
##TITLE=AC1204_BRAAS12063_7164085_X9wEiwGAoq
##JCAMPDX= 6.0         $$ Bruker NMR JCAMP-DX V2.0
##DATA TYPE= NMR SPECTRUM
##DATA CLASS= NTUPLES
##ORIGIN= BRUKER
##OWNER= Administrator
$$ 1.72 TOPSPIN		Version 2.1
$$ 2013-01-30 04:55:27.168 -0500  Administrator@X
$$ Compression mode = diff/dup
##.OBSERVE FREQUENCY= 400.02188249412
##.OBSERVE NUCLEUS= ^1H
##.ACQUISITION MODE= SIMULTANEOUS (DQD)
##.ACQUISITION SCHEME= undefined
##.AVERAGES= 64
##.DIGITISER RES= 22
##SPECTROMETER/DATA SYSTEM= spect
##.PULSE SEQUENCE= noesygpps1d.comp
##.SOLVENT NAME= COFFEE_meoh
##.SHIFT REFERENCE= INTERNAL, COFFEE_meoh, 1, 14.96261
##AUDIT TRAIL= $$ (NUMBER, WHEN, WHO, WHERE, PROCESS, VERSION, WHAT)
$$ ##TITLE= Audit trail, TOPSPIN		Version 2.1
$$ ##JCAMPDX= 5.01
$$ ##ORIGIN= Bruker BioSpin GmbH
$$ ##OWNER= Administrator
$$ $$ E:\/data/COFFEE/nmr/AC1204_BRAAS12063_7164085_X9wEiwGAoq/22/pdata/1/auditp.txt
$$ ##AUDIT TRAIL=  $$ (NUMBER, WHEN, WHO, WHERE, PROCESS, VERSION, WHAT)
(   1,<2013-01-30 04:55:21.246 -0500>,<Administrator>,<X>,<go>,<TOPSPIN 2.1>,
      <created by zg
	started at 2013-01-30 04:43:51.433 -0500,
	POWCHK enabled, PULCHK disabled,
       configuration hash MD5:
       86 BA 57 50 F2 9D 5C 9B 26 00 A9 28 5F 66 2E 89
       data hash MD5: 64K
       62 5A 68 56 ED 34 CC 61 14 64 56 DA C5 CE B4 60>)
(   2,<2013-01-30 04:55:24.324 -0500>,<Administrator>,<X>,<proc1d>,<TOPSPIN 2.1>,
      <Start of raw data processing
       efp LB = 0.3 FT_mod = 6 PKNL = 1 PHC0 = 0 PHC1 = 0 SI = 128K 
       data hash MD5: 128K
       56 34 28 6E 78 DE 66 6D A3 BF D3 71 51 52 ED DB>)
(   3,<2013-01-30 04:55:25.386 -0500>,<Administrator>,<X>,<proc1d>,<TOPSPIN 2.1>,
      <pk PHC0 = -78.2666 PHC1 = 0 
       data hash MD5: 128K
       75 10 1F B2 EE 63 DA 3E F4 24 6B 1C AB 52 00 F6>)
(   4,<2013-01-30 04:55:26.121 -0500>,<Administrator>,<X>,<proc1d>,<TOPSPIN 2.1>,
      <abs ABSG = 1 
       data hash MD5: 128K
       E1 2F 77 07 3A 72 D9 62 26 54 83 ED 45 FE C8 21>)
(   5,<2013-01-30 04:55:26.293 -0500>,<Administrator>,<X>,<proc1d>,<TOPSPIN 2.1>,
      <abs ABSG = 2 
       data hash MD5: 128K
       2D 1C 67 B6 39 22 55 AA FB E2 FD F4 65 DA E5 09>)
(   6,<2013-01-30 04:55:26.496 -0500>,<Administrator>,<X>,<proc1d>,<TOPSPIN 2.1>,
      <abs ABSG = 3 
       data hash MD5: 128K
       AB A7 9B B9 51 BE 32 60 CE FD 2C 6B 0F E7 0C 12>)
(   7,<2013-01-30 04:55:26.683 -0500>,<Administrator>,<X>,<proc1d>,<TOPSPIN 2.1>,
      <abs ABSG = 4 
       data hash MD5: 128K
       9D D0 EE 2C 26 58 E7 91 A8 83 1B 44 19 8A E6 6A>)
(   8,<2013-01-30 04:55:26.855 -0500>,<Administrator>,<X>,<proc1d>,<TOPSPIN 2.1>,
      <abs ABSG = 5 
       data hash MD5: 128K
       7A 30 88 A2 CF E0 3B 62 D3 AC 1E EA 2A E9 60 BB>)
$$ ##END=
$$ 
$$ $$ hash MD5
$$ $$ 7F D1 7A 0A CD 74 FB 32 A5 B7 88 CA B7 09 79 B2
##$RELAX= 
##$RELAX= 
##$RELAX= 
##$RELAX= 
##$RELAX= 
##$RELAX= 
##$RELAX= 
##$RELAX= 
$$ Bruker specific parameters
$$ --------------------------
##$DU= <E:\>
##$EXPNO= 22
$$ [...]
150 150 150 150 150 150 150 150
##$TP07= 0
##$TPNAME0= <>
##$TPNAME1= <>
##$TPNAME2= <>
##$TPNAME3= <>
##$TPNAME4= <>
##$TPNAME5= <>
##$TPNAME6= <>
##$TPNAME7= <>
##$TPOAL= (0..7)
0.5 0.5 0.5 0.5 0.5 0.5 0.5 0.5
##$TPOFFS= (0..7)
0 0 0 0 0 0 0 0
##$TUNHIN= 0
##$TUNHOUT= 0
##$TUNXOUT= 0
##$USERA1= <user>
##$USERA2= <user>
##$USERA3= <user>
##$USERA4= <user>
##$USERA5= <user>
##$V9= 5
##$VALIST= <valist>
##$VCLIST= <CCCCCCCCCCCCCCC>
##$VD= 0
##$VDLIST= <DDDDDDDDDDDDDDD>
##$VPLIST= <PPPPPPPPPPPPPPP>
##$VTLIST= <TTTTTTTTTTTTTTT>
##$WBST= 1024
##$WBSW= 4
##$XGAIN= (0..3)
0 0 0 0
##$XL= 0
##$YL= 0
##$YMAX_a= 8455026
##$YMIN_a= -18018517
##$ZGOPTNS= <>
##$ZL1= 120
##$ZL2= 120
##$ZL3= 120
##$ZL4= 120
##$ABSF1= 14.96261
##$ABSF2= -5.595572
##$ABSG= 5
##$ABSL= 3
##$ALPHA= 0
##$AQORDER= 0
##$ASSFAC= 0
##$ASSFACI= 0
##$ASSFACX= 0
##$ASSWID= 0
##$AUNMP= <proc_prof1d_extract.lims>
##$AXLEFT= 0
##$AXNAME= <>
##$AXNUC= <1H>
##$AXRIGHT= 0
##$AXTYPE= 0
##$AXUNIT= <>
##$AZFE= 0.1
##$AZFW= 0.1
##$BCFW= 0
##$BC_mod= 0
##$BYTORDP= 0
##$COROFFS= 0
##$CY= 15
##$DATMOD= 1
##$DC= 0
##$DFILT= <>
##$DTYPP= 0
##$F1P= 0
##$F2P= 0
##$FCOR= 0.5
##$FTSIZE= 131072
##$FT_mod= 6
##$GAMMA= 0
##$GB= 0
##$INTBC= 1
##$INTSCL= 1
##$ISEN= 128
##$LB= 0.3
##$LEV0= 0
##$LPBIN= 0
##$MAXI= 10000
##$MC2= 0
##$MEAN= 0
##$ME_mod= 0
##$MI= 0
##$NCOEF= 0
##$NC_proc= -2
##$NLEV= 6
##$NOISF1= 0
##$NOISF2= 0
##$NSP= 0
##$NTH_PI= 0
##$NZP= 0
##$OFFSET= 14.96261
##$PC= 1
##$PHC0= -78.2666
##$PHC1= 0
##$PH_mod= 1
##$PKNL= yes
##$PPARMOD= 0
##$PPDIAG= 0
##$PPIPTYP= 0
##$PPMPNUM= 2147483647
##$PPRESOL= 1
##$PSCAL= 4
##$PSIGN= 0
##$PYNMP= <proc.py>
##$REVERSE= no
##$SF= 400.020008993141
##$SI= 131072
##$SIGF1= 0
##$SIGF2= 0
##$SINO= 400
##$SIOLD= 131072
##$SPECTYP= <>
##$SREGLST= <1H.CDCl3>
##$SSB= 0
##$STSI= 131072
##$STSR= 0
##$SW_p= 8223.68421052631
##$SYMM= 0
##$S_DEV= 0
##$TDeff= 65536
##$TDoff= 0
##$TI= <>
##$TILT= no
##$TM1= 0
##$TM2= 0
##$TOPLEV= 0
##$USERP1= <user>
##$USERP2= <user>
##$USERP3= <user>
##$USERP4= <user>
##$USERP5= <user>
##$WDW= 1
##$XDIM= 131072
##$YMAX_p= 438860704
##$YMIN_p= -11302
##$CURPLOT= <Network HP LaserJet P1505>
##$CURPRIN= <$Network HP LaserJet P1505>
##$DFORMAT= <normdp>
##$LAYOUT= <+/1D_H.xwp>
##$LFORMAT= <normlp>
##$PFORMAT= <normpl>
##$SURQMSG= 1
$$ End of Bruker specific parameters
$$ ---------------------------------
##NTUPLES= NMR SPECTRUM
##VAR_NAME=  FREQUENCY,     SPECTRUM/REAL,   SPECTRUM/IMAG
##SYMBOL=    X,             R,               I
##VAR_TYPE=  INDEPENDENT,   DEPENDENT,       DEPENDENT
##VAR_FORM=  AFFN,          ASDF,            ASDF
##VAR_DIM=   131072,        131072,          131072
##UNITS=     HZ,            ARBITRARY UNITS, ARBITRARY UNITS
##FACTOR=    0.0627417313425164, 1,          1
##FIRST=     8223.62146879497, -2012,        -67976
##LAST=      0,             521,             -68356
##MIN=       0,             -11302,          0
##MAX=       8223.62146879497, 438860704,    0
$$ Real data points
##PAGE= N=1
##DATA TABLE= (X++(R..R)), XYDATA
$$ [...]
63235D17539J3336J5112J6415J7181J7783J8822K0365K1578K1735K1414K1904
63224F23184K3382K4483K3985K2181K0196J8663J7639J7158J7211J7456J7620
63213H43158J7943J8609J9021J8240J6020J2852R118M879L52m135q792j4223k0317
63200I12725k5777k9234l0501l0404k9647k8245k6015k3180k0307j7679j4925
63189F36811j1418p108k825M92K806M986P751J0908J3715J5772J7375J9142K1391
63176G29798K3847K5816K6745K6652K6019K5311K4687K4135K3584K2893K1946
63165A001433K0825J9654J8172J5822J2437Q503M464Kn447j1651j7558k2450k6579
63152A017627l0398l3627l5493l5752l4928l3624l1975k9911k7509k4874k1974
$$ plain form
63235 417539 430875 445987 462402 479583 497366 516188 536553 558131 579866 601280 623184
63224 623184 646566 671049 695034 717215 737411 756074 773713 790871 808082 825538 843158
63213 843158 861101 879710 898731 916971 932991 945843 954961 959840 960192 956057 947265 933042 912725
63200 912725 886948 857714 827213 796809 767162 738917 712902 689722 669415 651736 636811
63189 636811 625393 618285 615460 615952 618758 623744 631495 642403 656118 671890 689265 708407 729798
63176 729798 753645 779461 806206 832858 858877 884188 908875 933010 956594 979487 1001433
63165 1001433 1022258 1041912 1060084 1075906 1088343 1096846 1101310 1101312 1095865 1084214 1066656 1044206 1017627
63152 1017627 987229 953602 918109 882357 847429 813805 781830 751919 724410 699536 677562
63141F77562j8910j6126j4050j2644j1580j0745j0132r354p850n735l928l034
63129E53474k566j780q59n53p94n51O55J903K081J441J235K077L375M348M916
63114E68402N380N744N728N242M517L941L883M501N509O257O264N689N146N095
63100F41298N447N719N489M718L684K557J277o2r21q84m02m20j101j547j089l16
63084F63447k27q24j220r13k31M89J374K478L466M132M740N518O206O499O624
63069G01558P122Q257R849J1490J2694J3144J3092J3293J4208J5505J6699J7965
63057H54876J9811K2154K4283K5880K7536K9987L3133L6136L8316L9799M1250
63046A193161M3066M4906M5996M5979M5294M4673M4364M4047M3388M2438M1438
$$ plain form
63141 677562 658652 642526 628476 615832 604252 593507 583375 574021 566171 560436 556508 553474
63129 553474 550908 549128 548269 547716 546922 546371 547026 548929 551010 552451 553686 555763 559138 563486 568402
63114 568402 573782 579526 585254 590496 595013 598954 602837 607338 612847 619104 625368 631057 636203 641298
63100 641298 646745 652464 657953 662671 666355 668912 670189 670127 669206 668322 667920 667500 666399 664852 663763 663447
63084 663447 663220 662396 661176 660263 660032 660521 661895 664373 667839 671971 676711 682229 688435 694934 701558
63069 701558 708680 716937 726786 738276 750970 764114 777206 790499 804707 820212 836911 854876
63057 854876 874687 896841 921124 947004 974540 1004527 1037660 1073796 1112112 1151911 1193161
63046 1193161 1236227 1281133 1327129 1373108 1418402 1463075 1507439 1551486 1594874 1637312 1678750
63035A678750M0565L9950L9810M0320M1339M2371M2796M2130M0068L6311L0515
63024B114925K2579J3002K703p628j7889k8140l7976m6551n3261n8162o1574o3400
63012A778628o3065o0208n5296m9320m2953l6274k9373k2724j6574j0372l494
63001A388975L574R539J3987J8030K2890K8394L3363L7011L9388M0796M1454M1693
62989A719094M1830M1815M1352M0338L8911L7121L4890L2154K8775K4466J9106
62978B099852J2906N906k414j2460k3661l4776m4931n3846o1312o7182p1751p5344
62966A670987p7508p7380p4986p1380o7349o2773n7520n2100m6982m2026l7122
62955A003861l2737k9277k6425k3733k1294j9270j7362j5391j3878j3202j2669
$$ plain form
63035 1678750 1719315 1759265 1799075 1839395 1880734 1923105 1965901 2008031 2048099 2084410 2114925
63024 2114925 2137504 2150506 2153209 2145581 2127692 2099552 2061576 2015025 1961764 1903602 1842028 1778628
63012 1778628 1715563 1655355 1600059 1550739 1507786 1471512 1442139 1419415 1402841 1392469 1388975
63001 1388975 1392549 1402088 1416075 1434105 1456995 1485389 1518752 1555763 1595151 1635947 1677401 1719094
62989 1719094 1760924 1802739 1844091 1884429 1923340 1960461 1995351 2027505 2056280 2080746 2099852
62978 2099852 2112758 2118664 2116250 2103790 2080129 2045353 2000422 1946576 1885264 1818082 1746331 1670987
62966 1670987 1593479 1516099 1441113 1369733 1302384 1239611 1182091 1129991 1083009 1040983 1003861
62955 1003861 971124 941847 915422 891689 870395 851125 833763 818372 804494 791292 778623
62944G78623j1356r603q618q733r064q974q858r158r512r359q764q141p670p428
62930F53385p631q237q696q508p851p176o445n275l750k602k426l003l524l383
62916E74878k706k154k240k833l438l778l915l860l537l157l180l604l711k949
62902E29816j684o87j09M06Q56Q38L85J12L01M51R2n19r09j171j658k310k834
62885E21376l318m066m881n103m416l154j825p94m28r21j836k336k178j995k286
62870D81839k658k411j517n56mj0n37j293j756j729j647j874k010j455m26K30
62854D62186J48k67o39j007j402j676j886k227k461k117j402j150j559j771j204
62839D41566n54q32j857k613k675k480k376k193j810j442j218j060j005j172j326
$$ plain form
62944 778623 767267 757664 749046 740313 731249 722275 713417 704259 694747 685388 676624 668483 660813 653385
62930 653385 645754 637517 628821 620313 612462 605286 598841 593566 589816 587214 584788 581785 578261 574878
62916 574878 572172 570018 567778 564945 561507 557729 553814 549954 546417 543260 540080 536476 532765 529816
62902 529816 528132 527445 527336 527742 528598 529436 529821 529933 530234 530685 530777 530258 529349 528178 526520 524210 521376
62885 521376 518058 513992 509111 504008 499592 496438 494613 493819 493391 492470 490634 488298 486120 484125 481839
62870 481839 479181 476770 475253 474697 474693 474683 474146 472853 471097 469368 467721 465847 463837 462382 461956 462186
62854 462186 462334 462067 461428 460421 459019 457343 455457 453230 450769 448652 447250 446100 444541 442770 441566
62839 441566 441012 440180 438323 435710 433035 430555 428179 425986 424176 422734 421516 420456 419451 418279 416953
62824D16953j091o89q97j905k830k781k003j434j397j329p39R3N61M83K02R3K27
62807D01517M74P68J206J894K795L814M964O269P395P718P047O153O134P159Q324
62792D73631Q960R625J1256J3598J5249J5435J5091J5768J7933K0811K3611K6243
62780F67211K8894L1574L4347L7623M1791M6703N1772N6552O1048O5442O9678
62769A192635P3393P6256P8222P9275P8978P6548P1544O4220N5040M4069L1221
62758A921401J6876J821j3284k7942m1380n2646o1356o7984p3229p7290p9911
62747A445076q0748p9609p6648p2527o8070o3616n8946n4035m9446m5674m2420
62736G53337l8923l4896l0806k7248k4319k1691j9115j6786j5116j4127j3259
$$ plain form
62824 416953 415862 415173 414276 412371 409541 406760 404757 403323 401926 400597 399858 399951 400512 400995 401197 401290 401517
62807 401517 401991 402759 403965 405859 408654 412468 417432 423701 431096 438814 445861 452014 458148 465307 473631
62792 473631 482591 492216 503472 517070 532319 547754 562845 578613 596546 617357 640968 667211
62780 667211 696105 727679 762026 799649 841440 888143 939915 996467 1057515 1122957 1192635
62769 1192635 1266028 1342284 1420506 1499781 1578759 1655307 1726851 1791071 1846111 1890180 1921401
62758 1921401 1938277 1940098 1926814 1898872 1857492 1804846 1743490 1675506 1602277 1524987 1445076
62747 1445076 1364328 1284719 1208071 1135544 1067474 1003858 944912 890877 841431 795757 753337
62736 753337 714414 679518 648712 621464 597145 575454 556339 539553 524437 510310 497051
62725D97051j1949j0320q930p909o800n284l660k354j417o87q9M96J324K486L799
62710D45757N215P034R326J1564J3165J4214J5279J6722J8490K0472K2721K5448
62698F25407K8935L3232L7841M2106M6091N0585N5873O1147O5579O9447P3425
62687A189668P7154P9459P9761P8387P5432P0240O2206N1499L8686K4337R187
62676A836016n839k0133l3578m6008n6931o5876p2645p7048p8963p8887p7772
62665A222336p5986p2971o8393o3118n8365n4266n0009m5280m0756l7065l3899
62654F22228l0556k6970k3799k1642k0413j9419j7947j5789j3435j1601j0536
62643D10121r870r165q471q072p844p282o205n100m465m166l759l272l175l579
$$ plain form
62725 497051 485102 474782 465852 457943 451143 445859 442199 439845 438428 437741 437652 438148 439472 441958 445757
62710 445757 450972 458006 467332 478896 492061 506275 521554 538276 556766 577238 599959 625407
62698 625407 654342 687574 725415 767521 813612 864197 920070 981217 1046796 1116243 1189668
62687 1189668 1266822 1346281 1426042 1504429 1579861 1650101 1712307 1763806 1802492 1826829 1836016
62676 1836016 1830177 1810044 1776466 1730458 1673527 1607651 1535006 1457958 1378995 1300108 1222336
62665 1222336 1146350 1073379 1004986 941868 883503 829237 779228 733948 693192 656127 622228
62654 622228 591672 564702 540903 519261 498848 479429 461482 445693 432258 420657 410121
62643 410121 400251 391086 382615 374543 366699 359417 353212 348112 343647 339481 335722 332450 329275 325696
62629C25696l962l862l474l299l499l790l848l562l033k502k186k029j738j098
62615B83814j35R65J899K226J849J490K116L540M313L491K038J712K979M802O289
62600C23388P541Q804R738J0065J0308J1327J3369J6018J8846K1794K4943K8259
62588E04400L1557L4507L6730L8046L8720L9369M0392M1358M1062L8473L3737
62577I18351K7970K1950J5400P782n59q578j5569k1532k6597l0666l3668l5672
62565H18612l6636l6417l5236l3714l2225l0507k8191k5461k2957k1039j9476
62554D96753j7830j6006j4304j2979j1981j1200j0715j0499j0107r096p775o951
62542C57310o812o619n823m849m310l989l288k224j294o48m8M88P84J038J638
$$ plain form
62629 325696 321734 317872 314398 311099 307600 303810 299962 296400 293367 290865 288679 286650 284912 283814
62615 283814 283679 284644 286543 288769 290618 292108 294224 297764 302077 305568 307606 309318 312297 317099 323388
62600 323388 330929 339733 349471 359536 369844 381171 394540 410558 429404 451198 476141 504400
62588 504400 535957 570464 607194 645240 683960 723329 763721 805079 846141 884614 918351
62577 918351 946321 968271 983671 991453 990894 982316 966747 945215 918618 887952 854284 818612
62565 818612 781976 745559 710323 676609 644384 613877 585686 560225 537268 516229 496753
62554 496753 478923 462917 448613 435634 423653 412453 401738 391239 381132 372036 364261 357310
62542 357310 350498 343879 338056 333207 328897 324908 321620 319396 318102 317454 317406 317894 318678 319716 321354
62527C21354K478L173L843M947O348P285P479P591Q373R829J1424J2728J3783
62514D20635J5088J7220K0132K3033K5383K7678L0692L4289L7765M0946M3978
62503G36839M6243M6728M5459M3417M0845L6838L0924K3803J6047P369k206j1495
62491A060811j9426k6189l2278l7188m0097m1207m1395m1008l9871l8136l6194
62480F67822l3947l0956k7222k3257j9629j6832j5194j4327j3155j1120q978p704
62468D45501p096o229m849l465k318j224k75K04L89Q74J782K628L138L569M177
62453D36806M912N701O522P190P515P659P855P873P275O150N075M363L761K906
62439E21563J608k47k648n301p846j0171j2200j3578j3979j3573j2798j1886j0913
$$ plain form
62527 321354 323832 327005 330848 335795 342143 349428 356907 364498 372871 382700 394124 406852 420635
62514 420635 435723 452943 473075 496108 521491 549169 579861 614150 651915 692861 736839
62503 736839 783082 829810 875269 918686 959531 996369 1027293 1051096 1067143 1074512 1072306 1060811
62491 1060811 1041385 1015196 982918 945730 905633 864426 823031 782023 742152 704016 667822
62480 667822 633875 602919 575697 552440 532811 515979 500785 486458 473303 462183 453205 445501
62468 445501 438405 432176 427327 423862 421544 420320 420045 420249 420638 421512 423294 425922 429060 432629 436806
62453 436806 441718 447419 453941 461131 468646 476305 484160 492033 499308 505458 510533 514896 518657 521563
62439 521563 523171 522924 520276 514975 507129 496958 484758 471180 457201 443628 430830 418944 408031
62426D08031j0036r230q135o677n426m765m117k756j003K47R05J611K477K945
62412C64071L002L426M615O005O991P636Q143Q337Q070P573P134O788O515O220
62398D54526N504M021K128N56n44j575k570l144l447m158n321o160o341o378o410
62383D20687n649l732j607k16P52J963L145L793M524O393R245J1891J3802J5610
62369D80601J7943K0812K4116K7762L1193L3753L5797L8534M2441M6535M9639
62358H49126N1634N3014N3795N3500N1854M8830M4179L7531K9010J9468R967J180
62346A303088o788j4147k0923k6717l1010l3790l5692l7387l8980m0119m0502
62335I77033m0040l8682l6425l3521l0457k7624k5055k2591k0212j8218j6993
$$ plain form
62426 408031 397995 388765 380630 373953 368527 363762 359645 356889 355886 356133 357038 358649 361126 364071
62412 364071 367073 370499 375114 381119 388110 395746 403889 412226 420296 427869 435003 441791 448306 454526
62398 454526 460030 464051 466179 466735 466191 464616 462046 458902 455455 451297 445976 439816 433475 427097 420687
62383 420687 415038 411306 409699 409483 410235 412198 415343 419136 423660 430053 439298 451189 464991 480601
62369 480601 498544 519356 543472 571234 602427 636180 671977 710511 752952 799487 849126
62358 849126 900760 953774 1007569 1061069 1112923 1161753 1205932 1243463 1272473 1291941 1301908 1303088
62346 1303088 1296300 1282153 1261230 1234513 1203503 1169713 1134021 1096634 1057654 1017535 977033
62335 977033 936993 898311 861886 828365 797908 770284 745229 722638 702426 684208 667215
62324F67215j6518j6148j5074j3139j1019r379q067o466m457k596j308m78l8l39
62310E62189j523k917l688l870m168m878n640o223o857p609q041p764o913n872
62296D86226m949m450m475m422l368j345L75P79L27J65O62J445K280L128L624
62281D76002L487L264L785M979O032O651P272Q032Q531Q753R268J0257J1216J2032
62267E79561J3431J5815J8442K0520K2441K5156K8730L2444L6064M0177M5173
62256H77954N0499N5155N8529O0553O1256O0321N7029N0624M0920K8606J5037
62245A416483J687j0397k0811k9534l6403m1156m4084m6188m8117m9255m8583
62234A043642m6266m3497m0808l7597l3553k9484k6066k2756j8853j4952j2261
$$ plain form
62324 667215 650697 634549 619475 606336 595317 585938 577871 571405 566948 564352 563044 562566 562528 562189
62310 562189 560666 557749 554061 550191 546023 541145 535505 529282 522425 514816 506775 499011 492098 486226
62296 486226 481277 476827 472352 467930 464562 463217 463592 464371 464698 464863 465525 466970 469250 472378 476002
62281 476002 479489 482753 486538 491517 497549 504200 511472 519504 528035 536788 546056 556313 567529 579561
62267 579561 592992 608807 627249 647769 670210 695366 724096 756540 792604 832781 877954
62256 877954 928453 983608 1042137 1102690 1163946 1224267 1281296 1331920 1372840 1401446 1416483
62245 1416483 1418170 1407773 1386962 1357428 1321025 1279869 1235785 1189597 1141480 1092225 1043642
62234 1043642 997376 953879 913071 875474 841921 812437 786371 763615 744762 729810 717549
62223G17549j0890r755q148o395n034m149l663l577l657l426k767k099j758j558
62209F50673j136l83O00J721K818L783M815O286Q107R533J0012R985J0471J1923
62195G29208J3881J5790J7725K0001K2456K4542K6102K7483K8852K9834L0121
62184I85995K9910K9332K7833K4808K0634J6417J2706R117N354J905n33j754j837
62171A159887o97J699N027Q872J3041J7324K1327K4812K7952L0787L2629L2357
62159A375017K9299K3742J6798R904M127l05l678o135p712q949j0685j3036j5173
62146A393214j6454j7086j7313j6748j5130j3030j1013q742n767k734p40J86R39
62133A269582J888K620L021L521M206M760N441P042R525J1775J3272J4980J7811
$$ plain form
62223 717549 706659 696904 688756 682361 677327 673178 669515 665938 662281 658855 656088 653989 652231 650673
62209 650673 649537 649154 649754 651475 654293 658076 662891 669177 677284 686817 696829 706814 717285 729208
62195 729208 743089 758879 776604 796605 819061 843603 869705 897188 926040 955874 985995
62184 985995 1015905 1045237 1073070 1097878 1118512 1134929 1147635 1156752 1162106 1164011 1163478 1161724 1159887
62171 1159887 1159190 1160889 1165916 1174788 1187829 1205153 1226480 1251292 1279244 1310031 1342660 1375017
62159 1375017 1404316 1428058 1444856 1454760 1458887 1458582 1454904 1448769 1441057 1432108 1421423 1408387 1393214
62146 1393214 1376760 1359674 1342361 1325613 1310483 1297453 1286440 1277698 1271931 1269197 1268457 1268643 1269582
62133 1269582 1271470 1274090 1277111 1280632 1284838 1289598 1295039 1302081 1311606 1323381 1336653 1351633 1369444
62120A369444K1020K3098K3802K4238K5202K6315K6966K7236K7577K8047K8306
62109A651251K8209K8003K7974K8024K7800K7203K6674K6834K7837K9196L0297
62098A959302L1019L1848L3398L5801L8541M1020M3202M5449M7718M9236M9296
62087B405830M8001M6012M3941M2468M2615M5062M9178N3330N6212N7387N6734
62076B946770N4234N0563M7095M4856M3917M4087M5559M8362N1673N4336N5878
62065C487330N6476N6141N4591N1818M8297M4482M0393L5732L0248K4046J7745
62054C947299J2209P862M333R82k371n591q867j2655j6901k0759k3446k5033k6133
62041C830929k6998k7271k6657k5415k4036k2621k0934j8959j7076j5505j3963
$$ plain form
62120 1369444 1390464 1413562 1437364 1461602 1486804 1513119 1540085 1567321 1594898 1622945 1651251
62109 1651251 1679460 1707463 1735437 1763461 1791261 1818464 1845138 1871972 1899809 1929005 1959302
62098 1959302 1990321 2022169 2055567 2091368 2129909 2170929 2214131 2259580 2307298 2356534 2405830
62087 2405830 2453831 2499843 2543784 2586252 2628867 2673929 2723107 2776437 2832649 2890036 2946770
62076 2946770 3001004 3051567 3098662 3143518 3187435 3231522 3277081 3325443 3377116 3431452 3487330
62065 3487330 3543806 3599947 3654538 3706356 3754653 3799135 3839528 3875260 3905508 3929554 3947299
62054 3947299 3959508 3967370 3971703 3972685 3970314 3964723 3955856 3943201 3926300 3905541 3882095 3857062 3830929
62041 3830929 3803931 3776660 3750003 3724588 3700552 3677931 3656997 3638038 3620962 3605457 3591494
62030C591494j2189j0518r503r015q324p159o188o131o745p175p034o663o398
62017C488452o040n185l732j965k74J138K460M190O611R371J1847J3897J5919
62004C536689J8075J9934K1199K2253K3489K4267K3298J9957J4675P918m76j0571
61992C720707k1530l2159m1855n0452n7411o1969o4087o4550o4020o2565o0297
61981C139812n7760n5359n2904n0181m7515m5297m3298m0994l8409l6119l4545
61970B637431l3557l2700l1449k9455k6953k4745k3369k2408k1092j9390j7979
61959B354334j7111j6186j4645j2770j1217j0132r051p541n582l315p30K279N583
61946B253916Q732J1424J3955J6885K0212K3210K5369K6992K8573K9973L0740
$$ plain form
62030 3591494 3579305 3568787 3559284 3550269 3541945 3534786 3528598 3522467 3515722 3508547 3501513 3494850 3488452
62017 3488452 3482412 3477227 3473495 3471530 3471256 3472394 3474854 3479044 3485655 3495026 3506873 3520770 3536689
62004 3536689 3554764 3574698 3595897 3618150 3641639 3665906 3689204 3709161 3723836 3731754 3731278 3720707
61992 3720707 3699177 3667018 3625163 3574711 3517300 3455331 3391244 3326694 3262674 3200109 3139812
61981 3139812 3082052 3026693 2973789 2923608 2876093 2830796 2787498 2746504 2708095 2671976 2637431
61970 2637431 2603874 2571174 2539725 2510270 2483317 2458572 2435203 2412795 2391703 2372313 2354334
61959 2354334 2337223 2321037 2306392 2293622 2282405 2272273 2263222 2255681 2250099 2246784 2246054 2248333 2253916
61946 2253916 2262648 2274072 2288027 2304912 2325124 2348334 2373703 2400695 2429268 2459241 2489981
61935B489981L0965L1149L1352L1100L0127K8583K6577K4148K1745K0037J9077
61924B784841J8274J7474J7462J9214K3172K9562L8707N0539O4313P9384R5912
61913C238854J14319J34407J55624J77929K01849K27744K55560K85378L17780
61904E109444L53602L93628M38551M88721N43484O00418O54911P00210P27893
61895A0010862P28491O92392O11700M83351L12053J10695j02310l07037m85624
61886A2054573o25254p20247p72049p86706p71822p35092o84092o25666n64947
61877E768698n05225m48659l96605l49434l06818k68577k34997k06141j81321
61868B870921j59476j39824j21986j05709r0793p7166o4847n3723m3456l3570
$$ plain form
61935 2489981 2520946 2552095 2583447 2614547 2644674 2673257 2699834 2723982 2745727 2765764 2784841
61924 2784841 2803115 2820589 2838051 2857265 2880437 2909999 2948706 2999245 3063558 3142942 3238854
61913 3238854 3353173 3487580 3643204 3821133 4022982 4250726 4506286 4791664 5109444
61904 5109444 5463046 5856674 6295225 6783946 7327430 7927848 8582759 9282969 10010862
61895 10010862 10739353 11431745 12043445 12526796 12838849 12949544 12847234 12540197 12054573
61886 12054573 11429319 10709072 9937023 9150317 8378495 7643403 6959311 6333645 5768698
61877 5768698 5263473 4814814 4418209 4068775 3761957 3493380 3258383 3052242 2870921
61868 2870921 2711445 2571621 2449635 2343926 2253133 2175967 2111120 2057397 2013941 1980371
61858A980371k3623j3395l054O827J5563K2881K9204L5203M0867M5222M7293M7114
61846B230473M5378M2163L6792K9077J9978J0714J796o528j3505j8273k0695k1030
61834B336340j9091j4472p627M0P218J3259J7746K0190K0302J8055J3348O080
61822B411388l285j3765k4502l4935m4239n1353n5825n8117n8687n7341n3900
61811A955439m8915m3208l7038l0334k3339j6477r699k637M647J1625J8058K4351
61799A802473L0925L7629M3950M9751N5589O2321P0287P8873Q7100R4816J03142
61788B516856J13504J26376J41250J57671J75897J96630K20504K47961K79336
61779D175985L14936L55186M00809M52691N11605N78204O53193P37200Q30186
$$ plain form
61858 1980371 1956748 1943353 1940299 1947126 1962689 1985570 2014774 2049977 2090844 2136066 2183359 2230473
61846 2230473 2275851 2318014 2354806 2383883 2403861 2414575 2416371 2409843 2396338 2378065 2357370 2336340
61834 2336340 2317249 2302777 2295150 2295190 2302408 2315667 2333413 2353603 2373905 2391960 2405308 2411388
61822 2411388 2408103 2394338 2369836 2334901 2290662 2239309 2183484 2125367 2066680 2009339 1955439
61811 1955439 1906524 1863316 1826278 1795944 1772605 1756128 1746429 1743792 1748439 1760064 1778122 1802473
61799 1802473 1833398 1871027 1914977 1964728 2020317 2082638 2152925 2231798 2318898 2413714 2516856
61788 2516856 2630360 2756736 2897986 3055657 3231554 3428184 3648688 3896649 4175985
61779 4175985 4490921 4846107 5246916 5699607 6211212 6789416 7442609 8179809 9009995
61770I009995R30937J036767J143056J242403J323882J372889J372098J304092
61762A8736119J155731R23065O14614K51680j34408n07710q34885j092030j268226
61753A7843950j364701j391328j362760j295130j203158j098367r89123q81721
61745H257662p80820o88975o06586n33059m68031m11439l62808l20991k84660
61736C800293k52729k24310j98585j75019j53505j34081j16592j00893q7320p6455
61726B280804o8211o1574n5683n0981m8654m8909n0410n1648n2301n2826n3252
61715A686355n3056n1956n0117m7566m4109l9969l5927l2541k9667k6927k4250
61704A250270k1687j9174j6925j5616j5658j6456j6903j6571j5965j5689j5748
$$ plain form
61770 9009995 9940932 10977699 12120755 13363158 14687040 16059929 17432027 18736119
61762 18736119 19891850 20814915 21429529 21681209 21546801 21039091 20204206 19112176 17843950
61753 17843950 16479249 15087921 13725161 12430031 11226873 10128506 9139383 8257662
61745 8257662 7476842 6787867 6181281 5648222 5180191 4768752 4405944 4084953 3800293
61736 3800293 3547564 3323254 3124669 2949650 2796145 2662064 2545472 2444579 2357259 2280804
61726 2280804 2212593 2151019 2095336 2044355 1995701 1946792 1896382 1844734 1792433 1739607 1686355
61715 1686355 1633299 1581343 1531226 1483660 1439551 1399582 1363655 1331114 1301447 1274520 1250270
61704 1250270 1228583 1209409 1192484 1176868 1161210 1144754 1127851 1111280 1095315 1079626 1063878
61693A063878j5763j5450j4765j3854j2961j2250j1571j0616r306p926o907o550
61681I25959o882p525p794p243o111n018m203l496k992l226m327n414n384m166
61667H52178k794k178k291k598k879l303l914m460m768m915m913m472l288j558
61653H03847J04J205J758K124K719L809N382P042Q164Q340P659O544N391M388
61639H68476L490K540J548R34J333L012N553Q236J0606J2648J4538J6319J7627
61626I66860J7789J6359J3617J0240O482K069l032q237j2925j6949k0203k2223
61614I49847k2752k2256k1406k0285j8700j6938j5479j4239j2818j1397j0594
61603G62983j0440j0306r899r521r155q157o289m336l240l069l291l441l137j993
$$ plain form
61693 1063878 1048115 1032665 1017900 1004046 991085 978835 967264 956648 947342 939416 932509 925959
61681 925959 919077 911552 903758 896515 890404 885386 881183 877687 874695 871469 867142 861728 856344 852178
61667 852178 849384 847206 844915 842317 839438 836135 832221 827761 822993 818078 813165 808693 805405 803847
61653 803847 803951 805156 806914 809038 811757 815566 820948 827990 836154 844494 852153 858697 864088 868476
61639 868476 871966 874506 876054 876988 878321 881333 886886 895122 905728 918376 932914 949233 966860
61626 966860 984649 1001008 1014625 1024865 1031347 1033416 1030384 1022147 1009222 992273 972070 949847
61614 949847 927095 904839 883433 863148 844448 827510 812031 797792 784974 773577 762983
61603 762983 752543 742237 732338 722817 713662 705505 699216 694880 691640 688571 685280 681839 678702 676709
61589F76709k39J088J271J011J681L543N432O267O334O727Q017R815J1483J2866
61575G52005J4219J5685J7100J8258J9158J9939K0896K2474K4880K7443K8925
61564I80982K8940K8568K8918K9528K9141K7733K6558K6093K5310K3405K1208
61553A276384K0013J9917K0060J9874J9243J8013J6197J4308J2677J0738P696
61542A455120L603r40n809j1212j6736k1344k4335k5701k5705k4746k3463k2240
61530A256492k0634j8009j4582j1188q098m907j575J332L604N865Q773J2390J6520
61517A225983K1105K6003L0961L6131M2145M9410N7691O6512P5638Q5081R5160
61506A811820J06612J20093J35362J51478J67985J85336K03852K22709K40147
$$ plain form
61589 676709 676470 677558 678829 679840 681521 685064 690496 696763 703097 709824 717841 727656 739139 752005
61575 752005 766224 781909 799009 817267 836425 856364 877260 899734 924614 952057 980982
61564 980982 1009922 1038490 1067408 1096936 1126077 1153810 1180368 1206461 1231771 1255176 1276384
61553 1276384 1296397 1316314 1336374 1356248 1375491 1393504 1409701 1424009 1436686 1447424 1455120
61542 1455120 1458723 1457783 1451974 1440762 1424026 1402682 1378347 1352646 1326941 1302195 1278732 1256492
61530 1256492 1235858 1217849 1203267 1192079 1183981 1179074 1177499 1178831 1182435 1188300 1197073 1209463 1225983
61517 1225983 1247088 1273091 1304052 1340183 1382328 1431738 1489429 1555941 1631579 1716660 1811820
61506 1811820 1918432 2038525 2173887 2325365 2493350 2678686 2882538 3105247 3345394
61497C345394K54073K62194K62175K52320K31956K01033J60023J10719N6717K439
61487E139043m8415r3339j30635j59275j79144j90894j95429j93712j86951j76616
61477C584633j64039j50024j34879j18897j02829q7669p3840o0795m7812l4970
61467B608879k2835j1429k82J0460J9895K7644L4394M0723M6161N0055N2715N4817
61455B911197N6138N5888N4073N1712M9610M7727M5848M4288M3552M3795M4827
61444C448655M6346M7965M9250M9886M9767M8979M7757M6368M4729M2236L8304
61433C960242L3057K7217K1300J5125Q150Q3q777j7740k6191l3989m1149m7199
61421C890129n1268n3064n3352n2945n1646m8732m4236l8899l2996k6189j8746
$$ plain form
61497 3345394 3599467 3861661 4123836 4376156 4608112 4809145 4969168 5079887 5136604 5139043
61487 5139043 5090628 4997289 4866654 4707379 4528235 4337341 4141912 3948200 3761249 3584633
61477 3584633 3420594 3270570 3135691 3016794 2913965 2826296 2752456 2691661 2643849 2608879
61467 2608879 2586044 2574615 2574333 2584793 2604688 2632332 2666726 2707449 2753610 2803665 2856380 2911197
61455 2911197 2967335 3023223 3077296 3129008 3178618 3226345 3272193 3316481 3360033 3403828 3448655
61444 3448655 3495001 3542966 3592216 3642102 3691869 3740848 3788605 3834973 3879702 3921938 3960242
61433 3960242 3993299 4020516 4041816 4056941 4065091 4065174 4056397 4038657 4012466 3978477 3937328 3890129
61421 3890129 3838861 3785797 3732445 3679500 3627854 3579122 3534886 3495987 3462991 3436802 3418056
61410C418056j1908o521k024K450O479Q721Q650O975M336N06m616j0018j4326
61397C406760j7260j9494k1149k1242j8965j4743r275k044Q271K1860L7174N2629
61385C402522O8208Q4934J03358J23275J44501J66994J90175K12906K34291K53868
61375D985032K70743K82991K88293K84816K71264K46630K10677J64854J12407
61366G117707N7350L268m7145r1969j29989j61025j86013k06298k22533k34390
61356E898963k41439k43977k42766k38314k30976k21536k10953j99477j86718
61347C882807j72868j59184j46740j35250j23726j11921j00389q9362p8251o6489
61337B698627n4225m2096l0682k0291j0882k006O782J5289K2829K9099L4516L9367
$$ plain form
61410 3418056 3406148 3399627 3397603 3400053 3406532 3415253 3423903 3430878 3435214 3435720 3431104 3421086 3406760
61397 3406760 3389500 3370006 3348857 3327615 3308650 3293907 3284632 3282588 3290859 3312719 3349893 3402522
61385 3402522 3470730 3555664 3659022 3782297 3926798 4093792 4283967 4496873 4731164 4985032
61375 4985032 5255775 5538766 5827059 6111875 6383139 6629769 6840446 7005300 7117707
61366 7117707 7175057 7178325 7131180 7039211 6909222 6748197 6562184 6355886 6133353 5898963
61356 5898963 5657524 5413547 5170781 4932467 4701491 4479955 4269002 4069525 3882807
61347 3882807 3709939 3550755 3404015 3268765 3145039 3033118 2932729 2843367 2765116 2698627
61337 2698627 2644402 2602306 2571624 2551333 2540451 2538445 2545227 2560516 2583345 2612444 2646960 2686327
61325B686327M3187M5433M6417M6883M6840M5496M2516L8767L5487L3100L1085
61314C141538K8780K5951K2828J9915J7723J6289J4934J2697R146M678J5m506
61302C309988r057j3868j8778k3351k7382l1122l4904l8685m2161m5280m8194
61291B977206n0725n2316n2731n2366n1422m9248m5100l9415l3612k8567k3928
61280B497776j9048j3979r163m765q30K262M088M765M785M427L777L179L053L275
61266B483602L273K813K233J684P12j094l344n090n642m799k464J539P336J5030
61252B495789K4861L6958N0828O5330P9385R2542J04739J15545J23866J28335
61242C318178J27844J21611J08938Q9164O2110K8697q828m7368q3813j15686j41271
$$ plain form
61325 2686327 2729514 2774947 2821364 2868247 2915087 2960583 3003099 3041866 3077353 3110453 3141538
61314 3141538 3170318 3196269 3219097 3239012 3256735 3273024 3287958 3300655 3309801 3314479 3314494 3309988
61302 3309988 3300931 3287063 3268285 3244934 3217552 3186430 3151526 3112841 3070680 3025400 2977206
61291 2977206 2926481 2874165 2821434 2769068 2717646 2668398 2623298 2583883 2550271 2521704 2497776
61280 2497776 2478728 2464749 2455586 2450821 2449991 2452253 2456341 2461106 2465891 2470318 2474095 2477274 2480327 2483602
61266 2483602 2486875 2489688 2491921 2493605 2494317 2493223 2489879 2484789 2479147 2474348 2471884 2473423 2480759 2495789
61252 2495789 2520650 2557608 2608436 2673766 2753151 2845693 2950432 3065977 3189843 3318178
61242 3318178 3446022 3567633 3676571 3765735 3827845 3856542 3847714 3800346 3716533 3600847 3459576
61231C459576j59430j69641j72289j68801j61128j50940j39245j26733j14104
61222B097265j01885r0182p9018o8874o0411n3583m7513m1544l5999l1449k7623
61211A459184k3653j9364j5492j2444r482n674j173L099O737J0163J3645J6738
61199A422284J8911K0139K0529J9825J7853J5122J2481J0175P818N327L299K173
61187A575936J434J19k091m691p193r667j2309j4919j7095j8810k0449k2332k4436
61174A423497k6591k8628l0219l0862l0286k8852k7309k6154k5384k4859k4644
61163A119709k4855k5269k5365k4771k3606k2305k1187k0194j9036j7533j5896
61152H79692j4753j4822j6375j8851k1082k2103k1765k0553j8934j7052j4985
$$ plain form
61231 3459576 3300146 3130505 2958216 2789415 2628287 2477347 2338102 2211369 2097265
61222 2097265 1995380 1905198 1826180 1757306 1696895 1643312 1595799 1554255 1518256 1486807 1459184
61211 1459184 1435531 1416167 1400675 1388231 1378749 1373075 1371902 1375001 1381738 1391901 1405546 1422284
61199 1422284 1441195 1461334 1481863 1501688 1519541 1534663 1547144 1557319 1565137 1570464 1573763 1575936
61187 1575936 1577370 1577489 1575398 1570707 1563514 1553847 1541538 1526619 1509524 1490714 1470265 1447933 1423497
61174 1423497 1396906 1368278 1338059 1307197 1276911 1248059 1220750 1194596 1169212 1144353 1119709
61163 1119709 1094854 1069585 1044220 1019449 995843 973538 952351 932157 913121 895588 879692
61152 879692 864939 850117 833742 814891 793809 771706 749941 729388 710454 693402 678417
61141F78417j2965j1174r492p649n569l569k165j604j437p03J139L424M945N411
61127F37009N789O941Q527R677J0218J0534J0671J0415J0166J0765J2282J3711
61115G56705J4103J3469J2346J1122J0070R444R103Q472P192N387L125K00l147
61102H57591n947p527q322r104r837r986r593r268r301r499r801j0357j1021j1392
61088G26636j1461j1615j1966j2231j2354j2620j2995j2955j2215j1191j0370
61077E94663r617q494o995n614m692m041l256k282j548j409j572j325m23N76J104
61062E45075J372J933K769L309L263K858K349J792J400J466J813J846J378R76
61048E73599J227K028K866L436L769M024M470N407O786Q056Q638Q470P998P735
$$ plain form
61141 678417 665452 654278 644786 637137 631568 627999 625834 624230 622793 622090 623229 626653 631598 637009
61127 637009 642798 649739 658266 667943 678161 688695 699366 709781 719947 730712 742994 756705
61115 756705 770808 784277 796623 807745 817815 827259 836362 844834 852026 857413 860538 860738 857591
61102 857591 851644 844117 835795 826691 816854 806868 797275 788007 778706 769207 759406 749049 738028 726636
61088 726636 715175 703560 691594 679363 667009 654389 641394 628439 616224 605033 594663
61077 594663 585046 576552 569557 563943 559251 555210 551954 549672 548124 546715 545143 543818 543395 543971 545075
61062 545075 546447 548380 551149 554458 557721 560579 562928 564720 566120 567586 569399 571245 572623 573599
61048 573599 574826 576854 579720 583156 586925 590949 595419 600826 607612 615668 624306 632776 640774 648509
61034F48509P958Q601R323R773R855R730R497R158Q849Q848R178R470R362Q899
61020G77010Q343P807P286O997P358Q557J0221J1695J2651J3321J4148J5338J6940
61007I17672J9137K2097K5614K9269L2955L6854M0877M4611M7810N0520N2693
60996A320109N4481N7039O2160P0508Q0969R2212J04097J16941J30433J44407
60986B233356J60069J79321K03309K32732K69143L14904L72204M43155N30826
60977D939019O39911P77520R53680J178324J454310J772172K108103K416280K614395
60968A8853714K588346K245428J596058P90948O1171m01208n26354l62690k5582
60959B4819831L36705N55073M76259L7838o75694j461579k103651k473751k561176
$$ plain form
61034 648509 656467 665068 674391 684164 694019 703749 713246 722404 731253 740101 749279 758749 768111 777010
61020 777010 785353 793160 800446 807443 814801 823358 833579 845274 857925 871246 885394 900732 917672
61007 917672 936809 958906 984520 1013789 1046744 1083598 1124475 1169086 1216896 1267416 1320109
60996 1320109 1374590 1431629 1493789 1564297 1645266 1737478 1841575 1958516 2088949 2233356
60986 2233356 2393425 2572746 2776055 3008787 3277930 3592834 3965038 4408193 4939019
60977 4939019 5578930 6356450 7310130 8488454 9942764 11714936 13823039 16239319 18853714
60968 18853714 21442060 23687488 25283546 26074494 26135665 25734457 25208103 24845413 24819831
60959 24819831 25156536 25711609 26187868 26225706 25550012 24088433 21984782 19511031 16949855
60950A6949855k433516k180261j877786j577685j306596j072431q74531p10833
60942D916216n78271m71351l84386l14494k60673k20853j91656j70196j54287
60933B170049j41462j29614j18358j08301r9120q9637p9531o9639o0763n3326
60923A220298m7930m5004m3893m3380m2884m2238m0787l7927l4282l1040k8285
60912G82648k5274k2074j9557j7793j5920j3687j1772j0402r013p570o839o988
60900F15759p131o678o022n432m416k702q21P82K187L186L119K128J493J953K632
60885F00037K362J281K61n17j480k712l916m958n826o308o337o349o732p158o997
60870E44651o156n144m479m326m431m242l381k187j371j002l57J016K639L826
$$ plain form
60950 16949855 14516339 12336078 10458292 8880607 7574011 6501580 5627049 4916216
60942 4916216 4337945 3866594 3482208 3167714 2907041 2686188 2494532 2324336 2170049
60933 2170049 2028587 1898973 1780615 1672314 1573194 1483557 1404026 1334387 1273624 1220298
60923 1220298 1172368 1127364 1083471 1040091 997207 954969 914182 876255 841973 810933 782648
60912 782648 757374 735300 715743 697950 682030 668343 656571 646169 637156 629586 622747 615759
60900 615759 608628 601950 595928 590496 586080 583378 582557 583339 585526 588712 591831 593959 595452 597405 600037
60885 600037 602399 603680 603941 603424 601944 599232 595316 590358 584532 578224 571887 565538 558806 551648 544651
60870 544651 538495 533351 528872 524546 520115 515873 512492 510305 508934 507932 507575 508591 511230 515056
60856E15056M488M913N233N609O391P673Q983R865J0446J1147J2129J3359J4793
60843F30085J6233J7246J7555J7208J6255J4689J2744J0813Q859O541M075K296
60831G74599J541J139M19l75p23q22j265k152l098l920m760n670o453o929p067
60816G34464p041p216p825q601r069r195r307r408r209q899r001r257q568o553
60802F15315m328l098k661k080j102j69O39J708L119M496N484N974O001N917O320
60787F41535P440Q740R609J0031J0234J0085R408Q522P857P317O594N801N253
60774G48426M852M274L623L309L471L946M603N300N701N672N576N751N841N221
60760H15566L871K407J339P09K54l60j342k396k882k587k045j765j564j147p84
$$ plain form
60856 515056 519544 524457 529690 535299 541690 549363 558346 568211 578657 589804 601933 615292 630085
60843 630085 646318 663564 681119 698327 714582 729271 742015 752828 761687 768228 772303 774599
60831 774599 776140 777279 777698 777323 776600 775778 774513 772361 769263 765343 760583 754913 748460 741531 734464
60816 734464 727423 720207 712382 703781 694712 685517 676210 666802 657593 648694 639693 630436 621868 615315
60802 615315 610987 607889 605228 603148 602046 601877 602516 604224 607343 611839 617323 623297 629298 635215 641535
60787 641535 648975 657715 667324 677355 687589 697674 707082 715604 723461 730778 737372 743173 748426
60774 748426 753278 757552 761175 764484 767955 771901 776504 781804 787505 793177 798753 804504 810345 815566
60760 815566 819437 821844 823183 823892 824146 823786 822444 820048 817166 814579 812534 810769 809205 808058 807274
60745H07274q50j111j130j020j218j819k784m314o268p609p361n932m642m072
60731G57144l736l254k913l011l480m203n023n416m946m064l690l913l976l574
60717G01945l246l206k873j968j249j445k116k307j897j601j886k443k641k159
60703F70908j267o88r59j725k021j510j043j649l246m892o026o885p753q458q757
60688F14029q765q685q448p987p648p855q394q473p659o353n160m187l340k849
60674E18226k905k972k252p96N42J356K148L228M068M165L929M038M453M709M733
60659E46670M747M708M484M293M321M231L659K984K938L657M708N766O637O952
60645F10755O600O199O322O484N809M567M032M792O208P586Q940J0181J0703J0296
$$ plain form
60745 807274 806424 805313 804183 803163 801945 800126 797342 793028 786760 779151 771790 765858 761216 757144
60731 757144 753408 750154 747241 744230 740750 736547 731524 726108 721162 717098 713408 709495 705519 701945
60717 701945 698699 695493 692620 690652 689403 687958 685842 683535 681638 680037 678151 675708 673067 670908
60703 670908 669641 668953 667994 666269 664248 662738 661695 660046 656800 651908 645882 638997 631244 622786 614029
60688 614029 605264 596579 588131 580144 572496 564641 556247 547774 540115 533762 528602 524415 521075 518226
60674 518226 515321 512349 510097 509301 509843 511199 513347 516575 520643 524808 528737 532775 537228 541937 546670
60659 546670 551417 556125 560609 564902 569223 573454 577113 580097 583035 586692 591400 597166 603803 610755
60645 610755 617355 623554 629876 636360 642169 646736 650768 655560 661768 669354 678294 688475 699178 709474
60631G09474R720R738J0163J0336R993R135P617N544L594K302J235n00l021n483
60617G79847p088p820q232q785r549j0257j0593j0377r528p927n640l299j831
60604F78921j494j403m32J531L501M577M791M663M310L391J862L06o98j177j400
60589G01249j248m54P32J764K674L986N602O525O183N285M824M743M257L083J658
60574G50863L82o43j376j929k714l910n036n568n720n935o093n922n898o678p890
60559F85933q450q075p469p061o579n965n589n257m087j794Q04L005N075P325
60545F41816R220J0196J0713J1718J3442J5411J7376J9609K2469K6142L0680L5801
60533H64593M0773M4692M6834M6634M3543L7208K7635J5363J668j1513k2460l0539
$$ plain form
60631 709474 719194 728932 739095 749431 759424 768559 776176 781720 785314 787616 788851 788351 785330 779847
60617 779847 772759 764939 756707 747922 738373 728116 717523 707146 697618 689691 684051 680752 678921
60604 678921 677427 676024 675592 677123 680624 685201 689992 694655 698965 702356 704218 704524 703826 702649 701249
60589 701249 700001 699547 700279 702043 704717 708703 714305 720830 727013 732298 737122 741865 746122 749205 750863
60574 750863 751245 750602 749226 747297 744583 740673 735637 730069 724349 718414 712321 706399 700501 693823 685933
60559 685933 677483 669408 661939 654878 648299 642334 636745 631488 627401 625607 626411 629416 634491 641816
60545 641816 651036 661232 671945 683663 697105 712516 729892 749501 771970 798112 828792 864593
60533 864593 905366 950058 996892 1043526 1087069 1124277 1151912 1167275 1168943 1157430 1134970 1104431
60521A104431l5823l8072l6832l2550k6666k0347j3811p283j609K540N419P531
60509I06928Q826R208R152R126Q885Q152P633Q467J0907J4297J8220K2895K8473
60496A071169L4762M1864N0433O0843P2498Q4369R6071J08116J21013J34491J48043
60485B023672J62242J79102K00691K27526K58570K92260L26391L56517L75194
60476D402165L73640L44838K86066J99886R3551k2870j38555k43019l26798l83091
60466D585813m09986m10929l92527l61798l24789k86191k49034k14782j84119
60457A751658j57497j34901j15750r9456q5730p4213o4347n5899m8961m3173l7639
60446H34092l2063k7164k3576k0908j8548j6554j5114j3836j2426j1431j1417
$$ plain form
60521 1104431 1068608 1030536 993704 961154 934488 914141 900330 893047 891438 893978 899397 906928
60509 906928 915754 924962 934114 943240 952125 960277 967910 976377 987284 1001581 1019801 1042696 1071169
60496 1071169 1105931 1147795 1198228 1259071 1331569 1415938 1512009 1620125 1741138 1875629 2023672
60485 2023672 2185914 2365016 2565707 2793233 3051803 3344063 3670454 4026971 4402165
60476 4402165 4775805 5120643 5406709 5606595 5700146 5677276 5538721 5295702 4968904 4585813
60466 4585813 4175827 3764898 3372371 3010573 2685784 2399593 2150559 1935777 1751658
60457 1751658 1594161 1459260 1343510 1244054 1158324 1084111 1019764 963865 914904 871731 834092
60446 834092 802029 774865 751289 730381 711833 695279 680165 666329 653903 642472 631055
60435F31055j1855j1713j0811r707q606p397o363n941n807n212m088l063k391
60422E38101j784j181q42o31j10O15R47Q16Q37J264J633J640J617J808J930J783
60406E48443J686J872K034J957K063K824L963M769N014N106N441N944O272O226
60392F03614N902N518N106M478L586K771K386K282J923J080J00n48q25j169k025
60377F34179l314m380m614m201l905m031m030l419k557k021j685j055j63N94J266
60362E96664K177L058L233K726K363K634L192L699M407N473O392O605O246N853
60348F54722N678N687N902O363O888P195P083O492N585M806M463M206L341J838
60334G30249M47l78j101k209l225l247k126o09O12J417J962K317K523K614K502
$$ plain form
60435 631055 619200 607487 596676 586969 578363 570966 564603 558662 552855 547643 543555 540492 538101
60422 538101 536317 535136 534294 533663 533553 534168 535115 535931 536768 538032 539665 541305 542922 544730 546660 548443
60406 548443 550129 552001 554035 555992 558055 560879 564842 569611 574625 579731 585172 591116 597388 603614
60392 603614 609516 615034 620140 624618 628204 630975 633361 635643 637566 638646 638746 638198 637373 636204 634179
60377 634179 630865 626485 621871 617670 613765 609734 605704 602285 599728 597707 596022 594967 594804 595398 596664
60362 596664 598841 601899 605132 607858 610221 612855 616047 619746 624153 629626 636018 642623 648869 654722
60348 654722 660400 666087 671989 678352 685240 692435 699518 706010 711595 716401 720864 725070 728411 730249
60334 730249 730696 730318 729217 727008 723783 720536 718410 717801 718413 719830 721792 724109 726632 729246 731748
60319G31748K033J176oj424k813l665l674l138k673k552k655k887l266l501l130
60304F99573k247j641j868k458k538j947j250p52j18R45K195L258M048M516M414
60289G04130L745L025K621K187J312L92J63N83R30R52J039J320J518J881L089
60274G28887M896N816M954L365K769L600N089O653Q197R517J0499J1687J3675
60261H19604J6056J7941J9398K1330K4012K6757K9190L1796L4934L8323M1914
60250A121255M6314N1704N7201O1985O6542P2003P8638Q5640R2157R7962J03244
60239A934645J08171J12572J15798J17090J16266J13643J09134J01907R1522P8853
60229B999601O5312N1454L6998K2012P222o810k0037l2192m2386m9834n4510n6724
$$ plain form
60319 731748 733781 734957 734951 733527 730714 727049 723375 720237 717564 715012 712357 709470 706204 702703 699573
60304 699573 697326 695685 693817 691359 688821 686874 685624 684872 684754 685699 687894 691152 695200 699716 704130
60289 704130 707875 710900 713521 715708 717020 717412 717575 718158 719088 720040 721079 722399 723917 725798 728887
60274 728887 733783 739599 744553 747918 750687 754287 759376 766029 774226 783743 794242 805929 819604
60261 819604 835660 853601 872999 894329 918341 945098 974288 1006084 1041018 1079341 1121255
60250 1121255 1167569 1219273 1276474 1338459 1405001 1477004 1555642 1641282 1733439 1831401 1934645
60239 1934645 2042816 2155388 2271186 2388276 2504542 2618185 2727319 2829226 2920748 2999601
60229 2999601 3064913 3116367 3153365 3175377 3182599 3175789 3155752 3123560 3081174 3031340 2976830 2920106
60217B920106n6418n3415m8106m1310l3421k4120j3120p62J2266K5561L8999N2363
60205B778623O5357P7933R0165J01721J11829J19879J25669J28876J28712J24487
60195C853251J16273J04612Q9888P2477N3329L3686J4046o038k6792m7196o5505
60184D192031q0556r2260j00856j06133j07551j05023r9229r1065q0873o8461
60174C260024n3915l8078k2005o120R808K5931M1865N6932P0516Q2008R0605R5431
60162C613002R5964R2300Q4971P4454O0959M4905K7509J0491n040j9113l2038
60151D048364m3234n1318n5306n5289n1855m5208l5170k1969o629R669K6582M4641
60139C763278O4284Q5178J06848J29552J53881J79661K05999K32454K59369K86799
$$ plain form
60217 2920106 2863688 2810273 2762167 2720857 2687436 2663316 2650196 2649434 2661700 2687261 2726260 2778623
60205 2778623 2843980 2921913 3012078 3113799 3225628 3345507 3471176 3600052 3728764 3853251
60195 3853251 3969524 4074136 4164024 4236501 4289830 4323516 4337562 4331524 4304732 4257536 4192031
60184 4192031 4111475 4019215 3918359 3812226 3704675 3599652 3500423 3409358 3328485 3260024
60174 3260024 3206109 3168031 3146026 3139906 3149714 3175645 3217510 3274442 3344958 3426966 3517571 3613002
60162 3613002 3708966 3801266 3886237 3960691 4021650 4066555 4094064 4104555 4099515 4080402 4048364
60151 4048364 4005130 3953812 3898506 3843217 3791362 3746154 3710984 3689015 3682386 3692055 3718637 3763278
60139 3763278 3827562 3912740 4019588 4149140 4303021 4482682 4688681 4921135 5180504 5467303
60129E467303L13864L39451L62779L82764L97611M05772M06779M00529L86383
60120H863235L63762L33143K95597K51844K02606J49400R3814L6148k4065q6155
60110A0479329j47832k06394k59549l05129l41158l66463l80515l82914l74023
60101G715352l55922l31386l01743k67017k28325j88461j49464j11035p2337l4102
60091E675560K137L5828O6984R4635J17082J33396J43429J46568J41730J28776
60081F686125J09013Q4155N5618K5073n195l3144n7970q0031r9894j17670j33124
60070F432956j46237j57395j66813j73869j77556j77672j75063j70451j63624
60061D924276j54322j43219j31243j18182j02936q5224o6307m7791l0245j3209
$$ plain form
60129 5467303 5781167 6120618 6483397 6866161 7263772 7669544 8076323 8476852 8863235
60120 8863235 9226997 9560140 9855737 10107581 10310187 10459587 10553401 10589549 10565484 10479329
60110 10479329 10331497 10125103 9865554 9560425 9219267 8852804 8472289 8089375 7715352
60101 7715352 7359430 7028044 6726301 6459284 6230959 6042498 5893034 5781999 5709662 5675560
60091 5675560 5677697 5713525 5780509 5875144 5992226 6125622 6269051 6415619 6557349 6686125
60081 6686125 6795138 6879293 6934911 6959984 6954789 6921645 6863675 6783644 6683750 6566080 6432956
60070 6432956 6286719 6129324 5962511 5788642 5611086 5433414 5258351 5087900 4924276
60061 4924276 4769954 4626735 4495492 4377310 4274374 4189150 4122843 4075052 4044807 4031598
60051D031598L937K1472L9389N7406P4946R1286J05885J18468J28712J35829J38603
60040D947531J36010J27840J14630R7068P5709N1155K4305l677l1541n8192q2989
60029E397849j05692j25778j42012j53189j59173j60668j58068j51225j40504
60020D101540j27210j12637r7275q1273o4975m8541l1684j4325L027K0140L7713
60009C584500N6508P6228R5946J15271J34218J52314J68629J82575J93732K00855
59999D960776K01942J95717J82476J63351J39349J11459Q1088M9768J8453j2617
59989F091762m3326p3103j00822j25278j45674j61610j72535j77614j76331j69141
59979D746328j57219j41698j23386j03029q1435n9284l7064j5195O019K6494M6213
$$ plain form
60051 4031598 4035535 4057007 4096396 4153802 4228748 4320034 4425919 4544387 4673099 4808928 4947531
60040 4947531 5083541 5211381 5326011 5423079 5498788 5549943 5574248 5570571 5539030 5480838 5397849
60029 5397849 5292157 5166379 5024367 4871178 4712005 4551337 4393269 4242044 4101540
60020 4101540 3974330 3861693 3764418 3683145 3618170 3569629 3537945 3523620 3526647 3546787 3584500
60009 3584500 3641008 3717236 3813182 3928453 4062671 4214985 4383614 4566189 4759921 4960776
59999 4960776 5162718 5358435 5540911 5704262 5843611 5955070 6036158 6085926 6104379 6091762
59989 6091762 6048436 5975333 5874511 5749233 5603559 5441949 5269414 5091800 4915469 4746328
59979 4746328 4589109 4447411 4324025 4220996 4139561 4080277 4043213 4028018 4034037 4060531 4106744
59968D106744O4881Q1830R6233J07429J15256J20144J22608J22552J19371J12888
59958E169936J03691R2383P9036O3945M8353L3723K0547Q667j442q561j1943j1798
59946E586537q253n37J2291L0267N2623P8656J08116J40856J76548K14688K54747
59935F646539K96145L38037L78977M16681M48305M70929M81738M77813M56311
59926A0411475M15188L53911K73649J77376P0147m1083j48682k46105l28804l93916
59916A0543156m39801m66270m75060m69223m51679m24524l89863l50638l09851
59907F766247k69077k28384j87762j47897j09429p2158l5576K87L5020O8402J00311
59896E919984J30306J57767J82190K02710K17552K24508K21949K08998J85016
$$ plain form
59968 4106744 4171625 4253455 4349688 4457117 4572373 4692517 4815125 4937677 5057048 5169936
59958 5169936 5273627 5366010 5445046 5508991 5557344 5591067 5611614 5620281 5618839 5610278 5598335 5586537
59946 5586537 5578284 5577747 5590038 5620305 5672928 5751584 5859700 6000556 6177104 6391792 6646539
59935 6646539 6942684 7280721 7659698 8076379 8524684 8995613 9477351 9955164 10411475
59926 10411475 10826663 11180574 11454223 11631599 11701746 11660663 11511981 11265876 10937072 10543156
59916 10543156 10103355 9637085 9162025 8692802 8241123 7816599 7426736 7076098 6766247
59907 6766247 6497170 6268786 6081024 5933127 5823698 5751540 5715964 5716251 5751271 5819673 5919984
59896 5919984 6050290 6208057 6390247 6592957 6810509 7035017 7256966 7465964 7650980
59887G650980J49677J03735M9307j0743p3327j35117j92646k42790k83138l12044
59877F703894l28923l34695l31521l21708l06844k87961k66031k42091k17111
59868D067009j91994j67555j44302j22433j02235q4337o9308n7118m7254l9435
59858C041038l3990l1453l1825l4285l7563m0477m2182m2123m0017l6010l0659
59847B640454k4548j7949j0933l926K028N644O089L325k152r785j9000k8905l8193
59834B502149m5602n0420n2500n1901m8839m3909l7980l1669k5008j7736r829
59823B086756j685O168J3546K0708K7840L4384L9305M2341M4714M8101N2983N8456
59811B473617O3455O7486P0073P0253O7115O0484N0801L8717K5154J1518n78r946
$$ plain form
59887 7650980 7800657 7904392 7953699 7942956 7869629 7734512 7541866 7299076 7015938 6703894
59877 6703894 6374971 6040276 5708755 5387047 5080203 4792242 4526211 4284120 4067009
59868 4067009 3875015 3707460 3563158 3440725 3338490 3254153 3184845 3127727 3080473 3041038
59858 3041038 3007048 2975595 2943770 2909485 2871922 2831445 2789263 2747140 2707123 2671113 2640454
59847 2640454 2615906 2597957 2587024 2583098 2585126 2590770 2596859 2600184 2598032 2588247 2569247 2540342 2502149
59834 2502149 2456547 2406127 2353627 2301726 2252887 2208978 2170998 2139329 2114321 2096585 2086756
59823 2086756 2085071 2091239 2104785 2125493 2153333 2187717 2227022 2269363 2314077 2362178 2415161 2473617
59811 2473617 2537072 2604558 2674631 2744884 2811999 2872483 2923284 2962001 2987155 2998673 2998095 2988149
59799B988149j6135j9425k0468j9730j7185j2680o414J397J1048K2915L6454N0480
59787B998406O4662Q0078R7896J18269J40924J66186J94752K26845K62210L00488
59777D650716L40672L80074M14011M36258M39509M16277L61031K73031J58204
59768G869783K8822r9254k10932k95892l50088l74674l74294l55728l26152k91032
59758E220559k53593k16141j80969j49325j20598r3684o8723m6597k7189r365
59748D054375P555K3404L8219N2668O7283Q2094R7184J12920J29446J46592J64543
59737D976283J83949K05201K28097K52421K78446L06633L37232L70366M06142
59728G544770M44447M84610N25329N64700O00399O29990O51066O61206O58352
$$ plain form
59799 2988149 2972014 2952589 2932121 2912391 2895206 2882526 2876112 2877509 2888557 2911472 2947926 2998406
59787 2998406 3063068 3143146 3241042 3359311 3500235 3666421 3861173 4088018 4350228 4650716
59777 4650716 4991388 5371462 5785473 6221731 6661240 7077517 7438548 7711579 7869783
59768 7869783 7898605 7799351 7588419 7292527 6942439 6567765 6193471 5837743 5511591 5220559
59758 5220559 4966966 4750825 4569856 4420531 4299933 4206249 4137526 4090929 4063740 4054375
59748 4054375 4061930 4085334 4123553 4176221 4243504 4325598 4422782 4535702 4665148 4811740 4976283
59737 4976283 5160232 5365433 5593530 5845951 6124397 6431030 6768262 7138628 7544770
59728 7544770 7989217 8473827 8999156 9563856 10164255 10794245 11445311 12106517 12764869
59719A2764869O41663O11922N71238N23004M72548M26778L91936L71521L66695
59710A7142174L77941M05171M46226M96448N50151O02025O47037O79760O94455
59701B2041388O85852O50164N86075M95325L82472K54183J18733j4569j36652
59692B5062971k40125l20027l73761m00763m01905l78914l34487k72803j98814
59683B2141372j16083k5668P2339J76838K86137L99628N17713O39888P63569Q84434
59673B5740167R96822J093405J165183J201943J192818J127539R99026Q05940
59665C4322843N53563K53741p4814m07465p17983r84383j192003j333194j406608
59656B9013697j417191j375032j292652j183053j059448r34978q21700p30197
$$ plain form
59719 12764869 13406532 14018454 14589692 15112696 15585244 16012022 16403958 16775479 17142174
59710 17142174 17520115 17925286 18371512 18867960 19418111 20020136 20667173 21346933 22041388
59701 22041388 22727240 23377404 23963479 24458804 24841276 25095459 25214192 25199623 25062971
59692 25062971 24822846 24502819 24129058 23728295 23326390 22947476 22612989 22340186 22141372
59683 22141372 22025289 21999621 22071960 22248798 22534935 22934563 23452276 24092164 24855733 25740167
59673 25740167 26736989 27830394 28995577 30197520 31390338 32517877 33516903 34322843
59665 34322843 34876406 35130147 35055333 34647868 33929885 32945502 31753499 30420305 29013697
59656 29013697 27596506 26221474 24928822 23745769 22686321 21751343 20929643 20199446
59648B0199446o69679o46537o61287p06944p70488q36152q88903r18069r19853
59639A3181534q96670q53921p97591p33819o68302o04654n43984m86704m33938
59630G161951l86670l44588l06681k72451k41824k14471j89875j67606j47094
59621D890691j27653j09212r2478p7952o5316n4105m4453l6830l1654k9402l0344
59610D191292l3878l8911m5224n3550o3816p4293q3110q9819r4734r7659r8146
59599C418152r6455r3269q8770q2718p5161o6582n7610m8928m0992l3514k5773
59588B708380j7753j0274l738K456Q763J4599J9267K2860K5624K7189K7306K6559
59576B851238K5567K4042K1620J8998J7332J6917J7400J8896K2032K7056L3655
$$ plain form
59648 20199446 19529767 18883230 18221943 17514999 16744511 15908359 15019456 14101387 13181534
59639 13181534 12284864 11430943 10633352 9899533 9231231 8626577 8082593 7595889 7161951
59630 7161951 6775281 6430693 6124012 5851561 5609737 5395266 5205391 5037785 4890691
59621 4890691 4763038 4653826 4561348 4483396 4418080 4363975 4319522 4282692 4251038 4221636 4191292
59610 4191292 4157414 4118503 4073279 4019729 3955913 3881620 3798510 3708691 3613957 3516298 3418152
59599 3418152 3321697 3228428 3139658 3056940 2981779 2915197 2857587 2808659 2767667 2734153 2708380
59588 2708380 2690627 2680353 2676615 2679071 2687834 2702433 2721700 2744560 2770184 2797373 2824679 2851238
59576 2851238 2876805 2900847 2922467 2941465 2958797 2975714 2993114 3012010 3034042 3061098 3094753
59565C094753M1409M9909N8712O7763P7492Q8088R9221J10927J23965J38691J54373
59554D105303J70412J87368K05875K25251K44287K62595K80016K95386L07295
59545F283788L15540L20433L21057L15878L05026K90378K73345K54036K32881
59536H912362K11572J91524J72430J52906J31971J09835Q8237P0369N9454N6730
59526A0157390O1244P1657Q7094J05798J24043J37429J42826J38462J22801R4454
59516A1243198N3289R81n9676j25654j93839k60734l22511l75772m18451m49832
59506I090999m69659m77548m73618m59457m37865m11543l82267l51148l19069
59497E308825k86805k55080k24725j96483j70663j47160j25797j06425q8722p2241
$$ plain form
59565 3094753 3136162 3186071 3244783 3312546 3390038 3478126 3577347 3688274 3812239 3950930 4105303
59554 4105303 4275715 4463083 4668958 4894209 5138496 5401091 5681107 5976493 6283788
59545 6283788 6599328 6919761 7240818 7556696 7861722 8152100 8425445 8679481 8912362
59536 8912362 9123934 9315458 9487888 9640794 9772765 9882600 9970837 10041206 10100660 10157390
59526 10157390 10218634 10290291 10377385 10483183 10607226 10744655 10887481 11025943 11148744 11243198
59516 11243198 11296487 11297468 11237792 11112138 10918299 10657565 10335054 9959282 9540831 9090999
59506 9090999 8621340 8143792 7670174 7210717 6772852 6361309 5979042 5627894 5308825
59497 5308825 5022020 4766940 4542215 4345732 4175069 4027909 3902112 3795687 3706965 3634724
59487C634724n6698m1951k7836j4167q06J2520K6305M0857N5960P1307Q7132J04035
59475C891382J22290J41630J61660J82127K02760K23156K42748K60713K75972
59466E704438K87327K93383K92203K81598K60186K28033J86010J35015P6305J2287
59456G756785n3537j17366j75724k25854k66137k96032l15463l24647l24862l18530
59446E338633l07839k93573k75942k56034k35599k15699j96419j77738j59938
59437C219852j43211j27622j13418j00731q9166p8235o8090n9145n1193m3603
59427B345438l6255k9511k3373j7474j1817o752k196K348O930J0993J4245J6982
59415B269558J9529K1984K4690K8295L3067L8514M3523M6475M5633M0505L3085
$$ plain form
59487 3634724 3578026 3536075 3508239 3494072 3493266 3505786 3532091 3572948 3628908 3700215 3787347 3891382
59475 3891382 4013672 4155302 4316962 4499089 4701849 4925005 5167753 5428466 5704438
59466 5704438 5991765 6285148 6577351 6858949 7119135 7347168 7533178 7668193 7744498 7756785
59456 7756785 7703248 7585882 7410158 7184304 6918167 6622135 6306672 5982025 5657163 5338633
59446 5338633 5030794 4737221 4461279 4205245 3969646 3753947 3557528 3379790 3219852
59437 3219852 3076641 2949019 2835601 2734870 2645704 2567469 2499379 2440234 2389041 2345438
59427 2345438 2309183 2279672 2256299 2238825 2227008 2220256 2218060 2220408 2227338 2238331 2252576 2269558
59415 2269558 2289087 2311071 2335761 2364056 2397123 2435637 2479160 2525635 2571268 2611773 2644858
59404B644858K6990K5062K8051L5327M5901N8742P2946Q8082J03681J18277J29858
59393C377775J37931J44666J53612J67513J87462K13343K44387K79483L17572
59384E223744L57948M00164M43666M87369N29308N66608N95912O13958O18075
59375I836752O06848N80846N42422M94556M40240L83038L27076K75449K28998
59366A3716225J87363J50430J17632Q6520N3744J7468k2408o6229j14992j68194
59356A3957559k22531k73414l16908l49942l70140l76698l71097l56390l36287
59347A0984152l14995k96810k84861k80444k83631k93664l08441l24652l39364
59338H257290l50981l58318l59753l54234l42485l26226l06566k83917k59114
$$ plain form
59404 2644858 2671848 2696910 2724961 2760288 2806189 2864931 2937877 3025959 3129640 3247917 3377775
59393 3377775 3515706 3660372 3813984 3981497 4168959 4382302 4626689 4906172 5223744
59384 5223744 5581692 5981856 6425522 6912891 7442199 8008807 8604719 9218677 9836752
59375 9836752 10443600 11024446 11566868 12061424 12501664 12884702 13211778 13487227 13716225
59366 13716225 13903588 14054018 14171650 14258170 14311914 14329382 14306974 14240745 14125753 13957559
59356 13957559 13735028 13461614 13144706 12794764 12424624 12047926 11676829 11320439 10984152
59347 10984152 10669157 10372347 10087486 9807042 9523411 9229747 8921306 8596654 8257290
59338 8257290 7906309 7547991 7188238 6834004 6491519 6165293 5858727 5574810 5315696
59329E315696k33662k08801j84922j61930j39775j18742r9403q2113o6424n1345
59319C968579l6461k2269r175L228J5350K6725L6659M5338N3540O1329O7718P1549
59307D282110P2276P0005O5307N8809N0561L9980K6936J2696q22j2733k3508l3616
59295D608001m2468m8919n2304n2551m9712m3931l5823k6314j5843l987R840K5438
59283D271427M1874N8429P5212R2626J10509J28009J44199J58576J71006J81234
59273E433101J88421J91187J88386J79775J65546J45302J18139Q4174M5565N802
59263F745398l1479o2938q6003j00100j07056j09411j08548j05046j00076r5259
59253E839482r1345q8201q5900q4812q4647q4626q4577q4741q4445q2254p7705
$$ plain form
59329 5315696 5082034 4873233 4688311 4526381 4386606 4267864 4168461 4086348 4019924 3968579
59319 3968579 3932118 3909849 3900674 3903902 3919252 3945977 3982636 4027974 4081514 4142843 4210561 4282110
59307 4282110 4354386 4424391 4489698 4548507 4599068 4639048 4665984 4678680 4677858 4665125 4641617 4608001
59295 4608001 4565533 4516614 4464310 4411759 4362047 4318116 4282293 4255979 4240136 4236149 4245989 4271427
59283 4271427 4313301 4371730 4446942 4539568 4650077 4778086 4922285 5080861 5251867 5433101
59273 5433101 5621522 5812709 6001095 6180870 6346416 6491718 6609857 6694031 6739596 6745398
59263 6745398 6713919 6650981 6564978 6464878 6357822 6248411 6139863 6034817 5934741 5839482
59253 5839482 5748137 5659936 5574036 5489224 5404577 5319951 5235374 5150633 5066188 4983934 4906229
59242D906229p1675o4589n5387m2831k6850q017J3327L6858O2085Q9090J18717
59231D956957J51351J86193K22384K60016K99162L38287L74403M04396M25587
59222G618736M35378M31079M10235L71142L13652K39849J53441N8204m2387j43921
59212I845408k40500l26296l97322m51459m87655n06007n08042m96193m73166
59203E958768m42196m07016l70603l34255k98474k64325k33130k05302j80312
59194C223155j57670j37245j18938j02773q9168p8420o9950o2645n5809m9392
59184B301145m3484l8103l3300k8950k4593j9910j5183j0786o511j879L063P751
59172B089260J1783J5175J8179K1311K5215L0017L4996L9416M3439M7714N2329
$$ plain form
59242 4906229 4834554 4769965 4714578 4671747 4644897 4636880 4650207 4687065 4749150 4838240 4956957
59231 4956957 5108308 5294501 5516885 5776901 6076063 6414350 6788753 7193149 7618736
59222 7618736 8054114 8485193 8895428 9266570 9580222 9820071 9973512 10031716 9989329 9845408
59212 9845408 9604908 9278612 8881290 8429831 7942176 7436169 6928127 6431934 5958768
59203 5958768 5516572 5109556 4738953 4404698 4106224 3841899 3608769 3403467 3223155
59194 3223155 3065485 2928240 2809302 2706529 2617361 2538941 2468991 2406346 2350537 2301145
59184 2301145 2257661 2219558 2186258 2157308 2132715 2112805 2097622 2086836 2080325 2078446 2081509 2089260
59172 2089260 2101043 2116218 2134397 2155708 2180923 2210940 2245936 2285352 2328791 2376505 2428834
59161B428834N6851O1222O5932P1244P6782Q1998Q6558R0182R2587R3592R3066
59150C298848R0694Q6208P9812P1941O2517N0932L7050K1970P400n742j7758k9072
59138C754800l9047m6309n0297n1868n2030n0578m6617m0057l1756k2364j1923
59127C311954o55J0845K2567L5347M9740O5291Q1350R7903J15077J32503J49848
59116D071770J67466J85764K04316K22287K39467K56210K72442K87084K98364
59107F205170L04241L02694K92011K70882K38327J94116J39714P8504J4687m7949
59097G992397j06199j57162j98681k30142k52619k68058k78256k84215k86364
59088E930701k85395k82568k78709k73211k64842k53479k40318k26433k12129
$$ plain form
59161 2428834 2485685 2546907 2612839 2684083 2760865 2842863 2929421 3019603 3112190 3205782 3298848
59150 3298848 3389542 3475750 3555562 3627503 3690020 3740952 3778002 3799972 3807372 3801630 3783872 3754800
59138 3754800 3715753 3669444 3619147 3567279 3515249 3464671 3418054 3377997 3346241 3323877 3311954
59127 3311954 3311299 3322144 3344711 3380058 3429798 3495089 3576439 3674342 3789419 3921922 4071770
59116 4071770 4239236 4425000 4629316 4851603 5091070 5347280 5619722 5906806 6205170
59107 6205170 6509411 6812105 7104116 7374998 7613325 7807441 7947155 8025659 8040346 7992397
59097 7992397 7886198 7729036 7530355 7300213 7047594 6779536 6501280 6217065 5930701
59088 5930701 5645306 5362738 5084029 4810818 4545976 4292497 4052179 3825746 3613617
59079C613617j97738j83878j70569j57230j44042j32250j22508j13938j05481
59070B285983r7224q9559q2179p4885o8502o3729n9740n5096m9673m4524m0167
59059A560705l6137l2067k8240k5056k2758k1529k1267k1355k1189k0767k0276
59048A290064j9545j8363j6844j4917j2047q179m366j541P75L516O319P780P273
59035A219925N532L568J990J364K266M744Q293J2391J6591K0302K2951K4307K4292
59022A368516K2828K0210J7083J3654R590N153J598l81j610k805k964p75L029
59009A453126O343Q335R845J1331J2217J2283J2115J1629R643N580M99m200q166
58996A540580j1622j4391j6188j7195j7709j7482j6063j3547j0641q015n792l632
$$ plain form
59079 3613617 3415879 3232001 3061432 2904202 2760160 2627910 2505402 2391464 2285983
59070 2285983 2188759 2099200 2017021 1942136 1873634 1809905 1750165 1695069 1645396 1600872 1560705
59059 1560705 1524568 1492501 1464261 1439205 1416447 1394918 1373651 1352296 1331107 1310340 1290064
59048 1290064 1270519 1252156 1235312 1220395 1208348 1200169 1195803 1194262 1195037 1198553 1204872 1212652 1219925
59035 1219925 1225457 1229025 1231015 1232379 1234645 1239389 1247682 1260073 1276664 1296966 1319917 1344224 1368516
59022 1368516 1391344 1411554 1428637 1442291 1451881 1457034 1458632 1458251 1456641 1453836 1450872 1450097 1453126
59009 1453126 1459469 1467804 1477649 1488980 1501197 1513480 1525595 1537224 1546867 1552447 1552946 1548746 1540580
58996 1540580 1528958 1514567 1498379 1481184 1463475 1445993 1429930 1416383 1405742 1397727 1391935 1388303
58984A388303j299Q63K288L136M378O563Q952J0471J1084J1622J2606J4001J5795
58971A488763J8054K0571K3066K5535K7874K9579L0468L1281L2702L4281L5205
58960A797379L5679L6473L7425L7640L7015L6469L6630L7327L8425M0107M2277
58949B212846M4681M7719N2241N8337O5105P1720P8065Q4414R1254R9337J09031
58938C014750J19672J30350J41137J52634J64576J76187J87884K01439K18199
58929D506828K38114K60674K85767L13462L43889L77555M14916M55498M98287
58920G694990N42994N89918O38488O86908P33201P75419Q10562Q34456Q43006
58911A4149942Q32593P99222P38741O48852N30406L86918K24135N0389j24246
$$ plain form
58984 1388303 1387004 1387867 1390155 1393291 1397669 1404232 1413184 1423655 1434739 1446361 1458967 1472968 1488763
58971 1488763 1506817 1527388 1550454 1575989 1603863 1633442 1663910 1695191 1727893 1762174 1797379
58960 1797379 1833058 1869531 1906956 1944596 1981611 2018080 2054710 2092037 2130462 2170569 2212846
58949 2212846 2257527 2305246 2357487 2415824 2480929 2552649 2630714 2715128 2806382 2905719 3014750
58938 3014750 3134422 3264772 3405909 3558543 3723119 3899306 4087190 4288629 4506828
58929 4506828 4744942 5005616 5291383 5604845 5948734 6326289 6741205 7196703 7694990
58920 7694990 8237984 8827902 9466390 10153298 10886499 11661918 12472480 13306936 14149942
58911 14149942 14982535 15781757 16520498 17169350 17699756 18086674 18310809 18361198 18236952
58902A8236952k90456m41176n70799o74549p49769p97174q19958q21974q07119
58893A2263978p79464p42894p00571o54926o07806n60359n13295m67506m24124
58884F813033l83986l47503l15030k86642k61610k38943k18454k00549j84959
58875D375357j70678j57225j44947j33855j23220j12689j02845r4247q6707p9809
58865C169135p3423o7374o1399n5614n0361m5525m0794l6422l2702k8815k3564
58854B653142j7308j1708p243k589L150R142J4507J9699K5327L1013L6507M2662
58842B796301N0103N7864O4622P0443P6290Q2697R0014R8996J09814J21152J31634
58831C749930J41748J53134J66404J80915J96370K13336K32202K52843K75500
$$ plain form
58902 18236952 17946496 17505320 16934521 16259972 15510203 14713029 13893071 13071097 12263978
58893 12263978 11484514 10741620 10041049 9386123 8778317 8217958 7704663 7237157 6813033
58884 6813033 6429047 6081544 5766514 5479872 5218262 4979319 4760865 4560316 4375357
58875 4375357 4204679 4047454 3902507 3768652 3645432 3532743 3429898 3335651 3248944 3169135
58865 3169135 3095712 3028338 2966939 2911325 2860964 2815439 2774645 2738223 2705521 2676706 2653142
58854 2653142 2635834 2624126 2616883 2614294 2617444 2626586 2641093 2660792 2686119 2717132 2753639 2796301
58842 2796301 2846404 2904268 2968890 3039333 3115623 3198320 3288334 3387330 3497144 3618296 3749930
58831 3749930 3891678 4044812 4211216 4392131 4588501 4801837 5034039 5286882 5562382
58822E562382L00986L29826L61898L97134M35909M78367N23826N71039O18824
58813I580191O66192P11815P53225P86517Q07043Q10481P93179P51714O83078
58804A6343435N85883M61438L13798J49354k3549j95443l57179n01077o21435
58795A6155225p14826p80351q19235q34049q28379q06648p73344p32091o85872
58786I180430o37667n89925n43531m98406m55163m15170l78931l45615l14566
58777E001456k86154k60735k37860k17078j98603j82711j69266j58171j49417
58768C141461j42126j34580j25786j16330j07280r9042r1609q5014p8941p2710
58758B088043o6157n9739n3541m7035m0210l3911k8613k3880j9494j5981j3384
$$ plain form
58822 5562382 5863368 6193194 6555092 6952226 7388135 7866502 8390328 8961367 9580191
58813 9580191 10246383 10958198 11711423 12497940 13304983 14115464 14908643 15660357 16343435
58804 16343435 16929318 17390756 17704554 17853908 17830359 17634916 17277737 16776660 16155225
58795 16155225 15440399 14660048 13840813 13006764 12178385 11371737 10598393 9866302 9180430
58786 9180430 8542763 7952838 7409307 6910901 6455738 6040568 5661637 5316022 5001456
58777 5001456 4715302 4454567 4216707 3999629 3801026 3618315 3449049 3290878 3141461
58768 3141461 2999335 2864755 2738969 2622639 2515359 2416317 2324708 2239694 2160753 2088043
58758 2088043 2021886 1962147 1908606 1861571 1821361 1787450 1758837 1734957 1715463 1699482 1686098
58747A686098j0663p104l421o92J007K226L109L270J943j966q966j7698k5709
58734A621434l1912l7003m1125m2908m1658l8843l6173l3650l0877k8779k8344
58723A230162k8699k8279k7120k6340k6016k5253k4025k3221k2951k2256k0559
58712I55443j8309j6104j4120j2469j1298j0518r938r529r158q489p568o939o706
58699H14298o242n339m792n143n674n567n230n519o344p080p696q407q812q464
58685G23989p809p545p458o814n520l998k391o80Q96K339M253O935R657J1587
58671G17441J2738J3224J2396R852O645M395L554L448L499L554L464L192K858
58658H00260K056n4l258n847o656o488o452n982m002j100J173K692M714P610J0299
$$ plain form
58747 1686098 1675435 1668331 1664910 1664218 1665225 1667451 1670560 1673830 1675773 1673807 1664841 1647143 1621434
58734 1621434 1589522 1552519 1511394 1468486 1426828 1387985 1351812 1318162 1287285 1258506 1230162
58723 1230162 1201463 1173184 1146064 1119724 1093708 1068455 1044430 1021209 998258 976002 955443
58712 955443 937134 921030 906910 894441 883143 872625 862687 853158 844000 835511 827943 821004 814298
58699 814298 808056 802717 797925 792782 787108 781541 776311 770792 764448 757368 749672 741265 732453 723989
58685 723989 716180 708635 701177 694363 688843 684845 682454 681774 682670 685009 689262 696197 705854 717441
58671 717441 730179 743403 755799 765651 772296 776691 780245 783693 787192 790746 794210 797402 800260
58658 800260 802316 802262 799004 793157 786501 780013 773561 767579 763577 762477 763650 766342 771056 778666 788965
58643G88965J1992J3173J4599J6398J8422K0738K3530K6909L0751L4490L7582
58632A037549M0390M3992M8787N4134N9768O6420P4400Q2873R1491J01482J14014
58621A815300J28600J44347J61574J80724K00600K19293K36049K50730K62029
58612C599246K67574K65199K52898K28532J91280J42933Q6559K4756l9462j01170
58602D918345j54995j97820k28756k47406k54023k50810k41041k26982k09987
58593B906525j91932j74721j58613j42817j27563j14061j02607r2263q2329p2732
58583A646887o3313n4022m5501l8256l1700k5294j9884j6362j3848j0892p734
58572A320081n514l923j624J529M807Q552J3511J8546K1405K1644K0470J7672
$$ plain form
58643 788965 800957 814130 828729 845127 863549 884287 907817 934726 965477 999967 1037549
58632 1037549 1077939 1121931 1170718 1224852 1284620 1351040 1425440 1508313 1599804 1701286 1815300
58621 1815300 1943900 2088247 2249821 2430545 2631145 2850438 3086487 3337217 3599246
58612 3599246 3866820 4132019 4384917 4613449 4804729 4947662 5034221 5058977 5019515 4918345
58602 4918345 4763350 4565530 4336774 4089368 3835345 3584535 3343494 3116512 2906525
58593 2906525 2714593 2539872 2381259 2238442 2110879 1996818 1894211 1801948 1719619 1646887
58583 1646887 1583574 1529552 1484051 1445795 1414095 1388801 1368917 1352555 1338707 1327815 1320081
58572 1320081 1314567 1310644 1309020 1310549 1315356 1323908 1337419 1355965 1377370 1399014 1419484 1437156
58560A437156J1250O35j1929k3736l3533m0662m4426m5240m4740m3910m2231l9176
58548A079458l5313l1500k8093k5257k2990k0767j8254j6208j5484j5486j4929
58537H35177j3823j3075j2465j0908q619p078o727o540o007n730n888n964o222
58524G26131p632r899j1311j1107j0358r991r494q241o605n180m036l179k653
58511F26445j922k55K038L803M611N088N783O787Q258J0134J1569J1951J2118
58498G06408J3232J4912J6117J7195J9248K1766K2983K2425K1166J9590J6905
58487I11947J2987Q836M987J138k661o040r410j3336j7005j9129k0071k1166k2290
58474H08787k2179k0926j9905j9320j8094j6143j4496j3201j1349r286q360q409
$$ plain form
58560 1437156 1448406 1449041 1437112 1413376 1379843 1339181 1294755 1249515 1204775 1160865 1118634 1079458
58548 1079458 1044145 1012645 984552 959295 936305 915538 897284 881076 865592 850106 835177
58537 835177 821354 808279 795814 784906 776287 769209 762482 755942 749935 744205 738317 732353 726131
58524 726131 718499 708600 697289 686182 675824 665833 656339 648098 641493 636313 632277 629098 626445
58511 626445 624523 624268 626306 630109 634720 639808 645591 652378 660636 670770 682339 694290 706408
58498 706408 719640 734552 750669 767864 787112 808878 831861 854286 875452 895042 911947
58487 911947 924934 933770 938757 939895 937234 931194 921784 908448 891443 872314 852243 831077 808787
58474 808787 786608 765682 745777 726457 708363 692220 677724 664523 653174 643888 635528 627119
58462F27119p811o239n054m807m625m124l720k929q76J545K433J924J972L164
58448E97972M371N513P699J0500J2138J2755J4404J7374J9710K0895K2717K5629
58436G71677K7458K6785K4515K1120J5485P728J55n955j1698j7431k1263k2107
58424H16469k1489k0779j9285j6548j3878j2095j0122p246m415k081P32M120O605
58411F99988P932R832J2900J5503J6970J8796K1291K2076J9650J5539J1275O089
58399H77841n26o829j1262j4387j6747j7444j6432j5403j4822j2877r069n809
58387G36234m689m172k828j664j267Q9L103N325M909L576L356L250J790J85J19
58372G47316Q49J108J571L011M298M578N031O350P009O266O036P513Q832Q599
$$ plain form
58462 627119 619308 613069 608015 603208 598583 594459 590739 587810 586934 588479 590912 592836 594808 597972
58448 597972 602343 607856 615555 626055 638193 650948 665352 682726 702436 723331 746048 771677
58436 771677 799135 825920 850435 871555 887040 894768 894923 888968 877270 859839 838576 816469
58424 816469 794980 774201 754916 738368 724490 712395 702273 695027 690612 688531 689263 693383 699988
58411 699988 707920 717752 730652 746155 763125 781921 803212 825288 844938 860477 871752 877841
58399 877841 877315 870486 859224 844837 828090 810646 794214 778811 763989 751112 742043 736234
58387 736234 731545 727373 724545 722881 721614 721703 724806 730131 735040 738616 741972 745222 747012 747197 747316
58372 747316 748165 749273 750844 753855 758153 762731 767762 774112 781121 787387 793423 800936 809768 818367
58358H18367Q779J1244J4408J6135J7274J9287K1054K1086K0369J9916J7949J2717
58346A018585N918K41m298q799j2489j4188j4598j4502j2896r502o506n257l846
58333I17863p22K193K932L076M842P294Q635R555J1128J2148J1726J1820J3937
58320A016427J6266J7193J8586K2115K5548K6455K6464K7849K8890K6827K2632
58309A275252J8680J4246P648M70m469p220r031r082o641l894k777j578J647N158
58295A278409O887Q521J2154J5870J6961J6699J7683J9351K0236K1589K4649K7414
58283A486423K8283K9520L3080L6747L8623M1273M6749N1935N3819N4792N7286
58272A958530N7923N3069M5669M0134L4834K6435J7458J2373J0155P683O724J0224
$$ plain form
58358 818367 827146 838390 852798 868933 886207 905494 926548 947634 968003 987919 1005868 1018585
58346 1018585 1024503 1024744 1020446 1011647 999158 984970 970372 955870 942974 933472 926966 921709 917863
58333 917863 917141 919334 922266 925342 930184 937478 946113 955668 966796 978944 990670 1002490 1016427
58320 1016427 1032693 1049886 1068472 1090587 1116135 1142590 1169054 1196903 1225793 1252620 1275252
58309 1275252 1293932 1308178 1315826 1316296 1311827 1304607 1295576 1286494 1279853 1275959 1273182 1271604 1273251 1278409
58295 1278409 1285296 1293817 1305971 1321841 1338802 1355501 1373184 1392535 1412771 1434360 1459009 1486423
58283 1486423 1514706 1544226 1577306 1614053 1652676 1693949 1740698 1792633 1846452 1901244 1958530
58272 1958530 2016453 2069522 2115191 2155325 2190159 2216594 2234052 2246425 2256580 2264263 2270987 2281211
58260B281211J5441J8203K0379K5724L2114L5425L7413M1876M6883M8742M9884
58249B653295N4637O0874O4183O6340P1295P6810P8848Q0131Q5407R2510R7225
58238C481555J02230J11706J22023J27966J33135J43520J55930J64092J70931
58229D713088J82947J97671K09088K20201K37326K57234K73279K88866L11088
58220F890788L36883L59892L84745M19288M59465M98059N41127N98359O64912
58211A1153518P31752Q06015R01175J015779J143685J296527J493438J739186
58203B0281075K037088K409618K875787L421714M028942M721611N551656O555535
58195E1883026P771504R288185J1233906J3740775J6967127K1100689K6219408
$$ plain form
58260 2281211 2296652 2314855 2335234 2360958 2393072 2428497 2465910 2507786 2554669 2603411 2653295
58249 2653295 2707932 2768806 2832989 2899329 2970624 3047434 3126282 3206413 3291820 3384330 3481555
58238 3481555 3583785 3695491 3817514 3945480 4078615 4222135 4378065 4542157 4713088
58229 4713088 4896035 5093706 5302794 5522995 5760321 6017555 6290834 6579700 6890788
58220 6890788 7227671 7587563 7972308 8391596 8851061 9349120 9890247 10488606 11153518
58211 11153518 11885270 12691285 13592460 14608239 15751924 17048451 18541889 20281075
58203 20281075 22318163 24727781 27603568 31025282 35054224 39775835 45327491 51883026
58195 51883026 59654530 68942715 80176621 93917396 110884523 131985212 158204620
58188A58204620L2117394L8272556M3808514M7216133M6207688L8509022K3561340
58181D27897267L715800j6489086l2611563m2301177m5655505m4257210m0037798
58174B10260728l4618946k9083419k3990438j9547269j5805349j2745612j0283024
58167F4186671q300970o707773n437859m418087l573764k858238k243426j690389
58159B8956165j155566o12432m2012N81202J267078J984930K668312L201860L375717
58150D0225254K922839J712925n7713j915716l384998m225804m459946m252231
58142B6564610l796696l254469k724345k246242j832939j492226j221853j006045
58134H989795q30506o91139n83185m95159m19939l60143l16780k83196k54778
$$ plain form
58188 158204620 190322014 228594570 272403084 319619217 365826905 404335927 427897267
58181 427897267 431613067 415123981 382512418 340211241 294555736 250298526 210260728
58174 210260728 175641782 146558363 122567925 103020656 87215307 74469695 64186671
58167 64186671 55885701 49177928 43740069 39321982 35748218 32889980 30646554 28956165
58159 28956165 27800599 27188167 27146155 27727357 28994435 30979365 33647677 36849537 40225254
58150 40225254 43148093 44861018 44803305 42887589 39502591 35276787 30816841 26564610
58142 26564610 22767914 19513445 16789100 14542858 12709919 11217693 9995840 8989795
58134 8989795 8159289 7468150 6884965 6389806 5969867 5609724 5292944 5009748 4754970
58125D754970k33975k21290k11260k01066j93476j88001j78769j64219j49619
58116C013295j37278j23511j07673r4680q5905p6891o6907o1631o3224o6372o7198
58105B062025o7782o8873o6538n9536n2419m7971m3357l6693l0641k6941k3822
58094A537452k1269k2297k6820l0645l2460l5355l9582m0814l7735l4556l3602
58083A182317l2032k8496k6363k7411k8411k6965k5111k4383k2896j9957j8143
58072I02149j8192j7186j4172j2345j3061j3179j0944r108r464r478p426n822
58060G61772o516p144n717m408n497p516q541r471j1158j1837j0439r058r403
58047F55067r967r130q020p928p915p105o381n953m449j972q77j740k050n71O55
$$ plain form
58125 4754970 4520995 4299705 4088445 3887379 3693903 3505902 3327133 3162914 3013295
58116 3013295 2876017 2752506 2644833 2550153 2464248 2387357 2320450 2258819 2195595 2129223 2062025
58105 2062025 1994243 1925370 1858832 1799296 1746877 1698906 1655549 1618856 1588215 1561274 1537452
58094 1537452 1516183 1493886 1467066 1436421 1403961 1368606 1329024 1288210 1250475 1215919 1182317
58083 1182317 1150285 1121789 1095426 1068015 1039604 1012639 987528 963145 940249 920292 902149
58072 902149 883957 866771 852599 840254 827193 814014 803070 793962 784498 775020 767594 761772
58060 761772 755256 748112 742395 737987 732490 724974 716433 706962 695804 683967 673528 664470 655067
58047 655067 645100 635970 627950 620022 612107 605002 598621 592668 588219 586247 585370 583630 581580 581009 581664
58032E81664M22O05K206K910J084j196j631j056r98q94r8K55k98o4J789L376L377
58015E91453L311M480N516N087M381M659M894M020L038K946K899K323K402L544
58001F44953M003K794J512J306O69j806m926p117q714j0174j0610r993j0210j1833
57987E79854j2511j0746q598q280q512p018m336k434j357m4J100J049M20N40J280
57972E20407J708J823K020J968J541J489J927J635K06q21l38N98P31N75R36J285
57956E37690J050P54M87p67k937m001k916j315p53m63M63Q84k17j497j447r66
57940E24049j582k731l148l310m291n569o150o597p774q894q900q559r090r930
57926D37524r930r610j0050j0608r865q052o448n174l515j779q55m89L16J665
$$ plain form
58032 581664 582086 582691 584897 587807 588891 587695 586064 585008 584010 583116 583018 583273 582975 582911 584700 588076 591453
58015 591453 594764 599244 604760 609847 614228 618887 623781 627801 630839 633785 636684 639007 641409 644953
58001 644953 648956 651750 653262 654568 655237 653431 648505 641388 632674 622500 611890 601897 591687 579854
57987 579854 567343 556597 547999 539719 531207 524189 519853 517419 516062 516018 517118 518167 518587 519127 520407
57972 520407 522115 523938 525958 527926 529467 530956 532883 534518 534724 533903 533565 534163 534894 535469 536405 537690
57956 537690 538740 539494 539981 539214 536277 532276 529360 528045 527292 526829 527292 528176 527959 526462 525015 524049
57940 524049 522467 519736 516588 513278 508987 503418 497268 490671 482897 474003 465103 456544 447454 437524
57926 437524 427594 417984 407934 397326 387461 379409 372961 367787 364272 362493 361638 361149 361465 363130
57912C63130L023M419O011P084O986O459O680P572Q256Q453Q340P747O642N642
57898D56444N125M620L909L588L672L050J300l21q64j236k449l803m214m051m180
57883D60590m391m205m026m125l812k869k462l149l476k164k54O36P51J095J258
57868D29397M90k17O55K618L850L803L357K989K423J643P42o36k335l075k201
57853D43503j103j387k510k861k322j967k041j856j283o74J34J374K430K636K392
57838D34465K275J942J026J89k2l04j281k242k684l727o227q718r287q452q137
57823C88816q622q729q342q470r058q872p528n999n150n089n645o199n613l693
57809B91807k006j852k244j537j05M99K21K91Q69J075J060J937L766N468O736
$$ plain form
57912 363130 366153 370572 376583 383667 390653 397112 403792 411364 419620 428073 436413 444160 450802 456444
57898 456444 461569 466189 470098 473686 477358 480408 481708 481387 480523 479287 476838 473035 468821 464770 460590
57883 460590 456199 451994 447968 443843 440031 437162 434700 431551 428075 425911 425657 426293 427044 428139 429397
57868 429397 429887 429670 430325 432943 436793 440596 443953 446942 449365 451008 451750 451114 448779 445704 443503
57853 443503 442400 441013 438503 435642 433320 431353 429312 427456 426173 425499 425633 427007 429437 432073 434465
57838 434465 436740 438682 439708 439897 439875 439571 438290 436048 433364 429637 423410 414692 405405 396953 388816
57823 388816 380194 371465 363123 354653 345595 336723 329195 323196 318046 312957 307312 301113 295500 291807
57809 291807 289801 287949 285705 284168 284063 284562 284783 285074 285943 287018 288078 290015 293781 299249 305985
57794C05985Q283J0127J1265J1130R986Q032N463L203K106J654P33n96j505k059
57780C73807k962m024m453m369m560n036n327n740o744p497o810n237m468m746
57766C01834m645l304j375L05J401J625J006O08J499L160M168M221M121M156M027
57751C22807L994M542N195N160M778M732M432L016J449J520K954L674K924K016
57737C73193J816J619J047J069K438M532O293P165O934N910N313O084P412P811
57723D38636P448P734Q852R648R994J1101J3141J4537J4370J3766J4162J5591
57711E78980J7351J9075K0584K1787K3098K5064K7462K9809L2547L6431M0983
57700H73171M5182M9487N5449O3339P1955Q0829R0802J02248J14666J28262J44012
$$ plain form
57794 305985 314268 324395 335660 346790 356776 364808 370271 373474 375580 377234 377967 377371 375866 373807
57780 373807 370845 366821 362368 357999 353439 348403 343076 337336 330592 323095 316285 311048 306580 301834
57766 301834 297189 293885 292510 292815 294216 295841 296847 297455 298954 302114 306282 310503 314624 318780 322807
57751 322807 326801 331343 336538 341698 346476 351208 355640 358656 360105 361625 364579 368253 371177 373193
57737 373193 375009 376628 377675 378744 381182 385714 392007 399172 406106 412016 417329 423413 430825 438636
57723 438636 446084 453818 462670 472318 482312 493413 506554 521091 535461 549227 563389 578980
57711 578980 596331 615406 635990 657777 680875 705939 733401 763210 795757 832188 873171
57700 873171 918353 967840 1023289 1086628 1158583 1239412 1330214 1432462 1547128 1675390 1819402
57689A819402J61773J80161J98675K17912K37163K53655K64844K69525K66084
57680C869194K51645K24156J84075J33586P5934J6251l8875q4056j16418j34285
57670D381207j36686j25068j03794p8112n3415l7037l7785o0684j02308j52082
57660C494236j97552k28755k40775k35026k17607j94704j69555j43738j19387
57651A747137r8469q0998o5663n1794l9597k9204k0481j3188o546N94Q382J5757
57639A365930K2318K9246L7489M6287N4713O3581P4333Q6866R9940J13250J27673
57628B121626J43641J60517J77387J93442K07585K18308K23992K22878K12922
57619C882298J92278J59990J16502O4127P107m9688j02431j48512j85560k11760
$$ plain form
57689 1819402 1981175 2161336 2360011 2577923 2815086 3068741 3333585 3603110 3869194
57680 3869194 4120839 4344995 4529070 4662656 4738590 4754841 4715966 4631910 4515492 4381207
57670 4381207 4244521 4119453 4015659 3937547 3884132 3847095 3809310 3748626 3646318 3494236
57660 3494236 3296684 3067929 2827154 2592128 2374521 2179817 2010262 1866524 1747137
57651 1747137 1648668 1567670 1502007 1450213 1410616 1381412 1360931 1347743 1341197 1341791 1350173 1365930
57639 1365930 1388248 1417494 1454983 1501270 1555983 1619564 1693897 1780763 1880703 1993953 2121626
57628 2121626 2265267 2425784 2603171 2796613 3004198 3222506 3446498 3669376 3882298
57619 3882298 4074576 4234566 4351068 4415195 4422302 4372614 4270183 4121671 3936111 3724351
57609C724351k27264k33889k33049k25324k12320j97140j81984j66653j50406
57600A896322j34093j19271j06415r5151q5425p7221o9852o2703n6094n0575m5906
57589I93616m1551l7524l3993l0743k7692k5195k3216k1031j8433j6280j5088
57578G02870j4081j2475j0760r717r106q294p394o755o053m857l479k371j288
57565F06240P1J359K246L112M255N235N783O542Q056R888J1523J3253J5292J6951
57551G09806J7749J8449K0013K2345K5064K8565L3165L8118M2641M7187N2589
57540A055691N8757O5377P3095Q2641R3588J05056J17020J29706J42507J54792
57530B078230J66856J78538J87508J90517J85925J73677J53469J24645Q7768M4871
$$ plain form
57609 3724351 3497087 3263198 3030149 2804825 2592505 2395365 2213381 2046728 1896322
57600 1896322 1762229 1642958 1536543 1441392 1355967 1278746 1208894 1146191 1090097 1039522 993616
57589 993616 952065 914541 880548 849805 822113 796918 773702 752671 734238 717958 702870
57578 702870 688789 676314 665554 655837 646731 638437 631043 624288 618235 613378 609899 607528 606240
57565 606240 606311 607670 609916 613028 617283 622518 628301 634843 642899 652787 664310 677563 692855 709806
57551 709806 727555 746004 766017 788362 813426 841991 875156 913274 955915 1003102 1055691
57540 1055691 1114448 1179825 1252920 1335561 1429149 1534205 1651225 1780931 1923438 2078230
57530 2078230 2245086 2423624 2611132 2801649 2987574 3161251 3314720 3439365 3527133 3572004
57520C572004j556m8553r2093j28207j54954j72474j81569j83378j79802j72672
57510B256746j62586j49794j35822j22777j11202j00100q8951p8306o8543n9487
57500A179178n1328m4524l8697l2866k6846k1266j6230j1293o732l372r61J868
57488I26931N708R739J3341J7081K1642K6835L2263L8037M4231N0574N7113O4597
57476A308092P3677Q4269R5974J08486J21390J34072J46100J57196J66735J73518
57466B569509J75967J72125J59870J37894J06502O7121K1684k6807p3817j14905
57456C195143j47842j72289j87877j94118j92171j85064j75442j64076j50947
57447A625317j36785j22861j09976r8240q7471p7484o8348o0442n3946m8462m3528
$$ plain form
57520 3572004 3570448 3521895 3429802 3301595 3146641 2974167 2792598 2609220 2429418 2256746
57510 2256746 2094160 1944366 1808544 1685767 1574565 1474465 1385514 1307208 1238665 1179178
57500 1179178 1127850 1083326 1044629 1011763 984917 963651 947421 936128 929396 926024 925063 926931
57488 926931 932639 942378 955719 972800 994442 1021277 1053540 1091577 1135808 1186382 1243495 1308092
57476 1308092 1381769 1466038 1562012 1670498 1791888 1925960 2072060 2229256 2395991 2569509
57466 2569509 2745476 2917601 3077471 3215365 3321867 3388988 3410672 3383865 3310048 3195143
57456 3195143 3047301 2875012 2687135 2493017 2300846 2115782 1940340 1776264 1625317
57447 1625317 1488532 1365671 1255695 1157455 1069984 992500 924152 863710 809764 761302 717774
57436G17774l9235l5702l2370k8673k5058k2437k0751j9237j7789j6942j6509
57425D43071j5556j3891j2354j1417j0616r708r180r138q756p411n660m486m232
57412C20666m567m910m646l612k580k506l165l350k603j798j626j555r27k16l89
57397B82216j484k487k489j526m05O4j92n72o97r22j488j736j046j20k12j149
57381B65755j417m35N12Q5j420k702k957k152o44Q44J497J198O43L47J16k65n07
57364B58498m41m90j000j580j594r37j4P20J014R39Q70Q99M47q92k300k440j289
57347B50410k35j35k89K07J150J849K165K253J946J143K86j34j41J05P25J683
57331B62988K439K595K423K355K364K255K135K147K186K259K657L456M296M929
$$ plain form
57436 717774 678539 642837 610467 581794 556736 534299 513548 494311 476522 459580 443071
57425 443071 427515 413624 401270 389853 379237 369529 360349 351211 342455 335044 329384 324898 320666
57412 320666 316099 311189 306543 302931 300351 297845 294680 291330 288727 286929 285303 283748 282821 282605 282216
57397 282216 280732 278245 275756 274230 273825 273889 273697 273125 272428 271506 270018 268282 267236 267116 266904 265755
57381 265755 264338 263903 264415 264500 263080 260378 257421 255269 254625 255469 256966 258164 258807 259154 259270 259005 258498
57364 258498 258057 257567 256567 254987 253393 252456 252442 253162 254176 255115 255985 256884 257331 256439 254139 251699 250410
57347 250410 250175 250040 249751 249958 251108 252957 255122 257375 259321 260464 260750 260616 260475 260580 261305 262988
57331 262988 265427 268022 270445 272800 275164 277419 279554 281701 283887 286146 288803 292259 296555 301484
57317C01484N441N722N355M428L744L788M138M429N099O481P825Q154P680P473
57303C81241P960Q568Q838R093R800J0824J1598J1833J1896J2465J3832J5580
57291E13528J7134J8510K0139K2105K4017K5666K7206K8650K9720L0437L1212
57280G88324L2081L2487L2002L0736K8673K5325K0441J4455P798L62p745j5544
57268I89395k2001k7100l1406l4858l6793l7032l6237l5071l3573l1474k8748
57257F35102k5669k2588j9797j7490j5667j4117j2539j0821r207q006p080n887
57245D66234m251k782k142k187k301k244k091j602m89Q01J339R17K70N6K78P26
57229D50532J324J899K292K776L673M536M547L756L027K670K195J625J835L083
$$ plain form
57317 301484 306925 312647 318002 322430 326174 329962 334100 338529 343628 350109 357934 366088 373768 381241
57303 381241 389201 397769 406607 415700 425500 436324 447922 459755 471651 484116 497948 513528
57291 513528 530662 549172 569311 591416 615433 641099 668305 696955 726675 757112 788324
57280 788324 820405 852892 884894 915630 944303 969628 990069 1004524 1012322 1012684 1004939 989395
57268 989395 967394 940294 908888 874030 837237 800205 763968 728897 695324 663850 635102
57257 635102 609433 586845 567048 549558 533891 519774 507235 496414 487207 479201 472121 466234
57245 466234 461983 459201 457059 454872 452571 450327 448236 446634 446145 446946 448285 449202 449472 449528 449806 450532
57229 450532 451856 453755 456047 458823 462496 467032 471579 475335 478362 481032 483227 484852 486687 489770
57215D89770M278M551M595N582P457R196J0322J1335J2854J4912J6908J7921J7513
57202F27194J6375J5752J5900J5776J4616J2970J1750J0960J0092R192Q755Q967
57190G78299R639J0603J1681J2647J3562J4778J6263J7522J8465J9674K1353K2798
57178I67284K3505K4045K5138K6445K7127K6994K6409K5516K4340K3235K2428
57167A242466K1550K0374J9650K0374K2469K4904K6931K8525K9925L1383L3247
57156A521798L5612L7965L9686M0616M0809M0208L9159L8683L9487M0975M2060
57145A957058M2596M3275M4405M5653M6843M8175M9650N1053N2578N4690N7321
57134B493297N9794O1758O3686O6251O9655P3726P8323Q3442Q9080R5199J01802
$$ plain form
57215 489770 494048 498599 503194 508776 516233 525429 535751 547086 559940 574852 591760 609681 627194
57202 627194 643569 659321 675221 690997 705613 718583 730333 741293 751385 760577 769332 778299
57190 778299 787938 798541 810222 822869 836431 851209 867472 884994 903459 923133 944486 967284
57178 967284 990789 1014834 1039972 1066417 1093544 1120538 1146947 1172463 1196803 1220038 1242466
57167 1242466 1264016 1284390 1304040 1324414 1346883 1371787 1398718 1427243 1457168 1488551 1521798
57156 1521798 1557410 1595375 1635061 1675677 1716486 1756694 1795853 1834536 1874023 1914998 1957058
57145 1957058 1999654 2042929 2087334 2132987 2179830 2228005 2277655 2328708 2381286 2435976 2493297
57134 2493297 2553091 2614849 2678535 2744786 2814441 2888167 2966490 3049932 3139012 3234211 3336013
57123C336013J08949J16632J24532J31986J38556J44637J51216J58974J67963
57114D579458J78104J89626K03001K18919K38316K61890K89636L21442L58248
57105F838640M02171M55757N22035O05266P10624Q42974J006643J205889J444034
57096A4034033J722054K040059K401198K812913L283022L814487M402320N031837
57088C9541923N677691O306452O883129P377072P764363Q028301Q155914Q123644
57080I7858489P877026P328906O396038N056616L382146J514279l94808k232300
57072A26786392l935114n466997o789986p853350q604794r011838r076552q835299
57064F7212462q347610p683598o914665o106096n309879m560218l875467l265286
$$ plain form
57123 3336013 3444962 3561594 3686126 3818112 3956668 4101305 4252521 4411495 4579458
57114 4579458 4757562 4947188 5150189 5369108 5607424 5869314 6158950 6480392 6838640
57105 6838640 7240811 7696568 8218603 8823869 9534493 10377467 11384110 12589999 14034033
57096 14034033 15756087 17796146 20197344 23010257 26293279 30107766 34510086 39541923
57088 39541923 45219614 51526066 58409195 65786267 73550630 81578931 89734845 97858489
57080 97858489 105735515 113064421 119460459 124517075 127899221 129413500 129018692 126786392
57072 126786392 122851278 117384281 110594295 102740945 94136151 85124313 76047761 67212462
57064 67212462 58864852 51181254 44266589 38160493 32850614 28290396 24414929 21149643
57056B1149643k736253k291076j924747j625013j378303j174693j007271q69325
57048H142962p54303o57553n76062n06715m46223l92571l45132l03410k66849
57039C894144k35677k10593j91343j76552j64940j55694j47680j39435j30224
57030B342006j20403j10620j01211r2332q4006p6083o8678o2446n7856n4518n1798
57019A462055m9577m7772m5690m2832l9782l7308l5124l2492k9407k6113k2037
57008A053921j6548j0214l932K817J1488K2743L6603N3790P5262J00547J27526
56997A454003J52459J68004J62717J27225O3340j4328q6968j41343j72598j81901
56987A530610j74037j55535j32178j07579q4191o4470n0211m1699l8330l9193
$$ plain form
57056 21149643 18413390 16122314 14197567 12572554 11194251 10019558 9012287 8142962
57048 8142962 7388659 6731106 6155044 5648329 5202106 4809535 4464403 4160993 3894144
57039 3894144 3658467 3447874 3256531 3079979 2915039 2759345 2611665 2472230 2342006
57030 2342006 2221603 2110983 2009772 1917440 1833434 1757351 1688673 1626227 1568371 1513853 1462055
57019 1462055 1412478 1364706 1319016 1276184 1236402 1199094 1163970 1131478 1102071 1075958 1053921
57008 1053921 1037373 1027159 1023227 1026044 1037532 1060275 1096878 1150668 1225930 1326477 1454003
56997 1454003 1606462 1774466 1937183 2064408 2127748 2113420 2026452 1885109 1712511 1530610
56987 1530610 1356573 1201038 1068860 961281 877090 812620 762409 720710 682380 643187
56977F43187m2483m5505m6349m4965m2112l8202l3656k9253k5257k1017j6120
56966B58268j1164o758k664J590O089J1031J6776K2892K8215L2327L5715L7678
56954D29995L5566K7369J4210o58j4426k5320l1952l3819l2081k8602k4409j9781
56942B96092j5252j1367p837m020K8L818P494J1759J6947K2911K9600L6858M3518
56929D30549M7196M5243L6055K0106K68j9247l4870m4880m9138m8486m4573l9320
56917B98903l3913k8590k3551j9297j5858j2578r200o440m986m557m396m045l329
56904A28163k271j348j016p31N44K557L663L217K745L906O286Q400R913J1702
56890A75730J4293J7484K1133K5280K9588L3336L5608L4976K9720J9382N966p119
$$ plain form
56977 643187 600704 555199 508850 463885 421773 383571 349915 320662 295405 274388 258268
56966 258268 247104 240346 237682 239272 245361 256392 273168 296060 324275 356602 392317 429995
56954 429995 465561 492930 507140 506482 492056 466736 434784 400965 368884 340282 315873 296092
56942 296092 280840 269473 261636 257616 257644 261462 268956 280715 297662 320573 350173 387031 430549
56929 430549 477745 522988 559043 579149 579417 560170 525300 480420 431282 382796 338223 298903
56917 298903 264990 236400 212849 193552 177694 165116 155916 149476 144490 139933 135537 131492 128163
56904 128163 125892 124544 123528 122797 123341 125898 129561 132778 135523 139429 145715 154115 164028 175730
56890 175730 190023 207507 228640 253920 283508 316844 352452 387428 417148 436530 442496 435377
56878D35377j7195k3270k5625k5248k3235k0112j5915j1054o378k098K422P456
56866B75125J2521J7767K4559L3757M4403N5141O5783P6016Q3206Q2990P2169
56855H43437N0555K0960j1354l9828n9178o7767o7418o1347n2473m2799l3094
56844D79694k3211j3208l730N085J4279K4916L7009N0439O6005Q4383J04451J23326
56832I49438J37060J40324J26939R3482M3380j3363o5001j02948j23827j29050
56822A056434j22892j09914r3452p6105o0176m6606l4295k1845r489J827J2620
56811D96107K4552L8276N3011O8033Q2808R5236J00894R4842P4232M0090k080
56800A166001m3663p6554r6566j03730j00406r0012p6643o3666n2090m1190l0661
$$ plain form
56878 435377 418182 394912 369287 344039 320804 300692 284777 273723 267345 265247 267669 275125
56866 275125 287646 305413 329972 363729 408132 463273 529056 605072 688278 771268 843437
56855 843437 893992 914952 903598 863770 804592 736825 669407 608060 555587 512788 479694
56844 479694 456483 443275 439545 444630 458909 483825 520834 571273 637278 721661 826112 949438
56832 949438 1086498 1226822 1353761 1447243 1490623 1477260 1412259 1309311 1185484 1056434
56822 1056434 933542 823628 730176 654071 593895 547289 512994 491149 481660 483487 496107
56811 496107 520659 558935 611946 679979 762787 858023 958917 1053759 1127991 1168081 1166001
56800 1166001 1122338 1045784 949218 845488 745082 655070 578427 514761 462671 421481 390820
56789C90820k1165j2878m958L219J1342J9086K6769L4678M2362M8795N2454N1092
56777F41616M2285K5168J866k2760m3120n5557n9985n8885n4690m8516m1283l4549
56765B91590k9272k4828k0301j6006j2684j0127p870o371o060n997m998l532k851
56752A40693k824k370j551j348j613j282n17o07j563j854r75k52n87j182j290
56737A20878j483k222k695k176j385j351j876k050j577q53k83j55n12q05l81L82
56721A01456L24p60j623j278k72L07K68R3oj36k74l18k70j83k05o10j308j570
56703I3635r21r7j39q33j135r74j201j802j675n81K13j87j017j193p54l05O6M78
56685H1578P14O61O50Q15P58L30O6M05J100J689J926J595O66k25l41m9n15j954
$$ plain form
56789 390820 369655 356777 351819 355038 366380 385466 412235 446913 489275 538070 590524 641616
56777 641616 683901 709069 710935 688175 645055 589498 529513 470628 415938 367422 326139 291590
56765 291590 262318 237490 217189 201183 188499 178372 170502 164131 158071 152074 147076 143544 140693
56752 140693 137869 135499 133948 132600 130987 129705 129188 128581 127018 125164 124189 123937 123350 122168 120878
56737 120878 119395 117173 114478 112302 110917 109566 107690 105640 104063 103210 102927 102772 102260 101455 101074 101456
56721 101456 101780 101020 99397 98119 97847 98154 98422 98515 98509 98373 98099 97781 97511 97328 97123 96513 95205 93635
56703 93635 92714 92617 92478 91645 90510 89536 88335 86533 84858 84277 84490 84303 83286 82093 81339 81034 81100 81578
56685 81578 82292 82953 83603 84418 85176 85506 85572 85977 87077 88766 90692 92287 92953 92728 92387 92338 91823 89869
56667H9869l219l423k925k434k188k329k993l611l241k046j253j364j430p01L57
56652E7069J187K074L154L742L544L435M109M972N280N435O042O638O388N446
56638A18515M556L870L110K396K005J741J336J097J388J869J891J366O38q6o69
56623A45023q33n28j53m9j66m59j034j619j566p67P6M44N42N45J46o88j287j200
56605A36427q48q03j004j142j197j151p96k12J44J20K9k9k67n30l89%N5j46L0
56586A28291M52L48j65q8N67O14k01o03n2J34r26j906j190P41K250K790K913K900
56568A36869K762K865L364L665L447L399M067M811M918M711M618M169L131K505
56554A89301L067L855L577K619K216K320J949J030L72J38j60m85m10j86m62j164
$$ plain form
56667 89869 86650 83227 80302 77868 75680 73351 70358 66747 63506 61460 60207 58843 57413 56712 57069
56652 57069 58256 60330 63484 67226 70770 74205 78314 83286 88566 94001 100043 106681 113069 118515
56638 118515 123071 126941 130051 132447 134452 136193 137529 138626 140014 141883 143774 145140 145778 145692 145023
56623 145023 144190 143662 143509 143460 143294 142835 141801 140182 138616 137849 137925 138369 138911 139456 139602 138914 137627 136427
56605 136427 135579 134776 133772 132630 131433 130282 129486 129274 129418 129538 129567 129538 129271 128741 128352 128352 128407 128261 128291
56586 128291 128743 129091 128926 128838 129405 130019 129818 129215 129163 129297 128371 126465 125275 126016 128266 131056 133969 136869
56568 136869 139631 142496 145860 149525 152972 156371 160438 165249 170167 174878 179496 183665 186796 189301
56554 189301 192368 196223 199800 202419 204635 206955 208904 209934 210306 210444 210284 209799 209389 209203 208741 207577
56538B07577j695k025k467k793k648k456k835l422l376k725k160j822j317o57
56524A75179j62K33O24N17m78j733k412k719l264l729l335k294j560j343j069
56509A52455o68p23j319j768j537p72R6O04M39q4p7O89J207O14m18o59r6L03J87
56490A48473J16M06P39Q15O74M79M92R30J448J359Q15R30K164L432L658L183K843
56473A72956K624K299K328K934L287K892K780L865N120N003L889L347L582L448
56459B20354K540J583R05K19k74q6L65J68o42j328j846k579k984k109l20R45J078
56442B15989O94K27m14r02n94K27M99j31r83j493j762j980k267k820l463l441
56426A97386k544j771j911k240j841j312j707k524k471j610j043r45o93m84r89
$$ plain form
56538 207577 205882 203857 201390 198597 195949 193493 190658 187236 183860 181135 178975 177153 175836 175179
56524 175179 175017 175250 175874 176391 175913 174180 171768 169049 165785 162056 158721 156427 154867 153524 152455
56509 152455 151787 151064 149745 147977 146440 145668 145764 146368 146807 146723 146646 147335 148542 149156 148738 148079 147983 148286 148473
56490 148473 148589 148995 149734 150549 151223 151702 152194 153124 154572 155931 156746 157676 159840 163272 166930 170113 172956
56473 172956 175580 177879 180207 183141 186428 189320 192100 195965 201085 206088 209977 213324 216906 220354
56459 220354 222894 224477 225382 225601 225327 225241 225606 225774 225132 223804 221958 219379 216395 214286 213966 214911 215989
56442 215989 216683 216910 216496 215594 215000 215227 215726 215595 214612 213119 211357 209377 207110 204290 200827 197386
56426 197386 194842 193071 191160 188920 187079 185767 184060 181536 179065 177455 176412 175467 174774 174290 173301
56411A73301j769j861j602j991k564j931k71P80P38O77R10M21r22j626p29R21
56395A62482K186K972L452L376K740K038J455P77K28L56R56J236J061R44J032
56380A87291J244K084L901N653N962N175M814N180N265M769M398M189L429K232
56366B45586J426Q59l27j698j774m19Q46J172J167J202Q59L35M54R84P83q1k38
56349B51136N94J174J009J107J854K187J550R15J064J550J895K355K935L192L402
56334B77919M343N625N972N399N279N947O195N523M892M754M431M005M644O288
56320C51216P112O198M884M536M756M682M328L809K814J584R33P31M2r55j035
56305C95635k55j13r82j540j259j095j139j26J935L090K608K272L311M473M511
$$ plain form
56411 173301 171532 169671 168069 166078 163514 161583 161312 162092 162830 163507 164417 164838 163916 162290 161561 162482
56395 162482 164668 167640 171092 174468 177208 179246 180701 181478 181706 182062 183018 184254 185315 186259 187291
56380 187291 188535 190619 194520 200173 206135 211310 216124 221304 226569 231338 235736 239925 243354 245586
56366 245586 247012 247871 247544 245846 244072 243653 244499 245671 246838 248040 248899 249234 249688 250672 251455 251374 251136
56349 251136 251730 252904 253913 255020 256874 259061 260611 261526 262590 264140 266035 268390 271325 274517 277919
56334 277919 282262 287887 293859 299258 304537 310484 316679 322202 327094 331848 336279 340284 344928 351216
56320 351216 358328 364526 369410 373946 378702 383384 387712 391521 394335 395919 396852 397583 397625 396670 395635
56305 395635 395380 395267 394285 392745 391486 390391 389252 389126 391061 394151 396759 399031 402342 406815 411326
56290D11326M350N148O313O989P698Q990J0165J0788J1771J3680J5564J6678J7706
56277E47166J9250K0770K2128K4280K7404L0257L2359L4880L8408M2078M5830
56266H84810N1144N8316O5525P1999P9576Q9525J00316J10280J20025J30366J40276
56255A902158J48907J57269J65715J72009J74067J72587J68761J61477J49169
56246C372119J32435J12548Q9307O2958L6326J2456q503k7719m4631n7877o7787
56235C611632p5394q0358q2265q2696q3636q4999q5844q6788q9020r2162r5191
56224B673279r8286j01753j04533j05758j06359j07183j07118j05099j02227r9705
56214A635258r6481r1321q5391q0223p4898o7996o0642n4780m9945m4658l9566
$$ plain form
56290 411326 415676 420824 427137 434126 441824 450814 460979 471767 483538 497218 512782 529460 547166
56277 547166 566416 587186 609314 633594 660998 691255 723614 758494 796902 838980 884810
56266 884810 935954 994270 1059795 1131794 1211370 1300895 1401211 1511491 1631516 1761882 1902158
56255 1902158 2051065 2208334 2374049 2546058 2720125 2892712 3061473 3222950 3372119
56246 3372119 3504554 3617102 3706409 3769367 3805693 3818149 3809646 3781927 3737296 3679419 3611632
56235 3611632 3536238 3455880 3373615 3290919 3207283 3122284 3036440 2949652 2860632 2768470 2673279
56224 2673279 2574993 2473240 2368707 2262949 2156590 2049407 1942289 1837190 1734963 1635258
56214 1635258 1538777 1447456 1362065 1281842 1206944 1138948 1078306 1023526 973581 928923 889357
56203H89357l6089l3352k9640k5771k3732k2917k1015j8011j5953j5181j3971
56192F33725j1790r947q981p993o692n709m917l542j856p49RJ299K810L567L724
56177E82958M089M556M749N352O908Q322Q403P882P950Q051P153N904N287M523
56163F72087K696J082J280K295K125J161J269K550L694M635O183P922R105J0620
56149G28704J3585J6995J9361K1540K5309L0320L5335M1198M9595N9993P0753
56138A112688Q2214R5462J09117J20482J28874J34639J35920J30070J17733J02367
56128B269566Q6449P1273N9429N3331N1330M8595M2014L1653J8235K619j2526
56117B721968k3965l1137l5901l9777m4142n1980o5832q4055j01897j15886j24664
$$ plain form
56203 889357 853268 819916 790276 764505 740773 717856 696841 678830 662877 647696 633725
56192 633725 621935 611988 603007 595014 588322 582613 577696 574154 572298 571549 571558 572857 575667 579234 582958
56177 582958 587047 591603 596352 601704 608612 616934 625337 633219 641169 649220 656373 662277 667564 672087
56163 672087 674783 675865 677145 679440 681565 682726 683995 686545 690239 694874 701057 708979 718084 728704
56149 728704 742289 759284 778645 800185 825494 855814 891149 932347 981942 1041935 1112688
56138 1112688 1194902 1290364 1399481 1519963 1648837 1783476 1919396 2049466 2167199 2269566
56128 2269566 2356015 2427288 2486717 2540048 2591378 2639973 2681987 2713640 2731875 2734494 2721968
56117 2721968 2698003 2666866 2630965 2591188 2547046 2495066 2429234 2345179 2243282 2127396 2002732
56106B002732j26865j21762j11569r9866q7950p5349o3010n2860m4999l8230l2619
56095A147653k8812k5947k3083k1223k1061k0465j7535j4137j2856j2415j0200
56084I39919p247o248o432n120k799j778j334P81L443L895L193M557P465Q744
56070I41039Q512R439J1048J0538Q632Q712J0605J1039R958J0389J2312J2631
56058A064854J1228J1088J2307J2046J0511J0972J3520J4878J4652J5682J7893
56047A209631J8156J6730J7405K0510K2182K1380K1318K3016K3769K3135K4136
56036A441368K7232K9117K8787K8896L0245L0660L0138L1123L3237L3785L3719
56025A778307L6661M1810M4608M4559M5457M7736M8081M6660M7049M8772M7994
$$ plain form
56106 2002732 1875867 1754105 1642536 1542670 1454720 1379371 1316361 1263501 1218502 1180272 1147653
56095 1147653 1118841 1092894 1069811 1048588 1027527 1007062 989527 975390 962534 950119 939919
56084 939919 932672 926424 919992 914872 912073 910295 908961 909742 913185 917080 920273 924830 932295 941039
56070 941039 949551 958990 970038 980576 989208 997920 1008525 1019564 1029522 1039911 1052223 1064854
56058 1064854 1076082 1087170 1099477 1111523 1122034 1133006 1146526 1161404 1176056 1191738 1209631
56047 1209631 1227787 1244517 1261922 1282432 1304614 1325994 1347312 1370328 1394097 1417232 1441368
56036 1441368 1468600 1497717 1526504 1555400 1585645 1616305 1646443 1677566 1710803 1744588 1778307
56025 1778307 1814968 1856778 1901386 1945945 1991402 2039138 2087219 2133879 2180928 2229700 2277694
56014B277694M5771M7209N2017N4750N4828N7142O2098O4809O5147O8520P5315
56003B925300P9738Q0885Q4599R2541R9721J04838J12328J22249J29122J33008
55993C964329J40465J52313J62059J68526J77945J91300K02379K10812K23685
55984E593813K41700K57603K71072K90482L17028L42583L66323L97205M36710
55975H514519M76497N16662N67807O31141O96473P64427Q49650R57413J079759
55966A5054348J220069J397332J621571J892204K225032K648029L162651L745494
55958C2966730M400232N172574O105746P227806Q600639J0338445J2568910J5433515
55950A02814597J9125265K3813325K9451328L5679900M1833190M6746725M8411678
$$ plain form
56014 2277694 2323465 2370674 2422691 2477441 2532269 2589411 2651509 2716318 2781465 2849985 2925300
56003 2925300 3005038 3085923 3170522 3263063 3362784 3467622 3579950 3702199 3831321 3964329
55993 3964329 4104794 4257107 4419166 4587692 4765637 4956937 5159316 5370128 5593813
55984 5593813 5835513 6093116 6364188 6654670 6971698 7314281 7680604 8077809 8514519
55975 8514519 8991016 9507678 10075485 10706626 11403099 12167526 13017176 13974589 15054348
55966 15054348 16274417 17671749 19293320 21185524 23410556 26058585 29221236 32966730
55958 32966730 37366962 42539536 48645282 55873088 64473727 74812172 87381082 102814597
55950 102814597 121939862 145753187 175204515 210884415 252717605 299464330 347876008
55943C47876008M4247392L2542289J4195015o987176k6053963l9367571m5854950
55936C20597044m6552055m3389797l8244891l2511619k7012693k2112249j7926456
55929I2847284j4472907j1699346r492831p736997o351924n270788m417153l728311
55921B9677027l173239k728781k361502k046969j782641j566265j381289j215262
55913A3421079j072305r55138q52863p57456o74972o09709n53272m99072m52399
55904F993893m16700l84302l49789l18979k96056k74828k50924k30091k16261
55895D255963k03408j87057j72494j63766j55563j43619j32758j27030j21744
55886B848524j12727j04129r9844r6004q9013q2584q0004p7447p1605o6222o4636
$$ plain form
55943 347876008 392123400 424665689 438860704 431873528 405819565 366451994 320597044
55936 320597044 274044989 230655192 192410301 159898682 132885989 110773740 92847284
55929 92847284 78374377 66675031 57182200 49445203 43093279 37822491 33405338 29677027
55921 29677027 26503788 23775007 21413505 19366536 17583895 16017630 14636341 13421079
55913 13421079 12348774 11393636 10540773 9783317 9108345 8498636 7945364 7446292 6993893
55904 6993893 6577193 6192891 5843102 5524123 5228067 4953239 4702315 4472224 4255963
55895 4255963 4052555 3865498 3693004 3529238 3373675 3230056 3097298 2970268 2848524
55886 2848524 2735797 2631668 2531824 2435820 2346807 2264223 2184219 2106772 2035167 1968945 1904309
55875A904309o3266n8765n4516n3874n3697n0560m6882m5255m2963l7809l3278
55864A363444l2420l2317k9814k7074k6361k4993k0538j5638j2809r769m715j074
55852A125922k151n938r758j5018k2750k9310l1334l0680l0128k8646k5066k1903
55840H73240k1131k0416j7761j5646j6446j7841j7072j5761j6378j7672j7573
55829F79543j6995j7071j6151j3237j0722j0285r840p918p049r122j1404j0978
55817E38771r389r066q881p116n242m781l813n55K828L732L386L959M630M043
55803E12506L451L876L389Q24j210p30l80l037o744q286q743j0933j3978j5041
55789D54964j4303j3914j3755j2364j0382r406q866p461o033n800n526l609j181
$$ plain form
55875 1904309 1841043 1782278 1727762 1673888 1620191 1569631 1522749 1477494 1434531 1396722 1363444
55864 1363444 1331024 1298707 1268893 1241819 1215458 1190465 1169927 1154289 1141480 1131711 1126996 1125922
55852 1125922 1123771 1117833 1108075 1093057 1070307 1040997 1009663 978983 948855 920209 895143 873240
55840 873240 852109 831693 813932 798286 781840 763999 746927 731166 714788 697116 679543
55829 679543 662548 645477 629326 616089 605367 595082 585242 577324 570275 561153 549749 538771
55817 538771 529382 520316 511435 504319 499077 494296 490483 489928 492756 496488 499874 503833 508463 512506
55803 512506 515957 519833 523222 524046 522836 522106 521726 518689 511945 503659 494916 483983 470005 454964
55789 454964 440661 426747 412992 400628 390246 380840 371974 364513 358480 352680 347154 343545 342364
55776C42364q6K28P02k10m069q934j1741j2412j2556j1943r606o734n085l954
55762B55964j757Q20K040J911J044j380n631r273r956q760p908p088n090l133
55748B01803l134m186m022k752k103k224k126k030k506k622j594p76j345j755
55734A68628l03J584J705R67J626L197L452K250J030l82l134o398q159q194p615
55719A50254o497m652l443l908m374k870o76k31r00k50J577K405K201L006N042
55704A36684O429O665P134Q062Q010O591M953L377J008j847l582l735l407l229
55690A73113k827k268k124k282k275k366k737k439q72P19J130J417K998M873N150
55675A69210M286M073M321L414J500K65m0o13j511j615r78o76n56M32J872K201
$$ plain form
55776 342364 342278 342506 343208 342998 338929 329995 318254 305842 293286 281343 271737 265003 259918 255964
55762 255964 254207 255027 257067 258978 260022 258642 253011 243738 233782 225022 217114 210026 204936 201803
55748 201803 198669 194483 190461 187709 185606 183382 181256 179226 176720 174098 172504 171728 170383 168628
55734 168628 168325 169909 171614 172581 174207 177404 180856 183106 184136 183754 180620 174222 166063 157869 150254
55719 150254 143757 139105 135662 131754 127380 124510 123834 123603 122703 122453 124030 126435 128636 131642 136684
55704 136684 143113 149778 156912 164974 172984 179575 184528 187905 188913 187066 183484 179749 176342 173113
55690 173113 170286 168018 165894 163612 161337 158971 156234 153795 152923 153642 154772 156189 159187 164060 169210
55675 169210 173496 177569 181890 185304 186804 187069 187029 186416 184905 183290 182312 181636 181080 181512 183384 185585
55659A85585J248K99n6j79Q9J020J708J238M98O87R47k59k329l680m697o738q957
55642A66424r249p887p145p561p642p015o850p096o321m512l262k971k530j861
55628H4522k057k817k608j542j355k226k427j552j185j860k097j212m22l93k03
55613F0566M54M93l44q03m53m33j064j068k0O07j31j222j584j485j222l99O03
55596E2495L60j369k831k699j641p75j50L59L07l23p61p74j001j473j337m70J31
55579C8048J9j59j09l06o17k53O13R15O71R78J726J430j26j247j015n94r34j207
55561C7833o09J08R4j83j27j33n02n31K35J039J103O69J68m69j042q63N5P92R73
55542C8610J228J810K185K346L015M007M042K806J615J376J447J223J229J825
$$ plain form
55659 185585 186833 187132 187076 186897 186986 188006 189714 190952 191450 192137 193084 192825 190496 186816 182119 175381 166424
55642 166424 157175 149288 142143 134582 126940 119925 113075 105979 99658 95146 91884 88913 86383 84522
55628 84522 82465 79648 77040 75498 74143 71917 69490 67938 66753 64893 62796 61584 61162 60769 60566
55613 60566 61020 61513 61169 60366 59913 59480 58416 57348 57328 57935 57804 56582 54998 53513 52291 51892 52495
55596 52495 52855 51486 48655 45956 44315 43540 43390 43749 44056 43733 42972 42198 41197 39724 38387 37917 38048
55579 38048 38067 37908 37799 37493 36876 36623 37236 38151 38822 39800 41526 42956 42830 41583 40568 39974 39040 37833
55561 37833 37224 37332 37426 37243 37116 36983 36481 35950 36185 37224 38327 38996 39164 38695 37653 36790 36845 37637 38610
55542 38610 39838 41648 43833 46179 49194 53201 57243 60049 61664 63040 64487 65710 66939 68764
55528F8764K299K094J609J094J63r73j309p72o37j463k222k259k410l238l834
55513E6906l547l270l794m231l558k482k302k903l176k788k234j754j235p81n36
55498A8315l36o7J31K56M95P52Q71J283K307K977K030J00p66r6L54n69j755j859
55480B4423j226p32k19O79J453J544J222P85m1j178j841j815j851k149j871q79
55464A6304m11j075j718j359p23p14q03k34M31M65L88Q64J252O79k98n51j66l6
55446A2295k99m02j73K41R28J743J882Q69n60j282r65K1J148J662R91k31n57K54
55428A7565Q35L77j98k7K27k41q60p83l81l03k22K93O44K16m20n13m20o59p05
55409A4425J8Q73J050R91J470K106K128J778J641J347L57o67p38k10j84p54j116
$$ plain form
55528 68764 71063 73157 74766 75860 76023 75050 73741 72969 72332 70869 68647 66388 63978 60740 56906
55513 56906 53359 50089 46295 42064 38506 36024 33722 30819 27643 24855 22621 20867 19632 18851 18315
55498 18315 17979 17912 18043 18299 18794 19546 20417 21700 24007 26984 29014 29114 28348 28252 28606 28037 26282 24423
55480 24423 23197 22465 22246 22925 24378 25922 27144 27929 27888 26710 24869 23054 21203 19054 17183 16304
55464 16304 15893 14818 13100 11741 11018 10304 9501 9267 9698 10163 10551 11415 12667 13346 13048 12497 12331 12295
55446 12295 11996 11594 11421 11662 12590 14333 16215 17084 16524 15242 14277 14298 15446 17108 18099 17868 17311 17565
55428 17565 18400 18777 18579 18552 18779 18538 17678 16895 16514 16211 15989 16282 16926 17142 16722 16209 15789 15130 14425
55409 14425 14443 15316 16366 17357 18827 20933 23061 24839 26480 27827 28184 27517 26779 26569 26385 25631 24515
55392B4515r35m02N16J702K287J606L02o03j125j748k204k094k028k775l704l494
55376I816k010l15Q21J241P49o10j937k313k001A625a57j399p59k59K73J078C84
55358A721Q75J045J388R43kl32M5K50J05K95Q98J140P12J70q3j89j77J20M57L58
55338I739j05m90p41j044j118n60L67J067J470J784J806J314P55O16N08j26q62
55321A4380q85l41l1q5l8J27R2N8L69O08J17p57j142j022j009r92l43O73J002
55302A0781L57m69q87j037r85n28J04L25J17J4J59K15J30J55J99N2J18R29K045
55283A1794K396J677N15n71j436j773j347o92n61p67n22K10P35Q19Q02O98K84
55266A2261q1R7L30k19j116j063P2J047J191J109J185Q49j03q28p70m92n34m80
$$ plain form
55392 24515 23580 23178 23694 25396 27683 29289 29591 28988 27863 26115 23911 21817 19789 17014 13310 9816
55376 9816 7806 7491 8312 9553 10302 9692 7755 5442 3441 1625 -157 -1556 -2315 -2574 -2301 -1223 384
55358 1721 2596 3641 5029 5972 5970 5638 5683 5933 6038 6333 7231 8371 9083 9253 9170 8981 8804 8924 9381 9739
55338 9739 9634 9144 8403 7359 6241 5681 6048 7115 8585 10369 12175 13489 14244 14860 15368 15242 14380
55321 14380 13495 13154 13123 13038 13000 13127 13219 13277 13646 14254 14371 13614 12472 11450 10441 9449 9106 9779 10781
55302 10781 11138 10669 9782 8745 7760 7232 7336 7661 7778 7792 7951 8166 8296 8451 8650 8702 8820 9749 11794
55283 11794 14190 15867 16382 15811 14375 12602 11255 10563 10002 9235 8713 8923 9658 10477 11279 11977 12261
55266 12261 12180 12277 12607 12388 11272 10209 10281 11328 12519 13628 14813 15662 15559 14731 13961 13469 12935 12455
55248A2455J21P83Q74N68L31J08k98o44o40m24j46L99J207J642J146P8o75o76
55230A6209k08K26M01M97Q33J356J464P67j99n36k33r7m75p34k66N93J082R22
55212B1602L82j46l56j7P47J379J280M14o14j066p62k49j15l11m39n30q61j049
55194A9289k79J255K132J552M55J2p0o25j260r36N8L04o31j545j399o20k13l64
55176A7115m27J66J287K198K233J520P95L27l64j401j933j334l28ol13m04q0J97
55158A9248K71L02J37l27o05l05Q3N1J13Q40J517J153K69J10N06J63j097k082
55140B0347k162j873j540r12k19m5o4N62J451J358M36K45J175J753J099K43J60
55123B2014L18J22J66Q78J347P50k16n61n18o58n47L95J527J801J339R83Q35M28
$$ plain form
55248 12455 12576 13359 14233 14801 15132 15240 14942 14298 13658 13234 13088 13487 14694 16336 17482 17560 16885 16209
55230 16209 16001 16227 16628 17125 17958 19314 20778 21545 21346 20810 20577 20480 20005 19271 19005 19598 20680 21602
55212 21602 21984 21838 21482 21465 22212 23591 24871 25285 24671 23605 22843 22594 22479 22168 21729 21199 20338 19289
55194 19289 19010 20265 22397 23949 24404 24416 24346 23721 22461 21525 21583 21887 21256 19711 18312 17692 17479 17115
55176 17115 16688 16854 18141 20339 22572 24092 24887 25214 24850 23449 21516 20182 19854 19848 19535 19131 19051 19248
55158 19248 19519 19821 19958 19631 19026 18721 18804 18855 18968 19808 21325 22478 22747 22857 23363 23526 22429 20347
55140 20347 18185 16312 14772 13860 13641 13596 13532 14094 15545 16903 17339 17584 18759 20512 21611 21854 22014
55123 22014 22332 22454 22620 23498 24845 25595 25379 24818 24300 23642 23095 23490 25017 26818 28157 29140 29975 30403
55105C0403j46l85l17l06k26K48Q03Q02L67K65Q10J494J752J535J184J058J286
55088D0627J568J399O93o6m34m89m83m58l52j63J36N43Q15O98L61J89J72K0k21
55069D4555k69k54m74o33k39L37J54p40j195o04K98O73N58K18l99j105j250p13
55051C8918k17k05k04J41L38rm00k82M8O3j27k16l15n21n13j96p5l60m38J36P46
55030C6312O32J20R4O38R97O72mk95K82J423K074J435jr93j176j293j729j870
55012C7318j325o36k40J84P32P43M1l75K20J068J212R28R13Q77K73l77k76J35
54994D1415k07j102j241k09R65J336J066P50N86M68L22J31j5K7J09k13q90j078
54976D2220k12J049J638J488J384J716K181K464K477K052J145L09K52R38J673
$$ plain form
55105 30403 30257 29872 29555 29249 29023 29271 30074 30876 31243 31508 32318 33812 35564 37099 38283 39341 40627
55088 40627 42195 43594 44287 44221 43787 43298 42815 42357 42005 41842 41978 42521 43336 44034 44395 44584 44756 44776 44555
55069 44555 44286 44032 43558 42925 42686 43023 43177 42437 41242 40638 40936 41609 42167 42385 41986 40881 39631 38918
55051 38918 38701 38496 38292 38433 38771 38762 38362 38080 38128 38191 38064 37848 37533 37012 36499 36303 36228 35868 35430 35566 36312
55030 36312 36944 37064 37158 37796 38793 39465 39461 39166 39448 40871 42945 44380 44379 43386 42210 40917 39188 37318
55012 37318 35993 35357 35117 35301 36033 36776 36817 36442 36662 37730 38942 39870 40783 41660 41933 41556 41280 41415
54994 41415 41208 40106 38865 38656 39621 40957 42023 42773 43359 43827 44149 44280 44265 44292 44401 44188 43298 42220
54976 42220 42008 43057 44695 46183 47567 49283 51464 53928 56405 58457 59602 59911 60163 61101 62774
54961F2774K051K287K681L249L891M564N266O124P311Q741J0079J1264J2523J3658
54947A56463J3897J2838J1000Q956O441L028r18m601p754j0522j2716j3881j3924
54934A48307j3124j1740j0067q578p483o458n258m196l596l186k638k143j883
54921F7957j457m77O62J385J852K531L300L745L989M451N061N580O392Q110J0469
54906A23550J2454J3471J3675J3257J2127J0280P783M425R8m546q409j1009j2717
54893A74439j3950j4590j4301j3035j1169r343q025p054n859m348l166k838l106
54880F3655l379l370k914j852n58J03j29m60k75j5j68k96l3j24j213k301j878
54863D4793k86N82q2j115j318q85n78n05m09l42m59n83m42o1K95L79J41j53j17
$$ plain form
54961 62774 64825 67112 69793 73042 76933 81497 86763 92887 100198 108939 119018 130282 142805 156463
54947 156463 170360 183198 194198 203154 209595 212623 211705 207104 199350 188828 176112 162231 148307
54934 148307 135183 123443 113376 104798 97315 90857 85599 81403 77807 74621 71983 69840 67957
54921 67957 66500 66023 66685 68070 69922 72453 75753 79498 83487 87938 92999 98579 104971 113081 123550
54906 123550 136004 149475 163150 176407 188534 198814 206597 211022 211120 206574 198165 187156 174439
54893 174439 160489 145899 131598 118563 107394 98051 90026 82972 77113 72765 69599 66761 63655
54880 63655 60276 56906 53992 52140 51582 51685 51556 51096 50821 50806 50638 50342 50309 50185 48972 46671 44793
54863 44793 44507 45089 45007 43892 42574 41689 41111 40606 40197 39855 39396 38813 38371 38310 38605 38984 39125 38972 38855
54844C8855K02L13M1j12J22J55m99j173q21L82J245J136N47K14M60J272K267K641
54826D7247J938P91K12L12M38K70l8n52j384j914j289K45J451J670J450J451J607
54809E3905J601J465J399J522J954K735L607M357N164O217P230P971Q884J0416
54795A18427J2111J3187J3736J4290J4445J3133J0240O787L418j50l974p321r608
54782A98721j0958j1596j1542j1169j1048j0919r786p431m968l474k838k441k129
54769I8422j995j809j252l16Q21J944K671K742K568K922L956N118O091P153Q479
54754A37515R866J1262J2833J4331J5156J5185J4715J3460J0598O075R49l819
54742B58126q112j1829j4411j5660j6184j6391j5898j4375j2253j0080p960o151
$$ plain form
54844 38855 39057 39370 39411 39299 39421 39576 39077 37904 37083 37465 38710 39846 40393 40607 41067 42339 44606 47247
54826 47247 49185 49976 50188 50500 50938 51208 51170 50618 49234 47320 46031 46276 47727 49397 50847 52298 53905
54809 53905 55506 56971 58370 59892 61846 64581 68188 72545 77709 83926 91156 99127 108011 118427
54795 118427 130538 143725 157461 171751 186196 199329 209569 216356 219774 219624 215650 208329 198721
54782 198721 187763 176167 164625 153456 142408 131489 121703 114272 109304 105830 102992 100551 98422
54769 98422 96427 94618 93366 93050 93871 95815 98486 101228 103796 106718 110674 115792 121883 129036 137515
54754 137515 147381 158643 171476 185807 200963 216148 230863 244323 254921 260996 261945 258126
54742 258126 250014 238185 223774 208114 191930 175539 159641 145266 133013 122933 114973 108822
54730A08822n295n375n284m234k895k366k606k766k483k006j432p79m89r72j753
54715F8087j916j298n83j99J56P90J373J329N93k17l79K06Q31P56O8m66m40k42
54697F8449l45o20o68l96KM01P39Q96P84M66N3l24m80l80l19n50p64m55K57P60
54677F7506Q68J010J413J775J928K075K131J581M65k46K80J714L037L641L546
54662I2724L035K487K299K487K611K363J900J520J318J336J563J715J522J359
54648A20239J931L165M102M238M143M400M680M500M112L928L527K163o4k251l781
54633A59032m765n490o031o349o444o291n909n375m767m208l967m137m203l469
54619H7627j983n74K11N95Q74R48Q38R03J136R47J65m19j25O08R84J010J095J058
$$ plain form
54730 108822 103527 98152 92868 88634 85739 83373 80767 78001 75518 73512 72080 71301 70812 69840 68087
54715 68087 66171 64873 64290 64091 64247 65037 66410 67739 68332 68115 67736 67942 68773 69529 69597 69131 68691 68449
54697 68449 68104 67484 66816 66420 66422 66823 67562 68458 69242 69708 69761 69437 68957 68577 68258 67708 66944 66489 66746 67506
54677 67506 68374 69384 70797 72572 74500 76575 78706 80287 80752 80506 80786 82500 85537 89178 92724
54662 92724 95759 98246 100545 103032 105643 108006 109906 111426 112744 114080 115643 117358 118880 120239
54648 120239 122170 125335 129437 133675 137818 142218 146898 151398 155510 159438 162965 165128 165064 162813 159032
54633 159032 154267 148777 142746 136397 129953 123662 117753 112378 107611 103403 99436 95299 91096 87627
54619 87627 85644 85070 85281 85876 86750 87698 88536 89439 90575 91522 91687 91268 91143 91751 92735 93745 94840 95898
54601I5898M03o15j216j236j227j450j514j239j152j780k880l671l646k968k196
54586F9511j714j404r03j15O47J013Q76L57k89p40q80j008j444j962k032j643
54570E8270j336j289r77l0J051J456J009K83k6L07Q71J010O15L10N30P41K66m96
54552F2565n57Q8N55O69J139J948K013R90O2R0L11j33n18K46J660K325K037J862
54534G7352K319K821K847K624K475K318J904J022l83j850k516k185j833k369l327
54519H1219l543k782j813j155p40n30o05o57l81k47r38k077k375j283L19J226
54503F3638J080K70o75j272j200n61K06P61J068J231J360J504J538J304R74R43
54487G2169J138R77L37p3K22O41L89l91j007j182r53k21P86J168N01k63n0O44
$$ plain form
54601 95898 96301 95686 94470 93234 92007 90557 89043 87804 86652 84872 81992 78321 74675 71707 69511
54586 69511 67797 66393 65490 65375 66022 67035 67911 68268 67979 67239 66359 65351 63907 61945 59913 58270
54570 58270 56934 55645 54668 54638 55689 57145 58154 58437 58411 58718 59589 60599 61214 61524 62054 62795 63061 62565
54552 62565 62008 62096 62651 63320 64459 66407 68420 69410 69472 69562 69873 69740 69222 69468 71128 73453 75490 77352
54534 77352 79671 82492 85339 87963 90438 92756 94660 95682 95299 93449 90933 88748 86915 84546 81219
54519 81219 77676 74894 73081 71926 71186 70656 70051 69394 69013 68766 67828 65751 63376 62093 62412 63638
54503 63638 64718 64988 64313 63041 61841 61280 61486 62247 63315 64546 65906 67410 68948 70252 71226 72169
54487 72169 73307 74284 74621 74548 74770 75411 75800 75409 74402 73220 72267 72046 72832 74000 74501 74238 74188 74832
54469G4832N54l11p84m99k37l09o8O61J041O01M5Q6M74O52N37J81m49r19m84O53
54449G6257J141K21j130j563j082o19m41n0O37R57M72m12r63q98n11k69l10l63
54431G1074k01o6k88o01l38N28J102O85k73p58m44J29L62K25O9J78N52R71J217
54412G4123J251J154R60O97N12N26O58Q19J149J744K243K172J717J617K158K729
54396I6229K665K113J726J788K022K062J767J188N51K48N00R92R99J05j312k354
54380A11289k449j837j244j191j609k038j996j370o56o48j521k385k230j249n70
54365H8296o89r11o00j33r9k86j58J76L08L50O56R90Q19K79K8K38M60M65N01P34
54345I1424J081J617K511L514M065M045L835L648L268K556J716J030O33N29L85
$$ plain form
54469 74832 75386 75075 74291 73792 73555 73246 73178 73839 74880 75481 75526 75612 76086 76738 77275 77456 77007 76088 75604 76257
54449 76257 77398 77619 76489 74926 73844 73225 72784 72734 73371 74328 74800 74388 73425 72527 72016 71747 71437 71074
54431 71074 70873 70807 70519 69918 69580 70108 71210 71895 71622 70864 70420 70549 70911 71136 71205 71383 71935 72906 74123
54412 74123 75374 76528 77488 78185 78697 79223 79881 80700 81849 83593 85836 88008 89725 91342 93500 96229
54396 96229 98894 101007 102733 104521 106543 108605 110372 111560 112111 112359 112859 113851 114850 114955 113643 111289
54380 111289 108840 107003 105759 104568 102959 100921 98925 97555 96899 96251 94730 92345 90115 88866 88296
54365 88296 87607 86696 86096 85963 85864 85578 85420 85596 85904 86254 86910 87900 88719 88998 89026 89264 89724 90189 90690 91424
54345 91424 92505 94122 96633 100147 104212 108257 112092 115740 119008 121564 123280 124310 124943 125472 125857
54330A25857l70j805l055l212k453j626j069o48o62j625l181m229m291l941l634
54315I0056l161k496k212k579l044l068k825k603k216j523q97o66o16m95n21q26
54299F0308r37m04L99P39M23j81p83j262j401j046n14k94l79k93J33L81j49j310
54281E3430k185j966p42O74J585J828J465N49n35j046o43J08M38L09J98L07N59
54264E4333J011J584J701J011K15K63Q93R26K9q34q53l61q1j75m08m90r6Q38J654
54245F1160J545O74n1l69q43j497j477m99M61N70K43J48L7n67j258j258n73K34
54227E6680R25J570J941J754J139M50j55n63o17n98j097j946k031r50M9k65j183
54210E5103j083Q8Q18L95j37J99Q17O40j93n87j18N04N56K13M1M0k50q33j027
$$ plain form
54330 125857 125487 123682 120627 117415 114962 113336 112267 111619 110957 109332 106151 101922 97631 93690 90056
54315 90056 86895 84399 82187 79608 76564 73496 70671 68068 65852 64329 63432 62766 62150 61655 61134 60308
54299 60308 59371 58967 59366 60105 60528 60347 59564 58302 56901 55855 55341 55047 54668 54375 54508 54889 54740 53430
54281 53430 51245 49279 48537 49211 50796 52624 54089 54638 54103 53057 52414 52522 52960 53269 53467 53774 54333
54264 54333 55344 56928 58629 59640 59855 60118 61011 61937 61966 61132 60279 59918 59837 59662 59254 58764 58668 59506 61160
54245 61160 62705 63379 63328 62959 62116 60619 59142 58643 59104 59674 59917 60065 60102 59535 58277 57019 56446 56680
54227 56680 57605 59175 61116 62870 64009 64459 64304 63741 63124 62526 61429 59483 57452 56502 56551 56286 55103
54210 55103 54020 54108 54926 55321 55184 55383 56200 56840 56647 56060 55942 56446 57002 57215 57256 57296 57046 56213 55186
54191E5186m52L40O47N83O10N00k92j395j707j017l28l06l43K51J069J307R13
54174E5566L33k63q32j078q34l94J8N43J038R06J21m17k60k02q39j303n96O53
54156E2160J091P10N35P28N72J14K22Q76R86J99n24m99k45l16m07k32j91m45l14
54137E5020N71J360J089Q9n75o11n54o51n83k03J78L20L75M84M95J71m59j005
54119E5511r93l38M13N48L0m01j70M36O82L34j37k27P4L84M19L01L60O28O38m4
54099E8448j104j621j080J5P11O35K35N4J59K57J73k6k76o32j003j067o30k8J47
54080E3367k02n62m39J12O50Q09M90r6m43j36O06J068R40O88P51Q04L03n80j030
54061E7100n47N74J650K151J942J337P96M75J99oK18Q70J283J035O95J034J853
$$ plain form
54191 55186 54734 55074 55721 56304 56914 57414 57122 55727 54020 53003 52675 52369 52026 52277 53346 54653 55566
54174 55566 55899 55636 54804 53726 52892 52498 52516 53059 54097 55003 55124 54707 54447 54245 53406 52103 51507 52160
54156 52160 53251 53961 54496 55224 55796 55910 56132 57008 57994 58193 57669 57170 56925 56609 56202 55970 55779 55334 55020
54137 55020 55591 56951 58040 58129 57554 56943 56389 55738 55155 54952 55130 55450 55825 56309 56804 56975 56516 55511
54119 55511 54518 54180 54593 55141 55171 54770 54600 55036 55718 56052 55915 55688 55762 56146 56565 56866 57226 57854 58492 58448
54099 58448 57344 55723 54643 54658 55369 56004 56239 56293 56452 56709 56882 56856 56580 55948 54945 53878 53248 53220 53367
54080 53367 53165 52603 52164 52276 52926 53735 54225 54129 53686 53550 54156 55224 56164 56852 57603 58407 58710 58130 57100
54061 57100 56553 57127 58777 60928 62870 64207 65003 65478 65677 65671 65889 66759 68042 69077 69772 70806 72659
54044G2659K318K174J898J792J810K087K769L282K794J638J285K470M181N034
54030A08191M929M721M805M874M722M485M213L846L570L675L994L974L345K426
54016A65770J652J120P26M46L03J94r3o87j497k214k487k239j862j907k465k970
54000A51790k855k340k226k822l499l568l256l198l227k529j075j0j30p55q50
53985A19450n47p13j335j548j105p08o77m64J12K34n80j404j131j95R6l80m25
53968A08680N52J575J618J039Q46J186J395J197Q86M89l40j400j794j160l57l69
53952A14043r90j220o16M05J403K244K753K694K334K280K696L198L709M651N998
53937A45582O915O778N994N179M131K383L32j098j700k080k523k591k019j276
$$ plain form
54044 72659 74977 77151 79049 80841 82651 84738 87507 90789 93583 95221 96506 98976 103157 108191
54030 108191 113120 117841 122646 127520 132242 136727 140940 144786 148356 152031 156025 159999 163344 165770
54016 165770 167422 168542 169268 169714 170017 170211 170118 169431 167934 165720 163233 160994 159132 157225 154760 151790
54000 151790 148935 146595 144369 141547 138048 134480 131224 128026 124799 122270 121195 121185 121055 120300 119450
53985 119450 118903 118190 116855 115307 114202 113494 112817 112353 112465 112699 112119 110715 109584 109389 109485 109105 108680
53968 108680 109232 110807 112425 113464 114310 115496 116891 118088 118974 119463 119123 117723 115929 114769 114412 114043
53952 114043 113053 111833 111217 111622 113025 115269 118022 120716 123050 125330 128026 131224 134933 139584 145582
53937 145582 152497 159275 165269 170448 174579 176962 177294 176196 174496 172416 169893 167302 165283 164007
53923A64007r40r68r81q24n11J17J268K810M251N160N456N342N065M785M608M656
53907B03301M961N358N602N577N306M761L977L221K726K244J320L7r58j385j738
53892B44310k439l168l426l361l457l780m079m353m775n170n234n083n105n391
53878A85489n740o044o197n826m763l629l270l608l711l103k345k148k450k640
53864A30015k345j767j439j726k373k668k316j885k013k400k234j432p55o63q28
53849A03171r17j077j382j440j006m85l86o57r13r82q58m92J3K70O5k18K1Q28
53831I3555J641J893J503Q23K77P8J77M27P28J004J074P65R7p02j301j363p48
53814I9928J96Q16Q63Q44J292J958K186J908J738K089K684L016K894K489K205
$$ plain form
53923 164007 163067 162099 161118 160294 159783 159900 161168 163978 168229 173389 178845 184187 189252 194037 198645 203301
53907 203301 208262 213620 219222 224799 230105 234866 238843 242064 244790 247034 248354 248391 247433 246048 244310
53892 244310 241871 238703 235277 231916 228459 224679 220600 216247 211472 206302 201068 195985 190880 185489
53878 185489 179749 173705 167508 161682 156919 153290 150020 146412 142701 139598 137253 135105 132655 130015
53864 130015 127670 125903 124464 122738 120365 117697 115381 113496 111483 109083 106849 105417 104662 103999 103171
53849 103171 102254 101177 99795 98355 97349 96864 96478 95821 94908 93926 93068 92576 92589 92859 92924 92706 92727 93555
53831 93555 95196 97089 98592 99415 99692 99770 99947 100374 101102 102106 103180 103945 104042 103340 102039 100676 99928
53814 99928 100124 100940 101803 102647 103939 105897 108083 109991 111729 113818 116502 119518 122412 124901 127106
53799A27106K480L303L999L970L556L599M176M458L984L330L191L393L358L072
53785A76975L027L453M050M385M163L217J656j9j210j706j754j666j536j326j122
53770A90587j138j468j923k233k412k704l125l356l217k984k964l008k754k168
53756A55133j512r04k79K89N34K41n90j668k409k330j677j225j218j023k80K62
53740A41344k58j451k195k140j814j535j169q56r65j305j237o51l7M18R14J294
53724A28357J158Q04J005J696J924J370Q22Q01P92L70RJ65N18Q01J419K531L328
53707A47870L164K659K714L120L119K795K785K967K666K000J927K812L845M207
53693A88650M059M037M361M770N041N144N071M703L914K773J600Q20O86J152J971
$$ plain form
53799 127106 129586 132889 136888 140858 144414 148013 152189 156647 160631 163961 167152 170545 173903 176975
53785 176975 180002 183455 187505 191890 196053 199270 200926 200907 199697 197991 196237 194571 193035 191709 190587
53770 190587 189449 187981 186058 183825 181413 178709 175584 172228 169011 166027 163063 160055 157301 155133
53756 155133 153621 152717 152438 152727 153261 153502 152912 151244 148835 146505 144828 143603 142385 141362 141082 141344
53740 141344 141086 139635 137440 135300 133486 131951 130782 129926 128961 127656 126419 125768 125731 126149 127063 128357
53724 128357 129515 130319 131324 133020 134944 136314 137136 137937 138729 139099 139108 139273 139791 140592 142011 144542 147870
53707 147870 151034 153693 156407 159527 162646 165441 168226 171193 173859 175859 177786 180598 184443 188650
53693 188650 192709 196746 201107 205877 210918 216062 221133 225836 229750 232523 234123 234943 235629 236781 238752
53678B38752K816L372L508L269K650J647O81N12J264J961J800J356J646K305K066
53663B69605Q90K03O43J062M01p33j219j003o17p0O60R39L48l84m07l3L5P2O43
53644B71035J115L61j284k198j707q10n18o26n04j54K9r0l70n99n53k67k27p55
53626B61878j330j088L7J259K017K363K431K244K086K296K598K395J861J966L148
53611B86161M654N532N654N385M897M321M112M673N780O789P313P451P422P263
53597C67407O854O219N671N579N874O042N789N455N538O047O711P395P940P820
53583D56341O693N140M222M273M718M927M714L990K775J659J486K230K791K325
53569E08284J237M95M09N69O14N20K71j87o83q43n77l10o27j655k898l658l610
$$ plain form
53678 238752 241568 244940 248448 251717 254367 256014 256695 257207 258471 260432 262232 263588 265234 267539 269605
53663 269605 270495 270698 271341 272403 272804 272071 270852 269849 269232 269162 269822 270761 271109 270725 270318 270285 270320 270392 271035
53644 271035 272150 272511 271227 269029 267322 266512 265994 265368 264864 264710 264739 264649 264279 263680 263127 262860 262633 261878
53626 261878 260548 259460 259497 260756 262773 265136 267567 269811 271897 274193 276791 279186 281047 283013 286161
53611 286161 290815 296347 302001 307386 312283 316604 320716 325389 331169 337958 345271 352722 360144 367407
53597 367407 374261 380480 386151 391730 397604 403646 409435 414890 420428 426475 433186 440581 448521 456341
53583 456341 463034 468174 472396 476669 481387 486314 491028 495018 497793 499452 500938 503168 505959 508284
53569 508284 509521 510016 510425 510994 511608 512128 512399 512212 511529 510686 510109 509799 509172 507517 504619 500961 497351
53552D97351k931k047j389j271j652k044j949j448j033q50n91k25j40l13j12N87
53536D79943Q87J92n83j66J174K057K077K293L458M913N597N359M863M781N378
53521E22223O398P132P127O959P662R333J0943J1739J2073J2610J3440J4393J5483
53508F57515J6575J7212J7329J7656J8828K0521K1924K2719K3171K3549K4021
53497H81020K4826K6070K7523K8911L0229L1461L2378L2902L3308L3686L3553
53486A215867L2567L1293L0652L0868L1465L2186L3246L4648L5881L6460L6426
53475A581559L6177L6050L6110L6040L5234L3349L0808K8446K6647K5095K3419
53464A928934K1645J9874J8000J6112J4819J4674J5380J5974J5864J5223J4336
$$ plain form
53552 497351 494420 492373 490984 489713 488061 486017 484068 482620 481587 480737 480146 479921 479781 479468 479356 479943
53536 479943 480830 481022 480439 480273 481447 483504 485581 487874 491332 496245 501842 507201 512064 516845 522223
53521 522223 528621 535753 542880 549839 557501 566834 577777 589516 601589 614199 627639 642032 657515
53508 657515 674090 691302 708631 726287 745115 765636 787560 810279 833450 856999 881020
53497 881020 905846 931916 959439 988350 1018579 1050040 1082418 1115320 1148628 1182314 1215867
53486 1215867 1248434 1279727 1310379 1341247 1372712 1404898 1438144 1472792 1508673 1545133 1581559
53475 1581559 1617736 1653786 1689896 1725936 1761170 1794519 1825327 1853773 1880420 1905515 1928934
53464 1928934 1950579 1970453 1988453 2004565 2019384 2034058 2049438 2065412 2081276 2096499 2110835
53453B110835J2875J0249O443K149j944n669r091j2076j4423j6342j8432k1018
53441B043556k3721k5839k7167k8211k9525l1043l2317l3323l4609l6477l8348
53430A702976l9265l8872l7580l5961l4358l2949l1747l0504k9024k7562k6458
53419A338696k5436k3806k1433j8923j6674j4357j1562q377n083j820J170L628
53407A196023N942Q979J2736J5955J7815J9235K1566K4602K7077K8701L0407L2652
53395A441690L4762L6265L7714L9741M2189M4688M7298N0086N2639N4688N6744
53384A938504N9528O2983O6328O9009P1274P3817P7057Q0628Q3612Q5352Q6085
53373B754177Q6503Q6797Q6510Q5441Q4205Q3579Q3464Q2724Q0065P5107O8724
$$ plain form
53453 2110835 2123710 2133959 2140402 2142551 2140607 2134938 2125847 2113771 2099348 2083006 2064574 2043556
53441 2043556 2019835 1993996 1966829 1938618 1909093 1878050 1845733 1812410 1777801 1741324 1702976
53430 1702976 1663711 1624839 1587259 1551298 1516940 1483991 1452244 1421740 1392716 1365154 1338696
53419 1338696 1313260 1289454 1268021 1249098 1232424 1218067 1206505 1198128 1193045 1191225 1192395 1196023
53407 1196023 1201965 1210944 1223680 1239635 1257450 1276685 1298251 1322853 1349930 1378631 1409038 1441690
53395 1441690 1476452 1512717 1550431 1590172 1632361 1677049 1724347 1774433 1827072 1881760 1938504
53384 1938504 1998032 2061015 2127343 2196352 2267626 2341443 2418500 2499128 2582740 2668092 2754177
53373 2754177 2840680 2927477 3013987 3099428 3183633 3267212 3350676 3433400 3513465 3588572 3657296
53362C657296O2376N7002N2584M8669M5004M1551L8265L5202L2416K9427K5173
53351D124965J9126J2149N588l92o878j4871k4524l5578m7688o0106p1666q1311
53339C818814q8293r2013r2417r0633q8476q6979q5905q4770q3626q2710q1952
53328B861040q1325q1088q1297q1403q0772p9281p7179p4619p1562o8025o4247
53317B020242o0604n7234n3654m9191m4105l9757l7051l5102l2438k9073k6296
53306A555737k4478k2424j9159j5237j1784r234p540o624n987m664k307K38J930
53293A428467K652K917L179L907N570P920R944J1199J2624J5309J8986K2508K5365
53280A570547K7982L0784L3711L6417L8407L9226L9045L8780L9070L9512L9344
$$ plain form
53362 3657296 3719672 3776674 3829258 3877927 3922931 3964482 4002747 4037949 4070365 4099792 4124965
53351 4124965 4144091 4156240 4161828 4161436 4154558 4139687 4115163 4079585 4031897 3971791 3900125 3818814
53339 3818814 3730521 3638508 3546091 3455458 3366982 3280003 3194098 3109328 3025702 2942992 2861040
53328 2861040 2779715 2698627 2617330 2535927 2455155 2375874 2298695 2224076 2152514 2084489 2020242
53317 2020242 1959638 1902404 1848750 1799559 1755454 1715697 1678646 1643544 1611106 1582033 1555737
53306 1555737 1531259 1508835 1489676 1474439 1462655 1453421 1445881 1439257 1433270 1428606 1426299 1426537 1428467
53293 1428467 1431119 1434036 1437215 1441122 1446692 1454612 1464556 1475755 1488379 1503688 1522674 1545182 1570547
53280 1570547 1598529 1629313 1663024 1699441 1737848 1777074 1816119 1854899 1893969 1933481 1972825
53269A972825L8560L7709L7025L6268L5208L3658L1401K8661K6330K5081K4554
53258B327280K3957K3068K1918J9958J6545J2081P700L776m13n374j0658j5668
53246B424170k0484k5438l0400l5018l9285m3407m7243n0241n1986n2664n2876
53235A975128n3052n3007n2214n0529m8489m6797m5606m4490m3078m1583m0673
53224A455610m0824m1745m2568m2755m2680m2987m3532m3462m2235m0059l7323
53213I95440l4229l1124k8469k6264k4062k1848k0203j9340j8690j7900j7384
53202G35927j7438j7474j6935j6289j6245j6513j6236j5301j4312j3515j2637
53191E63032j1708j1170j1158j1371j1664j2076j2386j2314j2120j2322j2777
$$ plain form
53269 1972825 2011385 2049094 2086119 2122387 2157595 2191253 2222654 2251315 2277645 2302726 2327280
53258 2327280 2351237 2374305 2396223 2416181 2432726 2444807 2452507 2456283 2455870 2450496 2439838 2424170
53246 2424170 2403686 2378248 2347848 2312830 2273545 2230138 2182895 2132654 2080668 2028004 1975128
53235 1975128 1922076 1869069 1816855 1766326 1717837 1671040 1625434 1580944 1537866 1496283 1455610
53224 1455610 1414786 1373041 1330473 1287718 1245038 1202051 1158519 1115057 1072822 1032763 995440
53213 995440 961211 930087 901618 875354 851292 829444 809241 789901 771211 753311 735927
53202 735927 718489 701015 684080 667791 651546 635033 618797 603496 589184 575669 563032
53191 563032 551324 540154 528996 517625 505961 493885 481499 469185 457065 444743 431966
53180D31966j2728j1914j0917j0258r762r094q422q094q015p665o705n397m418
53167C18577m237m656n067n163n124n043m691m098l839m259m782m610l792l034
53153B56182k697k603k587k625k467j866j147q89j038r08k58L03J66m09o37j59
53137B36361O12R46N31k95r69j291j386j203n45L75R86J228J722K683L310K931
53121B45996K116J855K065J782O55o48j438j694j725j763j899j994j764j385j601
53106B38558k704l773l733k853k291k417k531k161j635j364j433j952k927l764
53092B03020l772l241l082l321l031j859o17l5l0m91j628k998l349k269j034r13
53076A71350j449j390o76l39p83j328j393j170r71p19l12J21M93Q74J129R00K44
$$ plain form
53180 431966 419238 407324 396407 386149 376387 367293 358871 350777 342762 335097 328392 322995 318577
53167 318577 314340 309684 304617 299454 294330 289287 284596 280498 276659 272400 267618 263008 259216 256182
53153 256182 253485 250882 248295 245670 243203 241337 240190 239301 238263 237355 237097 237400 237566 237157 236520 236361
53137 236361 236973 237919 238450 238155 237186 235895 234509 233306 232761 233136 234122 235350 237072 239755 243065 245996
53121 245996 248112 249967 252032 253814 254469 253821 252383 250689 248964 247201 245302 243308 241544 240159 238558
53106 238558 235854 232081 228348 225495 223204 220787 218256 216095 214460 213096 211663 209711 206784 203020
53092 203020 199248 196007 192925 189604 186573 184714 184097 184062 184032 183541 181913 178915 175566 173297 172263 171350
53076 171350 169901 168511 167835 167496 166713 165385 163992 162822 161851 161132 160820 160941 161434 162308 163437 164337 164581
53059A64581j81J26P52Q29K05l43j84L30M41J22r7j37m78j060j072k96K54k36
53041A63556j051j019l14j7k79l24r0m41j518k273k093j702j780j878j421q86
53025A46470j029j700k240k473k476j921o63N14O92J43r5K10K30n29j488j821
53009A31824j398n99K38R03J221J226J168J170J055O89K80J23K03K57K01J80K45
52992A38986J24l78r23q70J4J295K369K957K966K376J482R64J233J974K649L159
52976A60377L589L679L172K381J789J332P39K86L80N91Q9r57j450r45j57K78M90
52959A75663N16j08j354k270k257j949k110k399k093j346q84q15o76l47j62k86
52943A57123o22j075j492j530j141q29r53j093p17n3K54R4j10q5J85P26J376J608
$$ plain form
53059 164581 164400 164526 165278 166107 166312 165969 165785 166115 166556 166678 166581 166444 165966 164906 163834 163538 163792 163556
53041 163556 162505 161486 161172 161155 160876 160552 160462 160021 158503 156230 154137 152435 150655 148777 147356 146470
53025 146470 145441 143741 141501 139028 136552 134631 133968 134482 135174 135317 135222 135432 135662 135133 133645 131824
53009 131824 130426 129827 130065 130968 132189 133415 134583 135753 136808 137497 137777 137900 138103 138360 138561 138741 138986
52992 138986 139110 138732 137809 136939 136953 138248 140617 143574 146540 148916 150398 151362 152595 154569 157218 160377
52976 160377 163966 167645 170817 173198 174987 176319 177058 177344 177724 178315 178404 177447 175997 175052 174895 175173 175663
52959 175663 176179 176071 174717 172447 170190 168241 166131 163732 161639 160293 159409 158594 157918 157571 157409 157123
52943 157123 156501 155426 153934 152404 151263 150434 149481 148388 147671 147618 147872 147966 147856 147771 147956 148682 150058 151666
52925A51666J195P39R29J532J825J731J691J690J259M19k38n14p56j034r33m05
52909A60796l4j57l57j93J60L21K58J18k8L9O38J496J661O85m67m09Q85K027J976
52890A69415J227Q58J013R29K72l43l19J5n7n64q41n03J74Q47J477J893J601M87
52872A77581o44q11O1J135J636J512J188J074J308J684J836J583J126Q33Q96J286
52856A93284J798K064J830J409J524K414L366L556L030K446K020J359K99n84o09
52841B19206K23J245J767J503N58p48k001k791k910k558k240k288k495k399j948
52826B02124j591j732k270k792k971k725k216j779j611j529j282j058j245j715
52812A75608j826j359r40j169j811k166j913j278o11k24l14p49j123j276j468
$$ plain form
52925 151666 152861 153600 154529 156061 157886 159617 161308 162998 164257 164676 164438 163924 163168 162134 161201 160796
52909 160796 160762 160605 160248 160055 160215 160536 160794 160912 160884 160923 161561 163057 164718 165403 164936 164527 165412 167439 169415
52890 169415 170642 171500 172513 173442 173714 173371 173052 173067 173010 172446 171605 171102 171276 172123 173600 175493 177094 177581
52872 177581 176937 176126 176187 177322 178958 180470 181658 182732 184040 185724 187560 189143 190269 191102 191998 193284
52856 193284 195082 197146 198976 200385 201909 204323 207689 211245 214275 216721 218741 220100 220399 219815 219206
52841 219206 219429 220674 222441 223944 224502 223754 221753 218962 216052 213494 211254 208966 206471 204072 202124
52826 202124 200533 198801 196531 193739 190768 188043 185827 184048 182437 180908 179626 178568 177323 175608
52812 175608 173782 172423 171483 170314 168503 166337 164424 163146 162535 162311 161997 161248 160125 158849 157381
52797A57381j843k120k063j871j745j535j118p39n07r8N61P87N8r28r73l1O49
52780A43865J00j284k378k524j912j203r07r49p74r3O42P58J18q49j747k385k562
52763A25916k155j413q07n76o43q51j003q86n73n11r37j427j437j111j051j430
52747A09105j748j543q78k21p3n96j384j715j341p96o50q10r25j005j114q92n9
52730I3355Q58J088P49O83J171J563J264M95j11k45j11j76o72j188j054l65j29
52713I7175p63j102J39K331L478K689J013k17o53l95O15K038K923K721J928J216
52697A15136N17m91j581k226k310k102j813j525j266r49n43l69p87j468j621j149
52681I5453q98j398k028j987j463j166j152q62j61L69J81n74j228j193m42M61
$$ plain form
52797 157381 155538 153418 151355 149484 147739 146204 145086 144347 143840 143742 144303 145090 145148 144220 143247 143216 143865
52780 143865 143965 142681 140303 137779 135867 134664 133757 132808 132034 131941 132583 133341 133459 132610 130863 128478 125916
52763 125916 123761 122348 121541 120965 120322 119471 118468 117582 117009 116498 115561 114134 112697 111586 110535 109105
52747 109105 107357 105814 104936 104715 104642 104046 102662 100947 99606 98810 98160 97350 96425 95420 94306 93414 93355
52730 93355 94213 95301 96050 96733 97904 99467 100731 101226 101115 100870 100759 100583 99911 98723 97669 97304 97175
52713 97175 96412 95310 95449 97780 101258 103947 104960 104743 104090 103695 104310 106348 109271 111992 113920 115136
52697 115136 115653 115162 113581 111355 109045 106943 105130 103605 102339 101390 100847 100478 99691 98223 96602 95453
52681 95453 94555 93157 91129 89142 87679 86513 85361 84499 84338 84707 84888 84314 83086 81893 81451 81912
52665H1912Q77O95K83j08n14q54q61o03n53q27q83l26M35P18M59J77K65P03J172
52646H2167J236O50k46p67p17o12q82j223j122n46K35J109K016K695L033L282
52630I0308L535L341K361J054J28m08j050j811k161j913j538j481j651j710j522
52615H5482j161p08j79L94Q93J090Q15K68j49l27n12p45o96k50J60K28K58N53
52597H5414P82N52K11L82R41J245J123R09P02M25M92J456K884L514K819J598P53
52580A06202L27J49M93J423K198K091J425J004R40P99O24R26J649J991J408L45
52564A23994l49k91K53P08O81L03K06Q31J807K350K176J633R92K28m35m25L63
52547A35025J235J543J409J204Q23M6p03p67k39J24j6k43j69Q8L58P15R68N51
$$ plain form
52665 81912 82789 83484 83767 83659 83145 82291 81430 80827 80274 79447 78564 78238 78673 79391 79850 80027 80292 80995 82167
52646 82167 83403 84053 83807 83040 82323 81711 80829 79606 78484 77938 78173 79282 81298 83993 87026 90308
52630 90308 93843 97184 99545 100599 100727 100319 99269 97458 95297 93384 91846 90365 88714 87004 85482
52615 85482 84321 83613 83434 83828 84721 85811 86626 86894 86745 86418 85906 85161 84465 84215 84375 84603 84861 85414
52597 85414 86196 86748 86959 87341 88282 89527 90650 91559 92261 92686 93178 94634 97518 101032 103851 105449 106202
52580 106202 106529 106678 107171 108594 110792 112883 114308 115312 116252 117051 117675 118601 120250 122241 123649 123994
52564 123994 123645 123354 123607 124315 124996 125299 125505 126336 128143 130493 132669 134302 135294 135522 135087 134662 135025
52547 135025 136260 137803 139212 140416 141239 141285 140582 139815 139576 139700 139684 139441 139272 139360 139718 140433 141401 141952
52529A41952o76j952k399j979j236m25N19J344J495Q38n5n43m96j87J20K72K34
52512A36826J62L31P72J057O74l13j132j032j56N17K88m31o15J26J218J897J934
52495A42123J487P88K15K04O97J055Q03K38q2j00j08j00J21M41N34L93L36M75
52477A49520O32P60R83J245J346J288J236J129P72L05J69M68Q08Q75P92Q02Q22
52460A63952O12K08n5Q1M02K90o04j776k278j885j387j415j501r21J8L42j70p55
52442A53158q76p64p01n77m26o28j173j389q09J58Q51J139J179Q68J12o59p98
52425A48665k18M93P16L37k72o48o92o80p47m82N20J783K181J332J85p8N33J019
52407A53947P23k0m64k65L79J122J783K312K606K520K044J342N24l42r79r45k02
$$ plain form
52529 141952 141276 139324 136925 134946 133710 133285 133804 135148 136643 137481 137426 136883 136387 136200 136320 136592 136826
52512 136826 136988 137319 138091 139148 139822 139509 138377 137345 137189 137706 137994 137563 136948 137074 138292 140189 142123
52495 142123 143610 144398 144613 144817 145514 146569 147372 147610 147528 147428 147320 147220 147341 147782 148316 148709 149045 149520
52477 149520 150152 150912 151895 153140 154486 155774 157010 158139 158911 159216 159385 159853 160661 161536 162328 163130 163952
52460 163952 164564 164772 164717 164798 165200 165490 164886 163110 160832 158947 157560 156145 154644 153723 153741 154083 153913 153158
52442 153158 152282 151518 150817 150240 149814 149186 148013 146624 145815 145973 146824 147963 149142 150010 150122 149463 148665
52425 148665 148447 148940 149656 149993 149721 149073 148381 147701 146954 146472 146992 148775 150956 152288 152473 152395 152928 153947
52407 153947 154670 154650 154186 153921 154300 155422 157205 159517 162123 164643 166687 168029 168553 168211 167232 166287 166085
52390A66085P24J386J852K174J948J015J93M59J596K412K229J404M65l17n65P2
52374A83132J157J693J325P04M83O80J166J912K533K521K152K287K985L279K723
52359B10732K041J823J629J150J058J824K635K602K177K280K666K505K027K181
52345B39330K916L128K409J656J659K059K121J827J784K371L350M060L969L166
52331B75805K230J523R22M31M79J201J923K005J834K250L220L831L536K792K460
52316C06442L064M465N948O738O751O646O838P023O998P266Q169R031R041Q566
52302D02986Q659R605J0821J1910J2841J3345J3170J2908J3452J4618J5231J4817
52290E54363J4260J4496J5351J6026J6130J5923J5877J6223J6600J6301J5154
$$ plain form
52390 166085 166809 168195 170047 172221 174169 175184 175377 175836 177432 179844 182073 183477 183942 183625 183060 183132
52374 183132 184289 185982 187307 188011 188494 189174 190340 192252 194785 197306 199458 201745 204730 208009 210732
52359 210732 212773 214596 216225 217375 218433 220257 222892 225494 227671 229951 232617 235122 237149 239330
52345 239330 242246 245374 247783 249439 251098 253157 255278 257105 258889 261260 264610 268670 272639 275805
52331 275805 278035 279558 280480 280911 281390 282591 284514 286519 288353 290603 293823 297654 301190 303982 306442
52316 306442 309506 313971 319919 326657 333408 340054 346892 353915 360913 368179 376348 385379 394420 402986
52302 402986 411645 421250 432071 443981 456822 470167 483337 496245 509697 524315 539546 554363
52290 554363 568623 583119 598470 614496 630626 646549 662426 678649 695249 711550 726704
52279G26704J3917J3335J3176J2788J2208J1792J1217R881Q102O774N944M895
52267H50733L544K502J661K54j458k084j238m78j196k805l925m317m531m534l879
52252H28249k769j826j060m3J142J929K189K381K873L638M603N774P134Q628J0101
52237H72943J1146J1440J1409J1905J2959J3598J3332J3007J3449J4025J3561
52226A012774J2099J0677R755Q974Q200P677P157O033M468L340K850K150O89r62
52212A095881k150l170m530n927o617o547o397o712p447q204q490p980o936o190
52198A008584o258o614o309n183l953l171k648k067j572j414j395j121n47N9N34
52183I66925Q26P16J7r45j482j313q84p21p80p22n75p46j407k179k522k356k144
$$ plain form
52279 726704 740621 753956 767132 779920 792128 803920 815137 825018 833120 839894 845838 850733
52267 850733 854277 856779 858440 858694 857236 855152 853914 853436 852240 849435 845510 841193 836662 832128 828249
52252 828249 825480 823654 822594 822551 823693 825622 827811 830192 833065 836703 841306 847080 854214 862842 872943
52237 872943 884089 895529 906938 918843 931802 945400 958732 971739 985188 999213 1012774
52226 1012774 1024873 1035550 1045305 1054279 1062479 1070156 1077313 1083346 1087814 1091154 1094004 1096154 1096843 1095881
52212 1095881 1093731 1090561 1086031 1080104 1073487 1066940 1060543 1053831 1046384 1038180 1029690 1021710 1014774 1008584
52198 1008584 1002326 995712 989403 984220 980267 977096 974448 972381 970809 969395 968000 966879 966332 966391 966925
52183 966925 967751 968467 968484 967539 966057 964744 963860 963139 962359 961637 961062 960316 958909 956730 954208 951852 949708
52166I49708k379l014l503l470l170l107l364l644l820m046m214l907l095k420
52152I02555k405k756k861k650k552k805l223l542l603l439l372l793m537m906
52138H56111m701m711n579o640o811o257o092o465o236m884l621l782m901n340
52124G80091m489l406l288m033m613m396l688l085k674k085j187l26K08O24J271
52109G44924K122K929L651M369M966N375N956P043Q303R086R472J0281J1952J3979
52095H44408J5671J6841J7569J7868J7952J8429J9664K1213K2208K2232K1599
52084A055654K0861K0261J9584J8483J6956J5426J4250J3345J2442J1462J0320
52073A229044Q666O338L784J604j70j731k827l132l151l780n003n949o306o723
$$ plain form
52166 949708 947329 944315 940812 937342 934172 931065 927701 924057 920237 916191 911977 908070 904975 902555
52152 902555 900150 897394 894533 891883 889331 886526 883303 879761 876158 872719 869347 865554 861017 856111
52138 856111 851410 846699 841120 834480 827669 821412 815320 808855 802619 797735 794114 790332 785431 780091
52124 780091 775602 772196 768908 764875 760262 755866 752178 749093 746419 744334 743147 742821 743029 743653 744924
52109 744924 747046 749975 753626 757995 762961 768336 774292 781335 789638 798724 808196 818477 830429 844408
52095 844408 860079 876920 894489 912357 930309 948738 968402 989615 1011823 1034055 1055654
52084 1055654 1076515 1096776 1116360 1134843 1151799 1167225 1181475 1194820 1207262 1218724 1229044
52073 1229044 1237710 1244048 1247832 1249436 1249266 1247535 1244708 1241576 1238425 1234645 1229642 1223693 1217387 1210664
52059A210664p564q236q182p668p128o469n573m787m319l771k781j589n23N21
52045A142595J568K229K439K850L814M617M591M371N094O632P699P623P072O895
52031A210089P027O858O206N510N190N064M466L139J739J105J021L80j286l151
52017A253357m370n242o506q164r673j0840j1692j2018j1841j1955j3027j4456
$$ plain form
52059 1210664 1203100 1194864 1186682 1179014 1171886 1165417 1159844 1155057 1150738 1146967 1144186 1142597 1142074 1142595
52045 1142595 1144163 1146392 1148831 1151681 1155495 1160112 1164703 1169074 1174168 1180800 1188499 1196122 1203194 1210089
52031 1210089 1217116 1223974 1230180 1235690 1240880 1245944 1250410 1253549 1255288 1256393 1257414 1257794 1256508 1253357
52017 1253357 1248987 1243745 1237239 1229075 1219402 1208562 1196870 1184852 1173011 1161056 1148029 1133573
$$ [...]
##END NTUPLES=NMR SPECTRUM
##END=
