
##TITLE=AC1206_HPAAH12049_5973603_ulgv45x8Rn
##JCAMPDX= 6.0         $$ Bruker NMR JCAMP-DX V2.0
##DATA TYPE= NMR SPECTRUM
##DATA CLASS= NTUPLES
##ORIGIN= BRUKER
##OWNER= Administrator
$$ 1.72 TOPSPIN		Version 2.1
$$ 2012-04-14 19:54:42.984 -0500  Administrator@TOPSPIN
$$ Compression mode = diff/dup
##.OBSERVE FREQUENCY= 400.13188235
##.OBSERVE NUCLEUS= ^1H
##.ACQUISITION MODE= SIMULTANEOUS (DQD)
##.ACQUISITION SCHEME= undefined
##.AVERAGES= 8
##.DIGITISER RES= 22
##SPECTROMETER/DATA SYSTEM= spect
##.PULSE SEQUENCE= zg30
##.SOLVENT NAME= COFFEE_meoh
##.SHIFT REFERENCE= INTERNAL, COFFEE_meoh, 1, 14.98061
##AUDIT TRAIL= $$ (NUMBER, WHEN, WHO, WHERE, PROCESS, VERSION, WHAT)
$$ ##TITLE= Audit trail, TOPSPIN		Version 2.1
$$ ##JCAMPDX= 5.01
$$ ##ORIGIN= Bruker BioSpin GmbH
$$ ##OWNER= Administrator
$$ $$ C:\Bruker\TOPSPIN/data/COFFEE/nmr/AC1206_HPAAH12049_5973603_ulgv45x8Rn/10/pdata/1/auditp.txt
$$ ##AUDIT TRAIL=  $$ (NUMBER, WHEN, WHO, WHERE, PROCESS, VERSION, WHAT)
(   1,<2012-04-14 19:54:32.796 -0500>,<Administrator>,<TOPSPIN>,<go>,<TOPSPIN 2.1>,
      <created by zg
	started at 2012-04-14 19:53:24.671 -0500,
	POWCHK enabled, PULCHK disabled,
       configuration hash MD5:
       1A 1E CE 29 27 FD 77 03 67 4E F0 E3 C4 B2 CB 90
       data hash MD5: 64K
       50 71 63 B5 42 70 DF 40 C8 AA 8F 6E 71 11 DD 8E>)
(   2,<2012-04-14 19:54:36.218 -0500>,<Administrator>,<TOPSPIN>,<proc1d>,<TOPSPIN 2.1>,
      <Start of raw data processing
       efp LB = 0 FT_mod = 6 PKNL = 1 PHC0 = 0 PHC1 = 0 SI = 32K 
       data hash MD5: 32K
       DD 88 7A F7 A8 C9 6C 5F D7 B6 BD 0F 38 8A 27 5D>)
(   3,<2012-04-14 19:54:36.890 -0500>,<Administrator>,<TOPSPIN>,<proc1d>,<TOPSPIN 2.1>,
      <pk PHC0 = 211.6516 PHC1 = 0 
       data hash MD5: 32K
       94 CB 6E D1 84 C7 53 B5 EB E0 79 77 C9 4F D4 CD>)
(   4,<2012-04-14 19:54:37.000 -0500>,<Administrator>,<TOPSPIN>,<proc1d>,<TOPSPIN 2.1>,
      <abs ABSG = 1 
       data hash MD5: 32K
       46 03 E6 37 35 74 ED 56 0C 6C 2F EF 79 2F 44 C5>)
(   5,<2012-04-14 19:54:37.046 -0500>,<Administrator>,<TOPSPIN>,<proc1d>,<TOPSPIN 2.1>,
      <abs ABSG = 2 
       data hash MD5: 32K
       28 19 9D FF DE 9B 4E 65 0B 7F BE E1 F0 EA D3 35>)
(   6,<2012-04-14 19:54:37.078 -0500>,<Administrator>,<TOPSPIN>,<proc1d>,<TOPSPIN 2.1>,
      <abs ABSG = 3 
       data hash MD5: 32K
       81 70 73 C0 B6 FA 6C AE 87 C7 10 28 CF 45 18 44>)
(   7,<2012-04-14 19:54:37.125 -0500>,<Administrator>,<TOPSPIN>,<proc1d>,<TOPSPIN 2.1>,
      <abs ABSG = 4 
       data hash MD5: 32K
       E7 82 69 6A E2 99 BB F8 C4 ED F3 3A A1 52 22 D1>)
(   8,<2012-04-14 19:54:37.171 -0500>,<Administrator>,<TOPSPIN>,<proc1d>,<TOPSPIN 2.1>,
      <abs ABSG = 5 
       data hash MD5: 32K
       10 97 05 C0 74 AD BB 66 E6 98 AB 43 B8 CE 27 78>)
$$ ##END=
$$ 
$$ $$ hash MD5
$$ $$ AF A6 BE 4D F6 F1 EF F3 04 8E 8D 1F AE D3 0D AA
##$RELAX= 
##$RELAX= 
##$RELAX= 
##$RELAX= 
##$RELAX= 
##$RELAX= 
##$RELAX= 
$$ Bruker specific parameters
$$ --------------------------
$$ [...]
##$TP= (0..7)
150 150 150 150 150 150 150 150
##$TP07= 0
##$TPNAME0= <>
##$TPNAME1= <>
##$TPNAME2= <>
##$TPNAME3= <>
##$TPNAME4= <>
##$TPNAME5= <>
##$TPNAME6= <>
##$TPNAME7= <>
##$TPOAL= (0..7)
0.5 0.5 0.5 0.5 0.5 0.5 0.5 0.5
##$TPOFFS= (0..7)
0 0 0 0 0 0 0 0
##$TUNHIN= 0
##$TUNHOUT= 0
##$TUNXOUT= 0
##$USERA1= <user>
##$USERA2= <user>
##$USERA3= <user>
##$USERA4= <user>
##$USERA5= <user>
##$V9= 5
##$VALIST= <valist>
##$VCLIST= <CCCCCCCCCCCCCCC>
##$VD= 0
##$VDLIST= <DDDDDDDDDDDDDDD>
##$VPLIST= <PPPPPPPPPPPPPPP>
##$VTLIST= <TTTTTTTTTTTTTTT>
##$WBST= 1024
##$WBSW= 4
##$XGAIN= (0..3)
0 0 0 0
##$XL= 0
##$YL= 0
##$YMAX_a= 473184
##$YMIN_a= -578014
##$ZGOPTNS= <>
##$ZL1= 120
##$ZL2= 120
##$ZL3= 120
##$ZL4= 120
##$ABSF1= 14.98061
##$ABSF2= -5.57192
##$ABSG= 5
##$ABSL= 3
##$ALPHA= 0
##$AQORDER= 0
##$ASSFAC= 0
##$ASSFACI= 0
##$ASSFACX= 0
##$ASSWID= 0
##$AUNMP= <proc_prof1d_extract_pilot.lims>
##$AXLEFT= 0
##$AXNAME= <>
##$AXNUC= <1H>
##$AXRIGHT= 0
##$AXTYPE= 0
##$AXUNIT= <>
##$AZFE= 0.1
##$AZFW= 0.1
##$BCFW= 0
##$BC_mod= 0
##$BYTORDP= 0
##$COROFFS= 0
##$CY= 15
##$DATMOD= 1
##$DC= 0
##$DFILT= <>
##$DTYPP= 0
##$F1P= 0
##$F2P= 0
##$FCOR= 0.5
##$FTSIZE= 32768
##$FT_mod= 6
##$GAMMA= 0
##$GB= 0
##$INTBC= 1
##$INTSCL= 1
##$ISEN= 128
##$LB= 0
##$LEV0= 0
##$LPBIN= 0
##$MAXI= 10000
##$MC2= 0
##$MEAN= 0
##$ME_mod= 0
##$MI= 0
##$NCOEF= 0
##$NC_proc= -8
##$NLEV= 6
##$NOISF1= 0
##$NOISF2= 0
##$NSP= 0
##$NTH_PI= 0
##$NZP= 0
##$OFFSET= 14.98061
##$PC= 1
##$PHC0= 211.6516
##$PHC1= 0
##$PH_mod= 1
##$PKNL= yes
##$PPARMOD= 0
##$PPDIAG= 0
##$PPIPTYP= 0
##$PPMPNUM= 2147483647
##$PPRESOL= 1
##$PSCAL= 4
##$PSIGN= 0
##$PYNMP= <proc.py>
##$REVERSE= no
##$SF= 400.13
##$SI= 32768
##$SIGF1= 0
##$SIGF2= 0
##$SINO= 400
##$SIOLD= 32768
##$SPECTYP= <>
##$SREGLST= <1H.CDCl3>
##$SSB= 0
##$STSI= 32768
##$STSR= 0
##$SW_p= 8223.68421052632
##$SYMM= 0
##$S_DEV= 0
##$TDeff= 65536
##$TDoff= 0
##$TI= <>
##$TILT= no
##$TM1= 0
##$TM2= 0
##$TOPLEV= 0
##$USERP1= <user>
##$USERP2= <user>
##$USERP3= <user>
##$USERP4= <user>
##$USERP5= <user>
##$WDW= 1
##$XDIM= 32768
##$YMAX_p= 442759684
##$YMIN_p= -710616
##$CURPLOT= <Network HP LaserJet P1505>
##$CURPRIN= <$Network HP LaserJet P1505>
##$DFORMAT= <normdp>
##$LAYOUT= <+/1D_H.xwp>
##$LFORMAT= <normlp>
##$PFORMAT= <normpl>
##$SURQMSG= 1
$$ End of Bruker specific parameters
$$ ---------------------------------
##NTUPLES= NMR SPECTRUM
##VAR_NAME=  FREQUENCY,     SPECTRUM/REAL,   SPECTRUM/IMAG
##SYMBOL=    X,             R,               I
##VAR_TYPE=  INDEPENDENT,   DEPENDENT,       DEPENDENT
##VAR_FORM=  AFFN,          ASDF,            ASDF
##VAR_DIM=   32768,         32768,           32768
##UNITS=     HZ,            ARBITRARY UNITS, ARBITRARY UNITS
##FACTOR=    0.250966925370066, 1,           1
##FIRST=     8223.43324360095, -200615,      205232
##LAST=      0,             -187779,         -108781
##MIN=       0,             -710616,         0
##MAX=       8223.43324360095, 442759684,    0
$$ Real data points
##PAGE= N=1
##DATA TABLE= (X++(R..R)), XYDATA
$$ [...]
19499c3826l49362l6867J34720C29747b79606J27054n5876m0815c9574I1251J34831
19488B26082d03855a81276p403B24452a61187l0537N9029k322C7136M6390e5773
19476C4994h1873l84477K22141c1277k12547a09800j1533k19246A33772b4023
19465b30265A93960B2232b06957c2805k31333J22757a9449I760J5251c00530b9916
19453b95851c1948q7664B6339e4630A41439a4453A6980a4926j7215E2161a74619
19441b64033b8241A85743b48226C8449a65278g9200a6827A09251d4843b766A14008
19429G6025a94682c0563A5483g3551A92806a53770A31742J78593a17610N1832
19419f5778k35923a12374A42037o8996c52839J72668D7308c1252j62897j5866
$$ y = [-33826, -383188, -420055, -285335, 329747, -279606, -152552, -208428, -249243, -39574, 91251, 226082, -403855, -181276, -188679, 224452, -161187, -191724, -132695, -135017, 37136, 83526, -55773, 34994, -81873, -466350, -244209, -31277, -243824, -109800, -121333, -340579, 133772, -24023, -230265, 193960, 22232, -206957, -32805, -264138, -141381, -19449, 9760, 25011, -300530, -29916, -295851, -31948, -119612, 26339, -54630, 141439, -14453, 16980, -14926, -32141, 52161, -174619, -264033, -28241, 185743, -248226, 38449, -165278, -79200, -16827, 109251, -44843, -2766, 114008, 76025, -194682, -30563, 15483, -73551, 192806, -153770, 131742, 310335, -117610, -65778, -301701, -112374, 142037, 73041, -352839, -180171, 47308, -31252, -194149, -210015]
19409b10015K8242B5096K61878a22515d4679C50871o4529a89943l33790A73591
19398a29400k05868a37909F36a1644C58318A35680E8604L764l0696L2266a24266
19386E5239a64596k6757A06545J03405E3837a03100G8949d0629C23b99574I2506
19374b62174a21471K2185A10478d51255A98174a61609A58154a37270A7671c00758
19363C09182a11890l05897e0867o4063j27251H237a46977n0146j93298a21457
19352a54257j4121M5876A6273K655b42509D123M6474b36613C30497j34141o758
19341A89598a38838q737A26674a73016j59352B39323b80807E570c17033J42768
19331a74265p8144A16285n008J48921a67855H0294A207Q8764l4637i3946A07391
$$ y = [-210015, -181773, 25096, 286974, -122515, -44679, 350871, 286342, -189943, -523733, 173591, -129400, -335268, -137909, 636, -11644, 358318, 135680, 58604, 62368, 31672, 63938, -124266, 55239, -164596, -191353, 106545, 209950, 53837, -103100, 78949, -40629, 323, -299574, 92506, -262174, -121471, -99286, 110478, -451255, 198174, -161609, 158154, -137270, 17671, -300758, 309182, -111890, -417787, -50867, -114930, -242181, 8237, -146977, -197123, -390421, -121457, -154257, -168378, -122502, 16273, 18928, -242509, 4123, 50597, -236613, 330497, 196356, 189598, -138838, -147575, 126674, -173016, -332368, 239323, -280807, 5570, -317033, -174265, -252409, 116285, 111277, 260198, -167855, 80294, 1207, 89971, 55334, -93946, 107391]
19319b79500J00127K5862k22491A35333d8322A82603d2932j87390N1087d0052
19308c38035I7924c8943G1543a46141b1478F4696K13351b05173k90676b06899
19297e1408N953G6491c20122j09074A09225R9481I5055a832A91113c2562j96153
19286b28715d9694I1270J9997B1892J0815e8707K0756j70775C31319l3804a64085
19274B3503e3273l06782A08017c40846e2969j22842G1408L838d79551I1345c92806
19262A54996b10127o2308j54850f7013j3190G3896c8572H9653a12096p2937c4918
19250B22864b29656J13329L2857A81001g3818j95539a15802n95c4906A86138H3121
19238b19000i1789q1154a1517j9482q2112A1848a50435K7958o0068A68574F7640
$$ y = [-279500, -179373, -153511, -376002, 135333, -48322, 182603, -42932, -230322, -179235, -40052, -338035, 97924, -38943, 71543, -146141, -21478, 64696, 278047, -205173, -495849, -206899, -51408, -45455, 76491, -320122, -429196, 109225, 208706, 95055, -1832, 191113, -32562, -228715, -49694, 91270, 111267, 21892, 32707, -58707, -37951, -208726, 331319, 297515, -164085, 23503, -53273, -360055, 108017, -340846, -52969, -175811, 71408, 75246, -479551, 91345, -392806, 154996, -210127, -272435, -427285, -67013, -80203, 73896, -38572, 89653, -112096, -185033, -34918, 222864, -229656, -116327, -83470, 181001, -73818, -269357, -115802, -116397, -34906, 186138, 83121, -219000, -91789, -172943, -11517, -30999, -113111, 11848, -150435, -122477, -182545, 168574, 67640]
19226A78414C0258a67558E6346Q9637K22039b28090G762b34706B4461e276A03860
19214d27217E1075f9282r2709O8452j73991I7593D1884M8233D1401K839b24302
19202b9978a1717j37929R466f3563j13238o800B28415e9127j98293D8574a9784
19190a05270l8284j5387c3349C7552K11164l3930M69F2780a24087N692l1699j6583
19178a66677B45042a80126M7117j14841B59553b85054I1470c76716C61178j3939
19168C47239b08104a6344j11401k27296e6461A75953h4443B73642A17225c9421
19157e52369a61323c7409k03667k04808a4061A4004K0514e54818a28963D8496
19146a37557c0007k16666i326k9532A35251b8718h192A9839b20810B16610F8781
$$ y = [178414, 30258, -167558, 56346, 145983, 368022, -228090, 7762, -234706, 24461, -5276, 103860, -427217, 51075, -69282, -161991, -93539, -267530, 97593, 41884, 90117, 41401, 44240, -224302, -29978, -11717, -149646, -140180, -63563, -176801, -183601, 228415, -59127, -257420, 48574, -19784, -105270, -143554, -158941, -33349, 37552, 248716, 214786, 215255, 62780, -124087, -118395, -150094, -166677, 245042, -180126, -133009, -247850, 259553, -285054, 91470, -376716, 361178, 347239, -208104, -16344, -127745, -355041, -56461, 175953, -84443, 273642, 117225, -39421, -552369, -161323, -37409, -241076, -445884, -14061, 14004, 34518, -554818, -128963, 48496, -137557, -30007, -246673, -9326, -38858, 135251, -28718, -8192, 19839, -220810, 216610, 68781]
19134c45645Q1468D8085A4951f1624j84376c6407C46206c36226A54870C7286L0338
19123F7624B5888c0030k61144C9299a63343E0951b73686I8629J5246a62734B372
19111b23127G4052L25664a57854C4522L9377B9438a55509B104e0598I3858g8574
19099a60252k32938D9794a80383P7667A59027a42167A74495N5744a26017O2090
19089f3927k16286R0466f4195E8635e5226m2273j38567i1728E7499a20744B46354
19077c48492H559J19082M684A1908a40767O4478j03471l6890h0832G796J07100
19066A14896E274K3129a67836A67625K12180a0104k32395A77503g7275H4007b27085
19054G4199A6313a59111O3781A95733b47722D6011b79994B906f1144B71391d3486
$$ y = [-345645, -264177, 48085, 14951, -61624, -246000, -36407, 346206, -336226, 154870, 37286, 67624, 25888, -30030, -291174, 39299, -163343, 50951, -273686, 98629, 113875, -162734, 2372, -223127, 74052, 399716, -157854, 34522, 73899, 29438, -155509, 2104, -50598, 93858, -78574, -160252, -393190, 49794, -180383, -102716, 159027, -142167, 174495, 230239, -126017, -63927, -280213, -189747, -64195, 58635, -55226, -97499, -236066, -91728, 57499, -120744, 246354, -348492, 8559, 127641, 132325, 11908, -140767, -76289, -179760, -216650, -80832, 7796, 114896, 5274, 28403, -167836, 167625, 379805, -10104, -242499, 177503, -77275, 84007, -227085, 74199, 16313, -159111, -95330, 195733, -247722, 46011, -279994, 2906, -61144, 271391, -43486]
19042b2167j59416C2020M3854J06107b03937c9715E8186J62467r9086b00636a8699
19030C03963b32448e257D3110i0667k83488A55493a83596h4379j34792D494i7232
19018D3432K71933c53863A95020D2775K97107j22091q0293a38824r1276C5167
19007b6231k65330H9973f6068B25613m8079a37058N7766A70061C5509J33287o4539
18996A04257a19684B88693j03321q4530f9352I8000a05811r2651h7449G409J39440
18985A46849m006a54074G8823g5769A59309b05932B50561E4383a35910K8630j29758
18974b37038P2147C8068G690O1124a90644e5149j63016N6508n4924P8202M9316
18963h9063Q766k41730A64965C3414L70679j1685j60020A10100J8644k1364E176
$$ y = [-22167, -181583, 32020, 75874, 181981, -203937, -39715, 58186, 220653, 121567, -200636, -18699, 303963, -232448, -5257, 43110, -90667, -374155, 155493, -183596, -84379, -219171, 4494, -97232, 43432, 315365, -353863, 195020, 42775, 339882, 217791, 137498, -138824, -230100, 35167, -26231, -291561, 89973, -66068, 225613, 177534, -137058, -79292, 170061, 35509, 168796, 104257, -119684, 288693, 185372, 100842, -69352, 98000, -105811, -198462, -87449, 7409, 146849, 142843, -154074, 78823, -75769, 159309, -205932, 250561, 54383, -135910, -107280, -237038, -164891, 38068, 7690, 68814, -190644, -55149, -218165, -161657, -216581, -138379, -89063, -80297, -322027, 164965, 33414, 404093, 392408, 232388, 110100, 128744, 107380, 5176]
18951h1935k16494g4479l33947i0532j07839B67998A0596a77811r7536a17225
18940b30623M9385H737a78622F3502f7059C4573c61117J13480e5536A7046J46581
18929A63627B8960a6349k62027P4871C3083L8580c21B72653b5262E0053f4242
18917c06962B41631F0917k0590N7936b22389A03522J5016c08610j15595A96686
18906g7737E6117j2586k0938K14349D4526P310c17171C0613K4907P4121L62533
18895D92174j48531K94473B94846G695b15706Q4827j19019B94521A28951d39787
18884I7434j2489a86299a6485j73412O370b4610j22868r2044a13611K8680j9753
18873a04684r2192m0003j40133A86560E6081K2982a79598j04434r8428N3184a30038
$$ y = [-81935, -298429, -74479, -408426, -90532, -198371, 267998, 10596, -177811, -275347, -117225, -230623, -181238, 8737, -178622, 63502, -67059, 34573, -361117, -247637, -55536, 17046, 163627, 28960, -16349, -278376, -203505, 33083, 71663, -321, 272653, -25262, 50053, -64242, -306962, 241631, 60917, 40327, 98263, -222389, 103522, 118538, -308610, -424205, 196686, -77737, 56117, 43531, 22593, 236942, 44526, 51836, -317171, 30613, 55520, 129641, 492174, 343643, 638116, 294846, 7695, -215706, -130879, -249898, 294521, 128951, -439787, 97434, 84945, -186299, -16485, -189897, -183527, -24610, -147478, -239522, -113611, -84931, -104684, -196876, -236879, -377012, 186560, 56081, 79063, -179598, -284032, -382460, -329276, -130038]
18861b09815I2077k4863L4358h8605j0356j99034e2045J0535B37666G7714R7984
18850A75698N0244a45548B38691a02539k13665b5029j83354k7660k19092a66148
18839f1060b0524p4474n1530o1572f3659b4088B35385E5220e0104r5639j71856
18828c17599C46052A24599h2950B11953h3317r5225D8677h2639j17324A71989
18817b5318k96819a18429A31145J95853A60903a38973C30058F737Q4543d1967
18806a59424P2266m7834A37163J30662j32547A6227d3042p2209B61369B6611J18403
18795A45014J74187e1106k4993a3312B53262A06487a91310j90944c7099B02287
18784G6846J53312j02696k5783O9648E1143c05802I5495b42829D7271J7438a28912
$$ y = [-209815, 92077, 67214, 101572, -88605, -98961, -297995, -52045, -41510, 237666, 77714, 175698, 225942, -145548, 238691, -102539, -316204, -25029, -208383, -236043, -455135, -166148, -61060, -20524, -94998, -146528, -208100, -63659, -24088, 235385, 55220, -50104, -145743, -317599, 346052, 124599, -82950, 211953, -83317, -178542, 48677, -82639, -199963, 171989, -25318, -322137, -118429, 131145, 326998, 160903, -138973, 330058, 6737, 91280, -41967, -159424, -87158, -134992, 137163, 267825, 135278, 16227, -43042, -115251, 261369, 26611, 145014, 319201, -51106, -76099, -13312, 253262, 106487, -191310, -382254, -37099, 202287, 76846, 230158, 127462, 101679, 171327, 51143, -305802, 95495, -242829, 47271, 64709, -128912]
18772a28967N237d9914p4132M9575B758a55815B11275f2982B71452h4387k0075
18761a04462J2617h468C5638a21197F0890J302B2198c61408E8614h1376b8936
18749D8659K29510O154K1608a45309j4598O9371b0022j85923N4785B6367c7518
18737g8480A17515J84967a44343C4475a0617N143A08931g7859m2957k62908a09660
18725e0828A93077c20533D4619c3896B61370a02915A6589g5510o1213k79056B32597
18713c68824J50807c8691k75951E2090i8304a588j20452o4588k4186P585N6840
18702a46389B015a47306c7902k66778J07809j02058O0800A63927b19849e3395
18691a87322G461R2703c73497N7441C9364J4945a73073f0532j32214B2591a51829
$$ y = [-128967, -123730, -49914, -124046, -74471, 2758, -155815, 211275, -62982, 271452, -84387, -104462, -91845, -8468, 35638, -121197, 60890, 62192, 22198, -361408, 58614, -81376, -28936, 48659, 278169, 284323, 305931, -145309, -159907, -90536, -20022, -205945, -151160, 26367, -37518, -78480, 117515, 302482, -144343, 34475, -10617, -5474, 108931, -77859, -120816, -383724, -109660, -50828, 193077, -320533, 44619, -33896, 261370, -102915, 16589, -75510, -136723, -415779, 232597, -368824, -218017, -38691, -314642, 52090, -98304, -1588, -122040, -186628, -210814, -203229, -146389, 2015, -147306, -37902, -304680, -196871, -298929, -238129, 163927, -219849, -53395, -187322, 7461, 100164, -373497, -316056, 39364, 54309, -173073, -60532, -192746, 22591, -151829]
18679b46526B44779c82073a01770B41693j00228b53435C1915K8030i7110K4484
18669g2626k34965a16054k0351B9328a23414A55260a59520b6622m6638j77405
18659b50665K0195l0191A53469a86620C9931c43390a32977l68853J35359a01285
18648a31240l6816L2399d7149k2917I9291d0257B52014f8270C1649a80122q9353
18637b69475g9847o831j57946m5641B05032b01160P8042A40531f9040D62067a96027
18625a37842D2162J17014g9191C1047L4128N9428e8812k22702G2631a25312N4219
18614g1093r6915C5545e6531a2205B56565b77382a06837j30187M7931A17910P3098
18603A91008d143j29262J3724l7306g7746c1649l98067E6660a7321C18112A7220
$$ y = [-246526, 244779, -382073, -101770, 241693, 141465, -253435, 31915, 59945, -97110, -72626, -307591, -116054, -136405, 29328, -123414, 155260, -159520, -26622, -73260, -250665, -230470, -260661, 153469, -186620, 39931, -343390, -132977, -501830, -366471, -101285, -131240, -168056, -135657, -47149, -70066, 99291, -40257, 252014, -68270, 31649, -180122, -269475, -79847, -86678, -244624, -290265, 205032, -201160, -123118, 140531, -69040, 462067, -196027, -137842, 42162, 159176, -79191, 31047, 65175, 124603, -58812, -281514, 72631, -125312, -71093, -168008, 35545, -56531, -12205, 256565, -277382, -106837, -237024, -189093, 117910, 191008, -4143, -133405, -119681, -156987, -77746, -31649, -429716, 56660, -17321, 318112, 17220]
18591A18370c08591E5208K8512b97480J18698q1501C5945b21485K5006L2588a1112
18579i2259B06704a38378k67008G0282J29163i946j56291P5014m6849k06885J67494
18568a77463m2371j8527a06940B51890B8288i060k1571k02376C4317d93374b23791
18556a28276E8856Q894c4946j42320C5602b26489B5552K34570a52079j41329n5809
18545c49217J61324h327I3530b13683A35695a36919p8583p3018b2378D02391a38468
18533a38398B33013j02082a02040A86309l6069c54618R2437b5452A74123i852
18522D04691b8321B31251d0445C2110B413J05607f9680j1052f213o077A90553
18510E9849a65823D4563f6025D7703M761d90799a73336I8891g2707r0373N1231
$$ y = [118370, -308591, 55208, 83720, -297480, -178782, -260283, 35945, -221485, -196479, -163891, -11112, -92259, 206704, -138378, -405386, 70282, 199445, -9946, -166237, -91223, -138072, -344957, -177463, -219834, -238361, -106940, 251890, 28288, -9060, -30631, -233007, 34317, -493374, -223791, -128276, 58856, 67750, -34946, -177266, 35602, -226489, 25552, 260122, -152079, -293408, -349217, -187893, -8327, 93530, -213683, 135695, -136919, -215502, -288520, -22378, 402391, -138468, -138398, 233013, 130931, -102040, 186309, 150240, -354618, -262181, -25452, 174123, -9852, 404691, -28321, 231251, -40445, 32110, 2413, 108020, -69680, -80732, -6213, -12290, 190553, 59849, -165823, 44563, -66025, 47703, 52464, -490799, -173336, 98891, -72707, -163080, -111849]
18499a11849A27888e5911A62705F2413b8884j13740n599j8243b8867k56498J10853
18488a74512I7824b73979P7991j5666f611A21231b30799E2954a5381G1147a57043
18476g6078C7089a83960d1418a4390l50009a15921H1906R435d9071j2326I0936
18464b0805k25408B10919a59409q891M2450p7285h791j15083D8717a50350M0318
18453a10032d2282A4798b6725d295p9371L0111j1133o4628q5413B9408r729K8505
18441D8184M5445a57144C3211N5683b18245R618E1218A5794a67824A20402b5485
18429c23846N3318B37923B7589J20103a43j71694P7884J2823j96880C5039O7257
18418A02296g3587A61888A9396b8968j16552B0405a34529j32210B39426J10147
$$ y = [-111849, 127888, -55911, 162705, 62413, -28884, -142624, -148223, -166466, -28867, -285365, -174512, 97824, -273979, -195988, -211654, -6611, 121231, -230799, 52954, -15381, 71147, -157043, -76078, 37089, -183960, -41418, -14390, -364399, -115921, 81906, 91341, -49071, -61397, 90936, -20805, -246213, 210919, -159409, -168300, -125850, -203135, -8791, -123874, 48717, -150350, -110032, -42282, 14798, -26725, -4295, -83666, -53555, -64688, -129316, -214729, 29408, 19679, 48184, 93629, -157144, 33211, 88894, -218245, -208627, 51218, 15794, -167824, 120402, -25485, -323846, -270528, 237923, 27589, 147692, -143, -171837, -93953, -81130, -278010, 35039, 102296, -73587, 161888, 19396, -28968, -145520, 20405, -134529, -266739, 239426, 349573]
18408C49573b70574a04218K3361o0019A3853g1404A4916L58889A23453C6069a11926
18396a44075A85039a9647E5563a06049A88646D7554a17690A48205e5463B33625
18385a15208a0942B87356i6775J9042B77725b18391I6165a09067A19720a69225
18374g666A04298a63855G5076e1207q6133r1459E4873a72029B60418a62886A01742
18362B447g8237A9225a01165p6536g3867G1023b73493i7864D12676F394b61546
18350A49452L91002F7274A9714a57660b5113e279B85389a90242B18122F4621J12135
18339A76756j1143b07346A53863J03737a73585e8110b1810l397E7691f8698j09214
18328a77912B3106c0668C7890M0963J18886A3569a55907p6689C2930M901b84227
$$ y = [349573, -270574, -104218, -80857, -140876, 13853, -71404, 14916, 373805, 123453, 36069, -111926, -144075, 185039, -19647, 55563, -106049, 188646, 47554, -117690, 148205, -55463, 233625, -115208, -10942, 287356, -96775, -77733, 277725, -218391, 96165, -109067, 119720, -169225, -7666, 104298, -163855, 75076, -51207, -137340, -228799, 54873, -172029, 260418, -162886, 101742, 2447, -78237, 19225, -101165, -177701, -73867, 71023, -273493, -97864, 412676, 6394, -261546, 149452, 540454, 67274, 19714, -157660, -25113, -5279, 285389, -190242, 218122, 64621, 176756, 165613, -207346, 153863, 257600, -173585, -58110, -21810, -25207, 57691, -68698, -177912, 23106, -30668, 37890, 78853, 197739, 13569, -155907, -232596, 32930, 37831, -284227]
18316H069b84614J40394I9558a3398k04668h9823k94674a55875F9110L3981b71392
18304b61355D19000a9057A95957c88505J50002I6468J58449b91920E2413a45343
18293B0462e6837n3882B34391c22607B6091a89228D49447b0591r299a1568k05111
18282b16679B70553a36723B28599g3941L2597M021F3646c77621B08222a77168
18271a68237a2218H3416a53915e3979J44k5864l3945b4224I7362a07416j00224
18260b07640I8634O7284Q0821B1483f5004m55578B49232A2971a97911i4261c1835
18248c05632j8258R8075P5798C1070b75541A30869a9540m8401D4086Q3924D1879
18236D62609a51300E9359k5377g8054l64690Q2986c8380B54152b5417C0453d4616
$$ y = [8069, -284614, -144220, 99558, -13398, -218066, -89823, -384497, -155875, 69110, 103091, -271392, -261355, 419000, -19057, 195957, -388505, -238503, 96468, 254917, -291920, 52413, -145343, 20462, -56837, -110719, 234391, -322607, 26091, -189228, 449447, -20591, -29890, -11568, -216679, 270553, -136723, 228599, -73941, -41344, -37323, 63646, -377621, 208222, -177168, -168237, -12218, 83416, -153915, -53979, -53835, -79699, -113644, -24224, 97362, -107416, -207640, 98634, 165918, 246739, 21483, -65004, -520582, 249232, 12971, -197911, -94261, -31835, -305632, -323890, -225815, -150017, 31070, -275541, 130869, -19540, -67941, 44086, 128010, 41879, 462609, -151300, 59359, 33982, -78054, -442744, -359758, -38380, 254152, -25417, 30453, -44616]
18224b99888c0247q6633A38488J45901b35512m0416e5090m713m1286j8446p9883
18213a99418A8643L5171e9571r5548A40070A2581L4543b0658I0055k1230a84707
18201I0224a18166B16436f6524J1218n1644j14512B33017f2374A47015j4648e4326
18189b767F6670k3520f3759C3795a7116G4107k1963J16152f3290R025J7277l3060
18177g0048m1484k83162J66451A36146g4575k18704B96275a8672H1569l8516b03810
18165C4429b77874i164C04571d6396A22896i6162p6412A38189K5089d524k66429
18154b70953G3395b28692e228k70472I161N755R6744m8417c96240m8776I3971
18142a48867f0086A34373f7145k34612A46484a57844f8160a7550j35778B29261
$$ y = [-299888, -30247, -116880, 138488, 284389, -235512, -275928, -55090, -59803, -101089, -119535, -199418, 18643, 53814, -59571, -155119, 140070, 12581, 47124, -20658, 90055, 68825, -184707, 90224, -118166, 216436, -66524, -55306, -106950, -221462, 233017, -62374, 147015, 132367, -54326, -2767, 66670, 43150, -63759, 33795, -17116, 74107, 52144, 168296, -63290, -54265, -36988, -70048, -111532, -394694, -228243, 136146, -74575, -293279, 296275, -18672, 81569, 43053, -203810, 34429, -277874, -9164, 304571, -46396, 122896, -96162, -172574, 138189, 163278, -4524, -270953, 73395, -228692, -5228, -275700, 9161, 14916, 111660, 63243, -396240, -445016, 93971, -148867, -60086, 134373, -67145, -301757, 146484, -157844, -68160, -17550, -153328, 229261]
18131H0106b2509r6530A85366c65272h7798d0935B23672O620q9708R911C8883
18119a66072B1830d2908m3024o4889A12607a34851A32585a48455j3645B96561
18108c6137o3057j29890h4734G305K28001a05705G5659J4767N2969b38021C50451
18096b01040M6637G206e5597a1766j83024A53330b735j17695C3299c1386m3409
18085g4795r7387A31757E7044L218a16814e6493G1101K8078C8645J01725F1932
18073b4898A44623a89379B05814a9421A04172c1290B51799B550b51059P9932l5421
18062b06548h3244A27451N860f3097b7964j35797B77975c15959A02130i1868E8193
18050a51612F0028a30475q3304H3373b76168A042b29392D3181J7864h4378A41053
$$ y = [80106, -22509, -119039, 185366, -365272, -87798, -40935, 223672, 230292, 140584, 150495, 38883, -166072, 21830, -42908, -85932, -150821, 112607, -134851, 132585, -148455, -162100, 296561, -36137, -99194, -229084, -84734, 7305, 235306, -105705, 75659, 90426, 143395, -238021, 350451, -201040, -154403, 7206, -55597, -11766, -194790, 153330, -2735, -120430, 33299, -31386, -74795, -172182, 131757, 57044, 60262, -116814, -56493, 71101, 99179, 38645, 140370, 61932, -24898, 144623, -189379, 205814, -19421, 104172, -31290, 251799, 2550, -251059, -171127, -206548, -83244, 127451, 133311, -63097, -27964, -163761, 277975, -315959, 102130, -91868, 58193, -151612, 60028, -130475, -213779, 83373, -276168, 1042, -229392, 43181, 61045, -84378, 141053]
18038A18211Q7271p0928A0579d2224P64R245A28972d1232C3318J70370K4312c62871
18025d08246C5583J1833K0925b56906d7416m7112B30216b52966J08086A5498f262
18013F8318b53204h6629a0005C69d8986k9808m2723C26931k4226e0316K0877q3500
18001a12939a8144B0634f2784q9622A26730Q9450J28989e7848B0597e11619B79444
17989B92a63317I3237a93062h1179o6244e1539j9367K2954c441k12400O6828N1707
17977i7306B9987b6663n0312D2344N3012b91309B6501K08138b22339j18007g5627
17965B45129a97632P7617e1681l1234B72812G7088j6552L00037e1833H3283e7796
17953a18905G9902A8938a00330A76813c5356j16310A41877o6280c77322a38097
$$ y = [118211, 205482, 134554, 10579, -42224, -41460, -32215, 128972, -41232, 33318, 203688, 228000, -362871, -408246, 35583, 47416, 68341, -256906, -47416, -94528, 230216, -252966, -144880, 15498, -6262, 68318, -253204, -86629, -10005, 369, -48986, -78794, -121517, 326931, 302705, -50316, -29439, -112939, -18144, 20634, -62784, -152406, 126730, 216180, 345169, -57848, 20597, -511619, 279444, 292, -163317, 93237, -193062, -81179, -147423, -51539, -70906, -47952, -3441, -215841, -149013, -97306, 29987, -26663, -76975, 42344, 95356, -291309, 26501, 234639, -222339, -340346, -75627, 245129, -197632, -120015, -51681, -82915, 272812, 77088, 60536, 360573, -51833, 83283, -57796, -118905, 79902, 18938, -100330, 176813, -35356, -151666, 141877, 75597, -377322, -138097]
17942C871J47372J30429e1299B39828a19238j7231C91825A64883a6401B71623
17931a89464e651j31575G2292c15423f94A9891b48769a10196j09373j00327i1382
17919A29930M9746i291H8619D3915j4393a91944P0245A55137J0939b87910G0065
17907B43443j08553N9834o9468C8905b68415p2573B14745a42961j0376C76368
17896B0908N1435A9838J82432d8702A4385K16108f6559A27681b3650M026j51370
17885a70994C00250H4023a29916N3749l6580G4238a0689G958b4434B68413r941
17874B58472j4967a8121A91631J70475m0064b9097l76950a79136F31b44933D23487
17862c6859B34920I5600k6683c13634a21439A84460a94862D3319a23760L3634
$$ y = [3871, 151243, 281672, -51299, 239828, -119238, -136469, 391825, 164883, -16401, 271623, -189464, -5651, -137226, 72292, -315423, -694, 19891, -248769, -110196, -219569, -319896, -91382, 129930, 179676, -9291, 88619, 43915, 29522, -191944, -121699, 155137, 166076, -287910, 70065, 243443, 134890, 194724, 125256, 38905, -268415, -340988, 214745, -142961, -153337, 376368, 20908, 72343, 19838, 202270, -48702, 14385, 230493, -66559, 127681, -23650, -19624, -170994, 300250, 84023, -129916, -76167, -112747, 74238, -10689, 7958, -24434, 268413, 258472, 243505, -18121, 191631, 362106, 322042, -29097, -406047, -179136, 631, -244933, 423487, -36859, 234920, 95600, 68917, -313634, -121439, 184460, -194862, 43319, -123760, -90126]
17852i0126j524n9382l88558b55052R4167A6172P5257c2949j3231q4188C55310
17840A39060R2887i1425C97090c05800A07044j6010a79926A92247h5258c5693
17829a87711R3441B34565I9591K8a42059A87869H0938J94091b3139p0831K5011
17818f8959N496f66H0605J68950I7291b13150H5020H689a93219A14436G265K6826
17806C4091b94117R8099R0930A5534b97253f2583C7335P6660L5284a753l46832
17795c48585A48951c5519A07435a67917N9956A99978c51208A26841R1509C2249
17784B43269A17805J18207I695L67778A58808c0909C42913c33413B8928h7625
17773A06199B6149J94252a86788E9595b21391I5230D6388P4591d4352r6805C32722
$$ y = [-90126, -91650, -151032, -539590, -255052, -160885, 16172, 91429, -32949, -46180, -130368, 355310, 139060, 231947, -91425, 397090, -305800, 107044, 91034, -179926, 192247, -85258, -35693, -187711, -94270, 234565, 99591, 99619, -142059, 187869, 80938, 275029, -23139, -93970, -68959, -63463, -666, 80605, 249555, 97291, -213150, 85020, 8689, -193219, 114436, 7265, 34091, -294117, -196018, -105088, 15534, -297253, -62583, 37335, 113995, 149279, -1753, -348585, 148951, -35519, 107435, -167917, -107961, 199978, -351208, 126841, 218350, 32249, 243269, 117805, 236012, 9695, 377473, 158808, -30909, 342913, -333413, 28928, -87625, 106199, 26149, 220401, -186788, 59595, -221391, 95230, 46388, 120979, -44352, -141157, 332722]
17761A33898h889B18923a7586n2620F6687l1908c7737A41656m4239B3996K0043
17750D4039H043K74141b46457A12908K00889c2712A40054L6011c8261C15661A01722
17738G517b7312P072B84820a6150k0024F2896b36659D91155F1968J30843E9687
17726A8488g2759r5696F8455J05319p0137i9328A15192b01595d8000A34628O8347
17715B02975l9543a46861A75583p7926J81895D0162J68661M4421E2968J79643
17705B32611h5993c9290f787n2535C04109A5878c1694N306F33507A73625J67593
17694C41218I5251c84191J85724F770P0740k4825K221g9586k3392B21253K35517
17683D56770g2138C6186a9970D06984a89603E8051M8305Q5097b05806j3389B74385
$$ y = [133898, -8889, 218923, -17586, -70206, 66687, 34779, -37737, 141656, 97417, 23996, 44039, 8043, 282184, -246457, 112908, 313797, -32712, 140054, 176065, -38261, 315661, 101722, 7517, -27312, -20240, 284820, -16150, -36174, 62896, -236659, 491155, 61968, 192811, 59687, 18488, -72759, -168455, 68455, 173774, 103637, -99328, 115192, -201595, -48000, 134628, 202975, 163432, -146861, 175583, 97657, 279552, 40162, 208823, 253244, 52968, 232611, -85993, -39290, -6787, -59322, 304109, 15878, -31694, -26388, 633507, 173625, 341218, 95251, -384191, -198467, 6770, 77510, 52685, 54906, -79586, -102978, 221253, 456770, -72138, 36186, -19970, 406984, -189603, 58051, 106356, 191453, -205806, -219195, 274385]
17671e2008I1722a02099A62821K5347a76876B62266a35043B22525m0541F0850
17660A32487n3673O7312j9280c8759D63208B4844J73167n4817c0102n8756j13207
17649b02065b787D22886e404B0327K24625E3417J49708a83373A86215g784B55
17637C51768E7694P6016b3814C7048b42957I4661a7850C6589J12759l5172O439
17626A20615K82227j64059o7010a06520j02204d4946B9344L34289a7500A57037
17615I1171L448P6482a17702D709Q6519D034a96037A96986I4244J69034a71076
17603a65844H2134J56108E0236J8414a99549R7098C85032p8996j52426N811L93836
17592E53257k48727J13194A90969f5038C26125G0205B1256R7717J01870A4887
$$ y = [-52008, 91722, -102099, 162821, 188168, -176876, 262266, -135043, 222525, 181984, 60850, 132487, 78814, 146126, 126846, -38759, 463208, 24844, 198011, 143194, -30102, -88858, -202065, -2787, 422886, -5404, 20327, 244952, 53417, 203125, -183373, 186215, -7784, 255, 351768, 57694, 133710, -23814, 37048, -242957, 94661, -17850, 36589, 149348, 114176, 120615, 402842, 238783, 171773, -106520, -208724, -44946, 29344, 363633, -17500, 157037, 91171, 94619, 171101, -117702, 4709, 91228, 4034, -196037, 196986, 94244, 263278, -171076, -165844, 82134, 238242, 50236, 68650, -199549, -102451, 385032, 306036, 153610, 159421, 553257, 304530, 417724, 190969, -65038, 326125, 70205, 21256, 118973, 220843, 14887]
17581e8365A68051l984C9492J47071L4386i4074C40041C5307f3612a6494A37293
17569B06933q6684h8889B9044F769B288J66677J32767a09025A19095h1779B05555
17557H7201O0965d1974o8971O463g349C15217h402j40253A86135B9455f4323A0729
17544a48901A27967l9127K73632n5090q2439A03638r450J8981c27269C91979A3783
17532C33980n1330p5651J03828m2702a70831A82581p1794K5378b96278B83042
17521A22197K72801c5659D13531B02658h2515C28012b10455D69607j57469J77247
17511D89385Q3200Q0120j9748K69178k93462j55520K29369K7547j67132A30135
17500E47284B15951J83136J09392Q8030N6532L1405r6629K95903B98755M98635
$$ y = [-58365, 168051, 164067, 39492, 186563, 220949, -94074, 340041, 35307, -63612, -16494, 137293, 206933, 120249, -88889, 29044, 6769, 2288, 168965, 301732, -109025, 119095, -81779, 205555, 87201, 148166, -41974, -110945, -104482, -7349, 315217, -8402, -148655, 186135, 29455, -64323, 10729, -148901, 127967, 88840, 362472, 307382, 224943, 103638, 94188, 113169, -327269, 391979, 13783, 333980, 282650, 206999, 310827, 268125, -170831, 182581, 110787, 136165, -296278, 283042, 122197, 394998, -35659, 413531, 202658, -82515, 328012, -210455, 469607, 312138, 489385, 572585, 652705, 632957, 902135, 608673, 453153, 682522, 710069, 542937, 130135, 547284, 215951, 399087, 508479, 596509, 653041, 684446, 587817, 883720, 298755, 797390]
17490G97390k66462j9038B29206J86128A91709J78279R3909j88814n3780h926
17479B23723K66525B41177J54156a32826B19471K34510c01475B13322l0312J03745
17469B86755j13201q2415L13005j71924K51962B05165E7838N0456a6415n3898
17459g0313B52349G4242J73250j21089L0286R7244m2167F9354J01165L44445n4830
17448D60134A71841e827Q54A65884N5302k1102I2697J69069Q8386j0167r0759
17437B49226m1289J36724K42263E0822K65794M7943J62044J18900I5000K26885
17427C21885q439K14568H3086N6286J32848j0565h5156G0757O1725L98352f2512
17415B83903J85911K85284B36035A03803K1559L30981j99946r239E3340J65032
$$ y = [797390, 530928, 511890, 229206, 415334, 191709, 369988, 463897, 275083, 221303, -8926, 223723, 490248, 241177, 395333, -132826, 219471, 453981, -301475, 213322, 183010, 286755, 173554, 91139, 404144, 232220, 484182, 205165, 57838, 108294, -16415, -70313, 252349, 74242, 247492, 126403, 156689, 253933, 211766, 69354, 170519, 514964, 460134, 171841, -5827, -4973, 165884, 221186, 200084, 92697, 261766, 350152, 339985, 249226, 207937, 344661, 586924, 50822, 316616, 364559, 526603, 645503, 95000, 321885, 313446, 528014, 83086, 139372, 272220, 261655, -85156, 70757, 132482, 530834, -62512, 283903, 469814, 755098, 236035, 103803, 125362, 456343, 256397, 247158, 53340, 218372]
17405B18372H78M28755j41438q1750G5467k5816N51264A60400n0307M07618B39323
17393C09564I8794c5434F0709P1316J70126A4062K48722M4622K7326d448D2424
17381g7895C45262j31097J57995A50158L28725A62296L71555B32046J72731k2217
17371C82560i2502A31385m0743e5693A58932K81072k07486l0934J22224a18990
17360A30462J25316d1814C06179A22637J59191d663A43109k6919k168l3415J31085
17349B11692l2272K04457j63264K9295j8341M5308J4930M1894J15021D1857h9839
17337B79047e4891D08926B01742d9110A44724C5100K31559J14962j25678R7276
17327C53219R807J21365k40369q2958L04474E5583J56203p2768L06513k16585
$$ y = [218372, 878, 429633, 288195, 206445, 75467, 49651, 600915, 160400, 110093, 517711, 239323, 309564, 98794, -35434, 60709, 132025, 302151, 14062, 262784, 307406, 334732, -4448, 42424, -77895, 345262, 214165, 372160, 150158, 478883, 162296, 533851, 232046, 404777, 382560, -92502, 131385, 90642, -55693, 158932, 440004, 232518, 201584, 323808, -118990, 130462, 255778, -41814, 306179, 122637, 281828, -4663, 143109, 116190, 114022, 80607, 211692, 179420, 383877, 220613, 249908, 231567, 276875, 291805, 333699, 448720, 41857, -89839, 279047, -54891, 408926, 201742, -49110, 144724, 35100, 266659, 381621, 255943, 353219, 363026, 484391, 244022, 161064, 465538, 55583, 211786, 139018, 445531, 228946]
17317B28946j0532J44854A35226Q903A4099k550K13170K76336A20682Q7212J46007
17306C53901D4714A1448L19086l5256i3524A58595n1256K61990m3686A23925c0042
17294B36231H074C54K10244K87439j00640j7985j77098J22809j33565k2609a5371
17282C59353p6802K9579b0864B34587l8805L46030k09050p6106D4659J72311m2957
17271A74013O6125a0710D82892B36854o5142o4205L2149J67753r3746J63297k5819
17260C51141j33224a53C24118q0373K16156k4545K8489J44155C00092K9456J21137
17249D50685b274A16183J56604n6591O9883L26084A78341L96379B26780L04697
17239E31477c9769B64760q3746B0705L27885b9748B59420p04A20981J10772J71797
$$ y = [228946, 218414, 363268, 135226, 144129, 14099, 11549, 224719, 501055, 120682, 207894, 353901, 44714, 11448, 330534, 295278, -93524, 158595, 107339, 369329, 325643, 123925, -30042, 236231, 8074, 354, 210598, 498037, 397397, 379412, 202314, 325123, 191558, 168949, -15371, 359353, 282551, 312130, -20864, 234587, 195782, 541812, 332762, 256656, 44659, 216970, 174013, 240138, -10710, 482892, 236854, 171712, 107507, 139656, 307409, 213663, 376960, 351141, 217917, -153, 324118, 243745, 459901, 435356, 463845, 608000, 300092, 329548, 450685, -2274, 116183, 272787, 216196, 286079, 612163, 178341, 574720, 226780, 531477, -39769, 264760, 181014, 20705, 348590, -29748, 259420, 258716, 120981, 231753, 403550]
17228D03550p9105K8893j76236K84047m6436o0295l4285j17437J79166n4253J24781
17217D52390A19311M26387M4302A80913K84652A88879K46062K8989o7197k7454
17207C69279A52700L19333j7963A98720J1172j04704L30611A76880K39732j62342
17197B54270Q4980D7304M20866j56875L81462k33662J11196A46418J09008H9246
17186B95210R6358J77692k76857A31855O5579O280K71378B34067k3544K59573
17176D70096K7936A61365J02513P6087J20713j26639m2244J59746j07841K14962
17166E58662B02177K40520A72471M83900B10646L00941j01774q8826J06948O0463
17156D88398k13760J4166J35771L7358J76054B51366J19374j78090L85740n1887
$$ y = [403550, 324445, 353338, 177102, 461149, 414713, 354418, 320133, 202696, 381862, 327609, 452390, 119311, 545698, 590000, 180913, 465565, 188879, 434941, 463930, 396733, 369279, 152700, 472033, 454070, 198720, 209892, 105188, 435799, 176880, 416612, 254270, 339250, 47304, 468170, 311295, 692757, 459095, 570291, 146418, 255426, 89246, 295210, 391568, 569260, 292403, 131855, 197434, 203714, 475092, 234067, 210523, 470096, 498032, 161365, 263878, 339965, 460678, 334039, 291795, 451541, 343700, 558662, 202177, 442697, 172471, 656371, 210646, 511587, 409813, 320987, 427935, 488398, 274638, 288804, 424575, 461933, 637987, 251366, 370740, 192650, 578390, 526503]
17146E26503o9258j27998L9855d0907C99231k107O5246K38505B37364J53103K64176
17135F54643j97654A79584L91783l8992L1386k00450O9505J66810r9947j29309
17125C70370M340J33045J11324k44550L61978B29132K08248J39926L7054q9494
17115E24866j14238J96417B96799K25947J83204j18633j93570K3477J93681k1775
17105E89130k53265K68226n0827k8162J07475j97689j76053N33172l15515N5573
17095E32065p3784K5263L6053j78008J90668r2852J35775Q6058j81834J06082
17085E85486o9336L8445J56128p9693D171N13262o7061K01637k80505L91026k08183
17074E54347K48446r8176J43O999m2585j13294k200p973K36618r6620k920J86031
$$ y = [526503, 457245, 329247, 369102, -40907, 399231, 397124, 462370, 700875, 237364, 390467, 654643, 456989, 179584, 571367, 532375, 563761, 363311, 432816, 599626, 499679, 370370, 374710, 507755, 619079, 374529, 736507, 229132, 437380, 577306, 614360, 524866, 410628, 607045, 296799, 522746, 705950, 587317, 393747, 417224, 610905, 589130, 335865, 604091, 553264, 525102, 632577, 434888, 258835, 792007, 476492, 532065, 458281, 483544, 519597, 341589, 532257, 439405, 575180, 661238, 479404, 585486, 516150, 554595, 710723, 631030, 4171, 517433, 450372, 652009, 371504, 762530, 554347, 802793, 704617, 704760, 711759, 669174, 555880, 553680, 545707, 782325, 685705, 682785, 868816]
17062H68816l87812j61905M10514k40737M01921k40710j59908L96470B48263O27624
17052H75887l6083k00380j08300r294J59870k03898L59886C67347M42165k45432
17042E64080K48602j21443L19178k25613n5042k97717J5550K43085M5002C36978
17031I52814j31247j10369K4419p3090p3028K86162R2632j38666k71301o7028
17021D91298O07343n35816J96150J41458j33600Q0945j38567L23080k463N0418
17011A080246j38514J18460n4551j20734j93615M46777j39553k19937q9228J66110
17001H55461M2907l3563R5437k0665j19858Q3957j16129K41089R2034k72160O5230
16990I13740p5688K09501k8959R5426k17152J00982k44473R0682J76415M4365
$$ y = [868816, 481004, 319099, 729613, 488876, 890797, 650087, 490179, 886649, 248263, 875887, 839804, 639424, 531124, 521830, 681700, 477802, 837688, 367347, 809512, 564080, 812682, 691239, 1010417, 784804, 729762, 432045, 447595, 690680, 735682, 336978, 952814, 821567, 711198, 735617, 662527, 589499, 875661, 968293, 829627, 558326, 491298, 1098641, 562825, 758975, 900433, 766833, 847778, 709211, 1032291, 1029828, 1080246, 941732, 1060192, 1005641, 884907, 691292, 1138069, 998516, 778579, 689351, 855461, 898368, 864805, 960242, 939577, 819719, 903676, 787547, 1028636, 1120670, 848510, 913740, 838052, 1047553, 1018594, 1114020, 896868, 997850, 753377, 844059, 1020474, 1064839]
16980A064839j7366l8690Q8920m82L03186l06385N2911J78043J74772k39645m73809
16969G86294L48582n5713O9561j78329L81921j18669l13935K14208K47179j97511
16959A183588J16682l71318O03488l49785L27620m51561L58409p9373K8095j12722
16949A253123K5532k27548J47809p2843K68631J2171Q8856j10080j43259O9745
16939A312137J95343q900k53428K43352k04026L60793m00795N69481l68843j26436
16929A318678M24715l30094L81064q0508l2450m9868p5592K22261L0041j64264
16919A643983l14281O58793k3846j10934O2688j02210p4489m192J13811J54637
16909B003960l14993J34526K2373l42336N45610o671q8137L55913l11616J29803
$$ y = [1064839, 1047473, 1008783, 1097703, 1097221, 1400407, 1094022, 1146933, 1324976, 1499748, 1260103, 786294, 1134876, 1079163, 1148724, 970395, 1352316, 1233647, 919712, 1133920, 1381099, 1183588, 1300270, 928952, 1532440, 1182655, 1510275, 1058714, 1417123, 1337750, 1365845, 1253123, 1278655, 1051107, 1198916, 1126073, 1394704, 1406875, 1495731, 1385651, 1242392, 1312137, 1507480, 1498580, 1245152, 1488504, 1284478, 1645271, 1244476, 1813957, 1445114, 1318678, 1743393, 1413299, 1794363, 1713855, 1681405, 1631537, 1555945, 1778206, 1808247, 1643983, 1329702, 1988495, 1964649, 1853715, 1916403, 1814193, 1739704, 1735512, 1849323, 2003960, 1688967, 1823493, 1845866, 1503530, 2049140, 2042469, 1954332, 2310245, 1998629, 2128432]
16899B128432j20388M4042K27818l95871K84856P9906l34861J68830K36224J31691
16889B450679l38146N3625L32931n01183N31164l66140M16828K7243J0272j07202
16879B510071p5067J79008o1534K2744K8945J89416N8584Q2813r8270k8232k52485
16868B555993O36729k96447r917K81799l66431K18751J99764N0299l0602k63384
16858B976554L38703J46175j79363J36673k07295M58415q6163q4881J88321J70393
16848C857532J32418j82914n0198N24235j97918k14623L83615L2002m34303K51921
16838D101767M6684K78947n6252M6500K06923J44693K3217l5722L3754M4477L21216
16827E156204j29549K44948j17370K29442K30318m6080n7930M53458r9342K55258
$$ y = [2128432, 2008044, 2052086, 2279904, 1884033, 2168889, 2248795, 1913934, 2082764, 2318988, 2450679, 2112533, 2166158, 2499089, 1997906, 2529070, 2162930, 2579758, 2607001, 2617273, 2510071, 2435004, 2614012, 2552478, 2575222, 2604167, 2793583, 2852167, 2934980, 2836710, 2808478, 2555993, 3192722, 2896275, 2886358, 3168157, 2801726, 3020477, 3220241, 3270540, 3239938, 2976554, 3315257, 3461432, 3282069, 3418742, 3211447, 3669862, 3583699, 3498818, 3687139, 3857532, 3989950, 3807036, 3756838, 4281073, 4083155, 3868532, 4252147, 4284149, 3849846, 4101767, 4148451, 4427398, 4371146, 4417646, 4624569, 4769262, 4792479, 4756757, 4790511, 4834988, 5156204, 5026655, 5271603, 5154233, 5383675, 5613993, 5567913, 5509983, 5963441, 5864099, 6119357]
16817F119357j38947M06540k78559L13165K65338P9058j42592K71224Q3921j1203
16807F967302K7741L05791m7605M64678k9275K35106M09704n6654J5116K52762
16797H544666O54636j53730q1418M48987Q5580J50064N44469j84840L99532L20578
16787A0728524j6093N74847K26946N8697M83785J58057M60484Q8913L95154K2003
16777A3181317Q05345L05444L28666M93014K60253K94595P27482L01046L07149
16768A7004311N55647P28153N30924L05557O32073N53137P49610M14617Q07383
16759B2281412O54048O84141J294971L58230P77532J336429N37537O71494R89404
16750B9585198J181751J023203J355783J303734J357352J160069J300234J677289
$$ y = [6119357, 5980410, 6386950, 6108391, 6421556, 6686894, 6765952, 6623360, 6894584, 6978505, 6967302, 6995043, 7300834, 7253229, 7717907, 7688632, 7923738, 8333442, 8276788, 8291904, 8544666, 9199302, 9045572, 8964154, 9413141, 9498721, 9648785, 10193254, 10008414, 10407946, 10728524, 10712431, 11287278, 11514224, 11572921, 12056706, 12214763, 12675247, 12764160, 13159314, 13181317, 13986662, 14292106, 14620772, 15113786, 15374039, 15668634, 16396116, 16697162, 17004311, 17559958, 18288111, 18819035, 19124592, 19756665, 20309802, 21059412, 21474029, 22281412, 22935460, 23619601, 24914572, 25272802, 26050334, 27386763, 27924300, 28595794, 29585198, 30766949, 31790152, 33145935, 34449669, 35807021, 36967090, 38267324, 39944613]
16742C9944613J393289J691505J608250J516328K322984J549824J858521K060204
16734E3945518K168845K163957K585621K241353K774082K393411L018171K639823
16726G3930781K650010L034002K783953K922303K950308L234933L143286K478328
16718I7127904K645054L265436K515643K346148K352120J851850K047598J655720
16710A15807473J417189Q88772O72548q770p1008k29297q58480j146733j262237
16701A15209457j707974j988340k374978j964328l218399k344774l088685k835547
16693I5686432k857323k744812l532036l018965l093540l019185k604807k642195
16685G2173569l079238k681641k346481k602408k385806k068216k450592k321707
$$ y = [39944613, 41337902, 43029407, 44637657, 46153985, 48476969, 50026793, 51885314, 53945518, 56114363, 58278320, 60863941, 63105294, 65879376, 68272787, 71290958, 73930781, 76580791, 79614793, 82398746, 85321049, 88271357, 91506290, 94649576, 97127904, 99772958, 103038394, 105554037, 107900185, 110252305, 112104155, 114151753, 115807473, 117224662, 118113434, 118785982, 118777212, 118706204, 118476907, 117618427, 116471694, 115209457, 113501483, 111513143, 109138165, 107173837, 103955438, 101610664, 98521979, 95686432, 92829109, 90084297, 86552261, 83533296, 80439756, 77420571, 74815764, 72173569, 69094331, 66412690, 64066209, 61463801, 59077995, 57009779, 54559187, 52237480]
16677E2237480j755420k128319j630172j642370j949478j418966j513025j336718
16669C8863012j800689j345414j036465j341038j300167j264310p82627j092192
16661B8900110r53704q59665j203212m85159p36688r51620m48436r85962r27949
16652B1347715k39875n91761q54943p08014j67976p64070o58373l43428n32813
16643A6486462m32107k31277o76060M3883m68284n22422k87387o82520k01339
16634A3028949l46540l12978k07372n42608j56981l2090n05095n0930n1706l18493
16624A0504156l09409l79537k7414l80165j42996j89411k17935l77023j196m34415
16614H044655O1992j24292n68260N0891R4371j53206l6309n14884J39771m4960
$$ y = [52237480, 50482060, 48353741, 46723569, 45081199, 43131721, 41712755, 40199730, 38863012, 37062323, 35716909, 34680444, 33339406, 32039239, 30774929, 29992302, 28900110, 27946406, 27086741, 25883529, 25398370, 24661682, 23710062, 23261626, 22275664, 21347715, 21107840, 20516079, 19661136, 18953122, 18785146, 18021076, 17362703, 17019275, 16486462, 16054355, 15823078, 15147018, 15190901, 14722617, 14200195, 13912808, 13230288, 13028949, 12682409, 12369431, 12162059, 11619451, 11462470, 11430380, 10925285, 10874355, 10822649, 10504156, 10194747, 9815210, 9787796, 9407631, 9264635, 9075224, 8857289, 8480266, 8479070, 8044655, 8106647, 7982355, 7414095, 7464986, 7559357, 7406151, 7369842, 6854958, 6994729, 6949769]
16604F949769l36034j03587k02143O5587k28816k9513J10146k94437p2057m3207
16594E815708n51562K94091m14175L05061l09813j46014J11119l8509k18112l20952
16584D526842K49901P8500k21302r7012j67219J14279k65757q8783M3136l5857
16574D136728Q9579n30945K53076j67459j43180Q5563K03740j20701k64281M4490
16564C586610k6505K60645k58808j93132r0757l67331L54152k00835K64765J535
16554C330339l29138l1621J54859J5790O5781k67084q082q0715J19347j18628
16544B850848l07330K52323k43505o4551J99977p5183k0841k33981j6623J19313
16534B460447j55757J26153K65879r8561l69166N2496l0286k41799K04730J99317
$$ y = [6949769, 6613735, 6510148, 6308005, 6373592, 6144776, 6115263, 6225409, 5930972, 5858915, 5815708, 5264146, 5558237, 5144062, 5449123, 5139310, 4993296, 5104415, 5065906, 4847794, 4526842, 4776743, 4855243, 4633941, 4536929, 4369710, 4483989, 4218232, 4129449, 4172585, 4136728, 4226307, 3695362, 3948438, 3780979, 3637799, 3723362, 3927102, 3806401, 3542120, 3586610, 3560105, 3820750, 3561942, 3368810, 3278053, 2910722, 3264874, 3064039, 3328804, 3330339, 3001201, 2969580, 3124439, 3140229, 3206010, 2938926, 2930844, 2850129, 2969476, 2850848, 2543518, 2795841, 2552336, 2487785, 2687762, 2612579, 2591738, 2357757, 2341134, 2460447, 2304690, 2430843, 2696722, 2598161, 2228995, 2281491, 2251205, 2009406, 2214136, 2413453]
16524B413453j70582K50678l59232J37897q7275j30138j16604K07408J38263m08165
16514A875703N8185j07129K54854n4185J0321k65850k8740K97737j84424j38183
16504A718289J01486k65291J66624o5655K28313l32153K9224J82805n4395j52262
16494A556985K14489m3181M6688p5682j85756L09143j31208k48821M5712R0542
16484A578911R6304r5702R0456k65381R8431j54983K16921j14295J05510r1610
16474A464562N4418q8098j94007q2104J16493J10545K1808o9324q6651J45194
16464A392836j48613J25661M3927m2662k14658J85681n5309o4764K7632r5177
16454A154554p1287J97917K66166n00059J15333L70353j54445j99415J91224j89376
$$ y = [2413453, 2242871, 2493549, 2134317, 2272214, 2184939, 2054801, 1938197, 2145605, 2283868, 1875703, 1933888, 1826759, 2081613, 2027428, 2037749, 1771899, 1743159, 2040896, 1856472, 1718289, 1819775, 1554484, 1721108, 1655453, 1883766, 1551613, 1580837, 1763642, 1709247, 1556985, 1771474, 1728293, 1774981, 1699299, 1513543, 1822686, 1691478, 1442657, 1488369, 1578911, 1675215, 1579513, 1669969, 1404588, 1503019, 1348036, 1564957, 1450662, 1556172, 1464562, 1518980, 1430882, 1236875, 1154771, 1271264, 1381809, 1403617, 1334293, 1247642, 1392836, 1244223, 1369884, 1413811, 1371149, 1156491, 1342172, 1286863, 1222099, 1249731, 1154554, 1083267, 1281184, 1547350, 1047291, 1162624, 1532977, 1378532, 1179117, 1370341, 1180965]
16444A180965l36246J68046K17216k35824J07733j1951o5367p0409K15418p6227
16434A093354n30242O10639m13789K44763p9436j15230J52328K08028k26245R4432
16424A038602j23436J21119l00961P1226J14316j11529L7674K32705m10775L52414
16414A021355J3139k6533j72065Q1779J83141k17416l5651K68353m45226M35670
16404A106546k30060k96369J89411M6271K14959j87382j47503N5867K64211k3047
16394I92904O9498m18762J64051j6698j78605O5656O12947n31646J83215K93907
16384A236467k09506D95471N84184k20009N8614j08561N672J15504k83557L3744
16374F81062j4200j52267K76617O6402k1417l721o2799L5604m4134L4104o2107
$$ y = [1180965, 844719, 1012765, 1229981, 994157, 1101890, 1089939, 1024572, 954163, 1169581, 1093354, 563112, 1173751, 759962, 1004725, 925289, 810059, 962387, 1170415, 944170, 1038602, 915166, 1036285, 735324, 806550, 920866, 809337, 847011, 1079716, 668941, 1021355, 1034494, 1007961, 835896, 917675, 1100816, 883400, 847749, 1116102, 670876, 1106546, 876486, 580117, 769528, 815799, 1030758, 843376, 695873, 751740, 1015951, 992904, 1062402, 643640, 807691, 790993, 612388, 678044, 1290991, 759345, 942560, 1236467, 1026961, 495471, 1079655, 859646, 918260, 809699, 815371, 930875, 647318, 681062, 666862, 514595, 791212, 857614, 836197, 832476, 769677, 805281, 761147, 795251, 733144]
16363G33144J3057O4675K42065l99457j40138L32414l71170L24090r9226J30436
16353H29890k63687K46027J37895j18640k36577B21985J28728m797L44387j68301
16343E22002n9794K39054L8681L1784k07119l3718K78203r3615j00698j86277
16333D28503K71812j08708m1031K8223N5545K96408l10012O6289j83267R4490
16323E98252j09829k6570L57494D06888K25047j7836k81214M19535r1286N8471
16313G19605L2283l1497j69352j51000M98122k18378C37690m6256M70526J3356
16303G75316C72197L42622B35959K38002j53285K77799B39427J38636K93652J1234
16293F82949A38989L33321N3273E1921O06537k71876o7175L01462k06529o3568
$$ y = [733144, 746201, 810876, 1052941, 653484, 513346, 845760, 474590, 798680, 699454, 829890, 566203, 812230, 950125, 831485, 594908, 221985, 350713, 345916, 690303, 522002, 462208, 701262, 739943, 771727, 564608, 530890, 809093, 715478, 614780, 428503, 700315, 591607, 550576, 578799, 634344, 930752, 620740, 687029, 503762, 598252, 488423, 461853, 819347, 406888, 631935, 614099, 332885, 752420, 661134, 719605, 751888, 720391, 551039, 400039, 898161, 679783, 337690, 291434, 761960, 775316, 372197, 714819, 235959, 473961, 320676, 598475, 239427, 378063, 671715, 682949, 138989, 472310, 525583, 51921, 658458, 386582, 319407, 620869, 414340, 350772]
16283C50772L80468k75858R0126r4740J19046j37038K2949r6525J67153J3715
16273E40068j33117J1072J08496r3131A50028K91432N2355A60767M11170q5558
16263D86379R716L5791B15358K22171B01025J8271K739K72660H1934N3167L93326
16252E28427j41556J17801R5840o9658N2052K375B41819M611N1114J65746j07235
16241C56055A60771F7316L99115q4217J32620j84922J66349j34871j70746K11132
16231D01776J47801r8795A47923J35508q1802J04962K15227J21705B42528L44788
16221E87316k12276J28501n7491M5268j79153L3510n8492j40047J40805a13863
16210D58811J3230A55994J51365L07774m8853B49349N5009Q5562A39221J73369
$$ y = [350772, 731240, 455382, 545508, 450768, 569814, 432776, 455725, 359200, 526353, 540068, 406951, 418023, 526519, 433388, 150028, 441460, 493815, 160767, 571937, 486379, 496095, 531886, 215358, 437529, 201025, 219296, 222035, 494695, 81934, 135101, 528427, 386871, 504672, 600512, 530854, 582906, 585281, 241819, 246430, 297544, 463290, 356055, 160771, 67316, 466431, 382214, 514834, 329912, 496261, 361390, 190644, 401776, 549577, 450782, 147923, 283431, 201629, 306591, 521818, 643523, 242528, 587316, 375040, 503541, 446050, 491318, 312165, 345675, 287183, 147136, 287941, -113863, 458811, 472041, 155994, 307359, 615133, 566280, 249349, 304358, 389920, 139221, 312590]
16200C12590j09803J3648J67429D4635K36872j15674n8570J38380M08328A99571
16189B42871J86067A43917M90723k56821j37719P0227N320l7244O8602J99097
16179E46102A06525K2715L32070A27586J92141A4216L66783A64600O376m4330
16169A26646J04898j06411f1369D05183k8200P9368L0581B03634Q3220C3319L06250
16158C39569N079N2388j85754P7022B8573J500L09879O864A37435N3799P2542
16147B63776q6363q1050F855L18842B7368K54591D5637L10663p7890j27347J89039
16136C40102j34061K28291j57421r5322L64302A30526M47417A50720n7327J04101
16126A97494m73J83417J72130G3761A0826M3373J26283K25135b11013C21333j56488
$$ y = [312590, 202787, 216435, 383864, 44635, 281507, 165833, 107263, 245643, 653971, 199571, 242871, 428938, 143917, 634640, 377819, 240100, 310327, 315647, 278403, 347005, 546102, 106525, 129240, 461310, 127586, 319727, 14216, 380999, 164600, 170976, 126646, 231544, 125133, -61369, 405183, 376983, 456351, 486932, 203634, 286854, 33319, 339569, 344648, 397036, 211282, 288304, 28573, 30073, 339952, 346816, 137435, 191234, 263776, 177413, 96363, 6855, 325697, 27368, 281959, 45637, 356300, 278410, 151063, 340102, 206041, 434332, 276911, 181589, 545891, 130526, 577943, 150720, 93393, 197494, 197021, 380438, 552568, 73761, 10826, 54199, 180482, 405617, -211013, 321333, 164845]
16115A64845E7880K17786F7640K32698e8496n4663B37538m7666C0426P7847K09113
16104C17386l8387J0020i8345o9199D28631A46670a08615c2626c464o8748B55280
16092C98403A83946L60489A62123K16013j50552a45913I0258O0941a34390P502
16082a26888A94273d1155A31338m3431D2335p758a9082B74385a73685A21436e899
16070A05566g042B35542d3032C10764K4475a77244B7621J03503K62221j02855
16060B90490H0036K46477A16909a35348K0103L8739a2404k44565B18693l6559
16050A82134J9539F7042A4549J53590o163C3981N83119B31982i2355A15349C8798
16038B18232H6709h0676B16204h5235J289A48142a63234H2431a17440M1692n445
$$ y = [164845, 57880, 275666, 67640, 300338, -58496, -113159, 237538, 189872, 30426, 108273, 317386, 278999, 289019, -98345, -167544, 428631, 146670, -108615, -32626, -3464, -72212, 255280, 398403, 183946, 544435, 162123, 378136, 227584, -145913, 90258, 151199, -134390, -126888, 194273, -41155, 131338, 87907, 42335, 34577, -19082, 274385, -173685, 121436, -5899, 105566, -7042, 235542, -43032, 310764, 335239, -177244, 27621, 131124, 393345, 290490, 80036, 326513, 116909, -135348, -115245, -76506, -12404, -256969, 218693, 182134, 201673, 67042, 14549, 168139, 161976, 33981, 617100, 231982, -92355, 115349, 38798, 218232, 86709, -80676, 216204, -85235, -83946, 148142, -163234, 82431, -117440, -75748, -81193]
16027h1193q5154A15580h0140j15709C57973d2083B01361K2442R957A06353l4151
16016G2202b70260I0663a17079B73502o4095O948H4073a36234j38335Q0176A51279
16004B61225h4618B76732b08611F8769c39361D5870b35765m5339e9305C22391
15993E1044b1415J340A13442m6720M8762E4710j5785k326J93391p0471c62904
15981C31089A18238l8371M70868G2679N7781a06106A62793L2392O60089I8803
15970F61876K06329q1686l6984K53817l73984j83659J10981B31094h0692H8835
15959C708a05677k9928A51329b0192G6534O1748C0750d5689B23302c67730G0637
15947H3493a8660I3230a56020A76043b5534B8524c0321A72518j9238a03562b9205
$$ y = [-81193, -166347, 115580, -80140, -195849, 357973, -42083, 201361, 223803, 233760, 106353, 72202, -270260, 90663, -117079, 273502, 209407, 216355, 84073, -136234, -274569, -194393, 151279, 261225, -84618, 276732, -208611, 68769, -339361, 45870, -235765, -281104, -59305, 322391, 51044, -21415, -20075, 113442, 66722, 115484, 54710, 38925, 36599, 229990, 159519, -362904, 331089, 118238, 79867, 550735, 72679, 130460, -106106, 162793, 195185, 855274, 98803, 661876, 868205, 786519, 749535, 1003352, 629368, 445709, 556690, 231094, -80692, 88835, 3708, -105677, -135605, 151329, -20192, 76534, 138282, 30750, -45689, 223302, -367730, 70637, 83493, -18660, 93230, -156020, 176043, -25534, 28524, -30321, 172518, 153280, -103562, -29205]
15935F1788N7661L5902e35430B42203b88722A75032c20731a6063o922A55580B7330
15923b53989g754D8138J95568G9731b61018J00352l8486a7307l8870c478k07904
15912b11382b2793l3795H5644f0839j01093A31138a23892a3117C0646f0019A5323
15900a58230M987e4350D9821K5452B7049f7813K1997C2895K6928J23421G2330
15888b8608j32821l435D584b60269R4103O4481B2165a78967N0800k1908A66652
15876A97a86754C9427L9497J09453a84730e8045G8427e2294B46906i4488k08075
15865c02563a13381j68257A33382b83854G4975c31370a17396A26044Q1351b29322
15854a01690q0391r1595j6598i5263n4543j3807k33590J49716a17951A189M6807
$$ y = [61788, 119449, 155351, -535430, 242203, -288722, 175032, -320731, -16063, -22985, 155580, 27330, -253989, -7754, 48138, 243706, 79731, -261018, -160666, -199152, -17307, -56177, -3478, -211382, -22793, -56588, 85644, -60839, -161932, 131138, -123892, -13117, 30646, -60019, 15323, -158230, -153243, -54350, 49821, 75273, 27049, -67813, -45816, 32895, 59823, 183244, 72330, -28608, -161429, -164864, 4584, -260269, -166166, -101685, 22165, -178967, -128167, -150075, 166652, 197, -186754, 39427, 78924, 188377, -184730, -58045, 78427, -52294, 246906, -94488, -302563, -113381, -281638, 133382, -283854, 74975, -331370, -117396, 126044, 207395, -229322, -101690, -182081, -273676, -290274, -95263, -149806, -163613, -397203, -247487, -117951, 1189, 47996]
15843D7996i5014K2922B9894K2039K20737A2427R7416K6362g2914b5692k2630
15832d8322L403A5760c1548l87017a2711j80810B31048l5666n1856q096g0877
15820b77070A40982n3035N1991b02311D0940a02880B8331a42349A41869a01090
15809A27783J55702I0862a17394j34526H5860C0546g2506L2327I1073A1751f2606
15797a2114k46289g6021p296B37241e6392A22134b72200A44642b98827h3365A94028
15785a91264j23241i9723j6857A64617k7793J13558a71401b7840A2220b39147
15774f4804a2396j64890E6202O3055a43990C70184F6487B8576J34372B735e5892
15762b08143d8945j1955B46654D7582a07989L3330k99597C69034A30968a7273
$$ y = [47996, -95014, -72092, 29894, 51933, 272670, 12427, 109843, 136205, -72914, -25692, -48322, -44919, 15760, -31548, -418565, -12711, -193521, 231048, 195382, 143526, 135430, -70877, -277070, 140982, 87947, 139938, -202311, 40940, -102880, 28331, -142349, 141869, -101090, 127783, 283485, 90862, -117394, -251920, 85860, 30546, -72506, -40179, 91073, 11751, -62606, -12114, -258403, -76021, -83317, 237241, -56392, 122134, -272200, 144642, -298827, -83365, 194028, -191264, -314505, -99723, -116580, 164617, 136824, 250382, -171401, -27840, 12220, -239147, -64804, -12396, -177286, 56202, 119257, -143990, 370184, 66487, 28576, 162948, 2735, -55892, -208143, -48945, -60900, 246654, 47582, -107989, -74659, -374256, 369034, 130968, -17273]
15751b55947A04235D6546d673A21356k8538J27588c7536I4604c313j46610D5383
15739I4907f4384A16532L46m2574K9811A1164K48386k3997J00245E4796o525b13980
15726c0586n286A38726i5558F2801O994b62220D34590A29672j6544e9080j2681
15715g1761A66728a66978r8234N6680c4061D9937a2182n4825E3495a7455C49138
15703B48899o2328a69142G9957J5283O3474h0384A27162g026j65769h1922E3529
15691G7489J00938g1107l7267M7738B09824b72585c674k81115A31743g0933k84129
15680c55062A1320J58097b14603D7508L8456K3576e3878A72847A2494O7976a84163
15668g662l32779D3151a75564N3423A84565b60545c2426k81971E0360j4402K18726
$$ y = [-255947, 104235, 46546, -4673, 121356, 92818, 220406, -37536, 94604, -3313, -149923, 45383, 94907, -64384, 116532, 116878, 74304, 104115, 11164, 259550, 235553, 335798, 54796, 48271, -213980, -30586, -35872, 138726, -95558, 62801, 69795, -262220, 434590, 129672, 113128, -59080, -71761, 166728, -166978, -265212, -208532, -34061, 49937, -12182, -67007, 53495, -17455, 349138, 248899, 186571, -169142, 79957, 95240, 158714, -80384, 127162, -7026, -172795, -81922, 53529, 77489, 178427, -71107, -108374, -60636, 209824, -272585, -3674, -284789, 131743, -70933, -355062, 11320, 169417, -214603, 47508, 85964, 109540, -53878, 172847, 12494, 80470, -184163, -7662, -340441, 43151, -175564, -122141, 184565, -260545, -32426, -314397, 50360, 35958, 254684]
15657B54684I0489a50536r1107D29631A54327J6284d90195a0272l284A6235a57229
15645C3579b06586F5096K8528a7271A27643a4388j36012a054k26839g5606H3884
15633b15333a8662B5813K35611a08778o2945G2520d316j2553k6072D66890a881
15621a59525r1554L7228A19282c3238A17553P570b3055I4445P060A8370J50260
15610A68630c10043d9929A02136m8123J44554d1689o3161A39324b12278b992j91330
15599a94322h5044A74086h3920q0178A52921a68972F2439a5361E6304e09105D13821
15587a34003C1992a24524j88447a56425q617q9547c2434E7121a39557A63286k1637
15576A41649A320h597j1659A58615k4131a4569C37747g4516A91375F7361a53831
$$ y = [254684, 90489, -150536, -241643, 429631, 154327, 170611, -490195, -10272, -13556, 16235, -157229, 33579, -206586, 65096, 93624, -17271, 127643, -14388, -150400, -1054, -227893, -75606, 83884, -215333, -18662, 25813, 261424, -108778, -171723, 72520, -4316, -16869, -42941, 466890, -1881, -159525, -251079, -213851, 119282, -33238, 117553, 125123, -23055, 94445, 101505, 18370, 168630, -310043, -49929, 102136, 54013, 198567, -41689, -104850, 139324, -212278, -2992, -194322, -85044, 174086, -83920, -164098, 152921, -168972, 62439, -15361, 56304, -509105, 413821, -134003, 31992, -124524, -312971, -156425, -165042, -254589, -32434, 57121, -139557, 163286, 141649, 1320, -8597, -20256, 158615, 134484, -14569, 337747, -74516, 191375, 67361, -153831]
15564E0288J75612r2680a66395o7008D06552a83617j91305C90841h9752j5037
15554a04789B21124q4238m1664B9608c15908c8459k73456i8594p7160J0628j2709
15543a77835l7017E7294b28847q0377A33764d0544F9139b62610h9416j02954f629
15531a30298E4545j5647h9496B09532H5876b42217h2667l08012B83895a19933
15520c07256h1645B35179d639D39473B5496e7231j2145k50135e4401R164d860
15508A22177O96h4591B90466e5129D7317h610C1166e7541K4540j47364c1747B52818
15495D39159A71563a01280I0672L02756A25919m1122J54292J78102A74580H463
15484H5079j2083a04967H1780J63773r6341a22822A80652a05313c9726E506N6660
$$ y = [50288, 225900, 133220, -166395, -233403, 406552, -183617, -374922, 390841, -89752, -104789, 221124, 136886, 95222, 29608, -315908, -38459, -311915, -98594, -175754, -165126, -177835, -214852, 57294, -228847, -309224, 133764, -40544, 69139, -262610, -89416, -192370, -6629, -130298, 54545, 38898, -89496, 209532, 85876, -242217, -82667, -390679, 283895, -119933, -307256, -81645, 235179, -4639, 439473, 25496, -57231, -69376, -319511, -54401, -45237, -4860, 122177, 122873, -84591, 290466, -55129, 47317, -8610, 31166, -57541, -33001, -180365, -31747, 252818, 439159, 171563, -101280, 90672, 393428, 125919, 84797, 239089, 417191, 174580, 8463, 85079, 72996, -104967, 81780, 245553, 149212, -122822, 180652, -105313, -39726, 5506, 62166]
15473F2166P3158k3103k9828J06072r2359C0882a12250B38517l0093M2949J09201
15462C60574A57771a0598C45178j11349M40748k77810r2294j8047j25714N0562
15452B11274c4308C08418B7429l004f9844F4359a3331q0775j22307E8448g0611
15440b5094j27056B46245b9570C42510b97786B8601c0534j22706A07831O8111
15430A75942o5568K91917j90295R8683K92459p4581J58878k72358n6808A20567
15419a05848j50245B0118a22783D96150A32718O8636a97658l18141A20558J0154
15409A30712c03462A19257b8088A83372C9261K00123H152J5585g9115A93310f3950
15397B1520a98967B50143a75233A78408a79106F3873P6374O2483a36837B54123
$$ y = [62166, 135324, 112221, 82393, 188465, 96106, 30882, -112250, 238517, 208424, 251373, 360574, 157771, -10598, 345178, 233829, 674577, 396767, 304473, 286426, 160712, 211274, -34308, 308418, 27429, 24425, -69844, 64359, -13331, -94106, -216413, 58448, -70611, -25094, -152150, 246245, -29570, 342510, -297786, 28601, -30534, -153240, 107831, 175942, 110374, 402291, 211996, 310679, 603138, 528557, 687435, 415077, 358269, 120567, -105848, -256093, 20118, -122783, 496150, 132718, 201354, -197658, -515799, 120558, 130712, -303462, 119257, -28088, 183372, 39261, 239384, 8152, 23737, -79115, 193310, -63950, 21520, -198967, 250143, -175233, 178408, -179106, 63873, 140247, 202730, -136837, 254123]
15386a05225J3679f065j60155A09160a71148A67520C1268h2709A63553a79798
15375g8394B27346m4283B1729J67838F0500P1587D7234J37273a0909A06266a5670
15363a53923C03470j26740o0866E7922J14332K30459k00621k4932g0971A63286
15352F9495L3276J33564G139J60293J6768m2106A70L00241A6705L9030f9044A17321
15339C84090g5004A08568l8744J75473b0789C44897j51265b6435B38382a6532
15328B16553D7721L10265A00532L47076o0582j13464j30235J1420G2835K62410
15318C35245k7208p9883M1605N963A5063N8646a9088A82126L7609d0131A18256
15306a49055b4683G7379M3410C7826e3505A67650a55995B27663M6256G9610K42469
$$ y = [-105225, -91546, -6065, -166220, 109160, -171148, 167520, 31268, -82709, 163553, -179798, -78394, 227346, 183063, 21729, 189567, 60500, 132087, 47234, 184507, -10909, 106266, -15670, -153923, 303470, 176730, 115864, 57922, 172254, 402713, 202092, 177160, -70971, 163286, 69495, 102771, 236335, 7139, 167432, 184200, 142094, 170, 300411, 16705, 55735, -69044, 117321, 384090, -75004, 108568, 69824, 245297, -20789, 344897, 193632, -26435, 238382, -16532, 216553, 47721, 357986, 100532, 447608, 387026, 273562, 143327, 154747, 72835, 335245, 308037, 228154, 269759, 275722, 15063, 73709, -19088, 182126, 219735, -40131, 118256, -149055, -24683, 77379, 120789, 37826, -53505, 167650, -155995, 227663, 273919, 79610, 322079]
15295C22079E1187R3914K02056A38667p875A9405L0311J72830m387h9134A93719
15283a353A18310Q0439D5195e9719C81875b09521A11742A8930J24112K7698C729
15271B00099D8201g6670k49820B03944M0272g7972Q739C50318B5276K81853a25069
15259B76673Q9693H8851a14611A89830a6444E2557a80846j84214C11525a20023
15248B4538K74536a5317o8931i158L798A66775p7253A1197d3190B8777J01006
15237A29783d3811a2531A18888J09269J1367J28278q287J56779L62312L26536
15227A205142q7894J21290J32383D56052J11721A72863j8169h9193o3964j7139
15217a70296a0622A62186h3214L7787J0310E101h050n488j84574B72414o6763
$$ y = [322079, 51187, 145101, 347157, 138667, 130792, 19405, 49716, 222546, 218159, -89134, 193719, -1353, 118310, 198749, 45195, -59719, 381875, -209521, 111742, 18930, 143042, 170740, 3729, 200099, 48201, -76670, -326490, 203944, 244216, -77972, -69233, 350318, 25276, 307129, -125069, 276673, 366366, 88851, -114611, 189830, -16444, 52557, -180846, -365060, 311525, -120023, 24538, 299074, -15317, -84248, -9158, -5360, 166775, 89522, 11197, -43190, 28777, 129783, -43811, -12531, 118888, 228157, 239524, 367802, 359515, 516294, 878606, 1205142, 1117248, 1238538, 1370921, 456052, 567773, 172863, 154694, -89193, -153157, -170296, -10622, 162186, -83214, -45427, -35117, 5101, -8050, -13538, -198112, 272414, 205651]
15206B05651C622J78717C539L03290e2290I8388J84342J5045A05002k5705a84133
15194F7897a32529E2655R0012J57006I8394N0259b776G9567M585j2882a8176C2638
15181h9536A04298J7918a16651N4196k7529L2725j35090f1716B73367a12474A63486
15169B30138q5924o3883L3044D3056K12665a63937A50208J21987a46594B15239
15158D40644G1766a45563C55392e5424C5602b02001j56930A18270c29278A99120
15147A70608L4490a74412c0156j58186A30433e4481E3490d3934q69a9606C10793
15135G5558J78009o1725J08200p0812J75403A06999b58587R9941m1151C70464
15124B74634K2198G677a29722J400A14586K26166b28627H4677a13230m3458F1194
$$ y = [205651, 3622, 182339, 3539, 306829, -52290, 98388, 282730, 297775, 105002, 79297, -184133, 67897, -132529, 52655, 142667, 299673, 98394, 148653, -2776, 79567, 84152, 71270, -18176, 32638, -89536, 104298, 122216, -116651, -62455, -89984, -57259, -192349, -61716, 273367, -112474, 163486, 230138, 144214, 80331, 113375, 43056, 255721, -163937, 150208, 272195, -146594, 215239, 440644, 71766, -145563, 355392, -55424, 35602, -202001, -358931, 118270, -329278, 199120, 170608, 205098, -174412, -30156, -188342, 130433, -54481, 53490, -43934, -44803, -19606, 310793, 75558, 253567, 191842, 300042, 229230, 404633, 106999, -258587, -158646, -199797, 370464, 274634, 296832, 7677, -129722, -128322, 114586, 340752, -228627, 84677, -113230, -156688, 61194]
15112d4460B39641I2267N3729M02229a07933I9476K16694K10692D0153N37561
15102E77714B47703j0776J37810O1585j83750E1135N0299b14193A3514i2680E6223
15090A78007J00641F7227A5846J73851a14731B46470a5722B20345G0095a82760
15079a80691B91954A01275J72757b55p1956r1205B04134I5169N1207d6622k87
15068d6909A55343K70013q5895o0711a8192j22657B79821d0782m9490A99365q7508
15057A11857j0396p717J44098a75890E1365J28413J77539g4487C32162a23029
15046D10107k940a19579B76700j09332K78162p7929k4406J70566j14562j66616
15036B32583E5517J73249K3928M6795q7168M7666Q2853q0147F7974L20162g1609
$$ y = [-44460, 239641, 92267, 145996, 548225, -107933, 99476, 316170, 526862, 40153, 577714, 247703, 236927, 374737, 436322, 252572, 51135, 101434, -214193, 13514, -92680, 56223, 178007, 278648, 67227, 15846, 189697, -114731, 246470, -15722, 220345, 70095, -182760, -180691, 291954, 101275, 274032, -255, -72211, -163416, 204134, 95169, 146376, -46622, -46909, 155343, 425356, 339461, 278750, -18192, -140849, 279821, -40782, -90272, 199365, 111857, 101461, 93744, 237842, -175890, 51365, 179778, 357317, -74487, 332162, -123029, 410107, 407167, -119579, 276700, 167368, 445530, 367601, 343195, 513761, 399199, 232583, 55517, 228766, 252694, 299489, 212321, 259987, 342840, 262693, 67974, 388136, -71609]
15024D71010j98553J48292A42712K23248j27454J37719L1512j03897A09733M24069
15014E33802j47996K18465j47905A68368K52482j35325Q9928l4028K78961k07107
15004D13279K4543l7292P2261M0541o8699J27808j45378j45242K829A33033K90622
14993D23655L8704A49203L41285k27234K59750j86592j20504J22240J90970n4399
14983D74719o9607J53055q5986m4543C8028K1938L70143B09032K24509R9522j17806
14972D15257j44046K44771k04101K81395k31525L46493k94556K87914q2260k8849
14962E90493j70582j01246J79944B48599k3640N22317l41750j03353K65003L7270
14952F04446B66452L0392J03297q898b6359A58098K43400j59326K14307J63630
$$ y = [471010, 272457, 420749, 142712, 365960, 238506, 376225, 407737, 303840, 109733, 533802, 385806, 604271, 456366, 168368, 420850, 285525, 375453, 341425, 620386, 413279, 437822, 400530, 472791, 513332, 444633, 572441, 427063, 281821, 284650, 133033, 423655, 462359, 149203, 490488, 263254, 523004, 336412, 215908, 338148, 529118, 474719, 405112, 558167, 472181, 427638, 38028, 59966, 430109, 209032, 433541, 533063, 415257, 271211, 515982, 311881, 593276, 361751, 708244, 413688, 701602, 619342, 590493, 419911, 318665, 498609, 248599, 224959, 747276, 405526, 302173, 567176, 604446, 266452, 296844, 400141, 391243, -26359, 158098, 401498, 242172, 456479, 620109]
14942F20109k58674P3567N5460D7325J31407n2287L05691A27193J48309l9031
14932B36471A03970K66915J68001m8985j9031J88782k84004K52647j42936J69176
14922F54535C26930m6682J09491J63554J52489Q168m5402J8188J55818K35484
14912A078038l96225M12908L31498m8349J04897q395m42803R7209L80956n0556
14902A459178k08202J03919M35363m39048j0516k48289Q3896j81567k2963j57936
14892H13835l28193m1888q4507J5010P9882j1476R1609k21898j02520K06692c79894
14880B20533m3362L23591M6151L3063N1577j53740j96566E9426N63590j11407
14870E11609j44896J75954j89025K86753L0082k74689O0800R6143K48080o6044
$$ y = [620109, 361435, 435002, 490462, 47325, 178732, 126445, 432136, 127193, 275502, 236471, 103970, 370885, 538886, 489901, 470870, 659652, 375648, 628295, 485359, 654535, 326930, 280248, 389739, 553293, 705782, 713950, 668548, 686736, 842554, 1078038, 681813, 1094721, 1426219, 1377870, 1482767, 1474372, 1031569, 1128778, 1509734, 1459178, 1250976, 1354895, 1790258, 1351210, 1340694, 1092405, 1176301, 994734, 971771, 813835, 485642, 443754, 359247, 374257, 454139, 442663, 534272, 312374, 209854, 416546, -379894, 220533, 177171, 500762, 546913, 579976, 631553, 477813, 281247, 59426, 623016, 511609, 366713, 542667, 353642, 640395, 670477, 395788, 456588, 552731, 800811, 734767]
14860G34767k63486Q5878B58948J13053N0607N8837j55561P1237J21054L04795
14850H22970o5244k62082k26428O6683L28260j71080P1097j14546j53114Q1095
14840C77611J57987P599L727p18k29590q4564P1639J72262P1125A48961K02312
14829C51273J88756J75608j09551J18570J61785J87046J37011j79272n07538K44070
14819G67758k27403J47069j06346B55260J39859A42658P31157B73575K32928n5070
14809D51433N1004K14266k26773j80349L59603l6968M36819l02395J06383K55995
14799A129018B27092N95887l67712j13603j033K16788P3816r0199K30021k55824
14789E15233K76876j7932j79610J11788C37454M48025k71301m1795J21660P7267
$$ y = [734767, 471281, 557159, 258948, 372001, 422608, 481445, 325884, 397121, 518175, 822970, 757726, 495644, 269216, 335899, 664159, 493079, 564176, 449630, 296516, 377611, 535598, 543197, 546924, 546206, 316616, 232052, 303691, 475953, 547078, 148961, 351273, 540029, 715637, 606086, 724656, 886441, 1073487, 1210498, 1031226, 523688, 767758, 540355, 687424, 581078, 255260, 395119, 142658, 873815, 273575, 506503, 451433, 502437, 716703, 489930, 309581, 669184, 632216, 1069035, 766640, 873023, 1129018, 227092, 822979, 455267, 341664, 340631, 557419, 631235, 541036, 771057, 515233, 792109, 774177, 594567, 706355, 337454, 785479, 514178, 472383, 594043, 671310]
14779F71310k07801r4495j48483K06852n755j15159O916j25907L27430J6897J8394
14768E50199J29343k01679K50444k60842Q2075B46506M37688m3938j8379N14942
14758A136819m19508j89022J53327Q8643k48433m3501K8442j463J34603j0351
14748F29556k57162K73883k58586E3811L63596L44481L0312l51718M8318O6632
14738E55432L34693j45640n8324C35883N07887j63713l4779j79711J63664B08104
14727A016143m58681J98933O0548o3787l43625J251L05986j07555K59532p7042
14717G91703l8197j98018m354L68358J79521K5625L4244M9096J14073n8242k78769
14706I85040Q5114l30857J85406k33947L61878j13114C45609L76425j19984p9687
$$ y = [671310, 463509, 369014, 220531, 427383, 421628, 306469, 313385, 187478, 514908, 531805, 550199, 679542, 477863, 728307, 467465, 549540, 246506, 684194, 640256, 621877, 1136819, 717311, 528289, 681616, 770259, 521826, 478325, 506767, 505304, 639907, 629556, 372394, 646277, 387691, 53811, 417407, 761888, 792200, 440482, 488800, 555432, 890125, 744485, 686161, 335883, 843770, 680057, 645278, 465567, 629231, 208104, 1016143, 557462, 756395, 816943, 753156, 409531, 410782, 716768, 609213, 868745, 791703, 753506, 555488, 551134, 919492, 1099013, 1124638, 1158882, 1207978, 1322051, 1263809, 985040, 1070154, 739297, 924703, 690756, 1052634, 939520, 345609, 722034, 602050, 522363]
14696E22363O51004m73337P5686J30448M356N0794K66237k26191K1809k26874
14686G96295N21530l7149j14007J76636O2277l9774k64119p6175m8752j16836
14676H59926q5941K08784k50462o7357J28971J32561j9291R717O164k6703D20874
14664A111526n05618N8753R2358K92882k28995j05790J44534q786K17693k87774
14654G80783J44156k27432J27839j04694L38235r3615p6855M5469j35123M47616
14644A246379l57907k07222M67291l44162J36515L885r3248J20370K40487o5920
14634A146468j87464r2620K63823k03521J87070L01150k31977n3282k03499L12478
14624A238626l92255K79197l81741P9013L35916K4705k52121K19473j57722J05905
$$ y = [522363, 1173367, 700030, 775716, 906164, 910520, 961314, 1227551, 1001360, 1023169, 796295, 1317825, 1280676, 1166669, 1343305, 1405582, 1365808, 1101689, 1025514, 976762, 859926, 773985, 982769, 732307, 664950, 793921, 926482, 907191, 916908, 923072, 896369, 420874, 1111526, 605908, 664661, 757019, 1049901, 820906, 715116, 859650, 850864, 1068557, 780783, 924939, 697507, 825346, 720652, 1058887, 965272, 888417, 933886, 798763, 1246379, 888472, 681250, 1148541, 804379, 940894, 944779, 851531, 971901, 1212388, 1146468, 959004, 866384, 1130207, 926686, 1113756, 1414906, 1182929, 1129647, 926148, 1238626, 846371, 1125568, 743827, 822840, 1158756, 1183461, 931340, 1150813, 993091, 1098996]
14614A098996l5276J97032o8772k30792K11878q3228J52791Q628l36320M0986
14604I55923J54412K63042j76355k25278N04599l38241j57917K23782Q5667M2735
14594A332369j1707K88962l38953o5865J85642k25452O7910L56965k97298J13949
14584A406522j72346J21790k2547j03533J69913R3831m0813J82050m7107J23492
14574A711252m3262j77057k7283k58144M43063k04947L91940m68444K75353J39571
14564A782042k72415R9421O307K80205K8956n33341L00323m7722O11962n95957
14554A659781O09190p23656O50275K4670J97469k18012k05613M75084k29026J60235
14544B400397R7657J27621K27489R7277J81N06701N68916J27362P90327J293190
$$ y = [1098996, 1063720, 1260752, 1191980, 961188, 1173066, 1089838, 1242629, 1251257, 914937, 955923, 1110335, 1373377, 1197022, 971744, 1476343, 1138102, 980185, 1203967, 1289634, 1332369, 1320662, 1609624, 1270671, 1204806, 1390448, 1164996, 1232906, 1589871, 1292573, 1406522, 1234176, 1355966, 1333419, 1229886, 1399799, 1493630, 1452817, 1634867, 1587760, 1711252, 1667990, 1490933, 1463650, 1205506, 1648569, 1443622, 1835562, 1367118, 1642471, 1782042, 1509627, 1609048, 1615355, 1895560, 1924516, 1391175, 1691498, 1643776, 2255738, 1659781, 2268971, 1545315, 2195590, 2220260, 2417729, 2199717, 1994104, 2469188, 2240162, 2400397, 2498054, 2625675, 2853164, 2950441, 2950622, 3457323, 4026239, 4153601, 4943928, 6237118]
14534F237118K563424L964888O094709Q323705N83029r950401p756096l819696
14526F240680j456483r22573L46611m54464r58412m42446l1622k30695j26206
14517A964390N5408j45748q2799L91466l78401M25170l08493Q2801j68534N16865
14507B352125j29402q4334L5264L9598L7139J78920K8615n45181O30612j42974
14497B400382j0698K62950m66697J24269m5824K46419q6214L77526k32646k30535
14487B338932J84639q5463K08318j02488j9016L62270k48648k23506N66521o2641
14477B918918j02182J87956m23505J71061L87490K49364m91347P1042j8704K44210
14467C194303j93839L59379R6808j03035j11138J87441k3208O7665j7248K77998
$$ y = [6237118, 8800542, 12765430, 18860139, 27183844, 27766873, 17816472, 10060376, 6240680, 4784197, 3861624, 4208235, 3753771, 2795359, 2352913, 2321291, 2090596, 1964390, 2019798, 1874050, 1791251, 2182717, 1804316, 2229486, 1920993, 2003794, 1835260, 2352125, 2222723, 2138389, 2173653, 2213251, 2250390, 2429310, 2457925, 1912744, 2543356, 2400382, 2389684, 2652634, 2185937, 2310206, 2264382, 2510801, 2424587, 2802113, 2569467, 2338932, 2523571, 2438108, 2646426, 2543938, 2524922, 2887192, 2638544, 2415038, 2981559, 2918918, 2816736, 3004692, 2581187, 2752248, 3139738, 3389102, 2897755, 2968797, 2950093, 3194303, 3000464, 3359843, 3456651, 3353616, 3242478, 3429919, 3406711, 3474376, 3457128, 3735126]
14457C735126l00788J26492P3424J48845j7568o6448J78645J14225N8160K7424
14447D077537n6668J19081j90726L23536k73916N11902k21826K16418n1590o5547
14437D388201q2129K94102j08992K31407P4200Q3033N715q1462o2733K24108L52728
14426E318178l02875J03280J67858R5386J26973j30140M3622M55193l27891K21037
14416E770621L25051K00880m33038K18241P246P5857k61699K41527L60516M7680
14406F552882J34536J36581P150M23391J2149M10272j48178R8980l31338K49014
14396G545439k24959L43099L69643J39733K6550K02702K21975K92635j62856L28121
14386I082082M85993m73513K44912L44883q12317R24450N196K00691L75326l4115
$$ y = [3735126, 3434338, 3560830, 3634254, 3783099, 3765531, 3699083, 3877728, 3991953, 4050113, 4077537, 4020869, 4139950, 3949224, 4272760, 3998844, 4510746, 4288920, 4505338, 4453748, 4388201, 4306072, 4600174, 4491182, 4722589, 4796789, 4879822, 4885537, 4804075, 4741342, 4965450, 5318178, 5015303, 5118583, 5286441, 5381827, 5508800, 5378660, 5422282, 5877475, 5549584, 5770621, 6095672, 6296552, 5863514, 6081755, 6089001, 6164858, 5903159, 6144686, 6505202, 6552882, 6687418, 6823999, 6831149, 7254540, 7266689, 7676961, 7528783, 7627763, 7296425, 7545439, 7320480, 7663579, 8033222, 8172955, 8199505, 8402207, 8624182, 8916817, 8753961, 9082082, 9568075, 9094562, 9339474, 9684357, 8872040, 9796490, 9801686, 10002377, 10377703, 10343588]
14376A0343588j1784L74039J02683O7456M21140L03458K6969L24512J70359J78919
14366A2301339M19576K96261k8199K65550O02467J16569l5052J69563L06628K42334
14356A4657036L23867L84626N09689K61895K10722P06663N9713N51156K41078
14347A7906445O76448M3537L96637L03479N13549R6149Q94977L18357P12329L14466
14337B2176373M32850N36134P60422O50488M11115Q93049N82783Q28960L21946
14328B7594120R28066J242325L24929P87158R65115J104793P96088J108154J017780
14319C5868528Q67336J138153J444906J110984J302551J181059J194826J607509
14311D5715852J972443J355676J937817J594672J924038K119588K101005K148094
$$ y = [10343588, 10331804, 10705843, 10808526, 10875982, 11297122, 11600580, 11627549, 11952061, 12122420, 12301339, 12720915, 13017176, 12988977, 13254527, 13856994, 13973563, 13938511, 14108074, 14414702, 14657036, 14980903, 15365529, 15875218, 16137113, 16347835, 17054498, 17114211, 17665367, 17906445, 18582893, 18626430, 19023067, 19326546, 19840095, 19936244, 20831221, 21149578, 21861907, 22176373, 22609223, 23145357, 23905779, 24556267, 24967382, 25860431, 26443214, 27272174, 27594120, 28522186, 29764511, 30089440, 30876598, 31841713, 32946506, 33742594, 34850748, 35868528, 36735864, 37874017, 39318923, 40429907, 41732458, 42913517, 44108343, 45715852, 47688295, 49043971, 50981788, 52576460, 54500498, 56620086, 58721091, 60869185]
14303F0869185K257460K483792K680887K472797K845348K949643L450141K836003
14295H2845256L567632M131202M098012M456291M339216M513910N248287N552640
14287A18752446N937517O026334O733401O991186P831836P890459Q536342R683654
14279A78383175J0099027J0696556J0850190J2393775J2262002J2456872J3099133
14272B60240730J3483253J3858882J3928455J4571424J4471970J4204022J3942935
14265C58701671J3304264J2929120J2718611J1527440J1145086J0267681Q309025
14258D38902898K840451q7355j70494J274184j536603p395758m879710o827798
14250D22119815q878355j2125670j3560176j5023219j5385882j5907687j5480224
$$ y = [60869185, 63126645, 65610437, 68291324, 70764121, 73609469, 76559112, 80009253, 82845256, 86412888, 90544090, 94642102, 99098393, 103437609, 107951519, 113199806, 118752446, 124689963, 130716297, 137449698, 144440884, 152272720, 160163179, 168699521, 178383175, 188482202, 199178758, 210028948, 222422723, 234684725, 247141597, 260240730, 273723983, 287582865, 301511320, 316082744, 330554714, 344758736, 358701671, 372005935, 384935055, 397653666, 409181106, 420326192, 430593873, 438902898, 441743349, 441655994, 441485500, 442759684, 441223081, 433827323, 428947613, 422119815, 413241460, 401115790, 387555614, 372532395, 357146513, 341238826, 325758602]
14243C25758602j5642504j4799623j4491025j4611442j3541179j3062668j2376222
14236B27233939j1289602j0803970r758714r801532r506471q991973q416943p884081
14228A50780653p352590p252324o213718n999263o000119n232034n060764n202642
14220A02467199m544469m225598l953104l909791l325637l386481l065527l046731
14212G3009861k853373k796359k778723k111988k472724k269680j614965k449704
14204E3662345j488093k045548j528541j771686j497993r22260j790675j048616
14196D1568933j305922j565552j070872q85121m78407j363175r77238j245929
14188C2676717j209032k78737o24811j160115l85233j208369m40782o39646j137837
$$ y = [325758602, 310116098, 295316475, 280825450, 266214008, 252672829, 239610161, 227233939, 215944337, 205140367, 195381653, 185580121, 176073650, 167081677, 158664734, 150780653, 143428063, 136175739, 129962021, 123962758, 117962639, 112730605, 107669841, 102467199, 97922730, 93697132, 89744028, 85834237, 82508600, 79122119, 76056592, 73009861, 70156488, 67360129, 64581406, 62469418, 59996694, 57727014, 56112049, 53662345, 52174252, 50128704, 48600163, 46828477, 45330484, 44408224, 42617549, 41568933, 40263011, 38697459, 37626587, 36741466, 36263059, 34899884, 33922646, 32676717, 31467685, 31188948, 30564137, 29404022, 29018789, 27810420, 27369638, 26729992, 25592155]
14179B5592155n04966n09906q17338o15196o42017m35141l49951l79519o18762
14170B0719359r73476L3202p87906k07889m73603m13716m45589J62220j130197
14161A6482405j35069j23530k08413k23129m69874m38484o72156J21463l58923
14152A3974290l70947q9424l18937l43981l24239K64269o05841k53446J03445
14143A2035189l53411l17435n5171l76429J11310l56506k10667M8554m23895q7152
14133A0014387r3942l84389O5115l21883J65142o92145K16438k41536L1606M0941
14123H799734n13710j72370K82135n7111m11553k57945J67624k99724K91563p06474
14113G122169J60664K74377p79086N2301N5521k62719K9692K91858n79108K38393
$$ y = [25592155, 25087189, 24577283, 23759945, 23144749, 22502732, 22067591, 21717640, 21338121, 20719359, 19745883, 19779085, 18991179, 18783290, 18309687, 17895971, 17450382, 17612602, 16482405, 16347336, 16223806, 16015393, 15792264, 15322390, 14883906, 14211750, 14333213, 13974290, 13603343, 13513919, 13194982, 12851001, 12526762, 12791031, 12185190, 11931744, 12035189, 11681778, 11364343, 11309172, 10932743, 11044053, 10687547, 10476880, 10525434, 10101539, 10014387, 9920445, 9536056, 9601171, 9279288, 9444430, 8752285, 8968723, 8727187, 8758793, 8799734, 8286024, 8113654, 8395789, 8338678, 7927125, 7669180, 7836804, 7537080, 7828643, 7122169, 7282833, 7557210, 6778124, 6830425, 6885946, 6623227, 6652919, 6944777, 6365669, 6604062]
14103F604062N8090m59199q3184j92349j1228m7940K05767n45373K81409l43800
14093E466255J21219j15229k63758K63443j52116J52521k46736p4891j17992p4244
14083D958472M2002J96178k03476l04222J06378j1094q6042k25009J49477k8175
14073D594489m12200N0704L26975m87290M14637k85624k38768J15215k85210J01053
14063C893981J50912k69703K25765n08640L30530k11003p1379K36541l11640J8401
14053C483765J27849M3476K53793k46913j68164k59182L0565L10742l38110J63389
14043C401210o3718j5246j48406K66314k92066J47448m51367K32402Q5031K4876
14033C186478l68729K11020k01303q0516N0785K02471k75186O0569j58259P1056
$$ y = [6604062, 6662152, 6202953, 6119769, 5927420, 5916192, 5868252, 6074019, 5528646, 5810055, 5466255, 5587474, 5472245, 5208487, 5471930, 5319814, 5472335, 5225599, 5150708, 5032716, 4958472, 5000474, 5196652, 4993176, 4688954, 4795332, 4784238, 4698196, 4473187, 4622664, 4594489, 4182289, 4232993, 4559968, 4072678, 4487315, 4201691, 3962923, 4078138, 3792928, 3893981, 4044893, 3775190, 4000955, 3492315, 3822845, 3611842, 3540463, 3777004, 3465364, 3483765, 3611614, 3655090, 3908883, 3661970, 3493806, 3234624, 3265189, 3575931, 3237821, 3401210, 3337492, 3322246, 3173840, 3440154, 3148088, 3295536, 2844169, 3076571, 3161602, 3186478, 2817749, 3028769, 2827466, 2746950, 2797735, 3000206, 2725020, 2785589, 2627330, 2698386]
14023B698386K02316j88483J56481m5533j03934j30909L4201j48347j14611j75882
14013B183685K22514J965L5685q1136J40704n2718L7777j46773j12968k2510L4986
14002B241211j809j29915J71351m60551J67611N7677R0864k774j12879O9330K27459
13991B317575l22503k99115K81098j54103J34726j41562J51430J90288m66793
13982A691041P6184J03772Q7291K05201K72592L33493J47936O87225J778698L666433
13972I049866N349269Q708533N993607p486924p846025n162670k240274j514045
13964D851337q93101l11087l93242m02890m29121K79792j03699k8183n31258K01569
13954B240117p1165j1170K02804j74262m9695j00480j92761M22025l79099j89468
$$ y = [2698386, 2900702, 2712219, 2868700, 2823167, 2719233, 2588324, 2622525, 2474178, 2359567, 2183685, 2406199, 2408164, 2443849, 2362713, 2503417, 2450699, 2488476, 2341703, 2228735, 2206225, 2241211, 2239402, 2109487, 2280838, 1820287, 1987898, 2045575, 2136439, 2133665, 2020786, 2090116, 2317575, 1995072, 1695957, 1977055, 1822952, 1957678, 1816116, 1967546, 2157834, 1691041, 1767225, 1870997, 1958288, 2163489, 2436081, 2769574, 2917510, 3604735, 5383433, 9049866, 14399135, 23107668, 29101275, 21614351, 13768326, 8605656, 6365382, 4851337, 3958236, 3647149, 3253907, 2851017, 2421896, 2701688, 2597989, 2569806, 2038548, 2240117, 2168952, 2157782, 2360586, 2186324, 2136629, 2036149, 1843388, 2265413, 1886314, 1696846]
13944A696846N35778k21501l39610n4757k46883N65286j85812k68180K75342l06322
13934A450187J16471J72924j93622J14448J32818n93439J83779k2576M3451J72931
13924A577372j81227r0980o9764K53170j16186P5083J2874k47190J19217P5017
13914A407386J37337k99109j21163J32951K41838k42609k24154P4274J99448j59320
13904A146879L66344J10704l79591o2858N0470k81764L21116j4222j6531j39228
13894A101319J02036J15796j47418r6360R6010j760j62633J70530r5726L93738
13884A475532l96693K52183N768k15964k34547K95123l5793p7094o5379K30718
13874A233854q5415l8204K80120l22120k54513L94692k05388J56364Q0685K0563
$$ y = [1696846, 2232624, 2011123, 1671513, 1616756, 1369873, 1935159, 1749347, 1481167, 1756509, 1450187, 1566658, 1739582, 1545960, 1660408, 1793226, 1199787, 1383566, 1360990, 1404441, 1577372, 1396145, 1305165, 1235401, 1488571, 1372385, 1447468, 1460342, 1213152, 1332369, 1407386, 1544723, 1245614, 1124451, 1257402, 1499240, 1256631, 1032477, 1106751, 1306199, 1146879, 1513223, 1623927, 1244336, 1181478, 1231948, 950184, 1271300, 1257078, 1240547, 1101319, 1203355, 1319151, 1171733, 1075373, 1171383, 1169623, 1006990, 1177520, 1081794, 1475532, 1078839, 1331022, 1336790, 1120826, 886279, 1181402, 1145609, 1068515, 1003136, 1233854, 1148439, 1110235, 1390355, 1068235, 813722, 1208414, 1003026, 1159390, 1240075, 1260638]
13864A260638m84429Q0601J23321K71806l68184m9770J81763J08482r5606K35315
13854A263937E92047K56677k23970j8289K40768l3943J47276l435l30528K57243
13844H83846J74272M692k95464k38598J92694K36115k57729j5048j01041K84058
13834H67797j54381L0932M36884j87780k65680l559J12568J02038j33370r6657
13824G08792J54107J0453j34056L58001k05640k04822J15620J35823K01430m34079
13814G05629l03121L52571p66j28126M6176r6879N65408m38904n7509K29494n1231
13803H22742p3775p789N37310n16867k34200L36780j96445r2161O5875l0346K62472
13792H73596L4124k26884J29672l19012J34852m057L5120A34509O94909Q7778
$$ y = [1260638, 776209, 856810, 980131, 1251937, 883753, 833983, 1015746, 1124228, 1028622, 1263937, 592047, 848724, 624754, 606465, 847233, 813290, 960566, 957131, 626603, 883846, 1058118, 1062810, 767346, 528748, 721442, 957557, 699828, 684780, 583739, 867797, 713416, 744348, 1181232, 993452, 727772, 724213, 836781, 938819, 805449, 708792, 862899, 873352, 739296, 1097297, 891657, 686835, 802455, 938278, 1139708, 705629, 402508, 755079, 754313, 626187, 672363, 575484, 1140892, 701988, 644479, 873973, 822742, 748967, 741178, 1278488, 761621, 527421, 864201, 667756, 575595, 641470, 611124, 873596, 907720, 680836, 810508, 491496, 626348, 622291, 657411, 134509, 829418, 917196]
13782I17196k66412j42675j13919M10698j03566j70069L72168k43398k02564K33849
13772F91308j57287K64879o2175l55371M1233r6562K75722j53948K73734l3951
13762F87582k49001J86927m1920J05619B52124N05186j60250k34734O7250K29590
13752F59166L5985k17984J29404q4870k710O130O5510J27001r3184k70321l9059
13741C15068J72040L40575k37359K4505n8754Q7816j00795P4444j04887q8558
13731D24095K42870J05716l48553K03689J4124o1070j06506B29979n0256M17227
13721E96950k90755L63465j34321p5025j98082L64109L5739J23218l15333o2782
13711D07183J49044J41743k42541J02024O0818L509j12141K80455C16281J25073
$$ y = [917196, 650784, 508109, 394190, 804888, 701322, 531253, 903421, 660023, 457459, 691308, 534021, 798900, 736725, 381354, 422587, 326025, 601747, 447799, 721533, 687582, 438581, 625508, 583588, 689207, 252124, 757310, 597060, 362326, 429576, 659166, 695151, 477167, 606571, 521701, 518991, 525121, 590631, 717632, 624448, 354127, 315068, 487108, 827683, 590324, 614829, 556075, 643891, 543096, 617540, 512653, 424095, 666965, 772681, 424128, 627817, 641941, 580871, 474365, 229979, 179723, 596950, 306195, 669660, 535339, 460314, 262232, 626341, 662080, 785298, 469965, 407183, 556227, 697970, 455429, 557453, 618271, 621780, 509639, 790094, 316281, 441354]
13701D41354p1237K87366j70123m3932P5552k51427L50980l08911L6777j64087
13691A82312J31125K31580j81055K29792k66325m817Q9625M0579J77675j83856
13681D46635I9467L09839j44503M69236j53472j58557J47843B09909J5157J7765
13671B42831L9456J35627J78148A44668M34441j39809j95029L24941k07815j37789
13661B23608R6353n3975P2351J8264G9825K23881K6124J2360N4936q1834J03436
13650D18728B7322M24052Q1670k03223L37040A49500J89250j48768L48720B23779
13639E09679o6219n1544j86303M1700j0827J70677D0388M58260j09893N145K9848
13628D23748M8957j79713A8779N1483K11196J37366p6820l7115P2783O5371a717
$$ y = [441354, 370117, 657483, 487360, 443428, 518980, 267553, 618533, 309622, 346399, 182312, 313437, 545017, 363962, 593754, 327429, 322612, 412237, 452816, 630491, 446635, 99467, 409306, 264803, 734039, 580567, 422010, 569853, 209909, 225066, 242831, 282287, 417914, 596062, 144668, 579109, 439300, 244271, 569212, 361397, 223608, 319961, 265986, 338337, 356601, 79825, 303706, 329830, 342190, 397126, 315292, 418728, 27322, 451374, 533044, 329821, 666861, 149500, 338750, 189982, 538702, 223779, 509679, 443460, 391916, 205613, 247313, 236486, 407163, 40388, 498648, 388755, 393900, 423748, 472705, 292992, 18779, 70262, 281458, 418824, 342004, 304889, 377672, 443043, -1717]
13616D69505K621G3287L65105j11532K0264A25083K59634B4084J86171j7270M47574
13605F40559C1926M6786J71384A10647J79984R8637A88186f0502A41314L11624
13595D52938r2852J6466A78119K73018j55529h1699A60399J50541k3646O1496
13585C48790M167J19634B23194j07637K25087j66492L00881B16584K08013Q1560
13575E06157j05182J37133A94404O9432F9548k2767J13525J46801J87306j58167
13565C36246K3051J00984j39297A47197N67089A73572K05399A05164Q3286e6904
13554A18068K69274G2060J04526b7104A42109o8814J84710j18886J55135n187
13544B89067j27663m0913K03386j3601J2696j9324q8065q2177J67068l0319m6243
$$ y = [469505, 472126, 73287, 438392, 326860, 347124, 125083, 384717, 24084, 210255, 192985, 640559, 31926, 78712, 250096, 110647, 290631, 389268, 188186, -60502, 141314, 452938, 360086, 376552, 178119, 451137, 295608, -81699, 160399, 310940, 287294, 348790, 352957, 472591, 223194, 115557, 340644, 174152, 475033, 216584, 424597, 506157, 400975, 538108, 194404, 263836, 69548, 46781, 160306, 307107, 494413, 336246, 359297, 460281, 320984, 147197, 714286, 173572, 378971, 105164, 188450, -56904, 118068, 387342, 72060, 176586, -27104, 142109, 73295, 258005, 139119, 294254, 289067, 161404, 120491, 323877, 310276, 322972, 303648, 215583, 133406, 300474, 270155, 223912]
13533B23912J32769J2858q4453n7524P0692L6596m1845n9177n6685L52378F9385
13521E47744b7580A52645P6418p1601R9542m3039L43396I1585g6096g052B37961
13509E81832B76466j03769G0080J39472k8757P905F2028J02366J48855j47080
13499A66169O755J74234c5646A14960E6069O8300a24992C74997A80059a56124
13488A78235N6556m3017F4775a93637f0771A46889K61106B8902a68559A61631
13477C20822G3222a54694C91574A2595M99819a288k08623D01159j42806J06935
13467C65288D5478L65259p7531A17571c6307b226B58712J19218M8723I8451J68714
13456B67165l2392B1002P3817L7538K60035e3103B62400j15564J03130A12118
$$ y = [223912, 356681, 369539, 285086, 227562, 298254, 334850, 293005, 233828, 177143, 529521, 69385, 547744, -27580, 152645, 229063, 157462, 257004, 213965, 557361, 91585, -76096, -7052, 237961, 581832, 276466, 172697, 70080, 209552, 180795, 188700, 62028, 164394, 313249, 166169, 172924, 347158, -35646, 114960, 56069, 124369, -124992, 374997, 180059, -156124, 178235, 234791, 191774, 64775, -193637, -60771, 146889, 407995, 28902, -168559, 161631, 320822, 73222, -154694, 391574, 12595, 512414, -1288, -209911, 401159, 258353, 365288, 45478, 410737, 333206, 117571, -36307, -2226, 258712, 377930, 426653, 98451, 267165, 234773, 21002, 94819, 132357, 392392, -53103, 262400, 146836, 249966, 112118]
13445A59049J37376A15227Q7561A9970M12451i9149A65280J18052J42948A63158
13434D2707J22090P779n538k8168b63151B81223o7464b1447C60601k9861A12296
13422A12996J8408d4700F7554b35000d2935D55134A46237J84949m0883I3025f7889
13410A58121L9419J37664a08045C09041B9501Q4121J35749H6362b2040A3035K03420
13399B16455d2600A25866J53625A22970M73185I0260m1914j042L02557J39310
13389D89171k12158M2793G5984J83046D6073d547B40073b7667C89424a04340H390
13377C07507p5049J35898a76092C37708j01321a56213L8046E4386a75375A15685
13366I2580d7259B91448G6360K34149j12280M67286j03727q7618j30522K8718
$$ y = [159049, 296425, 115227, 202788, 19970, 432421, -99149, 165280, 283332, 426280, 163158, 42707, 164797, 172576, 167038, 138870, -263151, 281223, 213759, -21447, 360601, 330740, 112296, 112996, 131404, -44700, 67554, -235000, -42935, 455134, 146237, 331186, 290303, 93025, -67889, 158121, 197540, 335204, -108045, 309041, 29501, 113622, 249371, 86362, -22040, 13035, 216455, -42600, 125866, 279491, 122970, 596155, 90260, 48346, 47304, 349861, 489171, 277013, 319806, 75984, 259030, 46073, -4547, 240073, -27667, 389424, -104340, 8390, 307507, 232458, 368356, -176092, 337708, 236387, -156213, -118167, 54386, -175375, 115685, 92580, -47259, 291448, 76360, 310509, 198229, 665515, 561788, 474170, 343648, 372366]
13356C72366m2927J0308o5152J42215C9131G274L3420g3655A92278J48147I7545
13344A5659L67186a67931B5091b7669F8581b6856j68591j4863B80020A16133J83377
13333B99510A33139k4408f782B77134p9658l8194B7605J45007Q5051a4611C04881
13321B75804B0922a22986e2795A06398K64795D9307L65004d72A01225J17323K25455
13310D44003B5999N6226C8332K36582j07439K05295e7815B50977o8347K45818
13300D28448B09702r0959b72189A23127K00271c1329A59448A642K081e6587B65015
13288E5513L9238l5885K14459K56932A31161a54995d1284k30335A61904n1630
13278A10274l303l9702J62910q8778L1788b55607P8808C70992H6242K45040a08793
$$ y = [372366, 329439, 339747, 274595, 416810, 39131, 7274, 40694, -73655, 192278, 340425, 97545, 15659, 382845, -167931, 25091, -27669, 68581, -26856, -195447, -210310, 280020, 116133, 299510, 133139, 108731, -6782, 277134, 197476, 159282, 27605, 172612, 257663, -14611, 304881, 275804, 20922, -122986, -52795, 106398, 371193, 49307, 414311, -472, 101225, 218548, 444003, 25999, 82225, 38332, 274914, 167475, 372770, -57815, 250977, 182630, 428448, 209702, 118743, -272189, 123127, 323398, -31329, 159448, 1642, 3723, -56587, 265015, 55513, 94751, 58866, 273325, 530257, 131161, -154995, -41284, -271619, 161904, 110274, 106971, 67269, 230179, 141401, 173189, -255607, -176799, 370992, 86242, 331282, -108793]
13266B4931A26a76851j93378a30980d9827C2340L08630h6430A84126l7064J22293
13255B69355c49251A26272a05241k7428C40138c8904H5893a99164A82096D3372
13244E220L20229d6675B76118j08856J79911a27729F1730J73778m182a96481B25479
13232D9863a51367H2970J54859c8721B6986J14254f7286F6728f7585C46829a47799
13220a13239A81416b72129a21087A24992f0700l7952j54296A94208a10115A54513
13209A76327b43959a05216I608J77771b55251B45144d6730r8285O769E857K18702
13198B24559J61648B6054J73748i8056A64795O2353q0957g9351B61613j6175E4895
13186A9478a06542B70903A0881o32K08222j9747b06484I5438k1640e6764J0138
$$ y = [24931, 126, -176851, -370229, -130980, -49827, 32340, 340970, -86430, 184126, 147062, 269355, -349251, 126272, -105241, -132669, 340138, -38904, 85893, -199164, 182096, 43372, 5220, 325449, -46675, 276118, 167262, 347173, -127729, 61730, 235508, 231326, -196481, 225479, 49863, -151367, 82970, 237829, -38721, 26986, 141240, -67286, 66728, -67585, 346829, -147799, -113239, 181416, -272129, -121087, 124992, -60700, -98652, -252948, 194208, -110115, 154513, 176327, -243959, -105216, 9608, 187379, -255251, 245144, -46730, -145015, -138246, 5857, 224559, 386207, 26054, 199802, -98056, 164795, 227148, 146191, -79351, 261613, 245438, 54895, 19478, -106542, 270903, 10881, 10249, 218471, 198724, -206484, 95438, 73798, -56764, -46626]
13175d6626n1645B86793i580j52442C484a89774C365J3131Q3099J50387a4812
13163a44994l3010A99348B4920d5475I9424d9077j84869c3331G7583O4871D2181
13151B52904o4437q7617C3474K19529o8949P5028j06982o3945d8339G8858O0108
13140A38966c1231n5433E7704c7956C75447g0016A39309L0543F9433b29259D8236
13128I2940B5205J12114j9925a22321B87306q8316N0461b2229A91655a18350A78892
13116A10369d6059D18079d5434A21669i7269C88958e0698B25938A11742a31335
13105g472A92697r6346m136O3172a77978A47883B4291K96146a02137A32596O1376
13094A93972J73172I7807K00071A07766e31186a06761l1527H4196f8784l9551
$$ y = [-46626, -98271, 286793, -9580, -162022, 3484, -189774, 3365, 16496, 99595, 249982, -14812, -144994, -178004, 199348, 24920, -45475, 99424, -49077, -233946, -33331, 77583, 142454, 42181, 252904, 188467, 100850, 33474, 253003, 184054, 259082, 152100, 88155, -48339, 78858, 138966, -31231, -86664, 57704, -37956, 375447, -70016, 139309, 169852, 69433, -229259, 48236, 92940, 25205, 137319, 117394, -122321, 287306, 198990, 249451, -22229, 191655, -118350, 178892, 110369, -46059, 418079, -45434, 121669, -97269, 388958, -50698, 225938, 111742, -131335, -7472, 192697, 96351, 92215, 155387, -177978, 147883, 24291, 320437, -102137, 132596, 193972, 367144, 97807, 297878, 107766, -531186, -106761, -138288, 84196, -68784, -108335]
13084a08335C4376c0222A66380a11291j14625Q6218K4498L0653m0920A65103a61188
13072B03584a3901C00376M293b43751A12776m8590c08896A11773J05514K6470
13062B43757E6988f1969A86154B4994J04060M0769a06098n9353A04674q739l0988
13051F4947k6891N4869c0538k257C4572J39450m5860C3399K63235a93841A08754
13039a42949C29016A00048D1026a40508B00117q1652J12538q1066B7284a62528
13028b20737D3638G985J46157A7873H000K65878i8006l39265d2715n6746A1294
13016C29L86181A00382B320K32773g4745A66719d0552A08715a19341j73165J27834
13005a64672B86725A13582Q6924a5049j43934B573K85823b78355A25062a42427
$$ y = [-108335, 34376, -30222, 166380, -111291, -225916, -139698, -115200, -84547, -125467, 165103, -161188, 203584, -13901, 300376, 304669, -243751, 112776, 64186, -308896, 111773, 217287, 243757, 56988, -61969, 186154, 24994, 129054, 169823, -106098, -165451, 104674, 95935, 64947, 38056, 92925, -30538, -32795, 34572, 174022, 128162, 33399, 296634, -193841, 108754, -142949, 329016, 100048, 41026, -140508, 200117, 118465, 231003, 149937, 27284, -162528, -220737, 43638, 7985, 154142, 17873, 8000, 273878, -98006, -437271, -42715, -99461, 11294, 329, 386510, 100382, 2320, 235093, -74745, 166719, -40552, 108715, -119341, -292506, -164672, 286725, 113582, 200506, -15049, -158983, 2573, 288396, -278355, 125062, -142427]
12994a32089H3867b87951C7658P4040D6340J34062a73299I8575b37365m774B04976
12982B82168A16036M2693Q5371l9943h8889l9474C01421f2310j55695A75972a39480
12970D6024L53068G6240B9946P46J57609J09356a57365j0726A38721k9115g0214
12958D6804aA49532c3551D6730O145G461h3260a2128j55722P3750A60534i5814
12945a03398A75809J69747b03796L5420M0908A17646c69479C92403b35999e7594
12934a08027l3358G6609J08157J36312C0172a32849M1765A34095d5664A83764
12923A03478P6023a03532n2046c3995j66741F5724B1856J235a53276c7919e015
12911B94185A35559D9571q665h9884k3665A18041h1049j85082N6960F7399a24944
$$ y = [-132089, 83867, -287951, 37658, 111698, 46340, 180402, -173299, 98575, -237365, -242139, 204976, 282168, 116036, 158729, 244100, 204157, -88889, -128363, 301421, -62310, -218005, 175972, -139480, 46024, 399092, 76240, 29946, 30692, 188301, 297657, -157365, -168091, 138721, 109606, -70214, 46804, -1, 149532, -33551, 46730, 52875, 7461, -83260, -12128, -167850, -94100, 160534, -95814, -103398, 175809, 345556, -203796, -168376, -127468, 117646, -369479, 392403, -235999, -57594, -108027, -141385, 76609, 184766, 321078, 30172, -132849, -91084, 134095, -45664, 183764, 103478, 179501, -103532, -155578, -33995, -200736, 65724, 21856, 23091, -153276, -37919, -5015, 294185, 135559, 49571, 40906, -89884, -113549, 118041, -81049, -266131, -209171, 67399, -124944]
12899C71802a54546j91221Q5095F7375N4129E6189a7441n1928D11109b80843f931
12887A4280L3569a35538B2072a84170e245j15746p7792d5269o3903A92930a2451
12875A3919a25108l12703A66912L4713b91843A94000E5804B4368J2992j380R1333
12864A27313i6023K4742n629A32023D3872J28884a91967D20493A25150D6317a71985
12852a70499G3034a05455A47943a00213A37844a98125A56182g9661j18923h2054
12841H5685c39584E1520O2257J02355b08012j40361A9772b0930D9934i0719n5694
12830a46413E8377J34656i935A41960b8147F640d9217C6314a73352C69270J5211
12819C84481A83826G8425c3151q3938C6526a6302f806E2015J04232e8239F147
$$ y = [371802, -154546, -345767, -260672, 67375, 121504, 56189, -17441, -69369, 411109, -280843, -6931, 14280, 47849, -135538, 22072, -184170, -5245, -120991, -198783, -45269, -109172, 192930, -12451, 13919, -125108, -437811, 166912, 201625, -291843, 194000, 55804, 24368, 37360, 35980, 127313, -96023, -71281, -76910, 132023, 43872, 172756, -191967, 420493, 125150, 46317, -171985, -170499, 73034, -105455, 147943, -100213, 137844, -198125, 156182, -79661, -198584, -82054, 85685, -339584, 51520, 113777, 216132, -208012, -348373, 19772, -20930, 49934, -90719, -146413, 58377, 193033, -9935, 141960, -28147, 6640, -49217, 36314, -173352, 369270, 384481, 183826, 78425, -33151, -117089, 36526, -16302, -6806, 52015, 156247, -58239, 6147]
12807h4742E1053b68162F978N4100b17314B35472m2936a81160L3742j94764G1728
12795A35040n4620Q7395e6941A82941a98015K4075h2663I8277A0993b43575j98531
12784d42106i7782m2591n8191l1540E493L27298E7157J4780d1042k61244A28222
12772c9039A32909F3375K4587C2644c65343A03029J17446a27680j6392A19138
12761h6368j22052A95829c29264N0171j59924J18317J42583c1740B03101a08430
12750A4356h0843j09965e7767j79359G26J47624K4034c2399j87880Q145B6289
12738i564E1526b13822i1541B63961a37280q1273G8169a98043A44696g7516B00926
12726A18283O2140R186b61334A21980J89724j20963a16316c581H3722l1067O6936
$$ y = [-84742, 51053, -268162, 6978, 61078, -217314, 235472, 192536, -181160, -147418, -342182, 71728, 135040, 80420, 167815, -56941, 182941, -198015, -173940, -82663, 98277, 10993, -243575, -442106, -97782, -140373, -198564, -230104, 5493, 332791, 57157, 71937, -41042, -302286, 128222, -39039, 132909, 63375, 87962, 32644, -365343, 103029, 220475, -127680, -144072, 119138, -86368, -208420, 195829, -329264, -279093, -439017, -320700, -178117, -31740, 203101, -108430, 14356, -80843, -190808, -57767, -237126, 726, 148350, 172384, -32399, -220279, -212134, 26289, -9564, 51526, -213822, -91541, 263961, -137280, -218553, 78169, -198043, 144696, -77516, 200926, 118283, 180423, 189609, -261334, 121980, 311704, 190741, -116316, -3581, 83722, 52655, 119591]
12715A19591b31749G3062j2374M3929K11396e0747l59254B8270a8453k7801a9692
12703a22198l1443O8983D9614K6957g9491J5751A65924a20438B21391d0552B23461
12691B18392H0754b08632C77309b24896a04166J4647A11830J36650b92040J10123
12681a81917O7492D657b487A5747M2797D362a13623m8858h0664j13175C13784
12669A9473J71149d5939H8311A3522K15022C6589L027A4809b96143e8211k35335
12658b93546B46735o4093a53989J7539A86465c3511j40163j7569B09948C5075
12647I04K60046a64133A31438J9619a40660H7814N373a80633h0398b1068I0549
12635i1860A83208a07597E2621f0775B84832i8686o2747F1145a19991B65009a16097
$$ y = [119591, -231749, 73062, 60688, 104617, 316013, -50747, -410001, 28270, -18453, -46254, -19692, -122198, -153641, -84658, 49614, 76571, -79491, -63740, 165924, -120438, 221391, -40552, 223461, 218392, 80754, -208632, 377309, -224896, -104166, -89519, 111830, 248480, -292040, -181917, -114425, 4657, -2487, 15747, 58544, 4362, -113623, -162481, -80664, -193839, 313784, 19473, 190622, -45939, 88311, 13522, 228544, 36589, 39616, 14809, -296143, -58211, -293546, 246735, 182642, -153989, -136450, 186465, -33511, -173674, -191243, 209948, 35075, 904, 260950, -164133, 131438, 151057, -140660, 87814, 93187, -180633, -80398, -21068, 90549, -91860, 183208, -107597, 52621, -60775, 284832, -98686, -161433, 61145, -119991, 265009, -116097]
12623b01499C09026a27274J7830C59845N8635H2082N5940N4900j9440L2011a42265
12611a31760A74213m6105E3735a21185l3171b7497F8627a03407E750P9713O2745
12600A48208C5697J72385E3938J56901a3912B60074a969A67391l0385o7940a59849
12588h5261B871J36392b08652D04594a21272m005k5682C69812d11214B66284a83648
12576d1839G6030R5230a30198B65002a4584r9440I3030e8720E4726b57768A84326
12564E8973P2140f1716j47188J6568d2894j23291K3577e8600k9654K2133l3202
12553i9323l1917L162D4331N6457E391K82252g8918j09701h4053G7019b686k48819
12541b51505c002j63202P2336r4660B14240p8485i1465I1445J41239g540A36639
$$ y = [-201499, 309026, -127274, -109444, 359845, 418480, 82082, 138022, 192922, 173482, 205493, -142265, -131760, 174213, 128108, 53735, -121185, -154356, -27497, 68627, -103407, 5750, 85463, 148208, 35697, 208082, 53938, 210839, -13912, 260074, -1969, 167391, 137006, 69066, -159849, -85261, 2871, 139263, -208652, 404594, -121272, -125277, -150959, 369812, -411214, 266284, -183648, -41839, 76030, 171260, -130198, 265002, -14584, -114024, 93030, -58720, 54726, -257768, 184326, 58973, 131113, -61716, -208904, -192336, -42894, -166185, -142608, -58600, -88254, -66121, -99323, -131240, -128078, 44331, 100788, 5391, 287643, -78918, -188619, -84053, 77019, -2686, -251505, -3002, -166204, -93868, -188528, 214240, 135755, -91465, 91445, 232684, -7540, 136639]
12529B59877a46113B14979c1777j0810n1138a6706A47909e6805f2m15411d9214
12517f2112A62266c8775a0369j17926f692A35571a56681I7337b35544i6490J1374
12506h5116G4800j1850J17092K7945M03354A57891b6168A29894D0144a44815C07852
12494C35852m949I1306O0782a06246B50066j11973A2340K62663a46240c99l97166
12483c97565a23167C14497I9383a63170A04260a54637m2021F3555b00783h3263
12472a31367C39260a31678F3469b17342A90180k8682C8176J48435K3368K6499
12462B36478E4645h9954k88323c2726k16541f5588j47942A33598i6062r5709E6300
12450a51837K9111A95814A6333J5351L61544b8345m3279E0939h2663H8604c11779
$$ y = [259877, -146113, 214979, -31777, -42587, -93725, -16706, 147909, -56805, -62, -415473, -49214, -62112, 162266, -38775, -10369, -128295, -6692, 135571, -156681, 97337, -235544, -96490, -85116, 74800, 62950, 180042, 207987, 611341, 157891, -26168, 129894, 40144, -144815, 307852, 335852, 330903, 91306, 152088, -106246, 250066, 138093, 12340, 275003, -146240, -399, -397565, -123167, 314497, 99383, -163170, 104260, -154637, -196658, 63555, -200783, -83263, -131367, 339260, -131678, 63469, -217342, 190180, 161498, 38176, 186611, 209979, 236478, 54645, -89954, -378277, -32726, -249267, -65588, -213530, 133598, -96062, -191771, 56300, -151837, -122726, 195814, 16333, 31684, 393228, -28345, -71624, 50939, -82663, 88604, -311779]
12438c329B91719g9505a3986q6797D0538J41253O7857B8655g8987J2528J8817
12427d7642r3611C6987a28334K5409K9797B58790h3716c2551C1788A3541N8390
12416G1931a23689l6664c6507A33222c25616f2815B96298b35079d9850A84761
12405G4139d30988a29111D199J22667b24935m2219a24369N1858A09000f8949q8853
12394a57802A87046g0261D961b69335b016n1010A25607a86344j48494B87714a89909
12382A42051d98516a99993O0522A86561a25052c1800A6161a28601A12840a06774
12371b18367g918B58498e5491j56233B0680J25955Q797H313P2963K54032a37108
12359h2265a939F902b53277B1275J83880c2700F3283a36821B99856G9603P5569
$$ y = [-3329, 291719, -79505, -13986, -100783, 40538, 181791, 249648, 28655, -78987, -66459, -47642, -141253, 36987, -128334, -102925, -73128, 258790, -83716, -32551, 31788, 13541, 71931, -123689, -160353, -36507, 133222, -325616, -62815, 296298, -235079, -49850, 184761, 74139, -430988, -129111, 4199, 126866, -224935, -267154, -124369, -72511, 109000, -68949, -157802, 187046, -70261, 4961, -269335, -2016, -53026, 125607, -186344, -334838, 287714, -189909, 142051, -498516, -199993, -139471, 186561, -125052, -31800, 16161, -128601, 112840, -106774, -218367, -7918, 258498, -55491, -211724, 20680, 146635, 155432, 8313, 81276, 335308, -137108, -82265, -1939, 6902, -253277, 21275, 205155, -32700, 63283, -136821, 299856, 79603, 155172]
12348A55172d13664A96803G1053b04641N5578B3161J21008K47769a01458j5732
12338a17190M7269A3056a14056C13357G6414K11195e4512K4617B59246J6461b41546
12326B52302b26545B90368p4385b20127A26027k6027c6473I1402J2287K17212
12316C20901b42191D2327i9324A67727k855m6950J62968P0742G1418k6299A7356
12304B87307k2672g1398A12910A8209a36682F4578J75469J02524q2499k0916c54005
12292F3589J4248i1409A56048b5589k78421B84667q2273q3788m5594Q8726C1995
12280I6377e13140d1981k36283g7403C29272j18665i5962B20428K27706j38520
12270C09614a516A2386O0600A6796R6176j7559L48424o0593I0359O42151B22327
$$ y = [155172, -413664, 196803, 71053, -204641, -149063, 23161, 144169, 391938, -101458, -117190, -69921, 13056, -114056, 313357, 76414, 287609, -54512, -29895, 259246, 275707, -241546, 252302, -226545, 290368, 215983, -220127, 126027, 100000, -36473, 91402, 103689, 320901, -242191, 42327, -99324, 167727, 164872, 117922, 280890, 351632, 71418, 45119, 17356, 287307, 264635, -71398, 112910, 18209, -136682, 64578, 240047, 342571, 260072, 239156, -354005, 63589, 77837, -91409, 156048, -25589, -304010, 284667, 202394, 118606, 73012, 161738, 31995, 96377, -513140, -41981, -278264, -77403, 329272, 210607, -95962, 220428, 448134, 309614, -1516, 12386, 72986, 16796, 112972, 95413, 443837, 383244, 90359, 732510, 222327]
12258B44988j17992J03976b12387c1418E3263Q6743a3497G2384J26472J148L2114
12247B32118j2742J67374A22729J64700l8516G0574j4867a32748A36205c5844
12236B8390K41092h1640c5149O232C72534j00670p665b06654A31212M6077p3488
12225A03801a47381A29606a71440B74136a8035F3123M5842J89197A23695K99300
12215D22995b5971j20007f1224C85904B8236L40656D3336R9925J63751P8988j26507
12204B59493B7110M7727R6623K50803A75088J01480a15850E6297K39834i726I9780
12192F97O0425d3170C15694j39727d8549A62373a71707H7829K2989O6588b81668
12180A34580J36579E1399M3643J56984M3256j40990l7892D5954a55572C8079a79760
$$ y = [244988, 126996, 230972, -212387, -31418, 53263, 140006, -13497, 72384, 198856, 200004, 232118, 219376, 386750, 122729, 287429, 248913, 70574, 55707, -132748, 136205, -35844, 28390, 269482, -81640, -35149, -28917, 372534, 271864, 264199, -206654, 131212, 177289, 103801, -147381, 129606, -171440, 274136, -18035, 63123, 108965, 298162, 123695, 422995, -25971, -145978, -61224, 385904, 28236, 368892, 43336, 143261, 307012, 386000, 259493, 27110, 74837, 171460, 422263, 175088, 276568, -115850, 56297, 296131, -9726, 99780, 697, 61122, -43170, 315694, 175967, -48549, 162373, -171707, 87829, 110818, 177406, -281668, 134580, 271159, 51399, 95042, 252026, 295282, 154292, 116400, 45954, -155572, 38079, -179760]
12168E82616e2773A11886d4799Q760j41423O6142C0964h1527A21608J09201a65518
12156H9701P4K92893A27779C1738a03965b8825A47670M9405G5451N03056B45003
12144b7103C19845b8325A56442o8977k7074B3800J35286a52861g1176H3480J05849
12133A89329b71921A19524J70185J20290m8585a11289B77332c2335A36880a42829
12122A5375b05700C96489A35096d0944B46461n7930e7933F3972i6603B27807a02384
12110b20374B65784r9923F4489R5912E5959R8549J03318a33671C10319G384R8044
12099A05428K714G805a16320j4228C87272b9934B03845i0137C52991H0083a55772
12087A93255B3477b12134A1981g6391A41774a67114B0215O4669K7715h4203A0379
$$ y = [582616, -52773, 111886, -44799, -36039, -177462, -111320, 30964, -81527, 121608, 230809, -165518, 89701, 89775, 382668, 127779, 31738, -103965, -28825, 147670, 197075, 75451, 578507, 245003, -27103, 319845, -28325, 156442, 87465, 60391, 23800, 159086, -152861, -71176, 83480, 189329, -271921, 119524, 289709, 409999, 361414, -111289, 277332, -32335, 136880, -142829, 15375, -205700, 396489, 135096, -40944, 246461, 188531, -57933, 63972, -96603, 227807, -102384, -220374, 265784, 165861, 64489, 160401, 55959, 154508, 257826, -133671, 310319, 7384, 105428, 108142, 7805, -116320, -130548, 387272, -29934, 203845, -90137, 352991, 80083, -155772, 193255, 23477, -212134, 11981, -76391, 141774, -167114, 20215, 84884, 112599, -84203, 10379]
12075a74373A93633L5525A00006J39440G0605J56294q1435E1074N4892m2351K07610
12064B71225c9430D27267j39534n3808k1293h4105B24187M1426d3817C36374b57773
12052c5044F7738J83557a06309K4339H0901Q1778K7861h2069b0922B47363a1983
12040a354A80574A4144c57461f291C1220f414k5113J5190k14311b183k3115r537
12028c4835l8305C24595A37676l5445a068B4786J71314F4965k9432K07082a61785
12016a24203A49415D5003c70092B39193e4557q5877A98807d2797e609A17783a9699
12004b3036k33594C14144A46148b31538e3557a223k80462B4949J95848K3648b95796
11992A87158H9166J24419l6498c36701A81468b02687c3385k62723A36060n6491
$$ y = [-174373, 193633, 229158, 100006, 239446, 70605, 226899, 145464, 51074, 105966, 63615, 271225, -39430, 427267, 287733, 233925, 212632, -84105, 224187, 265613, -43817, 336374, -257773, -35044, 67738, 251295, -106309, -81970, 80901, 162679, 190540, -82069, -20922, 247363, -11983, -1354, 180574, 14144, -357461, -6291, 31220, -6414, -31527, -16337, -230648, -2183, -25298, -34835, -73140, 324595, 137676, 102231, -1068, 24786, 196100, 64965, 35533, 242615, -161785, -124203, 149415, 45003, -370092, 239193, -54557, -140434, 198807, -42797, -5609, 117783, -19699, -23036, -256630, 314144, 146148, -231538, -53557, -1223, -281685, 24949, 220797, 244445, -295796, 187158, 89166, 213585, 177087, -336701, 181468, -202687, -33385, -296108, 136060, 79569]
11982G9569K35300a22330e3680A03528a15640F7763a31777k61611B94485G9025
11971a6391j2750B01065r4645f9459B0783Q0427B855J24648a21730j29008E7151
11959G4100g7l74682a20858j23339i4875A53551b71936C2256J93444b08390B39100
11947c75191J28679i4444c3301D0244a92195Q7719H7646b6910k71108B0075g2591
11935b12399a1523j7672q9243c1956j37748j01611r2906e4422m0007B46158b85658
11923a47667A41162o5222J32023D0746b80084a35823A26417m4307l1655a60441
11912b88738A45981d4222A69056a06293E61245B2117M5117i6731G0080k6312a26501
11900B54989f4980K4554o1121B02058m0275l0585l4104d5371A8988a68653d5279
$$ y = [79569, 314869, -122330, -53680, 103528, -115640, 67763, -131777, -393388, 294485, 79025, -16391, -29141, 201065, 106420, -69459, 20783, 101210, 2855, 127503, -121730, -250738, 57151, 74100, -77, -374759, -120858, -244197, -94875, 153551, -271936, 32256, 225700, -208390, 239100, -375191, -246512, -94444, -33301, 40244, -192195, -104476, 87646, -26910, -298018, 20075, -72591, -212399, -11523, -29195, -118438, -31956, -169704, -271315, -364221, -54422, -94429, 246158, -285658, -147667, 141162, 75940, 207963, 40746, -280084, -135823, 126417, 82110, 50455, -160441, -288738, 145981, -44222, 169056, -106293, 561245, 22117, 67234, -96731, 70080, 43768, -126501, 254989, -64980, -40426, -101547, 202058, 161783, 131198, 97094, -45371, 18988, -168653, -45279]
11888b8865B7384a53656A19121K00453p9220D8545J78483A11772a15851F7769
11877b83774b8712F3447i8977B0886g5115r3514j48265J49338A10834O887a37224
11865A84316b66802J13887M4312N4090m7731B66153p5164d78176K26952a16343
11854a7592n8546a7393A43681A6659Q896d3254n6043o6238k6675E1424b38346
11842e5041j98656j3391a33311J4739K5023j6802C98482c0719B760O694M2893
11831E2347K6643h1238b2176l92449J70814A61877a83380B7274K06820a56390
11820a21920A25804a16916J3241C2859b17965j66977B26808b15513d3442C5213
11809b90479e0039D4267b90539b7655F3728d6008j15508b0943j65393E2257c5751
$$ y = [-28865, 27384, -153656, 119121, 319574, 240354, 48545, 227028, 111772, -115851, 67769, -283774, -28712, 63447, -98977, 20886, -75115, -168629, -316894, -167556, 110834, 117721, -137224, 184316, -266802, -152915, -108603, -54513, -102244, 266153, 190989, -478176, -251224, -116343, -17592, -76138, -17393, 143681, 16659, 25555, -43254, -99297, -165535, -192210, 51424, -238346, -55041, -253697, -267088, -133311, -118572, -93549, -110351, 398482, -30719, 2760, 9454, 52347, 78990, -81238, -22176, -414625, -243811, 161877, -183380, 27274, 234094, -156390, -121920, 125804, -116916, -103675, 32859, -217965, -384942, 226808, -215513, -43442, 35213, -290479, -50039, 44267, -290539, -27655, 63728, -46008, -161516, -20943, -186336, 52257, -35751]
11797A33575a3075n0221A59969o6736a09691q9303c9892B81187g4968k4729a9504
11785b55375J1204B36427k828C8883g5702H3324P3664C1481h1397B35264a29854
11773b19604E2570J0210d62597A64474a73786N1583k60796a22499m9593B2117
11762g2455J4756q2861k39433R2720g3188k19837d9518n0922H3899b55245A67049
11750G4335K480J78441b08057A07639c12263N3512a07134a3242j12887A6682g8617
11738A61319m1552L1419b40853B63017E2471i0172k3875C3829L05975A13094i0148
11726A75610a24848a4331D6002J45099e0133j7385j29834B54466n7078C2184R9237
11715A31421D2423J27661C9036a76520M4520A27657g2301B06601q0877A16a3421
$$ y = [133575, -13075, -63296, 159969, 93233, -109691, -198994, -39892, 281187, -74968, -99697, -19504, -255375, -244171, 236427, 233599, 38883, -75702, 83324, 156988, 31481, -81397, 235264, -129854, -219604, 52570, 62780, -462597, 164474, -173786, -122203, -382999, -122499, -172092, 22117, -72455, -57699, -140560, -379993, -287273, -73188, -293025, -49518, -100440, 83899, -255245, 167049, 74335, 76815, 255256, -208057, 107639, -312263, -258751, -107134, -13242, -126129, 16682, -78617, 161319, 119767, 151186, -240853, 263017, 52471, -90172, -114047, 33829, 339804, 113094, -90148, 175610, -124848, -14331, 46002, 191101, -50133, -67518, -197352, 254466, 197388, 32184, 131421, 42423, 170084, 39036, -176520, -132000, 127657, -72301, 206601, 125724, 116, -13421]
11703A98660p5503a91112c4168j39533d1286D6993K27629c2363F6438i2079G0269
11691B2299d9041l0390C86602i4373h20F8841a60204B33568D0991P8707n5508
11680F4190K53157k2701J67850A4802R1658B3211a93515G876a41259o796B6876
11668A51963c41289i932B80256g2001A96524O78a56708A55650a04332j20816B0591
11656A41359P5762b61830q732B9786o104a50244A00909A6363d1308r2592j61136
11645b95036A91508a89835J0685j5928C08036b6729n5733B69326a05833j26282
11635b32115A21286c1850A06249M1988m1796a03286A69007b76831H3001d50745
11624A8057d7749A93238J27315A58928C0642J83093A7179i9400J4534c5745q2105
$$ y = [198660, 123157, -191112, -34168, -173701, -41286, 46993, 274622, -32363, 66438, -92079, 70269, 22299, -49041, -79431, 386602, -94373, -820, 68841, -160204, 233568, 40991, 119698, 64190, 317347, 294646, 462496, 14802, 106460, 23211, -193515, 7876, -141259, -148055, 26876, 151963, -341289, -9932, 280256, -72001, 196524, 197202, -156708, 155650, -104332, -225148, 20591, 141359, 217121, -261830, -270562, 29786, 23682, -150244, 100909, 16363, -41308, -133900, -295036, 191508, -189835, -179150, -195078, 308036, -26729, -82462, 269326, -105833, -232115, 121286, -31850, 106249, 148237, 106441, -103286, 169007, -276831, 83001, -450745, 18057, -47749, 193238, 320553, 158928, 30642, 213735, 17179, -99400, -84866, -35745, -117850]
11613a17850p937D10612a96966B35053F7773J35251b6618I361g8391G8975a33328
11601F1948b95611j34468I4597B2701J77167b3020B30235H2263b25591r8701Q9461
11590b34831h044A33819b45696d7660q6827M9472C55777b51363A65386n7186g7017
11578b6443F4098a60316A04363e0530B47812b29971A51089K21J4929H884a14858
11566A2736R6655E219O3459P4139b02262M2729c4169B7325J56998a71096b0344
11554e7367B56096E1545b60093b0609A6011K58700n7857h7947B50289f2464J3468
11543d8996p5488A8832J21684e3793p3846d505A96332c2144j9615C6566K66777
11532C03343a12192r6326B50171f8552B10085p90b67908C06579j28416L7875c2368
$$ y = [-117850, -125787, 410612, -196966, 235053, 67773, 203024, -26618, 9361, -78391, 78975, -133328, 61948, -295611, -430079, 94597, 22701, 199868, -23020, 230235, 82263, -225591, -324292, -234831, -8044, 133819, -245696, -47660, -134487, -85015, 355777, -251363, 165386, 108200, -77017, -26443, 64098, -160316, 104363, -50530, 247812, -229971, 151089, 151310, 166239, 8884, -114858, 12736, 109391, 5219, 68678, 142817, -202262, -159533, -34169, 27325, 184323, -171096, -20344, -57367, 256096, 51545, -260093, -20609, 16011, 274711, 216854, -87947, 250289, -62464, -48996, -124484, 18832, 140516, -53793, -127639, -4505, 196332, -32144, -51759, 36566, 303343, -112192, -208518, 250171, -68552, 210085, 209295, -267908, 306579, 178163, 216038, -32368]
11520h7666D8188B0522J96730a79539L7518f6994p0303D7097K35009E2682R7097
11509A49779d27822I8569a11718A91570b10093i8527d2525A53220o4742a67271
11498A63860B8446K62213D4024f9742I3252l3670a06568A04182b19218A60397
11487C82048a60608p4115A18691D484K7992g544A28250E1319O7073k3873J79444
11476B73963B4703J92453N0119a2268C3153g9127n3894a4021B59708m249P4038
11465C29497g0447H4852a88159m0423A02975a67539L2690a1322C0164L19576A04414
11453a26648k6796A42506J5577O9562o6824K43101A10411K02159j27832K49949
11443D34687a82555M6533C38805D9451a18153j51745e7634m9825D03109A44651
$$ y = [-87666, 48188, 20522, 217252, -179539, -142021, -66994, -137297, 47097, 282106, 52682, 149779, -427822, 98569, -111718, 191570, -210093, -98527, -42525, 153220, 88478, -167271, 163860, 28446, 290659, 44024, -69742, 93252, 59582, -106568, 104182, -219218, 160397, 382048, -160608, -234723, 118691, 4484, 32476, -7544, 128250, 51319, 118392, 94519, 273963, 24703, 217156, 267275, -12268, 33153, -79127, -133021, -14021, 259708, 255459, 329497, -70447, 84852, -188159, -228582, 102975, -167539, -134849, -11322, 30164, 349740, 104414, -126648, -153444, 142506, 158083, 227645, 160821, 403922, 110411, 312570, 184738, 434687, -182555, -136022, 338805, 49451, -118153, -269898, -57634, -107459, 403109, 144651]
11432b14713G8747Q3322b13994A56261a26761N2342n2470C34324i246E121L72621
11421C77742f8236A94328J97067b9191B2267K22859c5949C5967L2647c81421A04074
11409C42236a92661G0150c275H789K47863o8519i4101A9908P4579h5211c546A74422
11396a27750r6879R3900D33862b31767c7959A84172a50944B38459a5237C88734
11385B32649h8410D1954M1192b4158I218J1062O3962a29891f2919A87952D9610
11373I0305K8880d2332j46389e8982F5352a07873a7794j75304j6134h5406K2385
11362f3021K8351B11346P4661b14258R9066A19732Q7739k8564H3806Q4692A007
11350b27202A8984J18433D1472a77410j79797A10910a91453F9335b32131E9456
$$ y = [-214713, 78747, 162069, -213994, 156261, -126761, -74419, -126889, 334324, -9246, 5121, 377742, -68236, 194328, 391395, -29191, 22267, 245126, -35949, 35967, 68614, -381421, 104074, 342236, -192661, 70150, -3275, 8789, 256652, 188133, -94101, 19908, 94487, -85211, -3546, 174422, -127750, -224629, -130729, 433862, -231767, -37959, 184172, -150944, 238459, -15237, 388734, 232649, -88410, 41954, 83146, -24158, 9218, 20280, 84242, -129891, -62919, 187952, 49610, 90305, 119185, -42332, -188721, -58982, 65352, -107873, -17794, -193098, -209232, -85406, -63021, -34670, 211346, 286007, -214258, -115192, 119732, 207471, 178907, 83806, 168498, 1007, -227202, 18984, 137417, 41472, -177410, -357207, 110910, -191453, 69335, -232131, 59456]
11339c7143j61301A29861l4123A2097a5420g626l0166A53468a74963B73884c2047
11327f9014k6855C51068C1496I397b8756o5851o1820A98594M548n9833a18630
11315a10442e840q3523l7669q9190C2949a54838j53488a27087D1250c31707F2347
11303E7434R0822C9647c2365B63537k3151p2470A0273m589R6743j7513g4929j96985
11291b71914A5802d77938G0892A188b24665r390A02363j7076L5139i7371b6037
11279b21590C2374a99383C6451a11704I8092c39977j42247a20271J1194k74372
11269c83449F1258c1084C3129b56830B802c0334m9994l04852B07494p9341i6340
11257b20069k4263K9258c4726E1387b60127b7319j34069A25174j3502a11438B8502
$$ y = [-37143, -198444, 129861, 95738, 12097, -15420, -7626, -37792, 153468, -174963, 273884, -32047, -69014, -95869, 351068, 31496, 9397, -28756, -94607, -156427, 198594, 203142, 143309, -118630, -110442, -5840, -89363, -127032, -216222, 32949, -154838, -308326, -127087, 41250, -331707, 62347, 57434, 148256, 39647, -32365, 263537, 240386, 167916, 10273, 5684, 102427, 84914, -74929, -271914, 15802, -477938, 70892, 1188, -224665, -234055, 102363, 85287, 120426, -97371, -26037, -221590, 32374, -199383, 36451, -111704, 98092, -339977, -482224, -120271, -109077, -383449, 61258, -31084, 33129, -256830, 2802, -30334, -80328, -385180, 207494, 128153, -96340, -220069, -244332, -215074, -34726, 51387, -260127, -27319, -161388, 125174, 111672, -111438, 28502]
11245b10897b9079B85540c06712a37700f0284G6581C7298b09124C2551a37565
11234b80320C8406d606I712a72223c8821A32601n1656L6371c33106J32712O0515
11223a39879j31967e8263B70633a70244b3902j07348f5585o0580l6453e2544o4737
11212a17281b5213j18895B93151a50247l2834m5557K1612J0007L7067O5706H1947
11200I8682c19089N9715L6559D9748b43638m4550B4860h7654j46509G5569b92363
11188b2838l73221a16705n0157k05675g3906B24523h9979j2542b2884j25570E1543
11176b50158k9627g3872B7220M1023j5358p830d4724j00353A60216n0054J41913
11165B52075D2914b06756g86l69520B9151A4362a14307M1678k05674J35991J2014
$$ y = [-210897, -29079, 285540, -306712, -137700, -60284, 76581, 37298, -209124, 32551, -137565, -280320, 38406, -4606, 9712, -172223, -38821, 132601, 80945, 117316, -333106, -200394, -139879, -271846, -58263, 270633, -170244, -23902, -131250, -65585, -126165, -162618, -52544, -117281, -25213, -144108, 293151, -150247, -183081, -228638, -207026, -197019, -159952, -94246, 81947, 98682, -319089, -259374, -222815, 49748, -243638, -288188, 24860, -87654, -234163, 75569, -292363, -22838, -396059, -116705, -166862, -372537, -73906, 224523, -89979, -102521, -22884, -148454, 51543, -250158, -279785, -73872, 27220, 68243, 52885, 45055, -44724, -145077, 160216, 110162, 252075, 42914, -206756, -786, -370306, 29151, 14362, -114307, -72629, -278303, -142312, -130298]
11154a30298r6160F7099K60118h4467j62428h6175B85645A33099k3028D623K9252
11143C3875O8856e3383j86239n1029a10027j29004j5110A88881d13673I8749d75893
11131i0171b883k13999B21809c65626G6536c56031P1878A72807K2292B3447D326
11119G5707a22302m1057B26989d83094h3044A1733d6318A91660c89346A9203h5481
11107B88015j25709d5484B09305e1479p9354F5717g8333A02726J09307a56708
11096A10154J44487j14772b56241A20935m6464a76551B89948c7035n5979j09288
11086b02302B68712A02982b61026k5287A2301a42550A24955J12647o7647l5172
11076A34783M0971F6288l1705d0566p197B87980M2864F987J15637M359f2654E3612
$$ y = [-130298, -226458, 67099, 327217, -84467, -246895, -86175, 285645, 133099, 110071, 4623, 33875, 102731, -53383, -239622, -290651, -110027, -239031, -254141, 188881, -413673, 98749, -475893, -90171, -2883, -216882, 221809, -365626, 76536, -356031, -284153, 172807, 195099, 23447, 4326, 75707, -122302, -163359, 226989, -483094, -83044, 11733, -46318, 191660, -389346, 19203, -85481, 288015, 162306, -45484, 209305, -51479, -130833, 65717, -78333, 102726, 212033, -156708, 110154, 254641, 139869, -256241, 120935, 74471, -176551, 289948, -37035, -93014, -202302, 268712, 102982, -261026, -286313, 12301, -142550, 124955, 237602, 169955, 134783, 175754, 66288, 34583, -40566, -47763, 287980, 330844, 6987, 122624, 126983, -62654, 53612]
11063C10703J18530A48180I440J22959j529n7463L11627J9323E3010M42426c6386
11051B23447K26259A54875M2676J52912A66919K00264L8779r0264J00729N5501
11041D71928B08949K23513K20465q9734B70120j4625L38080A84511Q7082L6478
11031C08071K17048n6355P8673n6941q3607L47695k72492B12039L86327A80465
11020D12348J33467k07275J71811j04002j9171J90597p9292J64493n8370k28611
11010C75995J21030J45927k34215L01519l53135M44242B31490L33691l1757p7360
11000D56064l9762J29827j2710j39737j16688K25593I8740K84615K96359k96722
10990C82992q5067J66051j67086J14389J32212R7300k64999J7038J6314k4983
$$ y = [310703, 429233, 148180, 9440, 132399, 130870, 73407, 385034, 404357, 53010, 495436, -36386, 223447, 449706, 154875, 197551, 350463, 166919, 367183, 405962, 315698, 416427, 471928, 208949, 432462, 652927, 563193, 270120, 255495, 593575, 184511, 271593, 308071, 525119, 468764, 547437, 490496, 406889, 754584, 482092, 212039, 598366, 180465, 412348, 545815, 338540, 510351, 406349, 387178, 577775, 498483, 662976, 604606, 375995, 497025, 642952, 408737, 710256, 357121, 801363, 231490, 565181, 533424, 456064, 416302, 546129, 533419, 393682, 276994, 502587, 98740, 383355, 679714, 382992, 297925, 463976, 296890, 411279, 543491, 640791, 375792, 392830, 409144, 384161]
10980C84161A66280K0890K31983p427N5010j8104J74779A81431M77403m7552j88788
10969D22494M0405N08593m54596J39044J03249Q5942J37897j62182K34880j37159
10959I18567j20069m7880M47018J79010N4777M74145J8348j50566o1394Q4406
10949A796362n14820j56213L77640q7584j59191k69686M43421j28209j25454J78003
10939A354269K22188l01937J93591J2572j40273J1162m37046K66282m78320B30202
10928F96121j03569j33359A24899N1398J31457R2465A88417J22301b49146a9062
10917E57163B38329C0525a7616A4238b260o8962m4818B676b23131E8834J79607
10906B38441L8793B1865a14223D5120a6235A26954a48019A27369R5459B3385c5707
$$ y = [384161, 166280, 187170, 419153, 411726, 466736, 448632, 623411, 181431, 658834, 611282, 422494, 462899, 971492, 516896, 655940, 759189, 845131, 983028, 820846, 1055726, 918567, 798498, 750618, 1197636, 1376646, 1431423, 1905568, 1923916, 1773350, 1711956, 1796362, 1281542, 1125329, 1502969, 1415385, 1256194, 986508, 1429929, 1301720, 1176266, 1354269, 1576457, 1274520, 1468111, 1480683, 1340410, 1351572, 914526, 1180808, 702488, 230202, 696121, 592552, 459193, 124899, 176297, 307754, 400219, 188417, 310718, -249146, -19062, 557163, 238329, 30525, -17616, 14238, -2260, -71222, -116040, 2676, -223131, 58834, 238441, 277234, 21865, -114223, 45120, -16235, 126954, -148019, 127369, 222828, 23385, -35707]
10894f5945n0845k0955j38173J36476C9603g7855B66322K8014h1535j9261C79482
10882b14626H105a92474m7957c956n5142F3973J25044a3033D0303c87600A39048
10870B97332C1016i1763K1864E7037b25482h3310j07942C67531F3586O0883J46890
10859B71359c17277E7800K90620d2734A51130a13858I0681h8955j06077d3659
10848b46536A65224b25003A11700a53714J5014G1498a89554A55695e0581J8616
10838c1965E4916K87522b709m2573C60893b42477E2453a89214C06354F3481Q2957
10827A46438c0995j45984j10341l675f5241r9453j48025B41134a28870p3983A6713
10815i0979F4255b05940a8140F170N9176A318b88184a24098j392j5020A51438
$$ y = [-65945, -116790, -137745, -275918, -139442, 39603, -77855, 266322, 294336, -81535, -100796, 379482, -214626, 8105, -192474, -240431, -3956, -59098, 63973, 189017, -13033, 40303, -387600, 139048, 297332, 31016, -91763, -69899, 57037, -225482, -83310, -191252, 367531, 63586, 124469, 271359, -317277, 57800, 348420, -42734, 151130, -113858, 90681, -88955, -195032, -43659, -246536, 165224, -225003, 111700, -153714, -138700, 71498, -189554, 155695, -50581, -31965, 54916, 342438, -2709, -45282, 360893, -242477, 52453, -189214, 306354, 63481, 146438, -30995, -176979, -287320, -290995, -65241, -164694, -312719, 241134, -128870, -202853, 16713, -90979, 64255, -205940, -18140, 6170, 65346, 1318, -288184, -124098, -125490, -140510, 151438]
10803b52885E7790a89430M5043B6093J12241d2622j03709d9646m0329B55407C4955
10791G2318N0483K14343F9008c62411G7290e4611A56881a05005A36118a34451
10780h726A06838e87376a90348J3398c6851G6472B117b25974m1542A63146o2052
10769A01094b15837h0091I3273g6965A09748a5776A35497h1545j89436E5540b01306
10757C7151a26558J1814j54773g9440n5611A06269J11850E8784K1157a79298A1587
10745A85906g9876a2010I5799Q3153a45040q2983n646A21822E3184J47019b69129
10733A88190N0460a97625B3013h4361k5574d1853B06888a9272q0135A07118a07061
10721B9936M7613e7652k13926n3863A08047b02328B15194c19874K1273H7114C5833
$$ y = [-252885, 57790, -189430, -144387, 26093, 138334, -42622, -146331, -49646, -89975, 255407, 34955, 72318, 122801, 337144, 69008, -362411, 77290, -54611, 156881, -105005, 136118, -134451, -8726, 106838, -587376, -190348, -176950, -36851, 76472, 2117, -225974, -267516, 163146, 101094, -215837, -80091, 93273, -76965, 109748, -15776, 135497, -81545, -270981, 55540, -201306, 37151, -126558, -114744, -269517, -79440, -135051, 106269, 218119, 58784, 79941, -179298, 11587, 185906, -79876, -12010, 95799, 178952, -145040, -228023, -233669, 121822, 53184, 200203, -269129, 188190, 238650, -197625, 23013, -84361, -109935, -41853, 206888, -19272, -99407, 107118, -107061, 29936, 77549, -57652, -271578, -325441, 108047, -202328, 215194, -319874, -298601, 87114, 35833]
10709b35047I6177a76117A51909L75551i515j18574l76337a07888B4562l350a97200
10697f2455C3490b14027K6332P0516l62418B405a10469D5420J61835a16740j63069
10686b79809C2825L51681b40701B4323c20978A05259R986a91634N9775l15274
10676d47133Q1280D7239J4023c6811k81689A35146f0976j5696q423A01304d87977
10664d1687l23896f4908q0712e747B22350J6743a32947B61394d0074C53a63264
10652h6971l39304E6478f00135h0775A99651b6482A22662a20846A9917J68039
10642A87956a08319C16383j32222l7949f0576r8904f5907H4566B932J26156m1757
10631H7331c7907m7547n7642b8665o873j18674B2497f9150J1228j52161A04199
$$ y = [-235047, 96177, -176117, 151909, 527460, -9515, -128089, -504426, -107888, 24562, 21212, -197200, -62455, 33490, -214027, -187695, -117179, -479597, 2405, -110469, 45420, 207255, -116740, -279809, 32825, 384506, -240701, 24323, -320978, 105259, 115245, -191634, -131859, -447133, -365853, 47239, 61262, -36811, -318500, 135146, -60976, -76672, -85095, 101304, -487977, -41687, -365583, -64908, -145620, -5747, 222350, 239093, -132947, 261394, -40074, 353, -163264, -86971, -426275, 56478, -600135, -80775, 199651, -26482, 122662, -120846, 19917, 187956, -108319, 316383, 184161, 146212, -60576, -159480, -65907, 84566, 2932, 129088, 87331, -37907, -85454, -143096, -28665, -35538, -154212, 22497, -69150, -57922, -210083, 104199]
10619G6667a97287C1665f3807l0294k7204K042A16552J02569a84958i1885k23958
10608c15843h8888j01328a6822F9253i3865j6338l5234b2851B17710J94691a35890
10596A04886b01947f6726l78436a51330j16744d0340j15437A46148B1187b42320
10585A81076p5293b1923G3858a23352C02136G3348L03663b49631A96374n9186
10575A37188b01816e021k46746f8764A78228q5512c2414k30035f1533C4066a82565
10563A46005f7731D21991g8645A2006J64118a86960A73034R154h5851b4886m31200
10552d56086d2514D4377a68836d724I3289h6879j8674k08375a26089G1846j8445
10541E3401a87339C778d1389m6139j10746p4542B95819h9448k0964A02933b15146
$$ y = [76667, -197287, 31665, -63807, -94101, -121305, -119263, 116552, 219121, -184958, -91885, -315843, -88888, -190216, -16822, 69253, -93865, -110203, -145437, -22851, 217710, 412401, -135890, 104886, -201947, -66726, -445162, -151330, -268074, -40340, -155777, 146148, 21187, -242320, 181076, 105783, -21923, 73858, -123352, 302136, 73348, 377011, -249631, 196374, 137188, -201816, -5021, -251767, -68764, 178228, 92716, -32414, -262449, -61533, 34066, -182565, 146005, -67731, 421991, -78645, 12006, 176124, -186960, 173034, 182188, -85851, -24886, -456086, -42514, 44377, -168836, -4724, 93289, -86879, -105553, -313928, -126089, 71846, 53401, -187339, 3778, -41389, -87528, -198274, -272816, 295819, -89448, -110412, 102933, -215146]
10529a24297N155C0886a21712b764C51370g7197r4369B71177b69905I193b7446
10517B6753L3178d59504d3240r4094A5593d13438a41982c2675r3184d0544B5963
10505b9645m60I3179J62957j09054K0545a11566I8332a08098j61165a13834D0189
10493d9546K686k8614r937j52871j04366c6920A02535q318a5298A58534O0619
10482B19153A7885a57355M3652A8267a42690A32983b2199H3785i4230H6612a4620
10470a33729M643A87204a25091k53224A43412J58187J17007j32999J1052J42203
10460D38862j20746L47607G5123h43A41156J17565b68302A89324a6054j09982
10450a26036B96754a50302G1178a39109K4590j45615B11359H2874h9085A6007
$$ y = [-124297, -119142, 30886, -121712, -2764, 351370, -77197, -171566, 271177, -269905, 9193, -27446, 26753, 59931, -459504, -43240, -137334, 15593, -413438, -141982, -32675, -125859, -40544, 25963, -29645, -30105, 93179, 256136, 147082, 167627, -111566, 98332, -108098, -269263, -113834, 40189, -49546, -46860, -75474, -85411, -238282, -342648, -36920, 102535, 94217, -15298, 158534, 219153, 17885, -157355, -113703, 18267, -142690, 132983, -22199, 83785, -94230, 86612, -14620, -133729, -129086, 187204, -125091, -378315, 143412, 301599, 418606, 285607, 296659, 438862, 318116, 665723, 75123, -843, 141156, 258721, -268302, 189324, -16054, -126036, 296754, -150302, 71178, -139109, -114519, -260134, 211359, 82874, -89085, 16007]
10439a14320K4015F2352K49600F004a06863l6533K1204N5559Q965A93273d38084
10427A01437a27371j49729O1269G935L29372f706j54024M9599j3496a1296B01924
10415a74425a8686k72092A74579B3924c40681J51659q6808a08870I0109b10275
10404a64773B85027d0952C15023B9008P954J10445m9036C3706c44613J08600F957
10392G6374l0086p737a71545M7499B63328a30391j49695K0359g0521C6303c17995
10380i5561C10588b16173b7774k1669j63027A38792g1972A32604L9543g56A88871
10368A83712a92209A41236a16974A9640e5584A80649c3691k05551a9094A48508
10357b7296m3671B04609h3304A96292o393c6311m8705j17499A03006N4337J98736
$$ y = [-114320, -90305, 62352, 311952, 6004, -106863, -143396, -122192, -66633, -57668, 193273, -438084, 101437, -127371, -277100, -215831, 7935, 337307, -6706, -160730, -111131, -124627, -11296, 201924, -174425, -18686, -290778, 174579, 23924, -340681, -189022, -275830, -108870, 90109, -210275, -164773, 285027, -40952, 315023, 29008, 36962, 147407, 98371, 33706, -344613, -236013, 6957, 76374, 46288, 38551, -171545, -124046, 263328, -130391, -280086, -259727, -70521, 36303, -317995, -95561, 310588, -216173, -27774, -49443, -212470, 138792, -71972, 132604, 172147, -756, 188871, 183712, -192209, 141236, -116974, 19640, -55584, 180649, -33691, -239242, -19094, 148508, -27296, -70967, 204609, -83304, 196292, 189899, -36311, -85016, -202515, 103006, 157343, 356079]
10346C56079j9695A63986F6145J422R5334K27299j13585a84349A91198B6279M46139
10335D72418j25388a14304C87018C9570L00267A00433J60478K91006H4493K07070
10325B91563D9730K57590A29992D3223H933a60722F8840p640O0082J84910A02091
10313A64780J15693A24288J33663C8169J48849J6735p8822J60938M3105j58089
10303A70885a42990p2394C58391b45356A88631L64128A11214e0687B39760Q1725
10293C21485a1105A17472J0891b08717F8627J23188b52037J20736H0118n273j0054
10282F4791a04211c6287k10966c143B1579L8404b73036A49565a95438k04205J39331
10271b60312o5047J56759j70655C4435J09483D3681J99680a159m650G1065k8610
$$ y = [356079, 336384, 163986, 66145, 67567, 162901, 390200, 276615, -184349, 191198, 26279, 472418, 347030, -114304, 387018, 39570, 339837, 100433, 260911, 551917, 84493, 291563, 49730, 307320, 129992, 43223, 8933, -160722, 68840, 61200, 121282, 306192, 102091, 164780, 280473, 124288, 257951, 38169, 187018, 203753, 124931, 285869, 328974, 170885, -142990, -215384, 358391, -245356, 188631, 552759, 111214, -50687, 239760, 321485, -11105, 117472, 128363, -208717, 68627, 191815, -252037, -131301, 80118, 74845, 64791, -104211, -36287, -247253, -3143, 21579, 59983, -273036, 149565, -195438, -399643, -260312, -325359, -168600, -339255, 34435, 143918, 43681, 243361, -1159, -5809, 71065, 42455]
10260D2455f8552m15108I0915a88567P1972G5993a36920j3149a2553m0888A15965
10248B71278c19A90828a1527A0498J14885c01251C0204b85275B49678f6718C4762
10236B43694J73564d9022A66121J45628j52215c8486k9236b7887A84607d9665
10225A82283g9252j47168j27531J76564h154A25084a05109D51438c26448B57742
10214I6944J87024a56868P2454K125c9790A44613b01109H2769g5354A44928E9982
10202b85928a05325B8545P6388P26D7909K727b66583d5751o2119e949I3837O7998
10190A61835N3052A9218J46317o9327K38113d12141f6684A33773n1457J35592
10180B17908a30669j57207m7444h568j95614e8575j49755m6389Q9489c6495l545
$$ y = [42455, -68552, -483660, 90915, -188567, -116595, 75993, -136920, -150069, -12553, -53441, 115965, 271278, -319, 190828, -11527, 10498, 125383, -301251, 30204, -285275, 249678, -66718, 34762, 243694, 417258, -49022, 166121, 311749, 159534, -38486, -67722, -27887, 184607, -49665, 182283, -79252, -226420, -353951, -177387, -8154, 125084, -105109, 451438, -326448, 257742, 96944, 283968, -156868, -84414, -82289, -39790, 144613, -201109, 82769, -75354, 144928, 59982, -285928, -105325, 28545, 104933, 105659, 47909, 50636, -266583, -45751, -107870, -5949, 93837, 161835, 214887, 19218, 165535, 96208, 334321, -412141, -66684, 133773, 82316, 217908, -130669, -287876, -335320, -8568, -204182, -58575, -208330, -254719, -165230, -36495, -40040]
10169d0040H376a09522j74555g0846J3475a4330q9595I2009C1921d1861k12947
10158b54808C0343a78398A49231b94318f5746j37461A80230J40080e3752k46430
10148c00182c7062a5339p3237L1430j38753l2648J9743f4508B59338D0605M9321
10137H9926e66769c2558l11821a35096E8111a42924r5994i75o8077M360A9039
10125A50677c01729J35577j09758J32654b6850B38446G7725a58561K7058k81406
10115d12909h1239F9682C4296O6138d2722E3174b66162A7400e2351C2605B431
10103b3343q0342j95247l0929i0866E6107i5463k08497q854A39325g2981K3018
10092d9963A00492b17123P7530e4595a039k6192B83314J83028a45423H000K52429
$$ y = [-40040, 8376, -109522, -284077, -70846, -57371, -14330, -103925, 92009, 31921, -41861, -254808, 30343, -178398, 149231, -294318, -65746, -203207, 180230, 320310, -53752, -300182, -37062, -15339, -88576, -57146, -195899, -228547, -208804, -64508, 259338, 40605, 89926, -566769, -32558, -344379, -135096, 58111, -142924, -238918, -975, -69052, -64692, 19039, 150677, -301729, -166152, -275910, -143256, -26850, 238446, 77725, -158561, -131503, -412909, -81239, 69682, 34296, 100434, -42722, 53174, -266162, 17400, -52351, 32605, 2431, -23343, -103685, -298932, -329861, -90866, 56107, -95463, -303960, -312814, 139325, -72981, -49963, 100492, -217123, -139593, -54595, -1039, -27231, 283314, 466342, -145423, 8000, 260429]
10081B60429a18428B93363E9095a44781k60299E3665j4590b31608m8672i2708
10070a46187l1462G2239a58018m1717G4669b39082A30217a76470r8448d7630j40439
10059a88069D821b82228j22162E0473P361B5553Q9067b17637l7009A45858F8081
10047d6879D3769g8375A3148J70311L2763c342A4808a66148B5820a18827j58862
10036b77689r315C7189i0181k4756D4291a04092D4953J30467l7048a83429F4670
10024a53468k0829j37962B41464c68553J27355A56535b35610J12962l03639A8214
10013B2509J64370B7451a2519l07004b981C5194d9077A07646J00940D8788a68846
10001E4009b7155k48974k0149D1199d33883C400a74153q500j06014A14134c40410
$$ y = [260429, -118428, 293363, 59095, -144781, -405080, 53665, 39075, -231608, -280280, -92708, -146187, -177649, 72239, -158018, -199735, 74669, -239082, 130217, -176470, -274918, -47630, -188069, 4821, -282228, -404390, 50473, 57834, 25553, 114620, -217637, -254646, 145858, 68081, -46879, 43769, -78375, 13148, 183459, 216222, -3342, 14808, -166148, 25820, -118827, -277689, -287004, 37189, -90181, -114937, 44291, -104092, 44953, 175420, 138372, -183429, 64670, -153468, -174297, -312259, 241464, -368553, -241198, 156535, -235610, -122648, -426287, 18214, 22509, 186879, 27451, -12519, -319523, -2981, 35194, -49077, 107646, 208586, 48788, -168846, 54009, -27155, -276129, -296278, 41199, -433883, 3400, -174153, -182653, -288667, 114134, -340410]
9989F3464a88722h3565a1092j39892k7728n7872n0429I5529j0464a99609A16399
9977C0423c68923a50811j26852B00568q4123b6543j57209f3060l94944e1780A22398
9965b79927A85154o0375J7221A6339R341J41537p7346a52591p0562d9411q9384
9954a38795l29133c6506j03832A92670E563c14748B37439I7215b15838H8534Q9290
9943A77824a78982A7729c2908l3669j21647D0144a35850a7311j57236P2126k01852
9932c04273d4664A11797a56002q9899J12103b5903B6943b43792d8379A41554E1898
9920G4386l3120b9402I6420a4265k19607A2067K0376J83642B3360c0496j22004
9909a52500H994c30768J47425f9431j92553C34790b7104B66724e0200j51524N2102
$$ y = [63464, -188722, -83565, -11092, -150984, -178712, -236584, -287013, 95529, 85065, -199609, 116399, 30423, -368923, -150811, -277663, 200568, 116445, -26543, -183752, -63060, -458004, -51780, 122398, -279927, 185154, 124779, 142000, 16339, 25680, 167217, 89871, -152591, -223153, -49411, -138795, -467928, -36506, -140338, 192670, 5563, -314748, 237439, 97215, -215838, 88534, 177824, -178982, 17729, -32908, -66577, -188224, 40144, -135850, -17311, -174547, -102421, -304273, -44664, 111797, -156002, -245901, -133798, -25903, 26943, -243792, -48379, 141554, 51898, 74386, 41266, -29402, 96420, -14265, -233872, 12067, 32443, 216085, 23360, -30496, -152500, 8994, -330768, -183343, -69431, -261984, 334790, -27104, 266724, -50200, -201724, -149622]
9898a49622j17945E3015a04489e0985j31278q3297e2134k90109C12472E7712L5239
9887I2951b56291h1353J4588A32989b2384O22j80638f9352k73408D1713j204j1378
9875B9131g9059r4126r1926a3037k916D20958A91341c08276r1834D5455a31806
9863B4517K57839a79212B4408J30663a91572f3308l2667L9991J1980A40061o0631
9852G9430f4886E3168d73737A84448q9922a5808A4665k815a14688N0396n1185
9841a15477b8364D6725a19400j27442p5806J28859Q2235k72373Q8274A37925a90504
9829B44282b66835m3495O4016B73951A03863f6907A88195G9620a62295P7254b1348
9817A96630J247c978l85581G875P1100h0413k30577N8030a08946j8978A47425
$$ y = [-149622, -267567, 53015, -104489, -50985, -182263, -265560, -52134, -342243, 312472, 57712, 92951, -256291, -81353, -66765, 132989, -22384, -21762, -202400, -69352, -342760, 41713, 40509, 29131, -79059, -173185, -265111, -13037, -15953, 420958, 191341, -308276, -400110, 45455, -131806, 24517, 282356, -179212, 24408, 155071, -191572, -63308, -95975, -55984, -44004, 140061, 79430, -64886, 53168, -473737, 184448, 94526, -15808, 14665, 11850, -114688, -64292, -115477, -28364, 46725, -119400, -246842, -322648, -193789, -111554, -383927, -295653, 137925, -190504, 244282, -266835, -310330, -246314, 273951, 103863, -66907, 188195, 79620, -162295, -85041, -21348, 196630, 197877, -3978, -389559, 7875, 78975, -80413, -310990, -252960, -108946, -127924, 147425]
9805B25664I7457a19241A43081A3982a03079g583j07477L9320A83193a38739A66165
9793a37112j71263A45499e58643a8237H2582a25682A96082e9747j35128R2315
9783a02560l4031G7819a34059b655j12572r0351A91476i7473m27968E9396q478
9772E0918d06841a01624L9237C0352a67278d8923A7116J9306K04200i3570A67265
9760d9993k78440d6864b0373p9530J4030A96713b9348l075k87113L9055h9147
9748e62094B1001a04907j81445J03497F8525b13557k5635A11950a42696N2633
9738i0063B01013a7231F9423b01269n3979P4421a9504o2412g936A80799b07659
9726a90445H0462b97477c3159k32058B2600c6795J1064k11841A46914c92224B251
$$ y = [225664, 97457, -119241, 143081, 13982, -103079, -7583, -115060, -75740, 183193, -138739, 166165, -137112, -308375, 145499, -558643, -18237, 82582, -125682, 196082, -59747, -194875, -102560, -136591, 77819, -134059, -2655, -115227, -205578, 191476, -97473, -525441, 59396, 50918, -406841, -101624, -62387, 30352, -167278, -48923, 17116, 36422, 240622, -93570, 167265, -49993, -328433, -46864, -20373, -99903, -85873, 196713, -29348, -32423, -319536, -280481, -89147, -562094, 21001, -104907, -286352, -182855, 68525, -213557, -239192, 111950, -142696, -90063, 201013, -17231, 69423, -201269, -255248, -180827, -19504, -81916, -7936, 180799, -207659, -190445, 80462, -297477, -33159, -265217, 22600, -36795, -25731, -237572, 146914, -392224, 2251]
9714E7465c06038I2071a98068k3657A50435h8702e785l45766C25492C4037a77181
9702c70117c1554k01128b1654F871M34161a94396A1820d63239a4889j73251P9268
9691a08872k10003A87138P6247A965b32746C440b25986B8326K11574b71064B47506
9679C5595c1515A07761b79588i4700C2380c01862f4815C0084a94032B03991A4659
9667a84535A67955a50537N9637A0269f8363A09119e0114j82925A25911i6520E5143
9655b54292N1914C36146G2651a69320j01234A07136b40659a09048a2127k12577
9645b24704R2610j0878L6925j98170B14364H4878c40358g4358j4976k67747A67473
9633B43663B5495a64018D235a91204A06439k16A3503a03032B7706a33505k29099
$$ y = [57465, -306038, 92071, -198068, -221725, 150435, -88702, -5785, -351551, 325492, 34037, -177181, -370117, -31554, -232682, -21654, 6871, 441032, -194396, 11820, -463239, -14889, -188140, -108872, -318875, 187138, 263385, 1965, -232746, 3440, -225986, 28326, 239900, -271064, 247506, 35595, -31515, 107761, -279588, -94700, 32380, -301862, -64815, 30084, -194032, 203991, 14659, -184535, 167955, -150537, -90900, 10269, -68363, 109119, -50114, -233039, 125911, -96520, 55143, -254292, -202378, 336146, 72651, -169320, -270554, 107136, -240659, -109048, -12127, -224704, -132094, -142972, -106047, -304217, 214364, 84878, -340358, -74358, -89334, -357081, 167473, 243663, 25495, -164018, 4235, -191204, 106439, 106223, 13503, -103032, 27706, -133505, -362604]
9622c62604A22463Q683d9483F2676g5183K9724k75361a9723j95029R7939A228
9610a644k35508c4372B7669b86267F7040c531H6814a24999j0803N1811m8946A010
9597a43693j83841o5841A81024a70385p8718l7757a16200B16911b26863M4980
9587a81883B66324A2606a14633A492O3068a18757j70289o5245B59803d8344B3041
9575b48704B50786b22691d7578G9106a5084G7603Q414Q2963D4737a65648r2390
9564b58038A25100i8804l2898k12392i5949j9023j8201I3087a32561j82757d9491
9552a35056b7712k55698j25870h874k71651k2137R2089f9693c835B3702a41892
9540a83370B90408d23409A4485M42243g4764n8073k8358K6189g990a207j62842
$$ y = [-362604, 122463, 131146, -49483, 62676, -75183, -45459, -320820, -19723, -214752, -116813, 1228, -1644, -237152, -34372, 27669, -286267, 67040, -3531, 86814, -124999, -135802, -83991, -132937, 1010, -143693, -327534, -393375, 181024, -170385, -249103, -286860, -116200, 216911, -226863, -181883, 266324, 12606, -114633, 1492, 64560, -118757, -289046, -354291, 259803, -48344, 23041, -248704, 250786, -222691, -47578, 79106, -15084, 77603, 86017, 168980, 44737, -165648, -258038, 125100, -98804, -131702, -344094, -95949, -114972, -133173, 93087, -132561, -315318, -49491, -135056, -27712, -283410, -409280, -8874, -280525, -302662, -210573, -69693, -3835, 23702, -141892, -183370, 290408, -423409, 14485, 456728, -74764, -132837, -161195, -135006, -7990, -1207, -164049]
9529a64049p5374E2986b04064C07521I114P1441i3296k12398c3462j92783f1497
9517b61605N0811J05233A61669H149i3309A43978C6129e22804B59007G810K98386
9506C06196h8556B17227h2382a5922j38065L0529E2282N4738b71931h7697B49184
9494b70672j5353Q780C31573a35226j93455b7924B07276g3636E0852L167f2447
9482b39663A57667A929J21402a37154B00292b74241b0117j18648j79287P66J40170
9471a77116M2824J5156A39954b15816A76018c8703n883j94462A03575c4772j63198
9460a97970g3546g273j82602B73479c7046q9596p4635R988C35163a70530m7912
9449b18442B11678C4265a38466J7163I2957a68965P6172Q67k7349A04542a78220
$$ y = [-164049, -239423, 52986, -204064, 307521, 9114, 80555, -93296, -305694, -33462, -226245, -61497, -261605, -210794, -105561, 161669, 8149, -93309, 143978, 36129, -522804, 259007, 7810, 306196, -88556, 217227, -82382, -15922, -153987, -123458, 52282, 107020, -271931, -87697, 249184, -270672, -286025, -277245, 331573, -135226, -328681, -27924, 207276, -73636, 50852, 54019, -62447, -239663, 157667, 1929, 123331, -137154, 200292, -274241, -20117, -138765, -318052, -317286, -177116, -134292, -119136, 139954, -215816, 176018, -38703, -44586, -239048, 103575, -34772, -197970, -73546, -7273, -189875, 273479, -37046, -126642, -201277, -191289, 335163, -170530, -218442, 211678, 34265, -138466, -121303, 92957, -168965, -92793, -91926, -119275, 104542, -178220]
9437B01991b0191j11160l9665k7245A51411F8341d6475A9847a38289E0774R1360
9426A42134d73065a15072A52822b60880P7221A449b08014B1325a86508b9392j11973
9415a41365A38410C0848e2687m3418A37965j5181g0950A60554b83042E6906Q5648
9404A42554a7542m7050F3957d7222k4104c2701l5158B43171k6978D1285a09809
9392b42818G9944a6896j2450i657F8997c4910j20263f9977c82j71558b0301A94570
9379b1780j0182k2060l91753a19136j27227R5831a330j05105j53970Q3388I2326
9367A5509J7612a62150g6223C6892J05658a63629C27467A22318c43542c9764j96029
9356b35793a04845h561j52668F2637J3137A5403f9438R285j30281K5110k51117
$$ y = [201991, -20191, -131351, -171016, -198261, 151411, 68341, -46475, 19847, -138289, 50774, 142134, -473065, -115072, 152822, -260880, -183659, 1449, -208014, 21325, -186508, -29392, -141365, 138410, 30848, -52687, -96105, 137965, 122784, -70950, 160554, -283042, 56906, 142554, -17542, -64592, 63957, -47222, -71326, -32701, -67859, 243171, 216193, 41285, -109809, -242818, 79944, -16896, -29346, -9657, 68997, -34910, -155173, -69977, -382, -171940, -20301, 194570, -21780, -31962, -54022, -445775, -119136, -246363, -150532, -1330, -106435, -260405, -177017, 92326, 15509, 33121, -162150, -76223, 36892, 142550, -163629, 327467, 122318, -343542, -39764, -235793, -104845, -8561, -161229, 62637, 75774, 15403, -69438, -60153, -190434, -165324, -416441]
9345d16441a15203A37037a91386d1536k17247O8086Q5025r1343N7321D3081c61490
9333i3648m9474H6391b35712c2144G1453L2740L3465E8880R7087a13968j01781
9322b15749m8463D9130J15886k8510a80565Q8997j8679M0903n809L2661f874B44869
9309e0956H2030b67066c7119C6950b88349E7928a42208A92010d13150f0829B8620
9297f5698B16629l4404m3403h8783B18630a6560C60877D4342d870j01600D7562
9285b602j00664A69979b01235I6259h5574B21204a690j28293l856d1202j82751
9274b23953B96157B1981K13019a92704j9264J7388I4561a37289l6566m0460i5662
9262D2342K4664a49125n4971C28930D5508a32427G3816b9285A46480a63012B31603
$$ y = [-416441, -115203, 137037, -191386, -41536, -258783, -190697, -105672, -197015, -139694, 43081, -361490, -93648, -143122, 86391, -235712, -32144, 71453, 104193, 137658, 58880, 155967, -113968, -215749, -264212, 49130, 165016, 136506, -180565, -91568, -110247, -69344, -75153, -42492, -6874, 244869, -50956, 82030, -267066, -37119, 36950, -288349, 57928, -142208, 192010, -413150, -60829, 28620, -65698, 216629, 182225, 138822, -88783, 218630, -16560, 360877, 44342, -4870, -106470, 47562, -2602, -103266, 169979, -201235, 96259, -85574, 221204, -1690, -129983, -133839, -41202, -223953, 296157, 21981, 235000, -192704, -211968, -194580, 94561, -137289, -173855, -214315, -95662, 42342, 67006, -149125, -204096, 328930, 45508, -132427, 73816, -29285, 146480, -163012, 231603]
9250E6327K03501q0535c12999J45004j23536d280A80626g1171m08142B8432M0389
9239F8821b03948A14813c00646a41518K6207L2319Q253C0565j4067h8836A18346
9227b37966C36072B4897P6695K1222M3550c7008B02945g2225j45319D4496J29828
9216A74324b07310F2591b34257i8864m6868A08064A7988b19590A37724a357k80464
9205b81821B05309b80610B60041b13017a06190F5043a55291j38607C1436e36735
9194B04222e40754d6736j84115a6999j73123l1671F1914b64695A07179L76580
9184D83759D768J78759a76988b7093j99310a3849I3768c82654J53579f1j08561
9173a08622j95296J45137a0008B2228b40167D8567K54708H0498d12961a42504
$$ y = [56327, 259828, 179293, -312999, -167995, -291531, -4280, 180626, -71171, -479313, 28432, 68821, -203948, 114813, -300646, -141518, -115311, -82992, -74739, 30565, 16498, -88836, 118346, -237966, 336072, 24897, 101592, 122814, 166364, -37008, 202945, -72225, -217544, 44496, 174324, -207310, 62591, -234257, -98864, -145732, 108064, 17988, -219590, 137724, -1357, -281821, 205309, -280610, 260041, -213017, -106190, 65043, -155291, -293898, 31436, -536735, 204222, -540754, -46736, -230851, -16999, -190122, -221793, 61914, -264695, 107179, 483759, 4768, 183527, -176988, -27093, -226403, -13849, 93768, -382654, -229075, -61, -108622, -303918, -158781, -10008, 22228, -240167, 48567, 303275, 80498, -412961, -142504]
9162a5011A56358a44212J0730b1576k71900D8650R5126b84979Q0852g6186l9099
9151a15285A06183N215c34238k6872a37169d3138J2887n8374B74750i6445A03076
9139b00762E6420d67839B52282g6429I9693a31274a0652j47779k5574P1475L2291
9128h0239c3454m6582k24191K5383A14486b59432G296c40827D8991a11320m1483
9117a52803A39291a58492a0207l3100k50504J18116f976B6284P2737L8676J8610
9106A56307J2209M5569o6455i4995j71059A3120N5341b03059A68853M7117b31736
9094A05997C171J7002b49690c9849k42577A20896A9227R9525c17616I1354C3062
9082f7990C79246a02287m13169i9173k26838J53803C7618J15026i1229m11849
$$ y = [-15011, 156358, -144212, -133482, -21576, -293476, 48650, 143776, -284979, -204127, -76186, -115285, 106183, 111398, -334238, -361110, -137169, -43138, -30251, -88625, 274750, -96445, 103076, -200762, 56420, -467839, 252282, -76429, 99693, -131274, -10652, -158431, -184005, -112530, -80239, -33454, -80036, -304227, -278844, 114486, -259432, 7296, -340827, 48991, -111320, -152803, 139291, -158492, -10207, -43307, -293811, -175695, -6976, 26284, 99021, 137697, 156307, 168516, 214085, 147630, -94995, -266054, 13120, 68461, -203059, 168853, 215970, -231736, 105997, 3171, 20173, -249690, -39849, -282426, 120896, 19227, 118752, -317616, 91354, 33062, -67990, 379246, -102287, -515456, -99173, -326011, -172208, 37618, 152644, -91229, -503078]
9072e03078a49924j39058F9874c8322B9078O5547f7269j54441H506a62446L9838
9061a22608j51668A49637b22944A31630o0557b19284j7072A30455c9066D5801
9050b29398J07723D6036K51314a53234A68116a13613C2612J37981K04475D6331
9039a12924I2804e7031a1629B2361a02519B95213a00894D5233h0406j15824C12147
9027c19064Q5234b327E1271K65775n4444B9914g1765I2100b35308F1179h8626
9015g7207n109F1818c14841J27098f7895j72005J07488j99463A27567h1405E7723
9003a29765A39576b72837A16589f86A35606b3385j38554M5045C9314L6259d98383
8991A26546J75039D7897J09680a93429A65529A1861b13426O3485E8044d82329
$$ y = [-503078, -149924, -288982, 69874, -38322, 29078, 94625, -67269, -221710, 8506, -162446, -122608, -274276, 149637, -222944, 131630, 71073, -219284, -236356, 130455, -39066, 45801, -229398, -121675, 46036, 297350, -153234, 168116, -113613, 32612, 170593, 375068, 46331, -112924, 92804, -57031, -11629, 22361, -102519, 295213, -100894, 45233, -80406, -196230, 312147, -319064, -233830, -2327, 51271, 317046, 262602, 29914, -71765, 92100, -235308, 61179, -88626, -77207, -82316, 61818, -314841, -187743, -67895, -239900, -132412, -331875, 127567, -81405, 57723, -129765, 139576, -272837, 116589, -686, 135606, -23385, -161939, -116894, 39314, 75573, -498383, 126546, 301585, 47897, 157577, -193429, 165529, 11861, -213426, -149941, 58044, -482329]
8980c026o1417r8004A52749k3767a41759e226B54578C3480P9442b06760C3654
8968a32957j1875A47545a22884M1377F9012a52534N3887A02609c4956a283n1713
8957e2996n0345G5366L2685c23919c4039k0849A01882j7252A1123i7014G4512
8945d1891H1630a06342e0305j26798d4273B13813q8126c37861a13278l5553D8995
8933d087G717M462K23740i4298j0498n0754b308C0021O532d44845I0008K02615
8921B92623D5894a84250A58208m7545n0943R5312b94834c8741A75874o534K0023
8910A89363K36421r6307G1443O65746K57604P39213J304390K847170k167230A516459
8899H73855k80510j73934A57438P0400J59417b0677A32165c6867C83927J9397
$$ y = [-3026, -64443, -162447, 152749, 128982, -141759, -5226, 254578, 33480, 112922, -206760, 33654, -132957, -144832, 147545, -122884, -81507, 69012, -152534, -98647, 102609, -34956, -1283, -52996, -103341, 75366, 108051, -323919, -34039, -54888, 101882, 84630, 11123, -97014, 74512, -41891, 81630, -106342, -50305, -177103, -44273, 213813, 125687, -337861, -113278, -148831, 48995, -4087, 7717, 12179, 235919, -94298, -104796, -155550, -2308, 30021, 36553, -444845, 90008, 292623, 45894, -184250, 158208, 110663, 59720, 155032, -294834, -38741, 175874, 169340, 189363, 425784, 329477, 71443, 737189, 994793, 1734006, 3038396, 5885566, 3718336, 1516459, 873855, 593345, 419411, 157438, 227838, 387255, -20677, 132165, -36867, 383927, 403324]
8889D03324D3488a1279f40n3325B87162c13282a35620p9714h3236j11084C9496
8877D4655J43532a25826r4536A8944a76918J0914B97741a04925D6503a73192A83905
8865H4413d6783j68626n7289C90394h2828B05239r3821N7710a22975b5494J0525
8854a4969l53633J56192k8887A0228Q0519a15109l5000l3661B21240a22921A73671
8842h8076C0734a48979B20022A00614M8302a23872I9597C3369J16538A7936h0477
$$ y = [403324, 43488, -11279, -640, -53965, 287162, -313282, -135620, -215334, -83236, -194320, 39496, 44655, 188187, -125826, -220362, 18944, -176918, -166004, 297741, -104925, 46503, -173192, 183905, 84413, -46783, -215409, -272698, 390394, -82828, 205239, 111418, 169128, -122975, -25494, -14969, -368602, -212410, -241297, 10228, 90747, -115109, -150109, -183770, 221240, -122921, 173671, -88076, 30734, -148979, 220022, 100614, 148916, -123872, 99597, 33369, 149907, 17936, -80477]
$$ [...]
##END NTUPLES=NMR SPECTRUM
##END=
