
##TITLE=AC1206_HPAAH12049_5973603_ulgv45x8Rn
##JCAMPDX= 6.0         $$ Bruker NMR JCAMP-DX V2.0
##DATA TYPE= NMR SPECTRUM
##DATA CLASS= NTUPLES
##ORIGIN= BRUKER
##OWNER= Administrator
$$ 1.72 TOPSPIN		Version 2.1
$$ 2012-04-14 20:08:29.765 -0500  Administrator@TOPSPIN
$$ Compression mode = diff/dup
##.OBSERVE FREQUENCY= 400.13188235
##.OBSERVE NUCLEUS= ^1H
##.ACQUISITION MODE= SIMULTANEOUS (DQD)
##.ACQUISITION SCHEME= undefined
##.AVERAGES= 64
##.DIGITISER RES= 22
##SPECTROMETER/DATA SYSTEM= spect
##.PULSE SEQUENCE= noesygpps1d.comp
##.SOLVENT NAME= COFFEE_meoh
##.SHIFT REFERENCE= INTERNAL, COFFEE_meoh, 1, 14.96846
##AUDIT TRAIL= $$ (NUMBER, WHEN, WHO, WHERE, PROCESS, VERSION, WHAT)
$$ ##TITLE= Audit trail, TOPSPIN		Version 2.1
$$ ##JCAMPDX= 5.01
$$ ##ORIGIN= Bruker BioSpin GmbH
$$ ##OWNER= Administrator
$$ $$ C:\Bruker\TOPSPIN/data/COFFEE/nmr/AC1206_HPAAH12049_5973603_ulgv45x8Rn/12/pdata/1/auditp.txt
$$ ##AUDIT TRAIL=  $$ (NUMBER, WHEN, WHO, WHERE, PROCESS, VERSION, WHAT)
(   1,<2012-04-14 20:08:22.750 -0500>,<Administrator>,<TOPSPIN>,<go>,<TOPSPIN 2.1>,
      <created by zg
	started at 2012-04-14 19:56:49.718 -0500,
	POWCHK enabled, PULCHK disabled,
       configuration hash MD5:
       1A 1E CE 29 27 FD 77 03 67 4E F0 E3 C4 B2 CB 90
       data hash MD5: 64K
       57 A0 A9 A3 2A F3 52 4D BD 11 48 75 C4 66 53 BD>)
(   2,<2012-04-14 20:08:26.718 -0500>,<Administrator>,<TOPSPIN>,<proc1d>,<TOPSPIN 2.1>,
      <Start of raw data processing
       efp LB = 0.3 FT_mod = 6 PKNL = 1 PHC0 = 0 PHC1 = 0 SI = 128K 
       data hash MD5: 128K
       EB E0 FF CA DE B3 DB 04 99 88 44 22 AD A6 22 ED>)
(   3,<2012-04-14 20:08:28.546 -0500>,<Administrator>,<TOPSPIN>,<proc1d>,<TOPSPIN 2.1>,
      <pk PHC0 = 34.77722 PHC1 = 0 
       data hash MD5: 128K
       85 F5 0D 02 C7 27 6F 5E 86 D6 19 A5 9E AB 55 6A>)
(   4,<2012-04-14 20:08:28.890 -0500>,<Administrator>,<TOPSPIN>,<proc1d>,<TOPSPIN 2.1>,
      <abs ABSG = 1 
       data hash MD5: 128K
       B5 50 1C BB FE 38 C1 39 B0 B1 2B 48 4F 4B 1E B6>)
(   5,<2012-04-14 20:08:28.984 -0500>,<Administrator>,<TOPSPIN>,<proc1d>,<TOPSPIN 2.1>,
      <abs ABSG = 2 
       data hash MD5: 128K
       26 13 1F E6 5D 7C 7A F7 D8 4F 24 E4 34 64 AF BE>)
(   6,<2012-04-14 20:08:29.484 -0500>,<Administrator>,<TOPSPIN>,<proc1d>,<TOPSPIN 2.1>,
      <abs ABSG = 3 
       data hash MD5: 128K
       CD 55 79 C1 A1 D7 CB E3 19 EB 24 66 3A 58 32 C6>)
(   7,<2012-04-14 20:08:29.578 -0500>,<Administrator>,<TOPSPIN>,<proc1d>,<TOPSPIN 2.1>,
      <abs ABSG = 4 
       data hash MD5: 128K
       0A D6 79 56 48 1A 85 60 67 4C 2A C5 87 BA 65 34>)
(   8,<2012-04-14 20:08:29.640 -0500>,<Administrator>,<TOPSPIN>,<proc1d>,<TOPSPIN 2.1>,
      <abs ABSG = 5 
       data hash MD5: 128K
       70 22 06 15 FB 82 88 AC A1 6A 82 7D 6B E1 31 A9>)
$$ ##END=
$$ 
$$ $$ hash MD5
$$ $$ FB C5 2E 4F 6F F3 79 30 FC 88 D4 52 9F 6C 87 22
##$RELAX= 
##$RELAX= 
##$RELAX= 
##$RELAX= 
##$RELAX= 
##$RELAX= 
##$RELAX= 
##$RELAX= 
$$ Bruker specific parameters
$$ [...]
##$TP07= 0
##$TPNAME0= <>
##$TPNAME1= <>
##$TPNAME2= <>
##$TPNAME3= <>
##$TPNAME4= <>
##$TPNAME5= <>
##$TPNAME6= <>
##$TPNAME7= <>
##$TPOAL= (0..7)
0.5 0.5 0.5 0.5 0.5 0.5 0.5 0.5
##$TPOFFS= (0..7)
0 0 0 0 0 0 0 0
##$TUNHIN= 0
##$TUNHOUT= 0
##$TUNXOUT= 0
##$USERA1= <user>
##$USERA2= <user>
##$USERA3= <user>
##$USERA4= <user>
##$USERA5= <user>
##$V9= 5
##$VALIST= <valist>
##$VCLIST= <CCCCCCCCCCCCCCC>
##$VD= 0
##$VDLIST= <DDDDDDDDDDDDDDD>
##$VPLIST= <PPPPPPPPPPPPPPP>
##$VTLIST= <TTTTTTTTTTTTTTT>
##$WBST= 1024
##$WBSW= 4
##$XGAIN= (0..3)
0 0 0 0
##$XL= 0
##$YL= 0
##$YMAX_a= 11362341
##$YMIN_a= -6161101
##$ZGOPTNS= <>
##$ZL1= 120
##$ZL2= 120
##$ZL3= 120
##$ZL4= 120
##$ABSF1= 14.96846
##$ABSF2= -5.58407
##$ABSG= 5
##$ABSL= 3
##$ALPHA= 0
##$AQORDER= 0
##$ASSFAC= 0
##$ASSFACI= 0
##$ASSFACX= 0
##$ASSWID= 0
##$AUNMP= <proc_prof1d_extract.lims>
##$AXLEFT= 0
##$AXNAME= <>
##$AXNUC= <1H>
##$AXRIGHT= 0
##$AXTYPE= 0
##$AXUNIT= <>
##$AZFE= 0.1
##$AZFW= 0.1
##$BCFW= 0
##$BC_mod= 0
##$BYTORDP= 0
##$COROFFS= 0
##$CY= 15
##$DATMOD= 1
##$DC= 0
##$DFILT= <>
##$DTYPP= 0
##$F1P= 0
##$F2P= 0
##$FCOR= 0.5
##$FTSIZE= 131072
##$FT_mod= 6
##$GAMMA= 0
##$GB= 0
##$INTBC= 1
##$INTSCL= 1
##$ISEN= 128
##$LB= 0.3
##$LEV0= 0
##$LPBIN= 0
##$MAXI= 10000
##$MC2= 0
##$MEAN= 0
##$ME_mod= 0
##$MI= 0
##$NCOEF= 0
##$NC_proc= -3
##$NLEV= 6
##$NOISF1= 0
##$NOISF2= 0
##$NSP= 0
##$NTH_PI= 0
##$NZP= 0
##$OFFSET= 14.96846
##$PC= 1
##$PHC0= 34.77722
##$PHC1= 0
##$PH_mod= 1
##$PKNL= yes
##$PPARMOD= 0
##$PPDIAG= 0
##$PPIPTYP= 0
##$PPMPNUM= 2147483647
##$PPRESOL= 1
##$PSCAL= 4
##$PSIGN= 0
##$PYNMP= <proc.py>
##$REVERSE= no
##$SF= 400.130004860154
##$SI= 131072
##$SIGF1= 0
##$SIGF2= 0
##$SINO= 400
##$SIOLD= 131072
##$SPECTYP= <>
##$SREGLST= <1H.CDCl3>
##$SSB= 0
##$STSI= 131072
##$STSR= 0
##$SW_p= 8223.68421052632
##$SYMM= 0
##$S_DEV= 0
##$TDeff= 65536
##$TDoff= 0
##$TI= <>
##$TILT= no
##$TM1= 0
##$TM2= 0
##$TOPLEV= 0
##$USERP1= <user>
##$USERP2= <user>
##$USERP3= <user>
##$USERP4= <user>
##$USERP5= <user>
##$WDW= 1
##$XDIM= 131072
##$YMAX_p= 463631922
##$YMIN_p= -571862703
##$CURPLOT= <Network HP LaserJet P1505>
##$CURPRIN= <$Network HP LaserJet P1505>
##$DFORMAT= <normdp>
##$LAYOUT= <+/1D_H.xwp>
##$LFORMAT= <normlp>
##$PFORMAT= <normpl>
##$SURQMSG= 1
$$ End of Bruker specific parameters
$$ ---------------------------------
##NTUPLES= NMR SPECTRUM
##VAR_NAME=  FREQUENCY,     SPECTRUM/REAL,   SPECTRUM/IMAG
##SYMBOL=    X,             R,               I
##VAR_TYPE=  INDEPENDENT,   DEPENDENT,       DEPENDENT
##VAR_FORM=  AFFN,          ASDF,            ASDF
##VAR_DIM=   131072,        131072,          131072
##UNITS=     HZ,            ARBITRARY UNITS, ARBITRARY UNITS
##FACTOR=    0.0627417313425165, 1,          1
##FIRST=     8223.62146879498, -1485,        -79812
##LAST=      0,             2227,            -80630
##MIN=       0,             -571862703,      0
##MAX=       8223.62146879498, 463631922,    0
$$ Real data points
##PAGE= N=1
##DATA TABLE= (X++(R..R)), XYDATA
$$ [...]
$$ plain form
61786 2588325 2548629 2511272 2478138 2450852 2428547 2408990 2391192 2375752 2363204 2353403 2346344 2342235
61774 2342235 2340613 2340422 2341183 2343313 2347189 2352672 2359565 2367745 2376760 2386083 2395862 2406708 2418803 2432067
61760 2432067 2447303 2466052 2488842 2514453 2541566 2570567 2603118 2640386 2682306 2728297 2778086
61749 2778086 2831856 2890040 2953038 3021057 3094225 3172936 3257927 3349938 3449433 3556674 3671911
61738 3671911 3795361 3927120 4067308 4216540 4376370 4549010 4736078 4937614 5153002
61729 5153002 5383229 5631680 5902289 6197480 6518657 6868375 7251123 7672094 8135918
61720 8135918 8646802 9209370 9829144 10512158 11263627 12086566 12982132 13951657 14997460
61711 14997460 16120443 17316991 18578710 19893896 21246940 22615488 23968913 25269176
$$ packed form
61786B588325l9696l7357l3134k7286k2305j9557j7798j5440j2548r801p059m109
61774B342235j622j91P61K130L876N483O893Q180R015R323R779J0846J2095J3264
61760B432067J5236J8749K2790K5611K7113K9001L2551L7268M1920M5991M9789
61749B778086N3770N8184O2998O8019P3168P8711Q4991R2011R9495J07241J15237
61738C671911J23450J31759J40188J49232J59830J72640J87068K01536K15388
61729E153002K30227K48451K70609K95191L21177L49718L82748M20971M63824
61720H135918N10884N62568O19774O83014P51469Q22939Q95566R69525J045803
61711A4997460J122983J196548J261719J315186J353044J368548J353425J300263
$$ plain form
61703 25269176 26471625 27525349 28376521 28976110 29288097 29294073 28994438 28407955 27569207
61694 27569207 26523366 25320155 24009079 22635759 21239096 19850674 18496309 17196643
61686 17196643 15965251 14807789 13725313 12718848 11789983 10938044 10158931 9447280 8798533
61677 8798533 8208641 7673207 7187765 6748092 6349673 5987646 5657858 5357334 5083304
61668 5083304 4832651 4603013 4393659 4204224 4032898 3876768 3733696 3602954 3483978
61659 3483978 3375386 3275524 3183268 3097803 3018002 2942619 2871134 2804118 2742566 2686772 2635776
61648 2635776 2587978 2542432 2499485 2460043 2424236 2390935 2358392 2325150 2290588 2255209 2220516
61637 2220516 2188021 2157962 2129064 2099711 2069170 2037728 2006298 1976160 1948489 1923356 1899405
$$ packed form
61703B5269176J202449J053724Q51172N99589L11987N976k99635n86483q38748
61694B7569207j045841j203211j311076j373320j396663j388422j354365j299666
61686A7196643j231392j157462j082476j006465r28865q51939p79113p11651o48747
61677H798533n89892n35434m85442m39673l98419l62027l29788l00524k74030
61668E083304k50653k29638k09354j89435j71326j56130j43072j30742j18976
61659C483978j08592r9862r2256q5465p9801p5383p1485o7016o1552n5794n0996
61648B635776m7798m5546m2947l9442l5807l3301l2543l3242l4562l5379l4693
61637B220516l2495l0059k8898k9353l0541l1442l1430l0138k7671k5133k3951
$$ plain form
61626 1899405 1875105 1850341 1826375 1804396 1784523 1765947 1747506 1728411 1709221 1691979 1678489
61615 1678489 1668296 1659045 1648866 1637661 1626165 1614997 1604917 1596700 1589955 1583091 1575264 1567447
61603 1567447 1560730 1554620 1548145 1541654 1536003 1530694 1524612 1518221 1513129 1509305 1504604 1497672 1489800 1483073
61589 1483073 1477908 1473318 1468590 1463660 1458493 1453192 1448421 1445007 1443245 1442944 1443713 1444855 1445601 1446042 1447243
61574 1447243 1449766 1452685 1454837 1456581 1459354 1463719 1468916 1474335 1480284 1486903 1493272 1498386 1502496 1506546
61560 1506546 1510401 1512642 1512496 1511209 1510715 1511303 1511520 1510332 1508269 1505980 1502731 1497269 1489603 1480909 1472013
61545 1472013 1463035 1454317 1446502 1439509 1432425 1424712 1416711 1408709 1400426 1391794 1383416 1375769 1368709 1362294
61531 1362294 1357363 1354629 1353727 1353752 1354364 1355807 1358246 1361669 1366271 1372545 1381135 1392719 1407621 1425234
$$ packed form
61626A899405k4300k4764k3966k1979j9873j8576j8441j9095j9190j7242j3490
61615A678489j0193r251j0179j1205j1496j1168j0080q217o745o864p827p817
61603A567447o717o110o475o491n651n309o082o391n092l824m701o932p872o727
61589A483073n165m590m728m930n167n301m771l414j762l01P69J142P46M41J201
61574A447243K523K919K152J744K773M365N197N419N949O619O369N114M110M050
61560A506546L855K241j46j287m94N88K17j188k063k289l249n462p666q694q896
61545A472013q978q718p815o993p084p713q001q002q283q632q378p647p060o415
61531A362294m931k734r02K5O12J443K439L423M602O274Q590J1584J4902J7613
$$ plain form
61517 1425234 1444256 1463806 1484157 1506363 1531587 1560590 1593028 1627194 1661459 1696257 1733606
61506 1733606 1774236 1816450 1858522 1900960 1945080 1990208 2033888 2074601 2112993 2150366 2187109
61495 2187109 2222839 2257296 2290700 2323460 2355481 2385489 2411419 2431992 2447687 2459848 2469280
61484 2469280 2476074 2480048 2480552 2476499 2467625 2455428 2441923 2427709 2412131 2395073 2377683 2361532
61472 2361532 2347929 2337799 2331164 2326838 2323616 2321848 2322965 2327632 2335426 2346443 2362073 2383830 2412224
61459 2412224 2447062 2488166 2535615 2590044 2652889 2725666 2808926 2902704 3007973 3126611 3259584
61448 3259584 3406192 3565664 3738701 3926927 4131462 4352609 4590138 4843004 5108964
61439 5108964 5385105 5668607 5956513 6244642 6526785 6794873 7039946 7253359 7427505
$$ packed form
61517A425234J9022J9550K0351K2206K5224K9003L2438L4166L4265L4798L7349
61506A733606M0630M2214M2072M2438M4120M5128M3680M0713L8392L7373L6743
61495B187109L5730L4457L3404L2760L2021L0008K5930K0573J5695J2161R432
61484B469280O794L974N04m053q874j2197j3505j4214j5578j7058j7390j6151
61472B361532j3603j0130o635m326l222j768J117M667P794J1017J5630K1757K8394
61459B412224L4838M1104M7449N4429O2845P2777Q3260R3778J05269J18638J32973
61448C259584J46608J59472J73037J88226K04535K21147K37529K52866K65960
61439E108964K76141K83502K87906K88129K82143K68088K45073K13413J74146
$$ plain form
61430 7427505 7556020 7634464 7661763 7640701 7576213 7473328 7337336 7175221 6995115 6803760
61420 6803760 6605419 6403484 6202101 6005758 5818273 5642676 5481009 5333661 5200010
61411 5200010 5080722 4978594 4896075 4832459 4784529 4749602 4727105 4717568 4721158 4737168 4764071
61400 4764071 4799942 4843416 4894309 4952852 5018272 5088549 5161585 5236246 5312193 5388970 5465354
61389 5465354 5539716 5611200 5680501 5749038 5817329 5884753 5950916 6016301 6080964 6143439 6201970
61378 6201970 6256473 6308368 6358537 6406269 6450172 6489289 6522982 6550355 6570314 6582098 6585589
61367 6585589 6581216 6569819 6552623 6531162 6506738 6479658 6449304 6415444 6379296 6342672 6306350
61356 6306350 6270275 6235301 6203396 6175601 6151046 6128823 6109677 6094603 6082722 6072056 6061885
$$ packed form
61430G427505J28515P8444K7299k1062o4488j02885j35992j62115j80106j91355
61420F803760j98341k01935k01383j96343j87485j75597j61667j47348j33651
61411E200010j19288j02128q2519o3616m7930l4927k2497r537L590J6010K6903
61400D764071L5871M3474N0893N8543O5420P0277P3036P4661P5947P6777P6384
61389E465354P4362P1484O9301O8537O8291O7424O6163O5385O4663O2475N8531
61378F201970N4503N1895N0169M7732M3903L9117L3693K7373J9959J1784L491
61367F585589m373j1397j7196k1461k4424k7080l0354l3860l6148l6624l6322
61356F306350l6075l4974l1905k7795k4555k2223j9146j5074j1881j0666j0171
$$ plain form
61345 6061885 6052668 6043746 6032845 6018317 6000696 5981592 5962149 5943104 5925365 5909784 5897057 5888565
61333 5888565 5886870 5894767 5914149 5946247 5992631 6055476 6137021 6239042 6362563 6507856 6674920
61322 6674920 6864104 7075881 7309851 7564299 7836788 8124594 8424284 8731458 9041261
61313 9041261 9348469 9646446 9926474 10178861 10394751 10566842 10689467 10759331 10776196 10741942
61303 10741942 10658912 10529907 10359573 10154376 9920325 9661318 9380297 9081440 8770442
61294 8770442 8452977 8133711 7816616 7505368 7203171 6912646 6636033 6375016 6130301
61285 6130301 5902045 5690959 5498511 5325642 5171715 5035080 4914326 4808676 4717794 4642001
61275 4642001 4582350 4539506 4512442 4498919 4497293 4507099 4527701 4557367 4594369 4638385 4689924 4748486
$$ packed form
61345F061885r217q922j0901j4528j7621j9104j9443j9045j7739j5581j2727q492
61333E888565j695P897J9382L2098M6384O2845Q1545J02021J23521J45293J67064
61322F674920J89184K11777K33970K54448K72489K87806K99690L07174L09803
61313I041261L07208K97977K80028K52387K15890J72091J22625O9864J6865l4254
61303A0741942q3030j29005j70334k05197k34051k59007k81021k98857l10998
61294H770442l17465l19266l17095l11248l02197k90525k76613k61017k44715
61285F130301k28256k11086j92448j72869j53927j36635j20754j05650r0882p5793
61275D642001n9651m2844k7064j3523j626R806K0602K9666L7002M4016N1539N8562
$$ plain form
61263 4748486 4811882 4877386 4943051 5007922 5071504 5133298 5192690 5249063 5301977 5351191 5396549
61252 5396549 5437970 5475499 5508910 5537072 5558143 5570911 5575845 5574433 5567518 5554632 5534874 5507971
61240 5507971 5474334 5434517 5389017 5338548 5284162 5226867 5167118 5104851 5040103 4973408 4905403
61229 4905403 4836340 4766569 4697441 4631064 4568810 4510619 4456083 4405628 4359977 4318992 4281988
61218 4281988 4248997 4220645 4196501 4174377 4151828 4127908 4103119 4078160 4053361 4029027 4005571
61207 4005571 3983048 3961030 3939428 3919369 3902893 3891488 3885046 3882597 3884190 3891764 3908014 3934641
61195 3934641 3971894 4019470 4077386 4146096 4226179 4317892 4420674 4533086 4653447 4780404
61185 4780404 4912504 5047298 5181183 5309872 5428433 5531022 5611411 5664228 5685665 5673412
$$ packed form
61263D748486O3396O5504O5665O4871O3582O1794N9392N6373N2914M9214M5358
61252E396549M1421L7529L3411K8162K1071J2768M934j412o915j2886j9758k6903
61240E507971l3637l9817m5500n0469n4386n7295n9749o2267o4748o6695o8005
61229D905403o9063o9771o9128o6377o2254n8191n4536n0455m5651m0985l7004
61218D281988l2991k8352k4144k2124k2549k3920k4789k4959k4799k4334k3456
61207D005571k2523k2018k1602k0059j6476j1405o442k449J593P574J6250K6627
61195C934641L7253M7576N7916O8710Q0083R1713J02782J12412J20361J26957
61185D780404J32100J34794J33885J28689J18561J02589Q0389N2817K1437j2253
$$ plain form
61175 5673412 5626933 5547958 5439885 5306375 5151273 4980092 4800171 4618029 4436930 4257942
61165 4257942 4082895 3915093 3757281 3610171 3473349 3346705 3230526 3124884 3029316 2942782
61155 2942782 2863864 2791696 2726850 2670522 2622575 2581239 2545118 2514453 2489664 2469720 2453316
61144 2453316 2441013 2434598 2434368 2438485 2445325 2455063 2468273 2484015 2500251 2515375 2528519 2538884
61132 2538884 2545757 2549004 2548871 2545459 2538925 2529897 2519052 2506497 2492141 2476325 2459367 2440786 2419900
61119 2419900 2397033 2373107 2348020 2320553 2290283 2258662 2227619 2197750 2168416 2138938 2108961
61108 2108961 2078102 2046073 2013068 1979470 1945327 1910547 1875449 1840693 1806760 1773828 1741863
61097 1741863 1710357 1678276 1645086 1611887 1580789 1552655 1525870 1497902 1467969 1437623 1408528
$$ packed form
61175E673412m6479p8975j08073j33510j55102j71181j79921j82142j81099j78988
61165D257942j75047j67802j57812j47110j36822j26644j16179j05642r5568q6534
61155B942782p8918p2168o4846n6328m7947m1336l6121l0665k4789j9944j6404
61144B453316j2303o415k30M117O840R738J3210J5742J6236J5124J3144J0365
61132B538884O873L247j33l412o534r028j0845j2555j4356j5816j6958j8581k0886
61119B419900k2867k3926k5087k7467l0270l1621l1043k9869k9334k9478k9977
61108B108961l0859l2029l3005l3598l4143l4780l5098l4756l3933l2932l1965
61097A741863l1506l2081l3190l3199l1098k8134k6785k7968k9933l0346k9095
$$ plain form
61086 1408528 1380204 1350694 1319299 1287753 1258198 1230818 1204497 1179428 1157672 1140820 1128187
61075 1128187 1118003 1109508 1103101 1099027 1096921 1096367 1097132 1098958 1101791 1105978 1111612 1117861 1123735 1129461
61061 1129461 1136384 1145474 1156537 1168963 1182507 1197048 1212090 1226812 1240423 1252493 1263358 1274136
61049 1274136 1285815 1298187 1310063 1320550 1329550 1336994 1342256 1344644 1344062 1341031 1336479 1331652 1327617
61036 1327617 1324435 1321125 1316681 1310815 1303680 1295530 1287067 1279524 1273665 1268923 1264036 1258424 1252481 1246714
61022 1246714 1241111 1235346 1229102 1222117 1214365 1206396 1199148 1193110 1187862 1182725 1177730 1173571 1170504 1167686
61008 1167686 1163976 1159315 1154973 1152399 1152095 1153543 1155662 1157120 1156802 1154720 1152330 1151446 1152804 1156011 1160610
60993 1160610 1166578 1173814 1181888 1190538 1199895 1209932 1220225 1230660 1242151 1256220 1273771 1294257
$$ packed form
61086A408528k8324k9510l1395l1546k9555k7380k6321k5069k1756j6852j2633
61075A128187j0184q495o407m074k106n54P65J826K833M187N634O249N874N726
61061A129461O923R090J1063J2426J3544J4541J5042J4722J3611J2070J0865J0778
61049A274136J1679J2372J1876J0487R000P444N262K388n82l031m552m827m035
61036A327617l182l310m444n866p135q150q463p543n859m742m887n612n943n767
61022A246714n603n765o244o985p752p969p248o038n248n137m995m159l067k818
61008A167686l710m661m342k574l04J448K119J458l18k082k390q84J358L207M599
60993A160610N968P236Q074Q650R357J0037J0293J0435J1491J4069J7551K0486
$$ plain form
60981 1294257 1315943 1337050 1356944 1376295 1396126 1417026 1439492 1464449 1492577 1523310 1555441
60970 1555441 1588787 1624359 1662754 1703318 1745295 1788872 1834528 1882191 1931827 1984239 2040523
60959 2040523 2101137 2166042 2235094 2307709 2382990 2461276 2544909 2636242 2735213 2840182 2950879
60948 2950879 3069035 3195951 3330915 3472570 3620745 3776460 3941364 4118047 4310145
60939 4310145 4521249 4754130 5011520 5296991 5614617 5969020 6367206 6820174 7341623
60930 7341623 7944775 8640551 9437765 10343798 11365702 12512760 13799156 15243864 16868240
60921 16868240 18694914 20748404 23051804 25613873 28407787 31349827 34289526 37022715
60913 37022715 39333712 41058368 42141685 42658574 42783815 42725558 42653134 42644819 42666087 42579853
$$ packed form
60981A294257K1686K1107J9894J9351J9831K0900K2466K4957K8128L0733L2131
60970A555441L3346L5572L8395M0564M1977M3577M5656M7663M9636N2412N6284
60959B040523O0614O4905O9052P2615P5281P8286Q3633R1333R8971J04969J10697
60948B950879J18156J26916J34964J41655J48175J55715J64904J76683J92098
60939D310145K11104K32881K57390K85471L17626L54403L98186M52968N21449
60930G341623O03152O95776P97214R06033J021904J147058J286396J444708J624376
60921A6868240J826674K053490K303400K562069K793914K942040K939699K733189
60913C7022715K310997J724656J083317N16889J25241n8257p2424q315K1268q6234
$$ plain form
60903 42579853 42188523 41301778 39808698 37721410 35167541 32338853 29428831 26590816
60895 26590816 23925556 21487292 19295144 17344395 15616915 14089517 12739192 11545790
60887 11545790 10492844 9566406 8752916 8038576 7410765 6858904 6373005 5942154 5555756
60878 5555756 5206241 4889609 4603245 4344069 4108858 3895119 3700636 3522453 3357062
60869 3357062 3201710 3055156 2917054 2786920 2663828 2546937 2435880 2330458 2230242
60860 2230242 2134812 2044272 1959089 1879467 1805313 1736787 1674078 1616325 1561625 1508852 1459057
60849 1459057 1414201 1374758 1339260 1306034 1274504 1244807 1217048 1191304 1167773 1146470 1126988
60838 1126988 1108695 1091023 1073684 1056992 1041844 1028871 1017662 1007332 997762 989657 983422 978676
$$ packed form
60903D2579853l91330q86745j493080k087288k553869k828688k910022k838015
60895B6590816k665260k438264k192148j950749j727480j527398j350325j193402
60887A1545790j052946r26438q13490p14340o27811n51861m85899m30851l86398
60878E555756l49515l16632k86364k59176k35211k13739j94483j78183j65391
60869C357062j55352j46554j38102j30134j23092j16891j11057j05422j00216
60860B230242r5430r0540q5183p9622p4154o8526o2709n7753n4700n2773m9795
60849A459057m4856l9443l5498l3226l1530k9697k7759k5744k3531k1303j9482
60838A126988j8293j7672j7339j6692j5148j2973j1209j0330r570q105o235m746
$$ plain form
60826 978676 974892 971826 969278 967306 966762 968636 972487 976597 980252 984941 992276 1001449 1009854 1015925
60812 1015925 1020367 1024599 1029027 1033156 1036661 1039764 1042733 1045415 1047476 1049063 1050991 1053931 1057466 1060356
60798 1060356 1061794 1062007 1061541 1060585 1059289 1058200 1057959 1058910 1061273 1065288 1070867 1077601 1085396 1094542 1104810
60783 1104810 1115120 1124629 1133460 1141857 1149497 1156525 1164467 1174774 1186807 1198526 1208998 1218981 1229046
60770 1229046 1238513 1246667 1253824 1260500 1266400 1271022 1274788 1278913 1284355 1291225 1299016 1307149 1315459 1324217
60756 1324217 1333436 1342328 1349968 1356379 1362246 1367607 1371705 1374314 1376166 1377554 1377431 1374618 1369227 1362143
60742 1362143 1353773 1344304 1334656 1325916 1317810 1308808 1298033 1286197 1274297 1262198 1249188 1235486
60730 1235486 1222507 1211715 1203688 1198150 1194366 1191374 1188362 1185210 1182580 1181300 1181769 1184029 1188159 1194228
$$ packed form
60826I78676l784l066k548j972n44J874L851M110L655M689P335R173Q405O071
60812A015925M442M232M428M129L505L103K969K682K061J587J928K940L535K890
60798A060356J438K13m66r56j296j089k41R51K363M015N579O734P795R146J0268
60783A104810J0310R509Q831Q397P640P028P942J0307J2033J1719J0472R983J0065
60770A229046R467Q154P157O676N900M622L766M125N442O870P791Q133Q310Q758
60756A324217R219Q892P640O411N867N361M098K609J852J388j23k813n391p084
60742A362143q370r469r648q740q106r002j0775j1836j1900j2099j3010j3702
60730A235486j2979j0792q027n538l784k992l012l152k630j280M69K260M130O069
$$ plain form
60716 1194228 1201965 1210968 1221354 1233842 1248839 1265597 1282576 1298706 1314296 1330781 1349570 1370803
60704 1370803 1392981 1413854 1431934 1447283 1461002 1474132 1486925 1498741 1508530 1515722 1520810 1524876
60692 1524876 1528564 1531889 1535028 1538622 1543111 1548254 1553534 1558337 1561724 1563077 1563460 1565070 1568347 1570764
60678 1570764 1569843 1566410 1563112 1560447 1556540 1550789 1545241 1541497 1538255 1533291 1526382 1518783 1510858 1501880
60664 1501880 1491761 1481556 1472305 1464330 1457562 1451749 1446427 1441361 1436983 1433898 1432099 1430959 1429682
60651 1429682 1427437 1423575 1418268 1412513 1407007 1401499 1395625 1389682 1383906 1377760 1370839 1363844 1357649 1351962
60637 1351962 1346029 1340203 1335470 1331640 1327366 1322026 1316407 1311474 1307595 1305081 1304178 1304197 1303729 1302104 1299638
60622 1299638 1296284 1291283 1284568 1277063 1268790 1258099 1243988 1228216 1213739 1201582 1190499 1179244
$$ packed form
60716A194228P737R003J0386J2488J4997J6758J6979J6130J5590J6485J8789K1233
60704A370803K2178K0873J8080J5349J3719J3130J2793J1816R789P192N088M066
60692A524876L688L325L139L594M489N143N280M803L387J353L83J610L277K417
60678A570764r21l433l298k665l907n751n548l744l242m964o909p599p925q978
60664A501880j0119j0205r251p975o768n813n322n066m378l085j799j140j277
60651A429682k245l862n307n755n506n508n874n943n776o146o921o995o195n687
60637A351962n933n826m733l830m274n340n619m933l879k514r03J9m68j625k466
60622A299638l354n001o715p505q273j0691j4111j5772j4477j2157j1083j1255
$$ plain form
60610 1179244 1167875 1156958 1146800 1137699 1130011 1123636 1117967 1112431 1106633 1100228 1093448 1087624 1084267
60597 1084267 1083403 1083596 1083739 1083967 1084597 1085190 1085351 1085677 1087024 1089333 1092060 1095409 1100072 1105590 1109872 1110893
60581 1110893 1108583 1104858 1102087 1101609 1103236 1105783 1108328 1111198 1115532 1121771 1129047 1136413 1144203 1153612
60567 1153612 1165241 1178808 1194015 1210714 1228102 1244939 1261227 1278915 1300023 1324437 1350290
60556 1350290 1376284 1402882 1431404 1462652 1496353 1531171 1565175 1596910 1626167 1653286 1677859
60545 1677859 1698738 1715081 1726439 1731895 1730348 1722062 1708832 1691964 1671150 1646191 1618831 1591517
60533 1591517 1564792 1537345 1508688 1480641 1455833 1435510 1419025 1404825 1391697 1379574 1369377
60522 1369377 1361760 1356016 1350716 1345262 1340070 1335253 1330162 1324638 1319774 1316625 1314684 1312453 1309287 1306037
$$ packed form
60610A179244j1369j0917j0158r101p688o375n669n536n798o405o780n824l357
60597A084267q64J93J43K28O30N93J61L26J347K309K727L349M663N518M282J021
60581A110893k310l725k771m78J627K547K545K870M334O239P276P366P790R409
60567A153612J1629J3567J5207J6699J7388J6837J6288J7688K1108K4414K5853
60556A350290K5994K6598K8522L1248L3701L4818L4004L1735K9257K7119K4573
60545A677859K0879J6343J1358N456j547q286j3230j6868k0814k4959k7360k7314
60533A591517k6725k7447k8657k8047k4808k0323j6485j4200j3128j2123j0197
60522A369377p617n744n300n454n192m817n091n524m864l149j941k231l166l250
$$ plain form
60508 1306037 1304024 1303986 1305914 1309272 1313368 1318128 1324597 1334058 1346296 1359278 1371098 1381964 1393688
60495 1393688 1407324 1422083 1436864 1452152 1469654 1490282 1513362 1537988 1564346 1593120 1624097
60484 1624097 1656196 1688864 1722812 1759207 1798571 1840661 1885023 1931237 1978608 2025640 2069827
60473 2069827 2108065 2137618 2156837 2165132 2162658 2150421 2130402 2104979 2076203 2046014 2016987 1991894
60461 1991894 1972153 1957282 1946463 1940262 1940187 1946769 1958782 1974562 1993621 2016492 2043187 2072490
60449 2072490 2103285 2136391 2174392 2219357 2271289 2329274 2393660 2466483 2550318 2647850 2762445
60438 2762445 2897714 3055870 3237130 3441091 3667964 3918209 4191983 4489635 4811849
60429 4811849 5158484 5527899 5918252 6328590 6757243 7198936 7643775 8077832 8482911
$$ packed form
60508A306037k013l8J928L358M096M760O469R461J2238J2982J1820J0866J1724
60495A393688J3636J4759J4781J5288J7502K0628K3080K4626K6358K8774L0977
60484A624097L2099L2668L3948L6395L9364M2090M4362M6214M7371M7032M4187
60473B069827L8238K9553J9219Q295k474j2237k0019k5423k8776l0189k9027k5093
60461A991894j9741j4871j0819o201p5O582J2013J5780J9059K2871K6695K9303
60449B072490L0795L3106L8001M4965N1932N7985O4386P2823Q3835R7532J14595
60438B762445J35269J58156J81260K03961K26873K50245K73774K97652L22214
60429D811849L46635L69415L90353M10338M28653M41693M44839M34057M05079
$$ plain form
60420 8482911 8836033 9111724 9287380 9347962 9287499 9108699 8822538 8447229 8005586 7521748
60410 7521748 7018713 6516564 6030691 5570696 5141177 4743954 4379874 4048851 3749014
60401 3749014 3476953 3229716 3006459 2807407 2631137 2473902 2332104 2204459 2090828
60392 2090828 1989751 1898472 1815045 1739089 1670505 1608717 1553240 1503704 1458987 1417452 1378485
60381 1378485 1342768 1310493 1280354 1250987 1222617 1196483 1173222 1152506 1133768 1116561 1100468
60370 1100468 1085161 1070476 1056365 1043135 1031627 1022329 1014220 1005486 995828 987181 981692 979777 980473
60357 980473 982584 984912 986627 988405 992130 998400 1005237 1010435 1014227 1018234 1022731 1026742 1030374 1035119
60343 1035119 1041752 1049485 1057347 1064878 1071284 1075577 1078221 1081402 1086845 1094218 1102180 1110084 1117982 1125706
$$ packed form
60420H482911L53122K75691J75656O0582o0463j78800k86161l75309m41643m83838
60410G521748n03035n02149m85873m59995m29519l97223l64080l31023k99837
60401C749014k72061k47237k23257j99052j76270j57235j41798j27645j13631
60392B090828j01077r1279q3427p5956o8584o1788n5477m9536m4717m1535l8967
60381A378485l5717l2275l0139k9367k8370k6134k3261k0716j8738j7207j6093
60370A100468j5307j4685j4111j3230j1508r298q109q734r658q647n489j915O96
60357I80473K111K328J715J778L725O270O837N198L792M007M497M011L632M745
60343A035119O633P733P862P531O406M293K644L181N443P373P962P904P898P724
$$ plain form
60329 1125706 1132697 1138395 1142420 1144866 1146703 1149232 1152717 1155997 1157783 1157995 1157586 1157475 1157806 1157853 1156598
60314 1156598 1153691 1149743 1145286 1140020 1133956 1128790 1126606 1127216 1128310 1128601 1129255 1131486 1134329 1136002 1136473
60299 1136473 1137480 1140727 1147085 1156728 1168792 1181393 1193187 1204645 1216843 1229572 1241792 1253415
60287 1253415 1265253 1277411 1289118 1300195 1311145 1321450 1329129 1332788 1333313 1332887 1332964 1333683 1334503 1334701
60273 1334701 1333686 1331554 1329154 1327174 1325541 1324214 1324205 1326864 1331954 1337090 1339628 1339010 1336949 1335418 1334749
60258 1334749 1333630 1330478 1324672 1316941 1309130 1303235 1299796 1297131 1292875 1286574 1280114 1275382 1272392 1270326
60244 1270326 1269437 1270614 1273459 1276127 1277275 1277245 1277128 1277562 1278705 1280470 1282336 1283642 1284665 1286707 1290399
60229 1290399 1294381 1296451 1295864 1293932 1292564 1292885 1295174 1299305 1304943 1311685 1319277 1327539 1336090 1344633
$$ packed form
60329A125706O991N698M025K446J837K529L485L280J786K12m09j11L31M7j255
60314A156598k907l948m457n266o064n166k184O10J094K91O54K231K843J673M71
60299A136473J007L247O358R643J2064J2601J1794J1458J2198J2729J2220J1623
60287A253415J1838J2158J1707J1077J0950J0305P679L659N25m26P7P19Q20J98
60273A334701j015k132k400j980j633j327rK659N090N136K538o18k061j531o69
60258A334749j119l152n806p731p811n895l439k665m256o301o460m732k990k066
60244A270326q89J177K845K668J148l0j17M34J143J765J866J306J023K042L692
60229A290399L982K070n87j932j368L21K289M131N638O742P592Q262Q551Q543
$$ plain form
60215 1344633 1353603 1364010 1376161 1388835 1400245 1409847 1418827 1428741 1440124 1452654 1466234 1481344
60203 1481344 1498358 1517106 1537424 1559837 1585226 1613925 1645523 1679701 1716876 1757849 1803109
60192 1803109 1852855 1907486 1967479 2032736 2102654 2177247 2257770 2345661 2441104 2543448 2653051
60181 2653051 2771766 2901030 3040004 3186147 3337205 3491959 3649509 3808818 3968869
60172 3968869 4128209 4284046 4432746 4571759 4700372 4817994 4922445 5010821 5081613 5135073
60162 5135073 5171712 5191627 5195637 5186148 5166188 5137971 5102991 5063323 5022197 4983143 4948841 4920944
60150 4920944 4900761 4889895 4890169 4903024 4929153 4968961 5023385 5093834 5180818 5282704 5396454
60139 5396454 5519942 5653110 5796299 5947675 6102859 6256798 6405205 6544288 6670414
$$ packed form
60215A344633Q970J0407J2151J2674J1410R602Q980R914J1383J2530J3580J5110
60203A481344J7014J8748K0318K2413K5389K8699L1598L4178L7175M0973M5260
60192A803109M9746N4631N9993O5257O9918P4593Q0523Q7891R5443J02344J09603
60181B653051J18715J29264J38974J46143J51058J54754J57550J59309J60051
60172C968869J59340J55837J48700J39013J28613J17622J04451Q8376P0792N3460
60162E135073L6639J9915M010r489j9960k8217l4980l9668m1126l9054l4302k7897
60150D920944k0183j0866K74J2855K6129L9808N4424P0449Q6984J01886J13750
60139E396454J23488J33168J43189J51376J55184J53939J48407J39083J26126
$$ plain form
60130 6670414 6780867 6874243 6949361 7004309 7037393 7048482 7038383 7007257 6954934 6882888 6794842
60119 6794842 6695210 6588036 6477671 6369183 6267107 6174307 6092546 6023455 5968409 5928237
60109 5928237 5903962 5897362 5909931 5941484 5990378 6054765 6132907 6222479 6320221 6422225 6524306
60098 6524306 6622523 6713989 6796959 6869727 6930015 6976188 7008596 7028827 7038006 7037000 7028133 7015356
60086 7015356 7002336 6991489 6985506 6988776 7006138 7040478 7092483 7162848 7253963 7369069 7510181
60075 7510181 7677496 7870947 8091859 8342626 8624911 8938726 9283163 9657191 10059307
60066 10059307 10487050 10937440 11407345 11892580 12387024 12883523 13375558 13857103 14320807
60057 14320807 14757466 15157907 15514838 15822414 16074836 16266434 16393157 16453315 16446734 16373901
$$ packed form
60130F670414J10453R3376P5118N4948L3084J1089j0099l1126n2323p2046q8046
60119F794842r9632j07174j10365j08488j02076r2800q1761o9091n5046m0172
60109E928237k4275o600J2569L1553M8894O4387P8142Q9572R7742J02004J02081
60098F524306R8217R1466Q2970P2768O0288M6173L2408K0231R179j006q867j2777
60086G015356j3020j0847n983L270J7362L4340N2005P0365R1115J15106J41112
60075G510181J67315J93451K20912K50767K82285L13815L44437L74028M02116
60066A0059307M27743M50390M69905M85235M94444M96499M92035M81545M63704
60057A4320807M36659M00441L56931L07576K52422J91598J26723O0158o581p2833
$$ plain form
60047 16373901 16236428 16037974 15784042 15480900 15135426 14756233 14354007 13939704 13522621
60038 13522621 13110951 12713600 12339945 11997377 11690141 11420834 11191636 11003477 10855511
60029 10855511 10746723 10677059 10645556 10648123 10678687 10731914 10803283 10887079 10976470 11065825 11151219
60018 11151219 11228230 11290887 11333640 11353203 11347898 11316470 11258538 11175241 11068317 10938829 10787400
60007 10787400 10615178 10424099 10216706 9996157 9765895 9529062 9288954 9050220 8818470
59998 8818470 8597896 8390120 8196153 8018723 7861742 7728020 7618487 7533317 7472894 7437887
59988 7437887 7428982 7446314 7488584 7553159 7637613 7740669 7860852 7994732 8137447 8284563
59978 8284563 8432354 8576437 8711432 8832229 8934713 9015084 9069561 9095434 9091899 9059490
$$ packed form
60047A6373901j37473j98454k53932l03142l45474l79193m02226m14303m17083
60038A3522621m11670l97351l73655l42568l07236k69307k29198j88159j47966
60029A0855511j08788o9664l1503K567L0564N3227P1369Q3796Q9391Q9355Q5394
60018A1151219P7011O2657M2753J9563n305l1428n7932q3297j06924j29488j51429
60007A0787400j72222j91079k07393k20549k30262k36833k40108k38734k31750
59998H818470k20574k07776j93967j77430j56981j33722j09533q5170o0423l5007
59988G437887q905J7332M2270O4575Q4454J03056J20183J33880J42715J47116
59978H284563J47791J44083J34995J20797J02484Q0371N4477K5873l535l2409
$$ plain form
59968 9059490 8999257 8912882 8802910 8672120 8522944 8358159 8182066 8000321 7818343 7640201
59958 7640201 7469110 7308485 7162028 7032894 6923174 6834238 6767181 6722735 6701135 6702471
59948 6702471 6727150 6775788 6848842 6946528 7068769 7214698 7382333 7569177 7772969 7991185
59938 7991185 8219790 8453099 8684981 8909708 9121620 9314810 9483710 9623809 9731786
59929 9731786 9805575 9844544 9849048 9819476 9756185 9660602 9535895 9386396 9217123 9034204 8844793
59918 8844793 8655601 8471786 8297822 8138778 7999663 7883564 7791206 7722449 7677697 7657747
59908 7657747 7662809 7691956 7743389 7815121 7905349 8012153 8133087 8265519 8407158 8555452
59898 8555452 8706391 8854910 8997103 9131344 9256890 9372326 9476287 9568833 9650940 9723141
$$ packed form
59968I059490o0233q6375j09972j30790j49176j64785j76093j81745j81978j78142
59958G640201j71091j60625j46457j29134j09720q8936o7057m4446k1600J336
59948F702471K4679M8638P3054R7686J22241J45929J67635J86844K03792K18216
59938G991185K28605K33309K31882K24727K11912J93190J68900J40099J07977
59929I731786P3789L8969M504k9572o3291r5583j24707j49499j69273j82919j89411
59918H844793j89192j83815j73964j59044j39115j16099r2358o8757m4752j9950
59908G657747N062K9147N1433P1732R0228J06804J20934J32432J41639J48294
59898H555452J50939J48519J42193J34241J25546J15436J03961R2546Q2107P2201
$$ plain form
59888 9723141 9785920 9841304 9892855 9944146 9998301 10059055 10131077 10218918 10326602 10458540 10619742
59877 10619742 10814360 11044676 11312041 11617959 11963220 12346316 12763616 13211007 13684302
59868 13684302 14177531 14681394 15183901 15672225 16133239 16552366 16913165 17199469 17398663
59859 17398663 17503336 17510723 17421890 17241741 16978852 16644322 16250600 15811168 15340410 14852786
59849 14852786 14361809 13879391 13415234 12976314 12567637 12194074 11860972 11572324 11329047
59840 11329047 11130007 10974503 10862976 10795543 10770795 10785949 10837363 10920930 11032750 11169456
59830 11169456 11327031 11498984 11676218 11848913 12008085 12145344 12251904 12318583 12337107 12301887
59820 12301887 12211027 12065723 11868659 11623321 11334881 11010782 10659416 10288525 9905491
$$ packed form
59888I723141O2779N5384N1551N1291N4155O0754P2022Q7841J07684J31938J61202
59877A0619742J94618K30316K67365L05918L45261L83096M17300M47391M73295
59868A3684302M93229N03863N02507M88324M61014M19127L60799K86304J99194
59859A7398663J04673P387q8833j80149k62889l34530l93722m39432m70758m87624
59849A4852786m90977m82418m64157m38920m08677l73563l33102k88648k43277
59840A1329047j99040j55504j11527o7433k4748J5154N1414Q3567J11820J36706
59830A1169456J57575J71953J77234J72695J59172J37259J06560O6679J8524l5220
59820A2301887r0860j45304j97064k45338k88440l24099l51366l70891l83034
$$ plain form
59811 9905491 9518511 9136079 8764957 8409302 8071562 7753419 7456072 7180819 6929547
59802 6929547 6703704 6502527 6323205 6163011 6020436 5894234 5782624 5684014 5597250 5520157
59792 5520157 5448685 5378891 5309813 5243675 5183159 5128763 5078712 5030969 4985189 4942728 4904819
59781 4904819 4870961 4839187 4807393 4773845 4736824 4694980 4648372 4598477 4546889 4494494 4441929
59770 4441929 4390166 4340410 4293972 4252277 4216302 4185910 4160344 4139340 4123010 4110858 4102265
59759 4102265 4098272 4101642 4114444 4136422 4166106 4202438 4244744 4292323 4345013 4403316 4467028 4534541
59747 4534541 4604331 4676331 4750825 4826714 4901843 4974335 5042548 5104514 5158847 5205954 5247309
59736 5247309 5283924 5316689 5347664 5379656 5414613 5453704 5498806 5552568 5617014 5693532 5784452
$$ packed form
59811I905491l86980l82432l71122l55655l37740l18143k97347k75253k51272
59802F929547k25843k01177j79322j60194j42575j26202j11610r8610q6764p7093
59792E520157p1472o9794o9078o6138o0516n4396n0051m7743m5780m2461l7909
59781D904819l3858l1774l1794l3548l7021m1844m6608m9895n1588n2395n2565
59770D441929n1763m9756m6438m1695l5975l0392k5566k1004j6330j2152q593
59759D102265l993L370J2802K1978K9684L6332M2306M7579N2690N8303O3712O7513
59747D534541O9790P2000P4494P5889P5129P2492O8213O1966N4333M7107M1355
59736E247309L6615L2765L0975L1992L4957L9091M5102N3762O4446P6518R0920
$$ plain form
59725 5784452 5893217 6022496 6173329 6346731 6544995 6770616 7024815 7307990 7620964
59716 7620964 7964727 8338940 8741021 9166304 9608380 10058971 10506948 10936668 11327273
59707 11327273 11655094 11898776 12043955 12085222 12026150 11878521 11660140 11390964 11089655 10772616
59697 10772616 10454537 10148171 9863162 9605595 9378746 9183901 9020849 8888646 8786678
59688 8786678 8714977 8673497 8661515 8678041 8722635 8795464 8896600 9025592 9181959 9365975
59678 9365975 9578731 9821433 10094921 10399940 10737595 11109337 11516877 11962471 12448929
59669 12448929 12978631 13552561 14170867 14834397 15544900 16303381 17108731 17958279 18848877
59660 18848877 19776671 20735943 21718728 22715474 23715733 24708782 25684657 26635405 27555801
$$ packed form
59725E784452J08765J29279J50833J73402J98264K25621K54199K83175L12974
59716G620964L43763L74213M02081M25283M42076M50591M47977M29720L90605
59707A1327273L27821K43682J45179M1267n9072j47629k18381k69176l01309l17039
59697A0772616l18079l06366k85009k57567k26849j94845j63052j32203j01968
59688H786678p1701m1480j1982J6526M4594P2829J01136J28992J56367J84016
59678I365975K12756K42702K73488L05019L37655L71742M07540M45594M86458
59669A2448929N29702N73930O18306O63530P10503P58481Q05350Q49548Q90598
59660A8848877R27794R59272R82785R96746J000259R93049R75875R50748R20396
$$ plain form
59651 27555801 28443758 29300853 30132104 30943963 31741866 32529808 33311714 34091560 34870992
59642 34870992 35646978 36411823 37154475 37861065 38515466 39101524 39605865 40018602 40332497
59633 40332497 40543556 40653361 40669847 40604994 40472477 40288072 40071050 39843161 39625581 39437012
59623 39437012 39294044 39211864 39203987 39281845 39454959 39731035 40115408 40610407 41215204 41926026
59613 41926026 42736357 43636826 44614242 45649965 46719028 47791002 48831377 49801908 50660701
59604 50660701 51364206 51871121 52146180 52163088 51907602 51380426 50597645 49587903 48388265
59595 48388265 47040582 45588146 44072448 42531061 40996727 39496121 38047972 36662480
59587 36662480 35342620 34085011 32879085 31707126 30547995 29382910 28199497 26993043
$$ packed form
59651B7555801Q87957Q57095Q31251Q11859P97903P87942P81906P79846P79432
59642C4870992P75986P64845P42652P06590O54401N86058N04341M12737L13895
59633D0332497K11059J09805J6486o4853j32517j84405k17022k27889k17580j88569
59623C9437012j42968q2180p877P7858J73114K76076L84373M94999O04797P10822
59613D1926026Q10331R00469R77416J035723J069063J071974J040375R70531Q58793
59604E0660701P03505N06915K75059J6908k55486n27176p82781j009742j199638
59595D8388265j347683j452436j515698j541387j534334j500606j448149j385492
59587C6662480j319860j257609j205926j171959j159131j165085j183413j206454
$$ plain form
59579 26993043 25766443 24529294 23295602 22080832 20899928 19766117 18689346 17675023
59571 17675023 16724931 15839749 15020409 14267102 13577887 12948843 12375469 11853744 11380070
59562 11380070 10950546 10560711 10206511 9885694 9597659 9341374 9113663 8909955 8726312
59553 8726312 8560096 8409003 8270299 8141038 8018391 7899734 7782903 7666305 7548345
59544 7548345 7427007 7300739 7169689 7035430 6899576 6763224 6627497 6493600 6362340
59535 6362340 6234557 6112114 5997427 5891617 5794098 5704534 5624309 5555344 5498072 5451382
59525 5451382 5414183 5386317 5368141 5359781 5360678 5369448 5384328 5404239 5429333 5460204 5496641 5537455
59513 5537455 5581487 5628486 5679076 5734021 5793520 5857150 5924577 5996418 6074406 6160807 6257621
$$ packed form
59579B6993043j226600j237149j233692j214770j180904j133811j076771j014323
59571A7675023r50092q85182q19340p53307o89215o29044n73374n21725m73674
59562A1380070m29524l89835l54200l20817k88035k56285k27711k03708j83643
59553H726312j66216j51093j38704j29261j22647j18657j16831j16598j17960
59544G548345j21338j26268j31050j34259j35854j36352j35727j33897j31260
59535F362340j27783j22443j14687j05810r7519q9564q0225o8965n7272m6690
59525E451382l7199k7866j8176q360Q97Q770J4880J9911K5094L0871L6437M0814
59513E537455M4032M6999N0590N4945N9499O3630O7427P1841P7988Q6401R6814
$$ plain form
59502 6257621 6366007 6486079 6617500 6760665 6917195 7088907 7276594 7480432 7701326
59493 7701326 7941055 8201043 8481661 8782550 9102736 9440317 9793075 10159575 10538609
59484 10538609 10927228 11320388 11713051 12101469 12481800 12848849 13197417 13523829 13824660
59475 13824660 14094873 14329374 14526620 14689241 14820881 14923789 14999969 15053155 15088496 15110856
59465 15110856 15124362 15133401 15143291 15159842 15188454 15233511 15298240 15384687 15493273 15621942 15765783
59454 15765783 15917681 16069034 16209602 16327448 16410412 16448213 16432893 16357657 16216695 16006942
59444 16006942 15729574 15389373 14993155 14549224 14067658 13559912 13037630 12511580 11991094
59435 11991094 11483803 10995894 10532948 10100402 9702714 9342017 9017975 8729135 8474337
$$ packed form
59502F257621J08386J20072J31421J43165J56530J71712J87687K03838K20894
59493G701326K39729K59988K80618L00889L20186L37581L52758L66500L79034
59484A0538609L88619L93160L92663L88418L80331L67049L48568L26412L00831
59475A3824660K70213K34501J97246J62621J31640J02908P6180N3186L5341K2360
59465A5110856J3506R039R890J6551K8612M5057O4729Q6447J08586J28669J43841
59454A5765783J51898J51353J40568J17846Q2964L7801j5320p5236j40962k09753
59444A6006942k77368l40201l96218m43931m81566n07746n22282n26050n20486
59435A1991094n07291m87909m62946m32546l97688l60697l24042k88840k54798
$$ plain form
59426 8474337 8252952 8064242 7907082 7780413 7683693 7616581 7578325 7567914 7585002 7630143
59416 7630143 7703551 7803917 7929121 8078036 8250893 8447686 8666937 8906309 9163507 9435749
59406 9435749 9718752 10007097 10295399 10578245 10848814 11098332 11317315 11497179 11630820
59397 11630820 11712589 11738552 11706757 11617017 11470775 11271626 11025705 10740763 10424430 10083524
59387 10083524 9724833 9355748 8983369 8613202 8249422 7896336 7558697 7239878 6940178
59378 6940178 6657788 6391585 6142507 5912213 5701179 5508669 5334037 5177199 5037728
59369 5037728 4914204 4804959 4709222 4627055 4558147 4501029 4453747 4415166 4385361 4364747 4353191
59358 4353191 4350080 4354834 4366923 4385586 4410151 4440708 4477836 4521238 4568767 4616963 4662451 4703190
$$ packed form
59426H474337k21385j88710j57160j26669r6720o7112l8256j0411J7088M5141
59416G630143P3408J00366J25204J48915J72857J96793K19251K39372K57198K72242
59406I435749K83003K88345K88302K82846K70569K49518K18983J79864J33641
59397A1630820Q1769K5963l1795q9740j46242j99149k45921k84942l16333l40906
59387A0083524l58691l69085l72379l70167l63780l53086l37639l18819k99700
59378F940178k82390k66203k49078k30294k11034j92510j74632j56838j39471
59369E037728j23524j09245r5737q2167o8908n7118m7282l8581k9805k0614j1556
59358D353191l111M754J2089J8663K4565L0557L7128M3402M7529M8196M5488M0739
$$ plain form
59346 4703190 4739347 4773595 4810066 4852234 4901858 4960255 5029725 5112500 5208163 5313180 5423457
59335 5423457 5537046 5654524 5778026 5910742 6056635 6219464 6401803 6605280 6831608
59326 6831608 7083047 7362087 7671182 8012747 8389056 8802151 9253979 9746323 10280224
59317 10280224 10855536 11471277 12126091 12817881 13542887 14295199 15066818 15847867 16626949
59308 16626949 17391957 18130977 18833178 19490069 20096724 20651387 21153310 21601256 21994443
59299 21994443 22333861 22621277 22857054 23039932 23168536 23241593 23256446 23208837 23094895 22912700
59289 22912700 22661830 22342842 21958193 21512806 21012882 20464670 19874770 19250488 18598733
59280 18598733 17925077 17234834 16534503 15831303 15131833 14442152 13768435 13116123 12488553
$$ packed form
59346D703190L6157L4248L6471M2168M9624N8397O9470Q2775R5663J05017J10277
59335E423457J13589J17478J23502J32716J45893J62829J82339K03477K26328
59326F831608K51439K79040L09095L41565L76309M13095M51828M92344N33901
59317A0280224N75312O15741O54814O91790P25006P52312P71619P81049P79082
59308A6626949P65008P39020P02201O56891O06655N54663N01923M47946L93187
59299B1994443L39418K87416K35777J82878J28604P3057J4853m7609j13942j82195
59289B2912700k50870l18988l84649m45387m99924n48212n89900o24282o51755
59280A8598733o73656o90243p00331p03200o99470o89681o73717o52312o27570
$$ plain form
59271 12488553 11887735 11316513 10778868 10277873 9814252 9386965 8994194 8633664 8303253
59262 8303253 8001997 7729894 7486376 7269568 7077318 6908251 6761413 6635514 6528930
59253 6528930 6440017 6367204 6309285 6265764 6236249 6219361 6213089 6216655 6231276 6258552 6298755 6351096
59241 6351096 6414759 6488767 6571529 6661690 6759315 6865471 6980655 7104145 7234480 7369744
59231 7369744 7507640 7646334 7785389 7925143 8065128 8203891 8340476 8475084 8607848
59222 8607848 8737951 8864841 8989729 9114849 9241345 9368750 9496536 9625106 9754529
59213 9754529 9882610 10004650 10115001 10208794 10282851 10335784 10367262 10376693 10362475 10322904 10257779
59202 10257779 10168786 10058512 9929796 9786236 9632499 9473504 9313540 9156353 9005380
$$ packed form
59271A2488553o00818n71222n37645n00995m63621m27287l92771l60530l30411
59262H303253l01256k72103k43518k16808j92250j69067j46838j25899j06584
59253F528930q8913p2813n7919m3521k9515j6888o272L566J4621K7276M0203N2341
59241F351096O3663P4008Q2762R0161R7625J06156J15184J23490J30335J35264
59231G369744J37896J38694J39055J39754J39985J38763J36585J34608J32764
59222H607848J30103J26890J24888J25120J26496J27405J27786J28570J29423
59213I754529J28081J22040J10351R3793P4057N2933L1478R431j4218l9571o5125
59202A0257779q8993j10274j28716j43560j53737j58995j59964j57187j50973
$$ plain form
59193 9005380 8863280 8731658 8611952 8506320 8417160 8345949 8292978 8257710 8238836 8234568 8243745
59182 8243745 8266214 8301296 8346492 8399065 8458540 8526184 8602072 8684323 8771600 8864787 8965729
59171 8965729 9075906 9197216 9332567 9484439 9653881 9842078 10051957 10286932 10548738
59162 10548738 10837515 11152965 11493809 11856513 12235866 12626170 13020076 13406429 13771093
59153 13771093 14100376 14382537 14606171 14759244 14830965 14814081 14705272 14504873 14217311 13851046
59143 13851046 13417093 12927709 12396480 11838162 11266815 10693766 10127694 9576109 9045964
59134 9045964 8542846 8070127 7629042 7219466 6840861 6492850 6174875 5885391 5621786
59125 5621786 5381399 5162405 4963562 4783459 4620370 4472664 4339139 4218970 4111414
$$ packed form
59193I005380j42100j31622j19706j05632q9160p1211n2971l5268j8874m268R177
59182H243745K2469L5082M5196N2573N9475O7644P5888Q2251Q7277R3187J00942
59171H965729J10177J21310J35351J51872J69442J88197K09879K34975K61806
59162A0548738K88777L15450L40844L62704L79353L90304L93906L86353L64664
59153A3771093L29283K82161K23634J53073P1721j6884j08809k00399k87562l66265
59143A3851046m33953m89384n31229n58318n71347n73049n66072n51585n30145
59134I045964n03118m72719m41085m09576l78605l48011l17975k89484k63605
59125E621786k40387k18994j98843j80103j63089j47706j33525j20169j07556
$$ plain form
59116 4111414 4015371 3929190 3851149 3780265 3716547 3660450 3612227 3571621 3537857 3509996 3487634
59105 3487634 3471189 3461196 3457622 3460336 3469758 3486073 3508020 3533737 3563205 3598760 3642496 3693865
59093 3693865 3750543 3811033 3875688 3945606 4021311 4102369 4187790 4276880 4369816 4467037 4568046
59082 4568046 4671650 4777695 4887523 5001978 5119787 5238822 5358142 5477535 5595669
59073 5595669 5710210 5819590 5923320 6020559 6109854 6190639 6263679 6329586 6387984 6438762 6483128
59062 6483128 6522842 6559442 6595004 6632672 6675297 6723996 6778955 6841128 6912252 6993754 7086751
59051 7086751 7192774 7313187 7447933 7596109 7757937 7934837 8126957 8331733 8545696
59042 8545696 8766798 8993811 9223918 9451930 9671670 9876913 10060854 10215883 10334920
$$ packed form
59116D111414r6043q6181p8041p0884o3718n6097m8223m0606l3764k7861k2362
59105C487634j6445r993l574K714R422J6315K1947K5717K9468L5555M3736N1369
59093C693865N6678O0490O4655O9918P5705Q1058Q5421Q9090R2936R7221J01009
59082D568046J03604J06045J09828J14455J17809J19035J19320J19393J18134
59073E595669J14541J09380J03730R7239Q9295Q0785P3040O5907N8398N0778M4366
59062F483128L9714L6600L5562L7668M2625M8699N4959O2173P1124Q1502R2997
59051G086751J06023J20413J34746J48176J61828J76900J92120K04776K13963
59042H545696K21102K27013K30107K28012K19740K05243J83941J55029J19037
$$ plain form
59033 10334920 10412964 10447376 10437438 10384329 10291236 10162741 10003979 9820512 9618532 9404068
59023 9404068 9181477 8953068 8720514 8486244 8253073 8022765 7795537 7570944 7348652
59014 7348652 7128236 6908875 6689914 6471736 6255693 6043056 5834192 5628846 5426970
59005 5426970 5229102 5036054 4848566 4667393 4493478 4327707 4170441 4021547 3881103
58996 3881103 3749830 3628366 3515927 3410043 3308247 3210203 3117824 3032918 2954962 2881726
58986 2881726 2811965 2746563 2686437 2630075 2574437 2518312 2463648 2413049 2366921 2323835 2282834
58975 2282834 2244138 2207922 2173774 2141607 2112122 2086024 2063593 2045161 2030934 2019912 2010119
58964 2010119 2000790 1993393 1989376 1987655 1985640 1982329 1978956 1976763 1975697 1975463 1976245 1977647 1978275 1977434 1976403
$$ packed form
59033A0334920P8044L4412r938n3109r3093j28495j58762j83467k01980k14464
59023I404068k22591k28409k32554k34270k33171k30308k27228k24593k22292
59014G348652k20416k19361k18961k18178k16043k12637k08864k05346k01876
59005E426970j97868j93048j87488j81173j73915j65771j57266j48894j40444
58996C881103j31273j21464j12439j05884j01796r8044r2379q4906p7956p3236
58986B881726o9761o5402o0126n6362n5638n6125n4664n0599m6128m3086m1001
58975B282834l8696l6216l4148l2167k9485k6098k2431j8432j4227j1022r793
58964B010119r329p397m017j721k015l311l373k193j066k34P82J402O28q41j031
$$ plain form
58949 1976403 1977050 1979885 1984385 1990462 1998293 2007062 2015326 2022716 2030185 2038375 2046750 2054698 2062500 2070641
58935 2070641 2078947 2087201 2096070 2106577 2118809 2131803 2144786 2158046 2172432 2188341 2205324 2222561
58923 2222561 2239687 2257245 2276356 2297824 2321510 2346537 2372012 2397515 2423060 2448838 2475124
58912 2475124 2502392 2531315 2562387 2595565 2630544 2667458 2706868 2748756 2792023 2835737 2880713
58901 2880713 2928935 2981118 3035624 3090385 3145304 3201994 3261415 3322670 3384306 3446154 3509575
58890 3509575 3576323 3647597 3723937 3805470 3892070 3983480 4079533 4180329 4286266 4398051 4516819
58879 4516819 4644131 4781548 4929942 5089087 5258016 5436061 5623971 5824256 6040186
58870 6040186 6273973 6525880 6795446 7083597 7393103 7726894 8086635 8473322 8888518
$$ packed form
58949A976403O47K835M500O077P831Q769Q264P390P469Q190Q375P948P802Q141
58935B070641Q306Q254Q869J0507J2232J2994J2983J3260J4386J5909J6983J7237
58923B222561J7126J7558J9111K1468K3686K5027K5475K5503K5545K5778K6286
58912B475124K7268K8923L1072L3178L4979L6914L9410M1888M3267M3714M4976
58901B880713M8222N2183N4506N4761N4919N6690N9421O1255O1636O1848O3421
58890C509575O6748P1274P6340Q1533Q6600R1410R6053J00796J05937J11785J18768
58879D516819J27312J37417J48394J59145J68929J78045J87910K00285K15930
58870F040186K33787K51907K69566K88151L09506L33791L59741L86687M15196
$$ plain form
58861 8888518 9334278 9812395 10324818 10874645 11465562 12099956 12778286 13500328 14266031
58852 14266031 15074541 15922990 16806702 17719848 18655127 19603134 20552445 21489729 22398906
58843 22398906 23260482 24052735 24754146 25344985 25807615 26126894 26291472 26295203 26137929 25825705
58833 25825705 25370570 24789466 24102208 23329303 22490685 21605715 20693497 19772054 18856310
58824 18856310 17956953 17081727 16237597 15430884 14665593 13942968 13263278 12627056 12033998
58815 12033998 11481798 10967280 10488196 10042888 9628723 9242204 8880728 8543269 8229222
58806 8229222 7937415 7666345 7414692 7181369 6965570 6766752 6584204 6416881 6264260
58797 6264260 6126830 6004763 5896384 5799212 5712486 5637345 5574264 5521693 5477864 5442747 5417382
$$ packed form
58861H888518M45760M78117N12423N49827N90917O34394O78330P22042P65703
58852A4266031Q08510Q48449Q83712R13146R35279R48007R49311R37284R09177
58843B2398906Q61576P92253P01411N90839M62630L19279J64578L731j57274l12224
58833B5825705m55135n81104o87258p72905q38618q84970r12218r21443r15744
58824A8856310q99357q75226q44130q06713p65291p22625o79690o36222n93058
58815A2033998n52200n14518m79084m45308m14165l86519l61476l37459l14047
58806H229222k91807k71070k51653k33323k15799j98818j82548j67323j52621
58797F264260j37430j22067j08379r7172q6726p5141o3081n2571m3829l5117k5365
$$ plain form
58786 5417382 5402338 5397836 5404473 5422554 5451067 5488610 5535245 5592428 5661015 5740273 5829147 5927819
58774 5927819 6037663 6160053 6295588 6444278 6606242 6782150 6972937 7179245 7401555
58765 7401555 7641050 7899868 8180043 8482631 8808544 9159947 9539996 9951138 10394575
58756 10394575 10871779 11385787 11940208 12537114 13176490 13857691 14580704 15345476 16150170
58747 16150170 16990454 17860241 18752206 19656692 20560177 21445378 22293081 23083534 23796465
58738 23796465 24411282 24908728 25272641 25490142 25551606 25452554 25196208 24793139 24257748 23605679
58728 23605679 22854705 22026095 21142647 20224726 19288618 18348142 17416079 16503414 15618341
58719 15618341 14766968 13954321 13183734 12455828 11769314 11123122 10517178 9951171 9423379
$$ packed form
58786E417382j5044m502O637J8081K8513L7543M6635N7183O8587P9258Q8874R8672
58774E927819J09844J22390J35535J48690J61964J75908J90787K06308K22310
58765G401555K39495K58818K80175L02588L25913L51403L80049M11142M43437
58756A0394575M77204N14008N54421N96906O39376O81201P23013P64772Q04694
58747A6150170Q40284Q69787Q91965R04486R03485Q85201Q47703P90453P12931
58738B3796465O14817M97446L63913K17501O1464r9052k56346m03069n35391o52069
58728B3605679p50974q28610q83448r17921r36108r40476r32063r12665q85073
58719A5618341q51373q12647p70587p27906o86514o46192o05944n66007n27792
$$ plain form
58710 9423379 8931075 8471674 8043220 7644155 7272949 6927765 6606337 6306421 6026556
58701 6026556 5766077 5524163 5299136 5089074 4893039 4711278 4544005 4390172 4247698
58692 4247698 4114988 3991963 3879257 3776531 3682092 3594377 3513256 3439358 3372464 3311159
58682 3311159 3253845 3199458 3147317 3097032 3048690 3002559 2958543 2916394 2876296 2838512 2802403
58671 2802403 2766727 2731077 2696231 2662775 2630158 2597402 2563880 2529028 2492288 2454001 2415525
58660 2415525 2377709 2339853 2300781 2260156 2218047 2174103 2128307 2082002 2037002 1993985 1952632
58649 1952632 1912900 1875048 1838661 1802757 1766933 1731660 1697614 1665511 1636277 1610395 1587089
58638 1587089 1564960 1543241 1521730 1499874 1477091 1453893 1431621 1410995 1391867 1374320 1358936
$$ packed form
58710I423379m92304m59401m28454l99065l71206l45184l21428k99916k79865
58701F026556k60479k41914k25027k10062j96035j81761j67273j53833j42474
58692D247698j32710j23025j12706j02726r4439q7715q1121p3898o6894o1305
58682C311159n7314n4387n2141n0285m8342m6131m4016m2149m0098l7784l6109
58671B802403l5676l5650l4846l3456l2617l2756l3522l4852l6740l8287l8476
58660B415525l7816l7856l9072m0625m2109m3944m5796m6305m5000m3017m1353
58649A952632l9732l7852l6387l5904l5824l5273l4046l2103k9234k5882k3306
58638A587089k2129k1719k1511k1856k2783k3198k2272k0626j9128j7547j5384
$$ plain form
58627 1358936 1345780 1334020 1322808 1311929 1301675 1292848 1286688 1283786 1283066 1282790 1282531 1283334 1286115 1290899
58613 1290899 1297308 1304518 1310973 1315551 1318958 1322497 1325630 1326591 1325519 1324826 1325723 1326410 1324747 1320947 1316355
58598 1316355 1311233 1305385 1299804 1296076 1294757 1295483 1297847 1301094 1304013 1306577 1310874 1318877 1329906 1341787
58584 1341787 1354185 1369246 1389016 1413487 1441182 1470585 1500909 1532283 1565402 1600626 1637756
58573 1637756 1677009 1719460 1765821 1815567 1868277 1925132 1987936 2057261 2132790 2215059 2305482
58562 2305482 2404806 2512794 2629494 2755969 2893888 3045183 3211607 3393552 3589731 3799181
58552 3799181 4023112 4263129 4517712 4781957 5050922 5321599 5591104 5854288 6103834
58543 6103834 6331523 6528760 6687017 6799226 6860998 6870598 6828606 6738076 6604400 6434214
$$ packed form
58627A358936j3156j1760j1212j0879j0254q827o160k902p20k76k59Q03K781M784
58613A290899O409P210O455M578L407L539L133R61j072o93Q97O87j663l800m592
58598A316355n122n848n581l728j319P26K364L247K919K564M297Q003J1029J1881
58584A341787J2398J5061J9770K4471K7695K9403L0324L1374L3119L5224L7130
58573A637756L9253M2451M6361M9746N2710N6855O2804O9325P5529Q2269R0423
58562B305482R9324J07988J16700J26475J37919J51295J66424J81945J96179K09450
58552C799181K23931K40017K54583K64245K68965K70677K69505K63184K49546
58543F103834K27689J97237J58257J12209O1772R600m1992r0530j33676j70186
$$ plain form
58533 6434214 6234281 6011209 5771587 5521991 5268852 5017975 4773654 4538432 4314207
58524 4314207 4103188 3907076 3725877 3558725 3405740 3267804 3144539 3033921 2934224 2844959
58514 2844959 2765370 2693357 2626926 2565762 2510373 2460319 2414189 2370867 2329917 2290954 2253350
58503 2253350 2216433 2179610 2142611 2106005 2070969 2037976 2005967 1973252 1938899 1902939 1865821
58492 1865821 1828331 1791497 1755617 1719548 1681892 1643069 1605436 1571056 1539826 1510150 1481048
58481 1481048 1453090 1427404 1404263 1382915 1362493 1342611 1323026 1303262 1283184 1263825 1246875
58470 1246875 1233009 1221075 1209379 1197626 1187202 1179520 1174360 1169930 1164391 1157282 1149634 1142943 1137998
58457 1137998 1134404 1130923 1126384 1120725 1115364 1112229 1111993 1113312 1113966 1112695 1109766 1105957 1101492 1096119
$$ packed form
58533F434214j99933k23072k39622k49596k53139k50877k44321k35222k24225
58524D314207k11019j96112j81199j67152j52985j37936j23265j10618r9697q9265
58514B844959p9589p2013o6431o1164n5389n0054m6130m3322m0950l8963l7604
58503B253350l6917l6823l6999l6606l5036l2993l2009l2715l4353l5960l7118
58492A865821l7490l6834l5880l6069l7656l8823l7633l4380l1230k9676k9102
58481A481048k7958k5686k3141k1348k0422j9882j9585j9764k0078j9359j6950
58470A246875j3866j1934j1696j1753j0424p682n160m430n539p109p648o691m945
58457A137998l594l481m539n659n361l135k36J319O54j271k929l809m465n373
$$ plain form
58443 1096119 1089903 1083507 1077501 1071567 1064786 1056904 1048913 1041926 1035781 1029510 1023173 1018221 1015523 1013737
58429 1013737 1010422 1004514 997129 990216 984997 981539 979188 977236 975367 973495 971190 967742 963083 958200
58415 958200 954159 950976 947891 944484 941059 938158 936081 934673 933250 930974 927641 923844 920140 916593
58401 916593 913461 911632 911596 912473 912887 912674 913002 914973 918752 923958 930209 937118 944140 950645 956195 960985
58385 960985 965904 971550 977177 981475 984532 987853 991866 994717 994570 992006 988894 985799 981962 977138
58371 977138 971858 966231 960026 953720 948088 942968 937815 933192 930084 927912 924998 921226 918524 918258
58357 918258 919779 922149 925703 930841 936506 941067 944134 946673 949854 954400 960585 968172 976568 985310
58343 985310 994219 1003127 1011918 1020730 1029483 1037457 1044232 1050886 1059131 1069145 1079450 1089195 1099331
$$ packed form
58443A096119o216o396o006n934o781p882p991o987o145o271o337m952k698j786
58429A013737l315n908p385o913n219l458k351j952j869j872k305l448m659m883
58415I58200m041l183l085l407l425k901k077j408j423k276l333l797l704l547
58401I16593l132j829l6Q77M14k13L28J971L779N206O251O909P022O505N550M790
58385I60985M919N646N627M298L057L321M013K851j47k564l112l095l837m824
58371I77138n280n627o205o306n632n120n153m623l108k172k914l772k702k66
58357I18258J521K370L554N138N665M561L067K539L181M546O185P587Q396Q742
58343I85310Q909Q908Q791Q812Q753P974O775O654Q245J0014J0305R745J0136
$$ plain form
58330 1099331 1110965 1123559 1135557 1146098 1155362 1163666 1170800 1176163 1179393 1181063 1182520 1184525 1186275
58317 1186275 1186495 1185200 1183435 1181576 1179191 1176654 1175449 1176444 1179017 1182347 1186416 1191138 1195650 1199417
58303 1199417 1203201 1208080 1214057 1220430 1226977 1233922 1241001 1247423 1252778 1257404 1261756 1265821 1269437 1272931
58289 1272931 1276921 1281296 1285011 1287579 1290282 1294761 1300567 1305726 1309986 1315534 1323489 1331686 1337686 1342548
58275 1342548 1349523 1360104 1373456 1388736 1405565 1422726 1438919 1454718 1471613 1489308 1506190
58264 1506190 1522310 1539471 1558198 1576985 1594863 1612461 1630186 1647642 1665285 1684314 1704304
58253 1704304 1723166 1740084 1756346 1772766 1788724 1804578 1822396 1842957 1864212 1884194 1903667
58242 1903667 1924643 1948038 1974033 2002947 2034310 2066524 2098740 2131898 2167103 2204365 2243624
$$ packed form
58330A099331J1634J2594J1998J0541R264Q304P134N363L230J670J457K005J750
58317A186275K20j295j765j859k385k537j205R95K573L330M069M722M512L767
58303A199417L784M879N977O373O547O945P079O422N355M626M352M065L616L494
58289A272931L990M375L715K568K703M479N806N159M260N548P955Q197O000M862
58275A342548O975J0581J3352J5280J6829J7161J6193J5799J6895J7695J6882
58264A506190J6120J7161J8727J8787J7878J7598J7725J7456J7643J9029J9990
58253A704304J8862J6918J6262J6420J5958J5854J7818K0561K1255J9982J9473
58242A903667K0976K3395K5995K8914L1363L2214L2216L3158L5205L7262L9259
$$ plain form
58231 2243624 2285362 2329387 2374601 2420851 2469425 2521105 2575401 2632102 2691506 2752582 2813310
58220 2813310 2873788 2936586 3002981 3071326 3140494 3212492 3290061 3373781 3463137 3558302 3659131
58209 3659131 3764222 3872805 3986025 4104939 4228687 4355871 4486292 4620435 4758930
58200 4758930 4903188 5054435 5211435 5371524 5534704 5704196 5882138 6067673 6260444
58191 6260444 6462911 6677645 6905039 7145201 7399383 7668089 7950552 8247516 8561846
58182 8561846 8895252 9247225 9618055 10009420 10421091 10851137 11300784 11775053 12277217
58173 12277217 12806850 13364500 13953244 14574012 15224966 15907928 16629991 17396230 18206432
58164 18206432 19061854 19969205 20934819 21961174 23052779 24219200 25468354 26803145
$$ packed form
58231B243624M1738M4025M5214M6250M8574N1680N4296N6701N9404O1076O0728
58220B813310O0478O2798O6395O8345O9168P1998P7569Q3720Q9356R5165J00829
58209C659131J05091J08583J13220J18914J23748J27184J30421J34143J38495
58200D758930J44258J51247J57000J60089J63180J69492J77942J85535J92771
58191F260444K02467K14734K27394K40162K54182K68706K82463K96964L14330
58182H561846L33406L51973L70830L91365M11671M30046M49647M74269N02164
58173A2277217N29633N57650N88744O20768O50954O82962P22063P66239Q10202
58164A8206432Q55422R07351R65614J026355J091605J166421J249154J334791
$$ plain form
58156 26803145 28228596 29755467 31393201 33147649 35031316 37068539 39286107 41708103
58148 41708103 44366338 47307651 50586674 54264207 58421992 63168682 68622196 74895981
58140 74895981 82109571 90400187 99918255 110828951 123320958 137573654 153674669
58133 153674669 171573122 191139846 212301542 235189303 260259021 288216560 319468153
58126 319468153 353146710 386428381 414990805 434594250 442712590 439124255 425382939
58119 425382939 403910432 377323298 348041897 318034263 288702442 260949257 235316930
58112 235316930 212072572 191258261 172771023 156448976 142114250 129596500 118768332
58105 118768332 109552116 101866871 95578193 90516891 86522826 83438251 81074640 79225799
$$ packed form
58156B6803145J425451J526871J637734J754448J883667K037223K217568K421996
58148D1708103K658235K941313L279023L677533M157785M746690N453514O273785
58140G4895981P213590Q290616R518068J0910696J2492007J4252696J6101015
58133A53674669J7898453J9566724K1161696K2887761K5069718K7957539L1251593
58126C19468153L3678557L3281671K8562424J9603445Q118340l588335j3741316
58119D25382939k1472507k6587134k9281401l0007634k9331821k7753185k5632327
58112B35316930k3244358k0814311j8487238j6322047j4334726j2517750j0828168
58105A18768332r216216p685245o288678n061302l994065l084575k363611j848841
$$ plain form
58097 79225799 77707800 76341303 74883237 73020723 70481673 67169582 63198426 58813241
58089 58813241 54279193 49811972 45560173 41614848 38022901 34795389 31914518 29345187
58081 29345187 27048281 24988267 23135126 21466089 19966429 18624843 17426659 16352799
58073 16352799 15384099 14503997 13698254 12955692 12269475 11635303 11048516 10504390 9999808
58064 9999808 9532145 9097655 8693273 8318674 7973945 7656237 7360940 7084789 6825291
58055 6825291 6578514 6340265 6108630 5883105 5662588 5446752 5237960 5038898 4849226
58046 4849226 4667130 4493070 4329190 4175870 4031561 3895334 3766949 3645152 3528454
58037 3528454 3417127 3312075 3212367 3116145 3023292 2934868 2850612 2769426 2691653 2618313 2548484
$$ packed form
58097G9225799j517999j366497j458066j862514k539050l312091l971156m385185
58089E8813241m534048m467221m251799l945325l591947l227512k880871k569331
58081B9345187k296906k060014j853141j669037j499660j341586j198184j073860
58073A6352799r68700q80102q05743p42562o86217o34172n86787n44126n04582
58064I999808m67663m34490m04382l74599l44729l17708k95297k76151k59498
58055F825291k46777k38249k31635k25525k20517k15836k08792j99062j89672
58046D849226j82096j74060j63880j53320j44309j36227j28385j21797j16698
58037C528454j11327j05052r9708r6222r2853q8424q4256q1186p7773p3340o9829
$$ plain form
58026 2548484 2479909 2412053 2346478 2284425 2226031 2171480 2120772 2072585 2025434 1979737 1936929
58015 1936929 1897005 1858906 1822771 1789618 1759196 1730358 1703274 1678971 1656832 1634920 1612897
58004 1612897 1592247 1573302 1554323 1534167 1513780 1494155 1474599 1454175 1433531 1414198 1396856
57993 1396856 1381096 1366216 1351573 1336558 1320850 1304668 1288769 1274235 1261804 1251054 1240692
57982 1240692 1230059 1219738 1210323 1201539 1193338 1186830 1182863 1180408 1177655 1174319 1171544 1169678 1167322
57969 1167322 1162802 1155887 1147865 1140209 1133015 1124811 1114436 1102907 1092269 1082667 1072159 1059818 1047080
57956 1047080 1035101 1022740 1008687 993928 980365 968227 956599 945372 934887 924566 913629
57945 913629 902458 891882 882111 873701 868056 865053 861633 855203 847432 842076 839710 837304 832687 826681
$$ packed form
58026B548484o8575o7856o5575o2053n8394n4551n0708m8187m7151m5697m2808
58015A936929l9924l8099l6135l3153l0422k8838k7084k4303k2139k1912k2023
58004A612897k0650j8945j8979k0156k0387j9625j9556k0424k0644j9333j7342
57993A396856j5760j4880j4643j5015j5708j6182j5899j4534j2431j0750j0362
57982A240692j0633j0321r415q784q201o508l967k455k753l336k775j866k356
57969A167322m520o915q022p656p194q204j0375j1529j0638r602j0508j2341j2738
57956A047080j1979j2361j4053j4759j3563j2138j1628j1227j0485j0321j0937
57945I13629j1171j0576r771q410n645l003l420o430p771n356k366k406m617o006
$$ plain form
57931 826681 820780 815339 810598 807230 805101 803232 801598 801415 803115 805492 807370 808863 810584 812651
57917 812651 814750 816176 815822 813131 808972 804525 799669 793682 787084 781194 776130 770842 764880 758509
57903 758509 751331 742644 733193 724827 718335 713254 709711 708397 708486 707616 704621 700674 697238 694467 692069
57888 692069 690100 688220 685690 682715 680612 680217 681400 684270 689118 694811 699015 700720 700965 700586 699046
57873 699046 696229 693407 691302 688844 685096 680795 676669 671748 664983 657323 650438 644288 637749 631085
57859 631085 626043 623592 622959 622978 623345 624491 627019 631352 637357 644437 652395 661856 673174 685141 695453
57844 695453 702653 707466 712277 719123 727619 734831 737848 736702 734151 732484 731422 729231 724684 717288
57830 717288 706901 694443 682431 673453 667875 663644 658348 651160 643030 635481 629200 623557 617589
$$ packed form
57931H26681n901n441m741l368k129j869j634j83J700K377J878J493J721K067
57917H12651K099J426l54k691m159m447m856n987o598n890n064n288n962o371
57903G58509p178q687r451q366o492n081l543j314Q9q70k995l947l436k771k398
57888F92069j969j880k530k975k103l95J183K870M848N693M204J705K45l79j540
57873F99046k817k822k105k458l748m301m126m921o765p660o885o150o539o664
57859F31085n042k451o33J9L67J146K528M333O005P080P958R461J1318J1967J0312
57844F95453P200M813M811O846Q496P212L017j146k551j667j062k191m547p396
57830G17288j0387j2458j2012q978n578m231n296p188q130p549o281n643n968
$$ plain form
57817 617589 611426 606320 603233 601980 601985 603174 605690 609296 613629 618702 624681 631452 638792 646669 654945
57802 654945 662958 669785 674897 678438 681034 683360 685622 687265 687237 684540 678641 669933 660206 652045 646762
57787 646762 642955 637790 629741 619537 608749 598310 588343 578431 567936 556879 546580 538593 532986
57774 532986 528446 523963 519269 513675 505979 496181 486137 477630 470549 463544 455762 447320 438739 430575
57760 430575 423095 415771 407541 398039 388224 379451 372350 366826 362658 359730 357965 357170 356780 356055 355116
57745 355116 355329 357698 361225 364169 366822 371480 379330 388828 397615 404623 409714 412816 414454 416009
57731 416009 418305 420700 422339 423364 424214 424829 425524 427493 431221 435183 437262 436877 434752 431478 427399
57716 427399 423225 419421 415427 410550 405186 400141 395313 390194 385161 381037 377758 374679 371917 370228
$$ packed form
57817F17589o163n106l087j253NJ189K516L606M333N073N979O771P340P877Q276
57802F54945Q013O827N112L541K596K326K262J643k8k697n899q708r727q161n283
57787F46762l807n165q049j0204j0788j0439r967r912j0495j1057j0299p987n607
57774E32986m540m483m694n594p696r798j0044q507p081p005p782q442q581q164
57760D30575p480p324q230r502r815q773p101n524m168k928j765p95l90p25r39
57745C55116K13K369L527K944K653M658P850R498Q787P008N091L102J638J555
57731D16009K296K395J639J025Q50O15O95J969L728L962K079l85k125l274m079
57716D27399m174l804l994m877n364n045m828n119n033m124l279l079k762j689
$$ plain form
57702 370228 369880 370769 373268 377543 382255 385506 387293 389658 394049 399722 405185 410028 414635 418983 422667
57687 422667 425740 428842 432600 437209 442462 448029 453740 459566 465215 470032 473657 476677 480243 485133
57673 485133 491390 498526 505718 512191 517980 524092 531442 539923 548951 558438 568545 578952 589321
57660 589321 600214 612564 626278 640255 653907 667797 682721 698919 716382 735269 755765
57649 755765 777958 801775 826614 851387 875855 901757 931477 965562 1002648 1041941 1084343
57638 1084343 1130615 1179895 1231184 1285318 1344176 1408606 1478523 1554654 1638667 1731466 1832712
57627 1832712 1942574 2062884 2195832 2342185 2501567 2674007 2860306 3061119 3276503
57618 3276503 3506465 3750949 4008486 4274999 4544493 4811082 5070200 5317864 5549119
$$ packed form
57702C70228l48Q89K499M275M712L251J787K365M391N673N463M843M607M348L684
57687D22667L073L102L758M609N253N567N711N826N649M817L625L020L566M890
57673D85133O257P136P192O473N789O112P350Q481R028R487J0107J0407J0369
57660E89321J0893J2350J3714J3977J3652J3890J4924J6198J7463J8887K0496
57649G55765K2193K3817K4839K4773K4468K5902K9720L4085L7086L9293M2402
57638A084343M6272M9280N1289N4134N8858O4430O9917P6131Q4013R2799J01246
57627A832712J09862J20310J32948J46353J59382J72440J86299K00813K15384
57618C276503K29962K44484K57537K66513K69494K66589K59118K47664K31255
$$ plain form
57609 5549119 5757435 5935440 6075764 6170979 6213340 6195871 6115104 5973526 5779687 5545958
57599 5545958 5285709 5011307 4733108 4459270 4196067 3948001 3717371 3504272 3308068
57590 3308068 3129062 2968183 2825196 2698263 2585561 2486307 2399800 2324697 2260140 2206494
57580 2206494 2163826 2130522 2104788 2086777 2077619 2076813 2082410 2093798 2112573 2140452 2177803 2224615
57568 2224615 2281158 2346973 2420701 2501987 2592551 2694494 2808312 2933256 3068556 3213312
57558 3213312 3365934 3524720 3688530 3856029 4024488 4189541 4345442 4485365 4602779
57549 4602779 4693580 4756126 4788410 4786329 4746214 4668693 4558935 4423466 4267899 4097335 3917033
57538 3917033 3731581 3543960 3356205 3171043 2992382 2823629 2665446 2515851 2373173
$$ packed form
57609E549119K08316J78005J40324R5215M2361j7469q0767j41578j93839k33729
57599E545958k60249k74402k78199k73838k63203k48066k30630k13099j96204
57590C308068j79006j60879j42987j26933j12702r9254q6507p5103o4557n3646
57580B206494m2668l3304k5734j8011r158q06N597J1388J8775K7879L7351M6812
57568B224615N6543O5815P3728Q1286R0564J01943J13818J24944J35300J44756
57558C213312J52622J58786J63810J67499J68459J65053J55901J39923J17414
57549D602779R0801O2546L2284k081m0115p7521j09758j35469j55567j70564j80302
57538C917033j85452j87621j87755j85162j78661j68753j58183j49595j42678
$$ plain form
57529 2373173 2238437 2113984 2000384 1896207 1800569 1713831 1635370 1562750 1494103 1429679
57519 1429679 1369957 1314099 1261820 1214958 1174979 1140106 1107211 1075806 1047864 1024114 1002861
57508 1002861 982489 962981 944671 927496 912076 899889 891542 885973 881789 878393 875594 873346
57496 873346 872267 873370 876851 881995 888335 895931 904578 914128 925781 941472 961417 983576 1006284
57483 1006284 1030272 1057309 1087884 1121247 1156981 1195497 1237325 1282819 1332580 1387690 1449317
57472 1449317 1518019 1593340 1674422 1761309 1855077 1956138 2063298 2175626 2294407 2421466
57462 2421466 2555762 2693509 2831574 2968501 3101605 3225356 3334016 3424239 3493786 3539388
57452 3539388 3557869 3548507 3512668 3451906 3368202 3265546 3149366 3024175 2892928 2758423
$$ packed form
57529B373173j34736j24453j13600j04177r5638q6738p8461p2620o8647o4424
57519A429679n9722n5858n2279m6862l9979l4873l2895l1405k7942k3750k1253
57508A002861k0372j9508j8310j7175j5420j2187q347n569m184l396k799k248
57496H73346j079J103L481N144O340P596Q647R550J1653J5691J9945K2159K2708
57483A006284K3988K7037L0575L3363L5734L8516M1828M5494M9761N5110O1627
57472A449317O8702P5321Q1082Q6887R3768J01061J07160J12328J18781J27059
57462B421466J34296J37747J38065J36927J33104J23751J08660R0223O9547M5602
57452C539388J8481r362l5839o0762q3704j02656j16180j25191j31247j34505
$$ plain form
57442 2758423 2623840 2491761 2363992 2242668 2130227 2027685 1933781 1846508 1765008 1689707
57432 1689707 1621286 1560156 1506573 1460666 1422302 1391138 1366745 1348658 1336403 1329483 1327146 1328319
57420 1328319 1332213 1339135 1350410 1367261 1389907 1417882 1450996 1489687 1534520 1585771 1643628 1708442
57408 1708442 1780316 1858544 1942043 2030527 2124832 2225815 2333321 2446444 2563989 2683785
57398 2683785 2801929 2913726 3015396 3103921 3175282 3224096 3245724 3238239 3202188 3139491 3053243
57387 3053243 2947560 2826357 2692407 2548332 2398114 2246708 2098252 1955336 1819630
57378 1819630 1692001 1571932 1458105 1350334 1250158 1158866 1075558 998078 925494 858731
57368 858731 798805 745386 697315 653575 613139 574598 536960 500763 467635 438604 413226
$$ packed form
57442B758423j34583j32079j27769j21324j12441j02542r3904q7273q1500p5301
57432A689707o8421o1130n3583m5907l8364l1164k4393j8087j2255o920k337J173
57420A328319L894O922J1275J6851K2646K7975L3114L8691M4833N1251N7857O4814
57408A708442P1874P8228Q3499Q8484R4305J00983J07506J13123J17545J19796
57398B683785J18144J11797J01670Q8525P1361M8814K1628p485l6051o2697q6248
57387C053243j05683j21203j33950j44075j50218j51406j48456j42916j35706
57378A819630j27629j20069j13827j07771j00176r1292q3308p7480p2584o6763
57368H58731n9926n3419m8071m3740m0436l8541l7638l6197l3128k9031k5378
$$ plain form
57357 413226 390340 369088 349097 330299 312905 297204 283046 269716 256508 243263 230335
57346 230335 218254 207275 196939 186353 175573 166394 160611 157456 154076 148953 143477 139413 136380
57333 136380 133287 130984 131366 134276 137405 139497 141835 145967 151472 156950 162068 167494 173391 179034
57319 179034 183797 187785 191475 195167 198849 202399 205878 209686 214270 219660 225476 231452 237832 245185
57305 245185 253757 262924 271401 278269 283711 288284 291689 293203 293450 294580 297989 302836 307565 311878
57291 311878 316222 320346 323808 327223 331440 335928 339596 342936 347621 353895 360008 364568 367982 371331
57277 371331 375197 380088 386582 394400 402392 409963 417450 424704 430594 434673 438282 443208 450005 458210
57263 458210 467343 476981 486581 495799 504560 512676 520174 528049 537443 547816 557278 565207 573080 581960
$$ packed form
57357D13226k2886k1252j9991j8798j7394j5701j4158j3330j3208j3245j2928
57346B30335j2081j0979j0336j0586j0780r179n783l155l380n123n476m064l033
57333A36380l093k303L82K910L129K092K338M132N505N478N118N426N897N643
57319A79034M763L988L690L692L682L550L479L808M584N390N816N976O380P353
57305B45185Q572R167Q477O868N442M573L405J514K47J130L409M847M729M313
57291C11878M344M124L462L415M217M488L668L340M685O274O113M560L414L349
57277C71331L866M891O494P818P992P571P487P254N890M079L609M926O797Q205
57263D58210R133R638R600R218Q761Q116P498P875R394J0373R462P929P873Q880
$$ plain form
57249 581960 590763 598233 605357 614289 625694 638653 652651 668231 685836 705087 725140 745029
57237 745029 763948 781968 800134 819222 838929 858931 879869 902187 924743 946101 966935
57226 966935 989609 1015245 1042479 1069529 1096296 1123808 1152552 1182184 1212416 1243154 1273752
57215 1273752 1302724 1328603 1350849 1369621 1384720 1395154 1399940 1399063 1393306 1383383 1369655 1352450
57203 1352450 1332137 1309037 1283915 1258455 1234420 1212226 1191065 1170568 1151551 1134859 1120334
57192 1120334 1107401 1096090 1086976 1080599 1077279 1077014 1079154 1082592 1086645 1091481 1097580 1105316 1115183 1127782
57178 1127782 1143079 1160067 1177454 1194537 1211427 1228762 1247118 1266262 1285107 1302862 1319924
57167 1319924 1337089 1354345 1371283 1388074 1404852 1420613 1434293 1446707 1459728 1473528 1486509
$$ packed form
57249E81960Q803P470P124Q932J1405J2959J3998J5580J7605J9251K0053J9889
57237G45029J8919J8020J8166J9088J9707K0002K0938K2318K2556K1358K0834
57226I66935K2674K5636K7234K7050K6767K7512K8744K9632L0232L0738L0598
57215A273752K8972K5879K2246J8772J5099J0434M786q77n757r923j3728j7205
57203A352450k0313k3100k5122k5460k4035k2194k1161k0497j9017j6692j4525
57192A120334j2933j1311r114o377l320k65K140L438M053M836O099P736R867J2599
57178A127782J5297J6988J7387J7083J6890J7335J8356J9144J8845J7755J7062
57167A319924J7165J7256J6938J6791J6778J5761J3680J2414J3021J3800J2981
$$ plain form
57156 1486509 1498265 1510715 1525533 1542144 1559082 1575773 1592053 1607430 1621949 1636532 1651277
57145 1651277 1664353 1673576 1678181 1678360 1674293 1666576 1656310 1643604 1627083 1606093 1582445 1558680
57133 1558680 1535379 1511381 1486026 1460023 1434558 1410476 1387954 1366296 1344508 1322573 1301651
57122 1301651 1282821 1266478 1253020 1242962 1236165 1232454 1233210 1240487 1253953 1270719 1289142 1310814
57110 1310814 1337642 1369177 1404601 1445597 1495166 1554719 1623840 1701349 1784518 1868409 1948098
57099 1948098 2021142 2086671 2143422 2190429 2228436 2258431 2279347 2288823 2285574 2269431 2239819 2195689
57087 2195689 2136249 2060325 1965973 1852281 1720710 1573126 1409190 1226977 1025052 802312
57077 802312 556765 286244 -10104 -332282 -680591 -1055313 -1456266 -1883948 -2340393 -2828272
$$ packed form
57156A486509J1756J2450J4818J6611J6938J6691J6280J5377J4519J4583J4745
57145A651277J3076R223M605J79m067p717j0266j2706j6521k0990k3648k3765
57133A558680k3301k3998k5355k6003k5465k4082k2522k1658k1788k1935k0922
57122A301651j8830j6343j3458j0058o797l711P56P277J3466J6766J8423K1672
57110A310814K6828L1535L5424M0996M9569N9553O9121P7509Q3169Q3891P9689
57099A948098P3044O5529N6751M7007L8007K9995K0916R476l249j6143k9612m4130
57087B195689n9440p5924r4352j13692j31571j47584j63936j82213k01925k22740
57077H02312k45547k70521a0104l22178l48309l74722m00953m27682m56445m87879
$$ plain form
57067 -2828272 -3350397 -3910658 -4513636 -5162559 -5859775 -6610085 -7421177 -8299689 -9249650
57058 -9249650 -10276287 -11388421 -12595378 -13904664 -15325128 -16869884 -18554279 -20394033
57050 -20394033 -22407447 -24616599 -27045240 -29720501 -32680267 -35976183 -39668801 -43826390
57042 -43826390 -48533012 -53894429 -60036120 -67106073 -75288005 -84807502 -95916729 -108865087
57034 -108865087 -123863217 -141041730 -160431800 -182004058 -205728008 -231543556 -259229241
57027 -259229241 -288341108 -318390587 -349145130 -380709277 -413208509 -446293403 -478852881
57020 -478852881 -509122286 -535078037 -554900587 -567336243 -571862703 -568643393 -558348962
57013 -558348962 -541957288 -520582382 -495325814 -467167945 -436945310 -405407147 -373271241
$$ packed form
57067b828272n22125n60261o02978o48923o97216p50310q11092q78512r49961
57058i249650j026637j112134j206957j309286j420464j544756j684395j839754
57050b0394033k013414k209152k428641k675261k959766l295916l692618m157589
57042d3826390m706622n361417o141691p069953q181932r519497j1109227j2948358
57034a08865087j4998130j7178513j9390070k1572258k3723950k5815548k7685685
57027b59229241k9111867l0049479l0754543l1564147l2499232l3084894l2559478
57020d78852881l0269405k5955751j9822550j2435656m526460L219310J0294431
57013e58348962J6391674K1374906K5256568K8157869L0222635L1538163L2135906
$$ plain form
57006 -373271241 -341217112 -309837050 -279600566 -250853218 -223837658 -198723766 -175634738
56999 -175634738 -154651513 -135795690 -119017374 -104207243 -91220466 -79892467 -70047721
56992 -70047721 -61511473 -54120542 -47725079 -42186422 -37379868 -33198668 -29551927 -26360124
56984 -26360124 -23555050 -21080987 -18891464 -16945169 -15206454 -13646974 -12243309 -10973896
56976 -10973896 -9820056 -8767931 -7806783 -6926655 -6119307 -5379271 -4701486 -4079164 -3505791
56967 -3505791 -2977601 -2492115 -2045495 -1632873 -1249663 -890845 -550505 -223840 91406 396574
56957 396574 693446 983023 1264808 1538816 1806661 2069566 2327259 2580056 2829772 3076950
56947 3076950 3319465 3556030 3789330 4023517 4259597 4493980 4718663 4920306 5081661
$$ packed form
57006c73271241L2054129L1380062L0236484K8747348K7015560K5113892K3089028
56999a75634738K0983225J8855823J6778316J4810131J2986777J1327999R844746
56992g0047721Q536248P390931O395463N538657M806554M181200L646741L191803
56984b6360124K805074K474063K189523J946295J738715J559480J403665J269413
56976a0973896J153840J052125R61148Q80128Q07348P40036O77785O22322N73373
56967c505791N28190M85486M46620M12622L83210L58818L40340b23840I1406L05168
56957C96574K96872K89577K81785K74008K67845K62905K57693K52797K49716K47178
56947C076950K42515K36565K33300K34187K36080K34383K24683K01643J61355
$$ plain form
56938 5081661 5188407 5235988 5229710 5180098 5099681 5001548 4896588 4790982 4687330 4587492 4492863
56927 4492863 4403099 4317031 4234831 4157865 4086774 4021183 3960836 3905480 3853789 3803769 3754127
56916 3754127 3704388 3654062 3602729 3550583 3498141 3445825 3394409 3345096 3298463 3254171 3212432
56905 3212432 3174729 3142230 3114527 3090939 3072037 3058689 3050406 3045622 3042702 3039731 3034345 3025077
56893 3025077 3012210 2996369 2977055 2953381 2925204 2892633 2855665 2815486 2774962 2736407 2699682
56882 2699682 2663661 2628505 2595239 2564324 2536254 2512420 2493462 2477456 2461688 2445971 2432634
56871 2432634 2423394 2417553 2412765 2405946 2393592 2372857 2342870 2304429 2258674 2206826 2150686 2092232
56859 2092232 2032786 1973204 1914348 1856653 1799937 1744457 1691428 1641563 1593927 1547237 1501410
$$ packed form
56938E081661J06746M7581o278m9612q0417r8133j04960j05606j03652r9838r4629
56927D492863q9764q6068q2200p6966p1091o5591o0347n5356n1691n0020m9642
56916C754127m9739n0326n1333n2146n2442n2316n1416m9313m6633m4292m1739
56905C212432l7703l2499k7703k3588j8902j3348q283m784k920k971n386r268
56893C025077j2867j5841j9314k3674k8177l2571l6968m0179m0524l8555l6725
56882B699682l6021l5156l3266l0915k8070k3834j8958j6006j5768j5717j3337
56871B432634r240n841m788o819j2354k0735k9987l8441m5755n1848n6140n8454
56859B092232n9446n9582n8856n7695n6716n5480n3029m9865m7636m6690m5827
$$ plain form
56848 1501410 1456771 1412820 1369240 1327245 1288358 1252543 1219108 1188772 1163140 1142555 1126123
56837 1126123 1113424 1104566 1098847 1095131 1093456 1094757 1099168 1106009 1115104 1126484 1139053 1151424 1163979
56824 1163979 1178066 1192866 1204947 1211485 1212353 1208579 1200597 1189064 1176065 1164152 1154683 1147703 1142887
56811 1142887 1140078 1139427 1141314 1145788 1152245 1160338 1170900 1184913 1201758 1219848 1238955 1260390 1284343
56798 1284343 1308387 1329116 1343950 1350664 1346756 1330985 1305157 1273324 1239334 1205684 1174125 1146079
56786 1146079 1122133 1101734 1083932 1068588 1056966 1051156 1052795 1062277 1079086 1102466 1131553 1165309
56774 1165309 1202849 1243412 1285211 1324296 1355173 1372782 1374031 1358336 1327719 1286139 1237760
56763 1237760 1185539 1131604 1078306 1027957 981948 941187 907102 881036 862805 851278 846533
$$ packed form
56848A501410m4639m3951m3580m1995l8887l5815l3435l0336k5632k0585j6432
56837A126123j2699q858n719l716j675J301M411O841R095J1380J2569J2371J2555
56824A163979J4087J4800J2081O538Q68l774p982j1533j2999j1913r469o980m816
56811A142887k809o51J887M474O457Q093J0562J4013J6845J8090J9107K1435K3953
56798A284343K4044K0729J4834O714l908j5771k5828l1833l3990l3650l1559k8046
56786A146079k3946k0399j7802j5344j1622n810J639R482J6809K3380K9087L3756
56774A165309L7540M0563M1799L9085L0877J7609J249j5695l0617m1580m8379
56763A237760n2221n3935n3298n0349m6009m0761l4085k6066j8231j1527m745
$$ plain form
56752 846533 849986 861893 880036 901876 927048 956527 989527 1021983 1048151 1063455 1066174 1057021
56740 1057021 1037467 1008677 972027 929966 885436 840500 796263 754174 716472 684793 658948
56729 658948 637643 620251 607516 600526 599161 601677 606111 612218 621474 634669 649896 663471 672415
56716 672415 675145 670287 656432 633681 604539 572537 540189 508482 477792 448827 422748 400387
56704 400387 381126 362897 343927 324476 306382 291081 278722 268965 261590 256114 251736 248110
56692 248110 245537 243987 242399 239355 234215 227478 220463 214604 210472 207294 203891 200153 197153 195808
56678 195808 195946 196644 196796 195371 191949 187342 183060 179876 177318 174588 171436 168223 165788 165112 166070
56663 166070 166531 163960 158367 152587 149193 148258 148714 150326 152915 154791 153985 150901 148071 147071 147016 146473
$$ packed form
56752H46533L453J1907J8143K1840K5172K9479L3000L2456K6168J5304K719r153
56740A057021j9554k8790l6650m2061m4530m4936m4237m2089l7702l1679k5845
56729F58948k1305j7392j2735o990j365K516M434O107R256J3195J5227J3575Q944
56716F72415K730m858j3855k2751k9142l2002l2348l1707l0690k8965k6079k2361
56704D00387j9261j8229j8970j9451j8094j5301j2359r757p375n476m378l626
56692B48110k573j550j588l044n140o737p015n859m132l178l403l738l000j345
56678A95808J38O98J52j425l422m607m282l184k558k730l152l213k435o76R58
56663A66070M61k571n593n780l394r35M56J612K589J876q06l084k830j000n5n43
$$ plain form
56647 146473 145406 144430 143276 141333 139194 138314 139013 139894 139677 138724 138100 137766 136713 134745 133108 132971
56631 132971 133883 134260 133154 131219 130106 131096 134163 138227 142450 147122 152937 159667 166306 172483 178764
56616 178764 185272 191131 195877 200518 206211 212529 217892 221275 222674 222471 221347 220399 220278 220354 219638 218182
56600 218182 216659 214914 212080 207944 203056 197633 191600 185785 181746 180096 179988 180456 181109 181249 179611
56585 179611 175840 171333 167828 165735 164427 163585 163492 164349 165913 167730 169426 170923 172534 174573 176769
56570 176769 178319 178657 178010 177341 177976 180888 185694 190526 193601 194923 195904 197447 199063 199795 199182 197342
56554 197342 194823 192517 191128 190582 190291 189795 188762 186941 184842 183871 184758 186329 187011 187096 188093 190215
56538 190215 192156 193281 194228 195133 195088 194013 193381 194254 195958 197512 199101 201219 203450 204934 205205 204103
$$ packed form
56647A46473j067r76j154j943k139q80O99Q81k17r53o24l34j053j968j637j37
56631A32971R12L77j106j935j113R90L067M064M223M672N815O730O639O177O281
56616A78764O508N859M746M641N693O318N363L383J399k03j124r48j21P6p16j456
56600B18182j523j745k834m136m888n423o033n815m039j650j08M68O53J40j638
56585A79611l771m507l505k093j308q42r3Q57J564J817J696J497J611K039K196
56570A76769J550L38o47o69O35K912M806M832L075J322R81J543J616P32o13j840
56554A97342k519k306j389n46k91m96j033j821k099r71Q87J571O82Q5R97K122
56538A90215J941J125R47R05m5j075o32Q73J704J554J589K118K231J484K71j102
$$ plain form
56522 204103 202018 200699 202360 207001 211852 214493 215485 217059 220414 225303 230958 236172 239612 241506
56508 241506 244123 249290 256240 263137 269713 276946 285117 293986 304142 316199 328959 340323 350023
56495 350023 359662 369896 379302 386485 391859 396764 402046 408065 414906 421706 426545 427852 425746 421742
56481 421742 417556 414318 412187 410207 406890 401386 394108 386247 378933 372681 367136 361310 354520 347196
56467 347196 340453 334878 330102 325549 321138 317139 313673 310477 307056 303109 298962 295423 292849 290493
56453 290493 287066 281981 275876 270095 265819 263451 262483 261907 260911 259245 257072 254819 253124 252513 253026
56438 253026 254370 256314 258494 260069 260452 260300 260847 262086 262674 261920 260706 259914 259121 257816 256876 257633
56422 257633 260089 263093 265858 268333 270522 272433 274486 277080 279935 282532 284920 287506 290482 294073
$$ packed form
56522B04103k085j319J661M641M851K641R92J574L355M889N655N214L440J894
56508B41506K617N167O950O897O576P233Q171Q869J0156J2057J2760J1364R700
56495C50023R639J0234R406P183N374M905N282O019O841O800M839J307k106m004
56481D21742m186l238k131j980l317n504p278p861p314o252n545n826o790p324
56467C47196o743n575m776m553m411l999l466l196l421l947m147l539k574k356
56453B90493l427n085o105n781m276k368r68n76r96j666k173k253j695o11N13
56438B53026J344J944K180J575L83j52N47J239N88p54j214p92p93j305r40P57
56422B57633K456L004K765K475K189J911K053K594K855K597K388K586K976L591
$$ plain form
56408 294073 298801 304683 310672 315797 320410 325496 331248 337304 343759 350667 356868 360756 362301 363175
56394 363175 364785 367253 370382 374422 379400 384528 388822 391809 393383 393507 392369 390564 388915 388147 388491
56379 388491 389361 389764 389343 388613 387817 386197 383045 378925 375170 372662 371715 372242 373084 372145 368647 364696
56363 364696 363017 363487 363578 362033 360132 359085 358092 355895 352759 349840 347585 345779 344444 343761 343447 342932
56347 342932 341943 340546 338936 337368 335933 334379 332642 331468 331766 333268 334770 335894 337563 340191 342298
56332 342298 341820 338434 333980 330706 329402 329027 327942 325669 323413 322589 323125 323773 323754 323121 321684 318922
56316 318922 315419 313181 313700 316474 320180 324479 329631 334953 339078 341867 344979 349976 356415 362321
56302 362321 366283 368566 370358 372648 376230 382047 390410 399753 407264 411438 413485 415597 418544 421698
$$ packed form
56408B94073M728N882N989N125M613N086N752O056O455O908O201L888J545Q74
56394C63175J610K468L129M040M978N128M294K987J574J24j138j805j649p68L44
56379C88491Q70M03m21p30p96j620l152m120l755k508r47N27Q42r39l498l951
56363C64696j679M70R1j545j901j047r93k197l136k919k255j806j335o83l14n15
56347C42932r89j397j610j568j435j554j737j174K98J502J502J124J669K628K107
56332C42298m78l386m454l274j304l75j085k273k256q24N36O48j9o33j437k762
56316C18922l503k238N19K774L706M299N152N322M125K789L112M997O439N906
56302C62321L962K283J792K290L582N817Q363R343P511M174K047K112K947L154
$$ plain form
56288 421698 424665 427582 430117 431565 432150 433074 434962 437270 439604 442617 446875 451539 454996 456572 457194
56273 457194 458579 462029 467648 474437 481341 488311 496029 504690 513662 522516 531649 541529 551850 562010
56259 562010 572064 582669 594199 606332 618504 630427 642145 653873 666014 679205 693923
56248 693923 709805 725518 739730 752147 763285 773445 782564 790991 799466 808113 816344 824075 831945
56235 831945 839843 846536 851698 857166 864936 874883 885825 897879 911970 927744 944054 961396 981785
56222 981785 1006012 1032888 1061576 1092759 1126803 1162531 1199014 1237350 1279620 1326964 1379491
56211 1379491 1437139 1499731 1566969 1639282 1718122 1804732 1899241 2001690 2113284 2235823 2370258
56200 2370258 2516499 2674253 2843465 3024270 3216969 3421652 3637269 3861247 4090452
$$ packed form
56288D21698K967K917K535J448N85R24J888K308K334L013M258M664L457J576O22
56273D57194J385L450N619O789O904O970P718Q661Q972Q854R133R880J0321J0160
56259E62010J0054J0605J1530J2133J2172J1923J1718J1728J2141J3191J4718
56248F93923J5882J5713J4212J2417J1138J0160R119Q427Q475Q647Q231P731P870
56235H31945P898O693N162N468P770R947J0942J2054J4091J5774J6310J7342K0389
56222I81785K4227K6876K8688L1183L4044L5728L6483L8336M2270M7344N2527
56211A379491N7648O2592O7238P2313P8840Q6610R4509J02449J11594J22539J34435
56200B370258J46241J57754J69212J80805J92699K04683K15617K23978K29205
$$ plain form
56191 4090452 4322320 4554907 4786170 5013414 5232879 5439528 5627664 5792356 5930384
56182 5930384 6040006 6120296 6170919 6192234 6185413 6152565 6096582 6020512 5927169 5819470 5700482
56171 5700482 5572413 5436092 5292459 5144181 4994531 4844638 4693025 4538044 4379687
56162 4379687 4219017 4057249 3895934 3736826 3580683 3426963 3275354 3126907 2983078
56153 2983078 2844318 2710329 2581198 2457581 2340012 2228652 2123672 2025574 1935029 1852336
56143 1852336 1776916 1707565 1643428 1584466 1530749 1481882 1437550 1397953 1362894 1331144 1301653
56132 1301653 1274740 1250939 1229352 1208626 1189144 1172632 1159810 1149944 1142513 1137591 1134586 1132383
56120 1132383 1131005 1131511 1134071 1137877 1143251 1151933 1164604 1179753 1195714 1212268 1229603 1247346 1265662
$$ packed form
56191D090452K31868K32587K31263K27244K19465K06649J88136J64692J38028
56182E930384J09622Q0290N0623K1315o821l2848n5983p6070r3343j07699j18988
56171E700482j28069j36321j43633j48278j49650j49893j51613j54981j58357
56162D379687j60670j61768j61315j59108j56143j53720j51609j48447j43829
56153B983078j38760j33989j29131j23617j17569j11360j04980r8098r0545q2693
56143A852336p5420o9351o4137n8962n3717m8867m4332l9597l5059l1750k9491
56132A301653k6913k3801k1587k0726j9482j6512j2822r866p431m922l005k203
56120A132383j378N06K560L806N374Q682J2671J5149J5961J6554J7335J7743J8316
$$ plain form
56107 1265662 1285914 1309128 1334692 1361249 1387842 1413672 1438016 1461053 1483637 1505712 1526181
56096 1526181 1544765 1562571 1580253 1597205 1613374 1630227 1648976 1669381 1691474 1717195 1749001
56085 1749001 1787823 1833532 1886566 1948136 2019397 2101092 2193186 2294451 2403394 2520048 2645780
56074 2645780 2780981 2923915 3071703 3220631 3365324 3499965 3621610 3730926 3829177 3916257
56064 3916257 3992229 4058240 4114399 4158556 4188529 4203865 4204322 4188841 4157779 4114295 4061397 3998754
56052 3998754 3923893 3835145 3732057 3614899 3485989 3350162 3211834 3072569 2933402 2798280
56042 2798280 2672768 2559866 2458997 2368677 2288421 2218296 2158215 2107814 2066215 2032124 2004476
56031 2004476 1982199 1963148 1944751 1926458 1910058 1896736 1885337 1874360 1863872 1854254 1844805 1835010
$$ packed form
56107A265662K0252K3214K5564K6557K6593K5830K4344K3037K2584K2075K0469
56096A526181J8584J7806J7682J6952J6169J6853J8749K0405K2093K5721L1806
56085A749001L8822M5709N3034O1570P1261Q1695R2094J01265J08943J16654J25732
56074B645780J35201J42934J47788J48928J44693J34641J21645J09316R8251Q7080
56064C916257P5972O6011N6159M4157K9973J5336M57j5481l1062m3484n2898o2643
56052C998754p4861q8748j03088j17158j28910j35827j38328j39265j39167j35122
56042B798280j25512j12902j00869r0320q0256p0125o0081n0401m1599l4091k7648
56031B004476k2277j9051j8397j8293j6400j3322j1399j0977j0488r618r449r795
$$ plain form
56019 1835010 1825749 1818007 1811807 1807336 1805426 1805927 1807433 1809595 1813692 1820007 1827030 1834381 1843930 1856703
56005 1856703 1871435 1887669 1907158 1930382 1954918 1979579 2006867 2038630 2072558 2106065 2140404
55994 2140404 2177478 2215712 2253186 2292117 2335781 2382998 2430036 2476298 2523853 2572990 2622649
55983 2622649 2674019 2729316 2787771 2846797 2906275 2967936 3031544 3095778 3162065 3233616 3311263
55972 3311263 3393870 3481980 3577292 3679353 3786480 3899121 4018617 4143710 4272206 4405125
55962 4405125 4545153 4691880 4842511 4996301 5154259 5315665 5479445 5648310 5826934
55953 5826934 6016454 6214805 6421732 6639190 6867610 7106250 7356698 7621843 7902055
55944 7902055 8196396 8506427 8834607 9180344 9542198 9922402 10324484 10748222 11192162
$$ packed form
56019A835010r261p742o200m471j910N01J506K162M097O315P023P351R549J2773
56005A856703J4732J6234J9489K3224K4536K4661K7288L1763L3928L3507L4339
55994B140404L7074L8234L7474L8931M3664M7217M7038M6262M7555M9137M9659
55983B622649N1370N5297N8455N9026N9478O1661O3608O4234O6287P1551P7647
55972C311263Q2607Q8110R5312J02061J07127J12641J19496J25093J28496J32919
55962D405125J40028J46727J50631J53790J57958J61406J63780J68865J78624
55953E826934J89520J98351K06927K17458K28420K38640K50448K65145K80212
55944G902055K94341L10031L28180L45737L61854L80204M02082M23738M43940
$$ plain form
55935 11192162 11659100 12153380 12674668 13220543 13793446 14398614 15036972 15707028 16412226
55926 16412226 17159186 17950130 18784653 19667769 20608603 21612371 22681506 23823175 25047126
55917 25047126 26357460 27755454 29249395 30852922 32575952 34427818 36428355 38606146
55909 38606146 40988458 43604604 46497780 49723457 53342647 57434520 62114835 67526216
55901 67526216 73811620 81112029 89582529 99385415 110667041 123563212 138223048 154798221
55893 154798221 173408702 194147656 217114729 242409998 270107412 300256642 332764388
55886 332764388 366912577 400681676 430592069 452599975 463631922 462672030 450742077
55879 450742077 430094803 403362220 373035934 341209743 309465084 278891439 250200745
$$ packed form
55935A1192162M66938M94280N21288N45875N72903O05168O38358O70056P05198
55926A6412226P46960P90944Q34523Q83116R40834J003768J069135J141669J223951
55917B5047126J310334J397994J493941J603527J723030J851866K000537K177791
55909C8606146K382312K616146K893176L225677L619190M091873M680315N411381
55901F7526216O285404P300409Q470500R802886J1281626J2896171J4659836J6575173
55893A54798221J8610481K0738954K2967073K5295269K7697414L0149230L2507746
55886C32764388L4148189L3769099K9910393K2007906J1031947r59892j1929953
55879D50742077k0647274k6732583l0326286l1826191l1744659l0573645k8690694
$$ plain form
55872 250200745 223824998 199955673 178582767 159566358 142703614 127767711 114539343
55865 114539343 102833876 92498522 83385884 75344849 68237847 61951391 56386790 51454000
55857 51454000 47077596 43195979 39749739 36679235 33934821 31479123 29276870 27291561
55849 27291561 25494064 23865303 22387560 21040574 19807806 18678627 17642005 16684805
55841 16684805 15797984 14977628 14218048 13510188 12848357 12232080 11659492 11124731 10623436
55832 10623436 10154990 9717636 9306971 8920896 8560676 8225206 7909340 7609635 7326799
55823 7326799 7060622 6807390 6564508 6333238 6114549 5906179 5706046 5515005 5333963
55814 5333963 5161168 4994205 4832181 4674773 4521863 4375140 4237270 4108315 3985487
$$ packed form
55872B50200745k6375747k3869325k1372906j9016409j6862744j4935903j3228368
55865A14539343j1705467j0335354r112638q041035p107002o286456n564601m932790
55857E1454000m376404l881617l446240l070504k744414k455698k202253j985309
55849B7291561j797497j628761j477743j346986j232768j129179j036622r57200
55841A6684805q86821q20356p59580p07860o61831o16277n72588n34761n01295
55832A0623436m68446m37354m10665l86075l60220l35470l15866k99705k82836
55823G326799k66177k53232k42882k31270k18689k08370k00133j91041j81042
55814E333963j72795j66963j62024j57408j52910j46723j37870j28955j22828
$$ plain form
55805 3985487 3867171 3754636 3649335 3551308 3460672 3377536 3299573 3222524 3144065 3064766 2984836
55794 2984836 2902756 2817956 2732272 2647826 2565575 2486378 2411239 2340082 2272337 2208807 2150933
55783 2150933 2098494 2050461 2007595 1971303 1940281 1911359 1883630 1858622 1836524 1815640 1795799
55772 1795799 1778778 1764675 1751019 1736181 1720554 1703792 1684140 1661478 1637937 1614306 1588584
55761 1588584 1559132 1526716 1492478 1456618 1420155 1385402 1353390 1322868 1292767 1263565 1235709
55750 1235709 1208976 1183997 1161941 1142118 1122442 1102866 1085790 1072456 1061719 1053017 1047505 1045195
55738 1045195 1043910 1042309 1041190 1040536 1038110 1032515 1025040 1016964 1007684 997173 987613 980369 973420 963904
55724 963904 951689 938733 926452 915191 904833 894575 883473 871959 861175 850140 835892
$$ packed form
55805C985487j18316j12535j05301r8027r0636q3136p7963p7049p8459p9299p9930
55794B984836q2080q4800q5684q4446q2251p9197p5139p1157o7745o3530n7874
55783B150933n2439m8033m2866l6292l1022k8922k7729k5008k2098k0884j9841
55772A795799j7021j4103j3656j4838j5627j6762j9652k2662k3541k3631k5722
55761A588584k9452l2416l4238l5860l6463l4753l2012l0522l0101k9202k7856
55750A235709k6733k4979k2056j9823j9676j9576j7076j3334j0737q702n512k310
55738A045195j285j601j119o54k426n595p475q076r280j0511r560p244o949r516
55724I63904j2215j2956j2281j1261j0358j0258j1102j1514j0784j1035j4248
$$ plain form
55713 835892 817412 797088 777228 757643 737945 719349 702304 684982 666431 649050 635562
55702 635562 625383 616152 606980 597821 587554 575537 563749 554573 547190 538663 527991 516835 506578
55689 506578 496727 486119 474219 461285 448267 436116 424575 412615 400676 390851 383795 377299
55677 377299 369489 361646 355814 351213 345409 337997 330803 325173 321191 318915 318100 317078 313965 308915
55663 308915 303557 298578 293560 288759 285068 282219 278755 273918 268242 262409 256876 252524 250292 250045
55649 250045 250869 252377 254755 257833 261192 264897 269007 272649 274789 275718 276722 278500 280807 283319 285792
55634 285792 287791 289306 291276 294422 298003 300834 303135 306140 310270 314918 319795 325158 330796 336036
55620 336036 340767 345423 349888 353334 355182 355530 354828 353891 353868 355260 357108 357909 357204 355689 354268 353712
$$ packed form
55713H35892j8480k0324j9860j9585j9698j8596j7045j7322j8551j7381j3488
55702F35562j0179r231r172r159j0267j2017j1788r176p383q527j0672j1156j0257
55689E06578r851j0608j1900j2934j3018j2151j1541j1960j1939r825p056o496
55677C77299p810p843n832m601n804p412p194n630l982k276q15j022l113n050
55663C08915n358m979n018m801l691k849l464m837n676n833n533m352k232k47
55649B50045Q24J508K378L078L359L705M110L642K140R29J004J778K307K512K473
55634B85792J999J515J970L146L581K831K301L005M130M648M877N363N638N240
55620C36036M731M656M465L446J848L48p02r37k3J392J848Q01p05j515j421n56
$$ plain form
55604 353712 354598 356549 358066 358167 357840 358870 361714 365505 369506 373299 376109 377514 378622 381050 384711
55589 384711 387953 389926 391418 393071 394064 393220 390515 386952 383367 379630 374677 367388 357782 347164
55575 347164 336632 325914 314284 302180 290940 281171 272228 263197 253732 244111 235069 227240 220268
55562 220268 213024 205339 198657 194013 190206 185218 178776 172133 165970 160220 155661 153740 154514 156179
55548 156179 157011 156666 155553 154215 153423 153579 153722 152382 149648 147161 145753 144404 142037 139146 136960
55533 136960 135882 135329 134330 131887 127583 122230 117176 112698 108044 103273 99834 98649 98750 98658 98305 98534
55517 98534 99357 99768 99072 97538 95832 94502 94088 95081 97489 100512 102867 103573 102668 101182 100309 100624 102070
55500 102070 104288 106611 108203 108885 109568 111140 113038 113646 112138 109263 106360 104287 103321 103292 103561 103491
$$ packed form
55604C53712Q86J951J517J01l27J030K844L791M001L793K810J405J108K428L661
55589C84711L242J973J492J653R93q44k705l563l585l737m953p289r606j0618
55575C47164j0532j0718j1630j2104j1240r769q943r031r465r621r042p829o972
55562B20268p244p685o682m644l807m988o442o643o163n750m559j921P74J665
55548A56179Q32l45j113j338p92J56J43j340k734k487j408j349k367k891k186
55533A36960j078n53r99k443m304n353n054m478m654m771l439j185J01r2l53K29
55517I8534Q23M11o96j534j706j330m14R93K408L023K355P06r05j486q73L15J446
55500A02070K218K323J592O82O83J572J898O08j508k875k903k073r66k9K69p0
$$ plain form
55484 103491 103164 103199 103869 105022 106685 108846 110593 110627 109096 108030 109282 112721 117077 121827 127304 133325
55468 133325 138852 143189 146856 150887 155666 160757 165571 169787 173153 175399 176695 177876 179739 182136
55454 182136 184255 185717 186769 187342 186679 184253 180337 175273 168834 160826 151701 142121 132651 124359 118636
55439 118636 115337 111958 105999 97803 89930 84113 80046 76717 73519 70064 66250 62629 59575 56125
55425 56125 50870 44061 37565 32597 28819 25843 24101 23684 23697 23614 24099 25572 26852 26219 23331 19392
55409 19392 15888 13623 12402 11094 8581 5196 2676 2286 3518 5089 6527 8133 9986 11759 13277
55394 13277 14712 16392 18649 21543 24495 26678 28027 29363 31163 32760 33218 32463 31157 29835 28698
55379 28698 27868 27354 26927 26364 25606 24515 22857 20765 18880 17749 17335 17267 17271 17287 17533 18475 20289 22340
$$ packed form
55484A03491l27L5O70J153J663K161J747L4j531j066J252L439M356M750N477O021
55468A33325N527M337L667M031M779N091M814M216L366K246J296J181J863K397
55454A82136K119J462J052N73o63k426l916n064o439q008r125r580r470q292n723
55439A18636l299l379n959q196p873n817m067l329l198l455l814l621l054l450
55425E6125n255o809o496m968l778k976j742m17J3q3M85J473J280o33k888l939
55409A9392l504k265j221j308k513l385k520l90J232J571J438J606J853J773J518
55394A3277J435J680K257K894K952K183J349J336J800J597M58p55j306j322j137
55379B8698q30n14m27n63p58j091j658k092j885j131m14o8MJ6K46R42J814K051
$$ plain form
55361 22340 23698 24136 24107 23883 23556 23747 25170 27196 28012 26770 24745 23762 24284 25635 27269 28993 30570
55344 30570 31942 33413 35045 36303 36886 37253 37691 37551 36274 34604 33768 33755 33393 31995 30009 28075
55328 28075 26322 24737 23463 22461 21379 20023 18663 17791 17822 18967 20975 22967 23878 23261 21480 19127
55312 19127 16459 13509 10516 8040 6516 5813 5463 5396 6118 7865 9948 11393 12080 12680 13581 14543 15294
55295 15294 15721 15441 14001 11746 9764 8747 8599 9307 11213 13912 15805 15545 13460 10943 8949 7669
55279 7669 7166 7548 8660 10105 11439 12221 12322 12407 13466 15464 17146 17667 17754 18503 19645 19923 18867
55262 18867 17341 16352 16004 15742 15270 15151 16432 19337 22428 23803 23309 22715 23317 24383 24561 23708 22280
55245 22280 20028 16849 14330 14598 17427 20030 20257 18861 18019 18539 19450 19798 19803 20092 20373 19483 16895
$$ packed form
55361B2340J358M38k9k24l27J91J423K026Q16j242k025r83N22J351J634J724J577
55344C0570J372J471J632J258N83L67M38j40j277j670q36j3l62j398j986j934
55328B8075j753j585j274j002j082j356j360q72L1J145K008J992R11o17j781k353
55312A9127k668k950k993k476j524p03l50o7P22J747K083J445O87O00R01R62P51
55295A5294M27k80j440k255j982j017j48P08J906K699J893k60k085k517j994j280
55279G669n03L82J112J445J334P82J01Q5J059J998J682N21Q7P49J142K78j056
55262A8867j526r89l48k62m72j19J281K905L091J375m94n94O02J066J78q53j428
55245B2280k252l179k519K68K829K603K27j396q42N20R11L48NK89K81q90k588
$$ plain form
55228 16895 13847 12414 13319 15053 15535 14315 12855 12907 14944 17893 20107 20790 20665 21045 22216 23214
55212 23214 23253 22633 21967 21372 20960 21274 22387 23223 22735 21435 20883 21889 23872 25743 26653 26185 24692
55195 24692 23367 23285 24372 25747 26863 27783 28685 29639 30620 31219 30773 29348 28009 27403 26627 24470 21300
55178 21300 18689 17473 17232 17414 17827 18152 18121 18200 19107 20571 21548 21673 21645 22104 23038 24262 25528 26209
55160 26209 25816 24878 24358 24262 23959 23865 25353 28633 32054 34142 35199 36169 36914 36591 35153 33615 33060
55143 33060 33773 35026 35466 34246 32091 30843 31748 34622 38482 42175 44398 44312 42640 41148 40476 39428
55127 39428 37017 34286 33094 33730 34731 34731 33619 32149 31176 31297 32571 34415 36017 36872 36861 36084 34717
55110 34717 32862 30601 28610 28425 31175 35871 39839 41314 40863 39912 38881 37477 35933 34879 34391
$$ packed form
55228A6895l048j433R05J734M82j220j460N2K037K949K214O83j25L80J171R98
55212B3214L9o20o66n95m12L14J113Q36m88j300n52J006J983J871R10m68j493
55195B4692j325q2J087J375J116R20R02R54R81N99m46j425j339o06p76k157l170
55178B1300k611j216k41J82M13L25l1P9R07J464R77J25k8M59R34J224J266O81
55160B6209l93r38n20r6l03r4J488L280L421K088J057R70P45l23j438j538n55
55143C3060P13J253M40j220k155j248R05K874L860L693K223q6j672j492o72j048
55127C9428k411k731j192O36J001%j112j470r73J21J274J844J602Q55j1p77j367
55110C4717j855k261j991j85K750M696L968J475m51r51j031j404j544j054m88
$$ plain form
55095 34391 34066 33763 33514 33029 32094 31287 31445 32425 33116 32715 31459 30048 28924 28270 28229 28791 29620 30172
55077 30172 30061 29373 28689 28611 29214 30116 31043 32028 33144 34556 36784 40201 43978 46336 46386 45249 44839
55060 44839 45921 47907 50036 52056 54015 56109 58709 62139 66482 71681 77419 82677 86180 87959
55046 87959 89760 92918 96294 97530 96118 93896 92427 91361 90009 89106 89657 90778 90282 87440 83913
55031 83913 81592 80581 79974 79642 80123 81159 81671 81373 81333 82497 84514 86516 88171 89224 88891 86884
55015 86884 84537 83694 84633 86053 86859 86845 85915 84109 82463 82275 83178 83382 82343 81594 82161 82701 81482
54998 81482 78965 77017 76502 77140 78932 81962 85109 86626 86061 84483 82852 81359 80302 80304 81376 82753
54982 82753 83877 84681 84887 84069 82642 81780 82028 82878 84027 86131 89755 94327 98751 102526 105691 108054
$$ packed form
55095C4391l25l03k49m85r35q07J58R80O91m01j256j411j124o54m1N62Q29N52
55077C0172j11o88o84p8O03R02R27R85J116J412K228L417L777K358N0j137m10
55060D4839J082J986K129K020J959K094K600L430M343N199N738N258L503J779
55046H7959J801L158L376J236j412k222j469j066j352r03N51J121m96k842l527
55031H3913k321j011o07l32M81J036N12k98m0J164K017K002J655J053l33k007
55015H6884k347q43R39J420Q06j4r30j806j646j88R03K04j039p49N67N40j219
54998H1482k517j948n15O38J792L030L147J517n65j578j631j493j057KJ072J377
54982H2753J124Q04K06q18j427q62K48Q50J149K104L624M572M424L775L165K363
$$ plain form
54966 108054 109056 108312 106027 102926 99915 97683 96577 96856 98671 101445 103729 104423 104047 104131 105388 107108
54950 107108 108316 108776 108848 109068 109961 111588 113217 114193 115046 116767 118792 118909 115800 110815 106441 103642
54934 103642 101485 98877 95796 92979 91195 90909 92141 94407 96826 98349 98090 95910 92778 90073 88302
54919 88302 86833 85005 83080 81915 82184 84056 87147 90506 93184 95026 96468 97468 97442 96573 96297 97850
54903 97850 100935 104480 108047 111749 115389 118692 122091 126396 131906 138584 146864 157267 169288 181606
54889 181606 193575 205782 219027 233518 249275 266485 284964 303698 321361 337058 350411
54878 350411 361134 368621 371847 369893 362986 352762 340824 327217 311128 293038 275002 258505
54866 258505 243116 227899 213168 199913 188276 177764 168542 161279 155870 151442 147716 145237 143986
$$ packed form
54966A08054J002p44k285l101l011k232j106K79J815K774K284O94l76Q4J257J720
54950A07108J208M60P2K20Q93J627J629R76Q53J721K025J17l109m985m374k799
54934A03642k157k608l081k817j784k86J232K266K419J523k59k180l132k705j771
54919H8302j469j828j925j165K69J872L091L359K678J842J442J000k6q69k76J553
54903I7850L085L545L567L702L640L303L399M305N510O678Q280J0403J2021J2318
54889A81606J1969J2207J3245J4491J5757J7210J8479J8734J7663J5697J3353
54878C50411J0723P487L226j954o907j0224j1938j3607j6089j8090j8036j6497
54866B58505j5389j5217j4731j3255j1637j0512r222p263n409m428l726k479j251
$$ plain form
54853 143986 142901 141393 140481 141580 144738 148892 153511 159164 166587 175940 186934 199011 211420 223742
54839 223742 236443 250298 265063 279283 291503 301017 307160 308781 305175 297108 286196 273475
54827 273475 259225 243904 228387 213250 198596 184758 172460 161919 152362 142926 133705 125404
54815 125404 118205 111451 104511 97717 92390 89947 90667 93078 94775 94319 92419 91011 91118 91798 91317
54800 91317 89114 86409 84839 84781 85209 85025 84101 82992 82097 81523 81379 81642 81808 81183 79576 77326 74756
54783 74756 72075 69709 68060 66905 65791 65184 66282 69144 71736 71615 68159 62703 57075 52739 50780
54768 50780 51513 54087 57190 60140 62798 64860 66215 67758 70627 74483 77641 79210 80026 81122 82406
54753 82406 83560 85112 87553 90122 91720 92695 94611 98368 103473 109083 114794 120330 125453 130519 136331
$$ packed form
54853A43986j085j508r12J099L158M154M619N653P423R353J0994J2077J2409J2322
54839B23742J2701J3855J4765J4220J2220R514O143J621l606q067j0912j2721
54827B73475j4250j5321j5517j5137j4654j3838j2298j0541r557r436r221q301
54815A25404p199o754o940o794n327k443P20K411J697m56j900j408J07O80m81
54800I1317k203k705j570n8M28j84r24j109q95n74j44K63J66o25j607k250k570
54783G4756k681k366j649j155j114o07J098K862K592j21l456n456n628m336j959
54768E0780P33K574L103K950K658K062J355J543K869L856L158J569Q16J096J284
54753H2406J154J552K441K569J598R75J916L757N105N610N711N536N123N066N812
$$ plain form
54738 136331 143085 150082 156902 164215 172965 183249 194543 206646 219772 233941 248861 264360
54726 264360 280351 296285 311096 323823 333964 341106 344620 344085 339842 332871 324166 314459 304354
54713 304354 294304 284357 274220 263731 252995 241984 230576 219435 210326 204635 201620 199081
54701 199081 196072 194053 194836 198249 202686 207297 212509 218734 225836 233945 243719 255466 268904 283993
54687 283993 301052 319708 338755 357580 376776 396641 416057 433721 449551 463666 474753
54676 474753 481066 482717 481357 477473 469598 456745 440170 421837 402150 380434 357145 334492
54664 334492 314788 298741 285313 272810 260161 247431 235181 223473 211940 200845 191254 183780
54652 183780 177808 172565 168208 164988 161926 157660 152516 148454 146571 145764 144514 142955 142102 141697 140299
$$ packed form
54738A36331O754O997O820P313Q750J0284J1294J2103J3126J4169J4920J5499
54726B64360J5991J5934J4811J2727J0141P142L514n35m243o971q705r707j0105
54713C04354j0050r947j0137j0489j0736j1011j1408j1141r109n691l015k539
54701A99081l009k019P83L413M437M611N212O225P102Q109R774J1747J3438J5089
54687B83993J7059J8656J9047J8825J9196J9865J9416J7664J5830J4115J1087
54676D74753O313J651j360l884p875j2853j6575j8333j9687k1716k3289k2653
54664C34492j9704j6047j3428j2503j2649j2730j2250j1708j1533j1095r591p474
54652A83780n972n243m357l220l062m266n144m062j883q07j250j559q53m05j398
$$ plain form
54637 140299 137612 135494 135873 138328 140487 140559 138833 136881 136083 136948 139071 141254 142163 141450 140105 139374
54621 139374 139535 140100 140857 142150 144262 147090 150470 154274 158069 161131 162947 163539 163413 163561 165271 169152
54605 169152 174319 179288 183871 189365 196530 204253 210935 216505 222118 228171 233640 237514 240212 243185
54591 243185 247385 252343 256779 260108 263149 267012 271450 275056 277312 279611 283667 289670 296877 305449
54577 305449 316568 330716 346771 363033 378585 393695 409491 427223 447093 467690 487078
54566 487078 504466 520176 533961 544267 549465 549138 543759 533769 519546 501855 481757 460181
54554 460181 437925 415946 395317 376880 360875 346728 333269 319620 306083 293855 283807
54543 283807 275784 269088 263110 257375 251544 245731 240447 235924 231785 227518 222855 217536 211350 204867
$$ packed form
54637A40299k687k118L79K455K159P2j726j952p98Q65K123K183R09p13j345p31
54621A39374J61N65P57J293K112K828L380L804L795L062J816N92j26J48J710L881
54605A69152N167M969M583N494P165P723O682N570N613O053N469L874K698K973
54591B43185M200M958M436L329L041L863M438L606K256K299M056O003P207Q572
54577C05449J1119J4148J6055J6262J5552J5110J5796J7732J9870K0597J9388
54566D87078J7388J5710J3785J0306N198l27n379r990j4223j7691k0098k1576
54554D60181k2256k1979k0629j8437j6005j4147j3459j3649j3537j2228j0048
54543B83807q023o696n978n735n831n813n284m523m139m267m663n319o186o483
$$ plain form
54529 204867 199520 196154 193780 190560 185992 181340 177695 174386 169933 164254 159110 156082 154563 152297
54515 152297 147809 141762 135859 131062 127434 125119 124441 124884 124888 123257 120414 117901 116836 117135 117993 118679
54499 118679 118896 118612 117846 116760 115884 115850 116587 117219 117297 117828 120297 124698 129305 132526 134181 134775 134437
54482 134437 133177 131554 130462 130509 131861 134210 136666 138315 139281 140563 142494 144289 145807 148732 154815
54467 154815 163580 173005 182068 191325 201183 211135 220843 230647 240451 249210 256151 261681 266432 270119
54453 270119 272019 271984 270198 266326 259691 250378 239682 229361 220523 212925 205215 196175 186150 176981
54439 176981 170239 165700 161847 157598 153052 148708 144536 140081 135274 130936 128300 127838 128538 128698 127719
54424 127719 126816 127518 129646 131408 131553 130846 131059 132911 135526 137745 139388 141106 143346 145738 147325
$$ packed form
54529B04867n347l366k374l220m568m652l645l309m453n679n144l028j519k266
54515A52297m488o047n903m797l628k315o78M43Mj631k843k513j065K99Q58O86
54499A18679K17k84p66j086q76l4P37O32P8N31K469M401M607L221J655N94l38
54482A34437j260j623j092M7J352K349K456J649R66J282J931J795J518K925O083
54467A54815Q765R425R063R257R858R952R708R804R804Q759O941N530M751L687
54453B70119J900l5j786l872o635r313j0696j0321q838p598p710r040j0025r169
54439A76981o742m539l853m249m546m344m172m455m807m338k636m62P00J60r79
54424A27719r03P02K128J762J45p07K13J852K615K219J643J718K240K392J587
$$ plain form
54409 147325 147264 145552 143262 141949 142574 145041 148695 152916 157002 160031 161478 161801 161799 161498 160410 158839
54393 158839 157957 158187 158384 157287 155234 153655 153200 153146 152479 150879 148683 146451 144607 143064 141231 138736
54377 138736 135990 133568 131278 128508 125348 122620 120715 119169 117644 116659 116853 117974 119116 119761 120180
54362 120180 120864 121830 122575 122665 122294 122137 122658 123849 125734 128601 132306 135874 138554 140862 143700 146629
54346 146629 148174 148028 147809 149186 152154 155702 159307 163031 166824 170589 174484 178442 181891 184688 187866
54331 187866 192484 197987 202652 205582 207333 208586 209278 209239 208677 207413 204405 198918 191865 185218 180109
54316 180109 176033 171955 167631 163508 159717 155664 150729 145097 139750 135757 133704 133524 134516 135445 135091
54301 135091 133025 129882 126742 124270 122458 120956 119536 118310 117630 117736 118611 120285 123074 127068 131504
$$ packed form
54409A47325o1j712k290j313O25K467L654M221M086L029J447L23kl01j088j571
54393A58839q82K30J97j097k053j579m55n4o67j600k196k232j844j543j833k495
54377A38736k746k422k290k770l160k728j905j546j525r85J94J121J142O45M19
54362A20180O84R66P45R0l71j57N21J191J885K867L705L568K680K308K838K929
54346A46629J545j46k19J377K968L548L605L724L793L765L895L958L449K797L178
54331A87866M618N503M665K930J751J253O92l9n62j264l008n487p053o647n109
54316A80109m076m078m324m123l791m053m935n632n347l993k053j80R92R29l54
54301A35091k066l143l140k472j812j502j420j226o80J06Q75J674K789L994M436
$$ plain form
54286 131504 135302 138406 141905 146353 150656 153282 154144 154457 154977 155367 155315 155274 155718 156548 157821 160422 165046
54269 165046 170645 174736 175552 173492 170205 166648 162557 157670 152739 148906 146422 144598 142865 141135
54255 141135 138910 134957 128699 121493 115543 111622 108731 106168 104877 105957 108500 109866 108216 104122
54241 104122 99580 95956 93222 90863 88892 87759 87495 87340 86469 84949 83763 83759 84605 84818 82943 78908
54225 78908 74379 71617 71659 73548 75390 76101 76026 76124 77025 78791 81036 82994 83929 83929 84138 85803 89091 93021
54207 93021 96540 99369 101781 103836 105179 105698 106138 107585 110108 112266 112584 111483 111119 112974 116152
54192 116152 118481 118909 118265 117862 118085 118343 117851 116189 113530 110587 108165 106594 105699 105303 105458 106179 107280
54175 107280 108561 109777 110381 109815 108316 106943 106356 106021 105235 104568 105443 108190 111380 113406 114193 114869
$$ packed form
54286A31504L798L104L499M448M303K626Q62L13N20L90n2m1M44Q30J273K601M624
54269A65046N599M091Q16k060l287l557m091m887m931l833k484j824j733j730
54255A41135k225l953o258p206n950l921k891k563j291J080K543J366j650m094
54241A04122m542l624k734k359j971j133k64j55q71j520j186mQ46K13j875m035
54225G8908m529k762M2J889J842P11p5R8R01J766K245J958R35%K09J665L288L930
54207I3021L519K829K412K055J343N19M40J447K523K158L18j101l64J855L178
54192A16152K329M28o44m03K23K58m92j662k659k943k422j571q95l96J55P21J101
54175A07280J281J216O04n66j499j373n87l35p86o67Q75K747L190K026P87O76
$$ plain form
54159 114869 116156 117597 118304 118098 117859 118796 121171 123693 124557 123311 121366 120392 120732 121835 123651 126569
54143 126569 130119 132837 133773 133392 132537 131172 128714 125100 120927 116884 113567 111438 110347 109394 107987
54128 107987 106767 106617 107009 106382 104220 101658 99724 98129 96396 94998 94336 93493 91421 88943 88040 89093
54112 89093 90335 90479 90524 92004 94544 96327 96468 95663 94676 93468 92029 90976 90760 90972 91060 91278 92261
54095 92261 93930 95468 96318 96632 96644 96138 94935 93550 92804 92729 92294 90626 88235 86531 86109 86041 85163 83514
54077 83514 81962 80802 79547 77980 76524 75323 73821 71756 69883 68991 68689 67984 66870 66516 67836
54062 67836 70484 73305 75215 75567 74263 71803 68921 66074 63590 62105 62156 63192 63765 63163 62334 62686
54046 62686 64361 66204 67175 67272 67235 67856 69505 71857 74054 75385 75854 75922 75940 76199 77309 79903 83763
$$ packed form
54159A14869J287J441P07k06k39R37K375K522Q64j246j945r74L40J103J816K918
54143A26569L550K718R36l81q55j365k458l614m173m043l317k129j091r53j407
54128A07987j220j50L92o27k162k562j934j595j733j398o62q43k072k478r03J053
54112H9093J242J44M5J480K540J783J41q05r87j208j439j053k16K12Q8K18R83
54095I2261J669J538Q50L14J2n06j203j385p46p5m35j668k391j704m22o8q78j649
54077H3514j552j160j255j567j456j201j502k065j873q92l02p05j114l54J320
54062F7836K648K821J910L52j304k460k882k847k484j485N1J036N73o02q29L52
54046F2686J675J843R71R7l7O21J649K352K197J331M69O8J8K59J110K594L860
$$ plain form
54029 83763 87544 89723 89840 88826 88136 88410 88847 88055 85630 82740 80862 80181 79619 78325 76615 75377
54013 75377 75079 75700 77233 79770 83093 86506 89266 91056 92024 92485 92776 93333 94565 96376 98032 98908
53997 98908 99411 100693 103203 105959 107693 108493 109739 112479 116275 119795 122157 123538 124743 126514 129123
53982 129123 132224 134919 136182 135823 135210 136646 141378 148293 155143 161044 167144 174717 183451 192058 199852
53967 199852 207035 214041 221394 229785 239333 249019 257640 265146 272247 279043 285127 290787 296750 302547
53953 302547 306506 307918 308141 308899 310415 311840 312507 311914 309295 304309 297659 290264 282378 274346 267517
53938 267517 263156 260768 258612 255773 252646 249471 245587 240462 234572 228955 224515 221751 220335 218751
53924 218751 215322 210027 204648 200747 198119 195579 192572 189430 186600 184241 182265 180374 178390 176909
$$ packed form
54029H3763L781K179J17j014o90K74M37p92k425k890j878o81n62j294j710j238
54013G5377k98O21J533K537L323L413K760J790R68M61K91N57J232J811J656Q76
53997I8908N03J282K510K756J734Q00J246K740L796L520K362J381J205J771K609
53982A29123L101K695J263l59o13J436M732O915O850N901O100P573Q734Q607P794
53967A99852P183P006P353Q391R548R686Q621P506P101O796O084N660N963N797
53953C02547L959J412K23P58J516J425O67n93k619m986o650p395p886q032o829
53938B67517m361k388k156k839l127l175l884n125n890n617m440k764j416j584
53924B18751l429n295n379l901k628k540l007l142k830k359j976j891j984j481
$$ plain form
53910 176909 177126 179472 182727 185082 185807 185441 184794 184560 185671 188934 193887 198684 201649 202634 202468 201566
53894 201566 199829 197815 196977 198176 200510 202472 204058 206698 210871 214827 216495 216033 215460 216168 217971
53879 217971 220535 224274 229250 234264 238080 241022 244456 249030 254243 259590 265169 270978 276322 280370
53865 280370 283017 284901 286723 288763 291090 294069 298386 304352 311345 318354 325110 332186 339828 347361
53851 347361 354213 360926 368403 376385 383497 388840 392904 396802 401206 406198 411538 416631 420465 422172
53837 422172 421744 420101 418343 416844 415103 412592 409701 407427 405926 403796 399427 392817 385440 378273
53823 378273 370648 361385 350621 340038 331263 324346 317933 310873 303352 296137 288975 280586 270597 260670
53809 260670 252916 247630 243425 239250 235229 231566 227818 223625 219270 215036 210650 205825 200764 195808
$$ packed form
53910A76909K17K346L255K355P25l66o47k34J111L263M953M797K965R85j66r02
53894B01566j737k014q38J199K334J962J586K640M173L956J668m62n73P08J803
53879B17971K564L739M976N014L816K942L434M574N213N347N579N809N344M048
53865B80370K647J884J822K040K327K979M317N966O993P009O756P076P642P533
53851C47361O852O713P477P982P112N343M064L898M404M992N340N093L834J707
53837D22172m28j643j758j499j741k511k891k274j501k130m369o610p377p167
53823C78273p625r263j0764j0583q775o917o413p060p521p215p162q389r989r927
53809B60670p754n286m205m175m021l663l748m193m355m234m386m825n061m956
$$ plain form
53795 195808 191100 186922 183723 181424 179308 176965 174730 172725 170213 166624 162655 159598 157942 157326
53781 157326 157441 158149 158953 159184 158697 157855 156963 156169 155631 155263 154592 153441 152366 151724 150741 148446 145239
53764 145239 142521 140948 140175 140282 142110 145705 149515 151875 152719 153293 154776 157566 161382 165461 169006
53749 169006 171826 174257 176323 177463 177417 176995 177664 180658 186432 194397 203022 210790 217336 223197 228562
53734 228562 233119 237244 242146 248276 254602 260166 265412 271078 276648 281067 284374 287426 290348 292393
53720 292393 293229 293387 293531 294004 294830 295316 294074 290523 286051 282516 279866 276625 272508 268718 265342 260380
53704 260380 252517 243468 236238 231863 229080 226601 224368 222752 221660 220594 218988 216473 213235 210006
53690 210006 207419 205722 205395 207283 211256 215248 216750 215267 212453 209903 207651 204996 201964 199589
$$ packed form
53795A95808m708m178l199k299k116k343k235k005k512l589l969l057j656o16
53781A57326J15P08Q04K31m87q42q92p94n38l68o71j151j075o42r83k295l207
53764A45239k718j573p73J07J828L595L810K360Q44N74J483K790L816M079L545
53749A69006K820K431K066J140m6m22O69K994N774P965Q625P768O546N861N365
53734B28562M557M125M902O130O326N564N246N666N570M419L307L052K922K045
53720B92393Q36J58J44M73Q26M86j242l551m472l535k650l241m117l790l376m962
53704B60380p863r049p230m375k783k479k233j616j092j066j606k515l238l229
53690B10006k587j697l27J888L973L992J502j483k814k550k252k655l032k375
$$ plain form
53676 199589 199204 201495 205706 209714 211596 211382 210719 210664 210594 209646 208376 208155 209325 210835 211584 211375 210402
53659 210402 208597 206017 203459 202004 201867 202224 202478 203337 206023 210313 213950 214495 211655 207558 204877
53644 204877 204890 207034 209793 212065 214101 217137 221843 227272 231726 234489 236196 237728 239552 242139 246018
53629 246018 250938 255721 259448 262205 264235 265297 265616 266735 270190 275565 280890 284840 287552 289392
53615 289392 290167 289946 289614 289954 290727 291197 291027 290308 289186 287948 286952 285976 284153 281195 278305 277150 277997
53598 277997 279404 279693 278265 275605 272596 269935 267879 266344 265323 265072 265670 266646 267313 267407 267250 267467
53582 267467 268669 270991 273610 275133 274901 273526 271809 269793 267597 266437 267606 270743 274368 277978
53568 277978 282198 286764 290111 291726 293433 297085 301984 305935 308249 310233 312954 315887 317982 319061
$$ packed form
53676A99589l85K291M211M008J882k14o63n5p0r48j270k21J170J510P49k09r73
53659B10402j805k580k558j455j37L57K54Q59K686M290L637N45k840m097k681
53644B04877J3K144K759K272K036L036M706N429M454K763J707J532J824K587L879
53629B46018M920M783L727K757K030J062L19J119L455N375N325L950K712J840
53615B89392P75k21l32L40P73M70j70p19j122j238r96r76j823k958k890j155Q47
53598B77997J407K89j428k660l009k661k056j535j021k51N98R76O67R4j57K17
53582B67467J202K322K619J523k32j375j717k016k196j160J169L137L625L610
53568B77978M220M566L347J615J707L652M899L951K314J984K721K933K095J079
$$ plain form
53554 319061 319849 321295 324049 328065 332537 336682 340603 344869 349385 353304 356177 358633 361843 366720
53540 366720 373489 381306 388368 393332 396929 401391 407790 414627 419628 422483 425181 429867 436789 444158
53526 444158 449653 452259 452907 453337 454398 455815 457440 459837 463227 466691 469197 470911 472691 474562 475585
53511 475585 475154 473532 471011 467462 463198 459692 458765 460999 465241 469545 472520 474054 475099 476833 479765
53496 479765 483361 486471 488284 489181 490604 493761 498290 502533 505302 507116 509439 513074 517779 523116
53482 523116 528885 534683 539789 543912 547704 552128 557463 563150 568535 573566 578809 584858 591744 599023
53468 599023 606478 614526 623693 633901 644611 655520 666716 678266 690241 703018 716844 731013
53456 731013 744492 757804 773347 792806 814818 836321 856071 875554 896314 917816 938828
$$ packed form
53554C19061P88J446K754M016M472M145L921M266M516L919K873K456L210M877
53540C66720O769P817P062M964L597M462O399O837N001K855K698M686O922P369
53526D44158N495K606O48M30J061J417J625K397L390L464K506J714J780J871J023
53511D75585m31j622k521l549m264l506r27K234M242M304K975J534J045J734K932
53496D79765L596L110J813Q97J423L157M529M243K769J814K323L635M705N337
53482E23116N769N798N106M123L792M424N335N687N385N031N243O049O886P279
53468E99023P455Q048R167J0208J0710J0909J1196J1550J1975J2777J3826J4169
53456G31013J3479J3312J5543J9459K2012K1503J9750J9483K0760K1502K1012
$$ plain form
53445 938828 959947 983325 1009950 1038376 1066420 1093297 1119633 1146193 1173554 1202626 1234305
53434 1234305 1268155 1302152 1334416 1364962 1395338 1426720 1458903 1491003 1522538 1553607 1584440
53423 1584440 1615113 1645580 1675886 1706420 1737779 1769973 1801841 1831976 1860424 1888804 1918256
53412 1918256 1947840 1975652 2001111 2025353 2049540 2073757 2097654 2121183 2144038 2164889 2181947
53401 2181947 2194381 2202991 2209464 2214947 2219147 2220786 2219115 2214723 2208513 2200199 2188730 2174287 2158733
53388 2158733 2143571 2128344 2111818 2093906 2075285 2055716 2034247 2011122 1988058 1966168 1944704
53377 1944704 1922518 1899867 1877872 1856763 1835667 1814030 1792438 1771878 1752826 1735307 1719449
53366 1719449 1705525 1693506 1682898 1673304 1665026 1658663 1653914 1649328 1643884 1638560 1635549 1636008 1639347
$$ packed form
53445I38828K1119K3378K6625K8426K8044K6877K6336K6560K7361K9072L1679
53434A234305L3850L3997L2264L0546L0376L1382L2183L2100L1535L1069L0833
53423A584440L0673L0467L0306L0534L1359L2194L1868L0135K8448K8380K9452
53412A918256K9584K7812K5459K4242K4187K4217K3897K3529K2855K0851J7058
53401B181947J2434Q610O473N483M200J639j671m392o210q314j1469j4443j5554
53388B158733j5162j5227j6526j7912j8621j9569k1469k3125k3064k1890k1464
53377A944704k2186k2651k1995k1109k1096k1637k1592k0560j9052j7519j5858
53366A719449j3924j2019j0608r594q278o363m749m586n444n324l011M59L339
$$ plain form
53353 1639347 1644668 1651716 1660093 1668852 1677813 1688364 1701776 1717338 1733434 1750113 1769215 1791890
53341 1791890 1817225 1843635 1870644 1898879 1929074 1961551 1996214 2032787 2071476 2113265 2158834
53330 2158834 2207161 2256101 2304672 2353933 2405383 2459445 2515951 2575027 2636559 2699449 2762349
53319 2762349 2824872 2887449 2950311 3013098 3075012 3134930 3192015 3246796 3300903 3354891 3407007
53308 3407007 3455016 3498508 3538190 3573553 3602992 3626165 3644578 3659463 3670462 3676876 3678739 3675757
53296 3675757 3666416 3649416 3625510 3596911 3565160 3530274 3491670 3449176 3403313 3355239 3306404
53285 3306404 3257787 3209457 3161029 3112293 3063281 3014209 2965629 2918154 2871721 2825799 2780688
53274 2780688 2737693 2697131 2657099 2615501 2572830 2531487 2492623 2455308 2418971 2384800 2353837
$$ packed form
53353A639347N321P048Q377Q759Q961J0551J3412J5562J6096J6679J9102K2675
53341A791890K5335K6410K7009K8235L0195L2477L4663L6573L8689M1789M5569
53330B158834M8327M8940M8571M9261N1450N4062N6506N9076O1532O2890O2900
53319B762349O2523O2577O2862O2787O1914N9918N7085N4781N4107N3988N2116
53308C407007M8009M3492L9682L5363K9439K3173J8413J4885J0999O414J863k982
53296C675757r341j7000k3906k8599l1751l4886l8604m2494m5863m8074m8835
53285C306404m8617m8330m8428m8736m9012m9072m8580m7475m6433m5922m5111
53274B780688m2995m0562m0032m1598m2671m1343l8864l7315l6337l4171l0963
$$ plain form
53263 2353837 2325183 2297359 2270424 2245305 2221757 2198579 2175701 2154467 2135483 2117422 2098521
53252 2098521 2078465 2058221 2038696 2020135 2002342 1984938 1967682 1950863 1935055 1920218 1905578
53241 1905578 1890851 1877089 1865806 1857640 1852337 1849453 1848331 1847833 1847170 1846898 1848275 1851722 1856828 1863788
53227 1863788 1873662 1886870 1902397 1918972 1936208 1954169 1972748 1992096 2012858 2035187 2058199
53216 2058199 2081149 2104488 2128810 2153347 2176488 2197409 2216194 2232735 2246604 2257890 2267101
53205 2267101 2274380 2279736 2283740 2286778 2287830 2285363 2279442 2271426 2261393 2247687 2229708 2209453 2189067
53192 2189067 2168231 2145356 2120296 2094299 2068076 2041632 2015605 1990881 1966826 1941523 1914246
53181 1914246 1886458 1859861 1834568 1809850 1785738 1762975 1741824 1721665 1701640 1681334 1660976
$$ packed form
53263B353837k8654k7824k6935k5119k3548k3178k2878k1234j8984j8061j8901
53252B098521k0056k0244j9525j8561j7793j7404j7256j6819j5808j4837j4640
53241A905578j4727j3762j1283q166n303k884j122m98o63k72J377L447N106O960
53227A863788R874J3208J5527J6575J7236J7961J8579J9348K0762K2329K3012
53216B058199K2950K3339K4322K4537K3141K0921J8785J6541J3869J1286R211
53205B267101P279N356M004L038J052k467n921q016j0033j3706j7979k0255k0386
53192B189067k0836k2875k5060k5997k6223k6444k6027k4724k4055k5303k7277
53181A914246k7788k6597k5293k4718k4112k2763k1151k0159k0025k0306k0358
$$ plain form
53170 1660976 1641211 1622438 1604169 1585366 1565633 1545779 1526971 1509589 1493193 1477378 1462360
53159 1462360 1448712 1436646 1425636 1414863 1404179 1394369 1386093 1378694 1370472 1360233 1348178 1335223
53147 1335223 1321869 1307864 1292632 1275781 1257409 1238065 1218326 1198429 1178537 1159191 1141010
53136 1141010 1123852 1106735 1088794 1070039 1051082 1032493 1014536 997180 980194 963462 947283
53125 947283 931945 916934 901042 883517 864746 845594 826566 807942 790235 773868 758543
53114 758543 743477 728290 713307 698889 684747 670190 655096 640444 627581 616849 607316 598178
53102 598178 589839 582845 576107 567484 556433 544925 535012 526422 517431 507459 497620 489074 481938 475824
53088 475824 470368 464971 458863 451905 444842 438456 432845 427746 423109 418982 415099 410967 406313 401334
$$ packed form
53170A660976j9765j8773j8269j8803j9733j9854j8808j7382j6396j5815j5018
53159A462360j3648j2066j1010j0773j0684r810q276p399q222j0239j2055j2955
53147A335223j3354j4005j5232j6851j8372j9344j9739j9897j9892j9346j8181
53136A141010j7158j7117j7941j8755j8957j8589j7957j7356j6986j6732j6179
53125I47283j5338j5011j5892j7525j8771j9152j9028j8624j7707j6367j5325
53114G58543j5066j5187j4983j4418j4142j4557j5094j4652j2863j0732r533r138
53102E98178q339o994o738q623j1051j1508r913q590q991r972r839q546p136o114
53088D75824n456n397o108o958p063o386n611n099m637m127l883m132m654m979
$$ plain form
53074 401334 396652 393113 391410 391499 392297 392186 390160 386698 383287 380876 378939 376335 372785 368913 365094
53059 365094 361221 357740 355688 355098 354383 352234 349236 346495 343474 338741 332537 327021 323816 322758 323254
53044 323254 325324 328541 331248 331939 330773 328927 326967 324670 322004 319573 318157 318237 319716 321929 324188
53029 324188 326356 328406 329572 328984 327330 326681 327946 329569 329632 328252 326675 324796 321167 315279 308487
53014 308487 302433 297562 293354 289196 284805 280450 276918 274672 272941 270215 265684 259773 253412 247491
53000 247491 242984 240733 240669 241620 242048 240835 237669 233260 229055 226104 224209 222526 220665 218551 215786
52985 215786 212305 209403 208768 210302 212078 212717 212559 212177 211145 209090 206629 204213 201052 196551 192057
52970 192057 189672 189576 189886 189186 187946 187135 186628 185712 184484 183890 184473 185716 186748 187371 188080 189133 189955
$$ packed form
53074D01334m682l539j703Q9P98j11k026l462l411k411j937k604l550l872l819
53059C65094l873l481k052n90p15k149k998k741l021m733o204n516l205j058M96
53044C23254K070L217K707O91j166j846j960k297k666k431j416Q0J479K213K259
53029C24188K168K050J166n88j654o49J265J623O3j380j577j879l629n888o792
53014C08487o054m871m208m158m391m355l532k246j731k726m531n911o361n921
53000B47491m507k251o4R51M28j213l166m409m205k951j895j683j861k114k765
52985B15786l481k902o35J534J776O39j58l82j032k055k461k416l161m501m494
52970A92057k385r6L10p00j240q11n07r16j228n94N83J243J032O23P09J053Q22
$$ plain form
52953 189955 189648 187868 184968 181552 178284 175844 174393 173247 171839 170927 171861 174478 176873 177781 178147
52938 178147 179579 182106 184389 185451 185167 183646 181267 179069 178050 178159 178727 179577 180884 182267 183110
52923 183110 183613 184446 185440 185707 185122 184607 184802 185424 186135 186956 187521 186935 185013 182962 182385 184024 187607
52906 187607 192126 196172 198934 201166 204359 208688 212776 215753 218295 221108 223736 225872 228574 232778
52892 232778 237368 240227 240941 241220 242824 246233 251136 256912 262448 266562 269122 271212 274082 278287 283572
52877 283572 288820 292356 293297 292665 292338 292909 293497 293566 293690 294151 294087 292792 290923 289574 288821 287983 286730
52860 286730 285103 282953 280458 278846 279516 282175 284802 285681 284829 283126 280875 277896 274580 271987 270759
52845 270759 270488 270453 270584 271284 272500 273641 274599 276259 279303 282736 284357 283013 279956 277689 277746 279785
$$ packed form
52953A89955l07j780k900l416l268k440j451j146j408r12R34K617K395R08L66
52938A78147J432K527K283J062k84j521k379k198j019J09N68Q50J307J383Q43
52923A83110N03Q33R94K67n85n15J95O22P11Q21N65n86j922k051n77J639L583
52906A87607M519M046K762K232L193M329M088K977K542K813K628K136K702M204
52892B32778M590K859P14K79J604L409M903N776N536M114K560K090K870M205N285
52877B83572N248L536R41o32l27N71N88O9J24M61o4j295j869j349p53q38j253
52860B86730j627k150k495j612O70K659K627Q79q52j703k251k979l316k593j228
52845B70759k71l5J31P00J216J141R58J660L044L433J621j344l057k267N7K039
$$ plain form
52829 279785 282432 284556 285919 287085 288846 291534 294770 297769 299721 300014 298609 296471 295164 295473 296582
52814 296582 297005 296160 294676 293473 293210 294406 297204 300776 303643 304963 305086 304659 303801 302571 301607 301586
52798 301586 302359 303232 303846 304224 304218 303677 302997 302711 302508 301537 299902 298899 299318 300312 300673 300586 301297 303378 306205
52779 306205 309015 311629 314158 316726 319629 323029 326316 328465 329350 330046 331496 333451 335179 336521 337584
52764 337584 337904 336904 335085 333920 334318 335775 337264 338451 339685 341102 342163 342066 340414 337488 333895
52749 333895 329975 325568 320408 314770 309611 305980 304093 302810 300268 295541 289770 285092 282224 279737
52735 279737 276111 271780 268386 266632 265939 265717 265561 264293 260479 254533 248989 245724 243886 241373 237464
52720 237464 232979 228820 225643 224266 224773 225421 223945 220113 215854 212795 210898 209542 208520 207549 206136
$$ packed form
52829B79785K647K124J363J166J761K688L236K999J952K93j405k138j307L09J109
52814B96582M23q45j484j203k63J196K798L572K867J320J23m27q58j230r64k1
52798C01586P73Q73O14L78on41o80k86k03r71j635j003M19R94L61q7P11K081K827
52779C06205K810K614K529K568K903L400L287K149Q85O96J450J955J728J342J063
52764C37584L20j000j819j165L98J457J489J187J234J417J061r7j652k926l593
52749C33895l920m407n160n638n159l631j887j283k542m727n771m678k868k487
52735B79737l626m331l394j754o93k22j56j268l814n946n544l265j838k513l909
52720B37464m485m159l177j377N07O48j476l832m259l059j897j356j022r71j413
$$ plain form
52705 206136 204538 203588 202927 200759 196311 191311 187827 185718 183623 181484 180258 179614 177916 174672 171279
52690 171279 168920 167157 165121 162735 160077 156755 152837 149474 147604 146695 145617 144144 142700 141255
52676 141255 139568 138226 138127 138855 138658 136436 133036 130120 128318 127023 125638 124331 123527 123240 123271 123650
52660 123650 124273 124229 122458 119621 118419 120808 125162 127567 126159 122998 121167 121234 121425 120211 117582 114520
52644 114520 112443 112718 115386 118465 119644 118610 116805 115289 114248 114447 117263 122470 127333 129070 127575
52629 127575 124951 123054 122352 122642 123694 125182 126792 128595 130915 133717 136451 138536 139851 140727 141572
52614 141572 142532 143585 145043 147528 151007 154101 155217 154427 153398 153178 152949 151557 149441 148167 148465
52599 148465 149616 150516 150570 149617 147888 146140 145117 144552 143169 140011 135534 131195 128174 126607 125858 125278
$$ packed form
52705B06136j598r50o61k168m448n000l484k109k095k139j226o44j698l244l393
52690A71279k359j763k036k386k658l322l918l363j870r09j078j473j444j445
52676A41255j687j342r9P28j97k222l400k916j802j295j385j307q04k87L1L79
52660A23650O23m4j771k837j202K389M354K405j408l161j831O7J91j214k629l062
52644A14520k077K75K668L079J179j034j805j516j041J99K816N207M863J737j495
52629A27575k624j897p02K90J052J488J610J803K320K802K734K085J315Q76Q45
52614A41572R60J053J458K485L479L094J116p90j029k20k29j392k116j274K98
52599A48465J151R00N4r53j729j748j023n65j383l158m477m339l021j567p49n80
$$ plain form
52583 125278 124746 124536 124699 124691 123842 122220 120807 120555 121271 121652 120622 118505 116657 115968 116205 116815 117645 118368
52565 118368 117926 115589 112367 110378 110641 112287 113970 115135 115681 115463 114719 114180 114089 113750 112628 111220
52549 111220 110173 109227 107896 106673 106572 107726 109315 110774 112245 113815 115017 115271 114423 112928 111878
52534 111878 112610 115614 119751 122985 124154 123997 124513 127242 131773 135844 137374 136511 135224 134937 135475 136420
52518 136420 138102 140449 142145 142162 141343 141274 142295 143767 145480 147390 148676 148801 149054 151233 154930 157943
52502 157943 159421 160796 163363 166745 170138 173194 174983 173949 170117 165989 163978 163963 164362 164556 165083
52487 165083 166268 167913 169845 171836 173521 175182 177981 182536 187737 191855 194406 196237 198207 200499
52473 200499 202721 204115 204186 203771 204787 208168 212621 216120 218008 218881 219207 219086 218810 218582 218086 217261 216925
$$ packed form
52583A25278n32k10J63qq49j622j413k52P16L81j030k117j848o89K37O10Q30P23
52565A18368m42k337l222j989K63J646J683J165N46k18p44n39r1l39j122j408
52549A11220j047r46j331j223j01J154J589J459J471J570J202K54q48j495j050
52534A11878P32L004M137L234J169j57N16K729M531M071J530q63j287k87N38R45
52518A36420J682K347J696J7q19o9J021J472J713J910J286J25K53K179L697L013
52502A57943J478J375K567L382L393L056J789j034l832m128k011j5L99J94N27
52487A65083J185J645J932J991J685J661K799M555N201M118K551J831J970K292
52473B00499K222J394P1m15J016L381M453L499J888Q73L26j21k76k28m96q25l36
$$ plain form
52456 216925 217692 218696 218650 217799 217629 218742 220152 220667 220050 218902 218264 219109 221316 223340 223891 223624 224096
52439 224096 225326 225798 224822 223462 222873 223025 223454 223983 224247 223573 221873 219642 216798 212821 208650 206911
52423 206911 209061 213329 216857 219129 221800 225611 229208 231231 232148 233274 234835 235906 235955 235675 236177
52408 236177 237761 239754 241274 241862 241398 239917 237895 236398 236351 237511 238680 239096 239276 240299 242537 245305
52392 245305 247506 248407 248066 247264 246947 247489 248468 249175 249340 249426 250301 252523 255794 259191 262078 264495 266499
52375 266499 267584 267304 266132 265078 264576 264399 264458 264846 265132 264557 263206 261997 261191 259929 257897 256511
52359 256511 257330 259803 261678 261606 260398 259607 259711 260014 259727 258652 257059 255366 254013 253498 254362 256847
52343 256847 260453 264005 266566 268314 270226 272715 274837 275179 273602 271767 271663 273701 276675 279558 282666
$$ packed form
52456B16925P67J004m6q51j70J113J410N15o17j148o38Q45K207K024N51k67M72
52439B24096J230M72r76j360n89J52M29N29K64o74j700k231k844l977m171j739
52423B06911K150M268L528K272K671L811L597K023R17J126J561J071M9k80N02
52408B36177J584J993J520N88m64j481k022j497m7J160J169M16J80J023K238K768
52392B45305K201R01l41q02l17N42R79P07J65Q6Q75K222L271L397K887K417K004
52375B66499J085k80j172j054n02j77N9L88K86n75j351j209q06j262k032j386
52359B56511Q19K473J875p2j208p91J04L03k87j075j593j693j353n15Q64K485
52343B56847L606L552K561J748J912K489K122L42j577j835j04K038K974K883L108
$$ plain form
52328 282666 286611 290764 293690 294982 295712 296854 298145 298930 299305 299708 299988 299845 299895 301191 303554 305278
52312 305278 304983 303140 301186 299612 297684 294966 292270 290794 290878 292096 294199 297277 301083 304930 308539
52297 308539 312388 316834 321328 325022 327808 330171 332183 333362 333616 333855 335410 338999 344180 349629 354133
52282 354133 357696 361499 366417 371913 376979 381793 387547 394715 402470 409964 417201 424309 430942 436895
52268 436895 442458 447581 451619 454758 458839 465604 474499 483464 491672 500241 510130 520591 530321 539171
52254 539171 548000 557418 567521 578569 591123 605471 621518 639311 659085 680475 702190 723057
52242 723057 743295 764318 787207 811770 837174 863041 889663 917524 946922 977716 1009123
52231 1009123 1040100 1070385 1100818 1132117 1163743 1194694 1225081 1255819 1286878 1317073 1345846
$$ packed form
52328B82666L945M153K926J292P30J142J291P85L75M03K80j43N0J296K363J724
52312C05278k95j843j954j574j928k718k696j476Q4J218K103L078L806L847L609
52297C08539L849M446M494L694K786K363K012J179K54K39J555L589N181N449M504
52282C54133L563L803M918N496N066M814N754P168P755P494P237P108O633N953
52268D36895N563N123M038L139M081O765Q895Q965Q208Q569R889J0461R730Q850
52254E39171Q829R418J0103J1048J2554J4348J6047J7793J9774K1390K1715K0867
52242G23057K0238K1023K2889K4563K5404K5867K6622K7861K9398L0794L1407
52231A009123L0977L0285L0433L1299L1626L0951L0387L0738L1059L0195K8773
$$ plain form
52220 1345846 1374084 1402478 1430000 1454879 1476421 1495082 1511372 1525715 1539084 1552541 1566043
52209 1566043 1578354 1588360 1596012 1601926 1606629 1610228 1612434 1612789 1611274 1608761 1606572 1605417 1604896 1604017
52195 1604017 1602062 1599151 1596226 1594470 1594616 1596835 1601180 1607662 1615719 1624208 1632497 1641386 1652517 1666995
52181 1666995 1684770 1704922 1726140 1747290 1768114 1789235 1811061 1833033 1854383 1875218 1896090
52170 1896090 1916780 1936381 1954535 1971699 1987892 2001928 2012383 2019054 2023167 2026318 2029191 2031093
52158 2031093 2030631 2026895 2019874 2009776 1996567 1980525 1962610 1943583 1923227 1901210 1878248 1855341
52146 1855341 1832160 1807505 1781400 1755459 1730850 1707164 1683865 1661708 1641711 1623525 1605833
52135 1605833 1588007 1570614 1554661 1540980 1529915 1520798 1511995 1502273 1492014 1482511 1474317 1467066
$$ packed form
52220A345846K8238K8394K7522K4879K1542J8661J6290J4343J3369J3457J3502
52209A566043J2311J0006P652N914M703L599K206L55j515k513k189j155n21q79
52195A604017j955k911k925j756J46K219M345O482Q057Q489Q289Q889J1131J4478
52181A666995J7775K0152K1218K1150K0824K1121K1826K1972K1350K0835K0872
52170A896090K0690J9601J8154J7164J6193J4036J0455O671M113L151K873J902
52158B031093m62l736p021j0098j3209j6042j7915j9027k0356k2017k2962k2907
52146A855341k3181k4655k6105k5941k4609k3686k3299k2157j9997j8186j7692
52135A605833j7826j7393j5953j3681j1065r117q803r722j0259r503q194p251
$$ plain form
52123 1467066 1460674 1455635 1451945 1448588 1444586 1439960 1435217 1430415 1425260 1419771 1414134 1408070 1401034 1393246
52109 1393246 1385994 1380524 1376867 1374035 1371141 1367868 1364009 1359162 1353186 1346539 1339770 1332853 1325502 1318091
52095 1318091 1311794 1307581 1305171 1303105 1299813 1294709 1288472 1282338 1277015 1272186 1267034 1261152 1254919 1249116
52081 1249116 1244350 1240768 1238122 1236050 1234247 1232405 1230082 1226895 1222796 1218007 1212849 1207977 1204481 1202989
52067 1202989 1202613 1201694 1199910 1198723 1199169 1200209 1200249 1199466 1199432 1200911 1203425 1206748 1211366 1217338 1223957 1230902
52051 1230902 1238623 1247328 1256693 1266947 1279213 1294268 1311886 1331764 1354051 1378439 1403830 1429670
52039 1429670 1456741 1485956 1517294 1550580 1586129 1623683 1661746 1699239 1736952 1776006 1815662
52028 1815662 1854260 1891784 1929704 1968277 2005674 2040012 2070816 2098160 2121896 2142333 2160388
$$ packed form
52123A467066o392n039l690l357m002m626m743m802n155n489n637o064p036p788
52109A393246p252n470l657k832k894l273l859m847n976o647o769o917p351p411
52095A318091o297m213k410k066l292n104o237o134n323m829n152n882o233n803
52081A249116m766l582k646k072j803j842k323l187m099m789n158m872l496j492
52067A202989l76r19j784j187M46J040M0p83l4J479K514L323M618N972O619O945
52051A230902P721Q705R365J0254J2266J5055J7618J9878K2287K4388K5391K5840
52039A429670K7071K9215L1338L3286L5549L7554L8063L7493L7713L9054L9656
52028A815662L8598L7524L7920L8573L7397L4338L0804K7344K3736K0437J8055
$$ plain form
52017 2160388 2176208 2188683 2197183 2202864 2207327 2210593 2211452 2209250 2204301 2196821 2186653 2174230 2160819
52004 2160819 2147310 2133242 2117548 2100026 2081658 2063676 2046742 2031086 2016949 2004399 1992846
51993 1992846 1981362 1969840 1959476 1951708 1946837 1944086 1942872 1943508 1946544 1951865 1958687 1966237 1974263
51980 1974263 1983017 1992805 2003438 2014164 2024377 2034356 2044986 2056661 2068691 2079862 2089353 2097013
51968 2097013 2103053 2107749 2111330 2113846 2114948 2113865 2109802 2102561 2092695 2080870 2067215 2051693 2034931
51955 2034931 2017919 2000566 1981264 1958490 1932325 1903851 1873722 1842258 1810423 1779230 1748057
51944 1748057 1714806 1678203 1639036 1598713 1557611 1515607 1473450 1432591 1393844 1356849 1320667
51933 1320667 1284426 1247596 1210254 1173099 1136965 1102355 1069473 1038207 1007823 977149 945567
$$ packed form
52017B160388J5820J2475Q500N681M463L266Q59k202m949p480j0168j2423j3411
52004B160819j3509j4068j5694j7522j8368j7982j6934j5656j4137j2550j1553
51993A992846j1484j1522j0364p768m871k751j214O36L036N321O822P550Q026
51980A974263Q754R788J0633J0726J0213R979J0630J1675J2030J1171R491P660
51968B097013O040M696L581K516J102j083m063p241r866j1825j3655j5522j6762
51955B034931j7012j7353j9302k2774k6165k8474l0129l1464l1835l1193l1173
51944A748057l3251l6603l9167m0323m1102m2004m2157m0859l8747l6995l6182
51933A320667l6241l6830l7342l7155l6134l4610l2882l1266l0384l0674l1582
$$ plain form
51922 945567 913605 882301 852368 824302 798577 775049 752531 729806 706915 684931 664652
51911 664652 646097 629004 613013 597477 581895 566621 552507 539795 528007 516998 507425 499912
51899 499912 494292 489740 485166 479555 472810 466414 462235 460107 457435 451943 444233 436846 431240 426527
51885 426527 420940 413650 405192 396866 389939 384898 381305 378581 376737 375793 374752 371988 366982 361095
51871 361095 356274 353339 351751 350633 349572 348644 347925 347024 345115 341782 337832 334824 333490 332916 331621
51856 331621 329108 326099 323567 321890 320616 318569 314566 308737 303010 299478 298083 296512 292690 286877
51842 286877 281074 276929 274645 273338 271665 268308 262762 256002 249934 245880 243742 242712 242324 242510 242931
51827 242931 242903 242121 241141 240773 241127 241594 241843 242421 243984 246108 247434 247105 245616 244006 242661 241441 240610
$$ packed form
51922I45567l1962l1304k9933k8066k5725k3528k2518k2725k2891k1984k0279
51911F64652j8555j7093j5991j5536j5582j5274j4114j2712j1788j1009r573p513
51899D99912n620m552m574n611o745o396m179k128k672n492p710p387n606m713
51885D26527n587p290q458q326o927n041l593k724j844r44j041k764n006n887
51871C61095m821k935j588j118j061r28p19r01j909l333l950l008j334n74j295
51856C31621k513l009k532j677j274k047m003n829n727l532j395j571l822n813
51842B86877n803m145k284j307j673l357n546o760o068m054k138j030l88J86M21
51827B42931k8p82r80l68L54M67K49N78J563K124J326l29j489j610j345j220q31
$$ plain form
51810 240610 240898 242503 244583 245937 245939 244788 243252 242279 242394 243217 243854 243928 243861 244111 244789 246377 249980 255943
51792 255943 262575 267293 269141 269467 270116 271768 274234 277343 280798 283763 285546 286684 288704 292581 297576
51777 297576 301598 302779 301140 298921 298780 301085 303268 302434 298438 293849 291103 290485 290800 290974 290472 288997
51761 288997 286671 284384 283327 284064 286257 289169 292141 294731 296668 297716 297574 296162 294046 292130 290665
51746 290665 289021 286937 285506 286082 288323 290191 290161 288792 287799 288142 289488 291066 292379 293193 293417 293154
51730 293154 292614 291893 291032 290226 289739 289615 289742 290224 291324 292913 294278 294841 294885 295180 295889 296301 295791 294692
51712 294692 293789 293304 292964 292965 294090 296536 299284 301227 302552 304339 306906 309347 310885 312082 314252 317916
51696 317916 322130 325308 326585 326558 326797 328604 332127 336563 340928 344432 346554 347430 348209 350362 354393
$$ packed form
51810B40610K88J605K080J354Kj151j536r73J15Q23O37P4o7K50O78J588L603N963
51792B55943O632M718J848L26O49J652K466L109L455K965J783J138K020L877M995
51777B97576M022J181j639k219j41K305K183q34l996m589k746o18L15J74n02j475
51761B88997k326k287j057P37K193K912K972K590J937J048j42j412k116j916j465
51746B90665j644k084j431N76K241J868l0j369r93L43J346J578J313Q14K24k63
51730B93154n40p21q61q06m87j24J27M82J100J589J365N63M4K95P09M12n10j099
51712B94692r03m85l40JJ125K446K748J943J325J787K567K441J538J197K170L664
51696C17916M214L178J277k7K39J807L523M436M365L504K122Q76P79K153M031
$$ plain form
51681 354393 359517 364696 369586 374408 379546 385568 393051 401922 411288 420324 428996 437634 446303 454879
51667 454879 463151 470396 475650 479247 483417 490064 498191 504781 508171 509349 509807 509702 508775 507705 507199
51652 507199 506529 504250 500097 495173 490581 486873 484601 484081 484339 483499 480838 477681 475653 474771 474042 473337
51636 473337 473569 475093 476976 478182 478804 479714 481467 483885 486325 487962 488303 488010 488842 492077 497142 502553
51620 502553 508047 514571 521927 527760 530004 529549 529119 529783 529982 528151 524907 521976 520081 518910 518467
51605 518467 519244 521179 523510 525815 528475 531856 535644 539270 542555 545618 548449 550833 552472 552937 551748
51590 551748 548772 544474 539632 534918 530711 526865 522450 516151 507518 497769 488848 481590 475194 468581
51576 468581 461806 455757 450777 446150 441008 435333 429756 424655 419841 415122 410732 406912 403356 399578
$$ packed form
51681C54393N124N179M890M822N138O022P483Q871R366R036Q672Q638Q669Q576
51667D54879Q272P245N254L597M170O647Q127O590L390J178M58j05r27j070n06
51652E07199o70k279m153m924m592l708k272n20K58q40k661l157k028q82p29p05
51636D73337K32J524J883J206O22R10J753K418K440J637L41k93Q32L235N065N411
51620E02553N494O524P356N833K244m55m30O64J99j831l244k931j895j171m43
51605E18467P77J935K331K305K660L381L788L626L285L063K831K384J639M65j189
51590E51748k976m298m842m714m207l846m415o299q633r749q921p258o396o613
51576D68581o775o049m980m627n142n675n577n101m814m719m390l820l556l778
$$ plain form
51562 399578 395783 392810 390921 389054 385798 380991 375860 371681 368833 367237 366996 368093 369764 370725 370078
51547 370078 367848 364855 362218 360640 359885 359163 358273 357840 358089 358092 357114 356091 356469 357818 358207 357187 356755
51530 356755 358538 361506 363746 365302 367628 371017 374422 377548 381308 385957 390520 394566 399080 404754
51516 404754 410648 415457 419241 422966 427002 430930 434282 436749 438145 438872 439878 441481 442760 442731 441455
51501 441455 439271 435842 431029 425962 421872 418260 413816 408904 405564 404849 405697 406799 408152 410172 412633
51486 412633 415308 418606 422618 426453 429447 432339 436361 441870 448597 456392 464620 471571 475895 478272
51472 478272 480411 482600 483581 482802 481354 480412 479991 479763 480032 481203 482963 484619 485665 485645 484157 481679
51456 481679 479796 479929 482086 485360 489222 493654 498316 502337 505001 506216 506334 505831 505084 504114 502536
$$ packed form
51562C99578l795k973j889j867l256m807n131m179k848j596k41J097J671R61o47
51547C70078k230k993k637j578p55p22q90m33K49Lr78j023L78J349L89j020m32
51530C56755J783K968K240J556K326L389L405L126L760M649M563M046M514N674
51516D04754N894M809L784L725M036L928L352K467J396P27J006J603J279k9j276
51501D41455k184l429m813n067m090l612m444m912l340p15Q48J102J353K020K461
51486D12633K675L298M012L835K994K892M022N509O727P795Q228O951M324K377
51472D78272K139K189R81p79j448r42m21k28K69J171J760J656J046k0j488k478
51456D81679j883J33K157L274L862M432M662M021K664J215J18n03p47r70j578
$$ plain form
51441 502536 499958 496410 492283 488014 483962 480262 476580 472371 467625 463027 459032 455151 450627 445536
51427 445536 440664 436463 432627 428688 424661 421187 419359 420085 423134 426974 430081 432270 434267 436230
51413 436230 437529 438010 438691 440895 445131 450965 457455 463478 468130 471361 474196 478239 484837 494253 505260
51398 505260 515842 524913 533166 541669 550036 556922 562085 566717 571561 575965 579311 582200 585421 588597
51384 588597 590704 591296 590496 588416 585527 583148 582556 583711 585387 586403 586394 585864 585952 587529 589989 591577
51368 591577 591491 590910 591206 592132 592781 593328 594287 594886 594033 592554 592454 593733 593773 590415 584221 577206 570714
51351 570714 565106 560134 554886 548488 541456 535218 529899 524122 517766 513094 511743 512015 510920 507895
51337 507895 504638 501981 499075 495554 492504 490779 489857 488973 488287 488296 488899 489585 489971 489833 489061 487883 486676
$$ packed form
51441E02536k578l548m127m269m052l700l682m209m746m598l995l881m524n091
51427D45536m872m201l836l939m027l474j828P26L049L840L107K189J997J963
51413D36230J299M81O81K204M236N834O490O023M652L231K835M043O598R416J1007
51398E05260J0582R071Q253Q503Q367O886N163M632M844M404L346K889L221L176
51384E88597K107N92q00k080k889k379n92J155J676J016rn30Q8J577K460J588
51368E91577q6n81K96R26O49N47R59N99q53j479j00J279M0l358o194p015o492
51351E70714n608m972n248o398p032o238n319n777o356m672j351K72j095l025
51337E07895l257k657k906l521l050j725r22q84o86RO03O86L86j38p72j178j207
$$ plain form
51320 486676 485499 484252 483187 482601 482003 480339 477195 473107 468507 463061 456387 448779 440782 432437 423281
51305 423281 412876 401243 389173 378108 369105 361729 354516 346811 339599 334132 330247 326592 322202
51292 322202 317248 312313 307472 302358 297090 292835 291046 291849 293407 293394 291139 287977 285532 284172 283193
51277 283193 281856 279850 277127 273816 270306 267151 264758 263023 261276 258934 256511 255583 257195 260536
51263 260536 263732 265744 266796 267276 267310 267413 268274 269554 270013 269428 269375 271492 275851 281744 288840 296394
51247 296394 302363 305100 305755 307465 312010 318366 324606 329891 334196 337320 339082 339893 340419 340969 341472
51232 341472 341672 341048 339040 335766 332098 328659 325027 320300 314115 306885 299368 292323 286220 280929 275889
51217 275889 270852 266248 262554 259699 257417 255754 254724 253744 252027 249443 246480 243480 240540 238199
$$ packed form
51320D86676j177j247j065n86n98j664l144m088m600n446o674p608p997q345r156
51305D23281j0405j1633j2070j1065r003p376p213p705p212n467l885l655m390
51292C22202m954m935m841n114n268m255j789Q03J558j3k255l162k445j360r79
51277B83193j337k006k723l311l510l155k393j735j747k342k423r28J612L341
51263B60536L196K012J052M80L4J03Q61J280M59n85n3K117M359N893P096P554
51247B96394N969K737O55J710M545O356O240N285M305L124J762Q11N26N50N03
51232C41472K00o24k008l274l668l439l632m727o185p230p517p045o103n291n040
51217B75889n037m604l694k855k282j663j030r80j717k584k963l000k940k341
$$ plain form
51203 238199 237420 238437 240005 240318 238658 235808 232910 230256 227365 224089 221289 220182 221064 222933 224502
51188 224502 225233 225181 224164 221774 218286 214947 212997 212638 213200 213966 214619 215266 216458 218872 222360 225520
51172 225520 226890 226653 226403 227154 228337 229198 230243 232362 234987 236326 235544 233754 232556 232280 232088 231186
51156 231186 229475 227569 226705 228065 231353 234333 234746 232803 231014 231350 233410 235722 237923 240679 243964
51141 243964 246707 248359 249720 251505 252771 251762 248313 244535 242824 243654 245486 246281 244694 240462 234495
51126 234495 228637 224626 222974 222991 223760 224769 225834 226995 228456 229912 230045 227602 223210 219117 216568
51111 216568 214464 211495 208583 207747 209026 210167 209472 207459 205321 203277 201310 200298 201076 203005 204734
51096 204734 205982 207325 208382 207742 205140 202564 202257 204192 206361 207214 206903 206133 204782 202289 198925
$$ packed form
51203B38199p79J017J568L13j660k850k898k654k891l276k800j107Q82J869J569
51188B24502P31n2j017k390l488l339j950l59N62P66O53O47J192K414L488L160
51172B25520J370k37k50P51J183Q61J045K119K625J339p82j790j198k76j92r02
51156B31186j711j906q64J360L288K980M13j943j789L36K060K312K201K756L285
51141B43964K743J652J361J785J266j009l449l778j711Q30J832P95j587m232n967
51126B34495n858m011j652J7P69J009J065J161J461J456J33k443m392m093k549
51111B16568k104k969k912q36J279J141o95k013k138k044j967j012P78J929J729
51096B04734J248J343J057o40k602k576l07J935K169Q53l11p70j351k493l364
$$ plain form
51081 198925 195877 193964 192828 191610 190012 188345 186871 185623 184771 184576 184928 185355 185634 185870 185949 185497
51065 185497 184757 184899 186860 190203 193649 196475 198862 201159 203473 205891 208424 210666 212148 213154 214641
51050 214641 217107 220010 222430 223840 224105 223311 222041 221364 222062 224035 226731 229803 232965 235528 236704
51035 236704 236394 235348 234450 234053 233936 233722 233298 232914 232840 232967 233041 233267 234224 235896 237258 237364 236491 235695
51017 235695 235411 235174 234739 234756 236060 238649 241683 244256 245977 246938 247328 247090 246112 244771 244000 244462 245820
51000 245820 247274 248595 250025 251300 251610 250776 249680 249130 248941 248706 248822 249922 251675 253005 253366 253032
50984 253032 252217 250889 249699 250172 253299 258368 263675 268050 271300 273617 275315 276984 279157 281613 283525
50969 283525 284558 285447 287243 290282 294193 298648 303566 308587 312849 315625 317100 318152 319331 320375
$$ packed form
51081A98925l048j913j136j218j598j667j474j248q52j95L52M27K79K36P9m52
51065A85497p40J42J961L343L446K826K387K297K314K418K533K242J482J006J487
51050B14641K466K903K420J410K65p94j270o77O98J973K696L072L162K563J176
51035B36704l10j046q98l97j17k14m24l84p4J27P4K26R57J672J362J06q73p96
51017B35695k84k37m35J7J304K589L034K573J721R61L90k38r78j341p71M62J358
51000B45820J454J321J430J275L10q34j096n50j89k35J16J100J753J330L61l34
50984B53032q15j328j190M73L127N069N307M375L250K317J698J669K173K456J912
50969B83525J033Q89J796L039L911M455M918N021M262K776J475J052J179J044
$$ [...]
##END NTUPLES=NMR SPECTRUM
##END=
