
##TITLE=AC1206_HPAAH12049_7154822_nrlYb0oDl9
##JCAMPDX= 6.0         $$ Bruker NMR JCAMP-DX V2.0
##DATA TYPE= NMR SPECTRUM
##DATA CLASS= NTUPLES
##ORIGIN= BRUKER
##OWNER= Administrator
$$ 1.72 TOPSPIN		Version 2.1
$$ 2012-12-01 02:39:03.637 -0500  Administrator@X
$$ Compression mode = diff/dup
##.OBSERVE FREQUENCY= 400.02188249412
##.OBSERVE NUCLEUS= ^1H
##.ACQUISITION MODE= SIMULTANEOUS (DQD)
##.ACQUISITION SCHEME= undefined
##.AVERAGES= 8
##.DIGITISER RES= 22
##SPECTROMETER/DATA SYSTEM= spect
##.PULSE SEQUENCE= zg30
##.SOLVENT NAME= COFFEE_meoh
##.SHIFT REFERENCE= INTERNAL, COFFEE_meoh, 1, 14.98509
##AUDIT TRAIL= $$ (NUMBER, WHEN, WHO, WHERE, PROCESS, VERSION, WHAT)
$$ ##TITLE= Audit trail, TOPSPIN		Version 2.1
$$ ##JCAMPDX= 5.01
$$ ##ORIGIN= Bruker BioSpin GmbH
$$ ##OWNER= Administrator
$$ $$ E:\/data/COFFEE/nmr/AC1206_HPAAH12049_7154822_nrlYb0oDl9/10/pdata/1/auditp.txt
$$ ##AUDIT TRAIL=  $$ (NUMBER, WHEN, WHO, WHERE, PROCESS, VERSION, WHAT)
(   1,<2012-12-01 02:38:53.247 -0500>,<Administrator>,<X>,<go>,<TOPSPIN 2.1>,
      <created by zg
	started at 2012-12-01 02:37:47.262 -0500,
	POWCHK enabled, PULCHK disabled,
       configuration hash MD5:
       86 BA 57 50 F2 9D 5C 9B 26 00 A9 28 5F 66 2E 89
       data hash MD5: 64K
       D6 BF 59 03 40 A0 2D 56 D5 C0 6F 67 A0 5F A5 15>)
(   2,<2012-12-01 02:38:56.872 -0500>,<Administrator>,<X>,<proc1d>,<TOPSPIN 2.1>,
      <Start of raw data processing
       efp LB = 0 FT_mod = 6 PKNL = 1 PHC0 = 0 PHC1 = 0 SI = 32K 
       data hash MD5: 32K
       92 BE D3 5D 1D 3B 48 29 8D 8A EA AD 18 C3 C1 E0>)
(   3,<2012-12-01 02:38:57.512 -0500>,<Administrator>,<X>,<proc1d>,<TOPSPIN 2.1>,
      <pk PHC0 = 97.03125 PHC1 = 0 
       data hash MD5: 32K
       9B C1 FC F6 3B 19 ED D5 BB FC 3E BD D5 67 D2 39>)
(   4,<2012-12-01 02:38:57.887 -0500>,<Administrator>,<X>,<proc1d>,<TOPSPIN 2.1>,
      <abs ABSG = 1 
       data hash MD5: 32K
       D0 4C F0 F6 E2 C1 2C F1 EF D3 46 01 85 83 C7 3A>)
(   5,<2012-12-01 02:38:58.153 -0500>,<Administrator>,<X>,<proc1d>,<TOPSPIN 2.1>,
      <abs ABSG = 2 
       data hash MD5: 32K
       4E 5E 4E 25 0E 94 CA 82 F6 88 59 EB E7 A1 8A 57>)
(   6,<2012-12-01 02:38:58.356 -0500>,<Administrator>,<X>,<proc1d>,<TOPSPIN 2.1>,
      <abs ABSG = 3 
       data hash MD5: 32K
       17 80 7D F5 2F AC C2 4E E8 9D 42 B6 0C B1 05 A9>)
(   7,<2012-12-01 02:38:58.575 -0500>,<Administrator>,<X>,<proc1d>,<TOPSPIN 2.1>,
      <abs ABSG = 4 
       data hash MD5: 32K
       BB A7 1A 9B DC EB B6 FF 52 49 BE 1B 24 5B FE A4>)
(   8,<2012-12-01 02:38:58.778 -0500>,<Administrator>,<X>,<proc1d>,<TOPSPIN 2.1>,
      <abs ABSG = 5 
       data hash MD5: 32K
       88 00 FF 80 F3 96 16 A3 98 55 64 2A 49 4C 9C FF>)
$$ ##END=
$$ 
$$ $$ hash MD5
$$ $$ EC 29 09 55 6B DF BC 87 E0 1C F3 12 CB CA B1 F3
##$RELAX= 
##$RELAX= 
##$RELAX= 
##$RELAX= 
##$RELAX= 
##$RELAX= 
##$RELAX= 
$$ Bruker specific parameters
$$ --------------------------
##$DU= <E:\>
##$EXPNO= 10
##$NAME= <AC1206_HPAAH12049_7154822_nrlYb0oDl9>
$$ [...]
150 150 150 150 150 150 150 150
##$TP07= 0
##$TPNAME0= <>
##$TPNAME1= <>
##$TPNAME2= <>
##$TPNAME3= <>
##$TPNAME4= <>
##$TPNAME5= <>
##$TPNAME6= <>
##$TPNAME7= <>
##$TPOAL= (0..7)
0.5 0.5 0.5 0.5 0.5 0.5 0.5 0.5
##$TPOFFS= (0..7)
0 0 0 0 0 0 0 0
##$TUNHIN= 0
##$TUNHOUT= 0
##$TUNXOUT= 0
##$USERA1= <user>
##$USERA2= <user>
##$USERA3= <user>
##$USERA4= <user>
##$USERA5= <user>
##$V9= 5
##$VALIST= <valist>
##$VCLIST= <CCCCCCCCCCCCCCC>
##$VD= 0
##$VDLIST= <DDDDDDDDDDDDDDD>
##$VPLIST= <PPPPPPPPPPPPPPP>
##$VTLIST= <TTTTTTTTTTTTTTT>
##$WBST= 1024
##$WBSW= 4
##$XGAIN= (0..3)
0 0 0 0
##$XL= 0
##$YL= 0
##$YMAX_a= 673865
##$YMIN_a= -572370
##$ZGOPTNS= <>
##$ZL1= 120
##$ZL2= 120
##$ZL3= 120
##$ZL4= 120
##$ABSF1= 14.98509
##$ABSF2= -5.573092
##$ABSG= 5
##$ABSL= 3
##$ALPHA= 0
##$AQORDER= 0
##$ASSFAC= 0
##$ASSFACI= 0
##$ASSFACX= 0
##$ASSWID= 0
##$AUNMP= <proc_prof1d_extract_pilot.lims>
##$AXLEFT= 0
##$AXNAME= <>
##$AXNUC= <1H>
##$AXRIGHT= 0
##$AXTYPE= 0
##$AXUNIT= <>
##$AZFE= 0.1
##$AZFW= 0.1
##$BCFW= 0
##$BC_mod= 0
##$BYTORDP= 0
##$COROFFS= 0
##$CY= 15
##$DATMOD= 1
##$DC= 0
##$DFILT= <>
##$DTYPP= 0
##$F1P= 0
##$F2P= 0
##$FCOR= 0.5
##$FTSIZE= 32768
##$FT_mod= 6
##$GAMMA= 0
##$GB= 0
##$INTBC= 1
##$INTSCL= 1
##$ISEN= 128
##$LB= 0
##$LEV0= 0
##$LPBIN= 0
##$MAXI= 10000
##$MC2= 0
##$MEAN= 0
##$ME_mod= 0
##$MI= 0
##$NCOEF= 0
##$NC_proc= -8
##$NLEV= 6
##$NOISF1= 0
##$NOISF2= 0
##$NSP= 0
##$NTH_PI= 0
##$NZP= 0
##$OFFSET= 14.98509
##$PC= 1
##$PHC0= 97.03125
##$PHC1= 0
##$PH_mod= 1
##$PKNL= yes
##$PPARMOD= 0
##$PPDIAG= 0
##$PPIPTYP= 0
##$PPMPNUM= 2147483647
##$PPRESOL= 1
##$PSCAL= 4
##$PSIGN= 0
##$PYNMP= <proc.py>
##$REVERSE= no
##$SF= 400.02
##$SI= 32768
##$SIGF1= 0
##$SIGF2= 0
##$SINO= 400
##$SIOLD= 32768
##$SPECTYP= <>
##$SREGLST= <1H.CDCl3>
##$SSB= 0
##$STSI= 32768
##$STSR= 0
##$SW_p= 8223.68421052631
##$SYMM= 0
##$S_DEV= 0
##$TDeff= 65536
##$TDoff= 0
##$TI= <>
##$TILT= no
##$TM1= 0
##$TM2= 0
##$TOPLEV= 0
##$USERP1= <user>
##$USERP2= <user>
##$USERP3= <user>
##$USERP4= <user>
##$USERP5= <user>
##$WDW= 1
##$XDIM= 32768
##$YMAX_p= 472774586
##$YMIN_p= -747025
##$CURPLOT= <Network HP LaserJet P1505>
##$CURPRIN= <$Network HP LaserJet P1505>
##$DFORMAT= <normdp>
##$LAYOUT= <+/1D_H.xwp>
##$LFORMAT= <normlp>
##$PFORMAT= <normpl>
##$SURQMSG= 1
$$ End of Bruker specific parameters
$$ ---------------------------------
##NTUPLES= NMR SPECTRUM
##VAR_NAME=  FREQUENCY,     SPECTRUM/REAL,   SPECTRUM/IMAG
##SYMBOL=    X,             R,               I
##VAR_TYPE=  INDEPENDENT,   DEPENDENT,       DEPENDENT
##VAR_FORM=  AFFN,          ASDF,            ASDF
##VAR_DIM=   32768,         32768,           32768
##UNITS=     HZ,            ARBITRARY UNITS, ARBITRARY UNITS
##FACTOR=    0.250966925370066, 1,           1
##FIRST=     8223.43324360094, -202190,      -36750
##LAST=      0,             -76666,          -308770
##MIN=       0,             -747025,         0
##MAX=       8223.43324360094, 472774586,    0
$$ Real data points
##PAGE= N=1
##DATA TABLE= (X++(R..R)), XYDATA
$$ [...]
23838 25887 237323 270650 -22016 -73327 245177 260624 218898 41363 331674 -159402 -13021
23826 -98020 -9666 -266270 -260543 -297390 25452 95346 118797 -90776 -41854 67270 -157778 -168933
23814 -168933 63723 27659 55111 -15354 122207 -89535 -66876 337496 -197134 32644 -110379
23802 -271111 2906 -228505 167768 -138441 -123938 187705 -177947 157661 23520 -40450
23791 24649 -65461 80818 -84170 -10635 -120372 -47078 -46925 -321302 3796 141033 160241 -163705
23778 -133973 26847 -14191 124098 28737 -250654 11834 -18712 259592 292909 -176547 -212704
23767 -212704 -202237 -284684 273028 437296 -29302 317220 80754 -47299 -275849 209951
23756 815 41277 -23329 138562 54584 -353548 -479310 29078 67825 -115608 171802 -59135
23744 434857 -365578 222663 -259384 -47845 154013 130767 197661 -369539 -216322 -306895
23734 -306895 99465 -56299 -78872 217966 406834 3652 -169377 -123197 48279 487452 -44475
23722 -155826 54173 66872 130148 -120630 -129337 82661 -236061 -502979 -29379 -191311 -254658
23711 -254658 68130 9826 80579 -42481 -189026 -123726 -128571 -113621 -396 -50401 -63700 153250
23698 140198 203005 41182 -36720 -97050 33604 36763 -296179 -48023 171713 -128093 -106118
23687 -106118 -69839 -253459 11566 -292767 -51793 39409 338565 -161538 101409 -112618
23676 -218144 44286 -16315 13810 -218882 98467 -260897 -52005 -158235 80141 54041 23227
23664 146910 85923 -408290 -80860 -23329 159638 259726 65723 -11479 -127972 41503 -14503
23652 47605 -25173 -68052 -55463 -57103 -61098 -217703 -97413 -172739 224194 76394 -141647
23640 -72437 196423 -120463 294222 71756 -228301 6375 -324319 129342 149212 159991 246587
23629 246587 232032 -112032 -188710 133584 160345 172232 -319639 -50357 216544 32010 -73061
23617 58231 -301589 138921 -37597 26110 -205129 163493 -18683 -30378 76343 195528 -114179
23605 283053 -53201 156748 4699 -11998 169822 -11244 145195 -24989 -2552 3487 -242520
23593 -330868 81713 63339 -107589 210556 149814 -21511 190749 79481 160408 -219993 201271
23581 22637 201949 13786 -105735 54039 32457 39418 -176489 24727 29057 190772 -145921
23569 -73812 49961 -57785 379560 -131896 -74301 -189282 -159533 -34828 -145260 -257696 -243110
23558 -243110 -317808 -379193 203266 -160256 115191 59131 -17318 160077 123866 -59526 -89732
23547 -89732 -195141 182308 52876 -199804 289314 -244121 19022 94072 96588 -211447 297757
23535 88393 54265 -59786 -32117 -270888 235517 65126 1492 189785 -148423 119382 -59289
23523 185817 160895 27488 -112550 58341 179768 -229741 -250893 -138986 -249171 17069
23512 -41912 -15266 -423589 -346210 134971 -147951 -201756 200740 -286 43812 39226 285813
23501 285813 -196962 158764 -59636 125523 -138485 -197778 -110321 150022 -32454 -114233
23491 -114233 -52190 -51040 -161583 -143281 33022 -305262 -171617 210565 93540 -466196 -92198
23479 4577 -126559 19556 -23020 38726 250709 40420 29310 97642 135693 -39390 21334
23467 -163386 -194157 -49918 60004 -222031 248052 52046 -304981 -81923 -127582 198735 300597
23456 300597 135205 -65622 -231463 116654 -236021 33755 157735 -138800 -37419 -161601
23446 -161601 -239777 -336019 9395 -129439 -48355 -301648 -12507 -225094 -15471 -75930 -49915
23435 -49915 -474625 93208 -236765 -77476 -254558 -105701 -27384 180622 85635 -152569
23424 -135423 -77183 -47781 51769 -182186 11516 -200956 187848 59372 -61225 -206261 4038
23412 34923 149072 228127 14433 -24903 79190 -181577 -66702 -57935 224766 -32416 -180909
23401 -180909 -162654 209487 -183310 -64487 58058 72352 192897 172903 -238065 126001
23390 95965 -25903 95277 93687 -45010 -171119 48370 -8680 410808 -354758 -114061 36062
23378 95808 92037 -150476 -320826 -184465 -63906 -194079 -148909 -120587 335955 -122572 -26505
23366 103430 -259195 109488 -108815 -162278 -321779 -131316 125850 5840 -67162 53325
23355 23393 -231996 101411 73708 -178577 -69407 11518 -118464 -122105 20360 -181578 -62338
23343 -348381 -3281 69711 58769 29301 28042 205154 35670 -705631 204715 136977 432723
23332 432723 -93120 -80681 -244916 -85929 -175084 362617 13064 -13796 -531394 295616 23547
23320 -128064 -176224 -258239 13574 -98277 -35062 -70345 -100264 -349345 2588 -120893 -300359
23309 -300359 44279 -47213 -227916 -341954 138642 -137720 53839 -33060 -48537 -1672 208408
23297 80503 -288840 6782 -215719 -180803 284496 -130446 -22088 -327070 -221323 -244083 74442
23285 -183001 279575 407354 218773 75120 -217176 -288304 -241588 -105652 -134978 -339712
23275 -339712 -105676 -197722 14311 -200820 63678 138899 -38599 88546 176531 149372 194575
23264 194575 -108600 102880 47700 -243485 -87585 -283013 215465 154501 279117 -159535
23253 115775 -187520 104027 58963 -151671 -197580 -102191 278924 -166957 8255 32492 -457658
23241 -18790 85101 109150 57750 -141174 -179124 169417 14239 46549 -73360 -51631 121758
23229 -284668 -341681 67989 -14907 154009 -109899 384799 120490 162699 -63742 279016
23218 -407379 89897 -238373 -302753 52603 -40774 140134 -119878 -42486 170449 -168051
23207 123368 54639 90194 362945 -86468 -51811 68551 131333 -326773 19807 33433 -258237
23195 119228 91201 80476 -272885 -97046 68863 -155556 -37558 122973 255299 -181778
23184 -180557 91908 203463 111096 96272 35739 235122 106030 -398930 -55917 -117566 192887
23172 216308 112447 44937 -104804 -335101 90049 -144950 -444311 105198 -23201 -85234
23162 -85234 -83509 -269362 -59259 -78619 69451 -4045 92127 -93273 223190 -74585 -10822 -255679
23150 -255679 42705 8985 -285563 -194333 184699 163735 -142721 306190 -167462 -281851
23140 -281851 178125 495773 23135 210904 -340198 -180036 66487 -204331 -3740 182708
23129 -190840 28645 -93493 115306 175203 242408 262532 -7835 -102161 -294894 -56184 -229591
23118 -229591 -226866 -39599 203197 -216639 288070 -187068 249976 -143974 237098 16499
23107 -72386 -48698 98292 188806 45945 -91699 233068 9668 -227664 -65298 52065 -177725
23095 -83661 121060 -153 -77199 64546 89099 -28290 106189 -27062 419004 341817 302855
23084 302855 117261 -135543 -5280 82675 -29595 -186310 85618 -307740 -326755 -16325 -292832
23073 -292832 117950 240517 -266158 20976 99680 214417 180932 291175 -164936 -61569
23062 -52034 378660 -4693 123001 -46428 -55664 -336324 238291 -141629 93977 312290 111568
23050 -166869 -242814 274852 269614 173193 -13548 -185999 -276917 83680 -127300 86733 239439
23039 239439 -310644 322966 -63233 -185455 167347 137077 248407 -183911 -84148 -248091
23029 -248091 163409 -364976 17131 55452 67574 -257845 -160147 -419659 87162 -170869
23018 -243571 39138 36923 -344689 -116871 240094 -171122 -186006 -318856 -298961 -251079 -82295
23006 2928 -55712 -159526 -173459 -265902 -215914 -40406 4073 210360 45785 -39231 -130172 83732
22993 -111265 -64909 27807 -94476 22982 137155 61652 -274696 32542 -7223 -259711 -31727
22981 -85039 -313297 -31827 198765 -138694 -99537 81981 345395 40635 37692 130173 -108525
22969 223978 108785 110571 61415 -112888 46142 119491 -103986 99108 468134 -104862 91148
22957 -254112 -159042 22928 -22823 96095 7777 -221666 -72259 141584 287602 -32569 200941
22945 -79793 -188804 65765 -191430 -354279 332982 -50750 113742 270699 -202043 22933
22934 224226 307762 19626 34851 -150239 102174 38418 -198188 246756 -230630 40844
22923 -115827 -297355 199678 -53057 -226410 -28845 143718 58967 -52692 213704 -152958
22912 239744 60652 -268594 74360 -8285 39989 -160490 -299036 -331846 -294724 -111826 123061
22900 48159 245757 67189 59289 -6232 -239067 55297 -61181 -137644 -355914 -6104 43819 228973
22888 228973 -187776 312438 3009 49891 -159072 38591 41654 -261951 91114 -147378 17532
22876 -96021 -34197 15796 -205884 266638 187669 -143309 -63009 -9832 203331 -54687 125074
22864 -195922 -137638 -96766 -67194 -154304 122439 -185591 -459744 -135144 -167477 -297040
22854 -297040 -383575 -84022 -360641 -308037 -127619 121494 -30908 32594 52247 290324 233936
22843 233936 -240302 -55268 -140447 -34994 397868 -86183 59125 99104 -18425 135134 293260
22832 293260 -404453 -52087 47985 -118303 46575 -317796 -76604 142316 127535 33577 -8877
22820 -281935 -133065 -205177 24369 25082 382051 -95823 -18512 -397987 87854 -344182 -331561
22809 -331561 -43682 -71748 -94665 -10224 -31547 33856 -203434 -7890 -458784 -312278 -205618
22798 -205618 440579 289176 -131351 12106 -221537 -121781 -78328 -212838 -217585 -60323 372695
22786 -186100 -134193 -256932 2233 106397 -112695 88041 -264565 139289 -218463 -35201
22775 84217 -225762 -33425 72077 -157264 -56232 65114 -67795 -130811 51764 170064 -155261
22763 380329 -6236 366271 85141 95112 -183233 -14671 -101197 142572 -2714 -134666 77520
22751 407246 112120 -222866 -146133 -63240 145857 95537 -91394 502712 -122508 -227006
22741 -227006 -299771 -45529 -114204 96272 17228 -19095 -37550 203676 206746 132229 26088
22729 -274655 219045 -226717 -63867 17830 47666 -9869 -343367 294221 131146 -36857 -83632
22718 -83632 167656 74071 -135764 -136258 -45043 166789 121092 -208754 -177827 -57914 -43 -51306
22706 -51306 56478 -287579 51934 -61697 277567 -94068 -236291 -150963 -254475 81693 -47569
22694 -20800 -194290 -49348 294726 154492 -52734 -13937 473 -124970 -154670 -136706 -386108
22683 -386108 -175713 -159543 57556 -176499 -441553 -53080 44810 -154716 -64305 -132487 14944
22671 96030 -313699 -388984 127887 -149139 102563 58334 -141505 40695 234130 -4317 9632
22659 196671 141555 32839 -149600 -1792 -172527 21324 184440 -113601 -153208 -154784 114121
22647 -229772 -50149 -254674 -1913 -43990 57592 -119519 -88433 -141519 -339427 -193610 -48874
22635 -281137 74873 -181233 73613 230375 -48414 -90062 172655 -143933 -38972 -80355 124113
22623 -161264 204114 -66490 2991 133536 79697 -13449 1207 152031 -36892 -131625 65027
22611 -471900 235970 35973 -76116 113354 -157682 -14644 115618 -212081 -30582 71179
22600 186673 -177167 39944 -21717 -160044 384483 124382 -230532 -34319 156848 -278871
22589 64960 -279008 281546 169970 176792 -360705 -45404 -107735 199034 -5557 -97457 -87756
22578 -87756 -262461 -182307 -12341 -206645 -289164 -79712 247452 252941 -143734 -172961 -129245
22567 -129245 -348045 -205416 17110 53784 -11550 60773 -115168 16556 127031 -94299 199202
22555 212286 329506 44959 73312 68961 -34484 8672 -157171 7562 -225056 -145842 -153016 18473
22542 -42935 128298 85221 71233 102544 -59685 -183740 174113 276379 -254013 51841 88473
22531 88473 37042 -191476 -281685 191722 -140672 417136 11327 -280011 -44390 -18903 98033
22519 82272 111846 -212175 -111156 83386 -157251 -136558 -178190 -135660 -207765 120498 118150
22508 118150 -68997 -330181 -114122 64436 -168919 30643 237946 255620 -290732 73353
22497 37771 -62692 -6439 -58688 -78448 42085 -15721 -127288 -206501 57428 279438 204539
22486 204539 -143079 -105288 10252 -351818 44970 99189 -9550 -108739 -176950 -151514 52884
22474 -117023 -315315 -72109 -156370 -287208 -370774 -139550 122316 -387456 108821 111558
22464 111558 3193 -37388 -174224 -177131 250493 -92445 72277 -256550 -273683 -97827 11723
22452 161007 18326 26097 -72765 55405 205781 -77241 37454 -71842 109224 -26052 -384145
22441 -384145 -285276 -161721 179593 56869 -148114 -100488 -45531 -40204 181431 -51811 22816
22429 6205 -101356 -95500 -39874 21972 -5604 106184 -170742 -252260 142916 -169239 202880
22417 108545 -30555 -36648 114571 113468 14871 -80657 -194831 -300809 169536 -361111 163023
22405 -111965 36001 74541 51112 162617 -114547 92540 111088 43393 117021 19945 -73884
22393 109216 -378420 10499 73894 -216661 122735 225615 492885 69889 155302 167544
22383 167544 -151017 -95139 -9935 326227 -194593 -34324 -180374 112835 150405 201076 -14855
22371 -287969 -217185 -166484 -322681 -372899 156640 -140660 99395 136338 170186 64311 69146
22360 69146 -274575 -16634 124097 211373 -86143 -13602 -144889 162756 -145786 -242827 -189423
22349 -189423 315744 56577 339794 -9158 31582 45590 284250 -100264 -12875 -234542 -178685
22338 -178685 -209572 -42739 75508 161407 -281304 -6797 43894 215165 184597 -140498 -34822
22326 229223 -179842 50631 -112345 -637 155915 75610 199091 272396 -154619 -18701 -384865
22315 -384865 289067 -259149 308956 -229843 -18150 114658 -168059 -28156 97656 -64816
22304 -14760 -116715 -328548 -113551 -185466 -55509 430784 53459 215611 -122962 -50605
22293 -159162 -27685 400092 -126517 1049 -220166 -22259 -61453 25386 -84567 57593 -118425
22281 20460 -181314 -86202 274724 164388 -34704 -219893 146599 -117520 203842 -310711
22270 163262 -94188 -344957 -242370 169247 56608 47496 198567 263281 116413 -214715
22259 8613 -144743 48977 38361 -357438 -60254 45808 -184015 100489 130339 -205221 -206523
22248 -206523 -110784 -49445 -119670 -70228 -238610 156096 63467 121225 -406299 92101 -27826
22236 -228327 -64090 41591 46724 137993 -16852 104158 173688 -310701 78969 34802 334075
22225 334075 -240492 -362874 -71098 -74109 -54215 -271785 16748 -65971 333103 -273333 604
22213 363609 99807 -211451 63038 -239135 -110317 44423 -280297 127153 197065 -203578
22202 59497 507862 -30187 -194565 204 237184 -337936 -65938 205100 145522 -40204 -105771
22191 -105771 -290589 2827 -225570 81203 1316 33123 141368 -216912 203211 16159 28452
22180 28452 -193678 -112159 38117 -277259 -23360 -266473 120093 -78303 -10306 -148555 15677
22168 -20116 -12804 -224714 86387 -2570 -678502 -154194 -426 181367 -218169 130892 306277
22157 306277 -293504 153359 -49563 -2085 -41538 13649 260161 -61727 -435032 11800 -169307
22145 22850 -183524 80752 -227190 92055 -274739 38314 -37268 -357026 -230366 -40965 12753
22133 -75884 -189421 170279 -164204 -181521 -177767 -323394 -353870 49384 -278961 157604 242285
22122 242285 -3391 -195108 -112345 3703 62744 309282 -137776 32176 29294 -158170 -117628
22111 -117628 -107475 157481 53054 -18853 -446097 124314 -218080 -193789 -32530 -63528 77621
22099 -316761 125719 271639 -114972 234995 188488 311104 -256206 -47260 28979 -204256
22088 -45928 104641 -102737 -116052 -78991 -77216 -71679 50315 -53230 336433 -166322 -206633
22077 -206633 -54714 43015 -62671 -99841 50706 -64 73774 -59983 398960 13817 34447 113552
22065 113552 8804 -157989 26962 -54456 -97503 -296389 59372 -104164 213394 107739 38850
22053 -232207 318230 138147 121046 226879 -357696 21942 -77860 -218549 -45954 -345651
22043 -345651 60447 54736 74929 65021 -94317 -92441 -96689 -162479 106749 -137601 -107652 8226
22030 -157874 73022 -179870 179289 -41206 35455 48482 -475931 90961 -64416 231674 173879
22019 173879 -114924 -47734 -7924 41777 26994 20706 73674 211175 51722 29312 -111777
22007 183789 -107076 203108 -93619 -100348 4395 -579465 -179721 176985 -6686 35342 282899
21996 282899 -98991 -204744 -95793 260928 188422 -140004 108481 -248918 188706 30717
21985 -286578 -16712 -21680 -1480 -37700 -27158 12624 30673 -167359 366468 -223409 141593
21973 -9935 8537 -259844 -238109 103933 307607 100822 -633387 -187834 117870 -66894 -443885
21962 -443885 146972 -236963 135294 212403 316033 -40013 -140859 -104737 -39227 116715
21951 -103278 64047 -242226 132608 145508 -57497 -230774 -195074 73780 -239866 95467 144354
21940 144354 -116707 -24083 22911 -339708 -325202 -149289 -25056 -277574 117212 -34379
21929 -214148 296457 -60139 -218864 193934 -84903 -149071 -225930 2362 -340051 -455239 42254
21917 -252291 141494 -591998 28370 -66355 -24287 -447263 -200336 -312725 -29043 860 248628
21906 248628 -7058 -104701 -47885 -404148 -128279 -87974 320286 -185990 5264 -280990 -233323
21895 -233323 103184 145460 -10610 -54246 251600 -46984 -71581 -77439 425870 85338 94215
21884 94215 -772 -75350 -101048 235681 -11467 -185085 15096 243705 -172224 -57011 -61250
21873 -61250 -1039 -215430 34733 -153700 -35404 -81393 384316 -266400 62160 -177857 -28600
21861 -31552 -115528 -189734 -154524 -203887 491678 -220073 -241194 44637 -11402 -51421 -128084
21850 -128084 14620 -201308 140776 -49495 15060 4007 -247282 -91686 -44894 -358959 -83848
21838 -46413 86268 181268 52503 -75366 -192516 -61397 62814 -178113 129988 -32482 -6123
21826 -123980 103519 -134314 -191331 -44526 26026 -254313 -138528 63595 223767 -146307
21815 -296611 448653 -37814 -159286 -35080 -142438 173034 112297 -148467 -156454 205388
21804 -26492 78780 -55105 285922 -76458 34624 -89924 89692 -167599 33963 225023 68929
21792 -93577 -35942 47546 18671 -3406 65310 309717 -116252 1323 -70930 -41886 -436460
21781 -436460 -200218 -187327 -56471 61878 -158310 -169071 -9211 -121203 -6109 -85012 -347941
21770 -347941 -319720 65891 -99501 94394 -154077 52363 108134 223077 65799 -71166 -184839
21759 -184839 268034 -196033 -68745 -43085 -23003 165181 61058 -150422 -325226 255962
21748 -72487 78774 -22434 -106440 282891 -144361 110652 145980 16048 161604 -244897 -344907
21737 -344907 -75621 -4002 -259274 207606 -112172 92985 -14521 339730 -176802 -44529 687917
21725 -231114 -224613 -160862 225551 201297 -73401 -56135 -180510 72008 39797 9396 -111808
21713 145992 -20721 91080 56857 -296534 -199510 -366806 -170202 -54239 -147552 368122 -33447
21701 -126134 -139411 11590 54651 -32304 -278132 -142034 121845 67222 -130545 -87398 -103589
21690 -103589 118362 214370 7286 90922 126076 -133653 -283507 -12172 -227288 71269 -283518
21678 -380179 20402 -229440 -99302 172205 -245851 -86879 -382905 -121521 -209931 -141327
21668 -141327 -190707 -27994 -201856 -40284 -95635 -60627 47849 -461389 -395165 -172051 178423
21656 -178925 -137304 71574 297719 -265207 41237 194814 69223 112982 -75505 -83035 -17960
21644 9431 -14147 -72841 526444 -85843 468925 -30824 -4367 55888 18418 148969 466983
21633 466983 26212 -154757 -177741 177148 57 104431 -23961 -91445 -187268 -244366 -138301
21622 -138301 -18147 60866 -166249 -41736 -207576 171341 -64280 88455 -283297 -196081 133467
21610 132496 -255516 180345 286785 16002 110030 3358 214043 268016 -89834 -48540 -132883
21599 -132883 20927 -48637 -143460 -29446 255450 -80659 -307882 -62894 193249 -244381 274148
21587 46041 -295249 229868 -190221 193735 42783 -93394 -75628 66543 141748 -73100 -22877
21575 -54253 -45225 149094 -217981 86732 97496 -311287 159800 17390 108714 -105034 451554
21563 98072 -113140 -69366 -93650 -230836 -209380 55304 -81720 -42299 -80553 -56998 -936 -182259
21551 -182259 -255580 -98869 54283 -67177 -254474 331022 185908 363470 197608 -226341
21540 -158446 91896 -170977 -173030 -334642 -111448 -354840 171795 -177076 -191977 -494401
21530 -494401 128404 -203874 93561 4166 -72826 -25860 125571 -213663 -24527 96377 84380
21519 84380 -31557 -18679 -200055 -64155 -108993 -329511 -156782 -110159 -346851 148583 -270621
21507 50765 -60998 -71416 -121181 73471 -228695 -6374 -57148 159492 -70472 -159484 24090
21495 20066 -271824 38857 65486 212039 88671 -30315 -12300 13731 57362 -49665 47918
21483 235950 78650 -89045 -472819 -93192 -284891 285440 78444 -59291 134808 63658 60506
21472 60506 36868 -65746 -35500 -282745 -188941 -39274 -10611 -481776 5567 -65774 -275211
21461 -275211 134328 56568 -327469 253404 59698 -42866 55942 -59776 -28303 79864 -83978
21449 -239467 -73733 -121239 -302090 -305421 -1069 208292 264839 -50669 91719 334895 -54099
21437 466465 197273 63941 -35880 398441 -65007 310194 35819 -182109 -16737 -133543
21427 -133543 -23230 281098 -38262 -61203 -157559 95810 -333085 -16538 -267536 -316208 -270336
21416 -270336 164913 -72447 152790 69557 108562 -256354 121353 -18785 -169948 -499311
21406 -499311 -45830 -126098 92063 -55549 -213239 -230264 -188214 262925 195716 99636 -121439
21394 -254440 -284862 -158410 173044 177341 -74103 110713 43841 85908 60521 -101168 -66931
21383 -66931 -48636 -132858 -275903 -520986 -183022 -9353 -67031 -66083 24925 -53159 258929
21371 71957 60177 268154 -109995 90895 -257236 -198532 -94959 -301349 111010 -30246 -231173
21360 -231173 -35673 -231610 -178967 10820 193114 -11435 -354789 -6293 -242967 -49641 40269
21348 -121370 17322 -21033 127564 -23674 -139279 -89983 -46747 -263724 -364996 10370 126275
21337 126275 -158878 -150321 -128646 -255450 25747 170732 29965 -313780 -411243 27401 -192559
21325 32248 240940 3431 26054 -319435 144235 -185192 241539 -40816 289310 -487134
21314 -232182 102263 170818 -111558 -285270 -199577 -220509 -33763 10056 -361649 -354790 -310131
21303 -310131 -230306 74457 55159 -225021 -56881 -71936 -292219 51193 28616 60160 98685
21292 98685 189156 -23830 181755 -258386 -45361 82301 50294 124543 -69060 -239887 -223009
21281 -223009 -364 136963 -432442 36436 -60531 22366 -149400 -48401 317138 8777 107171
21270 107171 -64988 -324100 -211801 -111977 -152084 -121762 190774 -155320 -334752 120175
21259 -177670 -14924 -76665 10175 17416 -219656 -89834 63584 -76946 -244164 -163127 198313
21247 -132897 -125012 -401829 -148828 103114 423747 210582 110454 53781 78059 60578
21237 60578 -26931 35916 -35550 33073 284547 -110297 58441 141175 135357 -221675 267621
21225 197388 218336 -71879 165222 -133130 -80400 -95666 -15593 -51688 120842 145327 -152191
21213 -29814 -85528 -70878 -213987 -110155 -203833 224286 -79515 -61627 -71765 -50582 400490
21201 -198948 -60379 17372 -155397 39609 -107474 -248696 53143 -5306 -156421 9602 228456
21190 228456 -256348 -171485 109995 -170253 -23768 -42502 53650 91590 473817 107757
21179 83586 196535 -254856 77992 70614 -137612 -339162 -131793 151893 119033 -243025
21168 -61959 94711 -82041 45773 -262783 89064 136049 294671 -595112 -17994 -220181 305772
21156 -125113 -232376 -123170 -18753 -482852 -233509 -13890 -244183 -62925 145962 -184753
21145 -239938 -76346 -205541 -265724 -231571 -309391 -95094 -304099 266711 -104340 -117516 -279331
21134 -279331 65502 -291766 89032 259456 -164924 186128 216918 121651 -53814 -61544 25347
21122 -141393 -152989 -191488 2403 58206 -126751 -175780 -332858 -12537 -249627 22782 105875
21111 105875 -365605 -156832 -59493 -394846 124332 96582 -109912 176657 999 -247084
21100 229758 105214 -125400 -270688 -128526 23809 -99725 -330344 -86317 -232125 -11525
21089 -63290 83758 202115 -258218 -125518 228345 18892 -177411 39559 -402287 -127655
21078 -135970 -15930 302960 77344 -77524 -264233 29939 -42127 -65124 -176608 276885 -58993
21066 -143903 122616 -308659 -339294 30268 290971 -215387 -175980 -4658 11047 -41534 -102769
21055 -102769 -45272 -150487 -239003 122446 384089 -274685 -75922 81278 -5062 -158526 49313
21043 -155238 -129294 103545 -110110 -112270 -330782 136931 -217931 -304756 -85439 75548 -166793
21031 -121365 -140880 -124271 110656 88972 -256224 9354 -171506 124816 -104646 -41568 -547819
21020 -547819 349295 -34509 192273 -361430 60453 57256 -134942 33717 -274431 122032
21009 -101625 47089 196 -243201 -71845 201540 -66292 -95873 -22387 280992 -386824 -311244
20998 -311244 153147 -41220 -183579 -110134 39504 -256651 -199752 -23728 60857 -152023 -152711
20987 -152711 -78844 24607 -402983 -81919 72414 -69941 108284 -30383 -140597 -99463 -220149
20976 -220149 -77661 247461 118194 145041 -251799 -103825 136582 -428264 56017 -270792
20965 56380 9100 5016 54961 -252971 62490 -24791 -69571 65236 -201002 -140181 -137510 180558
20952 246839 -211790 -194631 330452 -197144 65079 505499 543815 -69986 -322136 -48330
20941 -74580 -187490 -403736 -158767 -281143 91867 62550 24536 59493 61815 34082 66645
20930 66645 -315788 -62323 124835 38931 62638 82579 -112095 181115 22702 -142316 -382210
20919 -382210 98365 89814 -75365 -57353 -171420 -226308 192461 10165 -284123 455592 143171
20907 237655 -29916 -20726 175091 310585 75220 -247231 -170578 -18180 199612 178211 25404
20895 102709 -65689 39751 -599126 -24951 -68616 177735 61354 -127466 -78964 -185822 -252970
20884 -252970 125614 -100214 -740 20877 1021 -203393 -50971 199803 2824 -111134 201279
20872 57346 -162611 148229 -128142 194706 -42642 174862 -282749 -48092 -98692 221119
20861 -154004 -333688 -170167 207827 -247479 40243 -44353 -180363 -112632 -3869 -58864 102699
20849 -177161 -60513 -197698 356989 93631 -168288 88648 -146545 -228972 130754 -95465
20838 173600 3266 -51644 -1013 -406087 -131720 -236849 14448 327637 -263192 -597574 -81497
20826 -41631 -69779 -132991 137021 -16335 -131441 -289137 25846 134380 -222183 -50798 183316
20814 181797 210664 -596905 -107547 -197955 125583 184689 39172 114059 -95746 -31356 -34640
20803 -34640 -269213 -133983 -281814 3176 -286459 348942 63307 -383404 -331176 -36404 -210108
20792 -210108 -110611 -126437 29980 20433 192489 -16970 4881 11839 -51931 53293 -4503 108721
20779 2954 -231272 148535 214219 -305184 -304356 -20879 27154 -94814 90551 360555 -447639
20767 -174091 34595 -59279 213843 -254990 -199676 -71231 -28563 -173786 -20585 224315 274363
20756 274363 -340703 17459 -78228 -49750 110823 -392105 -28492 24666 -137413 -187800 -373356
20745 -373356 -99418 138959 -170733 -194939 -98205 -234657 -280066 -181267 -112882 899 -112293
20733 -143821 -83489 1632 95525 185944 -32517 -169098 -151206 -408837 -64610 -289819 -3218
20721 -170479 -258146 427108 -58370 128236 -41115 20930 -49558 -101720 -434700 68820 -328158
20709 -44208 34575 -190823 -237973 -68701 200638 -334405 65825 -445644 112209 -187913
20698 18392 179250 -100733 7154 252213 -211024 -214014 162422 78302 -71763 -215788 117983
20686 -118517 -30730 -356760 -236760 8858 -78275 -119338 1704 -8705 5969 -2463 80974 -338761
20673 27295 234080 -86675 -313047 126626 -4328 28436 119824 15625 40067 95564 -43637
20661 -133080 -161140 -170182 -395030 74358 46572 -126374 -26587 -66898 129970 -69246 -23423
20649 -247019 116550 43344 156211 -52346 -52620 -125685 57348 -116041 -69006 58894 61495
20638 61495 -25894 196730 -85489 -301159 -334237 162854 -250540 -105338 123807 57217
20627 290255 -74544 -122819 137028 -34794 -13076 252479 21057 -349903 -185176 109967
20616 -67355 169404 121471 -287567 -157882 -450373 -106213 91885 -325890 -158223 -135342
20606 -135342 -195748 -26681 145847 114154 -280332 98271 142412 -279678 -330018 64393 -70304
20594 30064 173981 76441 -67665 -143409 -123711 -59113 -50629 239545 221362 56183 -122885
20582 -168669 174402 -103231 -4087 -101773 128427 -192969 94904 -135381 132166 140224 -98973
20570 -484951 119454 -16558 -31731 -611 189150 -216257 202134 57291 37351 68839 -171117
20558 -106630 283091 -159617 160293 -253504 -393452 149505 -102942 217339 -47160 -236590
20548 -236590 -373739 -54249 187324 256 -107960 127324 35435 -162618 -56833 -425578 -78725
20536 -143451 -2337 184814 216287 158743 2638 -69340 -170873 -289351 181080 -243328 62348
20524 -148136 176004 107381 -255176 -102933 38233 -72371 -32428 -203978 -104861 103229
20513 -523293 294342 83322 -92428 150834 -4891 129573 -332749 225684 219220 -54024 -56389
20502 -56389 245570 -150379 -47093 87781 -219719 -17998 27484 -135914 -120417 126953 -50914
20490 68558 -139107 -353510 22496 161885 -6551 236139 -53899 -74383 274843 -69568 -265832
20479 -265832 -258456 -460710 -75955 70664 -62529 62159 -66164 -26287 -272680 126170 -113692
20467 -262800 373835 -181407 -23854 350165 177364 -176893 -213524 188480 9476 -35388
20456 -37574 -183426 -199091 205015 239654 140982 50326 -247565 353265 -68900 -8678 -253647
20445 -253647 -134882 -251348 224915 -294862 -174385 186426 -141277 -206571 146797 -101338
20434 -96267 -192106 -450667 -229175 -358201 13626 -113049 463329 27422 -327157 -130988
20423 -62225 -162697 180095 107856 -341243 -5884 44840 144425 58641 107739 133080 10989
20411 4743 -121302 147385 -150435 -133790 -242336 330883 -49161 -168055 177645 -154215
20400 -131790 -261072 -41430 -2392 -183027 -27668 160064 -31321 47341 -157991 216305 -234011
20388 107201 114195 -74775 47157 -114272 -137708 -231105 -73732 131235 35742 128477 -67106
20376 -112450 51170 247179 -116596 -54204 -134731 -38468 366799 -87996 237545 -90916 -266792
20365 -266792 -355337 -139745 143020 -245048 510850 -88366 173790 -203228 237510 -118377
20354 -131132 -203497 177663 78198 4298 231985 -143151 -34229 -256270 -137400 -124946 -59081
20342 -319741 -142435 -192753 77211 -216543 -108470 168371 -95179 135331 31454 -136480
20331 604 -79784 -134248 150720 -91813 68943 394824 104060 236507 -174837 -318625 9529
20319 -222112 -306747 -215804 -53620 73544 285855 -169472 196051 217310 15369 366610 33256
20307 78302 -340372 -5857 -59424 -144927 -96509 20771 -383882 -143074 -116389 -294527 -161974
20296 -161974 -11806 -46553 -277104 -148347 -291128 37955 334748 208287 43483 -11937
20285 1359 -241389 256231 -6831 -157774 -155648 -27318 -16002 -423237 -208171 -82879 -208225
20274 -208225 -183131 -277956 93719 -17897 125698 -342985 120884 -32897 310478 -145905
20263 204329 -150309 -180829 -86231 -132838 -211264 41339 -271655 132871 137267 -12264 -60214
20252 -60214 70717 17308 -292089 -49928 -67573 39935 174624 -80453 -246989 -160637 -120511
20241 -120511 -213058 -6000 -29965 -11235 -81093 -335207 -87687 280079 -154872 -199559 -71817
20229 -305553 -238392 -139932 -100976 -71370 -325219 -54757 -224073 -130354 309347 -86067 122665
20217 -15738 40597 21065 -280109 28575 -264677 -202685 27517 -20376 -208331 -55688 -41478
20206 -41478 201096 -38072 -25591 -454250 225043 -277631 -176460 88382 204057 75199
20195 47743 -24560 -313640 18391 142303 90599 86699 -114816 136619 195993 -70648 65010
20183 -105240 -88544 -208299 62014 -359160 175554 -160496 111747 209526 -200767 127237
20172 -46956 164188 -409519 75062 -102381 -29336 -5692 -277307 -174858 251070 130445
20162 130445 178772 -90062 -95785 -65937 156076 -130043 -67040 -38783 -482478 -179492 33350
20150 -322608 -188005 -78795 -118583 -408160 -123409 -364273 28185 -198648 157511 -88893
20139 -29543 18360 116885 80997 101282 61388 101320 -75803 -170009 -357269 -113642 -302170
20128 -302170 122316 -155944 237621 163082 202675 -217858 67033 47599 -171531 -245231
20118 -245231 89315 72032 50592 -66949 -239030 70649 76170 -72425 -82703 212141 -165140
20106 -175283 -136378 -170700 -28714 24095 12423 212004 -105187 -228625 256828 -195294
20095 212560 30221 61019 -253615 -401075 17191 -156314 -106366 -224782 166861 -3436 -202855
20084 -202855 22604 84883 -205785 -156705 -89502 11091 36679 102392 111938 -335654 -75856
20072 -73377 48832 -121273 196172 155113 -313814 -16579 -176756 -252653 -143159 182469
20061 -73507 -179935 264431 -267467 -256768 151086 -407331 331243 -15324 -60111 255156
20050 188641 -50312 -170482 -84481 -196419 67950 233651 -325274 67122 139947 -10146 -159905
20039 -159905 200723 170433 -14409 -46300 17346 -53160 -110861 62014 -113939 -217213 30786
20027 -260429 32314 158416 -145587 187923 -104673 -252138 -83287 -50402 -144245 213070
20016 -113185 -90464 -227009 75451 243749 -59153 7667 -165383 204143 38795 -101643 95855
20004 -108020 -17550 -91924 27786 21865 32059 93587 119273 125361 -160570 173598 579 144166
19992 144166 109691 -242382 -168663 120291 -102521 -80104 -312347 -153336 -52298 -510218
19982 -510218 206350 -26439 39548 -110316 -14685 102520 106175 180032 -15382 -118001 -89058
19971 -89058 34834 56887 -103770 -49041 44172 -194769 -35710 -593043 -421116 36803 256749
19960 256749 231706 -145029 20316 -149919 -69431 60238 61581 129015 -39943 -245473 -132247
19949 -132247 -402275 24476 -205837 -160247 110404 -155058 -174534 -185713 -57598 -193228
19939 -193228 -185210 165691 103718 109905 107065 44108 -164098 -78577 -16818 -126053 23917
19927 29377 -294821 -145060 -17441 -318649 -332994 -137964 -100900 120407 -12452 -277095
19917 -277095 26859 127168 294302 -108439 267188 -459658 -439007 62125 106570 223831
19907 223831 -18694 136755 -349218 -350848 -101831 159062 -194749 147340 -413922 -62656
19896 210449 -27808 -240425 -43962 -113353 123341 -325478 104114 -73589 -378872 -431947
19886 -431947 -59513 -171914 -33706 -134873 18627 32442 -515447 181199 -264210 -223958
19876 -223958 -46102 -26397 -21518 -369129 -300121 -200306 47378 -137567 27184 -280161 -34748
19864 63450 -318485 -187937 42874 -83310 -86833 -36589 211944 58268 -10567 -267835 -234233
19853 -234233 99403 36229 38156 -325718 67929 -277999 -197721 -302293 -51901 404941 -38123
19841 -365211 -138119 -106289 -152949 -191924 141733 -2864 -226475 136819 11183 116587 -265315
19829 -50206 -115476 -85245 31409 3641 226143 98214 -342976 171797 -102552 18749 178645
19818 178645 -5675 195325 -350932 -236437 45199 -738 41553 140907 -316078 160613 -235907
19806 -65983 -250778 -63116 82587 -274145 -134519 -70804 -235878 -51324 218275 163001 -29221
19794 310935 -301512 -117572 78733 181047 -80121 7247 59083 -59966 -116730 76429 -118378
19782 -246261 116047 130723 -42364 172026 21287 -76234 -95919 -60663 143653 -60344 -164743
19771 -164743 192247 -109346 -87103 75358 115982 -272635 299547 -31511 -3980 16656 -32359
19759 -196626 -237099 -9586 74343 61229 -172767 65024 238594 -48842 153998 225766 -102266
19747 309751 7491 -7198 -76777 60629 26305 284 -138870 299884 -212733 -21364 -29097 105777
19734 -163472 -58997 342664 120874 -309564 285986 110114 -52484 -149904 121432 96917
19724 96917 -400193 -163235 -84759 -32686 -400711 144102 43148 73164 -174427 47779 -136118
19712 133058 -36581 -140827 -43357 -2323 135871 -4987 -38638 66162 -61968 48391 269956
19701 269956 -12747 -165806 160336 87966 34960 -16737 -104478 9058 202788 -302624 185073
19689 -214407 -260265 -171904 84821 -124895 -165970 -146404 -72703 -122947 -9745 -7525 247985
19677 -282428 -89612 -226320 116739 -304284 -141538 189820 -31650 -101566 -164265 70484
19666 -332781 -90457 -432777 -173243 246169 -88097 47567 67004 185412 147542 -326330
19655 198438 143799 -310993 128814 -76264 -321025 99335 -4134 -232678 -69428 -50447 -474177
19644 -474177 -186808 -265014 70244 73805 206572 -102744 -88578 -146955 -42679 -266691 29583
19632 -102619 -25112 299942 -15852 -112942 -135564 -150685 -93093 100726 129489 -8292 -166487
19621 -166487 -163399 -39910 -95377 -183158 -398775 187348 -64730 -35613 -43223 -15041 -257635
19610 -257635 -330308 -58668 -279999 -254160 -271134 -257033 -199626 -249672 -175791 58202 -96057
19598 153701 -59467 217312 -119617 12639 -347402 222978 -7095 -41574 -288183 -11053 -241378
19587 -241378 35130 -279888 -406712 -54768 -378974 19413 -221473 37115 -80563 369831
19576 18901 53192 -212909 -121721 -245142 -22580 -381592 -121222 -15779 -126956 121512
19565 71761 -74861 -251536 -114796 24405 20151 -105446 -77183 -35767 -66597 -331667 259466
19553 26073 -107808 -56436 -91199 21250 -50968 -390011 -19527 -214572 -154512 -271170 -12538
19541 49997 -12705 75411 -6510 62853 117667 -208747 -171473 -168721 -44618 34092 -273953 129661
19528 -165455 -97360 120465 155948 -128980 -81200 -18752 -468019 -204699 -42539 -105295 -215990
19517 -215990 -8586 87882 -459356 -92989 -127956 -376035 137952 -284731 -46313 328306 -18488
19505 -30732 -203296 -261803 -455146 -304970 -5286 20827 -220231 70288 -131307 -74522 -228812
19494 -228812 25491 71488 -89774 -140226 -19018 -80699 64034 -207814 -9716 367672 112465
19482 -39742 -92439 -81835 -140087 -389800 -153271 -191203 41836 -246029 -32352 -291979 -97271
19470 -99519 -84678 -24765 -12784 146802 -224961 106560 -90369 35604 -84789 -62206 -71645
19459 -71645 -100807 57631 -253197 -108285 2636 174030 18141 -164313 3559 -14361 134027
19447 8511 59361 -204421 -229171 -245709 -145979 -203278 -170299 -29345 -267072 10504 175828
19436 175828 68502 139666 -159056 -6522 54641 -151176 -22731 139395 33528 -273693 58872
19424 172560 14323 -412803 120787 -438509 46791 127618 -225891 -160902 -205820 -44232 102289
19412 -2500 -93528 -148203 93264 -110227 72376 -310956 319156 -249870 -215465 -146535 -164460
19401 -164460 -190896 -95709 -232206 -40522 45027 -91172 272283 186004 97524 -157784 -9772
19389 -97166 -86989 -47284 -38370 -203389 6104 -140100 147240 -124023 -100861 26419 141429
19378 141429 -77654 -435736 -31191 -34401 82361 -21945 23438 20625 -354460 168729 -109959
19366 42128 -42159 -287789 -128853 -15698 40409 131211 -260174 128065 -509405 208134
19355 -82387 262907 -287798 -145294 281545 -209941 213546 7678 68928 -27952 -198285
19345 -198285 -297394 -229919 -248630 143995 66203 -259379 50324 -185063 -241061 -167843 -183303
19334 -183303 -97319 -292205 -152953 182797 -138084 -54496 -11458 56088 -163571 -382912
19324 -382912 -41366 -406920 17590 -126074 -157986 43994 -55303 336330 -127720 -37943 -178450
19313 -178450 365271 -181285 101074 -305988 -316954 -100495 -96561 -221680 97721 239661
19303 239661 -64865 -134876 237885 -229313 133616 -388659 108358 -27632 84356 -130673
19292 -151541 325730 112747 78026 -171978 -34280 -239414 -70187 -87555 22436 -117840
19281 53135 -68406 19884 -57325 -316336 12221 -74449 151108 45708 143218 -86378 48540
19269 311299 107086 -114343 287477 119107 -240731 134890 -10687 -284954 71207 -36624
19258 -2357 -176674 151605 -222090 10277 -70832 -80402 -20184 -349741 -213451 -438923 -174096
19246 63172 -244641 522932 -343019 -86087 -342431 -148304 -91264 64870 -3454 31504 -2574
19234 133880 -225324 -139951 101846 54075 -358066 -180448 127104 -4804 46272 -84408 -199733
19223 -199733 -29522 -221348 -164034 145226 -125303 -188549 344197 39276 174442 -182171
19212 -5924 -19832 -401672 -154275 -16148 61743 -96057 -119962 205030 -84450 37737 71623
19201 71623 -1189 -236246 -292247 19108 55851 -413340 -191596 27541 -202732 61820 -37895
19189 25869 95431 132587 -176823 119497 46420 99616 106651 -184904 -29561 163889 -309174
19177 -174312 -72018 30736 -116362 -183466 209949 -160016 19794 144219 113907 -117949
19166 -158493 216632 -21607 -218218 -139711 -123706 66742 -76917 -124605 -89941 -234265 -231813
19155 -231813 -29306 214414 8821 -67712 36440 -116023 -163449 97882 13047 -258040 -81502
19143 45995 132438 89993 -43836 -21680 -39862 -210475 -103596 235916 -179349 -33705 -156845
19132 -156845 233089 -8155 325977 148811 -280178 299295 -272529 -122207 225331 -19752
19121 301220 -141441 -396034 149894 -471792 -80514 136114 -209262 -211106 -273452 -22271
19110 -125430 -27152 -106705 -5278 -88564 51721 -172243 48320 -11429 139903 24902 -85397
19098 -383005 -132605 -5858 60311 -50470 81610 -190348 118008 -69446 86594 269904 326240
19087 326240 -20559 -183765 -113328 156810 -110446 82239 98080 -41871 -117162 -300559 151960
19075 -73297 -51259 -68521 -63978 -259058 49733 -138820 -406829 -20195 140007 258940 -5420
19063 275893 -160875 155435 -120602 227939 -107051 161824 25418 160882 85400 -28375
19052 79975 -360108 -374534 -174645 -374079 -210974 146095 -325445 -21251 -75013 244589
19041 -150022 3079 -91615 160042 -49704 -26350 -152398 -57790 45196 -140543 197607 78085
19029 -44044 16004 146377 -305629 224620 69928 161984 289956 -173747 21213 -77270 150057
19017 -205174 241278 -34230 -91389 -157212 132568 -71548 -16091 212590 10675 -152261 -31256
19005 317732 -311587 361779 -452235 114938 170389 -367100 -24883 -18851 -76617 26081 -243894
18993 -256111 -110876 164309 -218926 -54991 155137 -197418 -97619 -81914 194117 -226 39893
18981 136775 225200 25718 76822 -232285 -170616 -146097 -1558 -332462 160446 3626 -190223
18969 -154506 58174 -254728 98630 -137082 -243723 -180922 128972 161743 181253 -26519 264481
18957 -172639 50745 -31403 135176 75317 -338517 39156 94040 -19104 200800 -92698 -81701
18946 -81701 -251258 -294684 -236862 68487 -310083 -42624 -347050 13935 -347172 -182931 170412
18934 -230535 -3198 -229592 3201 140368 -315266 108223 65970 164556 -187332 -117493 73121
18922 61481 -216760 35961 136829 -92747 -183862 -399576 -159190 152653 -205385 -127048
18912 -127048 -228485 -285536 -350205 -79480 -207452 35009 -100878 -82402 6823 -142283 -61996
18900 226778 91367 99948 123446 -11039 31790 -129789 11744 -298890 -130005 131376 -31360
18888 -8948 64495 46825 -146742 -178666 5829 -2013 -156222 -59632 119972 -117925 -58887
18876 35843 -117008 464200 -131672 -339033 60432 30516 -343107 19823 -60706 -41721 159998
18864 -25235 -30852 218231 114421 -31444 -395162 -28012 -196543 130137 15332 -153715 181915
18852 -89608 248919 -128048 200189 -66068 -36492 -242470 -288319 -7222 238139 152907 54786
18840 -216373 -96055 -67486 -291906 262983 11910 55860 -43801 -32860 26484 -262874 -6762
18828 -83586 -137670 -264407 -425132 91418 -120422 181971 -257268 -14307 -191906 278973
18817 164900 119809 -158672 223651 260196 -295403 29060 -102177 -59001 -8180 209907 79967
18805 325212 5516 -301841 10235 -49331 147669 12798 -7394 16019 37087 59592 266267
18794 266267 -126105 -6256 3818 83554 -277043 -226464 -108534 -133689 74110 -138184 -291311
18783 -291311 307849 -122785 -205415 -191970 264590 63460 66840 -307034 -50914 128048 135474
18772 135474 18668 -23504 26024 -74973 -118668 -155051 100230 42846 -194314 -233716 -77903
18760 -36671 362559 -101060 -82153 86821 -41419 163185 53707 1657 -155686 -289451 -221084
18749 -221084 -118732 183736 -186069 260203 -370442 -88785 -219699 -161989 -174884 -102443
18739 -102443 -201143 -131968 -56672 -133964 6987 -250019 201101 -105195 -101992 117505 -79859
18727 9885 399913 -111213 -13299 -152655 -102965 203413 467948 -153946 115171 -16590
18716 -128559 -36821 -12587 33004 -379732 -2868 -125679 -22223 -126048 -69363 -5493 -340219
18705 -340219 -367817 -147315 -63097 130389 1889 140526 -18677 36814 -244514 1475 -171457
18693 -170617 -227490 49601 92764 16135 -225495 -204362 8113 -94091 -146151 29039 230683
18682 230683 -117797 355222 -68096 144858 120699 107980 66126 -19523 256963 14265 89582
18671 89582 176808 3935 -211531 -68390 -179151 -54094 -137362 -26762 -234857 50135 110296
18660 110296 -168402 -186812 -264823 -5729 254517 171142 -180973 -288498 394168 -183963
18649 -83991 -84938 -276518 -110242 -129450 -128388 -114024 58749 -210093 -406702 -37472 -59255
18638 -59255 -177482 -157981 -167110 -237924 1377 -350638 -80575 -184008 192701 61949 38947
18627 38947 -263859 2120 142822 99819 116138 -508775 -183337 -85025 7580 120032 41502
18615 81571 -234277 -380399 -39165 132208 -140781 19372 -71683 -172363 141218 -114753
18604 -193241 -186164 -5267 -518585 -105126 191986 113192 -15691 30269 446763 47291 132934
18593 132934 -105498 71441 -277705 110681 92356 -66269 -83152 30999 136580 -104756
18582 94747 70167 -333142 -197145 -388361 -288721 -42994 75871 196971 12351 36893 38227
18571 38227 64506 -117386 -36117 -50672 -206182 107744 -284652 -166141 101413 234543
18561 234543 -298875 -175019 -436070 -23405 -39886 -204030 213113 -70636 69186 -214682
18550 -101805 -105334 -99920 -224311 -279188 -95963 -144252 -142839 -2160 -284208 51666 80183 113162
18538 113162 -342913 -62825 36983 -112625 -37529 307460 -323319 -20536 -223844 -270184
18528 -270184 17237 45475 -97785 20031 10902 -133815 -126626 170334 136610 -123802 39677
18516 -49370 76718 41158 -24210 -185061 -86563 222997 97814 -74530 -110886 -4190 -154058
18505 -154058 -18593 -282368 -250087 -349839 -76765 127176 -6977 57111 227958 144 -241287
18493 70263 -440567 2263 -150226 -356500 -250812 -97003 10202 -80327 -319300 55602 174079
18482 174079 74742 -20017 -128207 -199084 -60027 238979 285008 259022 -156578 318184 -205481
18470 51739 91181 -27214 -152653 -231890 -336212 -503985 -92889 -2255 -115968 -169289 -290141
18459 -290141 -186497 223401 -152825 178665 -121669 -120610 41007 -69222 -104658 132290
18448 -34289 40004 -82925 -266719 -107871 12218 330067 -21680 -57276 230845 102806 26707
18436 -99108 -39342 123536 -35746 -484526 -141752 357059 -135830 49762 -1180 53935 37190
18425 37190 150790 -159149 -118746 4998 -83018 62169 -121150 197749 136792 -6594 -168357
18414 -168357 179255 -121212 -151508 -164416 99086 172502 149071 84217 -91970 51097 -10307
18402 222037 184410 93775 -175703 -132134 -473501 -27864 317819 -200078 -22624 143080
18391 -43772 174580 -74238 56181 252610 153995 -51927 13805 -53204 -273035 4720 62991
18380 62991 -328816 -157731 -507463 149655 -118601 -13701 -114449 -62719 46522 -259417
18369 -73011 -56439 -141749 -10436 94509 358265 -172847 -106809 236141 -189012 -153959 138344
18357 -57627 50433 53648 -156778 49077 95066 -242574 -186310 371539 43253 -359146 -159236
18345 155006 -332453 32395 224810 -11225 -119273 14196 191212 -77573 165358 -36620
18334 -58485 421406 55062 -112325 -31866 -338160 -90592 -131037 -161208 11769 -140086 -376707
18323 -376707 73282 -110522 55481 -50089 193050 -12904 425658 -31463 -267271 104546
18312 120128 -227281 -72838 -216050 -52933 1281 -1801 -41539 -168010 102836 -109728 58141
18300 42415 199910 -230623 -52832 -110595 -148449 -239173 -161227 137698 50154 -28710 -79893
18289 -79893 -301126 -126173 -247870 186857 38312 -90299 -85022 80483 -268297 -196496 -221454
18278 -221454 -60148 -35460 169021 306396 115810 -87912 -54719 -110077 37580 89462 103463
18267 103463 730 -64119 244491 -73325 -129712 -147117 -174160 51665 113909 321727 -337332
18255 167849 -99143 -98413 28879 -202222 -84799 -7050 170465 322824 -7211 -185537 270879
18243 -278267 -293512 -114743 -141497 65875 141769 201251 117406 -292657 -35492 239603 45294
18231 15523 -411435 -21539 -210967 -15085 264950 -255250 56672 -33655 22376 -4713 -185514
18220 -185514 102963 -213641 -110529 140609 15883 -132324 -97222 -57115 -65867 -321659
18210 -321659 32251 55515 -235561 -550382 99178 -316260 12364 127697 83297 117527 -369862
18198 96621 48283 -80383 -155016 -213182 -115309 -256615 16119 -53328 82535 -227092 -12666
18186 -38548 -94691 175930 215019 -31245 -52922 -271125 63893 -348380 8860 -189642 -272483
18175 -272483 168312 128621 41561 184226 10291 -135824 -109475 169615 -137490 278081
18164 45728 -201046 -76656 -301025 -53521 77318 -186662 -320788 -118412 183679 -82301
18153 -357821 -139796 42245 390235 -119694 -271539 -80247 273274 -279157 -38455 25602
18142 108842 -262506 109719 -253733 -168143 -75042 21753 -55610 -228627 -37548 -119347 -128482
18131 -128482 -49704 -323085 -30551 103778 55146 -48240 11267 -54417 -43439 876 -141375
18119 -282725 -267080 366738 -829 63717 138267 81200 -164717 95942 84723 -148257 56225
18107 48663 -11744 -32034 91463 93989 70933 138849 -51353 75944 148853 355466 245138
18096 245138 -20235 99305 126014 -68889 254025 -27956 129162 -50994 211125 56992 4923
18084 -208430 -31322 40919 -367925 27364 9491 -14096 -203113 -164458 -48345 940 -30379 273800
18071 -121966 128262 27472 21803 64068 85037 257991 266191 102331 148377 56248 -77326
18059 148070 -170560 -14029 -14887 6486 -6897 36380 -93728 264598 -196506 24327 51275 -218230
18046 135955 -118034 145456 -119899 -11147 16578 86265 174761 112223 -158526 -148398 17030
18034 -128072 217093 -137181 -368440 40092 25842 -195918 -153469 56387 -4673 134137 -194853
18022 -226105 148199 -70551 114619 77702 1797 7399 11443 -244943 160662 -231270 -84091
18010 -44626 254357 -204615 68236 -185301 -269573 126245 -150513 265512 89438 -245963
17999 226296 287811 -54722 -304781 -125656 -32045 107343 -87653 -56385 -71866 31920 28939
17988 28939 38385 -253170 85102 -38287 -335412 239591 65723 145110 -167258 -305572 72193
17976 260082 -223314 186191 103875 -46931 -134203 -284431 67235 25112 424062 329717 -228736
17964 -58071 59578 222846 -7188 -429170 -23241 3598 36289 154734 185304 221175 -90624
17952 16028 -97248 159701 34955 -22806 200737 -131344 -27621 -205329 169825 -75764 -237412
17941 -237412 92117 -187025 -361706 -155184 35544 -14803 41331 -12670 3304 -145063 -160847
17930 -160847 273728 227774 121705 -157432 238858 129604 88512 90909 62604 -87517 -2754
17918 399683 -173084 -137033 96471 -163376 -12529 136132 232636 18801 144159 -23899 -299028
17907 -299028 -114708 -56121 86818 -302615 -40960 64357 238817 -59881 -52640 -206782 -175519
17896 -175519 172975 -84613 1406 261520 -10195 -145767 -2113 23268 293102 -186223 -163295
17885 -163295 51209 -91867 592 196039 134087 157222 -53999 -160729 -246150 -50161 78512
17873 -119731 -5113 -100485 -6383 51459 269587 -51053 -119236 124247 28903 124042 -210803
17861 -131636 -242523 222020 74452 -133281 -113482 262386 70159 30312 -1135 -54718 -299724
17850 -299724 39568 217066 363125 -137857 -126971 -101270 -80597 -185662 130571 -24303
17839 -315928 -35186 -331911 -287464 15708 -307648 180899 -168043 120474 236898 -29778
17828 -250503 -390192 -380405 -27830 -122725 -343541 -232948 -165306 84436 80777 -22586 169422
17816 352863 209490 -280508 -107093 19803 -35298 -96399 -59578 140185 -427921 63342
17805 19531 -161303 -210590 49441 189002 84608 20435 258845 -32879 314001 94940 12372
17793 176499 -73063 -573975 230555 -105670 -33235 60540 -9171 126088 -92472 76586 163168
17782 163168 40070 90339 7527 -37675 -112140 -113383 63816 197044 -327989 -30205 -80350
17771 -80350 197657 5250 141565 60239 -166787 -48899 -83018 32293 -139040 -45563 6273
17759 -48140 58735 -40965 -258305 -353393 -153691 108500 129375 -247399 40375 -2690 -172636
17748 -172636 132805 -77169 -88617 317867 36176 19663 101521 137157 206647 241236 102099
17736 -170791 140962 -35068 -197986 28533 -137661 -75424 188461 189844 28557 166209 259184
17725 259184 -16137 178208 154896 106620 50829 -306251 -69260 249255 66387 -272771 -128526
17713 -125014 -48742 229071 218344 -149389 -42820 339456 -231114 87894 -179984 53487
17702 -93498 92446 -193311 156759 -286356 -95408 94358 147310 102388 -62332 -79258 56750
17690 -10346 44512 -37459 -130322 232457 192013 56639 325837 -318642 -60489 -29965 300839
17678 -188299 -92829 -90960 -184584 385125 238411 250292 105983 48766 42683 -134664 -365247
17667 -365247 55664 354369 -26013 93877 -124872 26443 -26488 -116536 -280430 75529 79917
17656 79917 276169 228268 399678 -45788 279404 227567 27478 212040 -29669 234679 -102470
17644 83184 105899 237431 -30039 61015 83540 -216844 176484 -470392 90951 36040 150476
17633 150476 -15158 170448 -30938 -167430 -104126 126142 -172927 175380 332124 207479
17623 207479 346896 26695 -122421 64433 172038 90829 234896 -128741 147124 97792
17613 97792 -22964 288665 -30002 -89188 -175601 190814 175160 -251821 87946 99705 29358
17601 52675 -319038 162927 354764 -106284 -140677 15561 222372 238427 -191805 -153947
17591 -153947 478636 346875 168174 92457 206718 406867 174788 228695 275697 -265615
17580 -187820 205862 195210 44498 341523 283620 -69801 92787 128482 -115729 -220318 239921
17568 -22929 444485 334851 317761 -13679 206953 223431 -107907 89217 113955 31949 331236
17557 331236 -33628 301317 22509 312477 61441 70692 196445 -205622 -22686 18039 77777
17546 77777 117483 92950 -221827 -157977 -423944 -150776 96492 78155 233406 58098 -49454
17534 -60633 69321 248397 321676 95223 -16541 2909 90059 346618 458746 18822 116876
17523 116876 139465 35734 164529 103152 -98516 178575 210476 233873 60994 192881 185098
17512 185098 220157 77845 -137332 -134049 167865 -147150 22482 -182479 64320 -32108 1009
17500 -103040 75566 409341 -145533 -287771 -85349 296308 -121366 -3476 -22521 229713
17489 -382168 292306 234642 1410 200637 48206 725736 84645 183787 -210216 342385 -170055
17477 124742 -132198 80222 -159882 182245 400242 73020 -26940 -67052 122907 -201436
17466 30865 211460 59837 -47138 155869 51926 -270859 109983 97415 163001 -45671 -45344
17455 -45344 174387 165179 383865 -57986 292081 209963 374771 347121 227305 -190901 384221
17443 377387 330173 84627 142370 11037 -13473 508448 387132 177729 227153 447465 299244
17432 299244 354711 -81134 149438 561529 416428 186793 293289 216868 313049 367506
17422 367506 613647 -37658 153161 53228 282873 157428 100551 53866 136803 219533 20775
17410 138972 102567 161818 443103 250342 17960 40993 -116641 2548 98698 201215 265945
17399 265945 135469 -31039 118874 481167 424550 -167116 273241 94731 74763 91240
17389 91240 261889 80451 243583 -55804 99484 310876 180604 -31344 164772 168539 -22029
17377 183850 116899 -37048 196452 45496 39887 -358083 328523 101583 114055 -169851 173911
17365 179429 -57580 115979 318265 179443 154118 -35504 -16185 107305 -47415 27068 313145
17354 313145 145537 184290 169577 230978 11582 452639 430938 529906 289548 75818 197469
17343 197469 365155 543285 15722 240958 325086 95722 323539 -27492 -452 486775 477635
17332 477635 19218 12015 123579 -63905 -213152 145677 89066 190724 185464 79803 17999
17320 -91051 206431 295245 112102 347646 341649 77602 100789 293016 -83039 -19996 -54291
17309 -54291 334510 195164 229923 154074 107006 328756 -153575 64561 364355 124394
17298 539425 373318 96337 89520 -54880 315967 80275 42311 489721 56961 158699 205091
17287 205091 426601 122958 78284 281837 400110 3453 447031 368106 20625 178631
17277 178631 -74121 440397 148835 66587 164180 122979 153192 334197 335695 271073 -106428
17265 20944 239654 256159 242898 405976 372381 155691 302481 184303 24078 237803
17255 237803 107297 281414 116282 -74410 423984 374429 315131 51751 102610 501114
17245 501114 252302 266190 248665 71233 191489 165662 518842 420758 4866 175860 -137079
17233 48749 -2104 402680 81935 109584 37445 229515 88791 458469 181582 294800 196421
17222 196421 -133813 130757 251525 345249 177730 387277 175067 176678 256450 268957
17212 268957 61326 121962 421719 319862 4222 127875 246801 60629 160199 292075 416339
17201 416339 156978 285117 553015 -115901 84896 395614 262144 125487 274464 302439
17191 302439 402873 163717 562934 384332 27015 243228 235904 101213 483701 302769
17181 302769 143076 541314 408645 364665 387805 379653 358474 249433 50142 241980 215529
17170 215529 -97552 271267 236943 337786 305271 391195 360722 166139 379717 353894 548533
17159 548533 589595 244826 202556 268982 57900 118105 28880 82349 241170 643966 382311
17148 382311 493212 341330 221862 80383 474465 47143 315398 444046 388829 -141806
17137 388167 533988 458159 363561 164890 311882 220353 236381 496320 257828 414863
17127 414863 207591 478767 261671 359740 283311 514790 418575 177486 365500 258728
17117 258728 459524 611943 250228 238632 529163 149806 340888 352503 223788 566447
17107 566447 854382 233433 108131 310032 514604 545373 676067 170185 398199 574448
17097 574448 347804 495172 657434 521792 420547 681199 449670 361968 193321 583149
17087 583149 222657 286262 240711 147145 967662 557039 524673 606357 181932 454934
17077 454934 601837 507066 420800 575025 469758 78775 316972 351140 332387 166838
17067 166838 553177 418411 248427 349884 610902 382987 640203 438927 307703 348146
17057 348146 797980 358610 498425 614243 494844 703712 476097 261662 759614 734939
17047 734939 822133 251806 292409 484608 509675 479306 759604 415836 872602 317042
17036 671684 835234 581354 845255 754048 804316 700457 610068 548803 1035716 620676
17026 620676 750877 635491 448830 1021433 530408 747046 512952 640961 608779 518440
17016 518440 972427 794790 966539 440224 976091 942610 438630 787647 791651 819067
17006 819067 696197 903037 647376 704435 704867 844150 1055117 788923 678208 630514
16996 630514 648110 645464 803706 656554 895741 911986 1115596 578795 809781 802950 855418
16985 855418 625040 634337 811756 804185 840234 899144 677608 961484 1134664 629003 1086163
16974 1086163 1130878 1086169 932774 981641 1124943 884614 1282299 402918 1481301 1242741
16964 1242741 948844 857995 977878 995657 1294740 965278 756170 950627 1341910 1428790
16954 1428790 1418191 1210877 1273242 1111562 1394975 1225535 937170 1172617 1175269 1518304
16944 1518304 1353045 1094816 847060 1309052 1447215 1191509 1291824 1023852 1191582
16935 1191582 1618441 1294926 1349730 1165445 1294524 1242317 1538151 1244915 1460672 1000266
16925 1000266 1762524 1489698 1365997 1226841 1298008 1363926 1662401 1817214 1767820 1505225
16915 1505225 1798191 1567907 1479879 1788999 1757974 1826292 2011250 1838816 1799581 2088617
16905 2088617 1895232 1859988 1857879 1853818 1787557 1916920 1920572 2266687 1968288 2095786 1958645
16894 1958645 2171920 2213898 2017465 1902258 1997984 2195872 2051343 2123732 2293417 2297467
16884 2297467 2482947 2470733 2391788 2317928 2331565 2372152 2501226 2088128 2297203 2799393
16874 2799393 2685937 2602700 2777527 2878313 2772344 2837246 2414018 2820943 3141174 2762772
16864 2762772 2836316 3195916 3206711 3252465 2999621 3012006 3479100 3438617 3212927 3380133
16854 3380133 3401591 3286418 3316065 3427609 3398683 3457486 3486744 3875450 3839748 3649375
16844 3649375 3782072 4036190 4359520 4360947 4358581 4100568 4248656 4167334 4628494 4356460
16834 4356460 4547743 4621536 4866941 5135322 4739988 4647806 5185785 4951846 5065603 5333829
16824 5333829 5652432 5752511 5650690 5525941 6040147 5868811 5812721 6076941 6276898 6156438
16814 6156438 6534471 6791374 6811306 7054770 7148505 7172919 7209396 7819157 7709102 7712940
16804 7712940 8244379 8413377 8466356 8772702 9086076 8721247 9296834 9826277 9829891 10131916
16794 10131916 10362905 10505950 10708251 10939229 11146974 11657596 11855052 12080849 12646817
16785 12646817 12939632 13132737 13729286 13878537 14269426 14592063 15141690 15930327 16392195
16776 16392195 16740143 17035795 17855149 18222469 19129400 19819145 20431529 21035842 21684805
16767 21684805 22578200 23543219 24099092 25106640 25961668 27020492 28016917 28847350 30118014
16758 30118014 31593499 32677268 34303897 35929766 37332297 38859801 40554767 42683218
16750 42683218 44483057 47002669 48703955 51565517 54100700 56493414 59580849 62596219
16742 62596219 66085040 69647219 73166471 77023817 81656738 86197187 91034233 95852025
16734 95852025 101217443 106910642 113075188 118555540 125050755 131642670 137912538 144436352
16726 144436352 150659653 157367649 163213115 169395232 174051983 178013496 181793105 184301236
16718 184301236 186252004 186701921 186155363 184601218 182273309 178988686 174436702 169957564
16710 169957564 164554688 158387582 152075448 145479771 138895071 132358561 125728720 119184579
16702 119184579 113134450 107063792 101572148 95882332 90537180 85819359 81488605 76821714
16694 76821714 72347079 69093980 65337704 61816247 58887610 55756025 53237728 50385582
16686 50385582 48017289 45720039 43656841 41487249 39787204 37635720 36318203 34595133
16678 34595133 33327984 31974717 30813384 29447918 28256770 27110964 25840190 24951095
16670 24951095 23900055 22814096 22317534 21507436 20950429 19895403 19341078 18592650 17810327
16661 17810327 17481961 17018759 16197451 15788128 15491682 14990610 14407196 14007544 13507159
16652 13507159 13443641 12820741 12562395 12076107 11498987 11362385 11090470 10716863 10802311 10029922
16642 10029922 9857771 9740396 9543765 9111458 8836825 8741384 8836569 8277463 8038509 8006332
16632 8006332 7816609 7627001 7442841 7201850 7127428 6621468 6518874 6602066 6357366 6410401
16622 6410401 6160460 6263772 5799153 5697441 5670277 5577993 5821354 5283421 5047694 5396180
16612 5396180 5173991 5205108 5115360 4860007 4834108 4805088 4434209 4478525 4183955 4542658
16602 4542658 4230891 4469696 3802853 4126288 3818439 3839993 3778678 3398774 3574669 3634942
16592 3634942 3444768 3565149 3719012 3286383 3394281 3632787 3269586 3079704 3526127
16583 3526127 3007718 2399775 2825346 2930853 3269688 2723200 2983910 2516873 2301698
16574 2301698 2541393 2338374 2757757 2489148 2564416 2363064 2587056 2488312 2448940 2678491
16564 2678491 2111774 2298114 2453826 2255345 2230818 2293212 2263266 2117536 1889915 2044586
16554 2044586 2026986 1948095 1932808 1772860 2304886 2190885 1936286 1657358 1744092 1880778
16544 1880778 1383346 1890051 1798234 1582661 1665956 1805240 1659600 1538177 1665489 1530849
16534 1530849 1852079 1679793 1356755 1664027 1884704 1812653 1602714 1180315 1450842 1656411
16524 1656411 1801226 1402890 1535173 1521716 1404224 1391834 967148 1469558 1761492 1345865
16514 1345865 1339131 1621316 1305190 1181223 1280005 1026396 1095876 927247 1351502 988521
16504 988521 970935 1079384 1048546 1188014 1149609 931124 1369350 1177449 1160223 1062393
16494 1062393 1061480 1235097 1177118 902606 1337069 971069 851211 667104 885957 671243
16484 671243 757700 1178965 1082894 819825 919529 820835 1339195 1131718 834184 988332
16474 988332 921051 757342 493801 852821 879785 804054 1136141 843491 678947 847545
16464 847545 593084 568075 717783 583996 833589 599544 732205 465347 974749 854825
16454 854825 424351 708669 534637 619343 451395 720804 745724 523105 807121 964475
16444 964475 527083 928627 476600 823466 599395 812973 847345 570032 717592 826769
16434 826769 396887 679128 595854 897140 235481 512453 787224 511237 598263 853282
16424 853282 376900 299541 625337 308551 492570 320833 510399 409172 547808 337541
16414 337541 894532 419525 603828 556786 522421 532614 514819 472982 459923 507032 612046
16403 612046 715398 280216 537809 251673 470822 684043 232923 317872 400051 610506
16393 610506 506356 418616 533430 448250 494715 403659 475700 562695 477697 -31806 452804
16381 180292 383990 484533 256898 251467 542308 254764 640487 518476 146460 247423
16371 247423 311802 381145 532652 282594 211638 452135 259119 313981 404521 241731
16361 241731 427975 196871 389763 395617 373020 245233 328555 557 382428 322164 278400
16350 278400 722182 116455 624923 86774 592234 507105 474342 289427 158547 440890
16340 440890 428079 -190800 563733 548809 68653 452469 206738 413858 -4905 286031
16329 193926 398716 551458 265247 408164 793037 420301 476603 193120 587480 372566
16319 372566 542674 364370 61010 113247 337133 201499 -86148 164601 74356 86044
16309 86044 418481 -42804 281948 408907 -7063 336020 276528 81193 -178913 69334 438385
16298 438385 464076 117798 -2015 242750 -38083 296817 82426 182942 100610 133273 341790
16287 341790 129660 280597 409146 462655 250636 101323 3921 -11102 301149 -96979
16276 226999 207994 297953 24021 175237 -5804 253854 63257 26425 116784 118708 399297
16265 399297 357442 254238 63303 428986 205798 372222 229842 40453 250518 -4327
16254 212467 139023 107739 291859 -24066 250502 338240 327171 89856 208087 288493 210891
16243 210891 54217 265751 -280379 223995 278375 284207 219766 311951 -301576 170197 -235791
16231 205059 -46428 377522 136328 194332 253201 67129 435098 176905 86783 232536
16221 232536 44374 -187309 488998 -173957 -295542 255093 -136841 -81450 383108 66775
16210 238155 282352 -208787 221392 -207474 49536 180795 -82509 534764 325125 249002
16200 249002 172764 198089 -27351 196781 19902 291862 -112555 307593 489546 35275
16189 91698 85750 225389 -17034 96488 -166214 -52805 -136922 176046 11139 -127338 -337698
16178 -337698 280351 -55525 -99550 196505 25410 66497 108012 196768 -343841 103152 -5668
16166 138522 -29296 -167213 230119 91455 -109965 77807 222111 277599 51483 77999 -5191
16154 248623 81892 240340 -30022 -239964 -18192 46796 -146198 22570 16021 117242 -137530
16142 178112 30483 -288286 48419 -8646 19127 237987 100755 -174368 -211520 -58747 94760
16130 -72362 50752 5824 152959 -149863 47598 5080 269515 376192 -77631 103558 -206466
16118 -75825 203894 10487 -68109 349989 -194989 170789 330168 31815 62886 -36354 168504
16106 -83247 71540 78642 94330 -213063 407431 15550 417355 172985 -13388 -142428 420188
16094 207961 221595 -62606 -5280 -3992 61398 -91463 77638 -5834 17463 -248358 67045 -110622
16081 279419 -78444 -150151 256297 221442 267005 -95437 183647 -50969 -87652 -57172 -47387
16070 -47387 289130 200122 64192 -142613 -325286 145975 -50393 202907 103663 296647
16060 296647 57822 -107754 -153606 19127 164171 -76848 -3508 -17855 -138740 -91755 -267288
16049 -267288 -210079 -187436 -59155 -27604 -8195 15873 19513 43517 122237 -519 30241 114751
16037 114751 126283 -227784 -34967 36679 170497 -124237 -107841 -80956 114432 85681 -108708
16025 147031 -105995 185409 168389 32446 -268554 192891 -275279 -28554 237607 41071
16014 -6773 -164763 -114462 172178 28988 -15604 200168 -50192 -57040 -320101 -382631 -54449
16002 332688 -136828 -97039 181186 2562 -79738 -251759 -169825 -233097 25464 -175355 71634
15990 -39916 -4926 226330 -114485 146154 -358943 157296 173553 395057 321262 111271
15979 561258 61252 43679 136619 -133131 -26613 65947 108954 151703 -155122 -78011 279117
15967 275513 -18658 -95091 235949 -42382 -219967 268343 2569 267601 -90742 64015 278487
15956 278487 -195338 -365364 -211365 116869 383 56015 286180 148439 29129 -87117 -173696
15945 -173696 -96049 -149235 -94338 -350232 316082 -87774 -90728 -247373 -307755 118809 84246
15934 84246 -359593 -265458 -372582 -321949 1309 -293124 -717 -292730 123033 -97736 35092
15922 -175206 -291757 96311 -41230 -535209 -339781 -309323 -70910 -61415 44246 56009 314855
15911 314855 -74386 -317200 52100 76745 76546 12819 54882 77938 -37665 -37548 69790 73514
15899 73514 242457 81654 -46651 -127514 -138365 85738 -92396 -35541 -186979 247006 -387548
15887 78401 107485 233656 -255711 -134129 -208572 143435 -19996 -75208 35528 9740 -203015
15875 46246 -35013 68762 122358 184711 344574 -377137 -52224 45957 39564 -256729 -226571
15864 -226571 -136047 -219452 -100863 205812 -234644 -17342 -95307 -98319 -83644 -90383 -199825
15853 -199825 50288 -112437 -173727 -27742 -52336 88878 134003 49778 -177077 -86352 -312936
15842 -312936 161676 -115875 -42330 -75832 -144832 -195137 203794 51585 324789 186896
15832 186896 51852 -69278 -185790 -95263 118108 -371870 98976 -101287 -205253 72662
15821 17300 -36856 -157413 104641 126970 257523 -218284 -142211 -166610 -133428 67014 -217251
15809 56968 -2387 61572 -250614 -59801 243193 -122707 197422 209922 315282 44462 164726
15798 164726 -17745 -76425 -186247 -21116 31033 142728 -122287 -48473 142017 203962 -192455
15786 31142 -143938 70051 -103739 125735 109049 -76871 -42281 -281118 -196129 -171544 388617
15774 -71216 17600 -127380 -261019 179067 52175 196308 -48556 169012 -369918 -265058
15764 -265058 -179866 -105953 22860 -256233 314774 -65781 164105 96222 71630 -42221 272590
15752 -113054 70358 -43806 -77235 -116326 -227750 -78345 64343 -266523 232993 45362 -61450
15740 387327 4436 -25153 164020 -224342 -149970 96351 -244244 -60899 53162 -170522 59668
15728 30122 -167066 281082 -306607 -184612 48845 -13926 195975 -125668 227224 -268459
15717 328929 -240239 -12408 303852 26131 -4529 227240 -1225 -165967 -54873 -370076 -276644
15706 -276644 -207058 188963 51612 71937 254371 -374531 266111 47594 117234 132611 116305
15695 116305 202206 -32977 -161770 99910 -203647 260304 109506 345427 -179527 -9250
15684 -161638 -179403 196190 -23776 155285 28934 -262694 44143 19672 63023 -45047 -167141
15673 -167141 73650 -109823 284946 324589 324447 71285 -282811 229129 31714 135237 -250544
15661 -57946 -38234 67327 89463 62987 -34901 85048 -257600 203348 -181264 -155940 53615
15649 -67804 29837 202374 40670 24473 426970 -272132 -127951 117721 32821 -104700
15638 155605 37763 -216827 -201759 116908 -467086 21590 113072 -144903 32319 14975 -24482
15626 -645 -94385 81360 -294291 -277280 45087 152842 78992 -123073 -215940 -382662 -215033
15615 -215033 -30088 281961 178336 -281701 73950 62942 37744 -319183 -49012 103181
15604 -344442 52558 155783 -150031 -3910 -256589 -39714 212641 -128207 74001 17821 184062
15593 184062 -156331 -164538 -38112 -176535 -144166 -3625 167730 -97839 101380 -166701 -56422
15581 -100799 218031 -68572 -121513 170528 -147360 298435 -157134 258213 -50590 -213371
15571 -213371 -241122 -476489 283490 200566 -201721 -164163 -185471 -71073 7180 -161924 -124866
15560 -124866 -9336 -190849 -274883 -125401 45859 236745 106979 -354570 109151 159639
15550 159639 102418 137643 69329 -96285 -121142 -67659 -224689 162500 123910 293268 -232655
15538 -218558 104699 89933 -182313 -137684 118777 -198774 -150363 15923 50317 -78867 31293
15526 65066 58111 214910 73381 32442 344318 -124545 -165776 -75192 136275 407405 138329
15514 123193 -8235 -354052 -82869 140341 95495 198743 -257349 104716 -203942 118342
15503 269616 275915 -29662 -169935 233990 26648 -316451 3529 -47419 97119 56726 207635
15492 207635 54844 132608 -204315 -15903 145827 25986 112952 -69157 -83338 -128953 159990
15480 178614 178939 -130648 -4383 115602 -146190 -68248 89420 -153332 115860 -79751 231465
15468 105852 133305 -4033 -20210 -266289 226699 -147372 -123279 -42328 350709 -31335 -117127
15457 -117127 -64310 -47236 -68294 97207 173273 -186528 146098 -169102 -59907 163383 156142
15446 156142 130878 216714 -110302 -159171 313528 193454 -75404 1780 286436 11239 -81043
15434 -145136 -94026 -90989 65152 -73820 -105027 20831 -233559 309628 -4087 11641 -191174
15422 -70157 56902 116375 -440242 179341 -131312 67191 -61255 41131 63318 -86203 -282661
15411 -282661 108357 42250 -225628 -52759 125336 -220351 -147381 69990 228184 -42575
15400 -97358 -200714 96479 148709 195990 42080 168743 -16645 216957 195806 261790 -123053
15388 139669 -185504 122346 -88232 -277010 111427 -23916 176663 72772 -19268 -166079
15378 -166079 247079 108694 80034 -207173 112071 -53298 -12655 -99760 263368 -179070
15367 41290 197736 -217919 -147782 -21583 28808 -183763 32607 -72242 88233 150102 -150581
15355 123936 -95319 -152921 262818 30104 63316 91853 159402 156905 98434 91282 -72437 -375335
15343 -375335 -31059 -166031 142718 -72118 141620 -24622 -96516 -190259 -52840 -182226 258078
15331 -151780 -15971 316496 -135192 -227456 -125856 18686 -40131 220671 28984 -126271
15320 285929 -36047 317162 197549 106339 -32944 -331303 -38613 3972 93618 11070 -262751
15308 232886 3048 125817 -1954 -339187 -46714 -28462 -34147 -89497 -187388 -179468 430154 322319
15296 322319 -189049 91289 217841 211743 332752 39221 110610 -251472 162012 196454 -34908
15284 369710 186031 24839 245491 -182079 71510 201803 104756 200599 -69678 166642
15273 60543 341130 47792 168423 677 -35332 127040 -204426 48157 60525 307370 238947
15262 238947 -53283 93177 170010 419 -67106 504900 117957 32262 149847 23996 582703
15251 582703 297718 446395 800560 1215361 1429298 1357562 723145 353713 -204331 -66779
15240 71713 111426 118277 -94364 306534 -66461 -69458 307381 251433 -129952 105285 -58329
15228 6835 17645 190571 242132 189877 51854 217026 12055 456738 -67795 -133798 279801
15216 -27295 120099 -193981 -3584 58855 -60625 65249 49673 157984 280786 -120325 106993
15204 252494 79086 -74912 27855 -81208 218548 210424 -132598 -48039 28478 -390257 83351
15192 -249137 46385 313635 142385 114820 214642 82340 -2314 703456 65487 22109 -143624
15180 46304 -138662 127505 104291 371320 -51550 95781 -319341 188850 293005 49410
15169 -83704 -61127 222243 -2661 34139 120063 -286977 147750 175130 94374 327619 -9220
15157 90919 206054 -10674 375331 154942 243314 231453 -46383 372927 313887 336738 216150
15146 216150 205956 130984 -81833 17202 -93932 142716 -59053 -94717 140851 298123 387941
15135 387941 -191793 136605 168723 50753 -129226 35175 293724 250390 269320 343847 190855
15124 190855 191315 405772 -203151 12206 67262 -106835 50318 -46945 359012 343808 117139
15112 220718 242581 -119199 190543 131979 -18738 95038 -11504 -216820 218305 172915 136914
15101 136914 -16576 399949 255116 -223666 -9524 274373 281757 169120 83065 -83018 248461
15089 87806 157583 8723 652080 240317 -123663 299799 157401 455338 306804 62607
15078 49426 37773 169338 60317 247568 124909 -219199 111506 132607 57950 -53430 536727
15066 -360283 255097 114956 -53446 149767 119935 -59297 79969 175814 395337 13259 -60424
15054 40591 -67206 61657 114142 60764 319011 415784 175089 257042 500629 -122815 107676
15042 165155 -36660 299227 239629 168780 70070 133116 119642 284786 335318 -28393 515237
15030 106694 235997 154052 341537 102341 253825 -4587 107855 237106 569181 174251
15019 358814 292416 151323 39805 257495 -19284 -105750 -40480 116183 247294 185539 355124
15008 355124 521372 316731 86355 305282 16226 376902 255816 678286 201701 535544
14998 535544 111962 305363 472604 288526 -69965 227329 485660 258451 547303 214204
14987 106500 259480 414115 207271 151361 -32229 113583 287716 -1402 103227 29243
14976 286210 331496 117412 192149 162001 154980 304806 5433 -86699 393197 238490 208831
14965 208831 194045 238846 206230 228945 -39146 393808 365495 342524 182661 -205672 261114
14953 519585 304102 -28363 -44045 179681 320715 392649 277519 464032 264033 278239
14943 278239 336772 331976 168950 281231 536699 428278 538524 230351 341193 280965
14933 280965 308164 437125 575189 -20290 407729 349956 352762 83548 466190 489134 538058
14922 538058 400636 122117 601123 96764 294689 340384 487410 178509 410602 36267
14911 388082 256181 133475 418678 436775 281046 382668 766890 505575 529705 235048
14900 254650 166720 347375 469005 8856 60363 91410 435166 637700 120175 172373 447605
14889 447605 -31056 573752 70470 500629 158036 355215 512030 572790 319662 401389
14879 401389 554127 177328 410394 538246 260024 926 521512 405418 949527 188526
14868 470132 479227 458867 621304 454502 153867 422672 470138 561468 562434 524839 604888
14857 604888 417997 500496 556233 273875 72832 615928 64769 153483 266972 584491
14847 584491 335077 264051 356572 419284 354968 547576 360664 339650 260070 363278 719661
14836 719661 136030 284060 187419 396072 763864 352116 486126 177197 605186 520211
14826 520211 888611 427135 540879 321655 173500 685381 636614 593193 674354 486471
14816 486471 323438 109721 655257 387357 464240 657413 468379 378149 612999 461169
14806 461169 630969 454224 613127 821002 517576 721678 258387 489082 479483 701248
14796 701248 548697 544352 292306 583678 573958 564360 685646 714643 833763 969051 713679
14785 713679 461873 588427 560776 626955 502994 662478 651851 605505 872016 741306
14775 741306 459686 577909 500608 706571 510325 661321 622622 702885 825672 466106
14765 466106 382732 685818 717572 594678 909766 605953 685490 769736 881752 614462
14755 614462 724921 795591 749686 539853 668465 682121 872557 775152 208763 649104
14745 649104 642692 659312 875024 887234 927833 565748 850556 555605 546704 1159416 792412
14734 792412 822791 788752 619648 715867 722423 759946 746151 552707 725245 1036634 720913
14723 720913 793629 722825 716722 950326 981069 959397 995082 817878 846898 1107644 715033
14712 715033 607807 794827 705210 962182 718625 1131455 916221 921625 1058089 1094848
14702 1094848 650862 945733 881163 767922 854330 1212324 989387 1065545 1134701 951649
14692 951649 780542 898513 1046700 845834 1027982 896480 744579 1112922 1181674 1224348
14682 1224348 953578 1175827 933740 1248599 973615 918587 1054338 1168026 1132387 1162827
14672 1162827 779023 1110594 960338 1170839 1270846 1058548 938987 797845 1133132
14663 1133132 1137414 1094722 1376445 968828 906483 1226590 1339797 1236496 1149915 987227
14653 987227 1458491 1302186 1213364 1201670 1168454 1127960 912688 1728053 1128761 1671241
14643 1671241 1116589 1542876 1488497 1170338 1560792 1027041 1339803 1501924 1387529 1351725
14633 1351725 1471833 1114813 1520036 1387047 1108349 1745899 1577865 1178538 1382097
14624 1382097 1639890 1771013 1491879 1454418 1248950 1431513 1574494 1907394 1355670 1452034
14614 1452034 1687479 1497225 1574396 1480643 1677666 1533487 1725489 1526961 1362009 1474423
14604 1474423 1846358 1978602 1684034 1861585 1966755 1843873 1699388 1648534 1854457 1631261
14594 1631261 1824870 1964383 2156591 1747141 1964121 1953592 1621966 1901581 1998276 1995464
14584 1995464 1896709 1955657 2204615 2002180 2292485 2082555 2100000 2054762 2120600 2211817
14574 2211817 2002676 2244458 2533506 2550581 2255804 2486842 2422683 2359404 2571010 2415412
14564 2415412 2403792 2278553 2784221 2563196 2777446 2743632 3263650 3245888 3287703 3793255
14554 3793255 3628558 4138510 4216480 5101563 5906460 7209253 10529264 18306256 35810712
14545 35810712 44485661 29289280 13760709 7023334 4068380 3061082 2466586 2472356
14537 2472356 2283514 2226230 2057333 1941515 2341771 2277434 2384436 2348496 2316062 2227550
14527 2227550 2469171 2695799 2322725 2924797 2592343 2454481 2347032 2595792 2792267
14518 2792267 2823974 2745908 2330106 2906550 2865719 2642244 3022112 2742701 3212348 2750101
14508 2750101 2990485 2773885 3292835 3090656 2990462 3303986 3393887 3431519 3322277 3288184
14498 3288184 3137158 3312917 3579032 3510952 3669529 3568804 3795476 3565189 3619499 4106431
14488 4106431 3955264 4287542 4095683 3674202 3913243 3958641 4431856 4012516 4275417 4126570
14478 4126570 4633123 4301607 4102366 4098415 4135537 4348634 4239252 4185682 4706640 4685029
14468 4685029 4254229 4518256 4353508 5138645 4753294 4813164 5061269 4827003 4808061 5129833
14458 5129833 5152659 5196190 5212803 5731208 5458052 5496319 5616775 5480539 5755314 5914188
14448 5914188 5661277 6138499 5981459 5675528 6256252 6501195 6382018 6425600 6357968 6409813
14438 6409813 6375056 6823080 6990066 6845739 7171417 6950578 7332143 7024509 7687844 7451448
14428 7451448 7432968 7712094 7775014 7904898 7987191 7965318 8174618 8528874 8521290 8470269 8887315
14417 8887315 8853436 9072287 8997381 9004059 9152948 9481656 9732468 9539067 9765383 9719236
14407 9719236 10188940 10099135 10421800 10611483 10624922 10836490 10800468 11173041 11095495 11549172
14397 11549172 11350181 11904755 11847946 12344293 12204375 12927655 13079606 13112562 13516065 13740644
14387 13740644 14224197 14033375 14345923 14314602 14719216 15187390 15142437 15521958 15592545 16183461
14377 16183461 16379898 16889462 17040603 17570267 17597269 18058652 18715079 19008183 19266164
14368 19266164 19442594 19975289 20484224 20767301 21290099 22046407 22102704 22994784 23154947
14359 23154947 23635939 24225792 24950376 25190193 26275457 26656162 27299826 28099683 28126896
14350 28126896 29013670 30244516 30572483 31481092 32138090 33245570 33839407 34701566 35717678
14341 35717678 36503568 37586721 38661005 39792824 40935303 41835587 43052920 44662741
14333 44662741 45872793 47301509 48549634 49967521 51560887 53608089 54927732 56933024
14325 56933024 58813766 60682176 62493839 64465218 67106321 69020582 72260857 74476115
14317 74476115 77336185 79989935 83265308 86313297 89744936 93377547 96916232 101178463
14309 101178463 105101770 109396921 114369273 119343664 124379292 130098065 135927016 142311496
14301 142311496 148772733 155597287 163002193 171177909 179460987 188354473 197467177 207544683
14293 207544683 217665148 228558918 239994503 251974921 264349474 277289114 290721502
14286 290721502 304790919 319210162 333879337 348676410 363279185 378112652 392615667
14279 392615667 406846617 420296696 433087367 444379802 454669692 463364347 469552683
14272 469552683 472766170 472774586 469827565 466511612 462535775 458299890 453368438 446048286
14264 446048286 436416417 424569521 411190918 397282246 382142718 366794189 351082585
14257 351082585 335296892 320452824 305788874 291275792 277129401 263774539 250895580
14250 250895580 239014626 226853790 216154106 205689848 195562744 186255133 177738770
14243 177738770 169492668 161920878 154102482 147193602 140507969 134690941 129027720 123378569
14235 123378569 118199367 112787242 108478260 104394203 99955655 95963491 92338811 89033229
14227 89033229 85400269 82242817 79222065 76266522 73375048 70795122 68599537 66462008
14219 66462008 64152845 62247489 59891702 57912758 55828077 54486195 53107942 51517614
14211 51517614 49675622 48245812 46464314 45429469 44363909 43715989 41990655 40900417
14203 40900417 39616464 38204096 37369294 37082328 35878149 34714996 33783472 33043342 31989577
14194 31989577 31474851 30589197 29883377 29042992 28483356 27576583 27188443 26471806 25831161
14185 25831161 25207214 24652109 24277905 23448305 23163360 22860353 22377219 21814899 21489459
14176 21489459 20903158 20455963 20260337 19834289 19338427 19025210 18402848 17880022 17919087
14167 17919087 17503035 17213631 16941531 16669031 16411969 16046370 15786950 15441237 15327405
14158 15327405 15237209 14714580 14464576 14076811 13656121 13643227 13514573 13366512 13123776 12640559
14148 12640559 12634142 12276267 12347485 12047388 11715172 11580541 11259598 11190814 11220189 11083446
14138 11083446 10692282 10541773 10357017 9836633 10148761 9891389 9641748 9646241 9267067 9446861
14128 9446861 9112074 9233713 9051277 8353193 8550516 8389209 8510843 8301753 7928807
14119 7928807 7860092 7939954 7896955 8122415 7645975 7400405 7644283 7415039 7189141 7028909
14109 7028909 7390470 6812972 6811525 6894996 6620351 6408737 6637302 6632188 6428496 6398233
14099 6398233 5949352 6240629 6274457 6166807 6458863 6211463 5903428 5830232 5652304 5750663
14089 5750663 5643090 5980877 5604535 5569130 5548425 5310062 5096575 5039860 5075297 5084143
14079 5084143 4871649 5163515 4951041 4698025 5290048 4798524 5047406 4933341 5085224
14070 5085224 5027535 4498570 4667116 4253095 4678504 4327215 4319354 4425861 4331545 4426016
14060 4426016 4465589 4129329 4352667 4312132 4239352 4291489 4053109 4034480 3818521 4115757
14050 4115757 4066161 3823043 3716347 3545277 3886228 3473093 3355629 3789652 3583836 3528875
14040 3528875 3587757 3318818 3373750 3311990 3352440 3342232 3202087 3221361 3023609 2997172 3380343
14029 3380343 3476728 3212261 3133994 3037008 3269048 2962286 2727638 2704956 2913841 2641044
14019 2641044 2774348 2879869 2585518 2396394 2550397 2632541 2458413 2396234 2569053 2711509
14009 2711509 2630119 2337931 2745975 2507218 2231753 2110427 2387122 2418622 2110456 2312739
13999 2312739 2369540 2537521 2253546 2296667 2369352 2214051 2106668 2365052 2264917 2862585
13989 2862585 3625725 5552570 11042238 26709391 41895945 33002624 18995860 11434158
13981 11434158 7505587 5619947 4889860 3869946 4033834 2979203 3010174 3144507 2998335
13972 2998335 2645024 2769474 2604165 2578548 2623958 2731830 2372612 2118834 2175073 2590039
13962 2590039 2375195 2565059 2437491 1900187 2052557 2476219 1965795 2258171 2137952
13953 2137952 1886331 2282032 1935671 2282919 2086618 2000699 1954110 1922959 1983531 1834266
13943 1834266 1715004 1780514 2010109 2047137 1881376 1553278 1595771 1851193 1816177 1645088
13933 1645088 1541387 1910125 1835558 1948898 1985868 1780944 1900844 1580736 2063451 1778366
13923 1778366 1510311 1721627 1424268 1689739 1831932 1786266 1826291 1523127 1481305 1774280
13913 1774280 1142652 1593903 1426094 1061987 1399249 1691232 1505925 1389457 1559424
13904 1559424 1382490 1469737 1360258 1601968 1539886 1479963 1085635 1519157 1464304 1691566
13894 1691566 1799926 1484869 1244522 1100768 1478864 1249679 1087130 1514709 1316552
13885 1316552 1222404 1382703 1401977 1211924 1526901 1172302 1185871 1123195 1246365 978183
13875 978183 1645033 1224956 1290589 1466864 1163768 881493 1436678 845694 1524511 1511555
13865 1511555 1177612 1372744 1231516 1484793 1007163 1019644 985811 1313392 1159339 944477
13855 944477 1034117 1230086 1334946 1019066 1276795 1302394 1060816 1281687 1036664 1002094
13845 1002094 906085 1065970 1025513 924515 1041598 1196785 947699 1238789 1152674 955678
13835 955678 1116379 1262133 656123 968468 1173361 1258263 981374 883376 917147 771178
13825 771178 1054659 760575 1094102 1107678 753159 720308 573306 758433 1051698 1007752
13815 1007752 904366 990755 634702 838600 769355 916529 1053696 719863 895308 845090
13805 845090 768680 993433 1067768 1005916 664597 1089851 1077561 695468 1169265 953373
13795 953373 944261 952644 730860 716002 1103859 696094 1070573 745537 1119252 1066820 878970
13784 878970 975514 627912 920801 687519 751957 842583 649867 1097705 676976 728395
13774 728395 788069 809077 632830 786362 794660 555494 830903 730011 788407 776029 936983
13763 936983 713975 747226 517107 731992 681797 772687 727235 799086 697047 724457 470961
13752 470961 653445 595169 31484 684438 692070 305951 747694 637795 754938 702750
13742 702750 748586 637329 836728 698395 568922 728061 681739 490518 630979 482981
13732 482981 605942 548747 511362 489141 671000 636922 933708 617388 555163 591284 552011
13721 552011 944519 609289 415158 487033 533709 694519 659067 773391 898458 340601
13710 493413 726961 668911 808633 208411 468784 706649 219092 576715 714691 230424
13699 436393 681503 115258 436839 247974 686933 911922 456512 509169 708002 573366
13689 573366 577786 765033 548720 788870 682118 601702 486300 58486 355371 296915
13679 296915 552175 363290 232397 714444 382336 347628 693669 450277 520210 374437
13669 374437 354284 279249 545036 235570 767059 408240 393940 581541 271807 512973
13659 512973 294256 509220 659715 552154 462142 434521 414880 384829 278109 512317
13649 512317 619055 594929 317452 630339 451630 415182 361767 635690 206393 507543
13639 507543 192061 181269 676438 738838 475891 435195 573022 734875 407653 499647
13629 499647 226098 518708 393339 408560 526204 275087 475052 424768 482441 421669
13619 421669 596207 359637 230543 522304 525196 457034 91191 391127 290882 288576 605970
13608 605970 340277 432465 185548 377020 660735 656640 290946 303813 314680 466245
13598 466245 248277 141319 146636 348338 383852 247690 435307 394030 68404 467086
13588 467086 127564 393578 598032 262270 69746 315003 470318 595493 282098 46555
13577 442920 68563 482779 81312 696716 341611 439857 624985 167596 -144682 377629
13566 150408 294631 273598 385635 462490 46987 167664 193175 282483 427133 -18590 497249
13554 401762 370255 278454 502043 349935 581439 248257 558247 333399 225924 379234
13544 379234 301024 548188 491157 279797 19377 -13054 421188 303736 266896 530737
13534 530737 -28509 310695 81565 206679 353798 506371 289665 413899 252380 5631
13523 65693 241018 340859 216414 188198 312224 266091 437555 347805 213298 553539
13513 553539 326733 633793 336695 633018 82761 334324 499517 590262 550084 550617 321112
13502 321112 188587 348741 351101 366646 160167 511196 184639 319881 365378 314258
13492 314258 73051 375181 104231 323131 284440 299457 138726 179466 97003 40103 522788
13481 522788 196839 340776 374401 163190 264537 399351 73888 386143 463719 302690
13471 302690 403083 225010 105519 40462 381539 455724 726146 69065 198341 -14419
13460 350789 197542 254469 80731 382348 234147 299381 533218 226804 111685 -69231
13449 319723 411497 92763 196674 426282 317429 -162120 484961 215073 117578 10287
13438 188769 173544 115641 163672 18192 127866 6032 387736 145564 346747 318017 448983
13427 448983 314123 429933 546763 197087 362497 353909 206150 235364 -15110 74450
13416 389361 -143218 226214 -11844 286273 57249 -176486 187442 171083 506865 218478
13405 169036 230304 37789 380675 183435 196292 312008 206520 491889 9883 598581
13395 598581 -64518 203256 150102 58688 317112 117272 33606 40727 318155 187657 346655
13384 346655 141051 21144 346986 120617 235375 123413 417805 279568 74490 207651
13374 207651 76450 159087 283998 252085 116319 570033 229459 54802 230525 148715
13364 148715 190172 -212589 467558 118480 -1532 306248 -145625 -783 311941 245041 197233
13353 197233 -91511 83849 80557 386571 104510 222065 -59925 240875 411419 246558
13343 246558 39322 417011 475684 486261 104318 305183 265756 275842 340077 293708 367272
13332 367272 445196 329636 257606 2414 86218 15604 185652 114272 30405 -126811 204139
13320 536141 273479 15273 188399 289831 166802 187805 408973 321793 105343 468951
13310 468951 277387 395324 -93321 178285 -112938 210686 24895 -160158 101566 274780
13300 274780 194046 -11651 543848 155786 616245 170351 444922 72502 96660 423461
13290 423461 -47560 -45767 -14242 -97383 -58837 202623 12246 263745 234800 100535 212116
13279 212116 363570 45803 227013 -14571 409864 168835 62583 -130562 -118640 -301311
13269 -301311 210815 -98014 45158 282892 80604 139471 167970 213030 129081 377578 -91020
13257 113263 -18311 104158 -49403 223444 72150 147978 -196063 48748 323903 287630 154478
13246 154478 166810 -436334 -37621 666712 31368 418106 413821 408261 124820 199521 304280
13235 304280 189186 476037 59837 189923 227110 232673 -17459 268603 382766 80355 137557
13224 137557 220278 -262548 -26640 -200364 49541 -141802 197439 45315 419341 144004
13213 79367 -85829 398648 21112 53173 131285 168148 58146 114848 237546 130832 4907
13201 231776 370767 184409 38237 -113124 77771 560397 208753 241897 -109387 191025
13190 107896 215869 33932 -136879 -230568 142406 237520 187856 -87702 186364 -154736
13179 144596 86053 -329587 74719 19081 -2103 -167789 113069 262946 174452 101028 34673
13167 -6236 342000 -183749 249633 85442 166962 220745 -37460 106941 130161 -88617 -173339
13156 -173339 115692 82598 147878 285031 450937 343523 -173244 49775 61691 43933
13146 43933 100286 195685 31209 248957 362048 278592 234300 150708 -134868 -77445 162915
13134 -6333 129016 133393 368808 -204725 62599 -11387 -178070 -82787 -25604 -18584 148045
13122 -60654 135949 235751 -27847 39806 -87008 5926 121991 286893 219510 -34474 203253
13110 -65239 112060 -12672 181488 -59484 -78818 134010 201829 -77236 -75706 156132 -198397
13098 -96809 408303 -295279 -89912 24905 155631 -37338 338532 284568 397611 148265
13087 -31333 -262304 223071 65884 4428 -92151 -73273 140998 98191 -246864 97304 4018
13075 202350 10867 -81436 324824 -87272 69306 -254640 49742 -203532 85277 254687 265113
13064 265113 -91454 292403 117411 81394 261739 81049 195480 67077 448193 -105294
13053 -72645 124908 209688 51267 305700 70140 -45717 128361 -44523 124228 -14860 -105370
13042 -105370 167034 84560 -197705 -84614 -15008 24415 112819 234707 138173 271980 121392
13030 -10069 29656 -46842 10060 114457 145816 -15308 -164921 285422 -10198 99117 159776
13019 159776 329627 249744 211857 256199 -113843 241585 223805 342562 31043 211855
13009 211855 20420 111585 49305 229436 125766 -26995 -118066 -12171 394401 323868 66416
12997 -116160 146363 522900 3485 61520 -10257 56929 -7714 -55317 -92670 61502 -148750
12985 43623 43242 70458 -133976 -154782 560612 -10122 178990 -54255 112877 181197 -168106
12973 237689 33848 -241460 -120804 -29980 -49146 38287 348516 17823 429328 22373 115888
12962 115888 80240 -45734 -23574 -30379 118021 169559 -158066 197582 150086 -166279 325115
12950 50374 14468 -406288 93544 88223 188652 -24938 302272 -29829 315134 -355264 126362
12938 33234 -105810 -83496 -10623 47256 4421 -132893 -117401 236751 -145143 174543 -21044
12926 328213 43861 -208278 72705 373056 -92215 -405637 162058 217022 -256335 -58453
12915 -265595 -9399 607730 -131783 -115617 -151477 171577 -89053 185084 -319005 -252862 3870
12903 -41257 27329 110490 98571 130256 -125866 185304 -66096 -168267 117209 -161856 -338550
12892 -338550 -99171 94012 -298193 161376 -135603 327635 145293 125786 25935 -407290
12881 30396 188909 234259 469005 -131112 12974 264273 248911 -242529 -194595 136126
12870 22140 -87911 -330354 -112924 143656 324158 297784 -445719 32447 -199266 -177325
12860 -177325 303697 -398758 205252 305834 -15682 170813 -144865 121544 -47756 102331
12849 -180683 -189163 29237 -201796 88982 120794 143022 133990 133656 45519 -157397 -12425 101620
12836 328761 -88320 -36033 17319 -202017 -245036 242191 -123457 -367468 282237 293099
12826 293099 -246469 31725 -72043 142341 341505 87223 -122665 113239 470022 98865
12815 371650 -133455 361337 -379671 120210 63037 -68324 146714 -37873 -7626 160502
12804 -45905 21396 129740 -9462 130649 175908 433012 -116551 124191 192000 -185166 -123377
12793 -123377 -213245 -158350 55519 57628 311099 15562 28675 -257255 80641 -49812 116144
12781 294294 348418 -167583 98106 388525 -60685 142177 147517 -140700 -477809 -29551 -100792
12770 -100792 -42475 219915 -87894 2017 138074 196071 -60540 -46306 186291 -178267 -212992
12759 -212992 -63939 -41104 1763 -198578 88063 92682 421868 -46331 38429 239213 199643
12748 199643 311000 9827 390355 229837 270675 -94890 3876 -28685 -60517 91679 326152
12737 326152 165812 -85405 101231 28698 249334 291527 110721 98867 -138399 96520
12726 186937 33576 -178638 -141467 -8614 18205 -40824 15401 234914 182227 -20842 -129829
12715 -129829 131274 131413 -215031 34149 -100923 317656 318189 66823 58813 98431 -127021
12703 326956 73891 159839 3740 507392 51802 -97996 128490 -127710 211518 202453 386810
12692 386810 -75929 -26618 -13429 97212 73505 140012 -103786 352071 -253762 -273458 -3857
12680 246509 352371 326791 -59298 172665 41036 379626 309982 101527 -40599 69076 -280360
12668 -202809 -46894 -135799 -91885 253054 -63389 -3555 172289 77213 -69748 -98804 -6389
12656 368411 194806 180712 101139 162414 66881 -22184 166549 225123 70617 -252960 233150
12644 41086 188935 -242613 -208489 -12319 -97812 248918 109624 -49232 -40223 335066 1022
12632 251940 188826 8925 145768 231722 -87818 232843 56325 266719 576562 82927 49851
12621 49851 24715 -159285 -29875 107337 -72958 -43889 110125 113862 -76404 164448 -45155
12609 172653 -224228 39772 158768 -105441 66607 -18100 -87875 -385474 50519 43472 478600
12598 478600 368806 62039 -135047 -159740 -78310 -30530 134283 284676 -73540 153986
12587 -85756 -125457 -40598 -130786 188850 -62492 164898 215192 -256961 -108051 -37568 -231319
12576 -231319 131986 372610 69082 353450 22468 97556 160037 -303637 -145643 301950
12565 54306 -166936 -165692 518872 101901 324939 -102632 -366810 -195987 166917 23286
12554 121512 -224307 183770 -164204 -65008 273814 -101696 -223732 166966 206250 145567
12544 145567 -304215 117650 -104744 -197234 135959 -193919 -56844 -218829 145336 -278816
12533 -217306 15221 235576 309724 -14631 97283 -194405 175048 38528 155593 -20202 252569
12521 34473 5821 -111692 -29691 105628 66241 -30671 67395 -39875 -90461 269953 -143198
12509 -138181 7237 172329 48839 -114921 93967 -106218 177965 79121 354548 -290103
12498 -42433 338898 -356488 -40229 -44783 251124 158548 166945 -38690 -128992 -39811 11488
12486 -105472 59282 274906 -106776 297540 -157636 -87840 -104978 -187815 281517 -244246
12475 -54983 192863 -113986 -236901 -90916 58345 -118757 115755 -97726 340198 -382163
12464 -167794 -92128 -93113 -88097 -126060 -92523 341811 -340756 134858 -207705 279676 127755
12452 369247 16484 -5307 -105180 7949 -24676 -279896 -257278 -61589 122984 23802 4829 -103184
12439 41853 -47789 -174586 71465 -199653 -384149 139672 -224596 -26075 -174727 -485676
12429 -485676 52189 11096 -231601 -21775 -11764 -145738 -60584 -93819 173885 -27884 -155569
12418 -155569 -169753 -66570 103700 8740 -128200 3914 5247 -45135 122769 -125139 26406
12406 75133 -170758 405940 197421 6639 35837 -266779 108880 177184 -167783 351241
12395 -34635 -15057 -105467 19395 43441 18658 -89258 -29125 -24154 -202032 -229162 127628
12383 140239 -203583 241572 -127540 76828 148931 -41096 -6808 -71877 -86264 -20489 206260
12371 -75468 98372 365929 13135 -32755 251403 145887 2362 -52581 -275609 53858 -132512
12359 -88089 26832 -48130 -3829 -33781 125916 -180653 -12361 -240746 -345187 95341 195745
12348 195745 14601 417548 4585 -34691 158286 111904 -86266 22869 87827 27344 -12521
12336 74818 55455 86445 -120938 -124853 43020 -267139 -210637 182399 69781 162322 -167427
12324 116971 -80818 28691 145366 -21529 61237 148264 253926 178124 363431 164793 -79202
12312 18398 385076 -227420 -233231 224501 178953 -305181 -367562 -39316 7971 -199592 -104890
12301 -104890 277690 108543 37496 83611 -188068 -44484 109548 33029 131357 162941 -147714
12289 -56431 -316361 169659 151481 117212 112909 423072 185887 114118 -65602 49730 -149297
12277 -153181 237061 79955 -29300 -202476 262768 154575 -180375 248418 31394 201068
12267 201068 63207 265242 296659 -49017 -119116 -4587 141697 161776 216985 84750 -131905
12255 110368 -138126 186811 277983 86384 -108375 -48760 91900 -85175 127041 -135181
12244 -90111 296204 304232 279506 -68498 164488 272210 215552 84811 247046 209459 127442
12233 127442 -121394 -11635 343115 16764 17096 248216 -215972 337573 129421 216072 165701
12222 165701 -25915 -20644 -28927 90503 97292 133086 -142708 -16542 367142 159505 118599
12211 118599 -249815 231120 164891 4011 -63346 169211 -43464 199755 77218 -41367 163748
12199 262668 40910 -21262 38992 148550 89100 91064 -28947 244229 337961 118301 43217
12187 130222 143151 -161644 208093 -259916 168956 154363 -132673 212588 -285856 -128232
12176 -193449 -17980 280297 482418 54936 -176395 -157413 304000 144513 -62220 -45499
12166 -45499 217293 325410 -167647 30590 406367 490531 169276 -140290 14813 93129
12156 93129 -287313 149130 -298911 4430 -327088 176279 -160294 -147060 -200016 -91156 -179985
12145 -179985 -143237 -19743 124242 242276 227717 201792 246405 -65253 290980 -299112 -27978
12133 105644 -90653 -70968 -43402 163417 -235801 -108114 -93823 64588 -83027 305240 435220
12122 435220 215369 -134849 -25664 272518 123475 -221097 88475 -231059 33375 -246660
12111 -7124 -163776 -260677 168828 163376 -45963 -218393 168531 85903 66128 37 28035 -159196
12098 -169646 147009 119041 223484 -46077 9320 -121885 108661 109124 -150186 149382 -149520
12086 156995 230934 -270368 -124805 161943 -55687 159126 116255 141855 447679 528905
12076 528905 1466647 1221268 576210 44745 -293361 243194 80452 -8439 25071 -234915
12065 -269156 -81846 -114955 297741 -145527 61938 113679 3889 -190581 206632 139850 67045
12053 -30019 113911 11781 -86899 177533 163886 135022 106113 52179 130902 24276 -373473
12041 26751 -185589 440 -208204 74051 -135886 -147771 -76065 -41829 -149849 -186669 -7666
12029 71371 158348 39788 227745 115352 133220 -44122 -40599 40403 -124818 -59369 166976
12017 53271 93053 -39152 83375 36814 65505 -7137 -55913 -122428 143875 -165753 19142
12005 -163871 -65029 -88192 -136221 -15549 131536 -6942 -281609 -147267 -228092 73966 -13092
11993 17193 -207881 981 -209491 146551 264881 63879 -454074 -70915 -255639 193695 44226
11981 -233655 157303 -318695 47443 73085 12909 -110532 227419 178839 -167872 -239860
11971 -239860 176107 146564 161041 89561 -107589 -151636 -44809 120270 511347 -164902
11960 -51310 286871 -66242 -99606 69064 55 110137 -271479 74320 60830 69536 28944 200514
11948 200514 -108325 34960 -74731 361496 474701 106038 31202 153105 149673 -72509 -23268
11936 -150332 -208418 6975 -125696 -315820 -284073 69012 -26346 -146625 34584 -426924 180984
11924 -177330 -210449 215674 -11595 -115710 31249 -47617 -88750 354639 -109291 -23502 22904
11912 -14480 -86156 -372227 22462 -146785 -210739 -151076 36164 -85268 -89090 245612 100112
11900 -31013 -16689 103750 -71339 -165323 -9911 33292 85624 -39132 -208123 -139476 278498
11888 -53701 -59781 286002 -286589 -84794 -326268 -320109 -343213 -182773 92847 52262 296003
11877 296003 166159 -422584 -72151 -259295 177673 -113440 -395839 97332 -28148 203133
11866 98571 448873 -117294 -232461 -415542 -238066 -244348 -237951 -5576 -29772 -334341 336972
11854 36375 349783 206254 -178825 -189840 -2755 -208492 13766 -307283 -67826 44643 -322469
11842 272362 94115 396364 -137177 32049 17913 23396 180291 202504 117145 163380 -234736
11830 10193 -87833 -263674 -127374 -68695 165833 152979 -322515 -59775 153116 -134185
11819 -135589 114382 -15948 -251975 -120436 -95667 214323 178234 565 -5585 -213014 -234288
11808 -234288 397842 -18950 -139117 -104033 -235318 -149317 -159852 273156 325090 -300424
11797 84865 -62974 -230297 -432 -356881 -86672 -224832 -106124 -8856 -128078 -214827 96487
11785 -120219 142365 -3536 -374474 918 122509 141849 39172 -7474 -189965 -6252 5892 112671
11773 112671 -109858 159393 272721 -119544 -291327 -277092 152825 138098 -49647 -178349
11763 -178349 -111166 64857 42118 -88686 -42140 90401 41451 -91020 175786 -165268 -21084
11751 36156 -138243 -9857 51705 -139138 -257339 198077 69366 -113959 237260 61385 -305430
11739 50142 20502 -4689 -138916 -117342 53157 338561 -205764 209428 297183 66902 86822
11728 86822 94208 85230 213942 84437 233866 199165 -130100 6539 122508 215614 -36880
11716 59953 44851 -84596 119848 -53311 393999 339964 -14749 -141895 -158628 33278 295226
11705 295226 192807 -9187 316992 167825 -120834 320401 218615 -139767 132878 393559
11695 393559 -332848 -334938 -50093 196088 -119423 291586 6529 -84516 51485 43675 87431
11684 87431 -128102 15412 -55226 -96305 106729 -3167 224200 150159 -347288 -86062 -26859
11672 116063 -28952 -21891 -45701 -59220 132091 -276478 -51670 -203350 -91540 -23188 -38792
11661 -38792 70188 107339 63365 -59875 -8163 93152 362720 264891 130589 -229344 102601
11649 334906 -9849 -253118 75948 -92449 172217 -75010 -52128 422847 -60912 -256227 47472
11637 85677 120815 195044 396001 -1497 19186 -24967 -128184 -4047 -138950 -110061 -122975
11626 -122975 -31529 330252 -168714 5594 64679 -59123 274625 9512 194720 102414 -12933
11614 20789 -29878 65313 56041 -196619 89049 250009 221772 -360711 -345502 139590 -41854
11602 -61151 295764 -108339 66130 86329 64018 -254613 94737 -289798 -104999 -259399
11592 -259399 131533 304120 132234 345265 197210 12435 194460 544493 -170402 255180
11581 202174 172961 -64337 97911 -32776 3241 66060 179703 -84157 -22988 24266 347299
11570 347299 104913 -37352 42804 163729 32938 225427 -181641 151528 8610 274064
11560 274064 100741 -70560 -187670 -155293 -199054 -162231 148310 54974 -89548 -169271 -122766
11549 -122766 22864 -182224 75374 137012 -86098 25374 115442 108336 81473 225496 179478
11538 179478 65708 49812 -104407 224643 371160 112193 61420 408834 213080 153527
11528 153527 -66655 -198330 138506 8521 1911 -38572 -5350 1312 138678 -212235 27658
11516 414536 -202088 473619 -73333 27086 -113024 167073 88709 -14134 359333 144474
11505 -19294 519562 172510 48766 261715 194739 359909 185033 87391 -64548 338328
11494 160028 -161746 41640 -61203 167921 21415 -206705 -77734 334538 -60209 -184430
11484 -184430 -63581 455444 116571 259595 -31873 251007 231213 -168093 218263 309015
11474 309015 777 339724 238234 -22937 -157702 280473 207652 159091 152991 -88349 173886
11462 293292 97927 204362 -171422 228426 132674 62477 329927 220845 312084 20963
11451 -108967 83181 -289708 263324 261818 -42258 -35625 274743 194528 304535 23900 -256708
11439 162240 150821 76561 -113535 429011 -178145 141552 64719 424804 -154172 -81268
11429 -81268 141028 155877 117322 341373 -25329 251766 -104111 32095 77525 -42038 36964
11417 -285277 -410000 -68690 -39937 157829 -346285 91091 -116611 -44357 207040 -392254
11406 -138842 49174 -314888 -103065 344616 47751 193777 154146 -37708 -93863 29496 -120117
11394 -67395 214429 -123445 -268963 16091 -149553 1796 -144245 338046 18484 494714
11384 494714 -376001 -192687 -11636 -228427 150785 -22857 217686 -222262 -86950 -446641
11374 -446641 -41328 119986 -19911 -182458 -121693 278324 48676 -236590 -59941 19064 -255621
11362 156925 -46072 -94077 327820 -269932 -133911 16244 -20533 -138166 -28060 -61671 333937
11350 -46298 -174322 278296 -151683 121473 -251529 243218 -45049 -181864 -165025 -259670
11340 -259670 78632 1953 230863 2680 106044 126364 20468 141015 -192657 146161 85660
11329 85660 78312 28804 -30023 26759 129511 -316215 -280170 265490 54570 -4552 697 -102442
11316 -295786 -285069 144823 -77542 68480 -246733 17174 139016 62738 -321393 -57475 -61456
11305 -61456 101116 75309 197917 -162692 -81379 292765 109926 -220337 373050 -9213
11294 -54458 58544 -210369 -233596 -43373 87390 -105490 162023 105611 93785 -436038 -234892
11283 -234892 -101672 104666 182469 -174242 -307594 62643 -104563 -265087 34884 -310020
11272 -40391 -54991 -14777 161887 349245 -290599 -29317 63874 -193701 -278254 -112413 -207003
11261 -207003 43673 -291051 -128022 40356 -223141 -352616 -158968 289893 -152337 -81020
11251 -81020 -147964 169954 230742 208793 -61773 94980 35408 -87103 -179031 -29297 -76880
11240 -76880 163344 -203069 314680 508278 -7774 -254140 -28187 -75061 328437 -91722 -253466
11229 -253466 11257 -105790 64688 -63632 8907 209216 138439 152648 54815 -329322 -447062
11218 -447062 67586 -228861 -26563 58668 -129104 -160721 191337 -17632 -2639 -205955 -7953
11206 60795 -328044 197994 143893 -88198 36781 -114903 -254118 -72115 39517 -201690 -194265
11195 -194265 -32089 -225736 502623 134298 100618 -197188 -178748 -285094 -494425 70053
11184 -19703 65670 -3507 -200100 -531365 30642 123116 314911 56643 -163940 183087 299307
11173 299307 32043 -146844 -64993 30868 -9500 -11384 84676 -231644 27784 -67039 -191912
11162 -191912 -137549 79441 103061 919 485588 6324 -62257 -394632 106308 -300533 -104906
11150 -36957 -30733 21078 -276728 -30638 63953 -139895 -186038 -219860 -343695 93969 -189039
11138 147884 11069 -42972 -188421 -86767 19184 326221 -118052 178318 -133791 55014
11127 -99000 -81724 -222637 333096 341127 25920 21509 150366 -150277 -201690 101513 102598
11116 102598 282280 198296 173163 196782 8190 -279194 121432 -167334 -226125 39071 129757
11105 129757 -39884 202072 72638 59936 118102 286560 111406 446968 101703 -122748
11094 55141 134959 321842 149321 259924 243317 106090 236102 89212 369078 -71235
11083 259987 178664 44105 399296 78819 537594 -6798 35671 422679 -153289 -11695 120273
11071 -80656 288822 236635 213528 126728 37022 155865 301713 35100 664043 367389 465991
11060 465991 572932 401120 466031 436730 747364 852572 552171 848321 632170 567367
11050 567367 646216 578343 425497 625525 266214 720580 573227 944634 592087 535778
11040 535778 714435 696251 1023227 780540 747935 636068 355058 663880 729518 503793
11030 503793 483274 672518 854216 731184 661581 546454 832771 521680 800389 262005
11019 527630 736658 602739 674348 777235 751946 205260 746430 626784 670096 383096
11009 383096 354709 745493 222736 721295 667002 156092 479342 791319 974570 672613
10999 672613 650466 1097856 877516 1014101 735131 790888 700370 705564 725090 821349 718747
10988 718747 788407 964601 869879 1007207 836851 969412 988373 983012 1266552 1402722
10978 1402722 1175168 1499840 1694121 1864372 2000492 2672726 2821807 2461137 2604548
10969 2604548 2345840 2167296 2352845 1978526 1713737 2153485 1952168 1566463 1708010
10960 1708010 1644430 1897539 1516261 1817112 1711651 1875029 1839149 1475646 1666006 1275930
10950 1275930 1054339 606589 1018243 595646 667863 384238 182920 331215 -1444 207864
10939 -169388 56548 78783 337792 117264 234023 80809 83035 -99942 302239 -92852 150921
10927 127819 -2168 -213094 101966 -256759 78773 185827 61143 -318388 250658 264705
10917 264705 89796 451204 -111296 62511 60607 7589 153757 -100039 127310 78120 34082
10905 -366919 -230864 10182 -157482 -529348 44553 -253169 197759 -41405 88226 -322674
10894 194110 -36711 -71857 82629 -21050 -62632 -58863 -163153 -31642 -6241 -51738 -308676
10883 -308676 284174 279031 66626 -28291 -88660 389787 21381 -220395 -247221 221098 1528
10871 -157038 -126782 -67098 -87440 -175037 209375 -176187 -552584 -202 17306 -16470 283221
10859 -351917 524662 -104121 -37186 218456 71853 -281171 -79348 -359395 -37156 -60676
10849 -60676 -42463 -100239 37460 -51802 -75158 120208 -319551 158278 -153657 -195017 272507
10837 202124 116237 -223286 -19179 -212581 199069 -57016 16731 -86413 -392989 54822 -54446
10825 3311 -209816 -97863 -383912 26126 -117905 -81058 -72546 118156 -40162 61840 192991
10814 192991 101728 153557 -5414 -381057 61973 -39981 -82025 -40709 -179419 -177835 -10252
10802 -377000 -82769 -119602 -9991 1091 101595 50390 -140629 11628 74334 -268902 -343463
10791 -343463 -207798 27377 209713 -55204 -261969 95266 -228111 22590 -427762 -179111
10780 -413460 -181587 -344616 -232242 -258945 387893 57036 96395 -311066 -335804 -259667
10770 -259667 274769 455264 131916 -25503 -56605 -58936 -117751 -138397 145885 84352 88100
10759 88100 58121 101974 306856 -207945 177334 165477 -25535 68616 -309238 -193657 -12419
10747 -20078 -450663 183157 -155217 81407 -136489 -352429 320551 246363 -4549 142292
10736 -1773 -345423 173363 -5829 162309 120411 -218192 205164 -155335 98731 -68520 172166
10724 -95121 -35184 5818 147875 77262 -557051 65046 169872 186190 -57472 -74264 75756
10712 -182296 108389 96290 189150 104136 -54625 -237907 83713 -101024 -228095 151013
10701 -449278 -197406 96447 52307 194678 139966 346904 163704 17437 -211504 96595
10690 -119649 -236884 -344474 -268904 34871 -266703 -428545 83400 -138000 106443 -223561
10679 -129055 170533 -77864 -135932 24034 -93322 -386433 441293 -172852 -481787 249517
10668 -98807 -191601 41936 34992 -264790 -171747 -169089 -86964 -81602 -67051 -88168 -222191 224112
10655 266982 -351984 -76320 -132171 -112887 -256539 -344354 -34051 -153164 61717 -61091 -149433
10644 -149433 -151401 -326085 147705 -139173 84782 -29346 -71697 -316437 -155015 -242337 72288
10632 -223225 45388 9581 -252506 -436546 -429138 -167851 -142678 142555 -178973 223462 -181190
10620 23619 -154163 -64495 -361939 -178385 -77477 50671 -212483 -252257 -188293 -66757 -318270
10609 -318270 -54657 -23346 -345797 73986 164218 19986 -335146 57472 -383256 -53730 -69804
10598 -69804 158647 -216680 -243616 -73762 -90487 -363133 -96652 245934 -237779 354580
10587 -59362 170239 235699 -203131 -61395 -141027 160832 127836 315328 -288975 100822
10576 -274371 -481251 413433 45160 -414751 238253 -412354 -99774 -77811 -97253 130293
10565 -103600 121002 -51210 50894 -124305 -121962 -139085 -45049 216266 188704 172094 58160
10553 14908 -168202 49071 -55069 -258461 156843 -84068 139531 -118110 -408449 -330377
10543 -330377 -352818 37988 -168209 123336 -170074 -504263 149388 42292 -267188 -53896
10532 -30276 278679 -280701 97125 -28906 -101270 87276 -182607 -233522 57543 -171463 -18221
10520 -103699 -139417 -26322 -184230 -8848 158578 -130957 176247 31001 243781 -140816
10509 -17242 5961 -206782 -180536 247517 -219954 -2335 -107399 56354 115035 54060 -58675
10497 177976 23618 18168 238057 -79881 369082 -85530 -29061 -6857 -36025 389164 -328985
10485 -102271 108690 173178 596631 307459 459135 424441 494780 149632 207162 230636
10475 230636 -353016 -63288 15906 15435 -96021 21014 74157 -93327 343103 34836 279028
10464 279028 -213102 377311 -239222 7140 -54905 24610 -236007 -92732 -34454 218553 353142
10453 353142 -70714 -189260 -153632 99438 149721 -106814 -386171 -233966 -45422 -4743 5845
10441 -263859 -402766 51430 42161 64388 156251 45116 -124726 -259847 165933 24215 -147561
10429 139675 193365 -305879 -129003 -169042 2358 -3333 72419 -173277 -65416 17485 80444
10418 80444 -113204 -20095 106364 -201406 -324146 -80399 287413 24148 -151040 -254008
10408 -254008 1251 102052 -3640 183259 -145932 -101194 75934 124586 59244 -17175 -1446
10396 -12402 62683 37822 30380 158110 89167 40303 146673 159968 -99672 32516 -17276
10384 56788 -149966 -169758 279406 371241 289014 200980 69182 204141 286618 145686 172352
10373 172352 331600 196189 693876 352049 450367 529005 284802 398995 448275 422296
10363 422296 75572 104114 319975 126873 294494 142790 191715 46100 -84340 458611
10352 447606 201124 325124 438384 558229 360979 171032 444296 383464 24574 419093
10342 419093 82232 154369 170382 438488 52905 313403 -133316 112001 268264 75270
10331 -169835 -9524 280287 -114755 -13748 20233 261205 394612 -258918 -115698 272854
10320 307364 320315 293504 -154284 76518 139686 313813 -18740 11696 12946 228074 140130
10309 140130 120607 -29146 -51115 231925 237812 -281468 -54510 193253 43125 29475 -146493
10297 -97616 -151974 90174 64843 327504 41481 -53100 -21961 77848 -70891 -147034 -69622
10285 51307 -143444 155114 26384 216210 -223355 -8877 -66405 23623 -116406 -314982 259916
10273 100796 44066 -22644 -54272 137104 104886 180841 -7342 310288 -282275 217006 150060
10262 150060 215160 -114711 243819 471142 108621 401104 310370 128259 258519 -40539
10251 343909 -112254 -440756 76965 -26151 -76542 -40686 -308101 -243228 -271511 -53268 36682
10239 144495 -234262 131142 -316992 -187859 -336806 -204181 -107256 146059 -73192 -185692
10229 -185692 48241 -220887 114595 -166008 -35046 18380 -25901 227672 -33346 55697 -182372
10217 -160209 -141128 -104762 14881 -32729 -5470 235167 -115206 -155942 -248019 -215521 29834
10205 -264645 -59881 77058 69789 -308709 6265 45107 -137031 -24066 -48099 145942 -103642
10193 -322825 -175158 -12973 174616 -132428 879 -143456 -78437 -63292 -219458 -116636 -157489
10182 -157489 -6787 -225345 -241329 -364286 -235857 12789 177230 -337185 221458 235202
10172 235202 244855 -157152 -171445 -143311 163948 -133209 108388 -295106 -126085 -158509
10162 -158509 115264 5096 89725 121087 -72859 -81027 -318517 456531 -179777 -114477 -115464
10151 -115464 -32241 -253087 -10191 -56158 157842 64608 35286 -66916 152854 -174641 -252626
10140 -252626 -32051 193766 132039 64202 76604 -191408 -116955 14689 -202641 -205351 3369
10128 178102 -356141 -213796 -175809 -32713 -395023 -77034 -33659 154304 -6427 -48614 -24470
10117 -24470 -67497 39165 134341 -432393 -53595 -16979 225969 133446 -49282 39677 138911
10106 138911 33409 10560 105583 -91871 -105648 -188409 -150216 6106 -323352 52581 -147312
10094 -365743 -269209 -41391 95714 -241169 -47942 -85908 -249621 -28948 298462 -179555 -143777
10083 -143777 -97067 31823 -494887 -2281 -220428 -43976 30959 -182788 -122537 -104328 -110257
10072 -110257 214719 9311 87069 -130605 -165856 7042 -310271 -31059 -144698 -183983 78558
10060 178147 -475762 -114907 -387383 156296 -218555 -38997 65152 32643 -11462 -98694
10050 -98694 -187834 -217644 -250205 -124697 -86505 63385 145480 -142397 36105 -152072 -177200
10039 -177200 53335 -385906 87738 219045 -257150 -118590 -28232 89904 -6506 3032 -261066
10027 -133450 -203012 15747 247997 -463260 28464 -441094 -315470 74335 -110402 44305
10016 -81042 -120972 -323427 -216159 4475 58346 -233703 -135602 -418238 -541847 -267463 21733
10004 10907 138317 -153485 90176 -171733 79305 -216163 -263045 -455508 -51095 -203385
9994 -203385 69581 -11160 -37088 -307739 -76132 -169841 324945 42422 26172 -265991 126555
9982 -9975 -232821 145736 23141 82933 -70893 212301 105903 71857 -504165 26986 199217
9971 199217 60912 -45323 -133566 61219 -577 359751 -124089 141741 -62229 -237177 249545
9959 -39954 -84866 138046 23052 150873 153350 -119678 -9162 84066 100722 -237190 -179566
9948 -179566 180127 -13970 -171794 -224811 -163495 -16387 -56572 157120 201600 156818 -9257
9936 214378 -21452 -1222 72846 -112585 65251 -445805 -352993 -85083 120351 -93100 -95708
9925 -95708 -112764 -188546 57878 -120569 -477 -71323 13174 -481910 -106166 -66842 -29155 -301807
9913 -301807 80760 267810 -114218 -207373 -327289 287067 243917 309974 60848 -69543 -214014
9902 -214014 -427426 54056 -348215 -21802 -61784 -380580 -31136 -172734 -285990 125560
9891 189607 24584 255782 69542 -90826 218421 -64166 79637 4534 -147956 -59905 -225425
9880 -225425 100895 -158729 131340 -8535 -523488 -194355 1927 -604754 163123 -244437
9869 160953 -273607 -38834 -250806 62767 -103631 -144781 235494 -403829 -110068 -10152
9858 125470 -159879 -159871 -65918 250681 -394958 -162850 22237 -154233 -166200 279508 -52270
9846 135413 -184407 165121 -94787 -110558 -57810 -485956 -55576 28401 -64914 1346 -255949
9834 -228735 60566 -258080 64902 -57209 -90995 51793 37270 -246406 -233091 275153 53347
9822 -41604 65928 76191 -238574 -138815 -178598 -295818 208008 175041 -87220 -177472 -100111
9811 -100111 -118616 -64476 -220693 -80053 -219361 117235 -279745 -138896 -66541 205050
9800 -18040 -248198 -482415 -400471 89425 -280147 62518 239312 150300 219361 224163 -161469
9788 -39362 49810 -8952 -4154 82407 -157700 186415 -233551 88816 248521 -16135 -146552
9777 -146552 28235 -124320 -147958 14208 146831 -59209 -415800 -89898 -364543 -10275 -71557
9766 -71557 121777 -18568 15141 -13316 100785 162608 -10782 -27078 154607 7317 99503
9755 99503 20696 -251566 -105714 94272 -288135 189207 -55540 10285 204505 -46520 -39192
9744 -39192 83844 86749 -58460 -34709 -165944 74769 -143263 -121097 71854 -54465 -23400 -54886
9732 -54886 -314592 -159722 -536358 -131949 -32846 -98375 84348 -227197 -236358 -54465 22661
9720 -55182 -216167 137612 -25369 -10574 -482207 -370248 -116077 182737 234678 -267656
9709 -166377 -134264 -196754 52415 -59199 -369498 147947 -181302 170025 -249969 56815 -428838
9697 105018 105633 -150485 -162404 -184628 21687 56385 53893 -40167 17656 -343638 -179652 -58748
9684 61132 -305518 -267195 106042 -214298 -26444 430712 -205775 156926 -1998 -269715 -86605
9672 227831 -39932 7432 -5250 37810 -365764 32740 -123057 59362 31890 -164700 20760
9660 -7701 -59836 -300211 -90184 110630 -252577 67955 -371387 -138222 -70059 -71656 -43529
9649 -43529 -213358 -169217 -156222 -242904 -245029 -35242 115426 1459 -29929 206482 -338645
9637 -20831 -15289 94224 -189579 170965 -147093 18299 -60551 151790 -226392 36522 31328
9626 31328 -184713 -258552 82787 -174478 -244814 190076 475109 -89262 -455507 -106772 -4506
9614 355141 74920 278118 -163048 -33099 -225351 -238718 -144184 313330 -321069 -106756
9603 169318 -84500 -193505 35391 173465 -28383 -36951 -119141 -69575 165850 -69640 -81587
9592 -81587 181602 -50017 -89731 65637 -255671 40531 185017 -258669 200186 -24902 281477
9580 6003 -183610 -160666 281193 -45584 -292493 -145527 132861 83942 19837 -107460 198931
9568 317968 -327417 -18414 955 70025 181402 -224716 163625 -140358 -343381 62492 299678
9557 299678 -7892 101989 -11479 -23439 -230446 -43137 -63800 -287025 -138789 -207159 -32290
9545 -130547 -380084 -396279 18985 71615 9756 130270 138571 63090 101362 254658 -202959
9533 -226703 -44925 -449 25410 -51862 -84589 78840 381674 42576 -183691 17583 -83423 -262239
9521 -262239 -179581 -59611 -13574 -47787 -224976 -75688 -98313 -169550 -70595 240224 128680
9510 128680 69726 118188 -33618 -179460 84513 71131 -391891 162348 -41651 177886 276697
9499 276697 -50520 11160 -235794 -46636 -174574 90354 -67181 187884 -334207 -186339 28632
9487 226220 30021 -180344 -21517 -178812 177476 -139524 354815 -211503 26301 -27853
9476 109257 502 66611 282364 -264947 -198515 101442 31355 -47275 -67751 -129317 -148309
9465 -148309 -170667 -322935 -185988 32968 157001 95288 -108652 85204 92407 -127083 -229999
9454 -229999 -192795 -177248 -237143 -96135 -297919 30813 -173060 -359226 -183922 -56559 -57506
9443 -57506 -256993 18888 103873 51983 34049 141460 34781 82259 -189288 -122823 -182130
9432 -182130 -187013 285818 -19968 -104384 -239297 3027 -339799 -173803 -278935 126590 -81294
9420 -51476 -91382 -44516 -357076 162278 -81046 -438015 -329909 -113955 -32412 -237659 113145
9408 80611 -462687 -27865 -141146 26096 -120823 206389 -26811 38469 297025 116059 -226477
9396 -166579 23484 23797 -148125 89867 -419840 -401893 -101726 -517180 27213 -395088 -147362
9384 -91187 143961 104749 -94510 -357624 -106097 -75215 14548 -192063 169422 42634 -185725
9372 -276055 -272937 32164 -55925 -93482 -139893 209875 81172 -105088 -7983 -186782 -115609
9361 -115609 -93205 -133874 -271215 -443477 -11337 128048 -3077 72563 -172683 -272946 -103277
9349 -226167 -144000 196613 -175926 -407605 -263653 15070 28555 -32561 -302634 -141959
9338 -382453 -214119 -401132 -137584 223932 -459427 -219954 99777 -100040 137512 204510
9328 204510 -165648 -156230 -88117 200526 -231116 182463 -223845 96892 -293303 -23532 -260230
9317 -260230 -77837 -51906 -42721 271716 -149281 -256033 284823 84613 -153175 -236582 -97916
9305 -229350 262349 -2429 25816 -192232 -210467 83685 -123756 -301707 -125514 -264224 7388
9293 106516 -22805 -310906 253045 -2371 -127616 -130130 112385 153318 -258275 140397 -214407
9281 109099 50231 79540 -54252 490799 -233696 229051 -106297 34479 -107217 -122603 -201872
9270 -201872 -47664 166491 -206280 37522 -162012 235676 200067 -14087 126996 -193565
9259 -240312 106922 67783 -47221 66665 -177437 -131341 119982 279726 198268 -93117 -31046
9247 92025 -230377 -253077 -172080 53097 194426 -135118 144624 237498 -220502 -15249 -96550
9236 -96550 -226852 -179744 -247610 67667 -494128 -158313 -359962 -18318 -91021 124491 -212787
9224 100780 -418116 -90027 -10715 38233 131406 -17746 91264 -194056 -217437 23204 -183476
9212 366875 38985 105561 -260050 -14862 -112551 -277251 149899 -70931 -183195 39841 333452
9201 333452 -3062 -251588 105742 17090 -159462 230696 -9438 47218 280770 56241 80251
9190 80251 14763 -175938 -138431 -53224 -243389 34509 336074 -69150 42454 -316002 -147379
9178 -40901 -254157 -222837 152330 -62278 362811 -298580 -120466 -231063 -113153 314639
9167 -43707 224390 64320 -119474 -102886 157491 -180484 36160 -451388 -113249 61983 -258645
9155 -124441 -103981 -399632 -21201 191681 -206238 -286905 -81083 -257831 206355 -57795 -233833
9144 -233833 -84121 -70542 64875 -303614 -43731 -160280 84957 -253533 -165928 -161180 -59413
9132 201510 -243308 -41495 -217227 265920 127221 -238397 -197756 -747025 -70306 -398082
9122 -398082 120035 -186012 82618 -276377 -299621 -26667 449834 186112 -114370 102278
9111 95141 26225 -131071 -185452 -154448 -176039 -200829 -167620 308534 -123426 -310286 -233598
9100 -233598 -120537 7694 -143923 190160 195494 -255030 -53634 -201302 -196452 -66532 -222621
9089 -222621 -6589 -167606 50383 -214396 105766 -15034 18661 -85811 -130513 -530217 -89634
9077 87288 165473 21049 -522866 -266679 -91918 203406 175456 17192 -135479 -176643 -85506
9065 -5773 -13423 -99862 -3143 -147431 69680 -65180 957 6341 -98219 91463 81702 103424 -220229
9051 95826 -48572 -55610 -240056 179325 179530 -136908 -97264 -249581 -168173 204508 184769
9040 184769 157804 -8676 21033 67470 -240196 -173222 30384 -40684 -283334 119524 -113504
9028 -48361 -304206 237181 205024 10019 216154 -351890 74342 -346242 -48164 -365747 100511
9016 164685 -187741 35707 -38774 90410 293887 -52195 50450 183406 -255851 -65897 -137126
9005 -137126 -38436 134444 8384 -332259 139700 -207436 -55387 323260 231631 247074 -170552
8993 -151741 -143723 70268 -86874 -73744 -134549 -28637 254391 -126391 160299 -250212 -269894
8982 -269894 56407 42218 87316 249860 -396473 -101230 -267041 123133 -254577 -108851
8971 -115298 -259214 111788 -19043 224069 75981 28017 -92240 150611 -107363 -330528
8961 -330528 -2406 -123069 46575 43739 -54471 190779 187983 -184831 -220787 -237225 113208
8949 -249001 -79715 327414 -159930 -228256 -141148 21266 301491 -182627 -71454 152965 10836
8937 53948 -165837 -219449 149457 -90504 326182 138191 -261510 -151473 -75120 -156315 -101326
8926 -101326 244191 292974 550938 2222570 7923323 10507642 5367778 2098608 666519
8916 559824 154454 220748 101844 197235 -140428 -229530 -56372 -109069 316012 285803 -30111
8904 315117 -264162 -5365 44022 272106 340655 -102701 61768 -116441 -236777 -109820 -33020
8892 -93661 -80281 -4811 -249185 -427981 13257 -109887 -187011 -147247 -333859 -127520 -257893
8881 -257893 -129375 -186867 -237798 -317671 168159 -204295 212767 71790 42552 -264973 -33890
8869 -53521 -365506 -344311 46105 58073 158232 -62118 184242 -453492 214434 166783 -86647
8857 -281443 -41911 -139830 -140456 134427 -117654 -256257 326728 -88575 -44993 -140343 197302
8845 151131 -154952 33437 -159973 -92076 -70593 97815 -182869 -118475 -158723 -59409 52712
8833 -368023 -227466 -20306 138443 -35711 -51722 139303 61127 -68252 -133501 -43189 -23684
8822 -23684 -393684 201771 -25001 74573 55816 -14737 221403 305272 -163651 75316 -109203
8810 -92342 190868 -70186 229024 167805 363091 -311740 40314 102065 -89576 103519 257180
8799 257180 -45566 39243 -24222 310743 -154405 -238460 -110727 154475 -112420 -346857
8789 -346857 -95135 -202945 -340262 -56938 69039 -386146 -36851 -441217 94851 -296107 18895
8777 -205253 -377409 -28935 -375043 167304 -207863 79147 43037 43082 -131345 -48778 -96054
8766 -96054 56434 -180725 -243255 -19695 90185 -153326 -229007 76621 194636 35212 15377
8754 -20584 350471 80964 325536 116872 26357 -48064 82402 -48052 363615 -56598 -167031
8743 -167031 -137559 -198268 -124594 -59535 -259139 354240 110015 -219507 -147005 31386 -151196
8731 -133009 -393327 -296433 -189312 -384427 -70350 -52937 -42763 88665 -33587 160845 28181
8719 -69612 -265586 63562 -42051 -4135 -214691 16601 -244734 71640 -29676 -122043 50518
8707 163719 -243419 169686 -101592 95791 118977 16430 -113601 -185516 32156 283358 -43016
8695 273425 42254 -101349 -155709 104995 -255497 -202260 -138213 -39776 -163714 -426312 -261121
8684 -261121 174323 146063 -98784 -28690 -68619 159203 -453636 -107148 -29677 994 -303776
8672 116599 -171987 95030 -27874 -207015 -152021 5356 42621 85169 -145931 -229609 -100125
8660 124790 -299075 504787 -225740 -493565 137808 -335702 117614 -359890 -3852 -270985
8650 -270985 60546 20492 -287428 297581 -162712 84364 -326072 321237 219851 -46091
8639 -6032 -68577 131915 28298 -215870 82660 -211552 -36034 -259388 -82489 148881 -220473
8627 -355829 393910 -240335 -223571 100906 -157572 69255 178610 -379156 -93389 -78156
8617 -78156 17394 -46592 -86336 -118672 273978 -324614 -42241 61517 129666 -60974 -170374
8606 -170374 12794 -111005 -183585 -435057 -190244 -149184 -131586 -589820 -179433 -16493 -152769
8595 -152769 70312 -7857 109453 296498 -338501 94962 -35189 153516 -6407 28346 -313846
8583 -128898 -99823 86174 -140194 -365776 158561 52178 -143229 -295025 -54406 -371705
8573 -371705 105405 93102 129429 -306781 -49320 -268335 153238 -197732 -184911 -617470
8563 -617470 41084 -89718 -58057 317619 78567 -283988 -214169 116714 -200470 -72988 -245826
8552 -245826 -29903 43708 31005 47753 -62891 -48102 20256 272177 246442 -40794 -86438
8541 -86438 -22307 -137573 -170900 -139894 -167014 213395 161943 -245192 -449369 67488 2773
8529 -59582 -251566 -315885 298368 164524 -179181 87492 13984 177319 -229416 -315327 90367
8517 -313840 83483 48777 214493 -202706 -143331 -281456 16294 -326470 -120492 -34546 -132270
8506 -132270 -131978 -301269 3096 -258361 -106992 -124103 65035 -140990 212477 -302513 -16503
8494 295592 76410 -135713 -132169 -193605 199858 299595 22517 519 -21482 -158814 -110907 -124353
8482 -124353 154714 71109 -143555 117502 -152791 194374 -53388 -119609 -76690 66538 -122882
8470 124388 -385930 11673 38462 -155388 149293 -206181 -48463 -194617 -293584 341385
8459 -159413 203575 -21764 -129283 -110277 13651 -127921 -281818 184422 283048 -150591
8448 -31077 -231383 -58033 272848 48212 -208132 -163550 69177 244110 -10400 88152 -217749
8436 -177530 -63049 28070 -309727 -226645 -142426 -163838 -199296 48268 -128032 72181 -2085
8424 253318 -167531 -74318 -453359 -20240 57475 246017 -50434 -125339 59762 -20228 -358514
8413 -358514 84265 -19015 -263239 -357908 -293744 -154565 674 224496 190846 39050 -211104
8401 139381 -66778 -8059 -359445 138163 69301 -56009 114749 25909 191310 -217887 -77541
8389 31828 115940 345034 372545 171862 -30673 -301 309356 -137949 -50576 211742 88708
8377 13759 151685 144502 -302388 50552 -98661 288942 102284 -345333 -85979 -147766 -275081
8366 -275081 -312162 10175 141479 149551 97411 -21082 -254537 -222895 363465 87699 167631
8355 167631 -286777 -12525 -79496 120775 -170554 42814 -147866 -455310 323148 60890
8344 -168168 66305 40768 -245078 296988 -18086 74426 259178 -267617 100332 -17780 -137707
8333 -137707 41956 -164463 -146432 4603 109746 66711 67398 -160187 -264086 21313 39670
8322 39670 23638 5467 10720 -151672 169897 -87686 -220706 -411869 -30562 129 -71677 116174
8309 -3066 -71825 -77840 128048 151281 -182934 -256032 -77895 143088 -113133 -65180 -273149
8298 -273149 -95342 327896 -255041 -24077 218811 194289 -32548 235778 212551 115249 28255
8286 172722 61296 -76328 -92401 -234495 -128313 -71546 -60462 158779 132069 -234492 -241882
8275 -241882 64312 -90204 -187622 225837 13233 5987 -117243 298709 43679 169030 124916
8264 124916 -328630 97327 20485 195032 -137475 -255243 -310395 -238802 -312568 -151639 -37046
8252 -362647 138409 -216239 -131942 -4355 40855 -281043 -12911 39120 -36779 28605 -224212
8240 -114706 -292516 -171829 -16871 -478062 -13039 31589 -128650 42796 -74010 80158 -69284
8228 -278472 -89363 26630 60772 79682 -169827 207032 -21 33370 -95095 148725 -201601
8216 116273 6347 -116321 -57509 -48831 -189185 -147646 -197763 27418 97987 -28419 10544 -190590
8203 -362013 254650 -35494 -83806 173292 -362959 -184062 -23715 142012 -160125 341332
8192 -213600 -153359 -58809 140365 16637 -76795 -96774 33520 271103 -117981 -76987 36291
8180 120194 -57010 54760 125433 381 3180 139325 -178440 -160648 127350 199601 -95891 -307661
8168 -307661 -444275 347265 -114191 318679 -196207 -185905 144104 43117 85588 -166670
8157 -136211 146252 19911 97596 -246676 16439 -14552 -267096 129357 -155123 -89382 8657
8145 -222492 -123102 94257 62836 -240108 -261650 -53469 58251 -187184 161474 -99968 511805
8133 -117383 235792 85294 22493 3740 -549185 5287 209126 6315 26690 44008 110508 4502
8120 -88139 -54392 54161 -84782 14210 166845 22715 187174 72108 -32890 -170675 -81253
8108 -80027 -95924 11401 -93535 -87591 -47339 -183790 -307048 121079 85786 -37222 23613
8096 -242676 -270482 -148050 -166029 122260 39644 -161911 -89973 169906 -241676 -42824 174852
8084 95025 10030 -34433 -314312 -6899 -83688 -226331 164791 112401 -113830 -225589 64003
8072 -433141 -293471 84261 -178680 1020 -71200 336873 18465 -378188 122809 183309 375497
8061 375497 -177348 89102 -246033 339340 -13088 -57464 -169983 -54139 174541 -237146
8050 -150601 21550 -196589 78498 -56377 -359594 103378 142541 195381 -14448 342693 36631
8038 150279 153376 41805 -205424 185269 -227317 89193 124644 176382 -38504 -177642 103331
8026 -136689 -187111 91299 -584054 -23521 -32489 395966 135264 124418 69908 -34867 -63742
8015 -63742 -97392 -11163 -73683 209520 -56456 39667 172735 22118 -70201 270755 -210263
8003 86532 96776 -105655 -175549 38291 -177148 -24426 237329 35371 -57839 161323 -240191
7991 -358769 41086 -88266 219128 57168 -257959 -96291 163101 -102857 80535 -251833 44568
7979 145376 -51393 -189047 59244 -331751 -51163 4247 -317362 -131879 -138634 170086 49746
7967 193541 -62423 23045 -252505 -145511 -363260 273082 72139 -254810 -122588 -19019
7956 -29739 81453 323388 -92935 29839 -310105 -186403 -86979 16590 -34057 185427 17276
7944 126950 -190430 -281394 98174 -129897 102333 31706 -62471 -179124 -524818 -98279 -8917
7932 -20454 -603431 -270322 -112197 -41440 124789 -28203 255123 -194472 -210418 -143848 45539
7920 -210143 25167 -43621 -182197 -306337 -146995 50642 -124715 112836 -159068 144438
7909 -42825 8028 -50690 318372 157149 63593 188459 -49768 -311221 143619 -235249 -205356
7898 -205356 -83832 -67708 -160278 -75836 -35119 182164 -43724 -84589 293972 -90584 -180549
7887 -180549 205103 -65833 -82991 149369 14465 -82760 -104281 -266237 -64205 119960 -123059
7875 86956 215824 -151018 88792 -168459 224741 39446 -263395 -105038 -277512 208003
7864 -97769 43947 104948 -236857 -154395 120410 111508 -135135 -132060 187417 -293686 -21881
7852 38953 -180985 133218 -107002 262414 98774 -303924 -133218 134950 -98609 236662
7841 -79437 94373 -42984 31288 -174065 5760 -42686 -101399 59490 206017 -126631 -54231
7829 -66907 131389 54208 -307815 -35226 24107 -270863 -49020 -26033 -24223 -188489 -167343
7818 -167343 160445 -71028 111491 -202470 -125354 -350652 -159085 12760 307615 4996 -388968
7806 -103272 -87501 21731 -144755 10169 -86333 27572 -140372 198287 -237129 -63103 392613
7794 -91155 -283065 -32039 -202662 -216161 -230865 -149304 82520 -186813 206426 125053 -76118
7782 345188 -93560 -46821 -164066 -174442 187941 -100820 -27204 112102 71541 51051 53636
7771 53636 165621 -121714 -113848 -310986 34800 229570 208918 -125278 163639 175866 -95545
7759 -68050 -44372 -339415 -232406 -64482 -343546 20020 -44495 369554 -116480 -160858 -247363
7748 -247363 -7394 -24195 229362 -170475 328807 121538 105315 52347 -291045 -16305 -113760
7737 -113760 -301754 -28349 12207 -98558 97616 -69661 -217399 6536 -146729 201111 -123051
7725 -195148 69054 -2283 107686 -123255 -358171 -458170 153733 39333 -201492 -342601 -70173
7713 -17412 -64587 -150411 184494 -62631 102433 -198218 -31118 190528 -37613 -63643 -41654
7702 -41654 85801 188684 3876 -172471 -192489 -52487 389631 278170 82522 119982 -68946
7690 21473 -203203 189725 43053 217140 67440 -65240 -104566 378646 117071 -161533 -155680
7679 -155680 -152785 217439 134353 38269 -32290 -120535 -53591 -231449 28603 -1538 24210 -20781
7666 -13597 -124708 -108699 -79296 7875 -267204 -71837 -252710 -35411 -82654 -218393 -25510
7654 98587 -285308 -214124 11198 236551 305723 -103935 -151815 171167 -47540 -28519 -254091
7643 -254091 -7126 -257456 -247885 -16081 -47221 -267760 -41558 -219815 143312 167496 466592
7632 466592 -269375 5022 -120663 -96166 -50561 159893 258085 -54237 -236197 33866 34479
7621 34479 -113330 -131428 -183200 -152620 40232 -19739 70715 41912 68619 -64312 -26040 124207
7608 46760 -34836 150120 -235654 226476 -143341 54177 95077 -193086 92069 -163478 -136048
7597 -136048 418998 5897 170261 -42344 -274437 -23095 28737 68123 47132 -1546 117888
7585 -83591 33712 -148400 -149967 157702 12933 196766 283458 -130670 35173 -81827 -186037
7574 -186037 -283452 201564 -214171 -144258 -162345 343902 24832 -202723 74699 -10418 21958
7562 -164074 -87308 -118897 -20197 272267 43277 -96815 214839 -71791 -167037 5371 -98156
7550 -73959 -9189 357563 -224816 -87626 80181 -147517 -314047 -188742 155496 3518 -38570
7538 -156348 -159462 111680 -151582 -209766 49061 19185 253773 -179973 356516 -164925 -148170
7527 -148170 -292836 -40495 -98749 -554642 77831 139253 119936 -183357 -292782 150491 -218426
7515 -146362 -192295 109364 -133960 16361 130403 -389686 225800 -42478 263097 -70054
7504 336716 -160164 -206759 -274539 -94336 251996 -258610 122903 -53734 233995 -121114
7493 330098 242861 -208224 -83298 316234 -179771 -173362 -153067 30961 304653 96347 20965
7481 73413 158393 -2268 -11563 16624 -207975 -257246 126305 115948 -129109 177638 196503
7470 196503 -90932 -235999 -262504 -259422 -67625 -259189 -320749 -323406 -238519 -63683 340254
7458 -66444 -15643 -212649 152960 -164391 115574 76393 -167375 146816 111491 160359 95076
7447 95076 182410 -3052 -68021 67559 -78350 -1806 161769 296194 -225925 272199 201635
7436 201635 -191877 31588 289812 -314752 -16216 124575 -185443 -94616 -123985 -37187 -128159
7425 -128159 105815 31668 66253 -212699 57855 229556 148563 -420664 -71474 -99859 -81766
7414 -81766 14388 -102907 20190 -8176 -7488 129936 -174608 -69443 254500 143837 330437
7403 330437 -72210 163259 -58159 -35147 -139636 221059 -42800 -55468 -115383 49440 76399
7392 76399 -251686 -63248 -98973 -239762 11563 -26084 -177190 -193216 -149979 271572 156443
7381 156443 -95994 -53317 76576 200546 90128 -204561 -98499 38318 62923 -38202 -109237
7370 -109237 -277013 -250069 33545 264969 160494 -299620 398262 -96493 -49906 76582 -102031
7358 -199363 42612 -305337 -152729 -25196 -145559 118865 -29371 -79998 9268 345756 -134831
7346 89343 -78178 334168 118734 -56258 67749 124959 301799 -447501 -35584 -8034 -62646
7335 -62646 -96726 84731 -40505 -153344 -44 -7028 217071 -89191 -241349 -27770 -80168 -346777
7323 -346777 -171565 65895 -104596 18543 186802 -173872 -38634 -82122 -162105 186361 -114088
7311 -68857 133645 -417674 -134155 291262 -40603 -52711 184441 33395 138501 -104712
7300 82929 -199660 147282 60311 154064 123258 -135615 -237271 -134896 69 -206373 123373
7288 60585 -60909 25858 -175969 -112030 -288632 -191926 -294786 -93161 533303 120209 58634
7276 -44743 48968 -124838 -27122 211218 -277099 22970 140250 73939 141163 -265735 101356
7264 -71312 265085 -132051 26194 -28141 -43773 -294477 41569 146142 282189 34727 -101999
7252 -180939 23898 -215859 274982 -230717 -53160 -191597 -185459 -18644 -223380 440166 -319187
7240 -23357 44088 -322984 -188723 69954 22216 215395 -214583 116225 -137380 118379
7229 200769 -70112 -1347 177265 16659 81054 332568 59071 -245113 26233 -352339 39013
7217 103238 -54789 96444 138512 -72601 151875 204066 60680 -177087 -43118 264224 34756
7205 14370 70840 30946 332348 -227273 -218135 441497 -101109 -263880 306507 207212 120530
7194 120530 50339 -219306 136770 30389 -49945 -128604 205708 -148124 -118212 97817 -166947
7182 -215549 -158793 -425488 122047 -75403 -315055 253073 -85322 -81712 149842 -31082 -87614
7171 -87614 -274976 -148652 -226674 28131 347981 -213607 142531 145159 -263136 -122065 -82652
7160 -82652 -324145 188128 178990 -230626 -376143 57299 260890 105468 -105801 -62476 -244434
7149 -244434 -195874 -121968 -188098 -109502 150715 -22327 -153643 110227 173295 275358 -255647
7137 -134149 -311428 129036 -247214 40531 69032 -58452 216218 42139 80392 -9761 284490
7125 -142843 21296 11328 28521 366379 -76284 177161 230109 16299 -167126 137088 165438
7114 165438 -354910 27789 210316 -120381 13569 -51579 12873 -153161 119870 344587
7104 344587 -132806 -140639 -30975 -261930 -175134 -167233 -135124 -13612 23099 -6881 274348 -60405
7091 -105832 -179557 -2805 -223613 204106 -147778 -135295 -148006 -68230 -33625 329434 -71622
7079 167329 54045 297801 309882 -42690 235822 36518 51763 -72977 -78881 -51155 81535
7067 -155092 -243923 183362 -44153 -7809 -154118 -216802 -136804 354411 236962 -147289 142264
7055 30267 -24805 249706 209528 62774 3207 64012 307730 128701 -162060 -218342 -93957
7043 -84483 -37912 64798 70173 -220417 -183670 72808 -58042 59752 -57849 168857 70018 66710
7031 66710 -82933 145045 -211458 -272202 -146386 51428 131480 33517 -370403 -317455 287796
7019 11094 152892 -167123 176946 -79339 44393 -259109 221881 88034 98702 217414 -117774
7007 -259296 -216237 -187410 32664 -155722 -28415 205028 174120 -4358 176014 10187 -157804
6995 -277950 -14682 -86667 30180 42244 -295591 122413 305708 -93618 15528 148196 5346
6983 178363 174407 4382 116187 -29857 -124713 -303495 -120129 56493 57275 43772 -23818 -178242
6971 -178242 -104913 217491 -231042 -136955 -294055 -103912 -109690 -11921 37290 -97403 74081
6959 84928 388356 -268796 -137709 68612 -366738 -55385 -133403 72020 -286936 -53310 -373953
6948 -373953 84667 -87551 -37648 -409093 -53084 -166693 -116587 45270 -282785 70886 172015
6937 172015 -48283 -277842 109802 -62078 108801 -110139 105405 72517 -220771 157184
6926 -38766 121208 250268 212169 -175987 203482 -356273 159297 -81161 -115947 -171350 -11841
6914 -406519 -336733 3631 -71688 -12823 18114 -121849 153807 66896 -49933 -105545 51471
6902 -41538 43153 149726 193390 30389 -114934 21839 -74198 -58578 -153349 -249021 -75192
6890 82481 -18049 -107933 -3700 -413026 53677 -452635 190702 361839 74648 174104 -52509
6878 -85639 35599 5274 296827 -193103 104556 -24587 77936 -647 -207158 -255136 -50293 69148
6865 139678 -47774 -71805 -304142 -170757 161757 183661 -131562 96312 55290 80756 -89
6853 -132338 -67173 -263391 -27731 -150554 38984 84472 69471 199590 -215693 -267014 -104856
6841 58030 72149 -225434 -6797 -405150 -48926 -258725 -39109 60112 -86505 -49073 -17187
6829 131944 84557 -58520 -158825 -200513 -68014 -3183 236494 -103214 -153979 -77043 -200023
6818 -200023 175421 -32354 -22405 133211 1594 -354472 25543 -50266 232668 -127401 -17135
6806 9586 217488 -8478 -417355 -315348 24170 -18005 82482 155080 -232968 -75704 -340172
6795 -340172 198816 66454 95286 -158439 249528 47745 -8483 -49701 -122225 114015 -45244
6783 -241824 -59009 38653 -184240 134275 182343 -12640 86106 -434316 -20373 -286666 -311955
6772 -311955 114752 100610 7678 209273 -25275 22633 -233987 -61426 105671 132673 -200989
6760 274013 -309508 -44642 -146017 106431 5203 426633 -140708 -179830 111862 93861 -247388
6748 -93742 128346 -319748 -132521 333036 66120 181912 -100309 -16836 -347500 395445
6737 -406588 229343 196803 -53285 52004 -601390 -87938 15115 265844 243536 -64361 -361079
6726 -361079 66916 116872 -106042 136555 -78124 -37114 -5172 -37302 180684 25680 71121
6715 71121 -298463 212676 -89941 32579 -135143 -79823 54332 -248316 -14792 204152 -31489
6703 45338 44392 -190040 -294471 224328 -49480 -105558 107500 186176 -80771 106387 21645
6691 97452 304117 -40990 -206230 -68642 9689 -35949 -30488 -85153 222436 131028 395575
6680 395575 -30369 -144575 256845 172260 -187320 228347 -172868 408748 39447 -324222
6669 -87364 14531 -174329 68702 170612 -91888 19857 -13859 329988 532 359983 -190155
6657 -126080 -410811 7232 -188342 156355 -68360 61342 254223 -92850 -211551 -471238 118308
6645 69706 97545 246727 -314435 -207939 7179 144133 -337357 24478 -148069 28164 126266
6634 126266 -9345 424674 -391789 158350 -35932 -9024 -177356 -70566 127580 154490 184634
6623 184634 71988 -181141 -446236 19221 -55043 126942 -108070 126270 21263 -44894 -43306
6612 -43306 -127771 -123904 85346 307931 76297 98280 -91217 148900 59886 -182783 -403320
6601 -403320 -60928 -106144 178896 -345159 -87013 -301240 -168783 -323438 -48609 28282 -107734
6589 405592 -260359 8481 37060 -78726 58310 165541 94340 -212622 240970 -45113 -52608
6578 -52608 -352014 123934 -16171 -328434 -3700 16841 -5964 296475 207305 -119972 140901
6566 -8045 -208339 -156290 48748 -237223 -11894 89303 401491 -384725 -3657 -355104 -21089
6554 -352626 -327236 -10814 -188858 -48555 58021 122802 -76741 103445 71723 -140317 -92637
6543 -92637 -339081 -82383 -45755 -365269 -12180 -71412 178320 -220724 10153 53277 30792
6532 30792 -7275 235752 -63776 16 -156804 -51915 -18143 -299693 -138608 -93292 -202165 162815
6519 92906 -17119 -308261 27100 -44130 133496 -41899 54133 -14313 454212 191344 121952
6508 121952 266606 26742 220674 74178 292538 82797 -149804 -58341 -257831 241061
6497 38545 -21135 78201 -118604 -50652 -74453 137581 102567 -449971 -1921 -106674 -134922
6486 -134922 -30091 83019 -70136 -377982 61101 47174 -35075 -14986 71960 32211 97598
6475 97598 -150148 -15090 -69083 -180346 34676 36409 -37600 -40675 85815 -155537 -115201 -18471
6462 -185116 -298675 96002 48258 81260 -191438 -248 88661 32865 -235538 40621 -154435
6450 313130 -296285 51912 -162661 271171 -94592 -263121 -207542 234786 -8360 -314553 173846
6438 124284 62682 101956 117427 156941 -26858 -48535 -119988 -56199 23223 -251518 -143149
6427 -143149 62505 -490807 -8686 107294 70116 146211 -57719 -135136 54995 138246 199971
6416 199971 52817 -140974 313897 33237 25527 -180093 -256677 -210988 -167392 -93899 172911
6404 206974 195441 154829 -114769 -211178 38743 -148177 -51408 -376839 125366 192552 -16547
6392 -218387 28712 -30500 -96353 -23581 122124 170068 -88707 52766 -304623 -172570 -140836
6381 -140836 -78276 149547 110973 146496 176330 -442948 -212300 184493 152037 -160816 170278
6369 -110194 81553 105777 -85323 128857 -66812 166573 23582 327379 -162498 -45109 77803
6357 106104 94861 192724 103716 -142900 34847 -53623 -496856 59487 -23183 -96154 -129062
6346 -129062 -312404 -118597 -187950 -191482 196439 -32097 -45247 -43672 -222315 -94643 -201598
6335 -201598 207459 8644 -134810 409657 142764 59999 -186982 179916 -151751 -30498
6324 219286 -86645 -4174 -217171 261508 -96926 -218844 -23012 29186 1798 241078 -65257
6312 -311064 -103313 -4437 68450 -51508 -58123 82084 40142 -44776 147137 -10959 -43095 94385
6299 -104319 54198 24642 -160144 278447 102745 -15445 131636 -99341 63462 -56625 14012
6287 -50495 -281634 -309268 76716 -278497 197519 -295795 -53543 -15154 -161886 50129 122506
6276 122506 52902 -131637 -116130 116161 -52201 -51211 -58600 196096 83633 -143302 52954
6264 -450457 -40841 106638 29996 -152409 -86375 41774 21402 7813 13220 183010 -146388
6252 -198210 40724 46988 244350 161435 -78470 -146811 42601 -69574 -23210 87238 60757 -197218
6239 136988 -324711 -78378 32061 87601 -4951 217161 159273 -256222 29767 147399 -26517
6227 -204436 -410216 -169573 -15656 538500 -172604 -227798 -178416 13503 -16392 144482 -268101
6215 33463 1310 -74574 100175 104901 -9441 -226243 -116411 15670 189915 -96249 341263
6203 103086 118454 -286947 79930 -14093 -103712 72974 118706 -322571 -276231 -65660 -236668
6192 -236668 -142308 -156743 -153058 -137539 -49846 -150339 12668 138056 14388 -277980 136211
6180 -291781 -112147 41169 70942 -225390 2370 116823 -45956 318692 9576 -9798 -157014
6169 -157014 141710 187935 34056 -32240 -97329 -190708 212090 83205 -80041 42337 80855
6158 80855 2153 -245243 128393 3532 -53808 30082 -344478 -222204 -171895 -76320 106456
6146 75047 -428656 -214482 -192534 -4895 239683 221548 100202 -43226 -54090 122651 144519
6135 144519 -115373 -282385 344769 -293008 -42380 1110 62542 -243060 161040 44045 -679
6123 -249620 -19158 -321341 -79672 -171756 -122418 109228 97546 -42202 -2966 234386 89935
6111 -129937 170771 -9001 171978 38374 -123127 75722 12306 60966 4090 -301561 105354
6099 15644 -243887 205783 -150223 -10932 31546 -456174 55794 -119470 55458 110873 40849
6087 58978 21698 176770 343864 93930 94074 135283 34572 113908 -232384 -4885 -176241 -207500
6075 -207500 102333 -513241 -338791 89119 93639 -64487 -42661 -237520 134713 -64928 144761
6063 -42446 -49321 152837 35016 -61020 -111332 -227860 203224 335694 -6874 -135683 -94648
6052 -94648 14846 188039 158502 127193 204855 43558 -159653 -193796 120677 -162591 -22120
6040 -247318 85334 190173 -123946 -21712 -390984 -219292 -39123 -190180 183515 -189033
6029 -21780 121379 -49392 177376 -134589 148168 184979 77518 188152 -175811 224292
6018 -114530 199890 88042 -155590 -70848 49090 -53818 86953 -76727 4561 -83611 57874
6006 -67432 -3601 -238220 -8296 115664 -106836 -188370 -181958 -50105 165643 28658 -14440 -32208
5994 -32208 -327535 184722 -273821 -158819 -193284 182639 101093 -18289 48460 182275 95713
5983 95713 -37960 -437478 114018 195985 79290 28947 -395319 -170053 80675 37324 97662
5972 97662 -328657 -112999 -49658 242715 143009 -106308 -152858 -78402 -265350 17719 206747
5961 206747 183764 -81117 81785 -311870 486431 -128786 -44956 -7861 -4060 -162049 -134540
5950 -134540 -406034 2976 -140206 200460 -252074 2483 187324 -156998 161388 99882 242995
5939 242995 145844 -4637 -154974 176670 -99215 56717 -86371 189506 80094 493638 479647
5928 479647 -118177 110040 108840 -138754 -89638 -55671 -202251 -42661 71083 -308350 24445
5916 -75153 -114011 246527 -116030 -39767 244028 -29928 149243 -248532 -79345 -170419 -200610
5905 -200610 -26129 -208228 -184639 -222577 189973 -7320 187340 -81301 -117289 53178 -242171
5893 11036 437939 75408 125597 -51436 -161104 -252856 126512 388089 79936 -108095 -369460
5882 -369460 -23119 218592 100883 26472 -33683 -332034 166335 27671 37525 31903 -306152
5870 -77299 -61171 403532 83572 -229513 63256 359473 314714 103701 -47513 -132069 -30894
5858 -80782 -50752 170589 -33749 161237 -81846 280494 -121097 103003 140889 124484 -387551
5846 85009 -199559 352886 48019 -168041 -71570 138177 89719 122274 206790 -131131 -12262
5834 105624 -74673 76012 134330 -121439 38915 47775 104400 224481 -54072 139504 276412
5823 276412 103797 -187629 94297 -103374 -58421 343621 -265852 -271644 -196902 -17818 -245295
5812 -245295 -42606 233988 24629 -149679 -31116 198122 -251947 5286 -171619 -9407 -200774
5801 -200774 28229 37402 17682 -189559 -196370 -206898 25256 -190422 -70596 37058 61114 26438
5788 -279573 -375694 89402 294757 -293800 354239 73614 -29612 18361 213190 254460 193290
5777 193290 200246 -53045 -384078 285013 210840 32317 -196976 -114346 -97676 -231063 73805
5765 -89161 -26058 -162201 190492 170759 -176653 -97572 225788 196922 -59652 -118298 -253553
5754 -253553 182123 64755 111886 158320 -33040 35928 -85305 72614 -281111 -60474 77274
5742 283332 -106826 -282602 186562 -232909 -228660 -198599 -29787 -35092 220655 -141694 -40147
5730 -194531 -85526 71605 -118665 128822 -71373 -62121 74174 -373731 161478 27354 67354
5719 67354 216387 15103 97596 192182 9593 -138030 -69575 373811 351522 -99377 39287
5707 -167745 -259038 -228121 -117543 47934 -49788 -83478 56176 -70030 2706 -289478 72427
5695 -22752 -48299 -183344 -1902 -208281 181973 213602 -130642 -76838 20605 170154 -64665
5683 -185828 -22406 202152 121670 26456 85521 75625 119401 10726 -197743 -127078 -29063
5671 -138592 219398 -110657 38542 275535 200005 179678 202750 133773 -14211 -100073 -28834
5659 95414 183299 67931 -66411 9615 -93898 87603 138341 -136488 -107617 35850 15928 -68815
5646 166284 185240 -119565 -141912 46788 122631 77158 137917 -95616 -396953 87525 3679
5634 -415102 -123473 -76174 -126466 24535 135820 226560 -90002 249394 59920 29383 71387
5623 71387 -5896 162609 318821 115351 -17907 141780 9862 -144382 221816 243918 71279
5611 -112664 191409 207566 -79029 95297 28629 -98021 33487 -442009 -122793 96190 -56285
5599 83612 -209253 135492 -27664 -160151 -54293 -14684 69245 -204880 431784 -97126 17488
5587 103986 -278259 -54906 -63072 178150 203149 107787 304120 52822 -56296 -226121 -374
5575 -42414 -125025 488830 -105906 21910 -355867 143264 44983 -207647 -52546 -553380 -61139
5563 1243 296071 43539 -25998 -222266 262478 167688 105822 35090 -36448 -192044 -300608
5552 -300608 129943 -158566 187369 35040 -8835 193160 -142274 128584 143445 -23533 204713
5540 42812 -29164 -170711 103677 -10955 320925 370567 -48988 157481 402943 93770 333965
5529 333965 -8599 76204 -78589 89772 -324131 -314138 153822 86107 -232964 251529 166823
5518 166823 128164 93630 72569 -212789 59533 -34104 31926 -113065 -237021 124516 362306
5507 362306 298986 -182496 32201 -408456 47638 311435 270454 114998 -78371 -270446 -180907
5496 -180907 -68787 5533 56759 -271864 416824 -95409 -351092 172030 -193131 -46948 97219
5484 6514 258745 -114634 -30453 -166422 -286502 16422 54899 190118 -176495 -32563 -167081
5473 -167081 13446 -255290 17740 -92108 13204 51486 -406431 -11395 -7989 -210680 -58170
5461 277970 12903 -116006 4198 -184112 -58342 -43174 -173145 -305995 -34918 173705 -31195
5449 -90441 -292953 -48087 49969 17550 -186455 -104884 -33071 -14720 -170014 65204 -145555
5437 -21257 -95931 269048 307622 37257 -168500 301804 -182143 -142944 89325 -60806 -40616
5426 -40616 163666 321992 -102484 484785 -53548 -15392 64877 -53045 36851 189432 95332
5415 95332 57820 -53261 267353 -36674 158317 -101840 -177112 -234864 -119173 101729 229
5403 232876 115697 -155275 17752 -259507 268300 -75806 490050 71210 -102047 50070
5392 -166848 -52676 -13723 -75391 -129223 -129040 1924 -360089 -370025 -286809 -184819 -25423 -108115
5380 -108115 -94637 74364 87791 -13193 -140798 101505 -21775 93833 58623 -218094 -11217
5368 117387 60293 -271334 -324301 -56430 -80212 -88222 191931 261986 40560 109974 -110784
5356 4877 92479 -182095 103824 266758 -14133 -292445 -196326 -128106 54358 -237347 -282089
5345 -282089 -21980 -58121 115188 -46660 249209 17001 145756 -42741 433282 -57129 59684
5333 -191274 -10078 -102550 120295 -89388 -137148 -95059 -56313 -17758 132814 -340097 62384
5321 186307 344207 135212 -34734 77131 231936 149614 93420 -45850 -19113 128955 -128385
5309 42567 -158974 122586 73375 -370634 212059 -31485 -79181 8475 -212959 140615 -40492
5297 43315 -52391 268975 98436 -95557 -24595 -119899 -274948 513041 -26992 63238 165409
5286 165409 75674 67748 -283580 -14489 -78814 82599 389107 -240801 249430 78133 32392
5274 12670 32446 -25710 39117 6315 179074 60295 -97647 343966 111350 105609 -27172 -7057
5261 -164038 -65034 -219980 121161 -54070 -103112 -63932 130771 172002 87593 -300560 -221501
5250 -221501 108520 -91307 157801 176687 49299 -1780 -135003 -70529 120824 13881 142026
5239 142026 235224 -20602 214174 137023 -252730 -171913 -46661 -47943 -98111 59743 -14567
5227 -10210 248100 -21058 -236609 -271923 -59591 37825 -60625 -139737 56040 -116130 270148
5215 77804 -150487 201356 41141 -175064 -173842 -36464 -234073 134735 -94359 -39849 44051
5203 -179644 26140 -15373 -149373 122462 -27217 80898 -6459 -81597 57183 -121317 8163
5191 -185584 175253 3276 76748 125960 -133984 -47709 -122998 -80585 -2523 46254 -195015
5179 -66504 95662 112544 147993 129843 129496 -190167 -74137 -316001 81042 -228646 352731
5167 72650 -250581 -61216 5508 -238442 -440760 165462 -92618 185956 -85105 109181 -14105
5155 150899 -52450 135414 -81452 189078 164871 119796 336834 112918 -125481 265734
5144 -67284 -104964 111670 74917 122396 -173424 -175349 49549 -37857 -68912 -192955 -216894
5133 -216894 -24081 -73274 82854 214022 -76012 -32983 -290674 144506 -28242 -246005 -42385
5121 -101387 143381 276449 216382 -197646 -68313 -113839 25990 363474 -116796 37139 215355
5110 215355 -256096 267719 14787 -95726 -249891 -152681 77630 362938 22460 -178795 -218006
5099 -218006 72449 234589 -22803 36110 -1893 233205 -39696 90193 -261873 79532 -148486
5087 305854 113328 23931 -58320 172645 96658 33785 169202 -178260 140711 187077 39658
5075 -333186 -209829 -249742 81162 -6696 -223845 243929 290629 2822 -128731 168510 -48037
5063 285782 -57646 40093 264445 -19445 -97413 296360 -91081 56849 -93884 177889 -202536
5051 -89813 -159266 -67372 -213003 281188 177080 13337 -159560 -258871 198129 -162675 -136130
5040 -136130 68607 243825 -25763 -128647 -9916 140271 -156164 -49562 -8357 153036 -202600
5028 41346 -24589 -1445 44791 -356564 -73032 80374 13754 -12559 87769 -170799 -173909 121190
5015 173537 83076 39968 -7483 45215 -317209 256780 377230 243654 53936 108801 164435
5004 164435 -135466 -272031 136997 -96067 255909 137836 -19599 -147375 -87156 110479
4993 -445920 241456 -26118 10329 -166994 -35001 133753 -225851 31063 -166349 -167079 -185475
4982 -185475 -144603 44006 101271 -45443 62292 57936 -29784 256165 318337 -84301 -381661
4971 -381661 196345 210853 -248830 -132513 -276554 -44356 -143208 205937 -170857 -64961
4960 -323654 -251711 -171338 -47120 15579 -183409 -129167 -32629 -156047 -16403 131015 52523
4948 -25450 160248 70591 -9987 -32900 19606 -211277 -38913 -268 -50173 193717 -106384 42956
4935 -335895 19243 402154 -269743 56299 -317652 186917 6359 4210 77827 156371 -87572
4923 -91061 -185344 152273 -223833 -208545 -33049 -97749 119906 74674 121051 -68230 -135020
4912 -135020 288731 89009 25364 373875 60817 -616 164776 75187 300199 154959 210788
4901 210788 126367 208820 14181 -3004 -289308 -100485 -193086 -263120 47335 163951 -116481
4889 261735 -22440 -142033 -84179 245820 -62598 95075 262622 156782 170836 -58007 263321
4877 138018 163139 -422333 -221165 -10480 82375 119751 144924 134966 187205 17984 147236
4866 147236 49291 178300 215284 -92982 -290915 310217 -283707 -210 118665 63556 -161350
4854 121852 300880 231272 244350 173803 -19774 -328589 -240608 -356268 -205029 81899 106707
4843 106707 18239 -31790 88971 29200 -203315 728 74961 -50844 -109409 -268528 311481
4831 -393362 -91736 -56658 -153237 -179179 -280015 123257 148298 89570 97125 -66765 81703
4819 67458 -169131 -63894 -7917 274263 -236943 213649 111695 -52258 -34039 -178159 112152
4807 46197 -102135 270828 -96912 -249550 -162035 -330134 -213618 -254695 259716 144735
4797 144735 -107954 -13662 -68391 -302686 103622 -62958 -18795 -126472 19694 -129925 -164835
4786 -164835 272407 54159 130371 -5847 -137811 105990 -81403 -28903 -49843 -84775 -119650
4775 -119650 180484 -261228 119098 208141 -194717 -62633 53453 -40239 -121872 273285 127259
4763 144447 -41031 125856 -17579 -3292 -181290 497925 -33335 98874 -198028 -146879 -1078
4751 -229424 -293721 109551 19642 -20942 50726 26103 -6900 -21648 657371 -1226 2714 99417
4739 99417 -135181 -9899 64536 152476 -187576 -72971 -204262 -37330 146364 15442 -261362
4727 -121613 656502 125712 -103408 -64101 102823 69511 -137536 -156079 157 277232 107064
4715 44586 65216 -47420 -98818 -48381 -144883 124023 -31463 -176531 124017 129761 -377223
4703 268728 224803 -262063 -49456 264228 271783 -261016 73253 314689 -4613 201970 -96388
4691 -20237 -121421 381469 -114836 50120 -67898 -112433 127786 115101 195252 34654 51765
4680 51765 53872 294982 -157600 15479 54124 92897 141982 -96240 205590 -300296 70014
4668 -155364 -172145 -119977 19421 259094 -150899 38248 157104 127580 -246785 148055 -57963
4656 -221132 -51806 159505 251278 -126208 185492 58639 -130570 -2338 -59296 -181237 86376
4644 202617 242648 -370004 29530 37102 168207 -93399 29951 100118 -227588 62536 -87538
4632 -37958 -86416 4089 234226 41013 -429279 -337077 -136238 169877 80899 273218 -253845
4620 -236691 295638 23241 288395 12270 93719 76893 271681 -164315 151670 332586
4610 332586 143936 65248 114201 440882 244134 -238381 132811 -14292 75984 -179690
4599 -67821 -76779 -212900 127516 291975 38381 214400 -31901 59636 223220 526446 24940
4587 -201984 69469 -135625 128595 -106159 258772 122193 -193595 -99676 -153433 -291293
4577 -291293 -182169 -3121 -40112 -204709 -24736 -92759 60086 178544 389250 424782 -60266
4565 -38587 -116412 15444 136364 18141 -231585 258126 -44360 118122 50903 92259 158447
4554 158447 -252920 -324383 76865 468597 337665 -97434 179000 -79186 229852 -114579
4543 201825 -16624 -35602 196128 7067 37214 3109 -301870 -3179 -42730 -55120 76015 129632
$$ [...]
##END NTUPLES=NMR SPECTRUM
##END=
