
##TITLE=AC1206_HPAAH12049_7154822_nrlYb0oDl9
##JCAMPDX= 6.0         $$ Bruker NMR JCAMP-DX V2.0
##DATA TYPE= NMR SPECTRUM
##DATA CLASS= NTUPLES
##ORIGIN= BRUKER
##OWNER= Administrator
$$ 1.72 TOPSPIN		Version 2.1
$$ 2012-12-01 02:52:09.734 -0500  Administrator@X
$$ Compression mode = diff/dup
##.OBSERVE FREQUENCY= 400.02188249412
##.OBSERVE NUCLEUS= ^1H
##.ACQUISITION MODE= SIMULTANEOUS (DQD)
##.ACQUISITION SCHEME= undefined
##.AVERAGES= 64
##.DIGITISER RES= 22
##SPECTROMETER/DATA SYSTEM= spect
##.PULSE SEQUENCE= noesygpps1d.comp
##.SOLVENT NAME= COFFEE_meoh
##.SHIFT REFERENCE= INTERNAL, COFFEE_meoh, 1, 14.96103
##AUDIT TRAIL= $$ (NUMBER, WHEN, WHO, WHERE, PROCESS, VERSION, WHAT)
$$ ##TITLE= Audit trail, TOPSPIN		Version 2.1
$$ ##JCAMPDX= 5.01
$$ ##ORIGIN= Bruker BioSpin GmbH
$$ ##OWNER= Administrator
$$ $$ E:\/data/COFFEE/nmr/AC1206_HPAAH12049_7154822_nrlYb0oDl9/12/pdata/1/auditp.txt
$$ ##AUDIT TRAIL=  $$ (NUMBER, WHEN, WHO, WHERE, PROCESS, VERSION, WHAT)
(   1,<2012-12-01 02:52:03.406 -0500>,<Administrator>,<X>,<go>,<TOPSPIN 2.1>,
      <created by zg
	started at 2012-12-01 02:40:33.528 -0500,
	POWCHK enabled, PULCHK disabled,
       configuration hash MD5:
       86 BA 57 50 F2 9D 5C 9B 26 00 A9 28 5F 66 2E 89
       data hash MD5: 64K
       63 33 FF C4 9E 40 8A 96 CC 11 6F 35 F7 D0 09 48>)
(   2,<2012-12-01 02:52:06.625 -0500>,<Administrator>,<X>,<proc1d>,<TOPSPIN 2.1>,
      <Start of raw data processing
       efp LB = 0.3 FT_mod = 6 PKNL = 1 PHC0 = 0 PHC1 = 0 SI = 128K 
       data hash MD5: 128K
       10 8F 6E C8 21 7D B3 32 84 B9 73 CB B8 E5 1B 88>)
(   3,<2012-12-01 02:52:07.828 -0500>,<Administrator>,<X>,<proc1d>,<TOPSPIN 2.1>,
      <pk PHC0 = -80.77698 PHC1 = 0 
       data hash MD5: 128K
       AD 98 C9 DE EE CC 4F 8C 5B 42 EB 6D 88 61 B7 6E>)
(   4,<2012-12-01 02:52:08.594 -0500>,<Administrator>,<X>,<proc1d>,<TOPSPIN 2.1>,
      <abs ABSG = 1 
       data hash MD5: 128K
       A1 95 B8 83 50 99 03 AD D7 01 EA 4E E8 FE 79 DE>)
(   5,<2012-12-01 02:52:08.812 -0500>,<Administrator>,<X>,<proc1d>,<TOPSPIN 2.1>,
      <abs ABSG = 2 
       data hash MD5: 128K
       78 15 7E 6B 02 43 E0 08 AA B9 A8 2D 50 8C 83 76>)
(   6,<2012-12-01 02:52:09.000 -0500>,<Administrator>,<X>,<proc1d>,<TOPSPIN 2.1>,
      <abs ABSG = 3 
       data hash MD5: 128K
       83 21 C3 EF C2 16 9D 26 5B CF 2B 3E 78 68 A3 E2>)
(   7,<2012-12-01 02:52:09.187 -0500>,<Administrator>,<X>,<proc1d>,<TOPSPIN 2.1>,
      <abs ABSG = 4 
       data hash MD5: 128K
       3E 95 37 9B 9B F2 BA 19 D6 14 AA B8 77 34 34 07>)
(   8,<2012-12-01 02:52:09.406 -0500>,<Administrator>,<X>,<proc1d>,<TOPSPIN 2.1>,
      <abs ABSG = 5 
       data hash MD5: 128K
       F2 97 18 13 68 17 08 7A 26 AC 6B DD E2 A7 B2 5B>)
$$ ##END=
$$ 
$$ $$ hash MD5
$$ $$ CF DF 23 2B 35 40 B5 A3 D7 76 DE 6E C5 92 53 D1
##$RELAX= 
##$RELAX= 
##$RELAX= 
##$RELAX= 
##$RELAX= 
##$RELAX= 
##$RELAX= 
##$RELAX= 
$$ Bruker specific parameters
$$ --------------------------
##$DU= <E:\>
##$EXPNO= 12
$$ [...]
##$TP07= 0
##$TPNAME0= <>
##$TPNAME1= <>
##$TPNAME2= <>
##$TPNAME3= <>
##$TPNAME4= <>
##$TPNAME5= <>
##$TPNAME6= <>
##$TPNAME7= <>
##$TPOAL= (0..7)
0.5 0.5 0.5 0.5 0.5 0.5 0.5 0.5
##$TPOFFS= (0..7)
0 0 0 0 0 0 0 0
##$TUNHIN= 0
##$TUNHOUT= 0
##$TUNXOUT= 0
##$USERA1= <user>
##$USERA2= <user>
##$USERA3= <user>
##$USERA4= <user>
##$USERA5= <user>
##$V9= 5
##$VALIST= <valist>
##$VCLIST= <CCCCCCCCCCCCCCC>
##$VD= 0
##$VDLIST= <DDDDDDDDDDDDDDD>
##$VPLIST= <PPPPPPPPPPPPPPP>
##$VTLIST= <TTTTTTTTTTTTTTT>
##$WBST= 1024
##$WBSW= 4
##$XGAIN= (0..3)
0 0 0 0
##$XL= 0
##$YL= 0
##$YMAX_a= 6168650
##$YMIN_a= -12511107
##$ZGOPTNS= <>
##$ZL1= 120
##$ZL2= 120
##$ZL3= 120
##$ZL4= 120
##$ABSF1= 14.96103
##$ABSF2= -5.597152
##$ABSG= 5
##$ABSL= 3
##$ALPHA= 0
##$AQORDER= 0
##$ASSFAC= 0
##$ASSFACI= 0
##$ASSFACX= 0
##$ASSWID= 0
##$AUNMP= <proc_prof1d_extract.lims>
##$AXLEFT= 0
##$AXNAME= <>
##$AXNUC= <1H>
##$AXRIGHT= 0
##$AXTYPE= 0
##$AXUNIT= <>
##$AZFE= 0.1
##$AZFW= 0.1
##$BCFW= 0
##$BC_mod= 0
##$BYTORDP= 0
##$COROFFS= 0
##$CY= 15
##$DATMOD= 1
##$DC= 0
##$DFILT= <>
##$DTYPP= 0
##$F1P= 0
##$F2P= 0
##$FCOR= 0.5
##$FTSIZE= 131072
##$FT_mod= 6
##$GAMMA= 0
##$GB= 0
##$INTBC= 1
##$INTSCL= 1
##$ISEN= 128
##$LB= 0.3
##$LEV0= 0
##$LPBIN= 0
##$MAXI= 10000
##$MC2= 0
##$MEAN= 0
##$ME_mod= 0
##$MI= 0
##$NCOEF= 0
##$NC_proc= -2
##$NLEV= 6
##$NOISF1= 0
##$NOISF2= 0
##$NSP= 0
##$NTH_PI= 0
##$NZP= 0
##$OFFSET= 14.96103
##$PC= 1
##$PHC0= -80.77698
##$PHC1= 0
##$PH_mod= 1
##$PKNL= yes
##$PPARMOD= 0
##$PPDIAG= 0
##$PPIPTYP= 0
##$PPMPNUM= 2147483647
##$PPRESOL= 1
##$PSCAL= 4
##$PSIGN= 0
##$PYNMP= <proc.py>
##$REVERSE= no
##$SF= 400.020009623009
##$SI= 131072
##$SIGF1= 0
##$SIGF2= 0
##$SINO= 400
##$SIOLD= 131072
##$SPECTYP= <>
##$SREGLST= <1H.CDCl3>
##$SSB= 0
##$STSI= 131072
##$STSR= 0
##$SW_p= 8223.68421052631
##$SYMM= 0
##$S_DEV= 0
##$TDeff= 65536
##$TDoff= 0
##$TI= <>
##$TILT= no
##$TM1= 0
##$TM2= 0
##$TOPLEV= 0
##$USERP1= <user>
##$USERP2= <user>
##$USERP3= <user>
##$USERP4= <user>
##$USERP5= <user>
##$WDW= 1
##$XDIM= 131072
##$YMAX_p= 413435415
##$YMIN_p= -15715
##$CURPLOT= <Network HP LaserJet P1505>
##$CURPRIN= <$Network HP LaserJet P1505>
##$DFORMAT= <normdp>
##$LAYOUT= <+/1D_H.xwp>
##$LFORMAT= <normlp>
##$PFORMAT= <normpl>
##$SURQMSG= 1
$$ End of Bruker specific parameters
$$ ---------------------------------
##NTUPLES= NMR SPECTRUM
##VAR_NAME=  FREQUENCY,     SPECTRUM/REAL,   SPECTRUM/IMAG
##SYMBOL=    X,             R,               I
##VAR_TYPE=  INDEPENDENT,   DEPENDENT,       DEPENDENT
##VAR_FORM=  AFFN,          ASDF,            ASDF
##VAR_DIM=   131072,        131072,          131072
##UNITS=     HZ,            ARBITRARY UNITS, ARBITRARY UNITS
##FACTOR=    0.0627417313425164, 1,          1
##FIRST=     8223.62146879497, -424,         -61359
##LAST=      0,             2046,            -61386
##MIN=       0,             -15715,          0
##MAX=       8223.62146879497, 413435415,    0
$$ Real data points
##PAGE= N=1
##DATA TABLE= (X++(R..R)), XYDATA
$$ [...]
63979C26956N702O563P404P957Q364Q678Q690Q508Q875J0363J2468J4080J4866
63966D49474J5584J6876J8351J9314J9897K0885K2574K4415K5842K7001K8620
63955F88833L1368L5428M0417M5759N1445N8335O7395P8596R0967J03767J17117
63944A409427J31269J45727J59556J72258J83896J94418K03217K09294K11599
63935C020661K09294K02083J90309J74534J55071J32070J05906P7236M6727J5009
63925D328900j7155m8955p9675j08490j34221j55777j72856j85841j94912j99771
63915C031247k00385j97487j91949j83998j73518j60923j47294j33601j20180
63906A521912j07096r4710q3634p4182o6025n8481n1218m4583l9134l4872l1111
$$ plain form
63979 326956 332658 339221 346625 354582 362946 371624 380314 388822 397697 408060 420528 434608 449474
63966 449474 465058 481934 500285 519599 539496 560381 582955 607370 633212 660213 688833
63955 688833 720201 755629 796046 841805 893250 951585 1018980 1097576 1188543 1292310 1409427
63944 1409427 1540696 1686423 1845979 2018237 2202133 2396551 2599768 2809062 3020661
63935 3020661 3229955 3432038 3622347 3796881 3951952 4084022 4189928 4267164 4313891 4328900
63925 4328900 4311745 4262790 4183115 4074625 3940404 3784627 3611771 3425930 3231018 3031247
63915 3031247 2830862 2633375 2441426 2257428 2083910 1922987 1775693 1642092 1521912
63906 1521912 1414816 1320106 1236472 1162290 1096265 1037784 986566 941983 902849 867977 836866
63895H36866k7280k3676k1136k0006j9631j9022j7868j6675j5907j5244j3917
63884F26504j1742r416p700o515n249l684k181q44R67L923P721J1219J3517J4697
63870F31217J5467J6352J7367J8287J8972J9400J9494J9099J8171J6888J5517
63859H26231J4187J2800J1105Q865O054L043M03j651l542n839q586j1389j4013
63846H37668j6500j8669k0059k0682k1316k2581k3980k4496k4100k3930k4744
63835E96611k5736k5495k3800k1837k0646k0038j9210j7893j6455j5242j4299
63824C75960j3573j2913j2027j0856r826r255q638p257n429m316m269m339l806
63811B69456l334l765m577m502l361k168j565j234q55p34j128j721k117k289k306
$$ plain form
63895 836866 809586 785910 764774 744768 725137 706115 688247 671572 655665 640421 626504
63884 626504 614762 605346 597646 591131 585882 582198 580017 579173 580140 584063 591784 603003 616520 631217
63870 631217 646684 663036 680403 698690 717662 737062 756556 775655 793826 810714 826231
63859 826231 840418 853218 864323 873188 879242 882285 882688 881037 877495 871656 863070 851681 837668
63846 837668 821168 802499 782440 761758 740442 717861 693881 669385 645285 621355 596611
63835 596611 570875 545380 521580 499743 479097 459059 439849 421956 405501 390259 375960
63824 375960 362387 349474 337447 326591 316765 307510 298872 291615 286186 281870 277601 273262 269456
63811 269456 266122 262357 257780 253278 249917 247749 246184 244950 244095 243361 242233 240512 238395 236106 233800
63796B33800k130j893j856j946j828j603j824k603l300l338k784j919r12k02m03
63781B05259j345j946j579r12p46p46k14M97M98m1m2P24J161M56p76j448j370
63764A97430j120j033r38o51k49J28M41O49O59L70k46r78j404j220n89J0L26M95
63746A92080O88R13J152J470J803J901J678J414J400J531J493J326J438K031K703
63731B15021K826K235J370Q11Q51J433K257K884L074L159L712M615M874L840K290
63716B55252J593J933K154J472M65l5k41q89j874k346j982j429j310j430j302
63701B50031r92j039j572j934j424k28P49J048J231J964K959L440L355L372L671
63686B64631L728L411L306L545L288K030O22Q1J30j43p49r78p19m81k82L02J083
$$ plain form
63796 233800 231670 229777 227921 225975 224147 222544 220720 218117 214817 211479 208695 206776 205864 205662 205259
63781 205259 203914 201968 200389 199477 198731 197985 197771 198268 198766 198725 198683 199407 200568 201024 200248 198800 197430
63764 197430 196310 195277 194339 193688 193439 193567 194008 194657 195316 195686 195440 194462 193058 191838 191249 191259 191585 192080
63746 192080 192768 193681 194833 196303 198106 200007 201685 203099 204499 206030 207523 208849 210287 212318 215021
63731 215021 217847 220082 221452 222263 223114 224547 226804 229688 232762 235921 239633 244248 249122 252962 255252
63716 255252 256845 258778 260932 262404 262869 262834 262593 261704 259830 257484 255502 254073 252763 251333 250031
63701 250031 249039 248000 246428 244494 243070 242842 243591 244639 245870 247834 250793 254233 257588 260960 264631
63686 264631 268359 271770 275076 278621 281909 283939 284561 284642 284772 284629 283880 282902 282183 281702 281420 281722 282805
63669B82805J291Q55N12N83O13M23M81P98N58n88j747k070j984k387l225l709
63653B73209l580l225k870k424k024k032k450k875l020k823k130q20O84J563J443
63638B46626Q28N44R54J809K605L041L190L338L596L793L882M197N047O162O902
63623B96514P030O965P193P764Q506R504J1034J3019J4896J6152J6945J7882J9219
63610D52623K0596K1749K3158K5404K8010K9570K9208K7371K4794K1307J6356
63599G20146J0442N113J364j239l546n497o441o351o076o393p389q950j1198j4057
63585F59928j6733j8271j8652j8863j9674k0703k0889j9679j7535j5368j3793
63574D59768j2766j1761j0215p984n452l136j313j1Q66J621K756M497O437P914
$$ plain form
63669 282805 284096 284951 285463 286046 286659 287082 287563 288361 288919 288331 286584 284514 282530 280143 276918 273209
63653 273209 269629 266404 263534 261110 259086 257054 254604 251729 248709 245886 243756 242936 243620 245183 246626
63638 246626 247454 247998 248952 250761 253366 256407 259597 262935 266531 270324 274206 278403 283450 289612 296514
63623 296514 303544 310509 317702 325466 333972 343476 354510 367529 382425 398577 415522 433404 452623
63610 452623 473219 494968 518126 543530 571540 601110 630318 657689 682483 703790 720146
63599 720146 730588 735701 737065 735826 732280 726783 720342 713991 707915 701522 694133 685183 673985 659928
63585 659928 643195 624924 606272 587409 567735 547032 526143 506464 488929 473561 459768
63574 459768 447002 435241 425026 417042 411590 408454 407141 407130 407996 409617 412373 416870 423307 431221
63560D31221Q748R336J0041J0782J1267J1352J1162J1143J2040J4377J7869K1591
63548E80929K4989K8315L1855L5022L6643L5926L2740K7183J9550J0924L123k505
63536H64694o082q598j0491j1311j0794r558q381p317o199n749p310j1176j5899
63523G45829j9660k2046k3933k5962k7706k8462k8196k7448k6489k5030k2846
63512D68051k0354j8247j6608j4827j2643j0796j0077j0018r347p789o438o016
63500C24891n695m451k784k088k581l020k441j265m35k47m10o30p17m90K9N48
63484B98214Q30R37J037J239J633K252K904L315L439L417L244K818K245J760J368
63469C30652Q88K80m36j445k774l860m117l908m170m968n255m424l279k902l149
$$ plain form
63560 431221 439969 449305 459346 470128 481395 492747 503909 515052 527092 541469 559338 580929
63548 580929 605918 634233 666088 701110 737753 773679 806419 833602 853152 864076 867199 864694
63536 864694 858612 850014 839523 828212 817418 807860 799479 792162 785963 780214 772904 761728 745829
63523 745829 726169 704123 680190 654228 626522 598060 569864 542416 515927 490897 468051
63512 468051 447697 429450 412842 398015 385372 374576 364499 354481 345134 337345 330907 324891
63500 324891 319196 314745 311961 309873 307292 304272 301831 300566 300131 299884 299474 298844 298127 297637 297666 298214
63484 298214 299044 299981 301018 302257 303890 306142 309046 312361 315800 319217 322461 325279 327524 329284 330652
63469 330652 331540 331820 331384 329939 327165 323305 319188 315280 311110 306142 300887 296463 293184 290282 287133
63454B87133k959j817k15J144K032K655L310M177N169N968O348O462O714P479
63440C33600Q908J0899J3164J5588J8336K1434K4287K6027K6333K5506K3802K1138
63428E69022J7560J3416R118N152K408J752L117N622Q721J2648J7464K2504K7067
63415G15571L0950L3827L4841L3429L0016K5447K0243J4784R579M783J17m168
63403I49419o985p825p775q266r478j0912j2878j6086k0096k3513k5749k7398
63391G72458k8890k9820k9926k9608k9135k8149k6358k4018k1395j8455j5485
63380D91219j3317j2366j1850j0472p739m380j603LR33K210M220O325P821Q885
63366D59889J0099J1526J2955J4684J7077J9568K1253K2429K4423K7556L0472
$$ plain form
63454 287133 284174 282357 282142 283286 285318 287973 291283 295460 300629 306597 312945 319407 326121 333600
63440 333600 342508 353407 366571 382159 400495 421929 446216 472243 498576 524082 547884 569022
63428 569022 586582 599998 609116 614268 616676 618428 621545 627167 635888 648536 666000 688504 715571
63415 715571 746521 780348 815189 848618 878634 904081 924324 939108 948687 953470 953587 949419
63403 949419 942434 934609 926834 918568 909090 898178 885300 869214 849118 825605 799856 772458
63391 772458 743568 713748 683822 654214 625079 596930 570572 546554 525159 506704 491219
63380 491219 477902 465536 453686 443214 435475 431095 429492 429495 430428 432638 436858 443183 451004 459889
63366 459889 469988 481514 494469 509153 526230 545798 567051 589480 613903 641459 671931
63355F71931L1985L2513L2983L3152L1952K8911K4447J9090J3198P218J652l095
63343I25937o558q370q927r336j0191j0969j1237j1847j4013j7554k1008k3398
63331G72529k4990k6327k7362k7772k7397k6142k3894k0802j7259j3524r743o413
63319E20904m332l958n087p241r896j2356j3957j4699j5181j5661j5509j3994
63307C89033j1390q898p579p511p843p531o185m395l203l041l376l456l165k893
63293C08567k829k750k481k163k007j996j964j791j473j107q93r44j068q70k33
63278B83998N30J062J323J388J129M56k70m83j38J58m4m89o38l69P7O00J259J907
63260B91456K236K234K239K487K864L228L599L960M139M123M250M836N719O439
$$ plain form
63355 671931 703916 736429 769412 802564 834516 863427 887874 906964 920162 927380 929032 925937
63343 925937 919379 911009 902082 892746 882555 871586 860349 848502 834489 816935 795927 772529
63331 772529 747539 721212 693850 666078 638681 612539 588645 567843 550584 537060 527317 520904
63319 520904 516572 512614 507527 500286 490390 478034 464077 449378 434197 418536 403027 389033
63307 389033 377643 368745 361166 353655 345812 338281 332096 327701 324498 321457 318081 314625 311460 308567
63293 308567 305738 302988 300507 298344 296337 294341 292377 290586 289113 288006 287113 286169 285101 284231 283998
63278 283998 284528 285590 286913 288301 289430 289886 289616 289133 288995 289153 289109 288620 287982 287613 287690 288290 289549 291456
63260 291456 293692 295926 298165 300652 303516 306744 310343 314303 318442 322565 326815 331651 337370 343809
63246C43809O706O626O613P213Q761J0921J2740J3579J3929J4959J7140J9694
63234D82690K1513K2413K3141K4341K5808K6885K7282K7300K7369K7586K7746
63223G64074K7581K6864K5544K4007K3035K3116K3857K4386K4362K4149K3875
63212A034850K2892K0543J7017J2903Q204K486m044j0392j5917k0960k6007l0713
63200A010862l4336l6619l7646l7136l4715l0921k7112k4087k1359j8150j4531
63189F94250j1090p904m603j256J514L494N330P727J0589J3260J5283J6554J7021
63176G60169J6754J6217J6087J6572J7226J7511J7394J7198J7030J6523J5149
63165I43830J2663R338N758K337j086n145j0263j6004k1240k5062k7479k9052
$$ plain form
63246 343809 350515 357141 363754 370967 379728 390649 403389 416968 430897 445856 462996 482690
63234 482690 504203 526616 549757 574098 599906 626791 654073 681373 708742 736328 764074
63223 764074 791655 818519 844063 868070 891105 914221 938078 962464 986826 1010975 1034850
63212 1034850 1057742 1078285 1095302 1108205 1116409 1118895 1114851 1104459 1088542 1067582 1041575 1010862
63200 1010862 976526 939907 902261 865125 830410 799489 772377 748290 726931 708781 694250
63189 694250 683160 675256 670653 669397 670911 674405 679735 687462 698051 711311 726594 743148 760169
63176 760169 776923 793140 809227 825799 843025 860536 877930 895128 912158 928681 943830
63165 943830 956493 965831 971589 973926 972840 967695 957432 941428 920188 895126 867647 838595
63153H38595l0045l0249k9666k8916k8551k8232k7056k4705k1830j9280j7327
63142E52738j5841j4725j3850j2826j1308r469p814o597n663m847m162l547k786
63129D39303j802q14o4M61Q86J250J550J916K452K975L116K728K134J833K073
63114D59997K688L298L620L651L655L916M375M563M013K773J375L08k92m07K3
63099D97556Q13J414J424J095R54J050R61N07rl09m67n57l84K56J242K251K966
63082E10763L175K973K902L523M660N529N717N652N905O538P357Q303R238R843
63068E92078J0171J0820J2085J3396J4139J4610J5518J6928J8435K0136K2532
63057G60848K5605K8831L2038L5564L9452M3296M6973N0785N4613N7733N9775
$$ plain form
63153 838595 808550 778301 748635 719719 691168 662936 635880 611175 589345 570065 552738
63142 552738 536897 522172 508322 495496 484188 474719 466905 460308 454645 449798 445636 442089 439303
63129 439303 437501 436687 436623 437084 437970 439220 440770 442686 445138 448113 451229 453957 456091 457924 459997
63114 459997 462685 465983 469603 473254 476909 480825 485200 489763 493776 496549 497924 498232 497940 497533 497556
63099 497556 498369 499783 501207 502302 503256 504306 505267 505774 505765 505456 504989 504432 504048 504304 505546 507797 510763
63082 510763 513938 516911 519813 523336 527996 533525 539242 544894 550799 557337 564694 572997 582235 592078
63068 592078 602249 613069 625154 638550 652689 667299 682817 699745 718180 738316 760848
63057 760848 786453 815284 847322 882886 922338 965634 1012607 1063392 1118005 1175738 1235513
63046A235513O1282O2858O4364O5274O5395O4806O3516O1638N9648N8078N7148
63035A919520N6876N7172N7605N7390N6007N3483M9883M4784L7662K8462J7524
63024B436368N225p968k1417l4611m7321n9067o8835p5789q0065q2264q2411q0057
63012A801788p5407o9630o3812n8016n1639m4315l6190k7692j9347j1740n168
63001A338832O59O310J1868J6711K0247K2716K5009K7603L0001L1355L1400L0599
62989A593310K9580K8779K8444K8467K8183K6731K3723J9349J3859P385K70o970
62977A821110j4218k1877l0087l8183m5209n0711n4761n7590n9473o0664o1024
62966A327313o0030n7530n4200n0802m7285m3193l8779l4986l2364l0546k8883
$$ plain form
63046 1235513 1296795 1359653 1424017 1489291 1554686 1619492 1683008 1744646 1804294 1862372 1919520
63035 1919520 1976396 2033568 2091173 2148563 2204570 2258053 2307936 2352720 2390382 2418844 2436368
63024 2436368 2441593 2433625 2412208 2377597 2330276 2271209 2202374 2126585 2046520 1964256 1881845 1801788
63012 1801788 1726381 1656751 1592939 1534923 1483284 1438969 1402779 1375087 1355740 1344000 1338832
63001 1338832 1339491 1345801 1357669 1374380 1394627 1417343 1442352 1469955 1499956 1531311 1562711 1593310
62989 1593310 1622890 1651669 1680113 1708580 1736763 1763494 1787217 1806566 1820425 1827810 1828080 1821110
62977 1821110 1806892 1785015 1754928 1716745 1671536 1620825 1566064 1508474 1449001 1388337 1327313
62966 1327313 1267283 1209753 1155553 1104751 1057466 1014273 975494 940508 908144 877598 848715
62955H48715k7058k4994k2778k0849j9726j9240j8529j7107j5478j4343j3651
62944F34962j2988j2495j2591j2928j2458j0807q946q041q049p997p360o560o117
62931E07625n915n495m731l896l271k979l015l216l224k770j973j224p56m80k24
62916D64456OO0j91p36j339j642j542j410j729k441k927k754k269k157k543k805
62900D38037k438j752j417j452j129o0J027J114K22o78r95j114j411j478q13K18
62884D25881Q07Q16P33P44N35J17P2O97J426J447O73j72l27K95J113J567J759
62867D38183K163K652K359Q96q38j706j791j912k076j571m54K72L00N38J528K469
62851D41012K576K300K297K130J157Nj74N18R69Q40Q05R98O91k56q80o24k73n83
$$ plain form
62955 848715 821657 796663 773885 753036 733310 714070 695541 678434 662956 648613 634962
62944 634962 621974 609479 596888 583960 571502 560695 551749 543708 535659 527662 520302 513742 507625
62931 507625 501710 496215 491484 487588 484317 481338 478323 475107 471883 469113 467140 465916 465160 464680 464456
62916 464456 464462 464522 464331 463595 462256 460614 459072 457662 455933 453492 450565 447811 445542 443385 440842 438037
62900 438037 435599 433847 432430 430978 429849 429789 430816 431930 432152 431474 430479 429365 427954 426476 425663 425881
62884 425881 426688 427504 428237 428981 429516 429633 429705 430402 431828 433275 433948 433776 433449 433744 434857 436424 438183
62867 438183 440346 442998 445357 446253 445415 443709 441918 440006 437930 436359 435905 436177 436477 437015 438543 441012
62851 441012 443588 445888 448185 450315 451472 451477 451303 451821 452790 453630 454435 455433 456124 455868 454988 454364 454091 453508
62833D53508r06j79J235J797Q41n65r89k50O95J049R69J069J476J680J319Q60
62817D63609J151K325L546M023L865L754M024M468M828M999M899M627M764N883
62803E20765P541Q388P741O608O512P647Q962R908J1102J3042J5121J6601J7851
62790F57789J9859K2857K6245K9624L3089L6620M0046M3759M8665N5056O2115
62779A075724O8862P5183Q1596Q8310R4862J00420J04232J05916J05522J03208
62769B003835R8819R1960Q2316O9706N4119L6198J7523l34j6993l2938m8097o1604
62757B294510p2966q2447r0049r5126r7537r8221r7918r6176r2426q7354q2225
62746A302065p7325p2059o6267o0484n5052m9831m4765m0116l6070l2617k9669
$$ plain form
62833 453508 452602 452423 453658 455455 456296 455731 454742 454492 455187 456236 457205 458274 459750 461430 462749 463609
62817 463609 464760 467085 470631 474654 478519 482273 486297 490765 495593 500592 505491 510118 514882 520765
62803 520765 528306 536694 544435 551043 557555 565202 574164 584072 595174 608216 623337 639938 657789
62790 657789 677648 700505 726750 756374 789463 826083 866129 909888 958553 1013609 1075724
62779 1075724 1144586 1219769 1301365 1389675 1484537 1584957 1689189 1795105 1900627 2003835
62769 2003835 2102654 2194614 2276930 2346636 2400755 2436953 2454476 2454142 2437149 2404211 2356114 2294510
62757 2294510 2221544 2139097 2049048 1953922 1856385 1758164 1660246 1564070 1471644 1384290 1302065
62746 1302065 1224740 1152681 1086414 1025930 970878 921047 876282 836166 800096 767479 737810
62735G37810k6922k3859k0474j7575j5795j4629j3107j1096r166p524n994m739
62723E66930m073l641k737j427m14J82R88K242L505M646O095P844R252J0223J1628
62708F11243J4035J6868J9456K2090K5331K8930L2262L5373L8840M2905M7386
62697I34719N2138N6959O1371O5058O8320P1418P3712P4093P2160O8342O2870
62686A661160N5366M5562L3884K1045P572o002j8908l0523m0869n0303n8745o5446
62674A553793o9660p1394p1363p0275o8303o5368o1725n7985n4486n0943m6970
62663H65321m2801l9106l6032l2842k8842k4533k1294j9829j9292j8293j6392
62652E66065j4289j2782j2088j2002j2035j1415r679p437n965n697n764n282m378
$$ plain form
62735 737810 710888 687029 666555 648980 633185 618556 605449 594353 585187 577663 571669 566930
62723 566930 562857 559216 556479 555052 554638 554820 555808 558050 561555 566201 572296 580140 589392 599615 611243
62708 611243 625278 642146 661602 683692 709023 737953 770215 805588 844428 887333 934719
62697 934719 986857 1043816 1105187 1170245 1238565 1309983 1383695 1457788 1529948 1598290 1661160
62686 1661160 1716526 1762088 1795972 1817017 1824589 1818587 1799679 1769156 1728287 1677984 1619239 1553793
62674 1553793 1484133 1412739 1341376 1271101 1202798 1137430 1075705 1017720 963234 912291 865321
62663 865321 822520 783414 747382 714540 685698 661165 639871 620042 600750 582457 566065
62652 566065 551776 538994 526906 514904 502869 491454 481775 474338 468373 462676 456912 451630 447252
62639D47252l562k841k124j786k042k261j803j091q97r48l81O20Q98J29o37n58
62623D27968j18j56o25q61n22K61J212K033K597L230M287N380N680N271N364O711
62607D67712Q523R548R610R484R775J0703J2530J5362J8638K1611K4287K7333
62595F45116L0984L4716L8058M1186M4432M7599N0112N1618N2058N1137M8206
62584A135222M3001L6282K9225K2069J3918M262n881j4896k2315k8886l5052m0276
62572A136673m3986m6354m7786m8216m7400m5518m3085m0532l8070l5687l3145
62561F66894l0246k7169k4189k1243j8256j5773j4449j3870j2727j0517q186o735
62549D63534n965n194m362l764l314k828k536k608k578j966j091n60k98J56O93
$$ plain form
62639 447252 443690 440849 438725 436939 434897 432636 430833 429742 428845 427897 427516 428136 429034 429163 428526 427968
62623 427968 427850 427694 427069 426208 425686 425947 427159 429192 431789 435019 439306 444686 450366 455637 461001 467712
62607 467712 476235 485783 495393 504877 514652 525355 537885 553247 571885 593496 617783 645116
62595 645116 676100 710816 748874 790060 834492 882091 932203 983821 1035879 1087016 1135222
62584 1135222 1178223 1214505 1243730 1265799 1279717 1283979 1278098 1263202 1240887 1212001 1176949 1136673
62572 1136673 1092687 1046333 998547 950331 902931 857413 814328 773796 735726 700039 666894
62561 666894 636648 609479 585290 564047 545791 530018 515569 501699 488972 478455 470269 463534
62549 463534 457569 452375 448013 444249 440935 438107 435571 432963 430385 428419 427328 426768 426470 426626 427319
62534D27319P17J15n35o94k61O10J602K319K769L556N095O926Q355R564J1355
62519D78812J3955J6781J9345K1762K4276K6924K9698L2565L5276L7554L9446
62508G76394M1046M1999M1797M0494L8500L5718L1531K5753J8984J1912M777k239
62496A106666q676j4134j8514k1778k3779k4530k4304k3270k1390j8726j5494
62485H92071j1703p148j989L050P327J0852J4020J7060J9893K2218K3439K2894
62473A011984K0433J6695J2500Q121L343j959p590j3293j8894k4147k8695l2247
62461I46251l4745l6329l7167l7316l6723l5353l3378l1102k8697k6023k2860
62450E86558j9349j6079j3614j1949j0561r014p353n830m454l012j387L36K040
$$ plain form
62534 427319 428036 428151 427616 426922 426661 427271 428873 431192 433961 437517 442612 449538 457893 467457 478812
62519 478812 492767 509548 528893 550655 574931 601855 631553 664118 699394 736948 776394
62508 776394 817440 859439 901236 941730 980230 1015948 1047479 1073232 1092216 1104128 1108905 1106666
62496 1106666 1097990 1083856 1065342 1043564 1019785 995255 970951 947681 926291 907565 892071
62485 892071 880368 873220 871231 874281 881608 892460 906480 923540 943433 965651 989090 1011984
62473 1011984 1032417 1049112 1061612 1069733 1073076 1071117 1063527 1050234 1031340 1007193 978498 946251
62461 946251 911506 875177 838010 800694 763971 728618 695240 664138 635441 609418 586558
62450 586558 567209 551130 537516 525567 515006 505992 498639 492809 488355 485343 483956 484292 486332
62437D86332L558M588M910M674M188L506K508J363M10m51j721l490n178o346p245
62422D91606q195q839q629p775p199p434p987p887o738n144m154m193m635m586
62408C98211l908l135k534j867j148q79j236j591j320o08m8J28N0q8Q9R48K094
62391C83158K346J164l89q40o4R24J536K057K703L204L472L839M443M970N182
62376D17705N248N439N873O607P553Q352Q693Q771R026R570J0275J1224J2587
62363E26923J4252J6052J8247K1186K4669K8269L2021L6158M0330M3937M7040
62352H49084N0023N2346N2698N0569M6721M1810L5585K7906J9704J2103N227j434
62340A242342p912j3778j8953k3832k8506l2433l4966l6077l6377l6453l6122
$$ plain form
62437 486332 489890 494478 499388 504062 508250 511756 514264 515627 516037 515586 513865 510375 505197 498851 491606
62422 491606 483411 474572 465943 458168 450969 443535 435548 427661 420923 415779 411625 407432 402797 398211
62408 398211 394303 391168 388634 386767 385619 384740 383504 381913 380593 379985 379937 380065 380115 380027 380116 381064 383158
62391 383158 385504 386668 386279 385439 385375 386299 387835 389892 392595 395799 399271 403110 407553 412523 417705
62376 417705 422953 428392 434265 440872 448425 456777 465470 474241 483267 492837 503112 514336 526923
62363 526923 541175 557227 575474 596660 621329 649598 681619 717777 758107 802044 849084
62352 849084 899107 951453 1004151 1054720 1101441 1143251 1178836 1206742 1226446 1238549 1243776 1242342
62340 1242342 1234430 1220652 1201699 1177867 1149361 1116928 1081962 1045885 1009508 973055 936933
62329I36933l4617l1651k8124k5234k3102k0913j8345j6132j4953j4570j4361
62318F94931j4229j4473j5197j6230j7306j8022j7935j6967j5530j4073j2833
62307E22136j2050j1893j1961j1412r975q324p113o109m744l112j841j238j060
62294D31304r55o92q1R34K055K851L143L143L281L967N208O408O896O806P053
62279D81321Q158R563J0385J0452J0210R978R790R678R658R576R371R338R729
62266F07207J0219J0272R951J0046J1291J3759J6915K0040K2699K5085K7951L1902
62254H17337L6813M1966M6642N0262N2177N1702M8563M3204L6623K9886K3575
62243A278750J7471J0855L329m652j2154j8695k4607l0492l6394m1608m5349m7551
$$ plain form
62329 936933 902316 870665 842541 817307 794205 773292 754947 738815 723862 709292 694931
62318 694931 680702 666229 651032 634802 617496 599474 581539 564572 549042 534969 522136
62307 522136 510086 498193 486232 474820 464845 456521 449408 443299 438555 435443 433602 432364 431304
62294 431304 430349 429657 429576 430510 432565 435416 438559 441702 444983 448950 454158 460566 467462 474268 481321
62279 481321 489479 499042 509427 519879 530089 540067 549857 559535 569193 578769 588140 597478 607207
62266 607207 617426 627698 637649 647695 658986 672745 689660 709700 732399 757484 785435 817337
62254 817337 854150 896116 942758 993020 1045197 1096899 1145462 1188666 1225289 1255175 1278750
62243 1278750 1296221 1307076 1310405 1305753 1293599 1274904 1250297 1219805 1183411 1141803 1096454 1048903
62231A048903m8823m9516m9111m6918m3247l9375l6246l3602l0605k6974k3255
62220F21231k0196j8104j6655j5165j3207j1012r128p673o261m760l651l364l599
62207D88456l664l366l146l353l658l348k161p01J41J95K27R46K123L083L736
62192D75510M530N514O239O680P435Q746R949J0368J0209J0117J0258J0358J0293
62179E86206J0086R600Q707P683O958O598O394O320O601P379Q640J0469J3115
62166F94756J6798K1439K6483L1017L4336L6496L8018L8998L8878L7147L3853
62155A048219K9253K3538J7183J0993N366n1n580j0824j5310j9272k3173k6722
62143A033620k9165l0391l1017l1300l0634k8422k5041k1611j8938j6853j4551
$$ plain form
62231 1048903 1000080 950564 901453 854535 811288 771913 735667 702065 671460 644486 621231
62220 621231 601035 582931 566276 551111 537904 526892 517764 510091 503830 499070 495419 492055 488456
62207 488456 484792 481426 478280 474927 471269 467921 465760 465059 465200 465395 465622 466568 468691 471774 475510
62192 475510 480040 485554 491793 498473 505908 514654 524603 534971 545180 555297 565555 575913 586206
62179 586206 596292 605892 614599 622282 629240 635838 642232 648552 655153 662532 671172 681641 694756
62166 694756 711554 732993 759476 790493 824829 861325 899343 938341 977219 1014366 1048219
62155 1048219 1077472 1101010 1118193 1129186 1134552 1134501 1128921 1118097 1102787 1083515 1060342 1033620
62143 1033620 1004455 974064 943047 911747 881113 852691 827650 806039 787101 770248 755697
62132G55697j1527q233n667m338l779l144j993m12J268K698L766M806O164P465
62118G42771P708O558M927L880L343K559J396N12K14j00j243l419o219r054j1420
62103G42413j2952j3423j2835j1536j0094q742o980m267j080J294K268K625L317
62090F70008M282M980N447O083O852P401P705P877P675O957O356O728Q039R469
62076G65859J0537J1433J2393J3450J4694J6109J7197J7496J7319J7354J7664
62065I31505J7871J8175J9274K1185K3062K4312K4987K4929K3472K0465J6709
62054A165946J2888Q765L983r70n244q687j1812j5049j8493k2102k5672k8826
62042A054727l1374l3573l5670l7398l8176l7683l6063l3795l1485k9563k7950
$$ plain form
62132 755697 744170 735937 730270 725932 722153 719009 717016 716604 717872 720570 724336 729142 735306 742771
62118 742771 750479 757037 761964 765844 769187 771746 773142 773654 773868 773768 772525 769106 762887 753833 742413
62103 742413 729461 716038 703203 691667 681573 672831 665851 661584 660504 661798 664066 666691 670008
62090 670008 674290 679270 684717 690800 697652 705053 712758 720635 728310 735267 741623 748351 756390 765859
62076 765859 776396 787829 800222 813672 828366 844475 861672 879168 896487 913841 931505
62065 931505 949376 967551 986825 1008010 1031072 1055384 1080371 1105300 1128772 1149237 1165946
62054 1165946 1178834 1187599 1191582 1190612 1185368 1176681 1164869 1149820 1131327 1109225 1083553 1054727
62042 1054727 1023353 989780 954110 916712 878536 840853 804790 770995 739510 709947 681997
62031F81997k6175k3950k1383j8683j5998j3646j2008j1025j0143r067q136p691
62019E04092p487p108o661o565o816o918o551n962n557n332m900m066l192k779
62005D24198k698k233j047L05J175J743K564L560M172M333M393M167L053J274
61991D48959M8L2L98jj262k726m065n276o142o424o292o090n919n814n974o257
61975C87195o065n231m545m635m876m262k994k188k197k263j864j348j101r37
61961C42689o01j67L17R17J359J223Q15J077K229L255L238K529K103K348L079
61946C66410M239N797P341Q466R369J0473J1736J2850J3874J5012J5976J6313
61934D97856J6176J6108J6167J5969J5509J5115J4646J3599J2119J0920R987Q315
$$ plain form
62031 681997 655822 631872 610489 591806 575808 562162 550154 539129 528986 519919 511783 504092
62019 504092 496605 489497 482836 476271 469455 462537 455986 450024 444467 439135 434235 430169 426977 424198
62005 424198 421500 419267 418220 418525 419700 421443 424007 427567 431739 436072 440465 444632 447685 448959
61991 448959 449007 449039 449437 449436 448174 445448 441383 436107 429965 423541 417249 411159 405240 399426 393452 387195
61975 387195 381130 375899 371354 366719 361843 357581 354587 352399 350202 347939 346075 344727 343626 342689
61961 342689 342088 341921 342238 343155 344514 345737 346552 347629 349858 353113 356351 358880 360983 363331 366410
61946 366410 370649 376446 383787 392253 401622 412095 423831 436681 450555 465567 481543 497856
61934 497856 514032 530140 546307 562276 577785 592900 607546 621145 633264 644184 654171 662486
61922F62486N390K060o55k773m753o415p351p756p977p736o639n021l281r14K652
61907F11317O563R245J0519J1663J3201J4000J3061J0878Q369N636K569k83k531
61894G14207m801p715j0595j2319j2991j3664j4563j4769j3683j1896j0386r625
61882E77200r587r977j0244r898r125q586q550q655q559q385q316q194p755o941
61868D54428n877m695l488k197o72R89K274K844L151M018N708P803R889J1838
61854D86013J3442J4414J4958J5822J7509J9773K2076K4157K6012K7563K8627
61843G10366K8955K8250K6322K3286J9448J5072J0459O089K288j142m495p444
61831H57454r303r932r869r351p940n324j958J488M824Q039J0656J1956J1682
$$ plain form
61922 662486 667876 669936 669281 666508 661755 655340 647989 640233 632256 624520 617881 612860 609579 608665 611317
61907 611317 617880 627125 637644 649307 662508 676508 689569 700447 708816 714452 717021 716738 714207
61894 714207 709406 701691 691096 678777 665786 652122 637559 622790 609107 597211 586825 577200
61882 577200 567613 557636 547392 537494 528369 519783 511233 502578 494019 485634 477318 469124 461369 454428
61868 454428 448551 443856 440368 438171 437499 438488 440762 443606 446757 450775 456483 464286 474175 486013
61854 486013 499455 513869 528827 544649 562158 581931 604007 628164 654176 681739 710366
61843 710366 739321 767571 793893 817179 836627 851699 862158 868247 870535 869393 864898 857454
61831 857454 848151 838219 828350 818999 811059 805735 803777 805265 810089 818128 828784 840740 852422
61818H52422J0162P792M771J268k470o327j0373j4585j8598k1845k3974k5085
61806G53158k5462k5233k4459k3459k2640k1914k0726j8874j6891j5293j3844
61795E24363j2150j0532r654r409q939p754o191m699l394k491k446l260m057l846
61781D35541k598j312j062j979l033k971j671m06m28j551k521k542j852r89k30
61766D10396K17K66K12L99N66K43k79j97N12J020J058J398K409L202K868J863
61750D26153J232J136R65N37K14K0m84j379k131k210j647r27o33j108k112k855
61734D14771k667j676o31j45j76j62M19J431K012J494L34k45K66J180J730K054
61718D19989K607L179L156K516J899J759J913J945J629J024L23l40j050j955k937
$$ plain form
61818 852422 862584 870376 875147 876415 873945 867618 857245 842660 824062 802217 778243 753158
61806 753158 727696 702463 678004 654545 631905 609991 589265 570391 553500 538207 524363
61795 524363 512213 501681 492027 482618 473679 465925 459734 455035 451641 449150 446704 443444 439387 435541
61781 435541 432943 431631 430569 428590 425557 422586 420915 420509 420081 418530 416009 413467 411615 410626 410396
61766 410396 410613 410879 411091 411490 412056 412299 412020 411823 412335 413355 414413 415811 418220 421422 424290 426153
61750 426153 427385 428521 429486 430023 430237 430257 429773 428394 426263 424053 422406 421479 420846 419738 417626 414771
61734 414771 412104 410428 409797 409652 409476 409314 409733 411164 413176 414670 415004 414759 415025 416205 417935 419989
61718 419989 422596 425775 428931 431447 433346 435105 437018 438963 440592 441616 441939 441599 440549 438594 435657
61703D35657l598l674l271k699k364k692l714m670m698l872l080k717k337j778
61689C90493j691k456l338l483l029k576k144j489j000j263k042k529k496k372
61675C58585k266j763q13j13l15j254k150k325j707q24l00j91k4M44Q15O52J12
61658C46563l24m32k00L58R48J035O20M51R60J432J006j3n93l50L65J430K939
61641C56195M372M825M245L595L555L796L714L145K136P14q34k025k806l622m586
61626C76419n141m848m047l374k979k556j910j171o11m35o47j017j294j387j290
61611C43712r82o37o66j199j759j935k109k905m048m502l932l215l207l633l684
61596C05299l292l146l585m041l668k368r23k46m98j112j464j391j007m89j83
$$ plain form
61703 435657 432059 428385 425114 422415 420051 417359 413645 408975 404277 400405 397325 394608 392271 390493
61689 390493 388802 386346 383008 379525 376496 373920 371776 370287 369287 368024 365982 363453 360957 358585
61675 358585 356319 354556 353743 353630 353315 352061 349911 347586 345879 345055 344755 344564 344540 344984 345799 346451 346563
61658 346563 346239 345807 345607 345965 346913 347948 348568 349019 349979 351411 352417 352404 351811 351461 351826 353256 356195
61641 356195 360567 365392 369637 373232 376787 380583 384297 387442 389578 390292 389458 387433 384627 381005 376419
61626 376419 371278 366430 362383 359009 356030 353474 351564 350393 349782 349347 348700 347683 346389 345002 343712
61611 343712 342730 342093 341427 340228 338469 336534 334425 331520 327472 322970 319038 315823 312616 308983 305299
61596 305299 302007 298861 295276 291235 287567 285199 284276 284030 283532 282420 280956 279565 278558 278069 277886
61581B77886m93j315j887j657j010o78o30k32O31J216Q72j48j014j216r54q50
61565B68521j205j564j191j20P19P12L88N31R85J140J147J600K162J680j1j438
61549B74056j212K58J427J475R40O83Q50R14N21M6J76R40J523J308P71Q10J450
61532B86936J827J476Q73N86N09K13l73r11j023o10JK40q4m87m52j31K9O6L10
61513B88995N33J77p07j448j740j838j715r70K42J042R62N11K21p8o51j212j395
61496B80929j261q97j88N66N66l47j106p32L25R10Q21Q12J277J762J769J330P40
61479B87276K88K59O96J112R62L94Q4K90N70N85O71J272K153K477J724K65r58
61462C00120j337j073q29r46j146r41j52R20J652J496M71o59j035n98j18k02o02
$$ plain form
61581 277886 277393 276078 274191 272534 271524 270846 270216 269984 270615 271831 272703 272555 271541 270325 269371 268521
61565 268521 267316 265752 264561 264441 265160 265872 266260 266791 267776 268916 270063 271663 273825 275505 275494 274056
61549 274056 272844 273102 274529 276004 276944 277627 278477 279391 279912 279958 280134 281074 282597 283905 284676 285486 286936
61532 286936 288763 290239 291112 291698 292207 292420 292047 291136 290113 289503 289504 289744 289660 289173 288721 288590 288619 288685 288995
61513 288995 289528 289705 288998 287550 285810 283972 282257 281287 281529 282571 283533 284044 284265 284187 283536 282324 280929
61496 280929 279668 278771 278583 279149 279715 279368 278262 277530 277855 278765 279586 280398 281675 283437 285206 286536 287276
61479 287276 287564 287823 288519 289631 290593 290987 291071 291361 291931 292516 293187 294459 296612 299089 300813 301078 300120
61462 300120 298783 297710 296881 295935 294789 293848 293696 294616 296268 297764 298235 297576 296541 295943 295825 295623 295021
61445B95021o84l20J3q3m05l33N17J841K853L012K484J861J569J684K104K621
61429C13755K947K950K795K600K222J656J315J423J473Q87K9k48J38N31P72J365
61413C36610K240K408J404J87q6M54Q20N92J64q9k37m84r49j636k336k649k413
61396C34000j858j243o07j36k49r98j752j918j576j075m77K08N98M37J62L95J014
61379C24925J333J134R35J240J970K716L178L243K930K435K072K068K376K655
61365C55210K472J730Q85N60Q51J298J514J552J652J969K600L518M379M797M916
61350C89903N175N487N243M366L651L687M022L895L274K585J900J079M37N73J555
61335D36832K725L337L074K073P36m97j423k030k236j967j520j371j459j203m46
$$ plain form
61445 295021 294337 294017 294030 293947 293542 293209 293726 295567 298420 301432 303916 305777 307346 309030 311134 313755
61429 313755 316702 319652 322447 325047 327269 328925 330240 331663 333136 334023 334052 333804 333942 334473 335245 336610
61413 336610 338850 341258 342662 342849 342763 343217 344037 344629 344793 344704 344467 343983 343034 341398 339062 336413 334000
61396 334000 332142 330899 330292 330156 329907 328909 327157 325239 323663 322588 322111 322319 322917 323354 323516 323911 324925
61379 324925 326258 327392 328327 329567 331537 334253 337431 340674 343604 346039 348111 350179 352555 355210
61365 355210 357682 359412 360297 360857 361708 363006 364520 366072 367724 369693 372293 375811 380190 384987 389903
61350 389903 395078 400565 405808 410174 413825 417512 421534 425429 428703 431288 433188 434267 434704 435277 436832
61335 436832 439557 442894 445968 448041 448777 448280 446857 444827 442591 440624 439104 437733 436274 435071 434625
61320D34625J48L2m24n33j70L80J010J692K152K259K438L236M662O350Q045R543
61304D75445J0528J0906J0941J0695R779Q138O546N695N196M222K740J407N18
61291E62756k12j015j896k924m059m897n216n519o416p590q131p758o971o059
61277D94093m792l227k078j880k261k299j449N7J526K435K815K978K919K443J825
61262D93105J801K604L598M289M990N988O729O569N795N081M378L266J985J205
61248E51383J031J077J215J414J171R1j241j959k282l048m102m377l651k968l049
61233E30705l389l245k631j947j378r73n55M72K403M261M604L477K449K507L080
61218E39840L558M422N988P274P238O456O371P252P950P512O173M760L800L252
$$ plain form
61320 434625 434773 434805 434381 433848 433678 434058 435068 436760 438912 441171 443609 446845 451507 457857 465902 475445
61304 475445 485973 496879 507820 518515 528294 536432 542978 548673 553869 558091 560831 562238 562756
61291 562756 562544 561529 559633 556709 552650 547753 542537 537018 530602 523012 514881 507123 500152 494093
61277 494093 489301 486074 483996 482116 479855 477556 476107 476164 477690 480125 482940 485918 488837 491280 493105
61262 493105 494906 497510 501108 505397 510387 516375 523104 529673 535468 540549 544927 548193 550178 551383
61248 551383 552414 553491 554706 556120 557291 557382 556141 554182 551900 548852 544750 540373 536722 533754 530705
61233 530705 527316 524071 521440 519493 518115 517142 516587 517059 519462 523723 528327 531804 534253 536760 539840
61218 539840 543398 547820 553808 561082 568320 574776 581147 588399 596349 603861 610034 614794 618594 621846
61204F21846K797K296K107K692L885M917N486O225P804R975J1920J3166J3723
61191G08839J3648J2938J1676R973P951N984M582L797L079J964N53r00k368l758
61177G77958m646m822m729m957n555o206o772p302p734p948q006q061q252q742
61163F84226r550j0201j0061r256q766r229j0093j0403r899q860p339n304l225
61150E72040j762q85%J000J452Q42m93j887l179m645o199p164o997o030n184m856
61134E26053m496l434j852m90M49J459K892M447N664O463P046P638Q499R752J1086
61119E81176J2056J2825J4088J6007J7791J8720J9136J9860K1013K1942K2227
61108G76841K2191K2352K2665K2500K1275J9109J6732J4701J2824J0615Q093N703
$$ plain form
61204 621846 624643 626939 629046 631738 635623 640540 646026 652251 660055 670030 681950 695116 708839
61191 708839 722487 735425 747101 757074 765025 771009 775591 779388 782467 784431 784984 784084 781716 777958
61177 777958 773312 768490 763761 758804 753249 747043 740271 732969 725235 717287 709281 701220 692968 684226
61163 684226 674676 664475 654414 645158 636392 627163 617070 606667 596768 587908 580569 575265 572040
61150 572040 570278 569393 569393 570393 571845 572687 572194 570307 567128 562483 556284 549120 542123 536093 530909 526053
61134 526053 521557 518123 516271 515781 516230 517689 520581 525028 530692 537155 544201 551839 560338 570090 581176
61119 581176 593232 606057 620145 636152 653943 672663 691799 711659 732672 754614 776841
61108 776841 799032 821384 844049 866549 887824 906933 923665 938366 951190 961805 969898 975601
61096I75601L531J163j619m525p161r319j0792j1567j2262j3627j5341j6025j4946
61083H63111j3021j1616j0915j0120q820p400o267n370m477l482k384j199M6J373
61069G79459K741L841M356M520N118O632Q696J0514J1569J1816J1602J1522J1976
61056H84362J2783J3548J4355J5541J6816J7470J7504J7758J8566J9278J9512
61045A067493J9889K0895K1922K2235K2174K2486K3171K3816K4568K5832K7435
61034A321916K8966L0533L2356L3977L4751L4792L4736L4925L5550L7101L9804
61023A699407M3124M6692N1229N7530O5026P2450P9625Q7541R7272J09914J27090
61012B536900J50061J78912K14145K58557L15921L88736M79758N94839P40290
$$ plain form
61096 975601 979132 980295 978676 974151 966990 957671 946879 935312 923050 909423 894082 878057 863111
61083 863111 850090 838474 827559 817439 808619 801219 794952 789582 785105 781623 779239 778040 778086 779459
61069 779459 782200 786041 790397 794917 800035 806667 815363 825877 837446 849262 860864 872386 884362
61056 884362 897145 910693 925048 940589 957405 974875 992379 1010137 1028703 1047981 1067493
61045 1067493 1087382 1108277 1130199 1152434 1174608 1197094 1220265 1244081 1268649 1294481 1321916
61034 1321916 1350882 1381415 1413771 1447748 1482499 1517291 1552027 1586952 1622502 1659603 1699407
61023 1699407 1742531 1789223 1840452 1897982 1963008 2035458 2115083 2202624 2299896 2409810 2536900
61012 2536900 2686961 2865873 3080018 3338575 3654496 4043232 4522990 5117829 5858119
61003E858119R16847J119118J338750J557349J729556J783675J660963J367601
60995A7331978R84353O16854L35161J60004R1000J21711K16192K89252K40091
60986B0386596K1366l26791p12901j058315j326327j506367j592842j586184j502674
60977A0795561j370880j217575j060115r09148p72011o52139n49025m61088l87530
60968C416050l27245k77848k36920k03265j76303j54953j37601j22767j09516
60959A669632r7633q7279p8215o9583o0941n3021m6748m1944l7884l4651l2821
60948A028912l1963l0752k8689k6530k4772k2874k0475j8307j7177j6762j6145
60937G74466j5025j3829j3032j2923j3545j4385j4527j3660j2554j2122j2278
$$ plain form
61003 5858119 6774966 7894084 9232834 10790183 12519739 14303414 15964377 17331978
60995 17331978 18316331 18933185 19268346 19428350 19519350 19641061 19857253 20146505 20386596
60986 20386596 20407962 20081171 19368270 18309955 16983628 15477261 13884419 12298235 10795561
60977 10795561 9424681 8207106 7146991 6237843 5465832 4813693 4264668 3803580 3416050
60968 3416050 3088805 2810957 2574037 2370772 2194469 2039516 1901915 1779148 1669632
60959 1669632 1571999 1484720 1406505 1336922 1275981 1222960 1176212 1134268 1096384 1061733 1028912
60948 1028912 996949 966197 937508 910978 886206 863332 842857 824550 807373 790611 774466
60937 774466 759441 745612 732580 719657 706112 691727 677200 663540 650986 638864 626586
60926F26586j2255j1682j0817r958r272q928q860q490p296n615m342l907l961
60913E21203m030l909l464k636j739j252j144r42n27l14m09k47N23J308J308N98
60897E04327o1k65k52k96m61q35j461j960j843j334j281k010k835l143l452m682
60881D78156o671q171q377p770p222o857o251n409m815m564m074k908j472n48
60867D03047l28k66J91J080K014K555K477K011J793K170K555J947L01j103j055
60852D19389K36J605K337K512K287J655R00N77P34P39J65o23j013q95o02m60p18
60835D28825j552k776l786m111l850l432l173l266l833m690n301n263m588l384
60821C75820j737k04J63j019k637l208k667k347l125m341m790m157l135k539k614
$$ plain form
60926 626586 614331 602649 591832 581874 572602 563674 554814 546324 539028 533413 529071 525164 521203
60913 521203 517173 513264 509800 507164 505425 504173 503029 502087 501560 501246 500837 500590 501113 502421 503729 504327
60897 504327 504266 504001 503749 503453 502992 502157 500696 498736 496893 495559 494278 492268 489433 486290 482838 478156
60881 478156 471485 463314 454937 447167 439945 433088 426837 421428 416613 412049 407975 405067 403595 403047
60867 403047 402719 402453 402644 403724 405738 408293 410770 412781 414574 416744 419299 421246 421547 420444 419389
60852 419389 419625 421230 423567 426079 428366 430021 430921 431498 432232 432971 433136 432513 431500 430605 430003 429543 428825
60835 428825 427273 424497 420711 416600 412750 409318 406145 402879 399046 394356 389055 383792 379204 375820
60821 375820 374083 373879 374042 373023 370386 367178 364511 362164 359039 354698 349908 345751 342616 340077 337463
60806C37463k959k909k165j217q79j312j800j656r99m14j56n2Q6K62M34N52M52
60789C22731L1m85o85m76j99j70k16O3P25J369J708J885K134K323K200J907J753
60772C36598J500N15j130k271j924n47O22J169J716K555K983K346J055Qn80j167
60756C43448j882k138j385R9J379J702J073R4o76j108j251r39M4J388K220J906
60740C43974O70o96j670k202k439k578k957l773m620m662l590k136j319j370j723
60725C08909j931k089k331k334j738p08K41Q90J384J749J737J248N86J33J8K41
60709C06005P76J385J565J044K32j48J57P44J132J251J314J474J717J872J636
60694C22156P63n28j512j563q17l2K41J51J69M56Q06J041J137J053P48M32M81
$$ plain form
60806 337463 334504 331595 329430 328213 327334 326022 324222 322566 321567 321153 320997 320945 321031 321293 321727 322279 322731
60789 322731 322762 322277 321592 321116 320917 320747 320531 320594 321319 322688 324396 326281 328415 330738 332938 334845 336598
60772 336598 338098 338613 337483 335212 333288 332741 333363 334532 336248 338803 341786 344132 345187 345195 344615 343448
60756 343448 341566 339428 338043 338142 339521 341223 342296 342390 341714 340606 339355 338416 338460 339848 342068 343974
60740 343974 344644 343948 342278 340076 337637 335059 332102 328329 323709 319047 315457 313321 312002 310632 308909
60725 308909 306978 304889 302558 300224 298486 297778 298019 298909 300293 302042 303779 305027 305613 305746 305764 306005
60709 306005 306781 308166 309731 310775 311007 310859 311016 311760 312892 314143 315457 316931 318648 320520 322156
60694 322156 322919 322391 320879 319316 318499 318467 318708 318859 319028 319484 320290 321331 322468 323521 324269 324701 325182
60677C25182R39J405J544J472J443J448J381J265J050M22p30j922k593k774k791
60662C26741k556j807r48q19j510k097j781p53L20J035J272J061Q48J284K349
60647C22639L136L013K488K392K602K304J215r2j052j660k177k701l128l263k949
60632C22767k313j796j697j782j599j042l94M9J71N8j3K69Q46J274J291J124J063
60615C18276J047R15P41O52O12O38Q83J238J275Q52L82J71j1l25m31j15J97J29
60597C27126nJ18R7m19q02k41R17J624J683J734J952J867J429J144J009M31n46
60580C39118r61k59R35J706J836J578J228J312K319L930N135N543N857O713P791
60565C83781Q583R242R966J0214R328P593N858M369K632L16k249m459n873o328
$$ plain form
60677 325182 326121 327526 329070 330542 331985 333433 334814 336079 337129 337551 336821 334899 332306 329532 326741
60662 326741 324185 322378 321430 320611 319101 317004 315223 314470 314790 315825 317097 318158 319006 320290 322639
60647 322639 325775 328788 331276 333668 336270 338574 339789 339697 338645 336985 334808 332107 328979 325716 322767
60632 322767 320454 318658 316961 315179 313580 312538 312144 312193 312364 312422 312409 312678 313524 314798 316089 317213 318276
60615 318276 319323 320238 320979 321631 322243 322881 323764 325002 326277 327129 327511 327682 327671 327346 326915 326800 326997 327126
60597 327126 327121 327239 327336 326917 326115 325874 326791 328415 330098 331832 333784 335651 337080 338224 339233 339664 339118
60580 339118 338157 337898 338833 340539 342375 343953 345181 346493 348812 352742 357877 363420 369277 375990 383781
60565 383781 392364 401606 411572 421786 431114 438707 444565 448934 451566 451882 449633 445174 439301 432973
60551D32973n992n240m283l024j462O6J305K483L935N525O860P947R254J1088
60537D61435J3180J4961J6065J6500J6403J5695J4119J1618Q592N600K895M16
60525E97479j916m103o106p699q414p986o866n905n581n748n973n772m763l078
60511E17569j444l75N00J719K973L626M078N534Q294J1311J3787J6241J9517K3528
60497F26858K7591L1374L4900L8093M0835M3061M4413M4250M2316L8863L3779
60486A046333K6335J6385N140n932j6375k6213l4707m0714m4081m5772m6536m6239
60474G87624m4577m1772l8389l4878l1546k8559k5724k2560j8930j5465j3133
60463D72091j2204j1721j0340p868n646n005n582n834n090m237m186m525m342
$$ plain form
60551 432973 426981 421741 417458 414434 412972 413038 414343 416826 420761 426286 433146 441093 450347 461435
60537 461435 474615 489576 505641 522141 538544 554239 568358 579976 588568 594168 597063 597479
60525 597479 595563 591460 585354 577655 569241 561255 554389 548484 542903 537155 531182 525410 520647 517569
60511 517569 516125 515750 516250 517969 520942 524568 528646 534180 542474 553785 567572 583813 603330 626858
60497 626858 654449 685823 720723 758816 799651 842712 887125 931375 973691 1012554 1046333
60486 1046333 1072668 1089053 1094193 1088261 1071886 1045673 1010966 970252 926171 880399 833863 787624
60474 787624 743047 701275 662886 628008 596462 567903 542179 519619 500689 485224 472091
60463 472091 459887 448166 437826 429958 424312 419307 413725 407891 402801 398564 394378 389853 385511
60450C85511l639l212l473m030m327m090l292k116r43k7P10J393J840J776J232
60435C63313N05j50o39j023j463j914j933j200k61j50j067k005k007j224l79J76
60419C48579M41L58N4J05Q93J976K598K576K256J866J444J099R67R47Q93Q74R94
60402C68920J199J444J712J746J281O84P09J369J805J646J614K220K781K570K126
60387C93826K361L021L162K679K253K090J893J848K436L322L570L068K650K725
60373D30904K821K672K723L196L572L433L083K882K675K302K080K254K445K166
60359D69208J586J395K070L524N252O655P471Q025Q814R781J0245R719Q449P057
60345E59251N782M244J889j290m392o279o706o593o849p361p511p220o813o147
$$ plain form
60450 385511 381872 378660 375187 371157 366830 362740 359448 357332 356389 356362 357072 358465 360305 362081 363313
60435 363313 363818 363668 363029 362006 360543 358629 356696 355496 355235 355085 354018 352013 350006 348782 348403 348579
60419 348579 349020 349378 349432 349537 350430 352406 355004 357580 359836 361702 363146 364245 365212 366159 367052 367926 368920
60402 368920 370119 371563 373275 375021 376302 376986 377695 379064 380869 382515 384129 386349 389130 391700 393826
60387 393826 396187 399208 402370 405049 407302 409392 411285 413133 415569 418891 422461 425529 428179 430904
60373 430904 433725 436397 439120 442316 445888 449321 452404 455286 457961 460263 462343 464597 467042 469208
60359 469208 470794 472189 474259 477783 483035 489690 497161 505186 514000 523781 534026 543745 552194 559251
60345 559251 565033 569277 571166 569876 565484 559205 552499 545906 539057 531696 524185 516965 510152 504005
60331E04005m813l155k314k963m492n696n868n121m020l137k637k274j824j436
60317D54255j209p64L91K157M022N777P566R426J1211J2829J4029J4203J3145
60304E47038J1752J1287J1830J2228J1555R914P761N169J986j860o295j0852j4454
60291E97059j6215j6518j6629j7035j6899j5394j2884j0366q356o762n442m403
60279D50156l674l276l163l104k875k528k177j641p96j20k61j085j799k002j927
60264D19728j635q69L1L0j245k784l372k976k361j873j255m10K78L87p5n83m78
60247D00538L83J345J657J452J490J969K209J737R46L56j28o76q99l91M74R04
60231D13366P03L68L67P24J228J654J825J698J432J262J315J578J848J825J489
$$ plain form
60331 504005 499192 496037 493723 490760 486268 480572 474704 469583 465563 462426 459789 457515 455691 454255
60317 454255 453046 452282 452673 454830 458852 464629 472195 481621 492832 505661 519690 533893 547038
60304 547038 558790 570077 581907 594135 605690 615604 623365 628534 630520 628660 622365 611513 597059
60291 597059 580844 564326 547697 530662 513763 498369 485485 475119 466763 460001 454559 450156
60279 450156 446482 443206 440043 436939 434064 431536 429359 427718 426922 426802 426541 425456 423657 421655 419728
60264 419728 418093 417224 417255 417285 416040 413256 409884 406908 404547 402674 401419 401009 401287 401674 401599 401016 400538
60247 400538 400921 402266 403923 405375 406865 408834 411043 412780 413726 414082 413954 413278 412379 411988 412462 413366
60231 413366 414069 414437 414804 415528 416756 418410 420235 421933 423365 424627 425942 427520 429368 431193 432682
60216D32682J373K011L164M044M323M381M535M637M623M792N187N352M992M427
60202D90523M019L748L704M336N618O554O224M978L866L200K477J475O39K70R6
60187E41727j63l81m65p51j546k503k871k448j933k166l112l923m005l668l543
60172E08249l675l580k940j878o87K21K62q04k259k924k359j173j50L69K66m60
60156D86478j354j736j488j120q43l18M68P81K17n40n76N1N99P62Q07R18R81R71
60138D85058J082J504K342L581M807N349M973M320M209M681N061M750L728K403
60124E37848J331Q50P61N29J6k79LM39L94JM2Q52J790J982J277L51j10m2J45K37
60104E48417L44L76j08j171k096k209j823j690j883j911j746j740j665r00K98
$$ plain form
60216 432682 434055 436066 439230 443274 447597 451978 456513 461150 465773 470565 475752 481104 486096 490523
60202 490523 494542 498290 501994 506330 511948 518502 524726 529704 533570 536770 539247 540722 541361 541631 541727
60187 541727 541564 541183 540718 539967 538421 535918 533047 530599 528666 526500 523388 519465 515460 511792 508249
60172 508249 504574 500994 498054 496176 495489 495710 495972 495168 492909 489985 487626 486453 486303 486672 486938 486478
60156 486478 485124 483388 481900 480780 479937 479619 480087 480868 481085 480545 479969 480020 480619 481381 482188 483106 484087 485058
60138 485058 486140 487644 489986 493567 498374 503723 508696 513016 517225 521906 526967 531717 535445 537848
60124 537848 539179 540029 540790 541319 541335 541056 541059 541498 541892 541893 541935 542787 544577 546559 547836 548187 548077 548035 548180 548417
60104 548417 548761 549137 549029 547858 545762 543553 541730 540040 538157 536246 534500 532760 531095 530195 530493
60089E30493Q62N13K50P60J358J177M54p1k50k73q9J50k58j595k992l489l343
60072E23657l421l844m109m156m364m729m975n210n704o166o085n567n085m599
60058D55643l764k865k631l097l505l344k815k216j576r68m68K14J439K810L426
60043D36283L071K588K727L165L055K222J407J392K090K628K358J655J459K030
60029D68130K609K419J465R6j523l065l882l872l946m836n940o240n951o154p004
60014D22306p462o852n713m823m230l577k778k043j637j721k054j912r31J43J83
59999C76899q27j749j779j226o94k88P7L29N57J047J724K082J991J993K413K797
59983C85346K663K260K007J678P95l91j044q67n23p92j585k061j583m21N64Q32
$$ plain form
60089 530493 531355 531868 532118 532878 534236 535413 535867 535796 535546 535273 535184 535334 535076 533481 530489 527000 523657
60072 523657 520236 516392 512283 508127 503763 499034 494059 488849 483145 476979 470894 465327 460242 455643
60058 455643 451879 449014 446383 443286 439781 436437 433622 431406 429830 428862 428394 428608 430047 432857 436283
60043 436283 439354 441942 444669 447834 450889 453111 454518 455910 458000 460628 462986 464641 466100 468130
60029 468130 470739 473158 474623 474719 473196 470131 466249 462377 458431 453595 447655 441415 435464 429310 422306
60014 422306 414844 407992 402279 397456 393226 389649 386871 384828 383191 381470 379416 377504 376573 376716 376899
59999 376899 376072 374323 372544 371318 370624 370336 370413 370742 371299 372346 374070 376152 378143 380136 382549 385346
59983 385346 388009 390269 392276 393954 394749 394358 393314 392447 391924 391132 389547 387486 385903 385482 386046 386878
59967C86878O03L84L16K15M0o4p9r4M7O91J794K751K927K299J432R58J072J356
59949D03526J162K87p90j432j487j271j095j082j236j436j416j088p28o36p30
59934C90548p48o53n43k98K43R15J373J548J639J729J818K018K421K770K722K318
59918D09820J868J485J057N67Q6m57j083j426r62L87K083L364L678L018K124J954
59902D27563K630L179K745J648P90M12J06k79m89m19j48M60J502K546L029L081
59886D48356L222L420L210K647K347K546K937L452M362N457O006N774N352N184
59872E04272M943M196L086K023J185O05K34k14r80j613j274M6J253J441R25O21
59856E20749Q79J425K036K761L614M419M916M906M399L659K888J945O17q50j867
$$ plain form
59967 386878 387481 387865 388181 388396 388436 388372 388293 388199 388246 388937 390731 393482 396409 398708 400140 401098 402170 403526
59949 403526 404688 404975 404185 402753 401266 399995 398900 397818 396582 395146 393730 392642 391914 391278 390548
59934 390548 389800 389147 388604 388306 388549 389464 390837 392385 394024 395753 397571 399589 402010 404780 407502 409820
59918 409820 411688 413173 414230 414797 414883 414426 413343 411917 410955 411342 413425 416789 420467 423485 425609 427563
59902 427563 430193 433372 436117 437765 438555 438967 439073 438794 438305 437886 437738 438198 439700 442246 445275 448356
59886 448356 451578 454998 458208 460855 463202 465748 468685 472137 476499 481956 487962 493736 499088 504272
59872 504272 509215 513411 516497 518520 519705 520310 520544 520330 519350 517737 516463 516509 517762 519203 520128 520749
59856 520749 521628 523053 525089 527850 531464 535883 540799 545705 550104 553763 556651 558596 559213 558363 556496
59841E56496k078j566o51M6k94j887l747m633m505m330m509m476l915l314k973
59826E13664k400j271j98O2l86r76j492j978k280k339k519l086l637l545k753
59811D84866j736q79l31j73m18r27j582k340k953l040k643k338k441k513k065
59796D58487j428j426k312l453m033l764k956k107j478r64l88J58M00K36k00p50
59780D34022j254j450j219q72p85p93l93N11J489K194K653K990L307L787M406
59765D48593M615L987L075K882L422L689L174K569K613L106L481L647L707L531
59751D96091L169L127L665M281M480M551M965N422N185M206L239K896L097L423
59737E51797L581L441K957K201J420R22Q07P89M48j89n63l26J76N02P96J251J347
$$ plain form
59841 556496 554418 552852 552201 552247 551953 550066 546319 541686 537181 532851 528342 523866 519951 516637 513664
59826 513664 511264 509993 509795 509857 509471 508495 507003 505025 502745 500406 497887 494801 491164 487619 484866
59811 484866 483130 482251 481920 481747 481329 480402 478820 476480 473527 470487 467844 465506 463065 460552 458487
59796 458487 457059 455633 453321 449868 445835 442071 439115 437008 435530 434566 434178 434336 434736 434972 434772 434022
59780 434022 432768 431318 430099 429227 428442 427649 427256 427767 429256 431450 434103 437093 440400 444187 448593
59765 448593 453208 457195 460270 463152 466574 470263 473437 476006 478619 481725 485206 488853 492560 496091
59751 496091 499260 502387 506052 510333 514813 519364 524329 529751 534936 539142 542381 545277 548374 551797
59737 551797 555378 558819 561776 563977 565397 566319 567126 567915 568363 568174 567611 567285 567461 567963 568759 570010 571357
59720E71357M60r47j682j310m44L59R82J050Q0j417k129j664r88p44l10Q40J919
59703E65412J909R94J22k36j02M58J062R43p2j038j091n94l27k82o9Q3k70q62
59685E66040j171j402k064k909l213k946k750k885k982k778k477k420k958m332
59671E28753o167p319o923n402l914l034k610k419k306j939j250q85j395k196
59657D80994k130j010J77O15M91M05O05R66J284J411J408J527J774J634O36r43
59641D89844k228k610k184j571j464k057k704k526j585r59j310j988k020j371
59627D63267o83k99k14n03j105j608j822k178k940l591l655l517l649l624k875
59612D31004j902j619j851j637q37l00m60p80o84j81N13J228J675J680J525J474
$$ plain form
59720 571357 571817 570870 569188 567878 567434 567793 568775 569825 569905 568488 566359 564695 563707 562963 562653 563493 565412
59703 565412 567321 568315 568437 568201 568099 568557 569619 570562 570490 569452 568361 567767 567440 567158 567089 567172 566902 566040
59685 566040 564869 563467 561403 558494 555281 552335 549585 546700 543718 540940 538463 536043 533085 528753
59671 528753 522586 515267 508344 502942 499028 495994 493384 490965 488659 486720 485470 484585 483190 480994
59657 480994 478864 477854 478031 478646 479137 479542 480147 481113 482397 483808 485216 486743 488517 490151 490787 489844
59641 489844 487616 485006 482822 481251 479787 477730 475026 472500 470915 469956 468646 466658 464638 463267
59627 463267 462584 462285 462071 461568 460463 458855 457033 454855 451915 448324 444669 441152 437503 433879 431004
59612 431004 429102 427483 425632 423995 423158 422858 422398 421618 420934 420753 421266 422494 424169 425849 427374 428848
59596D28848J251O30K88J053K572L671L901L747L419K572J359O34P52J018O42
59581D56357m14j718k778l135k702k107k027k211j920j261j116j641j949j486
59567D29892p73m02k55j47l91j117j713j548p67O1O05P77N84L13L71O32M87j41
59549D26468m15L31J635K525K704K700L117M176N730P408Q904J0422J2662J5929
59535E04296J9252K0618J8407J2814N914P4l804o321p981q317o989m909l384k533
59521E37137j519j05J010J380J307J039M01o37j754k892m277n626o146n619m878
59506E08821m818n488o346o834o557n520m456m232m746m993m451l644l103k591
59492D41042j831j225j168j204n93N05J150Q29J56J50J062K038K073J276Q39J566
$$ plain form
59596 428848 430099 430729 431017 432070 434642 438313 442214 445961 449380 451952 453311 453945 454697 455715 456357
59581 456357 455943 454225 451447 448312 445610 443503 441476 439265 437345 436084 434968 433327 431378 429892
59567 429892 429119 428717 428462 428315 427924 426807 425094 423546 422779 422840 423445 424222 424806 425119 425490 426122 426609 426468
59549 426468 426053 426384 428019 430544 433248 435948 439065 443241 448971 456379 465283 475705 488367 504296
59535 504296 523548 544166 562573 575387 581301 581375 577571 571250 563269 554952 547963 543054 539670 537137
59521 537137 535618 535513 536523 537903 539210 540249 540650 540013 538259 535367 531090 525464 519318 513699 508821
59506 508821 504003 498515 492169 485335 478778 473258 468802 464570 459824 454831 450380 446736 443633 441042
59492 441042 439211 437986 436818 435614 435021 435526 436676 437505 437661 437811 438873 440911 442984 444260 445099 446665
59476D46665K904L853M322M780N033M425L205K503K748L106K803K107J557J106
59462D91117N46R6L1L28R93K173L527M266M254M355N140N984O090N745N815O422
59446E46882O897O686N638L765J352q63k327l271m155m772m600l854l385l499
59432E40494l599l169k524k211k199k070j680j121j93J468L610N320O150O855
59418E45131Q486J1032J3583J5710J7873K0520K3491K6392K8516K8226K3762J5481
59406G78203O342q20n658r185j1355j1183q539m290Q22N849Q682P285K141m124
59392G54170r694j4681j9162k1940k2026k0024j7265j4566j2375j0946r739p702
59380E74050m879k744k259k564k314j395n54r2J92L71M51N92Q52J106J458K090
$$ plain form
59476 446665 449569 453422 457744 462524 467557 471982 475187 477690 480438 483544 486347 488454 490011 491117
59462 491117 491663 491759 491790 492118 493111 495284 498811 503077 507331 511686 516826 522810 528900 534645 540460 546882
59446 546882 553779 560465 566103 569868 571220 570357 568030 564759 560604 555832 551232 547378 543993 540494
59432 540494 536895 533726 531202 528991 526792 524722 523042 521921 521728 523196 526806 532126 538276 545131
59418 545131 553617 564649 578232 593942 611815 632335 655826 682218 710734 738960 762722 778203
59406 778203 784545 783725 778067 768882 757527 746344 737805 733515 734337 740186 748868 756153 758294 754170
59392 754170 744476 729795 710633 688693 666667 646643 629378 614812 602437 591491 581752 574050
59380 574050 569171 566427 564168 561604 559290 557895 557341 557249 557441 557812 558263 558855 559707 560813 562271 564361
59364E64361K541K027P39j75j93R6M30J488L493N442O530P220Q053Q567Q403Q390
59348F27412R447J1164J2535J3315J3809J4062J4169J4536J4871J3916J1167P928
59336G78331N559L676J303j211k994m507o829r615j1442j1912j1909j1956j1857
59323G04637j1736j1983j2198j1618j0580j0131j0238r765q399p131o604o334
59311E87920n844n316m621l049n29J957L899O048Q944J1465J1853R642N873J682
59297F29924k503o570j0125j2548j3523j3389j2856j2199j1007r047o998n801
59285E13358n394m763l215j126O49J556J606J299J390K310L773N254O631P941
59271E31269Q890R225R408J0133J1192J1594J0885R709Q852Q328P573O142M023
$$ plain form
59364 564361 566902 568929 569668 569493 569300 569396 569826 571314 574807 580249 586779 593999 602052 610619 619022 627412
59348 627412 636859 648023 660558 673873 687682 701744 715913 730449 745320 759236 770403 778331
59336 778331 783890 787566 788869 787658 784664 780157 773328 763713 752271 740359 728450 716494 704637
59323 704637 692901 680918 668720 657102 646522 636391 626153 616388 607989 600858 594254 587920
59311 587920 582076 576760 572139 569090 568561 570518 574417 580465 589409 600874 612727 622369 628242 629924
59297 629924 627421 620851 610726 598178 584655 571266 558410 546211 535204 526157 519159 513358
59285 513358 507964 503201 499986 498860 499509 501065 502671 503970 505360 507670 511443 516697 523328 531269
59271 531269 540159 549384 558792 568925 580117 591711 602596 612305 621157 629485 637058 643200 647223
59258F47223J679j59j125j648k443l590m521m858m733m415m056l798l666l364
59244F06526k611j618q66m40K8P82J730K706L534M006M100M041L851L156J884
59229F30809O77N2m47j532k962l947m509n436o916q159q542q344q149q144q150
59214E56301p880p046n795m849m670m698m114l142k622k511j951q87l51p64j172
59199E03849p57k7K33L19R85K050K633K391J742J057L90q3n0N01J247J970K609
59182E21059K976K869K480K326K630L064L188K932K523K141J795J491J306J338
59168E54118J581J947K310K521K475K302K336K698K950K513J386J66o76j179j520
59153E75928j789k275l440n166o473o530n717n175n473o100o198n424m171l228
$$ plain form
59258 647223 648902 648743 647618 645970 643527 639937 635416 630558 625825 621410 617354 613556 609890 606526
59244 606526 603915 602297 601431 600991 601019 601801 603531 606237 609771 613777 617877 621918 625769 628925 630809
59229 630809 631486 631538 631091 629559 626597 622650 618141 612705 605789 597630 589088 580744 572595 564451 556301
59214 556301 548421 541375 535580 530731 526061 521363 517249 514107 511485 508974 507023 506136 505785 505021 503849
59199 503849 503092 503065 503298 503617 504602 506652 509285 511676 513418 514475 514865 514782 514732 515233 516480 518450 521059
59182 521059 524035 526904 529384 531710 534340 537404 540592 543524 546047 548188 549983 551474 552780 554118
59168 554118 555699 557646 559956 562477 564952 567254 569590 572288 575238 577751 579137 579303 578627 577448 575928
59153 575928 574139 571864 568424 563258 556785 550255 544538 539363 533890 527790 521592 516168 511997 508769
59139E08769l169l810m367m305l867l690m065m719n059m602l411k144j311n74
59125D59676O44K007K594K379K359K969L497L610M213N867P542Q073Q035Q763
59111E22228J0163J0872J0358R459Q869Q305P299N948M692M011M179M784M739
59098F15906L523K007J294J180P22j01n18m45n96j151j506j419j310j344j272
59083F14970j252j806k837l595l753l658l527l399l745m988o366o510n366m320
59069E59848m219m447m309m033l923l631k956k403k357k574k886l557m384m413
59055E09756l282j930j306j172q96o99j162k087k687k612k064j212j94N18M05
59040D89376l89j054q78J04J105J245M65l04k14M40O98L78K98J009K155L286M481
$$ plain form
59139 508769 505600 501790 497423 493118 489251 485561 481496 476777 471718 467116 463705 461561 460250 459676
59125 459676 460320 462327 464921 467300 469659 472628 476125 479735 483948 489815 497357 505430 513465 522228
59111 522228 532391 543263 553621 563080 571949 580254 587553 593501 598193 602204 606383 611167 615906
59098 615906 619429 621436 622730 623910 624632 624531 624013 623568 622972 621821 620315 618896 617586 616242 614970
59083 614970 613718 611912 609075 605480 601727 598069 594542 591143 587398 582410 576044 569534 564168 559848
59069 559848 555629 551182 546873 542840 538917 535286 532330 529927 527570 524996 522110 518553 514169 509756
59055 509756 506474 504544 503238 502066 501170 500471 499309 497222 494535 491923 489859 488647 488453 488971 489376
59040 489376 488987 487933 487055 487159 488264 489509 489974 489670 489456 489896 490594 490972 491270 492279 494434 497720 502201
59023E02201N804O856P383P804Q661R867J0913J1500J1622J1243J0187Q269N611
59010F17921K828O89p10k010l434m127l397k114j758k301k272r13R21K225L010
58995F04558L603L837L522K968K513K084J560J013L68n05j274j377r19o03p25
58980F20623r45j057j085o53O43K188K883K890L555N322P016P744Q123Q952R894
58965F76093J0320J0376J0330R880Q938Q258Q338Q520Q015P034O015M535J982
58952G78634j253m221o498q143r098r548j0225j1543j2792j3025j2255j1104r855
58939F59074q571p620p188o746n837m967m774m793m032k552j467j386j724j659
58925E95758j050k83L10O36P27N82R0p91j702k158k164k181k343k208j504n99
$$ plain form
59023 502201 508005 514861 522244 530048 538709 548576 559489 570989 582611 593854 604041 612310 617921
59010 617921 620749 621438 620728 618718 615284 611157 607760 605646 603888 601587 599315 598402 599323 601548 604558
58995 604558 608161 611998 615520 618488 621001 623085 624645 625658 626026 625521 624247 622870 621951 621348 620623
58980 620623 619678 618621 617536 616883 617526 619714 622597 625487 629042 634364 641380 649124 657247 666199 676093
58965 676093 686413 696789 707119 716999 725937 734195 742533 751053 759068 766102 772117 776652 778634
58952 778634 777381 773160 766662 758519 749421 739873 729648 718105 705313 692288 680033 668929 659074
58939 659074 650503 642883 635695 628949 623112 618145 613371 608578 604546 601994 600527 599141 597417 595758
58925 595758 594708 594425 594735 595371 596098 596680 596770 595979 594277 592119 589955 587774 585431 583223 581719 581120
58909E81120Q0O08J212J911K713L734M879N927P074Q731J0612J1729J1619J0818
58895F62767R940R069Q387Q470R439J0587J1401J2129J2976J3571J3816J4335
58883G96887J5289J5665J4554J2425J0275Q202N770L190J150k71j665l462n631
58870H72378p958j0054j1391j1798j1592j0963r710p895o230n298m952m881n184
58857G64472n935o792p448p952q249q064p578p496q057q673q877q767q243o921
58843F55420n242m589n475o683o931o472o282o612p161p809q283p931o702n546
58829E63702n137m969m491m040l829l093j351M62J286J506K087K975L559L912
58815E52579M354M469L861L244L483M143M166L526K949K494J625L08j004k094
$$ plain form
58909 581120 581200 581808 583020 584931 587644 591378 596257 602184 609258 617989 628601 640330 651949 662767
58895 662767 672707 681776 690163 698633 708072 718659 730060 742189 755165 768736 782552 796887
58883 796887 812176 827841 842395 854820 865095 873297 879067 882257 883407 883136 881471 878009 872378
58870 872378 864420 854366 842975 831177 819585 808622 798912 791017 784787 779489 774537 769656 764472
58857 764472 758537 751745 744297 736345 728096 720032 712454 704958 696901 688228 679351 670584 662341 655420
58843 655420 650178 645589 640114 633431 626500 620028 613746 607134 599973 592164 583881 575950 569248 563702
58829 563702 558565 553596 549105 545065 541236 538143 536792 537254 538540 540046 542133 545108 548667 552579
58815 552579 556933 561402 565263 568507 571990 576133 580299 583825 586774 589268 590893 591201 590197 588103
58801E88103k772k547j570j179k300l922m441l935l743m306m866n046n259n609
58787E36608n622n157m552l872k860j504%J559K848L221K719K434L066L822L690
58772E36400K967K404J674P5j961l433m287n035n480n250m951n280n490m426k664
58757D95263j935k526k927k096n61P73J595J815J461J091J265J643J571J340J785
58742D99557K818L493L431L136L080L406M261N413N955N371M483M291M482M246
58728E57423L887M218M921N022M580M357M278L707K959K942L564M048M523N678
58714F16107P147P840P704P559P366O379M899M075L906L092J103j224l248n251
58700F67454p379r309j1105j3129j4994j5833j5569j4783j3644j2167j1074j0910
$$ plain form
58801 588103 585331 582784 581214 580035 577735 573813 569372 565437 561694 557388 552522 547476 542217 536608
58787 536608 530986 525829 521277 517405 514545 513041 513041 514600 517448 520669 523388 525822 528888 532710 536400
58772 536400 539367 541771 543445 543520 541559 538126 533839 528804 523324 518074 513123 507843 502353 497927 495263
58757 495263 493328 490802 487875 485779 485218 485991 487586 489401 490862 491953 493218 494861 496432 497772 499557
58742 499557 502375 505868 509299 512435 515515 518921 523182 528595 534550 539921 544404 548695 553177 557423
58728 557423 561310 565528 570449 575471 580051 584408 588686 592393 595352 598294 601858 605906 610429 616107
58714 616107 623254 631094 638798 646357 653723 660102 665001 669076 672982 676074 677177 675953 672705 667454
58700 667454 660075 650766 639661 626532 611538 595705 580136 565353 551709 539542 528468 517558
58688E17558j0710r227p049n789n563n220m691m951n755n644m335l092k495j858
58674D41179j059q91j219q16N90J971K942M151N472N976O043P286R744J1355J0955
58659E03679R730Q770P338M676J707l63j660k754l465l576l565l800m042m243
58645E08432m659m890m164k914k513l112l370k682j973j794j506q48n12n07J62
58630D73150J538K309K060K051K970L766L686L525L875L872K820J425L70o92j831
58615E04894k146j405p05n74q9J096J708J001J94M56J076R48L64J8l84j119j452
58598E03881r59n38r41j496j439j235j385j260k59J003J769K204K562K599K678
58583E07184L906O231P933Q082P871Q425Q964Q412P244O328N449M356L848M449
$$ plain form
58688 517558 506848 497621 490572 484783 479220 474000 469309 464358 458603 452959 448624 445532 443037 441179
58674 441179 440120 439229 438010 437194 437784 439755 442697 446848 452320 458296 464339 471625 481369 492724 503679
58659 503679 513409 522179 529517 534193 535900 535537 533877 531123 527658 524082 520517 516717 512675 508432
58645 508432 503773 498883 494719 491805 489292 486180 482810 480128 478155 476361 474855 474007 473495 472988 473150
58630 473150 474688 476997 479057 481108 484078 487844 491530 495055 498930 502802 505622 507047 507417 506725 504894
58615 504894 502748 501343 500638 500064 499975 501071 502779 503780 503974 504430 505506 506454 506818 506836 506452 505333 503881
58598 503881 502922 502384 501443 499947 498508 497273 495888 494628 494369 495372 497141 499345 501907 504506 507184
58583 507184 511090 517321 525254 533336 541207 549632 558596 567008 574252 580580 586029 590385 594233 598682
58569E98682N354N955P009R004J0922J1972J3073J5159J7512J9178K0534K1913
58557G56267K2229K0709J8560J7141J5761J3097R600O607M094J189j849l882m569
58544H74954m471m113m079n191p391r399j0529j1727j3763j5696j6376j6185j5938
58531G40096j5312j3798j2090j1066j0442r571q532p380n602l476k443k983l618
58518F33783l236k733l007l193k462j808k211k763k420j998k482k957k296j448
58504E98769j860k937l227k849k649k163o58R15J198O73O17Q42N35K55R58J966
58488E90385K034J544J673K294K690L292M688N931O011O048P756J0542J2355J2688
58474F69931J2634J2576J1934J0618Q910O431K998k08k018k999m277n496n743
$$ plain form
58569 598682 604036 609991 617000 626004 636926 648898 661971 677130 694642 713820 734354 756267
58557 756267 778496 799205 817765 834906 850667 863764 873364 879971 884065 885254 883405 879523 874954
58544 874954 870483 866370 862291 857100 849709 840310 829781 818054 804291 788595 772219 756034 740096
58531 740096 724784 710986 698896 687830 677388 667817 659285 651905 646303 642827 640384 637401 633783
58518 633783 630547 627814 624807 621614 619152 617344 615133 612370 609950 607952 605470 602513 600217 598769
58504 598769 596909 593972 590745 587896 585247 583084 582426 583341 584539 585212 585829 586671 587206 587461 588419 590385
58488 590385 592419 593963 595636 597930 600620 603912 608600 614531 620542 626590 634346 644888 657243 669931
58474 669931 682565 695141 707075 717693 726603 733034 736032 735824 733806 730807 726530 721034 715291
58461G15291n337n043m530l302k009j099M75L371O182P550Q358R674J0263Q648
58447G48492O080M676L874J609k035n068o624p213o896n687m829n139n116l129
58433G12995l74R36J042J538K161J662Q01J254K517K982L241N011P594Q698Q220
58418G60278P877P580N554J933j150k956m604o132o218m935m003m032m099l959
58404G41134m240m577m039l108k864k697j376L59R24R01J912L328L225K117K317
58389G33316L865M450L290J957J295O06o3K07R74Q70K67Q17K548M034N160O855
58373G70448Q545Q730P836P656Q332Q685Q869R750J0408R394P818P904R196R470
58359H93041Q747Q813R572R438Q792R279J0245R630P860P013O784N259L151L014
$$ plain form
58461 715291 709954 704911 700381 697079 695070 693971 694446 697817 703999 711549 719907 729581 739844 748492
58447 748492 754572 759248 763122 764731 762696 757628 751004 743791 736895 731208 726379 721240 716124 712995
58433 712995 712621 713557 714599 716137 718298 719960 720761 722015 724532 727514 730755 735766 743360 752058 760278
58418 760278 768155 775735 781289 783222 782072 779116 774512 768380 762162 757227 753224 749192 745093 741134
58404 741134 736894 732317 728278 725170 722306 719609 718233 718592 719516 720417 722329 725657 728882 730999 733316
58389 733316 737181 741631 744921 746878 748173 748779 748716 748923 749897 750767 751034 751851 754399 758433 763593 770448
58373 770448 778993 787723 795559 803215 811547 820232 829101 838851 849259 858653 866471 874375 883571 893041
58359 893041 901788 910601 920173 929611 938403 947682 957927 967557 975417 982430 989214 994473 997624 1000638
58345A000638M621N318M769N063O360O740O314P163R196J0250J0314J1385J3336
58332A101467J4189J4225J5396J6967J6442J4540J4341J5580J4936J2024R902
58321A260009R437Q429O680O506P702P374N477N193P025P907P014P052Q850J0047
58307A364702J0154J1502J4163J5289J4593J5006J6923J7331J5815J5735J8097
58296A529310J9879J9761J9973K1205K1283K0197K0773K3125K4103K3310K3813
58285A766732K5953K6662K5837K6871K9818L0804K9410K9679L2488L4161L4085
58274B092500L6045M0377M2563M1663M2191M5506M7472M7009M8545N3189N5975
58263B593035N5084N5366N9283O2716O3383O5033O9570P3257P4449P6743Q0948
$$ plain form
58345 1000638 1005259 1010577 1015346 1020409 1026769 1033509 1039823 1046986 1056182 1066432 1076746 1088131 1101467
58332 1101467 1115656 1129881 1145277 1162244 1178686 1193226 1207567 1223147 1238083 1250107 1260009
58321 1260009 1269446 1277875 1284555 1291061 1298763 1306137 1311614 1316807 1323832 1331739 1338753 1345805 1354655 1364702
58307 1364702 1374856 1386358 1400521 1415810 1430403 1445409 1462332 1479663 1495478 1511213 1529310
58296 1529310 1549189 1568950 1588923 1610128 1631411 1651608 1672381 1695506 1719609 1742919 1766732
58285 1766732 1792685 1819347 1845184 1872055 1901873 1932677 1962087 1991766 2024254 2058415 2092500
58274 2092500 2128545 2168922 2211485 2253148 2295339 2340845 2388317 2435326 2483871 2537060 2593035
58263 2593035 2648119 2703485 2762768 2825484 2888867 2953900 3023470 3096727 3171176 3247919 3328867
58252C328867Q2598Q1075Q2114Q7461R1432R1779R4218J01645J08775J12448J17303
58241D379715J26103J34390J39894J47309J58441J68018J74429J83817J98296
58232E810412K11407K20703K32885K50758K67660K80945K97782L21023L43220
58223H236795L61808L85641M18750M52707M83321N19143N64622O11645O57430
58214A2691862P13237P84885Q62901R43145J037732J153557J280627J414793J570343
58205B2453082J756639J966604K203928K495858K862585L302761L828737M485391
58197D5355585N314264O335587P591309R168435J1155230J3619553J6651175K0347419
58189A35538557K4690058K9468375L4303435L8545933M1004171M0020971L4335658
$$ plain form
58252 3328867 3411465 3492540 3574654 3662115 3753547 3845326 3939544 4041189 4149964 4262412 4379715
58241 4379715 4505818 4640208 4780102 4927411 5085852 5253870 5428299 5612116 5810412
58232 5810412 6021819 6242522 6475407 6726165 6993825 7274770 7572552 7893575 8236795
58223 8236795 8598603 8984244 9402994 9855701 10339022 10858165 11422787 12034432 12691862
58214 12691862 13405099 14189984 15052885 15996030 17033762 18187319 19467946 20882739 22453082
58205 22453082 24209721 26176325 28380253 30876111 33738696 37041457 40870194 45355585
58197 45355585 50669849 57005436 64596745 73765180 84920410 98539963 115191138 135538557
58189 135538557 160228615 189696990 224000425 262546358 303550529 343571500 377907158
58182C77907158K4167369J1360888j681451j3216433k2450207k9073581l2940166
58175C14073577l4191751l3367409l1184040k8248483k4993968k1745754j8723624
58168A21618548j6018291j3642371j1597154r869080q408650p162471o108457
58161D8812074n233594m503577l882413l359249k930152k573266k264826k001084
58153B2063913j783041j596426j426279j275381j149673j040106r35874q41346
58145A2015787p63394o95248o28625n69153n24269m87428m49126m12763l85287
58136G100494l62220l35931l09569k89512k72373k52079k31874k17365k05151
58127D624420j89745j74548j64979j57627j46916j35813j29646j25595j18403
$$ plain form
58182 377907158 402074527 413435415 411753964 398537531 376087324 347013743 314073577
58175 314073577 279881826 246514417 215330377 187081894 162087926 140342172 121618548
58168 121618548 105600257 91957886 80360732 70491652 62083002 54920531 48812074
58161 48812074 43578480 39074903 35192490 31833241 28903089 26329823 24064997 22063913
58153 22063913 20280872 18684446 17258167 15982786 14833113 13793007 12857133 12015787
58145 12015787 11252393 10557145 9928520 9359367 8835098 8347670 7898544 7485781 7100494
58136 7100494 6738274 6402343 6092774 5803262 5530889 5278810 5046936 4829571 4624420
58127 4624420 4434675 4260127 4095148 3937521 3790605 3654792 3525146 3399551 3281148
58118C281148j10446j06323j03209r6266q8193q4140q2129p7514p1971o9448o7925
58107B323584o3688n9203n8441n8809n5822n1506n0217n0305m7788m4350m3785
58096A739670m4234m1712l7876l6746l6887l4310l0175k8376k8210k6427k3977
58085A370740k3893k4905k3676k1184k0615k1188k0133j8532j9234k1151k1315
58074A134914k0457k0906k1351j9354j6813j7159j9142j9046j7129j6340j6448
58063I30769j5042j2729j1967j2158j1001r296r481j0826j0895j0270j1092j2387
58051G93625j1639r663r200r949r496q017p582p993p516o629o969p812p502o966
58037F76692p884q943p926n962n693o695o788o276o848p793p431o763p681r038
$$ plain form
58118 3281148 3170702 3064379 2961170 2864904 2776711 2692571 2610442 2532928 2460957 2391509 2323584
58107 2323584 2259896 2200693 2142252 2083443 2027621 1976115 1925898 1875593 1827805 1783455 1739670
58096 1739670 1695436 1653724 1615848 1579102 1542215 1507905 1477730 1449354 1421144 1394717 1370740
58085 1370740 1346847 1321942 1298266 1277082 1256467 1235279 1215146 1196614 1177380 1156229 1134914
58074 1134914 1114457 1093551 1072200 1052846 1036033 1018874 999732 980686 963557 947217 930769
58063 930769 915727 902998 891031 878873 867872 858576 849095 838269 827374 817104 806012 793625
58051 793625 781986 772323 763123 753174 743678 735661 728079 720086 712570 705941 698972 691160 683658 676692
58037 676692 668808 659865 651939 645977 640284 633589 626801 620525 613677 605884 598453 591690 584009 574971
58023E74971q589p301p571q757q647p775p957q155o320l930l985n710n872m335
58009D80067l611l852l029j448j350k415k184o81k64j135j217l77n14j574j553
57994D54863n14o04k046k927k980l805n315n676m775m228m006k759j209j458k872
57979D09689k643n95L86r06k486k940l110l484l190k278j911j886q95N38N12p46
57963C84055r87K23R24L63%N45R55Q29Q43O55p19k299k062o00n94k359l308k317
57945C74147j253j388j577r55m19l81J72J466K337K650L722N638O761O582O513
57930D04015P100P044N713M133K771Q21j579k996l298m168o236q061q658q764
57916C87837q881q411p411o924o948o289m846l800l195j832L6O69lj9J133J552
$$ plain form
58023 574971 566382 559081 551510 542753 534106 526331 518374 510219 503899 499969 495984 490274 484402 480067
58009 480067 476456 472604 469575 468127 466777 464362 462178 461497 461233 460098 458881 458504 457990 456416 454863
57994 454863 454349 453745 451699 448772 445792 441987 436672 430996 426221 421993 417987 415228 414019 412561 409689
57979 409689 407046 406451 406837 405931 403445 400505 397395 393911 390721 388443 386532 384646 383751 384289 384801 384055
57963 384055 383068 383291 384215 384578 384578 385123 386078 386907 387750 388405 387686 385387 383325 382725 382131 379772 376464 374147
57945 374147 372894 371506 369929 368974 368555 368174 368346 369812 372149 374799 378521 384159 390920 397502 404015
57930 404015 411115 418159 423872 428005 430776 431597 430018 427022 423724 419556 413320 405259 396601 387837
57916 387837 378956 370545 363134 356210 349262 342973 338127 334327 331132 329300 329336 330005 330002 329983 331116 332668
57900C32668L47p93o12k16p17j404j518j577j637n38J826L568L441K501K061J979
57884C39379J966K527L483L510K315J355J413J441P10J01J15k13j246j693r12
57869C54251l45j244k743l533l704l697l095j792q11o87m90L94J098R46P96J538
57853C36882K693L517M135M617M377L416K704K541K063J111P99J419J612O27m51
57838C72062p75j103j963k322j528p26q82j055j80R35J043N59O03J092J298J345
57822C68403J658J890J598J255J484J984K090J574K73j960m384n687n860o366
57808C57952p774q728q158o919o231n942n472n082n017m720l928l353l335l083
57794B80210k239j731k069k267j558p79p89q94j24J078J783J994K150K186K170
$$ plain form
57900 332668 333015 332222 331610 331394 330677 329273 327755 326178 324541 324003 325829 329397 332838 335339 337400 339379
57884 339379 341345 343872 347355 350865 353180 354535 355948 357389 358099 358200 358315 358102 356856 355163 354251
57869 354251 353906 352662 349919 346386 342682 338985 335890 334098 333287 332600 332110 332504 333602 334548 335344 336882
57853 336882 339575 343092 347227 351844 356221 359637 362341 364882 366945 368056 368855 370274 371886 372513 372062
57838 372062 371287 370184 368221 365899 364371 363645 362763 361708 361528 362463 363506 364065 364668 365760 367058 368403
57822 368403 370061 371951 373549 374804 376288 378272 380362 381936 382209 380249 375865 370178 364318 357952
57808 357952 350178 341450 333292 326373 320142 314200 308728 303646 298629 293909 289981 286628 283293 280210
57794 280210 277971 276240 274171 271904 270346 269567 268778 267884 267760 268838 270621 272615 274765 276951 279121
57779B79121K690L769M525M715N223O202O412N346M278M084L798K654J648J577
57765C36042J302k17j816k010j469j621k108j788j211j827l429m518m680m752
57751C05898n038n093m952m975m814l877k436j125J47J609K670K756K402K328
57737B85500K206J588J129J505J944J369K57j97k9j25m40k15M98R62J034J094
57721B98080J057P91Q51J615K199J651O00L73J003J509J642J814J774Q45o12j422
57705C13770j199o05j78R3J83L4j16j04k10m08k3J033J487L51j456k361k341k617
57687C05333l686m964n895o211n527l867k199j323p82K11J445K410L602N762Q536
57672B92845J1263J4430J8892K4209K9336L4501M0623M6955N0695M9096M1110
$$ plain form
57779 279121 281811 285580 290105 294820 300043 306245 312657 318003 322281 326365 330163 332817 334465 336042
57765 336042 337344 337127 335311 333301 331832 330211 328103 326315 325104 323277 319848 315330 310650 305898
57751 305898 300860 295767 290815 285840 281026 277149 274713 273588 273735 275344 278014 280770 283172 285500
57737 285500 287706 289294 290423 291928 293872 295241 295498 295301 295272 295147 294707 294492 294990 295952 296986 298080
57721 298080 299137 299928 300779 302394 304593 306244 306844 307217 308220 309729 311371 313185 314959 315804 315192 313770
57705 313770 312571 311966 311788 311881 312064 312098 311982 311878 311668 311260 311237 312270 313757 314108 312652 310291 307950 305333
57687 305333 301647 296683 290788 284577 279050 275183 272984 271661 270879 271090 272535 274945 278547 284309 292845
57672 292845 304108 318538 337430 361639 390975 425476 466099 513054 563749 612845 653955
57661F53955K7465J0471o526k0770l1389l8531m1937m1508l8531l4904l1308k7302
57649C79185k2863j8647j5060j2171j0208r181q390p240o031n075l891k205q81
57636B57342n86m94L07J127R11K21K32N85J33p92q52J5N88L42l29j389k855l700
57618B50806k909j400r13j347j197l31j78j113j852j677j307j229j028o95q57
57603B32773j389j385q02n22p06o86o05j341k586k911k018j197j196j453j744
57588B12232k692m067m519l636k658k430k368j985j805k053k055j658j668k219
57574A76419k321j709j482k077k415j903j584k135k439j534l67j94n06j63M95
57559A56085L21o49j378j497j427j271q08k95k44n90q09o87l00L14R24R59J34
$$ plain form
57661 653955 681420 691891 685365 664595 633206 594675 552738 511230 472699 437795 406487 379185
57649 379185 356322 337675 322615 310444 300236 291055 282665 275425 269394 264319 260428 258223 257342
57636 257342 256756 256262 256569 257696 258607 258828 259060 259645 259778 258986 258134 258149 258737 259079 258750 257361 254506 250806
57618 250806 247897 246497 245584 244237 243040 242709 242531 241418 239566 237889 236582 235353 234325 233630 232773
57603 232773 231384 229999 229197 228675 227969 227283 226678 225337 222751 219840 217822 216625 215429 213976 212232
57588 212232 209540 205473 200954 197318 194660 192230 189862 187877 186072 184019 181964 180306 178638 176419
57574 176419 174098 172389 170907 168830 166415 164512 162928 160793 158354 156820 156453 156259 155753 155590 156085
57559 156085 156406 155757 154379 152882 151455 150184 149376 149081 148837 148247 147438 146751 146451 146765 147689 148648 148782
57542A48782j024j753j735r73L51J553J737Q61p8l10j76l57r65j788k621k987
57526A38517k290p93L26L63l8J33J058K317L563M496M838M839N204O128O911O974
57510A82546O579O234N936N409M522L193J474q1p91p50o95r00j024j104j682k722
57494B06144l391l283k946k812k568j973j381j090r50r72j381j894j848j356j252
57479A77047j618j556p95k63n51r57p30j62J91L57M11P4n46p84n43n70j115j462
57461A66428j313j326j621j186L59J708J727J127J094J425J245O87M68N45M47
57446A71814L16M56M91L0l52Q1J012J659K009K442K702K293J468Q61N74L81K99
57429A88536K11l66j286j402j74J239J561J251J460J974J720P03n5k23k48r4O50
$$ plain form
57542 148782 147758 146005 144270 143297 143648 145201 146938 147799 147721 147411 147235 146878 145913 144125 141504 138517
57526 138517 136227 135434 135760 136123 136085 136218 137276 139593 143156 147652 152490 157329 162533 168661 175572 182546
57510 182546 189125 195359 201295 206704 211226 214419 215893 215812 215021 214271 213576 212676 211652 210548 208866 206144
57494 206144 202753 199470 196524 193712 191144 189171 187790 186700 185750 184778 183397 181503 179655 178299 177047
57479 177047 175429 173873 173078 172815 172264 171307 170577 170415 170606 170963 171374 171448 170902 170118 169575 169005 167890 166428
57461 166428 165115 163789 162168 160982 161341 163049 164776 165903 166997 168422 169667 170354 170822 171367 171814
57446 171814 172130 172586 173077 173107 172755 172836 173848 175507 177516 179958 182660 184953 186421 187282 187856 188237 188536
57429 188536 188747 188381 187095 185693 185519 186758 188319 189570 191030 193004 194724 195427 195372 195149 194901 194807 195457
57412A95457J523J553Q67N77J053J574J804K211K783K653J540L83M0K00J80l7
57396B14361r5M7K44M93P28P12N04N97J216J845J815J216Q18J185K031K574K370
57379B32661J814J660K135K692K676J968R33O0k24K15J002J541J689J785J977
57364B54584J914J334N48J22L79J293K422K975K530J736J627K249K664K488K386
57349B81251K784L022K423J352O84Q16J674K943L850L618K552J923K249K601K213
57334C15955J692J861K390K532K421K593K864K735K346K108J871J348R20J132
57320C44768J778K290K583K841K987K972L120L527L739L640L855M583M928M282
57306C91893L489L589M246M512M371M351M280L746L219L363L730L426K737K780
$$ plain form
57412 195457 196980 198533 199400 199977 201030 202604 204408 206619 209402 212055 213595 213978 214018 214218 214398 214361
57396 214361 214266 214313 214557 215050 215778 216490 216994 217591 218807 220652 222467 223683 224501 225686 227717 230291 232661
57379 232661 234475 236135 238270 240962 243638 245606 246539 246599 246375 246590 247592 249133 250822 252607 254584
57364 254584 256498 257832 258380 258502 258881 260174 262596 265571 268101 269837 271464 273713 276377 278865 281251
57349 281251 284035 287057 289480 290832 291516 292332 294006 296949 300799 304417 306969 308892 311141 313742 315955
57334 315955 317647 319508 321898 324430 326851 329444 332308 335043 337389 339497 341368 342716 343636 344768
57320 344768 346546 348836 351419 354260 357247 360219 363339 366866 370605 374245 378100 382683 387611 391893
57306 391893 395382 398971 403217 407729 412100 416451 420731 424477 427696 431059 434789 438215 440952 443732
57292D43732L740M730N201N377N418N180M804M587M463M223L998L819L273K328
57278E04873J837K345L101L270L289L913M763N150N522O628P904Q341Q298Q747
57264E77981R274Q772P800Q184J0237J2262J3083J3336J3880J4513J4731J4468
57252G18521J3765J2778J2195J2462J2742J1995J0888J1017J2296J3003J2595
57241H54257J2471J3464J4482J4483J4175J4678J5815J6702J7001J6751J5929
57230A020208J4939J4667J5361J6194J6485J6516J6739J7044J7289J7697J8267
57219A201406J8571J8578J8914J9989K1484K2902K3963K4473K4578K5037K6263
57208A446158K7369K7265K6497K6487K7164K7003K5563K4130K3540K3213K2873
$$ plain form
57292 443732 447472 452202 457403 462780 468198 473378 478182 482769 487232 491455 495453 499272 502545 504873
57278 504873 506710 509055 512156 515426 518715 522628 527391 532541 538063 544691 552595 560936 569234 577981
57264 577981 587255 596027 603827 612011 622248 634510 647593 660929 674809 689322 704053 718521
57252 718521 732286 745064 757259 769721 782463 794458 805346 816363 828659 841662 854257
57241 854257 866728 880192 894674 909157 923332 938010 953825 970527 987528 1004279 1020208
57230 1020208 1035147 1049814 1065175 1081369 1097854 1114370 1131109 1148153 1165442 1183139 1201406
57219 1201406 1219977 1238555 1257469 1277458 1298942 1321844 1345807 1370280 1394858 1419895 1446158
57208 1446158 1473527 1500792 1527289 1553776 1580940 1607943 1633506 1657636 1681176 1704389 1727262
57197A727262K3318K4651K5463K4927K4162K4477K5569K6592K7705K9385L1284
57186B014795L2919L4542L6381L7851L8528L8989L9790M0585M1067M1702M2665
57175B439814M3149M2753M2465M3049M3566M2711M0788L9061L7950L7100L6561
57164B888967L6599L6857L6828L6694L6787L6720L6033L5098L4459L3847L2751
57153C281640L1329K9841K7962K5552K3404K2164K1207J9659J7764J6217J4882
57142C531621J3423J2449J2737J3902J5155J6775J9439K2673K5399K7603K9971
57131C741147L2166L3044L2460L1438L0517K9321K7720K6280K5365K4851K4839
57120D059148K5695K7539L0501L5103M1362M7859N2999N6887O0795O5189O9805
$$ plain form
57197 1727262 1750580 1775231 1800694 1825621 1849783 1874260 1899829 1926421 1954126 1983511 2014795
57186 2014795 2047714 2082256 2118637 2156488 2195016 2234005 2273795 2314380 2355447 2397149 2439814
57175 2439814 2482963 2525716 2568181 2611230 2654796 2697507 2738295 2777356 2815306 2852406 2888967
57164 2888967 2925566 2962423 2999251 3035945 3072732 3109452 3145485 3180583 3215042 3248889 3281640
57153 3281640 3312969 3342810 3370772 3396324 3419728 3441892 3463099 3482758 3500522 3516739 3531621
57142 3531621 3545044 3557493 3570230 3584132 3599287 3616062 3635501 3658174 3683573 3711176 3741147
57131 3741147 3773313 3806357 3838817 3870255 3900772 3930093 3957813 3984093 4009458 4034309 4059148
57120 4059148 4084843 4112382 4142883 4177986 4219348 4267207 4320206 4377093 4437888 4503077 4572882
57109D572882P5355Q3461R4887J09417J27512J50362J78231K10512K47826K92414
57099F142859L46191M10457M88121N84256P03306Q47016J015711J209594J427419
57090A3174930J665191J916779K173615K422311K644397K819670K927974K947921
57082C2692788K860798K663358K376192K033947J666888J296287R44555O36003
57074D7170816L76666J37010j34304m73852q79730j318913j749349k134087k444797
57065C8549460k663926k787252k822066k781564k680898k535874k361225k168478
57057A7748177j966336j762800j565362j379329j207644j052604r16203p98617
57049G099282o97827o11449n37854m75336m21516l74353l32907k96628k64642
$$ plain form
57109 4572882 4648237 4731698 4826585 4936002 5063514 5213876 5392107 5602619 5850445 6142859
57099 6142859 6489050 6899507 7387628 7971884 8675190 9522206 10537917 11747511 13174930
57090 13174930 14840121 16756900 18930515 21352826 23997223 26816893 29744867 32692788
57082 32692788 35553586 38216944 40593136 42627083 44293971 45590258 46534813 47170816
57074 47170816 47547482 47684492 47550188 47076336 46196606 44877693 43128344 40994257 38549460
57065 38549460 35885534 33098282 30276216 27494652 24813754 22277880 19916655 17748177
57057 17748177 15781841 14019041 12453679 11074350 9866706 8814102 7897899 7099282
57049 7099282 6401455 5790006 5252152 4776816 4355300 3980947 3648040 3351412 3086770
57040C086770k36167k10850j88168j67086j46609j26261j05984q6057o6761m7612
57030A705215k7808q964L341L338q872k6856m4100n8819p1851q2446q8435q9254
57018A204489q6409q1373p4805o7566o0744n4584m8591m2704l7388l2708k8430
57007E89187k4881k2651k1480k0313j8611j6792j5389j4494j3939j3395j2398
56996C94844j0850r380q594q168p335n982m545l071j192J087L371N626Q220J1128
56982C65159J3528J4357J2955R441M807L58l346o733j0080j2699j3836j3799j3406
56969C46706j2709j1101q464n428k580j60J726L240N064P829J1397J5103J8486
56956C69109K1163K2348K1186J7472J1604M238l525j0157j4692j7408j8967j9323
$$ plain form
57040 3086770 2850603 2639753 2451585 2284499 2137890 2011629 1905645 1819588 1752827 1705215
57030 1705215 1677407 1668443 1671784 1675122 1666250 1639394 1595294 1536475 1464624 1382178 1293743 1204489
57018 1204489 1118080 1036707 961902 894336 833592 779008 730417 687713 650325 617617 589187
57007 589187 564306 541655 520175 499862 481251 464459 449070 434576 420637 407242 394844
56996 394844 383994 374614 366020 357852 350517 344535 339990 336919 335727 336814 340185 345811 354031 365159
56982 365159 378687 393044 405999 415440 420247 420605 417259 410526 400446 387747 373911 360112 346706
56969 346706 333997 322896 314432 309004 306424 306264 307990 311230 316294 324123 335520 350623 369109
56956 369109 390272 412620 433806 451278 462882 467120 463595 453438 438746 421338 402371 383048
56944C83048j8269j6403j4528j2474r583o118l054o03K044N445R393J3617J8094
56931C50609K2449K5916K7920K7968K5082J8395Q589k068j1465j8825k4199k7553
56919D22818k8801k8134k5981k2989k0031j7843j6465j5319j3809j1734r342p300
56907B05070o221n850n120l539j969j405j576j575j315j315j417r17J68J066J495
56892A75580J949K698L488M390O030Q665J1704J4309J5885J5953J4222J0896O581
56879B92350J798k932o927r710j1371j2004j1268r063o108l038N19M992R625J3411
56865B50274J6804K1191K6915L3158L9544M6385N3173N8132N9395N5706M6293
56854G06970L1627J4387j835j5176k5732l3360l7011l6577l3646k9604k4326j7495
$$ plain form
56944 383048 364779 348376 333848 321374 311791 305673 302619 302016 304060 309505 318898 332515 350609
56931 350609 373058 398974 426894 454862 479944 498339 506928 504860 493395 474570 450371 422818
56919 422818 394017 365883 339902 316913 296882 279039 262574 247255 233446 221712 212370 205070
56907 205070 198849 192999 187879 184340 182371 180966 179390 177815 176500 175185 173768 172851 173019 174085 175580
56892 175580 177529 180227 183715 188105 194135 202800 214504 228813 244698 260651 274873 285769 292350
56879 292350 294148 291216 284289 274579 263208 251204 239936 230873 224765 221727 222246 227238 236863 250274
56865 250274 267078 288269 315184 348342 387886 434271 487444 545576 604971 660677 706970
56854 706970 738597 752984 751149 735973 710241 676881 639870 603293 569647 540043 515717 498222
56842D98222r821k111N782J4246K3155L2584M3270N5495O8189P9674Q8233R1351
56830I88269Q5832P0211M6625J9465p399l1515n1087o4791p2283p4101p1175o4823
56818G73228n6705m8013l8978k9576k0264j1422k604O960J7375K8136L8837M9072
56806G06046N7671O2488O1109N1981L5486J4366p288k6064m0473n0469n6432n8814
56794G49607n8199n5112m9942m3245l5909k8802k2396j6706j1299n438J313Q622
56782D32494J5747K2226K7677L1144L1276K7273J9353Q579l292j4212k2948k9674
56770E45643l4793l7740l7827l5812l3259l0602k7214k3284k0128j8270j6744
56759B29970j4681j2399j0444q743p254o359o035n585m694l836l273k685k056
$$ plain form
56842 498222 488401 486290 492072 506318 529473 562057 605327 660822 729011 808685 896918 988269
56830 988269 1074101 1144312 1190937 1210402 1203003 1171488 1120401 1055610 983327 909226 838051 773228
56818 773228 716523 668510 629532 599956 579692 568270 565666 572626 590001 618137 656974 706046
56806 706046 763717 826205 887314 939295 974781 989147 981859 955795 915322 864853 808421 749607
56794 749607 691408 636296 586354 543109 507200 478398 456002 439296 427997 422559 423872 432494
56782 432494 448241 470467 498144 529288 560564 587837 607190 615769 612477 598265 575317 545643
56770 545643 510850 473110 435283 399471 366212 335610 308396 285112 264984 246714 229970
56759 229970 215289 202890 192446 183703 176449 170090 164055 158470 153776 149940 146667 143982 141926
56746A41926j914k237k292j905j747j930j649p07m3j37k10J91K28p08j713j721
56730A23432j043n86m69l95m94p66o28N0L60k10p15j92P92J231J400K163L195
56713A27125L346K447J521J295J498J487R88K76J02R50K140K368J474P01P22O55
56697A49095k06j006q08k91o13j440j578r11l30j94j70j90l76l77J33O68O54M77
56679A42537P35J005N91j3K31J111J399P63J57K24M95M01Q1j01j07J5L83J095
56661A51002K028K801K915K189J232R00J166J196P47N51J008J564J868K364L090
56646A76621L113K117J255J415J798J498J190J766K396J721J72p24p78j127k153
56631A90280l095l540l784l772l168k393k265k698k890k641k388k144j603j010
$$ plain form
56746 141926 140012 137775 135483 133578 131831 129901 128252 127545 127502 127365 127155 127346 127574 126866 125153 123432
56730 123432 122389 121803 121334 120939 120445 119679 119051 119101 119461 119251 118536 118344 119136 120367 121767 123930 127125
56713 127125 130471 132918 134439 135734 137232 138719 139707 139983 140085 141035 143175 145543 147017 147718 148440 149095
56697 149095 148889 147883 147075 146784 146171 144731 143153 142242 141912 141718 141548 141358 140982 140605 140738 141406 142060 142537
56679 142537 143272 144277 144868 144855 145086 146197 147596 148359 148516 148740 149235 149636 149717 149616 149509 149524 149907 151002
56661 151002 153030 155831 158746 160935 162167 163067 164233 165429 166176 166727 167735 169299 171167 173531 176621
56646 176621 179734 181851 183106 184521 186319 187817 189007 190773 193169 194890 195062 194338 193560 192433 190280
56631 190280 187185 183645 179861 176089 172921 170528 168263 165565 162675 160034 157646 155502 153899 152889
56617A52889q31q48o01l85o21p84j70P43R67N68J95l23j446k484k371j455r07
56600A42136p04Q5J309J883J713J673J774J235L34K43R07J022L45P7N86P43O2
56583A55423m26j56pn04p01J04J042J166R48J257J928K340K442K392K028J485
56567A70761J402J854J939J158L82O83K018L668N259O585P201O884O084N361M776
56552B26015M193L646L032K047P06m86j079r94l76K98J76j013k152j849l46P79
56536B32597P59K47k34j054k264k974k624j925j846k429l059l253k822j910j145
56521B06064j041j159o44L52P41O7r68j674k067k160j732j060q61j121r66m6R28
56504A92653J298J192Q04l4j172j884j677p24O15J980K716K296J121P0o44j234
$$ plain form
56617 152889 152058 151210 150609 150224 149603 148819 148649 149392 150359 150927 151122 150799 149353 146869 144498 143043 142136
56600 142136 141432 141517 142826 144709 146422 148095 149869 151104 151438 151681 152588 153610 153955 154032 154618 155361 155423
56583 155423 154997 154841 154834 154330 153629 153733 154775 155941 156889 158146 160074 162414 164856 167248 169276 170761
56567 170761 172163 174017 175956 177114 177496 178179 180197 183865 189124 195709 202910 209794 215878 221239 226015
56552 226015 230208 233854 236886 238933 239639 239153 238074 237080 236704 237002 237178 236165 234013 232164 231818 232597
56536 232597 233356 233603 233369 232315 230051 227077 224453 222528 220682 218253 215194 211941 209119 207209 206064
56521 206064 205023 203864 203220 203572 204313 204380 203412 201738 199671 197511 195779 194719 193858 192737 191771 191725 192653
56504 192653 193951 195143 195947 195913 194741 192857 191180 190456 191071 193051 195767 198063 199184 199254 198610 197376
56488A97376j314m04P63R24K32k1M03M67k7pP39R17o6r51o89p4k66r74j219q80
56468A94929m26O4O95J245J516J575J344P09J77L63P21J15j188j549m44P12P76
56451B01334L72L88N35L20J04K00J39k49k63L57Q04O71P50J471J858J162K63L12
56433B10528J002J309R96M05l60j015r12n5N33K87n8J39L49M0k37O6M48M03M25
56414B14293R72J430J220Q88J083J345J000L72J73M54J003J841K640K621J800
56399B33135J277J516J623J021M62N25N58J90L49J545K625K632K439L074L801
56384B56772L550L003L410M309M203K855J205l62k042l522m291m616m923m763
56370B54788l570j867n86J36M82J68p52j215n45L48M39K37O88J379J351Q66Q11
$$ plain form
56488 197376 196062 195658 196421 197345 197577 197556 197959 198426 198399 198392 199131 200048 199982 199031 198342 198268 198002 197028 195809 194929
56468 194929 194503 194567 195262 196507 198023 199598 200942 201651 201828 202191 202912 203027 201839 200290 199846 200558 201334
56451 201334 201706 202094 202629 202949 203053 203253 203392 203143 202880 203237 204041 204712 205462 206933 208791 209953 210216 210528
56433 210528 211530 212839 213835 214240 213880 212865 211953 211898 212431 212718 212660 212799 213148 213188 212951 213017 213465 213868 214293
56414 214293 215265 216695 217915 218803 219886 221231 222231 222603 222776 223230 224233 226074 228714 231335 233135
56399 233135 234412 235928 237551 238572 239034 239559 240117 240307 240656 242201 244826 247458 249897 252971 256772
56384 256772 260322 263325 266735 271044 275247 278102 279307 278945 276903 273381 269090 264474 259551 254788
56370 254788 251218 249351 248765 248901 249383 249551 248799 247584 247039 247387 247826 248063 248751 250130 251481 252347 253158
56353B53158J056R11N55O35R85J106J285J945K532K299J656J446J577J507J418
56338B74071J735K139K159J985J736R27l24p82M5P99M21L1R97K526K960K423K211
56321B96059K494K572K566K988L319K833K117K113K446K386K470L315L826K759
56307C34263J165J052K270K931K483K149K644L509M433N373N636M723L698L958
56293C80287N029N376M853M474M333L805L314L852N036N645N735O324P359P905
56279D53327P999Q382Q860Q814Q811R678J0669J0656J0533J1952J4261J5270J4825
56266E94037J4922J6398J8095J9397K1023K3080K4729K6176K8730L2565L6533
56255H55685M0478M5607N2250N9304O6244P3743Q2036R0569R9392J08992J18634
$$ plain form
56353 253158 254214 255125 255680 256315 257300 258406 259691 261636 264168 266467 268123 269569 271146 272653 274071
56338 274071 275806 277945 280104 282089 283825 284752 284428 283646 283691 284490 284911 284942 285939 288465 291425 293848 296059
56321 296059 298553 301125 303691 306679 309998 312831 314948 317061 319507 321893 324363 327678 331504 334263
56307 334263 335428 336480 338750 341681 344164 346313 348957 352466 356899 362272 367908 372631 376329 380287
56293 380287 385316 390692 395545 400019 404352 408157 411471 415323 420359 426004 431739 438063 445422 453327
56279 453327 461326 469708 478568 487382 496193 505871 516540 527196 537729 549681 563942 579212 594037
56266 594037 608959 625357 643452 662849 683872 706952 731681 757857 786587 819152 855685
56255 855685 896163 941770 994020 1053324 1119568 1193311 1275347 1365916 1465308 1574300 1692934
56244A692934J26840J33497J39543J44554J46824J45829J42387J36321J26224
56235B934953J11764R4086P3807N0860K6430K739j9530m1265o2206q0412r4856
56224B996370j06322j15324j21377j24665j26329j26596j24671j20773j16175
56215A914138j11058j04566r7164r0513q4689p8100p0555o3939n9175n4901m9991
56204A049487m5128m1099l7641l4633l2413l0393k7355k3559k0512j8401j6059
56193G22294j3600j2578j3047j3046j1621r840q359o500m424l526l885l815k752
56180F15301k129k560k726j867r47m92K40J217J282O10R50K591L728L600L496
56165F22294L924L740L047L828O416Q328Q084P277P460P897Q076R438J2551J5233
$$ plain form
56244 1692934 1819774 1953271 2092814 2237368 2384192 2530021 2672408 2808729 2934953
56235 2934953 3046717 3140803 3214610 3265470 3291900 3294639 3275109 3233844 3171638 3091226 2996370
56224 2996370 2890048 2774724 2653347 2528682 2402353 2275757 2151086 2030313 1914138
56215 1914138 1803080 1698514 1601350 1510837 1426148 1348048 1277493 1213554 1154379 1099478 1049487
56204 1049487 1004359 963260 925619 890986 858573 828180 800825 777266 756754 738353 722294
56193 722294 708694 696116 683069 670023 658402 648562 640203 633703 629279 625753 621868 618053 615301
56180 615301 613172 610612 607886 606019 605072 604580 604820 606037 607319 607929 608879 611470 615198 618798 622294
56165 622294 626218 629958 633005 636833 643249 651577 659661 666938 674398 682295 690371 699809 712360 727593
56151G27593J5645J5148J6109J8824K2343K6310L0493L4385L8752M5490N4727
56140A045819O4083P1909P8875Q5194Q8895Q8444Q4702P8906P1159O2381N5138
56129A875505N0706M7515M3905M0096L6059L0215K2080J3798P199J536m373j0224
56117B154017j6104k3814l4385m6326n7858o8639p7943q3713q5105q3686q0646
56106A495798p5290o7581n9489n2227m4813l6820k9838k4719k0135j5414j1865
56095A057607r825p528m449k519k308j419J368L838M331M526N963P156O671N943
56081A069355O492P383P707Q559J0360J1353J0916J1092J2774J3870J3354J3275
56069A196490J4581J5019J3744J3567J5847J7529J6557J5779J7830K0426K0715
$$ plain form
56151 727593 743238 758386 774495 793319 815662 841972 872465 906850 945602 991092 1045819
56140 1045819 1109902 1181811 1260686 1345880 1434775 1523219 1607921 1686827 1757986 1820367 1875505
56129 1875505 1926211 1973726 2017631 2057727 2093786 2124001 2146081 2159879 2167078 2168614 2164241 2154017
56117 2154017 2137913 2114099 2079714 2033388 1975530 1906891 1828948 1745235 1660130 1576444 1495798
56106 1495798 1420508 1352927 1293438 1241211 1196398 1159578 1129740 1105021 1084886 1069472 1057607
56095 1057607 1047782 1040254 1035805 1033286 1030978 1029559 1030927 1034765 1039096 1043622 1049585 1056741 1063412 1069355
56081 1069355 1075847 1083230 1090937 1099496 1109856 1121209 1132125 1143217 1155991 1169861 1183215 1196490
56069 1196490 1211071 1226090 1239834 1253401 1269248 1286777 1303334 1319113 1336943 1357369 1378084
56058A378084K0239K1376K2646K1911K0755K1347K2186K1132J9623J9839K0741
56047A609879K0781K1310K3477K5051K4236K3313K4691K6716K7250K7757K9973
56036A884434L2201L2919L4166L7416M0061M0154M0319M2811M5134M5062M5282
56025B319959M8248N1188N1331N1286N3947N6896N7408N8120O1929O6130O7619
56014B944061O9031P3533P8504Q0723Q2779Q7785R2960R5207R7787J04303J11574
56003C918247J15810J20277J29029J38744J44919J50498J59908J70256J77234
55994E224922J83910J94565K05813K13345K21342K35309K51792K65449K79857
55985G276304L00523L23849L44418L66325L95450M27579M56685M87713N27999
$$ plain form
56058 1378084 1398323 1419699 1442345 1464256 1485011 1506358 1528544 1549676 1569299 1589138 1609879
56047 1609879 1630660 1651970 1675447 1700498 1724734 1748047 1772738 1799454 1826704 1854461 1884434
56036 1884434 1916635 1949554 1983720 2021136 2061197 2101351 2141670 2184481 2229615 2274677 2319959
56025 2319959 2368207 2419395 2470726 2522012 2575959 2632855 2690263 2748383 2810312 2876442 2944061
56014 2944061 3013092 3086625 3165129 3245852 3328631 3416416 3509376 3604583 3702370 3806673 3918247
56003 3918247 4034057 4154334 4283363 4422107 4567026 4717524 4877432 5047688 5224922
55994 5224922 5408832 5603397 5809210 6022555 6243897 6479206 6730998 6996447 7276304
55985 7276304 7576827 7900676 8245094 8611419 9006869 9434448 9891133 10378846 10906845
55976A0906845N73702O18549O67984P30013Q00543Q73341R55589J056985J173090
55967A8356641J297418J439783J613669J816929K046318K319115K657535L065537
55959C4612945L547541M136369M875103N788723O907304Q300518J0054362J2235304
55951I0458169J4913331J8176427K2044581K6370903L0842008L4943346L7744668
55944B75493433L7819505L3807374K5433570J3997816J702060r556084j8784317
55937C59913357k5626254k9939245l1774402l1524741k9826902k7286663k4344756
55930A59590394k1320262j8444338j5837417j3528922j1521998r813503q370935
55923F0753019p142680o096626n220078m488850l868299l340685k903030k541123
$$ plain form
55976 10906845 11480547 12099096 12767080 13497093 14297636 15170977 16126566 17183551 18356641
55967 18356641 19654059 21093842 22707511 24524440 26570758 28889873 31547408 34612945
55959 34612945 38160486 42296855 47171958 52960681 59867985 68168503 78222865 90458169
55951 90458169 105371500 123547927 145592508 171963411 202805419 237748765 275493433
55944 275493433 313312938 347120312 372553882 386551698 388253758 378697674 359913357
55937 359913357 334287103 304347858 272573456 241048715 211221813 183935150 159590394
55930 159590394 138270132 119825794 103988377 90459455 78937457 69123954 60753019
55923 60753019 53610339 47513713 42293635 37804785 33936486 30595801 27692771 25151648
55915B5151648k230885j961964j736530j547600j380057j230145j103685r97304
55907A2963478q99964q10501p35745o73453o13946n56720n09275m71070m33852
55898G258952l96606l65573l40448l14386k87049k64602k47264k29067k09455
55889D604502j93448j80891j66692j51432j41012j35973j31247j25977j23765
55880C254065j23651j20492j14163j09243j05934j00139r2211q6835q4347q0503
55870B236547p4715p0470o7843o3579n8303n5839n5469n2654m7335m4068m3866
55859A602406m3214m1239m0634m1280l9995l6843l5069l4557l1999k7717k5622
55848A204237k6265k6328k5242k5792k7848k8012k6057k5343k6267k5485k2408
$$ plain form
55915 25151648 22920763 20958799 19222269 17674669 16294612 15064467 13960782 12963478
55907 12963478 12063514 11253013 10517268 9843815 9229869 8673149 8163874 7692804 7258952
55898 7258952 6862346 6496773 6156325 5841939 5554890 5290288 5043024 4813957 4604502
55889 4604502 4411054 4230163 4063471 3912039 3771027 3635054 3503807 3377830 3254065
55880 3254065 3130414 3009922 2895759 2786516 2680582 2580443 2488232 2401397 2317050 2236547
55870 2236547 2161832 2091362 2023519 1959940 1901637 1845798 1790329 1737675 1690340 1646272 1602406
55859 1602406 1559192 1517953 1477319 1436039 1396044 1359201 1324132 1289575 1257576 1229859 1204237
55848 1204237 1177972 1151644 1126402 1100610 1072762 1044750 1018693 993350 967083 941598 919190
55837I19190k0353k0264j9290j6645j5209j5956j6233j4834j3748j3663j2705
55826G40290j0675r848j0484j0188q640q371j0015j1224j1194j1691j2901j2761
55814F12298j1267j0917j2003j1926j0051q796q891q054n497l452k941k166l77
55801E15960O33K41M10K058L604M214M991N904N160K738J106J247J297Q9j185
55786E48467j726k358l226l505l946o381j0049j1936j1355j0594j0362q418l771
55773D60840J488N834J0152J4619J7004J5637J1268M922l108j1263j6820j9174
55761D91399k0228k0808j9715j6930j4407j2751j0493p559o069o586p012o397
55749C42444o380p556p915o479n175n340n522m471l329l008k319o06M13o72k795
$$ plain form
55837 919190 898837 878573 859283 842638 827429 811473 795240 780406 766658 752995 740290
55826 740290 729615 719767 709283 699095 690455 682084 672069 660845 649651 637960 625059 612298
55814 612298 601031 590114 578111 566185 556134 547338 538447 530393 524896 521444 518503 516337 515960
55801 515960 516593 516834 517244 519302 522906 527120 532111 538015 543175 545913 547019 548266 549563 549652 548467
55786 548467 546741 544383 541157 537652 533706 527325 517276 505340 493985 483391 473029 464611 460840
55773 460840 462328 468162 478314 492933 509937 525574 536842 541764 538656 527393 510573 491399
55761 491399 471171 450363 430648 413718 399311 386560 376067 368508 362439 355853 348841 342444
55749 342444 336064 328508 320593 314114 308939 303599 298077 293606 290277 287269 284950 284344 284757 284085 281290
55734B81290m554o048p165o653m531k969l143l597l126k802l542m251m042l887
55720B20980m375m225k701j232q50k83J610L699M619M990N809O523O305N546M593
55705B51008K802K03j806k613l359m639n370n158n495p163q685q770q123p460
55691A85372o057l814k382k482k433j082J13j77o48K87J764K290K363L054L728
55676A79896L436K997L420L772K715R16j44n53j213j885j858j479j383j187n59
55661A86891k48o98r15j98M27Q1k35O06J808K049J598J368J239R58J262K415L006
55644B01414K023O87M36N01n42k200l129l559m567n836o298o156o337o611o070
55629A53756m933m201m077m003l635k756j180K59K3j756k779j825o24q63j428
$$ plain form
55734 281290 276736 270688 263523 256870 252339 249370 246227 242630 239504 236702 233160 228909 224867 220980
55720 220980 216605 212380 209679 208447 207597 207314 208924 212623 217242 222232 228041 234564 240869 246415 251008
55705 251008 253810 254013 252207 249594 246235 241596 236226 231068 225573 218410 209725 200955 192832 185372
55691 185372 179315 175501 173119 170637 168204 167122 167235 167058 166410 166697 168461 170751 173114 176168 179896
55676 179896 183332 186329 189749 193521 196236 197152 197008 196455 195242 193357 191499 190020 188637 187450 186891
55661 186891 186643 185945 185030 184832 185259 185340 185105 185711 187519 189568 191166 192534 193773 194731 195993 198408 201414
55644 201414 203437 204124 204560 205061 204519 202319 199190 195631 191064 185228 178930 172774 166437 159826 153756
55629 153756 148823 144622 140545 136542 132907 130151 128971 129230 129253 127497 124718 122893 122269 121406 119978
55614A19978p62l2j121k981l058j452n83j222j726j193o84r48j287j128q88q20
55598A00093n16N7L09K2m19p49q88n80J23M68L7l89r7L24N9m38l19J65L63N70
55578I8195J248J827J755J821K826L900L906L659M723O719P812P478O770O173
55564A58812N152L635K232R69n92k156l034l430m021m647m807m905n467n737m807
55549A27197l509l307l827l441k041j072r93p80m5L79J43q9j09m22q42n25M38
55532A07155J034J119J520K153J839M23o56n16n1l72j332k248k892l222l111k879
55516I7964l216m192n143n677o005o291o577p251q507r431q762o577m100j915
55502A4320L71K709M259M592M108L157J885Q94P79J004N86r4K92J715K514J847
$$ plain form
55614 119978 119216 119184 118063 115082 112024 110572 109989 108767 107041 105848 105164 104216 102929 101801 100913 100093
55598 100093 99577 99634 99943 99965 99546 98797 97909 97329 97452 97920 97957 97568 97471 97795 97854 97416 97097 97262 97625 98195
55578 98195 99443 101270 103025 104846 107672 111572 115478 119137 123860 130579 138391 145869 152639 158812
55564 158812 163964 167599 169831 170800 170208 168052 165018 161588 157567 152920 148113 143208 137741 132004 127197
55549 127197 123688 120381 116554 113113 111072 110000 109007 108227 108182 108561 108704 108615 108506 108084 107242 106717 107155
55532 107155 108189 109308 110828 112981 114820 115243 114587 114071 114020 113648 112316 110068 107176 103954 100843 97964
55516 97964 94748 90556 85413 79736 73731 67440 60863 53612 45105 35674 26912 20335 16235 14320
55502 14320 14691 17400 21659 26251 30359 33516 35401 36295 37074 38078 38664 38570 38862 40577 43091 44938
55486D4938Q55P51J141J036L97j30k44l2L76P44Q71R82J416J926J990J705J529
55469F0251J332O94lk6K85p1r32j071l25qp18j308p83J10J44o20j256j374j170
55450E3151o76J60J075J703J953J843J382Q04M33J84k67p28o22N7O13O33L84J87
55432F2269N3R0M85R53R39M64P4n3j65j12N77J668K250K016J662J765K146K531
55414G9612K963L254K907J965J171R43P95J44r01j814k296k415k479k740k981
55399G8128k630j749j302j767k115j274K6J86p83j317p12P5K38J61L21M64M28
55382F6378N21O97L73m42r16o37j39J69N19R42R64N42K23J44j47n68m44J51K07
55363F8537o16j403j507j436j645j644j006k12K05M12N98N04J49P7L55L54j7K0
$$ plain form
55486 44938 45793 46544 47685 48721 49118 48988 48744 48712 49088 49832 50703 51685 53101 55027 57017 58722 60251
55469 60251 61583 62277 62274 62248 62533 62462 61530 60459 60134 60126 59408 58100 57317 57427 57571 56951 55695 54321 53151
55450 53151 52475 52635 53710 55413 57366 59209 60591 61395 61828 62012 61745 61017 60395 60452 61065 61698 62082 62269
55432 62269 62322 62412 62897 63850 64789 65253 65327 65274 65109 64997 65574 67242 69492 71508 73170 74935 77081 79612
55414 79612 82575 85829 88736 90701 91872 92815 93610 93754 92853 91039 88743 86328 83849 81109 78128
55399 78128 75498 73749 72447 70680 68565 67291 67317 67503 66720 65403 64691 64766 65004 65165 65486 65950 66378
55382 66378 66899 67596 67969 67527 66611 65974 65835 66004 66523 67465 68429 68971 69194 69338 69191 68623 68179 68330 68537
55363 68537 67921 66518 65011 63575 61930 60286 59280 59068 59273 59685 60283 60787 60936 61013 61368 61722 61705 61725
55345F1725O49R28L59k46k31j63o09j009p93m89n98m81M34J298J002k8n22k33
55327F0993Q2J05J03kn56j306j580j258p17o9P67J416J257L19o48j014q12n17
55309E6563m89n20N2J449K735K720J496K30n53j316j975j549K7J221R51J19n8
55292F1103K9n76j409j258j89O17P12O71P75P51O85R60J313J062L36m5J26J66
55274F5829l28r22j098q60l93J24L33j3m90l32M99J188J140O98N36Q02J059Q58
55256F8630K19m23o94o57o05n42k61J16J95m7k23k71m95p02j85J020J709J038
55238F7822k78r95r12o43m55k10J3J18M02R39R57j91j778k341j513l02L31L85
55220F1349K73J65L7j23k84k61J72P76Q40J29n07j72P56J056K37r57j575j375
$$ plain form
55345 61725 62374 63302 63661 63415 63184 63021 62412 61403 60610 60121 59523 59042 59476 60774 61776 61748 61226 60993
55327 60993 61075 61180 61283 61281 60725 59419 57839 56581 55864 55795 56562 57978 59235 59554 58906 57892 57080 56563
55309 56563 56074 55554 55606 57055 59790 62510 64006 64236 63683 62367 60392 58843 58870 60091 61042 61161 61103
55292 61103 61132 60556 59147 57889 57700 58317 59029 59700 60475 61226 61911 62871 64184 65246 65582 65537 65663 65829
55274 65829 65501 64579 63481 62621 62228 62352 62685 62672 62182 61850 62349 63537 64677 65375 65911 66713 67772 68630
55256 68630 68849 68426 67732 67075 66470 65928 65667 65783 65978 65931 65708 65437 64942 64240 64055 65075 66784 67822
55238 67822 67544 66549 65637 64994 64539 64329 64342 64460 64862 65801 66758 66567 64789 62448 60935 60633 60964 61349
55220 61349 61622 61787 61824 61701 61417 61156 61328 62104 62944 63073 62566 62394 63150 64206 64443 63486 61911 60536
55202F0536p19r4K39L95O60R71R26N13K60M08M82J65n5K67O98P00O07R09J127
55183F8995M54p89j490j366j111r81l79R48K220K579K026J147M53J86K82L47O7
55166G3588l41m35k51j55j87p9L7l10j109j683j522q29j02L82N95O38P16Q94R06
55147G0753N22K8r1P3m4n75r12n26K71O87L87j56k70R6L75K61K83J015J943J877
55127G5997N60q85j434j260r87o74j59K50K79K63N33P46N23J64Ql25j114j606
55109G0879j050r1N6m32l17O18J169O00l35o44k66L51R44J248R37J98k71j45K31
55090G3680N84J016J435J431J003O47M39j43j071j371n01O40Q74L74K81R54J466
55073H1738R94l6n04j3O81P01J74l2L84O91K29n46p31l12j13m70p99n72o1J47
$$ plain form
55202 60536 59817 59723 59962 60357 61017 61988 62914 63427 63687 64095 64577 64742 64687 64954 65652 66352 66959 67868 68995
55183 68995 69449 68660 67170 65804 64693 63712 63333 64281 66501 69080 71106 72253 72706 72892 73174 73521 73588
55166 73588 73247 72812 72561 72406 72219 72140 72177 71867 70758 69075 67553 66724 66622 67004 67599 68237 68953 69847 70753
55147 70753 71275 71303 71212 71285 71241 70666 69754 69228 69499 70186 70573 70417 70147 70243 70618 70879 71162 72177 74120 75997
55127 75997 76557 75672 74238 72978 71991 71317 71158 71408 71687 71950 72483 73229 73752 73916 73924 73599 72485 70879
55109 70879 69829 69738 69794 69362 69045 69663 70832 71432 71097 70453 70187 70538 71482 72730 73667 73865 73594 73449 73680
55090 73680 74264 75280 76715 78146 79149 79796 80235 80092 79021 77650 77149 77789 78663 79037 79318 80272 81738
55073 81738 82732 82696 82192 82179 82860 83561 83735 83703 84087 84778 85007 84461 83730 83418 83305 82835 82036 81464 81403 81550
55053H1550j14o05j012j061o81j80j3j63j58K02M77K37k61l27L39J278J725J362
55035H2595N69l2k67m02n91o94p34r80j395j428q01k1L11K66J89Jm60p93m69K90
55015G5154P30N72J98J8J76O13R14M50p06j405p74M78R91O94O51J245J717J592
54997H3308J353J329J040J08r98j586j535j030k18N71Q55O23M08M71M17j06q15
54980H4195j173r90m21K66P83R80R83R17O72L22L81J038J501R83N2l5Q26J552
54962I2832J595J463J384Q24k24p38j09R53J540J571J138q9j944l143k716j339
54946I2998l95k30k51j88k96n57o21m08j20K42P62J194J202R32Q07R10R38P06
54928I7625L41J03K40P56J251J304J163J549K654L850M631N157N560N449M621
$$ plain form
55053 81550 81436 80831 79819 78758 78077 77897 77884 77721 77563 77765 78242 78479 78218 77891 78230 79508 81233 82595
55035 82595 83164 83132 82865 82463 81872 81178 80444 79464 78069 76641 75840 75819 76130 76396 76585 76586 76126 75333 74864 75154
55015 75154 75884 76456 76654 76672 76848 77461 78375 78825 78119 76714 75940 76418 77409 78103 78754 79999 81716 83308
54997 83308 84661 85990 87030 87138 86140 84554 83019 81989 81771 82342 83197 83820 84228 84699 85116 85010 84195
54980 84195 83022 82032 81611 81877 82660 83640 84623 85540 86212 86534 86915 87953 89454 90437 90489 90454 91280 92832
54962 92832 94427 95890 97274 98098 97874 97136 97027 97980 99520 101091 102229 102140 100196 97053 94337 92998
54946 92998 92603 92373 92122 91934 91638 91081 90460 90052 89932 90174 90936 92130 93332 94264 95071 95981 96919 97625
54928 97625 97966 98069 98309 99065 100316 101620 102783 104332 106986 110836 115467 120624 126184 131633 136254
54913A36254L547K623J566K12p86r02p47j305k485l415l784l945l950l470k691
54898A16722k295k429k466j939j076k69K90L82k01j121j635j440r06l09N07J420
54882A03235J724J097M33R15K438L639L597K910K821L706M882N619N754N317M152
54867A52239K293L29j080j908k600l377m067m549m833m747m055l053k496k728
54853A15368l226l260k652j745r69o37q03j119j124q75r03j342j590j162m62k29
54837I3270n05o85n15m56r23j533j458m53P68J291J036O87O66N80L5n39m16L06
54819I1156Q36Q26O95P60P42L25l38q88j096p83M5Q57R06J49o18p07k16L48O14
54800I3613L92k19o17k24O40J009O18K10K97M80M20N95J357K045J850J015L44
$$ plain form
54913 136254 139801 142424 143990 144202 143416 142514 141767 140462 137977 134562 130778 126833 122883 119413 116722
54898 116722 114427 111998 109532 107593 106517 106248 106538 106920 106719 105598 103963 102523 101617 101308 101815 103235
54882 103235 104959 106056 106489 107404 109842 113481 117078 119988 122809 126515 131397 137016 142770 148087 152239
54867 152239 154532 154861 153781 151873 149273 145896 141829 137280 132447 127700 123645 120592 118096 115368
54853 115368 112142 108882 106230 104485 103516 102879 102076 100957 99833 98958 98055 96713 95123 93961 93499 93270
54837 93270 92765 92080 91565 91109 90186 88653 87195 86742 87510 88801 89837 90524 91190 91770 91805 91266 90850 91156
54819 91156 91992 92818 93513 94273 95015 95340 95002 94114 93018 92235 92280 93137 94043 94192 93574 92867 92651 92999 93613
54800 93613 94005 93786 93169 92945 93585 94594 95212 95422 95719 96199 96619 97214 98571 100616 102466 103481 103825
54783A03825Pl55o70n27m7J52j04l15j02L39O89R54J317J835K442L105L831M532
54765A20908M890M579L860L659M531N729N960N066M085L539K647P41j519l052
54751A65623l813m464n192n626n657n520n267m764m060l285k425j593j174j216
54737A11567j115m29L41M42k3k91K1O76J284J482R72Km63K78J726K821L245L479
54719A26015L893M367M708M744M233L221K214J494N57j070k806l608l385l023
54705A41554l128l558m045m499m667m193l199k209j462q36l41j33o2J51L46J53
54689A09872k96n35o06j018j751k054j455m19K98M15P7n38j221j624j453p22K00
54672I7170P88P56L91K45L62K12m18r15o59R2N60L68l14j071j291m70R07J479
$$ plain form
54783 103825 103832 103477 102807 102280 102233 102385 102281 101966 101864 102203 102892 103846 105163 106998 109440 112545 116376 120908
54765 120908 125798 130377 134237 137896 142427 148156 154116 159182 163267 166806 169453 170194 168675 165623
54751 165623 161810 157346 152154 146528 140871 135351 130084 125320 121260 117975 115550 113957 112783 111567
54737 111567 110452 110023 110364 110806 110783 110492 110513 111189 112473 113955 114927 114929 114466 114744 116470 119291 122536 126015
54719 126015 129908 134275 138983 143727 147960 151181 153395 154889 155446 154376 151570 147962 144577 141554
54705 141554 138426 134868 130823 126324 121657 117464 114265 112056 110594 109758 109417 109284 109222 109373 109719 109872
54689 109872 109576 109041 108435 107417 105666 103612 102157 101738 102036 102451 102528 101990 100769 99145 97692 96970 97170
54672 97170 97958 98714 99105 99350 99712 99924 99506 98591 97932 98024 98584 98952 98638 97567 96276 95806 96713 98192
54654I8192O92l02k31M71N17j79o12m53k68j52M18J307J686J411J198J143M51
54637A05289r18j703j173l35m54j301j647r72K04J117J286O45k27m47K07J003
54621A00574J207Q53K97l60j019j330j142p71m26P5P03R37N39N7P1L73M32J46
54603A01216k51o42q69n99J43P28O92L82L26M31K74r1k62r7K75P72J220J218O40
54584A05506K9p4Q9p0m58m80r3J5n40j210j224n34K39N63M24J38m2m2J22L85N20
54563A03263K10m95r73o35K28O60K13n03o26o6O27J042J209J226J060O75J56l63
54545A06908p41q52o51k25K98Q68J500K129K487K211J253J73k50J45P15Q06M12
54528A17186j17o19r81r16m23j07l95p42l68M86R08P24N74N75K9j212k097j674
$$ plain form
54654 98192 98884 98582 98351 98822 99339 99160 98548 98095 97827 97675 98093 99400 101086 102497 103695 104838 105289
54637 105289 104371 102668 101495 101160 100706 99405 97758 96786 96990 98107 99393 100038 99811 99364 99571 100574
54621 100574 101781 102634 102931 102571 101552 100222 99080 98309 97883 97958 98661 99598 100137 100194 100265 100638 101070 101216
54603 101216 100965 100323 99454 98855 98998 99726 100418 100800 101126 101557 101831 101740 101478 101381 101656 102428 103648 104866 105506
54584 105506 105535 105461 105550 105480 105022 104542 104449 104464 103924 102714 101490 100956 101195 101758 102182 102320 102278 102236 102358 102743 103263
54563 103263 103473 102978 102005 101370 101598 102258 102471 101968 101342 101276 101903 102945 104154 105380 106440 107115 107271 106908
54545 106908 106167 105315 104664 104439 104737 105605 107105 109234 111721 113932 115185 115358 115108 115253 115968 116774 117186
54528 117186 117069 116450 115469 114553 114130 114023 113628 112886 112518 113004 113912 114636 115210 115785 115814 114602 112505 110831
54510A10831l08Q77J246Q70J27m66m98j67j58o69j112j010n99k08K30O91P48L30
54492A10755R3L93N71l7r62j331j191j144j089m61M67O98Q0l19K92J352J857J662
54474A11686J329J132Q35K86k53m23j52L21P23R93J305J748K037J693O40n21j027
54457A22352p71m20n72r26o76L14J136Q86k19j185j378r81m54j19j81n87q82o12
54439A14725N8N60O47M58k9q28j322o93P99J850J724J050O21K94k72o13j09Q26
54421A19746J179P11Q2k12k93k96r4K62M25K16j67m89o94p18m37R0N66P88Q54
54402A21519R83J250J522J560J260Q10N74P24J058J161P43j48j006j134l07P95
54386A31364J211P27j2l98m29l24j31J21K58J97Q3N7J89N91J248J748J741J562
$$ plain form
54510 110831 110523 111400 112646 113516 113643 113177 112679 112512 112354 111685 110573 109563 108964 108756 108986 109677 110425 110755
54492 110755 110848 111241 111812 111775 110813 109482 108291 107147 106058 105597 106064 106762 106842 106523 106815 108167 110024 111686
54474 111686 113015 114147 114982 115268 115015 114592 114440 114761 115484 116477 117782 119530 121567 123260 123900 123379 122352
54457 122352 121581 121161 120589 119663 118987 119301 120437 121323 121104 119919 118541 117560 117106 116987 116806 116219 115337 114725
54439 114725 114783 115343 115990 116448 116419 115591 114269 113576 114375 116225 117949 118999 119620 119914 119642 119029 118920 119746
54421 119746 120925 121636 121718 121506 121213 120917 120823 121085 121510 121726 121559 121070 120376 119658 119221 119311 119877 120665 121519
54402 121519 122502 123752 125274 126834 128094 128904 129478 130202 131260 132421 133164 133016 132010 130876 130569 131364
54386 131364 132575 133302 133290 132892 132463 132139 132008 132129 132387 132584 132667 132724 132913 133504 134752 136500 138241 139803
54368A39803J839K489K827K696K653K899K977K777K841L234L045J757K02n96p90
54353A70653j124j665k054k405l016l524l369k821k612k719k388j315j17M49J78
54338A42151n80j210j212p27m17n23n11o2K47j28o90p08m53o24j013q41k11O3
54320A32551o9J87R02R97j04j421j652q23o8j60q20j271j064m21J09K58K55L69
54302A27755M72L53J30M4R6K59P34J498J958J609Q11K84J28q5m33n89m88l61k35
54283A33940J8K66L05K96M01K38n74j608k087j912j505r20J0R24J311J443J830
54266A32376J978R72o89j286k54J005J223R13J173J913K221J830J221P43L83J05
54250A45827j06l49n71n17k19q0k69m55l81j93L3M82J008R86J26j061j909k176
$$ plain form
54368 139803 141642 144131 146958 149654 152307 155206 158183 160960 163801 167035 170080 171837 172039 171443 170653
54353 170653 169529 167864 165810 163405 160389 156865 153496 150675 148063 145344 142956 141641 141524 141973 142151
54338 142151 141571 140361 139149 138422 138005 137482 136971 136909 137156 137028 136338 135630 135177 134553 133540 132699 132488 132551
54320 132551 132482 132669 133571 134568 134464 133043 131391 130568 130500 130340 129520 128249 127185 126764 126873 127131 127386 127755
54302 127755 128227 128580 128710 128754 128850 129109 129843 131341 133299 134908 135719 136003 136131 136046 135613 135024 134536 134175 133940
54283 133940 133958 134224 134529 134825 135226 135464 134890 133282 131195 129283 127778 126858 126868 127792 129103 130546 132376
54266 132376 134354 135326 134637 133351 133097 134102 135325 136238 137411 139324 141545 143375 144596 145339 145722 145827
54250 145827 145721 145372 144801 144284 144065 143985 143716 143261 142880 142687 142720 143202 144210 145196 145322 144261 142352 140176
54232A40176j746m95J085J867J288Pj002j506j677j458q77m50m88n60k63k6l67
54215A33508q72p83k56q4l98n68k96J06M92J022J437J117J48n10l15Q4r3n16l23
54196A32900M45Q25L62j76M9O50N45m03j106q10j87k11n62j06J244K255K161J609
54178A39484J367J088K33o12m53M32P72J63m65m21k37n07p81l72L11K84m62q70
54160A38954m16J12k26j186j751j457p55k27p8k66n72n13K34J170J326M68n38
54143A34279q93p42n50k35M33J115J345J330J523J644R87l29j297j311p63k27
54127A36309K11N85P09N70N13P31R59R18O65L34k0j72J32O43P71N31O94J631K566
54108A49280K468J327J12l10J94J211K234L035L738M484N076N262N230N285N036
$$ plain form
54232 140176 138430 137935 139020 140887 142175 142182 141180 139674 137997 136539 135662 135212 134724 134164 133901 133875 133508
54215 133508 132636 131853 131597 131513 131115 130547 130251 130357 130849 131871 133308 134425 134573 134063 133748 133832 133739 133223 132900
54196 132900 133345 134170 134532 134356 134405 135055 135600 135197 134091 133281 133094 132883 132321 132215 133459 135714 137875 139484
54178 139484 140851 141939 142172 141560 141107 141539 142311 142474 142009 141588 141351 140844 140063 139691 140002 140286 139824 138954
54160 138954 138538 138650 138424 137238 135487 134030 133275 133048 132970 132704 132132 131619 131853 133023 134349 134817 134279
54143 134279 133386 132644 132094 131859 132292 133407 134752 136082 137605 139249 140236 139907 138610 137299 136536 136309
54127 136309 136520 137105 137814 138384 138897 139628 140587 141505 142170 142504 142484 142312 142444 143087 143858 144389 145083 146714 149280
54108 149280 151748 153075 153187 152877 153071 154282 156516 159551 163289 167773 172849 178111 183341 188626 193662
54093A93662L672J273q67j688j627j908l051m493n378n249m210k765j381o9J358
54078A67279K585K939K409J859J884K033J659R48N22M60L44m8o05j167j478j256
54062A80367p59q08j690k514k321j448r06q54n96QK29k46o21n5J213K276K641
54045A73916K570K562K909L618M449N031N097M761M556N066O342P683Q218P769
54031B44547O921O198N546M721L775K887K040J217O64O32R93J419J649J431N27
54016B85167r12k252l035l463l948m449m645m507m317m288m494m875n057m543
54002B30382l431k581k603l056l196l078l217l517l331k500j537q59m91n52j247
53987A95186k218k613k116j354j022j042r35n59j84k7l4pK30O39R44R37Q48J164
$$ plain form
54093 193662 197334 198607 197740 196052 194425 192517 189466 184973 179595 174346 170136 167371 165990 165921 167279
54078 167279 169864 172803 175212 177071 178955 180988 182647 183595 184117 184577 184921 184873 184268 183101 181623 180367
54062 180367 179608 178800 177110 174596 172275 170827 169921 169067 168471 168479 168708 168462 167841 167786 168999 171275 173916
54045 173916 176486 179048 181957 185575 190024 195055 200152 204913 209469 214535 220877 228560 236778 244547
54031 244547 251468 257666 263212 267933 271708 274595 276635 277852 278516 279148 280141 281560 283209 284640 285167
54016 285167 284255 282003 278968 275505 271557 267108 262463 257956 253639 249351 244857 239982 234925 230382
54002 230382 226951 224370 221767 218711 215515 212437 209220 205703 202372 199872 198335 197476 196985 196433 195186
53987 195186 192968 190355 188239 186885 185863 184821 183886 183327 183143 183116 183082 183075 183305 183944 184888 185825 186673 187837
53969A87837K070L295M527N683O773P789Q774R705J0208R667P806N015J994p50
53955B70393l002m634n577n887n736n274m562l648k724k051j720j496j084m25
53941B22573M50J601K849L408K618J130O48K065M368N824N780M836L799L180L306
53926B68435M153N077N408N253N154N152M852M411M631N803P067P367O654N836
53912C45253N712O236O702O466N528M454L686L042K070P60l73r25j048j232j796
53897C84535k631l372l835m263n101o424p779q604q647q032p239o946p446q110
53883B96106p960o935n965n566n179m315l567l669m173m076l348k890l128l535
53869B31800l611l452l263k930k316j514p93n80j276k621l518l146k042j401j550
$$ plain form
53969 187837 189907 193202 197729 203412 210185 217974 226748 236453 246661 256328 264134 269149 271143 270393
53955 270393 267391 262757 257180 251293 245557 240283 235721 232073 229349 227298 225578 224082 222998 222573
53941 222573 223023 224624 227473 230881 233499 234629 235277 237342 241710 247534 253314 258150 261949 265129 268435
53926 268435 272588 277665 283073 288326 293480 298632 303484 307895 312526 318329 325396 332763 339417 345253
53912 345253 350965 357201 363903 370369 375897 380351 384037 387079 389149 389909 389536 388611 387563 386331 384535
53897 384535 381904 378532 374697 370434 365333 358909 351130 342526 333879 325847 318608 311662 304216 296106
53883 296106 288146 281211 275246 269680 264501 260186 256619 252950 248777 244701 241353 238463 235335 231800
53869 231800 228189 224737 221474 218544 216228 214714 213921 213341 212065 209444 205926 202780 200738 199337 197787
53854A97787j862j940j950j795j058K1N03J1o79p33k89m6l37q97j199q24M0M99
53836A85252p5r99j003j6O73L11k98j07P27J391J629J650J368O38j51m28j90J27
53818A90499L52N91P58O81N39O66J009J231J295J485J897K291K521K846L682N137
53802B17480O756P748P613O667N744N285N031M669M395M457M563M201L415K827
53788B90851K851L220L272K576J238j80j105j476j763k400l257l892m178m421
53774B81336m848n255n349n204n161n315n395n206m902m603m058l079k156k007
53760B18798k545k951k850k732k851k599j596p17j030k122k499j548j75N00K44
53745A93327n60j443j921j681r97m28r7K71N81M27l2p9N18J183J517J746J944
$$ plain form
53854 197787 195925 193985 192035 190240 189182 189203 189706 189717 189038 188305 188016 187970 187633 186736 185537 184713 184753 185252
53836 185252 185177 184178 183175 183159 183832 184143 183845 183738 184465 185856 187485 189135 190503 191141 190990 190562 190372 190499
53818 190499 190851 191442 192200 192881 193420 194086 195095 196326 197621 199106 201003 203294 205815 208661 212343 217480
53802 217480 224236 231984 239597 246264 252008 257293 262324 266993 271388 275845 280408 284609 288024 290851
53788 290851 293702 296922 300194 302770 304008 303828 302723 301247 299484 297084 293827 289935 285757 281336
53774 281336 276488 271233 265884 260680 255519 250204 244809 239603 234701 230098 226040 222961 220805 218798
53760 218798 216253 213302 210452 207720 204869 202270 200674 199957 198927 196805 194306 192758 192583 193083 193327
53745 193327 192767 191324 189403 187722 186725 186297 186200 186471 187052 187479 187447 187368 187886 189069 190586 192332 194276
53728A94276J617O10l38n32k55j58k17Q2Q76J816K637L258L508L209K469J628
53712B14486J012Q66J244J823K070J806J333R39O28N16R34J888K802L171L135
53697B38653L158L480M065M747N127M724L527K186J428J522K276L078K954J341
53683B82266r75k319j946q22k33k59j54L40P57O58N8p01j118q37j00L60K06j03
53665B75078q8O6m1l24m61m59n03n29m12k62j76jK75L40R2n8J55L67K04p1q2p
53643B73103j44j60M77J627K666L298L588L446K737J863J532J969K757L367L526
53628C05652L266K940K956L127K670J339R9N6J029J813J661Q54N3k35K72J471
53612C29023K755L561L951M222M267L876L435L564M142M408L970L162K395J786
$$ plain form
53728 194276 195893 196503 196165 195633 195378 195220 195003 195085 195961 197777 200414 203672 207180 210389 212858 214486
53712 214486 215498 216364 217608 219431 221501 223307 224640 225579 226207 226723 227657 229545 232347 235518 238653
53697 238653 241811 245291 249356 254103 259230 263954 267481 269667 271095 272617 274893 277971 280925 282266
53683 282266 281291 278972 277026 276204 275971 275712 275558 275898 276655 277313 277371 276670 275552 274715 274615 274975 275181 275078
53665 275078 274990 275056 275015 274691 274230 273771 273268 272739 272327 272065 271889 271888 272163 272503 272595 272537 272692 273059 273263 273192 273110 273103
53643 273103 272959 272799 273276 274903 277569 280867 284455 287901 290638 292501 294033 296002 298759 302126 305652
53628 305652 308918 311858 314814 317941 320611 321950 322049 322105 323134 324947 326608 327462 327515 327280 327552 329023
53612 329023 331778 335339 339290 343512 347779 351655 355090 358654 362796 367204 371174 374336 376731 378517
53598C78517J418J424J652J758J625J371R82L95j27k49j48l60j045j815k281k336
53582C80781j987j392r71j008j187r96n55m83r49j361j192o81n02r45j535j478
53566C63559n44M86N46m06j276j187m35K18N51O75M82j0k48J02M49J52k95Q2J196
53547C64097K012K054J830J805J846J725J371P33R5L65K023L989M662M056L751
53532C96414M628N937O785P240P477P153O404O346P665R539J0788J1407J2110
53519D99893J2929J3287J3093J2899J3131J3883J5249J7217J9249K0547K0904
53508F72281K0913K1284K2068K2625K2331K1417K0926K1555K2704K3204K2826
53497I14134K2361K2200K1723K0408J8758J7632J7249J7295J7468J7516J7205
$$ plain form
53598 378517 379935 381359 383011 384769 386394 387765 388747 389142 389015 388766 388618 388258 387213 385398 383117 380781
53582 380781 378794 377402 376431 375423 374236 373240 372685 372202 371253 369892 368700 368019 367517 366572 365037 363559
53566 363559 363015 363501 364047 363641 362365 361178 360743 360961 361512 362187 362669 362659 362411 362513 362962 363114 362819 362901 364097
53547 364097 366109 368163 369993 371798 373644 375369 376740 377473 377568 377933 379956 383945 388607 392663 396414
53532 396414 401042 406979 413764 421004 428481 435634 442038 448384 456049 465588 476376 487783 499893
53519 499893 512822 526109 539202 552101 565232 579115 594364 611581 630830 651377 672281
53508 672281 693194 714478 736546 759171 781502 802919 823845 845400 868104 891308 914134
53497 914134 936495 958695 980418 1000826 1019584 1037216 1054465 1071760 1089228 1106744 1123949
53486A123949J6780J6850J7459J7800J7410J6944J7123J7547J7404J6866J6680
53475A312812J6632J5619J3357J0923R213P756N676L112Q56j040l347o271q811
53462A376487r947r977j0091j0821j1610j1925j2072j2549j3264j4024j5194j7077
53450A227936j8870j9262j8204j7160j7289j8120j8458j7960j7161j6330j5110
53439A034012j3259j1139r310p902o614n234l990l238k820k037m03J705L416M222
53425I77409M230L848L653M348O196Q519J0243J1129J1915J3252J4917J6331J7438
53412A103428J8765K0767K3183K5046K5569K5164K5218K6492K8275K9603L0717
53401A382227L2407L4533L6372L8107M0654M3928M6675M8233M9204N0072N0539
$$ plain form
53486 1123949 1140729 1157579 1175038 1192838 1210248 1227192 1244315 1261862 1279266 1296132 1312812
53475 1312812 1329444 1345063 1358420 1369343 1378556 1386312 1391988 1395100 1395956 1394916 1391569 1385298 1376487
53462 1376487 1366540 1356563 1346472 1335651 1324041 1312116 1300044 1287495 1274231 1260207 1245013 1227936
53450 1227936 1209066 1189804 1171600 1154440 1137151 1119031 1100573 1082613 1065452 1049122 1034012
53439 1034012 1020753 1009614 1000304 992402 985788 980554 976564 973326 970506 968469 968066 969771 973187 977409
53425 977409 981639 985487 989140 993488 999684 1008203 1018446 1029575 1041490 1054742 1069659 1085990 1103428
53412 1103428 1122193 1142960 1166143 1191189 1216758 1241922 1267140 1293632 1321907 1351510 1382227
53401 1382227 1414634 1449167 1485539 1523646 1564300 1608228 1654903 1703136 1752340 1802412 1852951
53390A852951N0689N1416N2843N3604N2701N1039M9965M9239M7710M5350M3223
53379B400730M1713M0024L7457L4243L0961K7820K4624K0994J6734J2121P600
53368B695021L010k381q768j5385k1612k7627l3391l7900m0421m1788m3439m5587
53356B379732m7373m8282m8395m7640m5920m3812m2077m0669l9154l7834l7343
53345A901233l7410l7187l6704l6697l7049l6743l5546l4349l3450l1845k8874
53334A515379k5444k2764k0807j8847j6823j5255j4306j3769j3663j4092j4734
53323A324875j5103j5175j5199j5135j4753j4203j3946j4072j4117j3535j2165
53312A167472j0240q241o710n887n454m784l559k026o57L25J060J804K787M246
$$ plain form
53390 1852951 1903640 1955056 2007899 2061503 2114204 2165243 2215208 2264447 2312157 2357507 2400730
53379 2400730 2442443 2482467 2519924 2554167 2585128 2612948 2637572 2658566 2675300 2687421 2695021
53368 2695021 2698031 2695650 2686882 2671497 2649885 2622258 2588867 2550967 2510546 2468758 2425319 2379732
53356 2379732 2332359 2284077 2235682 2188042 2142122 2098310 2056233 2015564 1976410 1938576 1901233
53345 1901233 1863823 1826636 1789932 1753235 1716186 1679443 1643897 1609548 1576098 1544253 1515379
53334 1515379 1489935 1467171 1446364 1427517 1410694 1395439 1381133 1367364 1353701 1339609 1324875
53323 1324875 1309772 1294597 1279398 1264263 1249510 1235307 1221361 1207289 1193172 1179637 1167472
53312 1167472 1157232 1148991 1142281 1136394 1130940 1126156 1122597 1120571 1119914 1120239 1121299 1123103 1125890 1130136
53298A130136O377R011J1493J3216J4336J5609J7441J9441K1041K2154K2974K3506
53286A326735K3690K3632K3312K2421K0876J9173J7670J5895J3268J0246P906
53275A524824O380M598J804j416m003n727p230r122j1521j4233j6922j9200k0841
53262A427391k2015k3160k4584k6161k7377k7750k7260k6402k5773k5710k6160
53251A145039k6621k6250k4606k2447k1225k1412k1929k1622k0753k0309k0416
53240H97449k0376j9981j9741j9816j9652j8844j7576j6070j4297j2457j0978
53229G07661r917q921q014p688q021q429q574q819r375r800r847j0138j1333j3084
53215E75701j4496j5258j5635j5619j4814j3196j1428j0231r758r622r369q846
$$ plain form
53298 1130136 1136513 1145524 1157017 1170233 1184569 1200178 1217619 1237060 1258101 1280255 1303229 1326735
53286 1326735 1350425 1374057 1397369 1419790 1440666 1459839 1477509 1493404 1506672 1516918 1524824
53275 1524824 1531204 1535802 1537606 1536190 1532187 1526460 1519230 1510108 1498587 1484354 1467432 1448232 1427391
53262 1427391 1405376 1382216 1357632 1331471 1304094 1276344 1249084 1222682 1196909 1171199 1145039
53251 1145039 1118418 1092168 1067562 1045115 1023890 1002478 980549 958927 938174 917865 897449
53240 897449 877073 857092 837351 817535 797883 779039 761463 745393 731096 718639 707661
53229 707661 697744 688823 680809 673121 665100 656671 648097 639278 629903 620103 610256 600118 588785 575701
53215 575701 561205 545947 530312 514693 499879 486683 475255 465024 455266 445644 436275 427429
53203D27429q256p890p814p915q168q596q973q930q488q147q224q400q170p498
53189C11960o762o223n815n396m980m747m772m788m298l175k021j553j726j928
53175B53776j928k056k394k447j906j152o41l78l32q39j927k763k517j519q49
53160B30128q33q08l60m9m80j258j454q65k47k58o67q06n00j77j14m2L69R21J066
53141B23566N05n77j689k203j604m3J442J750Q98OO7J012K031K454K145J410O95
53124B31865K22j40m61l56N37J742K170J400K25l29j18K86M60L88J87k3j09j45
53106B37801m89j316k204k506k136j664j622j906j906j199n3P69P83K68j32j29
53090B22359N2J44M0l01p66r21m43L01O05L79J98K97K56j36m20l11k27m90o05
$$ plain form
53203 427429 419173 411283 403469 395554 387386 378790 369817 360887 352399 344252 336028 327628 319458 311960
53189 311960 305198 298975 293160 287764 282784 278037 273265 268477 264179 261004 258983 257430 255704 253776
53175 253776 251848 249792 247398 244951 243045 241893 241252 240874 240542 239703 237776 235013 232496 230977 230128
53160 230128 229295 228487 228127 228078 227598 226340 224886 224021 223774 223516 222849 222043 221543 221366 221252 221210 221579 222500 223566
53141 223566 224071 223494 221805 219602 217998 217955 219397 221147 222045 222051 222118 223130 225161 227615 229760 231170 231865
53124 231865 232087 231947 231486 231130 231667 233409 235579 236979 237204 236875 236757 237043 237503 237891 238078 238055 237946 237801
53106 237801 237312 235996 233792 231286 229150 227486 225864 223958 222052 220853 220800 221569 222352 222620 222488 222359
53090 222359 222411 222555 222595 222294 221528 220607 220164 220465 221070 221449 221647 221944 222200 222064 221644 221333 221106 220616 220011
53071B20011j20L96P6q13j133m44M74P64M13j84q40j460j787j710j532j540j465
53054B09106p12Q14K275K531J270n11j383q79J87P95P45M43R7l33o23l71L38Q14
53036B14603N59q3l41O7O20O17K9m02M1J143J907J614N46m57r07q76n85j66K12
53017B18141L68L74N08Q86J284J381J096N91N0m33p69q10m70K9K56J0m24o13m22
52998B21033M9P32J428J631R94l5o07n52m55o19o21j55L90O19P84J199J505J164
52980B28484L60k51m40m08j12P43K034L034L092K174Q14k05l01L48Q79P11L32
52963B41288O34J639K380K058Q29n36j367j449j033o06m03k62j31m39j471k640
52947B38491k931k117j011m94p45j382j862j715r18j08Om99q92p83m65k68j47
$$ plain form
53071 220011 219891 220287 220363 219550 218417 217973 218447 219211 219624 219440 218600 217140 215353 213643 212111 210571 209106
53054 209106 208394 209208 211483 214014 215284 214773 213390 212511 212698 213493 214238 214681 214778 214445 213822 213451 213789 214603
53036 214603 215162 215079 214738 214805 215425 216042 216071 215669 215710 216853 218760 220374 220920 220463 219556 218680 218095 217929 218141
53017 218141 218509 218883 219391 220277 221561 222942 224038 224629 224679 224246 223477 222667 222197 222226 222482 222492 222068 221455 221033
52998 221033 221082 221814 223242 224873 225867 225832 225225 224673 224218 223599 222978 222823 223213 223832 224616 225815 227320 228484
52980 228484 228844 228593 228153 227745 227633 228376 230410 233444 236536 238710 239524 239319 239018 239366 240245 240956 241288
52963 241288 241922 243561 245941 247999 248828 248292 246925 245476 244443 243837 243434 243172 243041 242602 241131 238491
52947 238491 235560 233443 232432 231938 231193 229811 227949 226234 225316 225208 225214 224715 223823 223040 222575 222307 222160
52930B22160p4k34n96p26l50K55O48O50K73l92j034j257j066q52p19l30L98R47
52912B17701R30O98P76J057J015N06j24n40o46m22P1N62P52O12L04m9l10k53J16
52893B22756L55L0o65j033o48K39J023J284J037O27L96L69L45L42O54J234J400
52876B29745O01o65j230n96M90R88P24L19K30K59K1l87m14K21J072J390R68L16
52858B34052l7j31l26p31j179j592j985k257k263k206k493l098l396k831j617
52843B07910n56k87p88j479j724j330o61j97JK46O32Q65P01L30R3J16L27O12P10
52824B05521M12P8N09J712K328J120j107k150j061P74J611J372J066J049Q90N32
52808B14656M23N59L74k20n28j14N01N02l02j514k620l146k815j889j072p45o20
$$ plain form
52930 222160 222086 221852 221256 220530 220180 220435 221083 221733 222006 221614 220580 219323 218257 217405 216686 216356 216754 217701
52912 217701 218631 219329 220105 221162 222177 222683 222559 222019 221373 220951 221022 221584 222336 222948 223252 223203 222893 222640 222756
52893 222756 223111 223141 222476 221443 220795 221034 222057 223341 224378 225005 225401 225770 226115 226457 227111 228345 229745
52876 229745 230346 229681 228451 227855 228345 229333 230057 230376 230606 230865 230886 230499 230085 230306 231378 232768 233736 234052
52858 234052 234015 233884 233558 232827 231648 230056 228071 225814 223551 221345 218852 215754 212358 209527 207910
52843 207910 207354 207067 206279 204800 203076 201746 201085 200888 200889 201135 201767 202632 203333 203663 203756 203872 204199 204811 205521
52824 205521 205933 206011 206520 208232 210560 211680 210573 208423 207362 208136 209747 211119 212185 213234 214124 214656
52808 214656 215079 215638 216012 215792 215264 215150 215651 216153 215851 214337 211717 208571 205756 203867 202795 202050 201430
52791B01430l84j73j20J22P90J254O45p59j534p61P95J670J524J343J769J994
52775B09605R54r11j907j281j89o2p54j116q08n12n96o52m92n33r31j199r83m64
52757A97169L21J553K713K618J062m69o16J49N78O01J010J715J709P43j91k11
52741B10454N45J562K612L452L591K806J499L33j71K49J347K243K106J079O2l67
52725B33402l68k49j64l46r51j535j413o83k44n36r73r25o48p96j398j831j529
52708B18813m72P80J453J186L95k44n67p49o17J31J039J120K26o05n40P3N43Q63
52690B22828J258J409Q69p9p40q83p51m79p2K32J83PR2L48L31k8k76j41J16R1
52670B24315k26m35k46P6j01r13j510q92P20J997K101J604J406J549J577J559
$$ plain form
52791 201430 201046 200873 200753 200875 201665 202919 203564 202805 201271 200510 201305 202975 204499 205842 207611 209605
52775 209605 210559 209648 207741 206460 206271 206209 205455 204339 203531 203019 202423 201771 201279 200746 199815 198616 197633 197169
52757 197169 197490 199043 201756 204374 205436 204967 204351 204500 205078 205679 206689 208404 210113 210856 210665 210454
52741 210454 210999 212561 215173 218625 222216 225022 226521 226854 226683 226932 228279 230522 232628 233707 233769 233402
52725 233402 233034 232785 232621 232275 231324 229789 228376 227693 227449 226913 225940 225015 224367 223571 222173 220342 218813
52708 218813 218341 219121 220574 221760 222155 221911 221344 220595 219978 220109 221148 222268 222494 221889 221349 221422 221965 222828
52690 222828 224086 225495 226364 226285 225545 224662 223911 223432 223360 223592 223775 223782 223874 224222 224553 224525 224249 224108 224224 224315
52670 224315 224089 223654 223408 223484 223383 222470 220960 220068 220788 222785 224886 226490 227896 229445 231022 232581
52654B32581J885K433K694K553K279J832R38k37j106j469j692k033k324k393k355
52639B33586k296k072j561q16M4Q04J084P01J07MN02J118J552J934K256K158J605
52622B40710J091R08O69O0n29n96m42p84j639k256k152j647j189p68k18L24O05
52605B32147O54O05L51j97o60m47M51J305J397P08k63r78j029k24J088J981J711
52588B38600M99o90j128q65l33J68N55P91Q37O37J41n56j144j298r95m94p4R0
52570B34741m4k70j62M43J107J244Q22K62j33l09j35M35Q82M69p19j656j528n98
52552B34851L10P44P19L44j99o06o66n22m58n84p93q40n13K1J63l78r39n86N23
52533B30591J215R16L56L59P52R61R32Q60O35J77j98l43o57j274j483p23L78P97
$$ plain form
52654 232581 234466 236899 239593 242146 244425 246257 247195 246958 245852 244383 242691 240658 238334 235941 233586
52639 233586 231290 229218 227657 226841 226885 227689 228773 229474 229581 229585 230087 231205 232757 234691 236947 239105 240710
52622 240710 241801 242709 243378 243438 242909 242313 241871 241087 239448 237192 235040 233393 232204 231436 231218 231542 232147
52605 232147 232801 233406 233757 233560 232900 232453 232904 234209 235606 236314 236051 235073 234044 233820 234908 236889 238600
52588 238600 239099 238409 237281 236416 236083 236251 236806 237597 238434 239071 239212 238656 237512 236214 235219 234725 234651 234741
52570 234741 234697 234427 234265 234708 235815 237059 237881 238143 238010 237701 237566 238001 238883 239352 238633 236977 235449 234851
52552 234851 235161 235905 236624 236968 236769 236163 235497 234975 234517 233933 233140 232300 231787 231808 231971 231593 230654 230068 230591
52533 230591 231806 232722 233078 233437 234189 235150 236082 236942 237577 237754 237556 237213 236556 235282 233799 233076 233454 234251
52515B34251N25L12M13N17O44J106J715J917J701J591J733J799J691J546J127
52500B52588N3j310k095k094j857j621j043j56L82K61r5l77p45j087q73j50K04
52483B39985k17o33l02L06L61%m0L02M97M55O22J020J093O66L93Q66J678J803
52465B48855Q77k93o29j2O90Q04O52Q41J275J365J012O22L21j71p85j091j115
52448B53218j401k021k302j905j389j299j381j262j161j330j393r88m90l78l78
52433B34140J8N67P05N56O32Q21N93R0L6N24Q26N90L25N00Q98J170J373J525J311
52414B47200O94L54R63K249L359L979M692O152Q216R984J0608R923Q335O163L469
52399C26340M65k221m131n558p034q346q605p377n305l383k095j388j098j026
$$ plain form
52515 234251 234776 235088 235501 236018 236662 237768 239483 241400 243101 244692 246425 248224 249915 251461 252588
52500 252588 252641 251331 249236 247142 245285 243664 242621 242465 242847 243108 243013 242636 241891 240804 239931 239781 239985
52483 239985 239768 239135 238833 239139 239500 239500 239460 239762 240259 240714 241336 242356 243449 244115 244508 245374 247052 248855
52465 248855 249732 249439 248810 248798 249488 250292 250944 251785 253060 254425 255437 256059 256380 256209 255424 254333 253218
52448 253218 251817 249796 247494 245589 244200 242901 241520 240258 239097 237767 236374 235386 234896 234518 234140
52433 234140 234158 234725 235430 235986 236618 237439 238032 238122 238158 238682 239508 240098 240423 240923 241821 242991 244364 245889 247200
52414 247200 247894 248248 249211 251460 254819 258798 263490 269642 277858 287842 298450 308373 316708 322871 326340
52399 326340 326805 324584 320453 314895 307861 299515 290910 283533 278228 274845 272750 271362 270264 269238
52385B69238q63m23J47N89Q57J066J262J501J978K812L681L916L201K133J837
52370B92932K794M108M296K970J391J083K145L341L597K858J597K23q25j044l58
52355C21108O51J382J801K137K378K414K369K416K418K233K098K349K840L150
52341C51744L264L575M206M818N250N810O752P784Q494Q978R708J0884J2170J3046
52327D56483J3315J3288J3614J4760J6546J8318J9682K0875K2212K3482K4194
52316F56769K4280K4081K3746K3089K2186K1556K1472K1408K0595J8961J7191
52305H95334J5910J5134J4476J3600J2415J1076R842Q784P594N932L933K151R01
52292A017082j39j531l449n548p334q512r048r102q876q478p896p107o119m870
$$ plain form
52385 269238 268375 267952 268099 268688 269545 270611 271873 273374 275352 278164 281845 285761 288962 291095 292932
52370 292932 295726 299834 304130 307100 308491 309574 311719 315060 318657 321515 323112 323335 322510 321466 321108
52355 321108 321759 323141 324942 327079 329457 331871 334240 336656 339074 341307 343405 345754 348594 351744
52341 351744 355008 358583 362789 367607 372857 378667 385419 393203 401697 410675 420383 431267 443437 456483
52327 456483 469798 483086 496700 511460 528006 546324 566006 586881 609093 632575 656769
52316 656769 681049 705130 728876 751965 774151 795707 817179 838587 859182 878143 895334
52305 895334 911244 926378 940854 954454 966869 977945 987787 996571 1004165 1010097 1014030 1016181 1017082
52292 1017082 1016943 1015412 1011963 1006415 999081 990569 981521 972419 963543 955065 947169 940062 933943 929073
52278I29073l278j422M54K214M001N957P890R440J0536J1490J2615J3819J4719
52265A017508J5079J5038J4841J4512J3897J3055J2402J2252J2417J2393J1950
52254A165344J1188J0130Q635O835N240M151L230J960K60j677l903o518r108j0911
52240A184856j1727j2186j2976j4107j5144j5753j5787j5149j3988j2885j2393
52229A032761j2416j2309j1596j0390r130q129p426o818o022m952l826k848j820
52216I35079l95J254K339K342J732J540K317L705M939N493N355M887M533M443
52202I79563M346L912L224K695K586K825L264L842M405M667M483L992L406K866
52188A030076K548K566K605J992M65j363k643l219l650m423n551o815p930q426
$$ plain form
52278 929073 925795 924373 924827 927041 931042 936999 944889 954329 964865 976355 988970 1002789 1017508
52265 1017508 1032587 1047625 1062466 1076978 1090875 1103930 1116332 1128584 1141001 1153394 1165344
52254 1165344 1176532 1186662 1195297 1202132 1207372 1211523 1214753 1216713 1216973 1215296 1211393 1204875 1195767 1184856
52240 1184856 1173129 1160943 1147967 1133860 1118716 1102963 1087176 1072027 1058039 1045154 1032761
52229 1032761 1020345 1008036 996440 986050 976920 968791 961365 954547 948525 943573 939747 936899 935079
52216 935079 934684 935938 938277 940619 942351 943891 946208 949913 954852 960345 965700 970587 975120 979563
52202 979563 983909 987821 991045 993740 996326 999151 1002415 1006257 1010662 1015329 1019812 1023804 1027210 1030076
52188 1030076 1032624 1035190 1037795 1039787 1040252 1038889 1036246 1033027 1029377 1024954 1019403 1012588 1004658 996232
52174I96232p917o648n473m993m944m630l772k716j914j418r00p4R64J786K079
52159I55662J938J673J479J491J949K867L598L295J968O90M42J085J799K117K168
52144I84221K128K053K098K440K912L115K939K641K415K274K373L005M082N164
52130A023860O290Q247J1481J5052J7463J8467J9373K1404K4350K7159K9262L0732
52118A253140L1549L1433L0431K9125K8081K7420K6920K6168K4653K2206J9415
52107A550541J7142J5427J3425J0625P543M798K192o40l232m739n237n696o776
52094A595373q373j0300j2572j4866j6545j7547j8469j9483j9879j9174j7918
52083A420247j6798j5485j3255j0311p606n512l411p19K333N131P349R028J0338
$$ plain form
52174 996232 988315 981667 976194 971201 966257 961627 957855 955139 953225 951807 950907 950833 951797 953583 955662
52159 955662 957600 959273 960752 962243 964192 967059 970657 973952 975920 976610 977052 978137 979936 982053 984221
52144 984221 986349 988402 990500 992940 995852 998967 1001906 1004547 1006962 1009236 1011609 1014614 1018696 1023860
52130 1023860 1030150 1038397 1049878 1064930 1082393 1100860 1120233 1141637 1165987 1193146 1222408 1253140
52118 1253140 1284689 1316122 1346553 1375678 1403759 1431179 1458099 1484267 1508920 1531126 1550541
52107 1550541 1567683 1583110 1596535 1607160 1614703 1619501 1621693 1621053 1617821 1613082 1607845 1602149 1595373
52094 1595373 1587000 1576700 1564128 1549262 1532717 1515170 1496701 1477218 1457339 1438165 1420247
52083 1420247 1403449 1387964 1374709 1364398 1356792 1351280 1347869 1347150 1349483 1354614 1361963 1370991 1381329
52070A381329J1561J2983J4663J6355J7750J8673J9063J8925J8284J7202J5809
52059A562597J4381J3156J2019J0592Q858P291O118M794K688l7k743n309q102
$$ plain form
52070 1381329 1392890 1405873 1420536 1436891 1454641 1473314 1492377 1511302 1529586 1546788 1562597
52059 1562597 1576978 1590134 1602153 1612745 1621603 1628894 1635012 1639806 1642494 1642457 1639714 1634405 1626303
$$ [...]
##END NTUPLES=NMR SPECTRUM
##END=
