
##TITLE=AC1206_HPAAH12049_7154822_nrlYb0oDl9
##JCAMPDX= 6.0         $$ Bruker NMR JCAMP-DX V2.0
##DATA TYPE= NMR SPECTRUM
##DATA CLASS= NTUPLES
##ORIGIN= BRUKER
##OWNER= Administrator
$$ 1.72 TOPSPIN		Version 2.1
$$ 2012-12-12 03:38:27.559 -0500  Administrator@X
$$ Compression mode = diff/dup
##.OBSERVE FREQUENCY= 400.02188249412
##.OBSERVE NUCLEUS= ^1H
##.ACQUISITION MODE= SIMULTANEOUS (DQD)
##.ACQUISITION SCHEME= undefined
##.AVERAGES= 8
##.DIGITISER RES= 22
##SPECTROMETER/DATA SYSTEM= spect
##.PULSE SEQUENCE= zg30
##.SOLVENT NAME= COFFEE_meoh
##.SHIFT REFERENCE= INTERNAL, COFFEE_meoh, 1, 14.98509
##AUDIT TRAIL= $$ (NUMBER, WHEN, WHO, WHERE, PROCESS, VERSION, WHAT)
$$ ##TITLE= Audit trail, TOPSPIN		Version 2.1
$$ ##JCAMPDX= 5.01
$$ ##ORIGIN= Bruker BioSpin GmbH
$$ ##OWNER= Administrator
$$ $$ E:\/data/COFFEE/nmr/AC1206_HPAAH12049_7154822_nrlYb0oDl9/30/pdata/1/auditp.txt
$$ ##AUDIT TRAIL=  $$ (NUMBER, WHEN, WHO, WHERE, PROCESS, VERSION, WHAT)
(   1,<2012-12-12 03:38:19.043 -0500>,<Administrator>,<X>,<go>,<TOPSPIN 2.1>,
      <created by zg
	started at 2012-12-12 03:37:12.871 -0500,
	POWCHK enabled, PULCHK disabled,
       configuration hash MD5:
       86 BA 57 50 F2 9D 5C 9B 26 00 A9 28 5F 66 2E 89
       data hash MD5: 64K
       C3 DD 1C 3C AA 7B 8D 3C A1 6F C3 8D 77 7F D0 63>)
(   2,<2012-12-12 03:38:22.309 -0500>,<Administrator>,<X>,<proc1d>,<TOPSPIN 2.1>,
      <Start of raw data processing
       efp LB = 0 FT_mod = 6 PKNL = 1 PHC0 = 0 PHC1 = 0 SI = 32K 
       data hash MD5: 32K
       83 BE 7A 06 35 5B E3 00 CD 85 FF F1 04 E3 EE D0>)
(   3,<2012-12-12 03:38:22.809 -0500>,<Administrator>,<X>,<proc1d>,<TOPSPIN 2.1>,
      <pk PHC0 = 93.95508 PHC1 = 0 
       data hash MD5: 32K
       60 B3 A7 0D AD 5F CC 2C A0 75 D6 38 D1 F4 F7 32>)
(   4,<2012-12-12 03:38:23.059 -0500>,<Administrator>,<X>,<proc1d>,<TOPSPIN 2.1>,
      <abs ABSG = 1 
       data hash MD5: 32K
       01 ED EA 64 5B FA EC DF 0D A8 E0 F7 E1 D3 29 6F>)
(   5,<2012-12-12 03:38:23.231 -0500>,<Administrator>,<X>,<proc1d>,<TOPSPIN 2.1>,
      <abs ABSG = 2 
       data hash MD5: 32K
       B3 88 0B 0D F2 5E 75 05 D7 23 E9 E3 4F 4D 73 7E>)
(   6,<2012-12-12 03:38:23.387 -0500>,<Administrator>,<X>,<proc1d>,<TOPSPIN 2.1>,
      <abs ABSG = 3 
       data hash MD5: 32K
       E7 AD 4F 7B E8 6B 52 8F BB DF 64 C7 A7 93 58 7C>)
(   7,<2012-12-12 03:38:23.543 -0500>,<Administrator>,<X>,<proc1d>,<TOPSPIN 2.1>,
      <abs ABSG = 4 
       data hash MD5: 32K
       16 7D 26 43 71 4E 5D 05 6D 07 0C 06 AD 44 7E 78>)
(   8,<2012-12-12 03:38:23.715 -0500>,<Administrator>,<X>,<proc1d>,<TOPSPIN 2.1>,
      <abs ABSG = 5 
       data hash MD5: 32K
       FA F9 93 CA 09 4F AF AE AF 4D E3 43 05 30 CC E2>)
$$ ##END=
$$ 
$$ $$ hash MD5
$$ $$ 34 40 6C A3 4E 9D 73 6B 9A 59 A2 F3 1A E9 E5 39
##$RELAX= 
##$RELAX= 
##$RELAX= 
##$RELAX= 
##$RELAX= 
##$RELAX= 
##$RELAX= 
##$RELAX= 
$$ Bruker specific parameters
$$ --------------------------
##$DU= <E:\>
##$EXPNO= 30
$$ [...]
150 150 150 150 150 150 150 150
##$TP07= 0
##$TPNAME0= <>
##$TPNAME1= <>
##$TPNAME2= <>
##$TPNAME3= <>
##$TPNAME4= <>
##$TPNAME5= <>
##$TPNAME6= <>
##$TPNAME7= <>
##$TPOAL= (0..7)
0.5 0.5 0.5 0.5 0.5 0.5 0.5 0.5
##$TPOFFS= (0..7)
0 0 0 0 0 0 0 0
##$TUNHIN= 0
##$TUNHOUT= 0
##$TUNXOUT= 0
##$USERA1= <user>
##$USERA2= <user>
##$USERA3= <user>
##$USERA4= <user>
##$USERA5= <user>
##$V9= 5
##$VALIST= <valist>
##$VCLIST= <CCCCCCCCCCCCCCC>
##$VD= 0
##$VDLIST= <DDDDDDDDDDDDDDD>
##$VPLIST= <PPPPPPPPPPPPPPP>
##$VTLIST= <TTTTTTTTTTTTTTT>
##$WBST= 2048
##$WBSW= 25
##$XGAIN= (0..3)
0 0 0 0
##$XL= 0
##$YL= 0
##$YMAX_a= 661011
##$YMIN_a= -560362
##$ZGOPTNS= <>
##$ZL1= 120
##$ZL2= 120
##$ZL3= 120
##$ZL4= 120
##$ABSF1= 14.98509
##$ABSF2= -5.573092
##$ABSG= 5
##$ABSL= 3
##$ALPHA= 0
##$AQORDER= 0
##$ASSFAC= 0
##$ASSFACI= 0
##$ASSFACX= 0
##$ASSWID= 0
##$AUNMP= <proc_prof1d_extract_pilot.lims>
##$AXLEFT= 0
##$AXNAME= <>
##$AXNUC= <1H>
##$AXRIGHT= 0
##$AXTYPE= 0
##$AXUNIT= <>
##$AZFE= 0.1
##$AZFW= 0.1
##$BCFW= 0
##$BC_mod= 0
##$BYTORDP= 0
##$COROFFS= 0
##$CY= 15
##$DATMOD= 1
##$DC= 0
##$DFILT= <>
##$DTYPP= 0
##$F1P= 0
##$F2P= 0
##$FCOR= 0.5
##$FTSIZE= 32768
##$FT_mod= 6
##$GAMMA= 0
##$GB= 0
##$INTBC= 1
##$INTSCL= 1
##$ISEN= 128
##$LB= 0
##$LEV0= 0
##$LPBIN= 0
##$MAXI= 10000
##$MC2= 0
##$MEAN= 0
##$ME_mod= 0
##$MI= 0
##$NCOEF= 0
##$NC_proc= -8
##$NLEV= 6
##$NOISF1= 0
##$NOISF2= 0
##$NSP= 0
##$NTH_PI= 0
##$NZP= 0
##$OFFSET= 14.98509
##$PC= 1
##$PHC0= 93.95508
##$PHC1= 0
##$PH_mod= 1
##$PKNL= yes
##$PPARMOD= 0
##$PPDIAG= 0
##$PPIPTYP= 0
##$PPMPNUM= 2147483647
##$PPRESOL= 1
##$PSCAL= 4
##$PSIGN= 0
##$PYNMP= <proc.py>
##$REVERSE= no
##$SF= 400.02
##$SI= 32768
##$SIGF1= 0
##$SIGF2= 0
##$SINO= 400
##$SIOLD= 32768
##$SPECTYP= <>
##$SREGLST= <1H.CDCl3>
##$SSB= 0
##$STSI= 32768
##$STSR= 0
##$SW_p= 8223.68421052631
##$SYMM= 0
##$S_DEV= 0
##$TDeff= 65536
##$TDoff= 0
##$TI= <>
##$TILT= no
##$TM1= 0
##$TM2= 0
##$TOPLEV= 0
##$USERP1= <user>
##$USERP2= <user>
##$USERP3= <user>
##$USERP4= <user>
##$USERP5= <user>
##$WDW= 1
##$XDIM= 32768
##$YMAX_p= 480530168
##$YMIN_p= -684626
##$CURPLOT= <Network HP LaserJet P1505>
##$CURPRIN= <$Network HP LaserJet P1505>
##$DFORMAT= <normdp>
##$LAYOUT= <+/1D_H.xwp>
##$LFORMAT= <normlp>
##$PFORMAT= <normpl>
##$SURQMSG= 1
$$ End of Bruker specific parameters
$$ ---------------------------------
##NTUPLES= NMR SPECTRUM
##VAR_NAME=  FREQUENCY,     SPECTRUM/REAL,   SPECTRUM/IMAG
##SYMBOL=    X,             R,               I
##VAR_TYPE=  INDEPENDENT,   DEPENDENT,       DEPENDENT
##VAR_FORM=  AFFN,          ASDF,            ASDF
##VAR_DIM=   32768,         32768,           32768
##UNITS=     HZ,            ARBITRARY UNITS, ARBITRARY UNITS
##FACTOR=    0.250966925370066, 1,           1
##FIRST=     8223.43324360094, 34353,        -232452
##LAST=      0,             34093,           -113259
##MIN=       0,             -684626,         0
##MAX=       8223.43324360094, 480530168,    0
$$ Real data points
##PAGE= N=1
##DATA TABLE= (X++(R..R)), XYDATA
$$ [...]
19538a39331G8481N4761f3942j52193l9155m3381j37480a65924B18468A4156a35342
19526B03430f8824A9858c81833c912q3428L8233n1944E9043e0658J0910A05100
19514a19248l3063N2931k6922G5121a6638k49547l5648O2337D6314b66459l1261
19503b97720K4545n9547c5193H9101b23247H1a85499I4920a14481A546a7276A4900
19490E6981a33330a0878m5622B09105E3311Q9601c1672C21205a04438C131J47405
19479A50536a60402k0674Q3916J4265k1677E701c61097J59174I8536b71172F8550
19467h0979j51230i139r0249o6317E8834J49930E2209K2261c8094F4483e9330
19455E05795A35498f7957q351j78178F561a38853l5242A8364c0253A44284b52566
$$ y = [-139331, 78481, 133242, -63942, -216135, -255290, -298671, -436151, -165924, 218468, 14156, -135342, 203430, -68824, 19858, -381833, -3912, -87340, -49107, -101051, 59043, -50658, -39748, 105100, -119248, -152311, -99380, -126302, 75121, -16638, -266185, -301833, -239496, 46314, -266459, -297720, -273175, -332722, -35193, 89101, -223247, 81, -185499, 94920, -114481, 1546, -17276, 14900, 56981, -133330, -10878, -56500, 209105, 53311, 142912, -31672, 321205, -104438, 3131, 150536, -160402, -181076, -97160, -82895, -104572, 5701, -361097, -201923, 98536, -271172, 68550, -80979, -232209, -9139, -99388, -165705, 58834, 208764, 52209, 74470, -38094, 64483, -59330, 505795, 135498, -67957, -76308, -254486, 6561, -138853, -174095, 18364, -30253, 144284, -252566]
19443a91421j26384C29835c91221J68365M0184I4430g4787D3672j9751e7308H6264
19431c06139E9249a21356C7004A7729b21586B78595c3985l07642e7073k588F5605
19419A95091r1025l7793J22083i1783j86339C0214d5468G1566i6595K8908G8068
19407a86762F9878o106l0332K95267c31817a7059k61156E9490a79613j09883B5256
19395A04658b88127a13976A36927a24997I6328a6732j08212A50977E1757d10919
19384b35207C23910G6214l4972a21544q8008A78744d21607C3461J16908a3053
19373b0335k17160k33193K06238k34387C19507b39907B50503A08877a47437k61289
19363d08726J98593c6643A44014a80172h6411k86023b2847m5478A09344m5319
$$ y = [-191421, -317805, 329835, -391221, -222856, -182672, 94430, -74787, 43672, 23921, -57308, 86264, -306139, 59249, -121356, 37004, 17729, -221586, 278595, -33985, -341627, -57073, -59661, 65605, 195091, 104066, 66273, 188356, -91783, -278122, 30214, -45468, 71566, -96595, -67687, 78068, -186762, 69878, 63772, 33440, 328707, -331817, -17059, -278215, 59490, -179613, -289496, 25256, 104658, -288127, -113976, 136927, -124997, 96328, -16732, -124944, 150977, 51757, -410919, -235207, 323910, 76214, 41242, -121544, -209552, 178744, -421607, 33461, 150369, -13053, -20335, -237495, -470688, -264450, -498837, 319507, -239907, 250503, 108877, -147437, -408726, -210133, -36643, 144014, -180172, -86411, -372434, -22847, -68325, 109344, 64025]
19353F4025j692b00126M0855F2372g83j93459j0991B43856a29801C1709L3129
19342F4838Q438h4942k80580a8786j84818j611M9838n8891A24072c6927j16673
19331a53600d8404D2303R0022a04210L9330C6706J85859c37252J26918r384H5189
19319a66838A06858a94216c5814E8164J59239k0648B6931N8517Q8229g8190j55870
19308b34060B80440h2356k28286h1151r2431j59023i195j76632A24931a44136
19297B63235c89216A59795b98432Q8692B67862b23514Q0504A50366h5052m4714
19287a29766F164N4135M9432g4564k19566i1635B58294e3251l5413B9183a85860
19275b15178A24462j9125D7142d15943g396j13964l45278b19425m3360a00317
$$ y = [64025, 62333, -200126, -159271, 62372, -783, -194242, -205233, 243856, -129801, 31709, 64838, 73276, -84942, -365522, -18786, -203604, -205215, -155377, -214268, 124072, -36927, -153600, -48404, 42303, 132325, -104210, -64880, 36706, 222565, -337252, -210334, -219718, 85189, -166838, 106858, -194216, -35814, 58164, 217403, 196755, 26931, 85448, 173677, -78190, -234060, 280440, -82356, -310642, -81151, -173582, -332605, -9195, -185827, 124931, -144136, 263235, -389216, 159795, -298432, -209740, 267862, -223514, -143010, 150366, -85052, -129766, 6164, 60299, 109731, -74564, -294130, -91635, 258294, -53251, -88664, 29183, -185860, -215178, 124462, 105337, 47142, -415943, -7396, -121360, -466638, -219425, -262785, -100317]
19264c01387B2913J7185a65j95375b1140A42401a20871e0205a5266j61092l4869
19253b11227k35394e5773j22304A50685a84563m1330L6886I7991K36622b63143
19242B3863g3292b6962o8550d0102j39701j8341H5895a78973B3657C059g2886
19230a8407B8021e22230A54037a4494j65603m5713I5086r322c76699B58272c14137
19218b3792k24088A28303b55640d4030G1838d7812H0344b10474l9563G5503A6174
19206I9857b1208k1374B11261e3047j7957p3123r9927J20851M6035A70256J79793
19195C50049a15146p072A11958b58866P2812n6863A55102q772b49368c7830A02729
19183a39930J3739J6852e2018k43125A08958b41929c6437A41725B1432J1465K54830
$$ y = [-301387, 22913, 40098, -165, -195540, -21140, 142401, -120871, -50205, -15266, -176358, -211227, -446621, -55773, -178077, 150685, -184563, -225893, -189007, 97991, 334613, -263143, 23863, -73292, -26962, -95512, -40102, -179803, -198144, 85895, -178973, 23657, 3059, -72886, -18407, 28021, -522230, 154037, -14494, -180097, -225810, 95086, 85764, -376699, 258272, -314137, -23792, -247880, 128303, -255640, -44030, 71838, -47812, 80344, -210474, -250037, 75503, 16174, 99857, -21208, -42582, 211261, -53047, -71004, -144127, -244054, -123203, -77168, 170256, 350049, -115146, -122218, 111958, -258866, -186054, -242917, 155102, 146330, -249368, -37830, 102729, -139930, -126191, -109339, -52018, -295143, 108958, -241929, -36437, 141725, 21432, 32897, 287727]
19172B87727M6235i3353j36093C32193f6090B20601a25869F3677b50404D5880
19161b53921m9087A2858J49731c31238A96572K72103a46457D6479a62388E1461
19150A64997J54066a72440j14048a30661k48089a60449d2957h843A09175R9040
19140B08215P3628a69519N4413A85219D7491a29689A36171d87213E9721B6635
19129b52227i553B87576F6527c46437C12733c1432l96300G6558a18174A75730
19118I3302j9668c13954g3406B14485f0834k74727B58442a27560k6530M050A87848
19106g7832j6318r47j33086i1418F2890g9674A39454a05784p7725C7052a35797
19094B83360r0912a5441k98863a20746L1098A34990c01739j0410J38940c6561
$$ y = [287727, 333962, -93353, -229446, 332193, -66090, 220601, -125869, 63677, -250404, 45880, -253921, -303008, 12858, 162589, -331238, 196572, 468675, -146457, 46479, -162388, 51461, 164997, 319063, -172440, -286488, -130661, -378750, -160449, -42957, -8843, 109175, 208215, 281843, -169519, -115106, 185219, 47491, -129689, 136171, -487213, 59721, 26635, -252227, -9553, 287576, 66527, -346437, 312733, -31432, -427732, 76558, -118174, 175730, 93302, 73634, -313954, -73406, 214485, -60834, -335561, 258442, -127560, -154090, -150040, 187848, -77832, -94150, -95097, -228183, -91418, 62890, -79674, 139454, -105784, -183509, 37052, -135797, 283360, 192448, -15441, -314304, -120746, -89648, 134990, -301739, -312149, -173209, -36561]
19083a34428b1179A3227i9333j72818h3155j86797B0242J94755a76115j79682
19073c55797a71543B7163M26827e7352I5295c55372A02412h8238a618B8243Q5754
19062A13997h4703A02876b34244E8260f7707n1100j1322K6256H7685L7496k9906
19051I5275f5833o0545C59063r9819b2869j81990d8609k33097a07198q2159H0058
19039b14600b5686G9236c2546k76972H1676J27117a83457a7334A94979R6989A44675
19027I3515J90323a36031H8479d010k65778a04298D0212J33966C4419J65093A969
19015A02152j3256i7623A51624A200L0730g2894j05496q9415h187j97959k67464
19004d73610b6214C88877a65907n4016B59442R157M5460e96173f0525N165A01800
$$ y = [-134428, -21179, 13227, -99333, -272151, -83155, -269952, 20242, 214997, -176115, -355797, -171543, 27163, 453990, -57352, 95295, -355372, 102412, -88238, -1618, 28243, 113997, -84703, 102876, -234244, 58260, -67707, -118807, -130129, -103873, 87685, 125181, 95275, -65833, -126378, 359063, 259244, -22869, -204859, -48609, -281706, -107198, -189357, 80058, -214600, -25686, 79236, -32546, -309518, 81676, 208793, -183457, -17334, 194979, 291968, 144675, 93515, 283838, -136031, 88479, -4010, -269788, -104298, 40212, 174178, 34419, 199512, 1969, 102152, 88896, -97623, 151624, 1200, 31930, -72894, -178390, -267805, -8187, -206146, -473610, -26214, 388877, -165907, -219923, 259442, 268599, 314059, -596173, -60525, -55360, 101800]
18992b36657F3031b27805k8246Q6964E9365c905E2477j6302i7372A04705c31553
18980b08395A31538i6330m9786d4314A69313a28051m5539B70914H1734c0759o6532
18969i7291A84477N3209a18496H6806a48382a2298l31840J33940E6615d89480
18958G3718J31706c73103c768j52339c0847l9539C1514K485b23625D988a2407
18946a8197j7948o8990K0808C04645j44985A3964a01499M5979k34705A36307a5409
18934a41888B41636h5432l6873B17824n2006B425b48793Q6827B03495a78189A39626
18922D7407r397J02326c59034j03016A15466l9650a86645g9306l03435G6144K1089
18911I7233A8432b12627B1161i2220b5307o3587k76550c1556q2110m6267N6590
$$ y = [-236657, 63031, -227805, -256051, -169087, 59365, -3905, 52477, 36175, -97372, 104705, -331553, -208395, 131538, -96330, -146116, -44314, 169313, -128051, -173590, 270914, 81734, -30759, -97291, 184477, 237686, -118496, 86806, -148382, -12298, -344138, -210198, 56615, -489480, 73718, 205424, -373103, -3768, -156107, -30847, -70386, 31514, 33999, -223625, 4988, -12407, -18197, -36145, -105135, -84327, 304645, 159660, 13964, -101499, -55520, -290225, 136307, -15409, -141888, 241636, -85432, -122305, 217824, 165818, 2425, -248793, -161966, 203495, -178189, 139626, 47407, 38010, 140336, -359034, -462050, 115466, 75816, -186645, -79306, -382741, 76144, 97233, 18432, -212627, 21161, -92220, -25307, -88894, -365444, -31556, -113666, -159933, -103343]
18900a03343o309A8758a83713B38498a73448D8121K9895e3812E7443J10023O5374
18889B32840r2225L1439a23143k33563D2320a9565q6841c7440k43593a28849j40912
18878b69761a22256j50283k8990e2309A8043g3936a7074B11198b4569j02544L3083
18867i4030D0418a20824k660E638b51757A0466b79216F7738N1553p739b40736
18855A82639a12681B7588R0512b88452A14432a09525o1907K6164F98L9754K9626
18844G0078b56130m8621B47748A19506c02113D3577e2767j89232d0713o3576j38819
18833b43108C5117j5445c52077d2122B56258I4170c6660A3946b0364I0914a63707
18821B0039g4618A93799a90251Q6993a8742B73579A36486f7192C65298N3126a20978
$$ y = [-103343, -109652, 18758, -183713, 238498, -173448, 48121, 78016, -53812, 57443, 167466, 232840, 140615, 172054, -123143, -356706, 42320, -19565, -106406, -37440, -281033, -128849, -269761, -122256, -272539, -301529, -52309, 18043, -73936, -17074, 211198, -24569, -127113, -94030, 40418, -120824, -123484, 5638, -251757, 10466, -279216, 67738, 119291, 111552, -240736, 182639, -112681, 27588, 118100, -288452, 114432, -109525, -171432, -145268, 698, 40452, 70078, -256130, -304751, 247748, 119506, -302113, 43577, -52767, -241999, -40713, -104289, -243108, 35117, 19672, -352077, -42122, 256258, 94170, -36660, 13946, -20364, 90914, -163707, 20039, -74618, 193799, -190251, -103258, -18742, 273579, 136486, -67192, 365298, 418424, -120978]
18809A79360P8791f8708A47551b25470O8106e3667A50858F9410K7446b68404J27468
18798a40936j48319A10924b39781A09081a64608A42310f0567l3177A28728a73205
18787F3071a08491A1292c01670D6955c81634a87253K1251k56909a10980l4650
18777a45630F513Q1650a48284A61823a32967A53101c74054J16238k0254C6436
18766e6134j83809J02660l73117E919a17110N2616r0344k86446G3155J17598c21525
18754a68085I4986b52235M9520N0651m3864C5703J38802d1264k10075B4276b28364
18742B59980c7977G9528K6692c327H8722Q4950M5033n1808a33971A04338P6033
18731A80371a22978B3790Q6075b44924G5184a41050M3749k2181k54601G0568b39180
$$ y = [179360, 258151, -68708, 147551, -225470, -157364, -53667, 150858, 69410, 96856, -268404, -140936, -289255, 110924, -239781, 109081, -164608, 142310, -60567, -93744, 128728, -173205, 63071, -108491, 11292, -301670, 46955, -381634, -187253, -166002, -422911, -110980, -145630, 6513, 88163, -148284, 161823, -132967, 153101, -374054, -257816, -278070, 36436, -56134, -239943, -137283, -510400, 5919, -117110, -64494, -154838, -441284, 73155, 190753, -321525, -168085, 94986, -252235, -202715, -152064, -195928, 35703, 174505, -41264, -251339, 24276, -228364, 259980, -37977, 79528, 106220, -3327, 88722, 173672, 218705, 166897, -133971, 104338, 180371, -122978, 23790, 109865, -244924, 75184, -141050, -97301, -119482, -374083, 70568, -239180]
18719A52993b38975C4207b28223c5093B5361b23927L1534r1841A09451e8420k0306
18708g8726c9203D536J01435b9347m36205I8012a91068K9546e3370r691A25062
18696B7995i0043M3524B0826c30099C78175c05283a21977j17817A85411o7966
18686A17445c1885P114k12334D6254c12670J10537D13704A93811b01511i2188
18675h5054c5882J690D7128d4469l5800k9531L2109j02173O4927p5182d6216l41144
18663c87360e6753A41726o9567d49738e7769j01959N6525j33375M642O0921N7875
18652a13140a1200m0957k00716m5046A96736b42601M4581o671B15662a48597a1519
18640B17784F0814b62248A40983b68161f4405r2141H0812a66731E6804b66878
$$ y = [152993, -238975, 34207, -228223, -35093, 25361, -223927, -192393, -284234, 109451, -58420, -78726, -39203, 4536, 105971, -29347, -465552, 98012, -191068, -161522, -53370, -63061, 125062, 27995, -90043, -46519, 20826, -330099, 378175, -305283, -121977, -239794, 185411, 117445, -31885, -24771, -237105, 46254, -312670, -202133, 413704, 193811, -201511, -92188, -85054, -35882, -34192, 47128, -44469, -80269, -109800, -77691, -179864, -114937, -190119, -46216, -387360, -56753, 141726, 72159, -449738, -57769, -159728, -103203, -236578, -231936, -171015, -113140, -11200, -52157, -252873, -297919, 196736, -242601, -198020, -204691, 215662, -148597, -11519, 217784, 60814, -262248, 140983, -268161, -64405, -156546, 80812, -166731, 56804, -266878]
18629B16447i2665j7966A11799c6484j50565J6842J3222A34211b28783B17353
18618a69037j6270j48018k3599J58143B86039b9353j07254E6020h7793A8035i1004
18606A40224B8756A0341L2232e9l2844j04743C0842J02428N7167b90195E0581
18594f5872k13489G0864a1931j79113A81454g1845m5597j8510j95995a3482A46867
18582B9838a63778m3135j92351J1426A68070g0824B57715b74443j31418F3986
18571B70075a99099A22416b47547H7752e6068j36274A40860a01520k90734f8402
18560h2610H130g3421l53836a87472H5052a43378m5305A73939b53364A92956c15896
18548a56239D809a4131k15645L9173M7634E0652d1791j34195j71683a29024C8230
$$ y = [216447, -92665, -110631, 111799, -36484, -187049, -170207, -156985, 134211, -228783, 217353, -169037, -185307, -333325, -356924, -198781, 286039, -29353, -136607, 56020, -87793, 18035, -91004, 140224, 28756, 10341, 42573, -59, -32903, -137646, 30842, 133270, 190437, -290195, 50581, -65872, -279361, 70864, -11931, -191044, 181454, -71845, -117442, -135952, -331947, -13482, 146867, 29838, -163778, -206913, -399264, -387838, 168070, -70824, 257715, -274443, -405861, 63986, 270075, -199099, 122416, -247547, 87752, -56068, -192342, 140860, -101520, -392254, -68402, -82610, 8130, -73421, -427257, -187472, 85052, -143378, -188683, 173939, -253364, 192956, -315896, -156239, 4809, -14131, -229776, -190603, -142969, 50652, -41791, -175986, -347669, -129024, 38230]
18536H1954K12372c02638A36347a20468B83988a19010A08140B9919J2208J97591
18526B39718e0993j96867N5959A54530c4762A97449a28513k49484B822L3200M2235
18515G8257b62750c4026C2990b36143B39015b11088A7899J6709a44201C05325
18504A1392a94428A70195b3552B45531d8647A53546a80455k07062A64379b86190
18493b2695B346b53053M8098c6908q8841k19532H7785c19137P9452M6941B04634
18481a45494B21992a43257c2276D00529a12951A3795J9996R0580a59058A92469
18470h1904q4291o0471I4175P3299i1258C4543e4507j56463g3030n6621e7464
18458E6901b3902C61133a38555A31270a64964N0303a7407o8189E9576c2133A4152
$$ y = [81954, 294326, -302638, 136347, -120468, 283988, -119010, 108140, 29919, 42127, 239718, -50993, -247860, -191901, 154530, -34762, 197449, -128513, -377997, 2822, 36022, 78257, -262750, -34026, 32990, -236143, 239015, -211088, 17899, 34608, -144201, 305325, 11392, -194428, 170195, -23552, 245531, -48647, 153546, -180455, -387517, 164379, -286190, -22695, 2346, -253053, -204955, -36908, -125749, -345281, 87785, -319137, -239685, -192744, 204634, -145494, 221992, -143257, -32276, 400529, -112951, 13795, 33791, 124371, -159058, 192469, -81904, -166195, -226666, 94175, 167474, -91258, 34543, -54507, -210970, -73030, -129651, -57464, 56901, -23902, 361133, -138555, 131270, -164964, -114661, -17407, -85596, 59576, -32133, 14152]
18446g4162m9935b7484k04896a06602D9368a99720j16495A28274f7572n02677
18436e70249K55776a3175C3605C51a07167A82396a00030j4429B48135a51799F323
18424a14495J063j52162O5173j75282D7023c79541l817A28409K6812M393a08510
18412d28799A08647l1159K15163a46809A91518m2174P8081b09164n7638P1568
18402a95234B72213A01968b27269b1258j47703D8244K6420b29428D2445a11820
18391a38402a06A38845a21474A59656b64987R7323A83564b9190A961b79429g4985
18379d54881J89299C44510a83198o6983b8554j21125o5652B46847e7222B16195
18368C6524K06606P2219a4354j34586D3448J41880J12740A7197a26003a9709j60509
$$ y = [-74162, -124097, -27484, -232380, -106602, 49368, -199720, -316215, 128274, -67572, -570249, -314473, -13175, 33605, 351, -107167, 182396, -100030, -114459, 248135, -151799, 6323, -114495, -113432, -265594, -200421, -375703, 47023, -379541, -383358, 128409, 155221, 159614, -108510, -428799, 108647, 77488, 292651, -146809, 191518, 149344, 227425, -209164, -266802, -195234, 272213, 101968, -227269, -21258, -168961, 48244, 74664, -229428, 42445, -111820, -138402, -106, 138845, -121474, 159656, -264987, -167664, 183564, -29190, 1961, -279429, -74985, -454881, -265582, 344510, -183198, -250181, -28554, -149679, -215331, 246847, -57222, 216195, 36524, 243130, 315349, -14354, -148940, 43448, 185328, 298068, 17197, -126003, -19709, -180218]
18357a80218j06233i7359A54159E0762c0865k96015A38354b46700A53094a39573
18346b08582c306A5348R9899b44802b393B92489c40445b3172p1917j51029B13932
18334c83613J84598B2564L7549a03240d509A99325I358i0489L0389A61674R8897
18323B60571i7372B83740m4354c13436A23369k4059i902F4876c8220A27625k3622
18312A04003c29788J57610G8375a624B0565g4556A34539a17898e0706A40260e5829
18300A65335G8707i9735j34122B79268m9895c8663j51392e3148B792J04287h7647
18288A55456a94509A14404c63395F8659a48246f995k5613k15085R8040A28143
18277g1380E7589a45100J2497k81858J48199A31170a40732L6414J0299A63581
$$ y = [-180218, -286451, -97359, 154159, 50762, -30865, -326880, 138354, -246700, 153094, -139573, -208582, -3306, 15348, 115247, -244802, -2393, 292489, -340445, -23172, -95089, -246118, 213932, -383613, -199015, 22564, 60113, -103240, -4509, 199325, 9358, -90489, -60100, 161674, 260571, -97372, 283740, 239386, -313436, 123369, 99310, -9902, 64876, -38220, 127625, 104003, -329788, -172178, 78375, -1624, 20565, -74556, 134539, -117898, -50706, 140260, -55829, 165335, 78707, -99735, -233857, 279268, 229373, -38663, -190055, -53148, 2792, 107079, -87647, 155456, -194509, 114404, -363395, 68659, -148246, -6995, -32608, -247693, -149653, 128143, -71380, 57589, -145100, -132603, -414461, -266262, 131170, -140732, -104318, -94019, 163581]
18266a11216E8199K37969A39138a48425a3406p8483A77373F7347a38021e0607
18255a63511j46256e2777o8203c1729l6174K9846B51795j20006E9251a45656R047
18244a36609j48113p7067f3189B07615a25640j82002B69064j8806e033k0012h32
18232A21927b37515B05903j6349d1182j40110O2814A7307b22063b0208k05809
18222b26017B4827a74668K9822L1427k1159j95632Q1123h8465k75312p2573A6144
18210h8056A5792a26051j38157F1638J10950l2715a45981f2834M387j81494A73273
18198F9335l1521M4407b07063F9548a47215d6027I369e9439C03251A10672c89720
18186d8482n0559E6517b17907M3393p1689b0485m66330A36240a24351A1761O775
$$ y = [-111216, 58199, 296168, 139138, -148425, -13406, -91889, 177373, 67347, -138021, -50607, -163511, -309767, -52777, -120980, -31729, -67903, -38057, 251795, 131789, 59251, -145656, -136609, -284722, -361789, -63189, 207615, -125640, -307642, 269064, 250258, -5033, -25045, -832, 121927, -237515, 205903, 189554, -41182, -181292, -118478, 17307, -222063, -20208, -226017, 24827, -174668, -144846, -113419, -134578, -330210, -249087, -88465, -363777, -436350, 16144, -88056, 15792, -126051, -264208, 61638, 172588, 139873, -145981, -62834, -58447, -239941, 173273, 69335, 37814, 82221, -207063, 69548, -147215, -46027, 9369, -59439, 303251, 110672, -389720, -48482, -99041, 56517, -217907, -174514, -246203, -20485, -486815, 136240, -124351, 11761, 18536]
18175A8536O9108a80088j75139B04168a95240l2493A74273j0658b75235a25639
18164D6485f6498m0954B56307E8507a34217k4216A535a16514a7876j45355k1608
18153a84839k419q0879g9625r6528J1812A68176o8434a49520J6k6259A9540c29046
18140a96915M6011P1396l02628a82247c6380k8848o495j17782c9095B81741G9267
18128a64767g7110A78075R255M1534p0526B9587L03557A14601a0526k34696B34930
18116c27560J02105e1786A85483g0998j41307B34665m1172A3690h1825C4879a05256
18104b22889Q6195d1129q4152A57218B4021J52212b25193C6780b06807K6284P7973
18093a02550A115a00487G4101b44226C77123o7019j30358a0793G2465K1822b13468
$$ y = [18536, 87644, -180088, -355227, 204168, -195240, -227733, 174273, 163615, -275235, -125639, 46485, -66498, -107452, 256307, 58507, -134217, -158433, 1535, -116514, -17876, -163231, -184839, -187258, -268137, -79625, -176153, -164341, 168176, 99742, -149520, -149504, -175763, 19540, -329046, -196915, -150904, -79508, -382136, -182247, -36380, -65228, -71723, -189505, -39095, 281741, 79267, -164767, -77110, 178075, 187330, 228864, 158338, 29587, 333144, 114601, -10526, -245222, 234930, -327560, -225455, -51786, 185483, -70998, -212305, 234665, 193493, 13690, -81825, 34879, -105256, -222889, -136694, -41129, -125281, 157218, 24021, 176233, -225193, 36780, -206807, -180523, -102550, 1115, -100487, 74101, -244226, 377123, 310104, 179746, -10793, 72465, 94287, -213468]
18081A55038d81049d8920j16940H7794j7806a69933M4548A81311d02089A57158
18070A95802a91473a7700C9200b3553D27056j77206b61994A45962o3530f0298
18059A0954b4943A85656i4459A18276a8114C84208b68130A03317b03406i8553
18048F201c3538k9826C1325L96581a81851P6899D9155J8394A2194K11701a08165
18036a99931m23188E9070b10877i693B1068e4794C48643i1138r482g900k09101
18025b17001g9273J99r2409A0241R6964a40517A07406b3710k9281D353R4289a89956
18012a23724l0143j05140G5236a30668p969K3571C322J40036P990b51634e1496
18000a39433i013l00565J15005c4789q5946k06491g4839C82412a83883G6546b92204
$$ y = [155038, -481049, -48920, -165860, 87794, 69988, -169933, -125385, 181311, -402089, 157158, 195802, -191473, -17700, 39200, -23553, 427056, 249850, -261994, 145962, 82432, -60298, 10954, -24943, 185656, -94459, 118276, -18114, 384208, -268130, 103317, -203406, -98553, 6201, -33538, -63364, 31325, 427906, -181851, -104952, 49155, 67549, 12194, 223895, -108165, -199931, -623119, 59070, -210877, -9693, 21068, -54794, 348643, -91138, -100620, -7900, -217001, -79273, -79074, -171483, 10241, 107205, -140517, 107406, -23710, -52991, 4353, 98642, -189956, -123724, -153867, -259007, 75236, -130668, -138637, -115066, 3322, 143358, 151348, -251634, -51496, -139433, -9013, -309578, -194573, -34789, -120735, -327226, -74839, 382412, -183883, 76546, -292204]
17988A82273E4715L2433b08414M6248B7049b24799c4199l42260a12327H1261A2613
17976d1373J4325j50841F9311b26047a05710B56034a72112B5200a23645C3025
17965a32721A0876N6996b72798P3898c1846j06266b852I9289b10098A65028b25755
17953b29223r8713J48443c0680j823k55485A55540K7096b40658B98524b17627
17942g4993G8947J30961E815J64395K17276g790k64779k802B57607G1021B0027
17930a79924n4349A21270a22295m586A25344K1062a43199m3364A76844a44247
17919c4188j75685d7168A91516a14786L9277A08246a84812I1025a10454F8196
17908F1752a06622k5719n4217j1596B85530h2814o6961Q068N6300B43255F8956
$$ y = [182273, 54715, 87148, -208414, -162166, 27049, -224799, -34199, -376459, -112327, 81261, 12613, -41373, -27048, -177889, 69311, -226047, -105710, 256034, -172112, 25200, -123645, 33025, -132721, 10876, 67872, -272798, -198900, -31846, -138112, -2852, 99289, -210098, 165028, -225755, -229223, -327936, -179493, -30680, -32503, -287988, 155540, 182636, -240658, 298524, -217627, -74993, 78947, 209908, 5815, 170210, 387486, -7790, -272569, -275371, 257607, 71021, 20027, -179924, -234273, 121270, -122295, -126881, 125344, 146406, -143199, -186563, 176844, -144247, -34188, -209873, -47168, 191516, -114786, -75509, 108246, -184812, 91025, -110454, 68196, 61752, -106622, -132341, -186558, -198154, 285530, -82814, -149775, -141707, -85407, 243255, 68956]
17896H6835m1137e5715m5605j30685A6056a8383B3772b5610p2826j02785p4164
17885b75385N0589c760j98887f0871B09785G548M6492K32517a95806B10521i0751
17873A0358L43173m4428a99973g7544j0111I4234b56263e4982l3080A98758C9732
17861b91991C26399j50472c2729m05957f7996C88234a16463j94242F9840A6973
17850I0521l7876A5597a22851m4145B9309e1062B25672C4404b2459E5494a52184
17838C9696b30476A28389a79111Q2947b4105A86905l2759E4279p162a07008m7908
17827a54916g2381I6770J41404b97774b1058k05159e1005k07742h7586A77502
17816b58191B15243B6424a80879P8776C46688a8225H2355Q959M091C6870J03062
$$ y = [86835, 45698, -55715, -101320, -232005, 16056, -18383, 23772, -25610, -98436, -201221, -275385, -224796, -3760, -202647, -60871, 209785, 7548, 54040, 286557, -195806, 210521, -90751, 10358, 353531, 309103, -199973, -77544, -87655, 94234, -256263, -54982, -88062, 198758, 39732, -291991, 326399, 175927, -32729, -438686, -67996, 388234, -116463, -310705, 69840, 16973, 90521, 52645, 15597, -122851, -166996, 29309, -51062, 225672, 34404, -22459, 55494, -152184, 39696, -230476, 128389, -179111, -96164, -24105, 186905, 154146, 54279, 47117, -107008, -154916, -72381, 96770, 238174, -297774, -21058, -226217, -51005, -258747, -87586, 177502, -258191, 215243, 26424, -180879, -102103, 346688, -18225, 82355, 91314, 95405, 36870, 139932]
17805A39932J5207a70134P6199A52894i2579q3356Q6503G8527K59211m2252a6141
17793b73399D8519L6064J1742a51029C219O9076p778K12807c49525a23848A8927
17781a64198C3094f84626b52149D18064b49375b3871B69417b51650e3485j30191
17771a83676h7239A32038f8049A92066c36765h4670j40717A73347C3745i6678
17760A13834J97077B021a23396J8492A72265a10484A41814h5731C5706A191L19663
17749C20854b19168E8135K0558b26391A42528a74764P7756k0137l4127A21597
17738D0245K95823g974D4362J49169R3207r1600j2113o8971e7906j66247d1460
17726A0297d0845A85359a75624h6728B04178A934Q5299K08472D4286b33520A10160
$$ y = [139932, 155139, -170134, -93935, 152894, -92579, -175935, -89432, 78527, 337738, 295486, -16141, -273399, 48519, 84583, 96325, -151029, 3219, 72295, 64517, 277324, -349525, -123848, 18927, -164198, 33094, -684626, -252149, 418064, -249375, -23871, 269417, -251650, -53485, -183676, -87239, 132038, -68049, 192066, -336765, -84670, -225387, 173347, 33745, -96678, 113834, 310911, 2021, -123396, -104904, 172265, -110484, 141814, -85731, 35706, 1191, 320854, -219168, 58135, 78693, -226391, 142528, -174764, -97008, -117145, -151272, 121597, 40245, 336068, -7974, 44362, 193531, 286738, 195138, 183025, 114054, -57906, -224153, -41460, 10297, -40845, 185359, -175624, -86728, 204178, 1934, 87233, 295705, 44286, -233520, 110160]
17714g1602B01027J2138k563e0418C79129c38811A39908K03530a73020o67A99712
17702g3199B78845a84093i1142m0935M6070l1851B49510o6398a36070I1297N2531
17691A43828K23221D213M9936b5478j0867j20857F2799A4651b10870H8697l3887
17680E4810a05112C23272b3769j21415e2547k91853H9666g3544B6562d0274j68868
17669b09142f1330l17620a77926A08202a30854b8607l7119A15011K68078A52763
17658a04754j0165I5408q498N6897J46810a80967A92290m1486f6252A4681J5305
17647B9986L41617g4405m486j75097A20336d19788J80668a1363j7819j03175e0675
17635c0702I8197C9443J36599J64595O1976a44686f7036A77219m7438k3959a28710
$$ y = [-71602, 201027, 213165, 210602, -50418, 379129, -338811, 139908, 343438, -173020, -173687, 199712, -73199, 278845, -184093, -91142, -132077, -86007, -117858, 249510, 183112, -136070, 91297, 143828, 367049, 4213, 54149, -25478, -36345, -157202, 62799, 14651, -210870, 88697, 54810, -105112, 323272, -23769, -145184, -52547, -344400, 89666, -73544, 26562, -40274, -209142, -61330, -378950, -177926, 108202, -130854, -28607, -65726, 115011, 383089, 152763, -104754, -114919, 95408, 86910, 143807, 290617, -180967, 192290, 150804, -66252, 14681, 29986, 371603, -74405, -78891, -253988, 120336, -419788, -239120, -11363, -29182, -132357, -50675, -30702, 98197, 39443, 176042, 340637, 402613, -144686, -67036, 177219, 129781, 105822, -128710]
17623A42717b38606J07935k2482B54835I8905B0102a22189K3299A96767i9418
17612C2577J43337k5301a7338r7829k03957B12388j9098J34947A28679A0107J7905
17601B8012b96116m7814a41356k9459B27309r1158n9106L8140a60913b184l75155
17590c77339F832R9932b57230H8426g8554B94652A13505I043Q6849K20129a84620
17578c6602A53608b7359C46453A32030O2357H8295J9617J28566a65230j07718
17568b72948D28129a3810o5339A26692J67557Q1185f6860b9606A97537B1165K18671
17557B39836E0121g6839m3782E4560a11888E2452B5021Q7025k6285a29033L7937
17546i1096l4287F3305N3457B4837c992j51794e384C1451J72226n8375B4106a88436
$$ y = [142717, -238606, -130671, -153153, 254835, 98905, 20102, -122189, -98890, 196767, -99418, 32577, 175914, 150613, -17338, -115167, -319124, 212388, 193290, 328237, 128679, 10107, 28012, -296116, -343930, -141356, -170815, 227309, 136151, 77045, 115185, -160913, -2184, -377339, 6832, 106764, -257230, 88426, -78554, 294652, 113505, 9043, 95892, 316021, -184620, -36602, 153608, -27359, 346453, 132030, 194387, 88295, 107912, 236478, -165230, -272948, 428129, -13810, -79149, 126692, 294249, 375434, -66860, -29606, 197537, 21165, 239836, 50121, -76839, -120621, 54560, -111888, 52452, 25021, 112046, 85761, -129033, -91096, -125383, 63305, 116762, 24837, -3992, -155786, -5384, 31451, 203677, 145302, 24106, -188436]
17533D75884E670J34761a51427B21965K35601f2988C62635G2879h1774H6254a06202
17521D0818b03107G1553A7335b76270B8159I996K42081b55369B54018K781A18873
17509G9311k8979K04829n144r6101J21979L882K03277A49096a51404A90735B2549
17497A30632J23957J02078H6510i842D10944C4271f1789A48797n3687O8029P4721
17486B37860A11857K56418b0616A74757l4778C898R2024h2535A63076N34475e3253
17474A78574O7217K70507k57476A0166J84732J57358A18021L0057K7995a99827
17463A19354a29870O2820B92138m5711l6720n9702c1591B33303a21897a8294C15639
17451B63431Q4282E6160e7129D40225j73559A25794M42521A99199F6260J81174
$$ y = [475884, 5670, 140431, -151427, 221965, 457566, -62988, 362635, 72879, -81774, 86254, -106202, 40818, -203107, 71553, 17335, -276270, 28159, 9996, 252077, -255369, 254018, 256799, 118873, 79311, 50332, 255161, 250017, 153916, 275895, 279777, 483054, 149096, -151404, 190735, 22549, 130632, 254589, 356667, 86510, -9842, 410944, 34271, -61789, 148797, 95110, 163139, 237860, 111857, 368275, -20616, 174757, 139979, 3898, 95922, -82535, 163076, 697551, -53253, 178574, 245791, 516298, 258822, 10166, 194898, 352256, 118021, 148078, 176073, -199827, 119354, -129870, -67050, 292138, 246427, 209707, 150005, -31591, 233303, -121897, -18294, 315639, 263431, 347713, 56160, -57129, 440225, 266666, 125794, 568315, 199199, 66260, 247434]
17441B47434C3164L27860O3057k01528N6495A05896J1174K43479A38864R4459
17431B33323J38203N8406A3132O455L73888J88391j97135O4833B09877o5751A3443
17419G9645P6389M75911k17709I9919L08385G6100J45185P5344A09955D5195J62536
17408B07731R266J0920g3682A01010l6673K9297L94077j04537j05532H570g5498
17396I0137L41843A42217J89533J50205A80616G1120L17219G6851b999k1017B26563
17384B36190d3170D9353J87273L1381F8551J48401K5023k4591J08347A59894l0739
17373A29155c1940B59960j03270J57930r4375C7484K366J21610K70124H9960Q2634
17362A72594i0602H7690M3684L23092B16567O886A8981J50084J74264J43931k37502
$$ y = [247434, 33164, 361024, 424081, 222553, 279048, 105896, 117070, 360549, 138864, 233323, 371526, 429932, 13132, 19587, 393475, 581866, 384731, 449564, 209877, 144126, 13443, 79645, 156034, 631945, 414236, 99919, 408304, 76100, 221285, 296629, 109955, 45195, 207731, 216997, 227917, -73682, 101010, 64337, 93634, 487711, 383174, 277642, 8570, -75498, 90137, 431980, 142217, 331750, 481955, 180616, 71120, 388339, 76851, -2999, -24016, 226563, 236190, -43170, 49353, 236626, 268007, 68551, 216952, 241975, 217384, 325731, 159894, 129155, -31940, 259960, 156690, 314620, 220245, 37484, 39850, 161460, 431584, 89960, 172594, -90602, 87690, 131374, 454466, 216567, 223453, 18981, 169065, 343329, 487260, 249758]
17351B49758C7055r817M7442J00636e7580C75371m5828f385A40113a29363E53439
17339C15499n082I3985d5807C21537o0141a37157A95117b5722A83046D086M56301
17328D60387e7501A25824n1364J0856c4424G3002d1615r6486B44717F1136K75748
17317C36884I0455K25349A45429L42832c1748C53334a08551B84005L12021A65267
17306E0145K76662A56231N2415G0617f897G5941C6778K07429r2949o9286g5029
17294A73380P0573j0654J86061A70289K2920j3995J31195j21688d9651F0331a64127
17282A62135P0427F9741J36525A4437K25415O3982M6219j13107b64877C57503
17271A25902l7553k1633P1506i2287a0940C42403F1025L59649A25822K82592G0947
$$ y = [249758, 37055, 27238, 74680, 175316, -57580, 375371, 329543, -6385, 140113, -129363, 553439, 315499, 310417, 93985, -45807, 321537, 261396, -137157, 195117, -25722, 183046, 4086, 460387, -57501, 125824, 74460, 85316, -34424, 73002, -41615, -138101, 244717, 61136, 336884, 90455, 315804, 145429, 488261, -31748, 353334, -108551, 284005, 596026, 165267, 50145, 326807, 156231, 208646, 70617, -6897, 75941, 36778, 244207, 151258, 81972, -75029, 173380, 243953, 233299, 419360, 170289, 193209, 179214, 310409, 188721, -49651, 60331, -164127, 162135, 232562, 69741, 206266, 14437, 239852, 303834, 350053, 236946, -264877, 357503, 125902, 88349, 66716, 138222, -92287, -10940, 342403, 61025, 420674, 125822, 408414, 70947]
17259A29094P8348h0263B61533J97240j07773k8418J9392a15332B40868L2775
17249B73643b25281C60221n5957j9364A03330M7801M58638L5866E1170P0257J83929
17238C05356R4942D6600K31675a12212B75708H9043B637K36843J5927D4703J56647
17227B01350r1312J66309j01188M05567k19042m0786K5490I7832L89189A82414
17216E06131A96734M41208B27556J10356J26413j21918A18332D6589J97605o2802
17206A81392R8044a95030C75314N1908k4964J11294j88546J11968A56664p2551
17196H4113L51348J38J87023B36176K0334K39518j22574o2802f0532B47539J57975
17185D05514K07480B36423k3639n6643K98291j95897N8825r0385P3732N6456a14254
$$ y = [129094, 207442, -80263, 261533, 458773, 351000, 322582, 341974, -115332, 240868, 273643, -225281, 360221, 304264, 284900, 103330, 151131, 609769, 645635, 51170, 121427, 305356, 400298, 46600, 278275, -112212, 275708, 89043, 2637, 239480, 255407, 44703, 201350, 110038, 276347, 175159, 580726, 361684, 320898, 346388, 97832, 487021, 182414, 506131, 196734, 637942, 227556, 337912, 464325, 342407, 118332, 46589, 244194, 181392, 279436, -195030, 375314, 427222, 402258, 513552, 325006, 436974, 156664, 84113, 435461, 435599, 622622, 236176, 256510, 496028, 373454, 310652, -60532, 247539, 405514, 612994, 236423, 212784, 156141, 454432, 258535, 317360, 226975, 300707, 357163, -114254]
17173D24513j492j06828G144J76280J05045K09413I3620J79324k9051m7513R0250
17162B86630K7916K1855k8300j1967K66920j93705N0693O9544J402A05560L43367
17151D48927A31369L03339G6622O4949K03028P5421A91320J23618j41888R1988
17141B65038B2926K42149A03287K82561K6193j21152K14430B48358J81965r0424
17131C39899j33800J63059j48038l9701P8391p4439L09768M8688I1744K14359
17121C06103a36284E77260k16058Q4430P8979r976p7584A29517N29644k16190
17111D42971j67020L1809L1063j44405R4840K44843k2601l4509Q4426B78932L6764
17100C15696N2983J20183k0957k09496K75339k35305M7921L9580A87806P50465
$$ y = [424513, 423021, 316193, 7144, 183424, 288469, 497882, 93620, 272944, 243893, 196380, 286630, 314546, 336401, 308101, 296134, 563054, 369349, 420042, 489586, 490988, 105560, 448927, 131369, 434708, 76622, 141571, 344599, 420020, 191320, 314938, 173050, 265038, 22926, 265075, 103287, 385848, 412041, 290889, 505319, 248358, 430323, 339899, 206099, 369158, 221120, 181419, 259810, 185371, 495139, 543827, 91744, 306103, -136284, 577260, 361202, 445632, 524611, 514635, 437051, 129517, 659161, 442971, 275951, 307760, 338823, 194418, 289258, 534101, 511500, 476991, 561417, 278932, 315696, 368679, 488862, 467905, 258409, 533748, 298443, 346364, 385944, 187806, 938271]
17090I38271m10598j04370L40251o4619r1423A17018L75796L08185j96048M99643
17080A104594m36881O0586N457j03254j47020J72938r075k75820P6416j97538
17070B50403J21364L44320k97370K26631j60555J12204k19936L1344O8926p2591
17060D04740j14410M94674j60777p9718K5863j3816m9186j1717B11805K19104
17050D30909J31551B51542K40719j21782K07438J34249j63304j91854j8671K34245
17040E72582M2828q626J1692B63855K89121L38419q2838r4790O2006j06636k18971
17029D50166M74178l85938K67569j40508p8324J06930l26766M79556j73687m0402
17019F32774J74243p9424P6682J54459J02477C96893L33647Q5337k3674n1852
$$ y = [938271, 527673, 423303, 763554, 698935, 607512, 117018, 492814, 800999, 604951, 1104594, 667713, 728299, 733756, 630502, 483482, 656420, 647345, 371525, 447941, 250403, 371767, 716087, 418717, 645348, 484793, 596997, 377061, 408405, 477331, 404740, 290330, 785004, 624227, 544509, 570372, 556556, 507370, 495653, 211805, 430909, 562460, 251542, 492261, 370479, 577917, 712166, 548862, 357008, 338337, 572582, 615410, 606784, 618476, 263855, 552976, 891395, 808557, 713767, 775773, 669137, 450166, 924344, 538406, 805975, 665467, 587143, 694073, 367307, 846863, 673176, 632774, 807017, 727593, 804275, 958734, 1061211, 396893, 730540, 815877, 792203, 740351]
17009G40351J46904K59845l24953L15007l25500K629L57767l30444r8283K43366
16999I86689k73894k3361p7573J0576M76595k08210K04967n10236K23862L3816
16989H43231m713K30919E02951M72280k82595J73326k13646L25486j76909J58675
16979I59568j4317K2726j79897J02772j32866K18760O1380m03809K29995O6232
16969I30544k41142N79479j67999K20282j65776k05738j96346K47632M56725l65317
16959A092344N7556j41071K882L84562l34156J40826o8381Q9087j24806k0854
16949A077989J49457J35203k49514K3210j48763K71626p3137J01108k59654N93567
16939A621092m84770N47118n99004J97464L3118Q6467K6223k671K52075m37257
$$ y = [740351, 887255, 1147100, 822147, 1137154, 811654, 814283, 1172050, 841606, 743323, 986689, 712795, 689434, 611861, 622437, 1099032, 890822, 1095789, 585553, 809415, 843231, 838518, 1069437, 502951, 975231, 692636, 865962, 652316, 977802, 800893, 959568, 945251, 967977, 788080, 890852, 757986, 976746, 1038126, 634317, 864312, 930544, 689402, 1268881, 1100882, 1321164, 1155388, 949650, 753304, 1000936, 1457661, 1092344, 1149900, 1008829, 1011711, 1396273, 1062117, 1202943, 1134562, 1223649, 1098843, 1077989, 1227446, 1362649, 1113135, 1136345, 987582, 1259208, 1186071, 1287179, 1027525, 1621092, 1136322, 1683440, 1084436, 1281900, 1315018, 1401485, 1427708, 1425037, 1677112, 1239855]
16929A239855K65311m31274K35568L44283K8309o01974j21116O65103O2939m3965
16919A643039o56435L48280L1788L43353q5862O5795K6313j51774q9634K58034
16909A732897M62765m01469L19064n24175k1712L81535j81889J11597P3988j95708
16899A756893M54562m28615J24712L00202r2459k2143J03586r9900K28740l16017
16889B009561O6419J09088l02546N61884j40203m1406R2933r2903J16180J1574
16879B390581j45610K51804J33201j8801l9833K99326j37666J82054m015l32690
16869B578351K04909J58711l12444K83103n9040j61467L83928J75909q3227k28181
16859B940552Q5928J15538K61838j06572O9048M6704J84312j28362k02891J48966
$$ y = [1239855, 1505166, 1073892, 1309460, 1653743, 1682052, 1080078, 958962, 1624065, 1687004, 1643039, 986604, 1334884, 1366672, 1710025, 1624163, 1689958, 1716271, 1564497, 1474863, 1732897, 2195662, 1794193, 2113257, 1589082, 1567370, 1948905, 1767016, 1878613, 1952601, 1756893, 2211455, 1782840, 1907552, 2207754, 2115295, 2093152, 2196738, 2096838, 2325578, 2009561, 2075980, 2185068, 1882522, 2444406, 2304203, 2262797, 2355730, 2262827, 2379007, 2390581, 2244971, 2496775, 2629976, 2611175, 2571342, 2870668, 2733002, 2915056, 2911041, 2578351, 2783260, 2941971, 2629527, 2912630, 2853590, 2692123, 3076051, 3251960, 3168733, 2940552, 3026480, 3142018, 3403856, 3297284, 3366332, 3413036, 3597348, 3468986, 3266095, 3415061]
16849C415061J52809m8249j16752L51018p2667M34576j3239n5796L32266j21309
16839D257718N8013J60606J86952k40821K98572k0196m7428j59520N25053M7421
16829E066370j23956q578q5741O04149o9055K52482j2144P7009k11524M17715
16819E906727l63681N60670m96376P44439J97611q3681J41450L71905K60365k62756
16809F976673k47533M44177M68398j73078K88934J70788Q5728N90519j80864L04542
16799H728284J31207M85330J01717J36141j47351L48983N36817L09759m8090P14954
16789A1297751j2282N36148J90581K94743J18194O53111L57901M8948M30052K18212
16779A4133359O73178K82805M89415M94150M14920O31199N37446L96502O91199
$$ y = [3415061, 3567870, 3519621, 3402869, 3753887, 3681220, 4115796, 4102557, 4046761, 4379027, 4257718, 4315731, 4476337, 4663289, 4422468, 4721040, 4700844, 4653416, 4493896, 5018949, 5066370, 4942414, 4933836, 4848095, 5452244, 5383189, 5635671, 5623527, 5700536, 5489012, 5906727, 5543046, 6103716, 5607340, 6351779, 6549390, 6465709, 6607159, 6979064, 7239429, 6976673, 6729140, 7173317, 7641715, 7468637, 7757571, 7928359, 8014087, 8604606, 8423742, 8728284, 8859491, 9344821, 9446538, 9582679, 9435328, 9784311, 10321128, 10630887, 10582797, 11297751, 11285469, 11821617, 12012198, 12306941, 12425135, 13078246, 13436147, 13485095, 13915147, 14133359, 14806537, 15089342, 15578757, 16072907, 16487827, 17119026, 17656472, 18052974, 18744173]
16770A8744173N69540M29701P57803R33376O52245P99820R57266O42449R51485
16761B5437858J149133Q46989J316090J054541J146627J035839J734760J572677
16753C5294514J313176J659226J621678J690796J880901J919858K391265K082985
16745D9854399K430336K609098K459904L207672L101903L425511L368385M166435
16737G4623643L946705M080452M398669M639480N357125N020066N547834N471519
16729A13085493N983878O282976O589281O368256O159122N675638O474503N435775
16721A62054922N253714M510828L758922L150517K249070J590539l07677o20146
16713A81640689j537943k859077l431882l900702n313919n274121n764402n970481
$$ y = [18744173, 19313713, 19743414, 20501217, 21434593, 22086838, 22886658, 23843924, 24486373, 25437858, 26586991, 27433980, 28750070, 29804611, 30951238, 31987077, 33721837, 35294514, 36607690, 38266916, 39888594, 41579390, 43460291, 45380149, 47771414, 49854399, 52284735, 54893833, 57353737, 60561409, 63663312, 67088823, 70457208, 74623643, 78570348, 82650800, 87049469, 91688949, 97046074, 102066140, 107613974, 113085493, 119069371, 125352347, 131941628, 138309884, 144469006, 150144644, 156619147, 162054922, 167308636, 171819464, 175578386, 178728903, 180977973, 182568512, 182260835, 181640689, 180102746, 177243669, 173811787, 169911085, 164597166, 159323045, 153558643, 147588162]
16705A47588162o344723o546343o393048o387876n978245n751366n735632n342101
16697I9108828n370366n141598m592044m468932l958758m311568l640649l425929
16689F4198984l376256k822035k934243k708315k748152k107023k436314k243476
16681D2823170j843238j356790k073162j607783j470650j223783j604199j184861
16673C0458704j521819r83339j214374r19285j152514l06408r47535j144679q47132
16664B1421619j066210l79480r43562l27670o21132o28436j000842m7900m67058
16655A5939329p00713j12234r79460n3599q84289N729o69062o0044n71860j46262
16645A1767535m51599J50188n39931l18067m41591l69916J27234n04214n0412
$$ y = [147588162, 141243439, 134697096, 128304048, 121916172, 115937927, 110186561, 104450929, 99108828, 93738462, 88596864, 84004820, 79535888, 75577130, 71265562, 67624913, 64198984, 60822728, 58000693, 55066450, 52358135, 49609983, 47502960, 45066646, 42823170, 40979932, 39623142, 37549980, 35942197, 34471547, 33247764, 31643565, 30458704, 28936885, 27953546, 26739172, 25819887, 24667373, 24360965, 23413430, 22268751, 21421619, 20355409, 19975929, 19032367, 18704697, 18083565, 17455129, 16454287, 16406387, 15939329, 15238616, 15126382, 14146922, 14093323, 13209034, 13214763, 12545701, 12485657, 11913797, 11767535, 11315936, 11466124, 10926193, 10608126, 10166535, 9796619, 9923853, 9419639, 9369227]
16636I369227k45012l94117p5309j95256j99556l61554n2250m27964p4059K9950
16626G374100n01819j83071J19184n5287j44373k3544n22629m4185J1575n86639
16616E443312O5107J05234n5411k24895L6756k09320m87026M48696j42296o1370
16606D918787j36375l61384N8063m0338k69571K55257k72203K9001J45839o57660
16596C669416L17422n16924J11297M59322m58507J40574j59792j25522P527J00535
16586C545348j85599K46090l16147l6520k23541K57553k74445l26046L60548k84558
16576B762683N2584L2239j50716M1017J15217k99120k41242j75904M77133j28167
16566B485724k2306P9998J7850j3897m52434L28819n3446J52936k42933l54120
$$ y = [9369227, 9124215, 8730098, 8654789, 8459533, 8259977, 7898423, 7846173, 7418209, 7344150, 7374100, 6872281, 6689210, 6808394, 6753107, 6608734, 6585190, 6062561, 6018376, 6029951, 5443312, 5508419, 5613653, 5558242, 5333347, 5370103, 5160783, 4673757, 5122453, 4980157, 4918787, 4782412, 4421028, 4479091, 4438753, 4169182, 4424439, 4152236, 4181237, 4327076, 3669416, 3986838, 3469914, 3581211, 4040533, 3582026, 3722600, 3562808, 3437286, 3444813, 3545348, 3359749, 3605839, 3289692, 3253172, 3029631, 3287184, 3012739, 2686693, 3047241, 2762683, 2815267, 2847506, 2696790, 2737807, 2853024, 2553904, 2312662, 2136758, 2613891, 2485724, 2463418, 2543416, 2561266, 2547369, 2094935, 2423754, 2370308, 2523244, 2280311, 1926191]
16556A926191L50670k69501j36213L36710j90908j25465M15578l04660r2853o6080
16546A843469j94045l4092J69136j09967J22248K57189o21920N38447l84967L37935
16536A923433l03940n8299L92283j45949j48417o17037P80237p3923l19700o6179
16526A362509P273R6879Q3547j27516l4193L9339k21945L03337j84023j00748
16516A224459J93150J66646k03045j17559j2933K92292l06491L91635j16781j06892
16506A404481r0052j66987M27629j91967k66024K1336Q4590j79514j68454K37083
16496A112121N4755k99890N1322j86048K97204J91826F07075M02527l1728k3312
16486I54562K6697j7710J07792k4927l96058L70480j65915k41569L83581D96070
$$ y = [1926191, 2276861, 2007360, 1871147, 2207857, 2016949, 1891484, 2307062, 2002402, 1909549, 1843469, 1649424, 1615332, 1784468, 1674501, 1796749, 2053938, 1432018, 1970465, 1585498, 1923433, 1619493, 1561194, 1953477, 1807528, 1659111, 1042074, 1822311, 1748388, 1428688, 1362509, 1369782, 1466661, 1550208, 1422692, 1388499, 1427838, 1205893, 1509230, 1325207, 1224459, 1417609, 1584255, 1381210, 1263651, 1250718, 1543010, 1236519, 1628154, 1511373, 1404481, 1314429, 1147442, 1575071, 1383104, 1117080, 1138416, 1223006, 1043492, 875038, 1112121, 1166876, 866986, 918308, 732260, 1029464, 1221290, 607075, 1009602, 977874, 954562, 981259, 963549, 1071341, 1046414, 650356, 1020836, 854921, 613352, 996933, 496070]
16475A127192k72757K06234l73217J05011C93069L22069j60905L78743O7671R8006
16465A098653m57594Q7957N08583n24872m9922J93877k52917M44373k73038k9905
16455G45195j34575K15708j53228j35923R6107O3419L0050j11654j49477K22690
16445F88312O7634k88589P8005B67131L08685P5084R4013r1782j74437J64756
16435F43450k08813O8397A02120N77852j38533Q4508J8948r0838Q9247j31391
16425E11913r6491K34367l8070k02632J22339o100j31625j9035K10317J60861
16415G45844j5194J4165k99258J05641j7857j42272J58939j62909k1222J72002
16405E37879j09729B8114L18028K13799A32515K90357l8317J10705K14660P3411
$$ y = [1127192, 854435, 1060669, 687452, 792463, 393069, 715138, 554233, 932976, 1000647, 1098653, 641059, 729016, 1237599, 712727, 662805, 856682, 603765, 1048138, 775100, 745195, 610620, 826328, 673100, 537177, 633284, 696703, 726753, 615099, 465622, 688312, 755946, 467357, 545362, 267131, 575816, 650900, 744913, 653131, 478694, 643450, 434637, 503034, 102120, 679972, 541439, 625947, 644895, 554057, 643304, 511913, 415422, 649789, 611719, 409087, 531426, 525326, 393701, 374666, 584983, 745844, 730650, 744815, 445557, 551198, 533341, 391069, 550008, 387099, 365877, 537879, 428150, 28114, 346142, 559941, 132515, 422872, 384555, 495260, 709920, 783331]
16395G83331l66279j06955A47241K04423K64187B32146K76330k02422C8602L90301
16385D28903K7476B5530P02305B88168l099M66326l10156A27920d8048I6109J14083
16374B10192n7667J38473J16526k02886J6699r1002K43884A80753J53657J23193
16364D57603j97344C1984P9873K49206I2347M40358i0333C49235A31033L24419
16354D55452A96479E9588K33391j37384c421B77030n8728J26786M2564l9410K0033
16343C68275J34698B34433J67597K0770o8787M3486j04490j8234L08564A03970
16332B50332K16812a22105A01915N71431l20992K2058A12263J49847J17858b57672
16321b9370A59987L88120j88267J55554k51694O69k9172p7125p4383J34220J33618
$$ y = [783331, 417052, 310097, 147241, 351664, 615851, 232146, 508476, 306054, 38602, 428903, 456379, 25530, 727835, 288168, 285069, 751395, 441239, 127920, -48048, 96109, 210192, 152525, 290998, 407524, 204638, 221337, 130335, 374219, 180753, 334410, 457603, 260259, 31984, 111857, 361063, 92347, 532705, -90333, 349235, 131033, 455452, 196479, 59588, 292979, 155595, -3421, 277030, 218302, 345088, 387652, 348242, 368275, 502973, 234433, 402030, 422800, 354013, 397499, 293009, 274775, 583339, 103970, 250332, 467144, -122105, 101915, 673346, 352354, 374412, 112263, 262110, 379968, -257672, -29370, 159987, 548107, 359840, 515394, 263700, 264369, 235197, 158072, 83689, 217909, 351527]
16310C51527l6569A56099M6731p4849J22290Q017J77800j9239a8789D02441E8164
16298A7023O5215c6782D3695A2937J58651N1958J68106a84972P0571B62506d3015
16286f5184A23886J76897l6211J56565j15578j09420J59561c35919A02744J67019
16276B69763J23011A21141D7215K29527H4069b97044B6031a22251A57215Q5652
16266B42867m8659L98139j78207B05023k6030a94385D58644h3918j85546C4670
16255A79619J54385J5514j64912d5238j5278A92357g8959A63700l8445C0232d290
16243B56728A22018c7038D05792k00660D3980f0323A17734J61154L4863F3568
16232B40652l0325a43936B34715E2308Q3421J1512g3530D3732j1540A2462L20221
$$ y = [351527, 314958, 156099, 202830, 127981, 250271, 258288, 436088, 416849, -18789, 402441, 58164, 17023, 82238, -36782, 43695, 12937, 171588, 223546, 391652, -184972, -114401, 262506, -43015, -65184, 123886, 300783, 264572, 421137, 305559, 196139, 355700, -335919, 102744, 269763, 392774, 121141, 47215, 276742, 84069, -297044, 26031, -122251, 157215, 242867, 194208, 592347, 414140, 205023, 178993, -194385, 458644, -83918, -269464, 34670, 179619, 334004, 349518, 184606, -45238, -60516, 192357, -78959, 163700, 125255, 30232, -4290, 256728, 122018, -37038, 405792, 205132, 43980, -60323, 117734, 278888, 313751, 63568, 240652, 210327, -143936, 234715, 52308, 135729, 147241, -73530, 43732, 32192, 12462, 332683]
16221C32683j30431o7305M1852O1821H0428A6226O0365d5447j43670J1260A19327
16209E3019b95127D1526d4138B80239a27517C98097a93226C42063A52133D8450
16198A92868L6865A11424a56715a8514A01797k3127J52397i2532l5069a2895k81701
16187b94596a1426A31721m0529J15548E92a89067A41300g1250E0607L6719D1773
16175F1697a75090A74641q1775d35921e1527j1463j20079f640k15423A77072L66353
16164E43425H1149K54575A65990q640m8879m7616J97053E8130J14681o3102J10507
16153B20216i0305l753A03574J89502k6589o1348b35015B2920b11017A49604e1082
16141B43045H5618d1725o8203A85316D8733J35918j1185q6568J51441a4516A95230
$$ y = [332683, 202252, 134947, 176799, 238620, 80428, 16226, 76591, -45447, -189117, -177857, 119327, 53019, -295127, 41526, -44138, 280239, -127517, 398097, -193226, 342063, 152133, 48450, 192868, 229733, 111424, -156715, -18514, 101797, 78670, 231067, -92532, -127601, -12895, -294596, -11426, 131721, 91192, 206740, 592, -189067, 141300, -71250, 50607, 87326, 41773, 61697, -175090, 174641, 92866, -435921, -51527, -62990, -183069, -6640, -222063, 177072, 543425, 81149, 335724, 165990, 157350, 108471, 60855, 257908, 58130, 172811, 109709, 220216, -90305, -94058, 103574, 293076, 266487, 205139, -235015, 22920, -211017, 149604, -51082, 243045, 85618, -41725, -109928, 185316, 48733, 184651, 173466, 86898, 238339, -14516, 195230]
16129D26110A8109M9920j3877b31898L1581i3753A82930K1866N3468I5472P0774
16118A66246a36259C9607N3015l8078M6505N1560D1808Q92J30140E9534c3681
16106g4858q5681n2052B04590a25761B20763g6912D2702J08576F1255a38095c7506
16094B19940O9757F0527a08925B4525a06733d4484G9741b8847k1271A57942n8492
16083I9450J59118A09440b11191f8953j59747g3755l4452A29331A5272K0072J22821
16072A58165G3482C3669N34877f2543j03000Q0065m8464p4837A1675J34871K89374
16061D35920a21577j07906E210J31500K0331F4325j1845K31068a87082B22774
16050G46K64374a30529K2502j51714e9016E3631c1970l22489I4789k9848P7209
$$ y = [426110, 18109, 68029, 54152, -231898, -200317, -93753, 182930, 204796, 258264, 95472, 166246, -136259, 39607, 92622, 54544, 101049, 152609, 41808, 42700, 172840, 59534, -33681, -74858, -160539, -212591, 204590, -125761, 220763, -76912, 42702, 151278, 61255, -138095, -37506, 219940, 289697, 60527, -108925, 24525, -106733, -44484, 79741, -28847, -50118, 157942, 99450, 258568, 109440, -211191, -68953, -228700, -73755, -108207, 129331, 15272, 35344, 158165, 73482, 33669, 568546, -62543, -165543, -85478, -133942, -208779, 11675, 146546, 435920, -121577, -229483, 5210, 136710, 157041, 64325, 52480, 283548, -187082, 222774, 746, 265120, -130529, -108027, -259741, -59016, 53631, -31970, -354459, 94789, 64941, 142150]
16039A42150m5725b92855A49782D1142a00885k4872A03260a63337E0201b94726
16028A7514c29133d7167j94986H9714b38895i7477q7591Q1366A02789a06327j04832
16017b11159J7369A83982J45386l1036a57893A79479J34144j49393d69416h5838
16006g2798E4272J92616a33167j0884n1397m6977J11306D4071a27017E5703J60890
15995B16593k8895k9142D7313J88957c41543a58546p7177b2411I4482a08068N3308
15984e4760I9398L18270l7098A80921L34556k43012O9235b54922A99595F5216
15973D51353d3859B11427m1318B2750B66N4136d5996A64790c28146G758P9603
15962H7361J90034I5872b76643a26469A0051c47044a15646I6883b21107J5955
$$ y = [142150, 96425, -292855, 149782, 41142, -100885, -125757, 103260, -163337, 50201, -294726, 17514, -329133, -47167, -242153, 89714, -238895, -97477, -185068, -103702, 102789, -106327, -211159, -193790, 183982, 329368, 298332, -157893, 179479, 313623, 164230, -469416, -85838, -72798, 54272, 246888, -133167, -144051, -195448, -242425, -131119, 44071, -127017, 55703, 216593, 187698, 158556, 47313, 236270, -341543, -158546, -235723, -22411, 94482, -108068, -54760, 99398, 417668, 380570, 180921, 515477, 272465, 341700, -254922, 199595, 65216, 451353, -43859, 211427, 170109, 22750, 266, 54402, -45996, 164790, -328146, 7758, 87361, 277395, 95872, -276643, -126469, 10051, -347044, -115646, 96883, -221107, -205152]
15952b05152J035G2233B4818J84724q0255F3432c32357b9602D8970f3053j00274
15941a63327B492J06171b5728j04679N9086j92210F4230o617a93878A18716d043
15929b6757A20641d55476a34355l7067N2243j94910D9420K29462m8104E6174a98263
15917c08476F7338a48474H6430e0392j29030Q3819A66108a29412l0456C02220
15906b22119J6601K271F6203j2798e8100K6680B91214B0672M668J69274d9432
15894a85824C42291c2004j50957j24459J35050A3761e384j39017A11402P3914
15884A85316a24835C2037L47673I817a48152M1700j3104a4102j46082o534A78255
15872a19466J6416B10539b69718c5918B23866A3592a05018A07040a42770K6030
$$ y = [-205152, -204117, 72233, 24818, 209542, 129287, 63432, -332357, -29602, 48970, -63053, -163327, 2492, 108663, -25728, -130407, -71321, -263531, 64230, 57613, -193878, 118716, -4043, -26757, 120641, -455476, -134355, -171422, -119179, -314089, 49420, 278882, 230778, 56174, -198263, -308476, 67338, -148474, 86430, -50392, -179422, -95603, 166108, -129412, -159868, 302220, -222119, -205518, -203247, 66203, 53405, -58100, -31420, 291214, 20672, 25340, 194614, -49432, -185824, 342291, -32004, -182961, -307420, -172370, 13761, -5384, -144401, 111402, 185316, -124835, 32037, 379710, 9817, -148152, -106452, -119556, -14102, -160184, -166718, 178255, -119466, -103050, 210539, -269718, -35918, 223866, 13592, -105018, 107040, -142770, -116740]
15862a16740j92267J34546G5652C5064a15309C058N4568a33311a7960l3646n2662
15851a04268j4195M8781B20081D1319J89740a57148k39591A82393e9256B79027
15840i9458E46f1257p0373l6057A18490e0997J8518H5674L8670b2941H7377a98822
15827E6882b12357b7529D04116a93352A25868e68661I3778A9691K54024a77142
15816A86906k7253e3204k23817e5823B8645a9511c083j79989F4103a45874A05159
15804b42331B62764o7501a00070b9132I1786K05018a81577Q4439k2636F137J22964
15793A29101d7083O063A23688a24134A40419a61648k3683J9577k6738H8152D79
15781a22143B6038J91875a14180A01398K1107C5352a13052A96442a21472C2434
$$ y = [-116740, -309007, -174461, 75652, 35064, -115309, 3058, 57626, -133311, -17960, -51606, -104268, -118463, -69682, 220081, 41319, 231059, -157148, -396739, 182393, -59256, 279027, -99458, 546, -61257, -131630, -167687, 118490, -50997, -32479, 85674, 124344, -22941, 87377, -198822, 56882, -212357, -27529, 404116, -193352, 125868, -568661, 93778, 19691, 273715, -177142, 186906, 159653, -53204, -277021, -55823, 28645, -19511, -3083, -183072, 64103, -145874, 105159, -242331, 262764, 195263, -100070, -29132, 91786, 296804, -181577, -97138, -119774, 6137, 129101, -47083, -41020, 123688, -124134, 140419, -161648, -185331, -165754, -192492, 88152, 479, -122143, 26038, 217913, -114180, 101398, 122505, 35352, -113052, 196442, -121472, 32434]
15770G8858a31816A06024h7799j0940H9123A5008b34629h5374j85301C3553K46684
15759B80237B6001a53014A85435J55726L7974A35052J57649c24796a60429A50758
15748B71886a47327A18811Q843C8957L5931a38799A36773O3495q3577m4578I160
15736C1161K41004f8517k4632I6209D5101b47557J03206M6468b6255F8377p038
15725F1339a19867j8025j24856h0364G3443a52334A47927J99589j65868l6011
15715A45637i7370K7236k21948B57617b63220A10342B8001a96940j60507d7556
15704a03146I4209a44835k67124D4151a88273f0755O710q0972A47373Q2267a88275
15692I1318J65301O5997Q6503E0288M1910a77555j20443O5325R2493M3989H9332
$$ y = [78858, -131816, 106024, -87799, -98739, 89123, 15008, -234629, -85374, -270675, 33553, 280237, 26001, -153014, 185435, 341161, 379135, 135052, 292701, -324796, -160429, 150758, 271886, -147327, 118811, 127654, 38957, 74888, -138799, 136773, 200268, 116691, 72113, 9160, 31161, 272165, -68517, -93149, 96209, 45101, -247557, -144351, -97883, -26255, 68377, 61339, -119867, -137892, -262748, -80364, 73443, -152334, 147927, 347516, 181648, 145637, -97370, -70134, -292082, 257617, -263220, 110342, 28001, -196940, -357447, -47556, -103146, 94209, -144835, -411959, 44151, -188273, -60755, -54045, -135017, 147373, 229640, -188275, 91318, 256619, 322616, 409119, 50288, 92198, -177555, -297998, -232673, -140180, -96191, 89332]
15680b25696B1015a86117o7733G9654K48294a51759K4340B88846A34534m5723
15670H8811D3239a38258l11314a21310e8588A1435a80397j05077a8778A17600
15659A11924P7575b16674A92272h8631A95908a19767M5026H2717c2931A35065
15648A75195d01844I9294R7655B4852r864K1657a55405H8240O5582L35a75139
15636d14462f412j05934C12026a42252C5182b4550k35458H3256h2180A6728J87300
15625B04028c7803C96972d9758E2800J46244c6553A88235b01977m1706c7133B10297
15613A53447D0110i0404k52249B71724r7254C2702F083L3639a94042A39102a97756
15601B07962a73845A71011F1672P1324a86230A97974c69724g0407J9451j63083
$$ y = [-225696, 21015, -186117, -253850, 79654, 327948, -151759, -127419, 288846, 134534, 88811, 43239, -138258, -449572, -121310, -58588, 11435, -180397, -285474, -18778, 117600, 111924, 189499, -216674, 192272, -88631, 195908, -119767, -74741, 82717, -32931, 135065, 175195, -401844, 99294, 196949, 24852, 14988, 36645, -155405, 88240, 153822, 154157, -175139, -414462, -6412, -112346, 312026, -142252, 35182, -24550, -260008, 83256, -82180, 16728, 204028, -37803, 396972, -49758, 52800, 199044, -36553, 188235, -201977, -243683, -37133, 210297, 153447, 40110, -90404, -342653, 271724, 174470, 32702, 6083, 39722, -194042, 139102, -197756, 207962, -173845, 171011, 61672, 132996, -186230, 197974, -369724, -70407, -50956, -214039]
15591b14039B31587r1113a23702A30353g0220A92727a35549I6311l9861b36823
15580e2302C1584h0430H7219h9435j0218A98324E4528a49133E7600b10900p8011
15569b88911P7718k53199a33361I1904a41265e2155m9021F0721O5267i8655A41346
15557D14485A15477n5760b95170C98997e0958G108J54362p0256d0651C5815J12445
15546A48260N0695p3378j6126i8417h398A86164C7301c87029B8064K28750c8020
15534a69138A30669a11038k06414B75596D5681H258J85112G2304c8025l57715
15524c95740i8905B7159K1585K1448h0461A24979K22390a23584L0270c3377A6914
15512B7992e2995l520B34342d64394B2428K2199k575a9067l8829m0841A21891
$$ y = [-214039, 231587, 140474, -123702, 130353, -70220, 192727, -135549, 96311, 56450, -236823, -52302, 31584, -80430, 87219, -89435, -99653, 198324, 54528, -149133, 57600, -210900, -288911, -211193, -464392, -133361, 91904, -141265, -52155, -101176, 60721, 125988, -98655, 141346, 414485, 115477, 59717, -295170, 398997, -50958, 7108, 161470, 91214, -40651, 35815, 148260, 198955, 125577, 109451, -98417, -8398, 186164, 37301, -387029, 28064, 256814, -38020, -169138, 130669, -111038, -317452, 275596, 45681, 8258, 193370, 72304, -38025, -395740, -98905, 27159, 48744, 70192, -80461, 124979, 347369, -123584, -93314, -33377, 16914, 27992, -52995, -56515, 234342, -464394, 22428, 44627, 42052, -19067, -57896, -98737, 121891]
15500e2337j83120a16094A8837g6919L0978G7561b8346C1369b57513P2523B24796
15488C91478a52993n2040i6260k20150a17001e6298j856k0647E8238b92429h9437
15476A42969J39394b05007A92856E2982b03840N9933m6867A06915f4505j41895
15466b06400A26305d4103A28463e4340n7747B7174j3098a48436r737A76770b25942
15454a07021a6584r5610c6593C64543a64747J2886m73636A27861J53120E7699
15443a60825p6656O4884Q0331K6830B99350a30941k8424P5195d392A66430b91067
15431b03648h3958j07579A4537J8997N8464j1431Q606J48922A146K2930d9225
15419g006A8419i2134L9779G2551a65143a229D7759a42375k54566A51677a24708
$$ y = [-52337, -235457, -116094, 18837, -76919, -45941, 77561, -28346, 31369, -257513, -184990, 224796, 391478, -152993, -205033, -96260, -316410, -117001, -56298, -58154, -78801, 58238, -292429, -89437, 142969, 282363, -205007, 192856, 52982, -203840, -143907, -190774, 106915, -64505, -206400, 126305, -44103, 128463, -54340, -112087, 27174, 14076, -148436, -158173, 176770, -225942, -107021, -16584, -112194, -36593, 364543, -164747, -151861, -625497, 127861, 280981, 57699, -160825, -237481, -172597, -92266, -65436, 299350, -130941, -159365, -84170, -4392, 166430, -291067, -203648, -83958, -191537, 14537, 33534, 91998, 80567, 89173, 238095, 1146, 24076, -49225, -7006, 18419, -92134, -52355, 72551, -165143, -1229, 47759, -142375, -396941, 151677, -124708]
15407d9032j54870i197A96864L2464H0307K197b29746C15744a87008a2687n3371
15396f6058A1379C469J41868A3656b92046a27200M8568L0416n214E877Q9895m167
15384I1605f7492j77377j13864a3495j2207h752C8121b39725a13E1356h5586B9649
15371a96759j56456B1175J66437h5161E7032K13571q9721Q0239d4922k18070a0930
15359g072H2654J60321G7792c0454A99544a51824A73752j1383e3489A04773e9816
15347A76516h4304C61282B4257d77699a48236B20338o5290d4184G5157j6868b43931
15335a54602j5973G2962e8541A42051K19239r530K3008C1264c1513j91925B97276
15323c0444C2116h6521o3153e5772k1911B32221F7686O9445L6723M7231o8468
$$ y = [-49032, -203902, -9197, 196864, 229328, 80307, 82504, -229746, 315744, -187008, -12687, -66058, 11379, 3469, 145337, 13656, -292046, -127200, -78632, -48216, -53430, 5877, 95772, 91605, -67492, -244869, -358733, -13495, -25702, -8752, 38121, -239725, -113, 51356, -85586, 29649, -196759, -353215, 21175, 187612, -85161, 57032, 270603, 180882, 261121, -44922, -262992, -10930, -7072, 82654, 242975, 77792, -30454, 199544, -151824, 173752, 162369, -53489, 104773, -59816, 176516, -84304, 361282, 24257, -477699, -148236, 220338, 155048, -44184, 75157, 58289, -243931, -154602, -170575, 72962, -58541, 142051, 361290, 351760, 374768, 31264, -31513, -223438, 297276, -30444, 32116, -86521, -149674, -55772, -77683, 232221, 67686, 137131, 173854, 221085, 152617]
15312A52617J38208A24928M82999h8868a4113E1453C797K0876Q9052K07177a14352
15300A48213f9258o9562m3769A94524f6103A49800J00456m2242a98053E5348i8835
15288a2678b300j6951A90631b46291d2256B6269c42008A79746a34607d8473k57806
15277c06279A50528I682J23541a47925B55422b0661j07013F232L80773d2829j0014
15266e2843j67834A13854a92466C11391k3752D4859J47623J55497A35281J17904
15256B53185A03858J8595R7349M0349O3745C0445O13003K33238R17275k56171
15246A537790k30100R4900o46806C29685j59097c1743C6917a07113A55837c2877
15235c4445k43283B94726c52603B3564J62J06780k3464c9905G6233h9082K7564
$$ y = [152617, 290825, 124928, 607927, -88868, -14113, 51453, 3797, 24673, 113725, 320902, -114352, 148213, -69258, -138820, -182589, 194524, -66103, 149800, 250256, 208014, -198053, 55348, -98835, -12678, -2300, -19251, 190631, -246291, -42256, 26269, -342008, 179746, -134607, -48473, -306279, 150528, 9682, 133223, -147925, 255422, -20661, -127674, 6232, 387005, -42829, -52843, -220677, 113854, -192466, 311391, 287639, 44859, 192482, 347979, 135281, 253185, 103858, 122453, 219802, 260151, 323896, 30445, 643448, 876686, 1793961, 1537790, 1307690, 1402590, 755784, 329685, 170588, -31743, 36917, -107113, 155837, -32877, -34445, -277728, 294726, -352603, 23564, 23726, 130506, 107042, -39905, 76233, -89082, -61518]
15224f1518p1903E6519J98419D0666a11453L2581B25823I0052a04234A21712b51504
15212f9330j63575f8530k54593E9885J4084N8343n4767b86584i2550A0610J43327
15201A53937a57309A59536i8526F2999D03L4353d7016A46490a8189E6845L7229
15190I4074J37753e9291I1053Q2864a9809A15192D6358J12131G0568J34660E9726
15178G2560c23902A28229J65680a51766G2762a17211O623I0939a33528A68255
15167f506B21897c02553D4827b02629A18202a04314J5717F3441A1394L81166A56420
15155A98760k7365D4311a5331C18144a66222A16315J11419A00555K94275a32188
15144I7761k1447b22868I0973j3379J80387r6143J03590a76664B65015b48445
$$ y = [-61518, -133421, 56519, 254938, 40666, -111453, -78872, 225823, 90052, -104234, 121712, -251504, -69330, -232905, -68530, -323123, 59885, 73969, 132312, 77545, -286584, -92550, 10610, 153937, -157309, 159536, -98526, 62999, 403, 34756, -47016, 146490, -18189, 56845, 94074, 231827, -59291, 91053, 173917, -19809, 115192, 46358, 158489, 70568, 205228, 59726, 72560, -323902, 128229, 293909, -151766, 72762, -117211, -110588, 90939, -133528, 168255, -6506, 221897, -302553, 44827, -202629, 118202, -104314, -88597, 63441, 11394, 392560, 156420, 198760, 171395, 44311, -15331, 318144, -166222, 116315, 227734, 100555, 394830, -132188, 97761, 76314, -222868, 90973, 77594, 257981, 161838, 265428, -176664, 265015, -248445]
15133H5588i3425L7042A44023L7023q3873B5482b05775D70010A04644a4729A57591
15121B19360A06631B0557R1429J596J8508K41005j56835K44325C2809J791K27592
15110B62192P0477j58486c20398b7938l5034D2591O8362g9901B85583m2840K08332
15099D51075a31424e3535B48084a11201C67069a68891C35440A53389i7296A16186
15088A69428k4433B2805J84068a66141A01384a6355C26179H1546R8170k8306n198
15077A46212E8385J4544J8723P2745C6153Q2499J06066A10032M8433L8377k593
15066A94249a19731A46068n060L8942e2000j62651A23460M335O1556K23692l8274
15055C74769A87236I2376J6960K19275A23563K15503E414a5678G6177L86190j20026
$$ y = [85588, -93425, -56383, 144023, 181046, 97173, 25482, -205775, 470010, 104644, -14729, 157591, 219360, 106631, 20557, 111986, 113582, 132090, 373095, 216260, 460585, 32809, 34600, 262192, 332669, 174183, -320398, -27938, -62972, 42591, 110953, -79901, 285583, 242743, 451075, -131424, -53535, 248084, -111201, 367069, -168891, 335440, 153389, -97296, 116186, 169428, 144995, 22805, 206873, -166141, 101384, -16355, 326179, 81546, 179716, 151410, 146212, 58385, 72929, 91652, 164397, 36153, 118652, 224718, 110032, 158465, 196842, 194249, -119731, 146068, 141008, 179950, -52000, -214651, 123460, 127795, 189351, 413043, 374769, 187236, 92376, 109336, 328611, 123563, 339066, 5414, -15678, 76177, 462367, 342341]
15044C42341A6920K14777A11979a00986B05861K7967C7445K49471N0145j37807
15034A99254J25565j55990n5840L7608F2311O2601R3428L86883B70095j26008
15024A44087K87080j97299l1331l1159L8840A01032M35926B07948C6433Q2661
15014A19094L14550i8130B58609k4963J20213A46798C547K98219J35338B06883
15003b38382c8390C80906n1947j63069c87920h3126F6307o156J19523J8961j5395
14992A83240K83734k31482b8182D72383K1036A83178N4985M3822J02059N1300
14982D35344a67986B07894J16207q6082p4188i4002B73164Q933n8679I3288J36042
14971B29330K82259m1907a70423A10766J2721a43284B09667b15140i8919B85869
$$ y = [342341, 16920, 231697, 111979, -100986, 205861, 233828, 37445, 286916, 337061, 199254, 324819, 168829, 112989, 150597, 62311, 124912, 218340, 605223, 270095, 144087, 431167, 233868, 202537, 171378, 210218, 101032, 536958, 207948, 36433, 119094, 433644, -98130, 258609, 233646, 353859, 146798, 3547, 301766, 437104, 206883, -238382, -38390, 380906, 328959, 165890, -387920, -83126, 66307, 60151, 179674, 198635, 183240, 466974, 235492, -28182, 472383, 493419, 183178, 238163, 281985, 384044, 435344, -167986, 207894, 324101, 238019, 163831, -94002, 273164, 282097, 223418, 93288, 229330, 511589, 469682, -170423, 110766, 123487, -143284, 209667, -215140, -98919, 285869]
14960G4696L37020n0735l3749r0010N1366I3276K10076Q7951J2474j09219A19602
14948A71221n3456L6333K87965H900K39269J04208k7748H9869h9754B0654K50967
14937B71621G1307N21810Q2540E5625j04R3540J2409a65370C19896j01738J53228
14926C71386j26994L69552j81285C8522K00859R3797R0969j79978l3458k9071
14916A81640c9904B49775K56019B28457J11633L70436K66256l94873B01725d5737
14905D32550A66767M54329k44527a40265B07329N068J56270e6970D81985k29725
14895B52260K41239A77895p6503K46450q4260M44033B17165j05283L59894B23284
14884D46521k6025j55651J09064A26540L05994o4428J65534D2425J65786K28056
$$ y = [74696, 411716, 360981, 327232, 237222, 288588, 93276, 303352, 391303, 403777, 294558, 119602, 171221, 117765, 154098, 442063, 8900, 248169, 352377, 324629, 89869, -89754, 20654, 271621, 71307, 593117, 675657, 55625, 55521, 149061, 161470, -165370, 319896, 218158, 371386, 244392, 613944, 432659, 38522, 239381, 333178, 424147, 244169, 210711, 181640, -39904, 249775, 505794, 228457, 340090, 710526, 976782, 581909, 201725, -45737, 432550, 166767, 621096, 376569, -140265, 207329, 212397, 368667, -56970, 481985, 252260, 493499, 177895, 101392, 347842, 263582, 707615, 217165, 111882, 471776, 223284, 446521, 420496, 264845, 373909, 126540, 432534, 368106, 533640, 42425, 208211, 436267]
14874D36267k04741K88276j76050k8480p7399J55584j71474P7533n5938M67407
14864G10985A16913K49482b135C93150N1870k88G2248L34630K56334K11476C09694
14852C70152A13653B3381L28407j19542K22677A10494O24178n3978j89027P4597
14842E66264Q8211k90457J14499k03778O4661R5762q9035J65876A17530L80481
14832D98011K7616M7483j18656j09442J87296p7327N9630R954K07532j19168A08229
14820C68669R8813l6438J99679j68456n8191n2041A67724M93307l01978L08900
14810F67953l7421o4091k35761L07505j79451A54599L50785J48625J54465J38736
14800I47210m32798J12265j47689J46611B10524K72810J09704F3311M19647m1610
$$ y = [436267, 231526, 519802, 343752, 315272, 237873, 393457, 221983, 299516, 243578, 710985, 116913, 366395, -2135, 393150, 445020, 444732, 72248, 406878, 663212, 874688, 309694, 370152, 113653, 23381, 351788, 232246, 454923, 110494, 734672, 680694, 491667, 566264, 654475, 364018, 478517, 274739, 339400, 435162, 346127, 512003, 117530, 498011, 525627, 573110, 454454, 345012, 532308, 454981, 514611, 524565, 732097, 612929, 108229, 368669, 467482, 431044, 630723, 462267, 404076, 352035, 167724, 661031, 359053, 667953, 630532, 566441, 330680, 638185, 458734, 154599, 505384, 654009, 808474, 947210, 514412, 626677, 478988, 625599, 210524, 483334, 593038, 63311, 482958, 441348]
14790D41348K90453j54206J17211k19037k25063K63889n8469j8085K65361l438
14780F99964j00896P2935B48652J02815O6504R8924q3412J03900K31529C75033
14769F96565O8726k02664j78441K17494j48256O2265L0548K16240C51244L82186
14759G33430j33907k40999R4029M56965K41951D69656N9632K70022j91179o7583
14749E40548J63753j20455k7525J50079O7178o6517L13792K9832m53170L01612
14739H99127m3699k63813P1135o6840j87151J63695J01757j51888K55254j05251
14729F72326j92929J85623k48556M81491M6791n023l30216k11932O14032j92568
14719H19039j35813J11673p8250k23122K26568r6978J9236K33339n9344K43963
$$ y = [441348, 731801, 577595, 694806, 475769, 250706, 514595, 456126, 438041, 703402, 699964, 599068, 672003, 248652, 351467, 417971, 516895, 433483, 537383, 768912, 375033, 696565, 765291, 562627, 384186, 601680, 453424, 515689, 546237, 762477, 351244, 733430, 599523, 358524, 452553, 909518, 1151469, 469656, 529288, 799310, 608131, 540548, 704301, 583846, 556321, 706400, 773578, 707061, 1020853, 1050685, 597515, 899127, 855428, 591615, 662750, 595910, 408759, 572454, 674211, 522323, 777577, 672326, 479397, 665020, 416464, 897955, 944746, 939723, 609507, 397575, 1011607, 819039, 683226, 794899, 716649, 493527, 720095, 623117, 642353, 875692, 816348, 1060311]
14709A060311l22308j5780P2538O6139J07274j93770J55124K28823l5001K4221
14699A147571l24928p8263Q9852o4240J57074r9040J65247O0952j5938K11800
14689A250087m51459r6442L87781k46014p5621N42048m06851p9229J8843K01512
14679A044655j29663K76783k08833j4092o2927K48857l8943P4084l62875R5J08992
14668I36133J65904l30666N20550K09978m54114J85399j02656n4525j11038j5690
14658I49275J63513L2826J40439j90645J12329j9330J61144J69680l99304J14478
14648A234405j03219K4966j8556n0044n9405j93975L68788J4447J72172p6397
14638A313182P2947j70178l9927L60465j43336q5450k9966j66166J6399o7862
$$ y = [1060311, 738003, 722223, 794761, 860900, 968174, 774404, 929528, 1158351, 1123350, 1147571, 822643, 744380, 834232, 769992, 927066, 828026, 993273, 1054225, 1038287, 1250087, 798628, 702186, 1089967, 843953, 768332, 1310380, 903529, 824300, 843143, 1044655, 914992, 1191775, 982942, 968850, 905923, 1154780, 1115837, 1189921, 827046, 827141, 936133, 1102037, 771371, 1291921, 1501899, 1047785, 1233184, 1130528, 1076003, 964965, 949275, 1112788, 1145614, 1286053, 1095408, 1207737, 1188407, 1349551, 1519231, 1119927, 1234405, 1131186, 1156152, 1137596, 1087552, 1028147, 834172, 1202960, 1217407, 1389579, 1313182, 1386129, 1215951, 1176024, 1536489, 1393153, 1307703, 1277737, 1111571, 1127970, 1060108]
14628A060108K85963o9324k99738N86489m4351k64662M8382J74626K465N5975
14618A535933r8120k14900J13376K87669L19424k87365m90566K46754m9609L59731
14608A722327l36979L13629r2935k76783j9967M53098j95834l23325L93465J45289
14598A781985O8031k08901N8623j32246J15860K681r8616K863R1060L01046J48355
14587B130741n40465k67990K62560M91780j3541J37165k96313j33L45411k64968
14577A984247L8896m981J33308J9931k60691J16607K28412L65463o41927J24856
14567B104121R1801K27246K98791l00479L23103n87735L60980M37561l88541M77378
14557C044226j74855K79606j29630L18825M07275P12904J26046J353841K115429
$$ y = [1060108, 1346071, 1276747, 977009, 1563498, 1519147, 1254485, 1302867, 1477493, 1479958, 1535933, 1437813, 1222913, 1336289, 1623958, 1943382, 1656017, 1165451, 1412205, 1362596, 1722327, 1385348, 1698977, 1606042, 1329259, 1309292, 1762390, 1566556, 1243231, 1636696, 1781985, 1850016, 1641115, 1699738, 1567492, 1683352, 1686033, 1587417, 1590280, 1681340, 1982386, 2130741, 1590276, 1322286, 1584846, 2076626, 2063085, 2200250, 1903937, 1903804, 2249215, 1984247, 2023143, 2018162, 2151470, 2171401, 1910710, 2027317, 2255729, 2621192, 1979265, 2104121, 2195922, 2423168, 2721959, 2421480, 2744583, 2156848, 2517828, 2955389, 2566848, 3044226, 2869371, 3148977, 3019347, 3338172, 3745447, 4458351, 4584397, 5938238, 8053667]
14548H053667M743594J0193233J7416975K645501j7541260A0893250D920851k051187
14540B869664n54624J19363o13123J08261J51033j06092N5237O8005o9615J5907
14530B044016q4365K95286P138k9474J88395k07509J87133q9866P3730L15452
14520B699936P562P7340k29872K12236K18756n60381L75804k19586J93269K59344
14510C034408q2804K55523l25765J88339m66197L92639J86267j90082L67544n56959
14500B802913N16839n01309K08674K13549Q3832J65746J52921j79786o5624K69600
14490C667355n10727K48908O7158K44344J05307M8660j83053K44018j2671k11837
14480C707462M17346n98500J56760j92636N03334p7972M45015j99649j41437K84743
$$ y = [8053667, 12797261, 22990494, 40407469, 43052970, 25511710, 10893250, 4920851, 2869664, 2315040, 2434403, 1821280, 1929541, 2080574, 1974482, 2029719, 2097724, 2028109, 2044016, 1959651, 2254937, 2262075, 2232601, 2420996, 2213487, 2400620, 2310754, 2384484, 2699936, 2707498, 2784838, 2554966, 2767202, 2985958, 2425577, 2801381, 2581795, 2775064, 3034408, 2951604, 3207127, 2881362, 3069701, 2603504, 2996143, 3182410, 2992328, 3359872, 2802913, 3319752, 2818443, 3027117, 3240666, 3324498, 3490244, 3643165, 3463379, 3397755, 3667355, 3156628, 3405536, 3472694, 3717038, 3822345, 3871005, 3687952, 3931970, 3919299, 3707462, 4124808, 3526308, 3683068, 3490432, 3993766, 3915794, 4360809, 4161160, 4019723, 4304466]
14470D304466L69829j92192k49204K97375m72973Q08562j84973k77931K89482
14461D692441M37837r7542j13919k10516L06176K51366j34392K75105j30414p4530
14451E201612L41587L9023j51044J41032J68534n0009J17183j28014K58644M8572
14441E987120K98355J28847o46395O32324m8950n4765J92432O07138l33279L8078
14431F800905J78094J13460J60629j35661J9210K15502L37929n2467j77299O34709
14421H095011l49489J64069J61777L26912m2347J44579Q4287Q4529N41244j96992
14411I013580K79692o955L71490j33853L51046k17991P10364j94266P0749J66729
14401A0410585K91748K2633J19536K23056K12005M37378K52499j2168M05110L04426
$$ y = [4304466, 4674295, 4482103, 4232899, 4530274, 4057301, 4865863, 4680890, 4402959, 4692441, 5130278, 5032736, 4918817, 4708301, 5014477, 5265843, 5131451, 5406556, 5276142, 5201612, 5543199, 5582222, 5431178, 5572210, 5740744, 5690735, 5807918, 5679904, 5938548, 5987120, 6285475, 6414322, 5767927, 6400251, 6351301, 6296536, 6488968, 7096106, 6762827, 6800905, 6978999, 7092459, 7253088, 7117427, 7136637, 7352139, 7690068, 7637601, 7460302, 8095011, 7745522, 7909591, 8071368, 8398280, 8355933, 8500512, 8584799, 8669328, 9210572, 9013580, 9293272, 9286317, 9657807, 9523954, 9875000, 9657009, 10367373, 10173107, 10243856, 10410585, 10702333, 10724966, 10844502, 11067558, 11279563, 11716941, 11969440, 11957272, 12362382, 12666808]
14391A2666808j62790L82227M40723k20026L90414M64001o3228K81774R6949M85726
14381A4762578j50120O58704K87556R3546L05535M72118j23336M15925O04210
14372A7326716J20758P59360P6115N10608J54754l4083P36340N07807K16300P23585
14362B1098260M56276L08213N92774M60993L31507O46060R76800J6747O62535
14353B5550165N81210P54995L56176N89540R13949J172087L84734Q33722O85354
14344C1821932Q30420Q02262R92779O58516J084143J280689J062584J001635J194683
14335D0729643R98632J439865J266332J053814J624748J516441J953337P60581
14327E1343393K396041J471686J257491K637894J766964K109836K278093K115747
$$ y = [12666808, 12504018, 12886245, 13326968, 13106942, 13497356, 13961357, 13898129, 14179903, 14276852, 14762578, 14612458, 15271162, 15558718, 15652264, 15957799, 16429917, 16306581, 16722506, 17326716, 17447474, 18206834, 18282949, 18793557, 18948311, 18914228, 19650568, 20158375, 20374675, 21098260, 21554536, 21862749, 22455523, 22916516, 23248023, 23894083, 24870883, 24887630, 25550165, 26131375, 26886370, 27242546, 27832086, 28746035, 29918122, 30302856, 31136578, 31821932, 32652352, 33454614, 34447393, 35105909, 36190052, 37470741, 38533325, 39534960, 40729643, 41728275, 43168140, 44434472, 45488286, 47113034, 48629475, 50582812, 51343393, 53739434, 55211120, 56468611, 59106505, 60873469, 62983305, 65261398, 67377145]
14319F7377145L009820K441313K696307K693866L430710K938915L496316L632695
14311I1717087M115409L315282M821018M305049M669712N302801N080187N905011
14303A29231556N909653O111874O575061P788056P482135Q229919Q460056R224579
14295A89012889R831840R994011J0913335J1507286J2093941J2391368J3663791
14288B69408461J4095611J4082380J5438790J5284922J5633994J6253293J6257469
14281C76454920J6107319J5588035J5160359J4530668J3096000J1826765R537469
14274D72301535O243596J985037l19079k810217k398132l159298o420876j768164
14266D63654402o384358j0605888j2766449j4109641j4894824j5579060j6073321
$$ y = [67377145, 70386965, 72828278, 75524585, 78218451, 81649161, 84588076, 88084392, 91717087, 95832496, 99147778, 103968796, 108273845, 112943557, 118246358, 123326545, 129231556, 135141209, 141253083, 147828144, 155616200, 163098335, 171328254, 179788310, 189012889, 198844729, 208838740, 219752075, 231259361, 243353302, 255744670, 269408461, 283504072, 297586452, 313025242, 328310164, 343944158, 360197451, 376454920, 392562239, 408150274, 423310633, 437841301, 450937301, 462764066, 472301535, 478545131, 480530168, 480211089, 477400872, 475002740, 471843442, 465422566, 463654402, 457270044, 446664156, 433897707, 419788066, 404893242, 389314182, 373240861]
14259C73240861j5544310j5823172j5663431j6152277j4970546j4516188j3874259
14252B66696678j3573571j2991940j2290833j1403105j0570317j0274985r782180
14245A85809747q610149q119247q168754p465198p259939p020251n964960n730439
14237A27470810n174161n533855m851221m767041m292780m302613l786852l586910
14229I1175377l712774l381565k822790l166087k951345k796601k501487k494570
14221F7348158k335447k079430j712310k420136k048149j790449j530974j820474
14213E1610789j162081j441614j536637j465326j518563j307625l46013j335760
14205D1497170j486298j413864j046608j087659o48263m30659j153986j153546
$$ y = [373240861, 357696551, 341873379, 326209948, 310057671, 295087125, 280570937, 266696678, 253123107, 240131167, 227840334, 216437229, 205866912, 195591927, 185809747, 177199598, 169080351, 160911597, 153446399, 146186460, 139166209, 133201249, 127470810, 122296649, 116762794, 111911573, 107144532, 102851752, 98549139, 94762287, 91175377, 87462603, 84081038, 81258248, 78092161, 75140816, 72344215, 69842728, 67348158, 65012711, 62933281, 61220971, 58800835, 56752686, 54962237, 53431263, 51610789, 50448708, 49007094, 47470457, 46005131, 44486568, 43178943, 42832930, 41497170, 40010872, 38597008, 37550400, 36462741, 35814478, 35383819, 34229833, 33076287]
14197C3076287q96815r48925q35125l66447n40416r83256p00073o56522p88080
14188B6360628l94526p62086l15163o89059n50156o62055m89613n18873m87180
14179B1491917m10255m48881l95031n26718l28308m58180l8186n85017j69118
14170A8132223o10268k02832k97825m88825j65652n25128K6982m04777m44452
14161A5019446l29093k05504j12183l03050n72566N5448k01131q7852j44077m58982
14151A2660456n02646Q5645j22959j79404o9896p41780J8557k17619n5886j26686
14141A0747782k5240l25899K11096m54259l3392l75729q2163k2287j46640l23027
14131I170242m1065j80926p5087j11885J0048l79549Q0510l63526q3979K38244
$$ y = [33076287, 32179472, 31230547, 30395422, 30028975, 29488559, 28505303, 27805230, 27148708, 26360628, 25966102, 25204016, 24888853, 24199794, 23649638, 22987583, 22497970, 21979097, 21491917, 21081662, 20632781, 20237750, 19711032, 19382724, 18924544, 18886358, 18301341, 18132223, 17521955, 17319123, 17021298, 16532473, 16366821, 15841693, 15868675, 15463898, 15019446, 14690353, 14484849, 14372666, 14069616, 13497050, 13552498, 13351367, 13263515, 13119438, 12660456, 12157810, 12243455, 12120496, 11941092, 11871196, 11129416, 11147973, 10930354, 10874468, 10747782, 10722542, 10396643, 10607739, 10153480, 10120088, 9744359, 9662196, 9639909, 9493269, 9170242, 9129177, 8948251, 8873164, 8761279, 8771327, 8391778, 8472288, 8108762, 8024783, 8263027]
14121H263027k56710j34640J65393m26004j55259K85294n1733n92975K00694n69808
14111F727279L49844k7387R2946n53854J49421o9773l02393J43498j2630L5264
14101F532215l52390J68305j89540J60189m35178K70325m64015J96641j1983l65061
14091E509508K50854l99901l8062M05937m75652l5539J42897j08055n71433N40819
14081E221373N9337k26612O3588J11712j27686k22758k25855K4421k3703q6552
14071D567265m6693j46097m4450p1357N05850m67101p157L48601n76159O1348
14061D124050K70092J67395n54894J77257n2932q4033j8284j48595j6251J2956
14051C876761m7063k0118j96503k1802o1109J10734l07031J77147j16473p2297
$$ y = [8263027, 8006317, 7871677, 8037070, 7611066, 7455807, 7741101, 7689368, 7096393, 7297087, 6727279, 7077123, 7049736, 7142682, 6588828, 6738249, 6668476, 6366083, 6509581, 6496951, 6532215, 6179825, 6348130, 6158590, 6318779, 5883601, 6153926, 5689911, 5886552, 5874569, 5509508, 5760362, 5360461, 5322399, 5728336, 5252684, 5217145, 5360042, 5251987, 4680554, 5221373, 5280710, 5054098, 5117686, 5229398, 5101712, 4878954, 4653099, 4677520, 4653817, 4567265, 4520572, 4374475, 4330025, 4258668, 4764518, 4297417, 4290260, 4638861, 4062702, 4124050, 4394142, 4561537, 4006643, 4183900, 4130968, 4046935, 4028651, 3880056, 3863805, 3876761, 3829698, 3809580, 3613077, 3591275, 3530166, 3640900, 3333869, 3511016, 3394543, 3322246]
14041C322246R7163l8579k466p6812l09664K32399J42462m27377N02213n8969
14031C382616l19795j5004J58268J32517l72134J8291Q448l58052K43689j50822
14021B728022K10355j01351j82285j67639K87868q7872M093j00070K35989n12499
14011B314611P1082J7316J37411K12675k19677p783n6155R9856r1982k45115l06514
14000A925725l4336N27319o12791M69422k04133j20695J63442R3268J68104l16888
13990B058437P55149J231469K944388Q439085J6718575J0909024j3103543j4322753
13982A5629831o884603k650534j146557n65195o19265j13665m62259j55359O6767
13973C099161j8768m09265J03474K4922m47036K77917m31223K73908Q4515k65483
$$ y = [3322246, 3419409, 3380830, 3378364, 3301552, 2991888, 3224287, 3366749, 2939372, 3441585, 3382616, 3062821, 3047817, 3206085, 3338602, 2966468, 2984759, 2993207, 2635155, 2878844, 2728022, 2938377, 2837026, 2654741, 2487102, 2774970, 2687098, 2691191, 2591121, 2827110, 2314611, 2385693, 2403009, 2540420, 2753095, 2533418, 2525635, 2469480, 2569336, 2477354, 2232239, 1925725, 1891389, 2418708, 1805917, 2275339, 2071206, 1950511, 2113953, 2207221, 2375325, 2058437, 2813586, 4045055, 6989443, 15428528, 32147103, 43056127, 29952584, 15629831, 8745228, 6094694, 4948137, 4382942, 3763677, 3650012, 3187753, 3032394, 3099161, 3080393, 2671128, 2774602, 2799524, 2352488, 2630405, 2199182, 2473090, 2557605, 2292122]
13963B292122M00203l77230j74003K10008l43967N32360q5029j9865l52780l76841
13953A704978P74118l27835J80560j88068p5662J48033M0934k37427l02610J13514
13943A830535o5395m3271L1859Q0320J33334N7672k85108J80827j04456P7232
13933A893549l80756K49100K31611l15949K89139j37287k08986K11676k40248
13924A591849j07883M93955m08965L4815J23107J1494j8169l70388M21329k00609
13914A570535j5248N7443J74851j37556k02187j5107j26989n811L56837n12918
13904A143850L20676J4188j6645J51261j47240k34086J13658Q4684r2746o4015
13894A273585m5595n9948Q3472L7832P0442J93510j79330L3068k6770j39528n3627
$$ y = [2292122, 2692325, 2315095, 2141092, 2351100, 2007133, 2539493, 2454464, 2434599, 2081819, 1704978, 2479096, 2151261, 2331821, 2143753, 2068091, 2216124, 2257058, 2019631, 1717021, 1830535, 1765140, 1721869, 1753728, 1834048, 1967382, 2025054, 1739946, 1920773, 1816317, 1893549, 1512793, 1761893, 1993504, 1677555, 1966694, 1829407, 1620421, 1832097, 1591849, 1483966, 1977921, 1568956, 1603771, 1726878, 1738372, 1720203, 1349815, 1771144, 1570535, 1555287, 1612730, 1787581, 1650025, 1447838, 1432731, 1305742, 1299931, 1656768, 1143850, 1464526, 1478714, 1462069, 1613330, 1466090, 1232004, 1345662, 1430346, 1337600, 1273585, 1227990, 1168042, 1251514, 1289346, 1359788, 1553298, 1373968, 1407036, 1380266, 1240738, 1187111]
13883A187111j01730J56937M41756m51052j13246q1677J50345J20884j54387K32063
13873A387004j90191l505j11877M7183K960j96782Q7134N8411j39085R0613J69104
13862A200969j93645J58307J07638m51220M35515l34614K19694J53906k28914
13853A067636j22221k345M08972l55444P2665L1047m30059j1836L57853q5539
13843I30729o0726K81413j0193m13563L07497k5751J08613m6618k29080K00914
13833A043235k44176N50179k64271P8387p0881k10829k34436M27928L4207l08207
13823H01136R8251l52047N47058j22351J58526j45215k33860L4074L02633q5611
13813A002594k8094k18279J8577K83239q2594k17573L00730j81991k94252J54518
$$ y = [1187111, 1085381, 1242318, 1684074, 1233022, 1119776, 1038099, 1188444, 1309328, 1154941, 1387004, 1196813, 1193308, 1081431, 1128614, 1131574, 934792, 1021926, 1080337, 941252, 1031865, 1200969, 1007324, 1165631, 1273269, 822049, 1257564, 922950, 1142644, 1296550, 1067636, 945415, 943070, 1352042, 996598, 1069263, 1100310, 670251, 658415, 1016268, 930729, 870003, 1151416, 1141223, 727660, 1035157, 1009406, 1118019, 1071401, 842321, 1043235, 799059, 1349238, 1084967, 1163354, 1092473, 881644, 647208, 1075136, 1109343, 801136, 899387, 547340, 1094398, 972047, 1130573, 985358, 751498, 785572, 1088205, 1002594, 974500, 756221, 774798, 1058037, 975443, 757870, 1058600, 876609, 582357, 736875]
13803G36875K5058K35910k74295J27575P9138J3831C82078N66543k03411k02841
13793E42369K59979K04641B81065J013161F20697k4031K77500q6737C92400L54339
13783G46739J43034j41073J06020K3333n8084K14859l81806k13824K30439l1723
13773F37914K26339L5575k24176K99736m33527J66520O1322P6834j23487l5062
13763F87988J4602r3582K8811K91062j95120Q3565l51228K66899J4452J26092
13753H73541l87178L55593j11699j56525j13483P90204C07688M36726B86276J10497
13743C96773K10707J27222j73064R4307K73002l12006m7269J12526J51425C40022
13732I51096l61161j03422m1207K24498l9609J87979K83940E18590j94167M46865
$$ y = [736875, 761933, 997843, 723548, 851123, 930261, 944092, 382078, 948621, 745210, 542369, 802348, 1006989, 281065, 1294226, 620697, 596666, 874166, 787429, 392400, 746739, 889773, 748700, 854720, 878053, 819969, 1034828, 653022, 439198, 669637, 637914, 864253, 899828, 675652, 975388, 541861, 708381, 769703, 846537, 723050, 687988, 702590, 609008, 637819, 928881, 733761, 817326, 466098, 732997, 747449, 873541, 486363, 841956, 730257, 573732, 460249, 1250453, 307688, 744414, 286276, 396773, 607480, 734702, 561638, 655945, 928947, 616941, 569672, 682198, 833623, 340022, 951096, 589935, 486513, 445306, 669804, 630195, 818174, 1102114, 518590, 324423, 771288]
13722G71288B59079N49265L93k60666j04628L46662o2249j33328O7310J36144
13712G97982k52507K66625l22300K58823J8555l4020j57562K50743l23165J73438
13702F76612l1896P1662C04454Q4606J96455j47012M21655k05142j9600p9069
13692E56347j10546M52548l09806n336j59350A6785P38280j66721R9451J29427
13682H17222n7234j15418j83128j63256K13636p8395j32172Q5433q5562J20187
13672D21313J32331P0002p8297k68881K650Q5896L09423l5808j35360J41703k10074
13661D34898Q9693l601q7867K46310o9873M806B58285L00139l606j86961J0583
13650C78440Q6901L4197K83200l58033R619j83309J95777j46893r1507J37530
$$ y = [771288, 259079, 808344, 808737, 548071, 443443, 790105, 727856, 594528, 661838, 797982, 545475, 812100, 489800, 748623, 767178, 733158, 575596, 826339, 503174, 676612, 644716, 716378, 304454, 389060, 585515, 438503, 860158, 655016, 635416, 556347, 445801, 898349, 588543, 583207, 423857, 16785, 755065, 588344, 687795, 817222, 759988, 644570, 461442, 298186, 511822, 433427, 301255, 386688, 301126, 421313, 553644, 623646, 545349, 276468, 279118, 365014, 674437, 638629, 503269, 644972, 434898, 524591, 520990, 433123, 679433, 609560, 614366, 258285, 558424, 554818, 367857, 378440, 465341, 499538, 782738, 424705, 434324, 251015, 446792, 299899, 208392, 345922]
13640C45922N3368K23241B83723J17216M61523O968C94641K63405p7603j71618
13630D08825K10878k35286j0836l564N7658P5103m7183n401n8826J12644j42411
13619C61601J0100D6374O08395B50250k4866E0899N02134o6981j13681D3763L33163
13608C76926p6901K99787q2844I2921M74318B81238J93236j41891k7856K01533
13598E06260B12001L45862B21062K43314j94421M9976J32582j48413R7912J36493
13588E38505j93753L66680l33874J55950Q311B55261L09728j36334K06073r5499
13578E39229k04514q2171J77974M9929j84828N0335J65843p4237j62292L47794
13568F23062B89032Q7099j50999J49658A06246L03075j83025J36808k6197M08953
$$ y = [345922, 399290, 622531, 283723, 400939, 862462, 869430, 394641, 658046, 580443, 408825, 619703, 384417, 373581, 370017, 427675, 502778, 455595, 450194, 391368, 504012, 361601, 371701, 46374, 654769, 250250, 225384, 50899, 553033, 486052, 372371, 43763, 376926, 300025, 599812, 516968, 92921, 567239, 281238, 474474, 332583, 304727, 506260, 212001, 557863, 221062, 464376, 269955, 319931, 452513, 304100, 402012, 538505, 344752, 711432, 377558, 533508, 541819, 255261, 564989, 428655, 634728, 539229, 334715, 252544, 430518, 480447, 295619, 345954, 511797, 437560, 275268, 623062, 289032, 376131, 225132, 374790, 106246, 409321, 226296, 363104, 336907, 745860]
13558G45860k64029B07619K70075E4133M32764A97707J82283p7727j39337M11622
13548E74548B01515r5075K23341q1888J55985N817A81408J65298K83869A70485
13537B6419O42739C12582m4463j0167J18892N7461j82312j12815J87307A57806
13526D81870G3561K50564I8530K61007J21275c4827F31630B52148K5857K55563
13516E33568o150r1081A45374N1388F7279K13088F7915i5862B88047C1716O45498
13505F77214C18572P6314A91962J79246n6561q7529G3597L03861a92937B88503
13494C97276e4108B29983J97173R3571q0559l5422A52489L13600j06178J39255
13484D99166F2901L5582K71025M24385B26035e3153K2799D19651G5081L87855
$$ y = [745860, 481831, 207619, 477694, 54133, 486897, 197707, 379990, 302263, 162926, 574548, 201515, 106440, 329781, 247893, 403878, 409695, 181408, 346706, 630575, 170485, 26419, 669158, 312582, 268119, 257952, 376844, 434305, 251993, 139178, 326485, 157806, 481870, 73561, 324125, 98530, 359537, 480812, -34827, 631630, 252148, 278005, 533568, 527418, 436337, 145374, 196762, 67279, 280367, 67915, -95862, 288047, 31716, 677214, 318572, 394886, 191962, 371208, 314647, 227118, 73597, 377458, -192937, 288503, 397276, -54108, 229983, 427156, 520727, 440168, 404746, 152489, 466089, 359911, 499166, 62901, 98483, 369508, 793893, 226035, -53153, -30354, 419651, 75081, 462936]
13474D62936n647j47712j44380j5480o1368K42634q7225J23660m2904p458b5868
13462D54023q2701P6204A91014Q5965A24732J52585R2701O2810j72534K11859
13452D72153M4412H1961J96816M02822B47728Q0021a63847B34043h7287D63033
13441B73569K57320j22886j85965K23877A51410p0225O6935b5518B14429d603
13430C89282e420B04614b2684k5965B531Q2078J37525r8112R8256J7918G674J05288
13418A12962j5192j4557K05475J11094j60295k1948E8291K98313R8225A3860J86937
13407B00797P4621K3883j4102R0539a10262B03398K21276j27203K2575p3417j9590
13396B27039M7878N392r9929K9937k834a18945R298A60469J20668L00997a55644
$$ y = [462936, 457289, 309577, 165197, 149717, 88349, 330983, 243758, 367418, 324514, 317056, -25868, 454023, 371322, 447526, 191014, 276979, 124732, 277317, 370018, 432828, 260294, 472153, 516565, 81961, 278777, 681599, 247728, 327749, -163847, 234043, -87287, 463033, 273569, 530889, 408003, 222038, 445915, 151410, 81185, 148120, -25518, 214429, -4603, 389282, -5420, 204614, -22684, -48649, 2531, 84609, 222134, 124022, 222278, 240196, 7674, 112962, 97770, 83213, 288688, 399782, 239487, 217539, 58291, 356604, 454829, 13860, 200797, 275418, 299301, 285199, 375738, -110262, 203398, 424674, 297471, 320046, 246629, 227039, 274917, 280309, 180380, 210317, 207483, -118945, -109647, 160469, 281137, 582134, -155644]
13384E23753D0543K00132A6346K06229P8886r1613A02171J84654K6567r5365K8163
13373B46190J6403l3258m1333L04135b34103E26487B34376L38743k7217N1100
13363E97002k84440A52926L5938k8681L21016j35602q8494j22427d7998B70383
13352D56346j23434P8144A42869n5161K65145r5261o8664K52812B16166H8623
13341a76088A44009J2731K16783A08050L58640B26832M257J09048I4476J27604
13331B22080K22089K18558A05476C1710L35522r2505M2512J70084E5709a76049
13320E25562L126B41496m1456K71221b2452B57401j03377J81028q3604m0549m2200
13309A68699n3212J19437j00122a997A70482N39728D1873J61912a5450A70506
$$ y = [523753, 40543, 240675, 16346, 222575, 301461, 209848, 102171, 286825, 313392, 218027, 246190, 262593, 229335, 188002, 492137, -234103, 526487, 234376, 573119, 545902, 597002, 312562, 152926, 188864, 160183, 481199, 345597, 257103, 134676, -47998, 270383, 456346, 332912, 411056, 142869, 87708, 352853, 257592, 188928, 441740, 216166, 88623, -176088, 144009, 156740, 373523, 108050, 466690, 226832, 231089, 340137, 94476, 222080, 444169, 662727, 105476, 31710, 367232, 274727, 317239, 487323, 55709, -176049, 525562, 528688, 241496, 200040, 471261, -22452, 257401, 154024, 335052, 251448, 210899, 168699, 115487, 234924, 134802, -1997, 170482, 710210, 41873, 203785, -15450, 170506]
13298B14868D3870b81574A42740B7555L97450A42757J4216k7718K4560K85412
13288D39227c4534k07588G7600L06019i442C1854K59475j15944h597j27449E1936
13276A43637l1047B2067L9485J02704J04299C0037J25578E792b26844A43770L1054
13265A74824J80589A20214h907B32997H5632Q8940K4458a92744A67482K33626
13255D01108b83980D17215A28485F0172l830J9651a9853j31979C3146J61812G315
13243G0707Q4587c4310A01749a0136j32837h77A92745k046i692B30725H6143L8074
13231A24217K30469b4986A01997b44673C55263M5973j95253o9204K56913G4459
13220C3682a62920L9967A57000K2920B1835d04663A3796a11943A78761P1565j8206
$$ y = [214868, 43870, -281574, 142740, 27555, 425005, 142757, 156973, 129255, 153815, 439227, -34534, -242122, 77600, 383619, -9442, 31854, 291329, 175385, -8597, -136046, 51936, 143637, 112590, 22067, 61552, 164256, 268555, 30037, 155615, 5792, -226844, 143770, 174824, 355413, 120214, -8907, 232997, 85632, 174572, 199030, -192744, 167482, 401108, -283980, 417215, 128485, 60172, 56342, 75993, -19853, -151832, 33146, 194958, 7315, 70707, 155294, -34310, 101749, -10136, -142973, -877, 192745, 190699, -9692, 230725, 86143, 124217, 354686, -24986, 101997, -244673, 355263, 401236, 205983, 136779, 393692, 74459, 33682, -162920, -122953, 157000, 179920, 21835, -404663, 13796, -111943, 178761, 250326, 232120]
13209B32120q7977B9962J19815K50173A54665b51739N5323E8633O2220n6857Q7303
13198A51299c8886H3985j3689k2539A1222f5215A48942n260P3418J30472B1585
13186H267L38972j29471J4609a51386b2535C69683o2232M5399j50052M0422b11245
13174A22966K0071m6070J53170I4111Q5500O0063k0610a61365D2635f0552I9560
13162i5577G3430M5540J12496A0238J32580f8826I5364K46687k5118c6097j35228
13151a71325A72920a86985f2985a1701A39342b24274P7989m9669A45046a48901
13140D94942A36488B6972h0283D3361A6880K7471K5187J63644J28301a74751q2657
13129b57408B19751J75763A25575K16896d4776A78451d5633H0836F694b5789j80154
$$ y = [232120, 144143, 29962, 149777, 399950, 154665, -251739, -196416, 58633, 120853, 63996, 151299, -38886, 83985, 70296, 47757, 11222, -65215, 148942, 143682, 217100, 347572, 21585, 8267, 347239, 217768, 232377, -151386, -22535, 369683, 307451, 352850, 202798, 243220, -211245, 122966, 143037, 96967, 250137, 94111, 179611, 239674, 219064, -161365, 42635, -60552, 99560, -95577, 73430, 118970, 231466, 10238, 142818, -68826, 95364, 342051, 316933, -36097, -171325, 172920, -186985, -62985, -11701, 139342, -224274, -146285, -195954, 145046, -148901, 494942, 136488, 26972, -80283, 43361, 16880, 44351, 69538, 233182, 361483, -174751, -257408, 219751, 395514, 125575, 342471, -44776, 178451, -45633, 80836, 6694, -25789, -205943]
13118b05943B13376J8582i9131A6781K78532p6086n7817O0435h962C83399e2455
13106i0450j77661B18129g1033j893n0003A86948C7557K3430P3663K67175j62712
13095B39113R0088j26214J11570a0431B79890j39304b5886j13718I6417J49278
13085B45695B7122a5096A31956f0883j1957A58112J54696l17h3276B34830G0057
13073D35191F1108K84713A39743n1066a25437c1314B49076E6317M4620K64934
13063C65871F5472L56142a22072A68813K64139D4337J06464n9295k0873M6326
13053A16959J61635j33562h5141G5882L34236g4913n1146C62858A46955m5563
13043A01392J58511p954H1759a39088f0677E2734f5144A0143l02N884a39435A16285
$$ y = [-205943, 213376, 231958, -99131, 16781, 295313, 219227, 161410, 221845, -8962, 383399, -52455, -90450, -268111, 218129, -71033, -72926, -122929, 186948, 37557, 60987, 134650, 401825, 239113, 329201, 202987, 314557, -10431, 279890, 140586, -25886, -139604, 96417, 245695, 27122, -15096, 131956, -60883, -72840, 158112, 312808, 312491, -83276, 234830, 70057, 435191, 61108, 345821, 139743, 88677, -125437, -31314, 249076, 56317, 100937, 365871, 65472, 421614, -122072, 168813, 432952, 44337, 150801, 91506, 70633, 116959, 278594, 145032, -85141, 75882, 410118, -74913, -126059, 362858, 146955, 101392, 259903, 251949, 81759, -139088, -60677, 52734, -65144, 10143, 9841, 15725, -139435, 116285]
13030B0318o961J80678M5122P973h2550B20721L7328j07987o976R6272C8755K63419
13018C02174K4824D2745J82260j09375O2652p9024K44584I0433I681a7669n9561
13007g7230F98496C35729l3440i521B80509A15642A4794b29677L275B52198D7668
12995C7814P0325b807B16661B6683b61845a04764B32797E9446e799D41852a19596
12983e7850E7995K32273D6018a49427A24294c698A10857m6621b52542c6530A26247
12971i6464L9778C98132E6803h3778D1854J41475K4921d47552K16977A01819k0545
12960H1274b80546a24746B6584b2146B35911N526A6823a01099B41078E4662d03096
12948B39712R7234J1154a21334A98268f0825A87765F6063N9989J37040j01435
$$ y = [20318, 13357, 194035, 239157, 247130, -82550, 220721, 258049, 150062, 143086, 239358, 38755, 302174, 326998, 42745, 225005, 115630, 178282, 99258, 343842, 90433, 9681, -17669, -77230, 698496, 335729, 302289, -9521, 280509, 115642, 14794, -229677, -226402, 252198, 47668, 37814, 108139, -2807, 216661, 26683, -261845, -104764, 232797, 59446, -5799, 441852, -119596, -57850, 57995, 290268, 46018, -149427, 124294, -3698, 110857, 64236, -252542, -36530, 126247, -96464, -56686, 398132, 56803, -83778, 41854, 183329, 208250, -447552, -230575, 101819, 81274, -280546, -124746, 26584, -22146, 235911, 241437, 16823, -101099, 241078, 54662, -403096, 239712, 336946, 348100, -121334, 198268, -60825, 187765, 66063, 126052, 263092, 161657]
12938A61657a94410f7517B69976d8484C55853F1986A6386K54784H8012K49735
12928C37747A54411E6495b3266A40741g8199r9262b6358A13424a45733A47505
12917a12154K6206I8681b4808j49950c6176k24447H404J4323J00969P8859a5179
12905a10046A93028m9569m7494a71176A09867a5022A80264O8111D2040O0732D7488
12893A22723d9457A72898k5749J97649g9734F51837l25013c21953J28741G6795
12882A61068K15836A08341c6606B56109j12874A6480M7340a19601C3074J65096
12872A98170p8117k2784J41609a7955j5092A52913h8694c413I9771b32773l3129
12861b65902a07376A84827b1027k7620A41095b53949A62823a2372B48196F4857
$$ y = [161657, -194410, -67517, 269976, -48484, 355853, 61986, 16386, 271170, 88012, 337747, 154411, 56495, -23266, 140741, -78199, -177461, -26358, 113424, -145733, 147505, -112154, -85948, 98681, -24808, -174758, -36176, -260623, 8404, 22727, 123696, 202555, -15179, -110046, 193028, 143459, 95965, -171176, 109867, -15022, 180264, 248375, 42040, 102772, 47488, 122723, -49457, 172898, 147149, 344798, -79734, 651837, 326824, -321953, -193212, 76795, 161068, 376904, 108341, -36606, 256109, 143235, 16480, 63820, -119601, 33074, 198170, 120053, 97269, 238878, -17955, -33047, 152913, -88694, -3413, 99771, -232773, -265902, -107376, 184827, -21027, -48647, 141095, -253949, 162823, -12372, 248196, 64857]
12850B8786J55398L12059k45756m7054A77P8348j3486c6001m5470L82A40474a59259
12837A73380h2957M174A80184b24226g7430j18429I2964b25675a12269b5059n576
12826c0635k88881A65630a82145e4247H1663B4045g2169C49718d4504C48874E0927
12814c33160a914A8197J76989a09981M6868f915C18621q8581F4094B441a45279
12802a17778B9895b04165A70924b56306P2401o937H4484h0871A43743a09664L2116
12791g7548B20793G6764K4684R7821G0408c8289A69860n3518a54035l2808B18355
12779b05876J4604h3575A87589b323l8601j4111A0383Q3935g2233B40846A06375
12767A59976b12315B04271G6071K44121b09479F6089b654E4222A3473L2641c2383
$$ y = [28786, 184184, 496243, 250487, 203433, 177, 78525, 65039, -36001, -81471, -81089, 140474, -159259, 173380, -82957, -78783, 180184, -224226, -77430, -195859, 92964, -225675, -112269, -25059, -30635, -319516, 165630, -182145, -54247, 81663, 24045, -72169, 349718, -44504, 348874, 50927, -333160, -1914, 18197, 195186, -109981, -63113, -6915, 318621, 230040, 64094, 2441, -145279, -117778, 29895, -204165, 170924, -256306, -183905, -190842, 84484, -80871, 143743, -109664, -77548, 220793, 76764, 101448, 199269, 70408, -38289, 169860, 116342, -154035, -186843, 218355, -205876, -191272, -83575, 187589, -2323, -40924, -55035, 10383, 94318, -72233, 240846, 106375, 159976, -212315, 204271, 76071, 320192, -209479, 66089, -2654, 54222, 13473, 46114, -32383]
12755A19373K6284J10300O4108i6658F3815b11079l2175H9674h905M347E5936
12743e8002C6749J27246m4853L2003J50318D5146J83081A02021j1647K18164c53168
12731e1820C18817a11781a2806C14972f6570H330L70263A69173b17258F4154d27872
12719B36721R2329j37150c22974A76539d9566L456b2403E6944J0142N9564M8820
12708A75470a88809B74531d5813A50334j9972n1757b4030A04705B3323K4910a61810
12696D50005J64112i8980C47579G5923K35839a3616G2379J76625A17981J09916
12686B27897A2538d3530E7975F313L25315F1324a37851B45140b15301j1795A80707
12674A44643c7088j5644j37078g9420E3996L72853j94800j10408f1876j30790
$$ y = [119373, 145657, 255957, 320065, -96658, 63815, -211079, -243254, 89674, -8905, -4558, 55936, -58002, 36749, 163995, 119142, 151145, 301463, 45146, 228227, 102021, 90374, 308538, -353168, -51820, 318817, -111781, -12806, 314972, -66570, 8330, 378593, 169173, -217258, 64154, -427872, 236721, 329050, 191900, -322974, 176539, -49566, -46110, -22403, 56944, 67086, 126650, 175470, -188809, 274531, -45813, 150334, 130362, 78605, -24030, 104705, 23323, 48233, -161810, 450005, 614117, -98980, 347579, 75923, 311762, -13616, 72379, 249004, 117981, 227897, 12538, -43530, 57975, 6313, 331628, 61324, -137851, 245140, -215301, -227096, 180707, 144643, -37088, -52732, -189810, -79420, 53996, 426849, 232049, 121641, -61876, -192666]
12664a92666d1871B95426A09778M6965L34110A59763l6673O9630p1689C3564b56228
12652b0182k9264A5789L68459a34025D4502L16062j61264c34830A47972e7665
12641f567k44805h841j86292B02372N4977B2857a52143C22153b43104G2108a06371
12629B48759c3691B94383A09062E1929k3376a95346C43771f3601C6887g2972B50882
12617a03412B45187q238a096D59514A21879h5349A88037k7674a55217A6737J02350
12606A19087I830J45610b33831B06957a3348B32717a68474g4224E7624K00537
12596B58161n8912m2496J90448A54640f1421C1043J68820f9134A3002F055O6592
12585G2647J42858n3504J54789a85085G0633K61993i8789j02378O0238e3872A5230
$$ y = [-192666, -41871, 295426, 109778, 156743, 490853, 159763, 123090, 192720, 121031, 33564, -256228, -20182, -49446, 15789, 384248, -134025, 44502, 360564, 199300, -334830, 147972, -57665, -6567, -251372, -8841, -195133, 202372, 257349, 22857, -152143, 322153, -243104, 72108, -106371, 248759, -33691, 294383, 109062, 51929, 28553, -195346, 343771, -63601, 36887, -72972, 250882, -103412, 245187, 236949, -1096, 459514, 121879, -85349, 188037, 160363, -155217, 16737, 119087, 9830, 155440, -233831, 206957, -13348, 232717, -168474, -74224, 57624, 258161, 199249, 156753, 347201, 154640, -61421, 31043, 199863, -69134, 13002, 6055, 72647, 215505, 162001, 316790, -185085, 70633, 332626, -98789, -201167, -140929, -53872, 15230]
12573H1648a64682C36948E283b86974D98378b90226A65235a36267B25402a7709
12562b4212j2437c330A55909b16545A22304Q2487C827c88762b6188A07595K0524
12551A28119J35343b23485O6752A17611J02357l9794Q9111A7015a88693Q7332
12541a01361G9476Q7761H558J78365F2309a58386C1986J43140L1600j8653L4270
12530B22343R918k5018J333D7420f0055l76438C29092A13065c75197a1345H9462
12518B09695A7726a37188j34520f3251k150H5943Q6468d3142B65476A11735L9958
12507A51693J7336a75834B21446a35892A02330e0817A82687j8166a16032o6473
12497a82505l2252p4142O4292B22920a24705o905e5393q3946D4739a85616A14657
$$ y = [81648, -164682, 336948, 5283, -286974, 498378, -290226, 165235, -136267, 225402, -17709, -24212, -36649, -3330, 155909, -216545, 122304, 204791, 3827, -388762, -26188, 107595, 128119, 263462, -223485, -156733, 117611, 219968, 180174, 269285, 17015, -188693, -101361, 79476, 167237, 8558, 186923, 62309, -158386, 31986, 175126, 206726, 188073, 222343, 232261, 207243, 208576, 47420, -60055, -436493, 329092, 113065, -375197, -11345, 89462, 209695, 17726, -137188, -271708, -63251, -65401, 85943, 172411, -43142, 265476, 111735, 151693, 169029, -175834, 221446, -135892, 102330, -50817, 182687, 164521, -116032, -182505, -214757, -288899, -224607, 222920, -124705, -131610, -55393, -139339, 44739, -185616, 114657]
12485A45755a93890r4002I5225Q4755g584j58211g424A91378H6931a20341B21748
12473f52A1996L9260b0310k1630M884k57755c7867B72160B144a57281L2246j45606
12461b70641C35631B8500N9016a14032B28426b59840E8712A4489a3503q633A07792
12449A37188h5745A95260c15066N8605N6046A49537J4698b67758N8820f5913a5395
12437c8290o4629j20607B30123a16244C57835F4015L4457a9065C05142b99326
12426A89222A1826h5616J2852m2994A0762J86599b8496C34919b181C74865A32297
12414b72640h224E1694J60103o4086C2222A058f8887K0500j58360f1587a6073
12402b3158m3598q918c2565k47924P6854N2114H6854c6720m50690a35398H5017
$$ y = [145755, -193890, -287892, 95225, 179980, -7584, -165795, -7424, 191378, 86931, -120341, 221748, -652, 11996, 51256, -20310, -41940, -37056, -294811, -37867, 272160, 2144, -157281, -125035, -270641, 335631, 28500, 87516, -114032, 228426, -259840, 58712, 14489, -13503, -22136, 107792, 137188, -85745, 195260, -315066, -256461, -200415, 149537, 164235, -267758, -208938, -65913, -15395, -38290, -102919, -223526, 230123, -116244, 357835, 64015, 98472, -19065, 305142, -299326, 189222, 11826, -85616, -72764, -115758, 10762, 197361, -28496, 334919, -2181, 374865, 132297, -272640, -8224, 51694, 211797, 147711, 32222, 1058, -68887, -48387, -206747, -61587, -16073, -23158, -66756, -75674, -32565, -280489, -203635, -151521, 86854, -36720, -487410, -135398, 85017]
12390C17777d4676j76173A4265J18899J43282a01356j00350A9239f2873l2704
12380i5577D1004i9635F3445e0015A325c8455A94770B9617b0621B0104N8787b09562
12367A49267J09422q768c27460B2772N0852a64107B9355o673J76134m6783a11464
12355a31457b2272A37709b84822C71206q4732a14811A26374a94185L4683k66311
12345d25813H0835d53653d1009o0906j47031B18778I6552J09416c17083O8588
12335b48495B98685C134b05723A78073J363a60268L0930A97587f6796k712J0277
12324e9231J9534B9331a40072l12401c7305A97746G950b92234e6105H1903b86657
12312B97935A30349i5137I6619J29174f4321F9444M68732c37483A5813c5437A7455
$$ y = [317777, -44676, -220849, 14265, 133164, 276446, -101356, -201706, 19239, -62873, -95577, 41004, -99635, 63445, -50015, 1325, -38455, 194770, 29617, -20621, 20104, 78891, -209562, 149267, 258689, 249921, -327460, 22772, 73624, -164107, 29355, 22682, 198816, 152033, -111464, -131457, -22272, 137709, -284822, 371206, 286474, -114811, 126374, -194185, -159502, -425813, 80835, -453653, -41009, -101915, -248946, 218778, 96552, 205968, -317083, -248495, 298685, 3134, -205723, 178073, 179436, -160268, -129338, 197587, -66796, -69508, -59231, -39697, 29331, -140072, -452473, -37305, 197746, 7950, -292234, -56105, 81903, -286657, 297935, 130349, -95137, 96619, 225793, -64321, 69444, 538176, -337483, 15813, -35437, 17455]
12300g9143L2025A35061J27350g4500o5041e7742B10481L544e7908O19D07091
12288b5056h560p7304j26453A17385O3036E9474b7506k06935J17106C29994A05958
12276B35547g5273c6561D32414J76890c253C61255m1399g0359A79641N2257H3389
12264A40962Q6870Q5734m519i0577B31J70160o0851a32067A81255O2817B5764
12252B15991K2588R1729G1947K11655D7085A4241J33984c7342A96790M1453I1733
12240B36110o8703C6859J24989j3501f7623A23682K62262a36943A42459a08497
12229d0017j37456C15845J06337A71378O235J87770M4358j08710O0376A41125
12218C19194q0149h6237B17763D5169L2059i5986C81461j79406r7068L10499a89349
$$ y = [-79143, -47118, 135061, 262411, -74500, -139541, -57742, 210481, 214025, -57908, -57289, 407091, -25056, -8560, -85864, -212317, 117385, 180421, 59474, -27506, -234441, -117335, 329994, 105958, 235547, -75273, -36561, 432414, 609304, -3253, 361255, 319856, -70359, 179641, 231898, 83389, 140962, 227832, 313566, 309047, -90577, 231, 170391, 109540, -132067, 181255, 244072, 25764, 215991, 238579, 330308, 71947, 283602, 47085, 14241, 148225, -37342, 196790, 238243, 91733, 236110, 167407, 36859, 161848, 148347, -67623, 123682, 385944, -136943, 142459, -108497, -40017, -177473, 315845, 422182, 171378, 177613, 365383, 409741, 301031, 361407, 141125, 319194, 239045, -86237, 217763, 45169, 77228, -95986, 381461, 202055, 104987, 415486, -189349]
12206a48927A44603l7280Q7425R4702o4288k2147e3382C21255N5515A82194G0976
12194A63650Q5052K6235j03123J59736A3528L1061J17424l6758b38845A41728
12183I6708N4447K5938h7675A20248J19948E5158i4465B73078k6355J15646b2294
12171a48946H6506f468C3605J94831C4004g1773C70004j00386o2834N5837h7027
12159a83000Q071l068A0287R0759J58746a87742B60526b76989I8559J73883J68306
12148D40748A4634M18932k06153q2484a8252H6911l4794O9021e1164A39497B4965
12136F2340J96338c7568A0392i8445Q84I9308i9723A6716J95376O9513m2148D1219
12123B44386b853E5723L74982k04323F8731a94761B29995a13189p6452a5358n6734
$$ y = [-148927, 144603, 107323, 194748, 289450, 225162, 203015, -53382, 321255, 376770, 182194, 70976, 163650, 248702, 274937, 171814, 331550, 13528, 44589, 162013, 125255, -238845, 141728, 96708, 151155, 177093, -87675, 120248, 240196, 55158, -94465, 273078, 246723, 362369, -22294, -148946, 86506, -6468, 33605, 228436, 34004, -71773, 370004, 269618, 206784, 262621, -87027, -183000, -174929, -177997, 10287, 101046, 259792, -187742, 260526, -276989, 98559, 272442, 440748, 14634, 433566, 227413, 144929, -18252, 86911, 52117, 121138, -51164, 139497, 24965, 62340, 258678, -37568, 10392, -98445, -97561, 99308, -99723, 16716, 212092, 281605, 239457, 41219, 244386, -2853, 55723, 430705, 226382, 68731, -194761, 229995, -113189, -189641, -15358, -72092]
12112g2092A33494d9524B71863j5988n0491b5629B32175A7158J10522D7731J30877
12101A78608a06126d7565A16471K30353a4121q8409d7027j53732M0677g9573k16710
12090b96283f9490j44255R639a0136r0268B51765R2192g8896C17165o1533m1309
12079B14323M21148N99549M29135k45496F04056a98863F0621j9072f7306C39720
12068B4794J17016b47990a4632B79070G8690c1133A83779R6747j09784c8998B67974
12056c7072k43539A58956o2377b38882J19115A24710a48203A13543d6289C84636
12045b4885A2423f6501A70589p1185b22224C4606J24321J09903a57964q4115g3954
12033C13020a21095A01142N698J9849d8279j68516c7069l73C25271d30448a9551
$$ y = [-72092, 133494, -49524, 271863, 255875, 205384, -25629, 232175, 17158, 127680, 47731, 178608, -106126, -47565, 116471, 346824, -14121, -102530, -47027, -200759, -160082, -79573, -296283, -69490, -213745, -204106, -10136, -100404, 251765, 343957, -78896, 317165, 255632, 214323, 635471, 1235020, 1664155, 1418659, 604056, -198863, 60621, 41549, -67306, 339720, 24794, 141810, -247990, -14632, 279070, 78690, -31133, 183779, 280526, 170742, -38998, 267974, -37072, -280611, 158956, 96579, -238882, -119767, 124710, -148203, 113543, -46289, 384636, -24885, 12423, -66501, 170589, 99404, -222224, 34606, 158927, 268830, -157964, -242079, -73954, 313020, -121095, 101142, 106840, 126689, -48279, -216795, -37069, -37442, 325271, -430448, -19551]
12021c5580E9403a51728B11911c8537B8219c60705C6945J0679L52583a63951B81793
12009A32969b6657l5826B41481i3533j73232J0583F1688a70263f7964B78735H2646
11997A50366p3431B9927a43669j90328a05105n3420c5125j29362H6984F343b22312
11985D6053a8878Q160A554a7191E6537c25120Q6460A26869B457d8195A92712p1503
11973A21209K4725a3343p693A02968D2417c09697B72870a70082O1626j92085e6481
11961h0862c715I6247J28901a08506A55411J4143i369m2567j46647F5870K5068
11950I0938l6758c39060g4693a8321l32565h4633M792A78031a26966c4819F8604
11938C47555n1050a00353A51324Q8367n6580d6690j16448G3636a43477D0368J4913
$$ y = [-35580, 59403, -151728, 211911, -38537, 28219, -360705, 36945, 47624, 400207, -163951, 281793, 132969, -26657, -62483, 241481, -93533, -266765, -256182, 61688, -170263, -67964, 278735, 82646, 150366, 76935, 29927, -143669, -333997, -105105, -158525, -35125, -164487, 86984, 6343, -222312, 46053, -18878, -10718, 1554, -17191, 56537, -325120, -238660, 126869, 2457, -48195, 192712, 121209, 145934, -13343, -21036, 102968, 42417, -309697, 272870, -170082, -108456, -300541, -56481, -80862, -3715, 96247, 225148, -108506, 155411, 169554, -9369, -51936, -198583, 65870, 90938, 54180, -339060, -74693, -18321, -350886, -84633, -79841, 178031, -126966, -34819, 68604, 347555, 296505, -100353, 151324, 239691, 183111, -46690, -163138, 73636, -143477, 40368, 55281]
11927E5281L5302d51818D8316a81631a0079j19549C63095j31702j822b30550i6967
11915g2884k01001b6310C59473a89677R2368A67690G8653B2307N7410K5214J71345
11904B76276F6600K38770b06069M4562g3783j78237i0367G0760d50447a75654
11893D4051b72521c9142A00842J57887H0542k6902K13952q4669Q0441c27278A5501
11881a5173A7813g3762B50190a23886N7355E7356g1413o2701j34629O6714r7022
11870b99051h1764C32769a4075j69902P3706r897l45788A49654l8338G162h8066
11858a93905k72297B53475J35355c57965e7136K7598j64853b9171r9783L2549
11848i6405k15417a39426A1890a89341Q1145C42390c73918a65094j16403A39853
$$ y = [55281, 90583, -451818, 48316, -181631, -10079, -129628, 363095, 231393, 229571, -230550, -96967, -72884, -273885, -26310, 359473, -189677, -97309, 167690, 78653, 22307, 79717, 104931, 276276, 66600, 305370, -206069, -161507, -73783, -252020, -90367, 70760, -450447, -175654, 44051, -272521, -39142, 100842, 258729, 80542, 53640, 267592, 182923, 263364, -327278, 15501, -15173, 17813, -73762, 250190, -123886, -66531, 57356, -71413, -134114, -268743, -202029, -299051, -81764, 332769, -14075, -183977, -110271, -120168, -465956, 149654, 111316, 7162, -88066, -193905, -466202, 253475, 388830, -357965, -57136, -29538, -194391, -29171, -128954, -96405, -311822, -139426, 11890, -189341, -108196, 342390, -373918, -165094, -281497, 139853]
11837b74698A08236k6111A1930b26401C4569c31187B1604d13006a73245f086k49106
11826b55192I386e24308b3612F4697J11253q6755b6058k33482n4304B72810a9220
11814b54572d9957A04367f9768n2246N6400B62136l1219a37871j4161B9102J01037
11803A30139O9066f7238j65382a13394C53123a7531B7908K67033A05388J13590
11793B18978G3181R6607n2205b19953I6684d672B58900H4678P270m1609a60444
11781A65753K35562j60871c6571A80626K36203j79104c28973i8986B93887e143
11770A12759i9199L8678F3727e3556j12754F7529B2872J16371a69840b7964A16731
11758b01870d3490q5094H9893k5243a40160E426a62732G5580L1198K34336a06450
$$ y = [-274698, 108236, 82125, 11930, -226401, 34569, -331187, 21604, -413006, -173245, -6086, -255192, 9386, -524308, -23612, 64697, 175950, 89195, -26058, -259540, -313844, 272810, -19220, -254572, -49957, 104367, -69768, -122014, -65614, 262136, 230917, -137871, -152032, 29102, 130139, 199205, -67238, -232620, -113394, 353123, -17531, 27908, 294941, 105388, 218978, 73181, 169788, 117583, -219953, 96684, -4672, 258900, 84678, 91948, 50339, -160444, 165753, 401315, 240444, -36571, 180626, 416829, 237725, -328973, -98986, 293887, -5143, 112759, -99199, -60521, 63727, -53556, -166310, 67529, 22872, 139243, -169840, -27964, 116731, -201870, -43490, -128584, 89893, 64650, -140160, 5426, -162732, 75580, 106778, 341114, -106450]
11746a85417E3945b76876M8462f8524j49698i2555o2782j15962L4462A9883K91610
11735C11493M346f0228J1891j13284O4787A57830b8379D132R853a51077D1108
11723d2450k31247J23381E4388J12891k5040k168O4362j2316P9888c5249p0600
11712a05849L6304H4141P8151j0632J04802G1480a47874B09970a90274B13781
11701a04463L460A16241e35471A18440i964o1411j23242C09141a809C48520H0506
11689c44526D2815K65449a29780B19198f3422A67554a20173a9294A2449a33313
11678A68824d7681I9504D1651b46787J13732G8982N8265d2768j49728h0003o7035
11667a47038F6296N17798a97461d4049l8472A58318P8729C8223J62197k9850G5069
$$ y = [-185417, 53945, -276876, -228414, -68524, -218222, -92555, -155337, -271299, -236837, 19883, 311493, 315839, -60228, -48337, -161621, -96834, 157830, -28379, 4132, 13985, -151077, 41108, -42450, -273697, -150316, 54388, 167279, 142239, 140071, 204433, 192117, 272005, -35249, -105849, -69545, 84141, 162292, 151660, 256462, 71480, -147874, 209970, -190274, 213781, -104463, -101003, 116241, -535471, 118440, -9964, -71375, -194617, 309141, -1809, 348520, 80506, -344526, 42815, 308264, -129780, 219198, -63422, 167554, -120173, -19294, 12449, -133313, 168824, -47681, 99504, 41651, -246787, -133055, 78982, 137247, -42768, -192496, -80003, -147038, 66296, 584094, -197461, -44049, -82521, 158318, 237047, 38223, 200420, 170570, 75069]
11655A51828K750D065a1404E1103a26980d8011G8422J30847a96876a4278j73692
11644a87970N0668A38675a11287A25379E3513n724a05978k6227B03974D6638e7354
11632C6702J69941L9834a15533D71948c7825C7200J12152a11340c9487A20153
11621a5467C1715a469C35134H9438g2869H9060a62645A61190B5747a43937R858
11610a34079D8003e6648m9460p5808L4063B0385K19254J05237A30719D0195g3791
11598H5505f5448C64811G2590b1867A9572L7458K50080a16583A8191K39817J9254
11587B77262l4311O6505k7656b4528o6512A20048N7635J4742Q668o5028d8519
11575A02166K26086A55326a01569H9182J20614b7470A39592M2859q9903J1001
$$ y = [151828, 154578, 4065, -11404, 51103, -126980, -48011, 78422, 209269, -196876, -14278, -187970, -137302, 138675, -111287, 125379, 53513, 47789, -105978, -132205, 203974, 46638, -57354, 36702, 206643, 246477, -115533, 471948, -37825, 37200, 149352, -111340, -39487, 120153, -15467, 31715, -1469, 335134, 89438, -72869, 89060, -162645, 161190, 25747, -143937, -134079, 48003, -56648, -106108, -181916, -147853, 20385, 239639, 344876, 130719, 40195, -73791, 85505, -65448, 364811, 72590, -21867, 19572, 57030, 307110, -116583, 18191, 258008, 277262, 242951, 309456, 281800, -24528, -91040, 120048, 177683, 192425, 201093, 136065, -48519, 102166, 328252, 155326, -101569, 89182, 209796, -27470, 139592, 182451, 92548, 103549]
11565A03549O2035E5689J44233M09733e967n46r9439A14150C9529N7577a38025
11553B5780K37411a07847A40310a68257N736N9234B22936k3948a66579o1319b4372
11541B85711a9200D0911K36956D5014a0863I9488a34568A39501J49797A37333
11530d9879f638A69442a6895A07581a15585e2533C31863J07209j68191K00224
11520D71105k21478j1806A00318B0871J08603J85685c203A18545f4576K8677l1750
11509f7649D65167A55566c3195H8482A0415h372B29566H1035N7209E8194K3249
11498H1443L61763A66579J15235c26590C67999j43741Q5893b9145r3049A72525
11487d6873k13311E55168B09199L6927J49105q3362G3748P2955m3204b3390I3274
$$ y = [103549, 165584, 55689, 199922, 609655, -5967, -6513, -105952, 114150, 39529, 97106, -138025, 25780, 263191, -107847, 140310, -168257, -162521, -103287, 222936, 198988, -166579, -227898, -24372, 285711, -19200, 40911, 277867, 45014, -10863, 99488, -134568, 139501, 289298, 137333, -49879, -6638, 169442, -16895, 107581, -115585, -52533, 331863, 439072, 270881, 471105, 249627, 237821, 100318, 20871, 129474, 315159, -3203, 118545, -64576, -35899, -67649, 465167, 155566, -33195, 88482, 10415, -8372, 229566, 81035, 138244, 58194, 81443, 443206, 166579, 281814, -326590, 367999, 224258, 310151, -29145, -122194, 172525, -46873, -260184, 555168, 209199, 246126, 395231, 311869, 73748, 146703, 103499, -23390, 93274]
11475B12598a60376F3850J01719b7133A77262J50765P3230A78968J64839j51573
11465A92234a2521r8623B63339J61985E1387O8707A7666J02360a13068B28449
11454B38997n8271a28397H879J5771K87129L105D808K05284I0144d2831A65087
11442I0566A8673J09743h3611r6538I047P0462F81P602Q3487M9781B6518K25087
11430B51605C1933P6763A8810b43961N6914c8272A865M3181a2865m5441A39027
11418e1491j08908C81873G7770d5945J9988j37806A17895a57953N8012c592k09719
11407b13311C45500b33470B03277r4987C6412d31271J63101C56612k4850D8826
11396C18835A13152P929K93845a6524k55490B78489l5880i467j78275k4638E9582
$$ y = [212598, -160376, 63850, 165569, -27133, 177262, 328027, 401257, 178968, 343807, 192234, -12521, -111144, 263339, 425324, 51387, 120094, 17666, 120026, -113068, 228449, 238997, 180726, -128397, 8879, 24650, 311779, 314884, 4808, 210092, 90144, -42831, 165087, 90566, 18673, 128416, -83611, -180149, 9047, 79509, 681, 8283, 91770, 141551, 26518, 251605, 31933, 108696, 18810, -243961, -187047, -38272, 1865, 45046, -12865, -58306, 139027, -51491, -160399, 381873, 77770, -45945, -25957, -163763, 117895, -157953, -99941, -3592, -213311, 345500, -233470, 203277, 108290, 36412, -431271, -268170, 356612, 331762, 48826, 318835, 113152, 121081, 414926, -16524, -272014, 278489, 242609, -9467, -187742, -212380, 59582]
11384A09353J37913a37378B6623a18330F9834f4867B69084f7236I3852L5230g1758
11372a61095k6802q2408g0976j99096M9394A87802d07427C8592a81560c9079B01989
11360b0262F6869k9952P5563a02730k4105O2500H5581f2002F6250K28125a03291
11348B55979b41111i4367j22140B37115g4183A60665P1248a21913L0992K7946
11338f2975l683E1213c3466A09087a3552A38216f8782B51402b3033k761q680n4181
11326h8655L3447A89020a66430B26499l773H7580g6627E1919K8618g8980G8619
11314C5383a66621K9820M1491A78564d0962C22414c11197L0969P6042D4936h7397
11302C5136b29176j03432N9286B73819b2184A80197R8840c3766m1658B33362A12071
$$ y = [109353, 247266, -137378, 26623, -118330, 69834, -64867, 269084, -67236, 93852, 129082, -71758, -161095, -187897, -270305, -70976, -270072, -220678, 187802, -407427, 38592, -181560, -39079, 201989, -20262, 66869, 36917, 112480, -102730, -126835, -64335, 85581, -62002, 66250, 294375, -103291, 255979, -241111, -94367, -216507, 237115, -74183, 160665, 231913, -121913, -90921, -62975, -66658, 51213, -33466, 109087, -13552, 138216, -68782, 251402, -23033, -25794, -34474, -88655, -55208, 189020, -166430, 226499, 222726, 87580, -76627, 51919, 80537, -78980, 78619, 35383, -166621, -136801, -95310, 178564, -40962, 322414, -311197, -280228, -204186, 44936, -87397, 35136, -229176, -332608, -273322, 273819, -22184, 180197, 279037, -33766, -75424, 233362, 112071]
11290B34248i3948k71044g755n1538A33850O9587a32906k7702B50825H7051a28666
11278A78435D5073a26738j15292B24160n1438b422I4632a11930D916g6006A93678
11266d5402F3336c11721c7067B6988q301J4538R3528a08004l2834c9346j44291
11255a83637M0405k0215K4857p7505A16433P2785c9125j12112J1146Q213J642
11244a30236b7676A9445i3785j07146I9769Q9868A4532a98128B75577c8826n0334
11233h9160L8888j19758Q575d7917G2463g1773B16118c05110L7246B04404a56966
11221b64812M539o3973A59685i8337d8367A42497K1533J878a80029H0720a86061
11209G3371a01258K0601D7349b39947i8601l162A04195f1259A70801H086o88d45663
$$ y = [234248, -93948, -364992, -7755, -59293, 133850, 203437, -132906, -160608, 250825, 87051, -128666, 178435, 45073, -126738, -242030, 224160, 172722, -2422, 94632, -111930, 4916, -76006, 193678, -45402, 63336, -311721, -37067, 26988, 18687, 33225, 126753, -108004, -140838, -39346, -183637, -143232, -163447, -138590, -216095, 116433, 189218, -39125, -151237, -140091, -131878, -130236, -27676, 19445, -93785, -200931, 99769, 189637, 14532, -198128, 275577, -38826, -89160, -50272, -170030, -161455, -47917, 72463, -71773, 216118, -305110, -267864, 204404, -156966, -264812, -260273, -324246, 159685, -98337, -48367, 142497, 164030, 165908, -180029, 80720, -186061, 73371, -101258, -80657, 47349, -239947, -98601, -101763, 104195, -61259, 170801, 8086, 7398, -445663]
11196B0130J7352d46918B0711a05402D7585a06942A41787N5435D6521c07718F4708
11184g6621m7078d7910l7823j63821a21264B07985j5382b05181o099G0393a59844
11172B60404c9671A1241J75169M1966b70763N7097g2946L2575A55837m0915J29096
11161B44018g4153m3001L6645j01551k29067C8526Q6635k4604h1142o544k83948
11150c71634B46043B1522g1919M434r1763B36430F9354M2236a90689h9483k10718
11139c00201B8941J20405p398J5258b41795F9495A9844J45181m5218a950m6190
11128d8140B23162e2719A45958j3341d00536e2211B02170l5297i3331r1524B94555
11116G3274a32996B3265i5360I0239Q926a19450b1717A56302k7755J57660A863
$$ y = [20130, 37482, -446918, 20711, -105402, 47585, -106942, 141787, 197222, 46521, -307718, 64708, -76621, -123699, -47910, -85733, -249554, -121264, 207985, 192603, -205181, -211280, 70393, -159844, 260404, -39671, 11241, 186410, 228376, -270763, -213666, -72946, -40371, 155837, 114922, 244018, -74153, -117154, -80509, -182060, -411127, 38526, 125161, 100557, -81142, -87686, -371634, 246043, 21522, -71919, -67485, -159248, 236430, 69354, 111590, -190689, -89483, -300201, 28941, 149346, 141948, 157206, -241795, 69495, 19844, 165025, 119807, -1950, -48140, 223162, -52719, 145958, 132617, -400536, -52211, 202170, 166873, -93331, -184855, 294555, 73274, -132996, 23265, -95360, 90239, 99165, -119450, -21717, 156302, 128547, 286207, 1863]
11104B09569n8168R853J00427J21404j34752R5567j09796A0206J39326a3037j07107
11093a20144B72849j16139J54519F5661N05623B69985R2037j71222K4130J72808
11083C87738F6710K11538E8072M43799h4625A51401K39910A00216L11313M0716
11073D52245j33792J51582A23661J39246K70351k46867K12315J00952j69064q809
11063D21785K30995l18062j27661J98771J57048K88823N7253l12703J02311N2931
11053G51491k77403M05602K4239k01312k33974M87096j8535k02101J61644j93063
11043G03684P2593k73494L41130l23427M00229m47506M07891k91581M3197B25931
11032H67306Q9745m27626q8545N26859l84696K21824J30279j34983k7485l80568
$$ y = [209569, 151401, 161254, 261681, 383085, 248333, 343900, 234104, 10206, 149532, -13037, -120144, 272849, 156710, 311229, 65661, 571284, 269985, 362022, 190800, 214930, 387738, 66710, 278248, 58072, 501871, -84625, 151401, 391311, 100216, 411529, 452245, 318453, 470035, 123661, 262907, 533258, 286391, 498706, 599658, 430594, 421785, 652780, 334718, 207057, 405828, 562876, 851699, 908952, 596249, 698560, 751491, 474088, 879690, 903929, 702617, 468643, 955739, 937204, 735103, 896747, 703684, 776277, 502783, 843913, 520486, 920715, 473209, 881100, 589519, 632716, 225931, 867306, 957051, 529425, 440880, 967739, 583043, 804867, 935146, 800163, 772678, 392110]
11022C92110L43606l276k92387J55194K68636Q6958l33402j79395J54550J22224
11012G14818j33416J07726p7928j79036O1285K31893J45319k25034J4678B14796
11001A050026n06791R686J84706j30389J04369k42693L89167k55382J82727J11897
10991H97323j43794J6393j68586K52885J57406r1049O8509J53119n02257M90015
10981A129964q8405K25016m9505K79342l96215P50112n8079N96020J46365K10214
10971B744829k4169L3768r3105j68635k14294l4857n18599O1823J29333n9933
10961A856161j94977J46741j77155J09401J4432m4394L85304n03244j97157J27058
10951A522170r6675l72663J1339m27412j29596M3923K0021j39546n0592I0214
$$ y = [392110, 735716, 732440, 440053, 595247, 863883, 950841, 617439, 438044, 592594, 714818, 581402, 689128, 611200, 432164, 493449, 725342, 870661, 645627, 660305, 214796, 1050026, 543235, 552921, 737627, 607238, 711607, 468914, 858081, 602699, 785426, 897323, 753529, 769922, 601336, 854221, 1011627, 920578, 989087, 1142206, 639949, 1129964, 1041559, 1266575, 1217070, 1496412, 1100197, 1850309, 1792230, 2388250, 2534615, 2744829, 2720660, 2754428, 2661323, 2492688, 2278394, 2243537, 1724938, 1786761, 1916094, 1856161, 1661184, 1807925, 1630770, 1740171, 1754603, 1710209, 2095513, 1592269, 1395112, 1522170, 1425495, 1052832, 1064171, 636759, 507163, 551086, 571107, 431561, 380969, 90214]
10940B58810j01288i0691B04292b21891D00787j49070f9916C86242A37777a70945
10929A8295b97j36301b2912j19235A51309b5514j96444b3954A52632b0919I4576
10917A47386D0902L09278A23562a4874A23180K4875b8955A0318J45897h3840n8926
10906a42766D7690b18232A78450n0296r10J00496G3957K26453B9691a21159r7431
10895b18590B43J04647j5874L6246M7787B0613a67537B6280L27752a5914o4815
10884h0729K9112A09151a79400B8120K81647A16035g9896G9553a12775A35950
10873B9828a93320E9542a51428o1414K6315A58058J01414q3421O834n8886h1745
10861B52900A14351c9290p0858k78169E0165A0251i2307A3385J18054o3644M38368
$$ y = [258810, 157522, -90691, 204292, -221891, 400787, 251717, -69916, 386242, 137777, -170945, 18295, -297, -136598, -22912, -142147, 151309, -25514, -221958, -23954, 152632, -20919, 94576, 147386, 40902, 350180, 123562, -14874, 123180, 148055, -28955, 10318, 156215, -83840, -142766, 47690, -218232, 178450, 128154, 127244, 227740, 73957, 300410, 29691, -121159, -218590, 243, 104890, 89016, 125262, 173049, 20613, -167537, 26280, 354032, -15914, -80729, -51617, 109151, -179400, 28120, 309767, 116035, -79896, 79553, -112775, 135950, 29828, -193320, 59542, -151428, -212842, -186527, 158058, 259472, 176051, 182885, 123999, -81745, 252900, 114351, -39290, -110148, -388317, 50165, 10251, -92307, 13385, 131439, 67795, 506163]
10850E06163B1852c5532A25612c0409D36619E7967f9264A14482a39393B89169
10839a90261j41390G882f1160B84227a42711f2606p0133C62143h0602A01631b11289
10827i0224M2941j7803m23283d5508k53811a13971n10j65674C1549J43580m5923
10816A29206a4993A14062b37934J8652j6506i3468d582G8479b89172a01180C59732
10804B04951b70979I5225e2353e665D2012h6696J1214k86907a08969A65146e3056
10792D07411a53971H4103K47659a99385P867Q7342K2950k1541n3265A20644e1280
10780a60545j24086a12428d3745a3819l35046P6211L9699H6632l6310a95894B11275
10768C3160J85495c73536M3901J08060n6758h0051o2814B53864d53820b24433
$$ y = [506163, 21852, -35532, 125612, -30409, 436619, 57967, -69264, 114482, -139393, 289169, -190261, -331651, 7882, -61160, 284227, -142711, -62606, -132739, 362143, -80602, 101631, -211289, -90224, -47283, -65086, -488369, -45508, -299319, -113971, -114481, -280155, 31549, 175129, 129206, -14993, 114062, -237934, -219282, -235788, -93468, -4582, 78479, -289172, -101180, 359732, 204951, -270979, 95225, -52353, -5665, 42012, -86696, -75482, -362389, -108969, 165146, -53056, 407411, -153971, 84103, 331762, -199385, -191518, -104176, -81226, -102767, -156032, 120644, -51280, -160545, -284631, -112428, -43745, -13819, -348865, -272654, -232955, 86632, 50322, -195894, 211275, 33160, 218655, -373536, -329635, -221575, -278333, -80051, -142865, 253864, -453820, -224433]
10757a26597Q378b6188k40092A98448d22214a74093H8778f5348I7559a46701A5420
10745b1315p2687j22813E4721g7055J2420j8333i724A73934a71641D0168K06275
10734B46443a4298C6068m848g5523C50395I4569j1780b1325E6727b02153j4353
10723b16506D5919K03813j6727b37144f3453A27394c67634a82565h1622b1491
10712d94327A25076b05433B08939M9141a26647o5425p8896E7141b49492A18080
10701a32995L129A80759a29960M2668C07514E4747a55416l4315J119A15639J40425
10690B56064a51656C70367g9296j13989B20029D0349j2819K5818M6454D5799b26300
10678a66918d4215j66176b2426A48899K9786b1658k3525l9135k2182D6175e5429
$$ y = [-126597, -118219, -26188, -266280, 198448, -422214, -174093, 88778, -65348, 97559, -146701, 15420, -21315, -94002, -216815, 54721, -77055, -64635, -82968, -9724, 173934, -171641, 40168, 246443, -14298, 36068, 31220, -75523, 350395, 94569, 82789, -21325, 56727, -202153, -216506, 45919, 249732, 233005, -237144, -63453, 127394, -367634, -182565, -81622, -21491, -494327, 125076, -205433, 208939, 258080, -126647, -192072, -270968, 57141, -249492, 118080, -132995, -129866, 180759, -129960, -87292, 307514, 54747, -155416, -189731, -188612, 115639, 256064, -151656, 370367, -79296, -193285, 220029, 40349, 27530, 53348, 99802, 45799, -226300, -166918, -44215, -210391, -22426, 148899, 178685, -21658, -45183, -84318, -106500, 46175, -55429]
10666c23251A75170a25896i559j2390l31207d3463j04369A29389a45745k74386
10656d20131I4026b41058A60539a7693q8510A84399H6495L78327c44711C35188
10645a54660A12951a81558F1239A0751R0730F241b3053o5836D63990h5316A0752
10633d905H9885m3380b06157A46965G919J81273c47842A65341B4209a68915e9483
10621b59229a0143m43745B58143a26689A08019B5998a19486B42475A0729J46825
10611A57554F0600Q738J00790F0244R4724A7254d55731E3332K977b51681j1583
10600b63264M5103g708B43860b16816e4488A6316a04115j16435O7248g5013c7157
10588a83675A9758b25088B61220p6030M9952l6401d6259j3558F3586k9586b74978
$$ y = [-323251, 175170, -125896, -9559, -21949, -353156, -43463, -147832, 129389, -145745, -420131, 94026, -241058, 160539, -17693, -106203, 184399, 86495, 464822, -344711, 335188, -154660, 112951, -181558, 61239, 10751, 101481, 6241, -23053, -88889, 463990, -85316, 10752, -4905, 89885, 46505, -206157, 146965, 7919, 189192, -347842, 165341, 24209, -168915, -59483, -259229, -10143, -453888, 258143, -126689, 108019, 25998, -119486, 242475, 10729, 157554, 60600, 69338, 170128, 60244, 154968, 17254, -455731, 53332, 56309, -251681, -263264, -218161, -7708, 243860, -216816, -54488, 16316, -104115, -220550, -153302, -75013, -37157, -183675, 19758, -225088, 261220, 185190, 235142, 198741, -46259, -59817, 63586, 34000, -274978]
10576a45283m706J7311d5341D37768e2367j75008A5073Q4639a4468A91852C5405
10564b82175d1427F5051a88349J3452B67937M5010B2130b75875N0101a01609A08928
10552f6580r6029d7434q900A18292b05378j69932J86034P3883k25699A3682J03592
10541A17274c34827M2832A25138b70486E0032m727h0131j52393A42371g9863k31416
10530c11279J45597A07944b32717A6299d66604b16960A30305r049b54662o1513
10520c16175a22964j75581A22152g0310r1652k7039i665C37550j02438k3501B3287
10508a96394C53043A66576b74188d6689C6025R6645J68607a97103e1179B03962
10497d49723K09382E1741b28433R4251D9113a5471H2647c05382a28943C26242
$$ y = [-145283, -149989, -132678, -45341, 437768, -52367, -227375, 15073, 99712, -14468, 191852, 35405, -282175, -41427, 65051, -188349, -174897, 267937, 312947, 22130, -275875, -225774, -101609, 108928, -66580, -162609, -47434, -56334, 118292, -205378, -375310, -189276, -115393, -341092, 13682, 117274, -334827, -291995, 125138, -270486, 50032, 45305, -80131, -232524, 142371, -79863, -311279, -165682, 107944, -232717, 16299, -466604, -216960, 130305, 121256, -254662, -316175, -122964, -298545, 122152, -70310, -161962, -189001, -9665, 337550, 235112, 211611, 23287, -196394, 353043, 166576, -274188, -46689, 36025, 132670, 301277, -197103, -51179, 203962, -449723, -240341, 51741, -228433, -134182, 49113, -15471, 82647, -305382, -128943, 326242]
10486c301A42085J9858a76644B85107M7576J58146q1455L06957k38457B21085
10475a78786A1076b45253a14047A6900b08687A40127a40500A0393i2483j0097
10465a02580k01074A24860c9064n7092l6112c6815j16451A73326a852B7892a01326
10453d2859j2402r4561E2213d8420l6983B08024a68531A44219c20338A00095a38887
10441c9977B7656J72622C6643m237A2139b70593D9396c335k24319A18229b65989
10429C38403l1815a65066C1242b74699A09336b31295O7626B08310b89571O6727
10419b22844D5109a35698e2997k53356E8362A354b37181C88147a07504B93968
10408g5905K3604C20655a86788B89710c4947j04976j61725A9774J08006K0315
$$ y = [-3301, 142085, 161943, -176644, 285107, 332683, 490829, 409374, 716331, 477874, 221085, -178786, 11076, -245253, -114047, 16900, -208687, 140127, -140500, 10393, -92483, -102580, -303654, 124860, -39064, -96156, -132268, -36815, -153266, 173326, -1852, 27892, -101326, -42859, -55261, -149822, 52213, -48420, -85403, 208024, -168531, 144219, -320338, 100095, -138887, -39977, 27656, 200278, 36643, 32406, 12139, -270593, 49396, -3335, -227654, 118229, -265989, 338403, 306588, -165066, 31242, -274699, 109336, -231295, -163669, 208310, -289571, -222844, 45109, -135698, -52997, -306353, 58362, 1354, -237181, 388147, -107504, 293968, -75905, -52301, 320655, -186788, 289710, -34947, -139923, -301648, 19774, 127780, 148095]
10398A48095J39749H4843k6126R7782a36445a476H0114K29361F623R0252K94110
10387C90985b0629f16C92813a06092l6102C4590Q1006n3292J89106i8708B31610
10375B65053q4942b46223C0245K39861A32063m7596L6964K50682J42544J21920
10365F36577A67464K12379j47019m8048M52356A24275J59863J39993b3206F30054
10354C40611j69988J72602O7963K5577J65495j26178R7156g0381C33175j32645
10344B00530J93148m1464p9922q005H6080L64604j65045J23632D8452e1139j03929
10333a55068A66337P6305F7886L01727b17151F2544A9041d4338A2688f4156B44568
10321C07631J79736R4013j06532B13903k9728J42664o784r0868A0135P3136Q0037
$$ y = [148095, 287844, 84843, 58717, 156499, -136445, -1476, 80114, 309475, 6623, 96875, 390985, -20629, -616, 392813, -106092, -142194, 34590, 115596, 62304, 251410, -98708, 231610, 265053, 180111, -246223, 30245, 270106, 132063, 84467, 121431, 372113, 514657, 636577, 167464, 379843, 232824, 184776, 637132, 124275, 284138, 424131, -23206, 630054, 340611, 170623, 343225, 411188, 436765, 602260, 476082, 573238, -70381, 333175, 200530, 393678, 352214, 272292, 264287, 86080, 450684, 285639, 409271, 48452, -51139, -155068, 166337, 242642, 67886, 369613, -217151, 62544, 19041, -44338, 12688, -64156, 244568, 307631, 487367, 581380, 474848, 213903, 184175, 326839, 320055, 229187, 10135, 83271, 163308]
10310A63308a74006A14974j3877a63882a3355H5759R6674b32194G3469K9950N1717
10299A55136K32779a25972p7609f0372B3074b65236J18848A45824p2203b22721
10288A33751Q9790b5176k5103j70675f468n2613m1902j32325A19823A8241K30436
10277B48677i4662l9108d4784q4592b1220p0928G0768i4126C18662j36703a82961
10265b58567B28261a04750b8425p9565B96631F0727J01481a81654A16074E5343
10254C55221N9738f0012C3058J42676i7576F5138P6497b69152a04559r3318A80820
10242A12626K15627C862f0997k78634a17753m101j87419a06405A1131b97047a31118
10230a86252O0295e0210p4058B56373c59308A22206h7878j70175Q5607j08798
$$ y = [163308, -174006, 114974, 101097, -163882, -13355, 85759, 182433, -232194, 73469, 103419, 155136, 387915, -125972, -203581, -60372, 23074, -265236, -146388, 145824, 73621, -222721, 133751, 223541, -25176, -50279, -220954, -6468, -59081, -100983, -233308, 119823, 18241, 248677, -94662, -133770, -44784, -129376, -21220, -92148, 70768, -94126, 318662, 181959, -182961, -258567, 228261, -104750, -28425, -107990, 296631, 60727, 162208, -181654, 116074, 55343, 355221, 414959, -60012, 33058, 175734, -97576, 65138, 141635, -269152, -104559, -197877, 180820, 112626, 328253, 3862, -60997, -339631, -117753, -121854, -309273, -106405, 11131, -297047, -131118, -186252, -125957, -50210, -124268, 256373, -359308, 122206, -87878, -258053, -172446, -281244]
10220b81244A84608c96250J42463j0804l82094A40880c40500c5497j72398C4375
10209B34246R6490A47941j393h1296G9501b51828f615A19319g0075b4921n5933
10198h0854k74340c9800j38464J223A01571a17992j48592A20835b56419f5677
10187f1517C56626a53025L1605A02250J05486E1348k1487c86079G2320a46236
10176c77767h0634A13320e4641C6230g6329j05778q153N2010J4050p4549K7634
10165a71115A27972e0400H2929M35984c9445j50972j55544I1027b4768A22549
10154c44510J31230f7006A57739a09242j2580B64488b08033K4023A84753d3174
10143a28102A40910f5052k29898B1845a06997d1202j07441F4244J48991i4850
$$ y = [-281244, 184608, -396250, -253787, -264591, -646685, 140880, -340500, -35497, -207895, 34375, 234246, 330736, 147941, 146548, -81296, 79501, -251828, -6615, 119319, -70075, -24921, -80854, -355194, -39800, -178264, -177041, 101571, -117992, -266584, 120835, -256419, -65677, -61517, 356626, -153025, -121420, 102250, 207736, 51348, 29861, -386079, 72320, -146236, -377767, -80634, 113320, -54641, 36230, -76329, -182107, -190260, -138250, -124200, -198749, -171115, 127972, -50400, 82929, 518913, -39445, -190417, -345961, 91027, -24768, 122549, -344510, -213280, -67006, 157739, -109242, -121822, 264488, -208033, -184010, 184753, -43174, -128102, 140910, -65052, -294950, 21845, -106997, -41202, -148643, 64244, 213235, -94850]
10132a11941i362A47212a17550H4902a07867A78357E4229O8591c75801A83303
10121a76852N3804p6621k1283I6734m6611J5233a70587C5003J67182i4866k11412
10110c06278G4043e0884j91249E0823b8243k246B77897b43850A79519c54856a25296
10098H4807M2324b09633i1018r5010p7552B6053J31548c115j03986L675A40781
10086a66817B48803d05832R7876C43564d92121b31214A49959a34920k41914a32611
10075C16320D4219R0763a69768O8266j05786f9512k02803j66394A22191c1576
10064a48762j49074A82196J9038a56438P2241A83257A6734a4248k18726A3382
10053b20725Q9182k7008A30205b1838B4436c5299D7392a12507k00906J45564g2033
$$ y = [-111941, -9362, 147212, -117550, 84902, -107867, 178357, 54229, 122820, -375801, 183303, -176852, -123048, -199669, -220952, 96734, 50123, 65356, -170587, 35003, 202185, -94866, -306278, 74043, -50884, -242133, 50823, -28243, -30489, 277897, -243850, 179519, -354856, -125296, 84807, 127131, -209633, -91018, -186028, -263580, 26053, 157601, -3115, -107101, -103426, 140781, -166817, 248803, -405832, -307956, 343564, -492121, -231214, 149959, -134920, -376834, -132611, 316320, 44219, 134982, -169768, -101502, -207288, -69512, -272315, -438709, 122191, -31576, -148762, -297836, 182196, 201234, -156438, -84197, 183257, 16734, -14248, -232974, 13382, -220725, -131543, -158551, 130205, -21838, 24436, -35299, 47392, -112507, -313413, -167849, -72033]
10041A09375L8425b22736N1133d6260J3879l24026i4591j70182K5554i7707j07598
10030b05305p9686O9493R8045E9182c73679I207d6636k32576A9265N5443a32418
10018I7055O6060a46623m5273J5435p1670F540b8674n8887A01596a11669c3644
10006a52347j5099D9643J07471a42010A92420d5745j69632E2693a27485E2691
9995i741j55493C05931a22495j66931B49975F2285b14918j3113i0026k69722a17842
9983D06794a28924o3187R0188m1348B92734D7183J66584i3695D3671b34168k67094
9972e01262A52858O75B063i9861k55596A3084M36866a0170k86819f2761p1388
9961a34149b1957k73751a42139A60549b23711i7120G3448K4151f708F1477c03314
$$ y = [109375, 147800, -222736, -171603, -46260, -32381, -356407, -94591, -264773, -239219, -97707, -205305, -284991, -215498, -117453, 59182, -373679, 9207, -46636, -279212, 19265, 74708, -132418, 97055, 163115, -146623, -191896, -176461, -248131, 6540, -28674, -87561, 101596, -111669, -33644, -152347, -167446, 49643, 157114, -142010, 192420, -45745, -215377, 52693, -127485, 52691, -9741, -165234, 305931, -122495, -289426, 249975, 62285, -214918, -228031, -90026, -359748, -117842, 406794, -128924, -192111, -101923, -143271, 292734, 47183, 213767, -93695, 43671, -234168, -501262, 152858, 153533, 2063, -99861, -355457, 13084, 449950, -10170, -296989, -62761, -134149, -21957, -295708, -142139, 160549, -223711, -97120, 73448, 97599, -6708, 61477, -303314]
9949a48473b2408P451k66326A1868d3868A6412a8616j69955m4390B44240i2746
9937B60337b73664J35902G5383c04600E7568P8669J26111A8088a25697H0350a88947
9925g7399B04256a27303k13610J04470A79404e1541E6531c02539J07857P3077
9915a21605B2426a83435o0737g9300j03553a0404j23158e8390k9694m1636R314
9904a20406j40794M2655A39508c4948k15287c6972l64038A1529N1885c05894g5188
9892a22195A57725J2343c66382f9891B14549a21119I4217b63190A7508B47a97273
9880a14270N6385i067r7526i209l9365k09508J21100F3681i2713K3451B3548g7991
9867e8464n08143b01913R7718C6419j4836c15334a54873a8893o0836l7898j26976
$$ y = [-148473, -22408, -14957, -281283, 11868, -43868, 16412, -18616, -188571, -232961, 244240, -92746, 260337, -273664, -137762, 75383, -304600, 57568, 136237, 262348, 18088, -125697, 80350, -188947, -77399, 204256, -127303, -340913, -236443, 179404, -51541, 56531, -302539, -194682, -121605, 22426, -183435, -244172, -79300, -182853, -10404, -133562, -58390, -88084, -129720, -120406, -261200, -218545, 139508, -34948, -250235, -36972, -401010, 11529, 63414, -305894, -75188, -122195, 157725, 170068, -366382, -69891, 214549, -121119, 94217, -263190, 17508, 247, -197273, -114270, -57885, -9067, -106593, -9209, -48574, -258082, -136982, 63681, -92713, -69262, 23548, -77991, -58464, -566607, -201913, -104195, 36419, 21583, -315334, -154873, -18893, -79729, -117627, -244603]
9856b44603g135H2248a19318e1350A08219k0388a86790A8142b00428I8070j1603
9845H6467c564E4163N2336J41860b86046M7147k3821E6062b74110i1630p4010
9834a65640A31556E1242b19574r145L6052f1657l6022B39647a41900J4199j08128
9823b35829d3952E9479c02350a2674l9456r0470j41176H1686b86039a42176O3749
9812g8427L4284j26613M7276k557A25111f7940p5467a1267E2954r438b94409E64929
9799A57186b46394A8059M6639M946b37046a2159k5544l4168a0044k73678A74450
9787a06301B82454A16549d08950a25046K8328G1126a82399h5318A36909n2986
9777H3923b2137B66286a10159m45462h3830K4824G2491c69021a82397Q9465p2891
$$ y = [-244603, -7135, 82248, -119318, -51350, 108219, 87831, -186790, 18142, -200428, 98070, 86467, -3564, 54163, 106499, 248359, -286046, -238899, -262720, 56062, -274110, -91630, -165640, 131556, 51242, -219574, -228719, -192667, -61657, -97679, 239647, -141900, -127701, -235829, -43952, 59479, -302350, -12674, -52130, -142600, -283776, 81686, -286039, -142176, -78427, -44143, -170756, -123480, -126037, 125111, -67940, -143407, -11267, 52954, 43516, -294409, 564929, 157186, -246394, 18059, 64698, 69644, -237046, -12159, -37703, -71871, -10044, -283722, 174450, -106301, 282454, 116549, -408950, -125046, -96718, 71126, -182399, -85318, 136909, 83923, -22137, 266286, -110159, -555621, -83830, -59006, 72491, -369021, -182397, -92932, -165823]
9766a65823A72890J84837C4755b36742N4512Q1792d4954D8159J1884b45329N0570
9755a94759h3154D748Q5951a3999k29602I3423c00598A4794c80498i0085c7404
9743c59622J69120j18821A55216c2986J3435m9502j94616J3569j7548A6843b15059
9731B14613a66972j28289A57924a4637o5611j33338a0643k63960I6328a870B07639
9719a50317C9802a02260A00392i1354E6596K15850M245e5928r5331c352A38946
9707e004k99908b5718j86018C9679K53218b59058J05330r748g0265j11313N8393
9696a23185A14400m3301a36081D984J51184R4913a01381A3904O0067i9704l18775
9685d18479a44380j47446L3709i310B4069a00284j16709A75913a0870j75997A74719
$$ y = [-165823, 172890, 357727, 34755, -236742, -182230, -100438, -44954, 48159, 60043, -245329, -194759, -83154, 4748, 90699, -13999, -243601, 93423, -300598, 14794, -380498, -90085, -37404, -359622, -190502, -309323, 155216, -32986, -19551, -69053, -263669, -250100, -267648, 16843, -215059, 214613, -166972, -295261, 157924, -14637, -80248, -213586, -10643, -274603, 96328, -1870, 207639, -150317, 39802, -102260, 100392, -91354, 56596, 272446, 276691, -55928, -151259, -3352, 138946, -5004, -304912, -25718, -211736, 39679, 292897, -259058, -153728, -163476, -70265, -181578, -123185, 114400, 71099, -136081, 4984, 156168, 251081, -101381, 13904, 73971, -99704, -418479, -144380, -291826, -258117, -9310, 24069, -100284, -216993, 175913, -10870, -186867, 174719]
9673C9956a03321B74153E0624a43880j94585E233c8665A26301A9181Q1992b65998
9661B26953o0616F6203f146j67400P2146B2187d56182A824b2584q6413j97826
9650c06823A15775C4919d6416j22795A77403J08394a70724h4083q6546A47716
9639C030b17470D38729A36669e0268k03666O7202A01553l6457d6644B7650e0043
9627A1397a04185n31988b89326d0594o7626l623A17192K5300o4173g7966A32182
9615a30846n7650j26532A36480b40591g8445H1017e20525A3079g651k47718a02671
9603i4663c478n10946d6970q189r0403j43823A82286a88070k65183J02047h2918
9591b34234r5167N9224G2265e0937G7232C4354K85167A6954Q098e79783a64848
$$ y = [39956, -103321, 274153, 50624, -143880, -338465, 5233, -38665, 126301, 19181, 101173, -265998, 226953, 166337, 66203, -6146, -173546, -101400, 22187, -456182, 1824, -22584, -108997, -306823, 115775, 34919, -46416, -169211, 177403, 285797, -170724, -84083, -170629, 147716, 3030, -217470, 438729, 136669, -50268, -253934, -186732, 101553, 65096, -46644, 27650, -50043, 11397, -104185, -636173, -289326, -40594, -108220, -111843, 117192, 142492, 78319, -77966, 132182, -130846, -188496, -315028, 136480, -240591, -78445, 81017, -520525, 13079, -7651, -255369, -102671, -94663, -3478, -514424, -46970, -55159, -145562, -289385, 182286, -188070, -453253, -351206, -82918, -234234, -329401, -270177, 72265, -50937, 77232, 34354, 319521, 16954, 25052, -579783, -164848]
9579H2946h8800A89738C0929L880M87298a06378k58696f637q981A49156a52988
9567d09680B3175q577a33244k9658A27322a285k46352A22959c5580k76493Q4284
9556b27789N4364H266f4177A03861Q9068k3014a10795B43100G5101P316b03354
9544B3802c28846I7432d17092a59383r6938g4936A40963b67114A70906k6704e5115
9532b55511J18208O3771r9139c983I8707C1161b8169C09729d80588B9481j3756
9521A5725b06886o3196c0663N603A46878h167A75854a66485A32185B3388a3036
9509c1939G5384a99812i2673B03639a3306m4024A6768c03259A40624a4192G0006
9497i2851k09214A47303m2837a0243o6515j47160A89046a96895l5235h607C75774
$$ y = [82946, -88800, 189738, 30929, 34809, 522107, -106378, -365074, -6637, -15618, 149156, -152988, -409680, 23175, 14598, -133244, -162902, 127322, -1285, -247637, 122959, -35580, -312073, -227789, -173425, 8266, -64177, 103861, 192929, 169915, -110795, 243100, 75101, 82417, -203354, 23802, -328846, 97432, -417092, -159383, -256321, -74936, 140963, -267114, 170906, 144202, -55115, -255511, -137303, -73532, -172671, -3983, 98707, 31161, -28169, 309729, -480588, 29481, 15725, -206886, -270082, -30663, -25060, 146878, -8167, 175854, -166485, 132185, 23388, -13036, -31939, 75384, -199812, -92673, 203639, -13306, -57330, 16768, -303259, 140624, -14192, 70006, -92851, -302065, 147303, 104466, -10243, -76758, -223918, 189046, -196895, -232130, -8607, 375774]
9485g0305H9158J07366f3180A42115a70711E114a92964H3106c108k48109h1205
9473a1178m3188F7211a23832B3320a49444A20168i8345k9482C04931a15403j0495
9462a25898m15056K42318A93934d286n332l28094h2532l30245E6560i4676q2912
9451a77588h7897B31595b56958a16872A26695b55509A62797a54763f8247A09017
9440b63375k09020A14824b45209O9093k54223C7177a39820B8088b25089l882N9191
9429a69780L2906A0445O8286a84316c524A8798d4272A33531a23584m6383d6307
9417B6854d13414G0925j4890e33365a32409j30891E2936P5839g2173j56122b0633
9405A68544g8725C285K37814q4104Q7264B5335a2393o6094D1419a88588b4887
$$ y = [-70305, 89158, 196524, -63180, 142115, -170711, 5114, -192964, 83106, -3108, -251217, -81205, -11178, -54366, 67211, -123832, 23320, -149444, 120168, -98345, -127827, 304931, -115403, -125898, -540954, -298636, 193934, -4286, -9618, -337712, -82532, -412777, 56560, -94676, -177588, -87897, 231595, -256958, -116872, 126695, -255509, 162797, -154763, -68247, 109017, -263375, -472395, 114824, -245209, -176116, -430339, 37177, -139820, 28088, -225089, -228971, -169780, -136874, 10445, 78731, -184316, -3524, 18798, -44272, 133531, -123584, -169967, -46307, 26854, -413414, 70925, 56035, -533365, -132409, -263300, 52936, 128775, -72173, -228295, -20633, 168544, -78725, 3285, 241099, 156995, 244259, 25335, -12393, -78487, 41419, -188588, -24887]
9393c88830a53290L7759j04000G5227R90a17402A96205g2076B24590a21854G9716
9381b45A16894D6976f365F4716f7136j36453A76392F3204j2545b5273r3463d7612
9368f3733k07282J31997L0535l1452I8910A9818b33103j28201a54716H1239a79145
9356a93692D3104Q2327D7798A0000b85155g6717A4590c9587A75517c82524f0985
9344h0445j21629j05933A43607b4463p9034A8491K24404D4103h8023M1188j05414
9333a52249p944F8987b00974i2553A02933a26117k18429h0740k16681q3993A68440
9321A14482a51116a5348F7591a43128B68839g7490A4390b11739L0983h63l11103
9310c11966J39922A99177a84715A8132c5620l51893H327c8758B5664L6243a97663
$$ y = [-388830, -153290, -115531, -219531, 75227, 76217, -117402, 196205, -72076, 224590, -121854, 79716, -245, 116894, 46976, -6365, 64716, -67136, -203589, 176392, 63204, 50659, -25273, -118736, -47612, -63733, -271015, -139018, -108483, -139935, 98910, 19818, -233103, -361304, -154716, 81239, -179145, -193692, 43104, 125431, 47798, 10000, -285155, -76717, 14590, -39587, 175517, -382524, -60985, -80445, -202074, -308007, 143607, -24463, -103497, 18491, 242895, 44103, -88023, -46835, -152249, -160193, 68987, -200974, -92553, 102933, -126117, -344546, -80740, -297421, -381414, 168440, 114482, -151116, -15348, 67591, -143128, 268839, -77490, 14390, -211739, -180756, -863, -311966, -172044, 199177, -184715, 18132, -35620, -387513, 8327, -38758, 25664, 61907, -197663]
9298e3014H7847a60354H8292b63329g8825K3301A69187J24042A37401a31046K3497
9287a07549A17264b21476A1567J48307c07151R1681M9627C7051b11253d0814l7328
9276g8142E2784M1016J25133b20840j24089J13521Q5877p0718j69758A07833D4650
9264i0817A38349c1664j38791c2986p1570M5783m6605A21621A5985b0538m0468
9253f1006j64463J1637K7724c877n0022A86594b85217J10640B13168a3661k38556
9242b52217J09936k08474l9467i1822j53575A74614d3A25182C6955K6515K00314
9231B63784a94984A24541F0347J70213i1961O124p2975d4664m2160q2368b6483
9219a81263c1310A04607Q2893a13870M5386C96991d9009B10144h563G8419a65498
$$ y = [-53014, 87847, -160354, 88292, -263329, -78825, -55524, 169187, 293229, 137401, -131046, -107549, 117264, -221476, 11567, 159874, -307151, -215470, -165843, 37051, -211253, -40814, -78142, 52784, 93800, 218933, -220840, -344929, -231408, -145531, -216249, -386007, 107833, 44650, -90817, 138349, -31664, -170455, -32986, -104556, -58773, -105378, 121621, 15985, -20538, -61006, -225469, -213832, -186108, -3877, -53899, 186594, -285217, -174577, 213168, -13661, -252217, -142281, -350755, -390222, -91822, -245397, 174614, -43, 125182, 36955, 63470, 263784, -194984, 124541, 60347, 230560, -91961, -85837, -158812, -44664, -86824, -169192, -26483, -181263, -31310, 104607, 187500, -113870, -68484, 396991, -49009, 210144, -8563, 78419, -165498]
9207a15112k1593H7075b65580I3837P345b35049C1246P7876c06151A63550c23044
9195d34437F7399c11617a29786B9686A3625J08351d8878H9957K89537j38492E60
9183a62456O7585B20609a29390C1866J1728a42573A46142a20124G493J29660q424
9172A28729b83176a0279G4930e0216i161G4793b65909J6025G8616h7659j42084
9161b29743f9249D875b08635k1090B32293b53573K7023d4852j042A0399f4689
9149f55731G7677a37990A65832d0330o863J4041B00335H3965d2501k19647N3150
9138b08998j00065D1080A1236a08444k3522A80731a3516j56570M3354B38673a8712
9126A42179d0282D8133R3435o0575a11965J9861k2599j7304r4578L1698f7111
$$ y = [-115112, -136705, 87075, -265580, 93837, 101182, -235049, 31246, 109122, -306151, 163550, -323044, -434437, 67399, -311617, -129786, 29686, 13625, 121976, -48878, 89957, 379494, 241002, 560, -162456, -94871, 220609, -129390, 31866, 43594, -142573, 146142, -120124, 7493, 137153, 128729, -283176, -10279, 74930, -50216, -9161, 74793, -265909, -249884, 78616, -87659, -229743, -69249, 4875, -208635, -229725, 232293, -253573, -226550, -44852, -45894, 10399, -64689, -655731, 77677, -137990, 165832, -40330, -47193, -33152, 200335, 83965, -42501, -262148, -208998, -309063, 41080, 11236, -108444, -131966, 180731, -13516, -170086, -126732, 238673, -18712, 142179, -40282, 48133, 141568, 80993, -111965, -92104, -114703, -132007, -226585, -194887, -67111]
9114a11450d5463j74596I9258L3056i1725j18322L9225A75374E0157K21993d7666
9102c44668P9528C34522c11244j95612D1360d7308F0638f8606I396a08218L9653
9091f8565j77384f1037H8308a46464j52540b3552o599j72286H3726a74997c002
9079A5396b4507B60900C6839c59250G9296a3871j91290a3208A59164d04180a44134
9067A59527a62518a4842j03353A50698b56479a20686e4525A85057l1850a68109
9056b44179J12031K9924k01931R6880Q339L2773o9318i1438j29938f9777k36660
9045c06437L8471B3077J01148c7706B15947b8517j82791I3303b45046B47923c6248
9033a65506A61537c03193J41001A7860c3208A88652G6224g3842a3853k03248e4883
$$ y = [-111450, -45463, -220059, 99258, 132314, -91725, -210047, -170822, 175374, 50157, 272150, -47666, -344668, -265140, 334522, -311244, -506856, 41360, -47308, 60638, -68606, 9396, -108218, -68565, -245949, -61037, 88308, -146464, -299004, -23552, -30151, -202437, 83726, -174997, -3002, 15396, -24507, 260900, 36839, -359250, 79296, -13871, -205161, -13208, 159164, -404180, -144134, 159527, -162518, -14842, -118195, 150698, -256479, -120686, -54525, 185057, 153207, -168109, -244179, -132148, -102224, -304155, -207275, -198936, -166163, -235481, -91438, -221376, -69777, -306437, -267966, 23077, 124225, -37706, 215947, -28517, -211308, 93303, -245046, 247923, -36248, -165506, 161537, -303193, -162192, 17860, -33208, 188652, 76224, -73842, -13853, -217101, -54883]
9021A53698i2864B8607K7183a49121R519j5418N4123P285J281B6022J89117a7458
9008B8019b7994j7548l84491D8972b44127B08537e40035H5038d6l7695j40262
8997a78003h5505k05610a05416o3250F6598a46875h194G8787E714J03033e3329
8985A42145L8107G4885J18718b71226J32219d0261o4239r5175n3269a07720m6310
8974a54030j00746L5876A98046B9705K02807b91950l1089j0078A80643R4558d1931
8962a88171I4010a29546D9581b21107b2085j34696k3998l606B56281G4435J92058
8951B66493N157I3657a18529p3865j08308a30850e0958o1911o9637B4361b00681
8939b88125E1604h1809k47812b4178C06222K43852e45174A66401O9809a23701
$$ y = [153698, -92864, 28607, 55790, -149121, -139602, -155020, -100897, -93612, -92331, 26022, 215139, -17458, 28019, -27994, -45542, -430033, 48972, -244127, 208537, -540035, 85038, -46, -37741, -178003, -85505, -291115, -105416, -168666, 66598, -146875, -8194, 78787, 5714, 108747, -53329, 142145, 180252, 74885, 193603, -271226, -139007, -40261, -104500, -199675, -252944, -107720, -154030, -254776, -218900, 198046, 29705, 232512, -291950, -323039, -333117, 180643, 275201, -41931, -188171, 94010, -129546, 49581, -221107, -22085, -156781, -180779, -184385, 256281, 74435, 266493, 271650, 93657, -118529, -192394, -300702, -130850, -50958, -112869, -182506, 24361, -200681, -288125, 51604, -81809, -329621, -24178, 306222, 550074, -545174, 166401, 236210, -123701]
8928c22451g0797A83103p3127P0566M82958R83307L173415K513322l528323A271416
8917G90746k51380F374b7617B68811q9003G2457A8385J53385F5068M11332i3401
8905B67266g2858A57331k7253a42446H3518b65304A74526q1599J51031E3106b74769
8893I6158C8581L7525N6525e1783a1848o0314j2316a9662A83038p5813C9444h7892
8880A5347P479a13431j83616j9793J3478g1433A41805O8752C0894c11258P7959
$$ y = [-322451, -70797, 183103, 109976, 180542, 663500, 1646807, 4820222, 7333544, 3805221, 1271416, 790746, 539366, 6374, -27617, 268811, 179808, 72457, 18385, 171770, 65068, 476400, -93401, 267266, -72858, 157331, 130078, -142446, 83518, -265304, 174526, 92927, 243958, 53106, -274769, 96158, 38581, 76106, 132631, -51783, -11848, -72162, -84478, -19662, 183038, 107225, 39444, -87892, 15347, 22826, -113431, -297047, -316840, -303362, -71433, 141805, 210557, 30894, -311258, -233299]
$$ [...]
##END NTUPLES=NMR SPECTRUM
##END=
