
##TITLE=AC1206_HPAAH12049_7154822_nrlYb0oDl9
##JCAMPDX= 6.0         $$ Bruker NMR JCAMP-DX V2.0
##DATA TYPE= NMR SPECTRUM
##DATA CLASS= NTUPLES
##ORIGIN= BRUKER
##OWNER= Administrator
$$ 1.72 TOPSPIN		Version 2.1
$$ 2012-12-12 03:51:31.465 -0500  Administrator@X
$$ Compression mode = diff/dup
##.OBSERVE FREQUENCY= 400.02188249412
##.OBSERVE NUCLEUS= ^1H
##.ACQUISITION MODE= SIMULTANEOUS (DQD)
##.ACQUISITION SCHEME= undefined
##.AVERAGES= 64
##.DIGITISER RES= 22
##SPECTROMETER/DATA SYSTEM= spect
##.PULSE SEQUENCE= noesygpps1d.comp
##.SOLVENT NAME= COFFEE_meoh
##.SHIFT REFERENCE= INTERNAL, COFFEE_meoh, 1, 14.96104
##AUDIT TRAIL= $$ (NUMBER, WHEN, WHO, WHERE, PROCESS, VERSION, WHAT)
$$ ##TITLE= Audit trail, TOPSPIN		Version 2.1
$$ ##JCAMPDX= 5.01
$$ ##ORIGIN= Bruker BioSpin GmbH
$$ ##OWNER= Administrator
$$ $$ E:\/data/COFFEE/nmr/AC1206_HPAAH12049_7154822_nrlYb0oDl9/32/pdata/1/auditp.txt
$$ ##AUDIT TRAIL=  $$ (NUMBER, WHEN, WHO, WHERE, PROCESS, VERSION, WHAT)
(   1,<2012-12-12 03:51:25.184 -0500>,<Administrator>,<X>,<go>,<TOPSPIN 2.1>,
      <created by zg
	started at 2012-12-12 03:39:54.949 -0500,
	POWCHK enabled, PULCHK disabled,
       configuration hash MD5:
       86 BA 57 50 F2 9D 5C 9B 26 00 A9 28 5F 66 2E 89
       data hash MD5: 64K
       43 CF F7 1D 5B 0B 37 C0 92 45 98 F0 79 D3 2B FD>)
(   2,<2012-12-12 03:51:28.418 -0500>,<Administrator>,<X>,<proc1d>,<TOPSPIN 2.1>,
      <Start of raw data processing
       efp LB = 0.3 FT_mod = 6 PKNL = 1 PHC0 = 0 PHC1 = 0 SI = 128K 
       data hash MD5: 128K
       BF 4E C7 15 8D 93 8D FE 52 2A 94 94 FB 35 3E 3B>)
(   3,<2012-12-12 03:51:29.559 -0500>,<Administrator>,<X>,<proc1d>,<TOPSPIN 2.1>,
      <pk PHC0 = -82.35352 PHC1 = 0 
       data hash MD5: 128K
       CA BB C2 82 1F 63 98 62 5E E6 A7 B7 EF 6B F4 22>)
(   4,<2012-12-12 03:51:30.387 -0500>,<Administrator>,<X>,<proc1d>,<TOPSPIN 2.1>,
      <abs ABSG = 1 
       data hash MD5: 128K
       61 D2 D8 3A E5 AB 99 C8 EC C7 B6 02 5E 53 82 4C>)
(   5,<2012-12-12 03:51:30.590 -0500>,<Administrator>,<X>,<proc1d>,<TOPSPIN 2.1>,
      <abs ABSG = 2 
       data hash MD5: 128K
       2E 43 BB 4D 14 A2 1E 05 A8 18 75 40 09 28 0E 5D>)
(   6,<2012-12-12 03:51:30.762 -0500>,<Administrator>,<X>,<proc1d>,<TOPSPIN 2.1>,
      <abs ABSG = 3 
       data hash MD5: 128K
       64 B9 8B 1F DD 4E 60 E8 4F 62 4B 8A ED ED 12 50>)
(   7,<2012-12-12 03:51:30.949 -0500>,<Administrator>,<X>,<proc1d>,<TOPSPIN 2.1>,
      <abs ABSG = 4 
       data hash MD5: 128K
       42 7B B0 16 6B 61 46 46 B5 04 3B 33 54 1E 3A 9F>)
(   8,<2012-12-12 03:51:31.106 -0500>,<Administrator>,<X>,<proc1d>,<TOPSPIN 2.1>,
      <abs ABSG = 5 
       data hash MD5: 128K
       40 A4 6D FC FE FC 16 2C 9A 99 4B 8C 72 BF A4 63>)
$$ ##END=
$$ 
$$ $$ hash MD5
$$ $$ A0 FF D5 2E D8 09 91 97 2B 98 10 27 76 30 3D FE
##$RELAX= 
##$RELAX= 
##$RELAX= 
##$RELAX= 
##$RELAX= 
##$RELAX= 
##$RELAX= 
##$RELAX= 
##$RELAX= 
$$ Bruker specific parameters
$$ --------------------------
##$DU= <E:\>
##$EXPNO= 32
$$ [...]
##$TP07= 0
##$TPNAME0= <>
##$TPNAME1= <>
##$TPNAME2= <>
##$TPNAME3= <>
##$TPNAME4= <>
##$TPNAME5= <>
##$TPNAME6= <>
##$TPNAME7= <>
##$TPOAL= (0..7)
0.5 0.5 0.5 0.5 0.5 0.5 0.5 0.5
##$TPOFFS= (0..7)
0 0 0 0 0 0 0 0
##$TUNHIN= 0
##$TUNHOUT= 0
##$TUNXOUT= 0
##$USERA1= <user>
##$USERA2= <user>
##$USERA3= <user>
##$USERA4= <user>
##$USERA5= <user>
##$V9= 5
##$VALIST= <valist>
##$VCLIST= <CCCCCCCCCCCCCCC>
##$VD= 0
##$VDLIST= <DDDDDDDDDDDDDDD>
##$VPLIST= <PPPPPPPPPPPPPPP>
##$VTLIST= <TTTTTTTTTTTTTTT>
##$WBST= 2048
##$WBSW= 25
##$XGAIN= (0..3)
0 0 0 0
##$XL= 0
##$YL= 0
##$YMAX_a= 6142482
##$YMIN_a= -13160156
##$ZGOPTNS= <>
##$ZL1= 120
##$ZL2= 120
##$ZL3= 120
##$ZL4= 120
##$ABSF1= 14.96104
##$ABSF2= -5.597142
##$ABSG= 5
##$ABSL= 3
##$ALPHA= 0
##$AQORDER= 0
##$ASSFAC= 0
##$ASSFACI= 0
##$ASSFACX= 0
##$ASSWID= 0
##$AUNMP= <proc_prof1d_extract.lims>
##$AXLEFT= 0
##$AXNAME= <>
##$AXNUC= <1H>
##$AXRIGHT= 0
##$AXTYPE= 0
##$AXUNIT= <>
##$AZFE= 0.1
##$AZFW= 0.1
##$BCFW= 0
##$BC_mod= 0
##$BYTORDP= 0
##$COROFFS= 0
##$CY= 15
##$DATMOD= 1
##$DC= 0
##$DFILT= <>
##$DTYPP= 0
##$F1P= 0
##$F2P= 0
##$FCOR= 0.5
##$FTSIZE= 131072
##$FT_mod= 6
##$GAMMA= 0
##$GB= 0
##$INTBC= 1
##$INTSCL= 1
##$ISEN= 128
##$LB= 0.3
##$LEV0= 0
##$LPBIN= 0
##$MAXI= 10000
##$MC2= 0
##$MEAN= 0
##$ME_mod= 0
##$MI= 0
##$NCOEF= 0
##$NC_proc= -2
##$NLEV= 6
##$NOISF1= 0
##$NOISF2= 0
##$NSP= 0
##$NTH_PI= 0
##$NZP= 0
##$OFFSET= 14.96104
##$PC= 1
##$PHC0= -82.35352
##$PHC1= 0
##$PH_mod= 1
##$PKNL= yes
##$PPARMOD= 0
##$PPDIAG= 0
##$PPIPTYP= 0
##$PPMPNUM= 2147483647
##$PPRESOL= 1
##$PSCAL= 4
##$PSIGN= 0
##$PYNMP= <proc.py>
##$REVERSE= no
##$SF= 400.020009619578
##$SI= 131072
##$SIGF1= 0
##$SIGF2= 0
##$SINO= 400
##$SIOLD= 131072
##$SPECTYP= <>
##$SREGLST= <1H.CDCl3>
##$SSB= 0
##$STSI= 131072
##$STSR= 0
##$SW_p= 8223.68421052631
##$SYMM= 0
##$S_DEV= 0
##$TDeff= 65536
##$TDoff= 0
##$TI= <>
##$TILT= no
##$TM1= 0
##$TM2= 0
##$TOPLEV= 0
##$USERP1= <user>
##$USERP2= <user>
##$USERP3= <user>
##$USERP4= <user>
##$USERP5= <user>
##$WDW= 1
##$XDIM= 131072
##$YMAX_p= 406079069
##$YMIN_p= -12306
##$CURPLOT= <Network HP LaserJet P1505>
##$CURPRIN= <$Network HP LaserJet P1505>
##$DFORMAT= <normdp>
##$LAYOUT= <+/1D_H.xwp>
##$LFORMAT= <normlp>
##$PFORMAT= <normpl>
##$SURQMSG= 1
$$ End of Bruker specific parameters
$$ ---------------------------------
##NTUPLES= NMR SPECTRUM
##VAR_NAME=  FREQUENCY,     SPECTRUM/REAL,   SPECTRUM/IMAG
##SYMBOL=    X,             R,               I
##VAR_TYPE=  INDEPENDENT,   DEPENDENT,       DEPENDENT
##VAR_FORM=  AFFN,          ASDF,            ASDF
##VAR_DIM=   131072,        131072,          131072
##UNITS=     HZ,            ARBITRARY UNITS, ARBITRARY UNITS
##FACTOR=    0.0627417313425164, 1,          1
##FIRST=     8223.62146879497, 1912,         -62390
##LAST=      0,             4538,            -62859
##MIN=       0,             -12306,          0
##MAX=       8223.62146879497, 406079069,    0
$$ Real data points
##PAGE= N=1
##DATA TABLE= (X++(R..R)), XYDATA
$$ [...]
$$ plain form
61683 431411 427775 425170 423219 421517 420121 418860 416933 413880 410519 408225 407507 407764 408193 408375 408144
61668 408144 407457 406491 405641 405381 406103 407824 409926 411466 411945 411568 410784 409902 409206 408913 408858 408674 408469 408805
61650 408805 409865 411194 412533 414346 417135 420701 424425 427867 430838 433306 435512 437700 439531 440311
61636 440311 439991 439235 438230 436276 433101 429750 427391 425827 423994 421431 418400 415009 411178 407327 404196
61621 404196 401883 399711 397207 394770 393273 393252 394401 395640 395848 394760 392967 390993 388777 386219 383601
61606 383601 381047 378094 374373 370253 366285 362459 358607 355184 352899 351708 350707 348961 346142 342658
61592 342658 339537 337745 337137 336493 335030 333361 332341 331599 330128 327947 326086 325012 324060 322610 320965
61577 320965 319772 319178 318926 318883 319156 319843 320784 321549 321837 322000 322819 324507 326310 327467 328154 328971 329869 330267
$$ packed form
61683D31411l636k605j951j702j396j261j927l053l361k294p18K57M29J82k31
61668D08144o87r66q50k60P22J721K102J540M79l77p84q82o96k93n5j84k05L36
61650D08805J060J329J339J813K789L566L724L442K971K468K206K188J831P80
61636D40311l20p56j005j954l175l351k359j564j833k563l031l391l831l851l131
61621D04196k313k172k504k437j497k1J149J239K08j088j793j974k216k558k618
61606C83601k554k953l721m120l968l826l852l423k285j191j001j746k819l484
61592C42658l121j792o08o44j463j669j020p42j471k181j861j074r52j450j645
61577C20965j193n94k52m3K73O87R41P65K88J63Q19J688J803J157O87Q17Q98L98
$$ plain form
61559 330267 329998 329436 328778 327916 327079 327004 328199 330329 332393 333378 332937 331770 331199 332042 333907 335772 336985
61542 336985 337528 337761 338308 339791 342235 344972 347480 349870 352157 353709 354143 354268 355164 356620 357377 356857
61526 356857 355730 354735 353781 352445 350673 348677 346599 344530 342632 341115 340243 340214 340828 341519 342070 342946
61510 342946 344486 346067 346649 345988 344756 343633 342772 342017 341152 340074 339052 338614 338769 338838 338518 338618 340023
61493 340023 342342 344395 345630 346265 346443 346246 346268 347111 348394 349308 350040 351598 354231 357156 359894 362716
61477 362716 365503 367351 367829 367713 367867 368224 368321 368136 367807 367122 365875 364304 362762 361407 360496 360441 361139
61460 361139 361712 361378 360268 359031 358013 357202 356680 356666 357137 357614 357390 356120 354358 353283 353546 354610 355640
61443 355640 356693 358317 360280 361738 362711 364346 367383 371200 374812 378049 381220 384213 386576 388185
$$ packed form
61559C30267k69n62o58q62q37p5J195K130K064R85m41j167n71Q43J865J865J213
61542C36985N43K33N47J483K444K737K508K390K287J552M34J25Q96J456P57n20
61526C56857j127r95r54j336j772j996k078k069j898j517q72k9O14O91N51Q76
61510C42946J540J581N82o61j232j123q61p55q65j078j022m38J55O9l20J00J405
61493C40023K319K053J235O35J78j97K2Q43J283R14P32J558K633K925K738K822
61477C62716K787J848M78j16J54L57R7j85l29o85j247j571j542j355r11n5O98
61460C61139N73l34j110j237j018q11n22j4M71M77k24j270j762j075K63J064J030
61443C55640J053J624J963J458R73J635L037L817L612L237L171K993K363J609
$$ plain form
61429 388185 389386 390714 392577 394910 397020 398279 399041 400268 402114 403638 404196 404340 404907 405950 407154
61414 407154 408616 410412 411869 412157 411486 410995 411437 412464 413181 412976 411815 410085 408260 406500 404607 402462
61398 402462 400351 398628 397218 395769 394212 392871 392003 391570 391593 392507 394772 398072 401253 403344 404486
61383 404486 405493 406672 407643 408309 409288 411086 413538 416454 420031 424034 427385 429467 431211 433784 436680
61368 436680 438386 438728 439163 440645 442543 444042 445445 447403 449753 451796 453207 454170 455074 456470 458927
61353 458927 462618 467353 473026 479571 486568 493531 500498 507558 513900 518327 520853 522755 524858 526837
61339 526837 528487 530402 532755 534583 535092 534779 534376 533606 531939 529846 528156 526631 524271 520836 517190
61324 517190 514261 512400 511601 511658 512192 513041 514529 516952 520125 523881 528647 534863 542077 549282 556119
$$ packed form
61429C88185J201J328J863K333K110J259P62J227J846J524N58J44N67J043J204
61414D07154J462J796J457K88o71m91M42J027P17k05j161j730j825j760j893k145
61398D02462k111j723j410j449j557j341q68m33K3R14K265L300L181K091J142
61383D04486J007J179R71O66R79J798K452K916L577M003L351K082J744K573K896
61368D36680J706L42M35J482J898J499J403J958K350K043J411R63R04J396K457
61353D58927L691M735N673O545O997O963O967P060O342M427K526J902K103J979
61339E26837J650J915K353J828N09l13m03p70j667k093j690j525k360l435l646
61324E17190k929j861p99N7N34Q49J488K423L173L756M766O216P214P205O837
$$ plain form
61309 556119 563261 571706 582098 594530 608464 622842 636592 649050 659777 668263 674119 677324
61297 677324 678005 676300 672697 668190 663600 658912 653583 647331 640380 633125 625817 618418 610650 602419
61283 602419 594252 586965 580887 575797 571596 568399 565980 563958 562790 563656 566895 571336 575716 580000
61269 580000 584609 589187 593036 596282 599676 603551 607797 612643 618617 625859 634040 642748 651382 658950
61255 658950 664746 669086 672700 675535 676815 676246 674429 672018 669055 665334 660968 656349 651773 647277
61241 647277 642775 638335 634289 630855 627710 624307 620687 617480 615092 613416 612500 612769 614272 616427 618977
61226 618977 622508 627402 632934 638104 642825 647624 652713 658137 664350 671720 679757 687662 695428 703565
61212 703565 711911 719584 726037 731484 736306 740711 744994 749506 754320 759380 764971 771636 779713 789275
$$ packed form
61309E56119P142Q445J0392J2432J3934J4378J3750J2458J0727Q486N856L205
61297F77324O81j705l603m507m590m688n329o252o951p255p308p399p768q231
61283F02419q167p287o078n090m201l197k419k022j168Q66L239M441M380M284
61269E80000M609M578L849L246L394L875M246M846N974P242Q181Q708Q634P568
61255F58950N796M340L614K835J280n69j817k411k963l721m366m619m576m496
61241F47277m502m440m046l434l145l403l620l207k388j676r16K69J503K155K550
61226F18977L531M894N532N170M721M799N089N424O213P370Q037P905P766Q137
61212G03565Q346P673O453N447M822M405M283M512M814N060N591O665Q077R562
$$ plain form
61198 789275 800343 812834 826581 841729 858624 876827 894735 910824 924846 937148 947330
61187 947330 954515 958669 960743 961600 961473 960301 957830 953568 947379 939953 931993 923198 912951 901691
61173 901691 890557 879732 868216 855357 841639 827774 813966 800366 787352 774935 762555
61162 762555 749797 736810 723804 710818 698291 687283 678734 672846 669290 667532 666844 666634 667048
61149 667048 668796 672080 676073 679520 681503 681520 679426 675582 670694 665330 659831 654691 650522 647575 645809
61134 645809 645553 647548 652069 658447 665806 673990 683529 694969 708492 723986 741204 759870 779759
61121 779759 800791 823115 847075 872764 899546 926387 952872 979506 1006751 1034227 1061219
61110 1061219 1087413 1112607 1136229 1157864 1177849 1196534 1213283 1227043 1237625 1245548 1250780 1252596
$$ packed form
61198G89275J1068J2491J3747J5148J6895J8203J7908J6089J4022J2302J0182
61187I47330P185M154K074Q57j27j172k471m262o189p426p960q795j0247j1260
61173I01691j1134j0825j1516j2859j3718j3865j3808j3600j3014j2417j2380
61162G62555j2758j2987j3006j2986j2527j1008q549n888l556j758o88k10M14
61149F67048J748L284L993L447J983J7k094l844m888n364n499n140m169k947j766
61134F45809k56J995M521O378P359Q184R539J1440J3523J5494J7218J8666J9889
61121G79759K1032K2324K3960K5689K6782K6841K6485K6634K7245K7476K6992
61110A061219K6194K5194K3622K1635J9985J8685J6749J3760J0582P923N232J816
$$ plain form
61098 1252596 1250644 1245290 1236915 1225793 1212718 1198777 1184206 1168305 1150826 1132795 1115664 1100238
61086 1100238 1086619 1074606 1063847 1054115 1045656 1038858 1033554 1029215 1025852 1024097 1024254 1025858 1028309
61073 1028309 1031329 1034713 1038229 1042023 1046520 1051741 1057197 1062606 1068247 1074417 1080968 1087451 1093335 1098166
61059 1098166 1102030 1105806 1110385 1115691 1121056 1126397 1132306 1139087 1146479 1154319 1162699 1171513 1180713 1191003
61045 1191003 1203282 1217248 1231430 1244803 1257598 1270482 1283910 1298448 1314659 1332271 1350303
61034 1350303 1368387 1387202 1407378 1428827 1451428 1475555 1501634 1529848 1560359 1593048 1627116
61023 1627116 1662031 1698866 1739521 1784751 1834485 1890204 1955216 2032144 2121957 2226094 2347665
61012 2347665 2489713 2654476 2845805 3070717 3337513 3654792 4034373 4493164 5049548
$$ packed form
61098A252596j952n354q375j1122j3075j3941j4571j5901j7479j8031j7131j5426
61086A100238j3619j2013j0759r732q459o798n304m339l363j755J57J604K451
61073A028309L020L384L516L794M497N221N456N409N641O170O551O483N884M831
61059A098166L864L776M579N306N365N341N909O781P392P840Q380Q814R200J0290
61045A191003J2279J3966J4182J3373J2795J2884J3428J4538J6211J7612J8032
61034A350303J8084J8815K0176K1449K2601K4127K6079K8214L0511L2689L4068
61023A627116L4915L6835M0655M5230M9734N5719O5012P6928Q9813J04137J21571
61012B347665J42048J64763J91329K24912K66796L17279L79581M58791N56384
$$ plain form
61003 5049548 5719264 6516525 7456246 8551908 9815044 11262070 12913258 14761644 16724621
60994 16724621 18631291 20280637 21533648 22361686 22820265 22996977 22993399 22932450 22933217 23038864
60984 23038864 23163757 23128935 22766286 22000633 20852234 19390303 17700315 15881292 14042960
60975 14042960 12284445 10671962 9236188 7984593 6912122 6005514 5246742 4616935
60967 4616935 4097683 3670473 3317662 3024447 2778894 2570675 2391290 2235184 2099075
60958 2099075 1979854 1873941 1778577 1692684 1616189 1548961 1490311 1438845 1392704 1350309 1310843
60947 1310843 1273748 1238050 1202614 1166913 1131169 1095869 1061527 1028658 997522 967940 939665
60936 939665 912794 887536 863807 841443 820614 801599 784189 767685 751569 736046 721894
$$ packed form
61003E049548O69716P97261R39721J095662J263136J447026J651188J848386J962977
60994A6724621J906670J649346J253011Q28038M58579J76712l578o0949P67J05647
60984B3038864J24893l4822l62649p65653j148399j461931j689988j819023j838332
60975A4042960j758515j612483j435774j251595j072471r06608p58772o29807
60967D616935n19252m27210l52811k93215k45553k08219j79385j56106j36109
60958B099075j19221j05913r5364q5893p6495o7228n8650n1466m6141m2395l9466
60947A310843l7095l5698l5436l5701l5744l5300l4342l2869l1136k9582k8275
60936I39665k6871k5258k3729k2364k0829j9015j7410j6504j6116j5523j4152
$$ plain form
60925 721894 709754 699396 689751 680064 671042 664245 660083 657045 653385 648999 644981 641819 639017 636310
60911 636310 634159 632769 631460 629565 627461 626161 626183 627143 628273 628923 628702 627513 625492 622782 619407
60896 619407 615459 611226 606887 602181 596620 590034 582776 575453 568637 562727 557820 553637 549734 545866
60882 545866 541994 537970 533401 528002 521989 516047 510889 506747 503230 499721 496139 493275 492095 492639
60868 492639 493858 494640 494799 494926 495633 497257 500035 504061 509015 514266 519325 524012 528164 531473 533735
60853 533735 535079 535902 536651 537718 539309 541239 542898 543546 542739 540614 537825 535093 532644 530048 526663
60838 526663 522139 516538 510194 503601 497168 490874 484330 477475 470981 465637 461509 458079 454988 452192
60824 452192 449495 446538 443315 440190 437267 434206 430842 427565 424825 422583 420471 418208 415633 412578
$$ packed form
60925G21894j2140j0358r645r687r022o797m162l038l660m386m018l162k802k707
60911F36310k151j390j309j895k104j300K2R60J130O50k21j189k021k710l375
60896F19407l948m233m339m706n561o586p258p323o816n910m907m183l903l868
60882E45866l872m024m569n399o013n942n158m142l517l509l582k864j180N44
60868D92639J219P82J59J27P07J624K778M026M954N251N059M687M152L309K262
60853E33735J344Q23P49J067J591J930J659O48q07k125k789k732k449k596l385
60838E26663m524n601o344o593o433o294o544o855o494n344m128l430l091k796
60824D52192k697k957l223l125k923l061l364l277k740k242k112k263k575l055
$$ plain form
60810 412578 409016 405196 401466 398032 394985 392427 390532 389556 389681 390619 391504 391584 391013 390522 390317 389813 388607
60793 388607 387207 386477 386732 387654 388789 389892 391022 392562 394898 397817 400425 401866 401964 401131 399980 399167
60777 399167 399122 399606 399855 399496 399108 399518 400745 401949 402374 402072 401801 402392 404096 406357 408234 409153 409221 408930
60759 408930 408754 408985 409605 410273 410660 410747 410489 409424 407277 404998 404325 405909 408461 410284 411105 411784 412693
60742 412693 413242 412908 411910 410575 408534 404985 399669 393386 387517 383057 380138 378341 377177 376178 374868
60727 374868 373133 371486 370560 370394 370635 371223 372260 373277 373444 372694 371911 371747 371974 372328 373243 375146 377639
60710 377639 379963 381832 383264 384057 384091 383801 383667 383447 382541 381045 379875 379868 381083 382896 384448 385116 384866
60693 384866 384117 383140 381787 379964 378050 376653 376257 377214 379596 382774 385610 387444 388591 389706 391146
$$ packed form
60810D12578l562l820l730l434l047k558j895r76J25R38Q85Q0n71m91k05n04j206
60793C88607j400p30K55R22J135J103J130J540K336K919K608J441R8q33j151q13
60777C99167m5M84K49l59l88M10J227J204M25l02k71N91J704K261J877R19O8k91
60759D08930j76K31O20O68L87Q7k58j065k147k279o73J584K552J823Q21O79R09
60742D12693N49l34r98j335k041l549n316o283n869m460k919j797j164r99j310
60727C74868j735j647r26j66K41N88J037J017J67p50p83j64K27L54R15J903K493
60710C77639K324J869J432P93L4k90j34k20r06j496j170pJ215J813J552O68k50
60693C84866p49r77j353j823j914j397l96R57K382L178K836J834J147J115J440
$$ plain form
60678 391146 393151 395924 399100 401776 403611 405290 407300 408933 409221 408318 407072 405654 403554 400701 397702
60663 397702 395033 392706 390693 389082 387916 387358 387780 389100 390342 390600 390236 390463 391939 394414 397490
60648 397490 400845 403817 405658 406320 406373 406141 405497 404394 402909 400867 398146 395326 393257 391942 390562
60633 390562 388707 386874 385726 385529 386358 388091 390037 391309 391762 391956 392149 392093 391955 392490 393867 395047
60617 395047 394937 393725 392580 392383 393149 394366 395488 396275 396929 397717 398431 398473 397589 396177 394757 393535 392624
60600 392624 392348 393027 394644 396825 399005 400689 401876 403240 405484 408452 411193 413004 414106 415296 417210
60585 417210 419894 422753 424932 426099 426811 427761 428839 429423 429476 429684 430466 431560 432797 434708 438017 442955
60569 442955 449324 456846 465193 474037 483377 493575 504832 516786 528689 539687 548820 555157 558286
$$ packed form
60678C91146K005K773L176K676J835J679K010J633K88r03j246j418k100k853k999
60663C97702k669k327k013j611j166n58M22J320J242K58l64K27J476K475L076
60648C97490L355K972J841O62N3k32o44j103j485k042k721k820k069j315j380
60633C90562j855j833j148j97Q29J733J946J272M53J94J93n6j38N35J377J180
60617C95047j10j212j145j97P66J217J122P87O54P88P14M2q84j412j420j222r11
60600C92624k76O79J617K181K180J684J187J364K244K968K741J811J102J190J914
60585D17210K684K859K179J167P12R50J078N84N3K08P82J094J237J911L309M938
60569D42955O369P522Q347Q844R340J0198J1257J1954J1903J0998R133O337L129
$$ plain form
60556 558286 558611 557017 554314 550916 546874 542200 537293 532908 529536 527079 525492 525454 527797 532348 537961
60541 537961 543899 550692 559446 570730 584295 599542 615973 633399 651876 671275 690807 709083
60529 709083 724677 736618 744568 748728 749493 747046 741469 733400 724195 715032 706080 696891 687373 678020
60515 678020 669474 662307 656920 653165 650314 647884 646250 646048 647457 650651 656472 665776 678417 693694
60501 693694 711553 732501 756696 784191 815892 853006 895339 941149 988866 1037947 1087753
60490 1087753 1136606 1182499 1224010 1260067 1289447 1310899 1323365 1325934 1318124 1300266 1273055 1236820
60478 1236820 1192079 1140787 1085993 1030006 973878 918833 866896 819457 776215 736355 700023
60467 700023 667927 640120 616032 595208 577299 561703 547870 535707 525164 515686 506562 497602
$$ packed form
60556E58286L25j594k703l398m042m674m907m385l372k457j587l8K343M551N613
60541E37961N938O793Q754J1284J3565J5247J6431J7426J8477J9399J9532J8276
60529G09083J5594J1941P950M160P65k447n577q069r205r163q952r189r518r353
60515F78020q546p167n387l755k851k430j634k02J409L194N821R304J2641J5277
60501F93694J7859K0948K4195K7495L1701L7114M2333M5810M7717M9081M9806
60490A087753M8853M5893M1511L6057K9380K1452J2466K569p810j7858k7211l6235
60478A236820m4741n1292n4794n5987n6128n5045n1937m7439m3242l9860l6332
60467G00023l2096k7807k4088k0824j7909j5596j3833j2163j0543r478r124q960
$$ plain form
60455 497602 489169 481857 476310 472858 470918 469126 466507 463194 459778 456423 452925 449231 445526 442143
60441 442143 439686 438788 439405 440609 441343 441198 440322 439043 437680 436358 434880 433127 431510 430529 430055 429707
60425 429707 429740 430688 432218 433412 434183 435230 436474 436962 436745 437321 439361 441436 442117 442190 443395 445831 448082
60408 448082 449398 450314 451365 452479 453639 455053 456544 457646 458403 459408 461024 463161 465799 469127 473153
60393 473153 477564 481917 485704 488507 490542 492672 495464 498554 501414 504287 507733 511618 515263 518373
60379 518373 521182 523909 526657 529660 533003 536275 539070 541658 544643 548150 551869 555604 559209 562252
60365 562252 564442 566290 568696 571942 575626 579452 583533 587974 592777 598171 604605 612325 621258 631240
60351 631240 642012 653057 663721 673446 681748 688219 692687 695089 695004 691857 685901 678483 670848 663076
$$ packed form
60455D97602q433p312n547l452j940j792k619l313l416l355l498l694l705l383
60441D42143k457q98O17J204P34j45q76j279j363j322j478j753j617r81m74l48
60425D29707L3R48J530J194P71J047J244M88k17N76K040K075O81P3J205K436K251
60408D48082J316R16J051J114J160J414J491J102P57J005J616K137K638L328M026
60393D73153M411M353L787K803K035K130K792L090K860K873L446L885L645L110
60379E18373K809K727K748L003L343L272K795K588K985L507L719L735L605L043
60365E62252K190J848K406L246L684L826M081M441M803N394O434P720Q933R982
60351F31240J0772J1045J0664R725Q302O471M468K402q5l147n956p418p635p772
$$ plain form
60337 663076 654652 645622 636624 628172 620470 613618 607426 601368 595246 589573 584812 580639 576534 572669
60323 572669 569485 566776 563938 560986 558592 557286 557251 558767 562282 568093 576345 587046 599624 612873
60309 612873 625969 639235 653276 667683 681316 693627 704954 715681 725798 735105 743147 748989
60297 748989 751631 750651 746073 737933 726550 712811 697546 680963 663352 645982 630305 616468
60285 616468 603475 590799 579091 569373 562167 557260 553626 549781 544942 539726 535047 530700 525946
60272 525946 521103 517347 514978 513034 510816 508725 507317 506462 505806 505268 504758 504053 503247 502674 502225 501399
60256 501399 500187 499219 498880 498981 499460 500608 502373 504236 506101 508514 511595 514426 516036 516436 516280 516000
60240 516000 515688 515296 514518 512902 510538 508210 506526 505338 504476 504499 506104 509024 512199 514981 517689 520954
$$ packed form
60337F63076q424r030q998q452p702o852o192o058o122n673m761m173m105l865
60323E72669l184k709k838k952k394j306l5J516L515N811Q252J0701J2578J3249
60309F12873J3096J3266J4041J4407J3633J2311J1327J0727J0117R307Q042N842
60297G48989K642r80m578q140j1383j3739j5265j6583j7611j7370j5677j3837
60285F16468j2993j2676j1708r718p206m907l634l845m839n216m679m347m754
60272E25946m843l756k369j944k218k091j408q55o56n38n10p05q06n73m49q26
60256E01399j212r68l39J01M79J148J765J863J865K413L081K831J610M00j56k80
60240E16000l12l92p78j616k364k328j684j188q62K3J605K920L175K782K708L265
$$ plain form
60224 520954 524950 529427 534132 538956 543780 548468 553074 557902 563166 568726 574384 580344 587006 594272
60210 594272 601550 608595 615818 623456 630924 637456 642959 647768 651981 655626 659145 662964 666681 669343
60196 669343 670525 670701 670582 670519 670397 669713 667879 664815 661116 657333 653435 649253 644979 640699 635971 630547
60180 630547 625124 620678 617392 614876 612957 611497 609868 607577 605075 603114 601657 600400 599835 600535 601650
60165 601650 601533 599912 598190 597471 597514 597801 598325 598910 598929 598264 597639 597562 597778 598099 598856 600079 601113 601597
60147 601597 602047 602985 604200 605356 606693 608636 611241 614409 618176 622501 627303 632842 639452 646763 653912
60132 653912 660623 667275 673784 679346 683546 686789 689308 690736 691073 691056 691021 690382 688898 687524 687207 687607
60116 687607 687815 687688 687647 687706 687514 686943 685947 684265 681841 679149 676486 673471 669849 666354 664025 662922
$$ packed form
60224E20954L996M477M705M824M824M688M606M828N264N560N658N960O662P266
60210E94272P278P045P223P638P468O532N503M809M213L645L519L819L717K662
60196F69343J182J76j19o3j22o84j834l064l699l783l898m182m274m280m728n424
60180F30547n423m446l286k516j919j460j629k291k502j961j457j257n65P00J115
60165F01650j17j621j722p19M3K87N24N85J9o65o25p7K16L21P57J223J034M84
60147F01597M50R38J215J156J337J943K605L168L767M325M802N539O610P311P149
60132F53912O711O652O509N562M200L243K519J428L37j7l5o39j484j374l17M00
60116F87607K08j27m1N9j92n71r96j682k424k692k663l015l622l495k329j103
$$ plain form
60100 662922 662072 660453 657642 653917 650240 647763 646837 646798 647099 648135 650397 653358 655941 657833 659609
60085 659609 661692 663776 665259 665768 665259 663923 661946 659262 655707 651440 646828 641852 636084 629458 622546
60070 622546 615847 609318 602909 596938 591575 586497 581470 576723 572338 567848 562939 558057 553804 550220
60056 550220 547160 544846 543470 542673 542015 541606 541749 542412 543593 545742 549126 553121 556843 560256 564013
60041 564013 568365 572855 576963 580473 583211 584970 585717 585592 584745 583367 581691 579763 577422 574675 571671
60026 571671 568013 562630 554859 545421 535900 527403 520032 513339 506875 500455 494283 488715 483795 479261
60012 479261 475100 471638 468934 466612 464599 463389 463153 463132 462503 461440 460761 460836 461369 461959 462376 462494 462453
59995 462453 462716 463664 465281 467422 470020 472775 475099 476769 478278 480181 482448 484734 486831 488518 489415
$$ packed form
60100F62922q50j619k811l725l677k477r26l9L01J036K262K961K583J892J776
60085F59609K083K084J483N09n09j336j977k684l555m267m612m976n768o626o912
60070F22546o699o529o409n971n363n078n027m747m385m490m909m882m253l584
60056E50220l060k314j376p97o58m09J43O63J181K149L384L995L722L413L757
60041E64013M352M490M108L510K738J759P47j25q47j378j676j928k341k747l004
60026E71671l658n383p771r438r521q497p371o693o464o420o172n568m920m534
60012D79261m161l462k704k322k013j210k36k1o29j063o79P5N33N90M17J18m1
59995D62453K63R48J617K141K598K755K324J670J509J903K267K286K097J687Q97
$$ plain form
59980 489415 489449 489043 488513 487710 486586 485540 484783 483921 482663 481412 480637 480156 479642 479358 479788 480942 482584
59963 482584 484737 487402 490205 492928 495934 499454 502846 505231 506525 507228 507571 507475 506998 506133 504517 502000
59947 502000 499227 497039 495570 494460 493539 492650 491222 488827 485962 483584 482031 480978 480207 479808 479850 480433
59931 480433 481802 483914 486223 488474 491275 495256 500033 504651 508604 511707 513485 513636 512829 512168 512021
59916 512021 512139 512548 513460 514566 515426 516426 518396 521343 524386 526930 529122 531288 533688 536702 540330
59901 540330 543570 545196 545212 544736 544557 544626 544847 545334 545877 546206 546931 549148 552846 556779 560317 564396 570010
59884 570010 576646 582993 588646 594263 600365 606681 612680 618220 623581 629028 634394 639091 642585 644796
59870 644796 645899 645920 644802 642820 640645 639004 638312 638379 638377 637491 635883 634548 633950 633466 632648 632239 633045 634478
$$ packed form
59980D89415L4m06n30q03j124j046p57q62j258j251p75m81n14k84M30J154J642
59963D82584K153K665K803K723L006L520L392K385J294P03L43r6m77q65j616k517
59947E02000k773k188j469j110r21q89j428k395k865k378j553j053p71l99M2N83
59931D80433J369K112K309K251K801L981M777M618L953L103J778J51q07o61j47
59916E12021J18M09R12J106Q60J000J970K947L043K544K192K166K400L014L628
59901E40330L240J626J6m76j79O9K21M87N43L29P25K217L698L933L538M079N614
59884E70010O636O347N653N617O102O316N999N540N361N447N366M697L494K211
59870F44796J103K1j118j982k175j641o92O7kq86j608j335n98m84q18m09Q06J433
$$ plain form
59852 634478 635389 636001 637836 641772 647334 653858 661137 668645 675202 679927 682795 683979 683447 681593 679518
59837 679518 678187 677748 677889 678267 678336 677428 675408 672747 669712 666060 661837 657858 654856 652557 649967 646284
59821 646284 641250 635059 628381 622256 617544 614418 612407 610730 608638 605828 602668 599767 597230 594602
59807 594602 591545 588200 584842 581506 578119 574724 571471 568572 566229 564417 562812 561149 559510 557993
59793 557993 556323 554108 551333 548276 545144 542137 539582 537547 535574 533288 530965 529055 527506 526141
59779 526141 525309 525417 526141 526926 528035 530113 532877 535213 536740 538356 541066 545022 549832 555099 560446
59764 560446 565685 571149 577269 583737 589731 594992 600030 605266 610702 616444 622689 629053 634801 639948
59750 639948 645350 651424 657616 663419 669125 675150 681331 687305 692942 697983 701885 704506 706468 708446
$$ packed form
59852F34478R11O12J835L936N562O524P279P508O557M725K868J184n32j854k075
59837F79518j331m39J41L78O9r08k020k661l035l652m223l979l002k299k590l683
59821F46284n034o191o678o125m712l126k011j677k092k810l160k901k537k628
59807E94602l057l345l358l336l387l395l253k899k343j812j605j663j639j517
59793E57993j670k215k775l057l132l007k555k035j973k286k323j910j549j365
59779E26141q32J08P24P85J109K078K764K336J527J616K710L956M810N267N347
59764E60446N239N464O120O468N994N261N038N236N436N742O245O364N748N147
59750F39948N402O074O192N803N706O025O181N974N637N041L902K621J962J978
$$ plain form
59736 708446 710453 712123 713225 713685 713515 713009 712598 712316 711809 710931 709828 708471 706750 705102 704289 704406
59720 704406 704820 705273 706190 707608 708697 708834 708399 708008 707611 706926 706132 705566 705223 705142 705796 707473 709652 711571
59702 711571 713124 714622 715953 716555 716222 715482 715138 715640 716837 718147 718967 718915 717696 715064 711271 707307
59686 707307 704098 701583 699082 696350 693525 690175 685484 679618 673982 669626 666101 662269 657556 651942
59672 651942 645458 638383 631501 625514 620437 615913 611834 608322 605447 603296 602062 601764 602109 602736 603315
59657 603315 603433 602914 602390 603010 605309 608767 612524 615990 618664 620059 620114 619176 617382 614556 610796 606543
59641 606543 601946 596876 591745 587535 584667 582551 580561 578716 577111 575503 573920 572851 572292 571295 569049
59626 569049 565771 562001 557711 552800 547857 543677 540379 537570 534988 532386 529261 525334 521030 516985
$$ packed form
59736G08446K007J670J102M60j70n06m11k82n07q78j103j357j721j648q13J17
59720G04406M14M53R17J418J089J37m35l91l97o85p94n66l43q1O54J677K179J919
59702G11571J553J498J331O02l33p40l44N02J197J310Q20n2j219k632l793l964
59686G07307l209k515k501k732k825l350m691n866n636m356l525l832m713n614
59672F51942o484p075o882n987n077m524m079l512k875k151j234k98L45O27N79
59657F03315J18n19n24O20K299L458L757L466K674J395N5r38j794k826l760m253
59641F06543m597n070n131m210k868k116j990j845j605j608j583j069n59r97k246
59626E69049l278l770m290m911m943m180l298k809k582k602l125l927m304m045
$$ plain form
59612 516985 513424 510493 508784 508897 510650 513212 515833 518154 520059 521592 522836 523765 524521 525806 528284
59597 528284 531409 533634 534253 534413 535778 538727 542280 545235 546931 547483 547811 548947 550828 552184 551997
59582 551997 550447 548084 544978 541322 538061 535967 534614 533119 531501 530455 530164 530178 530249 530438 530505 529959
59566 529959 528756 527475 526788 526957 527632 527914 527076 525533 524552 524594 524664 523920 523188 523947 526268 528759 530357
59549 530357 531294 532377 534171 536941 540737 545396 550865 557474 565510 574856 585550 598354 613874 631044
59535 631044 647220 660017 668723 673871 676025 675360 672213 667648 663265 660330 659151 659391 660742 662893
59521 662893 665020 665962 665133 662796 659373 655043 650108 645032 639784 633763 626684 618998 611226 603555 596322
59506 596322 590028 584454 578575 571952 565479 560169 555941 552224 549010 546576 544824 543633 543233 543475 543392
$$ packed form
59612E16985l561k931j709J13J753K562K621K321J905J533J244R29P56J285K478
59597E28284L125K225O19J60J365K949L553K955J696N52L28J136J881J356j87
59582E51997j550k363l106l656l261k094j353j495j618j046k91J4P1J89O7n46
59566E29959j203j281o87J69O75K82q38j543r81M2P0p44p32P59K321K491J598
59549E30357R37J083J794K770L796M659N469O609Q036R346J0694J2804J5520J7170
59535F31044J6176J2797Q706N148K154o65l147m565m383k935j179K40J351K151
59521F62893K127R42q29k337l423m330m935n076n248o021p079p686p772p671p233
59506E96322o294n574n879o623o473n310m228l717l214k434j752j191m00K42q3
$$ plain form
59491 543392 542360 541115 540738 541191 541750 542370 543588 545469 547698 550443 554098 558323 562301 565939 570037
59476 570037 575260 581552 588404 595027 600443 604080 606295 607834 609009 609786 610270 610574 610645 610838 612137 615077
59460 615077 618958 622913 627222 632639 638948 645286 651605 658647 666543 674500 681875 688650 694798 700042
59446 700042 704254 707320 708601 707316 703510 698054 691785 685338 679530 674985 671391 667915 664337 661002
59432 661002 657835 654441 651154 649013 648511 649259 651084 654588 660342 668358 678647 691502 706817 723792
59418 723792 741835 761171 782169 804596 828128 852976 879073 904541 925776 939697 945832 945838
59406 945838 941171 931963 918539 903291 890072 881814 879377 882155 888358 894505 896327 891383 880263
59393 880263 864844 846390 826039 805763 787382 771102 756134 742251 729818 718871 709288 701427
$$ packed form
59491E43392j032j245l77M53N59O20J218J881K229K745L655M225L978L638M098
59476E70037N223O292O852O623N416L637K215J539J175P77M84L04P1J93J299K940
59460F15077L881L955M309N417O309O338O319P042P896P957P375O775O148N244
59446G00042M212L066J281j285l806n456o269o447n808m545l594l476l578l335
59432F61002l167l394l287k141n02P48J825L504N754Q016J0289J2855J5315J6975
59418G23792J8043J9336K0998K2427K3532K4848K6097K5468K1235J3921O135O
59406I45838m667r208j3424j5248j3219q258k437K778O203O147J822m944j1120
59393H80263j5419j8454k0351k0276j8381j6280j4968j3883j2433j0947r583p861
$$ plain form
59381 701427 695543 690950 686782 683204 680866 679560 678494 677488 676814 676231 675375 674804 675446 677228 679407
59366 679407 681990 685598 690097 694700 699395 704988 711695 718942 726683 735687 746282 757907 770151
59353 770151 783259 797434 812560 828729 846131 864311 882465 900524 918939 937311 954272
59342 954272 968842 980901 990206 996049 998133 996830 992325 984485 973797 961374 947647 931955 913754
59329 913754 893529 872306 851117 831083 813036 796761 781378 766670 753223 741179 729854
59318 729854 718864 708636 699489 691068 683087 675838 669610 664251 659511 655167 650787 646268 642696 641733
59304 641733 643940 648520 654778 662801 672569 683531 695348 707836 719691 728351 731817 729959 723749
59291 723749 714214 702624 690707 679781 670160 661755 654687 649039 644773 642273 642205 644490 648182 652763
$$ packed form
59381G01427n884m593m168l578k338j306j066j006o74n83q56n71O42J782K179
59366F79407K583L608M499M603M695N593O707P247P741R004J0595J1625J2244
59353G70151J3108J4175J5126J6169J7402J8180J8154J8059J8415J8372J6961
59342I54272J4570J2059R305N843K084j303m505p840j0688j2423j3727j5692j8201
59329I13754k0225k1223k1189k0034j8047j6275j5383j4708j3447j2044j1325
59318G29854j0990j0228r147q421p981p249o228n359m740m344m380m519l572r63
59304F41733K207M580O258Q023R768J0962J1817J2488J1855Q660L466j858o210
59291G23749r535j1590j1917j0926r621q405p068n648m266k500o8K285L692M581
$$ plain form
59277 652763 658810 666922 676738 687500 698964 711287 724551 738710 753452 767889 781013 792660
59265 792660 803410 813323 821557 827419 831041 832781 832734 831102 828238 824008 817876 809981 801413 793223
59251 793223 785862 779669 774979 771507 768530 766027 764781 765155 766692 769114 772593 776682 780142 782368
59237 782368 783963 785351 785839 784795 782751 780495 777771 773687 767913 760830 752957 744714 736288 727376
59223 727376 717553 707120 696962 687467 678295 669361 661138 653759 646856 640547 635508 631623 627654 622873
59209 622873 618119 614654 612850 612438 613081 614136 614812 615155 616036 617674 619186 620079 620975 622217 623012 622900
59193 622900 622959 624407 626884 629255 631328 633670 636319 638818 641108 643408 645549 647311 649033 651122 653236
59178 653236 654689 655436 656094 657258 659171 661678 664175 666075 667611 669596 672197 674750 677035 679721 683091
$$ packed form
59277F52763O047Q112R816J0762J1464J2323J3264J4159J4742J4437J3124J1647
59265G92660J0750R913Q234N862L622J740m7j632k864m230o132p895q568q190
59251G93223p361o193m690l472k977k503j246L74J537K422L479M089L460K226
59237G82368J595J388M88j044k044k256k724m084n774p083p873q243q426q912
59223G27376r823j0433j0158r495r172q934q223p379o903o309n039l885l969m781
59209F22873m754l465j804m12O43J055O76L43Q81J638J512Q93Q96J242P95j12
59193F22900N9J448K477K371K073K342K649K499K290K300K141J762J722K089K114
59178F53236J453P47O58J164J913K507K497J900J536J985K601K553K285K686L370
$$ plain form
59163 683091 686392 689040 691402 693588 694532 693233 690060 685830 680398 673256 664931 656642 648887 641216
59149 641216 633097 624344 615098 606035 598148 591715 585921 580012 574241 569152 564614 560247 556165 552652
59135 552652 549648 547158 545565 545063 545421 546729 549445 553216 556640 558965 561111 564268 568418 573069 578423
59120 578423 584819 591860 599147 607161 616439 626588 637056 648060 659810 671589 682671 693353
59108 693353 703984 713783 721843 728613 735108 741266 746303 750103 752877 753991 752546 748921 744478 739998
59094 739998 735531 731534 728815 727388 726471 725588 724835 724201 723469 722590 721280 718640 714125 708593 703368 698546
59078 698546 693229 687220 681350 676126 671093 665682 659881 653971 648215 642834 637811 632846 627918 623575
59064 623575 620152 617142 613947 610815 608381 606635 605052 603356 601496 599214 596336 593271 590731 589112
$$ packed form
59163F83091L301K648K362K186R44j299l173m230n432p142q325q289p755p671
59149F41216q119q753r246r063p887o433n794n909n771n089m538m367m082l513
59135E52652l004k490j593n02L58J308K716L771L424K325K146L157M150M651N354
59120E78423O396P041P287Q014R278J0149J0468J1004J1750J1779J1082J0682
59108F93353J0631R799Q060O770O495O158N037L800K774J114j445l625m443m480
59094G39998m467l997k719j427r17q83p53o34p32q79j310k640m515n532n225m822
59078F98546n317o009n870n224n033n411n801n910n756n381n023m965m928m343
59064F23575l423l010l195l132k434j746j583j696j860k282k878l065k540j619
$$ plain form
59050 589112 588379 588022 586967 584432 581198 579091 578703 578796 578520 578765 580274 581874 582112 581569 581849 583015 583818
59033 583818 584020 584789 586909 590068 593960 598868 605107 612761 621920 632372 643371 654468 666120 678695
59019 678695 691437 703263 713880 723133 730032 733693 734647 733983 731753 727547 722072 716746 712066 707758
59005 707758 704176 702261 702250 703622 706111 709672 713798 717948 722331 727224 731997 735838 738863 741415 743024
58990 743024 743383 743614 744911 746491 746569 744957 743047 741570 740137 738831 738491 739292 740585 742244 744898 748876
58974 748876 754196 761370 770772 781401 791731 801660 812184 823381 834318 844866 855892 867540
58962 867540 878845 889123 898314 905933 911221 914334 915886 915273 911050 903075 892686 880665 866732
58949 866732 851240 835589 820437 805122 789437 774548 761454 749857 739206 729826 722384 717075
$$ packed form
59050E89112p33l57j055k535l234k107l88R3k76K45J509J600K38n43K80J166Q03
59033E83818K02P69K120L159L892M908O239P654R159J0452J0999J1097J1652J2575
59019F78695J2742J1826J0617R253O899L661R54o64k230m206n475n326m680m308
59005G07758l582j915j1J372K489L561M126M150M383M893M773L841L025K552J609
58990G43024L59K31J297J580P8j612j910j477j433j306l40Q01J293J659K654L978
58974G48876N320P174R402J0629J0330R929J0524J1197J0937J0548J1026J1648
58962H67540J1305J0278R191P619N288L113J552o13m223p975j0389j2021j3933
58949H66732j5492j5651j5152j5315j5685j4889j3094j1597j0651r380p442n309
$$ plain form
58937 717075 713681 711563 709441 706161 701902 697842 694729 692660 691854 692324 692978 692509 691147 690170 689726 688675
58921 688675 686555 684140 681917 679599 677351 675993 675639 675575 675671 676550 678135 679553 680781 682999 687007 692606
58905 692606 699695 708514 718674 729464 741273 755111 770531 785723 799932 814012 828308 841893
58893 841893 854555 867649 882183 897706 913879 931464 950803 970746 990042 1008471 1025733
58882 1025733 1040512 1051634 1059100 1063249 1063982 1061535 1056885 1050591 1042149 1031096 1017814 1002880 986783
58869 986783 970721 956477 944895 935475 927723 921589 916259 910090 902454 894350 886559 878500 869518
58856 869518 859954 850237 840165 829774 819687 809946 799797 789279 779744 771970 764952 757347 749013
58843 749013 740394 731470 722123 712602 702964 692939 682825 673552 665483 658129 651347 645713 641473 638327
$$ packed form
58937G17075l394k118k122l280m259m060l113k069q06M70O54m69j362r77m44j051
58921F88675k120k415k223k318k248j358l54o4R6Q79J585J418J228K218M008N599
58905F92606P089Q819J0160J0790J1809J3838J5420J5192J4209J4080J4296J3585
58893H41893J2662J3094J4534J5523J6173J7585J9339J9943J9296J8429J7262
58882A025733J4779J1122P466M149P33k447m650o294q442j1053j3282j4934j6097
58869I86783j6062j4244j1582r420p752o134n330o169p636q104p791q059q982
58856H69518r564r717j0072j0391j0087r741j0149j0518r535p774p018p605q334
58843G49013q619q924r347r521r638j0025j0114r273q069p354o782n634m240l146
$$ plain form
58829 638327 636398 636058 636613 636757 636603 637587 640022 642549 644471 646732 649937 653306 656433 660121 664430
58814 664430 667774 669206 669955 671370 672889 673412 673255 673240 673039 671855 669848 667588 664873 661167 656544 651425
58798 651425 646127 641233 637422 634403 631044 627000 623003 619248 615034 610475 606901 604878 603548 602629
58784 602629 603240 605811 608965 611620 614450 618118 621756 624499 626941 629704 631999 632961 633053 632872 631921 629723
58768 629723 626824 623529 619114 613497 608196 604324 601108 597601 594284 591667 589008 585949 583839 583817 585010
58753 585010 586232 587891 590503 592844 593612 593674 594740 596816 598848 600887 603746 607313 610937 614813 619467
58738 619467 624614 629906 635856 642744 649649 655913 662389 669828 677337 684014 690744 698520 706242 712225
58724 712225 716938 722147 728120 733720 738730 744164 750568 757620 765126 773005 780662 787554 793841 799466
$$ packed form
58829F38327j929l40N55J44j54R84K435K527J922K261L205L369L127L688M309
58814F64430L344J432P49J415J519N23j57j5k01j184k007k260k715l706m623n119
58798F51425n298m894l811l019l359m044l997l755m214m559l574k023j330r19
58784F02629O11K571L154K655K830L668L638K743K442K763K295R62R2j81r51k198
58768F29723k899l295m415n617n301l872l216l507l317k617k659l059k110k2J193
58753E85010J222J659K612K341P68O2J066K076K032K039K859L567L624L876M654
58738F19467N147N292N950O888O905O264O476P439P509O677O730P776P722N983
58724G12225M713N209N973N600N010N434O404P052P506P879P657O892O287N625
$$ plain form
58710 799466 803436 805093 805140 804224 801583 796271 788540 778699 765975 750105 732784 715812 698959 681346
58696 681346 663692 647242 631520 615261 598854 583969 571369 560755 552056 545201 539320 533736
58684 533736 528963 525339 521728 517206 512928 510516 509583 508684 507754 507685 508397 509316 510998 514366 519016 524044
58668 524044 529870 537479 546718 557061 569041 583037 597449 610025 620229 628425 633777 635097 633104
58655 633104 629712 625604 620277 613810 606783 599210 591398 584899 580654 577048 571917 565721 560650 557425
58641 557425 555129 553461 552901 553123 553320 553615 554323 554538 553379 551792 551113 550690 548972 546012 542725 538627
58625 538627 532645 525315 517841 509886 500756 491891 485536 481627 478579 476534 477182 480920 486770 494549
58611 494549 504385 514539 522532 528279 533610 538980 543198 546134 548980 551911 553985 555245 556641 558042
$$ packed form
58710G99466L970J657M7r16k641n312p731r841j2724j5870j7321j6972j6853j7613
58696F81346j7654j6450j5722j6259j6407j4885j2600j0614q699o855n881n584
58684E33736m773l624l611m522m278k412r33q99r30o9P12R19J682L368M650N028
58668E24044N826P609R239J0343J1980J3996J4412J2576J0204Q196N352J320j993
58655F33104l392m108n327o467p027p573p812o499m245l606n131o196n071l225
58641E57425k296j668n60K22J97K95P08K15j159j587o79m23j718k960l287m098
58625E38627n982p330p474p955r130q865o355l909l048k045O48L738N850P779
58611D94549R836J0154P993N747N331N370M218K936K846K931K074J260J396J401
$$ plain form
58597 558042 558598 558738 559522 560493 560604 560714 562654 566302 570141 574157 579517 585991 592566 600090 610249
58582 610249 622255 633557 643577 653677 663754 672094 678603 684996 691730 697831 703766 711318 720519
58569 720519 729864 739750 752496 768736 786958 806834 829716 855421 881830 908125 935068 961543
58557 961543 984254 1001661 1014997 1024659 1029038 1027989 1024129 1019371 1013067 1004850 996352 988754 981242
58544 981242 973160 965129 956883 946511 933073 917680 901060 882538 862371 842551 824184 806342
58532 806342 788467 771604 756485 742684 730443 720932 713988 708014 702711 699389 698021 696698 694648
58519 694648 693051 692161 690518 687781 685464 683932 681578 677966 674890 673244 671636 669214 667004 665416
58505 665416 663245 660348 658423 657903 656915 654663 653038 653373 654273 654146 653462 653104 652823 652631 653472 655428 657532
$$ packed form
58597E58042N56J40P84R71J11J10J940L648L839M016N360O474O575P524J0159
58582F10249J2006J1302J0020J0100J0077Q340O509O393O734O101N935P552R201
58569G20519R345R886J2746J6240J8222J9876K2882K5705K6409K6295K6943K6475
58557I61543K2711J7407J3336R662M379j049l860m758o304q217q498p598p512
58544I81242q082q031q246j0372j3438j5393j6620j8522k0167j9820j8367j7842
58532H06342j7875j6863j5119j3801j2241r511o944n974n303l322j368j323k050
58519F94648j597q90j643k737k317j532k354l612l076j646j608k422k210j588
58505F65416k171k897j925n20r88k252j625L35R00j27o84l58k81j92Q41J956K104
$$ plain form
58488 657532 660168 665126 672517 680304 687736 696394 707038 718416 730181 743783 759282 774372 787798
58475 787798 800627 812838 821915 826384 827655 826746 822323 813780 803365 793442 784250 775843 769450 765351
58461 765351 762203 759947 760626 764918 770796 776978 784667 794388 804257 813013 821641 830380 837187 840810
58447 840810 842281 841836 837734 829847 821051 813155 804757 794968 785834 779000 773357 768084 764703 763943 763865
58432 763865 763312 763983 766948 770414 773171 776874 782704 789137 795258 802657 811644 819196 823254 825474 827098
58417 827098 825900 820341 813146 807444 802462 796138 788864 781554 773159 763363 754805 749544 746060 742575
58403 742575 740209 739979 739966 738671 738107 740351 744010 747213 750936 756170 760922 763433 765404 768763 772201
58388 772201 774075 775645 778202 780161 780365 781070 784215 787863 789798 791403 794501 797672 799436 801815 806922
$$ packed form
58488F57532K636M958P391P787P432Q658J0644J1378J1765J3602J5499J5090J3426
58475G87798J2829J2211R077M469J271r09m423q543j0415r923r192q407o393m099
58461G65351l148k256O79M292N878O182P689R721R869Q756Q628Q739O807L623
58447H40810J471m45m102p887q796p896q398r789r134o834n643n273l381p60p8
58432G63865n53O71K965L466K757L703N830O433O121P399Q987P552M058K220J624
58417H27098j198n559p195n702m982o324p274p310q395r796q558n261l484l485
58403G42575k366k30j3j295n64K244L659L203L723N234M752K511J971L359L438
58388G72201J874J570K557J959K04P05L145L648J935J605L098L171J764K379N107
$$ plain form
58373 806922 813105 818239 823683 831232 839353 846326 853821 863424 872937 880265 887729 898258 910444 921578
58359 921578 932384 944381 955693 964027 970914 978609 985668 989875 992586 995881 998501 998921 999243 1001671
58345 1001671 1004414 1005595 1007723 1013566 1021116 1027663 1035407 1047694 1062865 1077189 1090920 1106193 1121937
58332 1121937 1136208 1150618 1167042 1182761 1194142 1202330 1210164 1216555 1219282 1220286 1222716 1225641 1226974
58319 1226974 1228457 1232379 1236727 1239154 1242283 1249363 1258233 1265500 1273023 1284020 1296417 1306561 1316002
58306 1316002 1328043 1341098 1352270 1363947 1379867 1397904 1413763 1428443 1445087 1461913 1475617
58295 1475617 1488400 1504258 1521660 1537205 1552917 1572257 1592652 1609959 1626677 1647583 1670870
58284 1670870 1692028 1712756 1737304 1763629 1787232 1810236 1837497 1867239 1895017 1923423 1957952
$$ packed form
58373H06922O183N134N444P549Q121O973P495R603R513P328P464J0529J2186J1134
58359I21578J0806J1997J1312Q334O887P695P059M207K711L295K620M20L22K428
58345A001671K743J181K128N843P550O547P744J2287J5171J4324J3731J5273J5744
58332A121937J4271J4410J6424J5719J1381Q188P834O391K727J004K430K925J333
58319A226974J483L922M348K427L129P080Q870P267P523J0997J2397J0144R441
58306A316002J2041J3055J1172J1677J5920J8037J5859J4680J6644J6826J3704
58295A475617J2783J5858J7402J5545J5712J9340K0395J7307J6718K0906K3287
58284A670870K1158K0728K4548K6325K3603K3004K7261K9742K7778K8406L4529
$$ plain form
58273 1957952 1996491 2032977 2068435 2108294 2151765 2194204 2237033 2284871 2335656 2384142 2432301
58262 2432301 2485660 2542353 2596608 2649872 2707347 2766825 2822545 2876788 2935851 2997924 3057189
58251 3057189 3116404 3182644 3254011 3323749 3394168 3473023 3559448 3647295 3738889 3841083 3951268
58240 3951268 4062152 4176804 4303671 4440549 4579545 4723874 4882934 5054739 5230919
58231 5230919 5415122 5617949 5837613 6064915 6303479 6564913 6848034 7144148 7458849
58222 7458849 7806237 8185597 8587416 9018528 9496564 10023735 10592512 11213172 11907854
58213 11907854 12681744 13530197 14470543 15535635 16741286 18095704 19638306 21433575
58205 21433575 23531669 25974444 28834207 32202342 36146930 40733914 46089494 52395249
$$ packed form
58273A957952L8539L6486L5458L9859M3471M2439M2829M7838N0785M8486M8159
58262B432301N3359N6693N4255N3264N7475N9478N5720N4243N9063O2073N9265
58251C057189N9215O6240P1367O9738P0419P8855Q6425Q7847R1594J02194J10185
58240C951268J10884J14652J26867J36878J38996J44329J59060J71805J76180
58231E230919J84203K02827K19664K27302K38564K61434K83121K96114L14701
58222G458849L47388L79360M01819M31112M78036N27171N68777O20660O94682
58213A1907854P73890Q48453R40346J065092J205651J354418J542602J795269
58205B1433575K098094K442775K859763L368135L944588M586984N355580O305755
$$ plain form
58197 52395249 59839684 68646399 79142579 91714857 106685645 124296689 144786800
58190 144786800 168376925 195202672 225375767 258933029 295169986 331641024 364079419
58183 364079419 387923223 400320080 400823599 390518280 370974806 344086220 312300566
58176 312300566 278349541 244559327 212474760 183005207 156667928 133659813 113901865
58169 113901865 97164290 83154513 71516928 61858158 53829813 47159633 41605971
58162 41605971 36940602 32988707 29636196 26782095 24320492 22174306 20304137 18670998
58154 18670998 17222648 15923135 14761801 13723741 12780196 11914648 11129751 10421021 9769330
58145 9769330 9165251 8615573 8119391 7661223 7233385 6842457 6487706 6154613 5835637
$$ packed form
58197E2395249P444435Q806715J0496180J2572278J4970788J7611044K0490111
58190A44786800K3590125K6825747L0173095L3557262L6236957L6471038L2438395
58183C64079419K3843804J2396857N03519j0305319j9543474k6888586l1785654
58176C12300566l3951025l3790214l2084567k9469553k6337279k3008115j9757948
58169A13901865j6737575j4009777j1637585r658770q028345o670180n553662
58162D1605971m665369l951895l352511k854101k461603k146186j870169j633139
58154A8670998j448350j299513j161334j038060r43545q65548p84897p08730o51691
58145I769330o04079n49678m96182m58168m27838l90928l54751l33093l18976
$$ plain form
58136 5835637 5537232 5261013 4997476 4743708 4508571 4294835 4093661 3901590 3725853
58127 3725853 3568055 3419175 3275572 3144015 3026233 2914017 2804264 2703731 2614247 2527880
58117 2527880 2441469 2361664 2290779 2221580 2151043 2085809 2028815 1973365 1915706 1861243 1813061
58106 1813061 1765879 1716475 1669091 1625748 1581966 1536645 1495650 1461067 1427135 1391123 1358131
58095 1358131 1330794 1304317 1276150 1250831 1230596 1210575 1187884 1166531 1148946 1131451 1112418
58084 1112418 1096213 1084623 1072636 1057047 1041209 1027196 1011374 991981 973276 957823 942044
58073 942044 923436 904844 887819 869199 848307 830205 817654 806700 794158 782593 774017 765536
58061 765536 755308 746269 739958 732951 723278 714145 707611 700762 691701 683100 676280 668081 657353 648207
$$ packed form
58136E835637k98405k76219k63537k53768k35137k13736k01174j92071j75737
58127C725853j57798j48880j43603j31557j17782j12216j09753j00533q9484q6367
58117B527880q6411p9805p0885o9199p0537o5234n6994n5450n7659n4463m8182
58106A813061m7182m9404m7384m3343m3782m5321m0995l4583l3932l6012l2992
58095A358131k7337k6477k8167k5319k0235k0021k2691k1353j7585j7495j9033
58084A112418j6205j1590j1987j5589j5838j4013j5822j9393j8705j5453j5779
58073I42044j8608j8592j7025j8620k0892j8102j2551j0954j2542j1565q576q481
58061G65536j0228r039o311p007r673r133o534o849r061q601o820q199j0728r146
$$ plain form
58047 648207 642923 637763 629777 621749 616357 611256 604155 597214 592238 586778 579076 571716 566534 560956
58033 560956 553190 545958 541239 536324 528982 521622 516433 511208 503884 496622 491482 486556 480148 474379
58019 474379 470926 467590 462768 459039 458576 459127 458137 456775 456462 455583 453066 451043 450596 449064 445045 441737
58003 441737 441734 442698 441828 440431 440343 439933 437497 434791 433421 431489 427457 423576 421866 420495 417716 415476
57987 415476 415375 415030 412510 410509 411853 414356 414431 412552 410945 409027 405459 401810 399982 398557 395605
57972 395605 392526 391365 390960 389463 388008 388167 388443 387018 385419 385735 386724 386362 385788 387020 389079 389986
57956 389986 390340 391442 392165 391118 389605 389110 388174 385105 381369 378981 377065 374370 372608 373756 376531
57941 376531 379126 382868 389487 397280 403932 410765 420169 430929 440141 447821 455648 462946 467781 470377
$$ packed form
58047F48207n284n160p986q028n392n101p101o941m976n460p702p360n182n578
58033E60956p766p232m719m915p342p360n189n225p324p262n140m926o408n769
58019D74379l453l336m822l729m63N51r90j362l13q79k517k023m47j532m019l308
58003D41737lR64q70j397q8m10k436k706j370j932m032l881j710j371k779k240
57987D15476j01l45k520k001J344K503P5j879j607j918l568l649j828j425k952
57972C95605l079j161m05j497j455J59K76j425j599L16R89l62n74J232K059R07
57956C89986L54J102P23j047j513m95r36l069l736k388j916k695j762J148K775
57941C76531K595L742O619P793O652O833R404J0760R212P680P827P298M835K596
$$ plain form
57927 470377 471726 470557 465427 458063 450907 443087 432631 420867 410673 401862 392333 382430 374196
57914 374196 367507 360847 354891 351510 350060 348273 346056 345021 345176 345302 345685 347276 349136 349848 350339
57899 350339 352127 354023 353890 352487 352149 352792 352698 352240 353250 355463 357063 358139 360379 363940 367606 371272
57883 371272 375314 378506 379642 380239 382455 385358 386480 385979 385876 386187 385353 383684 382815 382414 380936 379069
57867 379069 378880 380070 380573 380412 381470 383763 385492 386603 388821 392199 394948 396704 398772 401144 402454
57852 402454 402948 404387 406903 408845 409773 410676 411303 410304 408141 406928 407161 407292 406560 405600 404292 401828
57836 401828 398977 397657 398224 399570 401547 404614 407599 408835 409228 411150 414477 416912 418106 420129 423624
57821 423624 426783 428579 429946 431227 431374 430276 429133 428016 425686 422176 418780 415098 408972 399961
$$ packed form
57927D70377J349j169n130p364p156p820j0456j1764j0194q811r529r903q234
57914C74196o689o660n956l381j450j787k217j035J55J26L83J591J860P12M91
57899C50339J788J896j33j403l38O43r4m58J010K213J600J076K240L561L666L666
57883C71272M042L192J136N97K216K903J122n01j03L11q34j669q69m01j478j867
57867C79069j89J190N03j61J058K293J729J111K218L378K749J756K068K372J310
57852D02454M94J439K516J942R28R03O27r99k163j213K33J31p32r60j308k464
57836D01828k851j320N67J346J977L067K985J236L93J922L327K435J194K023L495
57821D23624L159J796J367J281J47j098j143j117k330l510l396l682o126r011
$$ plain form
57807 399961 390172 381036 371890 362331 353301 345117 336958 329037 322924 318945 315503 311578 307756 304388
57793 304388 301001 297899 296069 295137 293750 292285 292705 295325 298205 300256 302511 305839 309855 314601 320821
57778 320821 327955 334257 339473 345062 351302 356672 360636 364419 368337 370900 371469 371357 371449 371066 370022
57763 370022 369436 369608 369391 368593 368792 370927 374225 378222 383499 389639 394907 398910 403160 407966 411081
57748 411081 410596 406894 400638 391257 378926 365967 354700 345482 337971 332476 328855 325848 322757 320306
57734 320306 318925 317825 316606 315991 316141 316024 315285 314880 315092 314926 314252 314418 315815 317028 317482 318662 321402
57717 321402 324181 325516 326020 326594 326553 325270 323975 324175 325672 327583 329882 332529 334526 335291 335733 336732
57701 336732 337791 338305 338768 339675 340629 341540 343097 345024 345545 343812 341182 338807 335713 330758 324864 319638
$$ packed form
57807C99961r789r136r146r559r030q184q159p921o113l979l442l925l822l368
57793C04388l387l102j830r32j387j465M20K620K880K051K255L328M016M746O220
57778C20821P134O302N216N589O240N370L964L783L918K563N69j12R2l83j044
57763C70022n86J72k17p98J99K135L298L997N277O140N268M003M250M806L115
57748D11081m85l702o256r381j2331j2959j1267r218p511n495l621l007l091k451
57734C20306j381j100j219o15J50j17p39m05K12j66o74J66J397J213M54J180K740
57717C21402K779J335N04N74m1j283j295K00J497J911K299K647J997P65M42R99
57701C36732J059N14M63R07R54R11J557J927N21j733k630k375l094m955n894n226
$$ plain form
57685 319638 315174 310887 307317 305507 305585 307303 310976 316665 323630 331849 342891 358093 377160 399830
57671 399830 427486 461499 501149 544906 592754 645171 699944 751267 791929 816010 820594 806382
57659 806382 776712 735577 686896 635132 584713 538033 495290 456793 423842 396657 373366
57648 373366 352309 333938 319251 307767 298258 290237 283502 277474 272096 268193 265872 263812 261136
57635 261136 258656 257238 256429 255791 256040 257505 258878 258992 258496 258457 258570 258177 257659 257354 256390 254179 251875
57618 251875 250703 249963 248226 245482 242549 239467 236069 233172 231503 230348 228793 227422 227209 227571 227143
57603 227143 225720 223915 221659 218647 215575 213351 211601 209434 207116 205658 205233 205283 205564 205844 205245 203189
57587 203189 200451 198050 195746 192749 189238 186000 183212 180715 178785 177567 176511 175342 174638 174448 173519
$$ packed form
57685C19638m464m287l570j810P8J718L673N689O965Q219J1042J5202J9067K2670
57671C99830K7656L4013L9650M3757M7848N2417N4773N1323M0662K4081M584j4212
57659H06382k9670m1135m8681n1764n0419m6680m2743l8497l2951k7185k3291
57648C73366k1057j8371j4687j1484r509q021o735o028n378l903k321k060k676
57635B61136k480j418q09o38K49J465J373J14m96l9J13l93n18l05r64k211k304
57618B51875j172p40j737k744k933l082l398k897j669j155j555j371k13L62m28
57603B27143j423j805k256l012l072k224j750k167k318j458m25N0K81K80n99k056
57587B03189k738k401k304k997l511l238k788k497j930j218j056j169p04j90r29
$$ plain form
57572 173519 171160 168681 167514 167012 165706 163727 162204 161148 159759 158211 157351 157062 156505 155626 154956 154392
57556 154392 153488 152488 151780 150913 149427 147945 147105 146242 144656 143358 143831 145661 147127 147714 148374 149687
57540 149687 151396 153436 155807 157651 158020 157421 157279 158041 159019 159727 160031 159428 157593 155352 153725 152288
57524 152288 149785 146050 142096 138695 136191 135220 136075 137589 138124 137583 137250 137905 139306 141216 143603 146067
57508 146067 148250 150616 153700 156924 159320 161004 162813 164933 167039 169245 171615 173256 173304 172395 171788
57493 171788 171473 170470 168636 166739 165084 163431 161971 161079 160380 159235 157792 156415 154678 152236 150109
57478 150109 149581 150232 150482 149695 148395 146876 145051 143274 141887 140355 138193 136233 135577 135855 135949 135788
57462 135788 135882 135808 134890 133823 133801 134568 135110 135711 137339 139488 140704 140991 141607 142699 143211 143089 143496 144787
$$ packed form
57572A73519k359k479j167n02j306j979j523j056j389j548q60k89n57q79o70n64
57556A54392r04j000p08q67j486j482q40q63j586j298M73J830J466N87O60J313
57540A49687J709K040K371J844L69n99j42P62R78P08L04o03j835k241j627j437
57524A52288k503l735l954l401k504r71Q55J514N35n41l33O55J401J910K387K464
57508A46067K183K366L084L224K396J684J809K120K106K206K370J641M8r09o07
57493A71788l15j003j834j897j655j653j460q92o99j145j443j377j737k442k127
57478A50109n28O51K50p87j300j519j825j777j387j532k162j960o56K78R4j61
57462A35788R4p4r18j067k2P67N42O01J628K149J216K87O16J092N12j22M07J291
$$ plain form
57444 144787 146195 147543 149386 151432 152731 153464 154583 155722 155522 154171 153530 154422 155868 157313 159509
57429 159509 162580 165213 166521 167084 167477 167328 166475 165593 165077 164609 164204 164366 164896 164945 164464 164225 164306 164080
57411 164080 163809 164565 166349 167976 169108 170682 173011 175180 176643 177719 178209 177357 175619 174627 174825 174911
57395 174911 174203 173707 174129 174562 174136 173434 173361 173815 174279 174611 174725 174564 174758 176076 178059 179522 180518 182188
57377 182188 184621 186664 188055 189775 191918 193276 193622 194285 195781 196970 197407 198438 200749 202818 203115
57362 203115 202190 201283 200472 199586 199479 200965 203541 206275 208941 211372 212935 213613 214421 215881 217267 218131
57346 218131 219145 220578 221421 221061 220483 220814 221944 223495 225719 228428 230442 231236 231854 233204 234777 236021
57330 236021 237475 239390 240689 240632 240222 240643 241539 242099 242619 243644 244719 245384 246308 248133 250169 251539
$$ packed form
57444A44787J408J348J843K046J299P33J119J139k00j351o41Q92J446J445K196
57429A59509L071K633J308N63L93j49q53q82n16m68m05J62N30M9m81k39Q1k26
57411A64080k71P56J784J627J132J574K329K169J463J076M90q52j738r92J98Q6
57395A74911p08m96M22M33m26p02p3M54M64L32J14j61J94J318J983J463R96J670
57377A82188K433K043J391J720K143J358L46O63J496J189M37J031K311K069K97
57362B03115r25r07q11q86j07J486K576K734K666K431J563O78Q08J460J386Q64
57346B18131J014J433Q43l60n78L31J130J551K224K709K014P94O18J350J573J244
57330B36021J454J915J299n7m10M21Q96N60N20J025J075O65R24J825K036J370
$$ plain form
57314 251539 252613 254050 255463 256300 257065 258326 259480 259862 260186 261571 263894 266347 268830 271551 273991
57299 273991 275571 276706 278174 280042 282132 284676 287547 289785 290998 292345 294976 298339 301110 302983
57285 302983 304442 305604 306474 307600 309337 311122 312393 313465 314589 315069 314307 312852 311406 309735 307606
57270 307606 305808 305178 305529 306647 309342 314245 320479 326690 332648 338676 344444 349593 354734 360572 366704
57255 366704 372365 377664 383037 388304 393314 398717 405031 411713 418069 424238 430420 436223 441677 447696
57241 447696 454449 460580 465280 469861 475934 483213 490531 497762 505201 512246 518396 524557 531724 539326
57227 539326 546439 553588 561584 569630 576453 582497 589066 596038 602396 608502 615903 625068 634999 644843
57213 644843 654520 664103 673888 684626 696424 708015 718321 728047 738441 749388 760187 771300
$$ packed form
57314B51539J074J437J413Q37P65J261J154L82L24J385K323K453K483K721K440
57299B73991J580J135J468J868K090K544K871K238J213J347K631L363K771J873
57285C02983J459J162Q70J126J737J785J271J072J124M80p62j455j446j671k129
57270C07606j798o30L51J118K695M903O234O211N958O028N768N149N141N838O132
57255C66704N661N299N373N267N010N403O314O682O356O169O182N803N454O019
57241D47696O753O131M700M581O073P279P318P231P439P045O150O161P167P602
57227E39326P113P149P996Q046O823O044O569O972O358O106P401R165R931R844
57213F44843R677R583R785J0738J1798J1591J0306R726J0394J0947J0799J1113
$$ plain form
57201 771300 783662 797005 810453 824097 838429 852965 867040 881202 896211 911400 925746
57190 925746 939760 954622 970170 985533 1000921 1016966 1033066 1048362 1063706 1080630 1098941
57179 1098941 1117311 1135707 1155217 1175917 1196907 1218094 1240068 1262625 1285277 1308716 1333865
57168 1333865 1359942 1385404 1410359 1436091 1462695 1489206 1515647 1542840 1570529 1597731 1624687
57157 1624687 1652530 1681375 1710652 1740799 1772635 1805520 1838245 1871242 1905743 1941294 1976387
57146 1976387 2011119 2046907 2084013 2121706 2160453 2201434 2244192 2287277 2330957 2376786 2424787
57135 2424787 2473663 2523608 2576190 2631488 2688015 2745466 2804983 2866725 2929787 2994489 3062079
57124 3062079 3132248 3203573 3276307 3352024 3430769 3511589 3595778 3686558 3785603 3892983 4010324
$$ packed form
57201G71300J2362J3343J3448J3644J4332J4536J4075J4162J5009J5189J4346
57190I25746J4014J4862J5548J5363J5388J6045J6100J5296J5344J6924J8311
57179A098941J8370J8396J9510K0700K0990K1187K1974K2557K2652K3439K5149
57168A333865K6077K5462K4955K5732K6604K6511K6441K7193K7689K7202K6956
57157A624687K7843K8845K9277L0147L1836L2885L2725L2997L4501L5551L5093
57146A976387L4732L5788L7106L7693L8747M0981M2758M3085M3680M5829M8001
57135B424787M8876M9945N2582N5298N6527N7451N9517O1742O3062O4702O7590
57124C062079P0169P1325P2734P5717P8745Q0820Q4189R0780R9045J07380J17341
$$ plain form
57113 4010324 4140602 4284748 4441965 4613577 4803185 5013200 5245409 5505652 5804414
57104 5804414 6152790 6562169 7048424 7632001 8333021 9170582 10167801 11353540 12759064
57095 12759064 14418003 16369792 18656491 21313023 24362754 27819336 31682997 35932471
57087 35932471 40527879 45422230 50560194 55864074 61232918 66553431 71681505 76389328
57079 76389328 80353700 83251166 84903121 85336960 84712124 83198574 80917130 77954781
57071 77954781 74395613 70329423 65848171 61046817 56027543 50902527 45794801 40833230
57063 40833230 36137486 31800004 27877439 24393699 21346403 18712475 16455117 14531891
57055 14531891 12899852 11517279 10345420 9350701 8504816 7782987 7163461 6628416 6163681
$$ packed form
57113D010324J30278J44146J57217J71612J89608K10015K32209K60243K98762
57104E804414L48376M09379M86255N83577P01020Q37561R97219J185739J405524
57095A2759064J658939J951789K286699K656532L049731L456582L863661M249474
57087C5932471M595408M894351N137964N303880N368844N320513N128074M707823
57079G6389328L964372K897466J651955M33839o24836j513550k281444k962349
57071G7954781l559168m066190m481252m801354n019274n125016n107726m961571
57063D0833230m695744m337482l922565l483740l047296k633928k257358j923226
57055A4531891j632039j382573j171859r94719q45885p21829o19526n35045m64735
$$ plain form
57046 6163681 5757077 5397855 5077601 4790408 4531547 4296324 4080300 3880017 3693233
57037 3693233 3518546 3354645 3199700 3051539 2908557 2770364 2637746 2512437 2397014
57028 2397014 2294709 2209184 2144026 2100735 2075258 2056579 2030731 1987720 1924791 1843852 1747680
57017 1747680 1639348 1523486 1405869 1291482 1183602 1084351 995164 916560 848106 788870
57007 788870 737757 693513 654844 620746 590685 564386 541445 521106 502492 485145 469190
56996 469190 454859 441987 430184 419374 409940 402476 397585 395705 396844 400584 406608 415122 426522
56983 426522 440709 456715 472705 486214 494823 497078 492798 482615 467640 449594 430493 411752
56971 411752 393913 377492 363435 352388 344086 338107 334802 334934 338766 346038 356567 370353 387365
$$ packed form
57046F163681m06604l59222l20254k87193k58861k35223k16024k00283j86784
57037C693233j74687j63901j54945j48161j42982j38193j32618j25309j15423
57028B397014j02305q5525o5158m3291k5477j8679k5848m3011o2929q0939r6172
57017A747680j08332j15862j17617j14387j07880r9251q9187p8604o8454n9236
57007G88870n1113m4244l8669l4098l0061k6299k2941k0339j8614j7347j5955
56996D69190j4331j2872j1803j0810r434p464m891j880J139L740O024Q514J1400
56983D26522J4187J6006J5990J3509Q609K255m280j0183j4975j8046j9101j8741
56971D11752j7839j6421j4057j1047q302n979l305J32L832P272J0529J3786J7012
$$ plain form
56958 387365 407616 431032 456601 481653 502460 515680 519447 513742 500127 480837 457800 432573
56946 432573 407002 383130 362263 344745 330838 321101 315684 314053 315834 321311 330875 344700 363227
56933 363227 387071 416057 448994 484346 519880 551361 573288 582124 578151 563688 540694 510879
56921 510879 476673 440641 404556 369945 338566 311307 287529 266522 248708 234351 222202
56910 222202 210900 200895 193454 188415 184390 180709 177698 175348 173139 171055 169597 168906 168839 169580 171261
56895 171261 173433 175885 179561 185626 194099 204384 216567 231106 247902 266777 288011 310847
56883 310847 331984 347307 354964 355533 349757 337992 321833 304393 288380 274932 264481 257650
56871 257650 255074 257343 265206 279095 298603 323278 353624 390271 432632 479692 531926 590856
$$ packed form
56958C87365K0251K3416K5569K5052K0807J3220L767n705j3615j9290k3037k5227
56946D32573k5571k3872k0867j7518j3907r737n417j631J781N477R564J3825J8527
56933C63227K3844K8986L2937L5352L5534L1481K1927Q836l973j4463k2994k9815
56921E10879l4206l6032l6085l4611l1379k7259k3778k1007j7814j4357j2149
56910B22202j1302j0005p441n039m025l681l011k350k209k084j458o91o7P41J681
56895A71261K172K452L676O065Q473J0285J2183J4539J6796J8875K1234K2836
56883C10847K1137J5323P657N69n776j1765j6159j7440j6013j3448j0451o831
56871B57650k576K269P863J3889J9508K4675L0346L6647M2361M7060N2234N8930
$$ plain form
56859 590856 656174 723939 787487 839493 873893 887620 881296 858077 822089 778140 731567 686740
56847 686740 646013 611053 584319 567866 561554 564279 576509 599878 634774 680341 736652 804883
56835 804883 885212 976202 1075805 1180200 1280823 1364900 1420857 1443109 1432029 1391447 1327148
56824 1327148 1246165 1155702 1062475 972669 891172 820370 760718 712846 678164 657323 649465
56813 649465 653474 668918 695404 732198 778977 835850 901717 972799 1042613 1102719 1144184 1160509
56801 1160509 1150313 1116828 1064909 999413 925821 850120 776944 708764 647287 594416 551328
56790 551328 517780 493108 477070 469344 469180 476030 489714 509667 534937 565046 599488 635670
56778 635670 668310 691644 701912 697818 679910 650223 611743 567506 520305 472985 428045 386821
$$ packed form
56859E90856O5318O7765O3548N2006L4400J3727o324k3219l5988m3949m6573m4827
56847F86740m0727l4960k6734j6453o312K725J2230K3369L4896M5567N6311O8231
56835H04883Q0329R0990R9603J04395J00623Q4077N5957K2252j1080m0582o4299
56824A327148q0983r0463r3227q9806q1497p0802n9652m7872l4682k0841p858
56813F49465M009J5444K6486L6794M6779N6873O5867P1082O9814O0106M1465J6325
56801A160509j0196l3485n1919o5496p3592p5701p3176o8180o1477n2871m3088
56790E51328l3548k4672j6038p726j64O850J3684J9953K5270L0109L4442L6182
56778F35670L2640K3334J0268m094j7908k9687l8480m4237m7201m7320m4940m1224
$$ plain form
56766 386821 349773 317424 290127 267125 247059 229400 214319 201338 189535 179051 170881 164985
56754 164985 160031 155223 150943 147324 143747 140171 137510 136076 135002 133668 132343 130961 128648 125179
56740 125179 121677 119232 117918 117579 118329 119781 120995 121684 122290 122627 121884 120336 119449 119685 119850 119314 119193
56723 119193 120417 122277 124037 126486 130572 135679 140599 145173 149750 153890 156876 158862 160520 162090
56709 162090 163545 165074 166722 168193 169522 171097 172653 173293 172993 172936 173800 174911 175633 176267 176788 176167
56693 176167 173950 171333 169599 168603 167736 167277 167687 168618 169621 170884 172306 172947 172465 172091 173037 174859
56677 174859 176410 177454 178268 178692 178748 179244 180573 181758 181929 181846 182675 184013 184524 183971 183377 183559 184620
56660 184620 186425 188553 190207 191057 191746 192794 193614 193415 192376 191035 189173 186233 182259 177585 172194
$$ packed form
56766C86821l7048l2349k7297k3002k0066j7659j5081j2981j1803j0484q170n896
56754A64985m954m808m280l619l577l576k661j434j074j334j325j382k313l469
56740A25179l502k445j314l39P50J452J214O89O06L37p43j548q87K36J65n36j21
56723A19193J224J860J760K449M086N107M920M574M577M140K986J986J658J570
56709A62090J455J529J648J471J329J575J556O40l00n7Q64J111P22O34N21o21
56693A76167k217k617j734r96q67m59M10R31J003J263J422O41m82l74R46J822
56677A74859J551J044Q14M24N6M96J329J185J71q3Q29J338N11n53n94J82J061
56660A84620J805K128J654Q50O89J048Q20j99j039j341j862k940l974m674n391
$$ plain form
56645 172194 166144 159984 153985 147684 140890 134336 128606 123355 118368 114373 111813 109810 107445 105197
56631 105197 104029 103961 104602 106213 108951 111921 114235 116294 118802 121246 122724 123587 124859 126498 127673
56616 127673 128379 129483 131315 133325 135006 136227 136900 137161 137526 138114 138182 137204 135873 135250 135432 135899 136505
56599 136505 137263 137763 137753 137750 138201 138647 138594 138575 139407 140934 142372 143339 143784 143549 142800 142296 142491 143106 144128
56580 144128 146162 148984 150929 150860 149746 149204 149528 150331 151996 154970 158442 161238 163437 165820 168430
56565 168430 171012 174210 178929 185052 191998 199901 208886 217895 225621 232118 238188 243748 248134 251455
56551 251455 254260 256320 257076 256892 256641 256445 255945 255328 254915 254254 252823 251109 249874 248845 247221 244943
56535 244943 242478 240003 237744 236225 235124 232940 229047 225052 222744 221703 220438 218726 217095 215002
$$ packed form
56645A72194o050o160n999o301o794o554n730n251m987l995k560k003k365k248
56631A05197j168o8O41J611K738K970K314K059K508K444J478Q63J272J639J175
56616A27673P06J104J832K010J681J221O73K61L65N88O8r78j331o23J82M67O06
56599A36505P58N00j0lM51M46n3j9Q32J527J438R67M45k35p49n04J95O15J022
56580A44128K034K822J945o9j114n42L24Q03J665K974L472K796K199K383K610
56565A68430K582L198M719O123O946P903Q985R009P726O497O070N560M386L321
56551B51455K805K060P56j84k51j96n00o17m13o61j431j714j235j029j624k278
56535B44943k465k475k259j519j101k184l893l995k308j041j265j712j631k093
$$ plain form
56521 215002 211611 207710 204883 203170 201319 198904 196487 194161 191620 189222 187339 185168 181950 178803
56507 178803 177521 177929 178307 178046 177963 178255 178149 177610 177602 178536 179959 181700 183843 185751 186592 186704 187052 187598
56489 187598 187605 187150 186917 186967 187169 188245 190712 193359 194545 194468 194374 194177 192956 191310 190978 192262 193927 195431
56471 195431 197161 198611 198598 197400 196599 196662 196606 196174 196308 197267 198204 198855 199823 200962 201326 200962 201065 202105
56453 202105 203417 204720 206351 207982 208824 209163 209999 211198 211713 211534 211591 211878 211625 211146 211449 212075 211583
56436 211583 210198 209703 210476 211013 210722 210847 212032 213173 213401 213257 213230 212998 212704 213141 214120 214376 213598 212914
56418 212914 213031 213614 214693 216763 219247 220858 221736 223225 225294 226418 226326 226540 227717 228824 229583 231286
56402 231286 234259 236779 237641 237792 238443 239439 240378 241429 242155 241496 239869 239334 240720 242451 243174 243603 244648
$$ packed form
56521B15002l391l901k827j713j851k415k417k326k541k398j883k171l218l147
56507A78803j282M08L78k61q3K92j06n39qR34J423J741K143J908Q41J12L48N46
56489A87598Pm55k33N0K02J076K467K647J186p7r4j97j221j646l32J284J665J504
56471A95431J730J450j3j198q01O3n6m32J34R59R37O51R68J139L64l64J03J040
56453B02105J312J303J631J631Q42L39Q36J199N15j79N7K87k53m79L03O26m92
56436B11583j385m95P73N37k91J25J185J141K28j44k7k32k94M37R79K56p78o84
56418B12914J17N83J079K070K484J611Q78J489K069J124r2K14J177J107P59J703
56402B31286K973K520Q62J51O51R96R39J051P26o59j627n35J386J731P23M29J045
$$ plain form
56385 244648 245485 244668 241560 235771 226856 215615 204125 193571 183566 174261 167227 163348 161664 161294
56371 161294 162732 166218 170554 174692 178941 183607 187999 191710 195387 199293 202647 205159 207679 210587
56357 210587 213239 215703 219130 223521 227028 228529 229174 230384 232045 233698 235709 238094 239833 240528 241293
56342 241293 243060 245399 247793 250428 252949 254228 254260 254557 255826 257009 257388 257739 258529 258964 258828 259303
56326 259303 260964 262889 264755 267691 271922 275686 277850 279632 282327 285288 287535 289512 291714 293337
56312 293337 293834 294257 295654 297535 299215 301235 304319 308280 312804 317839 322609 326147 329398 334629 341975
56297 341975 348916 354079 358989 364917 370788 375716 380955 387447 393883 399163 404569 411543 419324 426784
56283 426784 434564 443474 452680 461414 470650 481244 492279 503070 514853 528613 543169 557355
$$ packed form
56385B44648Q37q17l108n789q915j1241j1490j0554j0005r305p034l879j684l70
56371A61294J438L486M336M138M249M666M392L711L677L906L354K512K520K908
56357B10587K652K464L427M391L507J501O45J210J661J653K011K385J739O95P65
56342B41293J767K339K394K635K521J279L2K97J269J183L79L51P90M35j36M75
56326B59303J661J925J866K936M231L764K164J782K695K961K247J977K202J623
56312B93337M97M23J397J881J680K020L084L961M524N035M770L538L251N231P346
56297C41975O941N163M910N928N871M928N239O492O436N280N406O974P781P460
56283D26784P780Q910R206Q734R236J0594J1035J0791J1783J3760J4556J4186
$$ plain form
56271 557355 572163 588719 606109 623429 642150 664140 688909 715033 742870 773758 807922
56260 807922 845215 886716 933706 986242 1044357 1109411 1182800 1264740 1355606 1456731 1568483
56249 1568483 1689348 1818238 1955730 2101573 2253115 2407644 2563915 2719715 2870341
56240 2870341 3011453 3141155 3257378 3355781 3432457 3486432 3517377 3523427 3503728 3460832 3398007
56229 3398007 3316364 3217089 3104152 2982097 2853080 2718552 2581671 2445408 2310478 2177756
56219 2177756 2050480 1931257 1819087 1712218 1611734 1519349 1433965 1353752 1279537 1212768
56209 1212768 1151966 1094706 1041470 994100 951855 912409 875489 842318 812573 784927 759560
56198 759560 737270 717299 698618 682056 668642 657334 646860 637949 631174 624624 616599 608593
$$ packed form
56271E57355J4808J6556J7390J7320J8721K1990K4769K6124K7837L0888L4164
56260H07922L7293M1501M6990N2536N8115O5054P3389Q1940R0866J01125J11752
56249A568483J20865J28890J37492J45843J51542J54529J56271J55800J50626
56240B870341J41112J29702J16223R8403P6676N3975L0945O050j9699m2896o2825
56229C398007q1643r9275j12937j22055j29017j34528j36881j36263j34930j32722
56219B177756j27276j19223j12170j06869j00484r2385q5384q0213p4215o6769
56209A212768o0802n7260n3236m7370m2245l9446l6920l3171k9745k7646k5367
56198G59560k2290j9971j8681j6562j3414j1308j0474q911o775o550q025q006
$$ plain form
56186 608593 602592 597492 591350 585124 580804 577818 574669 572228 571864 572200 571331 570449 571612 573756 574697
56171 574697 575312 577804 581501 584404 587464 593202 601216 608954 615890 623329 631283 639158 648239 659945
56157 659945 672947 685492 698987 715745 735005 755028 777194 803852 833947 865225 899194
56146 899194 939492 986803 1039924 1100302 1170778 1251030 1338891 1434848 1540266 1652014 1763596
56135 1763596 1870906 1972474 2065370 2146120 2215332 2276800 2332300 2381309 2424656 2463613 2496019
56124 2496019 2518001 2529131 2531671 2525677 2509394 2483534 2450372 2409203 2357134 2293516 2219232 2133004
56112 2133004 2033555 1924592 1812754 1701548 1592040 1488089 1395153 1314482 1243706 1182488
56102 1182488 1132400 1092063 1057848 1028891 1006369 988757 973096 959939 951542 946238 940358 934649
$$ packed form
56186F08593o001n100o142o226m320k986l149k441l64L36q69q82J163K144R41
56171E74697O15K492L697K903L060N738Q014P738O936P439P954P875R081J1706
56157F59945J3002J2545J3495J6758J9260K0023K2166K6658L0095L1278L3969
56146H99194M0298M7311N3121O0378P0476Q0252Q7861R5957J05418J11748J11582
56135A763596J07310J01568R2896Q0750O9212O1468N5500M9009M3347L8957L2406
56124B496019K1982J1130K540n994j6283k5860l3162m1169n2069o3618p4284q6228
56112B133004r9449j08963j11838j11206j09508j03951r2936q0671p0776o1218
56102A182488n0088m0337l4215k8957k2522j7612j5661j3157q397n304n880n709
$$ plain form
56090 934649 932733 934174 935309 936125 939834 946105 951280 955089 960757 968614 975876 982586 991475 1002160
56076 1002160 1011735 1020757 1032252 1045319 1056418 1066525 1079968 1096510 1111736 1125214 1140909 1159408
56064 1159408 1177067 1193160 1210541 1228851 1244312 1256734 1269650 1283303 1294659 1304360 1316151
56053 1316151 1329432 1340113 1348869 1360610 1375766 1390314 1404443 1422568 1444476 1465280 1484633
56042 1484633 1507096 1532888 1557414 1580593 1607214 1637246 1665427 1691572 1721548 1756756 1792424
56031 1792424 1827588 1866726 1909976 1951865 1991399 2033391 2078283 2121044 2161616 2205735 2253798
56020 2253798 2299946 2343846 2392057 2445959 2500032 2553902 2613909 2680585 2747107 2812608 2884217
56009 2884217 2963371 3043283 3122771 3209077 3303929 3400697 3498566 3605229 3722159 3841909 3963552
$$ packed form
56090I34649j916J441J135Q16L709O271N175L809N668P857P262O710Q889J0685
56076A002160R575R022J1495J3067J1099J0107J3443J6542J5226J3478J5695J8499
56064A159408J7659J6093J7381J8310J5461J2422J2916J3653J1356R701J1791
56053A316151J3281J0681Q756J1741J5156J4548J4129J8125K1908K0804J9353
56042A484633K2463K5792K4526K3179K6621L0032K8181K6145K9976L5208L5668
56031A792424L5164L9138M3250M1889L9534M1992M4892M2761M0572M4119M8063
56020B253798M6148M3900M8211N3902N4073N3870O0007O6676O6522O5501P1609
56009B884217P9154P9912P9488Q6306R4852R6768R7869J06663J16930J19750J21643
$$ plain form
55998 3963552 4095539 4239420 4386599 4535303 4694470 4866481 5043028 5222841 5415926
55989 5415926 5625312 5842962 6069055 6316209 6588842 6878199 7183854 7519281 7889701
55980 7889701 8286419 8710098 9176661 9692871 10250641 10853738 11524269 12274157 13098064
55971 13098064 14004426 15024440 16180621 17479524 18948986 20650196 22641108 24964514
55963 24964514 27685307 30898445 34685311 39109489 44277661 50362160 57554732 66066559
55955 66066559 76201227 88352732 102883611 120058127 140106766 163251765 189638719
55948 189638719 219370531 252564463 288889609 326493852 361395362 388511640 403863537
55941 403863537 406079069 396097745 375935184 347945835 314796446 279359535 244189418
$$ packed form
55998C963552J31987J43881J47179J48704J59167J72011J76547J79813J93085
55989E415926K09386K17650K26093K47154K72633K89357L05655L35427L70420
55980G889701L96718M23679M66563N16210N57770O03097O70531P49888Q23907
55971A3098064R06362J020014J156181J298903J469462J701210J990912K323406
55963B4964514K720793L213138L786866M424178N168172O084499P192572Q511827
55955F6066559J0134668J2151505J4530879J7174516K0048639K3144999K6386954
55948A89638719K9731812L3193932L6325146L7604243L4901510K7116278J5351897
55941D03863537K215532r981324k0162561k7989349l3149389l5436911l5170117
$$ plain form
55934 244189418 211064943 180987006 154416485 131437807 111863426 95376409 81632882
55927 81632882 70259658 60850701 53035721 46530516 41102500 36534103 32649208 29334503
55919 29334503 26501742 24055583 21917480 20046607 18411259 16964685 15667975 14509324
55911 14509324 13479704 12552305 11703676 10932134 10237161 9601146 9008192 8461406 7965290
55902 7965290 7508701 7080042 6682202 6318176 5978018 5653664 5351405 5076870 4822321
55893 4822321 4580849 4358562 4160596 3978897 3805715 3645912 3504369 3374035 3247996
55884 3247996 3131340 3029796 2937796 2848382 2763868 2686328 2608432 2524279 2439416 2360119 2282478
55873 2282478 2201679 2122387 2050067 1981117 1911230 1844818 1786664 1732527 1677353 1624905 1580162
$$ packed form
55934B44189418l3124475l0077937k6570521k2978678j9574381j6487017j3743527
55927H1632882j1373224r408957p814980o505205n428016m568397l884895l314705
55919B9334503k832761k446159k138103j870873j635348j446574j296710j158651
55911A4509324j029620r27399q48629p71542o94973o36015n92954n46786m96116
55902G965290m56589m28659l97840l64026l40158l24354l02259k74535k54549
55893D822321k41472k22287j97966j81699j73182j59803j41543j30334j26039
55884C247996j16656j01544r2000q9414q4514p7540p7896q4153q4863p9297p7641
55873B282478q0799p9292p2320o8950o9887o6412n8154n4137n5174n2448m4743
$$ plain form
55862 1580162 1539653 1498156 1457816 1422093 1387644 1350657 1314657 1283909 1255437 1225303 1196459
55851 1196459 1172645 1150656 1126222 1101634 1080208 1059050 1034562 1009467 987328 965687 941522
55840 941522 917941 898606 880937 861565 843028 828326 814292 797328 780487 767885 757093
55829 757093 744015 730584 720616 712534 703052 693863 687880 682850 675246 666633 659820 652651 642029
55816 642029 630394 621749 614816 606383 598077 593494 591742 589910 588968 591297 595249 598011 601142 607684
55802 607684 616408 624300 632008 641438 650636 656399 659381 661468 660757 654423 644046 632995 621012 606497
55788 606497 591696 580361 572257 564759 557704 552041 546090 538041 530057 525266 522859 520688 520307 524667
55774 524667 533089 543441 557100 576547 599419 619591 632901 637999 633632 619694 599483 576805
$$ packed form
55862A580162m0509m1497m0340l5723l4449l6987l6000l0748k8472l0134k8844
55851A196459k3814k1989k4434k4588k1426k1158k4488k5095k2139k1641k4165
55840I41522k3581j9335j7669j9372j8537j4702j4034j6964j6841j2602j0792
55829G57093j3078j3431r968q082r482r189n983n030p604q613o813p169j0622
55816F42029j1635q645o933q433q306m583j752j832r42K329L952K762L131O542
55802F07684Q724P892P708R430R198N763K982K087p11o334j0377j1051j1983j4515
55788F06497j4801j1335q104p498p055n663n951q049p984m791k407k171l81M360
55774E24667Q422J0352J3659J9447K2872K0172J3310N098m367j3938k0211k2678
$$ plain form
55762 576805 552222 525573 499788 478027 459171 440433 422457 407689 395786 384943 375815 369746
55750 369746 364996 359103 353208 349667 347148 342613 336646 332387 330541 329638 329772 331691 333456 332312 328883
55735 328883 325638 322439 317520 311500 306418 302043 297097 292762 290911 290115 287555 283739 281259 279980
55721 279980 277600 274156 271847 271174 271054 271975 275224 279777 283681 287717 294047 302015 308877 313807 317625
55706 317625 319583 318274 314904 311849 308636 302978 295111 287452 280651 273557 266377 260298 254603 247755
55692 247755 240668 235473 231771 227688 223825 222514 223756 225539 227565 230986 235081 237962 240241 244258
55678 244258 249961 255052 258910 262818 266591 268547 268709 268641 268269 266137 262627 259723 257889 256267 255455
55663 255455 256706 258859 259555 259121 259869 261994 263786 265457 268874 273585 276910 278150 279156 280607 281230
$$ packed form
55762E76805k4583k6649k5785k1761j8856j8738j7976j4768j1903j0843r128o069
55750C69746m750n893n895l541k519m535n967m259j846r03J34J919J765j144l429
55735C28883l245l199m919o020n082m375m946m335j851p96k560l816k480j279
55721B79980k380l444k309o73j20R21L249M553L904M036O330P968O862M930L818
55706C17625J958j309l370l055l213n658p867p659o801p094p180o079n695o848
55692B47755p087n195l702m083l863j311J242J783K026L421M095K881K279M017
55678B44258N703N091L858L908L773J956J62o8l72k132l510k904j834j622q12
55663B55455J251K153O96m34P48K125J792J671L417M711L325J240J006J451O23
$$ plain form
55648 281230 280837 280585 280000 277254 272679 268613 265399 260915 254392 247273 239964 231238 221449 212928 206450
55633 206450 200449 194347 189536 186355 183252 179747 177251 176134 174802 172490 170251 168552 166592 164607
55619 164607 164069 164871 164968 163498 161760 160532 159037 157055 155482 154233 152194 149725 148560 148758 148363 146614
55603 146614 144807 143515 141776 139648 138824 139858 141305 142239 143128 143673 142551 140096 138586 139032 140082
55588 140082 140802 141979 143888 145339 145901 146769 148558 150442 152123 154423 157326 159791 162078 165850 171362
55573 171362 176987 182117 188034 195206 202332 208885 216024 223981 230932 235462 237961 238839 237669 234895
55559 234895 232006 229145 224805 218640 212269 206555 200550 193915 187900 182961 177915 172494 168330 166294
55545 166294 165152 163895 163098 163001 162603 161771 161929 163545 165217 166270 167833 170223 171804 171789 171756 172830 173666
$$ packed form
55648B81230l93k52n85k746m575m066l214m484o523p119p309q726r789q521o478
55633B06450o001o102m811l181l103l505k496j117j332k312k239j699j960j985
55619A64607n38Q02R7j470j738j228j495j982j573j249k039k469j165J98l95j749
55603A46614j807j292j739k128q24J034J447R34Q89N45j122k455j510M46J050
55588A40082P20J177J909J451N62Q68J789J884J681K300K903K465K287L772N512
55573A71362N625N130N917P172P126O553P139P957O951M530K499Q78j170k774
55559B34895k889k861m340o165o371n714o005o635o015m939n046n421m164k036
55545A66294j142j257p97r7l98q32J58J616J672J053J563K390J581j5l3J074Q36
$$ plain form
55528 173666 172855 171241 170216 169607 168888 168650 169341 170128 170411 170923 172165 173445 174593 176824 180657 184727
55512 184727 187817 190351 192703 193777 192423 188566 182019 172118 159689 147409 137001 127846 119348
55499 119348 112496 107757 103661 99165 95515 94014 93631 92471 90158 87312 84200 81317 79815 79902 80200
55484 80200 79848 79769 80786 82220 83534 85450 87995 89403 88596 87059 86568 86583 85599 83652 81810 80510
55468 80510 79950 80818 83113 85410 86677 87664 89305 91150 92544 93831 95114 95467 94728 94414 95369 96206
55452 96206 95678 94890 95361 96458 96718 96333 96286 96240 95288 93839 92890 92266 91320 90568 90949 92200 93401 94417
55434 94417 95430 95942 95532 94821 94513 94412 94391 95182 96988 98629 99309 99929 101348 102757 103279 103799 105585
55417 105585 108352 111332 114980 119817 124746 128317 130739 132935 134631 135081 134686 134153 132958 130441 127516
$$ packed form
55528A73666q11j614j025o09p19k38O91P87K83N12J242J280J148K231L833M070
55512A84727L090K534K352J074j354l857o547r901j2429j2280j0408r155q498
55499A19348o852m739m096m496l650j501l83j160k313k846l112k883j502Q7K98
55484H0200l52p9J017J434J314J916K545J408q07j537m91J5r84j947j842j300
55468H0510n60Q68K295K297J267R87J641J845J394J287J283L53p39l14R55Q37
55452I6206n28p88M71J097K60l85m7m6r52j449r49o24r46p52L81J251J201J016
55434I4417J013N12m10p11l08j01k1P91J806J641O80O20J419J409N22N20J786
55417A05585K767K980L648M837M929L571K422K196J696M50l95n33j195k517k925
$$ plain form
55402 127516 125487 123875 121184 117203 112904 108794 104956 102083 100823 100551 100161 99505 98895 98080 97054
55387 97054 96899 98343 100433 102080 103856 106642 109583 111240 111830 112423 112757 111847 110080 108663 107489 105549
55371 105549 103073 101281 100191 98525 95727 92479 89370 86553 84577 84052 84529 84966 85137 85453 85802 85838
55355 85838 85953 86645 87410 87528 87447 88003 88814 88957 88760 89376 90844 92087 92611 92889 93261 93700 94429 95596
55337 95596 96656 97119 97378 97748 97446 95848 93984 93227 93186 92561 91521 91440 92602 93929 94809 95526 95915 95265
55319 95265 93639 91966 90716 89689 89005 89051 89594 90126 90918 92529 94486 95727 96124 96364 96486 95878 94624
55302 94624 93621 93311 93274 92986 92133 90557 88781 88102 89080 90448 90571 89425 88063 86942 86169 86593 88853
55285 88853 91760 93310 93159 92598 92395 92244 92114 92450 92993 92973 92535 92579 93102 93045 91872 90149 88547 87440
$$ packed form
55402A27516k029j612k691l981m299m110l838k873j260k72l90o56o10q15j026
55387I7054j55J444K090J647J776K786K941J657N90N93L34r10j767j417j174j940
55371A05549k476j792j090j666k798l248l109k817j976n25M77M37J71L16L49L6
55355H5838J15O92P65J18q1N56Q11J43j97O16J468J243N24K78L72M39P29J167
55337I5596J060M63K59L70l02j598j864p57m1o25j040q1J162J327Q80P17L89o50
55319I5265j626j673j250j027o84M6N43N32P92J611J957J241L97K40J22o08j254
55302I4624j003l10l7k88q53j576j776o79R78J368J23j146j362j121p73M24K260
55285H8853K907J550j51n61k03j51j30L36N43k0m38M4N23n7j173j723j602j107
$$ plain form
55267 87440 87376 88655 90450 91518 91830 92403 93634 94920 95806 96390 96629 96343 95844 95614 95481 94998 94333 93918
55249 93918 93648 93386 93662 94818 96110 96807 97440 98619 99416 98569 96665 95393 95054 94550 93468 92403 91472
55232 91472 90329 89519 90006 91339 92018 91705 91483 91868 92228 92274 92503 92970 93066 92704 92406 92210 91803 91619 92302
55213 92302 93244 93234 92509 92549 93813 95289 96359 97419 98530 99107 99117 99082 98735 97297 95220 94044 94311 95170
55195 95170 96150 97552 98885 98834 97314 95902 95646 95932 96033 96221 96822 97551 98324 99383 100248 99963 98816
55178 98816 98364 99214 100231 100425 100249 100411 100773 101044 101363 101598 101198 100273 99782 100236 101265 102640 104561 106706
55160 106706 108279 109230 110208 111135 111240 110610 110229 110224 109664 108349 107215 106633 105985 105290 105494 106627 107398 107246
55142 107246 107032 106994 105902 103177 100188 98359 97482 96951 97150 98396 99770 100223 99878 99309 98593 97914 97952
$$ packed form
55267H7440o4J279J795J068L12N73J231J286Q86N84K39k86m99k30j33m83o65m15
55249I3918k70k62K76J156J292O97O33J179P97q47j904j272l39n04j082j065r31
55232I1472j143q10M87J333O79l13k22L85L60M6K29M67R6l62k98j96m07j84O83
55213I2302R42j0p25M0J264J476J070J060J111N77J0l5l47j438k077j176K67Q59
55195I5170R80J402J333n1j520j412k56K86J01J88O01P29P73J059Q65k85j147
55178I8816m52Q50J017J94j76J62L62K71L19K35m00r25m91M54J029J375J921K145
55160A06706J573R51R78R27J05o30l81nn60j315j134n82o48o95K04J133P71j52
55142A07246k14l8j092k725k989j829q77n31J99J246J374M53l45n69p16o79L8
$$ plain form
55125 97952 98752 99227 98684 97802 97373 97210 97118 97695 99156 100446 100616 100147 99983 100130 100206 100542 101730 103628
55107 103628 105522 106765 106865 105709 104121 103299 103373 103434 103228 103608 104982 106653 108152 109865 111776 113056
55091 113056 113551 114202 115260 115580 114630 113681 113976 115094 116177 117442 119203 120625 120754 119859 118698 117409
55075 117409 116131 115609 116107 116727 116809 117002 117934 118974 119387 119612 120231 120760 120667 120565 121096 121564 120970 119611
55057 119611 118510 118053 118245 119299 120846 121481 120325 118199 116191 114122 111657 109726 109315 109732 109655 109128
55041 109128 109022 109218 108934 108337 108334 109105 110110 111113 112052 112391 111797 110902 110307 109565 108369 107876 109312 111927
55023 111927 113907 114823 115616 116627 117276 117427 117464 117154 115975 114513 114069 114779 115404 115059 114022 112848 111796
55006 111796 111153 111116 111312 111301 111426 112339 113937 115630 117230 118649 119281 118897 118671 119935 122232 123943 124537
$$ packed form
55125I7952Q00M75n43q82m29j63r2N77J461J290J70m69j64J47P6L36J188J898
55107A03628J894J243J00j156j588q22P4O1k06L80J374J671J499J713J911J280
55091A13056M95O51J058L20r50r49K95J118J083J265J761J422J29q95j161j289
55075A17409j278n22M98O20Q2J93R32J040M13K25O19N29r3j02N31M68n94j359
55057A19611j101m57J92J054J547O35j156k126k008k069k465j931m11M17p7n27
55041A09128j06J96k84n97lP71J005J003R39L39n94q95n95p42j196m93J436K615
55023A11927J980R16P93J011O49J51L7l10j179j462m44P10O25l45j037j174j052
55006A11796o43l7J96j1J25R13J598J693J600J419O32l84k26J264K297J711N94
$$ plain form
54989 124537 124743 124731 123828 122194 121142 121332 121920 122023 121830 121794 121743 121379 120844 120298 119524 118445 117481 117068 117225
54970 117225 117752 118509 119370 120272 121259 122249 122936 123288 123770 124645 125531 126184 127103 128598 129836 129794 128784 127952
54952 127952 127618 127202 126613 126485 126985 127459 127405 126956 126262 125234 124067 123266 123044 123284 124083 125609 127382 128403
54934 128403 128204 127294 126658 127233 129619 133660 138401 143059 147867 153433 159657 165958 172260 178833 185388
54919 185388 191155 195791 199384 201628 201838 199861 196304 191794 186521 180530 174006 167360 161316 156621
54905 156621 153245 150300 147236 144545 142755 141409 139863 138457 137852 137765 137409 136802 136539 136617 136593 136632 137256
54888 137256 138269 139117 140158 142428 146169 150661 155481 160852 166764 172818 178923 185138 190849 195223
54874 195223 198502 201667 204676 206164 205143 201992 197482 191854 185267 178281 171438 164965 159144 154382
$$ packed form
54989A24537K06j2r03j634j052J90N88J03j93l6n1l64n35n46p74j079r64m13J57
54970A17225N27P57Q61R02R87R90O87L52M82Q75Q86O53R19J495J238m2j010q32
54952A27952l34m16n89j28N00M74n4m49o94j028j167q01k22K40P99J526J773J021
54934A28403j99r10o36N75K386M041M741M658M808N566O224O301O302O573O555
54919A85388N767M636L593K244K10j977l557m510n273n991o524o646o044m695
54905A56621l376k945l064k691j790j346j546j406o05q7l56o07k63P8k4L9O24
54888A37256J013Q48J041K270L741M492M820N371N912O054O105O215N711M374
54874A95223L279L165L009J488j021l151m510n628o587o986o843o473n821m762
$$ plain form
54860 154382 150742 147968 145983 144694 143430 141415 138826 136598 135179 134274 133732 133684 133714 132927 131115 129004
54844 129004 127164 125470 123793 122326 121011 119490 117884 116893 116856 117402 118205 119334 120691 121832 122565 123036
54828 123036 123145 122688 122158 122497 123737 124733 124589 123705 123047 123068 123565 124012 123763 122596 121298 121089 122207 123643
54810 123643 124468 124806 125254 125960 126593 126774 126336 125544 125086 125368 125868 125721 124903 124202 124103 124414 124953 125813 126879
54791 126879 127818 128706 129948 131442 132476 132610 132079 131361 130953 131464 133107 135133 136579 137617 139347 142240
54775 142240 145718 149335 153378 158069 163052 168041 173216 178697 184342 190246 196676 203280 209084 213462
54761 213462 216486 218228 218428 216951 213839 208941 202379 195323 189244 184237 179101 173289 167656 163025
54747 163025 159186 155814 153255 151665 150312 148491 146521 145208 144855 145276 146190 147132 147552 147476 147608 148507
$$ packed form
54860A54382l640k774j985j289j264k015k589k228j419r05n42m8L0p87j812k111
54844A29004j840j694j677j467j315j521j606r91l7N46Q03J129J357J141P33M71
54828A23036J09m57n30L39J240R96j44q84o58K1M97M47k49j167j298k09J118J436
54810A23643Q25L38M48P06O33J81m38p92m58K82N00j47q18p01r9L11N39Q60J066
54791A26879R39Q88J242J494J034J34n31p18m08N11J643K026J446J038J730K893
54775A42240L478L617M043M691M983M989N175N481N645N904O430O604N804M378
54761B13462L024J742K00j477l112m898o562p056o079n007n136n812n633m631
54747A63025l839l372k559j590j353j821j970j313l53M21R14R42M20p6J32Q99
$$ plain form
54731 148507 150158 152512 155679 159361 162843 165981 169516 174088 179583 185678 192170 198324 202701 204247
54717 204247 203133 200241 196361 192067 187628 182752 177066 171112 166110 162506 159509 156268 152735 149192
54703 149192 145960 143818 143522 144427 144704 143555 142174 141845 142165 142034 141368 140754 140130 138986 137418 136059
54687 136059 135288 135234 136062 137483 138431 138099 136948 135977 135333 134419 133031 131547 130176 128818 127576 126751 126292
54670 126292 125768 124934 124003 123407 123537 124552 126184 127861 129181 130134 130858 131456 132064 132648 132754 131931 130444
54653 130444 128996 127808 126670 125892 126228 127606 128867 129212 129095 129272 129802 130507 131585 133079 134352 134775
54637 134775 134418 133666 132699 131872 131844 132717 133618 133757 133381 133158 133165 133102 132921 132621 131863 130451 128867 127814 127549
54618 127549 127928 128660 129191 128939 128005 127073 126347 125307 123861 122860 122921 123652 124562 125855 127606 129083 129790
$$ packed form
54731A48507J651K354L167L682L482L138L535M572N495O095O492O154M377J546
54717B04247j114k892l880m294m439m876n686n954n002l604k997l241l533l543
54703A49192l232k142k96R05K77j149j381l29L20j31o66o14o24j144j568j359
54687A36059p71n4Q28J421R48l32j151r71o44r14j388j484j371j358j242q25m59
54670A26292n24q34r31n96J30J015J632J677J320R53P24N98O08N84J06q23j487
54653A30444j448j188j138p78L36J378J261L45j17J77N30P05J078J494J273M23
54637A34775l57p52r67q27k8Q73R01J39l76k23Po3j81l00p58j412j584j053k65
54618A27549L79P32N31k52r34r32p26j040j446j001O1P31R10J293J751J477P07
$$ plain form
54601 129790 130376 131504 132544 132418 131229 130045 129504 129601 130412 131969 133630 134570 134808 135021 135485 135845 135762
54584 135762 135211 134361 133689 133812 134740 135730 136418 137450 139236 140689 140235 137742 134585 132023 130337 129344
54568 129344 128837 128565 128421 128639 129385 130367 131299 132345 133624 134737 135397 136073 137337 139005 140611 142239
54552 142239 144102 145712 146346 146072 145571 145274 145339 146025 147295 148456 149090 149924 151803 154145 155463 155279 154480
54535 154480 153823 153063 151729 149901 147999 146300 144796 143271 141658 140545 140865 142630 144475 145075 144419
54520 144419 143161 141496 139638 138638 139401 141247 142683 143362 144064 144965 145291 144796 144305 144493 145069 145457 145449
54503 145449 144976 144016 142940 142220 141715 140855 139586 138438 137693 137206 136929 136880 136688 136057 135563 136124 137717 139566
54485 139566 141481 143938 146727 148739 149399 149294 149026 148451 147518 146919 147258 148261 149407 150788 152770 155239
$$ packed form
54601A29790N86J128J040j26j189j184n41R7Q11J557J661R40K38K13M64L60q3
54584A35762n51q50o72J23R28R90O88J032J786J453m54k493l157k562j686r93
54568A29344n07k72j44K18P46R82R32J046J279J113O60O76J264J668J606J628
54552A42239J863J610O34k74n01k97O5O86J270J161O34Q34J879K342J318j84p99
54535A54480o57p60j334j828j902j699j504j525j613j113L20J765J845O00o56
54520A44419j258j665j858j000P63J846J436O79P02R01L26m95m91J88N76L88q
54503A45449m73r60j076p20n05q60j269j148p45m87k77m9j92o31m94N61J593J849
54485A39566J915K457K789K012O60j05k68n75r33n99L39J003J146J381J982K469
$$ plain form
54469 155239 157627 159430 160428 160666 160434 159994 159286 158228 157204 156765 156901 157150 157319 157464 157290 156448 155456
54452 155456 155374 156245 156700 155594 153419 151613 150934 150944 150735 149785 148342 147189 146878 147179 147531 147851 148458 149330
54434 149330 150086 150680 151404 152189 152625 152802 153329 154235 154609 153789 152305 151166 150700 150593 150702 151199 152012 152652
54416 152652 152723 152394 152243 152622 153335 154058 154915 156228 157630 158139 157479 156734 157028 158073 158782 158920 159266 160292
54398 160292 161617 162800 163897 165117 166535 168157 169735 170648 170549 169957 169544 169133 168190 167018 166433 166357 165900
54381 165900 164944 164531 165359 166896 168328 169562 170894 172396 174016 175670 177088 178235 179975 183402 188304
54366 188304 193176 197004 200134 203057 205409 206737 207375 207808 207884 207302 206264 204996 203167 200448 197186
54351 197186 193904 190533 186739 182688 178949 175896 173589 171959 170744 169573 168444 167807 167870 168153 168086 167747
$$ packed form
54469A55239K388J803R98K38k32m40p08j058j024m39J36K49J69J45j74q42r92
54452A55456q2Q71M55j106k175j806o79J0k09r50j443j153l11L01L52L20O07Q72
54434A49330P56N94P24P85M36J77N27R06L74q20j484j139m66j07J09M97Q13O40
54416A52652P1l29j51L79P13P23Q57J313J402N09o60p45K94J045P09J38L46J026
54398A60292J325J183J097J220J418J622J578R13r9n92m13m11r43j172n85p6m57
54381A65900r56m13Q28J537J432J234J332J502J620J654J418J147J740L427M902
54366A88304M872L828L130K923K352J328O38M33P6n82j038j268j829k719l262
54351A97186l282l371l794m051l739l053k307j630j215j171j129o37O3K83o7l39
$$ plain form
54335 167747 167650 168038 168659 169040 168814 167958 166823 165786 164951 164409 164495 165254 165890 165519 164367 163423 163000 162564
54317 162564 162054 162203 163217 164202 164492 164648 165411 166425 166787 166347 165653 164965 164009 162588 160989 159826 159588
54300 159588 160085 160314 159352 157436 155610 154360 153345 152567 152764 154229 156175 157798 159190 160584 161501 161412
54284 161412 160675 160162 160317 161080 162178 163035 163027 162391 162280 163326 164758 165554 165818 166298 167119 167842 168397 169203
54266 169203 170634 172860 175776 178595 180144 180247 180180 181105 182649 183863 184835 186275 187984 188948 188756 187842
54250 187842 186433 184317 181677 179240 177457 176225 175474 175200 174976 174231 173149 172622 173155 174379 175692 176762
54234 176762 177362 177369 177081 177005 177222 177412 177520 177830 178360 178758 178892 178972 178964 178466 177399 176288 175572 175017 174098 172692
54214 172692 171160 169899 169002 168189 167087 165700 164559 164200 164576 165230 165895 166555 167023 166996 166580 166348 166657
$$ packed form
54335A67747r7L88O21L81k26q56j135j037q35n42Q6P59O36l71j152r44m23m36
54317A62564n10J49J014R85K90J56P63J014L62m40o94o88r56j421j599j163k38
54300A59588M97K29r62j916j826j250j015p78J97J465J946J623J392J394R17q9
54284A61412p37n13J55P63J098Q57qo36j11J046J432P96K64M80Q21P23N55Q06
54266A69203J431K226K916K819J549J03o7R25J544J214R72J440J709R64j92r14
54250A87842j409k116k640k437j783j232p51k74k24p45j082n27N33J224J313J070
54234A76762O00Pk88p6K17J90J08L10N30L98J34Q0qm98j067j111p16n55r19j406
54214A72692j532j261q97q13j102j387j141l59L76O54O65O60M68k7m16k32L09
$$ plain form
54197 166657 167234 167621 167816 168285 169427 171122 172725 173495 173149 172060 170950 170388 170517 171031 171343 170976 169933
54180 169933 168618 167412 166558 166346 166981 168127 169006 169193 168929 168545 168014 167319 166721 166250 165454 164182 163227
54163 163227 163550 165058 166718 167747 168240 168726 169557 170657 171538 171711 171336 171217 171817 172654 173099 173360 174008
54146 174008 174853 175051 174260 172931 171450 169702 167761 166343 166213 167391 169179 170761 171669 171931 171965 172235
54130 172235 172949 174048 175323 176448 177148 177600 178398 179840 181557 183172 185000 187514 190327 192402 193296
54115 193296 193665 194473 196196 198869 202391 206523 210930 215495 220413 225909 232027 238646 245342 251237 255349
54100 255349 257284 257460 256610 255276 253722 251944 249679 246710 243252 239787 236416 232684 228202 223193 218244
54085 218244 213753 209846 206592 203950 201557 198966 196235 194061 193064 193040 193122 192693 191922 191425 191590 192330 193249
$$ packed form
54197A66657N77L87J95M69J142J695J603P70l46j089j110n62J29N14L12l67j043
54180A69933j315j206q54k12O35J146Q79J87k64l84n31o95n98m71p96j272r55
54163A63227L23J508J660J029M93M86Q31J100Q81J73l75j19O00Q37M45K61O48
54146A74008Q45J98p91j329j481j748j941j418j30J178J788J582R08K62L4K70
54130A72235P14J099J275J125P00M52P98J442J717J615J828K514K813K075Q94
54115A93296L69Q08J723K673L522M132M407M565M918N496O118O619O696N895M112
54100B55349J935J76q50j334j554j778k265k969l458l465l371l732m482n009m949
54085B18244m491l907l254k642k393k591k731k174r97k4Q2m29p71m97J65P40R19
$$ plain form
54068 193249 193919 194185 194318 194683 195198 195452 195450 195672 196145 196149 195418 195000 196026 198104 199965 201365 203140 205455
54050 205455 207409 208684 210249 212896 216087 218956 221512 224214 227256 230966 236036 242520 249300 255409
54036 255409 261181 267299 273419 278749 283383 288006 292726 297277 301949 307190 312550 317063 320514 323312
54022 323312 325301 325864 325183 324241 323392 321985 319747 317523 316127 315133 313312 309909 305163 299948 295139
54007 295139 291011 287051 282542 277347 271900 266611 261601 256891 252461 248256 244560 242116 241325 241434 241029
53992 241029 239298 236493 233377 230699 228991 228272 228014 227805 227762 227903 227616 226502 225364 225459 226910 228736
53976 228736 230347 232164 234810 238525 243384 249267 255549 261637 267968 275693 285192 295512 305255 313289
53962 313289 318583 320298 318469 313992 307749 300264 292238 284585 277695 271282 265221 259984 256136 253946
$$ packed form
54068A93249O70K66J33L65N15K54kK22M73Mp31m18J026K078J861J400J775K315
54050B05455J954J275J565K647L191K869K556K702L042L710N070O484O780O109
54036B55409N772O118O120N330M634M623M720M551M672N241N360M513L451K798
54022C23312J989N63o81r42q49j407k238k224j396r94j821l403m746n215m809
54007B95139m128l960m509n195n447n289n010m710m430m205l696k444p91J09m05
53992B41029j731k805l116k678j708p19k58k09m3J41k87j114j138R5J451J826
53976B28736J611J817K646L715M859N883O282O088O331P725R499J0320R743Q034
53962C13289N294J715j829m477o243p485q026p653o890o413o061n237l848k190
$$ plain form
53948 253946 253533 254712 256601 258138 259167 260390 262183 264172 266025 267837 269627 271384 273770 277754
53934 277754 283159 288541 292927 296749 300590 304093 306899 309683 313310 317571 321745 325899 330712 336272
53920 336272 341970 347418 352792 358396 364543 371700 380105 389209 398015 405967 413167 419848 426083 431855
53906 431855 436982 440955 443278 444002 443661 442656 440883 437957 433657 428305 422772 417983 414148 410561 406218
53891 406218 400522 393452 385367 376819 368253 359711 350966 342043 333389 325404 318074 311211 304884 299452
53877 299452 295248 292189 289561 286373 282228 277758 273857 270632 267567 264496 261772 259453 257039 254186
53863 254186 251085 247934 244639 241333 238591 236782 235525 234114 232191 229874 227634 226127 225645 225584 224983
53848 224983 223730 222695 222500 222778 222947 223020 223221 223421 223466 223607 224066 224577 224832 225053 225626 226441 227073 227429 227823
$$ packed form
53948B53946m13J179J889J537J029J223J793J989J853J812J790J757K386L984
53934B77754N405N382M386L822L841L503K806K784L627M261M174M154M813N560
53920C36272N698N448N374N604O147P157Q405R104Q806P952P200O681O235N772
53906D31855N127L973K323P24l41j005j773k926m300n352n533m789l835l587m343
53891D06218n696p070q085q548q566q542q745q923q654p985p330o863o327n432
53877B99452m204l059k628l188m145m470l901l225l065l071k724k319k414k853
53863B54186l101l151l295l306k742j809j257j411j923k317k240j507m82o1o01
53848B24983j253j035j95K78J69P3K01K00M5J41M59N11K55K21N73Q15O32L56L94
$$ plain form
53829 227823 228485 229273 229778 229656 229034 228602 228927 229681 230031 229835 229848 230625 231903 233298 234847 236490 237750
53812 237750 238510 239523 241532 244321 247192 250030 253344 257582 262794 268701 274723 280311 285562 291023
53798 291023 296631 301496 305207 308664 312975 318075 323136 327771 331986 335363 337291 337928 338171 338682 339460
53783 339460 340217 340551 339891 337890 334857 331278 327050 321678 315145 308058 301040 294461 288679 284040 280591
53768 280591 278032 275854 273359 269971 265915 262185 259368 256908 254050 251035 248646 246974 245444 243814
53754 243814 242223 240427 237952 235063 232748 231525 230917 230251 229312 228109 226699 225516 225238 225973 226962 227380
53738 227380 227125 226707 226737 227587 229116 230615 231460 231867 232621 233978 235345 236166 236591 237056 237732 238676 240085
53721 240085 242003 244039 245677 246684 247039 246908 246933 248136 250925 254313 256637 257219 257034 257693 259999 263542
$$ packed form
53829B27823O62P88N05j22o22m32L25P54L50j96J3P77J278J395J549J643J260
53812B37750P60J013K009K789K871K838L314M238N212N907O022N588N251N461
53798B91023N608M865L711L457M311N100N061M635M215L377J928O37K43N11P78
53783C39460P57L34o60k001l033l579m228n372o533p087p018o579n782m639l449
53768B80591k559k178k495l388m056l730k817k460k858l015k389j672j530j630
53754B43814j591j796k475k889k315j223o08o66r39j203j410j183k78P35R89M18
53738B27380k55m18L0Q50J529J499Q45M07P54J357J367Q21M25M65O76R44J409
53721B40085J918K036J638J007L55j31K5J203K789L388K324N82j85O59K306L543
$$ plain form
53705 263542 267356 270708 273489 276204 279653 284234 289431 294264 298405 302497 307023 311237 313853 314699
53691 314699 314961 315715 316878 317825 318346 318542 318345 317730 317037 316569 316191 315776 315716 316425 317556 318278 318197 317551 316636
53672 316636 315599 314696 314253 314289 314442 314266 313466 312106 310871 310704 311711 312721 312482 311119 309848 309461 309758
53655 309758 310306 310992 311694 312139 312354 312818 313852 315147 316102 316410 316269 316273 317106 319086 321929 325060 328040
53638 328040 330588 332452 333603 334395 335221 336215 337584 339832 343132 346779 349895 352549 355553 359271 363315
53623 363315 367300 371188 374802 377705 379816 381533 383066 384140 384566 384632 384726 385050 385881 387625 390334 393507
53607 393507 396600 399479 402231 404902 407600 410535 413804 417320 420993 424656 427839 430084 431530 432780
53593 432780 434087 435059 435235 434483 432824 430429 427939 426186 425317 424691 423908 423345 423304 423236 422407 420912 419366
$$ packed form
53705B63542L814L352K781K715L449M581N197M833M141M092M526M214K616Q46
53691C14699K62P54J163R47N21J96j97o15o93m68l78m15o0P09J131P22q1o46r15
53672C16636j037r03m43L6J53j76q00j360j235j67J007J010k39j363j271l87K97
53655C09758N48O86P02M45K15M64J034J295R55L08j41MQ33J980K843L131K980
53638C28040K548J864J151P92Q26R94J369K248L300L647L116K654L004L718M044
53623C63315L985L888L614K903K111J717J533J074M26O6R4L24Q31J744K709L173
53607C93507L093K879K752K671K698K935L269L516L673L663L183K245J446J250
53593D32780J307R72J76p52j659k395k490j753q69o26p83n63m1o8q29j495j546
$$ plain form
53576 419366 417820 415655 412522 408838 405288 402304 400136 398981 398709 398693 398262 397361 396551 396262 396167 395589 394501
53559 394501 393843 394565 396571 398887 400734 402019 402851 403108 402750 402188 402012 402442 403266 404192 405104 406047 407148
53542 407148 408627 410793 413880 417721 421610 424775 427187 429713 433233 437738 442522 447084 451572 456546
53528 456546 462710 470713 480677 491876 503266 514413 525600 537106 548861 560830 573248 586320
53516 586320 600129 615000 631451 649479 668336 687386 706939 727794 750145 773396 797040
53505 797040 821327 846777 873151 899155 923340 945341 966143 987115 1008868 1031052 1052948
53494 1052948 1074004 1094056 1113400 1132625 1152067 1171490 1190571 1209545 1228911 1248521 1267510
53483 1267510 1285337 1302475 1319737 1337251 1354525 1371401 1388464 1406272 1424404 1441586 1456795
$$ packed form
53576D19366j546k165l133l684l550k984k168j155k72j6m31r01q10k89r5n78j088
53559C94501o58P22K006K316J847J285Q32K57l58n62j76M30Q24R26R12R43J101
53542D07148J479K166L087L841L889L165K412K526L520M505M784M562M488M974
53528D56546O164Q003R964J1199J1390J1147J1187J1506J1755J1969J2418J3072
53516E86320J3809J4871J6451J8028J8857J9050J9553K0855K2351K3251K3644
53505G97040K4287K5450K6374K6004K4185K2001K0802K0972K1753K2184K1896
53494A052948K1056K0052J9344J9225J9442J9423J9081J8974J9366J9610J8989
53483A267510J7827J7138J7262J7514J7274J6876J7063J7808J8132J7182J5209
$$ plain form
53472 1456795 1469917 1481163 1490187 1496360 1499830 1501621 1502367 1501408 1497504 1490065 1479423 1466443 1452356
53459 1452356 1438446 1425131 1411512 1396443 1379893 1362775 1345731 1328757 1311791 1294816 1277461
53448 1277461 1259248 1240315 1221200 1201951 1182249 1162490 1143895 1127187 1111869 1097178 1083258
53437 1083258 1071042 1061309 1054096 1048665 1044020 1039883 1037118 1036684 1038229 1040507 1043087 1046675 1051508 1056632
53423 1056632 1061392 1066704 1073968 1083426 1094462 1107001 1121532 1137951 1155397 1173324 1192049 1212084
53411 1212084 1233470 1255940 1279354 1303788 1329397 1356252 1384223 1413138 1443215 1475215 1509888
53400 1509888 1547341 1587110 1628746 1672131 1717382 1764658 1813995 1865149 1917670 1971243 2025875
53389 2025875 2081595 2138087 2194736 2250958 2306370 2360724 2413717 2464906 2513884 2560592 2605206
$$ packed form
53472A456795J3122J1246R024O173L470J791P46r59l904p439j0642j2980j4087
53459A452356j3910j3315j3619j5069j6550j7118j7044j6974j6966j6975j7355
53448A277461j8213j8933j9115j9249j9702j9759j8595j6708j5318j4691j3920
53437A083258j2216r733p213n431m645m137k765m34J545K278K580L588M833N124
53423A056632M760N312P264R458J1036J2539J4531J6419J7446J7927J8725K0035
53411A212084K1386K2470K3414K4434K5609K6855K7971K8915L0077L2000L4673
53400A509888L7453L9769M1636M3385M5251M7276M9337N1154N2521N3573N4632
53389B025875N5720N6492N6649N6222N5412N4354N2993N1189M8978M6708M4614
$$ plain form
53378 2605206 2647520 2686738 2722253 2754359 2783583 2809486 2830783 2846739 2857758 2864448 2866765 2864328
53366 2864328 2856944 2844420 2826360 2802520 2773039 2738090 2697786 2652772 2604449 2554206 2502795
53355 2502795 2450764 2399032 2348516 2299474 2251691 2205100 2159888 2116193 2074033 2033365 1993939
53344 1993939 1955239 1916797 1878376 1839820 1801086 1762626 1725318 1689760 1655988 1624056 1594454
53333 1594454 1567625 1543473 1521703 1502232 1484971 1469549 1455594 1442856 1430708 1418029 1404104
53322 1404104 1389263 1374199 1358995 1343345 1327381 1311689 1296715 1282652 1269778 1258352 1248239
53311 1248239 1238991 1230344 1222457 1215812 1210988 1208204 1206914 1206258 1206125 1207326 1210448 1215105 1220788 1227873
53297 1227873 1237162 1248751 1262013 1276426 1291943 1308772 1327263 1347761 1370136 1393718 1418037
$$ packed form
53378B605206M2314L9218L5515L2106K9224K5903K1297J5956J1019O690K317k437
53366B864328p384j2524j8060k3840k9481l4949m0304m5014m8323n0243n1411
53355B502795n2031n1732n0516m9042m7783m6591m5212m3695m2160m0668l9426
53344A993939l8700l8442l8421l8556l8734l8460l7308l5558l3772l1932k9602
53333A594454k6829k4152k1770j9471j7261j5422j3955j2738j2148j2679j3925
53322A404104j4841j5064j5204j5650j5964j5692j4974j4063j2874j1426j0113
53311A248239r248q647p887o645m824k784j290o56j33J201L122M657N683P085
53297A227873R289J1589J3262J4413J5517J6829J8491K0498K2375K3582K4319
$$ plain form
53286 1418037 1443145 1468777 1493837 1517442 1539929 1561877 1582521 1600247 1614597 1626701 1637511
53275 1637511 1646484 1652345 1654551 1653616 1650430 1645497 1638570 1628879 1615948 1600197 1582539 1563520 1543099
53262 1543099 1521007 1496942 1470741 1442865 1414512 1386692 1359381 1332011 1304426 1276722 1248601
53251 1248601 1219837 1191216 1164018 1138533 1113986 1089935 1066712 1044263 1021669 998318 974803
53240 974803 952032 930119 908776 888232 869075 851439 834902 819036 803723 789137 775643
53229 775643 763528 752613 742388 732710 723969 716307 709015 701032 691772 681211 669481 656829 643742
53216 643742 630612 617290 603281 588482 573501 559185 545904 533367 521174 509467 498839
53205 498839 489495 480747 471685 462205 452959 444393 436246 428098 419887 411727 403604 395522 387671 380211
$$ packed form
53286A418037K5108K5632K5060K3605K2487K1948K0644J7726J4350J2104J0810
53275A637511Q973N861K206r35l186m933o927r691j2931j5751j7658j9019k0421
53262A543099k2092k4065k6201k7876k8353k7820k7311k7370k7585k7704k8121
53251A248601k8764k8621k7198k5485k4547k4051k3223k2449k2594k3351k3515
53240I74803k2771k1913k1343k0544j9157j7636j6537j5866j5313j4586j3494
53229G75643j2115j0915j0225r678q741p662p292p983r260j0561j1730j2652j3087
53216F43742j3130j3322j4009j4799j4981j4316j3281j2537j2193j1707j0628
53205D98839r344q748r062r480r246q566q147q148q211q160q123q082p851p460
$$ plain form
53191 380211 373052 366019 359090 352348 345919 340030 334929 330589 326696 323015 319609 316585 313812 310962
53177 310962 307695 303800 299393 295046 291420 288720 286637 284824 283069 281050 278429 275468 273093 271936
53163 271936 271502 270738 269329 268037 267702 268273 268994 269276 269084 268605 267911 267107 266523 266386 266401 266061 265412 265066
53145 265066 265263 265292 264257 262208 260146 259007 258926 259395 259885 260329 261187 262860 264959 266421 266687 266469 266907
53128 266907 268223 269722 270926 272016 273084 273684 273511 273182 273867 276152 279420 282395 284262 285211 285844 286184
53112 286184 285698 284307 282789 281861 281297 280442 279184 277814 276309 274423 272305 270313 268379 266330 264688
53097 264688 264310 265140 266104 266413 266212 265807 265138 264355 264104 264605 265105 264926 264583 265135 266648 267975 268103 267162
53079 267162 266000 265164 264551 263919 263382 263182 263090 262491 261236 259994 259281 258511 256733 254214 252527 252839 254670
$$ packed form
53191C80211p159p033o929o742o429n889n101m340l893l681l406l024k773k850
53177C10962l267l895m407m347l626k700k083j813j755k019k621k961k375j157
53163B71936m34p64j409j292l35N71P21K82j92m79o94q04n84j37J5l40o49l46
53145B65066J97K9j035k049k062j139q1M69M90M44Q58J673K099J462K66k18M38
53128B66907J316J499J204J090J068O00j73l29O85K285L268K975J867R49O33L40
53112B86184m86j391j518r28n64q55j258j370j505j886k118j992j934k049j642
53097B64688l78Q30R64L09k01m05o69p83k51N01N00j79l43N52J513J327J28r41
53079B67162j162q36o13o32n37k00r2n99j255j242p13p70j778k519j687L12J831
$$ plain form
53062 254670 256606 257749 258166 258307 258368 258096 257146 255744 254828 255111 256115 256709 256583 256529 257167 258174 259074 260105
53044 260105 261765 263961 266077 267632 268468 268610 268278 267861 267566 267309 267000 266637 266015 264815 263190 261801
53028 261801 261013 260476 259786 259089 258678 258464 258256 258251 258803 259893 261146 262178 262794 263104 263538 264370 265126 265041 264255
53009 264255 263910 264724 266094 267060 267514 267908 268384 268848 269469 270361 271124 271397 271592 272300 273239 273595 273308 273220 273922
52990 273922 275150 276457 277784 279038 279652 279026 277271 275281 274062 273995 274626 275237 275655 276341 277624 279187
52974 279187 280565 281812 283269 284914 286390 287618 288926 290573 292455 294330 296070 297684 299240 300747
52960 300747 302009 302735 302858 302591 302061 301176 299982 298741 297479 295851 293740 291598 289824 288196 286303
52945 286303 284168 282043 279982 278174 277288 277802 279144 280110 280043 279153 277899 276638 275698 275137 274501 273379
$$ packed form
53062B54670J936J143M17J41O1k72r50j402r16K83J004N94j26n4O38J007R00J031
53044B60105J660K196K116J555Q36J42l32m17k95k57l09l63o22j200j625j389
53028B61801p88n37o90o97m11k14k08nN52J090J253J032O16L10M34Q32P56q5p86
53009B64255l45Q14J370R66M54L94M76M64O21Q92P63K73J95P08R39L56k87q8P02
52990B73922J228J307J327J254O14o26j755j990j219o7O31O11M18O86J283J563
52974B79187J378J247J457J645J476J228J308J647J882J875J740J614J556J507
52960C00747J262P26J23k67n30q85j194j241j262j628k111k142j774j628j893
52945B86303k135k125k061j808q86N14J342R66o7q90j254j261r40n61o36j122
$$ plain form
52929 273379 272137 271508 271543 271578 271247 270891 270922 271414 272392 273887 275508 276539 276720 276538 276554 276852 277311 277937 278645
52910 278645 279084 278956 278331 277500 276790 276546 276961 277740 278202 277919 277047 276067 275433 275520 276536 278345 280551 282757
52892 282757 284528 285281 284728 283500 282764 282968 283343 282928 281726 280559 280047 280143 280533 281086 281765 282325 282362 281782
52874 281782 281027 280625 280542 280324 279942 280043 281129 282931 284954 287235 290004 292923 295296 296802 297361 296507
52858 296507 293708 289333 284544 280166 276354 273318 271456 270504 269406 267506 265219 263162 261250 259137
52844 259137 256938 254941 253147 251605 250770 250939 251711 252530 253376 254400 255252 255456 255165 254909 254812 254670 254592 254837
52826 254837 255123 254904 254411 254696 256329 258561 260093 260362 259908 259806 260866 263033 265365 266796 267134 267087 267329
52809 267329 267829 268155 268072 267540 266469 264795 262727 260623 258658 256742 254730 252608 250516 248654 247092
$$ packed form
52929B73379j242o29L5L5l31l56L1M92R78J495J621J031J81j82J6K98M59O26P08
52910B78645M39j28o25q31p10k44M15P79M62k83q72r80o34Q7J016J809K206K206
52892B82757J771P53n53j228p36K04L75m15j202j167n12R6L90N53O79N60L7n80
52874B81782p55m02q3k18l82J01J086J802K023K281K769K919K373J506N59q54
52858B96507k799m375m789m378l812l036j862r52j098j900k287k057j912k113
52844B59137k199j997j794j542q35J69P72Q19Q46J024Q52K04k91k56r7j42p8K45
52826B54837K86k19m93K85J633K232J532K69m54j02J060K167K332J431L38m7K42
52809B67329N00L26q3n32j071j674k068k104j965j916k012k122k092j862j562
$$ plain form
52794 247092 245675 244275 243186 242962 243696 244700 245202 245276 245716 247019 248827 250424 251453 251945 251959 251548 250980
52777 250980 250672 250845 251406 252107 252631 252598 251816 250649 249834 249775 250124 250224 249785 249060 248552 248671 249464 250461 251019
52758 251019 251017 251032 251591 252477 253145 253611 254493 256188 258424 260676 262634 264243 265648 267207 269133 271033 272176
52741 272176 272447 272628 273492 274984 276612 278238 280005 281713 282875 283428 283907 284780 285928 286958 287652 287919
52725 287919 287514 286147 283923 281482 279602 278635 278291 277941 277129 275852 274388 272960 271643 270549 269914 269892
52709 269892 270266 270512 270224 269451 268605 268069 267937 268068 268301 268630 269270 270552 272548 274783 276533 277526 278093
52692 278093 278446 278040 276096 272702 269016 266281 264989 265018 266096 267745 269116 269450 268808 268009 267703 267745 267563
52675 267563 266936 266219 265957 266492 267856 269725 271396 272080 271569 270547 270045 270516 271617 272902 274441 276628
$$ packed form
52794B47092j417j400j089k24P34J004N02P4M40J303J808J597J029M92J4m11n68
52777B50980l08J73N61P01N24l3p82j167q15n9L49J00m39p25n08J19P93R97N58
52758B51019kJ5N59Q86O68M66Q82J695K236K252J958J609J405J559J926J900J143
52741B72176K71J81Q64J492J628J626J767J708J162N53M79Q73J148J030O94K67
52725B87919m05j367k224k441j880r67l44l50q12j277j464j428j317j094o35k2
52709B69892L74K46k88p73q46n36j32J31K33L29O40J282J996K235J750R93N67
52692B78093L53m06j944l394l686k735j292K9J078J649J371L34o42p99l06M2j82
52675B67563o27p17k62N35J364J869J671O84n11j022n02M71J101J285J539K187
$$ plain form
52659 276628 279528 282642 285300 287169 288470 289767 291471 293451 295127 295989 296000 295470 294700 293757 292413 290277
52643 290277 287260 284059 281837 281128 281259 281171 280613 280161 280279 280901 281877 283278 285055 286853 288471 290160
52627 290160 292146 294027 295003 294667 293410 291996 290854 289800 288398 286551 284622 282987 281636 280461 279725
52612 279725 279888 280898 281979 282270 281522 280122 278653 277588 277188 277509 278454 279859 281520 283189 284651 285774
52596 285774 286416 286413 285836 285086 284508 284026 283437 282906 282792 283086 283478 283972 284932 286447 288134 289671 291059 292125
52578 292125 292352 291575 290465 289873 289986 290497 291235 292139 292792 292598 291449 289818 288216 286896 286060 285884 286215
52561 286215 286535 286454 286021 285462 284780 283849 282764 281865 281366 281085 280734 280420 280612 281475 282496 283029 283048 282942 282674
52542 282674 281771 280277 279100 278971 279515 279886 279953 280230 280832 281251 281240 281301 282006 283250 284419 284991 284788 283989
$$ packed form
52659B76628K900L114K658J869J301J297J704J980J676Q62J1n30p70r43j344k136
52643B90277l017l201k222p09J31q8n58m52J18O22R76J401J777J798J618J689
52627B90160J986J881R76l36j257j414j142j054j402j847j929j635j351j175p36
52612B79725J63J010J081K91p48j400j469j065m00L21R45J405J661J669J462J123
52596B85774O42ln77p50n78m82n89n31j14K94L92M94R60J515J687J537J388J066
52578B92125K27p77j110n92J13N11P38R04O53j94j149j631j602j320q36j76L31
52561B86215L20q1m33n59o82r31j085q99m99k81l51l14J92Q63J021N33J9j06k68
52542B82674r03j494j177j29N44L71O7K77O02M19j1O1P05J244J169N72k03p99
$$ plain form
52524 283989 283185 283167 284260 285933 287324 288115 288675 289441 290441 291463 292443 293523 294847 296427 298168 299909
52508 299909 301510 302969 304448 306025 307388 307909 307111 305029 302110 298923 296026 293908 292744 292202 291670
52493 291670 290715 289240 287380 285495 284187 283932 284608 285616 286517 287245 287688 287565 286974 286645 287219 288516 289892
52476 289892 291147 292639 294547 296464 297836 298472 298567 298452 298458 298853 299838 301606 304226 307303 309964 311604
52460 311604 312576 313707 315062 315659 314663 312447 310103 308155 306180 303609 300490 297434 295094 293818 293449
52445 293449 293238 292167 289729 286468 283584 281894 281279 281152 281256 281783 282850 284181 285427 286529 287566
52430 287566 288366 288550 287976 286983 286104 285622 285484 285471 285408 285240 285044 285007 285323 286072 287187 288537 290071 291947
52412 291947 294564 298443 303991 311263 319923 329453 339415 349469 359136 367673 374318 378681 380863 381154
$$ packed form
52524B83989q04j8J093J673J391P91N60P66J000J022R80J080J324J580J741J741
52508B99909J601J459J479J577J363N21p98k082k919l187k897k118j164n42n32
52493B91670r55j475j860j885j308k55O76J008R01P28M43j23n91l29N74J297J376
52476B89892J255J492J908J917J372O36R5j15OL95R85J768K620L077K661J640
52460C11604R72J131J355N97r96k216k344j948j975k571l119l056k340j276l69
52445B93449k11j071k438l261k884j690o15j27J04N27J067J331J246J102J037
52430B87566Q00J84n74r93q79m82j38j3o3j68j96l7L16P49J115J350J534J876
52412B91947K617L879N548P272Q660R530R962J0054R667Q537O645M363K182K91
$$ plain form
52398 381154 379694 376456 371510 365228 358182 350856 343565 336694 330890 326766 324377 323172 322527 322090 321499
52383 321499 320167 317799 315027 313070 312656 313497 314871 316417 318209 320376 322890 325618 328414 331208 334126
52368 334126 337400 341036 344619 347554 349475 350445 350852 351077 351202 351091 350858 351114 352424 354579 356689 358075
52352 358075 358833 359484 360432 361861 363884 366526 369733 373475 377658 381923 385806 389186 392289 395261 398157
52337 398157 401366 405481 410488 415703 420905 426976 434821 444139 453949 463969 474656 486109 497893
52324 497893 510066 523515 538906 555847 573398 590904 608070 624789 641359 658512 676800
52313 676800 696173 716435 737697 759906 782230 803616 824014 844567 866377 889424 912866
52302 912866 936066 958938 981306 1002305 1020725 1035982 1048591 1059516 1069148 1077107 1083003 1087038
$$ packed form
52398C81154j460l238m946o282p046p326p291o871n804m124k389j205o45m37n91
52383C21499j332k368k772j957m14Q41J374J546J792K167K514K728K796K794K918
52368C34126L274L636L583K935J921R70M07K25J25j11k33K56J310K155K110J386
52352C58075P58O51R48J429K023K642L207L742M183M265L883L380L103K972K896
52337C98157L209M115N007N215N202O071P845R318R810J0020J0687J1453J1784
52324D97893J2173J3449J5391J6941J7551J7506J7166J6719J6570J7153J8288
52313F76800J9373K0262K1262K2209K2324K1386K0398K0553K1810K3047K3442
52302I12866K3200K2872K2368K0999J8420J5257J2609J0925R632P959N896M035
$$ plain form
52290 1087038 1089595 1090478 1088975 1084837 1078964 1072847 1067317 1061973 1055852 1048511 1040365 1032212 1024756 1018574
52276 1018574 1014055 1011034 1008754 1006641 1005201 1005768 1009199 1014946 1021508 1027730 1033668 1040397 1049039 1059834
52262 1059834 1072016 1084653 1097495 1110909 1125173 1140280 1156374 1173823 1192538 1211605 1230041
52251 1230041 1247620 1264474 1280091 1293339 1303564 1311106 1316541 1319860 1320722 1319181 1315730 1310772 1304377
52238 1304377 1296493 1287099 1276228 1264149 1251484 1238782 1226010 1212785 1199132 1185576 1172341 1158943
52226 1158943 1144962 1130916 1117862 1106253 1095612 1085357 1075552 1066751 1059466 1053930 1050018 1047142
52214 1047142 1044535 1041968 1040163 1040148 1042156 1045288 1048304 1050587 1052341 1054066 1056037 1058278 1060882 1064167
52200 1064167 1068453 1073744 1079705 1085951 1092291 1098702 1105158 1111552 1117705 1123387 1128296 1132032 1134156 1134361
$$ packed form
52290A087038K557Q83j503m138n873o117n530n344o121p341q146q153p456o182
52276A018574m519l021k280k113j440N67L431N747O562O222N938O729Q642J0795
52262A059834J2182J2637J2842J3414J4264J5107J6094J7449J8715J9067J8436
52251A230041J7579J6854J5617J3248J0225P542N435L319Q62j541l451m958o395
52238A304377p884r394j0871j2079j2665j2702j2772j3225j3653j3556j3235j3398
52226A158943j3981j4046j3054j1609j0641j0255r805q801p285n536l912k876
52214A047142k607k567j805j5K008L132L016K283J754J725J971K241K604L285
52200A064167M286N291N961O246O340O411O456O394O153N682M909L736K124K05
$$ plain form
52186 1134361 1132660 1129372 1124888 1119494 1113399 1106847 1100097 1093348 1086698 1080059 1073141 1065746 1058234 1051470
52172 1051470 1046031 1041670 1037841 1034566 1032351 1031321 1030934 1030666 1030632 1031325 1033027 1035620 1038716 1041789 1044341
52157 1044341 1046107 1047102 1047524 1047765 1048350 1049475 1050680 1051429 1052031 1053461 1056109 1059266 1062110 1064647 1067254
52142 1067254 1069814 1071866 1073310 1074401 1075226 1075745 1076161 1076706 1077194 1077452 1078248 1081139 1087097 1095639 1105563 1116284
52126 1116284 1128287 1142551 1159782 1180003 1202550 1226421 1250737 1275044 1299369 1324127 1349801
52115 1349801 1376436 1403416 1429912 1455558 1480545 1505124 1529170 1552206 1573658 1593158 1610834
52104 1610834 1627357 1643494 1659504 1674978 1689135 1701200 1710628 1717247 1721152 1722318 1720405 1715101
52092 1715101 1706516 1695004 1680798 1664197 1646030 1627450 1609134 1591060 1573155 1555761 1539319
$$ packed form
52186A134361j701l288m484n394o095o552o750o749o650o639o918p395p512o764
52172A051470n439m361l829l275k215j030l87k68l4O93J702K593L096L073K552
52157A044341J766R95M22K41N85J125J205P49O02J430K648L157K844K537K607
52142A067254K560K052J444J091Q25N19M16N45M88K58P96K891N958Q542R924J0721
52126A116284J2003J4264J7231K0221K2547K3871K4316K4307K4325K4758K5674
52115A349801K6635K6980K6496K5646K4987K4579K4046K3036K1452J9500J7676
52104A610834J6523J6137J6010J5474J4157J2065R428O619L905J166j913n304
52092A715101q585j1512j4206j6601j8167j8580j8316j8074j7905j7394j6442
$$ plain form
52081 1539319 1523969 1509800 1497182 1486441 1477309 1469104 1461569 1455225 1450818 1448620 1448429 1450069 1453597
52068 1453597 1459050 1466278 1475219 1486105 1499094 1513741 1529146 1544770 1560858 1577911 1595895 1614140
52056 1614140 1631928 1648952 1665220 1680584 1694392 1705709 1713918 1719044 1721322 1720650 1716848 1710392 1702338
52043 1702338 1693288 1682905 1670724 1657031 1642552 1627667 1612456 1597213 1582293 1567431 1551830
52032 1551830 1534989 1517081 1498450 1479191 1459347 1439123 1418664 1397905 1376852 1355869 1335462
52021 1335462 1315925 1297362 1280028 1264374 1250582 1238149 1226151 1214030 1201930 1190100 1178278
52010 1178278 1166036 1153505 1141116 1128612 1115039 1099876 1083566 1066673 1049270 1031639 1014780
51999 1014780 999430 985042 970599 956136 942654 930686 919635 908369 895808 881130 864281
$$ packed form
52081A539319j5350j4169j2618j0741r132q205p535o344m407k198j91J640L528
52068A453597N453P228Q941J0886J2989J4647J5405J5624J6088J7053J7984J8245
52056A614140J7788J7024J6268J5364J3808J1317Q209N126K278o72l802o456q054
52043A702338r050j0383j2181j3693j4479j4885j5211j5243j4920j4862j5601
52032A551830j6841j7908j8631j9259j9844k0224k0459k0759k1053k0983k0407
52021A335462j9537j8563j7334j5654j3792j2433j1998j2121j2100j1830j1822
52010A178278j2242j2531j2389j2504j3573j5163j6310j6893j7403j7631j6859
51999A014780j5350j4388j4443j4463j3482j1968j1051j1266j2561j4678j6849
$$ plain form
51988 864281 846288 828407 810947 793503 776123 759382 743338 727323 710906 694379 678248
51977 678248 663011 649411 638006 628380 619746 612457 607866 606405 606996 608799 612246 617427 622637 625868
51963 625868 627180 628383 630610 633245 635017 635150 633428 630105 625965 621904 618266 615055 612680 611915 613081
51948 613081 615874 620183 626561 635662 647495 661533 677410 695431 716364 740600 767407 795126
51936 795126 822134 847253 869073 885486 894548 895709 889706 877419 859359 836299 809826 782009
51924 782009 754575 728341 703173 678591 654716 632539 613029 596104 580835 566576 553535
51913 553535 542344 533484 527068 522784 519946 517978 516988 517574 519989 523623 527290 529801 530373 528836 525571
51898 525571 521026 515249 508064 499626 490508 481300 472414 464297 457435 452029 447909 444925 443215 443014
$$ packed form
51988H64281j7993j7881j7460j7444j7380j6741j6044j6015j6417j6527j6131
51977F78248j5237j3600j1405r626q634p289m591j461N91J803L447N181N210L231
51963F25868J312J203K227K635J772J33j722l323m140m061l638l211k375p65J166
51948F13081K793M309O378R101J1833J4038J5877J8021K0933K4236K6807K7719
51936G95126K7008K5119K1820J6413R062J161o003j2287j8060k3060k6473k7817
51924G82009k7434k6234k5168k4582k3875k2177j9510j6925j5269j4259j3041
51913E53535j1191q860o416m284k838j968r90N86K415L634L667K511N72j537l265
51898E25571m545n777p185q438r118r208q886q117o862n406m120k984j710k01
$$ plain form
51884 443014 444352 447068 451001 456121 462554 470449 479623 489357 498731 507268 515065 522306 528758 533790
51870 533790 536702 537072 535024 531294 526860 522356 517906 513533 509586 506624 504989 504594 505052 505909 506768
51855 506768 507337 507421 506882 505553 503218 499707 495003 489230 482592 475487 468634 462807 458208 454263 450317
51840 450317 446432 443217 440960 439321 437921 436807 436247 436373 437147 438397 439749 440793 441410 441696 441553 440815
51824 440815 439797 439145 438916 438397 437210 436000 435542 435697 435933 436374 437521 439114 440172 440252 439917 439833 439962
51807 439962 439903 439492 438854 438244 438053 438625 439859 441218 442276 442946 443180 442820 441892 440685 439360 437811 436085
51790 436085 434603 433718 433264 432790 432074 431211 430413 429893 429774 429966 430299 430906 432197 434313 436872 439571 442753
51773 442753 447031 452528 458856 465650 472582 478969 484042 487870 491397 495129 498222 499352 498142 495063
$$ packed form
51884D43014J338K716L933N120O433P895R174R734R374Q537P797P241O452N032
51870E33790K912L70k048l730m434m504m450m373l947k962j635l95M58Q57Q59
51855E06768N69Q4n39j329k335l511m704n773o638p105o853n827m599l945l946
51840D50317l885l215k257j639j400j114n60J26P74J250J352J044O17K86j43p38
51824D40815j018o52k29n19j187j210m58J55K36M41J147J593J058Q0l35q4J29
51807D39962n9m11o38o10j91N72J234J359J058O70K34l60r28j207j325j549j726
51790D36085j482q85m54m74p16q63p98n20j19J92L33O07J291K116K559K699L182
51773D42753M278N497O328O794O932O387N073L828L527L732L093J130j210l079
$$ plain form
51759 495063 490251 483403 474984 466528 459174 452544 445739 438881 432855 427913 423555 419732 417208 416488
51745 416488 417147 418479 420107 421725 423019 424283 426431 429852 433794 437485 441235 445685 450395 454093
51731 454093 456198 457314 458215 459102 460023 461385 463637 466648 469598 471453 471651 470534 469030 467740 466515
51716 466515 465080 463699 462795 462217 461457 460473 459769 459669 460046 460843 462403 465083 468733 472610 475671 477118
51700 477118 476851 475288 472658 468945 464844 462128 462192 464436 466855 468144 468468 468290 467397 465329 462027 457707
51684 457707 452682 447600 443307 440149 437872 436335 435799 436233 437031 437841 439124 441415 444446 447534 450452
51669 450452 453452 456727 460412 464898 470527 476944 483141 488159 491510 493043 492758 490867 487806 484157
51655 484157 480611 477958 476949 478133 481721 487364 493994 500138 504637 507017 507186 505069 500698 494430
$$ packed form
51759D95063m812o848q419q456p354o630o805o858o026m942m358l823k524p20
51745D16488O59J332J628J618J294J264K148L421L942L691L750M450M710L698
51731D54093K105J116R01Q87R21J362K252L011K950J855J98j117j504j290j225
51716D66515j435j381r04n78p60r84p04j00L77P97J560K680L650L877L061J447
51700D77118k67j563k630l713m101k716O4K244K419J289L24j78q93k068l302m320
51684D57707n025n082m293l158k277j537n36M34P98Q10J283K291L031L088K918
51669D50452L000L275L685M486N629O417O197N018L351J533k85j891l061l649
51655D84157l546k653j009J184L588N643O630O144M499K380J69k117m371o268
$$ plain form
51641 494430 486890 478777 470817 463656 457597 452479 447916 443552 439171 434833 430973 428077 426155 424725
51627 424725 423336 421789 419822 417058 413544 409989 407089 404793 402532 399962 397201 394461 391758 389020
51613 389020 386298 383901 382293 381710 381848 382194 382689 383751 385522 387501 389251 391190 394270 399060 405418
51598 405418 412901 421141 429913 439153 448903 458902 468184 475335 479279 479834 477553 473247 467740 461995
51584 461995 457229 454573 454406 456264 459801 465714 475218 488455 503860 519363 533910 547629 561055
51571 561055 574658 588799 603432 617786 630796 642079 652391 663118 675441 689974 707045
51560 707045 727284 751747 781069 814310 848864 881838 911380 936595 956713 970955 979062 981292
51548 981292 977721 968007 952041 930550 904808 875992 845056 813054 781310 751168 723538 698610
$$ packed form
51641D94430p540q113p960p161o059n118m563m364m381m338l860k896j922j430
51627D24725j389j547j967k764l514l555k900k296k261k570k761k740k703k738
51613C89020k722k397j608n83J38L46M95J062J771J979J750J939L080M790O358
51598D05418P483Q240Q772R240R750R999R282P151L944N55k281m306n507n745
51584D61995m766k656j67J858L537N913R504J3237J5405J5503J4547J3719J3426
51571E61055J3603J4141J4633J4354J3010J1283J0312J0727J2323J4533J7071
51560G07045K0239K4463K9322L3241L4554L2974K9542K5215K0118J4242Q107K230
51548I81292l571r714j5966k1491k5742k8816l0936l2002l1744l0142k7630k4928
$$ plain form
51536 698610 675900 654672 634410 615025 596667 579471 563572 549306 537219 527592 519866 512777
51524 512777 505322 497592 490436 484347 478980 473764 468570 463586 458881 454386 450140 446221 442591 439219
51510 439219 436193 433425 430451 426863 422863 419051 415787 413190 411597 411381 412160 412805 412662 412307 412648 413641
51494 413641 414548 415233 416363 418195 419883 420412 419714 418436 417062 415862 415284 415608 416315 416552 416270 416153 416315
51477 416315 415910 414348 412084 409644 406622 402441 397574 393132 389486 386177 382998 380262 377996 375768
51463 375768 373518 371824 371047 370814 370673 370717 371239 372193 373372 374835 376883 379800 383732 388566 393952 399769
51447 399769 406606 415355 426294 438971 452927 467823 482713 495959 506328 513820 519186 523183
51435 523183 526477 529473 531570 531103 526711 518630 508201 496514 484047 471280 458875 447256 436563
$$ packed form
51536F98610k2710k1228k0262j9385j8358j7196j5899j4266j2087r627p726p089
51524E12777p455p730p156o089n367n216n194m984m705m495m246l919l630l372
51510D39219l026k768k974l588m000l812l264k597j593k16P79O45j43l55L41R93
51494D13641R07O85J130J832J688N29o98j278j374j200n78L24P07K37k82j17J62
51477D16315m05j562k264k440l022m181m867m442l646l309l179k736k266k228
51463C75768k250j694p77k33j41M4N22R54J179J463K048K917L932M834N386N817
51447C99769O837Q749J0939J2677J3956J4896J4890J3246J0369P492N366L997
51435E23183L294K996K097m67m392q081j0429j1687j2467j2767j2405j1619j0693
$$ plain form
51422 436563 427054 419199 413274 409102 406182 403950 402080 400691 400115 400285 400592 400590 400572 401252 403023 405714
51406 405714 408787 411599 413790 415685 418066 421381 425470 430089 435201 440461 445081 448734 452210 456665
51392 456665 462600 470004 478986 489592 501397 514071 528227 544972 564725 587183 612431 641350
51380 641350 674717 712491 754151 799222 847123 896644 945752 991839 1032329 1065476 1090670
51369 1090670 1107796 1116335 1115349 1104309 1083734 1055014 1019783 979374 934724 886905 837715 789404
51357 789404 743606 700858 661309 625407 593537 565537 541120 520365 503201 488782 476100
51346 476100 464963 455658 447860 440720 434015 428420 424432 421656 419370 417250 415358 413811 412749 412321
51332 412321 412536 413192 413828 413633 411789 408338 404460 401346 399025 396882 394997 394059 394002 393638 391955 389189
$$ packed form
51422D36563r509p855n925m172k920k232j870j389n76J70L07kj8O80J771K691
51406D05714L073K812K191J895K381L315M089M619N112N260M620L653L476M455
51392D56665N935P404Q982J0606J1805J2674J4156J6745J9753K2458K5248K8919
51380F41350L3367L7774M1660M5071M7901M9521M9108M6087M0490L3147K5194
51369A090670J7126Q539r86j1040k0575k8720l5231m0409m4650m7819m9190m8311
51357G89404m5798m2748l9549l5902l1870k8000k4417k0755j7164j4419j2682
51346D76100j1137r305p798p140o705n595l988k776k286k120j892j547j062m28
51332D12321K15O56O36j95j844l451l878l114k321k143j885r38n7l64j683k766
$$ plain form
51316 389189 386449 384832 384987 386846 389401 391282 391876 391625 391125 390420 389315 387868 386336 384964 383972 383312
51300 383312 382416 380701 378492 376947 376867 378007 379654 381349 382863 384084 385244 386838 388986 391248 393265
51285 393265 395222 397517 400455 404368 409470 415283 420753 425308 429336 433243 436547 438383 438598 437875 436983
51270 436983 436274 435727 435208 434818 435046 436261 437903 438689 437911 436106 434176 432329 430273 428002 425788 423636
51254 423636 421241 418402 415176 411819 408849 406885 406004 405471 404436 402788 400983 399294 397606 395859 394294
51239 394294 393283 393110 393834 395180 396693 398081 399252 399959 399838 399018 398222 397895 397545 396478 394943 394057
51223 394057 394585 396195 397802 398412 397796 396749 396620 398179 400889 403491 405276 406554 408019 410009 412359
51208 412359 414640 416468 417825 419229 421445 424894 429261 433731 437596 440717 443355 445570 446992 447326
$$ packed form
51316C89189k740j617J55J859K555J881N94k51n00p05j105j447j532j372r92o60
51300C83312q96j715k209j545q0J140J647J695J514J221J160J594K148K262K017
51285C93265J957K295K938L913N102N813N470M555M028L907L304J836K15p23q92
51270D36983p09n47n19l90K28J215J642P86p78j805j930j847k056k271k214k152
51254D23636k395k839l226l357k970j964q81n33j035j648j805j689j688j747j565
51239C94294j011j73P24J346J513J388J171P07j21q20p96l27l50j067j535q86
51223C94057N28J610J607O10o16j047j29J559K710K602J785J278J465J990K350
51208D12359K281J828J357J404K216L449M367M470L865L121K638K215J422L34
$$ plain form
51194 447326 446784 445663 443786 440972 437894 435637 434345 433110 431503 430339 430423 431347 432242 433079 434299 435664
51178 435664 436523 437002 437884 439246 440152 439875 438640 436938 434834 432332 429806 427645 425865 424367 423248
51163 423248 422564 422181 422141 422731 423821 424495 423890 422222 420535 419497 418907 418301 417572 416845 416133 415387 414686 414103
51145 414103 413508 412718 411779 410907 410213 409715 409612 410226 411521 412916 413799 414124 414369 415000 416097 417337 418171
51128 418171 418259 417982 418326 419895 422182 424246 425979 428127 431046 434058 436307 437777 439077 440581 442184
51113 442184 443721 445181 446568 447829 448933 449957 451081 452520 454325 456315 458340 460536 463018 465396
51099 465396 467091 468127 469076 470090 470552 469982 468826 467942 467744 468192 469201 470579 471863 472696 473214 473668
51083 473668 473981 474036 474113 474497 474896 474803 474343 474229 474900 476162 477681 479456 481736 484773 488693 493391 498660
$$ packed form
51194D47326n42j121j877k814l078k257j292j235j607j164Q4R24Q95Q37J220J365
51178D35664Q59M79Q82J362R06k77j235j702k104k502k526k161j780j498j119
51163D23248o84l83m0N90J090O74o05j668j687j038n90o06p29p27p12p46p01n83
51145D14103n95p90r39q72o94m98j03O14J295J395Q83L25K45O31J097J240Q34
51128D18171Q8k77L44J569K287K064J733K148K919L012K249J470J300J504J603
51113D42184J537J460J387J261J104J024J124J439J805J990K025K196K482K378
51099D65396J695J036R49J014M62n70j156q84j98M48J009J378J284Q33N18M54
51083D73668L13N5P7L84L99r3m60j14O71J262J519J775K280L037L920M698N269
$$ plain form
51066 498660 504631 511928 521127 532296 545386 560761 578757 598825 619619 639916 658981 676130
51054 676130 690651 702426 712257 721273 730139 738809 746682 752951 757137 759462 760444 760078 757697 752760
51040 752760 745447 736358 725953 714662 703359 693262 685024 677908 670142 660350 648686 636444 624710
51027 624710 613756 603665 594906 587962 582896 579731 578848 580422 583771 587960 593043 600089 609913 622211
51013 622211 635909 649902 663392 676056 688079 699779 711132 721856 731791 740713 747884 752393
51001 752393 754117 753869 752506 750383 747753 745043 742382 739423 736144 733414 732281 732947 734952 738188 743093
50986 743093 749901 758306 768155 780063 794924 812850 832914 853961 875483 897643 920667 944553
50974 944553 969463 996118 1025696 1059359 1097924 1141757 1190751 1244532 1302845 1365757 1433349
$$ packed form
51066D98660N971P297R199J1169J3090J5375J7996K0068K0794K0297J9065J7149
51054F76130J4521J1775R831R016Q866Q670P873O269M186K325R82l66k381m937
51040G52760p313r089j0405j1291j1303j0097q238p116p766r792j1664j2242j1734
51027F24710j0954j0091q759o944n066l165q83J574L349M189N083P046R824J2298
51013F22211J3698J3993J3490J2664J2023J1700J1353J0724R935Q922P171M509
51001G52393J724k48j363k123k630k710k661k959l279k730j133O66K005L236M905
50986G43093O808Q405R849J1908J4861J7926K0064K1047K1522K2160K3024K3886
50974I44553K4910K6655K9578L3663L8565M3833M8994N3781N8313O2912O7592
$$ plain form
50963 1433349 1505273 1580641 1658222 1736651 1814663 1891295 1965713 2036641 2102200 2160648 2211250
50952 2211250 2254174 2289594 2317233 2336865 2348997 2354904 2356008 2353312 2347398 2338918 2328802 2317761
50940 2317761 2305632 2291560 2274898 2255627 2233905 2209690 2183063 2154520 2124589 2093416 2060911
50929 2060911 2026928 1990999 1952288 1910233 1865003 1817017 1766371 1713157 1658029 1601998 1545965
50918 1545965 1490826 1437619 1387006 1338960 1293514 1251422 1213463 1179463 1148745 1121234 1097201
50907 1097201 1076072 1056424 1037305 1018873 1001727 986251 972592 960597 949752 939807 931355 925103
50895 925103 920715 917150 914053 911834 910453 909253 908228 908320 910004 912543 915149 918016 921633 925947 930875
50880 930875 936915 944530 953435 963125 973627 985114 997273 1009721 1022736 1037046 1053156 1071294
$$ packed form
50963A433349P1924P5368P7581P8429P8012P6632P4418P0928O5559N8448N0602
50952B211250M2924L5420K7639J9632J2132N907J104k696n914q480j0116j1041
50940B317761j2129j4072j6662j9271k1722k4215k6627k8543k9931l1173l2505
50929B060911l3983l5929l8711m2055m5230m7986n0646n3214n5128n6031n6033
50918A545965n5139n3207n0613m8046m5446m2092l7959l4000l0718k7511k4033
50907A097201k1129j9648j9119j8432j7146j5476j3659j1995j0845r945q452o252
50895I25103m388l565l097k219j381j200j025R2J684K539K606K867L617M314M928
50880I30875O040P615Q905R690J0502J1487J2159J2448J3015J4310J6110J8138
$$ plain form
50868 1071294 1091625 1114107 1138485 1164883 1194078 1226859 1263510 1304192 1349274 1398946 1453207
50857 1453207 1512757 1579314 1654396 1738282 1830722 1932076 2043054 2163882 2294520 2435194
50847 2435194 2585717 2744539 2909369 3078569 3251103 3425201 3597851 3765531 3924633
50838 3924633 4071217 4201289 4311777 4400889 4467612 4511469 4532804 4532845 4513431 4477142 4427553
50827 4427553 4368741 4304466 4238214 4173691 4114286 4061777 4016134 3976696 3942851 3913270 3885158
50816 3885158 3854882 3819220 3775869 3723143 3659616 3584157 3496293 3396568 3286361 3167178 3040372
50805 3040372 2907916 2773021 2639307 2509363 2384629 2266519 2156871 2057129 1967732 1888576
50795 1888576 1819520 1760188 1709795 1667535 1632821 1604959 1582939 1565780 1552786 1543310 1536638 1532252
$$ packed form
50868A071294K0331K2482K4378K6398K9195L2781L6651M0682M5082M9672N4261
50857A453207N9550O6557P5082Q3886R2440J01354J10978J20828J30638J40674
50847B435194J50523J58822J64830J69200J72534J74098J72650J67680J59102
50838C924633J46584J30072J10488Q9112O6723M3857K1335M1j9414l6289m9589
50827D427553n8812o4275o6252o4523n9405n2509m5643l9438l3845k9581k8112
50816C885158l0276l5662m3351n2726o3527p5459q7864r9725j10207j19183j26806
50805C040372j32456j34895j33714j29944j24734j18110j09648r9742q9397p9156
50795A888576o9056n9332n0393m2260l4714k7862k2020j7159j2994r476o672m386
$$ plain form
50783 1532252 1529818 1528705 1527887 1526487 1524050 1520166 1514313 1506414 1497141 1487222 1476657 1464905 1451618
50770 1451618 1436954 1421361 1405221 1388463 1370378 1350262 1328492 1306610 1286004 1266793 1248343
50759 1248343 1230445 1213595 1198430 1185473 1175230 1167973 1163475 1161415 1162011 1165865 1173230 1183881 1197737
50746 1197737 1215160 1236565 1262106 1291865 1325988 1364411 1406735 1452616 1502184 1556026 1614892
50735 1614892 1679329 1749296 1824029 1902574 1984521 2069973 2158656 2249423 2340748 2431382 2520233
50724 2520233 2605935 2686906 2761632 2828465 2885296 2929993 2961190 2978212 2980270 2966517 2937406
50713 2937406 2895592 2844933 2788729 2729460 2670000 2614110 2565103 2524226 2490791 2463737 2442616
50702 2442616 2427034 2415690 2406395 2396871 2385049 2368630 2345018 2312317 2270280 2219828 2161742 2096463
$$ packed form
50783A532252k434j113q18j400k437l884n853p899r273r919j0565j1752j3287
50770A451618j4664j5593j6140j6758j8085k0116k1770k1882k0606j9211j8450
50759A248343j7898j6850j5165j2957j0243p257m498k060N96L854P365J0651J3856
50746A197737J7423K1405K5541K9759L4123L8423M2324M5881M9568N3842N8866
50735A614892O4437O9967P4733P8545Q1947Q5452Q8683R0767R1325R0634Q8851
50724B520233Q5702Q0971P4726O6833N6831M4697L1197J7022K058j3753k9111
50713B937406m1814n0659n6204n9269n9460n5890m9007m0877l3435k7054k1121
50702B442616j5582j1344r295r524j1822j6419k3612l2701m2037n0452n8086o5279
$$ plain form
50690 2096463 2025351 1951377 1877928 1807082 1739598 1676283 1618589 1567748 1523999 1487062 1456992
50679 1456992 1434214 1418967 1411020 1409783 1414498 1424481 1439402 1459235 1483776 1512284 1543604 1576384
50667 1576384 1609179 1640674 1670048 1696905 1720852 1741562 1759443 1775660 1790984 1805001 1816926
50656 1816926 1826952 1836186 1845450 1854749 1863933 1873275 1883224 1894132 1906460 1920850 1937764 1957274
50644 1957274 1979383 2004305 2032280 2063377 2097621 2135015 2175235 2217545 2261255 2306107 2351964
50633 2351964 2398182 2443433 2486168 2525372 2561267 2595369 2629226 2662343 2691171 2710586 2716709
50622 2716709 2708476 2687014 2654327 2612980 2566454 2518825 2473640 2433204 2398825 2371286 2350731
50611 2350731 2336408 2326982 2321173 2318006 2316628 2316148 2315494 2313013 2306278 2292826 2271288 2241557 2203861
$$ packed form
50690B096463p1112p3974p3449p0846o7484o3315n7694n0841m3749l6937l0070
50679A456992k2778j5247p947j237M715R983J4921J9833K4541K8508L1320L2780
50667A576384L2795L1495K9374K6857K3947K0710J7881J6217J5324J4017J1925
50656A816926J0026R234R264R299R184R342R949J0908J2328J4390J6914J9510
50644A957274K2109K4922K7975L1097L4244L7394M0220M2310M3710M4852M5857
50633B351964M6218M5251M2735L9204L5895L4102L3857L3117K8828J9415O123
50622B716709q233k1462l2687m1347m6526m7629m5185m0436l4379k7539k0555
50611B350731j4323r426n809l167j378m80o54k481o735j3452k1538k9731l7696
$$ plain form
50598 2203861 2158195 2104887 2045213 1981035 1914089 1845980 1778410 1712768 1649454 1588069 1528416
50587 1528416 1471095 1417264 1368049 1324043 1285011 1250088 1218596 1190629 1166553 1146177 1128919
50576 1128919 1114726 1104191 1097634 1094567 1094313 1096675 1101712 1109307 1119280 1131574 1145914 1161655 1178426
50563 1178426 1196727 1217286 1239950 1263777 1288278 1313978 1341505 1370658 1400765 1431627 1463514
50552 1463514 1496369 1529502 1562218 1594379 1626181 1657692 1688781 1719331 1749329 1778993 1808991
50541 1808991 1840340 1873823 1909676 1948127 1989997 2036312 2087431 2143058 2203114 2268115 2338624
50530 2338624 2414863 2497091 2585829 2681346 2783264 2890973 3003922 3120972 3239769 3357366
50520 3357366 3471371 3580056 3681476 3773067 3852210 3916755 3964954 3995341 4006975 3999597 3973431
$$ packed form
50598B203861m5666n3308n9674o4178o6946o8109o7570o5642o3314o1385n9653
50587A528416n7321n3831m9215m4006l9032l4923l1492k7967k4076k0376j7258
50576A128919j4193j0535o557l067k54K362N037P595R973J2294J4340J5741J6771
50563A178426J8301K0559K2664K3827K4501K5700K7527K9153L0107L0862L1887
50552A463514L2855L3133L2716L2161L1802L1511L1089L0550K9998K9664K9998
50541A808991L1349L3483L5853L8451M1870M6315N1119N5627O0056O5001P0509
50530B338624P6239Q2228Q8738R5517J01918J07709J12949J17050J18797J17597
50520C357366J14005J08685J01420R1591P9143O4545M8199L0387J1634p378k6166
$$ plain form
50509 3973431 3929059 3867685 3791453 3703370 3606860 3505289 3401804 3299567 3202040 3112760 3034714
50498 3034714 2970090 2920626 2887631 2871291 2870310 2882704 2906712 2940402 2980639 3023114 3063354 3097080
50486 3097080 3119642 3126197 3113186 3079463 3025708 2953269 2864085 2761406 2649707 2533485 2416158
50475 2416158 2300064 2187072 2078784 1976202 1879548 1788746 1704058 1626091 1555236 1491448
50465 1491448 1434587 1384552 1340823 1302336 1268306 1238979 1215106 1196860 1183752 1175397 1171643 1171885
50453 1171885 1174917 1179806 1186544 1195650 1207476 1221999 1238828 1257169 1276194 1295758 1316423 1338432
50441 1338432 1360861 1382036 1400548 1415656 1427035 1434624 1438699 1439810 1438609 1435836 1432305 1428687 1425367
50428 1425367 1422667 1421046 1420933 1422433 1425462 1430140 1436925 1446323 1458662 1474167 1493266 1516653 1544931
$$ packed form
50509C973431m4372o1374p6232q8083r6510j01571j03485j02237r7527q9280p8046
50498C034714o4624m9464l2995j6340r81J2394K4008L3690M0237M2475M0240L3726
50486C097080K2562O555j3011l3723n3755p2439q9184j02679j11699j16222j17327
50475B416158j16094j12992j08288j02582r6654r0802q4688p7967p0855o3788
50465A491448n6861n0035m3729l8487l4030k9327k3873j8246j3108q355l754K42
50453A171885L032M889O738R106J1826J4523J6829J8341J9025J9564K0665K2009
50441A338432K2429K1175J8512J5108J1379P589M075J111j201k773l531l618l320
50428A425367k700j621j13J500L029M678O785R398J2339J5505J9099K3387K8278
$$ plain form
50415 1544931 1578178 1616041 1658381 1705588 1758010 1815180 1875940 1939171 2003997 2069296 2133562
50404 2133562 2195436 2254000 2308386 2357498 2400406 2436623 2465544 2485796 2495524 2493336 2478736 2451819
50392 2451819 2412959 2362973 2303457 2236806 2165858 2093449 2022127 1954045 1890809 1833307 1781913
50381 1781913 1737258 1700756 1674012 1657611 1650705 1651791 1659579 1672939 1690352 1709702 1728569 1744620
50369 1744620 1755845 1760554 1757221 1744613 1722523 1692372 1656634 1617401 1575767 1532732 1490160 1450285
50357 1450285 1414361 1382159 1352726 1325180 1298592 1271522 1242260 1209810 1174527 1137639 1100282
50346 1100282 1063303 1027903 995766 968039 944413 923723 905372 889760 877490 868712 863218 860604
50334 860604 860142 860959 862562 864913 867954 871444 875351 879904 885113 890681 896554 903065 910338 917998 925810
$$ packed form
50415A544931L3247L7863M2340M7207N2422N7170O0760O3231O4826O5299O4266
50404B133562O1874N8564N4386M9112M2908L6217K8921K0252R728k188j4600k6917
50392B451819l8860m9986n9516o6651p0948p2409p1322o8082o3236n7502n1394
50381A781913m4655l6502k6744j6401o906J086P788J3360J7413J9350J8867J6051
50369A744620J1225M709l333j2608k2090l0151l5738l9233m1634m3035m2572l9875
50357A450285l5924l2202k9433k7546k6588k7070k9262l2450l5283l6888l7357
50346A100282l6979l5400l2137k7727k3626k0690j8351j5612j2270q778n494k614
50334H60604m62Q17J603K351L041L490L907M553N209N568N873O511P273P660P812
$$ plain form
50319 925810 934109 943182 952552 961304 968894 975299 980628 984964 988463 991331 993797 996228 999001 1002083
50305 1002083 1005000 1007497 1009992 1013162 1017344 1022495 1028388 1034509 1040097 1044756 1048905 1053353 1058510 1064205
50291 1064205 1069924 1074903 1078196 1079136 1077752 1074609 1070317 1065344 1060111 1055047 1050575 1047126 1045023 1044422
50277 1044422 1045644 1049370 1055937 1064436 1073268 1081921 1091504 1103142 1116540 1130758 1145668 1161765 1178971
50264 1178971 1196641 1214756 1234207 1255666 1278702 1302256 1325642 1348893 1372330 1395823 1418469
50253 1418469 1439126 1457367 1473581 1488031 1500210 1509368 1515113 1517125 1514869 1508207 1497794 1484288
50241 1484288 1467602 1447745 1425985 1404330 1384137 1366072 1351072 1339971 1331891 1324046 1313587 1299103
50229 1299103 1280238 1256943 1229846 1200714 1171587 1143366 1115543 1087290 1058665 1030891 1005529
$$ packed form
50319I25810Q299R073R370Q752P590O405N329M336L499K868K466K431K773L082
50305A002083K917K497K495L170M182N151N893O121N588M659M149M448N157N695
50291A064205N719M979L293R40j384l143m292m973n233n064m472l449k103o01
50277A044422J222L726O567Q499Q832Q653R583J1638J3398J4218J4910J6097J7206
50264A178971J7670J8115J9451K1459K3036K3554K3386K3251K3437K3493K2646
50253A418469K0657J8241J6214J4450J2179R158N745K012k256o662j0413j3506
50241A484288j6686j9857k1760k1655k0193j8065j5000j1101q080p845j0459j4484
50229A299103j8865k3295k7097k9132k9127k8221k7823k8253k8625k7774k5362
$$ plain form
50218 1005529 983281 963602 945590 929009 914121 900779 888288 876169 864572 853869 844228
50207 844228 835622 827863 820617 813734 807498 802144 797259 792189 786917 781945 777358 772736 768036 763816
50193 763816 760344 757091 753388 749110 744555 740147 736467 734009 732656 731855 731415 731546 732019 732045 731401 730998
50177 730998 731820 733760 735992 738044 740030 742161 744590 747518 751047 754976 758923 762496 765344 767467
50163 767467 769604 772841 777634 783670 790850 799767 810962 824392 840046 858414 879749 903460 928936
50150 928936 956484 986665 1019152 1053123 1088628 1126672 1167907 1211946 1257970 1305299 1353194
50139 1353194 1400716 1447152 1492373 1536690 1580589 1624440 1667911 1709484 1746818 1777692 1800415
50128 1800415 1813500 1815529 1805626 1783867 1751223 1709392 1660691 1607633 1552244 1495830 1439443 1384398
$$ packed form
50218A005529k2248j9679j8012j6581j4888j3342j2491j2119j1597j0703r641
50207H44228q606p759p246o883o236n354m885n070n272m972m587m622m700m220
50193G63816l472l253l703m278m555m408l680k458j353q01m40J31M73K6o44m03
50177G30998Q22J940K232K052J986K131K429K928L529L929L947L573K848K123
50163G67467K137L237M793O036P180Q917J1195J3430J5654J8368K1335K3711K5476
50150I28936K7548L0181L2487L3971L5505L8044M1235M4039M6024M7329M7895
50139A353194M7522M6436M5221M4317M3899M3851M3471M1573L7334L0874K2723
50128A800415J3085K029r903k1759l2644m1831m8701n3058n5389n6414n6387n5045
$$ plain form
50116 1384398 1332198 1283978 1240061 1200017 1163245 1129562 1099128 1071827 1046973 1023814 1002035
50105 1002035 981518 961936 943067 925394 909808 896626 885273 875006 865581 857047 849294 842098
50093 842098 835473 829761 825413 822729 821615 821451 821382 820948 820406 820319 820936 822154 824013 826913 831147 836401
50077 836401 842021 847768 854029 861151 868846 876516 883983 891555 899381 907068 913958 919480 923257 925240
50063 925240 925878 925871 925586 924883 923529 921454 918546 914721 910420 906631 903986 902133 900380 898723 897847 898245
50047 898245 899802 902280 905839 911007 918264 927644 938594 950306 962381 975158 989323 1005279 1022991
50034 1022991 1042235 1062851 1084887 1108593 1134100 1161076 1188972 1217694 1247582 1278496 1309426
50023 1309426 1339444 1368601 1397341 1425285 1451175 1473932 1493230 1509199 1522195 1532876 1541894
$$ packed form
50116A384398n2200m8220m3917m0044l6772l3683l0434k7301k4854k3159k1779
50105A002035k0517j9582j8869j7673j5586j3182j1353j0267r425q534p753p196
50093H42098o625n712m348k684j114j64o9m34n42q7O17J218J859K900M234N254
50077H36401N620N747O261P122P695P670P467P572P826P687O890N522L777J983
50063I25240O38pk85p03j354k075k908l825m301l789k645j853j753j657q76L98
50047H98245J557K478L559N168P257R380J0950J1712J2075J2777J4165J5956J7712
50034A022991J9244K0616K2036K3706K5507K6976K7896K8722K9888L0914L0930
50023A309426L0018K9157K8740K7944K5890K2757J9298J5969J2996J0681R018
$$ plain form
50012 1541894 1549296 1554428 1556359 1553988 1545839 1530435 1507210 1476861 1440819 1400750 1358467 1315708
50000 1315708 1273679 1233054 1194481 1158667 1125877 1095883 1068632 1044475 1023365 1004268 985883
49989 985883 967690 949890 932545 915344 898167 881339 865164 849585 834525 820281 807278
49978 807278 795499 784425 773613 763232 753990 746603 741321 737735 734870 731618 727458 722941 719276
49965 719276 717229 716475 716078 715487 714995 715448 717719 722304 729130 737663 747286 757519 767945 778092 787559
49950 787559 796077 803362 809172 813628 817114 819545 820119 818276 814638 810347 805555 799182 790320 779342
49936 779342 767431 755508 743846 732357 720838 709156 697510 686458 676530 667939 660785 655314
49924 655314 651708 649662 648440 647466 646880 647436 649769 653668 658145 662262 665766 668861 671748 674774 678833
$$ packed form
50012A541894P402N132J931k371q149j5404k3225l0349l6042m0069m2283m2759
50000A315708m2029m0625l8573l5814l2790k9994k7251k4157k1110j9097j8385
49989I85883j8193j7800j7345j7201j7177j6828j6175j5579j5060j4244j3003
49978H07278j1779j1074j0812j0381r242p387n282l586k865l252m160m517l665
49965G19276k047p54l97n91m92M53K271M585O826Q533R623J0233J0426J0147R467
49950G87559Q518P285N810M456L486K431N74j843l638m291m792o373q862j0978
49936G79342j1911j1923j1662j1489j1519j1682j1646j1052r928q591p154n471
49924F55314l606k046j222r74n86N56K333L899M477M117L504L095K887L026M059
$$ [...]
##END NTUPLES=NMR SPECTRUM
##END=
