
##TITLE=AC1206_HPAAH12049_7160619_fPfpgWeFnK
##JCAMPDX= 6.0         $$ Bruker NMR JCAMP-DX V2.0
##DATA TYPE= NMR SPECTRUM
##DATA CLASS= NTUPLES
##ORIGIN= BRUKER
##OWNER= Administrator
$$ 1.72 TOPSPIN		Version 2.1
$$ 2012-12-01 00:24:40.342 -0500  Administrator@X
$$ Compression mode = diff/dup
##.OBSERVE FREQUENCY= 400.02188249412
##.OBSERVE NUCLEUS= ^1H
##.ACQUISITION MODE= SIMULTANEOUS (DQD)
##.ACQUISITION SCHEME= undefined
##.AVERAGES= 64
##.DIGITISER RES= 22
##SPECTROMETER/DATA SYSTEM= spect
##.PULSE SEQUENCE= noesygpps1d.comp
##.SOLVENT NAME= COFFEE_meoh
##.SHIFT REFERENCE= INTERNAL, COFFEE_meoh, 1, 14.96224
##AUDIT TRAIL= $$ (NUMBER, WHEN, WHO, WHERE, PROCESS, VERSION, WHAT)
$$ ##TITLE= Audit trail, TOPSPIN		Version 2.1
$$ ##JCAMPDX= 5.01
$$ ##ORIGIN= Bruker BioSpin GmbH
$$ ##OWNER= Administrator
$$ $$ E:\/data/COFFEE/nmr/AC1206_HPAAH12049_7160619_fPfpgWeFnK/12/pdata/1/auditp.txt
$$ ##AUDIT TRAIL=  $$ (NUMBER, WHEN, WHO, WHERE, PROCESS, VERSION, WHAT)
(   1,<2012-12-01 00:24:34.311 -0500>,<Administrator>,<X>,<go>,<TOPSPIN 2.1>,
      <created by zg
	started at 2012-12-01 00:13:04.620 -0500,
	POWCHK enabled, PULCHK disabled,
       configuration hash MD5:
       86 BA 57 50 F2 9D 5C 9B 26 00 A9 28 5F 66 2E 89
       data hash MD5: 64K
       38 FB D4 72 D2 40 7F F5 92 F7 AA 74 24 F8 B4 05>)
(   2,<2012-12-01 00:24:37.483 -0500>,<Administrator>,<X>,<proc1d>,<TOPSPIN 2.1>,
      <Start of raw data processing
       efp LB = 0.3 FT_mod = 6 PKNL = 1 PHC0 = 0 PHC1 = 0 SI = 128K 
       data hash MD5: 128K
       C0 AA C6 79 20 1C C3 60 95 07 35 94 15 A7 6B 73>)
(   3,<2012-12-01 00:24:38.576 -0500>,<Administrator>,<X>,<proc1d>,<TOPSPIN 2.1>,
      <pk PHC0 = -79.00818 PHC1 = 0 
       data hash MD5: 128K
       67 B7 A2 63 83 4C 13 9B 91 94 95 3F 10 CC 77 CB>)
(   4,<2012-12-01 00:24:39.342 -0500>,<Administrator>,<X>,<proc1d>,<TOPSPIN 2.1>,
      <abs ABSG = 1 
       data hash MD5: 128K
       A6 84 E8 46 8C B1 E9 61 DB 7E 88 7B AA 92 BC 96>)
(   5,<2012-12-01 00:24:39.514 -0500>,<Administrator>,<X>,<proc1d>,<TOPSPIN 2.1>,
      <abs ABSG = 2 
       data hash MD5: 128K
       1A E6 B9 3F 68 7A 7B C0 F0 27 DE C9 A8 58 EB FE>)
(   6,<2012-12-01 00:24:39.655 -0500>,<Administrator>,<X>,<proc1d>,<TOPSPIN 2.1>,
      <abs ABSG = 3 
       data hash MD5: 128K
       72 C8 62 C0 AE E9 32 3D 57 32 52 6C 1D 86 EE 4E>)
(   7,<2012-12-01 00:24:39.826 -0500>,<Administrator>,<X>,<proc1d>,<TOPSPIN 2.1>,
      <abs ABSG = 4 
       data hash MD5: 128K
       DD 1B 72 07 AB BB CF DF B8 8B A1 C0 06 D5 D7 D5>)
(   8,<2012-12-01 00:24:40.014 -0500>,<Administrator>,<X>,<proc1d>,<TOPSPIN 2.1>,
      <abs ABSG = 5 
       data hash MD5: 128K
       1F 75 53 38 4B 92 B2 92 65 33 3B DC 4A 4A 9F 4A>)
$$ ##END=
$$ 
$$ $$ hash MD5
$$ $$ 1A 9B 8E 29 C2 AF C2 AA 18 8B 6D A8 45 4F BB 63
##$RELAX= 
##$RELAX= 
##$RELAX= 
##$RELAX= 
##$RELAX= 
##$RELAX= 
##$RELAX= 
##$RELAX= 
$$ Bruker specific parameters
$$ --------------------------
##$DU= <E:\>
##$EXPNO= 12
$$ [...]
##$TP07= 0
##$TPNAME0= <>
##$TPNAME1= <>
##$TPNAME2= <>
##$TPNAME3= <>
##$TPNAME4= <>
##$TPNAME5= <>
##$TPNAME6= <>
##$TPNAME7= <>
##$TPOAL= (0..7)
0.5 0.5 0.5 0.5 0.5 0.5 0.5 0.5
##$TPOFFS= (0..7)
0 0 0 0 0 0 0 0
##$TUNHIN= 0
##$TUNHOUT= 0
##$TUNXOUT= 0
##$USERA1= <user>
##$USERA2= <user>
##$USERA3= <user>
##$USERA4= <user>
##$USERA5= <user>
##$V9= 5
##$VALIST= <valist>
##$VCLIST= <CCCCCCCCCCCCCCC>
##$VD= 0
##$VDLIST= <DDDDDDDDDDDDDDD>
##$VPLIST= <PPPPPPPPPPPPPPP>
##$VTLIST= <TTTTTTTTTTTTTTT>
##$WBST= 1024
##$WBSW= 4
##$XGAIN= (0..3)
0 0 0 0
##$XL= 0
##$YL= 0
##$YMAX_a= 7310150
##$YMIN_a= -15681354
##$ZGOPTNS= <>
##$ZL1= 120
##$ZL2= 120
##$ZL3= 120
##$ZL4= 120
##$ABSF1= 14.96224
##$ABSF2= -5.595942
##$ABSG= 5
##$ABSL= 3
##$ALPHA= 0
##$AQORDER= 0
##$ASSFAC= 0
##$ASSFACI= 0
##$ASSFACX= 0
##$ASSWID= 0
##$AUNMP= <proc_prof1d_extract.lims>
##$AXLEFT= 0
##$AXNAME= <>
##$AXNUC= <1H>
##$AXRIGHT= 0
##$AXTYPE= 0
##$AXUNIT= <>
##$AZFE= 0.1
##$AZFW= 0.1
##$BCFW= 0
##$BC_mod= 0
##$BYTORDP= 0
##$COROFFS= 0
##$CY= 15
##$DATMOD= 1
##$DC= 0
##$DFILT= <>
##$DTYPP= 0
##$F1P= 0
##$F2P= 0
##$FCOR= 0.5
##$FTSIZE= 131072
##$FT_mod= 6
##$GAMMA= 0
##$GB= 0
##$INTBC= 1
##$INTSCL= 1
##$ISEN= 128
##$LB= 0.3
##$LEV0= 0
##$LPBIN= 0
##$MAXI= 10000
##$MC2= 0
##$MEAN= 0
##$ME_mod= 0
##$MI= 0
##$NCOEF= 0
##$NC_proc= -2
##$NLEV= 6
##$NOISF1= 0
##$NOISF2= 0
##$NSP= 0
##$NTH_PI= 0
##$NZP= 0
##$OFFSET= 14.96224
##$PC= 1
##$PHC0= -79.00818
##$PHC1= 0
##$PH_mod= 1
##$PKNL= yes
##$PPARMOD= 0
##$PPDIAG= 0
##$PPIPTYP= 0
##$PPMPNUM= 2147483647
##$PPRESOL= 1
##$PSCAL= 4
##$PSIGN= 0
##$PYNMP= <proc.py>
##$REVERSE= no
##$SF= 400.020009141172
##$SI= 131072
##$SIGF1= 0
##$SIGF2= 0
##$SINO= 400
##$SIOLD= 131072
##$SPECTYP= <>
##$SREGLST= <1H.CDCl3>
##$SSB= 0
##$STSI= 131072
##$STSR= 0
##$SW_p= 8223.68421052631
##$SYMM= 0
##$S_DEV= 0
##$TDeff= 65536
##$TDoff= 0
##$TI= <>
##$TILT= no
##$TM1= 0
##$TM2= 0
##$TOPLEV= 0
##$USERP1= <user>
##$USERP2= <user>
##$USERP3= <user>
##$USERP4= <user>
##$USERP5= <user>
##$WDW= 1
##$XDIM= 131072
##$YMAX_p= 416874031
##$YMIN_p= -13584
##$CURPLOT= <Network HP LaserJet P1505>
##$CURPRIN= <$Network HP LaserJet P1505>
##$DFORMAT= <normdp>
##$LAYOUT= <+/1D_H.xwp>
##$LFORMAT= <normlp>
##$PFORMAT= <normpl>
##$SURQMSG= 1
$$ End of Bruker specific parameters
$$ ---------------------------------
##NTUPLES= NMR SPECTRUM
##VAR_NAME=  FREQUENCY,     SPECTRUM/REAL,   SPECTRUM/IMAG
##SYMBOL=    X,             R,               I
##VAR_TYPE=  INDEPENDENT,   DEPENDENT,       DEPENDENT
##VAR_FORM=  AFFN,          ASDF,            ASDF
##VAR_DIM=   131072,        131072,          131072
##UNITS=     HZ,            ARBITRARY UNITS, ARBITRARY UNITS
##FACTOR=    0.0627417313425164, 1,          1
##FIRST=     8223.62146879497, 289,          -57545
##LAST=      0,             1999,            -58125
##MIN=       0,             -13584,          0
##MAX=       8223.62146879497, 416874031,    0
$$ Real data points
##PAGE= N=1
##DATA TABLE= (X++(R..R)), XYDATA
$$ [...]
64592 52951 54492 55592 56220 56885 57531 57439 56342 55013 54361 54347 54174 53336 52126 51286 51400 52503 54024
64575 54024 55216 55811 56158 56614 57063 57290 57522 58204 59352 60547 61581 62700 64062 65271 65673 64982 63482
64558 63482 61700 60083 58992 58809 59810 61744 63670 64590 64401 63973 63994 64018 63107 61335 60025 60295 61790
64541 61790 63186 63590 63100 62279 61608 61352 61424 61293 60485 59325 58785 59361 60464 61280 61842 62706 63712 63816
64523 63816 62432 60432 59316 59568 60280 60378 59796 59257 59272 59679 60067 60278 60397 60443 60299 59867 59147 58176 57099
64504 57099 56317 56344 57303 58631 59492 59498 58914 58209 57601 57105 56766 56629 56585 56428 56077 55642 55305 55231 55488 55883
64484 55883 55947 55411 54702 54687 55733 57252 58393 58990 59537 60337 61130 61666 62211 63110 64063 64289 63509 62430
64466 62430 62027 62466 63008 62918 62198 61322 60447 59226 57453 55626 54654 55049 56621 58869 61367 63680 65282
64449 65282 65929 65981 65998 66030 65694 64940 64340 64375 64807 65116 65318 65885 66916 67798 67838 66956 65692 64724 64461 64881
64429 64881 65619 66333 67020 67861 68766 69373 69571 69722 70166 70748 71156 71602 72832 75405 79142 83293 87092
64412 87092 90197 92734 94981 96935 98225 98537 97995 96990 95743 94295 92871 91845 91226 90428 88827
64397 88827 86536 84454 83504 83761 84233 83564 81147 77667 74446 72229 70755 69520 68611 68554 69505 70975
64381 70975 72292 73050 73081 72315 70904 69351 68306 68180 68931 70103 71087 71521 71525 71439 71316 70924 70319 70086 70690
64362 70690 71837 72814 73287 73341 72917 71851 70503 69625 69287 68561 66808 64759 63620 63450 63255 62574 62021
64345 62021 62108 62417 62442 62588 63642 65622 67784 69622 71243 72773 73906 74210 73604 72453 71368 70874 71112
64328 71112 71851 72891 74329 76223 78141 79386 79642 79216 78745 78870 79952 81733 83298 83808 83296 82512
64312 82512 82099 82256 83038 84397 85959 87263 88345 89564 90811 91479 91373 90966 90486 89488 87777 86059
64296 86059 84950 83985 82488 81012 80854 82225 83961 85212 86471 88536 91241 93851 96173 98622 101404
64281 101404 104172 106437 107990 109038 110174 112102 115093 118731 122325 125470 128081 130072 131242 131456
64267 131456 130764 129373 127481 125062 121880 117950 113964 110889 109047 107894 106766 105407 103704 101559
64253 101559 99414 98280 98591 99399 99388 98468 97664 97656 98201 98961 99971 101113 101889 102133 102311 102771 103268 103714
64235 103714 104804 107265 110800 114455 117832 121289 124963 128239 130460 131781 133046 134951 137442 139819
64221 139819 141361 141881 141690 141139 140398 139654 139088 138378 136601 133157 128741 124887 122430 120769 118749 115995
64205 115995 113208 111370 110871 111333 112110 112906 113919 115408 117270 119180 120987 122769 124549 126211 127702
64190 127702 129084 130360 131461 132488 133716 135198 136554 137382 137838 138574 139989 141677 142786 142924 142499
64175 142499 142062 141572 140681 139587 139005 139158 139379 139143 138969 139693 141170 142432 143037 143500 144259 144943 145009 144581
64157 144581 144265 144553 145805 148415 152458 157283 161976 166264 170735 176166 182838 190514 198881 207952 218033
64142 218033 229270 241245 253202 264680 275715 286403 296578 306037 314679 322110 327469 330090
64130 330090 330214 328548 325167 319330 310546 299536 287957 277307 268160 260166 252569 244801 236837 229106
64116 229106 222063 215861 210388 205548 201441 198289 196196 194932 193963 192771 191288 190044 189778 190739 192403
64101 192403 194031 195519 197402 199962 202717 205154 207713 211517 217178 224370 232566 241577 251092 260287
64087 260287 268475 275894 283361 291210 298950 305934 311914 316818 320302 321842 321249 318933 315545 311361
64073 311361 306171 299874 293008 286411 280383 274556 268633 262862 257609 252797 248083 243415 239152 235736
64059 235736 233379 231919 230904 230059 229786 230897 233617 237174 240617 243747 246985 250676 254981 260200 266662
64044 266662 274258 282431 290664 298817 307155 316252 326629 338111 349735 360620 370743 380505 389803
64031 389803 398121 405410 412231 418877 424883 429619 433033 435592 437735 439598 441175 442651 444570 447622
64017 447622 452184 458215 465590 474205 483658 493313 503086 513659 525337 537013 546957 554420 559787
64004 559787 563367 564937 564530 562811 560417 557631 554963 553386 553583 555443 558581 562916 568516 575396 583735
63989 583735 593798 605425 618135 632041 648029 666674 687547 710149 734956 762886 794078
63978 794078 827903 863943 902272 942909 985662 1030629 1078423 1129793 1185366 1245745 1311574
63967 1311574 1383485 1462321 1549469 1646840 1756567 1880966 2022791 2185381 2372663 2589145
63957 2589145 2839806 3129811 3464449 3849379 4290484 4792817 5359285 5990057 6682750
63948 6682750 7432792 8233762 9077784 9955620 10856140 11765525 12666920 13540641 14364888
63939 14364888 15117126 15776207 16324475 16748864 17040819 17195449 17210431 17085298 16821628
63930 16821628 16424017 15900978 15265301 14534100 13728369 12871229 11985027 11088953 10198517
63921 10198517 9326415 8483529 7679687 6924032 6224462 5586195 5010881 4497323 4042848
63912 4042848 3643800 3295346 2991808 2727617 2497882 2298202 2124397 1972514 1838960
63903 1838960 1720744 1615752 1522600 1439870 1365648 1298048 1236002 1179140 1126995 1078689 1033326
63892 1033326 990343 949423 910323 872764 836390 800944 766543 733490 701624 670293 639318
63881 639318 609554 581952 556427 532200 508984 487137 466863 448043 430813 415516 401929
63870 401929 389259 377097 365764 355488 345888 336613 327965 320388 313739 307471 301320 295461 290229
63857 290229 285989 283064 281424 280600 280163 280241 281258 283185 285289 286748 287474 288253 289968 292657 295504 297794
63841 297794 299588 301210 302377 302264 300306 296538 291255 284847 277909 270944 263797 255843 246897 237542
63827 237542 228434 219745 211475 203813 196860 190405 184353 179037 174711 170998 167305 163622 160501 158273
63813 158273 156659 155197 153714 152227 150595 148520 145876 142961 140342 138466 137373 136686 135786 134162 131855
63798 131855 129514 127713 126214 124354 122227 120874 120941 121777 122428 122926 123736 124477 124280 123300 122617 122460 121740
63781 121740 119822 117747 116958 117511 118284 118411 117776 116538 114905 113206 111616 109992 108362 107262 107119 107581
63765 107581 107985 108184 108388 108432 107842 106547 105040 103887 103451 103943 105238 106728 107745 108126 108067 107646 106891
63748 106891 106119 105697 105640 105946 107102 109552 112693 115132 116189 116570 117304 118539 119689 120392 120904 121818 123727
63731 123727 127026 131673 137155 142886 148675 154788 161604 169295 177742 186602 195455 203927 211739 218672
63717 218672 224461 228673 230761 230425 227899 223733 218270 211685 204508 197727 192043 187337 183083 179013
63703 179013 175104 171292 167657 164657 162649 161244 159574 157195 154331 151343 148382 145559 143007 140726
63689 140726 138732 137361 137000 137399 137724 137460 136957 136949 137839 139605 142064 144991 148217 151889 156506 162489
63673 162489 169771 177808 185941 193700 201002 208116 215307 222454 229101 234828 239375 242433 243607 242691
63659 242691 239751 234875 228017 219278 209208 198733 188730 179620 171322 163674 156970 151874 148622
63646 148622 146560 144747 142886 141310 140261 139628 139349 139505 139945 140307 140537 141016 142040 143635 146036 149722
63630 149722 154594 159553 163485 166495 169737 174169 179863 186434 193614 201316 209483 218172 227681 238473
63616 238473 250973 265390 281634 299377 318296 338303 359540 382051 405379 428415 449719
63605 449719 468148 483200 494764 502720 506951 507613 505156 500188 493550 486439 480010 474722 470261 466015
63591 466015 461280 455105 446602 435706 423269 410126 396426 382168 367983 354816 342984 332041
63579 332041 321579 311788 303192 296079 290265 285236 280496 275865 271504 267614 264287 261680 260126 259845
63565 259845 260693 262367 264752 267851 271581 275936 281257 288075 296686 307064 319098 332681 347633
63552 347633 363853 381523 400937 422073 444547 467867 491458 514421 535618 554158 569597
63541 569597 581662 590131 595212 597826 599274 600752 603249 607528 613703 620833 627319 631876 633969 633282
63527 633282 629112 620548 607137 589149 567320 542614 516158 489012 461786 434701 408177 383178
63515 383178 360678 340907 323306 307162 292129 278228 265640 254526 244873 236519 229441 223899
63503 223899 220016 217305 214900 212265 209438 206662 204112 201992 200520 199721 199560 200265 202137 204955 208117
63488 208117 211520 215802 221413 227981 235052 242985 252502 263567 275314 286999 298486 309743 320316
63475 320316 329450 336540 341403 344220 345036 343255 338004 329350 318861 308398 298507 288490 277902
63462 277902 267378 257977 250192 243782 238169 233010 228689 226130 225697 226391 226739 226364 226054 226330 226763 226858
63446 226858 226715 226513 226155 225931 226789 229263 232720 236314 240165 244896 250518 256703 263846 272875 283993
63431 283993 296439 309617 323754 339353 356656 375800 396851 419459 443059 467628 493704
63420 493704 521373 549804 578154 606422 634827 662633 688062 709255 725023 734913 739134 738532
63408 738532 734326 727639 719250 709679 699384 688848 678432 667998 656776 643852 628868 612000
63396 612000 593302 572520 549692 525526 500889 476292 452172 429268 408271 389320 372297
63385 372297 357418 345046 335074 326986 320468 315454 311614 308414 305888 304815 305867 308867 313188 318572
63371 318572 325247 333336 342539 352440 363095 375213 389665 406711 425807 446298 468150 491688
63359 491688 516840 543041 569831 596983 623885 649280 671810 690480 704453 712980 715936 714088
63347 714088 708457 699812 689170 678241 668547 660193 652121 643511 634292 624345 613010 599682 584311
63334 584311 566986 547641 526652 505255 484703 465191 446135 427431 409808 393838 379140
63323 379140 364885 350834 337572 325909 316325 308883 303358 299357 296425 294131 292070 289920 287589
63310 287589 285314 283478 282374 282217 283200 285231 287623 289466 290482 291212 292154 293060 293398 293127 292472 291195
63294 291195 288885 285978 283698 282580 281723 279999 277519 275248 273584 272134 270734 269797 269428 268903 267526
63279 267526 265583 264024 263423 263654 264419 265638 267228 268840 270104 271056 272195 274046 276696 279829 283132
63264 283132 286490 289723 292367 294034 294971 295986 297709 300013 302233 303882 305125 306638 309080 312694
63250 312694 317351 322885 329205 336093 343131 349997 356720 363568 370856 379026 388629 399911 412515 425928
63236 425928 440143 455568 472330 490073 508483 527723 548311 570853 595839 623198 651843
63225 651843 679997 706331 730781 754205 777476 800975 824635 848184 871386 894207 916849
63214 916849 939708 963273 987701 1012078 1034328 1052440 1065810 1074929 1079734 1078992 1071546 1057534
63202 1057534 1037897 1013262 983964 950866 915467 879201 843061 807811 774133 742519 713347
63191 713347 687077 664156 644816 629158 617280 609027 603846 601244 601258 604125 609667 617450 627425
63178 627425 639787 654201 669731 685690 702079 718970 735939 752433 768370 784015 799457
63167 799457 814520 829056 842996 856136 868061 878274 886227 891256 892633 889798 882659 871665
63155 871665 857478 840406 820302 797252 772250 746770 721626 696695 671960 648319 626879
63144 626879 607804 590354 573996 558916 545457 533586 523139 514141 506542 499964 494127 489322
63132 489322 486011 483952 482179 479980 477604 475790 474897 474695 474796 474976 475183 475548 476355 477759 479528 481274
63116 481274 482881 484464 486002 487359 488745 490719 493563 496904 500180 503207 506106 508944 511772 514809
63102 514809 518247 521939 525581 529116 532711 536411 540055 543482 546625 549519 552453 555934 560055 564012
63088 564012 566765 568262 569529 571320 573241 574626 575857 578072 581646 585639 589040 591980 595277 599122
63074 599122 602963 606689 611257 617728 626072 635434 645318 655971 667692 680438 694288 709687 726838
63061 726838 745226 764225 783975 805291 828904 855105 883946 915277 948646 983643 1020481
63050 1020481 1059903 1102377 1147646 1195193 1244874 1296793 1350609 1405190 1459133 1511733 1563341
63039 1563341 1614631 1665576 1715461 1763904 1811394 1858543 1905289 1951341 1997129 2043585 2090938
63028 2090938 2138097 2183160 2223979 2258261 2283743 2298674 2301967 2292946 2271389 2237859 2193443 2139011
63016 2139011 2075277 2003790 1927321 1848854 1770625 1694408 1622142 1555531 1495316 1441575 1394638
63005 1394638 1355105 1323020 1297651 1278244 1264592 1256780 1254789 1258562 1268018 1282670 1301443 1323131
62993 1323131 1346986 1372686 1399836 1427732 1455654 1483280 1510732 1538203 1565459 1591779 1616409
62982 1616409 1639016 1659522 1677459 1691695 1700799 1703509 1698796 1685787 1664058 1634043 1596885 1553718
62970 1553718 1505178 1451721 1394312 1334623 1274530 1215462 1158204 1103170 1050786 1001621 956196
62959 956196 914678 876836 842343 811072 783001 757888 735239 714650 696047 679502 664961
62948 664961 652190 640875 630694 621423 613117 606064 600380 595666 591236 586733 582397 578684 575614
62935 575614 572611 569084 565115 561300 557753 553613 547970 541057 533952 527151 520197 512935 506260 501042
62921 501042 496856 492519 487541 482350 477394 472847 469038 466329 464448 462650 460671 458944 457705 456535
62907 456535 454986 453126 451254 449580 448378 447874 447705 447036 445540 443838 442684 442171 442029 442195 442679 443322
62891 443322 444094 445237 446725 448019 448696 448893 448685 447625 445517 443133 441383 440060 438215 435636 433138
62876 433138 431455 430627 430531 431280 432739 434243 435153 435416 435397 435349 435152 434322 432381 429476 426515 424227 422159
62859 422159 419091 414476 408978 403562 398647 394283 390553 387480 384950 382991 381730 380820 379414 377062
62845 377062 374281 371857 369928 368172 366539 365235 364165 362999 361764 360837 360249 359469 358133 356704 356151
62830 356151 356989 358756 360371 360987 360573 359780 359287 359412 360244 361790 363668 364926 364734 363388 362229 362299 363308
62813 363308 364209 364549 364891 365960 367771 369754 371460 372930 374553 376844 380314 385256 391483 398328 405017
62798 405017 411161 417034 423436 431198 440639 451505 463443 476456 490749 506321 523012 540981
62786 540981 560837 583173 608149 635665 665783 698820 735168 775177 819153 867429 920535
62775 920535 979277 1044366 1115811 1192917 1275051 1362143 1454135 1550111 1648229 1746319 1842203
62764 1842203 1933554 2017912 2092941 2156380 2205734 2238486 2253031 2249352 2228705 2192653 2142440
62753 2142440 2079125 2004160 1919837 1829111 1734916 1639603 1544939 1452370 1363019 1277560 1196408
62742 1196408 1120027 1048796 982623 921071 864034 812010 765507 724384 687917 655347 626113
62731 626113 599698 575570 553392 533193 515228 499652 486239 474411 463556 453434 444225 436197
62719 436197 429416 423753 419033 415081 411798 409311 407950 407914 409010 410935 413761 417947 423829 431365 440572
62704 440572 451941 466041 482669 500787 519540 539218 561082 586390 615736 649116 686255
62693 686255 726858 770854 818484 869959 924997 982868 1042889 1104478 1166542 1227117 1283914
62682 1283914 1335182 1379844 1416929 1445013 1462333 1467529 1460515 1442621 1415603 1380456 1337456 1287411
62670 1287411 1232383 1174800 1116180 1057081 998058 940171 884566 831972 782635 736517 693530
62659 693530 653757 617412 584511 554722 527656 503142 481047 461094 443141 427343 413673
62648 413673 401492 390025 379144 369289 360693 353067 345929 338865 331606 324266 317400 311356 305673
62635 305673 299575 293013 286672 281038 276063 271761 268417 265976 263847 261623 259489 257661 255932 254112
62621 254112 252483 251402 250761 250267 249987 250283 251418 253482 256422 259830 262946 265289 267188 269476 272744
62606 272744 277041 282112 287690 293743 300598 308707 318210 328956 340988 354661 370180 387472 406747
62593 406747 428768 454186 482925 514583 549179 587151 628856 674341 723250 774511 826389
62582 826389 877315 926504 973340 1016428 1053809 1084016 1106386 1120388 1125268 1120580 1106696 1084619
62570 1084619 1055608 1021051 982376 940826 897407 853143 809235 766815 726482 688104 651184
62559 651184 615679 582444 552629 526553 503531 482924 464836 449401 435874 423060 410479
62548 410479 398487 387364 376873 366751 357080 347980 339347 331043 323079 315551 308654 302758 298161
62535 298161 294699 291913 289578 287721 286198 284684 283170 282029 281555 281838 283137 285803 289657 293947 298260
62520 298260 303069 309104 316525 325059 334547 344977 356306 368734 382972 399732 419075 440683
62508 440683 464655 491490 521218 553060 586126 620051 654643 689209 722597 753754 781919
62497 781919 806286 825848 839708 847364 848598 843282 831554 814087 791933 766093 737422 706903
62485 706903 675692 644719 614516 585535 558366 533367 510353 489029 469583 452513 437882
62474 437882 425125 413560 402788 392661 383288 375162 368898 364624 361799 359625 357431 354780 351795
62461 351795 349533 349423 351807 355297 357991 359200 359688 360541 362300 365112 369063 374105 379922 386162 392711
62446 392711 399630 406947 414662 422916 432017 442082 452548 462062 469129 473005 473965 472721 469742 465168
62432 465168 459003 451096 441110 428896 414969 400426 386360 373427 361841 351556 342397 334233
62420 334233 327005 320553 314506 308632 303268 299072 296325 294709 293868 293864 294865 296647 298732 300997 303857
62405 303857 307811 312924 318818 325011 331206 337375 343692 350392 357594 365144 372623 379634 386189 392681
62391 392681 399275 405355 409853 412288 413258 413700 413854 413168 411133 407892 404044 400180 396695 393736 391169
62376 391169 388733 386415 384531 383425 383342 384787 388652 395584 405340 417139 430676 446398 464775 485715
62362 485715 508943 534727 563941 597435 635425 677375 722393 769808 819418 871045 923849
62351 923849 976190 1026108 1071695 1111117 1142821 1166038 1180870 1187706 1186807 1178669 1164323 1144801
62339 1144801 1120487 1091451 1058249 1021925 983354 943135 902148 861629 822507 785083 749609
62328 749609 716717 686968 660258 636001 613700 593085 573854 555619 538044 520928 504290
62317 504290 488579 474593 462929 453554 446089 440313 436163 433440 431837 431210 431509 432475 433721 435078
62303 435078 436548 437946 438924 439370 439359 438599 436444 432807 428609 424819 421251 416909 411481 405936 401489
62288 401489 398477 396517 395290 394711 394617 394894 395839 397887 400907 404280 407833 412191 417890 424506 431159
62273 431159 437614 444387 451865 459930 468551 478205 489365 501958 515724 530846 547796 566680 587269
62260 587269 609785 635256 664784 698654 736314 777039 820361 866012 913799 963417 1013952
62249 1013952 1063354 1108752 1147595 1178417 1200370 1212452 1213847 1205030 1187964 1164745 1136256 1102434
62237 1102434 1063706 1021666 978282 934733 891283 848164 806280 766948 731055 698680 669550
62226 669550 643696 621429 602756 587048 573427 561406 551079 542784 536615 532217 528970 526397
62214 526397 524355 522864 521889 521480 521950 523564 526003 528443 530297 531628 532828 534228 536112 538698 541801
62199 541801 544848 547514 550104 553101 556714 561168 567033 574713 583920 594228 605974 620004 636552
62186 636552 654963 674528 695007 716205 737575 758407 777972 795372 809766 821042 829894 837006
62174 837006 842486 846329 849155 852260 857097 864792 875807 890032 907415 928507 953909 983194 1014888
62161 1014888 1047595 1080471 1112460 1141949 1167683 1189285 1206230 1217157 1221256 1219943 1215956 1210694
62149 1210694 1203321 1192548 1178363 1161650 1143024 1122745 1101412 1080024 1059345 1039538 1020514
62138 1020514 1002533 986466 973362 963549 956154 949727 943308 936748 930168 923685 917706 912918 909631
62125 909631 907433 905858 905128 905900 908418 912225 916677 921503 926910 933362 941223 950442 960575 971220
62111 971220 982366 994211 1006813 1020157 1034500 1050289 1067592 1085792 1104090 1122352 1141378
62100 1141378 1162333 1185925 1212111 1240440 1270463 1301682 1333216 1363842 1392579 1419250 1444470
62089 1444470 1469241 1494682 1521963 1551983 1584733 1618990 1652854 1684791 1714316 1741961 1768983
62078 1768983 1797093 1827961 1862370 1899650 1938195 1976669 2014719 2052562 2090272 2127652 2164630
62067 2164630 2201413 2238243 2275189 2312234 2349388 2386661 2424003 2461251 2497997 2533472 2566671
62056 2566671 2596756 2623339 2646412 2666140 2682800 2696808 2708586 2718308 2725871 2731146 2734248 2735512
62044 2735512 2735331 2734134 2732407 2730596 2729023 2728132 2728742 2731657 2736848 2743411 2750660 2758924 2768809 2779963
62030 2779963 2791241 2802082 2812928 2824075 2834813 2844135 2851758 2857926 2862646 2865772 2867586 2868585 2868730
62017 2868730 2867466 2864518 2860236 2855158 2849727 2844432 2839696 2835487 2831539 2828111 2826085 2826071 2827850 2830939
62003 2830939 2835342 2841449 2849533 2859706 2872047 2886325 2901709 2917155 2932053 2946194 2959197 2970278
61991 2970278 2978593 2983583 2984933 2982448 2976059 2965951 2952696 2937260 2920653 2903367 2885262 2866212
61979 2866212 2846729 2827743 2809861 2793091 2777117 2761507 2745691 2729189 2712046 2694769 2677655
61968 2677655 2660363 2642254 2623039 2603047 2583038 2563710 2545053 2526063 2505499 2483252 2460751
61957 2460751 2439686 2420504 2402392 2384468 2366414 2348116 2329491 2311005 2293841 2278909 2265865
61946 2265865 2253528 2241354 2230222 2221725 2216861 2215333 2215883 2217288 2219226 2222314 2227259 2234035 2241983
61933 2241983 2250531 2259556 2269165 2279481 2290659 2302695 2315054 2326806 2337386 2347024 2356326 2365748
61921 2365748 2375784 2387334 2401509 2419141 2440812 2467254 2499396 2538101 2584226 2638933 2703595
61910 2703595 2779359 2867126 2968034 3083668 3215762 3366123 3537047 3731450 3952308 4202241
61900 4202241 4483969 4800950 5157015 5555061 5995857 6477466 6994902 7539605 8098806
61891 8098806 8654927 9185258 9662603 10057569 10342345 10494983 10503035 10365666 10093546 9706465
61881 9706465 9229693 8690622 8116248 7530996 6954697 6401520 5880565 5397449 4955454
61872 4955454 4555675 4196892 3876077 3589539 3333887 3106249 2903987 2724519 2565419
61863 2565419 2424516 2299767 2189181 2091030 2004066 1927359 1859972 1800988 1749847 1706384 1670448
61852 1670448 1641600 1619250 1602786 1591421 1584155 1580141 1578928 1580117 1582856 1585910 1588165 1588846 1587415
61839 1587415 1583601 1577475 1569207 1558815 1546540 1533419 1520966 1510157 1501123 1493970 1489355 1487901 1489496
61826 1489496 1493639 1500104 1508724 1518665 1528459 1536722 1542446 1544715 1542764 1536481 1526506 1513689 1498790
61813 1498790 1482781 1466907 1452007 1437980 1424332 1411346 1400467 1393408 1390932 1392625 1397838 1406568
61801 1406568 1419208 1435750 1455857 1479793 1508528 1542521 1580955 1622773 1668034 1717576 1771812
61790 1771812 1830798 1895314 1966707 2045494 2131103 2223409 2323763 2434178 2556294 2691664
61780 2691664 2842292 3010222 3197197 3405524 3638926 3901979 4199071 4534561 4913630
61771 4913630 5342252 5826556 6372725 6987044 7674844 8438742 9277768 10187271 11158112
61762 11158112 12174732 13213329 14240971 15215745 16088609 16807813 17325379 17603797 17621729
61753 17621729 17377987 16892361 16201943 15354089 14399115 13384937 12353591 11339185 10367193
61744 10367193 9454897 8612324 7843567 7148577 6524725 5967442 5470631 5027880 4633689
61735 4633689 4283234 3971346 3692732 3443397 3220956 3023150 2846770 2688505 2546238
61726 2546238 2418909 2305483 2204551 2114579 2033997 1961177 1894717 1833639 1777111 1724257 1674484
61715 1674484 1627697 1583784 1542108 1501941 1463263 1426759 1392955 1361603 1331963 1303644 1277125
61704 1277125 1253300 1232284 1212823 1193306 1173338 1153830 1135563 1118412 1102203 1087448 1074432
61693 1074432 1062132 1048935 1034303 1019039 1004011 989352 974987 961189 948273 936134 924406
61682 924406 912874 901550 890587 880261 870817 862279 854571 847845 842348 837832 833525 828949 824465
61669 824465 820636 817280 813717 809909 806734 804770 803302 801075 797847 794549 791895 789413 786190 782114
61655 782114 777989 774668 772421 770945 769615 767909 765919 764355 763732 763782 764037 764685 766280 768757 771382
61640 771382 773644 775586 777153 777897 777603 776736 776062 776191 777584 780477 784630 789591 795350 802271 810251
61625 810251 818557 826721 834973 843491 851797 859265 865643 870595 873344 873358 871040 867131 861730 854410 845087
61610 845087 834337 823067 812166 802135 792686 782998 772734 762448 752756 743631 734883 726678 719033
61597 719033 711426 703616 696306 690188 684866 679599 674653 670897 668394 666476 664972 664214 663915 663288 662454
61582 662454 662523 663967 666020 668199 671419 676892 684639 693768 703660 714245 725636 738121 752232 768268
61568 768268 785963 805032 825700 848285 872483 897485 922663 947839 973088 998501 1024006
61557 1024006 1049233 1073800 1097845 1121922 1146140 1169726 1191682 1211618 1229714 1246205 1261184
61546 1261184 1274631 1286261 1295503 1301884 1305292 1305762 1303264 1297883 1289971 1279824 1267432 1252772 1236175
61533 1236175 1218257 1199697 1181218 1163546 1147159 1132211 1118753 1106787 1096154 1086800 1079277 1074532
61521 1074532 1073035 1074605 1079336 1088044 1101282 1118375 1138160 1160564 1186888 1218580 1256215 1299740
61509 1299740 1349357 1405932 1470630 1544225 1626958 1719337 1823023 1940334 2072567 2219234
61499 2219234 2379285 2552534 2739076 2937424 3143733 3352765 3558829 3755583 3935528
61490 3935528 4090462 4212799 4296883 4339703 4341041 4303229 4230711 4129336 4005451 3865210
61480 3865210 3714469 3558893 3403582 3252431 3108094 2972565 2847323 2732979 2629458
61471 2629458 2536944 2456194 2387656 2330885 2285281 2250793 2227240 2213446 2207890 2210027 2220181 2238230
61459 2238230 2263134 2293733 2329319 2369338 2413153 2460225 2510029 2561668 2614010 2666195 2717635
61448 2717635 2767662 2815791 2862271 2907660 2951837 2994139 3034622 3074383 3114341 3154279 3193306
61437 3193306 3230490 3264786 3295211 3321739 3345364 3366692 3385051 3399576 3410461 3418220 3422279 3421524
61425 3421524 3416084 3407401 3396408 3382695 3365785 3346241 3324870 3301646 3276228 3249190 3221957 3195666
61413 3195666 3170695 3147241 3125783 3106830 3090631 3077254 3066606 3058181 3051016 3043996 3036029 3025939
61401 3025939 3012646 2995772 2975846 2953631 2929443 2903443 2876400 2849689 2824615 2802271 2784174
61390 2784174 2772410 2768749 2773950 2788371 2812972 2849305 2898742 2962309 3041193 3136763 3249934
61379 3249934 3380922 3529756 3696482 3880559 4080364 4293521 4517218 4747610 4979081
61370 4979081 5204481 5416101 5606196 5767071 5891709 5975130 6015394 6013501 5972496 5896558
61360 5896558 5790303 5658326 5505000 5334433 5150365 4956156 4755045 4550476 4345998
61351 4345998 4144782 3949275 3761260 3582061 3412684 3253965 3106616 2971049 2847269
61342 2847269 2735142 2634700 2545805 2467500 2398185 2336797 2283655 2239911 2206211 2182050 2166174
61331 2166174 2157414 2155258 2159888 2171607 2190078 2214218 2242952 2275852 2312749 2352989 2395482 2439346
61319 2439346 2483984 2528523 2571739 2612715 2651184 2687061 2720048 2749930 2776860 2800935 2821818
61308 2821818 2839165 2853170 2864201 2872014 2875823 2875214 2870536 2862289 2850444 2834548 2814234 2789477
61296 2789477 2760641 2728581 2694575 2659784 2624506 2587999 2549206 2507882 2465091 2422491 2381183
61285 2381183 2341444 2303583 2268602 2237586 2210656 2187006 2165952 2147478 2131678 2118090 2105904
61274 2105904 2094609 2084139 2074357 2064518 2053330 2039791 2024218 2008297 1993779 1981075 1969456 1958552
61262 1958552 1949119 1942283 1938536 1937715 1939482 1943471 1949496 1958168 1971073 1989758 2014698 2045769 2083581
61249 2083581 2129750 2185713 2251733 2327120 2410915 2502061 2599190 2700398 2802940 2902903 2995421
61238 2995421 3075446 3138281 3179530 3195202 3182592 3141267 3073135 2981760 2871775 2748566 2617748
61227 2617748 2484422 2352832 2226450 2107897 1998508 1898257 1806493 1722800 1647094 1579173
61217 1579173 1518533 1464560 1416595 1373840 1335645 1301966 1273063 1248499 1226901 1207211 1189856
61206 1189856 1176104 1166410 1160083 1156583 1156365 1160055 1167356 1177312 1189325 1203307 1218948 1235357 1251543
61193 1251543 1266874 1280917 1293103 1302803 1309707 1314130 1316884 1318759 1319925 1319839 1317750 1313287 1306596 1298107
61179 1298107 1288303 1277562 1266066 1253945 1241580 1229528 1217907 1206009 1192781 1177678 1160924
61168 1160924 1143073 1124517 1105291 1085094 1063537 1040621 1016931 993113 969248 945003 920401
61157 920401 896185 873326 852386 833339 815842 799606 784597 770815 757734 744140 728914
61146 728914 711956 694067 675916 657547 638999 620896 604060 588773 574849 562319 551623
61135 551623 543013 536097 530196 525084 521202 519136 518970 520157 521963 524054 526669 530257 534895 540077
61121 540077 545200 550270 555928 562630 570059 577647 585477 594189 603975 614241 624399 634453 644500
61108 644500 654202 663279 672116 681210 690205 698093 704240 708580 710889 710685 708062 703992 699415 694457
61094 694457 688903 682989 677259 671878 666568 661134 655698 650420 645262 640130 635157 630792 627536 625406
61080 625406 623647 621208 617660 613512 609519 605854 602108 597912 593374 588927 584910 581217 577296 572566
61066 572566 566951 560975 555360 550619 546989 544448 542683 541234 539882 538758 537946 537137 535948 534520 533583
61051 533583 533796 535134 537057 539248 541969 545501 549419 552875 555750 559087 563954 570171 576615 582622
61037 582622 588497 594709 601265 608059 615219 622755 630339 637841 645791 654872 665151 676149 687525
61024 687525 699395 712120 726051 741360 757929 775526 794266 814649 836835 860098 883441
61013 883441 906801 931369 958621 989111 1022184 1056782 1092513 1129910 1169597 1211333 1254251
61002 1254251 1298074 1343791 1393209 1448262 1510909 1582993 1665666 1759230 1863916 1980679 2111205
60991 2111205 2258112 2426205 2623672 2862006 3155425 3521062 3978800 4549358 5252267
60982 5252267 6106202 7130488 8345233 9771985 11437320 13370034 15573584 17973628
60974 17973628 20379369 22511043 24102198 25017241 25304580 25158880 24835405 24572576 24536718
60965 24536718 24773143 25170043 25475071 25387541 24687429 23324171 21417230 19184896 16856302
60956 16856302 14611471 12561534 10757468 9209659 7905514 6820759 5926095 5191790
60948 5191790 4590504 4098123 3693736 3359798 3081982 2848253 2648270 2473953 2320033
60939 2320033 2183122 2060236 1948613 1846653 1754087 1670879 1596239 1528822 1467407 1410986
60929 1410986 1358270 1307454 1256807 1205680 1154859 1105699 1058944 1014516 972323 932697 895872
60918 895872 861500 829093 798675 770614 744997 721492 699673 679153 659464 640167 621162
60907 621162 602805 585824 571065 558936 548851 539560 530305 521355 513124 505279 497311 489674 483506
60894 483506 479174 475759 472181 468339 464886 462332 460667 459691 459446 460357 462899 467021 472016 477228 482672
60879 482672 488553 494411 499428 503570 507710 512345 516830 520208 522291 523561 524579 525911 528052 530719
60865 530719 532606 532560 530881 528841 527104 525291 523004 520488 518112 515905 513876 512269 511199 510479 510072
60850 510072 510373 511763 514282 517996 523236 530122 538233 547212 557315 568789 580892 592158 601628
60837 601628 609384 616012 622064 628074 634465 641155 647645 653633 659168 664130 668092 671015 673592 676502
60823 676502 679667 682689 685740 689477 694236 699777 705690 711569 716800 720769 723378 725038 726112 726750
60809 726750 727225 727857 728423 728137 726522 723907 720832 717341 713169 708168 702129 694572 685310 675030 664740
60794 664740 654809 645053 635640 627187 619935 613526 607765 602907 598873 594895 590581 586897 585324 586178
60780 586178 588333 590609 592903 595934 600416 606652 614461 623202 632173 641276 651114 662217 674435 687229
60766 687229 700296 713472 726240 737833 747911 756813 765024 772677 779662 785930 791476 796259 800370
60753 800370 804127 807807 811382 814744 817984 821185 824081 826309 828012 829813 832046 834323 836010 836885
60739 836885 837138 836875 835848 833618 829879 824787 819038 813424 808133 802702 796868 791134 786148 781704 776800
60724 776800 770761 763938 757251 751332 746189 741480 737010 733066 730285 729055 729115 729911 731206 732993 734981
60709 734981 736604 737589 738089 738181 737646 736372 734515 732088 728795 724515 719522 714003 707811 701126 694891
60694 694891 690066 686687 684132 682063 680585 679698 679234 679339 680352 682040 683367 683332 681808 679420 676730
60679 676730 673615 669320 663137 655102 645877 635931 625187 613685 602115 591247 581168 571680 563107
60666 563107 555991 550206 545202 541069 538494 537551 537405 537436 537881 539053 540725 542749 545488 549011 552531
60651 552531 555319 557750 560781 564773 569405 574369 579427 584104 587991 591170 593735 595146 594756 592854
60637 592854 590499 588457 586903 586053 586290 587586 589523 592133 596133 602100 609838 618715 628156 637688 647006
60622 647006 656293 666125 676881 688537 701129 714932 729945 745634 761503 777596 794093 810641
60610 810641 826478 841101 854610 867396 879645 891067 901051 909102 915003 918389 918352 913923 904949
60597 904949 892095 875937 856608 834587 811369 788901 768509 750586 735055 721720 710256
60586 710256 700261 691417 683582 676791 671315 667564 665765 665711 666886 668744 670812 672683 674073 674908 675317
60571 675317 675557 675840 676123 676126 675750 675391 675615 676600 678187 680411 683614 687901 692864 698031 703358 709092 715294
60554 715294 721656 727704 733109 737906 742394 746812 751187 755655 760694 766812 774211 783114 794245 808462
60540 808462 826053 846950 871595 900853 934853 972413 1011721 1050981 1088109 1120378 1144864
60529 1144864 1159080 1161285 1150957 1129470 1099922 1065835 1030134 995263 963395 935900 913094
60518 913094 895044 882269 875231 873488 875861 881083 887914 895193 902441 910087 918500 927094 935076 942849
60504 942849 952087 964583 981555 1003798 1031816 1065900 1106796 1156353 1216932 1290238 1377203 1478849
60492 1478849 1596547 1731487 1884707 2057916 2253690 2474546 2722186 2997752 3302109
60483 3302109 3635018 3993297 4368713 4746405 5104902 5418474 5661157 5810813 5852341 5780112
60473 5780112 5599221 5324786 4979377 4589464 4181498 3778115 3395686 3044177 2728483
60464 2728483 2449655 2205828 1993678 1809911 1651521 1515139 1397126 1294583 1205718 1128995
60454 1128995 1062395 1003739 951385 904457 862647 825753 793078 763498 736552 713082 693918
60443 693918 678037 662985 647335 631825 617900 606065 596060 587633 580350 573324 565996 558746
60431 558746 552141 545928 539448 532699 526330 520775 515902 511371 506869 502173 497417 493125 489694 487014
60417 487014 484937 483732 483720 484752 486528 489095 492530 496304 499541 501856 503594 505405 507900 511487 516000
60402 516000 520623 524601 527961 531233 534713 538451 542716 547866 553812 560071 566277 572223 577546 581906
60388 581906 585449 588603 591498 594090 596793 600296 604593 608725 611659 613011 612870 611477 609308 606964
60374 606964 604601 601826 598436 594904 591862 589391 587181 585101 583282 581796 580639 579878 579543 579506 579741
60359 579741 580598 582441 585099 588091 591418 595693 601292 607755 614349 620989 628128 635872 643748 651523
60345 651523 659726 668919 678680 687858 695724 702370 707895 711758 713300 712560 710173 706666 702206 696955
60331 696955 691308 685835 681199 678074 676762 676897 677869 679585 682473 686568 690924 694221 695808 695865 694726
60316 694726 692393 688826 684314 679255 673815 668075 662506 657884 654605 652360 650666 649415 648623 647927 646832
60301 646832 645414 644376 644305 645187 646657 648365 650002 651372 652632 654108 655649 656453 655833 653897 651259
60286 651259 648353 645361 642522 640073 637906 635720 633570 632035 631782 633160 636225 640946 647177 654430
60272 654430 661773 668170 673120 676993 680601 684447 688490 692507 696405 700224 704229 709002 715000 721925
60258 721925 729033 736302 744821 755650 768652 782908 798020 814575 833489 855308 880115 907755
60246 907755 938166 971681 1008950 1050486 1096447 1146991 1202602 1263915 1331498 1405834 1487024
60235 1487024 1574251 1666056 1761513 1860611 1963013 2066966 2170025 2270319 2366353 2456027
60225 2456027 2536957 2607702 2667810 2716605 2752800 2775433 2784489 2780513 2764368 2737591 2702298 2660465
60213 2660465 2613898 2565030 2516956 2472325 2432681 2399139 2372970 2355066 2345572 2344704 2353499 2373162
60201 2373162 2404055 2445949 2498951 2563509 2639514 2725972 2821482 2924502 3032966 3143925 3253755
60190 3253755 3358779 3455968 3543287 3619240 3681943 3728925 3758182 3769179 3762502 3738750 3698352
60179 3698352 3642420 3573287 3493969 3407500 3317031 3226214 3138863 3057913 2984778 2920005 2864668
60168 2864668 2821020 2791550 2777440 2778151 2792526 2819967 2860342 2912973 2976058 3046976 3122871 3200813
60156 3200813 3277584 3349592 3413320 3466112 3506635 3534549 3549837 3552630 3543594 3524163 3496264 3462072
60144 3462072 3424159 3385541 3349194 3317595 3292911 3277544 3274075 3284538 3309835 3350014 3405076
60133 3405076 3475608 3562743 3667756 3791835 3936197 4102110 4290486 4501408 4734223 4988055
60123 4988055 5262014 5554834 5864443 6187825 6520936 6858570 7194581 7522522 7836143
60114 7836143 8129314 8395802 8629501 8825006 8977914 9084626 9142074 9147918 9101186 9002841
60104 9002841 8855675 8663659 8431629 8165789 7874308 7566847 7253033 6941235 6638590
60095 6638590 6351696 6086755 5848824 5641025 5464614 5319951 5207372 5127116 5078569 5059925
60085 5059925 5068697 5102248 5157578 5230864 5317536 5412741 5511507 5608735 5699564 5779866 5846240
60074 5846240 5895750 5926213 5936757 5927686 5899665 5853307 5789445 5709283 5614088 5505057 5383629
60063 5383629 5251599 5110870 4963433 4811707 4658443 4506107 4356694 4212324 4075642
60054 4075642 3949348 3835445 3735104 3649000 3577703 3521998 3482834 3460723 3455258 3465730 3492250
60043 3492250 3535648 3596077 3672273 3762347 3864539 3976734 4095806 4218011 4339521 4456076
60033 4456076 4562751 4655077 4730301 4786983 4823617 4838466 4830581 4800163 4747854 4674513 4582002
60022 4582002 4473566 4352896 4223151 4087252 3948905 3812796 3683524 3564206 3456031
60013 3456031 3359249 3274652 3203998 3148890 3109566 3085194 3075262 3080308 3101356 3139026 3193311 3263880
60001 3263880 3350477 3453189 3572302 3707597 3857683 4020065 4191538 4368008 4544008 4713127
59991 4713127 4869430 5008407 5126582 5220780 5288298 5327583 5338280 5320519 5274539 5201193 5102782
59980 5102782 4983162 4847063 4699412 4545341 4390467 4240486 4100104 3972500 3859921
59971 3859921 3764396 3687484 3629615 3590354 3569390 3566769 3582073 3613907 3660564 3720839 3793750
59960 3793750 3877646 3969971 4067906 4168955 4270956 4371840 4469430 4561308 4644885 4717974 4779570
59949 4779570 4829955 4869826 4899430 4918804 4928878 4931964 4930989 4928542 4927001 4929381 4939582 4961760
59937 4961760 4999854 5057798 5139609 5248769 5387631 5557761 5760627 5997468 6268358 6571640
59927 6571640 6904131 7261238 7636359 8020148 8400700 8764690 9098423 9388167 9620277
59918 9620277 9782299 9865108 9864651 9781979 9622100 9393259 9107004 8777641 8420352 8049104
59908 8049104 7675866 7310760 6961990 6635503 6335256 6064128 5824457 5617825 5444718
59899 5444718 5304711 5196946 5120508 5074648 5058775 5072205 5113973 5182900 5277671 5396434 5536239
59888 5536239 5692980 5861705 6036548 6210366 6374966 6522097 6644135 6733786 6783826 6788091
59878 6788091 6743293 6649905 6511362 6332697 6120015 5880680 5623170 5356138 5087341 4823101
59868 4823101 4568219 4325995 4098434 3886723 3691660 3513765 3353357 3210794 3086434
59859 3086434 2980005 2890120 2814778 2752315 2701603 2661490 2630537 2607214 2589732 2575640 2562311
59848 2562311 2548196 2533148 2517247 2499963 2480990 2461319 2442732 2426376 2412414 2400798 2391627
59837 2391627 2384505 2377957 2369655 2357220 2339171 2315572 2287751 2257024 2223819 2188351 2151836 2116381
59825 2116381 2083641 2054083 2027496 2003543 1981654 1961132 1942024 1925653 1913874 1907759 1907152 1911270
59813 1911270 1919369 1930822 1944974 1961394 1980393 2003078 2030631 2063577 2101914 2145638 2194450
59802 2194450 2246812 2300033 2351789 2401178 2447807 2490334 2526642 2555234 2575864 2588986 2595377
59791 2595377 2596395 2593892 2589643 2585203 2582305 2582831 2588310 2599930 2619113 2647553 2686583 2737163 2800747
59778 2800747 2879619 2976100 3091977 3229128 3390202 3578105 3794928 4041685 4318663 4625142
59768 4625142 4958243 5311614 5674423 6030604 6358811 6634130 6832203 6934878 6934912 6837239
59758 6837239 6656449 6412738 6128578 5826111 5524251 5236329 4970141 4730165 4519306
59749 4519306 4338797 4187760 4063985 3965111 3888903 3833035 3795404 3774597 3769642 3779451 3802999
59738 3802999 3839900 3890351 3954467 4032137 4123604 4229836 4352094 4491318 4648112 4823275
59728 4823275 5018204 5234793 5475120 5741328 6035723 6360673 6718287 7110262 7538008
59719 7538008 8002443 8503231 9038219 9603648 10194391 10803452 11421522 12037806 12641633
59710 12641633 13223486 13775636 14293532 14777328 15231723 15664182 16083555 16499628 16921981
59701 16921981 17357651 17809584 18276868 18755052 19235431 19704883 20147622 20547376 20888351
59692 20888351 21156181 21340263 21435876 21443704 21368022 21216474 21001292 20738949 20447596 20144809
59682 20144809 19847222 19570622 19329155 19134586 18996663 18923878 18923629 19002131 19164727 19416043
59672 19416043 19759508 20196790 20727806 21350655 22060564 22848197 23698465 24590211 25496244
59663 25496244 26383530 27213940 27945978 28537481 28949158 29148840 29115965 28845056 28346786
59654 28346786 27646206 26779128 25788179 24718982 23616136 22519274 21460416 20463268 19543574
59645 19543574 18709476 17961888 17295232 16698005 16152614 15635490 15119426 14578660 13994778
59636 13994778 13360683 12680998 11969271 11243778 10523754 9826718 9166552 8552347 7988591
59627 7988591 7476507 7015296 6602539 6234496 5906981 5616082 5358050 5129094 4925958
59618 4925958 4746448 4588768 4450501 4328909 4222122 4129312 4049564 3981223 3922505 3872048
59608 3872048 3828460 3789786 3753784 3718369 3681514 3641123 3595509 3543876 3486120 3422462 3353523
59597 3353523 3280425 3204394 3126431 3047706 2969973 2895112 2824393 2758545 2698391 2644776 2597902
59586 2597902 2557275 2522513 2493745 2471030 2453871 2441701 2434498 2432480 2435358 2442370 2452915 2466740
59574 2466740 2483414 2502094 2521977 2542773 2564564 2587392 2611093 2635306 2659510 2683337 2707125
59563 2707125 2732059 2759587 2790793 2826409 2867183 2914005 2967807 3029516 3099885 3179144 3267172
59552 3267172 3364451 3472660 3593822 3728964 3878047 4041060 4218457 4410352 4615944 4833944
59542 4833944 5063087 5301790 5547673 5797650 6048073 6294547 6532266 6757187 6966611
59533 6966611 7157976 7327291 7469559 7581132 7661552 7713291 7740134 7745789 7733488 7706384 7668216
59522 7668216 7623546 7577300 7534234 7498953 7476277 7471199 7488358 7531535 7603362 7704888 7834936
59511 7834936 7989541 8161833 8342435 8520331 8683894 8821595 8922394 8976326 8975528 8915111
59501 8915111 8793395 8611832 8374993 8090287 7767125 7416060 7048319 6675278 6307379
59492 6307379 5953052 5618481 5307918 5023819 4766981 4537175 4333904 4156421 4003299
59483 4003299 3872557 3762380 3671500 3598925 3543731 3505227 3483003 3476680 3485820 3510283 3550474
59472 3550474 3607131 3680972 3772507 3881905 4008857 4152697 4312764 4488453 4678792 4882007
59462 4882007 5095475 5315722 5537948 5755527 5960420 6144651 6301535 6425467 6510864 6552203
59452 6552203 6545773 6491285 6391455 6250356 6072822 5865194 5635351 5391165 5139093 4884391
59442 4884391 4631979 4386362 4150936 3927912 3718778 3524424 3345058 3180505 3030565
59433 3030565 2894774 2772053 2661051 2560770 2470609 2389995 2318323 2255029 2199363 2150349
59423 2150349 2107442 2070926 2041154 2017622 1999399 1986205 1978331 1975531 1976838 1981589 1989950 2002235
59411 2002235 2018379 2038336 2062261 2089469 2117258 2141278 2157577 2164848 2165261 2163138 2162420 2165145 2172175
59398 2172175 2184784 2204825 2233396 2269782 2311564 2355238 2397137 2435107 2470126 2506024 2547290
59387 2547290 2597160 2657531 2729691 2814622 2913070 3025969 3154755 3301218 3467320 3655294
59377 3655294 3867492 4105935 4372353 4668762 4997518 5360458 5758110 6189645 6652778
59368 6652778 7143073 7653518 8175110 8697813 9211179 9704912 10169817 10598734 10987166
59359 10987166 11333734 11640133 11909896 12146550 12352833 12531191 12683776 12811184 12911516
59350 12911516 12981081 13015567 13010380 12960779 12862788 12714062 12513760 12262357 11962432 11619191
59340 11619191 11239302 10829201 10394999 9943434 9481629 9015583 8549699 8088059 7635479
59331 7635479 7196936 6776522 6377352 6002070 5652796 5330588 5035263 4765855 4521301
59322 4521301 4300795 4103588 3928452 3773527 3636850 3516967 3412806 3323121 3246347 3180972
59312 3180972 3125723 3079426 3041090 3010199 2986624 2970119 2960176 2956484 2959214 2968657 2984780 3007363
59300 3007363 3036363 3071891 3113853 3161797 3215132 3273363 3336164 3403342 3474696 3549732 3627355
59289 3627355 3705897 3783591 3859212 3932400 4003381 4072343 4139072 4203189 4264741 4324473 4383527
59278 4383527 4443078 4504517 4569851 4641208 4719210 4801745 4884905 4965486 5042405 5115729 5184975
59267 5184975 5248865 5306096 5355257 5393802 5417946 5424103 5410210 5375631 5320587 5246325 5155536
59256 5155536 5051880 4938998 4820307 4699649 4581472 4469835 4367326 4275174 4194336 4126055
59246 4126055 4071191 4029364 3999331 3980157 3971559 3972957 3982804 3999246 4020954 4046753 4074833 4103089
59234 4103089 4130153 4155540 4179046 4200879 4222361 4245601 4272127 4302599 4338176 4381558 4436396
59223 4436396 4506279 4594569 4704411 4838187 4997372 5183432 5398294 5643226 5917294 6217044
59213 6217044 6536904 6869085 7203366 7527739 7829406 8095234 8312233 8468952 8556808 8570162
59203 8570162 8505945 8364430 8150405 7872767 7542685 7172359 6774995 6364410 5953517 5552881
59193 5552881 5170358 4811330 4478935 4174531 3898370 3649846 3427204 3227703 3048588
59184 3048588 2887975 2744710 2617528 2504506 2403273 2311709 2228605 2153693 2086975 2027916
59174 2027916 1975259 1927609 1884226 1845327 1811564 1783057 1758970 1738223 1720410 1705654 1693748
59163 1693748 1684186 1677118 1673473 1673746 1677399 1683958 1693944 1707919 1725246 1744758 1766300 1790652 1818142
59150 1818142 1848343 1881099 1916899 1956087 1998570 2044384 2093739 2146346 2201611 2259749 2321792
59139 2321792 2387999 2456983 2527017 2597561 2668933 2740952 2812596 2882634 2949933 3013230 3071194
59128 3071194 3122816 3167545 3205155 3235669 3259330 3276564 3288214 3295816 3301261 3305932 3310599 3316329
59116 3316329 3325075 3338884 3358890 3385489 3419214 3460914 3511226 3570379 3638580 3716308 3804308
59105 3804308 3903504 4014750 4138279 4273422 4419093 4574399 4738472 4909769 5085736 5262870
59095 5262870 5436596 5601145 5750119 5877402 5977432 6045048 6076134 6069069 6025336 5948465
59085 5948465 5842729 5713053 5565423 5406271 5241094 5073920 4907837 4745220 4587082
59076 4587082 4432908 4281826 4133830 3989481 3848660 3710324 3573509 3438128 3304684
59067 3304684 3173663 3045427 2920317 2798633 2680780 2567603 2460195 2359074 2263822 2173875
59057 2173875 2089328 2010652 1937821 1870229 1807395 1749327 1696102 1647423 1602639 1561109 1522560
59046 1522560 1487175 1455202 1426276 1399343 1373508 1348763 1325568 1303868 1282944 1262191 1241644
59035 1241644 1221736 1202918 1185632 1170387 1157681 1147831 1140859 1136484 1134460 1134973 1138374 1144226 1151134
59022 1151134 1158043 1165343 1173958 1183495 1192083 1198124 1201463 1202721 1202322 1200578 1198084 1195445 1192949 1190904
59008 1190904 1189887 1190267 1191851 1194456 1198487 1204426 1211934 1220021 1227953 1235451 1242033 1246786 1249010 1248694
58994 1248694 1246086 1241144 1233795 1224585 1214696 1205207 1196572 1188901 1182454 1177562 1174208 1172098 1171244 1172081
58980 1172081 1174779 1178747 1183184 1187909 1193244 1199271 1205733 1212634 1220385 1229189 1238764 1248964 1260295
58967 1260295 1273428 1288398 1304601 1321471 1338816 1356581 1374602 1392687 1410722 1428605 1446258
58956 1446258 1463888 1482164 1501804 1522802 1544224 1565048 1585249 1605873 1628096 1652496 1679222
58945 1679222 1708306 1739529 1772448 1807041 1844075 1884357 1927895 1974364 2024175 2078313 2137105
58934 2137105 2199899 2266314 2337210 2413902 2496774 2585241 2679011 2779030 2887116 3004946 3133626
58923 3133626 3274169 3428043 3596900 3781862 3983604 4203426 4443820 4707568 4996560
58914 4996560 5312039 5655735 6030128 6437597 6879837 7357944 7872307 8422112 9005315
58905 9005315 9618947 10258477 10916246 11580730 12237454 12870174 13461124 13991087 14440495
58896 14440495 14791215 15028170 15140757 15124212 14980369 14717219 14347721 13888501 13358336
58887 13358336 12776453 12161231 11529662 10896909 10275511 9674851 9101520 8560140 8053830
58878 8053830 7584229 7151468 6754243 6390129 6056275 5750154 5469656 5212516 4975986
58869 4975986 4757208 4553750 4363731 4185748 4018843 3862432 3716098 3579546 3452676
58860 3452676 3335454 3227635 3128759 3038321 2955720 2880128 2810733 2747097 2689054 2636408 2589096
58849 2589096 2547380 2511396 2480661 2454577 2433261 2417223 2406365 2400085 2398342 2401673 2410005 2422482
58837 2422482 2438901 2460428 2488219 2522020 2560806 2604253 2652836 2706858 2766141 2830669 2901052
58826 2901052 2978363 3063645 3157378 3259393 3369687 3489450 3620710 3764819 3922028 4092856
58816 4092856 4279097 4482897 4705575 4948182 5212793 5502491 5820367 6169128 6551316
58807 6551316 6969073 7423652 7915470 8444173 9007827 9601889 10219132 10850201 11483750
58798 11483750 12106295 12702341 13254481 13743407 14149050 14453373 14642894 14709221 14648856 14464114
58788 14464114 14164092 13763406 13279299 12729828 12133634 11509417 10874281 10242373 9624669
58779 9624669 9029208 8461352 7924498 7420929 6951843 6516801 6113960 5741264 5397177
58770 5397177 5080251 4788430 4519079 4269605 4038101 3823558 3625377 3442536 3273394
58761 3273394 3116450 2970879 2836075 2711134 2595278 2488341 2390176 2299888 2216359 2139315
58751 2139315 2069212 2006174 1949661 1898997 1853511 1812272 1774466 1740096 1709709 1683317 1660108
58740 1660108 1639118 1619670 1601256 1583676 1567282 1552404 1538500 1524441 1509637 1494291 1478697
58729 1478697 1463076 1447966 1433833 1420142 1405752 1390472 1375315 1360806 1345878 1329034 1310002
58718 1310002 1289670 1268826 1247465 1225049 1201074 1175573 1149259 1122901 1096548 1069864 1043230
58707 1043230 1017782 994135 971795 950267 930020 911803 895510 880375 865943 852320 839750
58696 839750 828422 818380 809121 799538 788755 776867 764534 752150 739859 728058 717226 707296
58684 707296 697811 688773 680873 674747 670344 667170 664910 663702 663913 665754 669001 673122 677767 683128
58670 683128 689675 697508 706038 714231 721077 725929 728629 729479 729121 728324 727663 727165 726194 723812 719330 712647
58654 712647 704234 694969 685865 677676 670641 664685 659864 656467 654711 654454 655342 657171 660187 664952 671795
58639 671795 680356 689932 700402 712500 726935 743487 761306 779916 799537 820536 842984 866770
58627 866770 891808 918080 945708 975000 1006208 1039255 1073915 1110341 1149418 1192720 1242126
58616 1242126 1299169 1364600 1438853 1523035 1618972 1727988 1850180 1985283 2133615 2295399
58606 2295399 2469545 2653871 2846097 3043481 3241323 3432685 3609793 3765181 3891702
58597 3891702 3982710 4033142 4040439 4004639 3928438 3817364 3678957 3520937 3350076 3172546
58587 3172546 2994296 2820333 2653927 2496971 2350849 2216650 2094877 1985455 1888004 1801883
58577 1801883 1726105 1659479 1600930 1549712 1505419 1467682 1435609 1407608 1382050 1358058 1335416
58566 1335416 1313814 1292662 1271620 1250936 1231138 1212609 1195371 1179061 1163207 1147820 1133395
58555 1133395 1119925 1106267 1091079 1074122 1055937 1036481 1014988 991215 966039 940634 915772
58544 915772 892060 870189 850615 833419 818452 805142 792429 779759 768114 759002 752239 745770
58532 745770 738073 729825 722631 717048 712540 708677 705471 702851 700538 698359 696314 694467 692971 691918
58518 691918 690969 689392 686637 682570 677149 670332 662408 653939 645323 636843 629042 622366 616433 610405
58504 610405 604187 598519 593826 589880 586704 584808 584168 583932 583557 583374 583607 583842 584008 584850 586682 588519
58488 588519 589331 589536 590406 592505 595397 598317 600474 601286 601093 601120 601995 602785 602240 600476 598609 597153 595683
58471 595683 593842 591880 590300 589514 589654 590249 590421 589874 589268 589100 588797 587701 586478 586592 588512 591253
58455 591253 593663 595468 597037 598719 600603 602528 604186 605313 605698 604977 602813 599513 596124 593598 592145
58440 592145 591556 591759 592749 594379 596581 599530 603457 608520 614773 621744 628203 633127 636853 640348 643312
58425 643312 644118 641865 637392 631948 626129 620571 616184 612807 608968 604074 599762 597889 598196 599248 600861
58410 600861 604128 609590 616726 624951 634029 643750 654193 666021 679643 694424 709395 724202 738545
58397 738545 751448 762050 770543 777353 781994 783829 783381 781836 779745 777169 774441 771657 768041 763079
58383 763079 757636 752737 747813 741555 733987 726264 718872 711543 704714 699509 696321 694640 694147 694744 695807
58368 695807 696748 698145 700967 704944 709038 713296 718667 725137 731718 738353 746231 755884 766420 776954
58354 776954 787496 798026 807978 817194 826348 835982 845945 856001 866095 875837 884599 892324 899408
58341 899408 905727 910560 913494 914561 913614 910566 906276 902321 899835 899170 900364 903087 906490 910121 914678
58326 914678 920947 928474 936401 944991 955001 966083 977251 988608 1001086 1014801 1029159 1044210
58314 1044210 1060336 1076931 1093116 1109476 1127276 1146103 1164141 1180657 1196309 1211004 1223521
58303 1223521 1233511 1241945 1249284 1255049 1259578 1264386 1270294 1276845 1283973 1292632 1303358 1315715 1329486
58290 1329486 1344912 1361539 1378429 1395686 1414192 1433844 1453786 1474411 1497098 1521805 1546906
58279 1546906 1571637 1596676 1622145 1647308 1672610 1699751 1729202 1759857 1791630 1826028 1863473
58268 1863473 1902385 1941764 1982449 2024856 2067556 2109203 2150115 2191133 2232649 2275342 2320088
58257 2320088 2366652 2414258 2463602 2516144 2571481 2627998 2686184 2748346 2814766 2883367 2953755
58246 2953755 3028242 3107969 3191494 3278288 3370276 3468593 3572100 3680367 3794810 3915699
58236 3915699 4041594 4173060 4313126 4462610 4619004 4781771 4954571 5140187 5337492
58227 5337492 5545791 5767959 6006785 6262486 6536467 6833221 7155726 7503447 7877692
58218 7877692 8284097 8726760 9205239 9721042 10281879 10895865 11567480 12303743 13118424
58209 13118424 14025429 15034752 16160903 17429179 18868256 20505024 22375468 24535169
58201 24535169 27054138 30013788 33524031 37741745 42870542 49160856 56926559 66543721
58193 66543721 78400866 92844276 110178712 130701965 154712247 182490262 214248990
58186 214248990 249889028 288390873 327078524 361458988 386201677 396977894 392106753
58179 392106753 373033760 343503008 308080593 270858045 234791699 201654584 172310678
58172 172310678 147025211 125685053 107949358 93376500 81521045 71977101 64385332
58165 64385332 58440752 53902573 50583450 48329355 47027470 46629258 47110269 48327961
58157 48327961 49874150 51087300 51277750 50024406 47331135 43555875 39204409 34741156
58149 34741156 30495998 26654619 23289939 20404638 17966265 15925629 14224080 12801414
58141 12801414 11605109 10593183 9731023 8990145 8349678 7794355 7309535 6880470 6495861
58132 6495861 6148264 5830431 5534456 5255007 4990254 4738959 4499727 4273603 4063971
58123 4063971 3872495 3697568 3537485 3392381 3262062 3144596 3038098 2941322 2851315 2763075
58113 2763075 2673077 2581374 2489392 2397993 2308719 2224343 2146353 2073619 2004866 1940691 1881854
58102 1881854 1827466 1776346 1728541 1684039 1641525 1599984 1560310 1523875 1490523 1459125 1429091
58091 1429091 1400202 1371997 1344371 1317894 1292680 1267904 1243116 1218941 1195678 1172363 1148064
58080 1148064 1123041 1097932 1072952 1048531 1025497 1003838 982471 961056 940817 922767 906322
58069 906322 890488 875205 860698 846801 833832 822893 814230 806433 798225 790007 782683 776149 769925
58056 769925 764140 758721 752665 745291 737339 729729 722136 713861 705233 697027 689323 681979 675430 669977
58042 669977 665070 660286 656152 652991 649880 645911 641641 638110 635302 632813 631237 631385 632677 633685
58028 633685 633856 633474 632448 630482 628080 626026 624122 621628 618691 616111 613943 611612 609280 607752 606960
58013 606960 605787 603667 601260 599175 596913 593522 588671 582718 576229 569716 563508 557574 551586 545183
57999 545183 538160 530690 523500 517502 512937 509209 505721 502341 498866 494764 490026 485634 482590 481074
57985 481074 481117 483358 488128 494225 499594 503186 505449 507298 509260 511434 513491 514804 515160 515244 515938 517355
57969 517355 518987 520452 521533 521787 520718 518219 514567 510332 506513 503990 502333 499931 496044 491998
57955 491998 489456 488210 486766 484493 481932 479306 476108 472221 468390 465424 463733 463571 464838 466647
57941 466647 467990 468897 470153 471941 473579 474609 475191 475386 474911 473785 472372 470637 468089 464558 460203
57926 460203 454662 447168 437823 427945 418758 410430 402794 396221 391152 387326 384107 381335 379375 378525
57912 378525 378748 379865 381766 384541 388514 393954 400670 408087 415724 423367 430756 437472 443263 448268
57898 448268 452801 457044 460955 464314 466885 468678 469912 470554 470153 468390 465546 462061 457866 452622 446430
57883 446430 439833 433235 426776 420667 415087 409842 404603 399518 395092 391471 388335 385596 383767 383485
57869 383485 384860 387384 390327 393316 396700 401149 406693 412481 417755 422672 427725 432803 437388 441345
57855 441345 444880 447975 450468 452442 453862 454131 452772 450331 447762 445091 441585 437144 432541 428216
57841 428216 423821 419159 414641 410497 406358 401973 397684 393874 390566 387791 385631 383627 380915 377271
57827 377271 373269 369082 364021 357800 351381 345742 340410 334131 326613 318774 311436 304536 297628 290593
57813 290593 283815 278057 274080 271971 270815 269386 267222 264912 263438 263482 265205 268310 272279 276783 281912
57798 281912 287911 294696 301692 308106 313270 316840 318749 319054 317945 316075 314647 314823 316859 319964 323022
57783 323022 325373 327089 328771 330980 333544 335450 335697 334199 331596 328352 324529 320285 316003 311846
57769 311846 307687 303584 299849 296526 293259 289869 286639 283919 281849 280592 280294 280614 280748 280252 279491
57754 279491 279063 279038 278990 278456 277226 275417 273399 271395 269218 266746 264583 263630 264022 265128 266682 269126
57738 269126 272572 276210 279314 282189 285538 289392 293271 297039 300908 304845 308564 312028 315483 319126
57724 319126 323052 327379 332040 336598 340641 344268 347906 351812 356034 360694 365939 371666 377559 383340
57710 383340 388947 394674 401229 409297 418743 428550 437858 446871 456491 467297 479162 491679 504667
57697 504667 518416 533666 551161 571001 592644 615751 640800 668730 700262 735745 775390
57686 775390 819413 868272 922990 984994 1055505 1135458 1226152 1329451 1447029 1579914 1729091
57675 1729091 1896007 2081928 2287132 2511036 2752334 3008162 3273372 3541265 3804518
57666 3804518 4054203 4277569 4457537 4575323 4615016 4568348 4438194 4238839 3991825 3719437
57656 3719437 3439873 3166125 2907026 2668164 2452186 2259270 2088103 1936972 1804369
57647 1804369 1688845 1588537 1501176 1424719 1357744 1299167 1248046 1204023 1167443 1138370 1115615
57636 1115615 1097268 1082155 1070349 1062444 1058881 1059938 1065750 1076141 1090755 1109503 1132655 1160602
57624 1160602 1193810 1232942 1278644 1331237 1391013 1458812 1536029 1624016 1723688 1835443 1959007
57613 1959007 2093302 2236729 2387380 2542438 2697372 2846114 2982181 3099422 3192054 3254762
57603 3254762 3283345 3275506 3231470 3154268 3049153 2922135 2778837 2624720 2465696 2307511
57593 2307511 2154370 2008531 1871138 1742860 1623913 1514305 1414291 1324092 1243116 1170097
57583 1170097 1104095 1044729 991337 942694 897916 857038 820351 787661 758486 732405 708811
57572 708811 686827 665995 646733 629712 615063 602454 591472 581587 572156 562934 554357 546985
57560 546985 540972 536333 533243 531578 530584 529586 528754 528547 528695 528422 527711 527668 529478 533404 538905 545317
57544 545317 552287 559990 569162 580645 594574 610126 626213 642430 659295 677761 698619 722264
57532 722264 748790 778137 810218 845138 883545 926691 975864 1031717 1094414 1164443 1242847
57521 1242847 1330329 1426484 1530271 1640936 1757874 1879542 2002998 2124496 2239967 2344704
57511 2344704 2433236 2500265 2541869 2555718 2540644 2496891 2427050 2336214 2230572 2115740 1996255
57500 1996255 1875964 1758101 1644975 1538124 1438916 1348499 1267029 1193517 1126922 1067077
57490 1067077 1014205 967875 927058 891100 860014 833773 811840 793571 778646 766838 757701
57479 757701 750790 746095 744012 744916 748836 755528 764934 777591 794422 815913 841721 871434 905651
57466 905651 945861 993207 1047755 1109042 1176947 1251899 1334619 1425897 1526216 1635121 1750838
57455 1750838 1870522 1990744 2107721 2217261 2314646 2394586 2451653 2481394 2481418 2451582 2393561
57444 2393561 2310794 2208537 2092893 1969115 1841081 1712383 1587089 1468756 1359076 1258080
57434 1258080 1165437 1081004 1004412 934868 871655 814468 763138 717252 676107 638938 605135
57423 605135 574371 546522 521454 498983 478962 461123 444832 429357 414567 401015 389149
57412 389149 378734 369256 360500 352425 344845 337591 330715 324217 317933 311996 306917 302686 298283 292828
57398 292828 286911 281922 278216 274839 271031 267079 263503 260338 257679 256058 255614 255420 254377 252456 250518
57383 250518 249163 248406 248223 248650 249308 249520 249120 248667 248566 248472 247915 247233 247323 248501 250028 250870 250658 249723
57365 249723 248455 246924 245107 243173 241409 239982 238914 238162 237604 236975 235989 234575 232946 231461 230441
57350 230441 230075 230363 231105 232012 232917 233877 235026 236314 237481 238360 239162 240321 241983 243752 245033 245562
57334 245562 245531 245330 245325 245731 246468 247190 247682 248168 248939 249767 250161 250256 250924 252672 254856 256505 257689 259528
57316 259528 262798 267015 271041 274304 277196 280467 284383 288453 291898 294432 296534 298933 301916 305288
57302 305288 308903 312913 317448 322322 327291 332496 338412 345294 352884 360777 369038 378248 388905 400927
57288 400927 413908 427717 442605 458724 475803 493439 511555 530478 550633 572235 595141
57277 595141 618880 642845 666457 689225 710774 730928 749509 765716 777900 784436 784879 779920
57265 779920 770270 756174 738098 717114 694173 669506 643275 616328 589685 563692 538378 514363
57253 514363 492578 473178 455598 439738 426230 415272 406007 397550 389988 383834 378981 374874 371400
57240 371400 368846 367055 365279 363057 360749 359029 358156 357945 358137 358539 358954 359253 359532 360086 361171 362801
57224 362801 364714 366556 368193 369860 371854 374061 376021 377596 379326 381804 384841 387604 389590 391079
57210 391079 392534 394044 395669 397928 401349 405621 409692 412851 415397 418139 421542 425498 429699 434015
57196 434015 438651 444040 450472 457763 465374 472811 479822 486288 492211 497792 503231 508407 513095 517502
57182 517502 522262 527780 533952 540688 548243 556729 565628 574165 582097 589895 598285 607721 618063 628578
57168 628578 638543 648099 658252 669761 682313 695152 708210 722101 737131 752894 768976 785571
57156 785571 803173 821962 841813 862801 885296 909369 934329 959247 984050 1009723 1037153
57145 1037153 1066091 1095667 1125608 1156256 1187558 1218916 1250245 1282403 1316179 1351497 1388052
57134 1388052 1426111 1466085 1507836 1551057 1595987 1643131 1692554 1744077 1798001 1855020 1915501
57123 1915501 1979348 2046493 2117119 2191581 2270611 2355499 2447574 2547450 2655120 2770765 2895205
57112 2895205 3029662 3175312 3333048 3503594 3688134 3889138 4110559 4357364 4635340
57103 4635340 4951536 5314716 5735691 6228227 6810191 7503777 8335259 9335893 10543274
57094 10543274 12000498 13752785 15843384 18308230 21167757 24419635 28038828 31982094
57086 31982094 36186057 40559630 44989652 49370976 53639946 57776384 61767252 65562225
57078 65562225 69054004 72089688 74499636 76129752 76867012 76650524 75468825 73354058
57070 73354058 70380392 66662081 62345011 57595432 52591644 47515023 42534280 37787739
57062 37787739 33374643 29357137 25765169 22600587 19843814 17463410 15422971 13683236
57054 13683236 12203879 10947274 9880275 8971752 8190419 7507080 6898730 6349823 5850568
57045 5850568 5394890 4978842 4599116 4252477 3936570 3650372 3393020 3162563 2956297
57036 2956297 2771771 2606793 2458918 2325722 2205439 2096877 1998811 1909839 1828667 1754179
57026 1754179 1685370 1621473 1562050 1506830 1455613 1408316 1364828 1324790 1287916 1254607 1225824
57015 1225824 1202241 1184079 1172050 1168059 1174563 1193461 1225938 1273267 1337721 1423085 1534345
57004 1534345 1675548 1845212 2031008 2207736 2342269 2405152 2382866 2282859 2128051 1945509
56994 1945509 1757283 1577498 1413827 1269818 1146471 1043093 957754 887725 830258 783305
56984 783305 745504 715633 692334 674044 658558 642659 622859 596880 564389 526506 485090
56973 485090 442404 400630 361243 325016 292641 264915 242295 224829 212694 206358 205989 211183
56961 211183 221513 236894 257148 281683 309951 341710 376162 410759 441271 463228 473555
56950 473555 471437 458261 436885 410673 382738 355542 330674 308907 290615 276140 265655 258956
56938 258956 255815 256399 260964 269227 280721 295827 315912 342117 374269 410726 448392 482445
56926 482445 506953 517002 510855 490275 459181 422097 383121 345251 310156 278557 250804 227038
56914 227038 207005 190096 175655 163228 152547 143328 135127 127446 120105 113416 107791 103220 99311
56901 99311 95803 92785 90496 89154 88978 90093 92473 96311 102388 111679 124456 140133 158105 178535
56887 178535 202273 230332 263325 300770 340484 378775 411551 435497 448766 451364 445214 433522
56875 433522 419543 405646 393041 382008 372503 365039 361041 362025 368571 380531 398045 421712 451817
56862 451817 488221 531235 581833 640417 705472 773091 836871 888247 918619 923087 902743 863328
56850 863328 812003 755324 698878 647014 602303 565728 537625 518311 508072 507216 516422 536804
56838 536804 569467 614996 673335 744149 827403 923343 1030983 1145500 1256742 1350571 1412647
56827 1412647 1432817 1408418 1345224 1255158 1151708 1045844 944791 853015 773277 706858 653768
56816 653768 613488 585643 569997 566096 573249 591031 619731 660066 712250 775407 847772 926545
56804 926545 1006344 1077744 1128772 1149511 1136281 1092211 1024795 943072 855795 770222 691372
56793 691372 621989 563056 514391 475340 445450 424613 412533 408433 411532 421529 438334 461645
56781 461645 491056 526172 565890 607335 645602 674602 688567 683947 661059 624092 579002 530926
56769 530926 483146 437583 395460 357518 324193 295733 271986 252193 235444 221334 209874
56758 209874 200763 193134 186134 179550 173786 169350 166390 164576 163400 162605 162229 162255 162451 162666 163044 163769
56742 163769 164811 166054 167440 168768 169569 169472 168561 167204 165709 164279 163032 161799 160179 158039 155760
56727 155760 153699 151689 149446 147261 145852 145522 145820 146027 145777 145242 144865 144900 145078 144846 143998 142917 142122
56710 142122 141817 142030 142832 144171 145642 146665 146816 145903 144034 141777 139981 139102 138866 138698 138281 137577 136642
56693 136642 135642 134789 134097 133445 132936 132768 132672 132029 130825 129947 130192 131483 133404 135797 138292 139860 139709
56676 139709 138413 137394 137380 137939 138361 138376 138091 137805 138044 139370 141946 145330 148615 150751 151167 150316 149279
56659 149279 148586 147821 146582 145161 143823 142058 139307 135931 132749 129979 127414 125307 124224 124138 124458
56644 124458 124920 125771 127191 129169 131765 134789 137271 138092 137189 135516 133843 132273 130948 130360 130651 131195
56628 131195 131211 130500 129478 128765 128763 129287 129647 129409 128940 128855 129206 129648 130116 130704 131169 131261 131328 131883 132643 132886
56608 132886 132712 133052 134278 135617 136224 136196 136192 136539 137007 137182 136928 136704 137223 138445 139302 139066 138612 139452 141710
56589 141710 144044 145528 146424 146962 146580 145030 143290 142570 142887 143227 142803 141741 140806 140817 142069 144145 146469
56572 146469 149023 152200 156029 160039 163874 167513 170927 174133 177558 181715 186519 191569 197069 203718
56558 203718 211618 220143 228947 238240 247843 256845 264539 271073 276907 282349 287778 293447 298812 302831
56544 302831 305206 306496 306809 305400 302003 297530 292864 287820 281954 275551 269093 262521 255721 249042
56530 249042 242609 235857 228578 221782 216589 212766 209231 205573 202226 199461 197123 195153 193596 192211
56516 192211 190705 189175 187773 186220 184235 182113 180204 178150 175399 172313 169973 168859 168337 167523 166098
56501 166098 164305 162642 161640 161542 162098 162899 163816 164909 166071 167080 167870 168490 168954 169323 169724 170047 169935
56484 169935 169346 168873 169238 170670 172908 175388 177301 178012 177803 177710 178308 179166 179871 180926 183003 185901 188964
56467 188964 192123 195736 199694 203487 206990 210453 213795 216623 218987 221548 224889 228980 233237 236814
56453 236814 239106 240379 241677 243623 245661 246994 247898 249276 251072 252114 251687 250484 249583 249099 248371
56438 248371 247152 246045 245718 246030 246128 245321 243691 241775 239882 237985 236130 234509 233116 231758 230520
56423 230520 229782 229607 229509 229087 228495 228094 227999 228141 228359 228274 227579 226695 226575 227523 228751 229418 229494 229112 227789
56404 227789 225095 221699 218967 217625 217402 217824 218763 220182 221827 223314 224424 225404 226962 229628 233081
56389 233081 236560 239996 244061 248876 253431 256685 258488 258864 257203 253029 247033 240518 234135 227898
56375 227898 222154 217689 214954 213740 213537 213784 213958 213869 213757 213914 214571 216263 219592 224170 228513 231587
56359 231587 233837 236119 238393 240241 241979 244239 246917 249488 251985 254747 257557 259942 262066 264386
56345 264386 266698 268410 269562 270671 271753 272376 272472 272274 271616 270227 268567 267485 267112 266989 267248 268738
56329 268738 271868 276097 280696 285352 289983 294554 299170 303873 308430 312761 317439 323175 330013 337468
56315 337468 345178 352933 360411 367496 374534 381698 388582 395006 401646 409108 417004 424848 433106 442196
56301 442196 450950 457538 461698 464809 467879 470684 472773 474079 474479 473916 473109 473128 474202 475829 477943
56286 477943 480915 484550 488224 492015 496596 502092 508233 515578 525216 537164 550345 564339 579851
56273 579851 597277 616167 636517 659248 684988 713602 745416 781637 822858 868311 917394
56262 917394 971049 1030915 1097995 1172900 1256662 1350402 1454580 1569052 1693512 1827543 1970616
56251 1970616 2122250 2281573 2446564 2614219 2781514 2945537 3102712 3248888 3380458
56242 3380458 3494673 3588800 3659959 3706220 3727246 3723914 3698305 3654177 3596193 3527992 3451514
56231 3451514 3368311 3280495 3190057 3098210 3005805 2913631 2821861 2729928 2637297 2543756 2448933
56220 2448933 2352395 2254487 2156205 2058066 1959996 1862465 1766767 1673913 1584174 1497954 1416123
56209 1416123 1339178 1266995 1199662 1137659 1081015 1029255 982286 940279 902587 868007 836324
56198 836324 808278 783764 761480 740794 722467 706894 693025 679908 668019 658100 649769 642224
56186 642224 635462 629898 625495 622028 619515 617830 616596 615931 616411 617926 619578 621180 623763 628042 633522
56171 633522 639712 647105 656211 666692 678241 691237 705721 720748 735686 751209 768135 786037
56159 786037 803840 821069 837768 853889 869361 884109 897576 909108 919204 929323 940042
56148 940042 950571 960638 971624 985198 1002126 1023204 1050072 1084135 1125751 1175328 1234153
56137 1234153 1303363 1383280 1474529 1578272 1693941 1817524 1943016 2064738 2177785 2278021
56127 2278021 2363530 2435589 2497283 2551578 2600795 2646117 2686166 2717082 2735304 2739845 2731688 2712590
56115 2712590 2685280 2652929 2616565 2573774 2520856 2455194 2374988 2278982 2168570 2049076 1927252
56104 1927252 1808203 1695565 1592720 1501716 1422082 1352687 1293976 1246782 1209989 1181300 1159548
56093 1159548 1144441 1134757 1128701 1125633 1125728 1128242 1131590 1134776 1137422 1138871 1138595 1137040 1134781 1131325
56079 1131325 1125973 1119351 1112976 1107799 1104123 1102178 1101710 1101777 1102088 1103799 1107978 1114160 1121383 1129627 1139142
56064 1139142 1149408 1159888 1170827 1182376 1194065 1206079 1219604 1234886 1250477 1265506 1281023
56053 1281023 1297844 1314958 1331592 1348911 1367891 1387376 1406166 1425312 1446325 1468704 1491277
56042 1491277 1514368 1538588 1563105 1587212 1612026 1638515 1665547 1692044 1719261 1748675 1779448
56031 1779448 1810373 1842461 1877069 1913366 1950354 1989476 2032332 2077671 2123506 2170399 2219676
56020 2219676 2270400 2321364 2374150 2430839 2490491 2551338 2614539 2682089 2752933 2824982 2899186
56009 2899186 2977561 3058989 3141238 3225482 3314451 3407600 3502685 3600711 3704627 3814295 3927424
55998 3927424 4044475 4168095 4298754 4435458 4579581 4733385 4896050 5065821 5244698
55989 5244698 5436234 5640448 5855950 6085232 6332402 6597801 6880695 7185135 7516813
55980 7516813 7876321 8262236 8678627 9132199 9624410 10154502 10728380 11356196 12043503
55971 12043503 12794062 13619594 14537257 15559853 16699309 17978165 19426947 21073440
55963 21073440 22948741 25103899 27609682 30546400 34015272 38164764 43196526 49356901
55955 49356901 56950225 66357152 78001855 92280082 109526930 130041399 154104170
55948 154104170 181973758 213886634 249928828 289519025 330564630 368958475 399195413
55941 399195413 416123579 416874031 401818691 374131967 338425033 299280561 260294125
55934 260294125 223784302 190977603 162347965 137893384 117317385 100167492 85945186
55927 85945186 74168248 64395705 56246263 49411958 43650227 38763454 34590213 31006185
55919 31006185 27915801 25237648 22901262 20852149 19048351 17451293 16026395 14750087
55911 14750087 13607447 12582949 11659757 10826403 10076531 9401983 8792126 8239254 7738643
55902 7738643 7283713 6866633 6483166 6131609 5807671 5505547 5223284 4961907 4719820
55893 4719820 4493086 4280628 4084008 3902326 3732088 3571878 3422515 3282827 3149852
55884 3149852 3023172 2904677 2794054 2688811 2588662 2495656 2409742 2328319 2250415 2177446
55874 2177446 2109588 2045217 1984191 1927959 1876167 1826896 1780604 1740043 1705605 1674228 1643736
55863 1643736 1614947 1588815 1564729 1542476 1522675 1503997 1482580 1455342 1421937 1383156 1339939
55852 1339939 1294536 1250055 1208004 1168156 1130965 1097678 1067806 1039098 1010604 983474 958317
55841 958317 934276 911321 890978 873912 858949 845264 833493 823971 815904 809080 804545 802811
55829 802811 803008 804322 806609 809090 810145 808930 805607 799703 789970 776296 760024 742030 722194
55816 722194 701003 679800 658961 637691 616111 595823 577827 561589 546689 533697 522781
55805 522781 513036 503842 495520 488305 482175 477970 476970 478849 481659 484336 487608 491959 496393 499875
55791 499875 502392 503893 503738 501913 499329 496202 491616 485377 478862 473183 467878 462284 456971 452941
55777 452941 450406 449024 448153 446207 440988 431621 419398 406156 392697 379248 366262 354038 342471
55764 342471 331869 323147 316612 311313 306073 300442 294283 287309 279457 271002 262034 252489 242671 232809
55750 232809 222250 210369 198309 188444 181819 177381 173871 171059 168790 166453 164088 162677 162655 163251
55736 163251 163849 164821 166464 168344 170304 172918 176287 179477 181765 183348 184231 183555 180674 175906 169815
55721 169815 162919 156466 151949 149166 146209 142206 138617 136850 136094 134753 132749 131011 129761 128858 129030
55706 129030 131225 135107 139464 143761 148259 152916 157133 160323 161973 161482 158748 154648 150330 146321
55692 146321 142765 139959 138094 136955 136415 136732 137975 139828 142433 146635 152804 160151 167841 175992 184831
55677 184831 193617 201216 207170 211376 213298 212356 208736 203218 196610 189874 184091 179680 176214 173586
55663 173586 172570 173471 175020 175622 175231 175087 176049 178036 180653 183464 185897 187723 189524 192054 195310
55648 195310 198627 201294 202701 202506 201260 200224 199912 199338 197361 194161 190594 186780 182284 177229 172201
55633 172201 167306 162193 156768 151060 144698 137385 129689 122545 116135 110014 104115 98814 94124 89649
55619 89649 85287 81281 77673 74371 71695 70115 69429 68742 67351 65234 62855 60944 60229 60765 61598 61610
55603 61610 60601 59138 57621 56056 54550 53353 52480 51817 51534 51848 52466 52794 52640 52206 51461 50054 47898
55586 47898 45412 43101 41216 39853 39043 38656 38411 37995 37192 36077 35141 34887 35172 35284 34770 33788 32551
55569 32551 31040 29529 28716 28814 29094 28880 28472 28498 28810 28817 28594 28885 30053 31551 32477 32413 31910 32225 34116
55550 34116 36652 37920 37273 36144 36056 36675 36756 36219 36051 36514 36786 36378 35797 35620 35910 36813 38820 41997
55532 41997 45535 48510 50783 52887 55330 58155 60977 63372 65435 67917 71528 76165 81028 85374
55518 85374 88990 92125 95227 98516 101533 103357 103495 102256 99992 96508 91566 85448 78460 70338 60834
55503 60834 50604 40826 32204 24904 19146 15095 12359 10314 8776 7823 7157 6372 5586 5106 4574 3323
55487 3323 1523 199 -53 307 516 301 -191 -747 -1236 -1792 -2813 -4380 -5768 -6078 -5306 -4280 -3600 -3178
55469 -3178 -2764 -2368 -2142 -2288 -3037 -4299 -5476 -6074 -6351 -6807 -7291 -7316 -7107 -7502 -8705 -9879 -10143 -9404
55451 -9404 -8116 -6777 -5837 -5513 -5487 -5139 -4213 -2992 -1951 -1618 -2485 -4417 -6323 -7158 -7263 -7904 -9427
55434 -9427 -10689 -10553 -9186 -7473 -5803 -3942 -1775 297 1616 1792 1149 568 627 985 889 146 -817 -1624
55416 -1624 -2133 -2188 -1861 -1825 -2700 -4031 -4661 -4228 -3537 -3324 -3378 -3182 -2724 -2290 -2008 -1901 -2011 -2171 -2035 -1537
55396 -1537 -1007 -767 -959 -1661 -2683 -3381 -3347 -3221 -4034 -5677 -6925 -7123 -6976 -7285 -7852 -8102 -8060 -8034 -7930
55377 -7930 -7559 -7206 -7324 -7933 -8711 -9398 -9773 -9667 -9317 -9276 -9652 -9929 -9838 -9850 -10326 -10714 -10198 -8748 -6993 -5373
55357 -5373 -4015 -3180 -3197 -3953 -4880 -5407 -5230 -4324 -3018 -1900 -1349 -1310 -1642 -2433 -3684 -5025 -5989 -6408
55339 -6408 -6303 -5740 -5020 -4692 -4992 -5490 -5589 -5128 -4300 -3306 -2349 -1634 -1098 -479 73 -98 -1252 -2619 -3214 -2979
55319 -2979 -2609 -2525 -2546 -2466 -2385 -2417 -2486 -2475 -2366 -2218 -2164 -2272 -2296 -1832 -974 -490 -943 -1845 -2155 -1538 -742 -689 -1505
55296 -1505 -2527 -3053 -3008 -2933 -3357 -4236 -5084 -5543 -5482 -4688 -3074 -1350 -838 -2177 -4523 -6470 -7374 -7426 -6797
55277 -6797 -5352 -3183 -871 867 1594 1326 509 -309 -982 -1783 -2814 -3763 -4420 -5017 -5677 -5922 -5271 -3969
55259 -3969 -2641 -1464 -278 711 972 406 -495 -1255 -1750 -1974 -1890 -1557 -1007 -77 1270 2534 3088 2970 2748
55240 2748 2603 2044 706 -1017 -2355 -2802 -2320 -1207 79 1256 2419 3694 4759 5095 4728 4245 3999
55223 3999 3783 3444 3339 3922 5214 6930 8772 10333 11128 11073 10679 10430 10228 9827 9471 9603 10088 10282
55205 10282 9898 9346 9152 9443 10082 10918 11694 12095 12144 12294 12821 13327 13177 12369 11670 11868 13094 14822 16301
55186 16301 17004 16872 16236 15390 14326 13056 12029 11805 12294 12751 12659 12212 11759 11188 10218 8915 7539 6193
55168 6193 5043 4569 5054 6034 6843 7582 8917 10939 12884 14080 14526 14418 13699 12440 11090 9973 8908
55151 8908 7701 6601 5883 5319 4573 3881 3846 4608 5584 6018 5572 4461 3340 2996 3840 5548 7280 8271
55133 8271 8322 7875 7666 8161 9211 10340 11256 11867 11979 11509 11079 11833 14392 18240 22357 26055 29047
55116 29047 31198 32637 33847 35259 36955 38885 40971 42741 43413 42785 41626 40726 39983 38994 38106 38094
55100 38094 38964 39867 40185 40070 39899 39836 39977 40353 40598 40094 38633 36636 34723 33453 33346 34565 36443
55083 36443 37850 38247 37999 37602 37179 36870 37059 37737 38083 37238 35321 33316 32153 32155 33119 34481 35493 35712
55065 35712 35410 35261 35585 36135 36614 37129 37991 39234 40480 41280 41497 41363 41235 41284 41394 41313 40938 40467 40253
55046 40253 40422 40658 40564 40294 40633 42177 44503 46364 46860 46273 45666 45734 46181 46269 45825 45466 45798 46669 47472
55027 47472 48060 48875 50131 51261 51504 50776 49671 48709 47860 46751 45137 43215 41636 41150 42035 43813
55011 43813 45574 46542 46404 45378 44108 43300 43211 43550 43951 44388 45072 46134 47456 48598 48889 48030 46757
54994 46757 46390 47338 48441 48291 46827 45112 43812 42620 41112 39441 37993 36809 35669 34485 33444
54979 33444 32908 33151 34042 35043 35805 36606 37902 39580 41064 42065 42812 43563 44349 45202 46172 47096 47777
54962 47777 48478 49750 51649 53552 54919 55839 56706 57799 59352 61577 64374 67415 70689 74527 78919
54947 78919 83422 88107 93964 101715 110710 119777 128891 139135 150971 163379 174916 184978 193664
54934 193664 200901 206113 208407 206770 200540 190259 177806 165104 152678 139902 126493 113182
54922 113182 100923 90190 81327 74820 70566 67407 64166 60933 58650 57582 57006 56378 55945 56014 56439
54907 56439 57187 58669 61066 64046 67666 72797 79883 87922 95647 103357 112522 123743 136089 148455
54893 148455 160497 171955 181917 189241 193147 193120 188928 181147 171168 160191 148553 136317 124053
54880 124053 112566 102198 92840 84390 76812 70001 63994 59111 55513 52780 50344 48178 46638 45622
54866 45622 44446 42707 40955 40146 40535 41342 41602 41212 40909 41246 41850 41913 41213 40311 39812 39815 40097 40402 40357
54847 40357 39485 37632 35178 32640 30200 27861 25832 24457 23787 23504 23273 23011 22802 22700 22724 22947 23496
54830 23496 24366 25270 25827 25984 26124 26597 27302 27929 28488 29266 30245 30935 30959 30577 30447 30929 31816 32763 33864
54811 33864 35615 38176 40845 42674 43660 44814 46769 48862 50087 50516 50992 51706 52003 51676 51580 52617
54795 52617 54834 57868 61677 66359 71719 77554 84090 91804 100989 111758 124104 137601 151322
54782 151322 164350 176140 186197 193793 198457 200429 200194 197739 192663 184952 175301 164764 154351
54769 154351 144770 136202 128392 121199 114970 110149 106672 104026 101797 99882 98306 97161 96681 97106 98368
54754 98368 100090 101953 104030 106800 110806 116214 122790 130516 140058 152183 166721 182668 199440
54741 199440 217377 236691 256442 275058 291344 304398 312932 315597 312070 303300 290645 275146
54729 275146 257584 238783 219723 201508 185094 170742 157922 146142 135681 127051 119929 113229
54717 113229 106270 99346 93132 88046 84329 82118 81067 80325 79264 78041 77139 76556 75759 74318 72324
54702 72324 70205 68353 66951 66013 65502 65360 65465 65660 65985 66794 68415 70610 72557 73502 73421 72948 72730
54685 72730 72937 73396 73965 74552 74815 74247 72823 71321 70646 70945 71775 72978 74812 77168 79359 80947 82235
54668 82235 83539 84515 84717 84463 84623 85789 88071 91351 95167 98660 101303 103523 105996 108512 110282
54653 110282 111226 112165 113687 115607 117739 120381 123690 127206 130448 133474 136523 139630 142997 147307 153111
54638 153111 160219 168150 176963 187216 199329 213363 229166 246204 263400 279627 294272 306864
54626 306864 316256 320865 319930 314134 304741 292522 277839 261425 244481 227960 212150 197158 183511
54613 183511 171936 162608 154900 148011 141635 135876 130702 125793 120997 116720 113652 112101 111609 111251
54599 111251 110320 108763 106955 105156 103372 101709 100504 99846 99179 97764 95489 92854 90194 87380 84404
54584 84404 81783 79943 78497 76620 74109 71628 69781 68316 66524 64164 61733 59859 58765 58400 58777
54569 58777 59890 61324 62298 62260 61428 60580 60235 60108 59463 58047 56552 55961 56461 57277 57609 57437 57189 57011
54551 57011 56806 56731 57085 57751 58280 58607 59062 59585 59605 59001 58528 58810 59472 59907 60457 62032 64761 67786 70394
54532 70394 72717 75247 78308 82135 86940 92633 98795 105135 111698 118566 125636 132741 139638 145824
54518 145824 150716 154108 156150 156839 155912 153289 149233 143968 137555 130311 122943 116071 109947 104721 100486
54503 100486 96823 92852 88185 83527 79848 77234 75077 73167 71893 71302 70566 68823 66292 64168 63449
54488 63449 64078 65287 66452 67370 67843 67522 66428 65307 64970 65374 65826 66095 66795 68440 70600 72343 73280
54471 73280 73757 74245 74971 76070 77715 79914 82371 84649 86339 87149 87019 86276 85516 85210 85382 85683 85721
54454 85721 85310 84563 83882 83813 84622 85856 86520 86057 85068 84637 84903 84788 83383 81110 79030 77440 75746
54437 75746 73539 71109 68962 67492 67139 68121 69738 70619 70038 68529 66945 65491 64088 63121 63069 63674
54421 63674 64151 64194 64262 64840 65863 66961 67909 68699 69393 70008 70485 70823 71313 72480 74585 77238 79739 81728
54403 81728 83417 85265 87634 90639 94101 97676 101144 104525 107818 110836 113426 115709 117871 119899
54389 119899 121674 123097 123867 123439 121645 119166 116913 114978 112706 109831 106966 104727 102827 100461 97343
54374 97343 93982 90995 88470 86030 83319 80389 77721 75928 75310 75631 76297 76786 76964 77058 77371 77901 78231
54357 78231 77870 76781 75515 74657 74182 73550 72443 71252 70675 71039 72220 74078 76571 79412 82020 84065
54341 84065 85836 87835 90200 92780 95538 98465 101242 103350 104564 104986 104652 103523 101880 100285 98972
54326 98972 97618 95900 93940 91985 89997 87844 85702 83904 82443 80852 78589 75528 72127 69105
54312 69105 66799 64855 62755 60554 58783 57635 56720 55697 54735 54085 53648 53215 52821 52543 52267 51950 51827
54295 51827 51995 52097 51727 50956 50101 49273 48429 47625 46837 45838 44654 43860 43947 44659 45420 46204 47382 48881
54277 48881 50151 50887 51222 51157 50448 49198 48018 47381 47204 47213 47439 48172 49675 51957 54566 56707 57909
54260 57909 58503 59061 59550 59601 59446 59792 60664 61172 60741 59945 59751 60506 62017 63993 65872 66762 66242 64925
54242 64925 63674 62584 61322 60110 59581 59736 59784 59151 58109 57241 56797 56762 57156 57969 59026 60098 61001
54225 61001 61520 61488 61035 60498 60034 59557 59154 59294 60358 62159 64025 65285 65623 65213 64707 64834 65774 67000
54207 67000 67917 68503 69096 69737 70130 70247 70482 70994 71237 70551 69063 67638 66877 66526 65997 65170 64346 63588
54189 63588 62451 60456 57676 54817 52836 52357 53215 54480 55216 55305 55368 55745 55928 55296 54186 53704 54397
54172 54397 55546 56072 55818 55573 55896 56390 56292 55462 54467 53778 53215 52271 50753 48968 47393 46371 46020 46198
54154 46198 46494 46471 46057 45614 45561 45992 46727 47504 47977 47686 46386 44476 42836 42078 42041 42110 41891 41512 41385
54135 41385 41841 42864 44038 44801 44938 44746 44582 44329 43585 42298 40917 39926 39502 39683 40462 41458 41869 41133
54117 41133 39573 38122 37521 37876 38788 39596 39710 39162 38752 39245 40408 41281 41350 41016 40833 40817 40823 41092 41932
54098 41932 43013 43481 42823 41436 40317 40315 41533 43264 44501 44667 43988 43241 43246 44401 46337 47973 48295
54081 48295 47367 46346 46363 47547 49211 50582 51129 50580 49133 47529 46494 46145 46161 46368 46838 47590 48552
54064 48552 49777 51312 52922 54268 55345 56378 57344 57952 58151 58283 58661 59262 59909 60505 60943 61087 60964
54047 60964 60857 61170 62314 64600 67948 71677 74932 77461 79734 82287 85177 88193 91300 94740 98786
54032 98786 103516 108642 113623 118153 122551 127368 132630 137801 142573 147275 152316 157561 162567 167124
54018 167124 171197 174478 176463 177068 176941 176978 177526 178093 177860 176500 174410 172135 169784 167257 164784 162708
54002 162708 160767 158148 154482 150297 146259 142377 138388 134487 131162 128518 126281 124362 122885 121683
53988 121683 120250 118342 116256 114465 113242 112683 112650 112593 111830 110300 108757 108008 108137 108652 109077 109101 108517
53971 108517 107495 106826 107339 108887 110245 110228 108737 106614 104720 103376 102457 101695 100840 99750 98471 97221
53955 97221 96261 95725 95459 95058 94288 93518 93454 94265 95207 95423 94911 94415 94571 95587 97628 100907 105236 110004
53937 110004 114832 119847 125152 130427 135341 139942 144281 148024 150803 152669 153785 154040 153488 152910 153235
53922 153235 154436 155602 156156 156543 157593 159672 162603 166006 169529 173084 177060 182028 188081 194693 201295
53907 201295 207650 213560 218601 222480 225506 228393 231619 235018 237960 239900 240795 240978 240595 239393 237317
53892 237317 235015 233262 231980 230376 228066 225400 222517 218822 213885 208288 202921 197706 191746 184686
53878 184686 177356 170832 165330 160308 155399 150840 146995 143758 140653 137449 134416 131881 129750 127670
53864 127670 125539 123529 121657 119589 116985 113855 110574 107632 105309 103397 101367 98992 96673 94927
53850 94927 93766 92889 92155 91346 89770 86904 83443 80882 79865 79580 79050 78292 77888 78083 78765 79731 80529
53833 80529 80573 79912 79373 79419 79442 78771 77738 77003 76409 75481 74693 75042 76446 77648 77921 77929 78552 79700 80744
53814 80744 81499 82200 82947 83704 84609 85818 87175 88423 89706 91608 94537 98154 101544 104100 106250 109090
53798 109090 113203 118098 123024 127904 133046 138245 142811 146438 149450 152248 155033 158028 161329 164464
53784 164464 166770 168404 170321 172957 175472 176680 176290 174887 173203 171809 171021 170512 169323 166817 163498
53769 163498 160419 157996 155843 153653 151616 149941 148466 146881 145054 143059 141129 139589 138546 137632
53755 137632 136399 135002 134165 134313 135021 135488 135298 134577 133578 132414 131103 129623 127888 125798 123343 120621
53739 120621 117762 114952 112498 110811 110163 110360 110651 110132 108459 106194 104318 103337 102958 102602 102025 101352
53723 101352 100779 100495 100720 101563 102891 104530 106526 108886 111183 112860 113985 115241 116935 118501 119282
53708 119282 119508 119994 121138 122711 124533 126811 129761 133312 137233 141236 144936 148127 151095 154296 157699
53693 157699 160882 163749 166619 169498 171935 173779 175450 177171 178556 179391 180143 181151 181919 181964 181887 182714
53677 182714 184436 186091 187200 188256 189717 191331 192655 193575 194136 194360 194394 194315 193747 192314 190580 189733
53661 189733 190006 190152 189003 186945 185208 184226 183414 182315 181181 180402 179950 179469 178636 177403 176190 175720
53645 175720 176308 177326 177735 177188 176287 175824 176083 176897 177942 178797 179086 178877 178733 179120 179909 180714 181590 183042
53627 183042 185297 187873 190036 191540 192758 194189 195982 197949 199860 201739 203950 206966 210889 215269
53613 215269 219515 223399 226944 229941 232034 233373 234753 236856 239675 242906 246522 250560 254703 258603
53599 258603 262432 266605 271041 275224 278968 282632 286554 290799 295463 300652 305986 310728 314665 318414
53585 318414 322500 326571 329901 332295 334042 335251 335820 335991 336417 337548 339229 341024 342723 344427 346230
53570 346230 347911 348979 349082 348343 347292 346405 345828 345481 345255 345085 345024 345221 345617 345694 344869 343223 341496 340202
53552 340202 339072 337626 335963 334641 333940 333621 333432 333551 334435 336327 338914 341427 343212 344272 345199 346572
53536 346572 348556 351042 353830 356508 358529 359717 360582 361886 364020 367010 370935 375995 382162 389039
53522 389039 396146 403292 410667 418670 427575 437321 447659 458459 469684 481109 492446 503866 516116
53509 516116 529849 545066 561427 578812 597231 616364 635684 655054 674938 695965 718404
53498 718404 742052 766443 791223 816470 842523 869355 896245 922306 947301 971709 996120
53487 996120 1020745 1045403 1069724 1093424 1116656 1140017 1164023 1188630 1213460 1238355 1263383
53476 1263383 1288363 1312836 1336502 1359359 1381377 1402445 1422785 1442940 1462935 1481719 1497982
53465 1497982 1511580 1523800 1535986 1548124 1559036 1567764 1574374 1579346 1582687 1584013 1583248 1580670 1576304
53452 1576304 1569774 1560894 1549938 1537214 1522847 1507270 1491280 1475090 1457729 1438092 1416397 1393976
53440 1393976 1371679 1349176 1325853 1301726 1277185 1252415 1227436 1202458 1177892 1154245 1132162
53429 1132162 1112247 1094601 1078733 1064109 1050490 1037648 1025167 1013007 1001960 993013 986224 980625
53417 980625 975391 970836 968164 968310 971074 975267 979765 984571 990870 999942 1012025 1026381 1042262 1059492
53403 1059492 1078100 1097892 1118650 1140493 1163658 1188124 1213817 1241120 1270654 1302417 1335554
53392 1335554 1369334 1404130 1441110 1481060 1523847 1568911 1615903 1664735 1715316 1767473 1821054
53381 1821054 1876008 1932388 1990204 2049142 2108529 2167760 2226710 2285469 2343749 2400906 2456505
53370 2456505 2510466 2562475 2611620 2656812 2697328 2732898 2763715 2790585 2814562 2835915 2853700
53359 2853700 2866772 2875013 2879142 2879495 2875546 2866660 2852819 2834465 2811982 2785492 2754943 2720212
53347 2720212 2681213 2638001 2590783 2539995 2486568 2431922 2377366 2323477 2270189 2217336 2164855
53336 2164855 2112612 2060527 2008878 1958140 1908510 1859967 1812804 1767651 1724779 1683782 1644164
53325 1644164 1605963 1569576 1535276 1503096 1472970 1444781 1418478 1394273 1372377 1352282 1332700
53314 1332700 1312689 1292635 1273639 1256078 1239344 1222973 1207312 1192804 1179236 1166308 1154615
53303 1154615 1145373 1139096 1135031 1132026 1129496 1127415 1125888 1125170 1125689 1127527 1130055 1132637 1135640 1140256
53289 1140256 1147285 1156592 1167848 1181199 1196961 1215153 1235651 1258383 1282956 1308522 1334493 1361064
53277 1361064 1388547 1416491 1444063 1471020 1497591 1523472 1547714 1569792 1590146 1609351 1627241
53266 1627241 1643156 1656687 1667870 1676980 1684410 1690437 1694733 1696389 1694793 1690362 1684050 1676244 1666526
53253 1666526 1654492 1640379 1624736 1607770 1589288 1569051 1546885 1522537 1495807 1467075 1437398
53242 1437398 1407797 1378496 1349114 1319451 1289718 1260161 1230987 1202748 1176150 1151134 1126709
53231 1126709 1102191 1078138 1055528 1034325 1013592 992767 972054 951711 931737 912380 894129
53220 894129 876998 860467 844450 829672 816702 805189 794416 784070 773960 763481 752014
53209 752014 739587 726599 713135 699092 684747 670602 656708 642696 628426 614174 600196
53198 600196 586654 573979 562714 552737 543138 533112 522665 512172 501588 490516 478838 466895
53186 466895 455115 443765 433014 422847 412892 402657 392101 381750 372113 363202 354790 346930
53174 346930 339879 333563 327434 320939 313991 306982 300526 295126 290809 287039 283217 279297 275608 272060
53160 272060 267955 262807 256974 251270 246306 242500 240219 239320 238774 237362 234725 231387 227933 224709 222066
53145 222066 220190 218612 216549 213900 211340 209277 207312 205062 202916 201499 200800 200351 200013 199997 200180 199907
53129 199907 198695 196914 195558 195343 196078 196922 197239 197000 196378 195259 193480 191309 189240 187380 185517 183727
53113 183727 182358 181339 180003 177905 175373 173071 171338 170141 169259 168293 166823 164866 162965 161652 161093
53098 161093 161239 161874 162413 162243 161527 161141 161496 162005 162135 162453 163984 166900 170410 173680 176273 177970 178784
53081 178784 179108 179379 179622 179642 179453 179160 178689 178117 177927 178378 178807 178208 176396 173983 171313 168132 164416
53064 164416 160759 157721 155288 153243 151559 150116 148421 146011 142967 139836 137216 135503 134720 134355 133622
53049 133622 132130 130239 128554 127207 125845 124290 122911 122202 122048 121712 120674 119278 118218 117473 116239
53034 116239 114052 111494 109530 108550 108416 108993 110060 110941 110911 109989 108875 108066 107400 106416 104833 102701 100477
53017 100477 98878 98264 98204 98017 97603 97316 97166 96712 95744 94522 93324 92352 92081 92969 94576 95629 95383
53000 95383 94453 94005 94584 96089 98284 100659 102176 101977 100449 99070 99032 100272 101847 102932 103287 103019
52984 103019 102221 100973 99625 98899 99455 101228 103297 104559 104620 104049 103800 104384 105539 106626 107271 107558 107740
52967 107740 108050 108736 109900 111121 111688 111493 111345 111969 113042 113755 114048 114644 115916 117491 119010 120655
52951 120655 122660 124854 126928 128731 130137 131095 132033 133661 136079 138588 140674 142702 145212 147978 150335
52936 150335 152139 153896 156076 158779 161904 165186 168108 170212 171517 172302 172541 171908 170364 168399 166593
52921 166593 165226 164396 164197 164563 165072 165227 164975 164714 164674 164401 163181 160956 158546 156748 155530 154386 153204
52904 153204 152345 151971 151837 151761 151859 152198 152694 153410 154454 155377 155273 153830 151935 150840 150987 151925 152997 153732
52886 153732 153921 153764 153851 154592 155720 156595 156831 156448 155678 154950 154818 155458 156298 156487 155734 154526 153693 153937
52868 153937 155457 157640 159337 159866 159682 159738 160377 161202 161833 162271 162599 162822 163046 163329 163331 162565 161142 159842
52850 159842 159238 159128 159036 158910 158991 159241 159371 159431 160023 161732 164499 167735 170941 173979 176682 178604 179476
52833 179476 179684 179762 179486 178109 175688 173547 172917 173588 174441 174918 175275 175598 175451 174644 173706 173224 173153 173140 173213
52814 173213 173830 175316 177450 179572 181081 181848 182140 182082 181388 179838 177793 175875 174229 172510 170511 168311
52798 168311 165840 162845 159464 156346 153910 151825 149519 146886 144223 141793 139730 138122 136805 135235
52784 135235 132935 130042 127124 124567 122361 120435 118894 117874 117389 117310 117333 116995 115899 114037 111759 109410
52768 109410 107172 105278 104100 103752 103739 103261 102037 100620 99810 99854 100394 100959 101208 100720 99073 96438 93737
52751 93737 91787 90394 88697 86343 83909 82122 81096 80511 80127 79795 79198 78014 76325 74649 73491
52736 73491 72972 72839 72776 72768 73198 74390 75953 76805 76187 74545 73125 72680 72851 72886 72589 72312 72231 72035 71394
52717 71394 70467 69782 69702 70030 70082 69188 67349 65514 64925 65930 67511 68260 67740 66657 65797 65243 64711 64183
52699 64183 63883 63881 64063 64337 64538 64292 63346 61999 60869 60179 59619 58999 58674 59160 60543 62445 64406 66056
52681 66056 67092 67441 67513 68017 69315 71015 72389 73286 74465 76888 80639 84670 87639 88947 89047 88946
52665 88946 89460 90748 92377 93827 94886 95512 95491 94587 93067 91659 90786 90196 89548 88987 88730 88442 87541
52648 87541 85991 84316 82908 81778 80945 80501 80236 79653 78528 77040 75274 73122 70883 69391 69082 69297
52632 69297 69021 68108 67334 67320 67925 68722 69602 70640 71609 72003 71548 70549 69632 69190 69134 69115 68834 68136 67019
52613 67019 65741 64785 64442 64439 64188 63476 62789 62894 64159 66229 68266 69594 70232 70705 71215 71252 70350 68991
52595 68991 68281 68733 69828 70844 71615 72364 73241 74281 75417 76278 76371 75761 75253 75518 76356 77166 77840 78755
52577 78755 80056 81466 82676 83569 84120 84458 85000 86085 87445 88392 88608 88482 88638 89376 90631 92199 93884
52560 93884 95628 97523 99551 101331 102398 102761 102926 103302 103921 104779 106073 107800 109388 110112 109836 109161
52544 109161 108842 109232 110168 111166 111698 111532 110950 110569 110877 111937 113500 115291 117053 118502 119414 119880 120337
52527 120337 121219 122533 123830 124619 124782 124599 124480 124692 125204 125705 125787 125277 124427 123710 123374 123185 122627 121322
52509 121322 119338 117218 115728 115375 115977 116737 116985 116904 117342 118741 120456 121333 120839 119348 117479 115621
52493 115621 114174 113621 113988 114572 114696 114542 114812 115690 116661 117342 117967 118825 119638 119814 119190 118267 117774 118071
52475 118071 119007 120282 121908 124113 126776 129262 131089 132445 133670 134533 134574 134008 133606 133665 133841 134064 134830
52458 134830 136225 137410 137597 136974 136128 135134 133885 132927 133109 134457 136033 136891 136725 135721 134333 133226
52442 133226 132928 133400 134237 135209 136314 137392 138108 138266 137844 136844 135495 134422 134067 134090 133760 132840 131570
52425 131570 130071 128468 127457 127759 128899 129456 128903 128303 128666 129442 129462 128760 128472 129195 130449 131781 133512
52408 133512 136053 139064 141710 143453 144225 144161 143537 142966 143193 144482 146322 147848 148577 148647 148469 148368 148522
52391 148522 148933 149285 149099 148297 147410 146991 147026 147299 148048 149654 151746 153316 153843 153765 153681 153702 153885 154595 155886
52372 155886 157028 157318 157093 157284 158168 159195 159972 160809 162153 164037 166222 168514 170722 172632 174214 175662
52356 175662 177174 178884 181006 183700 186693 189395 191582 193708 196295 199261 202123 204698 207162 209423
52342 209423 210849 210955 210181 209645 210092 211368 213040 215138 217889 220997 223765 226009 228260 230879 233518
52327 233518 235874 238437 241875 245949 249758 253016 256420 260642 265531 270617 275900 281744 288207 294846
52313 294846 301160 307063 313016 319782 327945 337502 347927 358635 369333 380039 391026 402739 415568
52300 415568 429672 445156 462180 480492 498986 516455 533082 550583 570334 591650 612467
52289 612467 631507 649260 666901 684898 702894 720475 737544 754053 769673 783895 796388
52278 796388 807239 816814 825334 832609 838214 841912 843911 844754 844968 844727 843749 841643 838464 834783 831126
52263 831126 827445 823340 818800 814472 811091 808697 806551 803871 800731 798188 797505 799184 802840 807901
52249 807901 814168 821719 830564 840653 851992 864453 877561 890763 903855 916940 930065 943187
52237 943187 956433 970051 983983 997704 1010561 1022126 1032158 1040492 1047024 1051679 1054332 1054960 1053918
52224 1053918 1051877 1049386 1046530 1042946 1037948 1030768 1021134 1009727 997693 985515 972714 958842 944320
52211 944320 929923 915829 901751 887770 874378 861743 849573 837846 827093 817586 808694 799484
52199 799484 789761 780189 771552 764217 758198 753337 749364 746014 743200 740966 739270 737990 737089 736583 736323
52184 736323 736009 735466 734764 733997 733136 732159 731148 730073 728652 726655 724272 721954 719861 717731 715338 712861
52168 712861 710616 708554 706250 703362 699938 696310 692845 689795 687189 684811 682431 680057 677826 675630
52154 675630 673116 670187 667245 664662 662225 659449 656409 653790 651971 650397 648148 644962 641429 638295
52140 638295 635877 634068 632625 631317 629989 628659 627414 626185 624715 622872 620849 618920 617102 615246
52126 615246 613436 612052 611374 611286 611416 611395 610938 609953 608858 608590 609843 612262 614823 617197 620381 625643
52110 625643 633097 641787 651055 661249 672937 685910 699462 713425 728515 745585 764801 785634
52098 785634 807419 829774 852576 875749 899173 922772 946564 970482 994141 1016919 1038353
52087 1038353 1058400 1077174 1094519 1110056 1123594 1135327 1145494 1153964 1160264 1164015 1165256 1164370
52075 1164370 1161700 1157277 1150930 1142709 1133135 1122954 1112630 1102146 1091233 1079705 1067600 1055224
52063 1055224 1043101 1031727 1021175 1011097 1001277 992138 984534 979054 975647 973872 973349 973902 975534
52050 975534 978406 982810 988951 996645 1005275 1014165 1023096 1032476 1042832 1054107 1065553 1076447 1086703
52037 1086703 1096563 1105827 1113869 1120449 1126098 1131344 1135871 1138821 1139817 1139261 1137685 1135214 1131844 1127807
52023 1127807 1123302 1117899 1110586 1100608 1088280 1074880 1061637 1048788 1035578 1021196 1005554 989152
52011 989152 972382 955195 937394 918975 900168 881328 862778 844579 826379 807682 788318
52000 788318 768574 748858 729422 710332 691457 672463 653099 633495 613920 594197 573851
51989 573851 553013 532678 513666 495739 478244 461360 445992 432450 419908 407455 395169
51978 395169 383770 373479 363700 353815 343942 334682 326269 318273 310292 302730 296460 291698 287614 283350
51964 283350 279011 275232 272012 268616 264647 260627 257278 254639 252174 249431 246346 243055 239688 236308
51950 236308 232902 229479 226192 223239 220579 217923 215068 212137 209493 207540 206506 206085 205321 203269 199950
51935 199950 196347 193311 190811 188437 186256 184738 184002 183514 182528 180691 178309 176145 174798 174199 173920
51920 173920 173943 174688 176042 176942 176492 175138 174073 173623 172927 171232 168815 166429 164485 163132 162588 162797
51904 162797 163052 162494 160984 159152 157631 156596 155959 155591 155250 154639 153731 152760 151753 150383 148564 146902
51888 146902 146115 146125 146219 146113 146289 147066 147915 148139 147846 147688 147820 147787 147383 147058 147285 147992 148776 149277 149197 148365
51868 148365 147065 145965 145497 145578 146099 147281 149221 151405 153086 154009 154555 155331 156789 159006 161537 163660
51852 163660 164958 165545 165666 165498 165454 166187 167834 169656 170840 171365 171678 171944 172124 172401 172817 172762 171614 169824
51834 169824 168613 168567 169144 169662 170097 170750 171689 172796 173919 174812 175294 175585 176081 176776 177348 177858 178755 180060
51816 180060 181137 181532 181494 181386 181139 180660 180274 180251 180235 179701 178754 178046 178022 178590 179408 180137 180516 180503 180316 180192
51796 180192 180130 180032 179948 180051 180472 181202 182077 182810 183292 183839 184781 185803 186136 185569 184762 184295 183898 183084 182144
51777 182144 181920 182726 184065 185356 186485 187539 188395 188784 188667 188419 188615 189594 191180 192962 194811 196887
51761 196887 199138 201175 202789 204270 205968 207874 209854 211952 214102 215934 217323 218956 221776 225923
51747 225923 230617 235077 239114 242788 245900 248124 249429 250188 250835 251445 251698 251354 250775 250745 251708 253395
51731 253395 255265 257038 258645 260019 261208 262415 263604 264312 264181 263452 262557 261491 260039 258511 257737
51716 257737 258322 260158 262663 265085 266619 266641 264987 261942 258080 254276 251536 250313 249978 249366 247884
51701 247884 245851 243846 242090 240442 238609 236338 233727 231371 229929 229509 229748 230409 231542 233114 234951
51686 234951 237146 240162 244348 249565 255412 261602 268031 274587 280863 285962 288761 288784 286782 284202 282092
51671 282092 280678 279760 279064 278277 277236 276119 275110 273944 272250 270294 268840 268194 267954 267764 267705 267664 266934
51654 266934 264876 261567 257419 252513 246771 240485 234222 228335 222984 218491 215227 213109 211508 209793
51640 209793 207823 205866 204105 202330 200153 197584 195241 193804 193291 193096 192650 191771 190481 188874 187266
51625 187266 186054 185294 184753 184469 184806 185744 186578 186694 186295 185941 185629 184852 183499 182180 181569 181706 182067 182097
51607 182097 181555 180526 179347 178589 178948 180826 183866 187068 189588 191383 192901 194399 195892 197621 200006
51592 200006 203082 206431 209835 213603 218032 222908 227773 232371 236622 240362 243362 245457 246590 246903
51578 246903 246761 246356 245350 243350 240718 238369 236712 235409 234336 234012 234698 235769 236509 236949 237423 237858
51562 237858 238152 238715 239949 241582 243159 244753 246496 247957 248915 250343 253475 258012 262352 265569 268038
51547 268038 270016 270901 270446 269612 269389 269502 269062 267986 266946 266275 265616 264580 263176 261731 260853 261325 263487
51530 263487 266686 269676 271662 272793 273811 275475 278131 281395 284221 285633 285493 284380 282765 280628
51516 280628 277908 274908 271968 268939 265376 261286 257366 254343 252215 250384 248400 246258 244027 241658
51502 241658 239363 237736 237074 236854 236315 235394 234599 234151 233851 233779 234395 235723 237027 237652 237739 237783 237924 238093
51484 238093 238467 239285 240452 241767 243325 245240 247135 248515 249597 251237 253931 257308 260778 264291 268237
51469 268237 272856 278019 283416 288751 293741 298076 301443 303738 305352 307077 309406 311909 313594 314019
51455 314019 313810 313950 314700 315428 315338 314255 312780 311857 312064 313123 314108 314285 313778 313324 313366 313603 313447 312776
51437 312776 312061 311777 311754 311106 308812 304503 298829 293070 288223 284360 280823 276967 272709 268414 264484
51422 264484 261088 258094 255118 251793 248160 244705 241895 239778 238218 237323 237311 238003 238858 239602 240505 241847
51406 241847 243522 245358 247490 250021 252590 254795 256860 259330 262040 263948 264243 263157 261390 259092
51392 259092 255892 251723 247095 242497 237910 233062 227924 222714 217548 212311 206954 201796 197372 193811
51378 193811 190475 186538 182037 178027 175403 173788 172073 169929 168237 167856 168487 169070 168839 167563 165092
51363 165092 161372 156958 152934 150023 148046 146410 144912 143787 143127 142578 141670 140338 138982 137990 137247
51348 137247 136283 134933 133749 133553 134613 136348 137775 138171 137552 136749 136876 138341 140360 141762 142286 142720
51332 142720 143801 145442 147229 149084 151032 152717 153749 154427 155616 157873 161077 164952 169417 174193
51318 174193 178420 181204 182564 183540 185113 187136 188516 188397 186903 184659 181988 178970 176002 173608 171661
51303 171661 169379 166342 162970 159687 156205 152182 148102 144748 142010 139051 135656 132644 130715 129525
51289 129525 128287 126800 125463 124645 124420 124717 125278 125613 125324 124504 123542 122612 121610 120536 119724 119597 120270
51272 120270 121382 122238 122273 121540 120693 120333 120379 120297 119940 119872 120728 122381 123951 124598 124222 123437 123033 123373 124093
51253 124093 124318 123394 121602 120012 119405 119488 119382 118725 117890 117191 116475 115654 115151 115353 115966 116326 116245 116176 116570
51234 116570 117372 118094 118182 117449 116396 115966 116675 118136 119679 121161 122695 123852 123872 122756 121535 121199 121787
51217 121787 122729 123616 124304 124620 124429 123893 123441 123528 124480 126330 128670 130892 132728 134394 136084 137592 138563
51200 138563 138884 138625 137835 136591 135157 133850 132892 132453 132661 133405 134267 134811 134863 134468 133798 133205 133093 133542
51182 133542 134193 134602 134557 133999 132895 131365 129737 128325 127320 126905 127238 128163 129177 129774 129628 128474 126251
51165 126251 123442 120812 118602 116460 114345 112894 112539 112821 113152 113691 114807 116085 116701 116555 116181 115668
51149 115668 114587 113089 112162 112395 113151 113396 112839 111856 110767 109754 109150 109232 109770 110251 110556 111102 112255
51132 112255 113869 115473 116705 117433 117622 117287 116640 116130 116156 116693 117294 117501 117162 116320 114982 113195 111297
51115 111297 109887 109442 109934 110765 111128 110611 109469 108162 106727 104958 103219 102446 103017 104152 104924 105455
51099 105455 106459 107917 109083 109720 110534 112102 114120 116058 118004 120365 123096 125770 128164 130398 132529
51084 132529 134358 135657 136451 137044 137806 138844 139861 140428 140414 139982 139327 138664 138367 138662 139121 138911 137768
51067 137768 136384 135646 135818 136659 137966 139638 141451 143070 144227 144766 144808 144983 146148 148504 151302 153685
51051 153685 155548 157236 158756 159840 160545 161200 161793 161981 161791 161791 162418 163489 164575 165496 166245 166731 166956
51034 166956 167264 168071 169315 170381 170606 169766 168119 166125 164240 162856 162193 162123 162199 162031 161616 161218 160983
51017 160983 160904 161067 161558 162084 162130 161727 161697 162708 164387 165912 167265 169242 172162 175256 177659 179537 181712
51000 181712 184453 187230 189592 191785 194274 197054 199784 202499 205839 210466 216420 223154 230058 236801
50986 236801 243357 250048 257554 266546 277056 288379 299815 311430 323889 337678 352800 369257
50974 369257 387506 408190 431560 457412 485676 516929 552180 592138 636786 685709 738639
50963 738639 795511 856142 920144 987164 1056849 1128467 1200860 1272971 1344065 1413121 1478294
50952 1478294 1537444 1589169 1632897 1668080 1693920 1710155 1717645 1717706 1711000 1697517 1677698 1653219
50940 1653219 1626405 1599015 1571836 1545439 1520853 1499082 1480033 1462405 1444823 1426721 1407897
50929 1407897 1387628 1364792 1338831 1310032 1278757 1244711 1207161 1165686 1120541 1072502 1022496
50918 1022496 971337 919792 868919 820159 774675 732580 693119 655768 620928 589424 561618
50907 561618 537199 515644 496576 479758 464989 452150 441278 432480 425590 419881 414369 408680
50895 408680 403502 399894 398214 398029 398859 400445 402310 403820 404931 406273 408150 410001 411330 412623 414736
50880 414736 417765 421218 425030 429646 435167 441185 447545 454616 462685 471605 481233 491727 503289 516022
50866 516022 530144 545865 562981 581157 600769 622870 648113 676326 707470 742402 782192
50855 782192 827275 877878 934877 999508 1072513 1154225 1245259 1346456 1458155 1580062 1711611
50844 1711611 1851886 1999426 2152920 2311984 2476244 2643333 2808620 2967286 3115904
50835 3115904 3251596 3370590 3468740 3543281 3593397 3619317 3621780 3602486 3564378 3511060 3446253
50824 3446253 3373915 3298367 3223788 3153532 3090006 3034908 2989144 2952315 2922412 2896308 2870847
50813 2870847 2843487 2811917 2773321 2724670 2664133 2591993 2509902 2419374 2321253 2216249 2105496
50802 2105496 1990700 1874330 1759634 1649738 1546351 1449706 1359941 1278065 1205231 1141555
50792 1141555 1086239 1038616 998535 965880 940354 921778 910034 904506 903980 907275 913562 921875
50780 921875 930833 939341 947249 954760 961312 965608 966780 965001 960819 954432 945975 936068 925482 914324
50766 914324 901992 887965 872353 855625 838176 820306 802377 784820 768145 753000 739992
50755 739992 729290 720685 714256 710719 710789 714333 720514 728741 739135 752032 767434 785158 805233
50742 805233 827922 853458 881911 913172 946956 983082 1022040 1065124 1113698 1168369 1229113
50731 1229113 1296073 1369751 1450316 1537143 1629239 1725723 1825405 1926137 2025194 2120411 2210556
50720 2210556 2294417 2369881 2434190 2484837 2519960 2538225 2538959 2522564 2490495 2444741 2387624 2322053
50708 2322053 2251573 2179837 2110200 2045791 1989335 1942286 1904251 1873727 1849426 1830520 1815744
50697 1815744 1802846 1789154 1772339 1750505 1722092 1686107 1642301 1590952 1532797 1469486 1403604
50686 1403604 1337562 1272511 1208900 1147959 1091854 1042151 998822 961286 929896 905687 888874
50675 888874 878438 873364 873693 880038 892519 910675 934223 963393 998336 1038333 1081686 1126384
50663 1126384 1170913 1214485 1256488 1295798 1330907 1360837 1385740 1406416 1423408 1436809 1446771
50652 1446771 1453817 1458689 1462200 1465238 1468510 1472127 1475766 1479414 1483679 1489234 1496364 1505394 1517228 1532913
50638 1532913 1552693 1575907 1601719 1629606 1659131 1689789 1721227 1753177 1784873 1814848 1841589
50627 1841589 1864221 1882376 1895725 1904122 1908090 1908652 1906535 1901810 1894527 1885545 1876589 1869515 1865521
50614 1865521 1864962 1867871 1874697 1886396 1903534 1925175 1948836 1971732 1992072 2009185 2022682 2031758
50602 2031758 2035255 2032112 2021668 2003644 1977929 1944373 1902832 1853393 1796515 1732966 1663905 1591189
50590 1591189 1517368 1444842 1374838 1307404 1242454 1180503 1122356 1068499 1019104 974338 934263
50579 934263 898557 866689 838300 813112 790620 770340 752419 737565 726179 717892 712097 708644
50567 708644 707733 709363 713193 718915 726538 736338 748635 763538 780799 799992 820900 843728 868899
50554 868899 896727 927294 960554 996582 1035722 1078289 1123911 1171395 1219645 1268553 1318383
50543 1318383 1368276 1416122 1460173 1500177 1536653 1569887 1600374 1629629 1659556 1691152 1724552
50532 1724552 1760152 1798860 1841213 1887030 1936111 1988563 2044226 2102459 2162859 2225724 2291517
50521 2291517 2360276 2431798 2505817 2581556 2657356 2731276 2801891 2868239 2929151 2982949 3027636
50510 3027636 3061191 3081855 3088436 3080390 3057576 3020215 2969264 2906645 2834856 2756402 2673654 2589136
50498 2589136 2505859 2427362 2357163 2297676 2249667 2213131 2188628 2177233 2179098 2192734 2215890
50487 2215890 2246357 2281425 2317236 2349583 2375182 2391583 2396145 2385941 2358847 2314293 2253084
50476 2253084 2177076 2089178 1993027 1892161 1789465 1687269 1587600 1492109 1401958 1317892 1240321
50465 1240321 1169362 1104950 1046955 995181 949340 909099 874065 843732 817699 796066 779201
50454 779201 766849 757805 750859 745862 743461 743980 747066 752227 759219 767938 778429 790972 805721
50441 805721 822239 839768 857923 876758 896337 916809 938814 963001 988896 1014937 1040005
50430 1040005 1064415 1089077 1114204 1139342 1164196 1188719 1212555 1235069 1256127 1276404 1296676
50419 1296676 1317021 1336880 1355905 1374643 1394299 1415801 1439254 1464446 1491760 1522169 1556213
50408 1556213 1593280 1632125 1671872 1712280 1753164 1793862 1833304 1870450 1904554 1935009 1961004
50397 1961004 1981543 1995929 2004021 2005720 2000332 1986885 1965051 1935143 1897019 1849693 1792704 1727597
50385 1727597 1657436 1584962 1511894 1439926 1371507 1308972 1253280 1204239 1161904 1127241 1101305
50374 1101305 1084250 1075429 1074114 1079648 1090976 1106449 1124205 1142510 1159706 1174163 1184423 1189131
50362 1189131 1186800 1176164 1157145 1131202 1100383 1066150 1029354 990822 951481 912107 873592
50351 873592 837283 804333 774732 747639 722787 700803 681899 665040 649013 633841 620476
50340 620476 609388 600055 591725 584119 577361 571748 567719 565708 565746 567359 570084 573993 579579 587076
50326 587076 596023 605687 615868 626965 639133 651762 664241 676994 691104 706898 723549 740223
50314 740223 756996 774273 791903 809422 826764 844129 861401 878297 894980 911863 928686
50303 928686 944376 958083 970046 981284 992632 1004163 1015224 1024752 1031731 1035672 1036785 1035677
50291 1035677 1032863 1028554 1022784 1015610 1007100 997131 985258 970873 953500 933051 909986 885383
50279 885383 860671 836999 814809 794097 774869 757099 740416 724323 708706 693750 679453
50268 679453 665753 653126 642372 633569 625904 618933 613373 610121 608994 609047 609702 610840 612078 612774
50254 612774 612778 612544 612409 612158 611359 609682 607034 603759 600658 598255 596081 593142 589068 584305 579275 573992
50238 573992 568591 563527 558956 554438 549569 544487 539497 534611 529791 525319 521527 518444 516033 514620
50224 514620 514705 516412 519289 522586 525654 528267 530687 533340 536388 539836 543899 548765 553868 557978 560450
50209 560450 561950 563475 564939 565312 563998 561496 558632 555642 552159 547658 541729 534308 526033 518128
50195 518128 511517 505997 500527 494393 487897 481864 476734 472323 468349 464851 462020 459813 457901 455930
50181 455930 453784 451644 449866 448638 447641 446162 443726 440588 437484 434989 433234 432086 431329 430692 429988
50166 429988 429237 428502 427579 426078 423829 420992 417675 413682 408803 403242 397553 392192 387118 381838 375898
50151 375898 369464 363391 358585 355287 353083 351498 350337 349518 348892 348350 347889 347491 347102 346811 346766 346833 346587
50134 346587 345888 345265 345469 346733 348670 350854 353248 356021 359197 362646 366358 370501 375172 380254 385656
50119 385656 391573 398279 405586 412846 419635 426241 433215 440561 447659 453943 459432 464598 469909 475503
50105 475503 481119 486240 490485 493905 496883 499798 502857 506164 509802 513799 518014 521969 524935 526568
50091 526568 527540 529086 531678 534609 537205 539872 543316 547152 550165 551849 552878 554096 555818 558260
50077 558260 561865 566912 573349 581215 590649 601324 612553 624188 636768 650513 664869 679375
50065 679375 694230 709405 723964 737052 749173 761729 775476 789961 804218 817519 829711
50054 829711 841334 853138 865085 876090 885157 892278 897722 901089 901973 901189 900267 899770 898991 897352
50040 897352 895277 893537 892505 892287 892989 894672 897637 902986 912314 926629 945979 970194 999376 1033439
50026 1033439 1071794 1113752 1158657 1205266 1251467 1295066 1334546 1368880 1397165 1418979 1434864
50015 1434864 1446111 1454199 1460572 1466445 1472413 1478401 1484205 1489628 1493704 1494095 1487774 1472356 1446767
50002 1446767 1411160 1366686 1315167 1258521 1198521 1137158 1076706 1018866 964094 912294 863974
49991 863974 820105 780948 745715 713530 684253 658137 635204 615243 598082 583513 571099
49980 571099 560227 550260 540601 530967 521768 513905 507875 503183 498931 494781 490998 487696 484531 481290
49966 481290 478316 475987 473970 471372 467646 463097 458471 454316 450808 447922 445502 443261 440978 438716
49952 438716 436738 435202 434029 432997 431862 430440 428784 427284 426427 426365 426788 427275 427757 428648 430581 433961
49936 433961 438644 444074 449834 456058 463203 471534 480916 491071 501831 513228 525517 539110 554222
49923 554222 570609 587937 606413 626798 649718 675263 703367 734344 768915 807954 852404
49912 852404 903126 960434 1023819 1092218 1164409 1238940 1313865 1386864 1455715 1518722 1574943
49901 1574943 1624278 1667274 1704696 1737443 1766962 1795222 1823634 1851930 1878523 1901883 1921069
49890 1921069 1934810 1940762 1936230 1919530 1890480 1849990 1799713 1741919 1678919 1612258 1542678 1471054
49878 1471054 1399040 1328442 1260124 1193934 1129680 1067813 1009055 953738 901872 853635 809413
49867 809413 769334 733117 700483 671414 645794 623039 602424 583749 567411 553715 542295
49856 542295 532264 522815 513573 504585 496100 488296 481031 473889 466628 459493 452797 446198 438815 430282
49842 430282 421360 413132 405897 399310 393371 388538 384791 381367 377783 374452 371761 369135 365787 362072
49828 362072 359225 357759 356940 355983 355034 354633 354811 355151 355378 355504 355667 356172 357420 359501 362041 364733 367746
49811 367746 371335 375299 379247 383238 387801 393354 399921 407304 415249 423557 432314 442009 453085 465444
49797 465444 478751 493275 510128 530515 554917 583083 614632 649524 688051 730482 776697
49786 776697 826082 877639 930048 981655 1030652 1075456 1114856 1147829 1173541 1191911 1204062
49775 1204062 1211931 1217431 1222042 1226963 1233176 1241032 1249760 1257269 1260588 1256865 1244393 1222687 1191626
49762 1191626 1150990 1101255 1044496 983892 922304 861734 803997 751034 704055 662784 626096
49751 626096 593288 564429 539631 518416 499958 483666 469389 457110 446603 437473 429419 422384
49739 422384 416433 411607 407875 405043 402658 400222 397686 395587 394512 394552 395381 396609 397790 398306 397725
49724 397725 396238 394475 392891 391608 390681 390137 389814 389600 389815 390882 392535 393822 394104 393694 393391 393731
49708 393731 394765 396092 396962 396846 396196 396145 397089 398040 397884 396920 396519 397498 399428 401485 403335 405009 406485
49691 406485 407714 408857 410222 412060 414482 417419 420571 423550 426180 428645 431279 434179 436994 439041
49677 439041 439752 439174 438010 437105 436860 437179 437819 438592 439257 439456 438987 438113 437454 437417 437787 438066 438252 438964 440575
49658 440575 442454 443529 443455 442795 442102 441377 440468 439409 438157 436584 435041 434388 434983 436088 436717 436675 436296
49641 436296 435720 435094 434997 435782 436680 436571 435635 435318 436469 438386 440027 441329 442760 444250 445279 445729 446016
49624 446016 446508 447308 448454 449924 451476 452872 454226 455882 457952 460272 462835 466022 470294 475739 481935
49609 481935 488208 494023 499199 503816 508064 512340 517310 523534 530947 538933 547008 555206 563760 572739
49595 572739 582205 592481 603900 616325 629108 641582 653573 665501 678029 691560 706104 721641
49583 721641 738394 756458 775304 794161 813008 832797 854454 877939 902519 927710 953652
49572 953652 980720 1009008 1038188 1067805 1097767 1128468 1160159 1192307 1224071 1255462 1287496
49561 1287496 1320863 1354917 1388303 1420180 1450463 1479263 1506631 1532593 1556916 1578998 1598441
49550 1598441 1615624 1631308 1645784 1658710 1669626 1678200 1684161 1687413 1688130 1686433 1682194 1675607 1667644
49537 1667644 1659380 1651029 1642223 1633079 1624240 1615951 1607929 1600324 1594041 1589785 1587433 1586622 1587406 1589945
49523 1589945 1594152 1600103 1608309 1619052 1631814 1645936 1661503 1678986 1698195 1718247 1738585 1759385
49511 1759385 1780761 1802001 1821999 1840242 1856958 1872237 1885321 1895023 1900768 1902899 1901902 1897627
49499 1897627 1889515 1877313 1861269 1841806 1819357 1794343 1766925 1736906 1704353 1670127 1635198
49488 1635198 1599583 1562712 1524902 1487530 1451399 1415751 1379440 1342521 1306116 1271268 1238458
49477 1238458 1207704 1178325 1148949 1118666 1088146 1059051 1032435 1008190 985807 964905 944962
49466 944962 925309 905709 886577 868465 851628 836144 822081 809360 797711 786858 776621
49455 776621 766938 757973 750045 743178 736905 730878 725406 720928 717100 713023 708354 703645 699538 696139
49441 696139 693238 690636 688104 685564 683411 682171 681703 681234 680405 679770 680049 681372 683523 686414 690027
49426 690027 694311 699536 706400 715412 726425 739044 753205 769086 786641 805220 823090 837299
49414 837299 845048 846078 843247 840109 838207 837206 836882 837834 840469 844550 850003 857306 866659 877438
49400 877438 888825 900487 912408 924585 937157 950290 963622 976320 988036 999270 1010414
49389 1010414 1021006 1030482 1039136 1047582 1055579 1062304 1067723 1072910 1078784 1085203 1091522 1097493 1103298 1109174
49375 1109174 1115473 1122776 1131485 1141418 1152137 1163469 1175383 1187594 1199851 1212632 1227014 1243540
49363 1243540 1261499 1279575 1297103 1314570 1333065 1353418 1375751 1399589 1424359 1449872 1476308
49352 1476308 1503756 1531947 1560616 1589998 1620753 1653353 1687705 1723391 1760153 1798001 1836935
49341 1836935 1876742 1917216 1958499 2001052 2045198 2090808 2137616 2185641 2235082 2285809 2337250
49330 2337250 2388776 2439881 2490026 2538786 2586368 2633534 2680587 2726781 2771174 2813748 2855064
49319 2855064 2894937 2932209 2965947 2996236 3023477 3047460 3067543 3083422 3095247 3103184 3107320 3108049
49307 3108049 3106175 3102448 3097072 3089711 3080064 3068479 3056001 3043711 3032041 3020827 3009900 2999476
49295 2999476 2990056 2982282 2976808 2973872 2972927 2973149 2974409 2977338 2982315 2988976 2997053 3007069 3019565 3033995
49281 3033995 3049127 3064417 3080416 3097801 3116540 3135995 3155269 3173275 3189006 3202052 3212630
49270 3212630 3220929 3226635 3229139 3227879 3222347 3212077 3196870 3176878 3152347 3123461 3090579 3054258
49258 3054258 3014924 2972817 2928562 2883514 2839090 2795751 2752952 2710098 2667240 2624742 2582647
49247 2582647 2540723 2499091 2458523 2419892 2383471 2348850 2315555 2283589 2253406 2225498 2200039
49236 2200039 2176705 2154720 2133308 2112341 2092431 2074208 2057582 2041889 2026601 2011613 1996954
49225 1996954 1982654 1968958 1956313 1944986 1934937 1926152 1918753 1912589 1907047 1901507 1895818 1890134 1884641
49212 1884641 1879666 1875697 1872748 1869934 1866231 1861645 1857096 1853079 1849018 1844222 1839002 1834452 1831412 1830014
49198 1830014 1829918 1830542 1831196 1831649 1832594 1835048 1839080 1843514 1847192 1850201 1853535 1857826 1862821 1868037 1873438
49183 1873438 1879360 1886093 1893714 1902119 1911037 1920105 1929178 1938600 1949081 1961165 1974768 1989231 2003932
49170 2003932 2018880 2034649 2051764 2070295 2089994 2110441 2130907 2150508 2169001 2187308 2206730
49159 2206730 2227660 2249502 2271854 2295165 2320058 2346564 2374395 2403522 2433906 2464920 2495641
49148 2495641 2525765 2555843 2586571 2618126 2650157 2682061 2713071 2742292 2768978 2792876 2814349
49137 2814349 2834105 2852743 2870547 2887744 2904809 2922229 2939989 2957608 2974756 2991460 3007633
49126 3007633 3022882 3037102 3050771 3064248 3077185 3089211 3100826 3112889 3125341 3137202 3147897
49115 3147897 3157882 3167692 3177012 3185157 3192096 3198608 3205641 3213804 3223222 3233495 3243934 3254210 3264749
49102 3264749 3276268 3288903 3302001 3314844 3327408 3340251 3353605 3366686 3378130 3387144 3394073 3399762
49090 3399762 3404611 3408529 3411557 3414133 3416757 3419738 3423255 3427351 3431845 3436584 3441842 3448164 3455756 3464289
49076 3464289 3473331 3482648 3492006 3501065 3509705 3518184 3526764 3535283 3543220 3550029 3555427 3559516 3562653 3564981
49062 3564981 3566136 3565623 3563338 3559341 3553230 3544388 3533003 3520198 3506840 3492632 3476754 3459032 3440116
49049 3440116 3420751 3401242 3381424 3360903 3339552 3317967 3297152 3277459 3258144 3238306 3218037
49038 3218037 3198360 3180261 3164125 3149853 3137134 3125685 3115518 3106829 3099477 3092899 3086870 3082089
49026 3082089 3079571 3079616 3081693 3085099 3089267 3093678 3098055 3102752 3108531 3115850 3124591 3134385 3144871 3155725
49012 3155725 3166771 3178068 3189600 3200909 3211385 3220891 3229773 3238271 3246179 3253104 3258816 3263355 3266988
48999 3266988 3269989 3272269 3273273 3272439 3269610 3264930 3258627 3251131 3242944 3233989 3223472 3210921 3197023
48986 3197023 3182763 3168012 3151737 3133416 3113361 3091697 3068015 3042323 3015462 2988211 2960667
48975 2960667 2932909 2905514 2878814 2852216 2824900 2796824 2768502 2740182 2711853 2683800 2656530
48964 2656530 2630258 2604931 2580678 2557805 2536490 2516880 2499364 2484289 2471506 2460665 2451915
48953 2451915 2445844 2442656 2441749 2442168 2443238 2444839 2447484 2452178 2459713 2469793 2481112 2492522 2504021
48940 2504021 2516450 2530419 2545730 2561725 2577966 2594530 2611892 2630594 2650895 2672586 2695209
48929 2695209 2718590 2743177 2769640 2797981 2827200 2855978 2883684 2910632 2937673 2965826 2996038
48918 2996038 3028772 3063706 3100211 3138206 3178183 3220375 3264449 3310196 3358011 3408244 3460529
48907 3460529 3514208 3569111 3625394 3682902 3741351 3800989 3862356 3925208 3988293 4050548 4112131
48896 4112131 4173895 4236038 4297652 4357546 4415242 4471117 4525687 4578835 4629649 4676968 4720046
48885 4720046 4758804 4793566 4824735 4852641 4877502 4899330 4917840 4932497 4942825 4948794 4950868 4949489
48873 4949489 4944499 4935155 4920752 4901085 4876399 4847178 4814100 4777919 4739181 4698047 4654417 4608043
48861 4608043 4558710 4506714 4453227 4399605 4346089 4291636 4235389 4177857 4120269 4063265 4006909
48850 4006909 3951550 3897803 3845737 3794842 3744929 3696379 3649370 3603596 3559043 3516544 3477208
48839 3477208 3441608 3409711 3381160 3355417 3332067 3311283 3293582 3278864 3266134 3254590 3244521
48828 3244521 3236770 3231611 3228687 3227764 3228989 3232510 3238362 3246702 3257705 3271123 3286283 3302558 3319623
48815 3319623 3337351 3355715 3374824 3394804 3415676 3437569 3460926 3486135 3512913 3540401 3567916
48804 3567916 3595474 3623566 3652597 3682541 3712920 3743237 3773621 3804911 3837731 3871550 3905084
48793 3905084 3937636 3969657 4001937 4034717 4067748 4100715 4133272 4165004 4195895 4226694 4258368
48782 4258368 4291092 4323998 4355997 4386711 4416519 4445872 4474704 4502503 4528823 4553535 4576600
48771 4576600 4597796 4616870 4633687 4647957 4658916 4665731 4668236 4666856 4661734 4652385 4638369 4619833
48759 4619833 4597086 4570085 4538784 4503633 4465214 4423537 4378236 4329404 4277699 4223611 4167078
48748 4167078 4107994 4046719 3983955 3920382 3856612 3793267 3730970 3670426 3612584 3558455 3508658
48737 3508658 3463236 3421954 3384540 3350665 3320068 3292920 3269805 3251080 3236433 3225255 3217250
48726 3217250 3212439 3210715 3211615 3214478 3218698 3223989 3230637 3239361 3250612 3264002 3278645 3294031 3310284
48713 3310284 3327550 3345488 3363547 3381489 3399269 3416480 3432282 3446082 3458074 3468938 3479150
48702 3479150 3488819 3498080 3507268 3516621 3526219 3536342 3547533 3559975 3573146 3586538 3600508 3615859
48690 3615859 3632735 3650585 3669285 3689620 3712384 3737568 3764796 3794049 3825548 3859346 3895535
48679 3895535 3934525 3976580 4021332 4068242 4117269 4168491 4221205 4274121 4326478 4378364 4429879
48668 4429879 4480597 4529986 4577662 4622866 4664162 4700239 4730818 4756403 4777272 4792940 4802457
48657 4802457 4804905 4799673 4786553 4765637 4737165 4701646 4660153 4614188 4564926 4512662 4457211 4398808
48645 4398808 4338407 4277079 4215241 4152553 4088529 4023209 3957229 3891298 3825755 3760766 3696755
48634 3696755 3634282 3573467 3513866 3455029 3396990 3340101 3284627 3230682 3178431 3128108 3079876
48623 3079876 3033738 2989556 2947142 2906447 2867681 2831049 2796372 2763172 2731220 2700797 2672273
48612 2672273 2645601 2620346 2596110 2572836 2550778 2530134 2510620 2491545 2472554 2454138 2436964
48601 2436964 2420756 2404434 2387402 2370091 2353086 2336496 2320606 2306278 2293882 2282361 2270320
48590 2270320 2257782 2245887 2234983 2224152 2212812 2201817 2192429 2184895 2178572 2172913 2167761 2163081
48578 2163081 2158987 2155817 2153711 2152304 2151217 2150629 2150919 2152014 2153649 2156116 2160108 2165685 2171929 2177871
48564 2177871 2183397 2189081 2195399 2202342 2209501 2216288 2222202 2227116 2231239 2234762 2237755 2240486 2243514 2247238
48550 2247238 2251554 2256214 2261305 2267027 2273187 2279330 2285300 2291255 2297109 2302441 2307111 2311579 2316345 2321390
48536 2321390 2326442 2331487 2336725 2342214 2347886 2353772 2359931 2366331 2373060 2380481 2388862 2398057 2407829 2418243
48522 2418243 2429264 2440233 2450442 2460168 2470465 2481765 2493355 2504420 2514966 2525320 2535372
48511 2535372 2544859 2554056 2563602 2573858 2584808 2596403 2608556 2621085 2634113 2648314 2664314 2681980
48499 2681980 2700793 2720791 2742597 2766610 2792693 2820629 2850225 2880725 2910749 2939295 2966668
48488 2966668 2994060 3022275 3050952 3078936 3105187 3129440 3152118 3173750 3194459 3213916 3231497
48477 3231497 3246379 3257803 3265577 3270249 3272521 3272512 3269830 3264236 3255997 3245682 3233880 3220991 3206948
48464 3206948 3191259 3173655 3154600 3134740 3113991 3091691 3067612 3042233 3015887 2988278 2959062
48453 2959062 2928323 2896116 2862066 2825974 2788511 2750741 2713073 2675148 2636710 2598152 2560072
48442 2560072 2522647 2485614 2448718 2412055 2376072 2341339 2308350 2277455 2248806 2222217 2197176
48431 2197176 2173278 2150705 2130129 2112021 2096186 2081991 2068868 2056583 2045211 2034928 2025728
48420 2025728 2017341 2009627 2003045 1998455 1996379 1996575 1998275 2000568 2002681 2004339 2006007 2008481 2012077 2016523
48406 2016523 2021584 2027355 2033795 2040565 2047572 2055283 2064186 2074299 2085453 2097524 2110041 2122123 2133348
48393 2133348 2144317 2155864 2168065 2180550 2193316 2206435 2219225 2230619 2240355 2249037 2257019 2264004
48381 2264004 2269850 2274898 2279209 2282258 2283871 2284870 2286243 2288137 2290169 2292278 2294641 2297011 2298894 2300403
48367 2300403 2302397 2305660 2310228 2315599 2321218 2326677 2331779 2336651 2341679 2347223 2353465 2360559 2368619 2377386
48353 2377386 2386098 2394069 2401463 2409303 2418513 2429098 2440419 2452122 2464442 2477518 2490816 2503510
48341 2503510 2515306 2526563 2537709 2548844 2559885 2570732 2581261 2591440 2601556 2611987 2622629
48330 2622629 2632889 2642506 2652016 2662003 2672164 2681657 2690349 2699113 2708629 2718403 2727319 2734859 2741290
48317 2741290 2746903 2751704 2755889 2759943 2763931 2767167 2769042 2769800 2769983 2769481 2767872 2765641 2764106 2763893 2764221
48302 2764221 2764125 2763712 2763637 2763945 2764281 2764886 2766447 2768972 2771742 2774558 2778253 2783588 2790279 2797544 2805089 2813004
48286 2813004 2821124 2829174 2837385 2846342 2856211 2866477 2876493 2885809 2893918 2900177 2904334 2906846 2908327
48273 2908327 2908782 2907678 2904699 2900025 2893664 2884870 2872632 2856792 2838325 2818435 2797619 2775769 2752871
48260 2752871 2729189 2704833 2679501 2652760 2624462 2594936 2564968 2535532 2507177 2479554 2451706
48249 2451706 2422883 2393011 2362549 2332250 2302971 2275225 2248693 2222478 2195955 2169147 2142270
48238 2142270 2115475 2089225 2064342 2041192 2019125 1997275 1975674 1955068 1935772 1917260 1898905
48227 1898905 1880622 1862567 1844575 1826136 1806819 1786654 1766163 1745914 1725893 1705461 1684150
48216 1684150 1662250 1640276 1618116 1595340 1572266 1549928 1528778 1508121 1487233 1466419 1446332
48205 1446332 1426599 1405871 1383233 1359098 1334698 1311147 1288946 1267882 1247167 1225968 1204108
48194 1204108 1182224 1161225 1141709 1123811 1107337 1091893 1077060 1062566 1048314 1034388 1021253
48183 1021253 1009825 1000888 994237 988586 982566 975762 968787 962573 957680 954059 951248 948898 947227 946818
48169 946818 947851 949697 951462 952797 954038 955718 958119 961117 964253 967115 969916 973471 978224 983475
48155 983475 988062 991792 995692 1000686 1006592 1012704 1018894 1025612 1033079 1041030 1049242 1057796 1066643 1075282
48141 1075282 1083168 1090290 1097074 1103765 1110144 1115995 1121587 1127426 1133574 1139568 1145160 1150823 1157197 1164234
48127 1164234 1171314 1178120 1184943 1192046 1199249 1206332 1213452 1220862 1228546 1236444 1244728 1253525 1262601 1271743
48113 1271743 1281196 1291269 1301605 1311378 1320212 1328491 1336714 1344925 1352889 1360496 1367875 1375381 1383574
48100 1383574 1392883 1403151 1413771 1424415 1435449 1447474 1460705 1474996 1490296 1506762 1524423
48089 1524423 1542889 1561548 1580143 1599161 1619474 1641459 1664571 1688029 1711759 1736387 1762408
48078 1762408 1789739 1818141 1847732 1878979 1912483 1948816 1988258 2030611 2075565 2123159 2173204
48067 2173204 2223742 2270372 2307617 2331258 2339780 2334446 2318562 2296360 2271784 2247742 2226077 2207680
48055 2207680 2192400 2179254 2167264 2156133 2146003 2136935 2128932 2122184 2116772 2112191 2107568 2102353 2096469
48042 2096469 2089886 2082419 2073999 2064835 2055205 2045295 2035140 2024472 2012641 1998981 1983310 1965969
48030 1965969 1947486 1928391 1909096 1889568 1869148 1847143 1823594 1799185 1774391 1749090 1722964
48019 1722964 1695889 1667840 1638860 1609257 1579507 1549817 1520055 1490259 1460841 1432138 1404037
48008 1404037 1376249 1348708 1321529 1294906 1269168 1244695 1221592 1199794 1179622 1161747 1146235
47997 1146235 1132062 1118088 1104285 1091459 1079952 1069236 1058810 1048816 1039580 1031029 1022932 1015347
47985 1015347 1008486 1002313 996694 991778 987823 984594 981289 977322 973010 969254 966564 964638 962926 961336
47971 961336 960193 959603 959136 958158 956300 953574 950182 946327 942103 937457 932277 926595 920685 914955 909747
47956 909747 905126 900760 895991 890298 883792 877127 870791 864578 857908 850589 843114 836196 830095 824439
47942 824439 818643 812474 806148 799957 793954 788166 782941 778766 775726 773398 771412 769886 769217 769705 771527
47927 771527 774816 779420 784805 790501 796568 803282 810450 817384 823693 829784 836393 843858 851993 860491
47913 860491 869074 877209 884021 888794 891580 893119 894077 894501 894088 892765 890693 887822 883860 878725 872763
47898 872763 866322 859449 852172 844773 837508 830259 822865 815691 809563 805117 802334 800562 798854 796486
47884 796486 793455 790427 788014 786279 785124 784841 785886 788317 791932 796726 802611 808798 814169 818495
47870 818495 822744 828007 834619 842402 851069 860081 868681 876618 884381 892326 899995 906753 912558 917502
47856 917502 921092 922933 923786 924828 925708 924361 919227 910922 901214 890976 879864 867588 854581 841346
47842 841346 827869 813989 799974 786348 773342 760831 748798 737531 727227 717607 708227 699165
47830 699165 691097 684580 679411 674909 670684 666934 664049 662196 661282 661118 661528 662450 663939 666011 668521
47815 668521 671344 674452 677649 680376 682209 683474 684899 686563 687614 687258 685604 683305 680765 678151
47801 678151 675856 674297 673255 671919 669763 667104 664614 662571 660754 658904 657070 655539 654628 654569 655545
47786 655545 657678 660935 665045 669718 675004 681291 688816 697295 706226 715494 725514 736746 749268
47773 749268 762848 777310 792696 809063 826149 843322 860017 876250 892528 909121 925540
47762 925540 940866 954534 966698 978001 989144 1000452 1011473 1020998 1027805 1031536 1032824 1032604 1031414
47749 1031414 1029258 1025882 1021122 1015160 1008442 1001263 993598 985530 977597 970256 963102 955174 946202 937068
47735 937068 928850 921857 915822 910609 906311 902913 900387 898954 898819 899728 901192 903155 906145 910745 917189
47720 917189 925500 935685 947622 960882 974787 988782 1002811 1017361 1032938 1049415 1066066 1082316
47708 1082316 1098135 1113522 1127946 1140650 1151238 1159567 1165335 1168344 1168970 1167728 1164407 1158295 1149373
47695 1149373 1138540 1126426 1112591 1096396 1078175 1059098 1040216 1022093 1005055 989178 974181
47684 974181 959761 946084 933651 922873 914084 907742 904043 902391 901737 901590 902348 904623 908569 914009
47670 914009 920885 929365 939624 951552 964574 977933 991430 1005718 1021442 1038107 1054348 1069368
47658 1069368 1083538 1097367 1110444 1121900 1131463 1139481 1146147 1151278 1154800 1156862 1157339 1155596 1151054
47645 1151054 1143799 1134563 1124241 1113497 1102615 1091551 1080185 1068563 1056843 1045036 1032964 1020596
47633 1020596 1008372 997156 987816 980715 975488 971360 967831 965033 963366 962890 963230 963927 964647 965121 965161
47618 965161 964858 964556 964496 964539 964203 962870 960054 955720 950354 944437 937892 930280 921572 912226 902402 891587
47602 891587 879382 866282 853183 840354 827461 814491 802050 790610 779968 769666 759511
47591 759511 749377 738869 727604 715691 703568 691426 679103 666498 653815 641322 629068
47580 629068 616913 604724 592542 580643 569413 558953 548905 538869 529065 520272 513033 507086
47568 507086 501793 496934 492860 489960 488214 487281 486855 486876 487492 488897 491125 494072 497648 501727 505828
47553 505828 509135 511223 512722 514889 518433 523034 528000 532878 537322 540901 543566 545951 548699 551605
47539 551605 553894 555197 555706 555422 553940 551189 547830 544494 541022 536815 531688 525965 519966 513795 507613
47524 507613 501713 496210 490823 485073 478643 471705 464924 458915 453551 448092 442259 436885 433015 430483
47510 430483 427947 424407 420242 416462 413392 410512 407439 404562 402565 401608 401308 401449 402333 404246 406811
47495 406811 409258 411302 413358 415755 418178 420178 421945 424150 427138 430625 434079 437102 439503 441403
47481 441403 443140 444763 445675 445153 443168 440289 436863 432831 428349 424044 420405 417341 414539 411886 409392
47466 409392 407134 405452 404753 404893 405200 405349 405722 406584 407493 407989 408411 409362 410675 411625 412026 412465 413425 414773
47448 414773 416183 417579 418990 420272 421150 421387 421004 420519 420780 422141 423935 425170 425679 426153 427124 428461
47432 428461 429935 431725 434178 437466 441669 446881 453031 459887 467362 475543 484397 493775 503703 514291
47418 514291 525348 536591 548276 561035 574852 588859 602527 616461 631509 647482 663325
47407 663325 678153 691580 703382 713652 723090 732361 741029 747832 752184 754810 756564 757121 755329
47394 755329 750591 743475 735042 725961 716322 706062 695404 684888 675034 666022 657719 649998 642987
47381 642987 637003 632301 628803 626033 623381 620532 617569 614663 611879 609438 607915 607812 609007 610926
47367 610926 613264 616198 619844 623894 628053 632500 637539 642879 647670 651404 654599 658281 662739 666939
47353 666939 669355 669351 667578 664943 661536 656816 650612 643433 635738 627397 618126 608097 597733 587085
47339 587085 575828 563880 551693 539831 528507 517659 507303 497638 488845 480930 473745 467119
47327 467119 460928 455086 449473 443872 438063 432030 426130 421043 417422 415467 414700 414272 413652 413050 413079 413903
47311 413903 414787 414673 413287 411674 411485 413601 417340 421002 423212 423773 423359 422614 421738 420728 419736 419054
47295 419054 418961 419620 420951 422407 423134 422657 421383 420168 419402 418794 418123 417816 418553 420488 423143 425972 428738
47278 428738 431380 433882 436460 439724 444345 450461 457458 464394 470685 476412 482046 488015 494560 501791
47264 501791 509616 517691 525725 533925 542812 552459 562179 571214 579476 587322 594819 601660 607688 613055
47250 613055 617821 621821 625017 627608 629662 630904 631049 630139 628452 626302 623958 621456 618391 614269 609242
47235 609242 604114 599429 594931 590149 585072 579848 574256 568085 561805 556275 551894 548583 546417 545591
47221 545591 545700 545809 545536 545454 546117 547228 548274 549501 551689 555174 559654 564907 571146 578558 586895 595675
47205 595675 604506 613082 621146 628737 636325 644401 652794 660495 666325 669912 672011 673736 675470 676596
47191 676596 676253 674110 670416 665635 660260 654707 649011 642831 636155 629878 625181 622274 620184 618020
47177 618020 615985 614908 615171 616547 618860 622315 627127 633171 640050 647359 654961 663276 673192 685353
47163 685353 699514 714859 730905 747685 765063 782420 799278 815774 832163 848222 863589
47152 863589 878397 892978 907049 919768 930627 939759 947149 952115 954034 953336 951330 949043 946474
47139 946474 942970 938114 932197 926000 920174 914800 909464 903731 897518 891091 884912 879519 875366 872536
47125 872536 870686 869360 868377 867775 867476 867179 866680 866250 866593 868322 871431 875311 879318 883321 887633 892495
47109 892495 897862 903652 909931 916598 923050 928380 931956 933723 933956 932806 930081 925426 918698 910169
47095 910169 900308 889398 877462 864535 850822 836564 821917 807080 792389 778156 764509 751442
47083 751442 738888 726650 714516 702633 691590 681966 673866 667048 661308 656472 652254 648482 645443
47070 645443 643615 643021 643195 643870 645286 647601 650336 652833 655184 658336 663193 669789 677389 685198 692859
47055 692859 700358 707634 714413 720382 725501 730045 734314 738305 741778 744704 747456 750397 753300 755518
47041 755518 756825 757871 759501 761788 764096 766055 768179 771416 776339 782763 789915 796901 803322 809565
47027 809565 816251 823398 830495 837493 845160 854061 863580 872434 879932 886336 892287 898490 905757 914625
47013 914625 924750 935197 945481 955895 966665 977325 987320 996878 1006828 1017623 1028827 1039527
47001 1039527 1048986 1056862 1063055 1067537 1070381 1071772 1071837 1070474 1067619 1063767 1059852 1056390 1053020 1049279
46987 1049279 1045446 1042032 1038671 1034364 1029008 1023891 1020315 1018279 1016971 1016095 1016122 1017524 1020303 1024134 1028489
46972 1028489 1032740 1036609 1040624 1045771 1052586 1060794 1069746 1078918 1087991 1096907 1106042 1116115 1127615
46959 1127615 1140290 1153262 1165624 1177017 1187762 1198472 1209458 1220396 1230559 1239353 1246632 1252631
46947 1252631 1257717 1262171 1266053 1269199 1271345 1272330 1272219 1271295 1269843 1267908 1265296 1261909 1257977 1253864 1249770
46932 1249770 1245856 1242547 1240354 1239357 1239197 1239641 1240758 1242436 1244188 1245847 1248135 1252124 1258226 1265926 1274345
46917 1274345 1282744 1290758 1298636 1307221 1317234 1328481 1340076 1351425 1362662 1374095 1385679 1397188
46905 1397188 1408535 1419594 1429882 1438708 1445587 1450343 1452904 1453139 1450840 1445778 1437840 1427221 1414443
46892 1414443 1400099 1384669 1368630 1352647 1337504 1323900 1312394 1303414 1297078 1293041 1290835 1290491
46880 1290491 1292631 1297771 1305717 1315897 1328103 1342453 1358644 1375775 1393219 1411205 1430029 1449028
46868 1449028 1466952 1483246 1498311 1512477 1525446 1536952 1547232 1556336 1563638 1568795 1572802 1577187
46856 1577187 1582330 1587378 1591866 1596512 1602148 1608726 1615924 1624035 1633426 1643572 1653561 1663484 1674478
46843 1674478 1687176 1700876 1714532 1727861 1740909 1753199 1764169 1774158 1783926 1793136 1800262 1804425
46831 1804425 1806428 1807337 1806803 1803785 1798465 1792259 1785876 1778564 1769684 1760052 1751068 1743252 1736433 1730805
46817 1730805 1726804 1724158 1722100 1720664 1720908 1723490 1727764 1732837 1739082 1747992 1760617 1776680 1795217
46804 1795217 1815584 1837489 1860326 1882938 1904258 1924005 1942580 1960328 1977014 1991942 2004330
46793 2004330 2013614 2019670 2022921 2023996 2023119 2019916 2013889 2004925 1993322 1979637 1964692 1949397 1934158
46780 1934158 1918574 1902046 1884599 1866914 1849688 1833351 1818322 1805072 1793703 1783637 1773856
46769 1773856 1763518 1752466 1741305 1730843 1721292 1712160 1703040 1694216 1686145 1678654 1671172 1663630 1656471
46756 1656471 1649761 1642891 1635515 1628334 1622627 1619214 1618105 1618818 1620720 1623250 1626249 1630120 1635392 1642096
46742 1642096 1649638 1657340 1665070 1673328 1682737 1693453 1705075 1717070 1729067 1740681 1751435 1761216
46730 1761216 1770618 1780394 1790502 1800057 1808207 1814777 1820099 1824631 1828814 1832867 1836529 1839385 1841620 1844108
46716 1844108 1847577 1851982 1856926 1862304 1868220 1874588 1881303 1888705 1897461 1907835 1919247 1930602 1941034
46703 1941034 1950347 1958762 1966251 1972283 1976409 1978810 1979810 1978995 1975458 1968987 1960277 1949601 1935999 1918414
46689 1918414 1897184 1873721 1849020 1823228 1796441 1769055 1741217 1712764 1684044 1656135 1629779
46678 1629779 1604511 1579373 1554184 1529631 1506263 1484017 1462825 1443120 1425314 1408988 1393116
46667 1393116 1377159 1361589 1347123 1333776 1321055 1308931 1298025 1288736 1280678 1273355 1267079 1262715
46655 1262715 1260605 1260120 1260401 1261230 1263183 1267191 1274130 1284562 1298499 1315262 1333684 1352658 1371661
46642 1371661 1390859 1410703 1431376 1452468 1472970 1491512 1506925 1518887 1527925 1534588 1538781 1540314
46630 1540314 1539851 1538671 1537364 1535469 1532680 1529847 1528334 1528864 1531533 1536495 1543965 1553754 1565554 1579561
46616 1579561 1596265 1615626 1637041 1660119 1684892 1711145 1738071 1764748 1790492 1814616 1836335
46605 1836335 1855071 1870444 1881778 1888140 1889148 1885266 1877007 1864295 1847105 1826325 1803431 1779372
46593 1779372 1754246 1727982 1700947 1673796 1647037 1620861 1595292 1570465 1546744 1524428 1503289
46582 1503289 1482675 1462228 1442236 1423107 1404819 1387179 1370346 1354597 1339766 1325375 1311222
46571 1311222 1297303 1283228 1268394 1252978 1238125 1224688 1212208 1199675 1187084 1175547 1165928
46560 1165928 1157906 1150649 1143903 1138051 1133375 1129769 1127070 1125207 1123816 1122153 1119798 1117338 1115951 1116197
46546 1116197 1117506 1118979 1120466 1122514 1125428 1128817 1132276 1136134 1141106 1147265 1153834 1160176 1166623 1173936
46532 1173936 1182149 1190509 1198608 1207079 1216811 1227843 1239444 1251073 1262737 1274511 1286343 1298536
46520 1298536 1311896 1327001 1343574 1360934 1378857 1397645 1417514 1438309 1459810 1481929 1504572
46509 1504572 1527619 1551112 1575167 1599520 1623424 1646174 1667551 1687611 1706283 1723427 1739062
46498 1739062 1753187 1765347 1774749 1780960 1784355 1785833 1786167 1785658 1784200 1781549 1777613 1772670 1767313 1762122
46484 1762122 1757333 1752741 1747843 1742031 1734841 1726154 1716207 1705379 1693914 1681774 1668624 1653996 1637706
46471 1637706 1620181 1602196 1584049 1565132 1544496 1521803 1497516 1472250 1446266 1419630 1392491
46460 1392491 1365056 1337529 1310287 1283894 1258638 1234310 1210809 1188858 1169613 1153434 1139510
46449 1139510 1126937 1115830 1106996 1100807 1096926 1095099 1095650 1099011 1105125 1113561 1123850 1135396 1147384
46436 1147384 1159230 1171065 1183350 1196060 1208606 1220550 1231965 1242981 1253361 1262724 1270822 1277432
46424 1277432 1282334 1285704 1288206 1290326 1291828 1292277 1291826 1291111 1290543 1290266 1290775 1292987 1297451 1303913 1311881
46409 1311881 1321353 1332769 1346413 1362121 1379528 1398528 1419545 1443344 1470489 1501003 1534687
46398 1534687 1571512 1611424 1653868 1697995 1743376 1790143 1838302 1887241 1935983 1983551 2029015
46387 2029015 2071689 2111443 2148454 2182377 2212139 2236744 2255930 2269814 2278386 2281728 2280294 2274469
46375 2274469 2264119 2249098 2229905 2207366 2181898 2153691 2123470 2092485 2061685 2031453 2002163
46364 2002163 1974506 1949075 1926019 1905262 1886833 1870955 1858046 1848594 1842703 1839959 1840237 1844574
46352 1844574 1854564 1870691 1891907 1917149 1946691 1981442 2021413 2065662 2113655 2165869 2222732
46341 2222732 2283436 2346234 2409737 2473560 2537602 2600980 2661907 2718528 2769618 2814416 2852093
46330 2852093 2881700 2902610 2914751 2918323 2913426 2900022 2878161 2848157 2810641 2766483 2716664 2662159
46318 2662159 2603934 2543041 2480743 2418530 2357853 2299569 2243713 2190112 2139275 2092401 2050388
46307 2050388 2013214 1980466 1952064 1928157 1908791 1894108 1884560 1880234 1880268 1883642 1890524 1902055 1918653
46294 1918653 1939168 1962074 1986918 2014224 2044317 2076682 2110339 2144539 2179219 2214888 2251919
46283 2251919 2289832 2327481 2363979 2399205 2433320 2466137 2497062 2525303 2549988 2570370 2586194
46272 2586194 2597686 2605119 2608681 2608838 2606280 2601220 2593167 2581816 2567825 2552212 2535270 2516634 2496378
46259 2496378 2475519 2455303 2436360 2418677 2402174 2387081 2373843 2362775 2353896 2347121 2342572 2340480
46247 2340480 2340772 2342962 2346504 2351083 2356519 2362698 2369726 2377780 2386508 2394790 2401485 2406365 2410069 2413207
46233 2413207 2415712 2416921 2415969 2412160 2405324 2395955 2384843 2372434 2358525 2342586 2324363 2304337 2283577
46220 2283577 2263038 2242859 2222471 2201430 2179961 2158626 2137756 2117379 2097543 2078435 2060273
46209 2060273 2043199 2027215 2012186 1998090 1985328 1974505 1965788 1958742 1952975 1948656 1946198 1945759 1947305
46196 1947305 1950912 1956617 1964145 1973066 1983124 1994236 2006409 2019844 2034803 2051063 2067804 2084396
46184 2084396 2100991 2117954 2135053 2151732 2167905 2183786 2199097 2213135 2225673 2237159 2247973
46173 2247973 2258134 2267838 2277608 2287610 2297340 2306411 2315154 2324010 2332670 2340421 2347289 2354388 2362979
46160 2362979 2373351 2384681 2395864 2406449 2416843 2427766 2439645 2452403 2465520 2478186 2489752
46149 2489752 2500443 2511387 2523519 2536523 2549155 2560479 2570333 2578827 2586021 2592133 2597399 2601510
46137 2601510 2603785 2604190 2603733 2603461 2603413 2602851 2601143 2598097 2593852 2588890 2583898 2579219 2574588 2569693 2564707
46122 2564707 2559831 2554653 2548491 2541342 2533962 2526957 2520254 2513547 2506867 2500529 2494798 2489739 2485191 2480726
46108 2480726 2475813 2470214 2464169 2458141 2452406 2446935 2441597 2436394 2431531 2427153 2423027 2418578 2413392 2407622
$$ [...]
##END NTUPLES=NMR SPECTRUM
##END=
