
##TITLE=AC1207_MCiAH12041_5946565_neomnvGzdM
##JCAMPDX= 6.0         $$ Bruker NMR JCAMP-DX V2.0
##DATA TYPE= NMR SPECTRUM
##DATA CLASS= NTUPLES
##ORIGIN= BRUKER
##OWNER= Administrator
$$ 1.72 TOPSPIN		Version 2.1
$$ 2012-04-11 03:02:02.187 -0500  Administrator@TOPSPIN
$$ Compression mode = diff/dup
##.OBSERVE FREQUENCY= 400.13188235
##.OBSERVE NUCLEUS= ^1H
##.ACQUISITION MODE= SIMULTANEOUS (DQD)
##.ACQUISITION SCHEME= undefined
##.AVERAGES= 8
##.DIGITISER RES= 22
##SPECTROMETER/DATA SYSTEM= spect
##.PULSE SEQUENCE= zg30
##.SOLVENT NAME= COFFEE_meoh
##.SHIFT REFERENCE= INTERNAL, COFFEE_meoh, 1, 14.98061
##AUDIT TRAIL= $$ (NUMBER, WHEN, WHO, WHERE, PROCESS, VERSION, WHAT)
$$ ##TITLE= Audit trail, TOPSPIN		Version 2.1
$$ ##JCAMPDX= 5.01
$$ ##ORIGIN= Bruker BioSpin GmbH
$$ ##OWNER= Administrator
$$ $$ C:\Bruker\TOPSPIN/data/COFFEE/nmr/AC1207_MCiAH12041_5946565_neomnvGzdM/10/pdata/1/auditp.txt
$$ ##AUDIT TRAIL=  $$ (NUMBER, WHEN, WHO, WHERE, PROCESS, VERSION, WHAT)
(   1,<2012-04-11 03:01:55.250 -0500>,<Administrator>,<TOPSPIN>,<go>,<TOPSPIN 2.1>,
      <created by zg
	started at 2012-04-11 03:00:48.281 -0500,
	POWCHK enabled, PULCHK disabled,
       configuration hash MD5:
       1A 1E CE 29 27 FD 77 03 67 4E F0 E3 C4 B2 CB 90
       data hash MD5: 64K
       89 7D 54 A5 80 DD 9F B7 A8 F3 7D 4D B1 31 94 3E>)
(   2,<2012-04-11 03:01:57.843 -0500>,<Administrator>,<TOPSPIN>,<proc1d>,<TOPSPIN 2.1>,
      <Start of raw data processing
       efp LB = 0 FT_mod = 6 PKNL = 1 PHC0 = 0 PHC1 = 0 SI = 32K 
       data hash MD5: 32K
       6A 98 93 EB C8 42 8F 55 82 77 2C 1B 41 BE 73 79>)
(   3,<2012-04-11 03:01:58.250 -0500>,<Administrator>,<TOPSPIN>,<proc1d>,<TOPSPIN 2.1>,
      <pk PHC0 = 209.1522 PHC1 = 0 
       data hash MD5: 32K
       CD FE F9 66 F1 6E E4 01 39 66 68 A2 A5 15 4F 59>)
(   4,<2012-04-11 03:01:58.375 -0500>,<Administrator>,<TOPSPIN>,<proc1d>,<TOPSPIN 2.1>,
      <abs ABSG = 1 
       data hash MD5: 32K
       01 00 99 CB 18 2A 2D C9 7F 8B 21 97 77 C1 9B 6E>)
(   5,<2012-04-11 03:01:58.390 -0500>,<Administrator>,<TOPSPIN>,<proc1d>,<TOPSPIN 2.1>,
      <abs ABSG = 2 
       data hash MD5: 32K
       21 E7 A2 19 10 C9 CD EC D0 66 0C B4 1C 97 11 EA>)
(   6,<2012-04-11 03:01:58.421 -0500>,<Administrator>,<TOPSPIN>,<proc1d>,<TOPSPIN 2.1>,
      <abs ABSG = 3 
       data hash MD5: 32K
       42 17 44 CD FD 67 69 0A DC 39 6F C6 B4 0C D4 5C>)
(   7,<2012-04-11 03:01:58.453 -0500>,<Administrator>,<TOPSPIN>,<proc1d>,<TOPSPIN 2.1>,
      <abs ABSG = 4 
       data hash MD5: 32K
       2C F2 9F 6C D9 37 A0 FB 34 AF A6 A6 DF 1E 0B 9E>)
(   8,<2012-04-11 03:01:58.484 -0500>,<Administrator>,<TOPSPIN>,<proc1d>,<TOPSPIN 2.1>,
      <abs ABSG = 5 
       data hash MD5: 32K
       6E F2 7C DA E0 AA F4 21 09 48 72 16 87 3C 59 11>)
$$ ##END=
$$ 
$$ $$ hash MD5
$$ $$ 59 F8 59 97 28 43 E2 90 00 BD F8 B2 D6 4C 7A 46
##$RELAX= 
##$RELAX= 
##$RELAX= 
##$RELAX= 
##$RELAX= 
##$RELAX= 
##$RELAX= 
$$ Bruker specific parameters
$$ --------------------------
$$ [...]
##$TP= (0..7)
150 150 150 150 150 150 150 150
##$TP07= 0
##$TPNAME0= <>
##$TPNAME1= <>
##$TPNAME2= <>
##$TPNAME3= <>
##$TPNAME4= <>
##$TPNAME5= <>
##$TPNAME6= <>
##$TPNAME7= <>
##$TPOAL= (0..7)
0.5 0.5 0.5 0.5 0.5 0.5 0.5 0.5
##$TPOFFS= (0..7)
0 0 0 0 0 0 0 0
##$TUNHIN= 0
##$TUNHOUT= 0
##$TUNXOUT= 0
##$USERA1= <user>
##$USERA2= <user>
##$USERA3= <user>
##$USERA4= <user>
##$USERA5= <user>
##$V9= 5
##$VALIST= <valist>
##$VCLIST= <CCCCCCCCCCCCCCC>
##$VD= 0
##$VDLIST= <DDDDDDDDDDDDDDD>
##$VPLIST= <PPPPPPPPPPPPPPP>
##$VTLIST= <TTTTTTTTTTTTTTT>
##$WBST= 1024
##$WBSW= 4
##$XGAIN= (0..3)
0 0 0 0
##$XL= 0
##$YL= 0
##$YMAX_a= 512274
##$YMIN_a= -642589
##$ZGOPTNS= <>
##$ZL1= 120
##$ZL2= 120
##$ZL3= 120
##$ZL4= 120
##$ABSF1= 14.98061
##$ABSF2= -5.57192
##$ABSG= 5
##$ABSL= 3
##$ALPHA= 0
##$AQORDER= 0
##$ASSFAC= 0
##$ASSFACI= 0
##$ASSFACX= 0
##$ASSWID= 0
##$AUNMP= <proc_prof1d_extract_pilot.lims>
##$AXLEFT= 0
##$AXNAME= <>
##$AXNUC= <1H>
##$AXRIGHT= 0
##$AXTYPE= 0
##$AXUNIT= <>
##$AZFE= 0.1
##$AZFW= 0.1
##$BCFW= 0
##$BC_mod= 0
##$BYTORDP= 0
##$COROFFS= 0
##$CY= 15
##$DATMOD= 1
##$DC= 0
##$DFILT= <>
##$DTYPP= 0
##$F1P= 0
##$F2P= 0
##$FCOR= 0.5
##$FTSIZE= 32768
##$FT_mod= 6
##$GAMMA= 0
##$GB= 0
##$INTBC= 1
##$INTSCL= 1
##$ISEN= 128
##$LB= 0
##$LEV0= 0
##$LPBIN= 0
##$MAXI= 10000
##$MC2= 0
##$MEAN= 0
##$ME_mod= 0
##$MI= 0
##$NCOEF= 0
##$NC_proc= -8
##$NLEV= 6
##$NOISF1= 0
##$NOISF2= 0
##$NSP= 0
##$NTH_PI= 0
##$NZP= 0
##$OFFSET= 14.98061
##$PC= 1
##$PHC0= 209.1522
##$PHC1= 0
##$PH_mod= 1
##$PKNL= yes
##$PPARMOD= 0
##$PPDIAG= 0
##$PPIPTYP= 0
##$PPMPNUM= 2147483647
##$PPRESOL= 1
##$PSCAL= 4
##$PSIGN= 0
##$PYNMP= <proc.py>
##$REVERSE= no
##$SF= 400.13
##$SI= 32768
##$SIGF1= 0
##$SIGF2= 0
##$SINO= 400
##$SIOLD= 32768
##$SPECTYP= <>
##$SREGLST= <1H.CDCl3>
##$SSB= 0
##$STSI= 32768
##$STSR= 0
##$SW_p= 8223.68421052632
##$SYMM= 0
##$S_DEV= 0
##$TDeff= 65536
##$TDoff= 0
##$TI= <>
##$TILT= no
##$TM1= 0
##$TM2= 0
##$TOPLEV= 0
##$USERP1= <user>
##$USERP2= <user>
##$USERP3= <user>
##$USERP4= <user>
##$USERP5= <user>
##$WDW= 1
##$XDIM= 32768
##$YMAX_p= 458723385
##$YMIN_p= -742989
##$CURPLOT= <Network HP LaserJet P1505>
##$CURPRIN= <$Network HP LaserJet P1505>
##$DFORMAT= <normdp>
##$LAYOUT= <+/1D_H.xwp>
##$LFORMAT= <normlp>
##$PFORMAT= <normpl>
##$SURQMSG= 1
$$ End of Bruker specific parameters
$$ ---------------------------------
##NTUPLES= NMR SPECTRUM
##VAR_NAME=  FREQUENCY,     SPECTRUM/REAL,   SPECTRUM/IMAG
##SYMBOL=    X,             R,               I
##VAR_TYPE=  INDEPENDENT,   DEPENDENT,       DEPENDENT
##VAR_FORM=  AFFN,          ASDF,            ASDF
##VAR_DIM=   32768,         32768,           32768
##UNITS=     HZ,            ARBITRARY UNITS, ARBITRARY UNITS
##FACTOR=    0.250966925370066, 1,           1
##FIRST=     8223.43324360095, -275670,      103565
##LAST=      0,             38703,           15395
##MIN=       0,             -742989,         0
##MAX=       8223.43324360095, 458723385,    0
$$ Real data points
##PAGE= N=1
##DATA TABLE= (X++(R..R)), XYDATA
$$ [...]
19472a61135A24928b02754h3967m1383r6485N5213C2734L8141b28812E608h1466
$$ -161135 124928 -202754 -83967 -125350 -221835 -166622 32734 70875 -228812 5608 -81466
19460A80372b11916h203n8963r5173f0293o9026k1860d9437m26381C8725j031
$$ 180372 -211916 -8203 -67166 -162339 -60293 -129319 -151179 -49437 -475818 38725 37694
19449C7694d3906j37202B1054Q9974b13653A25240b75334r474L5358a1226p6956
$$ 37694 -43906 -181108 21054 111028 -213653 125240 -275334 -284808 -249450 -11226 -88182
19438h8182a8637A26230d39508a76293N1297J9081j17882a9526n1620g692A13344
$$ -88182 -18637 126230 -439508 -176293 -124996 -105915 -223797 -19526 -71146 -7692 113344
19426a99267j71769a3580A62341a23585k86247A4010K5855b1366B54156A21195
$$ -199267 -371036 -13580 162341 -123585 -409832 14010 39865 -21366 254156 121195
19415A73497a37354M4845q5193f0702j83858G3423e701A87611I0947b51981Q467
$$ 173497 -137354 -92509 -177702 -60702 -244560 73423 -5701 187611 90947 -251981 -243514
19404b43514j57417a37021B07500b38672j43645a87930G7848H720J54794a17548
$$ -243514 -400931 -137021 207500 -238672 -382317 -187930 77848 8720 163514 -117548
19393a77022j30404J52500b467l45355C27368B9939L17344c55483A28763c11069
$$ -177022 -307426 -154926 -2467 -347822 327368 29939 347283 -355483 128763 -311069
19382b48567R8420F92c4839r4546q7737m3539a30105g112j33790l41505b05004
$$ -248567 -150147 692 -34839 -129385 -217122 -260661 -130105 -7112 -140902 -482407 -205004
19370A75649h2181A69758a35294A25913R9771L9433a6691k35710e1776l95018
$$ 175649 -82181 169758 -135294 125913 225684 265117 -16691 -252401 -51776 -446794
19360d46794P709g9478k9789A20656c28247C3045A064a61144C0412A259a94912
$$ -446794 -439085 -79478 -109267 120656 -328247 33045 1064 -161144 30412 1259 -194912
19348g37748b15552a4222B5802b14843L5633e5545j00324N5905r4519j84409a79445
$$ -737748 -215552 -14222 25802 -214843 -179210 -55545 -155869 -99964 -194483 -378892 -179445
19336I137K20391G3648b9413j91804B16877c15455P5192a4467n7260A09127K81217
$$ 9137 229528 73648 -29413 -221217 216877 -315455 -240263 -14467 -71727 109127 390344
19325C90344C4625d42498b12450R6542I3381l9752b57510E3181a07648j68587
$$ 390344 34625 -442498 -212450 -115908 93381 53629 -257510 53181 -107648 -276235
19315b76235R9151D831b18784i8079j11231i3102C5952f6039a8571r8176l8898
$$ -276235 -177084 4831 -218784 -98079 -209310 -93102 35952 -66039 -18571 -116747 -155645
19304a55645k1058C6976a9880a73k32356d5465o5239H7265h5107m2717L8053j86312
$$ -155645 -176703 36976 -19880 -173 -232529 -45465 -110704 87265 -85107 -127824 -89771 -276083
19292b76083J01709f1581k07816I6342C4117a42355l5905L6759A54886e7716k6367
$$ -276083 -174374 -61581 -269397 96342 34117 -142355 -178260 -141501 154886 -57716 -84083
19281h4083j16475G4031b95698A78992e4951E2763a20628j36190b7011l20395
$$ -84083 -200558 74031 -295698 178992 -54951 52763 -120628 -256818 -27011 -347406
19271c47406a33086a6412l9301r8647O2297j19303A61115f7221D6705a3517j71514
$$ -347406 -133086 -16412 -55713 -154360 -92063 -211366 161115 -67221 46705 -13517 -185031
19260a85031A31450D4133J02119D1012a07432o1182j82554a7849A2395J06428
$$ -185031 131450 44133 146252 41012 -107432 -168614 -351168 -17849 12395 118823
19250A18823J72447C4914M9351k1877h0824C9075c6909o6545p4753l78998c2283
$$ 118823 291270 34914 84265 62388 -80824 39075 -36909 -103454 -178207 -557205 -32283
19238b35744h9408A64594K17J71704d9860A8280a80028Q5752B99375e3967q694
$$ -235744 -89408 164594 164811 336515 -49860 18280 -180028 -94276 299375 -53967 -62661
19227f2661e616l30337R0624P9906j77646A23595a67027A64373a28943L2607l36165
$$ -62661 -5616 -335953 -245329 -165423 -343069 123595 -167027 164373 -128943 -96336 -432501
19216d32501h7356A20928b39617I89d6288k51122h6643H1964a23825n7335n4862
$$ -432501 -87356 120928 -239617 989 -46288 -297410 -86643 81964 -123825 -181160 -236022
19205b36022K5572Q2786G2785b37571B49273h7965C4743b25971a11146E3305d2378
$$ -236022 -210450 -127664 72785 -237571 249273 -87965 34743 -225971 -111146 53305 -42378
19193d59475B503K9451d1818j64524C42038i9651k09402d6303j98791g4597k94030
$$ -459475 2503 31954 -41818 -206342 342038 -99651 -309053 -46303 -245094 -74597 -368627
19182c68627A8029h1686c5193j60905l5907A4487b20376d0057F3717O7261b87758
$$ -368627 18029 -81686 -35193 -196098 -232005 14487 -220376 -40057 63717 130978 -287758
19170b88758B4773Q8140c87819b3933r9942b4826D25544b13155P7770m8249j28868
$$ -288758 24773 112913 -387819 -23933 -123875 -24826 425544 -213155 -135385 -183634 -312502
19159c12502e6166l17306a62821G7015d20099a60041k14900a73023A496g1431
$$ -312502 -56166 -373472 -162821 77015 -420099 -160041 -374941 -173023 1496 -71431
19148d89056f3605B8095c20483i4450L9079j20148Q6386b993B72841a48690p3508
$$ -489056 -63605 28095 -320483 -94450 -55371 -175519 -89133 -2993 272841 -148690 -222198
19137b22198I1784c52630B62330F0464J46340b16840j72200J65602g4711j32298
$$ -222198 91784 -352630 262330 60464 206804 -216840 -389040 -223438 -74711 -207009
19127b07009R6623j74057a39372a3850j53164O2216c0312m51022b9161F3526b07786
$$ -207009 -110386 -284443 -139372 -13850 -167014 -104798 -30312 -481334 -29161 63526 -207786
19115i1847l0635A60140k2556J9686a35837j44246A27833n7687f8071k2980l2682
$$ -91847 -122482 160140 137584 157270 -135837 -280083 127833 70146 -68071 -91051 -123733
19104a23733N9122l4491K2986A16349A9286a66214J0691e1998B68118J09771a36955
$$ -123733 -64611 -99102 -76116 116349 19286 -166214 -155523 -51998 268118 377889 -136955
19092A40678e78317H0137h8182j65697a26024j54006B5187b20414B83862j17594
$$ 140678 -578317 80137 -88182 -253879 -126024 -280030 25187 -220414 283862 166268
19082A66268k3880q714N3680b14308A3442a05439r2941O1628A5671M3906K00974
$$ 166268 142388 133674 187354 -214308 13442 -105439 -198380 -136752 15671 59577 260551
19071B60551i4724H824a16122A22012K787p763b06416M5975d0875j04074k71365
$$ 260551 -94724 8824 -116122 122012 124799 117036 -206416 -160441 -40875 -144949 -416314
19060d16314A39367R8780b5740A2214f3329j40026l367A2065J00617b4913k45488
$$ -416314 139367 238147 -25740 12214 -63329 -203355 -206722 12065 112682 -24913 -270401
19049b70401f425B59005a18822D8539b46196Q9072l7853i4443C824K5898b0252
$$ -270401 -6425 259005 -118822 48539 -246196 -157124 -194977 -94443 3824 29722 -20252
19037b31551g6246C7691a15516N719J9068b6365j41418O8920F7292p375Q2912
$$ -231551 -76246 37691 -115516 -109797 -90729 -26365 -167783 -98863 67292 59917 142829
19026A42829l9356a59254d5859j27221B45827c1202E9460b26109R5274D50286
$$ 142829 103473 -159254 -45859 -173080 245827 -31202 59460 -226109 -130835 450286
19015c8620D7262C625M8843a01026G7450b7447B67571a9055A14576a87775K8727
$$ -38620 47262 3625 52468 -101026 77450 -27447 267571 -19055 114576 -187775 -159048
19004a59048G025J23020R5138I4926i0220q9921d3448a2803j51874B54726r1921
$$ -159048 7025 130045 225183 94926 -90220 -180141 -43448 -12803 -164677 254726 162805
18993A62805m7770a97294N5115d184B75971m9897o7610C3630a46492C9250I463
$$ 162805 115035 -197294 -142179 -4184 275971 226074 158464 33630 -146492 39250 9463
18981B5436c551C10626b58529J12394a1998A48579l0596b84480O3352c3990B46253
$$ 25436 -3551 310626 -258529 -146135 -11998 148579 117983 -284480 -221128 -33990 246253
18969e3599k26225L4178N0419o3217J07649j02896b3521g974A49788a3508I027
$$ -53599 -279824 -245646 -195227 -258444 -150795 -253691 -23521 -7974 149788 -13508 9027
18957C75512K35289J00888c1965A84201D3626K3704b91543a01788c8601B78650
$$ 375512 610801 711689 -31965 184201 43626 67330 -291543 -101788 -38601 278650
18946A52095a19993M9120A69811e4184C01564a84985I5978e8151j19840B5427
$$ 152095 -119993 -70873 169811 -54184 301564 -184985 95978 -58151 -177991 25427
18935e53429a89225G3590b02380j04062A3396b89709a0734l0794A49161m5411
$$ -553429 -189225 73590 -202380 -306442 13396 -289709 -10734 -41528 149161 103750
18925A03750A8458b87406e9153k40827c2808A48541n6974h3728n3551j36987L5562
$$ 103750 18458 -287406 -59153 -299980 -32808 148541 91567 -83728 -137279 -274266 -238704
18914b38704a16019N4636C6301e0476E5055h5406l13531I2925a30343B27627d15547
$$ -238704 -116019 -61383 36301 -50476 55055 -85406 -398937 92925 -130343 227627 -415547
18902b5717D19275C7323i2229p922C5916M7130R1511J46114J78384J32131d8612
$$ -25717 419275 37323 -92229 -100151 35916 83046 174557 320671 499055 631186 -48612
18890B62658a0300p9517A81300f1849A37337c05722J39474C5522c41029a7521
$$ 262658 -10300 -89817 181300 -61849 137337 -305722 -166248 35522 -341029 -17521
18879A49822H233A934J22252h6548B7611h0587j36933j45859a49209c5333A18257
$$ 149822 8233 1934 124186 -86548 27611 -80587 -217520 -363379 -149209 -35333 118257
18867h5108D0776b50354K3649d7282l3524j78203J26267J1823H4524i1915k8640
$$ -85108 40776 -250354 -226705 -47282 -80806 -259009 -132742 -120919 84524 -91915 -120555
18856a20555r1079C0773b81702k20834B488a3073k13054J2980e1870j29821r5181
$$ -120555 -211634 30773 -281702 -502536 2488 -13073 -226127 -213147 -51870 -181691 -276872
18845b76872A80135o066a22387p3481o291P8194A56333E0084I187j276L569J3829
$$ -276872 180135 174069 -122387 -195868 -202159 -123965 156333 50084 9187 7911 11480 25309
18833B5309j0289a17145H4696a32225A84644H44N4577O1592a15233B24419m1423
$$ 25309 15020 -117145 84696 -132225 184644 844 55421 117013 -115233 224419 182996
18822A82996a22741p3977l03368a44478G5663g8107G7030J11873q7881c16522
$$ 182996 -122741 -196718 -500086 -144478 75663 -78107 77030 188903 101022 -316522
18811a05360R335o7864D3251c4073C59467a09989b8428A86344M0134I5458p416
$$ -105360 -96025 -163889 43251 -34073 359467 -109989 -28428 186344 226478 95458 88042
18800H8042a75130M365I0776a28217o9083N1976A91181b2264A62523f514j25577
$$ 88042 -175130 -170765 90776 -128217 -197300 -145324 191181 -22264 162523 -6514 -132091
18789a32091F2019k4258a63966e1700j52557f7841j46530G6934a22716b6851o7361
$$ -132091 62019 37761 -163966 -51700 -204257 -67841 -214371 76934 -122716 -26851 -94212
18778i4212E7614e3994G8295a28176E9257K92343a9661f881q1866K3085r5754
$$ -94212 57614 -53994 78295 -128176 59257 351600 -19661 -6881 -88747 -65662 -161416
18767a61416a2028o0783b2375r8211C32347f334l96122a07580j5302B18966g4408
$$ -161416 -12028 -72811 -22375 -120586 332347 -6334 -402456 -107580 -122882 218966 -74408
18755b11479B011b23085h8939G0505a27289n2534F4099h4434K6859j10618E6659
$$ -211479 2011 -223085 -88939 70505 -127289 -179823 64099 -84434 -57575 -168193 56659
18743a07838A6049R935M434a40774N3101o1168n0502O004B12212d90035g5952
$$ -107838 16049 25984 30418 -140774 -87673 -148841 -199343 -193339 212212 -490035 -75952
18731b47190C29595p8185h4816A35095i209I6594c03362a30123N2179B88826j989
$$ -247190 329595 251410 -84816 135095 -9209 96594 -303362 -130123 -77944 288826 286837
18720B86837c25505B064h5406d1147A0327a60918F7593c58494c5107j9263J5270
$$ 286837 -325505 2064 -85406 -41147 10327 -160918 67593 -358494 -35107 -54370 -39100
18709c9100A17190a03941k2242k30551A209c1858O342j39360d1052A50074b02730
$$ -39100 117190 -103941 -126183 -356734 1209 -31858 -25516 -164876 -41052 150074 -202730
18697d08997A9317c7877A68514A7532D43c93902B60643a69984c0303C15640g4694
$$ -408997 19317 -37877 168514 17532 443 -393902 260643 -169984 -30303 315640 -74694
18685H9185i9205A52009p3578a08524E2376i1914r3092P7178k02230d4209B07492
$$ 89185 -99205 152009 78431 -108524 52376 -91914 -185006 -107828 -310058 -44209 207492
18673A99565a25085a3701m7602k04180J26471l1621A21836d58876E600P2227b2627
$$ 199565 -125085 -13701 -61303 -265483 -139012 -170633 121836 -458876 5600 77827 -22627
18661c25511h6491I5178a54173A17515a60013j33303g2551j66257a2800k8215
$$ -325511 -86491 95178 -154173 117515 -160013 -293316 -72551 -238808 -12800 -41015
18651d1015A4495J95087b7701j03373k05365J38438B70403d5109j87749k48772
$$ -41015 14495 209582 -27701 -131074 -336439 -198001 270403 -45109 -232858 -481630
18641d81630A74851a8094G6265K08159b85433B30030r5327b57547d9332p0555
$$ -481630 174851 -18094 76265 284424 -285433 230030 134703 -257547 -49332 -119887
18631a19887A72510n207b30785O6754A61668F3156K98953a38693C6603j3177c11218
$$ -119887 172510 167303 -230785 -164031 161668 63156 362109 -138693 36603 23426 -311218
18619a6443j58564k59211B67419b04416A44242E1234g4614E0577a86947E4493
$$ -16443 -175007 -434218 267419 -204416 144242 51234 -74614 50577 -186947 54493
18608c2281j99790f4600R833j35996L8413J3243j83619R7219d9155j39875g3259
$$ -32281 -232071 -64600 -54767 -190763 -152350 -139107 -322726 -225507 -49155 -189030 -73259
18596d28553a77312f5843C9424J51609B2048b1959A85104h8793A57254m3371a66603
$$ -428553 -177312 -65843 39424 191033 22048 -21959 185104 -88793 157254 113883 -166603
18584A81265h4176k0115A12721O1115P6397a40741N7916G132K63807b17787N0550
$$ 181265 -84176 -104291 112721 173836 250233 -140741 -82825 7132 270939 -217787 -167237
18573a67237m0481k07470Q6058a55194j98942c6281n1271b6184j48892P7815c3262
$$ -167237 -207718 -415188 -329130 -155194 -354136 -36281 -87552 -26184 -175076 -97261 -33262
18561F325M555f7747j48058F3554c3661B72226e9258A22899d861l6281A29181
$$ 6325 10880 -67747 -215805 63554 -33661 272226 -59258 122899 -4861 -41142 129181
18549h5005H3373a38546A41843f6778p7918H5020J50583H4446f7738K1033A06643
$$ -85005 83373 -138546 141843 -66778 -144696 85020 235603 84446 -67738 -46705 106643
18537a05393o6009M6559m7582B3086c32226G9221k1537b0419j18127q3392J06304
$$ -105393 -171402 -124843 -172425 23086 -332226 79221 57684 -20419 -138546 -221938 -115634
18526a15634K015l61324a11703N0013A93170a87075C04907B1705a24673k4431
$$ -115634 -113619 -474943 -111703 -61690 193170 -187075 304907 21705 -124673 -149104
18516a49104N7196C6561J28598D1571a17769q883M895A75032h6063j32490q8000
$$ -149104 -91908 36561 165159 41571 -117769 -126652 -121757 175032 -86063 -218553 -306553
18505c06553h571A12208h1945p1655c8565j63951B08279b59979i4573m3301n5744
$$ -306553 -8571 112208 -81945 -153600 -38565 -202516 208279 -259979 -94573 -137874 -193618
18494a93618f5951K1175l6872A90163m6064K0307F0233a12984a3242j48429O2050
$$ -193618 -65951 -44776 -81648 190163 144099 164406 60233 -112984 -13242 -161671 -99621
18483i9621l38569A49239G1827J0933b03046B39748g9427q1183A18254b10823
$$ -99621 -438190 149239 71827 82760 -203046 239748 -79427 -160610 118254 -210823
18472A45347B4029K6460g4900a5673j8661j16934A20312L981M6959M866K9706
$$ 145347 24029 50489 -74900 -15673 -34334 -151268 120312 124293 171252 176118 205824
18461B05824k578a98436f4117j7229J7231K9846o6034C03758d219k17783a03637
$$ 205824 203246 -198436 -64117 -81346 -64115 -34269 -100303 303758 -4219 -222002 -103637
18449h3898B5629J07363a27741o15248A07187L1462a39821b0507F1551J85529
$$ -83898 25629 132992 -127741 -742989 107187 138649 -139821 -20507 61551 247080
18439B47080A853a20915p0751h4825G6564a54139k17325F7235R200c3674J3472
$$ 247080 1853 -120915 -191666 -84825 76564 -154139 -371464 67235 76435 -33674 -20202
18428b0202A12024a88644E2869g6413k04120h2306I2242m3277A8111J41400n4090
$$ -20202 112024 -188644 52869 -76413 -280533 -82306 92242 48965 18111 159511 105421
18417A05421R9650f9556k61197e7790D2609r483b6404j50498L0035k43729B06477
$$ 105421 205071 -69556 -330753 -57790 42609 33126 -26404 -176902 -146867 -390596 206477
18405B8446K6876a28728F7878K22316j07345d3397D22883f87A01467a52062f0269
$$ 28446 55322 -128728 67878 290194 182849 -43397 422883 -687 101467 -152062 -60269
18393G2574a93254A60664N5757a90484j45330B43821d84056J92671a420k7251
$$ 72574 -193254 160664 216421 -190484 -335814 243821 -484056 -291385 -1420 -28671
18383b8671A58480J1537q2150R879a78984b968k46447l1553F295a11778B86161
$$ -28671 158480 170017 87867 97746 -178984 -2968 -249415 -280968 6295 -111778 286161
18371D6291K6303b02475A45534k406C1255a22613m7737M8520e0443f959B8304
$$ 46291 72594 -202475 145534 143128 31255 -122613 -170350 -121830 -50443 -6959 28304
18359a06539A47029k382B7388L9292N3104n063a46866M043B45047b10073d2710
$$ -106539 147029 144647 27388 66680 119784 114721 -146866 -142823 245047 -210073 -42710
18347E9787a03341A49138l1726h9983M1234n0894d0249k37755J22035A59714R1658
$$ 59787 -103341 149138 117412 -89983 -48749 -99643 -40249 -278004 -155969 159714 251372
18336B51372b08801a00926K9777A72790b41140b766C21015a28091o8437N7080
$$ 251372 -208801 -100926 -71149 172790 -241140 -2766 321015 -128091 -196528 -139448
18326a39448I237a49431N3732l619m0083F1444e6362j63212g612A04753B3753
$$ -139448 9237 -149431 -95699 -99318 -139401 61444 -56362 -219574 -7612 104753 23753
18314C6681f8652k5609C7879b11432I0944a05270M4156k40103A02293g384j35890
$$ 36681 -68652 -94261 37879 -211432 90944 -105270 -61114 -301217 102293 -7384 -143274
18303a43274o1033a1442j98068A21828J18764E1163b7794m439A07837c9579A21965
$$ -143274 -204307 -11442 -209510 121828 240592 51163 -27794 -32233 107837 -39579 121965
18291a00956F5667R2279d7256A05545a37439C04212I6525M219G676i3232m8961
$$ -100956 65667 157946 -47256 105545 -137439 304212 96525 100744 7676 -93232 -142193
18280a42193j50597A78565L41a61322b3055j65320e1119E7403Q4758A7831b61898
$$ -142193 -292790 178565 178906 -161322 -23055 -188375 -51119 57403 142161 17831 -261898
18268E6866b90471A50850E7601L30627A45736e1506m35481B01878J6733c0871
$$ 56866 -290471 150850 57601 388228 145736 -51506 -486987 201878 218611 -30871
18257B87344h8882g931A96003a59905n2686B59534C8118K02134b25114A68118
$$ 287344 -88882 -7931 196003 -159905 -212591 259534 38118 240252 -225114 168118
18246d44601a863j89663o8749q2507J64912J1302C98882H4620K799P5174a49818
$$ -444601 -1863 -191526 -260275 -342782 -177870 -166568 398882 84620 87419 162593 -149818
18234a80833G4497J3945J10169q0594d5167j72244R8246a4298n7765j16418C038
$$ -180833 74497 88442 198611 118017 -45167 -217411 -119165 -14298 -72063 -188481 3038
18222i1175K7494A84852a21093a9457l30905e576n5327j0851k7578n5126D6935
$$ -91175 -63681 184852 -121093 -19457 -350362 -5576 -60903 -71754 -99332 -154458 46935
18210a18357j02600C1727H568J76262k609c29054E5821M0127b95179B11774G5436
$$ -118357 -220957 31727 8568 184830 182221 -329054 55821 95948 -295179 211774 75436
18198a38380H9790R3030c4377l1846H152Q4936k1491c24959H6403h0779A0832
$$ -138380 89790 182820 -34377 -66223 8152 93088 71597 -324959 86403 -80779 10832
18186C1742K13359d235k25428A02629a91333A38087a5690j37372O2923o2505A65103
$$ 31742 245101 -4235 -229663 102629 -191333 138087 -15690 -153062 -90139 -152644 165103
18174H478K53256b28759k0878E9975l421j2746b25782c1238r3736A36327J9062
$$ 8478 261734 -228759 -249637 59975 56554 43808 -225782 -31238 -124974 136327 155389
18163A55389f9919k30922A10442l3279B7193b40513A04412b37928f5993C24723
$$ 155389 -69919 -300841 110442 77163 27193 -240513 104412 -237928 -65993 324723
18152B64346b31124r6530G3176b1987j16365f5891A52422a37762B32507e14383
$$ 264346 -231124 -327654 73176 -21987 -138352 -65891 152422 -137762 232507 -514383
18141f42390i2653j29467c8416J3781A22882N325b97413H8008h5023B69981b53660
$$ -642390 -92653 -222120 -38416 -24635 122882 128207 -297413 88008 -85023 269981 -253660
18129b12291a5588m4235k57065h5549H3173b30612F2991f8042E7974J75220H5788
$$ -212291 -15588 -59823 -316888 -85549 83173 -230612 62991 -68042 57974 233194 85788
18117C92644A53909J1479B6305d13655A281a08990A91653a10501C4531O5696J04913
$$ 392644 153909 165388 26305 -413655 1281 -108990 191653 -110501 34531 100227 205140
18106B05140d30255A33988a37500B13802I994b36136b1825m01547A0163J07633
$$ 205140 -430255 133988 -137500 213802 9994 -236136 -21825 -423372 10163 117796
18096A17796e7247h863E7886h8177j84375A31422E9474a08833m1505b1463A48252
$$ 117796 -57247 -8863 57886 -88177 -272552 131422 59474 -108833 -150338 -21463 148252
18084A47128A0344J12394l2227a65883B37855i1335F3854F27O6776K1607l2381
$$ 147128 10344 122738 90511 -165883 237855 -91335 63854 627 67403 89010 56629
18073E6629H243M6079g4545A14818H403J18870b3717A90090F1205P4331g5203
$$ 56629 8243 54322 -74545 114818 8403 127273 -23717 190090 61205 135536 -75203
18061b16565A11914f51042c03269b1867G4239a21307L2284j21693k2384C8252
$$ -216565 111914 -651042 -303269 -21867 74239 -121307 -89023 -210716 -233100 38252
18050I983L017J05990k4640a71225h254k50764A42582O1478A6397a83544D8951
$$ 9983 13000 118990 94350 -171225 -8254 -259018 142582 204060 16397 -183544 48951
18038d7993k48589a31105k73325a27366m379d8906A1821a18511B3896J79638f9563
$$ -47993 -296582 -131105 -404430 -127366 -131745 -48906 11821 -118511 23896 203534 -69563
18026B80413B7876K65a75769G2029a33438d3337k83744A31768b14991d536k28208
$$ 280413 27876 28141 -175769 72029 -133438 -43337 -327081 131768 -214991 -4536 -232744
18015b32744E9241a69423k3765M8478f4163k39892h8824A0749J41696h6428B69895
$$ -232744 59241 -169423 -193188 -144710 -64163 -304055 -88824 10749 152445 -86428 269895
18003A39026j1832b58231A71399m2507h6367A27475c029q888l1047H4965J04700
$$ 139026 127194 -258231 171399 128892 -86367 127475 -3029 -11917 -42964 84965 189665
17992A89665g0044A43918d28485A9562e043Q34n5701a7872k58A73330G699d00355
$$ 189665 -70044 143918 -428485 19562 -5043 -4209 -59910 -17872 -18130 173330 7699 -400355
17979C5220a75828c5941j25968E223P2852C3414d5257B08166f4966q1513F6449
$$ 35220 -175828 -35941 -161909 5223 78075 33414 -45257 208166 -64966 -146479 66449
17967b49759o9369E4050K04607B3056e3414D8953c0350q8727o7990A69437c07324
$$ -249759 -319128 54050 258657 23056 -53414 48953 -30350 -119077 -187067 169437 -307324
17955B95686c4761j48305H9500K14544E0541a15779B7610b0909L920B47678a97294
$$ 295686 -34761 -183066 89500 304044 50541 -115779 27610 -20909 -16989 247678 -197294
17943A06772i6647p952C2564R3989i336k42497F956f1908B17665b52745h7573
$$ 106772 -96647 -104599 32564 126553 -9336 -251833 6956 -61908 217665 -252745 -87573
17931a05865B74744j34060a24265A12723a58395A42393K4110d1852o6213L2523
$$ -105865 274744 140684 -124265 112723 -158395 142393 166503 -41852 -108065 -75542
17921g5542a3470B50730c28431i6695a4567A86081c7158A4775J23126c13403C02248
$$ -75542 -13470 250730 -328431 -96695 -14567 186081 -37158 14775 137901 -313403 302248
17909D2495L08324a03132A02145B9912J50335P2737j26078a73464L1506A12015
$$ 42495 350819 -103132 102145 29912 180247 252984 126906 -173464 -141958 112015
17898A95571J83133q1718h1665B11766a03454l701D42554a30080e8056A10252
$$ 195571 378704 296986 -81665 211766 -103454 -107155 442554 -130080 -58056 110252
17887B604c87364f213B44114J289I7569D7310K30278O4416k2419o6117A01041
$$ 2604 -387364 -6213 244114 245403 97569 47310 277588 342004 319585 253468 101041
17875a31229C25946e2725A70914a57139A06627J5846h2748B57824c8389B85417
$$ -131229 325946 -52725 170914 -157139 106627 122473 -82748 257824 -38389 285417
17864a5222A58801a16875B84272b6849l278q0033d3332q3423B70164n9982b28067
$$ -15222 158801 -116875 284272 -26849 -30127 -110160 -43332 -126755 270164 210182 -228067
17852a20481A30020R5356j2697Q8407c9826D5678J06244d7925J6967j20976A08084
$$ -120481 130020 225376 212679 301086 -39826 45678 151922 -47925 -30958 -151934 108084
17840A95524B4898j0456g2114I8225B5836g5562I9194a02383p4154A65328a63504
$$ 195524 24898 14442 -72114 98225 25836 -75562 99194 -102383 -176537 165328 -163504
17828A11715a64154N2351A09064J6431M3579m9397a45125I0068e1651k2570j48364
$$ 111715 -164154 -111803 109064 125495 169074 119677 -145125 90068 -51651 -74221 -222585
17817b22585m3614a09151A4918a92729B81250a19696A00468Q4153L0965a03438
$$ -222585 -266199 -109151 14918 -192729 281250 -119696 100468 184621 215586 -103438
17806c3147j05024A72326d6797D49299A8921K44233b24245A73429b6545J0685
$$ -33147 -138171 172326 -46797 449299 18921 263154 -224245 173429 -26545 -15860
17796a5860k4272C6298c39126g3495F4921a54951G5464a6939j88290c2336j58907
$$ -15860 -40132 36298 -339126 -73495 64921 -154951 75464 -16939 -205229 -32336 -191243
17785a91243c6456H8066J15335b52279F8283P7768a13722N3719E6007f3093A42851
$$ -191243 -36456 88066 203401 -252279 68283 146051 -113722 -60003 56007 -63093 142851
17773C51992c39989B8126a12694a7321H4949a93694j09750A30731K93037c73871
$$ 351992 -339989 28126 -112694 -17321 84949 -193694 -303444 130731 423768 -373871
17762H0188M3752A6737b35011i1785E0844K0340M5207B7687N338a59684C05614
$$ 80188 123940 16737 -235011 -91785 50844 71184 116391 27687 33025 -159684 305614
17750a39610O757A50460J87821A31294D9364j3912a12344K4505M2351A88962a07976
$$ -139610 -132853 150460 338281 131294 49364 35452 -112344 -87839 -45488 188962 -107976
17738a24927B03819f3974j63540A55101K07639o5512P0168b819H597J88510b40723
$$ -124927 203819 -63974 -227514 155101 362740 297228 367396 -2819 8597 197107 -240723
17726G308M854Q4291h5163A08747M2498J9512a98064I6242K8695b2916j1934H5771
$$ 7308 12162 96453 -85163 108747 151245 170757 -198064 96242 124937 -22916 -34850 85771
17713f9709A91208n6795A4669a41086A89233n6159I869f3902j10438a3147B67935
$$ -69709 191208 134413 14669 -141086 189233 133074 9869 -63902 -174340 -13147 267935
17701A40248J75440h3994a6112j29022A34403r899a13250A42187E8252K9295c4270
$$ 140248 315688 -83994 -16112 -145134 134403 124504 -113250 142187 58252 87547 -34270
17689C41205A1617M2545a01513n1701E5155b06978B45520r270J29693b40504A50616
$$ 341205 11617 54162 -101513 -153214 55155 -206978 245520 236250 365943 -240504 150616
17677B09659d2582C51937j37765i862A5403L13685J8284m6006a84170E1614N4842
$$ 209659 -42582 351937 214172 -9862 15403 329088 347372 301366 -184170 51614 106456
17666A06456a42938B87909n2396l8997f9408A15936K13290A43037o738c7732c492
$$ 106456 -142938 287909 235513 196516 -69408 115936 329226 143037 136299 -37732 -3492
17654A3782d5786m1181B25869c24917A69409K4251M3266a42118A42535M0537a84502
$$ 13782 -45786 -86967 225869 -324917 169409 193660 236926 -142118 142535 183072 -184502
17642C8366P3748l6475Q1879J48914N850h5280E9072a81426C91793A47181p235
$$ 38366 112114 75639 157518 306432 312282 -85280 59072 -181426 391793 147181 139946
17631A39946k742f9950q8614A32621b6725j29037c4729C027K26022E316K00857
$$ 139946 137204 -69950 -158564 132621 -26725 -155762 -34729 3027 229049 5316 206173
17620B06173A00289J02339o5023J76130A32331R1689n2303b81271A2194K03331
$$ 206173 100289 202628 137605 313735 132331 224020 171717 -281271 12194 215525
17610B15525K32139k19218J51120i3632C75326b59407A36996J3307F1527J50443
$$ 215525 447664 228446 379566 -93632 375326 -259407 136996 150303 61527 211970
17600B11970h1597H4334m1830L78240e059I2768b1612D7910J80462H3671i3478
$$ 211970 -81597 84334 42504 420744 -5059 92768 -21612 47910 228372 83671 -93478
17588C20182j59989J03005K6750I9138e2008C63252D296a40389B68089J58944
$$ 320182 160193 263198 289948 99138 -52008 363252 4296 -140389 268089 427033
17578D27033D7919h0293C3298a66615A89172M6422Q8366H8978A5758K07013l5987
$$ 427033 47919 -80293 33298 -166615 189172 235594 323960 88978 15758 222771 186784
17567A86784e41k53970A20994d57357C44601A65221M2810a80972G3111L85734
$$ 186784 -541 -254511 120994 -457357 344601 165221 208031 -180972 73111 458845
17557D58845H8263J13678N5289H2703K20770A364J25675M2797J00103E2767a23919
$$ 458845 88263 201941 257230 82703 303473 1364 127039 169836 269939 52767 -123919
17545d1195B20569J186d14372A21824j4974j6406b76873h6568A65284K5237L95917
$$ -41195 220569 221755 -414372 121824 106850 90444 -276873 -86568 165284 190521 586438
17534E86438A48634K93300F4253J9870P1553N2804L16759A89115M9895J05604
$$ 586438 148634 441934 64253 84123 155676 208480 525239 189115 239010 344614
17524C44614j00690k3133K16042j36805j27237J6821j6420K32373J09904k15179
$$ 344614 243924 220791 436833 300028 172791 189612 173192 405565 515469 300290
17514C00290j07216M66355j63375J87779L12709m02968K41491j63091l21185j61674
$$ 300290 193074 659429 496054 683833 996542 593574 835065 671974 350789 189115
17504A89115n7281K83824K13200j30156J27436k47094J33852R172L03418r3806
$$ 189115 131834 415658 628858 498702 626138 379044 512896 522068 825486 731680
17494G31680Q3753j8686R6104k53198C09863K22163j73942L9319I339K57865R0118
$$ 731680 815433 796747 892851 639653 309863 532026 358084 397403 9339 267204 357322
17483C57322Q0831K9701d2922B48700O7782d9274B8669f3986D79955j88431o130
$$ 357322 438153 467854 -42922 248700 316482 -49274 28669 -63986 479955 291524 285394
17472B85394j38489J97555N8169A18155J45216N8694r9665K30962m314G6054L80158
$$ 285394 146905 344460 402629 118155 263371 322065 222400 453362 449048 76054 456212
17461D56212A43032J63848p0622J17917A24555j020m0645C6739J15749K92727
$$ 456212 143032 306880 236258 354175 124555 123535 82890 36739 152488 445215
17451D45215j03768J9552A10675E2992J78951B9461K20635c086B6441K39374J95600
$$ 445215 341447 360999 110675 52992 231943 29461 250096 -3086 26441 265815 461415
17440D61415k23256K15498q5232J22249B07513J86863L0892q5526j25303K1066
$$ 461415 238159 453657 368425 490674 207513 394376 425268 339742 214439 235505
17430B35505K47815B14479n468J87786K39770P0853a3069B07973L40659j44995
$$ 235505 483320 214479 209011 396797 636567 707420 -13069 207973 548632 403637
17420D03637j21739F4412R5728J91947d8355D25403A77301L1200c5411B53895
$$ 403637 281898 64412 160140 352087 -48355 425403 177301 208501 -35411 253895
17409C08909K28942A55685K3330d6355E157N00719A98151l274J4732J07415K43011
$$ 308909 537851 155685 179015 -46355 5157 505876 198151 194877 209609 317024 560035
17398E60035j97319G5301Q3306J34543k0576n7046N3736P4335H3384R9432a18356
$$ 560035 362716 75301 158607 293150 272574 215528 269264 343599 83384 182816 -118356
17386g9847D15957f3958B80509j5392F8375M17360j82140E9255b8098B65142b29377
$$ -79847 415957 -63958 280509 265117 68375 485735 303595 59255 -28098 265142 -229377
17374A52603J50988d490B41907A15944K30410A54069K13117j43319D5148K11912
$$ 152603 303591 -4490 241907 115944 346354 154069 367186 223867 45148 257060
17364B57060J9190l727j09125k3873L16500E6726J72682P2695J9422o5869J85438
$$ 257060 276250 272523 163398 139525 456025 56726 229408 302103 321525 255656 441094
17353D41094F2978M77027n6572j42516G6990K26745r2218e315l6494B30132b6143
$$ 441094 62978 540005 483433 340917 76990 303735 211517 -5315 -41809 230132 -26143
17341a63105B80156l1048J82826j74547K0081F4985a41174B1896M75935j84987
$$ -163105 280156 249108 431934 257387 277468 64985 -141174 21896 497831 312844
17331C12844A04226L46072B13787L85693A670L25689m8818K46845A42529E7047
$$ 312844 104226 450298 213787 599480 1670 327359 278541 525386 142529 57047
17320D69378j43547q5605k3486N5567M87678A1434K51102r3189R6676M7173n8497
$$ 469378 325831 240226 216740 272307 759985 11434 262536 169347 266023 313196 254699
17309B54699p8401H909L63069k247A35124J68082Q9410D3797a42871C32407j10488
$$ 254699 176298 8909 371978 369731 135124 303206 392616 43797 -142871 332407 221919
17298B21919c0451E34629k61444r6939p7905P3241J27187a7383D34509R9483B65372
$$ 221919 -30451 534629 273185 176246 98341 171582 298769 -17383 434509 533992 265372
17286D32094G053M39525l389r6235m8899R6738m3657q7963B5712a01256D36981
$$ 432094 7053 446578 443189 346954 298055 394793 351136 263173 25712 -101256 436981
17274D16963J65113j00677j20682N532j21449J07382j59520L52201j96066D4542
$$ 416963 582076 481399 360717 366249 244800 352182 192662 544863 348797 44542
17263H5510J5862L74737A83652l7359J0767J14800q1588q7574K38184A35684K35867
$$ 85510 101372 476109 183652 146293 157060 271860 190272 102698 340882 135684 371551
17252C71551A50842J24847L04788A93362J86743A88849J72163O1693N8932A29214
$$ 371551 150842 275689 580477 193362 380105 188849 361012 422705 481637 129214
17241C34672j57955K64530j6240j86600J10954K47935R8591k53849q8491J44061
$$ 334672 176717 441247 425007 238407 349361 597296 695887 442038 353547 497608
17231D97608k08284J54711B15110L50044k82105m1923K10482f9627A53554J13629
$$ 497608 289324 444035 215110 565154 283049 241126 451608 -69627 153554 267183
17221B67183A20302J97319J13396F799L67340j21360J84989Q1174k32296J74406
$$ 267183 120302 317621 431017 6799 374139 252779 437768 518942 286646 461052
17211D61052j66038K30729J1365j91456p042o0711k2717m860L509K02983M2223
$$ 461052 295014 525743 537108 345652 338610 277899 255182 250322 253831 456814 499037
17200D99037B03662J56818J33312P5666j45625q2871j21485F0796M35475l5048
$$ 499037 203662 360480 493792 569458 423833 340962 219477 60796 496271 461223
17190D61223N4331J856m7579J94991B16624L9263b5857F95399k67178P978j01336
$$ 461223 515554 517410 469831 664822 216624 255887 -25857 695399 428221 436199 334863
17179C34863L3244o710Q1147m1826A61640R9589p6129N15545k31772O4473j09680
$$ 334863 368107 361397 442544 400718 161640 261229 185100 700645 468873 533346 423666
17168D23666R0163K78258B40104K25482B09525J25141J89604Q1934j35546P0989
$$ 423666 513829 792087 240104 465586 209525 334666 524270 606204 470658 541647
17158E41647J62712C11992L98400j37953J24547j69674j29779P7429J63197j65797
$$ 541647 704359 311992 710392 572439 696986 527312 397533 474962 638159 472362
17148D72362L10470C73756r6706K62238Q1245l8774B74311K22747r5599J83865
$$ 472362 782832 373756 277050 539288 620533 581759 274311 497058 401459 585324
17138E85324J1360j67555K790k13200M10639k26771O9655Q3125M6375o0504j04970
$$ 585324 596684 429129 431919 218719 629358 402587 472242 555367 601742 541238 436268
17127D36268p6177L65517k09988j3882J53000k86325K24544P3073m4138C01418
$$ 436268 360091 725608 515620 501738 654738 368413 592957 666030 621892 301418
17116F57380j42516k0346r871q6029M3025j8209K49691j6504k02501r5206K16426
$$ 657380 514864 494518 484647 398618 441643 423434 673125 656621 454120 358914 575340
17105E75340J09141k74637m5359j32876K41659J52011l6688L30432D38633J87895
$$ 575340 684481 409844 364485 231609 473268 625279 588591 919023 438633 626528
17095F26528C08037L35622B25704R3761M03477l39934p141L91086j22683o5473
$$ 626528 308037 643659 225704 319465 722942 383008 375867 766953 644270 578797
17085E78797k48094L95059j37459K92505J3024k26090J18308r5299q6652L21358
$$ 578797 330703 725762 588303 880808 893832 667742 786050 690751 604099 925457
17075I25457C85169L98412j73621K51045j91441O1861M9844K0198l09876r3153
$$ 925457 385169 783581 609960 861005 669564 731425 781269 801467 491591 398438
17065C98438M14772M3803m01705J50454J34448L18599k44606r3410o1810J93110
$$ 398438 813210 857013 455308 605762 740210 1058809 814203 720793 658983 852093
17055H52093j22330l0237j46477L08708k23193K74975j97960J07531o9431J37326
$$ 852093 729763 699526 553049 861757 638564 913539 715579 823110 753679 891005
17045H91005j22045o8888J75496O971K3574l69034L43469k46310J44492j028M98381
$$ 891005 768960 700072 875568 882539 906113 537079 880548 634238 778730 777702 1276083
17034A276083n84809N24223l12082R0063k46965J9070J35146k18643L85216J21154
$$ 1276083 691274 1215497 903415 993478 746513 765583 900729 682086 1067302 1188456
17024A188456l28333J73699j87475j16937N02676m66929R9081k40259O32941j33718
$$ 1188456 860123 1033822 846347 729410 1232086 765157 864238 623979 1256920 1123202
17014A123202l95446R1863J79801J12135o9800Q8112k50131Q4694j78919O46982
$$ 1123202 727756 819619 999420 1111555 1041755 1129867 879736 964430 785511 1432493
17004A432493m24471k09155K56612l6133K17962Q4107m97582K33017j41606J74659
$$ 1432493 1008022 798867 1055479 1019346 1237308 1321415 823833 1056850 915244 1089903
16994A089903j47870K38792p6105J64760m28647J95175k8506p6765N71661k02187
$$ 1089903 942033 1180825 1104720 1269480 840833 1036008 1007502 930737 1502398 1300211
16984A300211j18448L07733m41457J86577j73578K87684j17435K08010k56792
$$ 1300211 1181763 1489496 1048039 1234616 1061038 1348722 1231287 1439297 1182505
16975A182505J15072j91209J4186J98766j53655K17610m5406K19016l41830m4899
$$ 1182505 1297577 1106368 1120554 1319320 1165665 1383275 1337869 1556885 1215055 1170156
16965A170156K04338L9906O9839j60680L52844m14236Q7988L86421j99193Q8962
$$ 1170156 1374494 1414400 1484239 1323559 1676403 1262167 1350155 1736576 1537383 1626345
16955A626345L1390l0401J21661j44132N2442l37523K59881j4121k18286J23103
$$ 1626345 1657735 1627334 1748995 1604863 1657305 1319782 1579663 1565542 1347256 1470359
16945A470359J60407K63633K4739l83115J93219j04545l13551L15182J30988j20246
$$ 1470359 1630766 1894399 1919138 1536023 1729242 1624697 1311146 1626328 1757316 1637070
16935A637070j74071L07326J46985k72417L96045j42853o4173Q4225K32401m79792
$$ 1637070 1462999 1770325 1917310 1644893 2040938 1898085 1833912 1918137 2150538 1670746
16925A670746M9658k5501K23379j7148J86223j10388o0136J84746j51418Q3416
$$ 1670746 1720404 1694903 1918282 1901134 2087357 1976969 1916833 2101579 1950161 2033577
16915B033577j46736K11504J81279J3709l864n787j25299J44314k92642Q3662
$$ 2033577 1886841 2098345 2279624 2293333 2289469 2283682 2158383 2302697 2010055 2093717
16905B093717L18480j31136Q9932p4012L31281k97219K30875N222K38464l69432
$$ 2093717 2412197 2281061 2370993 2296981 2628262 2331043 2561918 2567140 2805604 2436172
16895B436172L97593k54803J12832J33506j86756L3322M4495M6199k82128M21304
$$ 2436172 2833765 2578962 2691794 2825300 2638544 2671866 2716361 2762560 2480432 2901736
16885B901736J30633Q7080l16704J57021j71739K34479J27072j09660K7942m7357
$$ 2901736 3032369 3119449 2802745 2959766 2788027 3022506 3149578 3039918 3067860 3020503
16875C020503K87169J99572l11205J24349N0654j951j70526p86K64415M1602J25022
$$ 3020503 3307672 3507244 3196039 3320388 3371042 3369091 3198565 3197779 3462194 3503796 3628818
16864C628818M9771R9484k83999M01766J8605J4417J15248k65861N41633q5256
$$ 3628818 3678589 3778073 3494074 3895840 3914445 3928862 4044110 3778249 4319882 4234626
16854D234626j09998K05759k6490p8963K37564m09745K02308J52137K88104q535
$$ 4234626 4124628 4330387 4303897 4224934 4462498 4052753 4255061 4407198 4695302 4686767
16844D686767L5904K36720q7773L51496l75J45238m46793N02092j26401K53051
$$ 4686767 4722671 4959391 4871618 5223114 5222739 5367977 4921184 5423276 5296875 5549926
16834E549926k39439K02295J78332R7085P210k4118K35820J14348M25977O5744
$$ 5549926 5310487 5512782 5691114 5788199 5795409 5771291 6007111 6121459 6547436 6613180
16824F613180k58093J29406K76551j6311L90914k87539M51950K94633k00482j5089
$$ 6613180 6355087 6484493 6761044 6744733 7135647 6848108 7300058 7594691 7394209 7379120
16814G379120K28341J95154j39192N47634j3806J94791K94269J34124N5975K35691
$$ 7379120 7607461 7802615 7663423 8211057 8197251 8392042 8686311 8820435 8876410 9112101
16804I112101K02474J1183J81919J52023L65205o6378L86276K14706O63695k25348
$$ 9112101 9314575 9325758 9507677 9659700 10024905 9958527 10344803 10559509 11223204 10997856
16794A0997856K49300N69827q7466L37717M5557K63472M92174K83006K12709M68686
$$ 10997856 11247156 11816983 11729517 12067234 12112791 12376263 12868437 13151443 13364152 13832838
16784A3832838L30356J34850P07156L4617L08948P50899L55188M5889O84642K85439
$$ 13832838 14163194 14298044 15005200 15039817 15348765 16099664 16454852 16500741 17185383 17470822
16774A7470822O90914J34547P58623Q2478J008538M67627L33597P24617P54606
$$ 17470822 18161736 18296283 19054906 19137384 20145922 20613549 20947146 21671763 22426369
16765B2426369O01270Q69233P43384M40919N99878P91690P83335J077208R00541
$$ 22426369 23027639 23896872 24640256 25081175 25681053 26472743 27256078 28333286 29233827
16756B9233827N84932R78162J079244J238366J113105J066164J178794J241274
$$ 29233827 29818759 30796921 31876165 33114531 34227636 35293800 36472594 37713868
16748C7713868J679397J018036J165363J644981J507990J597825J415615K255737
$$ 37713868 39393265 40411301 41576664 43221645 44729635 46327460 47743075 49998812
16740D9998812J571175J640791K461579J620597K239822K171496K733526K353646
$$ 49998812 51569987 53210778 55672357 57292954 59532776 61704272 64437798 66791444
16732F6791444K148255K503062K349675K959695K417231K692432K758663K983912
$$ 66791444 68939699 71442761 73792436 76752131 79169362 81861794 84620457 87604369
16724H7604369K558953K685111L083594K735553K449296K985863K276863K285777
$$ 87604369 90163322 92848433 95932027 98667580 101116876 104102739 106379602 108665379
16716A08665379K385014J656358K455140J569706J152853R01794J083928Q44907
$$ 108665379 111050393 112706751 115161891 116731597 117884450 118786244 119870172 120715079
16708A20715079K08200k87720k84293o43050q58950j248240j581411j273737k364087
$$ 120715079 120923279 120635559 120351266 119708216 118849266 117601026 116019615 114745878 112381791
16699A12381791k292524k092868k287512k554631k621232k894794k405083l118745
$$ 112381791 110089267 107996399 105708887 103154256 100533024 97638230 95233147 92114402
16691I2114402k732232k651011k723155k875443k568518k866847k296305k896161
$$ 92114402 89382170 86731159 84008004 81132561 78564043 75697196 73400891 70504730
16683G0504730k311995k572057k355406k078066k513249k025413j953728k084226
$$ 70504730 68192735 65620678 63265272 61187206 58673957 56648544 54694816 52610590
16675E2610590j845769j496312k148489j665626j429587j825633j145929j754638
$$ 52610590 50764821 49268509 47120020 45454394 44024807 42199174 41053245 39298607
16667C9298607q19561j562891q80741j621975j182563q44262j233201k33812j527489
$$ 39298607 38479046 36916155 36035414 34413439 33230876 32386614 31153413 30919601 29392112
16658B9392112q74471j014120n26177r75322o83224q10622o84531r13346m52778
$$ 29392112 28517641 27503521 26977344 26002022 25318798 24508176 23823645 22910299 22457521
16649B2457521n68746l75513p05131o48486n19896q24473p3523m11458j105389
$$ 22457521 21888775 21513262 20808131 20159645 19639749 18815276 18741753 18330295 17224906
16640A7224906k49478m28280m44678n40912o6043r8447r24298l90196j33088k64382
$$ 17224906 16975428 16547148 16102470 15561558 15495515 15397068 14472770 14082574 13949486 13685104
16630A3685104p26686K36724k46574k59609n76277j82691j99071k79623j5846
$$ 13685104 12958418 13195142 12948568 12688959 12112682 11929991 11730920 11451297 11435451
16621A1435451l49936n00246J61796l31390n28782K36034n96110Q1365j974l63398
$$ 11435451 11085515 10585269 10747065 10415675 9886893 10122927 9526817 9608182 9606208 9242810
16611I242810k00744j36062k23667j4785l71359k34719m3304l29437K31838p7530
$$ 9242810 9042066 8906004 8682337 8667552 8296193 8061474 8018170 7688733 7920571 7843041
16601G843041l48664k71225j71824P7286j67987j57815k47973p0829q7773K8062
$$ 7843041 7494377 7223152 7051328 7128614 6960627 6802812 6554839 6484010 6396237 6424299
16591F424299l9244j75801o2766k8929k7286m76960k206j88466J35685k1053k43235
$$ 6424299 6385055 6209254 6146488 6117559 6090273 5613313 5611107 5422641 5558326 5537273 5294038
16580E294038K16554j00339k25747k97616j28012J89629L82258q38282o0419K31493
$$ 5294038 5510592 5410253 5184506 4886890 4758878 4948507 5330765 4492483 4432064 4663557
16570D663557N6502o2509m9109k04391J07527l1552j97334J81096o35133L13105
$$ 4663557 4720059 4657550 4608441 4404050 4511577 4480025 4282691 4463787 3828654 4141759
16560D141759l44887J00704J66738l30151M22074j55493l77116M46193n86894
$$ 4141759 3796872 3897576 4064314 3734163 4156237 4000744 3623628 4069821 3482927
16551C482927L31569l75676J6597L6047K67834m90755J43723j58683k62944Q1348
$$ 3482927 3814496 3438820 3455417 3491464 3759298 3268543 3412266 3253583 2990639 3071987
16541C071987J6026q3183m4054n8973O4061J17984k7824k22367J33472n17202
$$ 3071987 3088013 3004830 2960776 2901803 2965864 3083848 3056024 2833657 2967129 2449927
16531B449927N24777L3583n08100L37495J7232j06354r2424J18397n6276n12046
$$ 2449927 2974704 3008287 2500187 2837682 2854914 2748560 2656136 2774533 2718257 2206211
16521B206211O16821o41362M05629M4480l22644L59117l81820K06489j85717J73938
$$ 2206211 2823032 2181670 2587299 2631779 2309135 2668252 2286432 2492921 2307204 2481142
16511B481142j80608J50719k6801m75196N23780q3765J9950k88862q8683K35837
$$ 2481142 2300534 2451253 2424452 1949256 2473036 2389271 2409221 2120359 2031676 2267513
16501B267513L4350k61186j38809P9079L71120m66057q7991M22052k85913n6323
$$ 2267513 2301863 2040677 1901868 1980947 2352067 1886010 1798019 2220071 1934158 1877835
16491A877835p8743k50688K20934n8176K145J35705j22908J38227q1105L47919
$$ 1877835 1799092 1548404 1769338 1711162 1713307 1849012 1726104 1864331 1783226 2131145
16481B131145o5026j86385j6246j00285j24928J42698j58199R304J22785l09978
$$ 2131145 2066119 1879734 1863488 1763203 1638275 1780973 1622774 1632078 1754863 1444885
16471A444885P2311j08939L2917M82470m43600J60831k03046K38673j25915j16122
$$ 1444885 1517196 1408257 1441174 1923644 1480044 1640875 1437829 1676502 1550587 1434465
16461A434465K95057J8681n9621J39578k49661k16486J61947Q0107j12804k73778
$$ 1434465 1729522 1748203 1688582 1828160 1578499 1362013 1523960 1604067 1491263 1217485
16451A217485j73374M88578k33k776j95061p2526n7473j46058K00908r599L05504
$$ 1217485 1044111 1532689 1532456 1529680 1334619 1262093 1204620 1058562 1259470 1249871 1555375
16440A555375j29638L21870l61827L4332j27295k74641J63662P0169K6891r8768
$$ 1555375 1425737 1747607 1385780 1420112 1292817 1018176 1181838 1252007 1278898 1180130
16430A180130q7523J57081k6969q5012J71904l3174L2852K7333j34187l99786
$$ 1180130 1092607 1249688 1222719 1137707 1309611 1276437 1309289 1336622 1202435 802649
16420H02649L43585E71182O99483K22127n86083L75228l03340J47821n7357p4660
$$ 802649 1146234 571182 1270665 1492792 906709 1281937 978597 1126418 1069061 994401
16410I94401J34356J78518m69277k06565K21453J85302l2485J9334K92428l73276
$$ 994401 1128757 1307275 837998 631433 852886 1038188 1005703 1025037 1317465 944189
16400I44189K65620m86747R9315K07608l08728K48906K18233j13585m15810O0817
$$ 944189 1209809 723062 822377 1029985 721257 970163 1188396 1074811 659001 719818
16390G19818J18276L07495l54849P9826j28522J82948m1658o6399K69532j09546
$$ 719818 838094 1145589 790740 870566 742044 924992 883334 816935 1086467 976921
16380I76921D86304M66930R0579m92989L25216k44245L42022K8315k47446K11747
$$ 976921 486304 953234 1043813 550824 876040 631795 973817 1002132 754686 966433
16370I66433k2952P7569k26532R8877j29227J935L07049j99661j14824J23179
$$ 966433 943481 1021050 794518 893395 764168 766103 1073152 873491 758667 881846
16360H81846K3422J5344k09562j7499j38058J84114m6597o0855r3820J87909L2526
$$ 881846 905268 920612 711050 693551 555493 739607 693010 632155 538335 726244 758770
16349G58770O1357M6629m14443M26181M4607j78567j3941K5866J39125j29641
$$ 758770 820127 866756 452313 878494 923101 744534 730593 756459 895584 765943
16339G65943k86813J14496R4570j90729K02723j60443L36926B79402L16561n0462
$$ 765943 479130 593626 688196 497467 700190 539747 876673 279402 595963 545501
16329E45501n9042L47741J4215l11753l113l100J51768J0161J1252l33873M05429
$$ 545501 486459 834200 848415 536662 533549 530449 682217 692378 703630 369757 775186
16318G75186K25743l52061j2573j31725o3893O20330p3217C75370Q1886J99480
$$ 775186 1000929 648868 636295 504570 440677 1061007 987790 375370 457256 656736
16308F56736M0071j68412j6959O7713q0242M3205k47292K00605j96731K45315
$$ 656736 696807 528395 511436 579149 498907 542112 294820 495425 298694 544009
16298E44009N1276k2577k44147O0067L11267k87888j16522J06676J08019J89153
$$ 544009 595285 572708 328561 388628 699895 412007 295485 402161 510180 699333
16288F99333C12697M06600j26706M8332B22763K93464k33009L37860j45708r5605
$$ 699333 312697 719297 592591 640923 222763 516227 283218 621078 475370 379765
16278C79765K82319k58937K9791j29561K95525q8494k00929j28545J07598N0223
$$ 379765 662084 403147 432938 303377 598902 510408 309479 180934 288532 338755
16268C38755K64929k84193J91034j11400L56715C51251K5324L07187P3540k70661
$$ 338755 603684 319491 510525 399125 755840 351251 376575 683762 757302 486641
16258D86641J68360A90548J40492J17968M1435k5187j58131K35361K3603A25512
$$ 486641 655001 190548 331040 449008 490443 465256 307125 542486 566089 125512
16247b4014D73842A42735M97323k12278n378l9568m4833r7765K38794A43225L97011
$$ -24014 473842 142735 640058 427780 422402 382834 338001 240236 479030 143225 540236
16236E40236A57959K04377J92606j96977A31271C3758P58260k76464q0420A51732
$$ 540236 157959 362336 554942 357965 131271 33758 792018 515554 435134 151732
16225E48374J79346F6691K69171Q6344A89870J14020r5020L30565A82783L12105
$$ 548374 727720 66691 335862 422206 189870 303890 208870 539435 182783 494888
16215D94888K52397C45744j55344K99203A98002o5616l7538L70377j29980O3796
$$ 494888 747285 345744 190400 489603 198002 132386 94848 465225 335245 399041
16205C99041A38613a6581B11286L7040L46576B74653L76890Q7253b721A12771
$$ 399041 138613 -16581 211286 248326 594902 274653 651543 738796 -2721 112771
16194C66832r8427J5352C4460J81775M6638r8394Q166L8132D0346J61401n9866
$$ 366832 268405 283757 34460 216235 262873 164479 172645 210777 40346 201747 141881
16183A41881a281D46293A52306J58250Q5786O7960A48766L1358L69940k04313
$$ 141881 -1281 446293 152306 310556 396342 464302 148766 180124 550064 345751
16173C45751j20225m3709F3892L27722A95805H7734J63617r9974L99783C6161
$$ 345751 225526 181817 63892 391614 195805 87734 251351 151377 551160 36161
16162B80056o9477N56808B35470J88009E3076O7008J75386J17189j01246j31530
$$ 280056 210579 767387 235470 423479 53076 120084 295470 412659 311413 179883
16152A79883a08946G5665J39702n6789J80657K97048l07235A19565K83186A25492
$$ 179883 -108946 75665 215367 158578 339235 636283 329048 119565 402751 125492
16141b9009B87624K12311A06562D8402P8699a709D87427j26897k4881N6267A64434
$$ -29009 287624 499935 106562 48402 127101 -1709 487427 360530 335649 391916 164434
16129B62950k8572b1800B55305j18894a8934F3274j1146J18376J47110e0922C77421
$$ 262950 234378 -21800 255305 136411 -18934 63274 52128 170504 317614 -50922 377421
16117b16326D0187K50364P0488e9711E00367B18164M3383b136H8268a92284C72182
$$ -216326 40187 290551 361039 -59711 500367 218164 261547 -2136 88268 -192284 372182
16105A86161e5352C99976j31995l5138K30861A18384a98430d8784B01033l0036
$$ 186161 -55352 399976 267981 232843 463704 118384 -198430 -48784 201033 170997
16095A70997J41971a6459j34553C49600A49857j3434J53102F3822J88630o5719
$$ 170997 312968 -16459 -151012 349600 149857 136423 289525 63822 252452 186733
16085A86733r067a35079I7603N4854b9995l4420C93363j00408a4062l1954a9442
$$ 186733 177666 -135079 97603 152457 -29995 -64415 393363 292955 -14062 -46016 -19442
16073E55281A60944b11290D34220d2943A40986K13092A32322h3456E8111J21900
$$ 555281 160944 -211290 434220 -42943 140986 354078 132322 -83456 58111 180011
16063A80011K4417M8730A15905d7237C40594H9781K17350A12866L7262K30430
$$ 180011 204428 253158 115905 -47237 340594 89781 307131 112866 150128 380558
16053C80558E38J0797J03935b24122B15945P7148j29341M5960M7496b27007c1777
$$ 380558 538 11335 115270 -224122 215945 293093 163752 209712 257208 -227007 -31777
16041I8067f0597A44176a42593C21500i2534a0013k15694A75727b38820A21543
$$ 98067 -60597 144176 -142593 321500 -92534 -10013 -225707 175727 -238820 121543
16030D3670i913k88653A60916J18328a19598H6194O0526b6905A58345i969B26904
$$ 43670 -9913 -298566 160916 279244 -119598 86194 146720 -26905 158345 -9969 226904
16018A11624c5962k6858j37349I4583A013J19229J27855N2221a45155b5203j16384
$$ 111624 -35962 -62820 -200169 94583 1013 120242 248097 300318 -145155 -25203 -141587
16007a41587A58405K36009j13214A17801K39933d08757a55011A40713L5113b567
$$ -141587 158405 394414 281200 117801 357734 -408757 -155011 140713 175826 -2567
15996a61420D5859c0431B52883H3891J72948c37302C6476f8994C60803C0327a04540
$$ -161420 45859 -30431 252883 83891 256839 -337302 36476 -68994 360803 30327 -104540
15984C238d4836B09134J6628J15247a90318A44612K07596j35461q2256J4904K69680
$$ 3238 -44836 209134 225762 341009 -190318 144612 352208 216747 134491 149395 419075
15973D19075K23745k81558L47190J7241K60007j13666j19764j12514M8856H9872
$$ 419075 642820 361262 708452 725693 985700 872034 752270 639756 688612 89872
15962A93624B7751J25312K01373j32128d2086G1426c60019H880L08145i0560A72750
$$ 193624 27751 153063 354436 222308 -42086 71426 -360019 8880 317025 -90560 172750
15950a35729b8031A31791j9897D3410o464K53066L8351c5151B8105J34405K15976
$$ -135729 -28031 131791 111894 43410 36946 290012 328363 -35151 28105 162510 378486
15939C78486a09024G8705g6007A0077i3266C0979c85552D1436b5099j28253C40070
$$ 378486 -109024 78705 -76007 10077 -93266 30979 -385552 41436 -25099 -153352 340070
15927I9604B8712j0814L3795a6946j3012E6910h694j76792B50897a07209B38920
$$ 99604 28712 17898 51693 -16946 -29958 56910 -8694 -185486 250897 -107209 238920
15915b27190P1419k3045D01773H4208C3685R3384n3278J13200L4474B3615N11072
$$ -227190 -155771 -178816 401773 84208 33685 127069 73791 186991 221465 23615 534687
15904E34687E7069b4779k27290a09612A91819p8869a32643l96355a67421j26611
$$ 534687 57069 -24779 -252069 -109612 191819 112950 -132643 -528998 -167421 -294032
15894b94032c6462a2814B45598b64215M2277E0861f2688D00656r2787p0281B605
$$ -294032 -36462 -12814 245598 -264215 -221938 50861 -62688 400656 307869 237588 2605
15882b131A78922b67515A11886A3338a26421B35792i9303A3860J23168B1726f1635
$$ -2131 178922 -267515 111886 13338 -126421 235792 -99303 13860 137028 21726 -61635
15870D98385d5591a1248B94656a85411b2413n6594L946j06134F1756g9570j97163
$$ 498385 -45591 -11248 294656 -185411 -22413 -79007 -75061 -181195 61756 -79570 -276733
15859b76733J02218M5356l1208A77912b18558B03180d8220m540k19634c8759B71360
$$ -276733 -174515 -129159 -160367 177912 -218558 203180 -48220 -52760 -272394 -38759 271360
15847c92500a14476A44701f1137j37126i903A10463k5113c2426B56648a66341
$$ -392500 -114476 144701 -61137 -198263 -9903 110463 85350 -32426 256648 -166341
15836A22136a08042d3345E3350d1612O573A85579D4565C956J0648f9311m82380
$$ 122136 -108042 -43345 53350 -41612 -35039 185579 44565 3956 14604 -69311 -551691
15825e51691b42950e0992B6915j0305J71765g1283C6135O983J17296m9817f9179
$$ -551691 -242950 -50992 26915 16610 188375 -71283 36135 43118 160414 110597 -69179
15813a62752f2481j179L0134a4986B82669b5714k71717f0316q7521k75611L1363
$$ -162752 -62481 -63660 -33526 -14986 282669 -25714 -297431 -60316 -147837 -423448 -392085
15802c92085a33599K2231n6683b5947k50430g438D54783b3820C7501J07853a36313
$$ -392085 -133599 -111368 -168051 -25947 -276377 -7438 454783 -23820 37501 145354 -136313
15790C4465L49631a28842d3503A4968a38216f2070k77694G0893a77468A06887
$$ 34465 384096 -128842 -43503 14968 -138216 -62070 -339764 70893 -177468 106887
15779f7606j96738O415b1776B29395a9675G2578J54646G3024a23380p1176h251
$$ -67606 -264344 -257929 -21776 229395 -19675 72578 227224 73024 -123380 -194556 -8251
15767A32693a93395a1913C3378b38938d3567l5761A23535a70961B71721b08289
$$ 132693 -193395 -11913 33378 -238938 -43567 -79328 123535 -170961 271721 -208289
15756a04976r4692c0810E494L68229a30172A63391a14216N1612j2342j95228e975
$$ -104976 -199668 -30810 5494 373723 -130172 163391 -114216 -62604 -74946 -270174 -5975
15744c4055G0685b16902G2489k4895d3088A20444a86388A78727N1194c1596C04193
$$ -34055 70685 -216902 72489 47594 -43088 120444 -186388 178727 229921 -31596 304193
15732B73122A33803a87363A72373m1227h0970m8855c9941n1196d2944J1465H4891
$$ 273122 133803 -187363 172373 131146 -80970 -129825 -39941 -91137 -42944 -31479 84891
15720a69873K2983N9649K6980j41929K7361H40a91896h1926g647C8466b34107
$$ -169873 -146890 -87241 -60261 -202190 -174829 840 -191896 -81926 -7647 38466 -234107
15708E2052N6486J7470J4319b81112A56397A8075b07083K0035r3709b6816j32618
$$ 52052 108538 126008 140327 -281112 156397 18075 -207083 -187048 -280757 -26816 -159434
15697a59434B34760J76015a63481j80243H4211g1231A73935c33300b4440j06499
$$ -159434 234760 410775 -163481 -343724 84211 -71231 173935 -333300 -24440 -130939
15687a30939G3499b9122n2655A11102B9225b77913a11139J4040m5360D42054h2700
$$ -130939 73499 -29122 -81777 111102 29225 -277913 -111139 -97099 -142459 442054 -82700
15675a11614H5329a72868B1752J12991J78246p9838c1204p2697B2616a02054B44386
$$ -111614 85329 -172868 21752 134743 312989 233151 -31204 -103901 22616 -102054 244386
15663F8530j0000L73484b66489C92573A57611b0731j10544K9556C08256i85o6726
$$ 68530 58530 432014 -266489 392573 157611 -20731 -131275 -101719 308256 -985 -67711
15652f7711L661j5822A24841j9983a07501C2531p411N5916B2206a12342M0511
$$ -67711 -64050 -79872 124841 104858 -107501 32531 25120 81036 22206 -112342 -71831
15641g1831D12367a19332r1782d5765A14901h2535D7984a34591A47401B2859a40535
$$ -71831 412367 -119332 -211114 -45765 114901 -82535 47984 -134591 147401 22859 -140535
15629F0336J32828a20942F1969c55826f8951p9486j00636J02603M4772B8300a00625
$$ 60336 193164 -120942 61969 -355826 -68951 -148437 -249073 -146470 -101698 28300 -100625
15617b27199N5730O4094O826a2589B79676j3558a0988j45946g1507b9997A15599
$$ -227199 -171469 -107375 -100549 -12589 279676 266118 -10988 -156934 -71507 -29997 115599
15605D3776a97156o1648k02748B5709b32010j7554c2711C8061K28269A5817a85692
$$ 43776 -197156 -258804 -461552 25709 -232010 -249564 -32711 38061 266330 15817 -185692
15593C4762a20119l18986F9464c00758J354b4854A04575f3574E6032a19424K2382
$$ 34762 -120119 -439105 69464 -300758 -299404 -24854 104575 -63574 56032 -119424 -97042
15582i7042a7217B775a86382e0874C3775R8096a80810A5605K84448b05383B40402
$$ -97042 -17217 2775 -186382 -50874 33775 131871 -180810 15605 300053 -205383 240402
15570a30351H293a89025A04847b53481m0786M8733B80553l0828b4464A59753Q7237
$$ -130351 8293 -189025 104847 -253481 -294267 -245534 280553 249725 -24464 159753 246990
15559B46990C7579h005j91247l8360E2435d1060j25691c7057B23829e2912b6141
$$ 246990 37579 -8005 -199252 -237612 52435 -41060 -166751 -37057 223829 -52912 -26141
15547a7543B49411a16411B38342b0411A28448i5791B16911M0817A8654b28329
$$ -17543 249411 -116411 238342 -20411 128448 -95791 216911 257728 18654 -228329
15536a24907M0062k1585M8598r0016e3290B5532R8662b4844G9283R6054b66254
$$ -124907 -84845 -106430 -57832 -147848 -53290 25532 124194 -24844 79283 175337 -266254
15524A57148e4270F1195J28903E8630b93708E7582A8791a60435f380k89155F1660
$$ 157148 -54270 61195 190098 58630 -293708 57582 18791 -160435 -6380 -295535 61660
15512B33961I2906a59677c3296C37605A6688a05439A19324a53029L5988M5392
$$ 233961 92906 -159677 -33296 337605 16688 -105439 119324 -153029 -117041 -71649
15502g1649A01693j0968J73665l1779j00293n0205A3782N5279K5215K07651I2548
$$ -71649 101693 90725 264390 232611 132318 82113 13782 69061 94276 301927 92548
15490D02745G4092K37576f1359b4888j52675i961C50975c08923A93796D6169K13831
$$ 402745 74092 311668 -61359 -24888 -177563 -9961 350975 -308923 193796 46169 260000
15479B60000G1678J76552n0722H7109R0410F5929P3074a84154d4960B1794L5616
$$ 260000 71678 248230 197508 87109 177519 65929 139003 -184154 -44960 21794 57410
15468E7410L8011J08924b54126B99488A18244a17692A94485K24390p4541A28860
$$ 57410 95421 204345 -254126 299488 118244 -117692 194485 418875 344334 128860
15457G15041j91932k53996J59643g9939E1481b2647D5020K28447h9759a4416G046
$$ 715041 523109 269113 428756 -79939 51481 -22647 45020 273467 -89759 -14416 7046
15445i2940J1279H1711K364J77016E5259K97238E4846I233g3587d762B13516h7628
$$ -92940 -81661 81711 84075 261091 55259 352497 54846 9233 -73587 -4762 213516 -87628
15432F39J1852K6464L76151G2597L36200N57N53632k50452k58189r4409E4699
$$ 639 12491 38955 415106 72597 408797 409354 962986 712534 454345 359936 54699
15420E08549j46666D2582O1990a79897a7534A29993J27304c19187E3731M13221
$$ 508549 361883 42582 104572 -179897 -17534 129993 257297 -319187 53731 466952
15410D66952b42197E2855a3478B07882D0710b3456G2817b97332c7834j26145n5830
$$ 466952 -242197 52855 -13478 207882 40710 -23456 72817 -297332 -37834 -163979 -219809
15399b19809f2637j45265h2585B2648N2557L3565O5685a12454B74542q1295L086
$$ -219809 -62637 -207902 -82585 22648 75205 108770 174455 -112454 274542 193247 196333
15388A96333o2879a83973J5674M1287N1552l9224H85a18484A38292k7658i3619
$$ 196333 133454 -183973 -168299 -127012 -75460 -114684 885 -118484 138292 110634 -93619
15376B04256d18746F7417k8176B326Q2167e4131B58200b38213B80832b1195A73943
$$ 204256 -418746 67417 39241 2326 84493 -54131 258200 -238213 280832 -21195 173943
15364C27929e2510k05803a27778B84711L1004m136K6277c54482B34167M1334A30894
$$ 327929 -52510 -258313 -127778 284711 315715 311579 337856 -354482 234167 275501 130894
15352D06712G9372g6051A25103n321K7905J40502A10382A9476b31600C22821A55644
$$ 406712 79372 -76051 125103 119782 147687 288189 110382 19476 -231600 322821 155644
15340a73920C07841j9099f10C36278r6688J18349A32971N2197J39405m0443M3553
$$ -173920 307841 288742 -610 336278 239590 357939 132971 185168 324573 284130 327683
15329C27683e6844B39524J65552m1058c1702A54871e2047K5074B87575q9175G0079
$$ 327683 -56844 239524 405076 364018 -31702 154871 -52047 -26973 287575 198400 70079
15317C00204A31925c7900A69736h011k4122m7495j07368A94960L7601a01835A22300
$$ 300204 131925 -37900 169736 -8011 -32133 -79628 -186996 194960 232561 -101835 122300
15305A77688A05b55201c241A40625i2013B15596L3913A03418D3618L8068A3193
$$ 177688 105 -255201 -3241 140625 -92013 215596 249509 103418 43618 81686 13193
15293C15539J5613B7385g0961j81994L0735E8392k5059P2089H127K26652g4007
$$ 315539 331152 27385 -70961 -252955 -222220 58392 33333 105422 8127 234779 -74007
15281B9815J40033J44015q611K1858e7338A36303b8804k66168C17332N8453G950
$$ 29815 169848 313863 305252 327110 -57338 136303 -28804 -294972 317332 375785 7950
15269A55755p6306b44488c1689D1688P0921e9582k9210F7786b14620j65601B41409
$$ 155755 79449 -244488 -31689 41688 112609 -59582 -88792 67786 -214620 -380221 241409
15257b00015c8598D0025a73182B26730p6240o9240b93548J17630D03337a18108
$$ -200015 -38598 40025 -173182 226730 150490 81250 -293548 -175918 403337 -118108
15246D0022b61458B4344J6422h8252j45953C66779c62711C60892A28485a53037
$$ 40022 -261458 24344 40766 -88252 -234205 366779 -362711 360892 128485 -153037
15235a495k8777C75728A30213O60522F9523N21315J69396Q1172M09164M79808
$$ -1495 -30272 375728 130213 790735 69523 590838 760234 841406 1250570 1730378
15225A730378k27059O0209m88730k78437B23284A03609h1784B14210a4788r9797
$$ 1730378 1503319 1563528 1074798 796361 223284 103609 -81784 214210 -14788 -114585
15215a14585b6455E5110J57518o6794b7955P739A45869b33773A20123J32109L5847
$$ -114585 -26455 55110 212628 145834 -27955 -20216 145869 -233773 120123 252232 288079
15204B88079a61302M4371d8234k7893G6847J19886J93915G3153P1642i6830E7562
$$ 288079 -161302 -116931 -48234 -76127 76847 196733 390648 73153 144795 -96830 57562
15192A31009n7501O4379m6531l0004a31527C59983A03724b13732g3288L5976B33138
$$ 131009 73508 137887 91356 61352 -131527 359983 103724 -213732 -73288 -37312 233138
15180B8693J45058Q9583c392A84352a10842k1302A85537N6314D7438K71715a02514
$$ 28693 173751 263334 -3392 184352 -110842 -132144 185537 241851 47438 319153 -102514
15168A83813j0647H0859l0284d5433b359B09220E0713K72373A21569c38380A44939
$$ 183813 173166 80859 50575 -45433 -2359 209220 50713 323086 121569 -338380 144939
15156E1505a7597j03409C8339n013a03641j55714i125I9667N3601b70308a8606
$$ 51505 -17597 -121006 38339 33326 -103641 -259355 -9125 99667 153268 -270308 -18606
15144a2523A15090P0371N0948d5695j51672h5381A29083a66124A5591M864g7126
$$ -12523 115090 185461 236409 -45695 -197367 -85381 129083 -166124 15591 20455 -77126
15132C16019I7916J40398b34350B16827E5589L67441a54076f2315D05361D2163
$$ 316019 97916 238314 -234350 216827 55589 423030 -154076 -62315 405361 42163
15121H9158J09030a63147H9912f4745K7894B75560F5495M7290P4902d2116j0750
$$ 89158 198188 -163147 89912 -64745 -36851 275560 65495 112785 187687 -42116 -52866
15110e2866B18039A3448L06355N0178o9663r6842R1488J37549j65153M2561b05213
$$ -52866 218039 13448 319803 369981 300318 203476 294964 432513 267360 309921 -205213
15098F3024b4089l38376J4007C75161j36378G6512h5370j1605C58708g1405G637
$$ 63024 -24089 -362465 -348458 375161 238783 76512 -85370 -96975 358708 -71405 7637
15086A65172a20851A50936a87367A89783F2300K30737m1126j09713o8308k3489
$$ 165172 -120851 150936 -187367 189783 62300 293037 251911 142198 73890 50401
15076E0401K58019j46606J8302b8789A41422l893K49610I1246a0505B45047G4175
$$ 50401 308420 161814 180116 -28789 141422 137529 387139 91246 -10505 245047 74175
15064E2030J90754n4125P6125c8044B72626e5112B81088Q3271A15982D2111J32657
$$ 52030 242784 188659 264784 -38044 272626 -55112 281088 364359 115982 42111 174768
15053A74768o1170a2342m9469A9623F206Q4981K34126m2495N4408K30490A36767
$$ 174768 113598 -12342 -61811 19623 6206 91187 325313 282818 337226 567716 136767
15041C54172o0908r9414G8588k9706L13621n455n4125r4065L10593N4645f1400
$$ 354172 293264 193850 78588 48882 362503 357048 302923 208858 519451 574096 -61400
15029C31908A25798J54889J20538I6298J65214J21692q0466A12244M3944L00568
$$ 331908 125798 280687 401225 96298 261512 383204 302738 112244 156188 456756
15019D56756M7373A35427J94428L1319J17681l6442K28029B91674A36578J90798
$$ 456756 504129 135427 329855 361174 478855 442413 670442 291674 136578 327376
15009C27376j48806L04589j38149J92313p6277Q5541j9024M1093o5530j89842
$$ 327376 178570 483159 345010 537323 461046 546587 527563 568656 503126 313284
14999C13284K65226j29110K4736k06593N5564q1313L6740K4251K66790A29871
$$ 313284 578510 449400 474136 267543 323107 241794 278534 302785 569575 129871
14988C12306A39283K62856Q2686j29010A7097M45721j13835K91658B16383K51393
$$ 312306 139283 402139 484825 355815 17097 462818 348983 640641 216383 467776
14978D67776r9654J0539K20719k57732j00517Q4640J73098R4835Q2932L4731j74462
$$ 467776 368122 378661 599380 341648 241131 325771 498869 593704 676636 711367 536905
14967E36905o7972r4051M08697k72701L1880m9004B13843L28023B62208R9696
$$ 536905 468933 374882 783579 510878 542758 493754 213843 541866 262208 361904
14957C61904L0089L18809j51593k20396J57344j94606q3408D2533J65892K08681
$$ 361904 391993 710802 559209 338813 496157 301551 218143 42533 208425 417106
14947D17106J8315j66551l4129K23608j77692J40660j00956A5562J41203L14811
$$ 417106 435421 268870 234741 458349 280657 421317 320361 15562 156765 471576
14937D71576r2882m2526K24873B59418L90562K7368B49825L53249f0291F22981
$$ 471576 378694 336168 561041 259418 649980 677348 249825 603074 -60291 622981
14926F06510k01332J70160J74891C20946J34698j54890K12209K55562C52032O38587
$$ 606510 405178 575338 750229 320946 455644 300754 512963 768525 352032 990619
14916I90619l92633M03306k7872M55168k80929J42464j52039N83111j66688p4232
$$ 990619 597986 1001292 973420 1428588 1147659 1290123 1138084 1721195 1554507 1480275
14906A480275k36826J02623P4651j3657L10647m63773L13272l68735j40043l434
$$ 1480275 1243449 1346072 1420723 1407066 1717713 1253940 1567212 1198477 1058434 1055000
14896A055000J67049l05831K15149E24050R0152j07177j88742J65802J66740k45884
$$ 1055000 1222049 916218 1131367 524050 614202 507025 318283 484085 650825 404941
14886D04941J48256j54647j27129J73208H2332L57513q3055r242k2917J6284p7789
$$ 404941 553197 398550 271421 444629 82332 439845 356790 347548 324631 340915 263126
14875B63126K23094J77458H9694N11513M3678A50622P71718k78531K27620j03637
$$ 263126 486220 663678 89694 601207 644885 150622 922340 643809 871429 767792
14865G67792J84604j64096J02480j02250k90939J91221C36289L35908k86154A49438
$$ 767792 952396 788300 890780 788530 497591 688812 336289 672197 386043 149438
14854D89910K8584J45066p277k84979R5915J94368p3873j39774K42579O7169k13447
$$ 489910 518494 663560 656283 371304 467219 661587 587714 447940 690519 757688 544241
14843E44241r6109A58388M12391m5078k26481N8407J4344J7970A39220K9479J66864
$$ 544241 448132 158388 570779 525701 299220 357627 371971 389941 139220 168699 335563
14832C35563O38567C75419O9756L68012q2303L08655m0748m6364R2342p22n2937
$$ 335563 974130 375419 445175 813187 730884 1039539 998791 952427 1044769 1044047 991110
14821I91110M1896k45695L4464C29765J10182j9714J02771L0002J45720q5092
$$ 991110 1033006 787311 821775 329765 439947 420233 523004 553006 698726 613634
14811F13634j09658J00270K8860m5756A54270N92199k5832k93867L72972M169
$$ 613634 503976 604246 633106 587350 154270 746469 720637 426770 799742 803911
14801H03911j22229A44769L90350J15708k20796K05184K6715l00421K33969m2227
$$ 803911 681682 144769 535119 650827 430031 635215 661930 361509 595478 553251
14791E53251J71763r6949R231K50304J64180j79797l265p1989k27172j4208m1515
$$ 553251 725014 628065 637296 887600 1051780 871983 868718 796729 569557 555349 513834
14780E13834J59499j72169O3198l2889l3503K2653B50371J5557K43682j68886
$$ 513834 673333 501164 564362 531473 497970 520623 250371 265928 509610 340724
14770C40724M77242J23707m6300l05890J05878l25665J16301K35305J00676l34323
$$ 340724 817966 941673 895373 589483 695361 369696 485997 721302 821978 487655
14760D87655L73851l2136L40734k35543k28393p218k09963J61524k23744o2143
$$ 487655 861506 829370 1170104 934561 706168 698950 488987 650511 426767 364624
14750C64624R7724M12050j40235M1615C55195L32578m3242l18345M70108j68021
$$ 364624 462348 874398 734163 775778 355195 687773 644531 326186 796294 628273
14740F28273l7455B10341M37161q9333K55137j33792k04692O7696Q9224J72839
$$ 628273 590818 210341 647502 558169 813306 679514 474822 542518 631742 804581
14730H04581j23434l14193P89498m43278R0773N6509Q9909k59263j59372M11879
$$ 804581 681147 366954 1156452 713174 803947 860456 950365 691102 531730 943609
14720I43609j33195J10442C73564N50651k6478r4122K25421K03948J86856n5098
$$ 943609 810414 920856 373564 924215 897737 803615 1029036 1232984 1419840 1364742
14710A364742n7838J55013j27319l57285J62021m0367j45697l9372J08014l0449
$$ 1364742 1306904 1461917 1334598 977313 1139334 1098967 953270 913898 1021912 991463
14700I91463N8924k267l08803O350J49834K3946m842n5306J09539j94396K97202
$$ 991463 1050387 1048120 739317 745667 895501 919447 914605 859299 968838 774442 1071644
14689A071644K11665O5808o7635L11033K5574k04391n7623q8842O919j45024L29755
$$ 1071644 1283309 1349117 1281482 1592515 1618089 1413698 1356075 1267233 1274152 1129128 1458883
14678A458883m77299k22814K53029q5710O4137n8894j39342K81053k79793m9263
$$ 1458883 981584 758770 1011799 926089 990226 931332 791990 1073043 793250 743987
14668G43987R8034o1233M34158l3330l39557j49279Q1677J51874r2621J77696
$$ 743987 842021 780788 1214946 1181616 842059 692780 774457 926331 833710 1011406
14658A011406k0039j46018l7789L2059J65485K19410k8416k07672k17773J56295
$$ 1011406 991367 845349 807560 839619 1005104 1224514 1196098 988426 770653 926948
14648I26948l932M01228l58585M9139k90883K07094L82303j68056R9649o5031
$$ 926948 923016 1324244 965659 1014798 723915 931009 1313312 1145256 1244905 1179874
14638A179874J97150l05160J17746L36581j36312l07712K50358l7527j84641J27213
$$ 1179874 1377024 1071864 1189610 1526191 1389879 1082167 1332525 1294998 1110357 1237570
14628A237570N4929R4212k00064N646l80262J51717m2843o9276M16844k22988
$$ 1237570 1292499 1386711 1186647 1192293 812031 963748 920905 851629 1268473 1045485
14618A045485j7209N97555j54917k01858r0430K27428j59419o1638m4294K78630
$$ 1045485 1028276 1625831 1470914 1269056 1178626 1406054 1246635 1184997 1140703 1419333
14608A419333j34266m12958O1858L76300J13579j85771Q6425J20491l67907L81614
$$ 1419333 1285067 872109 933967 1310267 1423846 1238075 1324500 1444991 1077084 1458698
14598A458698J06467l65954K99408J47545k11122P125q2134K36402O5058p7992
$$ 1458698 1565165 1199211 1498619 1646164 1435042 1442167 1360033 1596435 1661493 1583501
14588A583501l75503O34440j29682p6467m64437L47028J41028j51601K36082J73910
$$ 1583501 1207998 1842438 1712756 1636289 1171852 1518880 1659908 1508307 1744389 1918299
14578A918299m91927K34241q5989P3322L8556m7287L09942l27808q8323L02909
$$ 1918299 1426372 1660613 1574624 1647946 1686502 1639215 1949157 1621349 1533026 1835935
14568A835935j67278K59967M27J09084o6840l9630k87552M29701R5199m3498k34796
$$ 1835935 1668657 1928624 1929051 2038135 1971295 1931665 1644113 2073814 2169013 2125515 1890719
14557A890719L99029j77162J45606L0696o7847K46295L0478j05761q4693L75313
$$ 1890719 2289748 2112586 2258192 2288888 2221041 2467336 2497814 2392053 2307360 2682673
14547B682673p158k58710K20356K76168J29194K46303K63761M58911k29746P55181
$$ 2682673 2675515 2416805 2637161 2913329 3042523 3288826 3552587 4011498 3781752 4536933
14537D536933N04596J070525J289458J973975M197600P018956J0892103q32125
$$ 4536933 5041529 6112054 7401512 9375487 13573087 20592043 31484146 30652021
14529C0652021j3614640p068894l637657j518446q62293J8344J31883Q50641k29540
$$ 30652021 17037381 9968487 6330830 4812384 3950091 3968435 4100318 4950959 4721419
14520D721419j398660n39396j52323m64838K39629j77291K84721j38670l11629
$$ 4721419 3322759 2783363 2631040 2166202 2405831 2228540 2513261 2374591 2062962
14511B062962m5422L61272j34428j50614K35463K59525m24075J53938J46381l5683
$$ 2062962 2017540 2378812 2244384 2093770 2329233 2588758 2164683 2318621 2465002 2429319
14501B429319L05964J8293l07972j3793J22409K42233n6215l13170K69204J90220
$$ 2429319 2735283 2753576 2445604 2431811 2554220 2796453 2740238 2427068 2696272 2886492
14491B886492j24758j30388K29156n52n575j04866N92797m22802R1831k5000M21730
$$ 2886492 2761734 2631346 2860502 2859950 2854375 2749509 3342306 2919504 3011335 2986335 3408065
14480C408065j06370j00777Q5993M7769o2002M05341k84676M8408o6466r4617
$$ 3408065 3301695 3200918 3286911 3334680 3272678 3678019 3393343 3441751 3375285 3280668
14470C280668M84202n4214j44233J90530j99194J85600j53431J87448J00269j01550
$$ 3280668 3764870 3710656 3566423 3756953 3557759 3743359 3589928 3777376 3877645 3776095
14460C776095M06825k75040L44613j1350j28994n6571r525O05116m00076K07672
$$ 3776095 4182920 3907880 4252493 4241143 4112149 4055578 4046053 4651169 4251093 4458765
14450D458765p7698j76653L22180J97644l17498O68420l09510l9497L05483L2277
$$ 4458765 4381067 4204414 4526594 4724238 4406740 5075160 4765650 4726153 5031636 5063913
14440E063913k09275M8171L45528j98966J42505O351K00695J84261k68007K22085
$$ 5063913 4854638 4902809 5248337 5049371 5191876 5198227 5398922 5583183 5315176 5537261
14430E537261k88527K94571O2945k4141M79680j94960j22558N01087j82229M19349
$$ 5537261 5248734 5543305 5606250 5582109 6061789 5866829 5744271 6245358 6063129 6482478
14420F482478j51742O0480N8392K24707K22155l59437K17111L76225J77788K01917
$$ 6482478 6330736 6391216 6449608 6674315 6896470 6537033 6754144 7130369 7308157 7510074
14410G510074l06710P9434N80859r4041j70124L50303K49613M62842k53110K59762
$$ 7510074 7203364 7282798 7863657 7769616 7599492 7949795 8199408 8662250 8409140 8668902
14400H668902k44231M03815J19379R9860L7897j65590O5038M33296J54499n4302
$$ 8668902 8424671 8828486 8947865 9047725 9085622 8920032 8985070 9418366 9572865 9518563
14390I518563L97824M50498l64410P05859j66179j25275L89549O3943J14384J100
$$ 9518563 9916387 10366885 10002475 10708334 10542155 10416880 10806429 10870372 10984756 10985856
14380A0985856L57680J58006J97116R5015L72822K44337K46765l7716K76636M11224
$$ 10985856 11343536 11501542 11698658 11793673 12166495 12410832 12657597 12619881 12896517 13307741
14370A3307741L59632k65499L93830P76888R4648O01977O7193J132K47812L4851
$$ 13307741 13667373 13401874 13795704 14572592 14667240 15269217 15336410 15337542 15585354 15620205
14360A5620205K39729Q80011K36852M93186j38162O20385K28016M40522L40421
$$ 15620205 15859934 16739945 16976797 17469983 17331821 17952206 18180222 18620744 18961165
14351A8961165O25089M70478L81639P0915N48004N87169J84669O89882L39760
$$ 18961165 19586254 20056732 20438371 20509286 21057290 21644459 21829128 22519010 22858770
14342B2858770R61887L02534M54607O54626N59098M48484J062684O44100L52251
$$ 22858770 23820657 24123191 24577798 25232424 25791522 26240006 27302690 27946790 28299041
14333B8299041R50497N21702P95143J280347M32759J309904L36465J098964J310806
$$ 28299041 29249538 29771240 30566383 31846730 32279489 33589393 33925858 35024822 36335628
14324C6335628P82254R83447J538002J082528R51012J260987J186032J420898
$$ 36335628 37117882 38101329 39639331 40721859 41672871 42933858 44119890 45540788
14316D5540788J430349J653182J343601J864911J502622J946086J852452K127875
$$ 45540788 46971137 48624319 49967920 51832831 53335453 55281539 57133991 59261866
14308E9261866J762284K854004K096695K439683K502010K520103K862256L144747
$$ 59261866 61024150 63878154 65974849 68414532 70916542 73436645 76298901 79443648
14300G9443648K739473L728860L094192L382011M319605M140494M554664M787474
$$ 79443648 82183121 85911981 89006173 92388184 96707789 100848283 105402947 110190421
14292A10190421M864787N437089N195061O216108O175595O405513P114198P688476
$$ 110190421 115055208 120492297 125687358 131903466 138079061 144484574 151598772 159287248
14284A59287248P911654Q237707Q703166R271121J0308681J0617009J0917549
$$ 159287248 167198902 175436609 184139775 193410896 203719577 214336586 225254135
14277B25254135J1831271J2417931J2781723J3146012J3754854J3812031J4157445
$$ 225254135 237085406 249503337 262285060 275431072 289185926 302997957 317155402
14270C17155402J4583601J4030967J4280071J3824334J3629528J1738892J1701868
$$ 317155402 331739003 345769970 360050041 373874375 387503903 399242795 410944663
14263D10944663J0269603R830037Q439318P092915O468239L003663Q63320O81564
$$ 410944663 421214266 431044303 439483621 446576536 453044775 456048438 456911758 457593322
14255D57593322J130063k997786o874388o833557j0212724j2856778j1457181
$$ 457593322 458723385 455725599 448851211 442017654 431804930 418948152 407490971
14248D07490971j3188062j0499064j3700846j4221933j3951739j4583079j3935270
$$ 407490971 394302909 383803845 370102999 355881066 341929327 327346248 313410978
14241C13410978j3604871j3422074j3341314j2223922j2282461j1720357j1891362
$$ 313410978 299806107 286384033 273042719 260818797 248536336 236815979 224924617
14234B24924617j1697135j1098918r168111j0222154r294803q594729p923435
$$ 224924617 213227482 202128564 192960453 182738299 173443496 164848767 156925332
14227A56925332p808607p051747o725473o404887n376086n557955n235822m991852
$$ 156925332 149116725 142064978 135339505 128934618 123558532 118000577 112764755 107772903
14219A07772903m362489m523360l957946m040034k960399l881014l434084k716010
$$ 107772903 103410414 98887054 94929108 90889074 87928675 84047661 80613577 77897567
14211G7897567l264205k798167k381759k507979k470962k048848k046153k133117
$$ 77897567 74633362 71835195 69453436 66945457 64474495 62425647 60379494 58246377
14203E8246377k143897j828351j655390j498513j859320j193989j366531j523928
$$ 58246377 56102480 54274129 52618739 51120226 49260906 48066917 46700386 45176458
14195D5176458j287041j311210j304233p45119j164230q98273j384537r23549
$$ 45176458 43889417 42578207 41273974 40528855 39364625 38466352 37081815 36158266
14187C6158266j161840p24518n93720j318915p05446q99065m29470q69129r11221
$$ 36158266 34996426 34271908 33678188 32359273 31653827 30754762 30325292 29456163 28544942
14178B8544942m66603o48260j065200l42408r00942n76525n29178p76959m8952
$$ 28544942 28078339 27430079 26364879 26022471 25121529 24545004 24015826 23238867 23189915
14169B3189915p28331j92109r38483k80594m17018l96970k15586o16542o1819
$$ 23189915 22461584 22269475 21330992 21050398 20633380 20236410 20020824 19404282 19342463
14160A9342463r07909q9604j72509p97049k16549n6070m71364j77803m10461n63359
$$ 19342463 18434554 18344950 18172441 17375392 17158843 17102773 16631409 16453606 16043145 15479786
14150A5479786o1240k47733o72159L0897k40960k02817l51082k6942m91027j1474
$$ 15479786 15418546 15170813 14498654 14529551 14288591 14085774 13734692 13707750 13216723 13205249
14140A3205249j99557m09802O593k07073j90145n08302n3528k68290j76437j916
$$ 13205249 13005692 12595890 12602483 12395410 12205265 11696963 11643435 11375145 11198708 11196792
14130A1196792k95023j63232l1106l12996o0264k06079j01117o1360o7535j92168
$$ 11196792 10901769 10738537 10707431 10394435 10334171 10128092 10026975 9965615 9898080 9705912
14120I705912l68033j79570j10367N7084j80266j93543j66074J30466k44981J52378
$$ 9705912 9337879 9158309 9047942 9105026 8924760 8731217 8565143 8695609 8450628 8603006
14110H603006k44288N512m41911K48697l20314k86963j80602J72076l55586j14328
$$ 8603006 8358718 8364230 7922319 8171016 7850702 7563739 7383137 7555213 7199627 7085299
14100G085299K87541k01874k59020j19034L26081l42034O7242j34130J36554n27713
$$ 7085299 7372840 7170966 6911946 6792912 7118993 6776959 6844201 6710071 6846625 6318912
14090F318912J05241N616q900j95661l4312l17894J13480k60801k61141M91222
$$ 6318912 6424153 6429769 6420869 6225208 6190896 5873002 5986482 5725681 5464540 5955762
14080E955762k10217K5896j9864l31720K31978m46106j26112K16351j55674j91762
$$ 5955762 5745545 5771441 5751577 5419857 5651835 5205729 5079617 5295968 5140294 4948532
14070D948532n2335j10904K49026m29144R8924K72940j56620k92825N783k57444
$$ 4948532 4896197 4785293 5034319 4605175 4704099 4977039 4820419 4527594 4533377 4275933
14060D275933L11486k04321n4301K78004j65600P275j63643m9659j28102K56381
$$ 4275933 4587419 4383098 4328797 4606801 4441201 4448476 4284833 4235174 4107072 4363453
14050D363453l23836k05152J97284k3K42375J36300j40077m08772p0819L19216
$$ 4363453 4039617 3834465 4031749 4031726 4274101 4410401 4270324 3861552 3790733 4109949
14040D109949l09346k55347J13775N9432l88066J68730J26045J70556l71452K52577
$$ 4109949 3800603 3545256 3659031 3718463 3330397 3499127 3625172 3795728 3424276 3676853
14030C676853K02913o09290J91055k86223K41815o8538k41680j7360j0723J09155
$$ 3676853 3879766 3270476 3461531 3175308 3417123 3348585 3106905 3089545 3078822 3187977
14020C187977m34610L91700J84223j28623M0283l19266J18677N1061j76324M8794
$$ 3187977 2753367 3145067 3329290 3200667 3240950 2921684 3040361 3091422 2915098 2963892
14010B963892j13140O0635l51197K00331M4499k56060J78872j02991K35229k92319
$$ 2963892 2850752 2911387 2560190 2760521 2805020 2548960 2727832 2624841 2860070 2567751
14000B567751k08622L51371l91923k2712K36005J12340k98286j09797J33182J34530
$$ 2567751 2359129 2710500 2318577 2295865 2531870 2644210 2345924 2236127 2369309 2503839
13990B503839l84870M02757j72573j79785N7708n454L19242j83927J90594R4804
$$ 2503839 2118969 2521726 2349153 2169368 2227076 2221622 2540864 2356937 2547531 2642335
13980B642335n554n6021K82041J07996P74360P41495J871477L257448N596103
$$ 2642335 2636781 2580760 2862801 2970797 3745157 4486652 6358129 9615577 15211680
13971A5211680J0872311P894060j2032621q028109m614253j984710j633087p44116
$$ 15211680 26083991 33978051 21945430 13917321 9303068 7318358 5685271 4941155
13963D941155n65453k70370p27323j70402K52697n29799J64447l99575j71494
$$ 4941155 4375702 4105332 3378009 3207607 3460304 2930505 3094952 2695377 2523883
13954B523883L75345n30536J23825J31128l11149k50033J89782j754m4516J67207
$$ 2523883 2899228 2368692 2492517 2623645 2312496 2062463 2252245 2250491 2205975 2373182
13944B373182K2077j0270k98819R5222j87896L31649l28233n9112K66486k12651
$$ 2373182 2395259 2384989 2086170 2181392 1993496 2325145 1996912 1937800 2204286 1991635
13934A991635Q6829m32715J68174p3998m112O3174N9676l62767J13458K78558
$$ 1991635 2078464 1645749 1813923 1739925 1735813 1798987 1858663 1495896 1609354 1887912
13924A887912k79960j30271L29125N7349k61858M01394j46318O29q3561j82164
$$ 1887912 1607952 1477681 1806806 1864155 1602297 2003691 1857373 1858002 1774441 1592277
13914A592277R2233j01740O3477j83848K21065m3969N1858r8702r8359j14025
$$ 1592277 1684510 1582770 1646247 1462399 1683464 1639495 1691353 1592651 1494292 1380267
13904A380267K93044k05017P65j0136l32334K04096M39139l14943K03476M0330
$$ 1380267 1673311 1468294 1469059 1458923 1126589 1330685 1769824 1454881 1658357 1698687
13894A698687k70088R0468l14822Q9261j32274O22226m15004J94638k41359P9165
$$ 1698687 1428599 1519067 1204245 1293506 1161232 1783458 1368454 1563092 1321733 1400898
13884A400898j23370o7014M47260j76962j0963j84172n6494q0981K6932J14311
$$ 1400898 1277528 1210514 1657774 1480812 1469849 1285677 1229183 1148202 1175134 1289445
13874A289445j0595r0456M818k85736Q0323J62892K3763P3179J34890m38294J07561
$$ 1289445 1278850 1188394 1193212 907476 987799 1150691 1174454 1247633 1382523 944229 1051790
13863A051790K49279l37677M00516j14311k44641J69120j59849J25181j71326
$$ 1051790 1301069 963392 1363908 1249597 1004956 1174076 1014227 1139408 968082
13854I68082n8397L31985j09705K47257o17633O33197n62047K65983l4957M35061
$$ 968082 909685 1241670 1131965 1379222 761589 1394786 832739 1098722 1063765 1498826
13844A498826l98692k62637P2193N1290J48228j24525J07416j61822P5716m8063
$$ 1498826 1100134 837497 909690 960980 1109208 984683 1092099 930277 1005993 957930
13834I57930J48872J15703j46721L70454q8806n52405M30105m66723K92235k22760
$$ 957930 1106802 1222505 1075784 1446238 1357432 805027 1235132 768409 1060644 837884
13824H37884P9488J91860k41266l388O5325J96788k69543L8973N6761j872k92878
$$ 837884 917372 1109232 867966 864578 929903 1126691 857148 896121 952882 951010 658132
13813F58132K70848N9974l23631L06809j38966l75819P60554l11851J88227o9298
$$ 658132 928980 988954 665323 972132 833166 457347 1217901 906050 1094277 1024979
13803A024979p9459J1827J62058o9797l30968N8493n7480O0178o6608M91780k97911
$$ 1024979 945520 957347 1119405 1049608 718640 777133 719653 779831 713223 1205003 907092
13792I07092q7780P1868K08076l53278p7445q7914K46066j05533L8595J53596
$$ 907092 819312 891180 1099256 745978 668533 580619 826685 721152 759747 913343
13782I13343C88651L38737j56019K60177K6060J02116j15967J49264l04260K70478
$$ 913343 388651 727388 571369 831546 857606 959722 843755 993019 688759 959237
13772I59237n3778l40723r1350J90181N3164J42000J2637p1067J73715l960m9790
$$ 959237 905459 564736 473386 663567 716731 858731 871368 800301 974016 970056 920266
13761I20266j49598j88435J46513M1574J66056k38713K28946p6645k08099P9476
$$ 920266 770668 582233 728746 770320 936376 697663 926609 849964 641865 721341
13751G21341J90588p6272k74170J1395k39134K94901j1036j02344o3887K87567
$$ 721341 911929 835657 561487 572882 333748 628649 617613 515269 451382 738949
13741G38949j24852r7762l3747j18676K35468o0185R9861J40381k00873B48484
$$ 738949 614097 516335 482588 363912 599380 539195 639056 779437 578564 248484
13730D70680M2454J29463k06461n100K14348o5573L8893k55145J54965B46923
$$ 470680 513134 642597 436136 431036 645384 579811 618704 363559 518524 246923
13719D74775M75938C36539P9762J73054j80336P3398J81408j55532L52898m24040
$$ 474775 950713 336539 416301 589355 409019 482417 663825 508293 861191 437151
13709D37151J69473j68410N7914L9890J53682J75716j94294N6264k06859j66839
$$ 437151 606624 438214 496128 536018 689700 865416 671122 727386 520527 353688
13699C53688R6103J51975P8308j6212J53004B85745M60451k18374j08734n7875
$$ 353688 449791 601766 680074 663862 816866 285745 746196 527822 419088 361213
13689C61213K16942K61675k79788M3502R6609k23717K85284n4671B62662M84786
$$ 361213 578155 839830 560042 603544 700153 476436 761720 707049 262662 747448
13679G47448l44116J33576J04135A82940q4540N06815k05222J17098L119m8447
$$ 747448 403332 536908 641043 182940 98400 605215 399993 517091 520210 471763
13669D71763J20754j22922j36535j58003L31559Q7037j02151j42684A41553L27542
$$ 471763 592517 469595 333060 175057 506616 593653 491502 348818 141553 469095
13659D69095J75461k37235q9695P229R6471j83649O20244l69145A39922N6875
$$ 469095 644556 407321 317626 324855 421326 237677 857921 488776 139922 196797
13649A96797K51796j29919R3993A89817L30996J96557C48444J46467J52455B56089
$$ 196797 448593 318674 412667 189817 520813 717370 348444 494911 647366 256089
13638C41650p4380N3338K27149j32757B0248M49467J04413q1481k20832O1710
$$ 341650 267270 320608 547757 415000 20248 469715 574128 492647 271815 333525
13628C33525l4550K146K13106J12996p8050J5559j99344n6532K03404K58377B49481
$$ 333525 298975 301121 514227 627223 549173 564732 365388 308856 512260 770637 249481
13616E98497B93661L69137l08978M25638B69405q4471M71807k07686j67882j202
$$ 598497 293661 662798 353820 779458 269405 184934 656741 449055 281173 279971
13606B79971k3521K11968j89985K12518p4822j04772k9435K07422k9979p3083
$$ 279971 256450 468418 278433 490951 416129 311357 281922 489344 459365 386282
13596C86282K00197B05757J57460J83125J12374l09726j26777O8151J98308j71723
$$ 386282 586479 205757 363217 546342 658716 348990 222213 290364 488672 316949
13586C16949M676K3188r7972A23171R4780L50001k05822K9245J24382r3775M7409
$$ 316949 321625 344813 246841 123171 217951 567952 362130 391375 515757 421982 469391
13575D69391l8333j14650G1748L09213K2309E9043R9231K48424J82726j7099B71721
$$ 469391 431058 316408 71748 380961 403270 59043 158274 406698 589424 572325 271721
13563F0433L34906J8633H1331L21935R1384j49635A66464K49988P7435k01529
$$ 60433 395339 413972 81331 403266 494650 345015 166464 416452 493887 292358
13553B92358R9595j55619P8601O1723J28735P8803j71561r5999j3157O2132L26690
$$ 292358 391953 236334 314935 376658 505393 584196 412635 316636 303479 365611 692301
13542F92301A90557R4871R3231n1424J8090j01764A17130R9539P4837A02503J63009
$$ 692301 190557 285428 378659 327235 345325 243561 117130 216669 291506 102503 265512
13531B65512B0687M502K22165J00352D2646Q8238K84552j37505p5549e2028C21487
$$ 265512 20687 25189 247354 347706 42646 130884 415436 277931 202382 -52028 321487
13519C58670O540r3363I8918J93370K09541b8129C97403L2899B12821M8258n2727
$$ 358670 365210 271847 98918 292288 501829 -28129 397403 430302 212821 261079 208352
13508B08352J10761k4314R9946A54280O8128K57400A47896L9819J35849A08188
$$ 208352 319113 294799 394745 154280 222408 479808 147896 187715 323564 108188
13497D86981j81259A11230L00185l8682j12887a8818k9835F23172B20361E0878
$$ 486981 305722 111230 411415 372733 259846 -18818 -48653 623172 220361 50878
13486D41063H1558b09305B15727A07306J06910k7263K1002r8419L59164q0506
$$ 441063 81558 -209305 215727 107306 214216 186953 207955 109536 468700 388194
13476C88194j5163F4397J01808J43849J65410j98814h1013A46714J36514L08925
$$ 388194 373031 64397 166205 310054 475464 276650 -81013 146714 283228 592153
13466E92153j30846j88062J87217b6710B62733Q0270q5507K9894G4150l762K82581
$$ 592153 461307 273245 460462 -26710 262733 343003 257496 287390 74150 70388 352969
13455C52969K29345G6394L13141b99009C52660A63719K03257l3195P2226A49844
$$ 352969 582314 76394 389535 -299009 352660 163719 366976 333781 406007 149844
13444B95843m408j34029B3737M28617A44949K47964m9004P3122j52128G7288J28886
$$ 295843 291435 157406 23737 452354 144949 392913 343909 417031 264903 77288 206174
13433B06174K4037c1853B17674c6326C67546j47778n9729p1306J43414A09204
$$ 206174 230211 -31853 217674 -36326 367546 219768 160039 88733 232147 109204
13422E59685A36918J87290K9220A13326a00330A40289M60058A04249A6849J00150
$$ 559685 136918 324208 353428 113326 -100330 140289 600347 104249 16849 116999
13412A16999K37144j22548d99197B18855c47630H8151P8510Q8225K10593B13707
$$ 116999 354143 231595 -499197 218855 -347630 88151 166661 254886 465479 213707
13401d5351I7604l4112j2157M52991k34444F7070J65947n9601g3386C82119j17064
$$ -45351 97604 63492 51335 504326 269882 67070 233017 173416 -73386 382119 265055
13390B65055A30983J43751K0872D241K80621K7928Q6681c6051C88521A54797e88
$$ 265055 130983 274734 295606 4241 284862 312790 399471 -36051 388521 154797 -588
13378A78852o4480Q6633f643A59821J04712L4473d5864C25800j19981I8546C8415
$$ 178852 114372 201005 -6643 159821 264533 299006 -45864 325800 205819 98546 38415
13366A23007B0362K15877b23495e325B36957A16403Q3974J48477G4663L46427
$$ 123007 20362 236239 -223495 -5325 236957 116403 200377 348854 74663 421090
13356D21090A77306K68831A37935p709I278J26829K28609j67618q2268C3719N75064
$$ 421090 177306 446137 137935 130226 9278 136107 364716 197098 114830 33719 608783
13345F08783b6203C70672R2057A29308g4352B81097j29912C8181J31281e8261
$$ 608783 -26203 370672 462729 129308 -74352 281097 151185 38181 169462 -58261
13334d82A39328B5252J61730A3626J66276G5472K25790E1927J57473a8120G8351
$$ -482 139328 25252 186982 13626 179902 75472 301262 51927 209400 -18120 78351
13322B574P4458J52346k4182n806K51190J22247A77533c12442b6145B92448l9385
$$ 2574 77032 229378 205196 199390 450580 572827 177533 -312442 -26145 292448 253063
13311B53063j17524k0895o684M2467a51913B05433E1683J30079K61731j23694
$$ 253063 135539 114644 107960 150427 -151913 205433 51683 181762 443493 319799
13301C19799l0202q4585J71951j42995K43772j44967C2991j2464J10427L55374
$$ 319799 289597 205012 376963 233968 477740 332773 32991 20527 130954 486328
13291D86328G8346J12261N1097D4954J1959J42383n4497c0742E32898k05951a2986
$$ 486328 78346 190607 241704 44954 56913 199296 144799 -30742 532898 326947 -12986
13279C7800L87696D3873N9500J65037R6307A58497J50472a3078B17533p767b42933
$$ 37800 425496 43873 103373 268410 364717 158497 308969 -13078 217533 209766 -242933
13267A63272a11357K9905A32449c5429p8003D03294A32916C9252N2742D1285J9500
$$ 163272 -111357 -81452 132449 -35429 -113432 403294 132916 39252 91994 41285 60785
13256F0785K39561I8399b15802D04852G4623Q005B1170L74548A31958m2413N8661
$$ 60785 300346 98399 -215802 404852 74623 82628 21170 395718 131958 89545 148206
13245A48206n4622a8619j37869c0080A46204K54069H9055j7033K50753j58557
$$ 148206 93584 -18619 -156488 -30080 146204 400273 89055 72022 322775 164218
13235A64218o0706b9776B5992k560J90115j02907a84666A41081K5568l7656K26670
$$ 164218 103512 -29776 25992 23432 213547 110640 -184666 141081 166649 128993 355663
13224C55663G2900J56706N6350a72334A96976F2737M6227a06408L6189B54107
$$ 355663 72900 229606 285956 -172334 196976 62737 108964 -106408 -70219 254107
13213C04398j18008E2904i6715B22476C6124c39656A96302K76370a12993E8575
$$ 304398 186390 52904 -96715 222476 36124 -339656 196302 472672 -112993 58575
13202C71611l0745A21695J70314a68808e5790b3503D59541r1976G8733L02496
$$ 371611 340866 121695 292009 -168808 -55790 -23503 459541 367565 78733 381229
13192C81229j11480J92359A65043J10055b126B26966C180P6918P5182J31303L1944
$$ 381229 269749 462108 165043 275098 -2126 226966 3180 80098 155280 286583 318527
13181C18527B6226J29728J47074a34163A8703M532L12684G7972L6775K34619A72701
$$ 318527 26226 155954 303028 -134163 18703 23235 335919 77972 114747 349366 172701
13169e483A15896i1561D6529e7026C41134d4698l257B01466a50032r387k1356
$$ -5483 115896 -91561 46529 -57026 341134 -44698 -47955 201466 -150032 -159419 -180775
13158a80775A33465d8834C061J22814K2448F9058a8064B88270c73338A02736J06091
$$ -180775 133465 -48834 3061 125875 148323 69058 -18064 288270 -373338 102736 208827
13147B08827p2615b6206q1323C61038j22943j01681a31390B52613a06830C6707
$$ 208827 136212 -26206 -107529 361038 238095 136414 -131390 252613 -106830 36707
13136d65626d0973I6518b87031B88350j06403O4190A12369O7963K59935a61344
$$ -465626 -40973 96518 -287031 288350 181947 246137 112369 180332 440267 -161344
13125I2882a19546A67959A8835a42631B28179j01989o0088J26346d8765A82421
$$ 92882 -119546 167959 18835 -142631 228179 126190 66102 192448 -48765 182421
13114H0973a5191F455Q3686h356C8188O7178b29433C11228a51178C57870p5143
$$ 80973 -15191 6455 90141 -8356 38188 105366 -229433 311228 -151178 357870 282727
13103B82727p2475H1152J92978F4691K51312F1759J22443N218b34086A124e7262
$$ 282727 210252 81152 274130 64691 316003 61759 184202 189420 -234086 1124 -57262
13091A54208D9256a9515B87046A1875N2034f4516F8095K1193K37265A07722i8163
$$ 154208 49256 -19515 287046 11875 63909 -64516 68095 89288 326553 107722 -98163
13079b03243i4230d1537m9297m2898n9053i1510i868A23846L69372a92400A36501
$$ -203243 -94230 -41537 -90834 -133732 -192785 -91510 -9868 123846 493218 -192400 136501
13067A17287M0543A9395a08361C23591I4693b51846A73397d1050j11873c2347
$$ 117287 157830 19395 -108361 323591 94693 -251846 173397 -41050 -152923 -32347
13056C05733j28215P1079n2964N6265g6547r8663h3897h832A15510a73929A08139
$$ 305733 177518 248597 195633 251898 -76547 -175210 -83897 -8832 115510 -173929 108139
13044g680F1133O2748a53051I8769K70641j55992J13571j09904k5508Q3257f0750
$$ -7680 61133 123881 -153051 98769 369410 213418 326989 217085 191577 274834 -60750
13032E950J20716b19610e7443r7759B63833P5483a83773j9655B72473f3794A54222
$$ 5950 126666 -219610 -57443 -155202 263833 339316 -183773 -203428 272473 -63794 154222
13020c5652I7261a24895b8150A01154l8741J71389c3937A71105b40350Q2836A50104
$$ -35652 97261 -124895 -28150 101154 62413 233802 -33937 171105 -240350 -157514 150104
13008A12540c1969C01449a16035D0661i178A60761P4906o4253a4927l3158A87582
$$ 112540 -31969 301449 -116035 40661 -9178 160761 235667 171414 -14927 -48085 187582
12996C2246o249J87306a31810C45919n1589F7683P9548a70354C00000H5188K0415
$$ 32246 25997 213303 -131810 345919 294330 67683 147231 -170354 300000 85188 105603
12985A05603a94453A73431N3257a03163C10429G4979J75502e7231j39378G1377
$$ 105603 -194453 173431 226688 -103163 310429 74979 250481 -57231 -196609 71377
12974e3496B76969a07884B36307D3018K01747a58773j8073h1422D10502G9270
$$ -53496 276969 -107884 236307 43018 244765 -158773 -176846 -81422 410502 79270
12963B69046j02807F9216P3283d5503H4439k1541J8943a39923a7340C1935g2484
$$ 269046 166239 69216 142499 -45503 84439 62898 81841 -139923 -17340 31935 -72484
12951D1590c34717b1884l33139G4949K25090a80393A43701K4300a28969B3897
$$ 41590 -334717 -21884 -355023 74949 300039 -180393 143701 168001 -128969 23897
12940A74590b16086B78554a18193C26950a32204N4072Q719F8043K52787m4427
$$ 174590 -216086 278554 -118193 326950 -132204 -78132 -69413 68043 320830 276403
12930B76403A24745a74420C5354J54152R6979G1755b41189J18949E0992a56643
$$ 276403 124745 -174420 35354 189506 286485 71755 -241189 -122240 50992 -156643
12919A13851b06858f789A21329J27913a713j59231a8213D8667a35840B03162I2074
$$ 113851 -206858 -6789 121329 249242 -1713 -160944 -18213 48667 -135840 203162 92074
12907c2649l6705A51715M46034f6685A43307Q7441f7692p6615G6821P5811G5561
$$ -32649 -69354 151715 597749 -66685 143307 230748 -67692 -144307 76821 152632 75561
12895h2929A9908L5724i2797B74152f8395F0954a08306B37287a6003j05850A63488
$$ -82929 19908 55632 -92797 274152 -68395 60954 -108306 237287 -16003 -121853 163488
12883A14762K8926a1651j27878A83134J9695a50513a4769k50450G9710P0701a44518
$$ 114762 143688 -11651 -139529 183134 202829 -150513 -14769 -265219 79710 150411 -144518
12871A31098b58120A95398A9007h1950C923b16981g5641E4382L6797l201M8504
$$ 131098 -258120 195398 19007 -81950 3923 -216981 -75641 54382 91179 87978 136482
12860A36482g966k25338B03436M1775I3220P4324b58848G7363K9817b19735f0319
$$ 136482 -7966 -233304 203436 245211 93220 167544 -258848 77363 107180 -219735 -60319
12848B30560R822K3009A3877M24067f4165C8422L80313a82967A92579f4267A70126
$$ 230560 240382 263391 13877 437944 -64165 38422 418735 -182967 192579 -64267 170126
12836I600a8510q5777a4564o6178H1713k700c23236A31967i9763N169l17686J07907
$$ 9600 -18510 -104287 -14564 -80742 81713 79013 -323236 131967 -99763 -94594 -412280 -304373
12824c04373C72891a0455E3837K41524r5960E7568a60965j7890N0172B7216c6609
$$ -304373 372891 -10455 53837 295361 199401 57568 -160965 -178855 -128683 27216 -36609
12812B39389j8855o9337N4040r9035j6537g5992C3954j171c5981B01097a01418
$$ 239389 220534 151197 205237 106202 89665 -75992 33954 32783 -35981 201097 -101418
12800a00219A07202a27734B5709N5689A4581N9893J7014I09J56886M865a40079
$$ -100219 107202 -127734 25709 81398 14581 74474 91488 909 157795 162660 -140079
12788a14157C39936j53959d9843C1900K9141O1358a9611j66636R1840A8323b06152
$$ -114157 339936 185977 -49843 31900 61041 122399 -19611 -186247 -94407 18323 -206152
12776B03153d5814l8082j05313A73802C4303j3805b89496K4676C0474a02639F9914
$$ 203153 -45814 -83896 -189209 173802 34303 20498 -289496 -264820 30474 -102639 69914
12764B37133K84418d5620B0303a4823e911A17460a66658B88034F2557f3464k0170
$$ 237133 521551 -45620 20303 -14823 -5911 117460 -166658 288034 62557 -63464 -83634
12753h3634B50307j04882A5973K3726O1907h468j82706C24463G6576i7633M5684
$$ -83634 250307 145425 15973 39699 101606 -8468 -191174 324463 76576 -97633 -51949
12742e1949l41113F3163L6704J6179e0982j58385A77361b5959A72240c29838A95423
$$ -51949 -393062 63163 99867 116046 -50982 -209367 177361 -25959 172240 -329838 195423
12730D74484A13855m0625M4177b12601g9639D3928b47806b7855k69059C20277
$$ 474484 113855 73230 117407 -212601 -79639 43928 -247806 -27855 -296914 320277
12719a59798M7481C6264J60468D8030K79672i4285L1870B75126b13493b0385I0307
$$ -159798 -112317 36264 196732 48030 327702 -94285 -62415 275126 -213493 -20385 90307
12707B5482K3246L25944G7534h7424G2266J22052a66891l1737c011m2541A44443
$$ 25482 48728 374672 77534 -87424 72266 194318 -166891 -198628 -3011 -45552 144443
12695G1214a14027r3728A06297D7291J33009a29799A048J35652K66426j57202
$$ 71214 -114027 -207755 106297 47291 180300 -129799 1048 136700 403126 245924
12685B45924g4633I9033a15770D7586R4609m9510C2443e3963j66114B22653E8666
$$ 245924 -74633 99033 -115770 47586 142195 92685 32443 -53963 -220077 222653 58666
12673A17739g7944H5332b66753h7135A61442o4320a79679A91943g7041A36087
$$ 117739 -77944 85332 -266753 -87135 161442 97122 -179679 191943 -77041 136087
12662A42126c655A09674a40922A0124J73073M1126a44912j95684A64608a80226
$$ 142126 -3655 109674 -140922 10124 183197 224323 -144912 -340596 164608 -180226
12651A35271C3551J49429p9236i9110r4462f537j5128F674b05170l9617B73680
$$ 135271 33551 182980 103744 -99110 -193572 -6537 -21665 6674 -205170 -244787 273680
12639i7953C15984G8709b00933A09536P7785O3600D808J14529A8763J70260I1777
$$ -97953 315984 78709 -200933 109536 187321 250921 4808 119337 18763 189023 91777
12627i7125k329B117a11805D3765c1947j07531N0762A7641J95354H1190M929P526
$$ -97125 -99454 2117 -111805 43765 -31947 -139478 -88716 17641 212995 81190 86119 93645
12615I3645f0004A3171K91673b6099A92829L7007a63345C024L61424C287K63239
$$ 93645 -60004 13171 304844 -26099 192829 229836 -163345 3024 364448 3287 266526
12604B66526j6892b72583B04093o3333F9031f8624B06121a28718q7971i9773B05668
$$ 266526 249634 -272583 204093 140760 69031 -68624 206121 -128718 -216689 -99773 205668
12592A03403a63496O2262B53258b264A7812L8447a0543q1117A330N0150K85741
$$ 103403 -163496 -101234 253258 -2264 17812 56259 -10543 -91660 1330 51480 337221
12581C37221a05687j98717A52303q373g1784B38635e5550A13812D1208b07544
$$ 337221 -105687 -304404 152303 143930 -71784 238635 -55550 113812 41208 -207544
12570C3177J1739K06679G2193a15976D0775a0510q4128A11628b23156c5521o1887
$$ 33177 44916 251595 72193 -115976 40775 -10510 -94638 111628 -223156 -35521 -97408
12559i7408A04498P647J19742d7435H4853h5279A37023a61920C1501b78852C45
$$ -97408 104498 112145 231887 -47435 84853 -85279 137023 -161920 31501 -278852 345
12547A49841o2465C9483c36971A09525a79792A56030m7000m6391L2365A5817K5649
$$ 149841 87376 39483 -336971 109525 -179792 156030 109030 62639 95004 15817 41466
12536D1466a90876A18126L9410b77200a9810A75776a37837k91825a69542f6605
$$ 41466 -190876 118126 157536 -277200 -19810 175776 -137837 -429662 -169542 -66605
12525g0926A67864D6273a17317j58395B58496a83697R1020A45201J7554G95a27403
$$ -70926 167864 46273 -117317 -275712 258496 -183697 -92677 145201 162755 795 -127403
12513i0650c8055k30589d4854D49941a73308f7452A55633G2468K23634c0865A35489
$$ -90650 -38055 -268644 -44854 449941 -173308 -67452 155633 72468 296102 -30865 135489
12501a08447B470J9602f4880o0014F7306b49317A96543a3907D1034K259a26924
$$ -108447 2470 22072 -64880 -124894 67306 -249317 196543 -13907 41034 43293 -126924
12489B38088a25906b3050A89926e3700B38818n2912n7559L6975a13342p6930A52184
$$ 238088 -125906 -23050 189926 -53700 238818 185906 128347 165322 -113342 -190272 152184
12477A13014A3861J02724K053a62240I5971a58214A39871b6796A89530g151j90262
$$ 113014 13861 116585 118638 -162240 95971 -158214 139871 -26796 189530 -7151 -197413
12466a97413R5068p1179B0672K74701E3701i2996A166M6796J71002b61305D7352
$$ -197413 -102345 -173524 20672 295373 53701 -92996 1166 47962 218964 -261305 47352
12454B24827A06872h3590B11419o1557g2890n263l26980H6208b20799J03576e0947
$$ 224827 106872 -83590 211419 149862 -72890 -78153 -405133 86208 -220799 -117223 -50947
12442b06427d2584q08I6758b01567B17554B0758a08507I696b35147G7234a90222
$$ -206427 -42584 -43392 96758 -201567 217554 20758 -108507 9696 -235147 77234 -190222
12430E2216J16642f622p8811F4067N4135C2610f5704n237A56659n0383b26625
$$ 52216 168858 -6622 -85433 64067 118202 32610 -65704 -70941 156659 106276 -226625
12418b4040A77294b59757P3373a5922j32699J7022r1128L0497E7633a09013F258
$$ -24040 177294 -259757 -186384 -15922 -148621 -131599 -222727 -192230 57633 -109013 6258
12406B03683c3319B36784B20e6543B75986a11061A57613h7569I8901c947A71972
$$ 203683 -33319 236784 220 -56543 275986 -111061 157613 -87569 98901 -3947 171972
12394I9630K17243c1548l34267R3934C2231J17815a04773A44638b55829F6847
$$ 99630 316873 -31548 -365815 -271881 32231 150046 -104773 144638 -255829 66847
12383c1914Q077A20223n2098R2682C9561c43235b2445o8654k972H6545i0773C82639
$$ -31914 -23837 120223 68125 160807 39561 -343235 -22445 -91099 -94071 86545 -90773 382639
12370C53004j74049a81164N8232A38956A6559a43124C3742J23278a08128j60040
$$ 353004 178955 -181164 -122932 138956 16559 -143124 33742 157020 -108128 -268168
12360b68168C81882e4757q9451B43392D2265j9589a39691F3990b72710b0256C24720
$$ -268168 381882 -54757 -144208 243392 42265 22676 -139691 63990 -272710 -20256 324720
12348F7096j8009a41630B31620G7375b4480a632k94321B15985l703l1903a96054
$$ 67096 49087 -141630 231620 77375 -24480 -1632 -295953 215985 212282 180379 -196054
12336a31506e6486j04708b2353B2384J52087F9531g9451l26932A17211L2618J92546
$$ -131506 -56486 -161194 -22353 22384 174471 69531 -79451 -406383 117211 149829 342375
12325C42375G1401J90956a64739O3123k41743I4091a21029F6699b84849g1094
$$ 342375 71401 262357 -164739 -101616 -343359 94091 -121029 66699 -284849 -71094
12314I4611a03600H4952L45887Q0674h3811r5628B86506l3326a91165D663M68831
$$ 94611 -103600 84952 430839 511513 -83811 -179439 286506 253180 -191165 4663 473494
12303D73494r4754q2507j44095K35000A23039q015J25389j04582m3290Q6306f3021
$$ 473494 378740 296233 152138 387138 123039 115024 240413 135831 92541 178847 -63021
12291d12849C37366j17542i3274G3620K60362j56366Q7594r6379a2508k5353D3734
$$ -412849 337366 219824 -93274 73620 333982 177616 265210 168831 -12508 -37861 43734
12279D7248O4123h2183C9438a50351B29154e4644A15643l4630a0683A44078E2902
$$ 47248 111371 -82183 39438 -150351 229154 -54644 115643 81013 -10683 144078 52902
12267I2047c1448B19004L5926C2969L0414f1418B96944a0654I07J68429G7384
$$ 92047 -31448 219004 254930 32969 63383 -61418 296944 -10654 907 169336 77384
12255B2354L96064j91633q8674K59883q7826J47485H9297K9905g5676B54336h1058
$$ 22354 418418 226785 138111 397994 310168 457653 89297 119202 -75676 254336 -81058
12243B33602b7273B14286a9138k29145D30678b73785C6794K47581r9284C0826
$$ 233602 -27273 214286 -19138 -248283 430678 -273785 36794 284375 185091 30826
12232a11118b1280i613H1631a28528n4609d6560I9162l7271b43255A4509c0177
$$ -111118 -21280 -9613 81631 -128528 -183137 -46560 99162 61891 -243255 14509 -30177
12220a71901B7344h5772A69607h4375K7247A59300P5215C3917q294J20244n2893
$$ -171901 27344 -85772 169607 -84375 -57128 159300 234515 33917 25623 145867 92974
12209I2974L3753R868D4082J62016j6650k0458G1882L23870I7136J12113J01686
$$ 92974 126727 136595 44082 206098 189448 168990 71882 395752 97136 209249 310935
12198C10935A15256J32440J43966a80181E8116B0896O4280k9425N2605b04418
$$ 310935 115256 247696 391662 -180181 58116 20896 85176 55751 108356 -204418
12187C40606q1547b91070A71870B5095J43950a2881D87402k25821G4064K70524
$$ 340606 259059 -291070 171870 25095 169045 -12881 487402 261581 74064 344588
12177C44588l9721b2406N334I6969B8512J6945A4045K2159K96435H6467J6212
$$ 344588 304867 -22406 -17072 96969 28512 45457 14045 36204 332639 86467 102679
12166A02679m0131J29972E9573b3054r008B82879E2478k5813L54345p5730K41146
$$ 102679 62548 192520 59573 -23054 -32062 282879 52478 26665 381010 305280 546426
12155E46426A85258K62379A84371g2194E49635B11289Q9640j10901f2990B95984
$$ 546426 185258 447637 184371 -72194 549635 211289 300929 190028 -62990 295984
12144F00899k21614j87043K39951A85063g3531A47569n8163J94801a71371B48135
$$ 600899 379285 192242 432193 185063 -73531 147569 89406 284207 -171371 248135
12133d8506j42109G5054a2901A62629F0300L85095j75274b2713k1546C86146j88765
$$ -48506 -190615 75054 -12901 162629 60300 445395 270121 -22713 -44259 386146 197381
12122A97381L2920e7280C34583c4482F177J72015R1125j07657L40550d64308a78372
$$ 197381 230301 -57280 334583 -34482 6177 178192 269317 161660 502210 -464308 -178372
12110B32878K44859A07567N137J41025d2693o3928q8435A80823l4424j2073a7750
$$ 232878 477737 107567 112704 253729 -42693 -106621 -195056 180823 146399 134326 -17750
12098A14245J07004J41752A36463E3475A1867a5712G4840f0511B2417J0561L06337
$$ 114245 221249 363001 136463 53475 11867 -15712 74840 -60511 22417 32978 339315
12087C39315g2175B16650f5238A28322P7586f5187j19692H0257e0067q2024G3176
$$ 339315 -72175 216650 -65238 128322 205908 -65187 -184879 80257 -50067 -132091 73176
12075D20527j73456A6785R9964m2363C4969J19485K30723j64662b2204B59249
$$ 420527 247071 16785 116749 74386 34969 154454 385177 220515 -22204 259249
12064A70390p2663K11515p1010O934a0189A78450P7353J55345A27489b79958A64671
$$ 170390 97727 309242 238232 245166 -10189 178450 255803 411148 127489 -279958 164671
12052A28741a59515A71905a94101P84D9430a31618d7379r4485I8214f706A19693
$$ 128741 -159515 171905 -194101 -193317 49430 -131618 -47379 -141864 98214 -6706 119693
12040c1145j96399P6138m1285B52213n0786E668i1563k7782n8976f9666j33057
$$ -31145 -227544 -151406 -192691 252213 201427 5668 -91563 -119345 -178321 -69666 -202723
12029b02723A83523p5762c47751F525K41633i4550D0444P0656g0387n292b7251
$$ -202723 183523 107761 -347751 6525 248158 -94550 40444 111100 -70387 -75679 -27251
12017A4989N7794b92115B07095a91399H6904J07458a67945A53906G1317K84715
$$ 14989 72783 -292115 207095 -191399 86904 194362 -167945 153906 71317 356032
12007C56032c00486F8700Q9881b10795B80015e2091j72392A06813N2908l4472
$$ 356032 -300486 68700 158581 -210795 280015 -52091 -224483 106813 159721 125249
11997A25249b20060f8859j24606d3208k12296A21321j7716K58661a39740N3874
$$ 125249 -220060 -68859 -193465 -43208 -255504 121321 103605 362266 -139740 -85866
11987h5866L9861k08638n6583F3108B6749a29541l6513J7430B20887a65908B25260
$$ -85866 -46005 -254643 -311226 63108 26749 -129541 -166054 -148624 220887 -165908 225260
11975a02020k82268C5512d4342j30840A47355G3571g8526j11384g7305B0555b2355
$$ -102020 -384288 35512 -44342 -175182 147355 73571 -78526 -189910 -77305 20555 -22355
11963a34509G5488B0851b23294J0576o885h0253a1123A24877l1021b3880j49459
$$ -134509 75488 20851 -223294 -212718 -219603 -80253 -11123 124877 93856 -23880 -173339
11952a73339f9508j81803A02450a32124B14257l4170G5161c57372H9976a01535
$$ -173339 -69508 -251311 102450 -132124 214257 180087 75161 -357372 89976 -101535
11941F0536c19272A14954h7926A85875a69875j2193G563P8446J7855a20817F0333
$$ 60536 -319272 114954 -87926 185875 -169875 -182068 7563 86009 103864 -120817 60333
11929a48225j63193b3079j0618B55363a2751p3648B96262o2746E4206J40794B059
$$ -148225 -311418 -23079 -33697 255363 -12751 -86399 296262 233516 54206 195000 2059
11917A40579C6596a3471n9890j1329B7123h7944j83945A11271j1510L2714h7143
$$ 140579 36596 -13471 -73361 -84690 27123 -87944 -271889 111271 99761 132475 -87143
11905b5019B97100F0828a01751k5323M1688m379F1530b30615j06304E01534G6478
$$ -25019 297100 60828 -101751 -127074 -85386 -89765 61530 -230615 -336919 501534 76478
11893i5797c7648h384K066k73035h397A88364A9140K62707M87C9862L758h7604
$$ -95797 -37648 -8384 -6318 -279353 -8397 188364 19140 281847 282334 39862 43620 -87604
11880a14217B146P7963h9533A79990a90718A30189b51743d998B53517a0413H2273
$$ -114217 2146 80109 -89533 179990 -190718 130189 -251743 -4998 253517 -10413 82273
11868A06060l0449b91675B67131A08554b67025I3598m541c30285I6469a95676
$$ 106060 75611 -291675 267131 108554 -267025 93598 89057 -330285 96469 -195676
11857a05752j20259a877A31548a10016B19051a59613j18683J27048p242j23928
$$ -105752 -226011 -1877 131548 -110016 219051 -159613 -278296 -151248 -158490 -282418
11847b82418e0497j45274Q4460b7061F9939L41466b19848f2643j06319k0157k41238
$$ -282418 -50497 -195771 -111311 -27061 69939 411405 -219848 -62643 -168962 -189119 -430357
11836d30357i1504G2665h6991k5334A85295H4341L12430i9269B23957a05054q205
$$ -430357 -91504 72665 -86991 -112325 185295 84341 396771 -99269 223957 -105054 -113259
11825a13259J4486c7131j45966l4042B35371O2746a28294r9782G2480a2248A87583
$$ -113259 -98773 -37131 -183097 -217139 235371 298117 -128294 -228076 72480 -12248 187583
11813i0266L1336F1706f9439D5882b70598A1650a44834k43604k16623b9772p8207
$$ -90266 -58930 61706 -69439 45882 -270598 11650 -144834 -388438 -605061 -29772 -107979
11802a07979D6226i7517F6890i172j29537D6004e1983I0505c0391q8918j23447
$$ -107979 46226 -97517 66890 -9172 -138709 46004 -51983 90505 -30391 -119309 -242756
11791b42756O5351H8440a36416l979A00196g6007j37136B8205a26253a3237q9877
$$ -242756 -177405 88440 -136416 -140395 100196 -76007 -213143 28205 -126253 -13237 -103114
11780a03114A22683a73281a1101l53107A59311O0313a98623R4472A05196a40420
$$ -103114 122683 -173281 -11101 -364208 159311 219624 -198623 -104151 105196 -140420
11769h9462K6115A35559A4828d983F2819f9279C2464M7194e0397p2902j31657
$$ -89462 -63347 135559 14828 -4983 62819 -69279 32464 79658 -50397 -123299 -254956
11758b54956A04403J93988a63524E756b96849A06486m4232d21707a95732C6737
$$ -254956 104403 298391 -163524 5756 -296849 106486 62254 -421707 -195732 36737
11747e8019n6866p1031c0383A04600b81043G8658J71013A24316P7643e5760A36892
$$ -58019 -114885 -185916 -30383 104600 -281043 78658 249671 124316 201959 -55760 136892
11735A1578J99636N9895G6449P9203c9690B58414E354i1941I9182b35625I4333
$$ 11578 211214 271109 76449 155652 -39690 258414 5354 -91941 99182 -235625 94333
11723a75036P0075k0588j5678b2680H1464a65627b0778o763A25768D9466a3548
$$ -175036 -104961 -125549 -141227 -22680 81464 -165627 -20778 -27541 125768 49466 -13548
11711b07332A61841b3832j24966B36495G0075J70579a27138e9009a8860k8626
$$ -207332 161841 -23832 -148798 236495 70075 240654 -127138 -59009 -18860 -47486
11701d7486o0092j326A38725e5724B92N6614R6590B7132k579b25453B71745C8269
$$ -47486 -107578 -108904 138725 -55724 292 56906 153496 27132 24553 -225453 271745 38269
11688a63486C5265P8778b81850C0402i2957A92065a31998n6416A85354j5700J63160
$$ -163486 35265 114043 -281850 30402 -92957 192065 -131998 -188414 185354 169654 332814
11677C32814b8595H2721K5260b71026A31508h6731o0579A76199k4873J3789K0219
$$ 332814 -28595 82721 107981 -271026 131508 -86731 -147310 176199 151326 165115 185334
11666A85334a12601b1890A5222h173n8964C2135A010J1901i1615I6001a7368k59842
$$ 185334 -112601 -21890 15222 -8173 -67137 32135 1010 12911 -91615 96001 -17368 -277210
11654b77210D21931c06785b423k34483A08754K1061b96955r6967c9694a3877o2056
$$ -277210 421931 -306785 -2423 -236906 108754 129815 -296955 -393922 -39694 -13877 -75933
11643g5933k6370A93381J66773I3577k7480A4738J1465K81012k9233g9368C9889
$$ -75933 -102303 193381 360154 93577 66097 14738 26203 307215 277982 -79368 39889
11631A04620a3220p1635G3644a40323N9628l0955J8416B23174k7779d7865K3372
$$ 104620 -13220 -84855 73644 -140323 -80695 -111650 -93234 223174 195395 -47865 -24493
11620b4493A46101Q8270D7946h1844b8031r1536k11732B47381N6234E2500f4894
$$ -24493 146101 234371 47946 -81844 -28031 -119567 -331299 247381 303615 52500 -64894
11608A9087J64945K67615c2463j67105o2315J13427A21977a86471L8573a7921
$$ 19087 184032 451647 -32463 -199568 -261883 -148456 121977 -186471 -147898 -17921
11597i6463a3099A55994p4046a20146b7271A42853K76388a65984B68024e4322
$$ -96463 -13099 155994 81948 -120146 -27271 142853 419241 -165984 268024 -54322
11586g2603F3237J9005a01385F3217a66706A08028a57409A29274e6369p8899N8253
$$ -72603 63237 82242 -101385 63217 -166706 108028 -157409 129274 -56369 -135268 -77015
11575g7015A00392K74303A26499D4159L9825c51910c0930B55938J231o5136o0609
$$ -77015 100392 374695 126499 44159 83984 -351910 -30930 255938 257169 192033 131424
11564A31424h650j77516B66966k4594c39B4336b42310D65419A63243b17021h5384
$$ 131424 -8650 -186166 266966 242372 -339 24336 -242310 465419 163243 -217021 -85384
11552E8889a14946b945B03350q7199K6294a48133L1785A16705k6859i375o8914
$$ 58889 -114946 -2945 203350 116151 142445 -148133 -116348 116705 89846 -9375 -78289
11541g8289q16J3006B47226r0067J51176E7979a50533A4791J71552b6473q7949
$$ -78289 -79105 -66099 247226 157159 308335 57979 -150533 14791 186343 -26473 -114422
11530a14422I5078h2334H5262J42594J7065A13175C8298K8379L16300I4539J69062
$$ -114422 95078 -82334 85262 227856 244921 113175 38298 66677 382977 94539 263601
11519B63601j26317n4783l6851i3899a3276A63507D6714J08155l1525a60567C0999
$$ 263601 137284 82501 45650 -93899 -13276 163507 46714 154869 123344 -160567 30999
11507I4466J03241P8299a5008A89752e1387A81996I0357l9184j4208J96220j10917
$$ 94466 197707 276006 -15008 189752 -51387 181996 90357 51173 36965 233185 122268
11496A22268J09194b3579j22913A40425k5563a46278d8900A69398a029H6852K35779
$$ 122268 231462 -23579 -146492 140425 114862 -146278 -48900 169398 -1029 86852 322631
11485C22631a01564J0935A49476B5009K7692L45691H4178a6245A68350P317J70005
$$ 322631 -101564 -90629 149476 25009 52701 398392 84178 -16245 168350 175667 345672
11474C45672b70764e8842p547B49881d6206I5257N2967J27999p3663j1525J92789
$$ 345672 -270764 -58842 -66389 249881 -46206 95257 148224 276223 202560 191035 383824
11463C83824p5134F9506L0549P8605p8801K078C6973P4943m9728a76174B72330
$$ 383824 308690 69506 100055 178660 99859 101937 36973 111916 62188 -176174 272330
11451a53875o7045A97466G4102a29034K4572r188A94876J2386o414n0525B0096
$$ -153875 -220920 197466 74102 -129034 -104462 -113650 194876 207262 200848 150323 20096
11439D0033a09797D2344M3758K4381K38793A6074J42720a05420A28817D307K89612
$$ 40033 -109797 42344 86102 110483 349276 16074 158794 -105420 128817 4307 293919
11428B93919L03401A14021a51591G3031L21021c58472C13598B621O5745D894b28633
$$ 293919 597320 114021 -151591 73031 394052 -358472 313598 2621 68366 4894 -228633
11416a55558A7537M6672b12703G0581a5677C35182D8669J15885c78939J10811
$$ -155558 17537 64209 -212703 70581 -15677 335182 48669 164554 -378939 -268128
11406b68128e1245a1829D41054A15033E498g7585B94155B9818i8989A92600A1550
$$ -268128 -51245 -11829 441054 115033 5498 -77585 294155 29818 -98989 192600 11550
11394a7876l2157l34088a26439A31946d01369A79563H5773c8147r1866F4495N947
$$ -17876 -50033 -384121 -126439 131946 -401369 179563 85773 -38147 -130013 64495 70442
11383G0442a40510j5561g7117H5839J66829q2836a90071o0340J24111c0123k822
$$ 70442 -140510 -156071 -77117 85839 252668 169832 -190071 -250411 -126300 -30123 -32945
11372c2945L654r4303k04091G3399d0268l7732D8249K5744b09736B76137i3538
$$ -32945 -29291 -123594 -327685 73399 -40268 -78000 48249 73993 -209736 276137 -93538
11360G4285a32188B6782i3638D5906a15858B01691a7583k86790A18199j6869O2317
$$ 74285 -132188 26782 -93638 45906 -115858 201691 -17583 -304373 118199 101330 163647
11349A63647K07974f7655k36314a37446E5092f2265a2971A69219f2105j82407
$$ 163647 371621 -67655 -303969 -137446 55092 -62265 -12971 169219 -62105 -244512
11339b44512J5205R9604e6134k65569F5498b82083A45351f5802j71376O0392I6876
$$ -244512 -229307 -129703 -56134 -321703 65498 -282083 145351 -65802 -237178 -176786 96876
11327D9253b79998A48742m832P74a30917N3137B09803C0639c17554a50884B6014
$$ 49253 -279998 148742 143910 144684 -130917 -77780 209803 30639 -317554 -150884 26014
11315b43368C29414L10087b42040A64867g483D3714a66022k1359j02491B5974
$$ -243368 329414 639501 -242040 164867 -7483 43714 -166022 -187381 -289872 25974
11304b65396f5431A25270K23941a16043l68379B0221R8681a34707D64872A23615
$$ -265396 -65431 125270 349211 -116043 -484422 20221 118902 -134707 464872 123615
11293A67002a11536C1538J10019a02970j5050k0783O1453B18813I0087E799a30599
$$ 167002 -111536 31538 141557 -102970 -118020 -138803 -77350 218813 90087 5799 -130599
11281a29230M1917n99c590k13591B28890G9568K17524a47244E0730a2512j40015
$$ -129230 -87313 -87912 -3590 -217181 228890 79568 297092 -147244 50730 -12512 -152527
11270a52527A45629J09409a12112A77060n642e3159r6174A06354f251B06708a80228
$$ -152527 145629 255038 -112112 177060 171418 -53159 -149333 106354 -6251 206708 -180228
11258a26693p7559R5762A76558F1307Q367b19770k0725d4285J4630j37556h1325
$$ -126693 -204252 -108490 176558 61307 69674 -219770 -240495 -44285 -29655 -167211 -81325
11246g9926B3600c5720j92843a8569k9580D2304b9281j38754b660r0033c6996
$$ -79926 23600 -35720 -228563 -18569 -48149 42304 -29281 -168035 -2660 -92693 -36996
11234a77435I177d6997k04855N6703L0659p3402j7994A1773f291A2780a31404
$$ -177435 9177 -46997 -251852 -195149 -164490 -237892 -255886 11773 -6291 12780 -131404
11222d8158A34636f500I1692a93064A46052a71835I3573d21838A5863L6916a23122
$$ -48158 134636 -6500 91692 -193064 146052 -171835 93573 -421838 15863 52779 -123122
11210H7127a57283j31279f4064r5507a9783j17798c6410D165a08634n7871k16429
$$ 87127 -157283 -288562 -64064 -159571 -19783 -137581 -36410 4165 -108634 -166505 -382934
11199c82934C19617A33997k3980a28757F7053b86351Q6860M5614B07681b48317
$$ -382934 319617 133997 110017 -128757 67053 -286351 -199491 -153877 207681 -248317
11188A9519b40894B47110f2897H210d3750j01902j1299B98902a36344A24262Q8920
$$ 19519 -240894 247110 -62897 8210 -43750 -145652 -156951 298902 -136344 124262 213182
11177B13182m2854p8605B1611J2664a73627E6878e41934J37889F7978a43875A81895
$$ 213182 170328 91723 21611 34275 -173627 56878 -541934 -404045 67978 -143875 181895
11165a20387j64030O413A76997q1651d3683k00167q7741a35101O2819D9889d6644
$$ -120387 -284417 -278004 176997 95346 -43683 -243850 -331591 -135101 -72282 49889 -46644
11153a22754k55490B25529a36614m7272I9790B4046J91106H0528l4346p488I942
$$ -122754 -378244 225529 -136614 -183886 99790 24046 215152 80528 46182 38694 9942
11141b20076B90101B8625g5020L2652A562J5642J97874p6441a25726p3183M9780
$$ -220076 290101 28625 -75020 -42368 1562 17204 215078 138637 -125726 -198909 -149129
11130a49129K914N2061F1423F962d3687l6581B07817B6672b18308G3103B1477
$$ -149129 -146215 -94154 61423 6962 -43687 -80268 207817 26672 -218308 73103 21477
11118A02132a86785c1948m888l7352E8793c29408F0949J88108j13429e349k28690
$$ 102132 -186785 -31948 -36836 -74188 58793 -329408 60949 249057 135628 -5349 -234039
11107b34039E5740R2543b52872J04515A50426N3009b92400h2951E5596J21129
$$ -234039 55740 148283 -252872 -148357 150426 203435 -292400 -82951 55596 176725
11097A76725B0240b08286G0797J09862J53882h5888A81210B5038a963j23062B33120
$$ 176725 20240 -208286 70797 180659 334541 -85888 181210 25038 -1963 -125025 233120
11085B09256O886a45295B17522H4303a8723C9760J02333J14285b09105c1659j00555
$$ 209256 216142 -145295 217522 84303 -18723 39760 142093 256378 -209105 -31659 -132214
11074a32214C09990A05763J4523J007J61877A22325P5892q6224J45786A7091B581
$$ -132214 309990 105763 120286 121293 283170 122325 198217 111993 257779 17091 2581
11062A81787O4946c0079H3392L29378r0645k2139q5001L25430B64524G4098J76574
$$ 181787 246733 -30079 83392 412770 322125 299986 214985 540415 264524 74098 250672
11051B50672N5784J62345h1888B39742K61451k01551K4513O1206A65975a09721
$$ 250672 306456 468801 -81888 239742 501193 299642 324155 385361 165975 -109721
11040D54283o1031A82633j4203O1887K47605R572J5750A43327L49258j52450L43649
$$ 454283 393252 182633 168430 230317 477922 487494 503244 143327 492585 340135 683784
11029F83784B99402L32665J67804k80607K29195k16623k5856P7119K25544j24971
$$ 683784 299402 632067 799871 519264 748459 531836 505980 583099 808643 683672
11019F83672j09182k50349L34640R7151l67250j0844J17832j89713K38271J32675
$$ 683672 574490 324141 658781 755932 388682 377838 495670 305957 544228 676903
11009F76903p5553r8946J21580J11050J16433k55388k30122J05859J44147R1978
$$ 676903 601350 502404 623984 735034 851467 596079 365957 471816 615963 707941
10999G07941C03553L1193J09649K4202j75530p5886J29695J50632j76039J98116
$$ 707941 303553 334746 444395 468597 293067 217181 346876 497508 321469 519585
10989E19585K28079A63166L8461K90436m3399K09980M2900k45483K03434K7524
$$ 519585 747664 163166 201627 492063 448664 658644 701544 456061 659495 687019
10979F87019j59047J58044k18440J00471K49600j25691k749l13563M13358k02925
$$ 687019 527972 686016 467576 568047 817647 691956 689207 375644 789002 586077
10969E86077j13104M46878k29588J7202O9486J28812O4015j98853L95674J13554
$$ 586077 472973 919851 690263 707465 776951 905763 969778 770925 1166599 1280153
10959A280153L69421o84470Q07769k08618K97452o1732l32945Q56039n02577M02097
$$ 1280153 1649574 965104 1772873 1564255 1861707 1799975 1467030 2323069 1820492 2222589
10949B222589k87013j47310R157J47969n78880M6404J00362j94771K60325J12969
$$ 2222589 1935576 1788266 1797423 1945392 1366512 1412916 1513278 1318507 1578832 1691801
10939A691801l58905L13825L1164L5580k7110n52292Q7062k64976k31897K6596
$$ 1691801 1332896 1646721 1677885 1713465 1686355 1134063 1221125 956149 724252 750848
10929G50848j4769k65561j75452M4982J21586A00935J59785B4998P6667L52132
$$ 750848 736079 470518 295066 340048 461634 100935 260720 24998 101665 453797
10919D53797B08582q3236o1498K09514A30234c8379k8729A32716J47895G8784
$$ 453797 208582 125346 63848 273362 130234 -38379 -67108 132716 280611 78784
10908C4361a61435A25291e9215I3217R9039J81722G3050a78578A151a11067A68042
$$ 34361 -161435 125291 -59215 93217 192256 373978 73050 -178578 1151 -111067 168042
10896a52095j06554B55310r9743b30267B87974A0402a03043N1343c871p4070j33702
$$ -152095 -258649 255310 155567 -230267 287974 10402 -103043 -51700 -3871 -77941 -211643
10885b11643e0077B67466e9613j91j74579B60534a57318q4181a4155k03352E9676
$$ -211643 -50077 267466 -59613 -59804 -234383 260534 -157318 -241499 -14155 -217507 59676
10873a27968B25641h6585B7630a25137b2200A0110i4018c3147j81322H2574K39968
$$ -127968 225641 -86585 27630 -125137 -22200 10110 -94018 -33147 -214469 82574 322542
10862C22542c90270a56458e2975j16143O3635A18234B5765J90460D0800J16731
$$ 322542 -390270 -156458 -52975 -169118 -105483 118234 25765 216225 40800 157531
10852A57531n5012A3167a84927q4666a15779A88048g1125l6441o1740O1462j18753
$$ 157531 102519 13167 -184927 -269593 -115779 188048 -71125 -107566 -169306 -107844 -226597
10841b26597j21072J58492j7480Q1756a0742B48244j06164a56086A22484l2380
$$ -226597 -347669 -189177 -206657 -124901 -10742 248244 142080 -156086 122484 90104
10831I0104c02238g8712p0065d9286o177K6715k4841I8858K8470k8543b61869
$$ 90104 -302238 -78712 -148777 -49286 -55463 -28748 -53589 98858 127328 98785 -261869
10819b52357g5754b0094L189A61109d1600D17743h8198C3583c05604J06775q2597
$$ -252357 -75754 -20094 -16905 161109 -41600 417743 -88198 33583 -305604 -198829 -281426
10808b81426e0333b0117j37268j39890I7165d84075J6149B17426H1967c14437
$$ -281426 -50333 -20117 -157385 -297275 97165 -484075 -467926 217426 81967 -314437
10797g9394A33090b37453A08525c32537a20523b2689G0612a26534j03316l7444
$$ -79394 133090 -237453 108525 -332537 -120523 -22689 70612 -126534 -229850 -267294
10787b67294b1970k16118M7646j83084L4678h1819B6873b41927a08655l69411
$$ -267294 -21970 -238088 -190442 -373526 -338848 -81819 26873 -241927 -108655 -478066
10777d78066a1211j2906B50314G089a22896j7786B77410k6017a86369c0651o4441
$$ -478066 -11211 -24117 250314 7089 -122896 -140682 277410 251393 -186369 -30651 -95092
10766i5092r4714A18138a60518n8099A2714f1882j6280A3263K26097D535L5993
$$ -95092 -189806 118138 -160518 -218617 12714 -61882 -78162 13263 239360 4535 40528
10755D0528L9947e679C7753g6201D3347b63219c2041C29904k8406A45932f2009
$$ 40528 80475 -5679 37753 -76201 43347 -263219 -32041 329904 301498 145932 -62009
10743d2829A7088c12809f6209j9619D595b52187r626M1177B0204b02579J5160
$$ -42829 17088 -312809 -66209 -85828 4595 -252187 -261813 -220636 20204 -202579 -187419
10732a87419A01737b29802A32642n6432a51033f5367A77040i1307q5982L1156
$$ -187419 101737 -229802 132642 76210 -151033 -65367 177040 -91307 -177289 -146133
10722a46133a5750o7628j61395H4708b3617A75988A5831M8348B2901e2556J8455
$$ -146133 -15750 -83378 -244773 84708 -23617 175988 15831 64179 22901 -52556 -34101
10711c4101F7795J2548b63949e8791r2427M0618L2225n7676B8316L2110d5258
$$ -34101 67795 80343 -263949 -58791 -151218 -110600 -78375 -136051 28316 60426 -45258
10699B6506J51816d35413d9676j65312A8480L71167h3638n3627m5496Q7205c0909
$$ 26506 178322 -435413 -49676 -214988 18480 389647 -83638 -137265 -182761 -95556 -30909
10687a20478M2532e640A89642b15342A1835N0155K22953j32423J8467l5370h0909
$$ -120478 -77946 -5640 189642 -215342 11835 61990 284943 152520 170987 135617 -80909
10675a59346N8921A03146K52362d0761j14418J158d8439H5731L5016A6425h9983
$$ -159346 -100425 103146 355508 -40761 -155179 -154021 -48439 85731 120747 16425 -89983
10663G627b08512g1418A23015a12134L9369j253G572L5829d6699k76394i4862
$$ 7627 -208512 -71418 123015 -112134 -72765 -74018 7572 43401 -46699 -323093 -94862
10651a37670m9980A31114Q2782p8283a4542j27542a4716F0136J6438N8030D9384
$$ -137670 -187650 131114 213896 135613 -14542 -142084 -14716 60136 76574 134604 49384
10639g8224j17301G3956b48576E3134O2321f1660p9550l3665e7612l67659D0965
$$ -78224 -195525 73956 -248576 53134 115455 -61660 -141210 -174875 -57612 -425271 40965
10627B824K81573j31059F7603f744q4622B9597g6974q3998A80048E9328b66952
$$ 2824 284397 153338 67603 -6744 -91366 29597 -76974 -160972 180048 59328 -266952
10615B61964a72521O6024p5676G2719J5940h9626j55857A19244a22628i801p0002
$$ 261964 -172521 -106497 -182173 72719 88659 -89626 -245483 119244 -122628 -9801 -79803
10604g9803o0874a1691B47632c72367D962b95237a1601j77176k33880R1052D0851
$$ -79803 -140677 -11691 247632 -372367 4962 -295237 -11601 -188777 -422657 -331605 40851
10592f0k1447j65341A50171a44159k45603B5150a16915j789L0340D0348K48711
$$ -60 -21507 -186848 150171 -144159 -389762 25150 -116915 -118704 -88364 40348 289059
10581B89059j00454D7935a7002I3013c93362C26552h4356B32251C5855c61546
$$ 289059 188605 47935 -17002 93013 -393362 326552 -84356 232251 35855 -361546
10570A20846a58803E7993j9265h3413m03287A23827a3745j72142h7999A75491
$$ 120846 -158803 57993 38728 -83413 -486700 123827 -13745 -185887 -87999 175491
10559C28956a29183C9353g2732b4810H7705a97654d2955k38598B07677c21570
$$ 328956 -129183 39353 -72732 -24810 87705 -197654 -42955 -281553 207677 -321570
10548A94154i312l132D078b02505m594A44369b4094j57890j53038A99625d18058
$$ 194154 -9312 -12444 4078 -202505 -207099 144369 -24094 -181984 -335022 199625 -418058
10536g5903G4435e5713n4446q90B8904K46915h0135l4895I0325O8934b76215j21748
$$ -75903 74435 -55713 -110159 -111049 28904 275819 -80135 -115030 90325 159259 -276215 -397963
10524c97963J97733m9631D7554e7573p221k63522E6650L50253c5553B27330f5579
$$ -397963 -200230 -249861 47554 -57573 -64794 -328316 56650 406903 -35553 227330 -65579
10512H5550j9598a47881A55069n7938a4601j02648A42895c01673k35029b8036
$$ 85550 65952 -147881 155069 97131 -14601 -117249 142895 -301673 -536702 -28036
10501A51201o1990d54551a03220K6108k0975A90612A9729b01679M6878n1832A07580
$$ 151201 89211 -454551 -103220 -77112 -98087 190612 19729 -201679 -154801 -206633 107580
10489f28115a66294j71957A18022C9811d7957k19664A10817l9915B5470L7553
$$ -628115 -166294 -338251 118022 39811 -47957 -267621 110817 70902 25470 63023
10479F3023g3909k29382R6493g7458I3811c95469B82550j30605a85197N6704H8658
$$ 63023 -73909 -303291 -206798 -77458 93811 -395469 282550 151945 -185197 -128493 88658
10467c4539C5706a79073A2397b36944b6800B83559j16437Q6410J76172A31573
$$ -34539 35706 -179073 12397 -236944 -26800 283559 167122 253532 429704 131573
10456C67093k8251B633J37574R4006j16023a18867a021C0089c39524D9599a77572
$$ 367093 338842 2633 140207 234213 118190 -118867 -1021 30089 -339524 49599 -177572
10444A13876D7262C557a08158J4775A41537C6563b7630j37269B1406a5996F2309
$$ 113876 47262 3557 -108158 -93383 141537 36563 -27630 -164899 21406 -15996 62309
10432c5436G906a26166k42096a65755A29989i6050h662D9166e3988k29104a6402
$$ -35436 7906 -126166 -368262 -165755 129989 -96050 -8662 49166 -53988 -283092 -16402
10420e5869L604k87240J69668A29202A8269J81663b78530d1074k19803f1937j00448
$$ -55869 -52265 -339505 -169837 129202 18269 199932 -278530 -41074 -260877 -61937 -162385
10409a62385O0114b3327E1113b10699L8888a4965A91805M34773a80497M6667c8725
$$ -162385 -102271 -23327 51113 -210699 -171811 -14965 191805 626578 -180497 -133830 -38725
10397e370k8536I0651f6474j40898A0562e2925B3712a6846o7239J3374F1014c20255
$$ -5370 -33906 90651 -66474 -207372 10562 -52925 23712 -16846 -84085 -70711 61014 -320255
10384b60326B35820h6787B89595a39514B16032a02628j05833C16745A2729a10330
$$ -260326 235820 -86787 289595 -139514 216032 -102628 -208461 316745 12729 -110330
10373B7720J39553N8825J62424A14944c76964a74403D27142E5210O8248a41842
$$ 27720 167273 226098 388522 114944 -376964 -174403 427142 55210 123458 -141842
10362a04552A85166J9847c24183B721J21126M9809d620A55426L53963A51046D1716
$$ -104552 185166 205013 -324183 2721 123847 173656 -4620 155426 509389 151046 41716
10350C70382m6710J21438j45520J24785A31488J10181c0337G4624M07390A84174
$$ 370382 323672 445110 299590 424375 131488 241669 -30337 74624 482014 184174
10339A09182a49342D04197j19554p7502m2339P1129j14791m6411J43779B2556
$$ 109182 -149342 404197 284643 207141 164802 235931 121140 74729 218508 22556
10328C23101I6508N26494B34765J32072I2984J15075o1260J12289P6037J71627
$$ 323101 96508 623002 234765 366837 92984 208059 146799 259088 335125 506752
10318E06752B8566J23149j8228c3788q5713i423C7424a48398I9678A1715M93847
$$ 506752 28566 151715 133487 -33788 -119501 -9423 37424 -148398 99678 11715 505562
10307E05562k37125F0516p606Q7652J67639J67773k07386n6767m1770J1650a3689
$$ 505562 268437 60516 52910 140562 308201 475974 268588 211821 170051 181701 -13689
10295d3033A75825b49446A41359d8237n9207A41889J8894a40714C57199C2958
$$ -43033 175825 -249446 141359 -48237 -107444 141889 160783 -140714 357199 32958
10284b09883d7648A14979n392b20188h3240q7260L7201o9079q1799j59019a80053
$$ -209883 -47648 114979 109587 -220188 -83240 -170500 -133299 -202378 -284177 -443196 -180053
10272H5491K4260a67804q3880D3225J45628c03355c371k29007k7719B58578o9928
$$ 85491 109751 -167804 -251684 43225 188853 -303355 -3371 -232378 -260097 258578 188650
10261A88650B7136b34308a07663C8359N5546K258b0220A32139M508h2787j70548
$$ 188650 27136 -234308 -107663 38359 93905 96163 -20220 132139 136647 -82787 -253335
10250b53335b7899l7224A31258c3917A59734p9405l734j8549M8056M4569P8848
$$ -253335 -27899 -65123 131258 -33917 159734 80329 76595 58046 106102 150671 229519
10239B29519a14966C58501j38132O531k5570J27750j06533j9674j00405g0003
$$ 229519 -114966 358501 220369 226900 201330 329080 222547 202873 102468 -70003
10228D6523d6875l7603A53182a11202D9653Q0631e020A81208G1576O0903K5874
$$ 46523 -46875 -84478 153182 -111202 49653 130284 -5020 181208 71576 132479 158353
10217A58353p2834d5192G9611b12474g0767H7858C8316Q5361e0122k58267A55784
$$ 158353 85519 -45192 79611 -212474 -70767 87858 38316 123677 -50122 -308389 155784
10205c468D7520c00621J42212A91916m13G1502b8902E2991L57102a69832Q0817
$$ -3468 47520 -300621 -158409 191916 191503 71502 -28902 52991 410093 -169832 -89015
10194h9015a4824j46280K2700k8115H9570g2011B01180b35280E4437b37646c2582
$$ -89015 -14824 -161104 -138404 -166519 89570 -72011 201180 -235280 54437 -237646 -32582
10182H1088b47956G9814k936c99360B7285o07G266J61273a17841A04051b02009
$$ 81088 -247956 79814 76878 -399360 27285 26678 7266 168539 -117841 104051 -202009
10170c3616C57326g8348k14929C2955J10989b03544O4171k9088F056i7924q8554
$$ -33616 357326 -78348 -293277 32955 143944 -203544 -139373 -168461 6056 -97924 -186478
10159a86478J8488E0181b30459r1051G7564a05597A63035c94854G5619a81726
$$ -186478 -167990 50181 -230459 -321510 77564 -105597 163035 -394854 75619 -181726
10148a17012K7645r8667A43536a35047k80970g6356C39271J44973a48033j03630
$$ -117012 -89367 -188034 143536 -135047 -416017 -76356 339271 484244 -148033 -251663
10138b51663A58309a18941A770b39602e8401K2409q2067L0782L5647l08481c924
$$ -251663 158309 -118941 1770 -239602 -58401 -35992 -118059 -87277 -51630 -360111 -3924
10126B17977c5996i934k14489L7439b4262j86649n0573H9871f0762n8724e8704
$$ 217977 -35996 -9934 -224423 -186984 -24262 -210911 -261484 89871 -60762 -119486 -58704
10114d14718a68831F5576a24430j85824C5251b85564J3163j36694H1406Q2338
$$ -414718 -168831 65576 -124430 -310254 35251 -285564 -272401 -409095 81406 163744
10104A63744b87720a32006e9485k26554J26361a1639B23343a06511k01243c6051
$$ 163744 -287720 -132006 -59485 -286039 -159678 -11639 223343 -106511 -307754 -36051
10093b17993R8460j7789C7662d2050k5246j69783c6456j26242k8031M539A1479
$$ -217993 -119533 -137322 37662 -42050 -67296 -237079 -36456 -162698 -190729 -186190 11479
10081c17468F4587b01262g3666B14146J01384a45904A04857m2430c5721A73493
$$ -317468 64587 -201262 -73666 214146 315530 -145904 104857 62427 -35721 173493
10070b99762J19461o987a4630k50101G9618i1591m14970J57417F8170A2779K30357
$$ -299762 -180301 -187288 -14630 -264731 79618 -91591 -506561 -349144 68170 12779 243136
10059B43136a05051A65951E0929J78995a01954M7114J0676j3429O057p6k61143
$$ 243136 -105051 165951 50929 229924 -101954 -54840 -44164 -57593 -51536 -51612 -312755
10048c12755i2272l09738a23832B64365A25648j5847b60368B13054L0151q1032
$$ -312755 -92272 -402010 -123832 264365 125648 109801 -260368 213054 243205 162173
10038A62173c3199k98626a27265B19291a86135g1595k03819D733b8672A76851
$$ 162173 -33199 -331825 -127265 219291 -186135 -71595 -275414 4733 -28672 176851
10027c34010o6148a3328A45419D8513i8318I6957a68607O6437l71959A65377a76578
$$ -334010 -400158 -13328 145419 48513 -98318 96957 -168607 -102170 -474129 165377 -176578
10015b18844I3729H793N9143f8604I3301a26877j46290M6207a6160m54045a72222
$$ -218844 93729 8793 67936 -68604 93301 -126877 -273167 -226960 -16160 -470205 -172222
10003h2456j8022L6367j26564A8572c8601j7381A51888k1076a70928f4147q5300
$$ -82456 -100478 -64111 -190675 18572 -38601 -55982 151888 130812 -170928 -64147 -149447
9992a49447M1845p4454L2536d5215J5509k22284A52043A6292a60690e6229G655
$$ -149447 -107602 -182056 -149520 -45215 -29706 -251990 152043 16292 -160690 -56229 7655
9980A58638a26200p8645E0410b21358K8729k26777a61302A2528a20134M4072o330
$$ 158638 -126200 -204845 50410 -221358 -192629 -419406 -161302 12528 -120134 -76062 -82392
9969h2392r4164B35692j16905E9272b39414e6117r7758q2161a13798G3746J01325
$$ -82392 -176556 235692 118787 59272 -239414 -56117 -153875 -236036 -113798 73746 175071
9958A75071a56023N9192A1586J24579K2697f4389C43134b73392j39134a88316
$$ 175071 -156023 -96831 11586 136165 158862 -64389 343134 -273392 -412526 -188316
9947e5308j95037A95549d2532j85492A31336a8118k021C5322b98225n3543i605
$$ -55308 -250345 195549 -42532 -228024 131336 -18118 -20139 35322 -298225 -351768 -9605
9935i2002o8576d3294A92298B2430J2329f7543k02533J09389K508b4395l00215
$$ -92002 -160578 -43294 192298 22430 34759 -67543 -270076 -160687 -158179 -24395 -324610
9924c24610a1685k79816B93825b18683B60380E4369J54349i3009C489b91011a35753
$$ -324610 -11685 -291501 293825 -218683 260380 54369 208718 -93009 3489 -291011 -135753
9912G9206N0726j2185P207k2482a39408o4830n6368C4227M0535k197N2624a59628
$$ 79206 129932 117747 124954 102472 -139408 -204238 -260606 34227 74762 72565 125189 -159628
9899A00790K6019D6131c25531f6460H6857A2630P2300b21271j2817A05876c75912
$$ 100790 126809 46131 -325531 -66460 86857 12630 84930 -221271 -234088 105876 -375912
9887a48732k32018Q3414B8108c6950B49149e1945G1707J50397b1455l01625J49573
$$ -148732 -380750 -297336 28108 -36950 249149 -51945 71707 222104 -21455 -323080 -173507
9876a73507n5115j41219G7222d47310a2458A91801d43152b12339C7349a26117
$$ -173507 -228622 -369841 77222 -447310 -12458 191801 -443152 -212339 37349 -126117
9865c79894C2483h7592k39077A06926b4911j08663A26111c54408a58706H8355
$$ -379894 32483 -87592 -326669 106926 -24911 -133574 126111 -354408 -158706 88355
9854a72347h323j90451R8515A26509h7474k00157f853B66670f3341Q477B2592
$$ -172347 -8323 -198774 -100259 126509 -87474 -287631 -6853 266670 -63341 -54864 22592
9842B7735b5946f488j48308A3890M7269J01372a26031d5706j48478H7127M5081
$$ 27735 -25946 -6488 -154796 13890 61159 162531 -126031 -45706 -194184 87127 132208
9831A32208b32754i6825l7212j47977i1510q5401q4638g568k72701c1345l67340
$$ 132208 -232754 -96825 -134037 -282014 -91510 -176911 -261549 -7568 -280269 -31345 -398685
9820c98685A26789J45112f6192E1640Q4598b30127f7739A15955i4412o2499A07017
$$ -398685 126789 271901 -66192 51640 136238 -230127 -67739 115955 -94412 -156911 107017
9808f9114j6120n6110j0433b7794C9570a32258H390f0110j4507B18766c61947
$$ -69114 -85234 -141344 -151777 -27794 39570 -132258 8390 -60110 -74617 218766 -361947
9796g6972A33858J70411A02757Q3300b7040m44764a273m8716A41482A137a45458
$$ -76972 133858 304269 102757 186057 -27040 -471804 -1273 -49989 141482 1137 -145458
9784a19455B71805a26847j87877H525b25268J01987N1008L758B6752J63288o6397
$$ -119455 271805 -126847 -314724 8525 -225268 -123281 -72273 -68515 26752 190040 123643
9773A23643C3153a07337j73943R9202a394A02562c27788b5597m72897i5547A17711
$$ 123643 33153 -107337 -281280 -182078 -1394 102562 -327788 -25597 -498494 -95547 117711
9761a29529j14359K4101Q8521C1332b24843E6991b50651F2477b52272C9775j1826
$$ -129529 -243888 -219787 -131266 31332 -224843 56991 -250651 62477 -252272 39775 27949
9750B7949c47536D39526d5143B5146a71247A37853d6079K2222j14791E8076b52174
$$ 27949 -347536 439526 -45143 25146 -171247 137853 -46079 -23857 -138648 58076 -252174
9738a38483e8802A29449R7928b71076b6567A84747b03645B51616q3499g279r3763
$$ -138483 -58802 129449 227377 -271076 -26567 184747 -203645 251616 168117 -7279 -101042
9727a01042O584m787C07599a52082c393j65296A0674b11014A13555b88815J10139
$$ -101042 -94458 -99245 307599 -152082 -3393 -168689 10674 -211014 113555 -288815 -178676
9716a78676a7160A17938a28385j13994i2238j55102j47835J73090i797m44504
$$ -178676 -17160 117938 -128385 -242379 -92238 -247340 -395175 -222085 -9797 -454301
9706d54301G6J64691m0141a47300q0721A37133a30394n5163R0583l17433a79193
$$ -454301 76 164767 124626 -147300 -228021 137133 -130394 -185557 -94974 -412407 -179193
9694A2960M30672A933p04b43161h3124j47440b7297A38845F2565g8619l49730
$$ 12960 443632 1933 1229 -243161 -83124 -230564 -27297 138845 62565 -78619 -428349
9683d28349d8535n035J8914j12046D5193K5827b31300E114J64609a89938j49855
$$ -428349 -48535 -53570 -34656 -146702 45193 71020 -231300 5114 169723 -189938 -339793
9672c39793b9635m78457i1407C2312O5798L7135D2073b63319i0402l6832j45019
$$ -339793 -29635 -508092 -91407 32312 98110 135245 42073 -263319 -90402 -127234 -272253
9661b72253a5971j10995j08092G2985C1745J02847N205a33339r5033e2063q1603
$$ -272253 -15971 -126966 -235058 72985 31745 134592 139797 -133339 -228372 -52063 -133666
9650a33666E5349h8358r567K5830b223r2791k55942J54770p7246D1260b03276
$$ -133666 55349 -88358 -97925 -72095 -2223 -95014 -350956 -196186 -273432 41260 -203276
9638d09537c3798p6710a212C86644c40433B23811a50453L6900p4170B3669M8501
$$ -409537 -33798 -110508 -1212 386644 -340433 223811 -150453 -113553 -187723 23669 72170
9627G2170a99925m848R7543D8268a55099a6986D8925c61325J10801D22059a91922
$$ 72170 -199925 -204773 -107230 48268 -155099 -16986 48925 -361325 -250524 422059 -191922
9615a99443Q9213e1551k60788A86040Q7825a57814A93991i3880C67492A57434
$$ -199443 -110230 -51551 -312339 186040 273865 -157814 193991 -93880 367492 157434
9604A71805j7793b81362C2694d9260j71375F6185L6907b48813J19837j1462O6361
$$ 171805 154012 -281362 32694 -49260 -220635 66185 103092 -248813 -128976 -140438 -74077
9593g4077r7625B18346a28529k5735M4434H3380L1496a72434f2996a9599c154
$$ -74077 -171702 218346 -128529 -154264 -109830 83380 114876 -172434 -62996 -19599 -3154
9581C6506b78970P7940j94033b8192j58327A55956D0013a23441d100j7373D882
$$ 36506 -278970 -201030 -395063 -28192 -186519 155956 40013 -123441 -4100 -21473 4882
9569c9621H7935a44360o0097a9225l1376A77980b30782g0792D5358c97944d4658
$$ -39621 87935 -144360 -204457 -19225 -50601 177980 -230782 -70792 45358 -397944 -44658
9557g6521j1536B35987e3427P589l08632b0433m6137n5820k1243A61194b16720
$$ -76521 -88057 235987 -53427 -45838 -354470 -20433 -66570 -122390 -143633 161194 -216720
9545b47635A4866b14698L8001K2520A62233n7518c47397H7847A8504O3253a15130
$$ -247635 14866 -214698 -176697 -154177 162233 104715 -347397 87847 18504 81757 -115130
9533A57480j5647e2260m195E5402c5098B13071A9676e4793b2057l45143F6093
$$ 157480 141833 -52260 -56455 55402 -35098 213071 19676 -54793 -22057 -367200 66093
9521I2845A0269c2502f698k40400d0429l1882K4546j39967L6155J0960f9244A51805
$$ 92845 10269 -32502 -6698 -247098 -40429 -72311 -47765 -187732 -151577 -140617 -69244 151805
9508A33098g9010j07275k9943h3019k914j09205A1865a79419J4525e6568B658
$$ 133098 -79010 -186285 -216228 -83019 -85933 -195138 11865 -179419 -164894 -56568 2658
9496f0784c0297a2096A13828J54572j01614p7608N2583h8908k3902k17605D3704
$$ -60784 -30297 -12096 113828 268400 166786 89178 141761 -88908 -112810 -330415 43704
9484g3518j69309A06590a15297D18487b69621A3310b24950f7021B56562p0310
$$ -73518 -242827 106590 -115297 418487 -269621 13310 -224950 -67021 256562 186252
9474A86252a16362G4816b48847a3776j92727c558m0345A851a26488I5918a14631
$$ 186252 -116362 74816 -248847 -13776 -206503 -3558 -43903 1851 -126488 95918 -114631
9462A13270b47568C2783G677a31780H1206c05668a39173N7734n589l36482a68121
$$ 113270 -247568 32783 7677 -131780 81206 -305668 -139173 -81439 -87028 -423510 -168121
9450b39359j5435d7557E8078e04906a74336g2517K0092k0052A10565d08655A62548
$$ -239359 -254794 -47557 58078 -504906 -174336 -72517 -52425 -72477 110565 -408655 162548
9438h4611K7870l1409k6674M4037C01073b31816g8785j2637I1597c99159H7194
$$ -84611 -56741 -88150 -114824 -70787 301073 -231816 -78785 -91422 91597 -399159 87194
9426B63999M6079g5016k89427a06957k07997a32266J024A68625J1748I0116L6599
$$ 263999 310078 -75016 -364443 -106957 -314954 -132266 -131242 168625 180373 90116 126715
9415A26715c18005G6746i4870C35481a56997d0415j29874M5777k61278B24615
$$ 126715 -318005 76746 -94870 335481 -156997 -40415 -170289 -124512 -385790 224615
9404i5688p6744B4949b96657a35592c4156A96253b40177A0503K30696f9870B15572
$$ -95688 -172432 24949 -296657 -135592 -34156 196253 -240177 10503 241199 -69870 215572
9392a88046a2532j91150M8983c036k21487g2925r4287d1866A07821e21655K56959
$$ -188046 -12532 -203682 -154699 -3036 -224523 -72925 -167212 -41866 107821 -521655 -264696
9381b64696j9421E9064h7732j03389B19676m2366g381D3989K6722a35578l562
$$ -264696 -284117 59064 -87732 -191121 219676 177310 -7381 43989 70711 -135578 -139140
9370a39140l9104J6036o0338k21755A76083f9883l5686k7146B6315a69494f0871
$$ -139140 -178244 -162208 -222546 -444301 176083 -69883 -105569 -132715 26315 -169494 -60871
9358a86311J1971G4773J7325J87525b69696O0564h2731j80906N7270L4725O8242
$$ -186311 -174340 74773 92098 279623 -269696 -209132 -82731 -263637 -206367 -171642 -103400
9347a03400b9915j37653j6061m1019M2523L1705C46084f4513j76509P4602c3573
$$ -103400 -29915 -167568 -183629 -224648 -182125 -150420 346084 -64513 -241022 -166420 -33573
9335A18653c622j40413j4998J9672j51992d8771p9415B2454b20009A16054C7946
$$ 118653 -3622 -144035 -159033 -139361 -291353 -48771 -128186 22454 -220009 116054 37946
9323e2688j5854D12745B685O171f1781D8427c30479f998B5535e8625A43822d06754
$$ -52688 -68542 412745 2685 8856 -61781 48427 -330479 -6998 25535 -58625 143822 -406754
9310I8859a51143F5496g4019j94939F801a70044N748c9994j84166A02628a59502
$$ 98859 -151143 65496 -74019 -268958 6801 -170044 -164296 -39994 -224160 102628 -159502
9298e7713i361A63523c87245A90315a1630k07462L300g332k9698k24948i6986
$$ -57713 -9361 163523 -387245 190315 -11630 -219092 -215792 -7332 -37030 -261978 -96986
9286a79653f0869o7805d2116k58762h7016B1821g3207l511A32546d8436a5611
$$ -179653 -60869 -128674 -42116 -300878 -87016 21821 -73207 -76718 132546 -48436 -15611
9274D338c1341j31742F0117f4702j65940k23350a31187k2623p6602b5256A23224
$$ 4338 -31341 -163083 60117 -64702 -230642 -453992 -131187 -153810 -230412 -25256 123224
9262a84364Q8594j60425B78466E9789N6107e9584j47600A21849L2885a21850k95177
$$ -184364 -95770 -256195 278466 59789 115896 -59584 -207184 121849 154734 -121850 -417027
9251d17027B24200A01597b84761a34974j9192B24980a72015L4908B32203g7233
$$ -417027 224200 101597 -284761 -134974 -154166 224980 -172015 -137107 232203 -77233
9240h5491j42126p4122c3566j50175B4943e1554f64C13758f8564D6358a1438l53068
$$ -85491 -227617 -301739 -33566 -183741 24943 -51554 -664 313758 -68564 46358 -11438 -364506
9228c64506G7674Q0589b79738j84788a14445H4903a38587b2653k34974a05707
$$ -364506 77674 158263 -279738 -464526 -114445 84903 -138587 -22653 -257627 -105707
9217C20494a17014D9647c42586C6959b27043g2175a031j08259M6558J3058k18504
$$ 320494 -117014 49647 -342586 36959 -227043 -72175 -1031 -109290 -62732 -49674 -268178
9206b68178B3285D816J5863d39978g3149b5977D3640b84567G4943d2289j45209
$$ -268178 23285 4816 20679 -439978 -73149 -25977 43640 -284567 74943 -42289 -187498
9195a87498P1674K2768k22576c7388o9142a6043H6802K93269a55450A29179b3818
$$ -187498 -115824 -93056 -315632 -37388 -106530 -16043 86802 380071 -155450 129179 -23818
9183b56537A31236A5761N6318d19298a07152m3462C0460c02017c6019B3448a48001
$$ -256537 131236 15761 72079 -419298 -107152 -150614 30460 -302017 -36019 23448 -148001
9171A6746c0703m352A7635g4004L833a9197m8766C091L09592b89981g6159k10889
$$ 16746 -30703 -35055 17635 -74004 -70171 -19197 -67963 3091 312683 -289981 -76159 -287048
9159b87048J09723b9638j63504j05015Q4294g431j52131L2358J2258q6115D9046
$$ -287048 -177325 -29638 -193142 -298157 -213863 -7431 -159562 -127204 -114946 -201061 49046
9147B09711a01389B59663e8892A01827A3915h9646n8427F5391g6964c1643B00917
$$ 209711 -101389 259663 -58892 101827 13915 -89646 -148073 65391 -76964 -31643 200917
9135a29534A04633b12144m6439J10259j89013h8485j21089C49162D4229j198a22013
$$ -129534 104633 -212144 -258583 -148324 -337337 -88485 -209574 349162 44229 43031 -122013
9123h1330n2906I4531c8151k21565D5181b09420N8668L0286b9187n6045L6155
$$ -81330 -134236 94531 -38151 -259716 45181 -209420 -150752 -120466 -29187 -85232 -49077
9112d9077B5674c58037a72701L7704K2958B7674b39813j05369I8764b41076M6712
$$ -49077 25674 -358037 -172701 -134997 -112039 27674 -239813 -345182 98764 -241076 -194364
9101a94364b9524A71249c8549A28595B8298a17510l32086J72214A08412b3951
$$ -194364 -29524 171249 -38549 128595 28298 -117510 -449596 -277382 108412 -23951
9090b7959C5448b63810N6802f4180k68510a7219C08447h6335A36547c09793J29156
$$ -27959 35448 -263810 -207008 -64180 -332690 -17219 308447 -86335 136547 -309793 -180637
9079a80637B89112c03292J0934M516O7797A48356a20681A35941b80549E9227c0060
$$ -180637 289112 -303292 -292358 -287842 -220045 148356 -120681 135941 -280549 59227 -30060
9067A65701a81709B5498a46975C44847B7476a17378B30385a04058L5187A1443
$$ 165701 -181709 25498 -146975 344847 27476 -117378 230385 -104058 -68871 11443
9056A90738a68213M0269A08492A310L9665J15536R2676b01603A37590J62415i0460
$$ 190738 -168213 -127944 108492 1310 40975 156511 249187 -201603 137590 300005 -90460
9044a89171A47259a43779j0819l9710j7017c4833l87649a9267B58408d6543n2281
$$ -189171 147259 -143779 -154598 -194308 -211325 -34833 -422482 -19267 258408 -46543 -98824
9033i8824F2030F713J637a41447j10779j42087A62929A5748J6373J14150g5217
$$ -98824 62030 6713 8350 -141447 -252226 -394313 162929 15748 32121 146271 -75217
9021A69592m3846a20400A97088H3739a96052e7658n8801l0002A3707P3912G645
$$ 169592 125746 -120400 197088 83739 -196052 -57658 -116459 -146461 13707 87619 7645
9009A92459D8184a02129A91103b18938c0877B39343b2133A83777d48268f1586
$$ 192459 48184 -102129 191103 -218938 -30877 239343 -22133 183777 -448268 -61586
8998b9745o6049j87323E7050L0859c8481A22053Q3896e3597H1430c9931f643G860
$$ -29745 -95794 -283117 57050 87909 -38481 122053 205949 -53597 81430 -39931 -6643 7860
8985a44440j19629O1626k84357a61953J405C97363j93268a47573l4463C15129
$$ -144440 -264069 -202443 -486800 -161953 -160548 397363 204095 -147573 -182036 315129
8974A59773Q5037j07626f5651A2934a10233K6443k3810K2373O374C5369d50697
$$ 159773 244810 137184 -65651 12934 -110233 -83790 -107600 -85227 -78853 35369 -450697
8962g6069B93038i6917n5482B07155a2012I4171R0715a9770j47112d5762j268
$$ -76069 293038 -96917 -152399 207155 -12012 94171 184886 -19770 -166882 -45762 -47030
8951d7030B63515A7996c66419E8880A4077K52900b28693n2699J21872R907B49859
$$ -47030 263515 17996 -366419 58880 14077 266977 -228693 -281392 -159520 -149613 249859
8939g7050j01352k27964a04472E1177b02270J3643A2917b70476C6830a67372a9316
$$ -77050 -178402 -406366 -104472 51177 -202270 -188627 12917 -270476 36830 -167372 -19316
8927B6232K6533b76544J9849b7425l31236l1178a87314A25789k9577P291K23928
$$ 26232 52765 -276544 -256695 -27425 -358661 -389839 -187314 125789 96212 103503 327431
8916C27431j08032H2942J94389c7295E11085B12123N3592K10644j86869N01510
$$ 327431 219399 82942 277331 -37295 511085 212123 265715 476359 289490 791000
8906G91000K23462Q39461J373697M222575k304849B540079j237778m10103D00320
$$ 791000 1014462 1853923 3227620 7450195 5145346 2540079 1302301 892198 400320
8896C44222J48870D7317a38712A93054q6573K37770A292K67861C7319L25575G5012
$$ 344222 493092 47317 -138712 193054 106481 344251 1292 269153 37319 362894 75012
8884b67967B39595I1754f6930C508L0852O8428a94431A02892d8208l39166a67902
$$ -267967 239595 91754 -66930 3508 34360 102788 -194431 102892 -48208 -387374 -167902
8872c391m43823G9471d4404q9925A67212a46375A01748B2135Q9044f0290D2658
$$ -3391 -447214 79471 -44404 -134329 167212 -146375 101748 22135 111179 -60290 42658
8860d23201a77281H467a92504b2829K4E5211b01995P3028D2576c45254a06955
$$ -423201 -177281 8467 -192504 -22829 -22805 55211 -201995 -128967 42576 -345254 -106955
8848H0108d24277d0324J7309j50327Q664A79332c7669F6159A4489c01469B72735
$$ 80108 -424277 -40324 -23015 -173342 -164678 179332 -37669 66159 14489 -301469 272735
$$ [...]
##END NTUPLES=NMR SPECTRUM
##END=
