
##TITLE=AC1207_MCiAH12041_7155062_eldopUTpDe
##JCAMPDX= 6.0         $$ Bruker NMR JCAMP-DX V2.0
##DATA TYPE= NMR SPECTRUM
##DATA CLASS= NTUPLES
##ORIGIN= BRUKER
##OWNER= Administrator
$$ 1.72 TOPSPIN		Version 2.1
$$ 2012-12-01 20:39:02.206 -0500  Administrator@X
$$ Compression mode = diff/dup
##.OBSERVE FREQUENCY= 400.02188249412
##.OBSERVE NUCLEUS= ^1H
##.ACQUISITION MODE= SIMULTANEOUS (DQD)
##.ACQUISITION SCHEME= undefined
##.AVERAGES= 8
##.DIGITISER RES= 22
##SPECTROMETER/DATA SYSTEM= spect
##.PULSE SEQUENCE= zg30
##.SOLVENT NAME= COFFEE_meoh
##.SHIFT REFERENCE= INTERNAL, COFFEE_meoh, 1, 14.98509
##AUDIT TRAIL= $$ (NUMBER, WHEN, WHO, WHERE, PROCESS, VERSION, WHAT)
$$ ##TITLE= Audit trail, TOPSPIN		Version 2.1
$$ ##JCAMPDX= 5.01
$$ ##ORIGIN= Bruker BioSpin GmbH
$$ ##OWNER= Administrator
$$ $$ E:\/data/COFFEE/nmr/AC1207_MCiAH12041_7155062_eldopUTpDe/10/pdata/1/auditp.txt
$$ ##AUDIT TRAIL=  $$ (NUMBER, WHEN, WHO, WHERE, PROCESS, VERSION, WHAT)
(   1,<2012-12-01 20:38:54.144 -0500>,<Administrator>,<X>,<go>,<TOPSPIN 2.1>,
      <created by zg
	started at 2012-12-01 20:37:47.597 -0500,
	POWCHK enabled, PULCHK disabled,
       configuration hash MD5:
       86 BA 57 50 F2 9D 5C 9B 26 00 A9 28 5F 66 2E 89
       data hash MD5: 64K
       C9 F7 F0 E5 B6 81 CD 7A C2 AB 52 07 0B A3 96 5B>)
(   2,<2012-12-01 20:38:57.190 -0500>,<Administrator>,<X>,<proc1d>,<TOPSPIN 2.1>,
      <Start of raw data processing
       efp LB = 0 FT_mod = 6 PKNL = 1 PHC0 = 0 PHC1 = 0 SI = 32K 
       data hash MD5: 32K
       15 08 4F 6C 04 A7 FB EB 9E 37 A6 FB 57 E3 1C 83>)
(   3,<2012-12-01 20:38:57.659 -0500>,<Administrator>,<X>,<proc1d>,<TOPSPIN 2.1>,
      <pk PHC0 = 95.89966 PHC1 = 0 
       data hash MD5: 32K
       04 36 50 70 47 34 8C F5 40 DD D3 4C 2A F2 C1 50>)
(   4,<2012-12-01 20:38:57.894 -0500>,<Administrator>,<X>,<proc1d>,<TOPSPIN 2.1>,
      <abs ABSG = 1 
       data hash MD5: 32K
       29 9E D3 1A F1 81 B7 62 46 B8 54 B1 E1 A6 06 EC>)
(   5,<2012-12-01 20:38:58.050 -0500>,<Administrator>,<X>,<proc1d>,<TOPSPIN 2.1>,
      <abs ABSG = 2 
       data hash MD5: 32K
       5B 80 93 EA BD 65 4A 65 72 23 A8 0C 33 73 8D A4>)
(   6,<2012-12-01 20:38:58.190 -0500>,<Administrator>,<X>,<proc1d>,<TOPSPIN 2.1>,
      <abs ABSG = 3 
       data hash MD5: 32K
       36 2C DE E8 78 62 BD 97 7B B1 AA D8 86 45 B4 6E>)
(   7,<2012-12-01 20:38:58.331 -0500>,<Administrator>,<X>,<proc1d>,<TOPSPIN 2.1>,
      <abs ABSG = 4 
       data hash MD5: 32K
       FF FE 86 94 FE 37 5E 26 C7 BF D2 D0 15 4A B9 84>)
(   8,<2012-12-01 20:38:58.472 -0500>,<Administrator>,<X>,<proc1d>,<TOPSPIN 2.1>,
      <abs ABSG = 5 
       data hash MD5: 32K
       E5 46 DB 07 C6 22 A6 E2 45 0A 3A F4 2F 22 78 DA>)
$$ ##END=
$$ 
$$ $$ hash MD5
$$ $$ 69 22 E2 03 51 5A E0 15 B9 99 5E 40 0E 36 5D A1
##$RELAX= 
##$RELAX= 
##$RELAX= 
##$RELAX= 
##$RELAX= 
##$RELAX= 
##$RELAX= 
$$ Bruker specific parameters
$$ --------------------------
##$DU= <E:\>
##$EXPNO= 10
##$NAME= <AC1207_MCiAH12041_7155062_eldopUTpDe>
$$ [...]
##$TP= (0..7)
150 150 150 150 150 150 150 150
##$TP07= 0
##$TPNAME0= <>
##$TPNAME1= <>
##$TPNAME2= <>
##$TPNAME3= <>
##$TPNAME4= <>
##$TPNAME5= <>
##$TPNAME6= <>
##$TPNAME7= <>
##$TPOAL= (0..7)
0.5 0.5 0.5 0.5 0.5 0.5 0.5 0.5
##$TPOFFS= (0..7)
0 0 0 0 0 0 0 0
##$TUNHIN= 0
##$TUNHOUT= 0
##$TUNXOUT= 0
##$USERA1= <user>
##$USERA2= <user>
##$USERA3= <user>
##$USERA4= <user>
##$USERA5= <user>
##$V9= 5
##$VALIST= <valist>
##$VCLIST= <CCCCCCCCCCCCCCC>
##$VD= 0
##$VDLIST= <DDDDDDDDDDDDDDD>
##$VPLIST= <PPPPPPPPPPPPPPP>
##$VTLIST= <TTTTTTTTTTTTTTT>
##$WBST= 1024
##$WBSW= 4
##$XGAIN= (0..3)
0 0 0 0
##$XL= 0
##$YL= 0
##$YMAX_a= 670641
##$YMIN_a= -570558
##$ZGOPTNS= <>
##$ZL1= 120
##$ZL2= 120
##$ZL3= 120
##$ZL4= 120
##$ABSF1= 14.98509
##$ABSF2= -5.573092
##$ABSG= 5
##$ABSL= 3
##$ALPHA= 0
##$AQORDER= 0
##$ASSFAC= 0
##$ASSFACI= 0
##$ASSFACX= 0
##$ASSWID= 0
##$AUNMP= <proc_prof1d_extract_pilot.lims>
##$AXLEFT= 0
##$AXNAME= <>
##$AXNUC= <1H>
##$AXRIGHT= 0
##$AXTYPE= 0
##$AXUNIT= <>
##$AZFE= 0.1
##$AZFW= 0.1
##$BCFW= 0
##$BC_mod= 0
##$BYTORDP= 0
##$COROFFS= 0
##$CY= 15
##$DATMOD= 1
##$DC= 0
##$DFILT= <>
##$DTYPP= 0
##$F1P= 0
##$F2P= 0
##$FCOR= 0.5
##$FTSIZE= 32768
##$FT_mod= 6
##$GAMMA= 0
##$GB= 0
##$INTBC= 1
##$INTSCL= 1
##$ISEN= 128
##$LB= 0
##$LEV0= 0
##$LPBIN= 0
##$MAXI= 10000
##$MC2= 0
##$MEAN= 0
##$ME_mod= 0
##$MI= 0
##$NCOEF= 0
##$NC_proc= -8
##$NLEV= 6
##$NOISF1= 0
##$NOISF2= 0
##$NSP= 0
##$NTH_PI= 0
##$NZP= 0
##$OFFSET= 14.98509
##$PC= 1
##$PHC0= 95.89966
##$PHC1= 0
##$PH_mod= 1
##$PKNL= yes
##$PPARMOD= 0
##$PPDIAG= 0
##$PPIPTYP= 0
##$PPMPNUM= 2147483647
##$PPRESOL= 1
##$PSCAL= 4
##$PSIGN= 0
##$PYNMP= <proc.py>
##$REVERSE= no
##$SF= 400.02
##$SI= 32768
##$SIGF1= 0
##$SIGF2= 0
##$SINO= 400
##$SIOLD= 32768
##$SPECTYP= <>
##$SREGLST= <1H.CDCl3>
##$SSB= 0
##$STSI= 32768
##$STSR= 0
##$SW_p= 8223.68421052631
##$SYMM= 0
##$S_DEV= 0
##$TDeff= 65536
##$TDoff= 0
##$TI= <>
##$TILT= no
##$TM1= 0
##$TM2= 0
##$TOPLEV= 0
##$USERP1= <user>
##$USERP2= <user>
##$USERP3= <user>
##$USERP4= <user>
##$USERP5= <user>
##$WDW= 1
##$XDIM= 32768
##$YMAX_p= 470109384
##$YMIN_p= -785476
##$CURPLOT= <Network HP LaserJet P1505>
##$CURPRIN= <$Network HP LaserJet P1505>
##$DFORMAT= <normdp>
##$LAYOUT= <+/1D_H.xwp>
##$LFORMAT= <normlp>
##$PFORMAT= <normpl>
##$SURQMSG= 1
$$ End of Bruker specific parameters
$$ ---------------------------------
##NTUPLES= NMR SPECTRUM
##VAR_NAME=  FREQUENCY,     SPECTRUM/REAL,   SPECTRUM/IMAG
##SYMBOL=    X,             R,               I
##VAR_TYPE=  INDEPENDENT,   DEPENDENT,       DEPENDENT
##VAR_FORM=  AFFN,          ASDF,            ASDF
##VAR_DIM=   32768,         32768,           32768
##UNITS=     HZ,            ARBITRARY UNITS, ARBITRARY UNITS
##FACTOR=    0.250966925370066, 1,           1
##FIRST=     8223.43324360094, -87005,       50449
##LAST=      0,             -100199,         -99023
##MIN=       0,             -785476,         0
##MAX=       8223.43324360094, 470109384,    0
$$ Real data points
##PAGE= N=1
##DATA TABLE= (X++(R..R)), XYDATA
$$ [...]
19582a58469A81429e3363H4245a52354A95395C6703h1973A02568a94597D75064
19571a17330j8465A41470a70385B06510A9171J50356b07029G4618K2029l2006
19561F4641L31992A4039b12217N4944P7465l34067B02095a52620O0763j8196A02544
19549C31819A02353b10703B09031J95349b41735j63438h7974k5821j42748g612
19538a72790n3264B0000J03882d3418C9748c93887N8478g4951j44382h9205l4586
19527a23791I3797c27238A26280a7842l081A1313a13014b4659C2202b87463J23663
19516a63800G5294A2054Q9228D3656b54349O8519d3381o0773I669E10d9731G8602
19503g6680k59878B63247I3628a2801q3897q792n5375B71553b85997J18136N4446
$$ y = [-158469, 181429, -53363, 84245, -152354, 195395, 36703, -81973, 102568, -194597, 475064, -117330, -135795, 141470, -170385, 206510, 19171, 169527, -207029, 74618, 96647, 64641, 396633, 14039, -212217, -157273, -79808, -413875, 202095, -152620, -91857, -110053, 102544, 331819, 102353, -210703, 209031, 404380, -241735, -405173, -87974, -113795, -256543, -7612, -172790, -226054, 20000, 123882, -43418, 39748, -393887, -335409, -74951, -219333, -89205, -123791, 93797, -327238, 126280, -17842, -20923, 11313, -113014, -24659, 32202, -287463, -163800, 75294, 12054, 101282, 43656, -254349, -185830, -43381, -104154, 9669, 510, -49731, 78602, -76680, -336558, 263247, 93628, -12801, -96698, -105490, -160865, 271553, -285997, -167861, -113415]
19492a13415A27853d2572D038c79136B7728b28322J5188e8597m865l3261k40289
19481c37012b9661j05900A42293h6057B424J01721i9624c5193o3872E8735J16669
19470A75404B3640a4121B01799a19600I0790Q8271C0270c68857J28436B53836
19459a20359j42580F8876b98046I3867a63038c4708C51671c11582A62956a85447
19448d7733j08117F7386b1195A55331b99155A20951b93865J15484Q7954b0258
19437d13913a81375F1421g7531l0440A53697a62265O376B9865b2780j01534l5638
19426a59952f0649j28668c5152D156g3586F8150b05529B14896b86245P573A64132
19414D22213a0568k62688R4660c8777l01384h3013D1340a67090d4161H620c82586
$$ y = [-113415, 127853, -42572, 4038, -379136, 27728, -228322, -213134, -58597, -63462, -96723, -337012, -29661, -135561, 142293, -86057, 2424, 104145, -99624, -35193, -99065, 58735, 175404, 23640, -14121, 201799, -119600, 90790, 179061, 30270, -368857, -240421, 253836, -120359, -262939, 68876, -298046, 93867, -163038, -34708, 351671, -311582, 162956, -185447, -47733, -155850, 67386, -21195, 155331, -299155, 120951, -293865, -178381, -90427, -20258, -413913, -181375, 61421, -77531, -107971, 153697, -162265, -155889, 29865, -22780, -124314, -159952, -60649, -189317, -35152, 4156, -73586, 68150, -205529, 214896, -286245, -278672, 164132, 422213, -10568, -273256, -178596, -38777, -340161, -83013, 41340, -167090, -44161, 8620, -382586]
19402b52424I9540N9895D9057K9750b12577P3235h079B6911a36493J5993C32181
19390a67676A82971E8325a12370K2026k16616C7612b01085A8542a56677A10733
19379A72191c74819a18887A9602a43861k19924e8620k79245J29376B7176d2614
19368C8352g3090G9516C0143b2122n7873I7741I767L6973g0733M382B41441d7979
19355c79601b1955C859N7088i2936E9198b09901e690k9307j65364h6633o2399
19344a49032e1749l04875B646J43554a10148j05525M6090k8912I8651a97956Q0361
19333a17595l9871B7709a83874H2778b35522l9053A26598m9283m408M2606C371
19321A68933A0688J31936C6394e64949g2753j95292j0026A5723i3789K4117k5750
$$ y = [-252424, 99540, 159435, 49057, 78807, -212577, -139342, -8079, 26911, -136493, -120500, 332181, -167676, 182971, 58325, -112370, -90344, -306960, 37612, -201085, 18542, -156677, 110733, 172191, -374819, -118887, 19602, -143861, -363785, -58620, -337865, -208489, 27176, -42614, 38352, -73090, 79516, 30143, -22122, -79995, 97741, 9767, 46740, -70733, -66351, 241441, -47979, -379601, -21955, 3859, 60947, -92936, 59198, -209901, -5690, -34997, -200361, -86633, -149032, -51749, -356624, 2646, 146200, -110148, -215673, -169583, -198495, 98651, -197956, -117595, -157466, 27709, -183874, 82778, -235522, -274575, 126598, 77315, 72907, 115513, 3371, 168933, 10688, 142624, 36394, -564949, -72753, -268045, -278071, 15723, -93789, -69672, -95422]
19310i5422C9995J36209c5545B28221b38890B2233b58119J17329A96041a76648
19299A21103c2498I7159F364d9769I856f0308l3422K3990H5861b27792B03216
19287B95842H410c05492f4590j86920q5367a08468B4631b75682A64151N3666i9522
19275a52932j42733L3466N3071C0187a14822b028k34723D0563O1788h4894A6922
19263A52855l2313G919L5193j3076J09789h6614m5392B66485b20282B69911j23952
19252A45959G2204A300b02458E7151N9380d2516A7922J8253a25771j79864a12037
19240a60081N0214A96834e3646J6752H383f1616b6698H7084J29227d8857k78028
19229c26885G9261j9856a5045B14567A543c96253Q7221G6575J11578H3206e7897
$$ y = [-95422, 39995, 176204, -35545, 228221, -238890, 22233, -258119, -140790, 196041, -176648, 121103, -32498, 97159, 6364, -49769, 9856, -60308, -93730, -69740, 85861, -227792, 203216, 295842, 8410, -305492, -64590, -251510, -336877, -108468, 24631, -275682, 164151, 217817, -99522, -152932, -295665, -262199, -209128, 30187, -114822, -2028, -236751, 40563, 102351, -84894, 16922, 152855, 120542, 7919, 43112, 30036, 139825, -86614, -132006, 266485, -220282, 269911, 145959, 72204, 1300, -202458, 57151, 116531, -42516, 17922, 36175, -125771, -305635, -112037, -160081, -109867, 196834, -53646, -36894, 8383, -61616, -26698, 87084, 216311, -48857, -326885, 79261, 59405, -15045, 214567, 1543, -396253, -309032, 76575, 188153, 83206, -57897]
19217a76089B93597B0414b36515R7387G8245Q6663b31902A63664b60860I7097
19206H9873a97622j69624C1148b2190A95177I2837a79635C77135D7959O001e0930
19194A21672f1953j89317a20543j37634J07294J5561c9748j69751e4713A71763
19183a52860N7246B25064m942b66910J30158B7525h1042q5105j76911O8604B49873
19171b28243A14176c12579e5483k51223M7028E6694E33a31681o4973M9831p2597
19160b19420k39450i1952A85469b05899J5862m3821J12083l0134J4860f3184l09294
19149c72478o2527a09504j70908a919B39572J6485c77297d3681k04850a8084D8867
19137d6230k2034q1140A14440g5348l2344k41899B5063a90486C2839b57431A41536
$$ y = [-176089, 293597, 20414, -236515, -139128, 78245, 164908, -231902, 163664, -260860, 97097, 89873, -197622, -367246, 31148, -22190, 195177, 92837, -179635, 377135, 47959, 53960, -50930, 121672, -61953, -251270, -120543, -258177, -150883, -135322, -39748, -209499, -54713, 171763, -152860, -95614, 225064, 220122, -266910, -136752, 27525, -81042, -166147, -343058, -274454, 249873, -228243, 114176, -312579, -55483, -306706, -259678, 56694, 533, -131681, -196654, -146823, -219420, -458870, -91952, 185469, -205899, -190037, -233858, -121775, -151909, -137049, -63184, -372478, -435005, -109504, -280412, -1919, 239572, 256057, -377297, -43681, -248531, -18084, 48867, -46230, -68264, -149404, 114440, -75348, -107692, -349591, 25063, -190486, 32839, -257431, 141536]
19125B82899l4728b07925R5090D85031a17338A68600E3583K58823c7028k33941
19115b70969B01059b40438J06672p9157Q7394N4229B57757a14816Q764H9218e9689
19103c16502c0611E361J2514f4678b9143l1568d193A06307J02229o6546D1068
19091B36694c61933a19035B35658g7423A14010K4883f5289B5227b40743A40586
19080c224E880J19331a3165N35A12311E126c8905C91275a72527L5214n2497D2900
19067A41918e7161j67933L7178c6074F2101a88079q5653G6464a84974I1109a24049
19055b22594C62559b32108o6574g1273B31725a76937j92654a57567K4401I397
19044b43987a4046n1969A09470b68737C02240f0404K6999A29627b00479j11095
$$ y = [282899, 248171, -207925, -112835, 485031, -117338, 168600, 53583, 312406, -37028, -270969, 201059, -240438, -133766, -212923, -125529, -71300, 257757, -114816, -106052, 89218, -59689, -316502, -30611, 5361, 17875, -64678, -29143, -60711, -4193, 106307, 208536, 141990, 41068, 236694, -361933, -119035, 235658, -77423, 114010, 138893, -65289, 25227, -240743, 140586, -3224, 5880, 125211, -13165, -12630, 112311, 5126, -38905, 391275, -172527, -137313, -189810, 42900, 141918, -57161, -225094, -187916, -36074, 62101, -188079, -273732, 76464, -184974, 91109, -124049, -222594, 362559, -232108, -298682, -71273, 231725, -176937, -369591, -157567, -133166, 9397, -243987, -14046, -66015, 109470, -268737, 302240, -60404, -33405, 129627, -200479, -311574]
19034c11574J2133J34440D6041a70850A8670L26702i7723p2807q9308k3832B53921
19022A46287m878N1203J02157A43620K6729b39975M132g361D0071J80041f719
19010b810F6529a50859A4814c8426E2049I618i0063j34998c6831j92735F1503
18998A93503C5050b74340E3281c12469J52344A89484M9695h9413l1158B9028a95876
18986c67074b8851B98618a13407m866A10662n358a12922l36448a87852a6267E6839
18974E9817B7287c5444j06415j60244M7587f0350j75186l8238l14740d3359j49275
18963a92634A88347H9168d70016A60031l4107a88871f7756B65441e9280I9152
18952a96365O9199k07999a55190A3688a93717b8674l6577n1722A27038b3768B525
$$ y = [-311574, -299441, -165001, 46041, -170850, 18670, 345372, -97723, -170530, -259838, -283670, 253921, 146287, 141409, 192612, 294769, 143620, 170349, -239975, -235843, -7361, 40071, 220112, -6719, -2810, 66529, -150859, 14814, -38426, 52049, 9618, -90063, -225061, -36831, -229566, 61503, 193503, 35050, -274340, 53281, -312469, -160125, 189484, 239179, -89413, -120571, 29028, -195876, -367074, -28851, 298618, -113407, -118273, 110662, 105304, -112922, -449370, -187852, -16267, 56839, 59817, 27287, -35444, -141859, -302103, -254516, -60350, -235536, -273774, -588514, -43359, -192634, 188347, 89168, -470016, 160031, 125924, -188871, -67756, 265441, -59280, 99152, -196365, -127166, -335165, -155190, 13688, -193717, -28674, -65251, -116973, 127038, -23768, 2525]
18940a52371A58847B6545b85852e0866F012a387A5913h1305k15855b4517e823
18928e5866A28617b2839A61245D8600J95619c6240j12496P1015k37159d9970H3131
18916F4531c5651B4050A0637a70775J7122e8229A81089F8538N0062k4016J76289
18905B70873b6015p1173H933c06533h4119B2224g6828K5920n35447B34524C5976
18893A20753c10394B07647o1130N6248J95282A5265a42204A3964Q813a27990B10528
18881C39086a59300j06031a29414A8933d1582j75755B5319f1142A37687a69213
18870b95668A83586a04212k2734n9155K2196A015O730K78417A01458b70114a8569
18858C12880d4974j32111f7959j22301F7404B8583i0744j47284A46553N2639A0529
$$ y = [-152371, 158847, 26545, -285852, -50866, 6012, -1387, 15913, -81305, -297160, -24517, -5823, -55866, 128617, -22839, 161245, 48600, 244219, -36240, -148736, -77721, -314880, -49970, 83131, 64531, -35651, 24050, 10637, -170775, -153653, -58229, 181089, 68538, 118600, 94584, 270873, -26015, -97188, 8933, -306533, -84119, 22224, -76828, -50908, -586355, 234524, 35976, 120753, -310394, 207647, 146517, 202765, 398047, 15265, -142204, 13964, 22777, -127990, 210528, 339086, -159300, -265331, -129414, 18933, -41582, -217337, 25319, -61142, 137687, -169213, -295668, 183586, -104212, -126946, -186101, -163905, 1015, 7745, 286162, 101458, -270114, -18569, 312880, -44974, -177085, -67959, -190260, 67404, 28583, -90744, -238028, 146553, 199192, 10529]
18846a49069E8636J32340m0900E1a64190K6071A09629a79777G7345k8699K24481
18835B73127a96154o8408O5496f6174j19398M9009B09417E4840J13542c64429
18824B78454D9139f1759G9060a07956A80105a95406j81796B40136E9883a08123
18813C38938L7681G8886B8839f5698a6395F6111g8491j05840G254e3927B0122
18801c6751j04586c443l2652j12519n8565L9071N5333C3026K38625b33379A00842
18789f9990C28259c7617A36515K1514Q8534b0746j03435B43772b96126j77245
18779d73371G736b97534O1579J00952B81072f5917q0104j17025A10587b4554B1194
18767C8420N5266a0751o9757D4946b4679C29552a12862n186D5719d2109C98434
$$ y = [-149069, 58636, 190976, 150076, 51, -164190, -138119, 109629, -179777, 77345, 48646, 273127, -196154, -264562, -199066, -66174, -185572, -136563, 209417, 54840, 168382, -364429, 278454, 49139, -61759, 79060, -107956, 180105, -195406, -377202, 240136, 59883, -108123, 338938, 376619, 78886, 28839, -65698, -16395, 66111, -78491, -184331, 7254, -53927, 20122, -36751, -141337, -3443, -36095, -148614, -207179, -168108, -112775, 33026, 271651, -233379, 100842, -69990, 328259, -37617, 136515, 158029, 246563, -20746, -124181, 243772, -296126, -473371, 7736, -297534, -235955, -135003, 281072, -65917, -146021, -263046, 110587, -24554, 21194, 38420, 93686, -10751, -80508, 44946, -24679, 329552, -112862, -118048, 45719, -42109, 398434]
18755A56473a12565C5314a80951b7812k12743f682D9267b55117j23475a52769
18744b32338e2335A41525d25804a85789C4837J11477a25484N9297A55290c74670
18733A56515b72611B6865a0756m1421M028B03121a76785f9965H4833c41295C4268
18721a02308D9163c39681B24787b30679M1585A72732e422j9034m4693k15317H7814
18709B7318O270a56483j23521K4925A29073i0272I0535b11115B7532e9227C8466
18697c36033F4297g5400j7298k39295A49898c85159a46305b8948A5686R5313c92038
18685b39074g2162r2784F1850d3300l01208Q4527B11224A2091i4938A6323a06669
18673g8347k238A9164J33177B9921J12204h7867L6304C7708A5999P9278l9205
$$ y = [156473, -112565, 35314, -180951, -27812, -240555, -6682, 49267, -255117, -378592, -152769, -232338, -52335, 141525, -425804, -185789, 34837, 146314, -125484, -66187, 155290, -374670, 156515, -272611, 26865, -10756, -52177, -48149, 203121, -176785, -69965, 84833, -341295, 34268, -102308, 49163, -339681, 224787, -230679, -189094, 172732, -5422, -24456, -69149, -284466, 87814, 27318, 33588, -156483, -280004, -255079, 129073, -90272, 90535, -211115, 27532, -59227, 38466, -336033, 64297, -75400, -92698, -331993, 149898, -385159, -146305, -28948, 15686, 110999, -392038, -239074, -72162, -164946, 61850, -43300, -344508, -259981, 211224, 12091, -94938, 16323, -106669, -78347, -80585, 19164, 152341, 29921, 142125, -87867, -51563, 37708, 15999, 95277, 56072]
18662E6072M2669h7279B494N7442d6498n46753c8993J2229C14311g0733k07914
18651b78647A15234i525a494j29424n8534b0774m284j87021H6907b11171r143
18640b20314r4589D7698A1947f7006A10355R3305J67009a12552o7174O1594M5837
18629g2295A69744q3149g641A43266c1000k69300J49505f9397m11678d834j54992
18618a59826F3582c3699B05328A3312d4590j7277j38538C53912g0622m6029M5763
18607g0888K4332a2806D3363j6624h7091K7222A1914b59236d7683q2588k35613
18596c65884J75119F9494b65922P3885N0537M1029j06237L8702A77231B7439a38276
18584C47258c3004J4743k18608l463J0670B72980A22066k867J5360K55211I2755
$$ y = [56072, 98741, -87279, 2494, 59936, -46498, -593251, -38993, -26764, 314311, -70733, -278647, 115234, -9525, -1494, -130918, -189452, -20774, -25058, -212079, 86907, -211171, -220314, -314903, 47698, 11947, -67006, 110355, 203660, 370669, -112552, -179726, -118132, -72295, 169744, 86595, -7641, 143266, -31000, -300300, -150795, -69397, -481075, -4834, -159826, 63582, -33699, 205328, 13312, -44590, -61867, -200405, 353912, -70622, -116651, -70888, -46556, -12806, 43363, 26739, -87091, -59869, 11914, -259236, -47683, -130271, -365884, -190765, 69494, -265922, -192037, -141500, -100471, -206708, -168006, 177231, 27439, -138276, 347258, -33004, -18261, -236869, -240332, -229662, 272980, 122066, 119199, 134559, 389770, 92755]
18572a62487N6734H0920b8123k8588a614G6319k3014k1771i0602A84319b61148
18560B26473h700C6837b58021A2694g6731a6933A85237h4599A0306b49808H1782
18548b22546O9901d2702o5554B65360a14168I6820a72995A49629i7972A86550
18537B5222c29688B7692Q0744d3109C5416b76811M771i7979b025A57442b86748
18525D9667K09612b92758a27124j58226A62670b19460b7571B1861a39602p7605
18515b17207c1525k88751a19878j59177N885B97012E9992i8321k83786a65941
18504a37821e9859B9414a14671k08801I0946d5918D33902a12130A23098c812k47552
18493b51364a24149P242H3437a63423g2225I6670f8403F3209k3987a32411A6038
$$ y = [-162487, -105753, 80920, -28123, -56711, -1614, 76319, 53305, 31534, -90602, 184319, -261148, 226473, -8700, 36837, -258021, 12694, -76731, -16933, 185237, -84599, 10306, -249808, 81782, -222546, -152645, -42702, -108256, 265360, -114168, 96820, -172995, 149629, -97972, 186550, 25222, -329688, 27692, 108436, -43109, 35416, -276811, -272040, -97979, -2025, 157442, -286748, 49667, 259279, -292758, -127124, -285350, 162670, -219460, -27571, 21861, -139602, -217207, -31525, -320276, -119878, -279055, -273170, 297012, 59992, -98321, -382107, -165941, -137821, -59859, 29414, -114671, -323472, 90946, -45918, 433902, -112130, 123098, -3812, -251364, -124149, -116907, 83437, -163423, -72225, 96670, -68403, 63209, 39222, -132411, 16038]
18481A46975b01116A15111J26166a84101O6259D06412h4053D4117c64836C52991
18470i8090j22085i290j88323N3282e3992j911k34482b8034J1862j55763l6575
18459b08510B5852a31037J4105r9711h0924c114k74644F6426h2796b2562o7800
18448i0362n7692B51611g2055j59741A62064a08904C74805A52756D3484d4539
18437b03608g35k37869G133O7405f549l52924A25051F2126d1668i204B66386a76903
18424a38939k9571j32713L5142b0022p3475E0322d40124E9431k368d2784B03554
18412f9640A44659c98764a43350N2312A86292E552a34405B27500a98557a5263
18401B63877p1070r1113K26901k8493a06797l6197d6050j72244A11120c00019
$$ y = [146975, -201116, 115111, 241277, -184101, -117842, 406412, -84053, 44117, -364836, 352991, -98090, -220175, -9290, -197613, -144331, -53992, -55903, -290385, -28034, -16172, -171935, -208510, 25852, -131037, -116932, -216643, -80924, -3114, -277758, 66426, -82796, -22562, -90362, -148054, 251611, -72055, -231796, 162064, -108904, 374805, 152756, 43484, -44539, -203608, -735, -238604, 7133, 74538, -6549, -359473, 125051, 62126, -41668, -9204, 266386, -176903, -138939, -168510, -301223, -266081, -20022, -93497, 50322, -440124, 59431, 57063, -42784, 203554, -69640, 144659, -398764, -143350, -91038, 186292, 5552, -134405, 227500, -198557, -15263, 263877, 192807, 101694, 328595, 300102, -106797, -142994, -46050, -218294, 111120, -300019]
18390a41189D5792J8776g0652n2346A35149c39926q8411c7292A11756k0027a79685
18378C73N1605K49244A4632M5443J25638c70241A30526m941J42999a4653A34339
18366A82796I60d26911J80244C6929b48507C415b05901b0825A26824b86746B16299
18354a14011A07529b38291A23282A5051a21076b2056A27895a91294r1159e4033
18343g4221N153m7707K7490k9427q7227R142i407A2857c75367J26835A65225K1525
18331A86750i242r7035I8563a519n5141A32635c24488C2076J33669b4574l3860
18320e8434A01540a67447L82A26517C2416J41166c06876R1577A82774p1730a18485
18308b83486E061q40M5886b07467O6169a8525p0194D4388d7638L428G4659a65883
$$ y = [-141189, 45792, 64568, -70652, -122998, 135149, -339926, -428337, -37292, 111756, 91729, -179685, 373, 51978, 301222, 14632, 60075, 185713, -370241, 130526, 125585, 268584, -14653, 134339, 182796, 960, -426911, -246667, 36929, -248507, 3415, -205901, -20825, 126824, -286746, 216299, -114011, 107529, -238291, 123282, 15051, -121076, -22056, 127895, -191294, -282453, -54033, -74221, -69068, -116775, -89285, -118712, -205939, -196797, -9407, 12857, -375367, -248532, 165225, 186750, -9242, -106277, 98563, -1519, -56660, 132635, -324488, 32076, 165745, -24574, -58434, 101540, -167447, -167065, 126517, 32416, 173582, -306876, -215299, 182774, 111044, -118485, -283486, 5061, 4221, 50107, -207467, -141298, -18525, -88719, 44388, -47638, -44210, 74659, -165883]
18295A745b05774G0092a66308j86137r1617G920K66186h1507M124K228A00814
18283b13370A85179L6627b45598B1785L04409a26673e0150n7546j01767G44J7588
18272A8332L24452g3039B92918A22722i4291E9858J05826g1533A47006J25876
18262B72882b67339B37425B2476f7482j71647o6561A61459e1704k13500A40545
18251I7072P0621k6322E8752d2056J4716r5765A1686b26052A4179b02892L3303
18240a69589n3035A15495l2397d0321m4563A84066b29314b9302l12603E2243b02104
18228I4409f8889f01B98701G5210P9988B1910a07923A9892a5409j92586i8629
18216A18682a92566N8377A28623b05918R7874E6972i8059D2328i1575k0814q5424
$$ y = [1745, -205774, 70092, -166308, -352445, -444062, 7920, 274106, -81507, -77383, -75155, 100814, -213370, 185179, 221806, -245598, 21785, 326194, -126673, -50150, -107696, -209463, 744, 18332, 342784, -73039, 292918, 122722, -94291, 59858, 165684, -71533, 147006, 272882, -267339, 237425, 22476, -67482, -239129, -305690, 161459, -51704, -265204, 140545, 97072, 167693, 141371, 58752, -42056, -27340, -123105, 11686, -226052, 14179, -202892, -169589, -222624, 115495, 83098, -40321, -84884, 184066, -229314, -29302, -341905, 52243, -202104, 94409, -68889, -601, 298701, 75210, 155198, 21910, -107923, 19892, -15409, -207995, -98629, 118682, -192566, -134189, 128623, -205918, -108044, 56972, -98059, 42328, -91575, -112389, -197813]
18205a97813j11931A10217K8900f3289A72752D1255a9804m60768g5767k40262
18195c16029J37011P9475D06161h099j4414j41252e1069k04689D7733A577J30229
18184A31806k4369i7517j18349c5853g614j13140a8488Q662A70857E3707f8790
18172B12387A03397D7811b99380m6226a66921e6443o878M681A32806R9631b82572
18160A12337l9083j4506a56824A75415g0567C496a55537c1955C9624R6198n1299
18149H4523Q0114e19649B57278C6729j4283J13412a21789l5710f6082j63473A61181
18137a40521j10852B24353p0716o7645K5954i4276J6543C9585a54146b4721j84694
18126b09415B95323A25136R6971A1912R2610B863b39995B40083A2634Q9219b0482
$$ y = [-197813, -309744, 110217, 139117, -63289, 172752, 41255, -19804, -480572, -75767, -316029, -179018, -99543, 406161, -8099, -22513, -163765, -51069, -255758, 47733, 1577, 131806, 107437, -97517, -215866, -35853, -7614, -120754, -18488, -9826, 170857, 53707, -68790, 212387, 103397, 47811, -299380, -345606, -166921, -56443, -63321, -58640, 132806, 232437, -282572, 112337, 73254, 58748, -156824, 175415, -70567, 3496, -155537, -31955, 39624, 135822, 84523, 164637, -519649, 257278, 36729, 22446, 135858, -121789, -157499, -66082, -229555, 161181, -140521, -251373, 224353, 153637, 85992, 111946, -94276, -77733, 39585, -154146, -24721, -209415, 295323, 125136, 222107, 11912, 104522, 2863, -239995, 240083, 12634, 101853, -20482]
18114A203b04027B00870D5773b88955A02781k3822a2111k51925K0240A22620h2860
18102H9467b4175B55211J4031h4237G575M4949J69658a26083B31170B2572c08795
18090A60726f2086e818l5819G6928k9960a72584E086b85605b745k17900j40869
18079c61514R3729f0609j52781Q2156A14387a38124k493j4199B89546F5913b31923
18067C03602a26386k5288N1922B68404d0258A76979c61245A68421m5892m3662
18057G8867h8752b0421o1018K4583m3939J4437G5394j7328a33105A372L2899a63
18044b16877E5038J1643K50015a73854D24275A42497K30553a80939I3487c03866
18033A36708b27603J09646j62901c6841n5388A30220K08867a15941B8781J45836
$$ y = [1203, -204027, 200870, 45773, -288955, 102781, 78959, -12111, -264036, -243796, 122620, -82860, 89467, -24175, 255211, 269242, -84237, 7575, 52524, 222182, -126083, 231170, 22572, -308795, 160726, -62086, -5818, -41637, 76928, 46968, -172584, 5086, -285605, -2745, -220645, -361514, -267785, -60609, -213390, -131234, 114387, -138124, -140617, -154816, 289546, 65913, -231923, 303602, -126386, -151674, -99752, 268404, -40258, 176979, -361245, 168421, 122529, 78867, -88752, -20421, -81439, -56856, -100795, -86358, 75394, 58066, -133105, 1372, 34271, -163, -216877, 55038, 66681, 316696, -173854, 424275, 142497, 373050, -180939, 93487, -303866, 136708, -227603, -117957, -280858, -36841, -92229, 130220, 339087, -115941, 28781, 174617]
18023A74617C7324i6909B71624a92222j35275f0541F3856g9675A83193E483c56840
18011H0677c64963c675A4729J31985J36004A8457d0648B67518j28696n6172e5120
17999c8654k7970j9253J5851j15676r7020a1225A09798b723B1942b35584A38662
17987a55351j28100i9784E2982a40102A41957D3764a06063c7319J0827j58157
17977a84649o8582I9702b17013h6021B27353A07300a90297M1777A21077i2816
17966B9365K11757b28249O6216r7770m3978c1655k3277D816i2949o2015n1290
17955b06254A47842c95483i7512b1823r0195G4299R6852d8669p8421e2591B36875
17943D8487Q4321b5003k81194A84231a57090A42923h2869H4268M2322P146h4707
$$ y = [174617, 37324, -96909, 271624, -192222, -327497, -60541, 63856, -79675, 183193, 5483, -356840, 80677, -364963, -3675, 14729, 146714, 282718, 18457, -40648, 267518, 138822, 82650, -55120, -38654, -66624, -85877, -70026, -185702, -282722, -11225, 109798, -2723, 21942, -235584, 138662, -155351, -283451, -99784, 52982, -140102, 141957, 43764, -106063, -37319, -26492, -184649, -253231, 99702, -217013, -86021, 227353, 107300, -190297, -148520, 121077, -92816, 29365, 241122, -228249, -162033, -259803, -303781, -31655, -54932, 4816, -92949, -154964, -206254, 147842, -395483, -97512, -21823, -112018, 74299, 171151, -48669, -127090, -52591, 236875, 48487, 132808, -25003, -306197, 184231, -157090, 142923, -82869, 84268, 126590, 133736, -84707]
17931a53268c6763G1817a20869N2628B65951a01597A79558N6487f2984B02399
17920i6349E8332J48284b07664g5277i406j90615A27041L1467F377a70402A55217
17908c73978D8245b32962g0276A16019d86799a07653A18842l9582K30359A47132
17897A10134J91375G4306d7477H3995b08876B79420h6026K9201m4574a0363E1547
17885a15391B30512F7456B446b09384A81494K2437b66955B7078d4445j08413A50694
17873b43652A38957g3863K3503C1507a2691j83725K7154D1890J47987b80891B7787
17861B95934a54902B09144d12604c5865C8487J8693J52610c73032I7292p390b64485
17849B69712a07520i181A9864a58954A3484d6171a8291R062k90582C0447i9223
$$ y = [-153268, -36763, 71817, -120869, -68241, 265951, -101597, 179558, 236045, -62984, 202399, -96349, 58332, 206616, -207664, -75277, -9406, -200021, 127041, 158508, 6377, -170402, 155217, -373978, 48245, -232962, -70276, 116019, -486799, -107653, 118842, 79260, 309619, 147132, 110134, 301509, 74306, -47477, 83995, -208876, 279420, -86026, -56825, -101399, -10363, 51547, -115391, 230512, 67456, 2446, -209384, 181494, 203931, -266955, 27078, -44445, -152858, 150694, -243652, 138957, -73863, -50360, 31507, -12691, -196416, -169262, 41890, 189877, -280891, 27787, 295934, -154902, 209144, -412604, -35865, 38487, 57180, 209790, -373032, 97292, 89902, -264485, 269712, -107520, -9181, 19864, -158954, 13484, -46171, -18291, -9229, -299811, 30447, -99223]
17837a16249c8139j65410I7592l5365M6683J14664E2463N0268b3582k71772a28048
17825A61917e1181C2709M2058M3713D9606K1136j8257g1411j8656A39544d44202
17813a12339A77458m4315N9271i5970B33L057M39003e813j18127N7284k83479
17802c50135I2251a6549j07723k40351a32303l5734R374E0615K0601k2064K62212
17791C11364H4337k3860c9950j04468A25221K4773f1627a6869j93986f0566D5066
17779b30702E1518b8618B11455a73270j7616p6735F1210a83177C9156b7091A01178
17767i532j12843d4215m6035o4142M1753n4332B34014a44989l8784i96j60273
17756a61269g6876a7299k22156A2990a12216I3649P6589K9600b73148c7583A0351
$$ y = [-116249, -38139, -203549, 97592, 62227, 108910, 223574, 52463, 102731, -23582, -295354, -128048, 161917, -51181, 32709, 74767, 118480, 49606, 70742, 52485, -71411, -90067, 139544, -444202, -112339, 177458, 133143, 192414, -95970, 233, 3290, 442293, -5813, -123940, -66656, -350135, 92251, -16549, -124272, -364623, -132303, -168037, -158663, 50615, 71216, 49152, 311364, 84337, 60477, -39950, -144418, 125221, 149994, -61627, -16869, -210855, -60566, 45066, -230702, 51518, -28618, 211455, -173270, -190886, -267621, 61210, -183177, 39156, -27091, 101178, -9532, -122375, -44215, -90250, -154392, -112639, -166971, 234014, -144989, -183773, -996, -161269, -76876, -17299, -239455, 12990, -112216, 93649, 170238, 199838, -273148, -37583, 10351]
17744d5136n7125A14072D3738e4999A8013J18064R8875k7426f4144A44232a76741
17732D4164K60064j50837P1129E8262M8908a09482A42862o2805a83241g3137j99958
17721b73095a07323C03322a11419j04428a0121B16761a34145B05257b02376A04309
17710C07267I3410b2428C85214G7281d7906B77099H2034K54913M8709G9228a01260
17698A98872g3174p2894I3528A3965M6234a03448n2108B00421B0432i4596G302
17686B3696b13591j5162g2709A49770N5004m070d9019A7247a36682A98489n4788
17675A43701O9342G6066b55637B28701h2426E9188R8891o9531k4221J51724a37248
17663F4725b9295f102j15593E747g3791k76220E8770c252A98624m2713g1729j71316
$$ y = [-45136, -102261, 114072, 43738, -54999, 18013, 136077, 234952, 207526, -64144, 144232, -176741, 44164, 304228, 153391, 224520, 58262, 107170, -109482, 142862, 80057, -183241, -73137, -273095, -107323, 303322, -111419, -215847, -10121, 216761, -134145, 205257, -202376, 104309, 307267, 93410, -22428, 385214, 77281, -47906, 277099, 82034, 336947, 385656, 79228, -101260, 198872, -73174, -146068, 93528, 13965, 60199, -103448, -155556, 200421, 20432, -94596, 7302, 23696, -213591, -228753, -72709, 149770, 204774, 200704, -49019, 17247, -136682, 198489, 143701, 213043, 76066, -255637, 228701, -82426, 59188, 158079, 88548, 64327, 216051, -137248, 64725, -29295, -6102, -121695, 5747, -73791, -350011, 58770, -3252, 198624, 155911, -71729, -243045]
17651b43045K6238a00815a6847j185B507K06493D747R2654c0554j92099A83748
17639B96762a11755j22928b8483j88625G1226r605a87088B22242h3566B11376
17628b43291Q1831O3735D08670d3830j76809B77678a01411A32427c72006a39222
17617C50568d3586B43917a10943d1515m0747A7703N1333d50076B50910b33797
17606F1921P9294F5853g7831k267m7012A15754l119O0302j1832P3804c8432C62750
17593G294d027B48499J2663b53952N5150C35488G7550a57104D08459b24003A96129
17581B51419a00706L2899j76863A05110b6859A81532q9804k28J80563c94683a52594
17569A24748Q9413E1877J44026a95796D105P1669e9332k14491h2442B99259n0923
$$ y = [-243045, -216807, -100815, -16847, -18032, 2507, 209000, 4747, 97401, -30554, -222653, 183748, 296762, -111755, -234683, -28483, -217108, 71226, 61621, -187088, 222242, -83566, 211376, -243291, -161460, -97725, 408670, -43830, -220639, 277678, -101411, 132427, -372006, -139222, 350568, -43586, 243917, -110943, -41515, -82262, 17703, 69036, -450076, 250910, -233797, 61921, 141215, 65853, -77831, -80098, -127110, 115754, 112635, 172937, 161105, 234909, -38432, 362750, 7294, -4027, 248499, 261162, -253952, -198802, 335488, 77550, -157104, 408459, -224003, 196129, 251419, -100706, -67807, -244670, 105110, -26859, 181532, 91728, 91500, 272063, -394683, -152594, 124748, 214161, 51877, 195903, -195796, 4105, 75774, -59332, -273823, -82442, 299259, 248336]
17558B48336a19674D49835A46855l3640K6771K86814B12941e5543C13263i890
17547A0618K32246h1501A71443c51551G0588O5827E0708K5243b32645C10754a05992
17535b9045q9640B71213b30404G1540K45991a21239B3969L8772K90858g5684A87456
17523b8663B27768A598J94628J02789J4813H5748b4915A0612m171c4888B81841
17511B29970j515o1320a35956A41275R5390c8041B7685K3508N7051m6697J3045
17500G4592R940l6456R8769N659N3697c0776A70088b82731I2643K41642J5514
17489C49799i7617A87972A178i7812k094D46446j14041p9787i6258B03102p7850
17478A25252n2186R6097c5495j38907D19872j89750e932B54265J68550n2281b97665
$$ y = [248336, -119674, 449835, 146855, 113215, 139986, 426800, 212941, -55543, 313263, -9890, 10618, 242864, -81501, 171443, -351551, 70588, 136415, 50708, 75951, -232645, 310754, -105992, -29045, -118685, 271213, -230404, 71540, 317531, -121239, 23969, 62741, 353599, -75684, 187456, -28663, 227768, 1598, 196226, 299015, 313828, 85748, -24915, 10612, 6441, -34888, 281841, 229970, 228455, 167135, -135956, 141275, 236665, -38041, 27685, 51193, 108244, 61547, 74592, 84532, 48076, 146845, 152504, 206201, -30776, 170088, -282731, 92643, 334285, 349799, -97617, 187972, 1178, -97812, -99906, 446446, 332405, 252618, -96258, 203102, 125252, 73066, 169163, -35495, -174402, 419872, 230122, -5932, 254265, 422815, 370534, -297665]
17466B4030J64556R1816A11958j961b87635A04138d2189m8593A34810C8183o521
17455C1662J07258a56088a8054C20940j55686J16622r8442q4851J26904B7153
17444C24003j13628K42798A32769L58186j84002r756p484l5733k0266k1145A05872
17432C02358A44857K59302F1221K12439N2213R4459a11776F6493M0682M54526
17422E61701A02102l2465N07077r9542j11914f16D86561c9246D29153j88534J02983
17411C43602a20747A56911L70776B25017k7689o5483i1240E10495A81994e6140
17400E0587R5785A3691J148K33515K8334j32290a83294B85237H1083g9724D1228
17388E44020G1849M73956d362B41663d0664a1165k5054A06565K5477m8481g7854
$$ y = [24030, 188586, 280402, 111958, 109997, -287635, 104138, -42189, -90782, 134810, 38183, 31662, 138920, -156088, -18054, 320940, 165254, 281876, 183434, 98583, 225487, 27153, 324003, 210375, 453173, 132769, 490955, 306953, 297197, 289713, 253980, 233714, 212569, 105872, 302358, 144857, 404159, 61221, 273660, 325873, 420332, -111776, 66493, 107175, 561701, 102102, 69637, 576714, 477172, 365258, -616, 486561, -39246, 429153, 240619, 343602, -120747, 156911, 527687, 225017, 197328, 131845, -91240, 510495, 181994, -56140, 50587, 146372, 13691, 14839, 248354, 276688, 144398, -183294, 285237, 81083, -79724, 41228, 544020, 71849, 545805, -4362, 241663, -40664, -11165, -36219, 106565, 132042, 83561, -77854]
17376d06982f0236b7611A03146J0589J65305b49049A48395e115C02647j22896
17366A79751a62450A03287L7687J22778i3416A6127K3624J23527p1405J05200
17356A97073d0074D17367m7951A30045Q6415D2426K17966A3267L5241J65623i8439
17344B35871r6277J18721n8972M7283K29213A7083L29725b58477E4438J4614m508
17333F4544a0410B17613C9345J36848H5429Q2364d9384a0402C18096r8951b91375
17321b0840H2669C5671L25192A04419i3414A32939K8954Q2094N6987j21774i2659
17309A34121J70671j38993A6502R1374N557J9619D6076J51441a52011J8057e4179
17297A72738N861G9394a02028E9206K25382Q9769O6335A16545j6952K49480j22023
$$ y = [-406982, -60236, -27611, 103146, 113735, 279040, -249049, 148395, -5115, 302647, 179751, -162450, 103287, 140974, 263752, -93416, 16127, 39751, 163278, 91873, 197073, -40074, 417367, 369416, 130045, 216460, 42426, 260392, 13267, 48508, 214131, -98439, 235871, 139594, 258315, 199343, 246626, 475839, 17083, 346808, -258477, 54438, 69052, 64544, -10410, 217613, 39345, 176193, 85429, 167793, -49384, -10402, 318096, 219145, -291375, -20840, 82669, 35671, 360863, 104419, -93414, 132939, 161893, 243987, 300974, 179200, -92659, 134121, 304792, 165799, 16502, 107876, 113433, 133052, 46076, 197517, -152011, -133954, -54179, 172738, 178599, 79394, -102028, 59206, 284588, 374357, 440692, 116545, 99593, 349073, 227050]
17286B27050J45086j80040J61935m5408n513I7803A2060d1635C9465G524J50383
17275A57907a94057A27777b70404F4459J8593a17121C00873C194L07455a5967
17264A40164J82664A59199f1920H7151J1383L25756a29509K3566B86782d7098
17253B89965m837q0410l9570b7078k219A17177a44435A04035J91067L9784d6965
17241G9892P1452m1726J82775a1188B27033q3036Q2671O0806P7980K53662H3053
17229A32003K3001n0608B7217K16544J08747J49255B25011A3673a7038C94508
17218A83949b3106A14026K70872D9596N1945M92596j97590H0739L2428k5287J89493
17207B77373M1441j8286o3237o7652G9720J23596P4194J03104j22211H6850B9316
$$ y = [227050, 372136, 192096, 354031, 308623, 303110, 97803, 12060, -41635, 39465, 7524, 157907, -194057, 127777, -270404, 64459, 83052, -117121, 300873, 3194, 310649, -15967, 140164, 322828, 159199, -61920, 87151, 98534, 424290, -129509, -105943, 286782, -47098, 289965, 285128, 204718, 165148, -27078, -29297, 117177, -144435, 104035, 295102, 334886, -46965, 79892, 151344, 109618, 292393, -11188, 227033, 143997, 226668, 287474, 365454, 619116, 83053, 132003, 155004, 104396, 27217, 243761, 352508, 501763, 225011, 13673, -17038, 394508, 183949, -23106, 114026, 384898, 49596, 101541, 594137, 396547, 80739, 113167, 87880, 277373, 318814, 300528, 237291, 169639, 79720, 203316, 277510, 380614, 258403, 86850, 29316]
17195B69978q6300K42506q66j03469P6218E3478L60133A89675L15099b6358C62044
17183C00239l4561K1155D5139L83365A34659J56364k3412b0952C24272o7615f5210
17171B61289K27496A13162J57070o019j07741R1238q0926N0689R6272K16610I0729
17159A37810J10207G4295L43157J38165A14810L52615m4975Q5237k42037K77214
17149E42864A82722l0716N8813J01510C8158J43133N3199g8669D45535L4430j96332
17138B83633p5481K85793K9767k01563k08r2127R5317P5406O4085H715N40772
17127E49487j35469L2460L1825i6908C26204d5094A03926K16330j58223O9348
17117B31381J60928J11779j69217a69233C67078j52033J24865J83592L568B50676
$$ y = [269978, 183678, 426184, 425318, 321849, 398067, 53478, 413611, 189675, 504774, -26358, 362044, 300239, 265678, 286833, 45139, 428504, 134659, 291023, 267611, -20952, 324272, 256657, -65210, 261289, 488785, 113162, 270232, 264213, 156472, 247710, 166784, 217473, 313745, 530355, 90729, 137810, 248017, 74295, 417452, 555617, 114810, 467425, 422450, 507687, 265650, 542864, 182722, 152006, 210819, 312329, 38158, 181291, 234490, -78669, 445535, 479965, 283633, 208152, 493945, 523712, 322149, 321941, 229814, 325131, 400537, 464622, 8715, 549487, 414018, 446478, 478303, -96908, 326204, -45094, 103926, 320256, 162033, 231381, 392309, 504088, 334871, -169233, 367078, 215045, 339910, 523502, 527070, 250676]
17106F2003L14559M2095r1743L12842l2529A06204M06163k47586j03479L07765
17096D69067B01651N07653B92720K81891k01230P859L4579I3291O10303l30535
17086C73059N8753K077j89633K75642I0314L32404J15341L9670j88632A66261
17075G01899C03312L60855A80004M2068J78252K67117A84872K15269J95132j1283
17065E83990p8183n966J58961j75924p0156j02090K83271B30965J35116M24369
17055G90450B94236A03167K42929R7431j25181J09493r4033K36025O0686k2316
17045F08201A98532L4593L11552J28528k27299m6308K03265k32174K05825K6954
17035F03468k75577j20592M58088l27953J27610M9624J303l458J00768j8355Q8783
$$ y = [62003, 376562, 418657, 326914, 639756, 607227, 106204, 512367, 264781, 161302, 469067, 201651, 709304, 292720, 574611, 373381, 381240, 415819, 93291, 703594, 373059, 431812, 433889, 244256, 519898, 90314, 422718, 538059, 577729, 389097, 166261, 701899, 303312, 664167, 180004, 222072, 400324, 667441, 184872, 400141, 595273, 583990, 505807, 499841, 658802, 482878, 412722, 310632, 593903, 230965, 366081, 790450, 294236, 103167, 346096, 443527, 318346, 427839, 333806, 569831, 630517, 608201, 198532, 233125, 544677, 673205, 445906, 399598, 602863, 370689, 576514, 603468, 327891, 207299, 665387, 337434, 465044, 514668, 515971, 512513, 613281, 594926, 683709]
17024F83709j45156P7633K38744B092N16550J16296j24244K7440m636K60097l03698
17013D89897M15686k81532C05977N26883Q8342L67169E37521J82578k00921J78934
17003F98112K9243J51062C50342K71110j34254Q6598j41955Q5765Q279K22492
16993G48377j55829J59496J59391l87475j98085M85194o9872P3459k25525K9605
16983F18736K3069K57791j97694O7702p5811n2446K9769J24602B65581Q20095
16973A085676M2232E55035K840J46631K63040P1885R1711m97305L40758l2352
16963I42243j47898j7120J98693j26071O6708O0476l01120L27683k38843N2052
16953H16803R6569k67751K00707K20503j5239l48209K71079l1402K34483r9774
$$ y = [683709, 538553, 616186, 854930, 2092, 518642, 634938, 510694, 538134, 533498, 793595, 489897, 905583, 624051, 305977, 832860, 921202, 1288371, 537521, 720099, 519178, 698112, 727355, 878417, 350342, 621452, 487198, 573796, 431841, 517606, 525885, 748377, 592548, 752044, 911435, 523960, 325875, 811069, 741197, 814656, 589131, 618736, 641805, 899596, 701902, 769604, 693793, 641347, 671116, 795718, 265581, 1085676, 1127908, 555035, 557875, 704506, 967546, 1039431, 1131142, 633837, 974595, 942243, 794345, 777225, 975918, 849847, 916555, 977031, 675911, 1003594, 764751, 816803, 913372, 645621, 846328, 1066831, 1051592, 703383, 974462, 943060, 1177543, 1077769]
16943A077769R8046J38884k56676Q87j42687J20174j95919J41180L8213J55632
16933A175503j72722N5088l80971L39075L34018k87574K56610p7938N4443J68768
16923A464300l39627j18690K01773J06394j21522K36798l83241n8639L77247j9215
16913A345578J28274j68871K28269m17365J93319M8957K94752l44393K5144O7290
16903A400954L8419O3581K79603k70336J59404p4235q3668K48541j51517j20123
16893A490623j45961K27755P6877L51009m31233L45502j33612Q3507J79961m69582
16883A574846Q8683j6623L96360Q1323r6257n941n1619K7040R4292J29823J46907
16872B368834j72497K3323q6813L13808k53127J32136J64158j35967k3965M7612
$$ y = [1077769, 1175815, 1314699, 1058023, 1058910, 916223, 1036397, 840478, 981658, 1019871, 1175503, 1002781, 1057869, 676898, 1015973, 1349991, 1062417, 1319027, 1241089, 1295532, 1464300, 1124673, 1005983, 1207756, 1314150, 1192628, 1429426, 1046185, 987546, 1364793, 1345578, 1473852, 1304981, 1533250, 1115885, 1309204, 1358161, 1652913, 1308520, 1333664, 1400954, 1439373, 1502954, 1782557, 1512221, 1671625, 1597390, 1513722, 1762263, 1610746, 1490623, 1344662, 1572417, 1649294, 2000303, 1569070, 1914572, 1780960, 1864467, 2044428, 1574846, 1663529, 1646906, 2043266, 2124589, 2028332, 2022391, 1970772, 1997812, 2092104, 2221927, 2368834, 2196337, 2219660, 2132847, 2446655, 2193528, 2325664, 2489822, 2353855, 2329890, 2377502]
16862B377502J25258j36795j16212J79722K26876N9889J08158l11365L91157l84025
16852B520165L19723l3619j2416O6645k38749J49186k8302O59155j61873k0491
16842C219424J39726k15947K17289k2895j80031Q39959l31764l85104M44769j54734
16832C570692K97540k5063l22863M12048L4104K79399l22821L83688K19894p5418
16822D451200J78087N9758l7362J48315N0577J44512k17298M63190j15126J22352
16812E248205J57101J6517J66380L28665K11531P4531J14211k92065J64009J082959
16802G272044l04224k17585O05611j95482R4778N14035j49302N07721j13765K30170
16792H244001O68824J66193J09016M7871K83178M46971K16632O823J11061P67321
$$ y = [2377502, 2502760, 2365965, 2249753, 2429475, 2656351, 2716240, 2824398, 2513033, 2904190, 2520165, 2839888, 2806269, 2793853, 2860498, 2621749, 2770935, 2742633, 3401788, 3239915, 3219424, 3359150, 3143203, 3360492, 3337597, 3157566, 3997525, 3665761, 3280657, 3725426, 3570692, 3868232, 3843169, 3520306, 3932354, 3966458, 4245857, 3923036, 4306724, 4526618, 4451200, 4629287, 4689045, 4651683, 4799998, 4850575, 4995087, 4777789, 5240979, 5125853, 5248205, 5405306, 5421823, 5588203, 5916868, 6128399, 6202930, 6317141, 6025076, 6189085, 7272044, 6967820, 6750235, 7355846, 7160364, 7255142, 7769177, 7619875, 8127596, 8013831, 8244001, 8912825, 9079018, 9188034, 9235905, 9519083, 9966054, 10182686, 10189509, 10300570, 11067891]
16782A1067891R4085J98946M60733O31280j11870O43405L77585Q86439L660P98988
16772A5051142k0608P73467M56972J023280J93085O96475N35011N92600Q11627
16763B0113051R15074M37437R86526J038502J109941Q42393J472339R34415R58275
16754B8807953J170728J384168J706003J726477J299104J571544K259010K082382
16746D2007369K292887J793489L077891K307919L156543K995011L514380L833468
16738F4978957L441026M332939M304134N092986N231768O243277N761359O257310
16730A05643756P480472P443062Q199000Q301955Q732003R087224R153321R678544
16722A73719337R028814Q617511Q313377P343602O174436M653274K787208J331896
$$ y = [11067891, 11161976, 11360922, 11821655, 12452935, 12341065, 12984470, 13362055, 14248494, 14252154, 15051142, 15030534, 15804001, 16260973, 17284253, 17477338, 18173813, 18708824, 19301424, 20113051, 21028125, 21465562, 22452088, 23490590, 24600531, 25442924, 26915263, 27849678, 28807953, 29978681, 31362849, 33068852, 34795329, 36094433, 37665977, 39924987, 42007369, 44300256, 46093745, 49171636, 51479555, 54636098, 57631109, 61145489, 64978957, 68419983, 72752922, 77057056, 82150042, 87381810, 93625087, 99386446, 105643756, 113124228, 120567290, 128766290, 137068245, 145800248, 154887472, 164040793, 173719337, 182748151, 191365662, 199679039, 207022641, 213197077, 217850351, 220637559, 221969455]
16714B21969455k37673k438357l866196n739238o539832q155335q370304r506720
16706A77115800r299781r624906r376716r392999q675342q365954q006190p772557
16698A06601355p038860o147874n879190n327612n372161n152977m232804l886256
16690F3563621m034047l404297l404062k709580l087680k380453k363214k298348
16682C9881940k013403k104660j329805j999752j611197j327647r53924j848970
16674B6692582q60545j353803r61747r15773q92697j004253q42796q17336q12622
16665A8231010p08425m90288n40668m67091o11938p42310n99660k82062o71795
16656A3116773o4052l18618p79112q9911n11870l25371n40961O6306o82801J06262
$$ y = [221969455, 221731782, 219293425, 215427229, 209687991, 203148159, 194992824, 186622520, 177115800, 167816019, 158191113, 148814397, 139421398, 130746056, 122380102, 114373912, 106601355, 99562495, 93414621, 87535431, 82207819, 76835658, 71682681, 67449877, 63563621, 59529574, 56125277, 52721215, 50011635, 46923955, 44543502, 42180288, 39881940, 37868537, 35763877, 34434072, 32434320, 30823123, 29495476, 28541552, 26692582, 25832037, 24478234, 23516487, 22600714, 21708017, 20703764, 19860968, 19043632, 18231010, 17522585, 17032297, 16491629, 16024538, 15412600, 14670290, 14070630, 13788568, 13116773, 13052721, 12734103, 11954991, 11865080, 11353210, 11027839, 10486878, 10553184, 9870383, 9976645]
16646I976645o42745m00508K05535p05272K25990n48861J17287r60009J67915
16637G435977J52202j79664n27463M1970l93842m9169m9236m48931L0162j4431
16627E997575k68914m0115m71692L18178m96639R0480k25868o4701l34511K79080
16617D782873l29822J5132k28954J38810j22671l01108J37013k12532M15694m82603
16607C811832l11249K82417j93574o5568m24107L87826k69375J2184K74671r1992
16597C413065l78872J27972l65372k06851L06918n0550K9019n50058K84910K26946
16587B837127n5415k24300k41011K37755k09245K28816j0590n17642k6933O6782
16577B085344Q778K50175K7116l26596J04869j33599j74730L29803m1396k37586
$$ y = [9976645, 9333900, 8933392, 9138927, 8433655, 8659645, 8110784, 8228071, 7268062, 7435977, 7588179, 7408515, 6881052, 6923022, 6529180, 6480011, 6430775, 5981844, 6012006, 5997575, 5728661, 5688546, 5216854, 5535032, 5038393, 5128873, 4903005, 4838304, 4503793, 4782873, 4453051, 4468183, 4239229, 4378039, 4255368, 3954260, 4091273, 3878741, 4294435, 3811832, 3500583, 3783000, 3589426, 3523858, 3099751, 3487577, 3218202, 3230386, 3505057, 3413065, 3034193, 3162165, 2796793, 2589942, 2896860, 2846310, 2875329, 2325271, 2610181, 2837127, 2781712, 2557412, 2316401, 2554156, 2344911, 2573727, 2563137, 2045495, 2018562, 2085344, 2094122, 2344297, 2371413, 2044817, 2149686, 2016087, 1841357, 2171160, 2129764, 1892178]
16567A892178p3628J24743j89877L5228L51214n89966K35210j4499J47998j94603
16557A723998j78820j00688j35038j0478R5662L56662j95646M5544k64268J54405
16547A491333l13182K00021M3662k16221J71083o3199K876j27267q0471j05992
16537A002643J66792o2538J14869j39365J25537j56060J04219J07397m77259K48614
16527A034849J49954o7969n275j46035K46578k36113m187K11966k55477J97768
16517A126059k22945L520K5453J42881m03461O3592j37412J58448K02536J78958
16507A137629k02131k85346M05852m49233p6165J29249J59877L78211l11300q7037
16497G99606j6174r3126N4746K3623j22704L73268m10431k6970L29406m31381
$$ y = [1892178, 1818550, 1943293, 1753416, 1788644, 2139858, 1549892, 1785102, 1770603, 1918601, 1723998, 1545178, 1444490, 1309452, 1298974, 1394636, 1751298, 1555652, 1601196, 1336928, 1491333, 1178151, 1378172, 1421834, 1205613, 1376696, 1313497, 1316373, 1189106, 1108635, 1002643, 1169435, 1106897, 1221766, 1082401, 1207938, 1051878, 1156097, 1263494, 786235, 1034849, 1184803, 1116834, 1111559, 965524, 1212102, 975989, 971802, 1183768, 928291, 1126059, 903114, 906634, 932087, 1074968, 671507, 735099, 597687, 756135, 958671, 1137629, 935498, 650152, 1056004, 606771, 530606, 659855, 819732, 1197943, 886643, 799606, 783432, 690306, 745052, 768675, 645971, 1019239, 608808, 581838, 911244, 479863]
16487D79863J48559M78199n04232q5969l7218J82176J62992k3431k68553R978
16477E42364j24655K62412J03872o3636j82013L35290k76323J35502B72828J69277
16467D42105M26623m33157J35436j55072N9818L00579k94704J11267j20909n7877
16457D14109l6337J35157J43727j02133j32375Q7529J30429j29827H2336K25581
16447C07917J17913J08245q5654J57402K3319K993A78088M38592j87365J75411
16437F04726j80004J30320o5057A30075L09196L35673l14091j42571L45351k88925
16427C74708j62643L31362B43591K94782k33674m5011J69491M1147m2467j52389
16417B75470J04836r824C7857R8340J94039J33759A26074J76054L01550j55741
$$ y = [479863, 628422, 1106621, 602389, 516420, 479202, 661378, 824370, 800939, 532386, 542364, 417709, 680121, 783993, 720357, 538344, 873634, 597311, 732813, 272828, 442105, 868728, 435571, 571007, 415935, 475753, 776332, 481628, 592895, 471986, 414109, 377772, 512929, 656656, 554523, 422148, 509677, 640106, 510279, 82336, 307917, 425830, 534075, 448421, 605823, 629142, 632135, 178088, 616680, 429315, 604726, 424722, 555042, 489985, 130075, 439271, 774944, 460853, 318282, 663633, 374708, 212065, 543427, 243591, 538373, 304699, 259688, 429179, 470326, 427859, 275470, 380306, 370482, 37857, 136197, 330236, 463995, 126074, 302128, 603678, 447937]
16407D47937J86836B04335G6610J39816a07112B14282L24421j13967B08287L28306
16397E36593j0863j01663M5516A77842p5823L12963J0080j84525m373J82042j61578
16386B56628f4452B12134k9884J6333N4737j833J36976j61642E5053L61623n0414
16375C66262j05176h8162I5653J0192O8847Q6398I8566M66961j05030r0562F6945
16363A07916o569J86789m526K31568D317L92714j80680J81689a55967B1331J39508
16352A60839N6330o2734K62759j86232J17024I0191c6119C75109K33645B12176
16341B92069F4664J6888Q198K4726L03672j53102C7062J76321p7741Q2282c0873
16329H1583K58733c9656o7288O37E02078r5083p1921d3341H8228J19354j01863
$$ y = [447937, 634773, 204335, 76610, 216426, -107112, 214282, 538703, 424736, 208287, 536593, 525730, 424067, 469583, 177842, 102019, 414982, 425062, 240537, 236164, 418206, 256628, -64452, 212134, 182250, 198583, 253320, 251487, 388463, 226821, 55053, 416676, 366262, 261086, -88162, 95653, 105845, 174692, 261090, 98566, 565527, 460497, 369935, 66945, 107916, 101347, 288136, 283610, 515178, 4317, 397031, 216351, 398040, -155967, 21331, 160839, 217169, 154435, 417194, 230962, 347986, 90191, -36119, 375109, 608754, 212176, 292069, 64664, 81552, 89750, 114476, 418148, 265046, 37062, 213383, 135642, 217924, -30873, 81583, 340316, -39656, -106944, -106307, 502078, 406995, 335074, -43341, 88228, 207582, 105719]
16318A05719N2723J03486a583B53398A24669M8279o1013g5523D62610j06511J5187
16307C71286c5718B10526a27111B13990J43001B0006J24298J7504a06588H003
16296C9534d4427E72280B66853q9178G6565J35351n5289a80893C0154K63607i0640
16284f4648q164C02188j07371L1844J88092A47534e3579C4008h6605B83616a43785
16272b00733A56568a16587C00356D1461K23160o9903Q1082G5357j11Q3986L4828
16261A94060H1365e7372B36459G8952J02963f4377A29521J41624a48724b2078
16250A61395L7236L7207i9005A09760j9713N31B9792a47802p9356a2955B88689
16238E6895J136J90798H1680P9687K8014J02295C4740J68471q1103k864J66249
$$ y = [105719, 158442, 261928, -1583, 253398, 124669, 172948, 111935, -75523, 462610, 356099, 371286, -35718, 210526, -127111, 213990, 356991, 20006, 144304, 161808, -106588, 8003, 39534, -44427, 572280, 266853, 177675, 76565, 211916, 156627, -180893, 30154, 293761, -90640, -64648, -72812, 302188, 194817, 226661, 414753, 147534, -53579, 34008, -86605, 283616, -143785, -200733, 156568, -116587, 300356, 41461, 264621, 194718, 275800, 75357, 75246, 159232, 194060, 81365, -57372, 236459, 78952, 181915, -64377, 129521, 271145, -148724, -22078, 161395, 198631, 235838, -99005, 109760, 90047, 90578, 29792, -147802, -227158, -12955, 288689, 56895, 58031, 248829, 81680, 161367, 189381, 291676, 34740, 203211, 122108, 119244, 285493]
16227B85493a02167M9078A55080b69A64888D766a48086A17552A4559f5456K5419
16216d0037A64384P6603i7869o531K0847C90886A773a5509A8362R4718d1707A40042
16203a98914O431h7197E2060J94312I7580a31246L8668P106C1996O4710N5309
16192A52015l3018A3741a399C0690Q2265c7719E0733g2374C17342A09312L7953
16181A47265g9187D1086e5913C16594E6373M8619a0717k96090B0133b96616f4848
16169C22470b90586B57980a46314A11096K6705F6355k6082f6308D3238b7364r6758
16158a24122B998a09446G8797L1230B1715J01401b62142G9716M6231l0210K14170
16147C09907a67482G2040a71113I2652d79799C85072A42679E9420a90251F5808
$$ y = [285493, -102167, -53089, 155080, -269, 164888, 4766, -148086, 117552, 14559, -65456, -40037, 164384, 240987, -97869, -104400, -83553, 390886, 1773, -15509, 18362, 113080, -41707, 140042, -198914, -192483, -87197, 52060, 246372, 97580, -131246, -92578, -85472, 31996, 96706, 152015, 118997, 13741, -1399, 30690, 112955, -37719, 50733, -72374, 317342, 109312, 147265, -79187, 41086, -55913, 316594, 56373, 104992, -10717, -306807, 20133, -296616, -64848, 322470, -290586, 257980, -146314, 111096, 137801, 66355, 40273, -66308, 43238, -27364, -124122, 2998, -109446, 78797, 110027, 21715, 123116, -262142, 79716, 125947, 95737, 309907, -167482, 72040, -171113, 92652, -479799, 385072, 142679, 59420, -190251, 65808]
16136I000b1836A24985a97521g549m6192m3650d8687k6609B43917e6774A71590
16124a74031A41341K5882b2732r4167M5043l9574A53890a23695C7410b6337C43476
16112A99060m8780a68049j10104P3697B56525p4038e510I0888a69953c5660F4467
16100C7639J3844J75641J8964d3176C57041e5407K6060j26813B57312a12916B32412
16088a50229j34471A1481c28180a38241c4960C1639O8059a39975k244q0209k3081
16077b45509c2114q1870j3227f0413G850J48382p3208a01099A2693b95571b0180
16065a71925l12686C42353A34577b12758b1225G7704f084k55624C4071P5274J08083
16054B17428d38812H7934b99462e9887k0031j1272k48A00646R57e9685p0615j1624
$$ y = [9000, -21836, 124985, -197521, -7549, -53741, -97391, -48687, -75296, 243917, -56774, 171590, -174031, 141341, 167223, -22732, -116899, -71856, -111430, 153890, -123695, 37410, -26337, 343476, 199060, 150280, -168049, -278153, -204456, 256525, 182487, -5510, 90888, -169953, -35660, 64467, 37639, 51483, 227124, 246088, -43176, 357041, -55407, -29347, -156160, 257312, -112916, 232412, -150229, -284700, 11481, -328180, -138241, -34960, 31639, 99698, -139975, -142219, -222428, -245509, -32114, -113984, -127211, -60413, 7850, 156232, 83024, -101099, 12693, -295571, -20180, -171925, -484611, 342353, 134577, -212758, -21225, 77704, -6084, -261708, 34071, 109345, 217428, -438812, 87934, -299462, -59887, -79918, -91190, -91438, 100646, 101603, -59685, -130300, -141924]
16042a41924B83168d02239a09062d6122j91127h9697A18468e7697A99968a82065
16031b25519N6914L8247L0796k03063h6289l95010A18b37813A12953J28163g8907
16019I7845B1132a18886j00007Q4378N0205K1981k6342l9860C1410J1218i6857
16007i5916j08539P8771e278k72700D11209b64293H0243a8859j19269a9877O095
15996a3782j51078A05095J01659f3106k48446J42609O2557k80434a88496h8060
15985A11511P4319K5025r8055d3955A13853g8969I6883d7695A42680O1120B1720
15973f2022o615j04059B1756K22617o6147d8022k55837B1188K42082b34683N9196
15962a75487A61565b1505k38535G4376B5830P3521n783b49747f8367E4611k6062
$$ y = [-141924, 283168, -402239, -109062, -46122, -237249, -89697, 118468, -57697, 199968, -182065, -225519, -168605, -130358, -99562, -302625, -86289, -481299, 118, -237813, 112953, 241116, -78907, 97845, 21132, -118886, -218893, -134515, -84310, -62329, -88671, -128531, 31410, 42628, -96857, -95916, -204455, -125684, -5278, -277978, 411209, -264293, 80243, -18859, -138128, -19877, -13782, -164860, 105095, 206754, -63106, -311552, -168943, -106386, -386820, -188496, -88060, 111511, 185830, 210855, 112800, -43955, 113853, -78969, 96883, -47695, 142680, 203800, 21720, -62022, -68637, -172696, 21756, 244373, 178226, -48022, -303859, 21188, 263270, -234683, -175487, 161565, -21505, -260040, 74376, 25830, 99351, 93568, -249747, -68367, 54611, 28549]
15951B8549K53068I4805M7595J11134b23323M3080A05695k3525i6196A63683c36965
15939a88945A54291b96729G8421O5663a16879B6714O8474b20680C08660A35423
15928e5689E4066N1015a82483B353J16233c21549a31542a5599N260j7359A11518
15916e566A5812c24156o3394A84176b13732J8374N1808k61222f4560j8560a0706
15904A93736E473a33229Q498O2096a0591C48875j56719a270j82835A9217j30b44436
15891A60653a03226L2416j61987P1460k0398E9297J16538b90726d5639Q971F941
15879c42112A6655b26506A65742a63815B85114b77146A44897d4863l5149j57148
15869b37160E8656A8651a5746k19984m1840A21058A988K34968c8k90525R0461
$$ y = [28549, 281617, 94805, 142400, 253534, -223323, -180243, 105695, 82170, -96196, 163683, -336965, -188945, 154291, -296729, 78421, 144084, -116879, 26714, 95188, -220680, 308660, 135423, -55689, 54066, 105081, -182483, 2353, 118586, -321549, -131542, -15599, -10339, -27698, 111518, -5566, 15812, -324156, -387550, 184176, -213732, -195358, -143550, -404772, -64560, -83120, -10706, 193736, 5473, -133229, -124731, -62635, -10591, 348875, 192156, -1270, -184105, 19217, 19087, -244436, 160653, -103226, -70810, -232797, -161337, -181735, 59297, 175835, -290726, -45639, -36668, 6941, -342112, 16655, -226506, 165742, -163815, 285114, -277146, 144897, -44863, -80012, -237160, 58656, 18651, -15746, -235730, -277570, 121058, 1988, 236956, -38, -290563, -200102]
15858b00102c0064E1678a71435B39164n465Q2791j50301F2500b06075g7990L6190
15847d1800J7255F8577a69365G2644k5957b25623C8930a48554C1693a99738N1168
15836a48570n3550O4463j05489C30487j62194n4330a43637c4456B75283i9265
15825a92024M8936k08284C78317H76d8949j10767G962a85404B50463e7601A49056
15813b32423C66309a05096k07023D2841J4037b50624h5695j11753e2912p2070
15803a24982d0827o6984D5584M5027J22368h3420j90583D9978J54463a11668A36989
15791b44131a2712j72261b2083a0824j43935b2776E3185c13090A35265f7570l3063
15780a00633j04866B1163g8896A97680r0352a81788k25048a54975l1483D740d0519
$$ y = [-200102, -30064, 51678, -171435, 239164, 233699, 316490, 166189, 62500, -206075, -77990, -41800, -24545, 68577, -169365, 72644, 46687, -225623, 38930, -148554, 31693, -199738, -148570, -202120, -137657, -243146, 330487, 168293, 113963, -143637, -34456, 275283, -99265, -192024, -143088, -351372, 378317, 876, -48949, -159716, 7962, -185404, 250463, -57601, 149056, -232423, 366309, -105096, -312119, 42841, 56878, -250624, -85695, -197448, -52912, -124982, -40827, -107811, 45584, 90611, 212979, -83420, -274003, 49978, 204441, -111668, 136989, -244131, -12712, -184973, -22083, -10824, -154759, -22776, 53185, -313090, 135265, -67570, -100633, -205499, 21163, -78896, 197680, 107328, -181788, -406836, -154975, -186458, 4740, -40519]
15768a06780c7137j55913N9812r7462c4925A93896a89210M0621r7762H7640a93905
15756G2046J22281L2897g833A00630Q3312b00720B82022D9078J55444J35283j51861
15745A87944c5595J1131A57594a8935A97572o6101b21082J07832j74359C52750
15734b80444A51874e7658j2951q5519o2361c7018j27011L3544k03344A09325a79700
15722I9551b50097B88580o838a87305B57300H8287i618B47716b34743a9921j0644
15711c0565j69232J832I45f2065a9092n4845q1317N1658A36776a85250d8078q6322
15699a34400l5166g3231q744a8686A4226K58749H0615J52711b85668A38024L14874
15688D52898A80087B0462f7826B35459E0626a16362A27548A511d26424D1982b24471
$$ y = [-106780, -37137, -193050, -133238, -230700, -34925, 193896, -189210, -148589, -246351, 87640, -193905, 72046, 194327, 227224, -7833, 100630, 183942, -200720, 282022, 49078, 204522, 339805, 187944, -35595, -24464, 157594, -18935, 197572, 131471, -221082, -113250, -287609, 352750, -280444, 151874, -57658, -70609, -156128, -218489, -37018, -164029, -130485, -333829, 109325, -179700, 99551, -250097, 288580, 281742, -187305, 257300, 88287, -9618, 247716, -234743, -19921, -30565, -199797, -197965, 945, -62065, -19092, -73937, -155254, -103596, 136776, -185250, -48078, -134400, -169566, -73231, -81975, -18686, 14226, 272975, 80615, 233326, -285668, 138024, 452898, 180087, 20462, -67826, 235459, 50626, -116362, 127548, 1511, -426424, 41982, -224471]
15676b84674a35245C2971J8658a64899E2560k1908Q2394a21938r636a5683q090
15665b3773A37226b24462A15769a79830k76989K28309i7247D1695K08873b89683
15654a97562j94871A7807i6407c1542D05399E3304c964I9278b5452m342l8758
15643f8552c082B7802R3599b92039K9368M2516O2043O7374A76011d36508e5093
15631A2477Q6723c14913B6201M8940R6501a9677C00465i0039A88168o1834b22982
15619a16563N7147k534B19059D9643h9258B76557K28146a11647k74262a13644
15608h4230C909b4766m4396A1626a62168P5055j58843o8906d8011D6785M429j9363
15596C1851B134J5239b50566A12821j0655g8956k6819o1029f8085p894A87998
$$ y = [-284674, -135245, 32971, 51629, -164899, 52560, 30652, 113046, -121938, -131574, -15683, -23773, 137226, -224462, 115769, -179830, -456819, -228510, -97247, 41695, 250568, -289683, -197562, -392433, 17807, -96407, -31542, 405399, 53304, -3964, 99278, -25452, -29794, -68552, -3082, 27802, 121401, -292039, -262671, -220155, -158112, -90738, 176011, -436508, -55093, 12477, 99200, -314913, 26201, 75141, 171642, -19677, 300465, -90039, 188168, 126334, -222982, -116563, -59416, -61950, 219059, 49643, -89258, 276557, 504703, -111647, -385909, -113644, -84230, 3909, -24766, -69162, 11626, -162168, -87113, -245956, -314862, -48011, 46785, 51214, 31851, 2134, 17373, -250566, 112821, 102166, -78956, -105775, -166804, -68085, -75979, 187998]
15584b77062B44788b55809Q3769A59061N4728A01715a70813d9183J2842A48846
15573A76306o2474J02111C0778e8634b5545B2346q002b04962e2360l6573B71667
15561C9169K4928B4616c44115G4698g6534j41599B17022q9529a02201d8395A95214
15549i77l43423A72952P0464F4139J15733j2199c795p787k26427E4830R5429d7431
15536G8746K1790R20a1793j62898D8743A9335c04157A72776B9336J33891i9966
15524b30439p7192B36667e5356o3022A33341O0773n6526C3643P8509j9733a29800
15512a14403F3484a45540C43011M0293A9102J35063m9263b39026A06469a88896
15501B3144a43840A14295h570l9489A60952a56844l407e3764B18380a54078k6139
$$ y = [-277062, 244788, -255809, -172040, 159061, 213789, 101715, -170813, -49183, -36341, 148846, 176306, 113832, 215943, 30778, -58634, -25545, 22346, 14344, -204962, -52360, -88933, 271667, 39169, 64097, 24616, -344115, 74698, -76534, -218133, 217022, 127493, -102201, -48395, 195214, -977, -344400, 172952, 243416, 64139, 179872, 167673, -3795, -11582, -238009, 54830, 150259, -47431, 78746, 100536, 101456, -11793, -174691, 48743, 19335, -304157, 172776, 29336, 163227, -99966, -230439, -307631, 236667, -55356, -118378, 133341, 194114, 137588, 33643, 112152, 92419, -129800, -114403, 63484, -145540, 343011, 383304, 19102, 154165, 104902, -239026, 106469, -188896, 23144, -143840, 114295, -8570, -48059, 160952, -156844, -160251, -53764, 218380, -154078, -180217]
15490a80217q2343a14597k20365b5829n9995K2238a8391j9879A86972J6204K08671
15479D11847a58784A7828p978a03799d699A76734i1845a917B17567I4887J08676
15468B03563l9757c34562E7318N9486f9890q0438A49195c32203Q2900n900G3886
15456E5534a11484K5898Q519A35591a89930A87106E2316a06323r4711J6245B91970
15444A25770a46340k17813J59253B67284H8504a15411a6458j58420e060q1716
15434h6776E9650M3951q641a95610a0566B6585J68651c76900G7170P2310f1341
15422C8898g6059r2180A78711a46612b554l1580q3446A85526g386q233N778r6020
15410a05861M9544B53600B9773a26131N441o9202A51236J13482G0158R122P8093
$$ y = [-180217, -262560, -114597, -334962, -25829, -85824, -63586, -18391, -38270, 186972, 203176, 411847, -158784, 17828, 9850, -103799, -4699, 176734, -91845, -1917, 217567, 94887, 203563, 163806, -334562, 57318, 116804, -69890, -150328, 149195, -332203, -249303, -255203, 73886, 55534, -111484, -85586, -77067, 135591, -189930, 187106, 52316, -106323, -201034, -184789, 291970, 125770, -146340, -364153, -204900, 267284, 88504, -115411, -16458, -174878, -5060, -86776, 59650, 103601, 94960, -195610, -10566, 26585, 195236, -376900, 77170, 149480, -61341, 38898, -76059, -168239, 178711, -146612, -2554, -34134, -117580, 185526, -7386, -15619, -9841, -105861, -56317, 253600, 29773, -126131, -120690, -189892, 151236, 264718, 70158, 79280, 157373]
15399A57373a20963e9171A23481h8914j08456A04036M1502p0057b37130A94210
15388B2793M1022l0388a21056B48981A10620e6247E8494b23891A29840k6879b60271
15376d58889C6342M9939l6611K94808a11325a9044n0961a2507m2920B8176a34095
15364E1010b15318j41339E303J06340C4501j5999a14316M8217A68320p6932M17761
15353E09149b99132B26842b0382j32935B2829a59944P9035D3875Q8649F710d7783
15341g4659q8136C31094c96246J38977h6394A93312b060A30278l6103o312J26953
15330B14816C4218M8435L71618C0970O0508M8598m4465l3703c04667A46211J7639
15319A63850k7428L04653j4901B08076G0579a18405A19066J65496I0325b08497
$$ y = [157373, -120963, -59171, 123481, -88914, -197370, 104036, 145538, 75481, -237130, 194210, 22793, 63815, 33427, -121056, 248981, 110620, -56247, 58494, -223891, 129840, 102961, -260271, -458889, 36342, 86281, 49670, 344478, -111325, -19044, -70005, -12507, -55427, 28176, -134095, 51010, -215318, -356657, 5303, 111643, 34501, 18502, -114316, -66099, 168320, 91388, 509149, -299132, 226842, -20382, -153317, 22829, -159944, -80909, 43875, 132524, 6710, -47783, -74659, -162795, 331094, -396246, -257269, -86394, 193312, -2060, 130278, 94175, 87863, 214816, 34218, 82653, 454271, 30970, 91478, 140076, 95611, 61908, -304667, 146211, 163850, 136422, 441075, 426174, 208076, 70579, -118405, 119066, 284562, 90325, -208497]
15308C51373A03444D2087J82775q1103b3485A4691J55046c9627A15051A5417f2330
15296B76809A34259Q5602H9724J59081a8871A51879b24572H2671i9449L7034k02177
15285b64592J29425A10367J39866A09446k3283l0985b14004k1763b4244C5583
15274b09477C7050b95182A50589B5158a99720m4154A69285g6105A33216M3855
15264A77071c04903C58567o4990A6963K22359F8469K59351A19959K34261a12631
15253F4276R3525J73063n537K2246M33801Q37265p08134J90304J38632n93009
15243F46432B4012J61849d4218j09675f6519o3960C8334c6744A03487e2909B19677
15231b1843A21454m4079K77491H5663k2013b56591A55260O7504g3226F5271J5709
$$ y = [351373, 103444, 42087, 224862, 143759, -23485, 14691, 169737, -39627, 115051, 15417, -62330, 276809, 134259, 219861, 89724, 248805, -18871, 151879, -224572, 82671, -99449, -62415, -264592, -135167, 110367, 250233, 109446, 86163, 55178, -214004, -235767, -24244, 35583, -209477, 37050, -295182, 150589, 25158, -199720, -243874, 169285, -76105, 133216, 177071, -304903, 358567, 293577, 16963, 239322, 68469, 327820, 119959, 354220, -112631, 64276, 157801, 330864, 325327, 347573, 781374, 1618639, 910505, 1100809, 1239441, 646432, 24012, 185861, -44218, -153893, -66519, -130479, 38334, -36744, 103487, -52909, 219677, -21843, 121454, 77375, 354866, 85663, 63650, -256591, 155260, 222764, -73226, 65271, 80980]
15220H0980M38828A70226l429f0963B267L87050c4758a2958C92282c49186G0265
15208E2661j7662a45448A44756P0608n5968A5917a57866F8796J44674A03363d49776
15196B01430N3026p4774B8697K52494a79089L4731g610k08289A35826k2897e7950
15184D816P4085J4789a05119j88667G0077B1855N1451J85259A14180a41041A00889
15172h4459A6892J78666E7895a1115D3904K42776j40947E4316O75R271J41906
15161B06168I822N0515K66105C7071J50043B3696O3399A0299N9588i5107B51608
15149b3159k81535F9392J47581H7835K42692I5582K39454N1497c5190J5312B42051
15137D4685a32420A51930D5267a20686A74217Q8083F6057K58762q3861O0999j06016
$$ y = [80980, 519808, 170226, 166797, -60963, 2267, 389317, -34758, -12958, 392282, -349186, 70265, 52661, 34999, -145448, 144756, 215364, 159396, 15917, -157866, 68796, 213470, 103363, -449776, 201430, 254456, 179682, 28697, 281191, -179089, -144358, -7610, -215899, 135826, 112929, -57950, 4816, 78901, 93690, -105119, -293786, 70077, 21855, 73306, 258565, 114180, -141041, 100889, -84459, 16892, 195558, 57895, -11115, 43904, 286680, 145733, 54316, 54991, 64262, 206168, 9822, 60337, 326442, 37071, 187114, 23696, 87095, 10299, 69887, -95107, 251608, -23159, -304694, 69392, 216973, 87835, 330527, 95582, 335036, 386533, -35190, -19878, 242051, 44685, -132420, 151930, 45267, -120686, 174217, 262300, 66057, 324819, 240958, 301957, 195941]
15126A95941o8269b51469A40567a49485I6288K95632a37671D40664A09010P9530
15116A88540J4815G4515K86091h5447A95679O2510d0801F3795K37828O348K9787
15105C37758G9177J40424j316A03162N1832J05756A29252j2991d3988A74178O1108
15094B35286A00226f5227B11244k7277e0484C2595K29359i3478R277C21944A18775
15082A037K66730L8095n8365l9842N00183A11401l3718B8204K13264L6063G9120
15070B08387k3554g9021B03891K7952F1800J12486p40b6483C12857E9537J33198
15059A92735m6543m4036N7335j7759L78660A9229J3601K31818A02045K448K00899
15048C05392b1091j8114B58681o3593k2308J64205J01101j4760j62388P918G776
$$ y = [195941, 127672, -251469, 140567, -149485, 96288, 391920, -137671, 440664, 109010, 188540, 203355, 74515, 360606, -85447, 195679, 258189, -40801, 63795, 301623, 307971, 337758, 79177, 219601, 218285, 103162, 154994, 260750, 129252, 116261, -43988, 174178, 235286, 100226, -65227, 211244, 183967, -50484, 32595, 261954, -93478, -84201, 321944, 118775, 1037, 267767, 305862, 247497, 207655, 707838, 111401, 77683, 28204, 241468, 277531, 79120, 208387, 184833, -79021, 203891, 231843, 61800, 174286, 173546, -26483, 312857, 59537, 192735, 146192, 102156, 159491, 141732, 520392, 19229, 32830, 264648, 102045, 104493, 305392, -21091, -39205, 258681, 195088, 172780, 336985, 438086, 423326, 260938, 268856, 7776]
15036B50424q8716B372J97849c33804A1720J3775L63682k7914A30227A8309K34826
15025B53135J4176J220J41601j64101f0206A73330j4814L16646j91441c0210B32104
15013B75274k8077O5496J21424A39810a58807C94185A68083L69263A76534l2846
15003A43688n8905J19597g498A030L41058P27l4008j40315H1848a78492D63637
14991A62163f2694A50341e1058D40515j54215a0137B2783J44223p827A4606J35731
14980A50337C1012K55845A34464J47236Q0689A0055M77517B24907K42120k24512
14970B42515n9299J51880j7739O148J75920A56273K39217A11878d8077E65505
14959E77135I6010J07790J50860j48262G6811J16822J45558J28937G8543K72091
$$ y = [250424, 161708, 2372, 200221, -333804, 11720, 25495, 389177, 361263, 130227, 18309, 253135, 267311, 268531, 410132, 246031, -60206, 173330, 158516, 475162, 283721, -30210, 232104, 275274, 247197, 312693, 434117, 139810, -158807, 394185, 168083, 537346, 176534, 143688, 84783, 204380, -7498, 1030, 342088, 342815, 308807, 168492, 81848, -178492, 463637, 162163, -62694, 150341, -51058, 440515, 286300, -10137, 22783, 167006, 159179, 14606, 150337, 31012, 286857, 134464, 281700, 362389, 10055, 487572, 224907, 467027, 242515, 183216, 335096, 317357, 323505, 499425, 156273, 395490, 111878, -48077, 565505, 577135, 96010, 203800, 354660, 206398, 76811, 193633, 339191, 468128, 78543, 350634]
14949C50634a7661B64905J37279G836K83292m3130F9365J76964K6179o5652a78815
14937A52658o9266j8792K55303o9054K20957j99510j21925L97785k16276A61817
14926B70186L41629A13152L78838A21166L26123G7963M63665A83929J30647j9556
14916B95020O8304H3361L65828J27714j86128j54606J29955J50211j66185J01946
14906D52096K61533l36515J33310B42026A14625N07929m6491B87790C7139K99297
14896C36436A63908J72856r3086M11412j75101q7862j2633A62855L37530k29219
14886B71166o971K8822o2192L11313k61656K62147j16404J07175A48927K85215
14876D34142A18806F314N05935m5679K20353A19586L75653J5310O6405M887k60140
$$ y = [350634, -17661, 264905, 402184, 7836, 291128, 247998, 69365, 246329, 272508, 206856, -178815, 152658, 83392, 64600, 319903, 250849, 471806, 272296, 150371, 548156, 331880, 161817, 270186, 611815, 113152, 491990, 121166, 447289, 77963, 541628, 183929, 314576, 295020, 363324, 83361, 449189, 576903, 390775, 236169, 366124, 516335, 350150, 452096, 713629, 377114, 510424, 242026, 114625, 622554, 576063, 287790, 37139, 336436, 163908, 336764, 243678, 655090, 479989, 392127, 379494, 162855, 500385, 271166, 264195, 293017, 230825, 542138, 280482, 542629, 426225, 533400, 148927, 434142, 118806, 6314, 512249, 466570, 686923, 119586, 495239, 510549, 576954, 581841, 321701]
14865C21701J47386K65508l43528k7632J19446J09787E5815L65436j63763j9987
14855B37501J00445j7916n9452A06826K76660L05481B15913L61773B31011J42393
14845C73404m0680A13895M93830k56957J11819m6249m8627K10456J24087k29607
14835D72647L0450A17843K07463j7207K23159H8282N65253j91684k03610K93196
14825E51437j16132P6579K67296l80975K5508q1319j67385K71572L8307J56066
14815F40954P8883B72568K80918k30174K19362j19567m5601J0159L51431k86118
14805D52978J31514B54321p0815K58297K02433C09120L42763j34028j18974n9934
14795C38947Q718N61489j97255k46123j17500K23184j62170K8778J67576k66319
$$ y = [321701, 469087, 734595, 391067, 363435, 482881, 592668, 55815, 421251, 257488, 237501, 337946, 320030, 260578, 106826, 383486, 688967, 215913, 577686, 231011, 373404, 332724, 113895, 607725, 350768, 462587, 416338, 367711, 578167, 702254, 472647, 503097, 117843, 325306, 308099, 531258, 88282, 653535, 461851, 258241, 551437, 435305, 511884, 779180, 398205, 423713, 342394, 175009, 446581, 484888, 640954, 719837, 272568, 553486, 323312, 542674, 423107, 377506, 387665, 739096, 452978, 584492, 254321, 183506, 441803, 644236, 309120, 651883, 517855, 398881, 338947, 347665, 909154, 711899, 465776, 348276, 571460, 409290, 438068, 605644, 339325]
14785C39325J60523n8510j07139L67583l9803j01297j03590K94701M7172k3985
14775G74980n8830j94726K99478C34378J52739M12529j81283j49647R6744m6867
14765F18593P3655J84437j82086k73647K14446J13943k48357M0701M15121l91606
14755E65200J58741R958O9997K47928l76205J73807k1659C13275J28229K64066
14745G05570l06367K23582J26083J7505O9222J34913m29520K81408r1169M1678
14735G72905J46688q7361j51066k6039j6592L75413j69916M9902k12165J16953
14725G98722k56109K78895L4295p7343M06943l9326m22983q5535L75464P1314
14715A084337O3590l41663K71813l8930k06916n4367K26198j60199J32133J02
$$ y = [339325, 499848, 441338, 334199, 701782, 661979, 560682, 457092, 751793, 798965, 774980, 716150, 521424, 820902, 334378, 487117, 899646, 718363, 568716, 665460, 618593, 692248, 876685, 694599, 420952, 635398, 749341, 500984, 541685, 956806, 565200, 723941, 733899, 803896, 1051824, 675619, 849426, 827767, 313275, 441504, 705570, 399203, 622785, 748868, 766373, 835595, 970508, 540988, 822396, 731227, 772905, 919593, 832232, 681166, 655127, 638535, 1013948, 844032, 893934, 681769, 798722, 542613, 821508, 855803, 778460, 1185403, 1146077, 723094, 637559, 1013023, 1084337, 1147927, 806264, 1078077, 1039147, 832231, 777864, 1004062, 843863, 975996, 976098]
14705I76098j28584Q0946K76991j3102m26581M12394l90982K16433L44255k50036
14695A097832j39545r6667j13802M51600n07094N743J97861J75307P695k38045
14685H40885J6750J57926K6798j12779K73620l30542L39286l56699J06642j8127
14675I43760K12415K13636j97093j96776r3808J78859M9318J18454R0308k86470
14665A032603o3280q2440K02416k43446J69034L2157j99463M061K55129j50707
14655I56064J13695J65015J2129l5569Q9460k28193K8507O1008Q6321J04729p2054
14644A281112J42892j12751n3259k5857K99834K3807J9625k54662J00545J14734
14634A536020l4945k61651J21484K18297o00532P46743l21660J91515j23230n9246
$$ y = [976098, 847514, 928460, 1205451, 1192349, 765768, 1178162, 787180, 1003613, 1347868, 1097832, 958287, 861620, 747818, 1199418, 692324, 698067, 895928, 1071235, 1078930, 840885, 857635, 1015561, 1042359, 929580, 1203200, 872658, 1211944, 855245, 961887, 943760, 1156175, 1369811, 1172718, 975942, 882134, 1060993, 1110311, 1228765, 1319073, 1032603, 969323, 886883, 1089299, 845853, 1014887, 1047044, 847581, 851642, 1106771, 956064, 1069759, 1234774, 1246903, 1211334, 1300794, 1072601, 1101108, 1162116, 1248437, 1353166, 1281112, 1424004, 1311253, 1257994, 1232137, 1531971, 1555778, 1575403, 1320741, 1421286, 1536020, 1501075, 1239424, 1360908, 1579205, 978673, 1725416, 1403756, 1595271, 1472041, 1412795]
14624A412795K26299j834j40072r4648J96849l08400L96010j55440J10663l31864
14614A310358K47840l27727N99120O5442m71950M85569k38560J26634j97857L1311
14604A630180L2423j80868O09114k24117q3094j97036K47286J08146k12793L93731
14594B122972l43105j1965O7691P590j32538K87574j35370m680K86608j59171
14584A985606k054J72487L3907l2634l19944L47249J9166j06601J99645j27917
14574B168910o1657O5251K5673M41272J14048n22731K43146p5974J43783L3045
14564B574766o7799L32120M3645j77595J79049K76555l2141K31401J40287K66493
14554C766781J64578M11892M74728J82714J420544J512793L936545Q235038J4161726
$$ y = [1412795, 1639094, 1637260, 1497188, 1402540, 1599389, 1290989, 1686999, 1531559, 1642222, 1310358, 1558198, 1230471, 1829591, 1895033, 1423083, 1908652, 1670092, 1796726, 1598869, 1630180, 1662603, 1481735, 2090849, 1866732, 1783638, 1586602, 1833888, 1942034, 1729241, 2122972, 1779867, 1767902, 1835593, 1843183, 1710645, 1998219, 1862849, 1858169, 2144777, 1985606, 1983552, 2156039, 2189946, 2157312, 1837368, 2184617, 2203783, 2097182, 2296827, 2168910, 2107253, 2172504, 2198177, 2639449, 2753497, 2230766, 2473912, 2397938, 2541721, 2574766, 2506967, 2839087, 2882732, 2705137, 2884186, 3160741, 3128600, 3360001, 3500288, 3766781, 3931359, 4343251, 4817979, 5000693, 6421237, 7934030, 11870575, 20105613, 34267339]
14545C4267339R928355j5768931A2857402F061828k142662q01124m65627j13778
14537B538637n19673J64350o745p0859M50894k85278K09210q0940m05749q2768
14527A911079L53692N4691M47208j17852K80167l38913R3499L05630l04699j09279
14517B575223o0360L00919m54444M40557O8181k0720k53688L83243N0741j82131
14507B847521K16298P1361J59553K69887l40780K88460J26496o02296J83042N31458
14497C751000l77492L8803j95293O24369J69922l38186R3859J64213l48011L6063
14487C619247J91698m03392P29791R3750o4776j04519r5152L66734j29353O75
14477D204703L13440n2061j9150o9641q9180M59681j33794k83221L62329L60614
$$ y = [34267339, 44195694, 28426763, 12857402, 6061828, 3919166, 3118042, 2652415, 2538637, 2018964, 2183314, 2176569, 2105710, 2556604, 2271326, 2480536, 2399596, 1993847, 1911079, 2264771, 2319462, 2766670, 2648818, 2928985, 2590072, 2683571, 2989201, 2684502, 2575223, 2514863, 2815782, 2361338, 2801895, 2870076, 2849356, 2595668, 2978911, 3029652, 2847521, 3063819, 3135180, 3294733, 3564620, 3223840, 3512300, 3638796, 3036500, 3219542, 3751000, 3373508, 3412311, 3217018, 3841387, 4011309, 3673123, 3766982, 3931195, 3583184, 3619247, 3810945, 3407553, 4137344, 4231094, 4166318, 4061799, 3966647, 4333381, 4204028, 4204703, 4518143, 4466082, 4446932, 4377291, 4288111, 4747792, 4613998, 4330777, 4693106, 5053720]
14467E053720j51913O4807j98802q7707M67207j35743j32052Q4745P35308l97039
14457E302531K27774k5585j14746O8211K35763J07565L6603j98874K28848J71214
14447F039304j42313J09040N9687J05814M6956J56890J60483o7536m1134J4977
14437F442168O63071m63165J48372L73172N2436m5710J30447R0319K34052j30726
14427G494436M65513L3954o0210J15968J23133p2438N93692j31534j2226Q4673
14417H634961M14773j12311K50669j25870J77229M1497M0839M70710L19308M16918
14407A0528723k26138K29298q1041L19940J76180Q7413J15648j21312N57619K16964
14397A1803294Q5115n2608L45835L41392J50942K0195L99683L17836K18987j06285
$$ y = [5053720, 4901807, 4966614, 4767812, 4680105, 5147312, 5011569, 4879517, 4964262, 5699570, 5302531, 5530305, 5504720, 5389974, 5458185, 5693948, 5801513, 5838116, 5639242, 5868090, 6039304, 5896991, 6006031, 6065718, 6171532, 6218488, 6375378, 6535861, 6468325, 6427191, 6442168, 7105239, 6642074, 6790446, 7163618, 7216054, 7170344, 7300791, 7391110, 7625162, 7494436, 7959949, 7993903, 7933693, 8049661, 8172794, 8100356, 8694048, 8562514, 8550288, 8634961, 9049734, 8937423, 9188092, 9062222, 9239451, 9280948, 9321787, 9792497, 10111805, 10528723, 10302585, 10531883, 10450842, 10770782, 10946962, 11034375, 11150023, 11028711, 11586330, 11803294, 11888409, 11835801, 12181636, 12523028, 12673970, 12694165, 13093848, 13411684, 13630671, 13524386]
14387A3524386N85685J75439K26319J70755L59425K28465N1243M61282N60647
14378A6343646m9565N12836L01604N25188L35517K71002J73402N91910Q8362N48936
14368A9642838J76037N30237P23447J27986M13528O13158M20804M79662P70462
14359B3898159K72577O18457P52549L36123O71647N26844P54837N17345J017511
14350B9366049K13477P83403N85588J016838J002395Q53909Q05112P72556J161108
14341C6560435Q98176P17314J578205J106953J114158J125972J205927J046157
14333D5353297J704366J299748J539074J325057J814195J667964J661870J934734
14325E8300305J792856J948472K136632K541417K037958K636963K583080K590816
$$ y = [13524386, 14110071, 14285510, 14511829, 14682584, 15042009, 15270474, 15321717, 15782999, 16343646, 16294081, 16806917, 17108521, 17633709, 17969226, 18240228, 18413630, 19005540, 19093902, 19642838, 19818875, 20349112, 21072559, 21200545, 21614073, 22227231, 22648035, 23127697, 23898159, 24170736, 24789193, 25541742, 25877865, 26549512, 27076356, 27831193, 28348538, 29366049, 29579526, 30362929, 30948517, 31965355, 32967750, 33821659, 34626771, 35399327, 36560435, 37458611, 38175925, 39754130, 40861083, 41975241, 43101213, 44307140, 45353297, 47057663, 48357411, 49896485, 51221542, 53035737, 54703701, 56365571, 58300305, 60093161, 62041633, 64178265, 66719682, 68757640, 71394603, 73977683, 76568499]
14317G6568499L389415K658177K987052L403308L360747L858137L857076M045761
14309A04128172M324379M465385M603715N214104N281118O047288N750498O404177
14301A46218836O613940P035419P434224Q203653Q061121R178699R460623R639970
14293B11846485J0635906J0842438J1247126J2078762J2388733J3154550J3289082
14286B95483082J3977793J4381566J4316997J4785505J4399678J4538264J4098917
14279C95981802J3922373J2988950J2196524J0690923R568794P488029N036451
14272D67873846K235538j742913k932954j180898k338686n162958o862083q944376
14264D40944516j0839090j2441679j3167982j4282788j4492316j5388538j5023711
$$ y = [76568499, 79957914, 82616091, 85603143, 89006451, 92367198, 96225335, 100082411, 104128172, 108452551, 112917936, 117521651, 122735755, 128016873, 134064161, 139814659, 146218836, 152832776, 159868195, 167302419, 175506072, 183567193, 192745892, 202206515, 211846485, 222482391, 233324829, 244571955, 256650717, 269039450, 282194000, 295483082, 309460875, 323842441, 338159438, 352944943, 367344621, 381882885, 395981802, 409904175, 422893125, 435089649, 445780572, 455349366, 462837395, 467873846, 470109384, 468366471, 465433517, 464252619, 461913933, 456750975, 449888892, 440944516, 430105426, 417663747, 404495765, 390212977, 375720661, 360332123, 345308412]
14257C45308412j5480484j5268343j4143471j3912358j3672878j3226105j2529903
14250B47074870j1942731j1542859j0856611j0244343r642870r166993q196459
14243A75482004q190380p856250p169819o894844o416491o069752n582649n184384
14235A22117435m992976n317692m544931m264536l619267m224702l592915l501982
14227H8058434l425288l272547k710102k889565k658632k556228k684456j744766
14219F6116850k565000j770364k517411j675933j970415j378993j503217j551014
14211E1184503j528490j886704j077278j217199r02102j172733j241853j524021
14203D0634123j251247j067822q63341o82481r66756j289052o92847r63384n18266
$$ y = [345308412, 329827928, 314559585, 300416114, 286503756, 272830878, 259604773, 247074870, 235132139, 223589280, 212732669, 202488326, 192845456, 183678463, 175482004, 167291624, 159435374, 152265555, 145370711, 138954220, 132884468, 127301819, 122117435, 117124459, 111806767, 107261836, 102997300, 99378033, 95153331, 91560416, 88058434, 84633146, 81360599, 78650497, 75760932, 73102300, 70546072, 67861616, 66116850, 63551850, 61781486, 59264075, 57588142, 55617727, 54238734, 52735517, 51184503, 49656013, 47769309, 46692031, 45474832, 44572730, 43399997, 42158144, 40634123, 39382876, 38315054, 37451713, 36769232, 35802476, 34513424, 33820577, 32857193, 32338927]
14194C2338927q21739r63569m42613p99482q57328p79911m92808n97113n37495
14185B6046869o41852q16411n80836m07633n40633l32972n39158j93721m80464
14176B1513189n86559l98601m88992l28672n73322j22477n46478j40766p26349
14167A7600973j08344j60366o21706p7477k82602j99874n35009l6652o5019o69420
14157A4844504k22196m29705Q4009n04061J13762m42499n4946o16453O579l43264
14147A2435730L0396n54185J51901k08688k43137m67885o9529j0303o3355j58767
14137A0842178J5145k90890m3680m86324j10075J4837m3011o70053O6798j2190
14127I282735p2319j71702J02161n90070K77509k32326j62719P9555k30955l26924
$$ y = [32338927, 31517188, 30553619, 30111006, 29311524, 28454196, 27674285, 27181477, 26584364, 26046869, 25405017, 24588606, 24007770, 23600137, 23059504, 22726532, 22187374, 21993653, 21513189, 20926630, 20528029, 20039037, 19710365, 19137043, 19014566, 18468088, 18327322, 17600973, 17492629, 17332263, 16710557, 16633080, 16350478, 16150604, 15615595, 15578943, 15513924, 14844504, 14622308, 14192603, 14276612, 13772551, 13886313, 13443814, 13388868, 12772415, 12778994, 12435730, 12466126, 11911941, 12063842, 11855154, 11612017, 11144132, 11074603, 11064300, 11000945, 10842178, 10857323, 10566433, 10522753, 10036429, 9926354, 9941191, 9898180, 9228127, 9294925, 9282735, 9210416, 9038714, 9140875, 8550805, 8828314, 8595988, 8433269, 8512824, 8281869, 7954945]
14117G954945k01428K69193k2176l07108j52189J61695n8202j21237j2068m44312
14107G067113j133N5915o769l5890l67417O1755j85018K80513m62022j62338j13767
14096F130942N9043M3813k47056j34688j84961J81836j40659q9341n03137R50122
14086F065914j013829L23825n4131j44202L78393l30875n8265L9847m27315N12704
14076E292066m13016L1953J80933l64162K22927m60755K91204k55858K24538j3776
14066D736054m10143K55267j42144L35299n01688M9010K30825m91275K80856J00661
14056D442722l55483p6479N3613p631q4186J50921l49903P9549j87061Q6114j97855
14045C554321K93791k76564j00529j01689J28203K26991N3732o26442L42290J29261
$$ y = [7954945, 7753517, 8022710, 8000534, 7693426, 7541237, 7702932, 7644730, 7523493, 7511425, 7067113, 7065980, 7121895, 7115126, 7079236, 6711819, 6773574, 6588556, 6869069, 6407047, 6244709, 6130942, 6189985, 6233798, 5986742, 5852054, 5667093, 5848929, 5708270, 5618929, 5115792, 6065914, 5052085, 5375910, 5321779, 5177577, 5555970, 5225095, 5166830, 5206677, 4779362, 5292066, 4879050, 4911003, 5091936, 4727774, 4950701, 4489946, 4781150, 4525292, 4749830, 4736054, 4325911, 4581178, 4439034, 4774333, 4272645, 4321655, 4552480, 4061205, 4342061, 4442722, 4087239, 4010760, 4064373, 4056742, 3972556, 4123477, 3773574, 3853123, 3666062, 3752176, 3554321, 3848112, 3571548, 3471019, 3369330, 3497533, 3724524, 3778256, 3151814, 3494104, 3623365]
14035C623365o9915n14855L25457k11208J27057n08140L25426M2080M1039m6952
14025C133354m66845K46385J28990k09461J54143j87668L05364l56671J44273
14016B891864J38105j99135l82948M82082k39547k37741J95732m6230n3871J62812
14006B711123k9680r8191k9838j18056k25405J81961l3017P6652j26828R456q1887
13995B236290K90000m5042J5570k80108M74038K58702R01408K628245O805836
13986A3284939J3679489J4577516j0149775j4353389o929641l092053j211307
13979E805779q40701r90034l98748J22495j92629l25772k23680j10520j80329
13970B665861j77m4172k84310L54818j50890l2204m95314M94645r9269o8415P792
$$ y = [3623365, 3553450, 3038595, 3364052, 3152844, 3279901, 2771761, 3097187, 3139267, 3180306, 3133354, 2666509, 2912894, 3041884, 2832423, 2986566, 2798898, 3104262, 2747591, 2891864, 3029969, 2830834, 2447886, 2929968, 2690421, 2452680, 2648412, 2602182, 2548311, 2711123, 2681443, 2583252, 2553414, 2435358, 2209953, 2391914, 2358897, 2435549, 2308721, 2318177, 2236290, 2526290, 2481248, 2496818, 2216710, 2690748, 2949450, 3850858, 6479103, 13284939, 26964428, 41541944, 31392169, 17038780, 10109139, 7017086, 5805779, 4965078, 3975044, 3576296, 3698791, 3506162, 3180390, 2956710, 2846190, 2665861, 2665684, 2621512, 2337202, 2692020, 2541130, 2508926, 2013612, 2508257, 2408988, 2340573, 2348365]
13959B348365k827k8964j02208R1164J8474l01769l85451L59133r555L3802J60364
13948B180528l59448M94158j66246l46575N64066m26994J141j82739J62080j02071
13938A817900k80575L74683Q522j01211k5223r453j48750O0276L92301m08267
13928A680203M74881n13876L24014n08607j94261O11541l53249N4736J5165J96421
13918A786968l02100J62789J20260m96861L59109o0612j19738K41591n33006R7699
13908A256099K3258R8502Q4468K33519j45267j47514J39497j14965J69451l0055
13898A566993l354l5240j58440J23853k15814J74949l83992M53876j45805L19063
13888A696089k47957l1398q1988J22612r6608J5274j26953L52318m71711M23492
$$ y = [2348365, 2345538, 2316574, 2214366, 2305530, 2324004, 2022235, 1636784, 1995917, 1986362, 2020164, 2180528, 1821080, 2315238, 2148992, 1802417, 2366483, 1939489, 1940630, 1757891, 1919971, 1817900, 1537325, 1912008, 1920530, 1819319, 1794096, 1784643, 1635893, 1696169, 2088470, 1680203, 2155084, 1641208, 1965222, 1456615, 1262354, 1873895, 1520646, 1575382, 1590547, 1786968, 1484868, 1647657, 1767917, 1271056, 1630165, 1569553, 1449815, 1691406, 1158400, 1256099, 1279357, 1377859, 1462327, 1695846, 1550579, 1403065, 1542562, 1427597, 1597048, 1566993, 1563639, 1528399, 1369959, 1493812, 1277998, 1452947, 1068955, 1522831, 1377026, 1696089, 1448132, 1416734, 1334746, 1457358, 1360750, 1376024, 1249071, 1601389, 1129678, 1553170]
13878A553170m23296M10029m8962K0460q2035m7689r8498o0516J69685k53564
13868A138784K62810K2790K00009l08596J07539k95175k20003K68409l17735M44256
13858A303088j13483p1848o870J04798J03809o13726M30205O7356R1308j29009
13848A165628j6068k74137L33596k44077M46166m07449l78187J71539K88187k4177
13838A061021k26196P691Q0070K51600O4172l20875j10572K57853n6774k96741
13828G11249K67438j74518l563o8462L18430q3141O4286l09066j20038L94258
13818I96873J88789j88997l9546o3814p564q6656J24320j73312j05569M78298
13808A122822m7621k02799J21099D67032J05756L90634J60356l87540N76057l69528
$$ y = [1553170, 1129874, 1539903, 1490941, 1511401, 1429366, 1381677, 1283179, 1222663, 1392348, 1138784, 1401594, 1424384, 1624393, 1315797, 1423336, 1128161, 908158, 1176567, 858832, 1303088, 1189605, 1117757, 1110887, 1215685, 1319494, 705768, 1135973, 1203329, 1294637, 1165628, 1149560, 875423, 1209019, 964942, 1411108, 1003659, 625472, 797011, 1085198, 1061021, 834825, 842516, 922586, 1174186, 1238358, 917483, 806911, 1064764, 1007990, 711249, 978687, 804169, 800606, 732144, 1050574, 967433, 1031719, 722653, 602615, 996873, 1185662, 996665, 957119, 893305, 885741, 799085, 923405, 750093, 644524, 1122822, 1075201, 872402, 993501, 467032, 572788, 963422, 1123778, 736238, 1312295, 942767]
13798I42767j94183j35306J86878L1162L4961p216j43906J12055n5963J5202Q604
13787G95055l01667L42366N8053k10204K76395k12458J44169j75826k0304j78347
13777E17232J86327r1059j71926k321K55915M11066n23983L19567j69532J50229
13767H81515l15599L26689j8741j41565K34938m4996j27559k52277J39356r3489
13757E88272j8322J77274j03375N6867J5564j33990j88501K41466j74635n0668
13747D09952L20651N05173E11461n9177M25054n6205k72895J53330N1732j75292
13737E78008j11742N58971B66202K70989M60856l89228J80739K85063l60433j39092
13727E75096B65342J91862K46523r749K9056L0030k34598k5368K58844n0106j78018
$$ y = [942767, 748584, 613278, 800156, 831318, 866279, 859063, 715157, 827212, 771249, 786451, 795055, 493388, 835754, 893807, 683603, 959998, 747540, 891709, 715883, 695579, 517232, 703559, 612500, 440574, 438253, 694168, 1105234, 581251, 900818, 731286, 881515, 565916, 892605, 873864, 732299, 967237, 922241, 794682, 542405, 681761, 588272, 569950, 747224, 643849, 700716, 716280, 582290, 393789, 635255, 460620, 409952, 730603, 1235776, 511461, 452284, 877338, 821133, 548238, 701568, 753300, 578008, 466266, 1025237, 266202, 537191, 998047, 608819, 789558, 1074621, 714188, 575096, 265342, 457204, 703727, 693978, 723034, 753064, 518466, 493098, 751942, 701836, 523818]
13716E23818m0283k35108L94601J58616k1939l8670J12937B67306N02477k67076
13706E02707K89646k06624B70848K25846j68238M68649C70272J14359j915m0902
13696D41814K48621k60005O8793J21193J75024A48656L05465J64352J95945k66450
13686E47968p8690O5067O3879M8149m4042j66674R5726J71841l37603L69943A14753
13674D68911O6800j5926j16657J20395k9509g3637B48938J99776M8935L41456
13664H39105l09259A57188M02327r603r9341O0892j30700K18989j61443j25878
13654C12431R6870j24568L56569J43305l36040h626H87624H8116O54865r8056
13644F44925N1454j99769j56455k7619M66439C13194J84756K7476j0290j83160
$$ y = [523818, 483535, 248427, 643028, 801644, 779705, 741035, 853972, 267306, 769783, 502707, 792353, 585729, 270848, 496694, 328456, 797105, 370272, 484631, 482716, 441814, 690435, 430430, 499223, 620416, 795440, 148656, 454121, 618473, 814418, 547968, 469278, 534345, 598224, 646373, 602331, 435657, 531383, 703224, 365621, 735564, 114753, 468911, 535711, 519785, 403128, 523523, 494014, -73637, 248938, 448714, 497649, 839105, 529846, 157188, 559515, 549912, 450571, 511463, 380763, 599752, 438309, 312431, 409301, 284733, 641302, 784607, 448567, -8626, 887624, 88116, 742981, 644925, 696379, 496610, 340155, 312536, 778975, 313194, 497950, 525426, 515136, 331976]
13634C31976N3033N39022l94026j78436K97441j73320J7081j06291j04766p6780
13624B04934K29753j03511K731j23815L33863p9836A84067Q26616m24512k02178
13614C83993J16647K4847j85534J40714k1540J30073j98100J56245k06275J31735
13604D72805l8951l2120J70347B22887K32999F1801R8700M65292k57058K78603
13594F47338B84193K73467M3802c5688D37773A40157J14808J20295A86438L17632
13584E04070j87221J06625K08011A81483J47743J62927m3581j52753k8235L08616
13574E76200L83J06759k07550A16313K084L08790N2386k33579k2021R8233L2002
13563C54208n3435A30720N57434B82627K27029j81762l0927k4896M17811b7251
$$ y = [331976, 385009, 924031, 530005, 351569, 649010, 475690, 492771, 386480, 281714, 204934, 434687, 331176, 333907, 210092, 543955, 464119, 184067, 1010683, 586171, 383993, 500640, 525487, 339953, 480667, 459127, 589200, 391100, 547345, 341070, 472805, 433854, 401734, 572081, 222887, 455886, 61801, 160501, 625793, 368735, 647338, 284193, 557660, 601462, -35688, 437773, 140157, 254965, 375260, 186438, 504070, 316849, 423474, 631485, 181483, 329226, 492153, 448572, 295819, 267584, 576200, 576583, 683342, 475792, 116313, 118397, 427187, 479573, 245994, 223973, 322206, 354208, 300773, 130720, 688154, 282627, 509656, 327894, 296967, 272071, 689882, -27251]
13552b249C60513e418B07116E4539L25443A71117J77894O0436j91513J58950M5659
13541D22543j31518K8165N0168A00944J60623B943N67657M9458B53882A14573
13530A12973L69872G6092L03924E5357J15684L74580B46560L23282j76586A04500
13519i6839A01310A2778M42940j03654j67638J65770J45717N7972j59103A30484
13508C90548j77645P2849L5504N2568m26j67966A01638m0720K75376n0657J34091
13497D19728A08644J57070o8736L93070j47610B11184g8929C46163j64011J50006
13487C32158A61581J4937R0296o7008E6134L94487j44825j14170J73232L4852
13477C99710j57212q2764J50374J46019b3649k09932J05598D16747a0124F97334
$$ y = [-2249, 360513, -5418, 207116, 54539, 379982, 171117, 349011, 409447, 217934, 376884, 422543, 291025, 319190, 369358, 100944, 261567, 2943, 570600, 620058, 253882, 114573, 112973, 482845, 76092, 380016, 55357, 171041, 545621, 246560, 569842, 393256, 104500, -96839, 101310, 12778, 455718, 352064, 184426, 350196, 495913, 553885, 394782, 130484, 390548, 212903, 285752, 321256, 373824, 373398, 205432, 101638, 60918, 336294, 285637, 419728, 108644, 265714, 196978, 590048, 442438, 211184, -78929, 346163, 182152, 332158, 161581, 176518, 266814, 199806, 56134, 450621, 305796, 191626, 364858, 399710, 242498, 159734, 310108, 456127, -23649, -233581, -127983, 416747, -10124, 697334]
13466A3077M23742j15042e9658C30434j16264P805M3620A6537K79041K1507b3533
13454B3853L17625H1249J90359q5387J37080A48648J06155q1445O1815J5124J1669
13443B61966o5779r2783K37271F1378L80013F629K61530A5278L27361A30719k2081
13432A08638K47654J52274A92682K63046A92024J71926l9560a10620A35159L86951
13422E22110A34690M3172H810J74560q7448J11666a85548A09872M08030F3078
13411A42895c8937D09554j41925j02053R2270c0644j10132A36639J85771J34468
13401D56878k24123a18958B37331N493H4206J22716K65521i1352B02794K6972
13391B29766l5524o5523K24374K6653B91M39443a1181j03576A41853A5407K36512
$$ y = [13077, 436819, 321777, -59658, 330434, 214170, 221975, 265595, 16537, 295578, 317085, -23533, 23853, 341478, 81249, 271608, 186221, 323301, 148648, 254803, 173358, 235173, 250297, 261966, 196187, 103404, 340675, 61378, 441391, 6629, 268159, 15278, 342639, 130719, 108638, 356292, 508566, 192682, 455728, 192024, 363950, 324390, -110620, 135159, 522110, 134690, 177862, 8810, 183370, 95922, 207588, -185548, 109872, 517902, 63078, 142895, -38937, 409554, 267629, 165576, 257846, -30644, -140776, 136639, 322410, 456878, 232755, -118958, 237331, 242824, 84206, 206922, 472443, -91352, 202794, 229766, 194242, 128719, 353093, 379746, 291, 439734, -11181, -114757, 141853, 15407, 251919]
13380B51919P3863f0057B06425M7901M4005D1076M88304A0688K54111a1514H4559
13368A1671Q7045K35401K23724B71081a02039o1257A82431K92743a11189d8301
13357E52552E535L29189M8878B3934K34711R176K76970G1118J91583j17822M84184
13346F29063B62415L18051a094D91651A40046K26571E3017N82024k19362J04815
13336E20494B23010J20770J44327B24675G3409J5768O032d499B75052e3543A27612
13324C58537A74718N2907L89855B37598g384D98239A76334J20033J02299a7157
13313B54049J07335A57547k1652J42549q2573a85935c897B68237j7310j15556
13303A35371J52408L8226j38197J64707f7608A82796M0357B313L89956d8249D5674
$$ y = [251919, 325782, -60057, 206425, 254326, 298331, 41076, 529380, 10688, 264799, -11514, 84559, 11671, 98716, 334117, 557841, 271081, -102039, -163296, 182431, 475174, -111189, -48301, 552552, 5535, 334724, 383602, 23934, 258645, 267821, 544791, 71118, 262701, 144879, 629063, 262415, 580466, -1094, 491651, 140046, 366617, 53017, 635041, 415679, 520494, 223010, 343780, 488107, 224675, 73409, 89177, 95209, -4499, 275052, -53543, 127612, 358537, 174718, 227625, 617480, 237598, -7384, 498239, 176334, 296367, 398666, -17157, 254049, 361384, 157547, 135895, 278444, 195871, -185935, -3897, 268237, 250927, 135371, 287779, 326005, 187808, 352515, -67608, 182796, 223153, 2313, 392269, -48249, 45674]
13291D18369A76013k5100o9498b3876A55544m5992J92647K94358n5432A34966
13280f8424k2261c7019F3867L3811l1566P0116b151E22983A69201E1288f2174
13268A19574N33754A70910m5594M1691B431a1650A01108O3351J01776K3495H3149
13256B45900E8210K30246J03554A27830R5620A09573d0195I7941R6677K99262
13246D93880j94385h3135p9398D49706A50965l1087L32671a05101I1362e8321
13235B74122n9390N076g3112C41800L0497H2333J16153a02361C11536h6716f870
13223a03572G1989M13787G1416N3719J56842A35377K24941A25744N504F840N04382
13212E11222A4851b78509A57908J21473a48521j18713B45201p7435b14124A85141
$$ y = [418369, 176013, 150913, 81415, -23876, 155544, 109552, 302199, 596557, 541125, 134966, -68424, -90685, -37019, 63867, 97678, 66112, 136228, -2151, 522983, 169201, 51288, -62174, 119574, 653328, 170910, 125316, 167007, 2431, -11650, 101108, 164459, 266235, 289730, 83149, 245900, 58210, 288456, 392010, 127830, 223450, 109573, -40195, 97941, 194618, 493880, 299495, -83135, -162533, 449706, 150965, 119878, 452549, -105101, 91362, -58321, 274122, 214732, 219808, -73112, 341800, 372297, 82333, 198486, -102361, 311536, -86716, -6870, -103572, 71989, 485776, 71416, 125135, 281977, 135377, 360318, 125744, 131248, 6840, 511222, 14851, -278509, 157908, 279381, -148521, -267234, 245201, 167766, -214124, 185141]
13201B16813m9320J21785A29366b6127A60083B4563J70072F4222R6176n754R1631
13190B46275D9572K11163A12249N8063M8324J3386j07415C9455J4267J47586b7947
13178H52R1081g5608c5166n6449B77248m154A09022j7549P1842G1814e4887J5616
13166c9271B56794A27176a99150A38415J21703a06770i414F2753b32315C58099
13155i3217J7346C27865f1546B90763I6905P9946D6906j8785a66880A55827a32444
13143B20590c1479C9993p405R6059k1522n0696K31523G5792c5521j02480n107
13132a43108g735B882J70795b60488D0411c4860A22691i1817c9469B45622a23836
13120f7093J1849C91956g7275A60018b64453f2566k79366B18628l3446J36462
$$ y = [216813, 167493, 289278, 129366, -26127, 160083, 24563, 194635, 64222, 160398, 154644, 246275, 49572, 260735, 112249, 170312, 218636, 232022, 124607, 39455, 53722, 201308, -27947, 852, 91933, -75608, -35166, -91615, 277248, 273094, 109022, 91473, 163315, 71814, -54887, -39271, 256794, 127176, -199150, 138415, 260118, -106770, -9414, 62753, -232315, 358099, -93217, -75871, 327865, -61546, 290763, 96905, 176851, 46906, 28121, -166880, 155827, -132444, 220590, -31479, 39993, 32588, 128647, 107125, 56429, 287952, 75792, -35521, -138001, -143108, -7735, 2882, 173677, -260488, 40411, -34860, 122691, -91817, -39469, 245622, -123836, -67093, -55244, 391956, -77275, 160018, -264453, -62566, -341932, 218628, 185182, 321644]
13110C21644B9472J36821H292J98351a2627C26832b13925d2432B03477E2821k3905
13099B8916O0627a83337C20748H8016J32377O075a43090b0991F0863j6193i2533
13087A46483m1327L02783a44217A42989K44287A52977J48771a17410B19103H9119
13076A83511f3629b587j13956C681a5581l7291A72980f6308A57992g9620D17682
13064a79877F0165L07507A58463J52090J49746A78589a4818C68006a81845e4579
13053a0637p6622a9057l6829A82109J13026a96969C0015N29229F9866K96571A07126
13041c8074A02018J59054a67489B55590D4729b13134J0A39722K95951k01913J00913
13030C34673B7139a19047e4612b956p7733B35134Q5082A11126c4730D78959A77921
$$ y = [321644, 29472, 166293, 8292, 206643, -12627, 326832, -213925, -42432, 203477, 52821, 28916, 89543, -183337, 320748, 88016, 220393, 226468, -143090, -20991, 60863, 44670, -92533, 146483, 105156, 407939, -144217, 142989, 387276, 152977, 301748, -117410, 219103, 89119, 183511, -63629, -2587, -116543, 3681, -15581, -52872, 172980, -66308, 157992, -79620, 417682, -179877, 60165, 367672, 158463, 310553, 460299, 178589, -14818, 368006, -181845, -54579, -10637, -87259, -19057, -55886, 182109, 295135, -196969, 30015, 559244, 69866, 366437, 107126, -38074, 102018, 261072, -167489, 255590, 44729, -213134, -213124, 139722, 435673, 233760, 334673, 27139, -119047, -54612, -2956, -80689, 235134, 320216, 111126, -34730, 478959, 177921]
13018B15177L18740d0750a6023o0300D75643k19461A1154J30740d3970B24637
13007A08640C9390c48351a58161C1519G745M6723f0830j84086J14758E1195J58577
12996B09772a0833k08683B9635K51024G1764K21358r6258I6201J66580q8271a62154
12984a6096A14770A101K36842n0228F7757R8151j6237a05163o910F8718K18492
12973B87210e391j54047F7873J01924a51600D26041A28431a50258b0546j76069
12963a96615e1826A36067a1833B91297J96669E1203J19836L10379k33139f9305
12952A60268E9280J879a8424G7919g8292j6866C29086a84211N5997N6854k1620
12941i2980A84637J72335Q8228j65485K28500c02607F3059J92037h1616l8108
$$ y = [215177, 533917, -40750, -16023, -76323, 475643, 256182, 11154, 141894, -43970, 224637, 108640, 39390, -348351, -158161, 31519, 7745, 54468, -60830, -244916, -130158, 51195, 209772, -10833, -219516, 29635, 280659, 71764, 293122, 196864, 96201, 262781, 174510, -162154, -16096, 114770, 1101, 237943, 187715, 67757, 165908, 149671, -105163, -112073, 68718, 287210, -5391, -159438, 67873, 169797, -151600, 426041, 128431, -150258, -20546, -196615, -51826, 136067, -11833, 291297, 487966, 51203, 171039, 481418, 248279, -69305, 160268, 59280, 61159, -18424, 77919, -78292, -95158, 329086, -184211, -128214, -71360, -92980, 184637, 356972, 445200, 279715, 508215, -302607, 63059, 255096, -81616, -119724]
12931a19724C7094R9977E9416R8910e1041C1223J35347D6961K99542a56320C14973
12919A96178K06270d376B59063B0565N6461a51601m311g1706C84671j36189i4600
12907A26878H220K0751L35837H2672K71650c4860I7744M4265K11132H1827L6217
12896A18044n1O479h7300m1896r6687A65915a38866f0850A09131J80099j20720
12885A68510K16056a14060j72641b5251l39770I8463k1955a09172a8112j08548
12875a26660p559H5661l9998a56032r649A18324J73269j26320a90395B11588j01793
12864A09795b21310C6510K22718C8816i5165J2445P416j26612A04545b14710Q3231
12853a31479P143C12389a12697c2256j81757a04493A47715G3216C4319i6340A38116
$$ y = [-119724, 37094, 137071, 59416, 158326, -51041, 31223, 166570, 46961, 346503, -156320, 314973, 196178, 402448, -4376, 259063, 20565, 77026, -151601, -155912, -71706, 384671, 248482, -94600, 126878, 8220, 28971, 364808, 82672, 354322, -34860, 97744, 142009, 353141, 81827, 118044, 117993, 124472, -87300, -129196, -225883, 165915, -138866, -60850, 109131, 289230, 168510, 384566, -114060, -286701, -25251, -365021, 98463, 76508, -109172, -18112, -126660, -134219, 85661, 45663, -156032, -165681, 118324, 291593, 165273, -190395, 211588, 109795, -221310, 36510, 259228, 38816, -95165, -82720, -75304, -201916, 104545, -214710, -131479, -124336, 312389, -112697, -32256, -214013, -104493, 147715, 73216, 34319, -96340, 138116]
12841H7806a31407B43973a43863a1699A11642q591b18503A78271g6793A7511N5661
12830G3172K31291H0472i5847A63337J11855a58465d856l8178r3059H5248N3878
12819A39126c25661f5330B16187F6140a31666G9654J4317a56844j25987a24030
12808I801b7455m87025A20221a4374B8541b09448A61397a71692J1179l3997g7213
12796G8787J15313c25092a9008r403A42097E238c33665A13867m7012J8170A5123
12784a75075A37024a56632A90946a5641n3231o8364f5021D9093h4839L7578C23419
12772a7588j21222B3252a16681A97239I6764A5799b1553j15443A45690C1345K3536
12761E4881K2092e6988D5484J71934r7531B0412J4380K07608f0852i670j54922
$$ y = [87806, -131407, 243973, -143863, -11699, 111642, 103051, -218503, 178271, -76793, 17511, 73172, 304463, 80472, -95847, 163337, 275192, -158465, -4856, -43034, -136093, 85248, 139126, -325661, -65330, 216187, 66140, -131666, 79654, 93971, -156844, -282831, -124030, 9801, -27455, -514480, 120221, -14374, 28541, -209448, 161397, -171692, -160513, -194510, -77213, 78787, 194100, -325092, -19008, -28411, 142097, 5238, -333665, 113867, 66855, 85025, 15123, -175075, 137024, -156632, 190946, -15641, -68872, -137236, -65021, 49093, -84839, -47261, 323419, -17588, -138810, 23252, -116681, 197239, 96764, 15799, -21553, -136996, 145690, 31345, 54881, 76973, -56988, 45484, 217418, 119887, 20412, 34792, 242400, -60852, -9670, -164592]
12750a64592A77900i3180a9308A91828a79452c5875A62368m0943h8110A17749
12739h3448B68706a8248l1941B04279a28058a4899k0857A15810L11126j26338
12729C00598r2272e9863B1060K2221a43505C13181m9366I5664i1923K107E3852
12717A93243D3019K6348i0845c0488r0521B22573I9031Q3506E6974K99665A28338
12705C83942H5469J89948c5516B28183d5267A01809K03380R6376b35781A3726
12694a30577A95337H5103P2323B9731d3016j77895a3665A26340b98856A8800h9409
12682B11479j02570a2119j27328B0587J39260b26602B59745j29630j2951j1506
12672A05658g0770A47941R1662D1304a23228A49207M1860o8031M7729D602h4184
$$ y = [-164592, 177900, -93180, -19308, 191828, -179452, -35875, 162368, 121425, -88110, 117749, -83448, 268706, -18248, -50189, 204279, -128058, -14899, -35756, 115810, 426936, 300598, 208326, -59863, 21060, 43281, -143505, 313181, 263815, 95664, -91923, -89816, 53852, 193243, 43019, 69367, -90845, -30488, -121009, 222573, 99031, 182537, 56974, 356639, 128338, 383942, 85469, 275417, -35516, 228183, -45267, 101809, 305189, 401565, -235781, 13726, -130577, 195337, 85103, 157426, 29731, -43016, -220911, -13665, 126340, -298856, 18800, -89409, 211479, 108909, -12119, -139447, 20587, 159847, -226602, 259745, 130115, 117164, 105658, -70770, 147941, 239603, 41304, -123228, 149207, 191067, 123036, 170765, 4602, -84184]
12660D18721a9529B14547F1687k7749O863J32813J48892j23957a37437I4848K22560
12649C17408j22568I1157i3090o9952O0755B9261O7171a667B88407a40336C9166
12637H1347J01666j8617J465i2747B50255K64398b5971A68937K07431n1593j04913
12626B19862J8271J81784j43637K62483A71649B6147K51071b8091B11893J38265
12616C50158K7898A24588k0423b7043A28997K4419h2504m2585H7709J18465c32681
12604e3975p3769A42605J30521I9443a60534G8143k7159J27365n8678a17028A31901
12592C02421A3444P288K67757I2000e8975A96044E0212J57706c14628k582E5477
12580F0113A0266K18639C3952f4780j57610B10120r0286b2907m4877A44480B5659
$$ y = [418721, -19529, 214547, 61687, 33938, 40801, 173614, 322506, 198549, -137437, 94848, 317408, 194840, 91157, -93090, -163042, -102287, 29261, 96432, -1667, 288407, -140336, 39166, 81347, 183013, 164396, 165861, -92747, 250255, 514653, -25971, 168937, 376368, 324775, 219862, 238133, 419917, 276280, 538763, 171649, 26147, 277218, -28091, 211893, 350158, 378056, 124588, 104165, -27043, 128997, 153416, -82504, -125089, 87709, 206174, -332681, -53975, -127744, 142605, 273126, 99443, -160534, 78143, 50984, 178349, 119671, -117028, 131901, 302421, 13444, 20732, 288489, 92000, -58975, 196044, 50212, 207918, -314628, -317210, 55477, 60113, 10266, 228905, 33952, -64780, -222390, 210120, 119834, -22907, -67784, 144480, 25659]
12568h7756L5850B2124J14000J72243a28016N0664A49284c52313a2998A24356
12557A68468a3742B83228b5032A27302P2011a72997H732J68730b34682O1445A68736
12545g6503C53782A7458a63633L2146A22491B8776L35709h5533K0316j49405A29372
12533E815N0241a58471A40473K00144G963O1522M2678h6205D9305g8933G2833
12521C37237F8687f8628j14226J6828N3111A18340P1734K24745j26647C3385M5040
12510G8425a30422A07733k8822K43950H1107b5603a1309j10613N8334B07287a37512
12498B40628K5610K95298k43083a29203N3692q7848g6562k0700B9176a99162H5057
12486B7785c0613j2865j88133G0715O4265r727e3155j1573C5431J54649K8434
$$ y = [-87756, -51906, 22124, 136124, 308367, -128016, -77352, 149284, -352313, -12998, 124356, 168468, -13742, 283228, -25032, 127302, 199313, -172997, 8732, 177462, -234682, -173237, 168736, -76503, 353782, 17458, -163633, -131487, 122491, 28776, 364485, -85533, -65217, -214622, 129372, 5815, 56056, -158471, 140473, 340617, 7963, 69485, 112163, -86205, 49305, -78933, 72833, 337237, 68687, -68628, -182854, -166026, -112915, 118340, 190074, 414819, 288172, 33385, 78425, -130422, 107733, 78911, 322861, 81107, -25603, -11309, -121922, -63588, 207287, -137512, 240628, 266238, 561536, 318453, -129203, -75511, -163359, -76562, -97262, 29176, -199162, 85057, 27785, -30613, -43478, -231611, 70715, 134980, 125253, -53155, -64728, 35431, 190080, 218514]
12475B18514b3258B4145a13088k41191A27850D6834E81J79438c46545I803b53915
12463H6583b43842C5416g6394A25417e4548D316b69306C10021B6904K63759e9769
12451H8831a27048A64967J67972j28172D3556d0270A71718a6048r743m0928A11426
12439A46015N964a8083B16949a04813I7381J65634c1890p4909e647j5146j08102
12428a28895N9967B80166i7308F1117c9797C34340c9524B08431H9746J67360a93538
12416a82740d5888k17345e534o2851p7364A2558K0421a53445b473j67817B55238
12404B98660C8830a07018j43693J460f8399A76542A1246i9914B59576b09942M9696
12393a60246p9712B25211a46488B3608J09733j528b75361O0643h716o6587l2644
$$ y = [218514, -23258, 24145, -113088, -354279, 127850, 46834, 581, 180019, -346545, 9803, -253915, 86583, -243842, 35416, -76394, 125417, -54548, 4316, -269306, 310021, 26904, 290663, -59769, 88831, -127048, 164967, 332939, 204767, 43556, -40270, 171718, -16048, -25791, -66719, 111426, 146015, 151979, -18083, 216949, -104813, 97381, 263015, -31890, -106799, -5647, -20793, -128895, -68928, 280166, -97308, 61117, -39797, 334340, -39524, 208431, 89746, 257106, -193538, -182740, -45888, -263233, -5534, -68385, -145749, 12558, 32979, -153445, -2473, -170290, 255238, 298660, 38830, -107018, -250711, -249251, -68399, 176542, 11246, -99914, 259576, -209942, -160246, -239958, 225211, -146488, 23608, 133341, 131813, -275361, -214718, -8716, -75303, -107947]
12382a07947o383j47621A10737b96575q6488M3301A71689C2267J11830m8934a68383
12370D5590a21640C9686L34944a33477k77918g0173a6718A47917J62853q7994
12360B22776p0920J80594o3341a50086j89525A86284c4886r676j50674A13308
12349A81367A0240a80881E714K07180D3297a21194B4643a83181a4162n1380A37345
12337a96106k514b7855D5564A7703J08507d5951A18749K33541a94408C43834d4909
12325a7710j56905L3153I7400A5472J9734a8208B19041g2678F2231a38855B16773
12313A81448g5031A38839c38403I2087C8041b61174b735E8813e6023q6445B26101
12301C1039b30128J3612H5466J31251J96393a86297C59973a6041E6230d05419
$$ y = [-107947, -114330, -261951, 110737, -296575, -383063, -339762, 171689, 32267, 144097, 95163, -168383, 45590, -121640, 39686, 374630, -133477, -411395, -70173, -16718, 147917, 310770, 222776, 151856, 332450, 269109, -150086, -339611, 186284, -34886, -44562, -195236, 113308, 181367, 10240, -180881, 5714, 212894, 43297, -121194, 24643, -183181, -14162, -65542, 137345, -196106, -198620, -27855, 45564, 17703, 126210, -45951, 118749, 352290, -194408, 343834, -44909, -17710, -174615, -141462, 97400, 15472, 35206, -18208, 219041, -72678, 62231, -138855, 216773, 181448, -75031, 138839, -338403, 92087, 38041, -261174, -2735, 58813, -56023, -142468, 226101, 31039, -230128, -216516, 85466, 216717, 413110, -186297, 359973, -16041, 56230, -405419]
12290A25197L3706D5817J9523J37770J53478D6441K5783e8193A6360Q0727J55211
12279B52298d3124n4920A67137A8722e024A13406g2138K431A69262J54121G6037
12267A191J22300J756a18068B7523c3355F9424a74745F2239a17183j14100A0073
12255B15306c3885q0513M2432j33463E6040J23744J59472e9590C3776b44509A49747
12243F1113J91772e815G112N5481J48524L612K17718A75844o0670N358j0276c598
12230B64666a10433F7294b12081a8348B22920P0497J406b8942I6817K85202j52559
12219B29460f6609E06389a6990C11337f869A42903J13167m5862J52491o2165M9004
12208C49538n0891L4959G8420L31819I8854A1228a826D84947j5630A7889J29851
$$ y = [125197, 158903, 45817, 65340, 203110, 356588, 46441, 72224, -58193, 16360, 97087, 252298, -43124, -98044, 167137, 18722, -5024, 113406, -72138, -69707, 169262, 323383, 76037, 1191, 123491, 125247, -118068, 27523, -33355, 69424, -174745, 62239, -117183, -231283, 10073, 215306, -33885, -114398, -71966, -205429, 56040, 179784, 339256, -59590, 33776, -244509, 149747, 61113, 252885, -5815, 7112, 62593, 211117, 214729, 432447, 175844, 115174, 120532, 110256, -3598, 264666, -110433, 67294, -212081, -18348, 222920, 293417, 294823, -28942, 96817, 382019, 229460, -66609, 506389, -16990, 311337, -6869, 142903, 256070, 210208, 362699, 300534, 349538, 298647, 333606, 78420, 410239, 98854, 11228, -1826, 484947, 469317, 17889, 147740]
12197A47740p1527J47606A7032P1682n561M72562B72378j24878a19647d6686C48776
12185C68646H2910a5314B03832K49252B06168J30701j61510b6422B37220a47775
12174C21405j24229L2799J71561G1170g4102E5039K88057d2195B83104p3256K72294
12163D82142I5596k7070M5258n4596A802b4920o1466E1320f1283p1687A11121
12151c1500j18198C36538a6301A46710o57c18050A08977A6490b0123A01923b02227
12139G2814O1324a8303r6401A2484J77279O8915c00439B31393a5544A75994L57337
12128E33331A5352b6395j35077H5215a01135A87480G5189k0811b16299A52031
12117B03487J12565b86080f7250B01489J79840b72952A26513d0667j75870B85855
$$ y = [147740, 76213, 223819, 17032, 88714, 83153, 555715, 272378, 147500, -119647, -46686, 348776, 368646, 82910, -15314, 203832, 453084, 206168, 336869, 175359, -26422, 237220, -147775, 321405, 197176, 229975, 401536, 71170, -74102, 55039, 343096, -42195, 283104, 209848, 482142, 95596, 68526, 113784, 59188, 1802, -24920, -86386, 51320, -61283, -132970, 111121, -31500, -149698, 336538, -16301, 146710, 146053, -318050, 108977, 16490, -20123, 101923, -202227, 72814, 134138, -18303, -114704, 12484, 189763, 258678, -300439, 231393, -15544, 175994, 533331, 15352, -26395, -161472, 85215, -101135, 187480, 75189, 54378, -216299, 152031, 203487, 316052, -286080, -67250, 201489, 381329, -272952, 126513, -40667, -216537, 285855]
12106a70665B66258m8291C4206b02314J00312A5703J66488c5003j36000b9582
12095B8672b00554b021l51343d1329l98968J66115A83583c45883a24036A19062
12084f7812j35037F3092a68739A8542J30131d62725B07027b04680g6465C28438
12073b38223A0409g8431D4197L775P46493O58342l52002F647J49093J49617b1033
12061A5359a98058B76611B2786M1201q392d924I3864f9495A55276a41498D6638
12049d7503F761b33790J5799j10943F8030Q0031R8283a90137A55501j7691o4372
12038G3438b75797L0536A65150b06857A27405A8669b2230e62j37542J8911k7264
12027a46457p1761E5025c93111A64751b29841G2455a60128g0917A86392a51589
$$ y = [-170665, 266258, 217967, 34206, -202314, -102002, 15703, 182191, -35003, -171003, -29582, 28672, -200554, -2021, -353364, -41329, -440297, -274182, 183583, -345883, -124036, 119062, -67812, -202849, 63092, -168739, 18542, 148673, -462725, 207027, -204680, -76465, 328438, -238223, 10409, -78431, 44197, 47972, 794465, 1452807, 1100805, 6647, 155740, 305357, -21033, 15359, -198058, 276611, 22786, 63987, 55595, -4924, 93864, -69495, 155276, -141498, 46638, -47503, 6761, -233790, -217991, -328934, 68030, 148061, 246344, -190137, 155501, 137810, 73438, -275797, -245261, 165150, -206857, 127405, 18669, -22230, -562, -138104, -119193, -146457, -218218, 55025, -393111, 164751, -229841, 72455, -160128, -70917, 186392, -151589]
12016G9784j9920a26468B20598i2229K1736Q625p6353e4160j19122j31171J35933
12005a68520J222j30724A25521n4474k4245J73107a34528L0436A80248A1320b0693
11993d47572A83778a23996r6787b0979k01603b3101C10207i6927A08842a68780
11982A55938b0634k32007A83090h201B85581A13233D9449K6522J11060a51555
11971c04754a1534I9900l1433R7027N6557C2915a30450p2766b3806m3412A62921
11959A07575g6486b0097C75657a41811A18970d359A38494Q1335L25998g1251b6288
11947A11741a09963c2704l5525I7773Q2739J08489j01318h3793E320J1568J14643
11936A31531b80587D0576c55128c569j04146A06386c42039i1015l53580f304A71027
$$ y = [79784, 59864, -126468, 220598, -92229, -70493, -61868, -138221, -54160, -173282, -304453, -168520, -167298, -298022, 125521, 71047, 46802, 219909, -134528, -104092, 180248, 11320, -20693, -447572, 183778, -123996, -220783, -20979, -222582, -23101, 310207, -96927, 108842, -168780, 155938, -20634, -252641, 183090, -8201, 285581, 113233, 49449, 75971, 187031, -151555, -304754, -11534, 99900, 68467, 165494, 222051, 32915, -130450, -203216, -23806, -67218, 162921, 107575, -76486, -20097, 375657, -141811, 118970, -4359, 138494, 219829, 545827, -71251, -26288, 111741, -109963, -32704, -68229, 97773, 180512, 289001, 187683, -83793, 5320, 16888, 131531, -280587, 40576, -355128, -3569, -107715, 106386, -342039, -91015, -444595, -6304, 171027]
11924a01034c9530G8966b49195A05886O5328B7178E607h8685I0563a04006A44105
11912c27861g7159l0428C88658j9092A9262e3131C6048b59512B41091F5498L2584
11901I8082e1589B35544h5947A31017m8571k2651J10754d7944p9219A71422d04349
11889f04377B61154a12904C07127h2041A90224b30183a07035E3671b80320A69546
11878A90562p2085a76949k55467C3724c2044k03553A07558e7882a5457j098c090
11866a07061A47222J27592L303a00611j81929j7697E0953J46098b8803D5421c32986
11854A08398e9197j84277f9152A91852H2086J89368h511E3886P9301J18389I8166
11842d4194E4190g1144B18900M997c19273a42028A73013k5796J48553I6094b14897
$$ y = [-101034, -39530, 78966, -249195, 105886, 171214, 27178, 5607, -88685, 90563, -104006, 144105, -327861, -77159, -107587, 388658, 369566, 19262, -53131, 36048, -259512, 241091, 65498, 98082, -51589, 235544, -85947, 131017, 82446, 59795, 170549, -47944, -127163, 171422, -404349, -604377, 261154, -112904, 307127, -82041, 190224, -230183, -107035, 53671, -280320, 169546, 190562, 118477, -176949, -432416, 33724, -32044, -235597, 107558, -57882, -15457, -16555, -3090, -107061, 147222, 274814, 278117, -100611, -282540, -300237, 50953, 197051, -28803, 45421, -332986, 108398, -59197, -243474, -69152, 191852, 82086, 271454, -8511, 53886, 133187, 251576, 98166, -44194, 54190, -71144, 218900, 223897, -319273, -142028, 173013, 147217, 295770, 96094, -214897]
11830b10482A81804E0872d2956E9731L848b1474L472F1741R225b45333A36440
11818a73954d398k4978B7182b4787l40880P7187A77545B1704f308C3615b30568
11806b26971H1258r583K5310a48689i487A16977Q8179q1764b00154j1102A29020
11794A68767o0465l806J46952j06677K4518C2528c9248A48977c6004j3678J5464
11783c4218j43772j52796a090B57551h4013H4633b90868a30426n7744A66538G7988
11771b65302A44734l1382a39359B0982P5182K16312A00068d6018D8104b25709
11760C1430J5361a7013A07221J75609g2279G384b6127a652j33631l1648r1047
11749b57978k3115A14843m6027L3956a0626n1343j51474A56549a98172H1539g1796
$$ y = [-210482, 181804, 50872, -42956, 59731, 63579, -21474, -18002, 61741, 70966, -245333, 136440, -173954, -4398, -29376, 27182, -24787, -365667, -288480, 177545, 21704, -6308, 33615, -230568, -226971, 81258, 71675, 96985, -148689, -9487, 116977, 205156, 123392, -200154, -211256, 129020, 168767, 108302, 104496, 251448, 144771, 169289, 32528, -39248, 148977, -36004, -49682, -34218, -177990, -330786, -1090, 257551, -84013, 84633, -290868, -130426, -188170, 166538, 77988, -265302, 144734, 113352, -139359, 20982, 96164, 312476, 100068, -46018, 48104, -225709, 31430, 46791, -17013, 107221, 282830, -72279, 7384, -26127, -1652, -135283, -166931, -257978, -281093, 114843, 68816, 102772, -10626, -61969, -213443, 156549, -198172, 81539, -71796]
11737a23375E7622K01003j16567K9402G5755k8275h8813A69502J63714n1747g3509
11725a00191L1096j05248j37247A49331b98279a02470A17152f7543A61210p7621
11715H3589B6609L72480A24872K099F334M176h8467A30275K35612b29146C3964
11703A88309K14725I7467N9128d41082A31844B3026J20893B744e775k2239A6997
11691c5022B957a62361E18994A54566p4493i558B987a22596H2941L81089r8836
11680C65194A02986d8519I6340K14160E4007Q9770D6659f8786j66485g097c493
11668B42539C2252Q4473P182J6981a76597I8928j9467a86642G1972H734b46575
11656a04817C2055J76573q3157a62870n7071A31930e9504a1026a650A14128a31976
$$ y = [-123375, 57622, 258625, 142058, 171460, 75755, 47480, -88813, 169502, 333216, 281469, -73509, -100191, -69095, -174343, -311590, 149331, -298279, -102470, 117152, -67543, 161210, 83589, 26609, 399089, 124872, 126971, 6334, 10510, -88467, 130275, 365887, -229146, 33964, 188309, 403034, 97467, 156595, -441082, 131844, 23026, 143919, 2744, -5775, -28014, 16997, -35022, 2957, -162361, 518994, 154566, 80073, -9558, 2987, -122596, 82941, 464030, 365194, 102986, -48519, 96340, 310500, 54007, 143777, 46659, -68786, -235271, -7097, -3493, 242539, 32252, 116725, 123907, 140888, -176597, 98928, 79461, -186642, 71972, 8734, -246575, -104817, 32055, 208628, 125471, -162870, -219941, 131930, -59504, -11026, -1650, 114128, -131976]
11644C3357A4514a4702F2623b63669C93M59397A15693b53422i7509A33510B6436
11632c895A45586o4111a14714P856L0021j22966A61729K9422q134r368g5177A65312
11619A67893I025K40759a62336I9286a44145r2926D28779B08947a60977d5639
11608A46394B3508a42719m536p7688B17833N934C09i4987A44401L80887b19744
11596a87643B35669a37733O5274A59325c83429I6440Q6088a75950A03433J3881
11586A17314m4413K62126p4012K03928C0042J70703E1209K81531A09422N0731
11576A60153a88876B03054n1184A1741P703J14312O5995c4136B93746D3277L51251
11565C94528j03930j18398L1626f5496C75730e4991A42651F4237R2962N427a37788
$$ y = [33357, 14514, -14702, 62623, -263669, 393, 459790, 115693, -253422, -97509, 133510, 26436, -3895, 145586, 81475, -114714, -106858, -76837, -199803, 161729, 191151, 183017, 173649, -75177, 165312, 167893, 9025, 249784, -162336, 99286, -144145, -237071, 428779, 208947, -160977, -45639, 146394, 23508, -142719, -147255, -224943, 217833, 223767, 309, -94987, 144401, 525288, -219744, -187643, 235669, -137733, -72459, 159325, -383429, 96440, 182528, -175950, 103433, 117314, 72901, 335027, 261015, 464943, 30042, 200745, 51209, 332740, 109422, 160153, -188876, 203054, 151870, 11741, 19444, 133756, 199751, -34136, 293746, 43277, 394528, 290598, 172200, 203826, -65496, 375730, -54991, 142651, 64237, 157199, 162626, -137788]
11553A03L8284Q5434J06274k8377a64814f7310A99847d0374E2395h296B30611
11541A0581a05130C28810j28169G0999J84721b9405C9872K96477A53265b0764
11530b7804k22339A01977L26508d8981F1171K80957b3475B27229g3368I0052a28410
11518a70969h396A77234E9781a03706C60309A20014J43846b22267D65680j50058
11508C15622B5677Q6067l6841J33680j0626O0435A20523h0138D1564K52104b30655
11496c3873j15188B10691F9063K7277K58185j76290K96393A33111E3819K10918
11486B64737K4285j04647J09449F9594L87664A81412J23317j51791L0380p6568
11476A06750O4340N8959a0129B70873a05494B05373K14524i7245B0712K83435
$$ y = [103, 38387, 123821, 230095, 201718, -164814, -67310, 199847, -40374, 52395, -8296, 230611, 10581, -105130, 328810, 200641, 70999, 255720, -29405, 39872, 336349, 153265, -20764, -27804, -250143, 101977, 428485, -48981, 61171, 342128, -23475, 227229, -73368, 90052, -128410, -170969, -8396, 177234, 59781, -103706, 360309, 120014, 263860, -222267, 465680, 315622, 25677, 111744, 74903, 208583, 197957, 258392, 120523, -80138, 41564, 293668, -230655, -33873, -149061, 210691, 69063, 96340, 354525, 178235, 474628, 133111, 53819, 264737, 289022, 184375, 293824, 69594, 457258, 181412, 304729, 152938, 183318, 106750, 171090, 230049, -10129, 270873, -105494, 205373, 419897, -97245, 20712, 304147]
11466C04147A14242K58095k5663r8082o3748c9584B22840D2842a16434A54445
11455B7907b7555k56122I6271e1955C4735J03146M8753b9869B89072M4405j38676
11444A94801E4361J85278d4466k2075I2343L47576F8453a54758j6293E1777a4346
11432B67896o3114b2075B14137b31768D8647d1534A77676b2339C20464b56174
11421g6424C23823b80136g3221K7515B46529C5193d9403p0710e1544A22799a54275
11409E09904k36083F883h6806A07990J74675D1487L1423J81634p5979d7902H8889
11397c2136B60662d06182a02683A26432l8151f0221j10322O6525A96881c695B14853
11385e0117j68873B34829a31344L0686n49208b01139h5469c0935m1906D31035
$$ y = [304147, 114242, 372337, 346674, 248592, 184844, -39584, 222840, 42842, -116434, 154445, 27907, -27555, -283677, 96271, -51955, 34735, 137881, 186634, -29869, 289072, 333477, 194801, 54361, 239639, -44466, -66541, 92343, 439919, 68453, -154758, -171051, 51777, -14346, 267896, 204782, -22075, 214137, -231768, 48647, -41534, 177676, -22339, 320464, -256174, -76424, 323823, -280136, -73221, -45706, 246529, 35193, -49403, -120113, -51544, 122799, -154275, 509904, 273821, 6883, -86806, 107990, 282665, 41487, 72910, 254544, 178565, -47902, 88889, -32136, 260662, -406182, -102683, 126432, 88281, -60221, -170543, -104018, 196881, -3695, 214853, -50117, -218990, 234829, -131344, -100658, -649866, -201139, -85469, -30935, -72841, 431035]
11374C08253h635E4448f5510B34081a24934C79476A28822b13953k9478C2028a59974
11362C1008a56902C4608a13691b5524B49719a39038A10716J74143J0789g4931
11351a0122J783B52398C2511b75009F2707k3348J85092B3716J05726a14058p8801
11340a92859B13982a84739B3330d2139B67311a46616d0905E8492K98695j07455
11330B49732c1287j68554d4635F2178B6524a53656O9675j68575A20406a45056
11319a34910I81K44351n5442b51096a21969r1136B86798a86536B33781c35910
11308A38952a29611j2911B222a08209j07958m536H3389e8262m1512k80201A57121
11296D8232J1007O3362D9824l275O151d1574l34355r1481J79695B1841i6864B00477
$$ y = [308253, -8635, 54448, -65510, 234081, -124934, 379476, 128822, -213953, -243431, 32028, -159974, 31008, -156902, 34608, -113691, -25524, 249719, -139038, 110716, 284859, 295648, -74931, -10122, -8339, 252398, 32511, -275009, 62707, 39359, 224451, 23716, 129442, -114058, -192859, 213982, -184739, 23330, -42139, 267311, -146616, -40905, 58492, 357187, 249732, -31287, -199841, -44635, 62178, 26524, -153656, -83981, -252556, 120406, -145056, -134910, 981, 245332, 189890, -251096, -121969, -213105, 286798, -186536, 233781, -335910, 138952, -129611, -142522, 2222, -108209, -216167, -220703, 83389, -58262, -99774, -379975, 157121, 48232, 59239, 122601, 49824, 46549, 52700, -41574, -375929, -467410, -287715, 21841, -96864, 200477]
11283a96555h6331C69721A222J78092b9281B1545a19964k0925A03940k1284b63886
11271e3891j54837C70301j78106a01372l36706R3946J41579b6859k10075a18439
11260B01328h3947m6498I5335a41434e7996j02699B07417e8089A54254K6392C313
11248A65353b32122b0965k02706Q6384B82328B6761k740K23330a77193M909C7373
11236C86729a53673o4400j42290A7238b96608E5955a32498F2211b79970G1824
11225B56032a19721k92471B5544a82519B62330b32164J15455j48495E1922B2340
11214b95262e2107l71j17475A6540b44669B16528a38993o2827j15872R921J53320
11203a54451F9799f8695n3461d4109m0680c1371K900E9688f4423B49840A21865
$$ y = [-196555, -86331, 369721, 1222, 179314, -29281, 21545, -119964, -140889, 103940, 82656, -263886, -53891, -208728, 370301, 192195, -101372, -438078, -344132, -202553, -26859, -236934, -118439, 201328, -83947, -130445, 95335, -141434, -57996, -160695, 207417, -58089, 154254, 180646, 3313, 165353, -232122, -20965, -223671, -137287, 282328, 26761, 24021, 247351, -177193, -172284, 37373, 386729, -153673, -218073, -360363, 17238, -296608, 55955, -132498, 62211, -279970, 71824, 256032, -119721, -412192, 25544, -182519, 262330, -232164, -116709, -265204, 51922, 22340, -295262, -52107, -52478, -169953, 16540, -244669, 216528, -138993, -201820, -317692, -307771, -154451, 69799, -68695, -122156, -44109, -84789, -31371, -28471, 59688, -64423, 249840, 121865]
11191a69744B71246h9198B24157H8705L883l8786a40583C5087c5210m699q4386
11180a24295A544b5004B04906A4505e38475B72116j35586a25032j4188F0428j461
11169E8967J993b68755A82037e3369G6007a83484O4428l0164G8727a33369d8823
11157a94742B98247G3878k0622B2603L58249C3869F212O3376c8681C28873D9773
11145C43405G05h0133A34920L8512i2544k57725I6649d32070A28309a15311H1721
11133a14597j63642A4370c1849F0977d5395C93519h7537a6062j02617A13309L251
11122A16560Q544B4368K968a75623H5253J71326j20602e4606H4856K1108j983
11111A03981J66622r7889k084K5643k6146Q8140l9946J21225A11586l5307L3138
$$ y = [-169744, 271246, -89198, 224157, 88705, 92588, 53802, -140583, 35087, -35210, -39909, -124295, 1544, -25004, 204906, 14505, -538475, 272116, 136530, -125032, -139220, 60428, 58967, 60960, -268755, 182037, -53369, 76007, -183484, -119056, -149220, 78727, -133369, -48823, -194742, 298247, 73878, 53256, 22603, 380852, 33869, 6212, 69588, -38681, 328873, 49773, 343405, 705, -80133, 134920, 173432, -92544, -350269, 96649, -432070, 128309, -115311, 81721, -114597, -278239, 14370, -31849, 60977, -45395, 393519, -87537, -16062, -118679, 113309, 116560, 125104, 24368, 27336, -175623, 85253, 256579, 135977, -54606, 84856, 105964, 103981, 270603, 172714, 170630, 196273, 170127, 258267, 218321, 339546, 111586, 76279, 109417]
11100A09417a72129A72391C948O0886J11180J18968j27K66589A47842B0252K51808
11089B72060L1227j21713R1208A34221N8261K057K3761C685L17788j2684K11326
11078E20115A32117P9977A7070J40942K69668A03127J73230A29699M78929A04785
11067C44749H315K42961C3038O12489j08918k34296K52639O9238M1898p376l24057
11056C34655K24151N6019j9278K74377j86739K07271l77949M6861o3188L04944
11046H01124J9510J50680j52596k14083p2230K50770K781l01209J25014j7332
11036E92429l2008L53661J0555B24614O55837l67995L72449l2895J01677l27026
11026F26661k9256k01144K32593k203k15300L81578l484l73728J46135K57086
$$ y = [109417, -172129, 172391, 3948, 64834, 176014, 294982, 294855, 561444, 147842, 20252, 272060, 303287, 181574, 272782, 134221, 192482, 194539, 218300, 3685, 321473, 308789, 520115, 132117, 212094, 17070, 158012, 427680, 103127, 276357, 129699, 608628, 104785, 344749, 8315, 251276, 33038, 645527, 536609, 302313, 554952, 624190, 666088, 658712, 334655, 558806, 614825, 595547, 869924, 683185, 890456, 512507, 559368, 496180, 801124, 820634, 971314, 818718, 604635, 532405, 783175, 785956, 484747, 609761, 592429, 560421, 914082, 924637, 224614, 880451, 512456, 884905, 852010, 953687, 626661, 597405, 396261, 628854, 626651, 411351, 792929, 789445, 415717, 561852, 818938]
11016H18938k28345J73100o7181j31333J27981n1316k96215K43145J63578J00837
11006H53189k80273r1004J79591m258j49970o5862L56868j07432J62024r5063
10996G57810P0128k77165q4297L89438k38069K89875q6683L9197L75479l10858
10986I24855N2954j19803J41595k43684L89981q5258K70386J80327J41942L34243
10976A987538l46985j50283R49486O11730k40888j8910L39285l05497l47540m93213
10966A984723K12789m28062k6648M5623k23049J83291J04529j08400J75376K53409
10956B173581n58176j88954l0425k55844k93745o0322j05530j0581Q2229j30611
10946F21622A84411K18443j09628J63620A48280J69138e3461E9599M85875k52617
$$ y = [818938, 590593, 763693, 696512, 565179, 693160, 641844, 345629, 588774, 752352, 853189, 572916, 481912, 661503, 657245, 507275, 441413, 798281, 690849, 852873, 757810, 827938, 550773, 466476, 855914, 617845, 907720, 821037, 860234, 1235713, 924855, 977809, 858006, 999601, 755917, 1145898, 1060640, 1331026, 1511353, 1653295, 1987538, 1640553, 1490270, 2439756, 3051486, 2810598, 2791688, 3130973, 2825476, 2477936, 1984723, 2197512, 1769450, 1742802, 1788425, 1565376, 1748667, 1853196, 1744796, 1920172, 2173581, 1615405, 1426451, 1396026, 1140182, 846437, 786115, 680585, 670004, 752233, 621622, 184411, 402854, 293226, 456846, 148280, 317418, -53461, 59599, 545474, 292857]
10936B92857B2625K93573j33997h1757A19458f9621G7352J35779G1560A605L74718
10925C76323a24214k6904e2073l83813k1616Q9482c2659m4986g327l53102G2344
10913A87877i5496B28694H1218h7587I855J10452a48113k97024H8200d2408B3537
10901b5179B06787a48086E1522L58311o8509f9093b0109C0494L41940A09553a0520
10889a02762j07834E5500a5159m1790j6758D27813a19963A86082g2153j86983
10879b59136c4376A04522h6466j64626Q0819e4883o2099f308j89368g3364F3410
10867C97979a43913I5810a06892k6682A14960m1148R7646b13211Q7156c7693F4756
10855H1707a419k4543O464j61430E9014J5308j0488L01607g2114k68763A41179
$$ y = [292857, 22625, 316198, 182201, -81757, 119458, -69621, 77352, 213131, 71560, 1605, 376323, -124214, -151118, -52073, -435886, -457502, -368020, -32659, -77645, -7327, -360429, 72344, 187877, -95496, 228694, 81218, -87587, 9855, 120307, -148113, -445137, 88200, -42408, 23537, -25179, 206787, -148086, 51522, 409833, 341324, -69093, -20109, 30494, 372434, 109553, -10520, -102762, -210596, 55500, -15159, -56949, -73707, 427813, -119963, 186082, -72153, -259136, -34376, 104522, -86466, -251092, -170273, -54883, -116982, -6308, -195676, -73364, 63410, 397979, -143913, 95810, -106892, -133574, 114960, 73812, 171458, -213211, -126055, -37693, 64756, 81707, -1419, -25962, -19498, -180928, 59014, 74322, 63834, 365441, -72114, -340877, 141179]
10843a39451A13206a28115a7866D09066A7774f2437G7074a77870k3807i6870F816
10831B9603b54119A00947h0166A01679A2609P3876b67736J04436d6485I9792a44138
10819D51077i5454p6318f6271L206o5090k4635d0721B20669C970e5451j88529
10808b43980g8915c7766j87200d5178a6713l6528k5795k12353a17517C18785b23433
10796A73571l3003J38934b79112f6144j7764A15463a52933a0124A31268F3224
10785a76524j06415O3859d357k23365A25352b14978j1768J11537F6298a34817
10774A08317P2306E0183L1018b5414A00088e4013j83915a0481A9846b24484e2698
10762a86794c8618j74285A83273b5091l98278i4889c3661r73D4764a86901A20668
$$ y = [-139451, 113206, -128115, -17866, 409066, 17774, -62437, 77074, -177870, -201677, -96870, 6816, 29603, -254119, 100947, -80166, 101679, 12609, 86485, -267736, -163300, -46485, 99792, -144138, 451077, -95454, -171772, -66271, -63065, -128155, -152790, -40721, 220669, 3970, -55451, -243980, -78915, -37766, -224966, -45178, -16713, -53241, -79036, -291389, -117517, 318785, -223433, 173571, 140568, 279502, -279112, -66144, -83908, 115463, -152933, -10124, 131268, 63224, -176524, -282939, -219080, -4357, -227722, 125352, -214978, -226746, -115209, 66298, -134817, 108317, 180623, 50183, 81201, -25414, 100088, -54013, -237928, -10481, 19846, -224484, -52698, -186794, -38618, -212903, 183273, -25091, -423369, -94889, -33661, -34634, 44764, -186901, 120668]
10750c1160C711b18170e3598A57112A6218a44190D0649b65628a22263k3716A2394
10738a62001e9609A03881a95904R2218D0556k099J59919f0160e391k04250A20459
10726a2103D3796K56870j31280M5610f57A54576b98437e2844C26851r9560L0078
10715B57369j8198a53561j6040e8996p5115j10086A08696d6289J8642B30720c24787
10703b64572E5186M7674a75086p1545d8307o0061B436d25719j9705A01011m0904
10692F0107b6020m8867E3628k4824L9448A0455i2470H5401J6060A9738a88993
10680B12419c00280e6158A28810Q721b38896l05140J86396a47749k6702d6810
10669A74617b63819C56516b61948h6000k16758J32092A64378i918j83251A00156
$$ y = [-31160, 3711, -218170, -53598, 157112, 16218, -144190, 40649, -265628, -122263, -145979, 12394, -162001, -59609, 103881, -195904, -103686, 40556, 38457, 198376, -60160, -5391, -209641, 120459, -12103, 43796, 300666, 169386, 214996, -657, 154576, -298437, -52844, 326851, 227291, 257369, 239171, -153561, -169601, -58996, -134111, -244197, 108696, -46289, -27647, 230720, -324787, -264572, 55186, 102860, -175086, -246631, -48307, -108368, 2436, -425719, -445424, 101011, 60107, -26020, -74887, 53628, 28804, 68252, 10455, -92470, 85401, 101461, 19738, -188993, 212419, -300280, -56158, 128810, 137531, -238896, -544036, -357640, -147749, -174451, -46810, 174617, -263819, 356516, -261948, -86000, -302758, -170666, 164378, -9918, -193169, 100156]
10658e5470A32439a45008A9047b67173j8931K2510O3075A1307a59157j57132f6058
10646A5254a7982j25866C3809c30688R7239k00279a81226B91731a21221e101A38760
10634A8398c5819E193L654i6734d2385k03191B95293G7764c76010I1346A9611
10622G8987b93195B0601O2277g0603A38198b62484g2770j89538Q3159B88353a1892
10610a20476b2608D8130O7006J0878b59148d5025B09991h2406k1036e1509B383
10598b3412G967b85900A60541A9362a02232j61341C9652a77796L3561j4055A84526
10586b27727A5093R9350d97391D5555i8241o8362b4450j22398l03926a03022d316
10574c45310h2502k29960D8475a59207A03700d52990a1077j09489B11022G8130
$$ y = [-55470, 132439, -145008, 19047, -267173, -286104, -263594, -200519, 11307, -159157, -316289, -66058, 15254, -17982, -143848, 33809, -330688, -233449, -433728, -181226, 291731, -121221, -5101, 138760, 18398, -35819, 5193, 8847, -96734, -42385, -245576, 295293, 77764, -376010, 91346, 19611, 78987, -293195, 20601, 82878, -70603, 138198, -262484, -72770, -262308, -179149, 288353, -11892, -120476, -22608, 48130, 115136, 126014, -259148, -45025, 209991, -82406, -103442, -51509, 2383, -23412, 7967, -285900, 160541, 19362, -102232, -263573, 39652, -177796, -144235, -158290, 184526, -227727, 15093, 114443, -497391, 45555, -98241, -166603, -24450, -146848, -450774, -103022, -4316, -345310, -82502, -312462, 48475, -159207, 103700, -452990, -11077, -120566, 211022, 78130]
10563a79106Q9425G360b92058G0416B1431a78615A35273a73956J3064D24058f4941
10551D37657I417f1886B20313I9157f1764r3885g3200L0352A29647L2449E4655
10539H8307c78330J40611E7144b7530j34804B1897J11134b26606C50479i3381
10528G090J54933O6765k8349a58992g369k48649N042A0234d03190B48925D3527
10516C8021h3847C7612d6403A6775f9065q802F8660a75882A12960f9466A18640
10504a86655F791a41352j26157B12984A6377a10595m6018a3226A20680N8434c04962
10492B71840a29485p5166i920j17327f2087o7161C9085J10610b7877C24503J06633
10481D31136J33416K08716A15804L24917A07331b22027j00435A29995J12016a79289
$$ y = [-179106, -89681, 7360, -292058, 70416, 21431, -178615, 135273, -173956, -160892, 424058, -64941, 437657, 9417, -61886, 220313, 99157, -61764, -155649, -73200, -42848, 129647, 162096, 54655, 88307, -378330, -237719, 57144, -27530, -162334, 21897, 133031, -226606, 350479, -93381, 7090, 162023, 228788, 200439, -158992, -7369, -256018, -250976, 10234, -403190, 248925, 43527, 38021, -83847, 37612, -46403, 16775, -69065, -77867, 68660, -175882, 112960, -69466, 118640, -186655, 6791, -141352, -267509, 212984, 16377, -110595, -156613, -13226, 120680, 179114, -304962, 271840, -129485, -204651, -9920, -127247, -62087, -129248, 39085, 149695, -27877, 324503, 431136, 564552, 773268, 115804, 440721, 107331, -222027, -322462, 129995, 242011, -179289]
10470B45681h5614m28030a20172B19701C0281j1297h8960n1050A45438L03165
10460D48603a22142j71211A40095D5510K20704a54516d9285H1782g378A88135
10449e8849l7231k36787H2074c09291E3729M54252e3101E5850P0110a82454N2017
10438a30437a1141k92051D4937a45769n349j01263R0788r9903B90755a24188c1835
10426a70686n8553B32186n8119d35428J35440d8737G7122J99707a74292E4444
10415d6000k49764G7685j3180b05341D0644a03739B47275a1373j12254e0673m11775
10404d62448a8735H6736R1812b04116B06412f6971B2107R3782J09646F3799a25169
10392E5512J66441a16483F7330M78104c3013p6466B08896G2586A71J22253m9132
$$ y = [245681, -85614, -513644, -120172, 219701, 30281, 18984, -88960, -140010, 145438, 448603, -122142, -293353, 140095, 45510, 266214, -154516, -49285, 81782, -7378, 188135, -58849, -96080, -332867, 82074, -309291, 53729, 507981, -53101, 55850, 125960, -182454, -130437, -11141, -303192, 44937, -145769, -151118, -252381, -161593, -261496, 290755, -124188, -31835, -170686, -229239, 232186, 174067, -435428, -299988, -48737, 77122, 276829, -174292, 54444, -46000, -295764, 77685, 64505, -205341, 40644, -103739, 247275, -11373, -123627, -50673, -462448, -18735, 86736, 178548, -204116, 206412, -66971, 22107, 115889, 225535, 63799, -125169, 55512, 221953, -116483, 67330, 545434, -33013, -109479, 208896, 72586, 171, 122424, 73292]
10381G3292B338K39540b9118B17175A06497M46771j99900D8122I637J96168K11280
10370D17085j59487K44806J97412k77034p7024R5511m8375N3364B09664e4619
10359A98374k2686l8576N2547N455c7035I0825M5506K79334J5189k03882n8589
10348A68383M38988I6548J91482K97716k4463B09704j1847f2303B83090a2875
10337C2878J10434f5373G3466L15867J30978A35542b1746E62339E2276J64783
10327B17059F2187P4683h0392C85551j9710a140A54746j7330F0759J57769C4699
10315C54171A15505d9853g95G3621B8682a62180B826f4814d636j47308M9578F8315
10302A49218J42988A26812b01669A69153q0180d6974q2573A49249l3882a14994
$$ y = [73292, 2338, 241878, -29118, 217175, 106497, 553268, 353368, 48122, 9637, 205805, 417085, 257598, 502404, 699816, 422782, 345758, 441269, 392894, 446258, 209664, -54619, 198374, 175688, 137112, 189659, 195114, -37035, 90825, 136331, 415665, 430854, 226972, 168383, 607371, 96548, 288030, 585746, 561283, 209704, 197857, -62303, 283090, -12875, 32878, 143312, -65373, 73466, 389333, 520311, 135542, -21746, 562339, 52276, 217059, 62187, 136870, -80392, 385551, 365841, -1140, 154746, 137416, 60759, 218528, 34699, 354171, 115505, -49853, -795, 73621, 28682, -162180, 2826, -64814, -4636, -151944, -102366, 68315, 149218, 292206, 126812, -201669, 169153, 88973, -46974, -129547, 149249, 115367, -114994]
10291d31199C2048D075c56184K2791b3282B16657b322k5296k99317r0514c3646
10279A4080a48497J7906A43410a78010k8715G3776a40261b588r2773l1454B65050
10267i6978D35348B4057R6457k5571l4396J88577J87111K48667B23717R8826B0191
10255B52868b2689l7187C50130F6607K05913a34066L1408A75602b29023e8838
10244c04758A57364A6759J13189J60367b91932i357A88968a12309r9855j21615
10234c33779R8962F7377a33493m4855D28983a86321j08241D5790c77150g3049
10223A04306a10704B66171a13906p1616j13403B0801b99418A35199K19221b54962
10212A75447R7879n7729c87841a33491A58706a16365B13965b01391i6688q284
$$ y = [-431199, 32048, 4075, -356184, -333393, -23282, 216657, -2322, -27618, -326935, -417449, -33646, 14080, -148497, -130591, 143410, -178010, -206725, 73776, -140261, -2588, -95361, -126815, 265050, -96978, 435348, 24057, 120514, 94943, 60547, 249124, 436235, 684902, 223717, 322543, 20191, 252868, -22689, -59876, 350130, 66607, 272520, -134066, -102658, 175602, -229023, -58838, -304758, 157364, 16759, 129948, 290315, -291932, -9357, 188968, -112309, -212164, -333779, -234817, 67377, -133493, -178348, 428983, -186321, -294562, 45790, -377150, -73049, 104306, -110704, 266171, -113906, -185522, -298925, 20801, -299418, 135199, 354420, -254962, 175447, 273326, 215597, -387841, -133491, 158706, -116365, 213965, -201391, -96688, -104972]
10202a04972A05327a76178O0375k05821A8517c5919p9755k19652B48571c6446
10191c65151A4173b7122B28963L9403J02715h6602A8253a04148A43703a17938
10180i525D108e3533j22073A12475e8539C58383C5129d6988j11754m2764B35451
10168a90715C4289J00228a5069q9249A4561d3389j9535q0710B93K8765b42707
10156a66717C8643a59150B02950c70172a02675K2668D5750M0331a49425a0048
10145E7215N8209d14939b06962R9591d2400B74881B7167b70393A72344b30835
10134b72594G1231B6409M6388a56736r5133f925j60085N6793q4992A72203q2743
10123H9460A9948c03486d9610o8023r6276J00544k69903i5431K1477j47266B4084
$$ y = [-104972, 105327, -176178, -115803, -321624, 18517, -35919, -115674, -335326, 248571, -36446, -365151, 14173, -27122, 228963, 268366, 371081, -86602, 18253, -104148, 143703, -117938, -9525, 4108, -53533, -175606, 112475, -58539, 358383, 35129, -46988, -158742, -201506, 235451, -190715, 34289, 134517, -15069, -104318, 14561, -43389, -62924, -143634, 293, 29058, -242707, -166717, 38643, -159150, 202950, -370172, -102675, -80007, 45750, 86081, -149425, -10048, 57215, 115424, -414939, -206962, -107371, -42400, 274881, 27167, -270393, 172344, -230835, -272594, 71231, 26409, 72797, -156736, -251869, -6925, -167010, -110217, -195209, 172203, 89460, 19948, -303486, -49610, -117633, -213909, -113365, -383268, -95431, -73954, -221220, 24084]
10111A82191b08225f7579n3169A7302b93628a03444I558c6736q143B05896b6803
10099e3133j25669Q3517q2158m1542b6629I7095a47019A39146e4915m9006K9628
10088g4293p3449I4769e254j77123J2636P4519B83647f4361K1413A9174D083c4318
10075b80317Q4677L6416j24018C35831A21615c4887B09737d9798p3275j32715
10065b55788R3360D9691J66271c33I698b96113A25215A5068J22287b42104H566
10053c00646A15733C3734J60755b01872b7633L441k12115M7067B6307i848j72586
10042a82434h0819k58424a46167p3644h3618k84636b7125B5060a3621c409A09919
10030B74849d200l2499A60615a20529M8619m2180q2536c6236r598A0410J04931
$$ y = [182191, -208225, -67579, -120748, 17302, -293628, -103444, 9558, -36736, -44879, 205896, -26803, -53133, -178802, -95285, -177443, -218985, -26629, 97095, -147019, 139146, -54915, -103921, -74293, -147742, 94769, -5254, -182377, -169741, -95222, 283647, -64361, -42948, 19174, 4083, -34318, -280317, -195640, -159224, -283242, 335831, 121615, -34887, 209737, -49798, -123073, -255788, -162428, 49691, 215962, -333, 9698, -296113, 125215, 15068, 137355, -242104, 8566, -300646, 115733, 33734, 194489, -201872, -27633, -24192, -236307, -189240, 26307, -9848, -182434, -80819, -339243, -146167, -219811, -83618, -368254, -27125, 25060, -13621, -3409, 109919, 274849, -4200, -36699, 160615, -120529, -71910, -114090, -196626, -36236, -45834, 10410, 115341]
10019A15341K05470a08206L4796A74382l7873b071j96998L9153B15079b42865
10008a58021B265h3596j53274B05182c73589C5824h187I1736g3900B4049L4070
9997E8119a00467A4441K0085b48174A26974g138B35551K9368h0148b3827r6074
9986a19901A79800a28129n7742a0666n5634n0130J2264c4490H261a02850Q010
9975i4840B28553b05347l17786a87277L0483j23270C5046C045h9993m0173j7996
9964a48162A25940c15741I1835R8428g6014j8714m14466d1020o0921c6306A61206
9952i0434I5090D0764J5374a13048k42847k5159c8971k4282k50431a15015K179
9941a12836j93770I1444J69069A00149e8424B14340B5662b18818O7209C5211a3923
$$ y = [115341, 320811, -108206, -73410, 174382, 136509, -2071, -199069, -159916, 215079, -242865, -158021, 2265, -83596, -236870, 205182, -373589, 35824, -8187, 91736, -73900, 24049, 58119, -100467, 14441, 34526, -248174, 126974, -7138, 235551, 264919, -80148, -23827, -119901, 179800, -128129, -185871, -10666, -66300, -116430, -104166, -34490, 8261, -102850, -94840, 228553, -205347, -523133, -187277, -156794, -280064, 35046, 3045, -89993, -130166, -148162, 125940, -315741, 91835, 190263, -76014, -94728, -509194, -41020, -101941, -36306, 161206, -90434, 95090, 40764, 56138, -113048, -355895, -381054, -38971, -63253, -313684, -115015, -112836, -306606, 91444, 260513, 100149, -58424, 214340, 25662, -218818, -151609, 35211, -13923]
9929g3582A30496E3324i8311l2500F2736i5950d107j59648k9744i5510G7494a61088
9916a07737A7065i9525c8490j4058A2141b60589F7992c4201k29329f8872A60888
9904a13043j18089j36014a2395j65030N4771j90166J25531l11376A4064K68386
9894B82450b10147A88518b8748A16174a22722m149A81722c24119A56441a26330
9883A73622f8872q2990j21674K9147B87066C9726b27786c6219I6249b08458A85681
9871a64086L498o0519J04601J9669p8123h247q6953l98660d8814p5490a7144j52911
9859a70055B15460c74149a6728j12021L289H4123a30686j17080i3365M022C26105
9847A87186k1846R2989a17920e3378A44096j3760a39086A51915a89080f1083q8013
$$ y = [-73582, 130496, 53324, -98311, -130811, 62736, -95950, -4107, -163755, -193499, -95510, 77494, -161088, -107737, 17065, -99525, -38490, -52548, 12141, -260589, 67992, -34201, -263530, -68872, 160888, -113043, -231132, -367146, -12395, -177425, -122654, -312820, -187289, -498665, 14064, 282450, -210147, 188518, -28748, 116174, -122722, -126871, 181722, -324119, 156441, -126330, 173622, -68872, -151862, -273536, -244389, 287066, 39726, -227786, -36219, 96249, -208458, 185681, -164086, -160588, -221107, -116506, -96837, -174960, -8247, -95200, -493860, -48814, -124304, -17144, -170055, 215460, -374149, -16728, -128749, -125460, 84123, -130686, -247766, -93365, -89343, 326105, 187186, 165340, 258329, -117920, -53378, 144096, 130336, -139086, 151915, -189080, -61083, -149096]
9836a49096O8328A92328A2760a26555m1830P6782C591a25919C940f1908F3502
9824f5268j55034A15627N9602m3644E9354a29267j20203N5046f4127m32993a52856
9812b30611J0467m9635A13446c2603j7277l65694C1614P6761a96375B54808c06432
9800A41229c358j26685l28821a04880j87194L6673a05541p8676D4620n618a62966
9788c3222m3844A60883d51815A64480C2239c41253a20294k74870a85540B0850
9777b31316J04577m01160K21524J47379A68327e27996a45540c4402p768N403A07168
9765a46461l8723L6707a8648j9765k91146k703f479l6982A53116a85139c8932
9753a5815j67596O5711e973B45711a99048a9187B27382g4240B03951F2371f2383
$$ y = [-149096, -80768, 192328, 12760, -126555, -168385, -91603, 3591, -125919, 3940, -61908, 63502, -65268, -220302, 115627, 175229, 131585, 59354, -129267, -249470, -194424, -64127, -497120, -152856, -230611, -220144, -269779, 113446, -32603, -49880, -415574, 31614, 108375, -196375, 254808, -306432, 141229, -3358, -130043, -458864, -104880, -292074, -255401, -105541, -184217, 44620, 39002, -162966, -33222, -77066, 160883, -451815, 164480, 32239, -341253, -120294, -395164, -185540, 20850, -231316, -126739, -527899, -306375, -158996, 168327, -527996, -145540, -34402, -42170, -36767, 107168, -146461, -185184, -148477, -18648, -38413, -329559, -332262, -6479, -43461, 153116, -185139, -38932, -15815, -183411, -117700, -5973, 245711, -199048, -19187, 227382, -74240, 203951, 62371, -62383]
9741A47198b25974A9630b09373q8739h0668A6765a15108A15445c01294a39696
9730C54729i2819q2429n5771N9060N7475j46505A61933c6801A39373A5015O2230
9719G7245a51597C67125a45228K3431j94142a9953A02542f3282A91432n6853g0268
9707C3954d04792a28858K4161D2053c38842B52058a06523A30596b54390f1021
9696i6836b566k5821A9699d62207a14088K1321c4090A00995b62737A59373b76488
9684b82243a10174d9509F3956J14258g569B5095a33062G1943g8058l6938A16011
9672a35851k2819j79975A20883a01419p609a2193B6641b83712d9439k06477B40442
9660D7948b88249J5780i8962a6129f751A47301e2127q7623c4527m85446B09688
$$ y = [147198, -225974, 19630, -209373, -298112, -80668, 16765, -115108, 115445, -301294, -139696, 354729, -92819, -175248, -231019, -171959, -114484, -260989, 161933, -36801, 139373, 15015, 77245, -151597, 367125, -145228, -121797, -315939, -19953, 102542, -63282, 191432, 134579, -70268, 33954, -404792, -128858, -104697, 42053, -338842, 252058, -106523, 130596, -254390, -61021, -96836, -2566, -28387, 19699, -462207, -114088, -92767, -34090, 100995, -262737, 159373, -276488, -282243, -110174, -49509, 63956, 178214, -7569, 25095, -133062, 71943, -78058, -114996, 116011, -135851, -158670, -338645, 120883, -101419, -109028, -12193, 26641, -283712, -49439, -255916, 240442, 47948, -288249, -272469, -98962, -16129, -6751, 147301, -52127, -139750, -34527, -519973, 209688]
9648c26019B54301d88439J73704E1788a31283d0396l7444j77183g8488A66087
9637A48915D634K1163K98478F415a53586c4239j10521e4095j38895P4362j473
9626a20101n0207A94182b15939j72293A6732h3280C33860b2541A11179J26435
9616B37614B9118a04818A55323b0801k23877q5339i7958j31176M3509p0361N8330
9605a97656j68782a01930j60517R0852N3850o0486o6173G3766a10979j936C73356
9593E4209i7003k7541j80037j0929P2325h8629l7114c5485H5532C5194K1100c31510
9580b58881C3449N2680a28599l446A64262a99849I45h3657E3168h6847m71586
9569e58433b0122k69472f4727j45987R1716k03135i8393A02559K06376b13601
$$ y = [-326019, 254301, -488439, -314735, 51788, -131283, -40396, -77840, -255023, -78488, 166087, 148915, 4634, 25797, 324275, 6415, -153586, -34239, -144760, -54095, -192990, -118628, -120101, -170308, 194182, -215939, -388232, 16732, -83280, 333860, -22541, 111179, 237614, 29118, -104818, 155323, -20801, -244678, -330017, -97958, -229134, -185625, -255986, -197656, -366438, -101930, -262447, -171595, -117745, -178231, -244404, 73766, -110979, -112915, 373356, 54209, -97003, -124544, -304581, -315510, -243185, -88629, -125743, -35485, 85532, 35194, 56294, -331510, -258881, 33449, 86129, -128599, -132045, 164262, -199849, 945, -83657, 53168, -86847, -558433, -20122, -289594, -64727, -210714, -118998, -322133, -98393, 102559, 308935, -213601]
9558D773b32727g8949a9250k87180f5548A20764a63482e0277n2386A12278a97985
9546A58722n1396f9603j03823r2431c8311H7656a05517B94354h5437j90402N173
9535b70666A28090C257b67480m625f1372D9206f8640m5996A31265d59649b4557
9523I7652J15099D0527a18166A02814b06277M3618g8022k8123b9938b440F1666
9511b55927C02470j30497a18863p2235N3790B5005K31390c53615a49629p9125
9501b28754B81500H084g325q2967J3904o5123D0361c9049j69039A33493d7162
9489a47410j6215B74430b56756j70230J73997A93130C4287B915K92431D8842M9518
9478I8360b29809J06197l9138A93926B5108a54409B0471K2936a69476F3960c16833
$$ y = [4773, -232727, -78949, -19250, -306430, -65548, 120764, -163482, -50277, -102663, 112278, -197985, 158722, 107326, -69603, -173426, -265857, -38311, 87656, -105517, 294354, -85437, -275839, -270666, 128090, 3257, -267480, -272105, -61372, 49206, -68640, -114636, 131265, -459649, -24557, 97652, 212751, 40527, -118166, 102814, -206277, -162659, -78022, -106145, -29938, -2440, 61666, -255927, 302470, 171973, -118863, -191098, -137308, 25005, 256395, -353615, -149629, -228754, 281500, 8084, -7325, -90292, -76388, -141511, 40361, -39049, -208088, 133493, -47162, -147410, -163625, 274430, -256756, -426986, -252989, 193130, 34287, 2915, 295346, 48842, 98360, -229809, -123612, -162750, 193926, 25108, -154409, 20471, 43407, -169476, 63960, -316833]
9466b14999A40555a85042P6326r0510i9295G731a08842B02394a07283c3529A33463
9454C3026a39266B6092K78045I5079c3956A98302a38999n0220e3110l76923A6583
9442H5464k6633L4600d701a972A28413a5480j56870N8971p4086h8583D7518a91826
9429b72518G6417J37079a23761C496e3316j75528B30787c0554n2412B0558O3328
9418H3886A5913a73319j88031a00948j15332g9848L8633j17992c7403k3228l58984
9407d19615a88877A21198a03101D6522J61941b08288l94A65065d3225j83839C0331
9395h0455k4996B07049H398M2302A989N6393e6742K733k2887G4748h0655j23460
9383b04115k05906i5746k80734a13499A19334a86893J2878F530a7162e655A35306
$$ y = [-214999, 140555, -185042, -108716, -199226, -99295, 7731, -108842, 202394, -107283, -33529, 133463, 33026, -139266, 26092, 304137, 95079, -33956, 198302, -138999, -189219, -53110, -430033, 16583, 85464, 58831, 93431, -4701, -1972, 128413, -15480, -172350, -113379, -187465, -88583, 47518, -191826, -272518, 76417, 213496, -123761, 3496, -53316, -228844, 230787, -30554, -82966, 20558, 83886, 15913, -173319, -361350, -100948, -216280, -79848, -41215, -159207, -37403, -60631, -419615, -188877, 121198, -103101, 46522, 208463, -208288, -208682, 165065, -43225, -227064, 30331, -80455, -105451, 207049, 8398, 50700, 1989, 58382, -56742, -54009, -76896, 74748, -80655, -204115, -410021, -95746, -376480, -113499, 119334, -186893, -174015, 6530, -17162, -5655, 135306]
9371D6417g641B2603J7788J17906C1419J91113J39671c90009J13126J25972e3430
9359c0001A67641a20796H948b90455J7175A8290e7950j11326Q2498j31174Q3400
9348a34552A02023A8317i1512j47599L6502d6566m9815A32480J30620a83916A34563
9336b67916k7777B5426b05865C76343b62093F8957A026O2739i3801H4192b1434
9324A17156g8355B00437e34732a75728F5517Q7671b3436j71570A70409c04723
9313D85570d363G7704c08252b5797j44262J9797M3070a6254k13424A5582e8019
9301d24023A22366N4845I661b30508B93010c23724J45329M7442k0731o9913h017
9289A35125b24281H2519R2376a60167r2162j17466E6254a58187o1025A3410a19991
$$ y = [46417, -7641, 22603, 40391, 158297, 31419, 222532, 362203, -390009, -276883, -150911, -53430, -30001, 167641, -120796, 8948, -290455, -273280, 18290, -57950, -169276, -86778, -217952, -134552, 102023, 18317, -91512, -239111, -202609, -46566, -96381, 132480, 263100, -183916, 134563, -267916, -295693, 25426, -205865, 376343, -262093, 68957, 1026, 63765, -93801, 84192, -21434, 117156, -78355, 200437, -534732, -175728, 65517, 153188, -23436, -195006, 170409, -304723, 485570, -4363, 77704, -308252, -25797, -170059, -150262, -107192, -16254, -229678, 15582, -58019, -424023, 122366, 177211, 9661, -230508, 293010, -323724, -178395, -130953, -151684, -221597, -8017, 135125, -224281, 82519, 174895, -160167, -252329, -369795, 56254, -158187, -219212, 13410, -119991]
9277B5023a78106Q8243c6454k61581a29121e7987C39331a26748A93595d1435H730
9265C6946L175a99384A23190g5776r3121p6770A48741a27389n0496M526C62471
9253a08873A33301B4654b71786D6004a23469c7138A07718e0674k48060a37013
9242B3099a84378e4539b45j58161A2292e2951H0723J59080E9183d83366C2798
9230d2327A39139K43259A41525K04741a2181l7288k08260i1469j44334G197g5769
9218a07287B54972a41575O3453N006k73490j03807a79276f3178g135A38376b80428
9206b59847J01701G6820Q434j3673A0148a04671B61845m5897G6958a89307B0955
9194c59741A05353a00158j21206Q9899j7422L0010A38319C7226J625L08990a69029
$$ y = [25023, -178106, -89863, -36454, -298035, -129121, -57987, 339331, -126748, 193595, -41435, 8730, 36946, 40121, -199384, 123190, -75776, -168897, -245667, 148741, -127389, -177885, -173359, 362471, -108873, 133301, 24654, -271786, 46004, -123469, -37138, 107718, -50674, -298734, -137013, 23099, -184378, -54539, -245, -158406, 12292, -52951, 80723, 239803, 59183, -483366, 32798, -42327, 139139, 382398, 141525, 346266, -12181, -49469, -257729, -91469, -235803, 7197, -75769, -107287, 254972, -141575, -78122, -73116, -346606, -450413, -179276, -63178, -7135, 138376, -280428, -259847, -158146, 76820, 85254, 71581, 10148, -104671, 261845, 215948, 76958, -189307, 20955, -359741, 105353, -100158, -221364, -131465, -148887, -118877, 138319, 37226, 38851, 347841, -169029]
9182D76102E8483G667K8406b89663J1821J1831E73M5699a26480m7348k7018A6426
9169I9289e51402b8962j3520F478N1628l562R1625c45335J31456C1540b05531
9157i2457j78552N369g5339L2153J4684m65293A7139K5250K22123a32216F475
9145A65946a79925j95914J50453f2455j75514C00833b91969H1154b0549A38613
9134B37632j03539b07954q2983J39665N6222m5697q6355B42638G5681d3924B87089
9122d46994H9179B5498a65094G4051m897b10907b3548B6401d19880K03501J4198
9111b02181A84577J43177g3983A43135i1437G8219L5408J15920g0964j41549D9533
9099d12423A24532a15876I0996N265o349c64791J27452d708j76079B04447a05916
$$ y = [476102, 58483, 7667, 36073, -289663, -277842, -266011, 573, 46272, -126480, -173828, -200846, 16426, 99289, -551402, -28962, -42482, 6478, 58106, 54544, 146169, -345335, -213879, 31540, -205531, -92457, -271009, -265640, -75339, -43186, -28502, -493795, 17139, 42389, 264512, -132216, 6475, 165946, -179925, -375839, -225386, -62455, -237969, 300833, -291969, 81154, -20549, 138613, 237632, 134093, -207954, -290937, -151272, -95050, -140747, -227102, 242638, 75681, -43924, 287089, -446994, 89179, 25498, -165094, 74051, 69154, -210907, -23548, 26401, -419880, -216379, -202181, 184577, 327754, -73983, 143135, -91437, 78219, 113627, 229547, -70964, -212513, 49533, -412423, 124532, -115876, 90996, 96261, 89912, -364791, -237339, -4708, -180787, 204447, -105916]
9087a30493B86425b62098A13202b46590Q4014c699n4786j25921o8703d6479H016
9075B8410I779b24774j6527A79555d5508k65339J53544L2926K8371A77740J47690
9064C25430b12426b2613k1809B4718c98058B32379e0340k53076h9836B6158a41663
9052C3161J61474a41481j69457J38158A02596M6905R5530a13454G9973b24517
9041H0818i8964D634a71983K8625K6160k06260B96938A26521a19855r7517F9736
9029g5829j80582d2916l59001A43454P959m7925h2632A7929K88931b98351C30302
9017a55258e2342j44770h1077j08116E1103L56382a94803l71221f7420A84525
9006a3838j71363A87494B0377c2109j25326l31093F5502J43980j3079R4890g3395
$$ y = [-130493, 286425, -262098, 113202, -246590, -162576, -3699, -58485, -184406, -253109, -46479, 8016, 28410, 9779, -224774, -241301, 179555, -45508, -310847, -157303, -124377, -96006, 177740, 325430, -212426, -22613, -44422, 24718, -398058, 232379, -50340, -303416, -89836, 26158, -141663, 33161, 194635, -141481, -310938, -172780, 102596, 149501, 245031, -113454, 79973, -224517, 80818, -98964, 4634, -171983, -143358, -117198, -323458, 296938, 126521, -119855, -217372, 69736, -75829, -256411, -42916, -401917, 143454, 151413, 103488, -82632, 17929, 306860, -298351, 330302, -155258, -52342, -197112, -81077, -189193, 51103, 407485, -194803, -566024, -67420, 184525, -13838, -185201, 187494, 20377, -32109, -157435, -488528, 65502, 209482, 196403, 291293, -73395]
8994a81903K2735N5571j97468J14850E3799a99798N1500p2877k1009K3676o3027
8983b81535J00698l7405J05449D4678d48423K13022B037a35318k00989A02360
8972f6812q1669k06655A2144a24348A97783f6404p8545r3229A50785a34816B11581
8960a70710D7632b29483C06564c63350J34073A09555b84423A9642f93k73448A50869
8948a34594A48931H590b7376k78720D4101K79316a58360A85215a08158m2132B30241
8936C78959A71161O9538p1977m7137c16691e9003A7165L4441D762a30494C36143
8924B63014J063474K751338P115705l347012A924116F49729A25059B2478L04926
8915C27404F04J67210d9653E47501H6695d2823D966N73473B1811O9044i9567E6542
$$ y = [-181903, -159168, -103597, -301065, -186215, 53799, -199798, -148298, -221175, -242184, -218508, -281535, -180837, -218242, -112793, 44678, -448423, -235401, 2037, -135318, -336307, 102360, -66812, -148481, -355136, 12144, -124348, 197783, -66404, -144949, -238178, 150785, -134816, 211581, -170710, 47632, -229483, 306564, -363350, -229277, 109555, -284423, 19642, -693, -274141, 150869, -134594, 148931, 8590, -27376, -306096, 44101, 323417, -158360, 185215, -108158, -150290, 230241, 378959, 171161, 240699, 168722, 121585, -316691, -59003, 17165, 51606, 4762, -130494, 336143, 263014, 1326488, 4077826, 11193531, 7846519, 1924116, 649729, 125059, 22478, 327404, 604, 167814, -49653, 547501, 86695, -42823, 4966, 578439, 21811, 90855, -99567, 56542]
8902H1784c9596j07936B48182q6193f496k5571j16515A72296B571K22870a71476
8890c6814B01823d19552a0424n2728E147b67973a21507k3720J4002i288A38825
8878d99993g8042k9890b2325k0291f002A24915J4393C1186a94848g294A54466
8866D18171A7089h5777n1078j83405A11299b76016J32412B1310b59718A03812
8855a53416b6693l7713r9747M293g3197D66586C2925e6133E7657h496k80291J18632
$$ y = [81784, -39596, -147532, 248182, 161989, -6496, -32067, -148582, 172296, 2571, 225441, -171476, -36814, 201823, -419552, -10424, -63152, 5147, -267973, -121507, -145227, -131225, -9288, 138825, -499993, -78042, -107932, -22325, -42616, -6002, 124915, 139308, 31186, -194848, -7294, 154466, 418171, 17089, -85777, -136855, -320260, 111299, -276016, -143604, 21310, -259718, 103812, -153416, -26693, -64406, -164153, -159860, -73197, 466586, 32925, -56133, 57657, -8496, -288787, -170155]
$$ [...]
##END NTUPLES=NMR SPECTRUM
##END=
