
##TITLE=AC1207_MCiAH12041_7155062_eldopUTpDe
##JCAMPDX= 6.0         $$ Bruker NMR JCAMP-DX V2.0
##DATA TYPE= NMR SPECTRUM
##DATA CLASS= NTUPLES
##ORIGIN= BRUKER
##OWNER= Administrator
$$ 1.72 TOPSPIN		Version 2.1
$$ 2012-12-01 20:52:04.940 -0500  Administrator@X
$$ Compression mode = diff/dup
##.OBSERVE FREQUENCY= 400.02188249412
##.OBSERVE NUCLEUS= ^1H
##.ACQUISITION MODE= SIMULTANEOUS (DQD)
##.ACQUISITION SCHEME= undefined
##.AVERAGES= 64
##.DIGITISER RES= 22
##SPECTROMETER/DATA SYSTEM= spect
##.PULSE SEQUENCE= noesygpps1d.comp
##.SOLVENT NAME= COFFEE_meoh
##.SHIFT REFERENCE= INTERNAL, COFFEE_meoh, 1, 14.96074
##AUDIT TRAIL= $$ (NUMBER, WHEN, WHO, WHERE, PROCESS, VERSION, WHAT)
$$ ##TITLE= Audit trail, TOPSPIN		Version 2.1
$$ ##JCAMPDX= 5.01
$$ ##ORIGIN= Bruker BioSpin GmbH
$$ ##OWNER= Administrator
$$ $$ E:\/data/COFFEE/nmr/AC1207_MCiAH12041_7155062_eldopUTpDe/12/pdata/1/auditp.txt
$$ ##AUDIT TRAIL=  $$ (NUMBER, WHEN, WHO, WHERE, PROCESS, VERSION, WHAT)
(   1,<2012-12-01 20:51:59.097 -0500>,<Administrator>,<X>,<go>,<TOPSPIN 2.1>,
      <created by zg
	started at 2012-12-01 20:40:28.831 -0500,
	POWCHK enabled, PULCHK disabled,
       configuration hash MD5:
       86 BA 57 50 F2 9D 5C 9B 26 00 A9 28 5F 66 2E 89
       data hash MD5: 64K
       84 DE 59 C7 10 C7 45 13 5F F3 BC 0A B9 49 0F F9>)
(   2,<2012-12-01 20:52:02.206 -0500>,<Administrator>,<X>,<proc1d>,<TOPSPIN 2.1>,
      <Start of raw data processing
       efp LB = 0.3 FT_mod = 6 PKNL = 1 PHC0 = 0 PHC1 = 0 SI = 128K 
       data hash MD5: 128K
       9A C5 A8 A0 E0 E1 C8 0C B0 C2 A0 FE 82 BE BB 03>)
(   3,<2012-12-01 20:52:03.222 -0500>,<Administrator>,<X>,<proc1d>,<TOPSPIN 2.1>,
      <pk PHC0 = -81.62842 PHC1 = 0 
       data hash MD5: 128K
       1E C4 61 61 0B 1F 10 87 9C 9A 38 2E CF E1 23 23>)
(   4,<2012-12-01 20:52:03.940 -0500>,<Administrator>,<X>,<proc1d>,<TOPSPIN 2.1>,
      <abs ABSG = 1 
       data hash MD5: 128K
       57 F9 12 F5 4F 86 CA D7 FF 7A CB A2 81 DD 2B B3>)
(   5,<2012-12-01 20:52:04.112 -0500>,<Administrator>,<X>,<proc1d>,<TOPSPIN 2.1>,
      <abs ABSG = 2 
       data hash MD5: 128K
       45 00 E1 64 DF C6 1C 35 4F 86 8B 8C 64 51 EA 0D>)
(   6,<2012-12-01 20:52:04.253 -0500>,<Administrator>,<X>,<proc1d>,<TOPSPIN 2.1>,
      <abs ABSG = 3 
       data hash MD5: 128K
       08 C6 24 82 07 0F C7 65 30 06 DF ED 50 4F DD 20>)
(   7,<2012-12-01 20:52:04.440 -0500>,<Administrator>,<X>,<proc1d>,<TOPSPIN 2.1>,
      <abs ABSG = 4 
       data hash MD5: 128K
       15 BA 57 EB 1F 9A F6 2D 47 73 30 16 FB C3 F5 27>)
(   8,<2012-12-01 20:52:04.612 -0500>,<Administrator>,<X>,<proc1d>,<TOPSPIN 2.1>,
      <abs ABSG = 5 
       data hash MD5: 128K
       56 34 4D B7 FF B9 19 8F A8 78 D5 44 D8 CE E5 94>)
$$ ##END=
$$ 
$$ $$ hash MD5
$$ $$ 3A B4 D3 61 31 79 6A 4F 98 1C E7 E3 CA 07 82 4C
##$RELAX= 
##$RELAX= 
##$RELAX= 
##$RELAX= 
##$RELAX= 
##$RELAX= 
##$RELAX= 
##$RELAX= 
$$ Bruker specific parameters
$$ --------------------------
##$DU= <E:\>
##$EXPNO= 12
$$ [...]
150 150 150 150 150 150 150 150
##$TP07= 0
##$TPNAME0= <>
##$TPNAME1= <>
##$TPNAME2= <>
##$TPNAME3= <>
##$TPNAME4= <>
##$TPNAME5= <>
##$TPNAME6= <>
##$TPNAME7= <>
##$TPOAL= (0..7)
0.5 0.5 0.5 0.5 0.5 0.5 0.5 0.5
##$TPOFFS= (0..7)
0 0 0 0 0 0 0 0
##$TUNHIN= 0
##$TUNHOUT= 0
##$TUNXOUT= 0
##$USERA1= <user>
##$USERA2= <user>
##$USERA3= <user>
##$USERA4= <user>
##$USERA5= <user>
##$V9= 5
##$VALIST= <valist>
##$VCLIST= <CCCCCCCCCCCCCCC>
##$VD= 0
##$VDLIST= <DDDDDDDDDDDDDDD>
##$VPLIST= <PPPPPPPPPPPPPPP>
##$VTLIST= <TTTTTTTTTTTTTTT>
##$WBST= 1024
##$WBSW= 4
##$XGAIN= (0..3)
0 0 0 0
##$XL= 0
##$YL= 0
##$YMAX_a= 6165064
##$YMIN_a= -12428859
##$ZGOPTNS= <>
##$ZL1= 120
##$ZL2= 120
##$ZL3= 120
##$ZL4= 120
##$ABSF1= 14.96074
##$ABSF2= -5.597442
##$ABSG= 5
##$ABSL= 3
##$ALPHA= 0
##$AQORDER= 0
##$ASSFAC= 0
##$ASSFACI= 0
##$ASSFACX= 0
##$ASSWID= 0
##$AUNMP= <proc_prof1d_extract.lims>
##$AXLEFT= 0
##$AXNAME= <>
##$AXNUC= <1H>
##$AXRIGHT= 0
##$AXTYPE= 0
##$AXUNIT= <>
##$AZFE= 0.1
##$AZFW= 0.1
##$BCFW= 0
##$BC_mod= 0
##$BYTORDP= 0
##$COROFFS= 0
##$CY= 15
##$DATMOD= 1
##$DC= 0
##$DFILT= <>
##$DTYPP= 0
##$F1P= 0
##$F2P= 0
##$FCOR= 0.5
##$FTSIZE= 131072
##$FT_mod= 6
##$GAMMA= 0
##$GB= 0
##$INTBC= 1
##$INTSCL= 1
##$ISEN= 128
##$LB= 0.3
##$LEV0= 0
##$LPBIN= 0
##$MAXI= 10000
##$MC2= 0
##$MEAN= 0
##$ME_mod= 0
##$MI= 0
##$NCOEF= 0
##$NC_proc= -2
##$NLEV= 6
##$NOISF1= 0
##$NOISF2= 0
##$NSP= 0
##$NTH_PI= 0
##$NZP= 0
##$OFFSET= 14.96074
##$PC= 1
##$PHC0= -81.62842
##$PHC1= 0
##$PH_mod= 1
##$PKNL= yes
##$PPARMOD= 0
##$PPDIAG= 0
##$PPIPTYP= 0
##$PPMPNUM= 2147483647
##$PPRESOL= 1
##$PSCAL= 4
##$PSIGN= 0
##$PYNMP= <proc.py>
##$REVERSE= no
##$SF= 400.02000974212
##$SI= 131072
##$SIGF1= 0
##$SIGF2= 0
##$SINO= 400
##$SIOLD= 131072
##$SPECTYP= <>
##$SREGLST= <1H.CDCl3>
##$SSB= 0
##$STSI= 131072
##$STSR= 0
##$SW_p= 8223.68421052631
##$SYMM= 0
##$S_DEV= 0
##$TDeff= 65536
##$TDoff= 0
##$TI= <>
##$TILT= no
##$TM1= 0
##$TM2= 0
##$TOPLEV= 0
##$USERP1= <user>
##$USERP2= <user>
##$USERP3= <user>
##$USERP4= <user>
##$USERP5= <user>
##$WDW= 1
##$XDIM= 131072
##$YMAX_p= 381076537
##$YMIN_p= -13035
##$CURPLOT= <Network HP LaserJet P1505>
##$CURPRIN= <$Network HP LaserJet P1505>
##$DFORMAT= <normdp>
##$LAYOUT= <+/1D_H.xwp>
##$LFORMAT= <normlp>
##$PFORMAT= <normpl>
##$SURQMSG= 1
$$ End of Bruker specific parameters
$$ ---------------------------------
##NTUPLES= NMR SPECTRUM
##VAR_NAME=  FREQUENCY,     SPECTRUM/REAL,   SPECTRUM/IMAG
##SYMBOL=    X,             R,               I
##VAR_TYPE=  INDEPENDENT,   DEPENDENT,       DEPENDENT
##VAR_FORM=  AFFN,          ASDF,            ASDF
##VAR_DIM=   131072,        131072,          131072
##UNITS=     HZ,            ARBITRARY UNITS, ARBITRARY UNITS
##FACTOR=    0.0627417313425164, 1,          1
##FIRST=     8223.62146879497, -865,         -60569
##LAST=      0,             1112,            -61485
##MIN=       0,             -13035,          0
##MAX=       8223.62146879497, 381076537,    0
$$ Real data points
##PAGE= N=1
##DATA TABLE= (X++(R..R)), XYDATA
$$ [...]
65284 129847 130990 131843 131966 131354 130446 129728 129228 128493 127224 125753 124681 124147 123795 123347 122846 122352 121788
65267 121788 121170 120707 120589 120848 121418 122059 122352 122124 121836 122095 122842 123513 124000 124751 125765 126242 125776 125244
65249 125244 125798 127298 128464 128420 127440 126271 125428 125141 125376 125679 125542 125057 124702 124360 123248 121149 119108
65232 119108 118236 118272 118049 117134 116221 115879 115768 115371 114879 114817 115213 115642 115871 115995 116059 116010 115998 116287 116813 117164
65212 117164 117103 116825 116613 116557 116678 117011 117417 117626 117672 117945 118590 119111 118958 118293 117834 118016 118664 119334 119629 119255
65192 119255 118184 116855 115890 115537 115600 115897 116421 117041 117450 117587 117728 118005 118146 118013 118115 119223 121475 124106
65174 124106 126089 126947 127029 127112 127707 128680 129530 129921 129802 129151 128077 127184 127318 128608 130108 130814 130777 130762 131078
65155 131078 131383 131627 132473 134465 137252 140064 142676 145378 148120 150236 151303 152004 153763 157501 162910
65140 162910 169021 175293 181979 189513 197890 206714 215548 223962 231443 237705 243149 248635 254615 260656
65126 260656 265988 270291 273751 276582 278836 280586 281917 282631 282315 280829 278464 275457 271674 267063 262107
65111 262107 257345 252584 247131 240887 234611 228921 223591 218203 212976 208297 203752 198496 192593 187267
65097 187267 183420 180455 177013 172596 167953 164003 160823 157795 154423 150758 147129 143704 140450 137435
65083 137435 134958 133287 132427 132302 132982 134437 136179 137553 138364 138870 139118 138764 137749 136722 136471 137162
65067 137162 138413 139791 140908 141327 140888 140025 139376 139150 139159 139290 139475 139303 138291 136633 135205 134582 134474
65050 134474 134338 134132 134105 134217 134253 134351 134903 135850 136554 136551 136171 136156 136745 137336 137049 135539 133329 131394 130390
65031 130390 130114 129721 128546 126717 124912 123562 122505 121429 120413 119779 119549 119332 118807 118083 117498 117235
65015 117235 117250 117425 117664 117889 118125 118585 119545 121033 122615 123618 123753 123572 124105 125834 128192 130260 131786
64998 131786 133162 134573 135734 136567 137568 139119 140855 142131 142887 143585 144483 145394 146148 146865 147709 148660
64982 148660 149592 150377 150945 151444 152268 153631 155188 156422 157425 158930 161436 164599 167598 169799 170899
64967 170899 170755 169397 167083 164052 160355 156149 152109 149154 147634 146902 145844 143771 140825 137722 135247
64952 135247 133801 133153 132599 131602 130340 129417 129008 128624 127874 127096 126828 126968 126953 126644 126431 126516 126688 126897 127332
64933 127332 127707 127170 125389 123169 121516 120603 120163 120303 121197 122421 123449 124531 126211 128117 129154 128955
64917 128955 128245 127677 127168 126604 126298 126328 126175 125513 124786 124509 124512 124380 124142 124027 123948 123835 124155 125482 127738
64898 127738 130331 132927 135597 138365 141028 143467 145882 148746 152576 157426 162538 166951 170694 174797
64884 174797 179748 184637 188511 191926 196168 201298 206100 209929 213462 217360 221207 224260 226480 228200
64870 228200 229315 229339 227959 225183 221330 217225 213940 211840 210171 207977 205099 201964 198867 196035 193943
64855 193943 192768 191730 189798 187041 184511 182638 180559 177368 173386 169601 166326 163079 159611 156364
64841 156364 153778 151651 149425 146884 144339 142223 140643 139291 137804 136289 135446 135955 137660 139519 140521
64826 140521 140502 139977 139379 138760 138194 137999 138378 139040 139480 139580 139704 140233 141225 142556 144112 145687 146925 147657
64808 147657 148336 149902 153078 157751 162996 167686 171229 173919 176623 180030 184161 188597 193069 197627
64794 197627 202230 206430 209628 211527 212210 211832 210405 207917 204581 200899 197412 194277 191087 187302 182946
64779 182946 178752 175550 173647 172889 173022 173718 174465 174852 174971 175245 175867 176647 177367 177979 178494 179104 180401
64762 180401 182968 186594 190365 193808 197521 202324 208109 213975 219238 223877 228151 232241 236219 240004
64748 240004 243380 246311 249117 252063 254939 257448 259861 262750 266056 268920 270606 271292 271763 272486 273077
64733 273077 272491 269847 265253 259755 254266 248795 243072 237534 232973 229274 225365 220676 215980 212409
64719 212409 210167 208622 207217 205862 204751 204190 204409 205205 206027 206656 207520 209099 211393 214201 217489 221046
64703 221046 224285 226925 229497 232487 235270 236655 236390 235349 234158 232383 229276 224733 219182 213084
64689 213084 206940 201396 196811 192871 188996 185068 181441 178323 175501 172775 170403 168872 168316 168413 168888
64674 168888 169866 171508 173494 175282 176889 178976 181976 185520 189031 192550 196550 201123 205827 210265
64660 210265 214356 218093 221414 224417 227309 230019 232121 233205 233075 231598 228773 225063 221332 218177
64646 218177 215477 212785 209927 207092 204490 202254 200650 200137 201037 203140 205777 208394 211028 214047 217454
64631 217454 220854 224238 228374 233965 240654 247422 253895 260729 268606 277298 285867 293413 299460 303972
64617 303972 307163 309011 308871 305975 300457 293461 285992 278097 269544 260803 252731 245525 238632 231730
64603 231730 225203 219475 214396 209640 205393 202225 200305 199061 197729 196040 194253 192656 191317 190352
64589 190352 190141 190968 192522 194104 195416 196892 199122 202192 205793 209740 214022 218397 222338 225548 228320
64574 228320 231186 234396 237941 241996 246973 252953 259300 265122 270060 274421 278534 282276 285304 287417
64560 287417 288461 288098 285973 282009 276352 269201 260966 252356 243860 235283 226257 217230 209389 203452
64546 203452 199003 195262 192088 189891 188870 188731 188941 188966 188485 187760 187656 188899 191374 194404 197581 200889
64530 200889 204046 206232 206704 205397 202821 199603 196320 193492 191340 189570 187652 185422 183252 181557
64516 181557 180312 179247 178435 178296 178898 179619 179844 179816 180285 181348 182198 182286 182162 182707 183845 184663 184683 184428
64498 184428 184682 185734 187598 190459 194473 199349 204547 209781 215068 220436 225907 231668 237842 243996
64484 243996 249241 252979 255322 256705 257425 257724 257930 258140 257991 257167 255984 255041 254415 253697 252780 252003 251416
64467 251416 250463 248711 246320 243491 240052 236174 232968 231536 231640 232101 232528 233829 236867 241256 245801
64452 245801 249614 252454 254446 255907 257205 258486 259647 260662 261696 262810 263941 265361 267746 271484
64438 271484 276240 281439 286886 292618 298557 304732 311667 320114 330533 343101 358010 375398 395133
64425 395133 417079 441545 469205 500749 536883 578470 626286 680713 741982 810496 886439
64414 886439 969159 1057323 1149505 1244070 1338574 1430041 1516142 1595647 1667495 1729908 1780807
64403 1780807 1818705 1842819 1852662 1848134 1829920 1799228 1756949 1703411 1639069 1565201 1483747 1396731
64391 1396731 1306100 1213965 1122538 1033674 948687 868729 795060 728591 669257 616172 568499
64380 568499 525980 488679 456554 429365 406627 387433 370604 355338 341571 329568 319354
64369 319354 310756 303665 297899 292941 288170 283332 278522 273770 268873 263557 257611 250987 244012 237293
64355 237293 231149 225283 219345 213599 208606 204413 200621 197275 195098 194637 195580 197127 198765 200541 202862
64340 202862 206196 210692 215898 220959 225106 227829 228763 227875 225814 223602 221771 220103 218287 216372 214443
64325 214443 212341 210056 208008 206577 205647 204990 204799 205340 206244 206639 206053 204941 204275 204749 206288 208152
64309 208152 209596 210569 211599 212906 213956 214179 213826 213602 213567 212925 210965 207790 203988 199929 195697 191494
64293 191494 187780 184936 182861 180963 178614 175734 172960 171191 170864 171560 172213 171856 170445 168997 168721
64278 168721 169924 171966 174305 177084 180442 183785 186369 188430 191088 195075 200075 205401 210777 216191
64264 216191 221447 226262 230580 234408 237469 239381 240158 240261 240092 239623 238675 237469 236728 237051 238150 238887
64248 238887 238284 236423 234173 232081 229868 227040 223583 219780 215669 211117 206342 201950 198325 195274
64234 195274 192399 189630 187223 185422 184338 184081 184679 185725 186352 185844 184348 182755 181829 181606 181693 181890
64218 181890 182222 182523 182417 181764 180868 180118 179662 179522 179745 180228 180592 180492 179909 178988 177789 176434 175287 174562
64200 174562 173925 172931 171845 171457 171939 172424 172103 171328 171157 172030 173455 174906 176461 178376 180560 182832
64184 182832 185453 189063 194142 200719 208511 217096 226031 235025 244021 252920 261172 267867 272314 274456
64170 274456 274637 273129 269986 265278 259289 252434 245082 237493 229918 222740 216420 211152 206509 201700
64156 201700 196407 191287 187308 184599 182304 179730 177247 175719 175256 175059 174459 173648 173234 173503 174412 175992
64140 175992 178297 181080 183938 186891 190504 195218 200658 205716 209384 211445 212401 212763 212554 211645 210386
64125 210386 209492 209143 208587 207009 204597 202373 201058 200519 200314 200350 200877 202187 204409 207408 210790 214323
64109 214323 218363 223511 229774 236506 243365 250900 259738 269500 278970 287189 293976 299442 303524 306203
64095 306203 307989 309901 312863 317058 321963 327112 332727 339295 346572 353457 359036 363266 366349 367865
64081 367865 367056 363716 358290 351233 342787 333344 323519 313805 304456 295653 287410 279423 271501 264173
64067 264173 258364 254327 251315 248482 245765 243707 242730 242799 243531 244423 245146 245768 246637 247988 249760 251705
64051 251705 253473 254739 255575 256598 258316 260449 262429 264560 268013 273516 280663 288752 297633 307314
64037 307314 317387 327463 337712 348248 358287 366721 373421 379254 384684 389007 391223 391207 389651
64024 389651 387151 383686 378935 372821 365712 358215 350916 344291 338715 334326 330915 328128 325853 324188
64010 324188 322985 321727 319971 317700 315002 311688 307551 302865 298288 294289 290853 287727 284784 282147
63996 282147 280043 278492 277164 275719 274300 273404 273175 273232 273369 274014 275628 277989 280467 282716 284727 286519
63980 286519 288348 290976 295082 300416 306096 311761 317891 324956 332843 341303 350383 360093 370099 380138
63966 380138 390446 401397 412889 424517 436290 448844 462794 478075 494151 510921 529251
63955 529251 550404 574939 602418 632351 665241 702510 745624 795588 853149 919135 994576
63944 994576 1080684 1178615 1289054 1412110 1547757 1695987 1856106 2026135 2203467 2386025
63934 2386025 2572229 2759777 2944985 3123389 3290596 3442617 3576076 3688394 3777425 3840869
63924 3840869 3876574 3883621 3862536 3814292 3739696 3640118 3518250 3377613 3221677 3053874 2878075
63913 2878075 2698432 2518743 2342142 2171132 2007607 1853134 1709456 1578316 1460446
63904 1460446 1355101 1261071 1177765 1104793 1040951 984537 934658 891486 855091 824582 798558
63893 798558 775852 755620 737213 720419 705605 693207 683065 674393 666393 658774 651627 644856
63881 644856 637935 630491 623066 616899 612778 610454 609443 610057 613207 619476 628856 641189 656271 673580
63867 673580 692382 712203 732819 753935 775307 797054 819217 841081 861601 880538 898345
63856 898345 914663 927826 936440 940833 942283 941287 937432 930607 921355 909950 895982 879245 860468
63843 860468 840675 820034 797800 773361 747120 720274 693903 668334 643328 618647 594291
63832 594291 570283 546563 523238 500682 479152 458488 438470 419355 401785 386142 372207
63821 372207 359423 347281 335559 324489 314677 306477 299372 292297 284768 277346 270761 264883 258979
63808 258979 252798 246900 241908 237932 234874 232799 231612 230619 228940 226391 223639 221419 219901 218828
63794 218828 217905 216837 215381 213653 212178 211301 210718 209960 209101 208478 207810 206290 203795 201395 200200 200050
63778 200050 199867 199032 197847 196766 195789 194747 193665 192554 191246 189755 188620 188482 189357 190576 191457 191817
63762 191817 191819 191546 190959 190181 189620 189676 190367 191318 192109 192559 192696 192636 192581 192794 193382 194141 194732 194983 194894 194479 193877
63741 193877 193614 194354 196200 198454 200300 201529 202393 202967 203090 202968 203414 205153 207985 210843 212774 213803
63725 213803 214824 216709 219580 222972 226550 230414 234714 239272 243823 248412 253172 257817 261764 264767
63711 264767 267011 268478 268745 267779 266467 265771 265500 264564 262434 259800 257584 255875 254240 252632 251415
63696 251415 250610 249722 248482 247340 246977 247492 248385 249283 250458 252458 255333 258446 261175 263658 266601 270317
63680 270317 274249 277539 279829 281336 282403 283329 284411 285699 286713 286865 286299 285982 286725 288354 289989
63665 289989 290964 291297 291480 292065 293328 295104 296954 298493 299394 299079 296863 292699 287509 282375 277569 272723
63649 272723 267741 262989 258660 254532 250540 247108 244623 242955 241786 241140 241244 242067 243392 245271 247966
63634 247966 251342 254686 257380 259630 262302 266049 270772 275955 281313 286897 292666 298388 304103 310407
63620 310407 317832 326011 333861 340718 347081 354172 362946 373620 385867 399309 413946 430275 448932
63607 448932 470113 493489 518665 545532 574099 604211 635559 667691 699776 730535 758645
63596 758645 783182 803641 819736 831369 838586 841459 840261 835936 830038 823815 817484 810543 802398
63583 802398 792311 779177 762163 741583 718559 693784 667220 639116 610672 583340 557894
63572 557894 534566 513703 495747 480631 467700 456376 446747 439374 434608 432200 431638 432754 435734
63559 435734 440456 446162 452127 458471 465931 474944 485334 496815 509293 522669 536816 551870 568179
63546 568179 585956 605495 627754 654130 685375 721167 760755 803213 846630 887755 923247
63535 923247 951098 970599 981613 984704 981604 974550 965117 954210 943011 933008 924784 917303 908684
63522 908684 897436 882864 864763 843015 817368 787593 754042 718017 681278 645156 610333
63511 610333 577320 546656 518588 492940 469455 448046 428709 411440 396220 382803 370647
63500 370647 359418 349565 341901 336512 332435 328507 324155 319334 314280 309545 305843 303437 301893 300657
63486 300657 299638 298957 298518 298176 298171 298925 300412 302070 303436 304656 306268 308594 311523 314879 318750 323232
63470 323232 327885 331770 334160 334999 334531 332870 330215 327146 324168 321148 317658 313766 309962 306468 303232
63455 303232 300522 298805 297944 297185 296177 295384 295248 295559 295954 296497 297446 299042 301772 306142 311687 316924
63439 316924 321037 325144 331156 339761 350336 362554 377104 394784 415689 439578 466380 495865
63427 495865 526987 557843 586281 610663 630317 645349 656205 663628 669040 674391 681256 690390
63415 690390 702416 718413 739268 764892 794740 828693 866510 906559 946061 982753 1015578
63404 1015578 1043606 1065287 1079376 1086100 1086904 1083363 1076707 1067980 1058011 1047163 1035292 1021920 1006351
63391 1006351 987816 965688 939553 909187 874758 837178 797961 758618 720278 683834 650056
63380 650056 619406 591968 567685 546447 527926 511683 497594 485949 476993 470545 466162 463474
63368 463474 462347 462949 465700 470894 478282 487279 497554 509206 522484 537751 555679 576896 601268
63355 601268 628014 656654 687342 720105 754410 789883 826796 865190 903872 940932 975002
63344 975002 1005381 1031069 1050504 1062504 1067129 1065507 1059227 1050009 1039534 1029031 1018844 1008384
63332 1008384 996481 981937 963932 942026 915934 885536 851293 814518 777046 740588 706274
63321 706274 674570 645465 618938 595416 575735 560606 550191 543949 540393 536928 530629 519758
63309 519758 504506 486181 466136 445617 425917 407878 391462 376415 363108 352122 343227 335538
63297 335538 328591 322499 317059 311651 306319 302124 299881 299026 298201 296482 293641 289762 285333 281364 278645
63282 278645 276905 275281 273556 272329 271900 271641 270816 269519 268418 267856 267606 267411 267321 267450 267687 267819 267803
63265 267803 267791 267938 268314 269054 270458 272799 275961 279417 282670 285692 288811 292241 295869 299503 303107
63250 303107 306759 310611 314960 320117 325988 332021 337885 344041 351293 359804 369034 378707 389383 401751
63236 401751 415699 430440 445401 460633 476533 493484 511731 531249 551727 572843 594416
63225 594416 616075 637036 656762 675802 695364 715924 736781 757235 777656 798918 821115
63214 821115 843383 864848 885195 904208 921162 934912 944433 949111 948594 942588 931020 914458
63202 914458 894142 871323 846627 820355 793373 767234 743258 721780 702558 685586 671274
63191 671274 660173 652881 649978 651616 657218 665913 677171 690897 707113 725884 747291 771056
63179 771056 796287 822029 847997 874396 901112 927558 953355 978698 1003970 1029273 1054369
63168 1054369 1078654 1101093 1120525 1136193 1147772 1154859 1156832 1153206 1143802 1128402 1106736 1079005
63156 1079005 1046100 1009077 968777 926179 882768 840058 798835 759165 721102 685092 651719
63145 651719 621314 593895 569342 547546 528354 511429 496273 482579 470492 460274 451705 444015
63133 444015 436533 429261 422807 417884 414794 413120 411918 410482 409016 408296 408677 409756 411012 412381 414070
63118 414070 416185 418729 421608 424502 427105 429657 432815 436750 440830 444505 447997 451687 455354 458590
63104 458590 461600 464867 468267 471272 473911 476729 479706 481985 482994 483313 484013 485458 487072 488140 488555
63089 488555 488866 489648 490819 491718 491966 492000 492364 492788 492545 491658 491075 491492 492656 494110 496067 499135 503575
63072 503575 509168 515501 522031 528306 534529 541655 550438 560649 571560 582949 595184 608603 623405
63059 623405 639994 658795 679698 702218 726363 752824 782145 814103 848184 884385 923302
63048 923302 965542 1011174 1059493 1109198 1159049 1208601 1258253 1308523 1359451 1410752 1462246
63037 1462246 1513858 1565392 1616627 1667646 1718843 1770524 1822445 1873604 1922353 1966783 2005145
63026 2005145 2035981 2057980 2069939 2070955 2060553 2038670 2005885 1963779 1914719 1860829 1803293
63015 1803293 1742968 1681516 1621514 1565350 1514357 1469008 1429580 1396479 1370288 1351787 1341715
63004 1341715 1340206 1346505 1359452 1378243 1402659 1432663 1467914 1507582 1550483 1595498 1642023 1690019
62992 1690019 1739510 1790081 1840902 1891109 1940001 1986997 2031616 2073484 2112209 2147170 2177378
62981 2177378 2201299 2216828 2221839 2215174 2196925 2167477 2126599 2074035 2010830 1939426 1862333 1781213
62969 1781213 1697388 1612529 1528436 1446630 1368539 1295597 1228630 1167425 1111441 1060668 1015278
62958 1015278 974746 938064 904742 874871 848142 823522 800175 778131 757782 739134 721829
62947 721829 705455 689509 673482 657308 641479 626325 611473 596380 581125 566302 552366
62936 552366 539545 528189 518619 510593 503325 496156 488973 481999 475533 469907 465284 461377 457687 454150
62922 454150 451240 449256 447764 446028 443855 441800 440561 440327 440670 440948 440780 440247 439657 439176 438683 437946
62906 437946 436804 435196 433152 430753 427957 424493 420181 415459 411327 408529 406840 405393 403642 401770
62892 401770 400159 398796 397493 396540 396707 398406 401027 403404 404897 405783 406641 407647 408628 409503 410377 411301
62876 411301 412204 413047 413838 414465 414708 414424 413716 412936 412559 412823 413356 413379 412558 411556 411383 412244 413335 413741
62858 413741 413217 412129 411008 410234 409827 409412 408710 408125 408503 410194 412689 415282 417661 419636 420840 421151
62842 421151 421115 421427 422131 422678 422667 422147 421343 420495 419928 419859 420069 419992 419181 417576 415494 413599 412680 413025 414014
62823 414014 414718 414894 415076 415708 416616 417424 418121 419008 420358 422301 424869 427963 431359 434811 438080 440994
62807 440994 443634 446424 449713 453400 457283 461669 467100 473484 480097 486671 493931 502661 512769 523787
62793 523787 535889 549702 565201 581505 597976 615077 633917 655232 679051 705202 733907
62782 733907 765918 802214 843544 890207 942185 999370 1061633 1128811 1200756 1277254 1357626
62771 1357626 1440404 1523580 1605271 1683983 1758129 1825431 1883031 1928292 1959484 1975749 1976644 1961985
62759 1961985 1932317 1889361 1835772 1774275 1707007 1635507 1561077 1485027 1408700 1333350 1259994
62748 1259994 1189343 1121958 1058420 999225 944508 894019 847483 804854 766206 731497 700536
62737 700536 673073 648827 627491 608692 591910 576553 562348 549622 538950 530493 523924 519000
62725 519000 515757 514011 513111 512572 512678 514075 516898 520687 525085 530258 536609 544373 553572 564161 576195
62710 576195 589931 605732 623751 643858 666083 691057 719820 753165 791336 834293 882094
62699 882094 935009 993428 1057673 1127830 1203831 1285687 1373392 1466348 1563002 1661251 1759132
62688 1759132 1854955 1946836 2032303 2108323 2171797 2220383 2253035 2269499 2269155 2250894 2214522 2161826
62676 2161826 2095648 2018242 1931274 1837145 1739255 1640677 1543224 1448010 1356231 1269035 1187150
62665 1187150 1111061 1041133 977264 918820 865336 816943 773754 735151 700107 668028 638963
62654 638963 613138 590529 570687 552806 536165 520700 506858 494780 484001 474063 464847 455980
62642 455980 446648 436666 427204 419637 413965 409144 404750 401320 399096 397497 396188 395797 396956 399186
62628 399186 401238 402219 401935 400568 398561 396651 395447 394932 394648 394304 393910 393456 392862 392276 392154 392956 394897
62611 394897 397996 402105 406834 411652 416263 420905 426210 432753 440763 450242 461260 473933 488073
62598 488073 503166 519023 536377 556453 579835 606133 634866 666180 700370 737055 775391
62587 775391 814859 855158 895238 933071 966726 995360 1018878 1036912 1048500 1052619 1048721 1036890
62575 1036890 1017810 992671 962825 929425 893413 855708 817223 778773 741230 705681 673009
62564 673009 643218 615523 589319 564830 542595 522640 504545 488145 473669 461143 450167
62553 450167 440466 432253 425665 420109 414703 409334 404842 401941 400256 398695 396642 394531 393283 393392
62539 393392 394650 396515 398575 400648 402641 404516 406473 409050 412758 417497 422496 427024 431139 435536
62525 435536 440739 446778 453684 461944 472142 484411 498541 514574 533086 554909 580771 611040
62513 611040 645561 683834 725618 771192 820700 873398 928021 983741 1040055 1095593 1147847
62502 1147847 1194508 1234590 1267757 1293069 1309017 1314618 1309939 1295747 1273164 1243602 1208559 1169502
62490 1169502 1128160 1086658 1046763 1009155 973859 941298 912373 887727 867538 852015 841438
62479 841438 835653 834171 836843 843839 854947 869614 887753 909614 934456 960137 984514 1006632
62467 1006632 1026060 1041838 1052891 1059050 1060752 1057988 1050175 1036926 1018231 994004 964170 929353
62455 929353 891047 851038 810894 771763 734123 697851 663031 630617 601804 576802 554815
62444 554815 535237 518279 504264 492865 483393 475524 469461 465516 463695 463563 464472 466010 468166 470950
62430 470950 474036 477009 479712 481962 483119 482454 479885 475900 470870 464929 458400 451648 444442 436176
62416 436176 426970 417948 410078 403280 397029 391306 386380 382044 377704 373204 369039 365728 363247 361225
62402 361225 359493 358257 357699 357434 356653 355002 353163 352165 352225 352711 353176 353878 355073 356404 357353 357931 358559
62385 358559 359492 360640 361758 362625 363285 364192 365763 367698 369271 370521 372623 376680 382608 389641 397410
62370 397410 405950 415065 424391 433918 443901 454466 465831 478634 493368 509634 526706 544751
62358 544751 564910 588228 615196 646205 681621 721273 764665 811888 863517 919281 977549
62347 977549 1036434 1094616 1150550 1201715 1245593 1281099 1308327 1327264 1337560 1339276 1332896 1318558
62335 1318558 1296137 1266296 1230729 1191008 1147862 1102028 1055144 1009087 964757 922243 882043
62324 882043 845323 812782 783953 758041 734952 715003 697908 682669 668372 654540 640663
62313 640663 626004 610191 593608 576854 560074 543192 526511 510605 495704 481621 468321
62302 468321 456167 445505 436358 428615 422225 417068 412892 409542 407015 405139 403446 401587 399726 398331
62288 398331 397712 397869 398609 399591 400495 401356 402632 404637 407067 409405 411736 414751 418827 423499 428093 432619
62272 432619 437708 443724 450314 456932 463553 470594 478303 486555 495313 504953 515901 528148 541537
62259 541537 556449 573894 594803 619554 648264 681231 718848 761338 808875 861663 919459
62248 919459 980972 1044039 1106452 1166402 1222285 1272542 1315935 1351701 1379187 1397538 1406049 1404748
62236 1404748 1394334 1375398 1347938 1311851 1267947 1218178 1164624 1108357 1049669 989509 930186
62225 930186 874199 822570 774832 730553 690249 654638 623598 596342 572262 551148 532781
62214 532781 516824 503124 491677 482228 474167 466914 460209 454003 448313 443250 438943 435342 432248
62201 432248 429659 427975 427779 429387 432530 436382 440143 443885 448720 455735 464797 474814 485128 496103
62187 496103 508190 521060 534134 547501 561709 576870 592576 608500 624500 640076 654381
62176 654381 666926 677810 687057 694224 698935 701476 702565 702882 703199 704631 708238 714465 723437 735813
62162 735813 752894 775721 804301 837808 875219 915564 957754 1000440 1042044 1080867 1115265
62151 1115265 1143891 1165774 1180278 1187240 1187283 1181637 1171197 1155809 1134794 1108156 1076838 1041817
62139 1041817 1003623 963129 922264 883187 846941 813573 783467 757710 736921 720461 707286
62128 707286 697090 690065 685995 684203 684182 685617 687982 690777 694201 698937 705103 711892 718380 724073
62114 724073 728476 730780 730590 728666 726347 724298 722178 719466 716074 712002 706790 699752 690742 680428
62100 680428 669753 659356 649689 641385 635008 630411 626928 624475 623941 626008 630025 634758 639926 646158
62086 646158 653514 661097 668406 676129 685042 694844 704763 714837 725863 738395 752425 767913 784965
62073 784965 803507 823237 843945 865549 887852 910546 933370 956036 978223 999891 1021368
62062 1021368 1042830 1064124 1085598 1108755 1135307 1165509 1197927 1230768 1262868 1293438 1321517
62051 1321517 1346020 1366049 1381022 1390740 1395281 1394542 1387940 1374896 1355440 1329962 1298570 1261306
62039 1261306 1218857 1172476 1123270 1072300 1021258 972036 925293 880244 836375 794650 756475
62028 756475 722103 690740 661840 635579 612265 591875 574186 558890 545560 533723 522910
62017 522910 512572 502202 491776 481776 472594 464201 456505 449545 443060 436412 429410 422765 417262
62004 417262 412859 409212 406608 405629 406121 407348 409113 411935 416004 420595 424773 428157 430820 432899 434553
61989 434553 435973 437182 437992 438157 437334 435015 430929 425529 419651 413734 407766 401852 396208 390596 384530
61974 384530 378266 372848 368751 365140 361008 356538 352703 349941 347981 346743 346554 347405 348675 349893 351315
61959 351315 353407 356034 358529 360438 361931 363466 365207 366914 368382 369877 372010 375138 379008 383065
61945 383065 387008 390924 394964 399078 403201 407654 413263 420931 430984 442963 456157 470233 485207
61932 485207 500915 516882 532750 548524 564208 579474 593897 607260 619426 630148 639307 647104
61920 647104 653603 658215 660112 659223 656446 652776 648510 643438 637530 631219 625208 620233 616873 615375
61906 615375 615664 617710 621861 628634 638172 649947 663047 676610 689930 702198 712301 719090 721963
61893 721963 721238 717815 712401 705044 695422 683476 669661 654637 638892 622752 606638 591092 576551
61880 576551 563164 550859 539421 528497 517754 507240 497424 488635 480562 472622 464799 457681 451538
61867 451538 445812 439939 434397 430386 428389 427564 426776 425942 426033 427931 431658 436771 443154 451164 461137
61852 461137 473009 486490 501400 517801 535940 556153 578668 603274 629314 656184 683708
61841 683708 711778 739719 766348 790739 812515 831305 846306 856736 862548 864363 862856 858461
61829 858461 851583 842869 833331 824298 817030 812188 809867 810303 814123 821520 831614 843260 856142 870217
61815 870217 884162 895411 902062 903984 901642 894675 882396 865098 843959 819858 793121 764376
61803 764376 734853 705592 676919 648995 622467 598235 576769 557867 540979 525621 511564
61792 511564 498699 486780 475491 464905 455646 448221 442279 436862 431396 426074 421248 416902 412858
61779 412858 409168 406021 403478 401463 399865 398562 397460 396527 395613 394278 392181 389699 387732 386675 385964
61764 385964 384942 383792 383261 383679 384745 386173 388035 390386 392851 394830 395961 396309 396110 395462 394362
61749 394362 393079 392284 392511 393540 394645 395419 395919 395945 394816 392313 389299 386853 385126 383642 382418 382010
61733 382010 382541 383465 384408 385536 386861 387861 388188 388314 388993 390322 391736 392768 393577 394787 396866 399537
61717 399537 401879 403327 404547 406797 410367 414284 417767 421223 425252 429329 432299 433838 434529 434590 433457
61702 433457 430855 427582 424816 422994 421613 419819 416973 413027 408578 404397 400649 396792 392320 387426
61688 387426 382781 378965 376244 374599 373664 372803 371567 370007 368367 366635 364669 362660 361088 360148 359472
61673 359472 358534 357206 355742 354337 352871 351185 349494 348312 347903 347920 347797 347430 347229 347458 347757 347446 346156
61656 346156 344072 341766 339900 338904 338694 338778 338745 338568 338353 338022 337553 337337 337978 339750 342480 345889 349653
61639 349653 353198 355869 357575 358990 360881 363377 366021 368242 369585 369709 368533 366312 363379 359895
61625 359895 356051 352260 348816 345516 342041 338666 336138 334767 334113 333732 333738 334294 334977 335131 334603 333696 332526
61608 332526 330963 329149 327488 325963 323945 320957 317320 313758 310507 307117 303041 298265 293432 289364
61594 289364 286373 284007 281624 279125 276815 274523 271471 267341 263008 259683 257601 256067 254591 253273
61580 253273 252142 250831 249152 247417 245856 244177 242087 239916 238322 237569 237455 237706 238103 238350 238227 237809
61564 237809 237300 236750 236219 236043 236485 237202 237512 237220 236808 236724 236922 237196 237568 238074 238558 238995 239730 241022 242527
61545 242527 243563 243834 243624 243478 243943 245425 247764 249981 250954 250531 249688 249424 249809 250287 250580 250969 251823
61528 251823 253150 254540 255406 255369 254643 254011 254200 255235 256435 256974 256395 254760 252548 250370 248568 247050
61512 247050 245594 244223 243111 242249 241471 240769 240322 240161 240116 240124 240337 240761 241057 240915 240471 240156 240214 240531 240875
61493 240875 241115 241211 241134 240864 240482 240245 240476 241198 241908 241958 241192 240043 238942 237925 236991 236507 236915 238180
61475 238180 239838 241507 243109 244720 246482 248591 251024 253306 254920 255938 256881 257941 258721 258927 258891
61460 258891 259099 259499 259689 259611 259601 259750 259623 258850 257731 257013 257112 257782 258543 259182 259732 260230 260788 261826 263753
61441 263753 266220 268062 268395 267662 267249 268044 269687 271254 272354 273369 274906 277202 280022 282933 285643
61426 285643 288073 290096 291408 291848 291770 291802 292222 292759 293037 293020 293013 293438 294598 296392 298310 299999 301796 304282
61408 304282 307361 310263 312509 314238 315460 315698 314786 313358 311973 310306 307898 305264 303382 302370 301524
61393 301524 300541 299773 299206 298190 296510 294981 294502 295053 296017 296976 297758 298158 298136 298046 298269 298834 299641 300724
61375 300724 301950 302837 303130 303292 303948 305006 305827 306114 306167 306270 306289 305965 305297 304590 304309 304816 306026 307408
61357 307408 308565 309629 310865 312166 313431 315218 318379 322999 328282 333551 338821 344259 349657 354761
61343 354761 359609 364233 368423 372162 375862 379756 383466 386728 390184 394750 400311 405776 410503 415005
61329 415005 419964 425109 429482 432501 434339 435488 436316 436963 437297 436993 435953 434639 433717 433326 432938 432047
61313 432047 430851 430136 430571 432208 434648 437617 441345 446263 452362 459127 466360 474825 485535 498306
61299 498306 511480 523332 533345 541789 548557 553166 555787 557405 558662 559047 557665 554447 550157 545404
61285 545404 540172 534267 527813 521142 514394 507401 499857 491600 482853 474233 466440 459920 454815 451105
61271 451105 448631 447023 445861 444955 444411 444386 444841 445527 446209 447006 448548 451497 455718 460111 463643 466517
61255 466517 469907 474511 479703 484307 487838 490731 493597 496674 499949 503385 506881 510180 513116 515905
61241 515905 519036 522682 526237 528695 529629 529693 529969 530822 531648 531671 530719 529118 527177 525092 523210 522008
61225 522008 521746 522335 523632 525725 528809 532889 537753 543176 549075 555436 562227 569370 576691 583810 590293
61210 590293 596167 602095 608646 615346 620873 624414 626495 628232 630175 632237 634363 636629 638815 640617
61196 640617 642364 644976 648984 654093 659915 666648 674676 683835 693432 702743 711226 718555 724798 730349
61182 730349 735342 739301 741665 742502 742403 741836 740969 740036 739437 739340 739401 738955 737477 734934 731844 728848 726106
61165 726106 723170 719550 715214 710372 705009 698918 692084 684829 677573 670549 663621 656288 648048 638865
61151 638865 629108 619032 608776 598945 590611 584276 579257 574560 569983 565796 561759 557236 552090 546713
61137 546713 541158 535016 528272 521667 515974 511423 507925 505346 503384 501682 500348 499977 500984 503235
61123 503235 506436 510508 515446 521241 528127 536439 546077 556493 567427 579304 592783 608315 626250
61110 626250 646776 669382 692821 716001 738723 761387 784349 807718 831277 854287 875784
61099 875784 895418 913604 930529 945529 957779 967088 973469 976544 976098 972877 967992 961682 953303
61086 953303 942423 929248 914124 897438 879989 862633 845342 827345 808511 789873 772373
61075 772373 755752 739254 722873 707139 691992 676840 661794 647995 636329 626378 617182 608673
61063 608673 601719 596937 594056 592522 592117 592745 594092 595883 598198 601228 605002 609603 615321 622249 630076
61048 630076 638672 648437 659584 671522 683695 696644 711342 727792 745368 764433 786328 811501
61036 811501 838933 867961 899507 934685 973182 1014018 1057198 1103481 1152908 1204607 1257883
61025 1257883 1312675 1369016 1426842 1486502 1549056 1616038 1689047 1769302 1857378 1953676 2059209
61014 2059209 2175561 2304296 2447610 2609924 2797913 3019074 3282119 3599497 3987649
61005 3987649 4463756 5044460 5749201 6601821 7625896 8840532 10261110 11891726 13695848
60996 13695848 15564883 17328126 18815886 19928396 20654165 21039816 21162561 21130879 21078624
60987 21078624 21114078 21249371 21379792 21341585 20998478 20287445 19209898 17808881 16163453
60978 16163453 14387577 12609081 10934344 9426561 8109727 6984089 6036666 5246311
60970 5246311 4589191 4043809 3591858 3216723 2903650 2640888 2418993 2229330 2064395
60961 2064395 1919051 1790065 1674719 1570805 1477435 1394495 1321358 1256905 1200351 1150966
60951 1150966 1107212 1067216 1030004 995391 962899 931811 902197 874799 849804 826602 804942
60940 804942 785489 769002 755555 744670 735624 727518 719669 712093 705179 698814 692328 685247 677603
60927 677603 669515 661041 652453 644143 636212 628620 621639 615600 610226 604834 599245 593935 589278 585192
60913 585192 581562 578453 575887 573968 573243 574299 576886 580057 583270 586803 591007 595833 601325 607969
60899 607969 616261 626310 638066 651435 666020 681277 697121 713945 731923 750823 770533 791102
60887 791102 812052 832350 851433 869563 886813 902366 915408 926143 935282 942846 948059 950135
60875 950135 948697 943764 935948 926408 915967 904371 890942 875874 860257 844824 829236 812843
60863 812843 795768 778958 763339 749046 735356 721339 706728 692212 678797 666827 655733
60852 655733 644670 633271 621730 610371 599276 588316 577398 566597 556074 545986 536414 527258
60840 527258 518157 508779 499259 490096 481494 473105 464594 456053 447487 438444 428771 419399 411518 405073
60826 405073 398927 392521 386481 381449 377230 373514 370464 368006 365333 361962 358671 356531 355425 354458
60812 354458 353507 353376 354418 355984 357423 358801 360338 361804 362949 364088 365776 368118 370698 373016 374791
60797 374791 376020 376968 377995 379208 380384 381282 381861 382104 381825 380850 379304 377570 376002 374755 373813 373053
60781 373053 372307 371427 370270 368646 366452 363918 361589 359823 358333 356359 353368 349552 345670 342499 340396
60766 340396 339212 338501 337853 337136 336435 335748 334868 333659 332292 331013 329750 328191 326266 324286 322546 321058
60750 321058 319766 318729 317967 317428 317295 318059 320039 323148 327279 332476 338316 343587 347237 349395 350836
60735 350836 351673 351374 350019 348638 347968 347558 346429 344155 340992 337438 334003 330987 328161 324951 321161
60720 321161 317209 313545 310284 307495 305248 303062 299994 295766 291281 287528 284425 281266 277836 274467
60706 274467 271379 268694 266784 265918 265727 265655 265748 266325 267080 267242 266630 265796 265110 264426 263784 263679 264348 265372
60688 265372 266338 267418 268883 270459 271580 272095 272429 273167 274704 277128 280232 283693 287265 290750 293901
60673 293901 296642 299371 302627 306425 310251 313810 317384 321284 325304 329002 332227 335053 337371 338900
60659 338900 339559 339631 339583 339796 340375 341113 341634 341650 341094 340145 339294 339291 340640 343019 345387 346786 346965 346271 345216
60640 345216 344183 343277 342283 340911 339135 337099 334699 331590 327731 323616 319792 316376 313218 310235 307397
60625 307397 304603 301915 299707 298292 297532 297068 296838 297076 297852 298860 299679 300034 299780 298840 297244 295222
60609 295222 293308 292263 292583 293897 295117 295480 295316 295507 296374 297463 298302 298887 299364 299716 300024 300678 301965
60592 301965 303610 305043 306067 307042 308374 309951 311078 310927 309202 306523 304133 303055 303443 304648 305782
60577 305782 306226 305972 305736 306588 309071 312673 316415 320014 324192 329829 337042 345281 354069 363426 373586
60562 373586 384415 395108 404484 411726 416814 420085 421490 420590 417346 412434 406594 400091 393151 386568
60548 386568 381379 378086 376629 376899 378779 381764 385183 388978 393803 400182 407920 416547 425981 436457
60534 436457 447961 459891 471147 480550 487414 491848 494410 495528 495456 494577 493260 491424 488728 485290
60520 485290 481698 478217 474534 470464 466323 462320 458271 454380 451668 450942 451679 452611 453119 453475 454062 455148
60504 455148 457300 461169 466821 473958 482948 494899 510480 529252 550529 574416 601527 631990
60492 631990 665135 699969 735526 770713 804117 834116 859168 878000 889589 893130 888173 874913
60480 874913 854233 827386 795713 760669 723799 686452 649603 614125 580996 551033 524535
60469 524535 501418 481482 464343 449359 436010 424181 413796 404434 395676 387570 380289 373574
60457 373574 367052 360935 355769 351628 348221 345718 344615 344578 344182 342227 338873 335146 331803 329053 326950
60442 326950 325548 324823 324717 325112 325599 325553 324669 323235 321730 320395 319274 318348 317447 316367 315241 314484 314194
60425 314194 313960 313505 313158 313346 313908 314220 313845 312881 311889 311623 312494 314074 315442 316237 317000 318232 319578
60408 319578 320381 320679 321084 321913 322963 323994 324883 325354 325116 324324 323562 323324 323860 325419 328140 331585 334862
60391 334862 337470 339758 342310 345148 347791 349972 351972 354225 356776 359255 361327 363034 364641 366235
60377 366235 367692 369032 370590 372647 374980 377037 378595 380084 382134 384806 387432 389285 390370 391391
60363 391391 392843 394366 395163 394974 394389 394255 394996 396461 398213 399981 402041 405094 409530 415003 421007
60348 421007 427685 435518 444321 453177 461421 469034 475870 481204 484505 486058 486319 485071 481799 476548
60334 476548 469910 462420 454487 446702 439629 433363 427684 422502 417821 413443 409193 405283 402017 399252
60320 399252 396560 393787 391077 388580 386593 385787 386653 388757 391065 393012 394823 396954 399864 404266 410860
60305 410860 419633 430025 442025 456511 474150 494351 515543 536058 554510 569732 580754 586743
60293 586743 586972 581277 570633 556765 540858 523088 503666 483815 465244 448986 435175 423616
60281 423616 414032 405974 399072 393388 389192 386474 384962 384372 384250 383774 382364 380463 379187 379034 379355
60266 379355 379168 378043 376041 373318 370188 367303 365268 364070 363107 361775 359941 357947 356270 355102 354134
60251 354134 352896 351402 350274 350051 350579 351288 351870 352321 352512 352281 352023 352665 354690 357513 360146 362296
60235 362296 364423 366914 369624 372203 374436 376155 377191 377673 378120 378965 380065 380880 381068 380749 380255 379778
60219 379778 379339 378949 378784 379111 380040 381350 382736 384186 386010 388395 391154 394019 397051 400518 404395
60204 404395 408249 411709 414907 418327 422274 426629 431158 435914 441189 447088 453340 459561 465558 471230
60190 471230 476335 480573 483928 486727 489310 491704 493650 494889 495458 495733 496076 496391 496192 495163 493443
60175 493443 491248 488533 485335 482073 479007 475650 471305 466150 461205 457209 454045 451345 448976 446805
60161 446805 444568 442298 440370 438836 437218 435298 433599 432712 432576 432823 433334 434048 434710 435297 436269 437826
60145 437826 439396 440406 441121 441992 442636 442386 441636 441629 442942 445034 447426 450422 454381 459018 463831 468673
60129 468673 473554 478252 482449 485906 488352 489570 489770 489540 489229 488769 488141 487539 486890 485784 484206 482906
60113 482906 482589 483095 483804 484597 485931 488096 490814 493610 496271 498850 501359 503596 505313 506502 507400
60098 507400 508083 508287 507895 507368 507250 507333 506825 505432 503694 502136 500643 498898 496951 495001 493233 492287
60082 492287 493303 496662 500926 503818 504339 503455 502714 502738 503159 503381 502967 501631 499325 496342 493111 489819
60066 489819 486245 481890 476264 469274 461509 454048 447731 442577 438015 433615 429391 425395 421375 417070
60052 417070 412684 408730 405416 402463 399584 396856 394527 392736 391630 391513 392621 394802 397611 400611
60038 400611 403545 406409 409491 413105 417116 420962 424365 427751 431638 435844 439643 442582 444809 446693
60024 446693 448387 449604 449605 447716 444187 440219 436706 433265 428984 423766 418213 412494 406217 399500 393314
60009 393314 388558 385313 383103 381282 379120 376227 373075 370534 368758 367161 365497 364141 363103 361742
59995 361742 359874 358264 357475 357043 356461 356190 356810 357804 358237 358269 358954 360634 362496 363846 364955 366371 367995
59978 367995 369297 370129 370925 372106 373477 374372 374447 374144 374080 374100 373437 371817 369837 368079 366465 364785 363204
59961 363204 361844 360459 359064 358303 358601 359435 360114 360761 361756 362692 362742 361851 360748 359973 359679 360135 361522
59944 361522 363360 365009 366700 369193 372443 375508 377875 379915 381881 383456 384603 385907 387585 388914
59930 388914 389181 388565 387601 386434 385146 384191 383821 383518 382681 381575 380985 381151 381636 382109 382694 383610 384921
59913 384921 386573 388319 389715 390634 391731 393972 397578 401736 405362 407903 409380 409996 409887 409127 407812
59898 407812 406124 404262 402327 400346 398553 397531 397853 399502 401721 403579 404815 406148 408673 412834
59884 412834 418085 423573 428980 434445 439874 444797 449005 452946 457303 462338 467687 472609 476339 478551
59870 478551 479642 480365 481016 481096 479830 476866 472420 467112 461746 456944 452710 448579 444432 440914 438760
59855 438760 437974 438079 439073 441619 446122 452025 458321 464607 471299 478802 486757 494260 500624 505629 509170
59840 509170 511156 511935 512354 512972 513404 512835 510974 508003 503824 498067 491018 483889 477810 472933 468763
59825 468763 464899 461160 457423 453874 451181 449922 449849 450016 449545 448078 445658 442530 438966 435045 430735
59810 430735 426426 423066 421331 420768 420226 419121 417854 416980 416411 415612 414203 412185 409875 407828 406572
59795 406572 406139 405966 405427 404346 402866 401063 398978 396942 395486 394832 394678 394607 394526 394535 394503 394090 393178 392059
59777 392059 391080 390359 389958 390088 390776 391489 391534 390837 390002 389479 389058 388326 387268 386164 385240 384743 385006 385966
59759 385966 386800 386633 385598 384746 384856 385798 387122 388728 390669 392774 394890 397176 399781 402474 405066
59744 405066 407990 411906 416732 421612 425914 429751 433313 436264 438260 439682 441294 443297 445263 446964
59730 446964 448744 450917 453295 455575 457823 460205 462428 463876 464266 463984 463775 464239 465545 467397 469259
59715 469259 470764 471854 472466 472302 471192 469610 468419 468019 468050 468005 467832 467709 467552 467163 466721 466683 467080 467294
59697 467294 466868 466278 466492 467780 469420 470735 471960 473647 475530 476629 476492 475727 475029 474274 472946 471062
59681 471062 469105 467316 465641 464284 463611 463397 462690 460744 457772 454588 451847 449855 448709 448112 447098
59666 447098 444433 439605 433384 427311 422522 419009 415968 412851 409985 408127 407540 407666 407636 406931 405647
59651 405647 404380 403914 404802 407082 410363 414050 417406 419661 420499 420435 420343 420553 420701 420482 420084 419716 419150
59634 419150 418085 416728 415585 414794 414029 413043 412048 411466 411527 412180 413233 414470 415672 416684 417494 418122 418323
59617 418323 417497 415202 411805 408360 405624 403458 401410 399501 398030 396852 395500 393982 392829 392261 391920
59602 391920 391618 391781 392790 394326 395744 396675 396959 396405 395185 394162 394186 395081 395786 395549 394690 394159 394605
59585 394605 395914 397465 398721 399596 400278 400825 401209 401608 402174 402454 401600 399432 396773 394343 391914 389089
59569 389089 386382 384663 383862 383117 382117 381369 381006 380284 378714 376949 375978 375893 376047 376125 376434 377200 378095 378648
59551 378648 378870 379337 380627 382708 384922 386687 388160 390045 392783 396194 399999 404388 409835 416532 424284
59536 424284 433001 443138 455555 470821 488424 506528 522536 534086 539792 539503 534202 525609 515515
59523 515515 505282 495862 488005 482154 478256 476061 475573 476857 479452 482426 485129 487447 489210 489888
59509 489888 489231 487784 486262 484613 482073 478035 472545 466061 459140 452350 446105 440416 435015 429745
59495 429745 424720 420090 415831 411816 408006 404526 401590 399313 397591 396266 395372 394968 394712 394037 392979
59480 392979 392506 393598 396194 399469 402913 406653 410813 415208 419759 424625 429670 434294 438092 441293
59466 441293 444212 446646 448217 449018 449441 449606 449499 449585 450654 452920 455716 458308 460724 463582 467382 472169
59450 472169 477667 483496 489446 495792 503207 512080 521946 531820 541026 549378 556513 561509 563545 562803
59436 562803 560373 557194 553355 548477 542436 535439 527675 519351 511074 503722 497619 492138 486475 480739
59422 480739 475993 473222 472534 473452 475741 479763 486032 494653 505378 518255 533892 552739 574256
59409 574256 597340 621497 646777 672035 694021 709160 716137 716093 710685 701060 688728 676140 665722
59396 665722 658918 656344 657830 661555 664024 661983 654248 641285 623781 602555 579275 556007 534076
59383 534076 514177 497280 484281 474740 467163 460806 456249 453907 453053 452793 453081 454093 455352 456239
59369 456239 456910 457988 459729 461994 464634 467396 469847 471941 474252 477180 480418 483766 487872 493311
59355 493311 499409 504974 509967 515409 521693 528124 534306 540924 548661 557218 566043 575371 585819 597359
59341 597359 609420 621822 634919 648796 662761 675723 686796 695571 702202 707318 711536 714807
59329 714807 716341 715309 711636 706013 699182 691290 681979 671033 658794 645959 633157 620796 609162
59316 609162 598443 588726 580072 572545 566009 560059 554461 549610 546249 544680 544596 545745 548413 553065
59302 553065 559839 568661 579532 592155 605261 616763 624798 628535 628027 623637 615797 605127 592497
59289 592497 578984 565787 553935 543799 534951 526784 519230 512641 507082 502134 497552 493756 491373
59276 491373 490512 490739 491623 493017 494934 497397 500403 503864 507714 512199 517804 524611 532040 539602 547663
59261 547663 556841 566764 576089 583756 589599 593608 595380 594699 592030 587973 582621 575904 568085 559436
59247 559436 549843 539392 529093 520281 513342 507604 502551 498566 496289 495701 496135 497004 498239 500071
59233 500071 502538 505342 508220 511286 514785 518541 522037 525152 528383 532086 535819 538700 540129 539929
59219 539929 538224 535554 532737 530128 527346 524136 521023 518491 515963 512445 508018 503865 500886 499016
59205 499016 497840 496931 495569 493118 490082 487906 487240 487120 486372 485078 483999 483185 482096 480815 480169 480578
59189 480578 481499 482245 482850 483792 485138 486321 486748 486452 486028 485965 486201 486462 486873 487874 489507 491154 492140
59172 492140 492386 492317 492400 492937 494079 495819 498137 501209 505272 510182 515445 520895 526986 534083 541789 549374
59156 549374 556647 563971 571418 578384 584111 588291 590995 592254 591889 589713 585846 580815 575308 569823
59142 569823 564618 559914 555834 551964 547343 541300 534221 527180 520833 514969 509106 503182 497504 492274
59128 492274 487341 482358 477170 472129 468004 465341 463903 462994 462391 462621 464176 466802 469921 473468 477845
59113 477845 483109 488703 494117 499396 504802 510353 515948 521673 527591 533428 538806 543709 548445 553284
59099 553284 558387 563843 569354 574051 577215 579159 580856 582638 583894 584169 583933 583893 584065 583977 583341 582095
59083 582095 580160 577705 575373 573739 572583 571049 568392 564386 559342 554013 549121 544523 539175 532348
59069 532348 524527 516663 509062 501712 495205 490323 486825 483590 480054 476683 473917 471474 468905 466067
59055 466067 462820 458990 454978 451750 449804 448661 447668 446757 446097 445592 445171 445063 445343 445608 445546 445410 445507
59038 445507 445547 444939 443461 441307 438816 436499 434969 434425 434494 434964 436240 438633 441599 444286 446653 449401
59022 449401 452930 456924 460984 465183 469949 475811 483258 492325 502167 511474 519595 527026 534518 541901
59008 541901 548056 552049 554029 554895 555291 555221 554639 553982 553825 554284 555184 556664 559161 562725 566844 571054
58992 571054 575368 579966 584816 589770 594696 599331 603278 606322 608520 609914 610458 610249 609475 608053 605780
58977 605780 602907 600155 598030 596633 596255 597477 600354 604103 608086 612649 618509 625727 633824 642545
58963 642545 651957 661992 672406 683062 693836 704370 714214 723045 730552 736451 740885 744387 747007
58950 747007 747870 746083 741701 735325 727130 716970 705156 692378 678934 664760 650236 636327 623782
58937 623782 612654 602730 593967 586348 579653 573570 567895 562565 557691 553529 550240 547683 545559 543647
58923 543647 541823 540099 538789 538345 538761 539396 539598 539256 538509 537387 536079 535148 535017 535544 536491 538017 540206
58906 540206 542576 544701 546987 550143 554186 558735 564036 570841 579317 588936 599420 610941 623228
58893 623228 635307 646475 656917 667042 676796 686037 695185 705134 716676 730205 745661 762574
58881 762574 780323 798425 816433 833638 849202 862599 873653 882243 888216 891501 891989 889554 884504
58868 884504 877649 869253 858276 843570 825842 807570 790818 775877 762200 749698 738590 728671
58856 728671 719446 710668 702252 693903 685207 675966 666234 656250 646376 636766 627018 616624 605935 596118
58842 596118 587880 580692 573606 566322 559032 551737 544399 537516 531860 527577 523937 520095 515838 511622
58828 511622 508114 505701 504251 503223 502049 500466 498626 497052 496426 497147 498989 501336 503773 506262 508865
58813 508865 511650 514917 519084 524132 529350 533844 537218 539780 542283 545413 549178 552765 555304 556836
58799 556836 558113 559390 559879 558632 555593 551428 546662 541396 535731 530040 524730 519861 515083 509957
58785 509957 504421 498983 494358 490929 488660 487438 487271 488142 489832 491921 493880 495402 496841 499031 502232
58770 502232 505401 507003 506472 504395 501356 497322 492286 486811 481551 476688 472188 468194 464801 461727
58756 461727 458613 455437 452386 449526 446851 444487 442626 441426 441093 441876 443775 446459 449574 452971 456586
58741 456586 460368 464421 468888 473531 477781 481409 484899 488950 493759 498933 503882 508142 511612 514679
58727 514679 517954 521765 526046 530713 535762 540859 545205 548196 550100 551945 554802 559203 564947 571261
58713 571261 577316 582790 587927 593075 598336 603590 608626 613234 617387 621326 625201 628709 631340 632845
58699 632845 633123 631813 628422 622845 615299 605842 594442 581490 567728 553714 539873 526922 515511
58686 515511 505395 495787 486647 478789 472498 466916 461242 455709 450812 446282 441591 436924 432888 429585
58672 429585 426623 423866 421618 420215 419888 420840 423045 426113 429684 433816 438705 444302 450387 456687 462702
58657 462702 467813 471860 475140 477561 478350 477120 474678 472160 469769 467014 463873 460945 458553 456399
58643 456399 454156 451886 449796 447967 446393 445040 443880 443058 442880 443465 444623 446272 448633 451767 455223
58628 455223 458521 461658 464801 467834 470641 473573 477068 480938 484434 486909 488186 488515 488488 488747 489433
58613 489433 490187 490907 492081 494055 496529 499253 502663 507120 511945 516035 519106 521535 523228 523636 522871
58598 522871 521892 521373 521116 520763 520365 519959 519255 518106 516839 515756 514723 513567 512531 512014 512119 512787 514209
58581 514209 516790 520782 526115 532495 539530 546844 554214 561614 569032 576232 582739 588138 592544 596757
58567 596757 601774 608013 615110 622526 630193 638569 648279 659797 673224 688193 704176 720938 738465
58554 738465 756408 773994 790659 806325 820804 833284 842844 849210 852679 853498 851736 847664 841949
58541 841949 835464 828996 822925 817019 810777 804009 796877 789247 780444 769822 757261 743018 727633
58528 727633 712160 697861 685223 673753 663114 653923 646946 642008 638319 635479 633538 632332 631406
58515 631406 630499 629651 629014 628836 629292 629939 629735 628161 625972 624278 623220 622115 620546 618649 616524 614047
58499 614047 611219 608188 605046 601984 599422 597592 596273 595381 595393 596580 598186 599075 599007 598658 598656 599230 600574
58482 600574 602776 605491 608283 611252 614834 619246 624704 631824 640921 651117 660999 670217 679613 689703
58468 689703 699732 708429 715043 719377 721356 720952 718407 714378 709824 705542 701619 697638 693599 690226
58454 690226 688171 687466 688161 690798 695635 701994 709086 716878 725387 733695 740686 746301 751031 754530 755843
58439 755843 754766 751880 747388 741139 733807 726900 721354 716987 713504 711133 710126 710418 712047 715216
58425 715216 719820 725497 732101 739479 746939 753774 760250 767251 775012 783048 791180 799562 807625 814046
58411 814046 818041 819841 819732 817510 813150 807293 800790 794341 788569 783706 779217 774505 769947 766433
58397 766433 763996 761903 760159 759791 761446 764629 768531 772660 776535 779749 782695 786285 790575 794463
58383 794463 796996 798111 797864 795910 792331 788224 784910 782902 781867 781136 780184 779158 778925 780111 782319
58368 782319 784961 788528 794002 801276 809245 817348 825802 834404 842501 850301 858975 869097 880155 891784
58354 891784 904252 917361 930150 942153 953841 965421 976229 985710 993975 1001075 1006844 1011785
58342 1011785 1016932 1022465 1027557 1031993 1036835 1043063 1050657 1059377 1069295 1080168 1091455 1103316 1116493
58329 1116493 1130920 1145734 1160899 1177332 1195008 1212400 1228399 1243362 1257738 1271178 1283703
58318 1283703 1296193 1308892 1320767 1331158 1340734 1350138 1359111 1367680 1376702 1386425 1396094 1405763 1416800
58305 1416800 1429573 1442438 1454311 1466586 1481082 1497625 1515175 1533862 1554185 1575393 1596457
58294 1596457 1617694 1639827 1662281 1683928 1704777 1725562 1746460 1767600 1789974 1814396 1840180
58283 1840180 1866114 1892100 1918793 1946453 1975288 2005976 2038704 2072525 2106770 2142150 2179387
58272 2179387 2217890 2256997 2297400 2339982 2384354 2429984 2477765 2528952 2583431 2640408 2699919
58261 2699919 2762256 2826800 2892874 2960957 3031780 3105059 3180295 3257894 3338273 3420884 3505447
58250 3505447 3593151 3685338 3781955 3882437 3987001 4095910 4208743 4325678 4448276 4577755
58240 4577755 4713753 4855952 5005468 5163461 5330029 5505676 5692141 5890441 6099988
58231 6099988 6321057 6556135 6807439 7075347 7360816 7666850 7995731 8347353 8722334
58222 8722334 9124240 9556800 10021869 10522462 11064736 11654391 12294287 12988466 13745324
58213 13745324 14573972 15481260 16475999 17572464 18786211 20130807 21623347 23289466
58205 23289466 25158758 27260481 29630354 32319036 35390780 38921792 43009914 47784909
58197 47784909 53407129 60067007 67997650 77482895 88843117 102417648 118563184 137640730
58189 137640730 159956313 185670275 214689115 246484191 279811902 312510133 341666203
58182 341666203 364234404 377799781 381076537 374003048 357590447 333689978 304690521
58175 304690521 273124667 241266526 210854827 182999819 158239933 136683377 118172233
58168 118172233 102415843 89071635 77790758 68250254 60170504 53313181 47473242
58161 47473242 42478445 38189763 34493126 31290122 28497661 26050209 23895075 21986058
58153 21986058 20284079 18759938 17391130 16157002 15039620 14026362 13107436 12272139
58145 12272139 11510219 10814737 10180266 9599822 9066255 8574858 8121832 7701862 7309809
58136 7309809 6943221 6600623 6278989 5975537 5690507 5425383 5179414 4950186 4736387
58127 4736387 4537592 4352340 4178733 4016105 3864098 3721097 3585556 3457881 3338968
58118 3338968 3227712 3121921 3020889 2925183 2834638 2748304 2665730 2586677 2510344 2436405 2365986
58107 2365986 2300080 2237837 2177920 2120535 2066457 2015047 1965042 1916503 1870143 1825519 1781733
58096 1781733 1739236 1698956 1660198 1621424 1582839 1546165 1511891 1478627 1445354 1412680 1381522
58085 1381522 1351965 1323818 1297151 1271825 1247267 1222950 1198599 1174041 1149418 1125273 1101853
58074 1101853 1078784 1056091 1034830 1015768 998039 980257 962496 945921 930790 916127 901376
58063 901376 887145 874098 862020 850270 838555 827046 816098 805823 795688 784817 772982
58052 772982 760913 749284 737965 726641 715456 704548 693771 683532 675030 668763 663576 658126
58040 658126 652603 647942 644035 639886 635014 629487 623058 615566 607923 601398 595963 590411 583952 576653
58026 576653 568456 558977 548411 537663 527419 517794 508789 500337 492016 483562 475584 468965 463660
58013 463660 458884 454272 449981 445879 441724 438070 435840 434826 433621 431329 428442 425732 423122 420061
57999 420061 416393 412458 408782 405894 404009 402738 401466 400050 398759 397654 396584 395735 395587 396296 397592
57984 397592 399194 400811 401897 402086 401790 401631 401320 399834 396788 392909 389055 385481 382180 379317 377013
57969 377013 375223 373993 373330 372764 371638 369988 368615 368105 368279 368735 369305 369829 370057 370047 370171 370446 370324
57952 370324 369422 367991 366388 364544 362321 360007 358024 356370 354754 353167 351957 351396 351462 352131 353693
57937 353693 356603 360927 366070 371279 376397 381849 387783 393659 399019 404307 410394 417373 424236 429713
57923 429713 433089 434334 433890 432429 430495 428290 425842 423151 419959 415644 409814 402908 395859 389267
57909 389267 383190 377520 372152 366907 361734 356948 352879 349361 345928 342452 339248 336550 334182 331666
57895 331666 328538 324845 321516 319822 320028 320950 321327 321171 321173 321306 321035 320671 321359 323478 325960 327622 328523
57878 328523 329573 331219 332979 334076 334249 333950 333754 333580 332759 331052 329142 327638 326005 323161 318939
57863 318939 314232 309871 306130 303156 301019 299227 297081 294665 292725 291469 290357 289308 289147 290355
57849 290355 292182 293625 294675 295954 297582 299073 300010 300265 299785 298645 297183 295676 294021 292003 289700
57834 289700 287370 285176 283276 281871 280853 279673 277898 275765 273989 273144 273401 274514 275844 276709 277109
57819 277109 277889 279907 283174 287068 291189 295639 300517 305382 309279 311218 310785 308368 304739 300388 295428
57804 295428 290104 285041 280797 277384 274397 271449 268420 265503 263151 261794 261467 261769 262163 262174 261452 260038
57788 260038 258524 257495 256795 255762 254227 252752 251736 250876 249845 248967 248810 249526 250954 253032 255618
57773 255618 258250 260598 262914 265567 268295 270453 271906 273114 274369 275459 276212 276886 277751 278522 278467 277001
57757 277001 274069 270135 265950 262236 259385 257362 255899 254752 253778 252869 251942 251048 250399 250172 250268 250409
57741 250409 250538 250932 251789 252849 253596 253801 253694 253681 254098 255129 256718 258520 260113 261280 261971 262163 261984
57724 261984 261808 261900 262025 261694 260739 259314 257447 255051 252421 250275 249155 249047 249608 250377 250733 250127 248651
57707 248651 247011 245661 244206 241914 238660 235089 231989 229672 227955 226604 225696 225451 225683 225765 225410 225216
57691 225216 225918 227273 228184 227922 226645 224780 222610 220646 219639 219785 220395 220787 221082 221776 223001 224731
57675 224731 227415 231874 238725 248294 260945 277078 296856 320284 347434 378332 412577 449082
57663 449082 485781 519266 545138 559574 561033 550472 530059 501936 468142 431172 394023 359415
57651 359415 328907 302860 281167 263712 250025 238945 229242 220585 213563 208739 206035 204914 204660
57638 204660 204485 203912 203219 203059 203518 204031 204257 204514 205163 206132 207203 208258 208990 208980 208339 207752 207657 207909 208408
57619 208408 209268 210048 209712 207918 205602 203619 201564 198749 195620 193191 191534 189882 188000 186391 185325
57604 185325 184570 184073 184012 184135 183875 183184 182581 182311 182157 182097 182333 182557 181936 180122 177669 175223 172836 170291
57586 170291 167566 164747 161880 159121 156771 155062 154197 154423 155572 156640 156508 155162 153585 152430 151435
57571 151435 150239 148963 147731 146300 144553 142778 141160 139574 138227 137763 138235 138560 137715 136082 134937
57556 134937 134853 135342 135921 136839 138579 141125 143944 146509 148636 150415 151796 152350 151669 150081 148640 148142
57540 148142 148381 148655 148825 149452 150945 153017 155153 157336 159997 163257 166518 169020 170685 172081 173475
57525 173475 174369 174284 173640 173313 173523 173773 173885 174389 175639 177124 178048 178184 177822 177234 176637 176388 176697 177198
57507 177198 177129 176045 174178 172172 170578 169550 168870 168261 167614 166803 165484 163455 161205 159607 158924 158531
57491 158531 157801 156817 155901 154948 153699 152347 151322 150651 150000 149265 148679 148421 148554 149335 151091 153588 155875
57474 155875 157032 156981 156418 155969 155534 154524 152770 151027 150338 150898 151886 152475 152644 152782 152905 152743 152304 151874
57456 151874 151496 150905 150013 149148 148774 149194 150436 152067 153190 153086 152014 151017 150790 151050 151196 151263 151847 153227
57438 153227 154912 156145 156694 157043 157829 159085 160118 160209 159452 158766 158958 159935 160949 161590 162227 163433 165183
57421 165183 166843 167879 168257 168159 167659 166895 166284 166180 166451 166769 167237 168269 169796 171123 171854 172564 174177
57404 174177 176856 179823 182094 183168 183193 182833 182879 183619 184549 184937 184666 184379 184804 186093 187713 188846 189030
57387 189030 188666 188772 190010 192105 194412 196846 199806 203363 207056 210519 213798 216929 219730 222217 224713
57372 224713 227234 229220 230287 230851 231545 232340 232806 233001 233367 233803 233673 232948 232599 233401 234886 236067 236842
57355 236842 237963 239810 241920 243805 245565 247448 249323 250994 252677 254795 257465 260492 263668 266845
57341 266845 269848 272570 274990 276949 278169 278735 279247 280169 281354 282612 284369 287108 290355 293047 295002
57326 295002 297274 300784 305177 309343 312543 314707 316120 317330 319119 322065 326127 330807 335525 339770
57312 339770 343216 345964 348429 350825 353118 355605 359044 363804 369272 374470 378976 382892 386359 389669
57298 389669 393564 398743 405123 412095 419392 427284 435932 445067 454323 463482 472401 481079 489871 499277
57284 499277 509446 520104 530901 541610 552090 562368 572621 582796 592395 600988 608730 616006
57272 616006 622828 629073 635059 641220 647358 652933 658079 663609 669967 676948 684617 693667 704457 716353
57258 716353 728545 740979 753969 767387 780799 794112 807577 821376 835668 850831 867163
57247 867163 884451 902199 920151 938258 956278 973920 991370 1009292 1028130 1047599 1066972
57236 1066972 1085774 1104183 1122777 1141911 1161365 1180676 1199678 1218489 1237059 1255224 1273269
57225 1273269 1291996 1311912 1332667 1353628 1374712 1396300 1418556 1441175 1463715 1485822 1507259
57214 1507259 1528046 1548569 1569290 1590350 1611619 1633097 1655072 1677913 1701775 1726422 1751268
57203 1751268 1775813 1800182 1825050 1850855 1877231 1903466 1929289 1954998 1980959 2007275 2033917
57192 2033917 2060895 2088249 2115892 2143506 2170654 2197247 2223872 2251266 2279356 2307156 2333807
57181 2333807 2359412 2384629 2409873 2435240 2460848 2486808 2513046 2539549 2566481 2593689 2620415
57170 2620415 2646070 2671111 2696543 2722659 2748807 2774410 2799644 2825013 2850667 2876245 2901085
57159 2901085 2924631 2946981 2969004 2991471 3014062 3035703 3055886 3075157 3094186 3112871 3130540
57148 3130540 3146663 3161187 3174578 3187751 3201545 3215982 3230314 3244075 3257805 3272473 3288424
57137 3288424 3305248 3322540 3340444 3359428 3379743 3401167 3423177 3445323 3467435 3489527 3511643
57126 3511643 3533877 3556414 3579386 3602807 3626837 3652036 3679207 3709129 3742595 3780398 3822969
57115 3822969 3870294 3922665 3981358 4048062 4123749 4208676 4303501 4409868 4529992 4666521 4823145
57104 4823145 5004819 5217155 5466168 5759055 6104960 6514974 7002180 7582589 8276030
57095 8276030 9105921 10098256 11280718 12681551 14327330 16239533 18430761 20901564
57087 20901564 23638593 26614033 29785302 33094751 36471388 39836340 43109673 46213902
57079 46213902 49073811 51617424 53780789 55512131 56769732 57515032 57708356 57312310
57071 57312310 56301911 54677342 52474525 49768490 46666593 43294055 39778281 36236795
57063 36236795 32769619 29455304 26350302 23490915 20896176 18570795 16508370 14694689
57055 14694689 13110241 11732063 10535806 9497914 8596760 7812677 7128063 6527846 5999370
57046 5999370 5531600 5114787 4740856 4403480 4097531 3818877 3564609 3332673 3120971
57037 3120971 2927386 2750748 2591007 2448166 2321868 2212502 2121889 2052231 2004915 1980500
57027 1980500 1978170 1993167 2014826 2028848 2022755 1989755 1928734 1842495 1736684 1619000 1497635
57016 1497635 1379472 1269216 1169500 1081336 1004641 938602 881754 832050 787469 746802 709693
57005 709693 676026 645634 618582 595137 575072 557279 540307 523206 505835 488769 473068
56994 473068 459714 448812 439487 430903 423247 417413 413908 412490 412843 415094 419458 425655 432950 440560
56980 440560 447695 453253 455862 454507 449098 440318 429057 416047 401919 387290 372746 358909 346551
56967 346551 336326 328237 321645 316155 312362 311403 313825 319236 327069 337240 349782 364111 378957
56954 378957 392909 404756 413350 417489 416220 409334 397590 382463 365618 348441 331868 316473
56942 316473 302649 290770 281227 274262 269765 267433 267357 270338 277352 288655 303576 321161 340665
56929 340665 361255 381452 399152 412145 418558 417141 407680 391338 370289 346679 321777 296147
56917 296147 270517 246245 224751 206495 190774 176660 164022 153460 145287 138870 133041 127001
56905 127001 120757 114905 110128 106774 104718 103552 102918 102631 102565 102640 102952 103805 105543 108510 113134 119818
56889 119818 128697 139738 153163 169409 188410 209181 230368 251002 270400 287556 301116 310089
56877 310089 314413 314871 312654 308944 304676 300652 297899 297565 300245 305634 313280 323516 337274 355170
56863 355170 377306 403882 435383 471963 512958 556893 601348 642724 676910 700727 712608
56852 712608 712083 699480 676616 647080 614981 583462 554598 530009 510765 497057 488897 487186
56840 487186 493387 508129 530886 561193 599464 646264 701280 763341 830729 900532 967705 1025468
56828 1025468 1067234 1088481 1087336 1064294 1022096 965765 901883 836813 774994 718702 669116
56817 669116 627257 593947 569430 553508 545925 546474 554951 571282 595585 627826 667331 712481
56805 712481 760443 806991 847086 876183 891079 889807 871738 838504 794265 743994 691421 638964
56793 638964 588958 543769 504710 471962 445718 426457 413875 406709 404191 406816 415019 427889
56781 427889 444008 462872 484405 507261 528443 544577 553046 552221 541560 521869 495078 463586
56769 463586 429851 396185 364271 334777 307748 283384 262062 243766 227944 214016 201721
56758 201721 191004 181834 174150 167746 162252 157447 153436 150262 147492 144546 141291 138003 134893 132068
56744 132068 129801 128330 127407 126510 125543 124894 124728 124577 123826 122428 121071 120696 121650 123082 123444 122068 120053
56727 120053 119081 119507 120211 120309 120231 120930 122685 125106 127756 130283 132303 133671 134738 135917 137088 137713
56711 137713 137544 136986 136755 137224 138027 138328 137677 136642 136345 137299 138893 140109 140471 140216 139897 140040 140901 142217
56693 142217 143367 143989 144354 144957 145935 147054 148090 148935 149427 149368 148762 147927 147339 147344 147880 148465 148648 148529 148633
56674 148633 149157 149625 149455 148624 147534 146470 145528 144872 144640 144608 144367 143957 144029 145111 146831 148114 148233 147586
56656 147586 147309 148117 149592 150725 151103 151359 152405 154388 156547 157981 158416 158259 158073 158065 158019 157662 157040 156505
56638 156505 156399 156858 157819 159055 160190 160908 161252 161583 162219 163211 164525 166192 168121 169944 171279 172082
56622 172082 172567 172821 172708 172165 171454 171006 171060 171469 171816 171736 171142 170223 169221 168231 167190 166009 164729 163566
56604 163566 162738 162210 161692 160989 160274 159847 159612 159021 157645 155708 153959 153100 153347 154385 155610 156507 157015
56587 157015 157533 158458 159707 160813 161575 162376 163655 165210 166353 166842 167254 168213 169545 170577 171087 171485
56571 171485 172193 173310 174902 177052 179464 181611 183528 186000 189609 194020 198581 203290 208743 215460
56557 215460 223686 233467 244342 255118 264554 272177 278095 282263 284518 285214 285224 285289 285743 286701 287949
56542 287949 288719 288186 286259 283465 280129 276242 272073 268242 265005 261962 258669 255108 251486 247974 244682
56527 244682 241483 237913 233777 229806 227037 225501 224186 222408 220514 219020 217807 216521 215107 213530
56513 213530 211562 209246 207073 205252 203286 200749 198050 195925 194551 193618 192984 192758 192920 193256 193579 193818
56497 193818 194049 194549 195469 196322 196250 195035 193408 192153 191437 191274 191967 193474 194833 194948 193831 192518 191859
56480 191859 191760 191560 190814 189728 188987 189074 189792 190675 191723 193162 194586 195213 195228 196011 198480 201882 204809
56463 204809 206753 208012 208747 209022 209369 210393 211907 213160 213745 213748 213217 212146 210867 209877 209372 209366 210038 211422
56445 211422 212986 214091 214711 215234 215766 216175 216535 216999 217390 217487 217484 217671 217869 217771 217557 217613 217858 217979 218058 218301
56425 218301 218375 217797 216778 215936 215267 214265 213000 212247 212451 213292 214370 215563 216594 217019 216884 216760 216855
56408 216855 216728 216110 215400 214941 214363 213109 211303 209726 209130 209799 211520 213726 215829 217645 219482 221771
56392 221771 224704 228155 231756 235098 237996 240501 242529 243742 244003 243768 243730 244174 244895 245522 245716 245359
56376 245359 244846 244894 245725 246740 247285 247364 247259 247006 246690 246763 247407 248059 248290 248717 250210 252507 254551 255992
56358 255992 257475 259508 261845 263993 265582 266294 266170 265995 266690 268352 270472 272890 275739 278589 280564
56343 280564 281420 281772 282258 283103 284399 285996 287199 287438 287227 287671 289122 291147 293681 297054 300838 303902
56327 303902 305926 307849 310449 313454 316395 319361 322459 325368 327874 330063 331604 331762 330645 329582
56313 329582 329687 330698 331741 332523 333199 333737 334094 334540 335246 336011 336851 338364 340989 344325 347691 350994
56297 350994 354630 358841 363528 368383 372938 376816 380217 383788 387828 391995 395928 399707 403570 407698
56283 407698 412387 417860 423710 429101 433770 438351 443573 449663 456596 464290 472430 480729 489514 499416
56269 499416 510469 522257 535014 549622 566279 584097 602359 621326 641509 663080 686409
56258 686409 712238 740757 771400 804141 840180 880758 926149 976561 1033252 1097813 1170805
56247 1170805 1251915 1341179 1439313 1546958 1663958 1789256 1921233 2058351 2199425 2342822
56237 2342822 2485554 2623936 2755002 2876317 2984383 3074617 3143490 3189742 3213111 3213086 3189594
56226 3189594 3143869 3077795 2993326 2893366 2782199 2663887 2540765 2414266 2286505 2160069
56216 2160069 2036819 1917906 1804588 1698115 1599010 1507082 1421892 1342793 1269118 1200853
56206 1200853 1138658 1082726 1032245 986445 945383 909058 876515 846632 819140 794137 771302
56195 771302 750428 732049 716541 703105 690565 678825 668661 660407 653617 647737 642344 636948
56183 636948 631245 625530 620452 616505 613873 612278 610872 608965 607119 606683 607932 609597 610662 611591 613190
56168 613190 615333 617608 620313 623883 628097 632601 637485 642640 647480 652033 657385 664200 671739 679195
56154 679195 686979 695757 705311 715451 726980 740557 755627 771843 790524 813151 839280 867670
56142 867670 898965 935555 978986 1028961 1084692 1145745 1211479 1280715 1351957 1423059 1490948
56131 1490948 1552795 1607541 1655808 1698752 1737652 1773759 1807425 1837659 1863398 1884655 1901686
56120 1901686 1913762 1919866 1920053 1915110 1905325 1890308 1869297 1840858 1803228 1756109 1701465 1641758
56108 1641758 1578451 1513192 1449055 1388967 1333814 1283526 1239068 1201680 1170981 1145538 1124663
56097 1124663 1108133 1094917 1083954 1075619 1070707 1068502 1067489 1067443 1069121 1072328 1076015 1079948 1084727 1090442
56083 1090442 1096771 1103992 1112461 1121597 1130735 1140399 1151326 1163017 1174796 1187428 1201895 1217314
56071 1217314 1231960 1245723 1259683 1273905 1287609 1300984 1314894 1329285 1343751 1359140 1376644
56060 1376644 1395820 1415419 1435558 1457030 1479135 1500430 1521179 1542890 1565797 1588938 1612368
56049 1612368 1637169 1663544 1690826 1718885 1747657 1775958 1802884 1829595 1857589 1886093 1913586
56038 1913586 1940923 1970199 2001353 2032814 2064845 2099131 2135536 2172489 2210404 2251598 2296812
56027 2296812 2344758 2395049 2448570 2504892 2562261 2620268 2679851 2740792 2802023 2864271 2929494
56016 2929494 2997864 3068234 3141262 3218998 3301586 3387526 3476940 3571417 3670954 3774383 3882470
56005 3882470 3997072 4117610 4242004 4370836 4506882 4650809 4801121 4958023 5123474
55996 5123474 5297793 5480200 5672210 5876334 6092073 6317654 6555086 6808752 7079767
55987 7079767 7366848 7672031 7999961 8352150 8727759 9129608 9563333 10031145 10533039
55978 10533039 11073914 11662554 12303669 12998219 13751762 14575030 15476331 16461520 17542026
55969 17542026 18735016 20055856 21519570 23150339 24981042 27044624 29377443 32032291
55961 32032291 35078812 38594310 42670470 47432705 53042964 59688908 67591319 77024111
55953 77024111 88307027 101774593 117765276 136621800 158641358 183971889 212503012
55946 212503012 243715311 276404376 308412936 336752719 358303926 370723279 372957135
55939 372957135 365177389 348482762 324688235 296133388 265317795 234440185 205102649
55932 205102649 178280672 154436469 133651290 115759378 100478380 87493409 76485618
55925 76485618 67149072 59216198 52466077 46708461 41774363 37524728 33852207 30666526
55917 30666526 27886115 25444991 23294914 21394907 19706007 18197749 16849779 15642988
55909 15642988 14556053 13572319 12681941 11874589 11137046 10459967 9839849 9272026 8748170
55900 8748170 8262551 7814301 7401339 7018013 6660657 6329639 6023922 5739030 5472248
55891 5472248 5224607 4995901 4782749 4583281 4398850 4229404 4071870 3924578 3788460
55882 3788460 3662161 3540672 3420713 3303271 3189221 3076906 2965937 2859095 2758311
55873 2758311 2662423 2570678 2484623 2404610 2328002 2252853 2180150 2110798 2043671 1978423 1916961
55862 1916961 1860352 1807203 1756643 1709798 1666743 1625116 1583632 1544057 1507920 1473919 1440309
55851 1440309 1407241 1375087 1343014 1310889 1280123 1250977 1221421 1190322 1159393 1130336 1102357
55840 1102357 1074317 1047173 1022357 999474 977366 955973 935636 915990 896793 878520 861200
55829 861200 844155 827648 813075 800752 789356 778195 768039 758880 749075 737795 726252 715398
55817 715398 704331 692087 679113 665871 651953 637763 625131 614948 605927 596850 588293 580987
55805 580987 574341 567908 562541 558757 555545 552099 549134 547254 545656 543773 542634 543083 544038 543957 542884
55790 542884 541823 541209 541167 542150 544274 547022 550346 554800 559880 563724 565271 565157 563604 559182 550772
55775 550772 539230 526015 511828 497767 486043 477941 472471 468409 466207 466377 467425 467177 465090
55762 465090 461631 456367 448424 438178 427041 416063 405833 396970 389573 382854 376274 370238 364777
55749 364777 358658 350961 342571 334955 328264 321705 314940 308039 300927 293971 288255 284236 280980 277683
55735 277683 274906 273242 271858 269698 267197 265425 264277 262840 260901 258838 256598 253939 251102 248152
55721 248152 244274 238894 232932 227825 223794 220137 216711 214051 212436 211852 212495 214501 217510 221207 225773
55706 225773 231157 236568 241329 245521 249153 251617 252667 252890 252310 249629 244064 236968 230352 224576 218780
55691 218780 212829 207367 202466 197712 193461 190732 189905 190426 191617 193022 194224 195123 196126 197503 199016
55676 199016 200658 202959 205847 208103 208910 209121 209927 210976 210983 209619 207663 205713 203850 202191 200789 199317
55660 199317 197705 196619 196502 196787 196904 197366 198829 200768 202264 203466 205084 206904 208030 208236 207921 207123
55644 207123 205693 204105 202963 202072 201044 200345 200594 201223 201122 200318 199712 199302 197950 194987 190915 186503
55628 186503 182092 177828 173707 169414 164868 160777 157909 156036 154347 152596 151030 149630 148285 147372
55614 147372 147205 147235 146633 145303 143466 140858 137425 134165 131980 130128 127270 123775 121449 121020 121347 121261
55598 121261 120809 120352 119662 118408 116734 115016 113642 113005 113002 112679 111247 109327 108216 108150 108258 108152 108345
55581 108345 109102 110015 110888 111986 113255 114296 115288 116946 119430 122237 125331 129344 134478 140160 146059
55566 146059 152409 159030 164939 169354 172243 173546 172721 169526 164648 159072 153356 147739 142337 136943
55552 136943 131182 125176 119640 115144 111651 108753 105939 102705 99030 95681 93482 92397 91884 91880 92622
55537 92622 93757 94644 95445 96897 98963 100782 102097 103636 105763 107771 108986 109717 110617 111799 113011
55522 113011 114095 114899 115248 115243 115094 114526 112979 110455 107463 104094 100041 95709 92321 90457 89309 87800
55506 87800 85733 83434 81045 78748 77014 75947 74911 73383 71820 71115 71510 72554 73853 75374 77142
55491 77142 79000 80625 81619 81742 81187 80498 80139 80298 81011 82166 83382 84216 84514 84347 83758 82881 82099 81657
55473 81657 81282 80643 79943 79512 79095 78265 77319 76933 76971 76527 75258 73867 73059 72744 72485 72104 71589 70981 70591
55454 70591 70807 71499 72023 71917 71279 70512 70115 70512 71508 72147 71768 70987 70882 71529 72203 72739 73525 74311 74343
55435 74343 73799 73725 74245 74188 73036 71955 72164 73304 74289 74830 75234 75432 75174 74733 74604 74814 75138 75654 76552
55416 76552 77704 78870 79999 81008 81710 82223 82916 83618 83523 82338 80915 80218 80212 80285 80205 80079 79838 79408 79093
55397 79093 79246 79788 80407 80867 80830 79860 78079 76340 75216 74212 72537 70327 68585 68117 68957 70584 72282
55380 72282 73465 74079 74615 75509 76679 77707 78198 77906 76902 75736 74966 74429 73500 72129 70938 70175 69446
55363 69446 68808 69138 70736 72400 72795 72225 72105 73029 74273 75053 75365 75524 75617 75700 76058 76898 77950 78565
55345 78565 78288 77318 76338 75770 75362 74721 73989 73531 73159 72300 70906 69566 68682 68235 68353 69265 70494 70982
55327 70982 70357 69369 68791 68677 69010 70111 71816 73107 73238 72606 71901 71135 70109 69171 68745 68685 68777 69301
55309 69301 70400 71512 72112 72434 72730 72502 71398 70221 70011 70574 70989 71177 71834 72977 73806 74052 74426
55292 74426 75488 76887 77941 78382 78329 78099 78104 78488 78809 78561 77909 77457 77419 77499 77471 77308 76894 76174 75522 75382
55272 75382 75615 75735 75649 75622 75605 75243 74538 73956 73830 74089 74505 74768 74477 73565 72607 72211 72291 72449 72750 73437
55252 73437 74181 74473 74622 75366 76460 76694 75612 74265 73807 74148 74528 74712 74880 74812 74035 72667 71465 70949
55234 70949 70906 70848 70623 70395 70260 70168 70199 70625 71507 72335 72438 71766 70981 70653 70710 70858 71131 71645 72100 72020 71424
55213 71424 70852 70752 71130 71757 72414 72933 73248 73478 73864 74579 75603 76626 77123 76784 75875 74868 73798 72379
55195 72379 70782 69667 69360 69627 70402 71889 73608 74345 73730 73012 73349 74082 73774 72450 71555 71924 72971
55178 72971 73885 74476 74740 74534 74035 73728 73698 73540 73152 72949 73171 73591 74049 74664 75331 75630 75461 75255 75363
55159 75363 75708 76213 77074 78397 79950 81380 82347 82476 81648 80332 79141 78152 77168 76535 76913 78194 79438
55142 79438 80060 80395 80900 81566 82350 83423 84579 85057 84472 83382 82548 82136 82047 82408 83192 83821 83746 83077 82153
55123 82153 80881 79178 77741 77594 78850 80510 81624 82175 82691 83373 83866 83687 82725 81361 80208 79679
55107 79679 79737 80067 80464 81070 82159 83666 84958 85259 84434 83220 82576 82881 83857 84989 85805 86027 85809 85730
55089 85730 86206 86952 87318 87014 86297 85612 85399 86034 87514 89311 90958 92544 94207 95421 95503 94709 94028
55072 94028 93876 93733 93184 92522 92057 91583 90952 90574 90882 91769 92910 94165 95310 95819 95455 94697 94133 93747
55054 93747 93230 92725 92756 93547 94765 95774 95890 94664 92346 89903 88223 87415 87125 87282 88023 89060 89665
55037 89665 89469 88943 88880 89566 90547 91154 91182 91009 91077 91328 91282 90645 89653 88748 88114 87619 87078 86510 86209 86570
55017 86570 87641 88842 89400 89139 88637 88537 88922 89391 89534 89226 88699 88447 88858 89786 90611 90827 90429 89777
54999 89777 89320 89429 90149 90989 91266 90836 90292 90287 90904 91822 92804 93832 94931 96052 97072 97885 98608 99616
54981 99616 101050 102309 102503 101582 100571 100376 100740 100788 100340 100173 101010 102697 104453 105609 105945 105567 104778
54964 104778 104037 103748 103940 104259 104393 104404 104447 104363 103918 103410 103465 104009 104029 102806 101025 100099 100601 101903 103151
54945 103151 104007 104512 104821 105158 105540 105562 104917 104041 103654 103665 103183 101746 99931 98574 97910 97697 97638 97454 97067
54926 97067 96893 97447 98473 99087 99041 99144 100070 101407 102498 103540 105117 107041 108593 109838 111898 115701
54910 115701 120935 126484 131510 135899 139836 143217 145584 146573 146294 145175 143554 141576 139356 136867 133806
54895 133806 129940 125653 121684 118354 115480 113111 111712 111350 111229 110452 108941 107347 106351 106256 106883 107572
54879 107572 107616 106955 106216 105997 106477 107756 109884 112381 114397 115821 117615 120632 124665 129160 134096 139415
54863 139415 144137 147106 148369 148961 149375 149117 147734 145472 142739 139596 136083 132565 129426 126695 124149
54848 124149 121613 119119 116920 115288 114142 113039 111789 110783 110283 109676 108035 105354 102575 100388 98610
54833 98610 96934 95618 95082 95218 95584 96000 96588 97359 98160 99026 100207 101657 102707 102555 101131 99248 97727
54816 97727 96619 95546 94660 94711 96100 98289 100362 101801 102549 102765 102881 103465 104557 105390 105237 104346 103580
54799 103580 103365 103488 103757 104254 104915 105387 105443 105175 104696 104018 103291 102829 102776 102946 103053 102863 102246 101389 100912
54780 100912 101335 102388 103275 103704 104169 105015 105761 105805 105517 106036 107981 110848 113773 116459 119016 121217 122577
54763 122577 123280 124528 127455 131888 136607 140724 144347 147885 151294 154324 157067 159832 162626 165053
54749 165053 166611 166885 165661 163115 159745 155894 151465 146351 140965 136065 132145 129170 126767 124490
54735 124490 122054 119568 117445 115913 114750 113674 112792 112442 112693 113196 113400 112884 111735 110730 110832 112272
54719 112272 114399 116577 118800 121217 123607 125840 128403 131761 135463 138616 141157 143923 147280 150324
54705 150324 151728 151073 149100 146901 144972 142941 140132 136456 132636 129440 126917 124643 122481 120712
54691 120712 119522 118769 118218 117705 117087 116315 115546 114991 114659 114424 114146 113566 112366 110620 108914 107671 106706
54674 106706 105847 105601 106551 108305 109741 110231 109997 109387 108491 107550 106997 106847 106626 106120 105716 105774 106126 106389
54656 106389 106412 106195 105765 105327 105158 105229 105241 105155 105254 105561 105691 105453 105176 105204 105534 106170 107328 108914 110252 110831
54636 110831 110980 111335 111885 112103 111840 111506 111283 110718 109359 107534 106166 105832 106208 106518 106474 106624 107665 109541
54618 109541 111427 112577 112929 112796 112242 111039 109212 107344 106168 105880 105974 105863 105536 105424 105680 105925 105845
54601 105845 105717 106059 106951 108000 108827 109320 109506 109499 109477 109453 109172 108509 107814 107597 107991 108778 109720 110490 110505 109465
54581 109465 107990 107207 107615 108763 109984 110930 111385 111247 110926 111213 112378 113777 114645 114904 114851 114405 113182
54564 113182 111227 109271 108126 107970 108285 108502 108648 109171 110065 110506 109740 108172 107085 107248 108280 109367
54548 109367 110113 110550 110789 111011 111471 112209 112950 113432 113696 113955 114394 115164 116313 117632 118818 119816 120722 121392
54530 121392 121551 121334 121221 121340 121314 121001 120846 121160 121540 121441 120947 120458 119912 118888 117395 115988 115040 114320
54512 114320 113466 112527 111855 111574 111420 111067 110500 109978 109722 109776 110138 110870 111970 113286 114663 116030 117230
54495 117230 117957 118119 118051 118169 118522 118915 119215 119257 118734 117651 116653 116378 116629 116711 116440 116231 116266 116270 116106 115899
54475 115899 115554 114858 114251 114678 116311 118090 118940 118924 118795 118981 119448 120138 120962 121601 121723 121227 120214 119119
54457 119119 118914 120510 123554 126384 127665 127619 127266 127045 126793 126536 126492 126464 125945 124805 123420 122217 121466
54440 121466 121350 121794 122280 122211 121411 120138 118859 118162 118428 119232 119508 118775 117765 117384 117559 117729 117981 118746
54422 118746 119648 119687 118665 117564 117275 117663 118138 118511 118920 119455 120231 121484 123171 124738 125657 126066 126632
54405 126632 127790 129264 130250 130018 128483 126367 124810 124652 125908 127778 129214 129736 129786 130144 131034 132073
54389 132073 133083 134466 136559 139033 141260 142883 143690 143387 142049 140464 139409 138718 137696 136312 135411
54374 135411 135703 137087 138931 140488 141071 140441 139225 138491 138789 139923 141575 143531 145257 145984 145588 144886
54358 144886 144669 144804 144638 143965 143230 142993 143528 144768 146317 147610 148339 148717 149286 150606 153117 156887 161250
54341 161250 164983 167303 168574 169727 171003 171589 170548 167884 164574 161638 159233 156664 153270 149275
54327 149275 145712 143456 142469 142035 141576 141064 140712 140522 140250 139709 138985 138294 137720 137157 136503 135844 135413 135385
54309 135385 135746 136280 136642 136526 135858 134835 133760 132831 132110 131559 131068 130507 129855 129238 128732 128196 127425 126496
54291 126496 125877 126087 127236 128887 130408 131444 132015 132208 131951 131172 129994 128623 127260 126335 126554 128225
54275 128225 130641 132694 134138 135661 137524 138846 138745 137692 137000 137133 137258 136550 135364 134792 135386 136695
54259 136695 137941 138842 139668 140670 141704 142507 143117 143781 144558 145303 146004 146811 147680 148418 149150 150238 151508
54242 151508 152027 151124 149302 147703 146848 146404 146020 145818 145932 146020 145481 144028 141895 139584 137491 135799 134705
54225 134705 134558 135509 137025 138088 138038 137051 135748 134695 134329 134891 136084 137167 137765 138251 138998 139631 139572
54208 139572 138989 138619 138764 139009 138905 138428 137783 137202 137015 137471 138356 139080 139307 139242 139271 139532 139899 140190 140321
54189 140321 140344 140351 140329 140203 140074 140197 140648 141290 142090 143098 143925 143759 142290 140244 138611 137678 137198 137053 137224
54170 137224 137439 137487 137632 138146 138694 138767 138526 138522 138764 138711 138115 137218 136238 135282 134674 134656 134837 134622 134144 134012 134198
54149 134198 134006 133262 132636 132555 132615 132449 132450 133195 134629 136220 137506 138277 138687 139343 140744 142424 143286 142990
54131 142990 142367 142202 142335 142364 142461 142871 143226 143081 142682 142541 142587 142388 141971 141754 141850 142007 142176 142602 143406 144452
54111 144452 145564 146471 146721 146112 145161 144730 145217 146410 147993 149727 151161 151675 151060 149800 148667 148172
54095 148172 148399 149156 150090 150797 150976 150594 149938 149480 149530 149972 150419 150679 150908 151249 151499 151299 150560 149561 148680
54076 148680 148116 147871 147931 148398 149371 150703 152080 153455 155142 157273 159351 160657 160965 160576 159876 159268 159331
54059 159331 160410 162063 163464 164440 165605 167415 169677 172205 175369 179650 185018 191059 197383 203680
54045 203680 209662 215253 220590 225714 230442 234592 237980 240197 240862 240233 239168 238366 238074 238475 239710
54030 239710 241422 243003 244598 247107 250782 254562 257332 259188 260808 262149 262633 262293 261910 262081 262693
54015 262693 263251 263241 262341 260739 259087 257722 256081 253290 249168 244282 239297 234666 230671 227220 223820
54000 223820 220196 216725 213818 211154 208148 204936 202236 200375 199073 198122 197567 197186 196433 195066 193336
53985 193336 191459 189373 187124 185065 183457 182206 181071 179891 178579 177261 176393 176328 176737 176859 176425 175968
53969 175968 176096 176802 177652 178333 178858 179367 179862 180069 179657 178776 178175 178474 179430 180297 180806 181387 182496 184221
53951 184221 186555 189522 192853 195939 198364 200273 202115 204281 207013 210299 213824 217374 221385 226632
53937 226632 233258 240507 247662 254801 262326 270152 277832 285205 292335 298872 304034 307443 309643 311524
53923 311524 313382 314824 315520 315796 316370 317660 319508 321551 323744 326478 330289 335464 341846 349011 356641
53908 356641 364657 372925 381042 388632 395743 402662 409428 415964 422719 430692 440514 451734 463087 472971
53894 472971 479505 480759 475669 464764 449673 432072 413302 394573 376862 360523 345408 331453
53882 331453 318888 307861 298094 289050 280395 272365 265625 260485 256288 251907 247013 242326 238433 234946
53868 234946 231299 227809 225191 223344 221446 219136 216879 215106 213617 212006 210163 208204 206260 204468
53854 204468 202888 201433 200072 198964 198032 196665 194377 191673 189658 188810 188654 188594 188512 188470 188435 188449 188583 188592
53836 188592 188059 186989 185860 185048 184612 184606 185065 185664 186008 186277 186940 187729 187739 186848 186232 186973 188736 190356
53818 190356 191226 191575 191761 191956 192322 193015 194090 195683 198006 200835 203389 205163 206632 208696 211605 214856
53802 214856 218021 221187 224620 228397 232476 236885 241718 246905 251990 256305 259738 263196 267678 272718
53788 272718 276454 277685 277236 276734 276677 276507 276087 275965 276239 276291 275859 275409 275045 273940 271466 268200 265053
53771 265053 261923 258026 253303 248636 244658 241178 237900 234918 232185 229145 225468 221667 218461 215801
53757 215801 213149 210492 208376 207013 206016 205114 204461 204031 203350 202191 201027 200349 199958 199367 198528 197727 197111
53740 197111 196831 197278 198544 199945 200734 201115 201815 202844 203499 203612 203876 204719 205648 206092 206185 206274 206286 206172 206493
53721 206493 207922 210336 212949 215166 216910 218280 219334 220217 221154 222287 223688 225439 227501 229653 231738
53706 231738 233892 236284 238763 240967 242758 244370 246156 248304 250768 253452 256455 260053 264287 268684
53692 268684 272641 276000 278941 281404 283118 284217 285260 286413 287138 286989 286284 285589 284920 283880 282292
53677 282292 280333 278282 276503 275381 274834 274155 272800 271138 269942 269342 268838 268195 267712 267535 267251 266374
53661 266374 264886 263179 261792 261214 261556 262233 262329 261455 260077 258858 257975 257249 256630 256259 256178 256315 256711 257491
53643 257491 258533 259421 259912 260352 261384 263170 265133 266618 267669 268934 270886 273402 276116 278804 281324
53628 281324 283493 285284 286957 288780 290723 292610 294453 296494 299030 302315 306394 310903 315224 319089
53614 319089 322825 326829 331028 335200 339546 344468 349844 355046 359781 364428 369353 374261 378606 382433
53600 382433 386322 390510 394460 397631 400441 404033 408863 413855 417313 418598 418520 418040 417038 414701 410826
53585 410826 406321 402364 399366 396784 393749 389808 385195 380543 376329 372591 369089 365663 362366 359344
53571 359344 356707 354514 352886 352024 351991 352406 352574 352140 351443 351001 350849 350761 350938 351819 353144 353867 353373 352337
53553 352337 352005 352949 354863 357166 359310 360806 361568 362218 363645 366271 369973 374495 379591 384970 390570
53538 390570 396776 403858 411326 418330 424721 431172 438231 445871 454116 463503 474475 486752 499695
53525 499695 513035 526811 540872 554977 569328 584479 600624 617375 634402 651964 670587
53514 670587 690482 711595 734028 757938 783013 808483 833841 859211 884785 910293 935423
53503 935423 960464 985908 1011426 1035855 1058442 1079723 1100895 1122620 1144667 1166406 1187337
53492 1187337 1207329 1226680 1245875 1265154 1284364 1303324 1322109 1340843 1359498 1378059 1396610
53481 1396610 1414965 1432520 1448848 1464260 1479267 1493497 1505576 1514275 1519569 1522416 1523585 1522884
53469 1522884 1519509 1513020 1503765 1492316 1478876 1463591 1447209 1430814 1414811 1398716 1382042 1364837
53457 1364837 1347128 1328488 1308658 1288050 1267124 1245684 1223395 1200677 1178379 1156802 1135667
53446 1135667 1114928 1094979 1076143 1058539 1042451 1028312 1016364 1006774 999862 995538 992644 989698
53434 989698 986436 983928 983003 983313 984227 985927 989058 993800 999819 1006916 1015257 1025113 1036646 1049842
53420 1049842 1064525 1080615 1098407 1118227 1139780 1162312 1185592 1210217 1236723 1264968 1294773
53409 1294773 1326546 1360669 1396710 1434057 1473088 1514897 1559889 1607397 1656834 1708382 1762196
53398 1762196 1817537 1873321 1929229 1985658 2042785 2100241 2157779 2215696 2274315 2333315 2391822
53387 2391822 2448995 2504354 2557780 2609436 2659512 2707714 2753120 2794802 2832436 2865988 2895017
53376 2895017 2918922 2937814 2952435 2962883 2968057 2966771 2958845 2944612 2923889 2896244 2862016 2822252
53364 2822252 2777708 2728662 2675706 2620011 2562627 2504145 2445243 2386928 2329928 2274368 2220339
53353 2220339 2168297 2118484 2070416 2023370 1977079 1931535 1886433 1841375 1796509 1752456 1709585
53342 1709585 1667761 1626844 1587118 1549095 1513189 1479740 1449115 1421521 1396717 1374052 1352873
53331 1352873 1332827 1313690 1295025 1276296 1257427 1239029 1221763 1205625 1190106 1174991 1160665
53320 1160665 1147592 1135841 1125239 1115716 1107328 1100073 1093894 1088820 1085091 1083163 1083469 1085960 1089955
53307 1089955 1094706 1100154 1106888 1115429 1125852 1138166 1152667 1169680 1189126 1210536 1233470 1257851
53295 1257851 1283927 1311771 1340773 1369892 1398686 1427805 1457934 1488458 1517848 1545349 1571480
53284 1571480 1596645 1620019 1640308 1657067 1670686 1681508 1689540 1694786 1697247 1696689 1692807 1685621 1675422
53271 1675422 1662455 1646924 1629074 1608993 1586603 1562156 1536436 1510077 1483014 1455052 1426648
53260 1426648 1398425 1370245 1341496 1312208 1283054 1254212 1225149 1195777 1166932 1139228 1112156
53249 1112156 1084961 1057785 1031176 1004932 978274 951081 924142 898155 873176 849153 826315
53238 826315 804784 784304 764669 745949 728116 710955 694731 680395 668490 658231 648302 638378
53226 638378 629133 620762 612239 602240 590282 576755 562366 547821 533529 519230 504281 488677
53214 488677 473475 459863 448101 437729 428388 419928 411983 404113 396379 389268 382931 376848 370338
53201 370338 363196 355788 348664 342030 335449 328313 320738 313677 307860 302970 298268 293645 289485 285873
53187 285873 282677 280139 278567 277469 275902 273728 271695 270073 268138 265331 262159 259438 257323 255587
53173 255587 254304 253649 253429 253333 253326 253391 253228 252636 251868 251188 250480 249670 249153 249218 249411 249087 248352 247879 247879 247875 247417
53152 247417 246576 245654 244833 244168 243699 243527 243819 244520 244947 244076 241612 238506 236066 234818 234497 234709 235076
53135 235076 235138 234801 234697 235453 236722 237570 237722 237773 238197 238843 239434 239866 239862 239000 237434 236062 235582 235757 235892
53116 235892 235709 235371 234988 234555 234305 234733 236044 237737 238912 239128 238867 238942 239459 239735 239369 238855 238720 238495
53098 238495 237264 235047 232863 231406 230373 229225 227883 226385 224559 222504 220898 220264 220239 220055 219484
53083 219484 218871 218464 218225 218168 218355 218551 218396 218054 218275 219536 221420 223117 224308 225166 225573 224898 222884
53066 222884 220424 218908 218817 219400 219840 220205 220926 221777 221973 221174 219889 218870 218507 218815 219559 220226 220287 219710
53048 219710 219016 218717 218900 219414 220164 220979 221438 221107 219958 218458 217210 216482 216016 215406 214732 214553 215041 215409
53030 215409 214730 213204 212039 211985 212535 212800 212607 212431 212604 213017 213338 213219 212474 211362 210503 210278 210526 210994
53012 210994 211729 212744 213662 214137 214377 214794 215338 215734 216264 217627 219812 221627 221746 220068 217815 216439
52996 216439 216549 217713 219072 220095 220887 221857 223186 224631 225722 226084 225686 224958 224550 224821 225612 226616
52980 226616 227743 228924 229810 230111 230214 230966 232707 234902 236871 238546 240207 241783 242808 243084 243090 243642
52964 243642 245199 247429 249490 250834 251746 252940 254602 256116 256786 256435 255162 253016 250405 248357 247608
52949 247608 247544 246783 244897 242844 241458 240280 238398 235811 233280 231184 229280 227444 225912 224699 223438
52934 223438 221993 220753 220119 220030 220190 220372 220297 219600 218234 216660 215345 214313 213410 212759 212565 212641 212533 212144
52916 212144 211925 212369 213415 214469 214971 214936 214898 215212 215533 215226 214326 213669 213864 214465 214543 213882 213189 213161 213772
52897 213772 214530 215136 215679 216354 217174 217987 218716 219479 220367 221110 221172 220315 218969 217888 217522 217798 218397 219033
52879 219033 219559 220003 220531 221274 222191 223063 223569 223441 222797 222340 222874 224468 226323 227643 228358 228805 229059 228968
52861 228968 228618 228336 228300 228478 228827 229263 229482 229137 228229 227123 226273 226021 226456 227200 227550 227141 226252 225162
52843 225162 223579 221126 218147 215420 213203 211145 209003 206846 204622 202254 200223 199274 199356 199516 199185
52828 199185 198923 199513 200872 202334 203533 204500 205258 205847 206502 207306 207856 207711 207035 206332 205715 204878 203756
52811 203756 202750 202254 202327 202843 203627 204414 205027 205727 207050 209116 211311 212857 213533 213637 213362 212494 210838
52794 210838 208707 206845 205810 205464 205089 204000 202151 200186 198893 198585 199032 199968 201337 202917 204070
52779 204070 204382 204383 205051 206494 207791 208304 208448 208681 208507 207299 205672 205055 205965 207547 208775 209270 208908
52762 208908 207581 205745 204405 204095 204372 204667 204995 205424 205521 204962 204243 204113 204597 205180 205667 206244 206778 206727
52744 206727 205834 204558 203686 203776 204874 206499 207990 209111 210287 211992 214091 216080 217816 219628 221753
52729 221753 224064 226389 228765 231212 233495 235272 236422 237142 237719 238164 238121 237210 235504 233493 231608 230013
52713 230013 228831 228183 227820 227091 225572 223473 221201 218826 216345 214233 213254 213724 215231 217020 218427
52698 218427 219012 218628 217508 216206 215374 215491 216528 217840 218684 218982 219323 220129 221212 222334 223697 225420
52682 225420 226937 227453 226900 225960 225248 224867 224731 224856 225268 225816 226094 225568 224071 222310 221451 221914 222941
52665 222941 223660 224095 224627 224979 224509 223247 221885 220918 220471 220789 222051 223782 225299 226775 229011 232033
52649 232033 234812 236642 237991 239607 241453 242944 243622 243206 241619 239376 237412 236058 234784 233315 232280
52634 232280 232161 232293 231727 230571 229609 228986 228289 227665 227839 228968 230427 231897 233806 236361 238854 240359
52618 240359 240595 239765 238085 235909 233875 232407 231320 230278 229410 229040 229129 229417 230007 231245 233072 234918
52602 234918 236318 237286 238003 238485 238705 238741 238673 238536 238487 238805 239581 240548 241319 241645 241366 240429 239145 238167 237936
52583 237936 238290 238856 239614 240725 241988 242956 243604 244426 245696 247010 247742 247721 247242 246674 246255 246068 245981 245760
52565 245760 245416 245222 245231 244966 243897 242134 240400 239370 239251 239822 240640 241190 241126 240470 239520 238626 238068 237968
52547 237968 238123 238061 237459 236435 235345 234477 234162 234849 236642 238852 240406 240798 240403 239903 239685 239754 239946 240148
52529 240148 240419 240829 241089 240672 239612 238842 239139 239991 240165 239356 238449 238063 237706 236765 235569 234828 234611 234563
52511 234563 234784 235727 237407 239473 241985 245400 249615 253633 256524 258311 259681 261111 262566 263829 264789
52496 264789 265425 265695 265437 264370 262340 259648 257007 255021 253746 252810 251870 250821 249684 248448 247104
52481 247104 245760 244666 244082 244043 244273 244417 244437 244713 245654 247229 248961 250411 251523 252458 253227 253690 253923
52464 253923 254361 255430 257141 259238 261663 264624 268119 271600 274296 275804 276231 275821 274707 273083 271403
52449 271403 270080 269002 267556 265293 262399 259358 256325 253175 250121 247859 246831 246600 246256 245323 244038
52434 244038 242858 242008 241466 241145 241032 241317 242286 243783 244949 244973 244174 243860 244858 246585 247932 248676 249507
52417 249507 250778 251901 252187 251908 252124 253565 255970 258615 261303 264592 269046 274521 280440 286719 294057
52402 294057 303119 313570 324072 333057 339444 342881 343647 342223 338732 332907 324935 316158 308440 302642
52388 302642 298062 293572 288978 285023 282355 280952 280452 280596 281235 282220 283447 284852 286303 287642 288942
52373 288942 290495 292474 294824 297650 301403 306327 311828 316865 321026 324885 329107 333516 337339 340174
52359 340174 342355 344366 346223 347531 347994 347775 347445 347625 348516 349695 350501 350755 351048 352191 354487 357624
52343 357624 361163 364878 368650 372385 376272 380969 387177 394985 403768 412799 421876 431345 441666 453053
52329 453053 465388 478465 492405 507829 525423 545208 566386 588052 609903 632110 654698
52318 654698 677337 699708 721833 743997 766421 788868 810443 829933 846713 861229 874385
52307 874385 886572 897623 907545 916771 925596 933830 941145 947419 952624 956717 959812 962030 963022 962058
52293 962058 958937 954457 949706 945136 940564 935704 930344 924307 917705 911045 904743 898806 893397 889452
52279 889452 888122 889628 893150 897916 903963 911762 921560 933292 946831 961974 978216 994745 1010821
52266 1010821 1026246 1041416 1056718 1071876 1086120 1099060 1110998 1122253 1132621 1141791 1149875 1157019
52254 1157019 1162838 1166870 1169472 1171659 1174000 1176116 1177280 1177109 1175686 1173349 1170407 1166737 1161767 1155186
52240 1155186 1147558 1139815 1132229 1124346 1115926 1107400 1099378 1092149 1085757 1080153 1075173 1070726 1067047 1064409
52226 1064409 1062658 1061399 1060603 1060530 1061155 1062220 1063845 1066461 1070020 1073899 1077710 1081647 1085900 1090358 1095137
52211 1095137 1100783 1107592 1115272 1123485 1132264 1141651 1151466 1161632 1171999 1181582 1188793 1193051 1195583
52198 1195583 1198007 1200692 1203131 1205298 1207667 1210168 1212066 1212990 1213421 1214083 1215295 1216931 1218578 1219767 1220355
52183 1220355 1220630 1220773 1220443 1219233 1217260 1214840 1211824 1207792 1202758 1197154 1191206 1184859 1178275 1171843 1165656
52168 1165656 1159408 1152924 1146436 1140358 1135150 1131357 1129318 1128785 1129143 1130017 1131355 1133082 1135091 1137544 1140619
52153 1140619 1143981 1146968 1149336 1151331 1152952 1153745 1153498 1152606 1151465 1149981 1148019 1145906 1144098 1142721 1141868
52138 1141868 1142044 1143749 1146710 1150043 1153249 1156716 1161164 1166884 1173658 1181219 1189636 1199359 1211003 1224955
52124 1224955 1241120 1259149 1278957 1300853 1325062 1351322 1379190 1408538 1439343 1470990 1502302
52113 1502302 1532462 1561461 1589255 1614932 1637358 1656411 1672868 1687012 1698062 1705174 1708333 1707917
52101 1707917 1703951 1696374 1685759 1673262 1660009 1646780 1634018 1621779 1609816 1598090 1587061 1577247
52089 1577247 1568758 1561528 1555646 1551027 1547011 1542835 1538453 1534570 1531924 1530845 1531253 1532713 1534677 1537092
52075 1537092 1540696 1546363 1554353 1564544 1576995 1591606 1607416 1623039 1637932 1652684 1667924 1683467
52063 1683467 1698635 1712827 1725595 1736619 1745841 1753302 1758714 1761559 1761677 1759315 1754491 1746774 1735968
52050 1735968 1722588 1707475 1691239 1674271 1656840 1638894 1620050 1600070 1579155 1557644 1535814
52039 1535814 1514085 1493009 1472684 1452537 1432074 1411666 1392242 1374423 1358270 1343695 1330729
52028 1330729 1319441 1309871 1302026 1295724 1290549 1286127 1282273 1278580 1274016 1267430 1258580 1248419 1238150
52015 1238150 1228151 1217889 1206763 1194758 1182214 1169136 1154994 1139300 1122210 1104338 1086001
52004 1086001 1066917 1046651 1025194 1002983 980521 958177 936295 915238 895095 875388 855333
51993 855333 834679 814239 795234 778034 761938 746386 731937 719575 709329 700290 691871 684375
51981 684375 678082 672464 666751 660872 655313 650129 644582 637822 629675 620637 611253 601612 591489 580881
51967 580881 570248 560195 551050 542901 535918 530386 526444 523978 522779 522661 523530 525537 529083 534395
51953 534395 541081 548339 555608 562763 569642 575552 579380 580221 578095 574113 569704 565504 561331 557426
51939 557426 555117 555678 558866 563393 568609 574924 582644 591381 600784 610963 621771 632307 641510 648650
51925 648650 653003 653813 651106 645851 638746 629419 617443 603513 588832 573811 558295 542762 528273
51912 528273 515220 502995 491050 479657 469445 460886 454452 450678 449623 450614 452914 456497 461951
51899 461951 469785 479967 491906 504633 517088 528468 538374 546593 552819 556617 557642 555829 551358
51886 551358 544455 535328 524398 512419 500177 488095 476388 465514 456008 447854 440548 434090 429425
51873 429425 427493 428106 430205 432945 436101 439645 443525 447896 453064 459060 465427 471374 475969 478443
51859 478443 478676 477250 474672 470749 465172 458484 451924 446344 441903 438754 437306 437552 438774 440246 441821
51844 441821 443536 445179 446615 448146 450004 451669 452158 450922 448193 444526 440319 435716 430778 425724
51830 425724 421084 417451 414968 413286 412146 411730 412152 412931 413403 413501 413654 414002 414159 413801 412971 411685 409663
51813 409663 406732 403184 399457 395768 392340 389775 388797 389598 391700 394432 397338 400188 402843 405188 407049
51798 407049 408187 408502 408135 407173 405325 402202 397910 393014 387920 382691 377664 373754 371628 370711 369520
51783 369520 367115 363932 361058 358941 357124 355233 353848 354026 356019 358857 361381 363284 364730 365360 364509
51768 364509 362453 360649 360338 361474 363356 365708 368635 372084 376111 381345 388461 397271 406856 416433
51754 416433 425534 433608 440136 445017 448144 448751 446032 440418 433458 426319 419136 411875 404924 398577
51740 398577 392778 387757 384208 382483 382340 383844 387614 393680 400925 408356 416205 424974 434033 442073
51726 442073 448549 453823 458307 462355 466659 471671 476569 479646 479848 477388 472992 467229 460624 453695
51712 453695 446679 439646 432920 426940 421765 417178 413144 409609 406047 401926 397608 394111 391958 390951
51698 390951 391071 392726 395855 399515 402762 405357 407323 408417 408489 407932 407370 407261 408039 410080 413042 415591
51682 415591 416327 414819 411517 406949 401462 395531 389818 384921 381230 378934 377949 377973 378820 380686 383988
51667 383988 389110 396310 405550 416194 427177 437735 447788 457376 465858 471930 474415 472970 468255
51654 468255 461542 454007 446278 438736 432175 427777 426287 427589 431161 436444 442407 447343 449816 449767 448153
51639 448153 445562 441710 436339 430001 423601 417483 411337 404933 398601 392892 387958 383484 379214 375311
51625 375311 372062 369368 366812 364182 361694 359663 358180 357127 356192 354826 352621 349947 347851 347014 347049
51610 347049 347202 347406 348105 349179 349767 349343 348446 347981 348157 348550 349078 350329 352859 356542 360918 365857 371506
51593 371506 377747 384249 391131 398991 407836 416351 422767 426349 427535 426772 423974 419271 413661 408389
51579 408389 404067 400720 398369 397117 396975 398102 401089 406484 414104 423209 433328 444577 457237 471477
51565 471477 487397 504768 522650 539918 556437 573268 591352 610498 630168 650859 674033
51554 674033 700822 731417 765635 803125 842460 880590 913937 940132 958419 968581 970055 962288
51542 962288 945633 921623 892380 859825 825223 789247 752414 715523 679710 646093 615436
51531 615436 588084 564079 543206 525012 508933 494520 481599 470227 460409 451821 443954 436585
51519 436585 429952 424270 419225 414279 409352 404786 400586 396190 391226 386182 382022 379367 378231 378184 378486
51504 378486 378372 377714 377211 377526 378433 379322 380370 382450 385753 389154 391321 392022 391926 391467 390449 388787 387119
51487 387119 386431 387115 388515 389446 389183 387975 386589 385420 384127 382060 378846 374555 369559 364364 359387
51472 359387 354655 349705 344061 337971 332469 328436 325534 322441 318440 314542 312523 312828 313933 313980 312574
51457 312574 310624 308985 307881 307456 308055 309736 311956 314051 315910 317999 320846 324540 328728 333156 338186
51442 338186 344524 352313 360864 369540 378575 388541 399298 409993 419888 428551 435325 439407 440683 440020
51428 440020 438471 436577 434449 431972 428735 424210 418271 411228 403343 394791 386185 378527 372359 367439
51414 367439 363427 360354 358158 356406 354905 354051 354094 354626 355363 357005 360492 365617 371061 375765 379660
51399 379660 383090 386094 388495 390287 391741 393309 395446 398350 401845 405609 409449 413317 417339 422001
51385 422001 427939 435295 443631 452896 464114 478541 496392 517094 540783 568804 602506 642068
51373 642068 686762 735816 788477 843389 898264 950193 996235 1034028 1062188 1080238 1088062 1085504
51361 1085504 1072545 1049822 1018790 981298 938969 892935 844125 793759 743504 695076 649745
51350 649745 608163 570509 536811 507268 482329 462240 446432 433609 422682 413423 406007 400101
51338 400101 394796 389417 384011 378960 374409 370263 366552 363525 361309 359626 357953 355973 353792 351718
51324 351718 349908 348269 346552 344441 341705 338461 335210 332392 330020 327930 326216 325074 324356 323752 323327
51309 323327 323351 323605 323524 323168 323342 324454 325872 326853 327494 328220 328894 329210 329614 331049 333846 337479 341283
51292 341283 344813 347587 349158 349593 349383 348816 347828 346449 344949 343499 342125 341026 340539 340700 341320 342501
51276 342501 344602 347524 350423 352358 352998 352650 351856 351060 350358 349488 348340 347436 347647 349394 352410 356194
51260 356194 360253 363919 366514 367923 368636 369013 368830 367655 365396 362411 359384 357116 355977 355406 354401
51245 354401 352623 350597 348707 346606 343961 341212 339036 337428 335924 334510 333688 333642 333916 334041 334109 334495
51229 334495 335236 335927 336129 335758 335027 334108 332993 331731 330632 329993 329714 329478 329303 329534 330265 331166 332008 332939
51211 332939 333927 334403 333966 333173 333076 333990 335239 336199 337121 338684 341049 343660 345909 347762 349688 352073
51195 352073 354737 357079 358667 359619 360321 360922 361285 361426 361734 362556 363629 364107 363323 361450 359277 357351
51179 357351 355553 353579 351579 350054 349206 348779 348526 348465 348554 348461 347980 347497 347668 348602 349607 349882 349379 348910
51161 348910 349439 351316 354217 357728 361779 366360 370993 374862 377540 379291 380485 380965 380215 377983 374495
51146 374495 370198 365607 361436 358471 357047 356737 356745 356635 356586 356949 357669 358216 358040 357036 355584 354236 353386
51129 353386 353057 352865 352301 351202 349957 349078 348603 348146 347611 347563 348616 350564 352437 353554 354286 355537 357563
51112 357563 359646 361039 361948 363218 365223 367502 369566 371611 374135 377170 380253 383025 385526 387964
51098 387964 390504 393175 395772 397903 399468 400945 402796 404630 405489 405087 404234 403740 403388 402463 401039 400059
51082 400059 400105 400653 400800 400350 399746 399160 398195 396616 394904 393793 393562 394127 395542 397864 400657 403306 405980
51065 405980 409627 414741 420795 427349 435021 444604 455697 467177 478858 491626 505778 520069 532812
51052 532812 543367 552279 560546 569092 578488 588726 599510 610919 623398 636835 650165 662156
51040 662156 672101 679352 682885 682153 678166 673018 668132 663252 657004 648049 635831 620770 603931 586274
51026 586274 568134 549527 530839 513043 497260 484274 474237 466643 460743 456291 453772 453705 455908
51013 455908 459690 464495 469970 475658 481239 487102 494082 502409 511260 519603 527301 535207 544243 554510
50999 554510 565219 575464 585067 594587 604509 614774 625281 636482 648930 662350 675659 687985
50987 687985 699219 709547 718938 727324 734906 741974 748666 755101 761522 768103 774804 781596 788646 796048
50973 796048 803616 811137 818759 826966 836447 848194 863528 883611 908895 939205 974196 1013462
50961 1013462 1056395 1102475 1151849 1205296 1263303 1325246 1389578 1454697 1519520 1583422 1645873
50950 1645873 1706198 1763545 1817021 1865961 1910172 1949980 1985979 2018611 2047887 2073651 2096250
50939 2096250 2116881 2136938 2156886 2175901 2192697 2206509 2217177 2224590 2228506 2228873 2225891 2219551
50927 2219551 2209350 2194681 2175303 2151188 2121976 2086836 2044967 1996163 1940933 1880207 1814998
50916 1814998 1746335 1675476 1604091 1533993 1466533 1402317 1341558 1284605 1231928 1183743 1139953
50905 1139953 1100547 1065772 1035686 1009657 986578 965613 946553 929407 913913 899668 886637
50894 886637 875155 865321 856628 848378 840291 832525 825274 818620 812692 807708 803931 801737 801505 803047
50880 803047 805323 807268 808934 811302 814974 819590 824644 830133 836122 842431 849292 857607 867775 878711
50866 878711 888941 898445 908656 920869 935467 952601 972538 995112 1019688 1046139 1075300 1108086
50854 1108086 1144688 1185059 1229737 1279769 1336125 1399478 1470195 1548165 1632916 1724342 1823164
50843 1823164 1930361 2046222 2170115 2300963 2437670 2579166 2724228 2871149 3017493
50834 3017493 3160339 3296874 3424593 3540998 3643606 3730693 3801865 3857692 3898963 3926622
50824 3926622 3942341 3948883 3949810 3948780 3948924 3952652 3961918 3978346 4002671 4033887 4069225 4105055 4137644
50811 4137644 4163124 4177322 4176229 4156825 4117406 4057259 3976199 3874505 3753348 3615193 3463494
50800 3463494 3301811 3133495 2962342 2792933 2629548 2474804 2329879 2195836 2073985
50791 2073985 1965074 1869057 1785784 1715077 1655892 1606312 1564824 1530903 1503984 1482691 1465647
50780 1465647 1452222 1441754 1432725 1423648 1414346 1405467 1396989 1388055 1378070 1367132 1355380 1342635 1328742
50767 1328742 1313710 1297497 1280137 1262018 1243520 1224448 1204319 1183218 1161897 1141032 1120869
50756 1120869 1101555 1083331 1066246 1050137 1035097 1021705 1010688 1002526 997378 995100 995241 997242
50744 997242 1000760 1005915 1013365 1024073 1038655 1056887 1078195 1102723 1131411 1164837 1202592 1244166
50732 1244166 1289885 1340440 1395995 1456248 1520787 1588647 1658074 1727646 1797431 1868280 1940231
50721 1940231 2012396 2084028 2154629 2223105 2287828 2347697 2402252 2450622 2491216 2522601 2543917
50710 2543917 2554384 2553591 2542814 2525244 2504397 2482843 2462752 2446660 2436772 2433925 2437896 2448367
50698 2448367 2464918 2486298 2510280 2534146 2554930 2569433 2574615 2568144 2548436 2514406 2465676 2403136
50686 2403136 2328972 2245917 2156452 2062765 1967427 1873910 1786045 1706621 1636533 1575447 1523177
50675 1523177 1480133 1446639 1422315 1406300 1397822 1396463 1402020 1414119 1431842 1453807 1478739 1505671
50663 1505671 1533390 1560175 1584693 1606865 1627234 1645677 1661530 1674920 1687078 1699141 1711370
50652 1711370 1723794 1736867 1751028 1766176 1782077 1798949 1817250 1837162 1858691 1882133 1908189
50641 1908189 1937757 1971596 2009919 2052187 2097516 2145319 2195304 2246969 2299532 2352321 2404757
50630 2404757 2455997 2505102 2551608 2595487 2636742 2675626 2712830 2748086 2778163 2797348 2800746
50619 2800746 2786778 2756528 2712031 2656294 2594141 2531484 2473353 2422907 2381856 2350927 2329839
50608 2329839 2317500 2312497 2313242 2317716 2323439 2327724 2327877 2321461 2306681 2282504 2248347 2203957 2149805
50595 2149805 2087349 2018699 1946104 1871607 1796685 1722089 1648526 1577673 1511871 1452489 1399106
50584 1399106 1350659 1306882 1268207 1234809 1206327 1182154 1161460 1143230 1126775 1111959 1098675
50573 1098675 1086528 1075452 1066083 1058967 1053831 1050261 1048653 1049714 1053363 1058892 1066065 1075280 1086673
50560 1086673 1099804 1114325 1130432 1148518 1168821 1191491 1216626 1244156 1273895 1305619 1338892
50549 1338892 1372970 1407197 1441264 1474820 1507147 1537664 1566495 1594121 1620763 1646664 1672771
50538 1672771 1700543 1731142 1765265 1803598 1846930 1895888 1951017 2013045 2082639 2159999 2245055
50527 2245055 2337902 2438656 2547092 2662860 2785762 2915236 3049826 3187671 3327205 3466651
50517 3466651 3603164 3733377 3854725 3965367 4062883 4144097 4206466 4248784 4270163 4269232 4245027
50506 4245027 4198274 4131306 4047064 3948579 3839070 3722055 3601441 3481753 3368036 3265119
50496 3265119 3176733 3105147 3051457 3016228 3000022 3003093 3024265 3060235 3106223 3157093 3207487
50485 3207487 3251345 3282343 3295154 3286113 3253054 3195488 3115099 3015286 2899857 2772587 2637860
50474 2637860 2500552 2364591 2232204 2104955 1984819 1873603 1771938 1679630 1596654 1523096
50464 1523096 1458339 1401069 1350141 1304966 1265158 1230363 1200448 1175356 1154712 1137871 1124401
50453 1124401 1114123 1106718 1101712 1099073 1099437 1103383 1110487 1119311 1128419 1137424 1147019 1157928 1169865
50440 1169865 1181664 1192389 1201963 1210562 1217785 1222974 1226269 1228767 1231418 1234138 1236303 1237889 1239744
50427 1239744 1242840 1247610 1254008 1261740 1270357 1279571 1289886 1302703 1319371 1340134 1364257 1391117
50415 1391117 1420876 1454235 1491952 1534620 1582402 1634842 1691245 1751384 1815511 1883516 1954424
50404 1954424 2026744 2098892 2169222 2236267 2299242 2357827 2411149 2457532 2495545 2524629 2544183
50393 2544183 2552745 2548885 2532445 2504065 2463882 2411740 2348596 2276960 2199959 2120608 2041784 1965957
50381 1965957 1894865 1830195 1774550 1730795 1700205 1681949 1674547 1677008 1688319 1706661 1729617 1754548
50369 1754548 1778430 1798020 1810716 1814934 1809410 1792825 1764615 1725722 1678092 1623806 1564949 1503723
50357 1503723 1442050 1381263 1322447 1266654 1214397 1165345 1118992 1075330 1034555 996637 961706
50346 961706 930427 903314 879939 859456 841740 827361 816448 808241 801981 797752 796206 797715
50334 797715 802044 808760 817718 829045 842638 857880 874110 891317 910008 930306 951440 972194
50322 972194 991467 1008231 1021358 1029914 1033532 1032415 1027268 1019350 1010142 1000508 990382 979535 968457
50309 968457 958238 949784 943375 938666 934938 931715 929475 929368 931801 935648 939382 942737 946713 952197
50295 952197 959184 967247 976042 985283 994850 1005141 1016785 1029739 1043069 1055895 1068179 1080317
50283 1080317 1092357 1104099 1115738 1127925 1141260 1156143 1172986 1191747 1210816 1226858 1236494
50272 1236494 1238206 1232295 1219383 1199854 1174994 1147651 1120927 1096445 1074462 1055162 1038946 1025610
50260 1025610 1014265 1004387 996283 990221 985826 982801 981619 982758 985512 988302 990374 992756 997261 1004609
50246 1004609 1013745 1023081 1032285 1042506 1054875 1069286 1085050 1102162 1121117 1141698 1162895 1184122
50234 1184122 1205731 1228085 1250839 1273357 1295091 1315183 1332477 1346535 1358112 1368179 1376979
50223 1376979 1384451 1390955 1396769 1401188 1402650 1399526 1390439 1374352 1351095 1321653 1287522 1250011 1210538
50210 1210538 1171081 1133664 1099564 1069452 1043897 1023162 1006805 994034 984106 975788 966914 955363
50198 955363 940420 922626 902651 881083 859056 837992 818582 800653 784101 769211 755989
50187 755989 743853 732191 720744 709419 698277 687739 678181 669246 660153 650775 641798 633729 626343
50174 626343 619297 612658 606608 601109 596116 591647 587521 583504 579892 577393 576199 575669 575209 574999 575577
50159 575577 577205 579998 584227 590035 597068 604716 612666 621066 630349 640913 652690 664975 676994
50146 676994 688630 700136 711185 720772 728261 733950 738344 741446 743132 743782 744090 744601 745733 747871
50132 747871 751077 755163 760491 768327 779881 795266 813818 835100 858987 885178 913473 944530
50120 944530 979612 1019342 1063217 1110468 1160750 1213605 1267687 1321096 1372465 1421511 1468704
50109 1468704 1514753 1560382 1606208 1652495 1698977 1744753 1788157 1826600 1856852 1875937 1882136
50098 1882136 1875264 1856174 1826147 1786741 1739882 1687797 1632733 1576737 1521580 1468803 1419818
50087 1419818 1375860 1337581 1304707 1276397 1252109 1231864 1215554 1202330 1190921 1180269 1169631
50076 1169631 1158537 1147097 1136008 1125583 1114953 1102843 1089085 1074735 1060729 1047077 1033475
50065 1033475 1019966 1006687 993560 980627 968270 956698 945592 934641 924178 914952 907421 901567
50053 901567 897163 893990 891971 891296 892294 894999 899091 904362 910922 918742 927379 936474 946168 956515
50039 956515 966725 975569 982586 988432 993871 998752 1002208 1003661 1003362 1001956 999799 996909 993446 989903
50025 989903 986583 983148 978976 973929 968536 963471 959059 955103 950874 945413 938456 931083 924940 920600
50011 920600 917119 913388 909453 906186 904198 903579 904407 906912 911171 917072 924787 935040 948741 966331
49997 966331 987499 1011607 1038402 1068080 1100417 1134122 1167621 1200462 1233374 1266792 1299939
49986 1299939 1331638 1361409 1389209 1414399 1435384 1450071 1456353 1452492 1437594 1411833 1376134 1331915
49974 1331915 1281163 1226216 1169063 1111204 1054430 1001103 952998 910271 872116 838098 808173
49963 808173 781879 758495 737924 720477 705733 692494 680136 669153 660034 652404 645759 640386
49951 640386 636879 635175 634746 635479 637733 641640 647004 653863 662538 672944 684298 695788 707183 718524
49937 718524 729470 739287 747354 753336 756969 758125 757142 754634 750641 744318 734807 722218 707386 690907
49923 690907 673074 654676 637138 621509 607848 595964 586235 579100 574110 570169 566734 564206 563063
49910 563063 563020 563213 562946 562178 561503 561770 563552 566887 571429 576689 582078 587116 591958 597496 604497 612784
49894 612784 621706 631306 642378 655215 668784 681363 691694 699371 704564 707752 709500 710064 709268
49881 709268 706917 703205 698439 692421 684415 673896 661197 647326 633135 618828 604281 589653
49869 589653 575474 562230 550252 540066 532410 527530 524719 522973 522001 522188 523657 525872 528219 530544
49855 530544 532987 535720 539060 543480 549197 555950 563443 571851 581658 593029 605516 618338 630866
49842 630866 642880 654440 665446 675336 683304 688812 691835 692690 691880 689987 687328 683605 678224 671083
49828 671083 662833 654218 645424 636274 626842 617625 609287 602417 597420 594422 593364 594230 597016 601457
49814 601457 607062 613583 621135 629698 638875 648430 658645 669629 680585 690413 698978 707047 714913
49801 714913 721810 727020 730931 734420 737543 739443 739378 737261 733181 726987 718617 708404 696798 683980
49787 683980 670009 655177 639972 624889 610552 597803 587186 578330 570270 562513 555429 549421
49775 549421 544161 539069 534255 530407 527772 525793 523950 522542 522367 523862 526826 530798 535449 540722
49761 540722 546860 554283 563208 573338 584023 594697 605098 615089 624442 632801 639736 644848 647921
49748 647921 648971 648087 645246 640373 633582 625276 616011 606344 596798 587850 579865 572992 567070 561624
49734 561624 556101 550322 544738 540167 537179 535716 535217 535078 535102 535519 536537 537875 538951 539606 540392 541950
49718 541950 544437 547843 552552 558975 566812 575374 584706 595580 607988 620311 630538 637887 642729
49705 642729 645451 646249 645726 644692 643241 640783 637186 633176 629389 625722 621947 618232 614498 609918 603791
49690 603791 596580 589430 582917 576906 571399 566758 563140 560448 558947 559221 561226 564011 566803 570030
49676 570030 574881 582056 591272 601829 613335 625906 639781 654681 669443 682364 692087 698237
49664 698237 701408 702770 703634 704949 706996 709626 712911 717375 723514 731133 739185 746099 750356 751021 747838
49649 747838 740745 729497 714136 695733 676154 656931 638754 622083 607667 596061 587043 579930
49637 579930 574282 569928 566614 564072 562341 561567 561541 561707 561627 561162 560240 558685 556300 552952 548627 543536
49621 543536 538163 533039 528447 524317 520293 516004 511558 507770 505496 504560 503750 502121 499937 498025 496707
49606 496707 495842 495544 496171 497734 499896 502422 505104 507359 508620 509159 509856 510960 511709 511464 510647 510190
49590 510190 510475 511335 512732 514847 517528 520183 522398 524410 526740 529489 532157 534214 535694 537095 538748
49575 538748 540526 542266 544160 546467 549049 551601 554268 557650 562108 567466 573482 580278 588065 596634
49561 596634 605439 614065 622393 630303 637358 642842 646121 647001 645769 642930 638958 634204 628863 622980
49547 622980 616729 610785 606136 603305 601962 601548 601979 603422 605660 608187 610797 613600 616543 619416 622281
49532 622281 625392 628633 631696 634960 639601 646416 654966 664292 674266 685819 699883 716222 733256
49519 733256 748996 762378 773725 783772 792370 798653 802444 804887 807343 810168 813003 815906 819686
49506 819686 825259 833023 842744 853641 864579 874340 881743 885504 884316 877499 865552 849903 832080
49493 832080 813117 793516 773671 754485 737480 723892 713513 704861 696750 689350 683421 679075
49481 679075 675780 673192 671289 669798 668175 666260 664487 663328 662863 662997 663697 664865 666241 667638 669180
49466 669180 671203 673954 677261 680452 682740 683925 684646 685813 687932 691052 694975 699114 702434 704150
49452 704150 704446 704078 703250 701380 698002 693379 688066 682320 676213 669924 663606 657239 650967 645363 640969
49437 640969 637654 634718 631710 628910 626982 626318 626889 628651 631834 636645 642789 649572 656600 664183 672959
49422 672959 683383 695739 710233 726712 744624 763806 784985 808702 833601 856458 874200
49411 874200 885539 890668 890213 885066 876805 867637 859961 855997 857204 863533 873545 885747 899526
49398 899526 914477 929414 942924 954657 965257 975028 983508 990418 996207 1001296 1005422 1008142 1009462
49385 1009462 1009510 1008021 1004595 999176 991882 982716 971948 960482 949325 938764 928536 918675 909696
49372 909696 901977 895433 889943 885642 882663 880913 880314 881010 883113 886315 889857 892836 894615 895063 894392
49357 894392 892671 889651 885287 880244 875440 871103 866677 861723 856546 851834 848056 845381 843823 843143
49343 843143 842805 842338 841728 841377 841725 842875 844383 845443 845574 845080 844525 843892 842738 841139 839696 838419
49327 838419 836409 833160 829468 826383 823915 821624 819925 819695 820710 821631 821790 822112 823898 827387 831944
49312 831944 836995 842228 847265 851762 855786 859771 864086 868781 873650 878469 883299 888550 894574 901214
49298 901214 908017 914885 922220 930439 939682 949964 961211 973106 985360 998227 1012132 1026526
49286 1026526 1039518 1049093 1054493 1056243 1055260 1052298 1047965 1042754 1036929 1030472 1023091 1014340 1004108 993075
49272 993075 982397 972844 964578 957784 952912 950007 948408 947557 947683 949181 951668 954249 956523 958797
49258 958797 961418 964330 967194 969529 970859 971248 971795 974329 980532 991366 1007043 1027147 1050873 1077287
49244 1077287 1105090 1131975 1154749 1170820 1179383 1180683 1174521 1160427 1139324 1114078 1087918 1062711
49232 1062711 1039060 1017453 998757 983719 972442 964381 958769 955146 953557 954100 956364 959575 963317
49219 963317 967685 972635 977632 982309 987131 992934 999844 1007030 1013638 1019778 1026523 1035093 1046072 1059322
49205 1059322 1074429 1091071 1108900 1127274 1145402 1162833 1179669 1196230 1212613 1228628 1243972
49194 1243972 1258332 1271479 1283509 1294983 1306604 1318619 1330642 1342145 1352988 1363345 1373247
49183 1373247 1382562 1391485 1400690 1410754 1421665 1433232 1445797 1460135 1476711 1495551 1516886 1541420
49171 1541420 1569694 1601639 1637177 1676976 1722128 1772932 1827954 1883887 1936141 1979970 2011863
49160 2011863 2030346 2035759 2029617 2014380 1993403 1970440 1948873 1931268 1919268 1913450 1913233 1917193
49148 1917193 1923712 1931515 1939913 1948738 1957920 1967079 1975731 1983981 1992623 2002328 2013008 2024258 2036134
49135 2036134 2049140 2063695 2079946 2097912 2117358 2137619 2157946 2178069 2198336 2219379 2241735
49124 2241735 2265452 2289744 2313318 2335324 2355807 2375102 2393276 2410480 2427322 2444325 2461357
49113 2461357 2478190 2495284 2513462 2533137 2554583 2578726 2607058 2641086 2682692 2734755 2800252
49102 2800252 2880143 2972176 3071432 3171943 3269105 3362203 3454131 3546563 3634644 3707685 3755906
49091 3755906 3775927 3769901 3741307 3692811 3626905 3546611 3455335 3356748 3254583 3151913 3050953
49080 3050953 2954178 2865130 2787256 2722077 2669111 2627223 2595294 2571840 2554997 2543134 2535080
49069 2535080 2529735 2525965 2522844 2519647 2515742 2510909 2505599 2500419 2495490 2490736 2486498 2483269 2480942 2478975
49055 2478975 2477252 2476117 2475565 2475040 2474192 2473229 2472364 2471433 2470345 2469412 2468901 2468532 2467774 2466467 2464973 2463838
49039 2463838 2463453 2463929 2465171 2467155 2470156 2474602 2480719 2488406 2497307 2506770 2515811 2523536 2529669 2534397
49025 2534397 2537678 2539008 2537952 2534576 2529299 2522655 2515420 2508570 2502761 2497992 2494115 2491486 2490727 2491907
49011 2491907 2494418 2497763 2502030 2507340 2513224 2519041 2524831 2531112 2537783 2543819 2548371 2551720 2554717 2557672
48997 2557672 2560306 2562508 2564392 2565654 2565568 2563774 2560577 2556312 2550911 2544218 2536269 2527119 2516997 2506827
48983 2506827 2497901 2490612 2484140 2477884 2472575 2469275 2467800 2467054 2466716 2467669 2470809 2476202 2483568 2492749 2503324
48968 2503324 2514373 2525118 2535544 2546068 2556736 2567035 2576346 2584406 2591335 2597349 2602423 2606287
48956 2606287 2608830 2610499 2612201 2614826 2618919 2624619 2631803 2640401 2650809 2663902 2680452 2700575 2723832
48943 2723832 2749657 2777572 2807330 2839198 2873860 2911624 2951853 2993599 3036645 3081543 3128748
48932 3128748 3178233 3229911 3283909 3340254 3398748 3459248 3521693 3585754 3650796 3716328 3782099
48921 3782099 3847724 3912660 3976762 4040393 4103689 4166099 4227010 4286512 4344989 4402060 4456404
48910 4456404 4506761 4552790 4594868 4633379 4668455 4700326 4729564 4756785 4782174 4805521 4826709
48899 4826709 4846011 4863779 4879990 4894283 4906391 4916342 4924241 4929988 4933300 4933940 4931881 4927204 4919783
48886 4919783 4909220 4895259 4878238 4858814 4837205 4813014 4785889 4755906 4723048 4686833 4647031
48875 4647031 4604493 4560599 4515866 4469575 4420848 4369613 4316373 4261487 4204990 4146984 4087897
48864 4087897 4028309 3968565 3908703 3848912 3790014 3733203 3679246 3628359 3581045 3538398 3501028
48853 3501028 3468154 3438515 3411970 3389359 3370911 3355671 3342614 3331530 3322504 3315301 3309740 3306148
48841 3306148 3305006 3306570 3311154 3319251 3330861 3345093 3360948 3378225 3397132 3417274 3437684 3457780
48829 3457780 3477733 3497767 3517561 3536580 3554740 3572518 3590470 3608826 3627543 3646625 3666229
48818 3666229 3686464 3707264 3728567 3750405 3772565 3794351 3815088 3834890 3854522 3874486 3894613
48807 3894613 3914664 3934884 3955735 3977410 3999856 4022947 4046406 4069828 4093004 4116026 4138914
48796 4138914 4161526 4184080 4207343 4231828 4257065 4282091 4306418 4330054 4352721 4373653 4392155
48785 4392155 4407911 4420707 4430338 4436906 4440801 4442053 4439898 4433175 4420986 4402881 4378668 4348324
48773 4348324 4312006 4269889 4222058 4168774 4110921 4049992 3987543 3924655 3861929 3799791 3738627
48762 3738627 3678673 3620025 3562821 3507331 3453906 3402954 3354952 3310202 3268532 3229587 3193587
48751 3193587 3161443 3133788 3110176 3089702 3072227 3058522 3049269 3044419 3043465 3045768 3050469 3056623 3063672
48738 3063672 3071510 3079998 3088883 3098372 3109194 3121674 3135090 3148357 3161009 3173111 3184496 3194598
48726 3194598 3202871 3208953 3212530 3213543 3212543 3210396 3207508 3203577 3198208 3191562 3184398 3177646 3171959 3167427
48712 3167427 3163670 3160248 3156954 3153649 3149981 3145553 3140314 3134584 3128673 3122761 3117079 3111959 3107508 3103425
48698 3103425 3099296 3095030 3090930 3087402 3084706 3082921 3081973 3081664 3081769 3082305 3083656 3086322 3090484 3095892 3102092
48683 3102092 3108528 3114364 3118569 3120535 3120500 3119098 3116520 3112413 3106482 3098868 3089954 3080096 3069490 3057895
48669 3057895 3044448 3028137 3008610 2986231 2961412 2934334 2905409 2875405 2844792 2813397 2781170
48658 2781170 2748966 2718091 2689160 2661700 2634704 2607198 2578432 2548012 2515997 2482723 2448516
48647 2448516 2413730 2379014 2345260 2313231 2283350 2255875 2231117 2209332 2190296 2173075 2156434
48636 2156434 2139624 2122596 2105314 2087203 2067727 2047307 2027049 2007573 1988721 1970482 1953507
48625 1953507 1938369 1924936 1912835 1901878 1891458 1880070 1866310 1850188 1832902 1815430 1797999
48614 1797999 1780791 1764438 1749582 1736403 1724802 1714734 1706307 1699817 1695805 1694724 1696406 1700014
48602 1700014 1704613 1709627 1714738 1719588 1723757 1726920 1728920 1729766 1729614 1728797 1727894 1727630 1728434 1729943 1731095
48587 1731095 1730852 1728734 1724577 1718060 1708781 1696763 1682637 1667268 1651286 1634980 1618628 1602868
48575 1602868 1588627 1576486 1566245 1557356 1549704 1543627 1539200 1535922 1533251 1531172 1530114 1530635 1533166
48562 1533166 1537643 1543297 1549209 1555203 1561722 1568731 1575258 1580197 1582948 1583058 1579955 1573567 1564694 1554285
48548 1554285 1542788 1530661 1518944 1508724 1500335 1493524 1487872 1482500 1475970 1467314 1456914 1445685
48536 1445685 1433734 1420568 1406276 1391646 1377283 1363448 1350653 1339622 1330691 1323956 1319943 1319290
48524 1319290 1321769 1326488 1333178 1342387 1353992 1366163 1376227 1382152 1382916 1378033 1367388 1351525 1331809
48511 1331809 1310246 1288966 1269619 1253119 1239959 1230534 1224979 1223094 1224851 1230786 1241400 1256390
48499 1256390 1274937 1296563 1321044 1347414 1373445 1396104 1412319 1419766 1417734 1407414 1391020 1370659
48487 1370659 1348207 1325632 1304597 1285782 1269136 1254606 1242035 1230645 1219499 1208444 1197879
48476 1197879 1187650 1176936 1165306 1153217 1141400 1130376 1120549 1112120 1104818 1098230 1092352 1087268
48464 1087268 1082591 1078005 1074175 1072162 1071980 1072652 1073735 1075751 1078975 1082845 1086976 1091866 1098093 1105491
48450 1105491 1113455 1121426 1128730 1134550 1138380 1140108 1139620 1136954 1132891 1128563 1124338 1119798 1114910 1110284
48436 1110284 1106060 1101467 1095904 1089640 1082980 1075511 1066700 1056639 1045773 1034422 1022910 1011679 1000974
48423 1000974 990866 981631 973547 966312 959315 952493 946113 939783 932721 925072 917895 911616 905570 899383
48409 899383 893697 889098 885316 881920 878897 876208 873738 871972 871604 872221 872567 872472 873095 874744 875900 875225
48393 875225 873198 870877 868351 865391 862399 859532 855910 850854 845037 839364 833642 827431 821286 815972
48379 815972 811197 806260 801262 796668 792368 788212 784759 782462 780779 779035 777408 776149 774608 772103
48365 772103 769038 766179 763549 761011 759090 758177 757552 756296 754510 752827 751479 750716 751187 752879 754553
48350 754553 755141 754909 754424 753531 752239 751371 751237 750933 750050 749665 750452 751384 751740 752802 755870 760180 764595
48333 764595 769833 776997 785296 793439 802079 812730 825404 839368 854937 872218 889278 903919
48321 903919 916173 926925 935505 941166 945486 950544 956020 960913 966594 975042 985393 995672 1006750
48308 1006750 1021057 1038446 1056993 1076931 1100066 1126209 1154075 1184857 1221012 1262436 1307855
48297 1307855 1358972 1419019 1488467 1566718 1656623 1762383 1884906 2025121 2190325 2391230
48287 2391230 2635254 2930567 3294673 3750198 4314556 5004388 5847659 6877757 8116630
48278 8116630 9576878 11268736 13161606 15113239 16863293 18139542 18784051 18777355 18171705
48269 18171705 17045503 15521983 13781768 12015215 10359321 8882964 7611856 6547012
48261 6547012 5668593 4945985 4352957 3869950 3476594 3152018 2881907 2658073 2471805
48252 2471805 2313597 2178148 2063532 1965908 1879984 1803852 1738370 1682175 1631651 1585355 1544301
48241 1544301 1508189 1475076 1444469 1417247 1392791 1369427 1347334 1327926 1310776 1294163 1278148
48230 1278148 1263970 1250849 1236721 1222021 1209470 1199862 1191019 1181362 1171742 1163085 1154683 1145607 1135699
48217 1135699 1124405 1110386 1092931 1072399 1049084 1023274 996633 971849 950381 931721 914896
48206 914896 899357 884370 869125 853769 839104 825163 811268 797445 784459 772432 760690
48195 760690 749041 737959 727539 717475 708034 699786 692435 685184 678187 672327 667574 662928 658089
48182 658089 653793 650325 647050 643656 640623 638117 635620 633035 631100 630221 629775 628984 627769 626448 625265
48167 625265 624386 623827 623365 622944 622915 623244 622981 621468 619614 618887 619360 619980 620480 621587 623371 624831 625362
48150 625362 625377 625204 624543 623356 622187 621238 620171 619110 618815 619430 620064 620051 619809 620067 621019 622570 624601
48133 624601 626570 627640 627611 627211 627238 628015 629746 632612 636246 639816 642919 645830 648849 652126 656136 661434
48117 661434 667748 674106 680021 685757 691424 696820 702413 709406 718333 728443 738885 749720 761306
48104 761306 773496 786016 799005 812710 827133 842331 858490 875382 892264 908625 924511
48093 924511 939946 954651 968616 982288 995897 1009116 1021667 1033723 1045481 1056836 1067643
48082 1067643 1077771 1086832 1094538 1101357 1108091 1114713 1120390 1124812 1128619 1132269 1135384 1137543 1138964 1140081
48068 1140081 1141189 1142752 1145182 1147996 1150145 1151579 1153633 1157291 1161919 1166238 1169760 1172693 1175144 1176983
48054 1176983 1177815 1176654 1172332 1164808 1155372 1145146 1134162 1122303 1110049 1097500 1083636 1067574
48042 1067574 1049922 1031980 1014140 995962 977305 958464 939574 920710 902259 884415 866658
48031 866658 848468 830276 813081 797440 783360 770697 759002 747424 735524 723817 712903
48020 712903 702542 692283 682477 673771 665986 658408 650920 643964 637664 631796 626430 621740 617386 612925
48006 612925 608655 605219 602527 599950 597494 595867 595368 595514 595835 596285 596793 597194 597707 598809 600490 602193
47990 602193 603600 604884 606189 607436 608638 609730 610092 609031 606903 605011 604093 603547 602485 600903 599382
47975 599382 598140 596916 595566 594298 593391 592958 592940 593148 593349 593369 593150 592734 592229 591700 591076 590295 589585 589394
47957 589394 589927 591090 592968 595868 599672 603650 607355 611235 615922 621356 627195 633610 640918 648731
47943 648731 656325 663707 671540 679980 688277 695672 702117 708088 714113 720482 726934 732684 737148 740516
47929 740516 743208 745111 745902 745769 744997 743131 739488 734366 728793 723063 716544 709034 701230 693509 685327
47914 685327 676334 667290 659297 652723 647349 642863 638681 633956 628505 623280 619333 616652 614565 612905
47900 612905 612179 612828 614805 617721 621024 624303 627799 632336 638299 644920 651061 656511 662095 668644 676345
47885 676345 684935 694043 703236 712070 720306 727981 735238 742077 748137 752738 755399 756417 756696 756830 756559
47870 756559 755209 752389 748108 742554 736062 729052 721740 714040 705902 697473 688793 679622 669877 659941
47856 659941 650324 641244 632807 625262 618720 612880 607421 602461 598262 594709 591573 589117 587906 587963 588634
47841 588634 589436 590629 592673 595444 598316 600903 603425 606327 609732 613402 617122 620940 624924 628760
47827 628760 631785 633494 633995 633947 634066 634609 635262 635529 635329 635108 635277 635702 636058 636567 638008 640866 644769
47810 644769 648985 653248 657970 663939 672101 683423 698492 717018 737933 760180 783469 808147
47798 808147 834311 861226 887777 913332 937819 960953 981831 999500 1013491 1023530 1029248 1030738
47786 1030738 1029023 1025266 1019593 1011374 1000509 987756 973817 958978 943786 929201 915626 902503
47774 902503 889323 876482 864620 853619 842889 832318 822346 813256 804910 797115 789948 783844 779452
47761 779452 777051 775882 774594 772710 771159 770825 771115 770670 769078 767012 764908 762512 759843 757677 756698
47746 756698 756836 757870 760118 764014 769348 775437 781953 789220 797740 807718 819001 831200 843784 856267
47732 856267 868426 880308 891868 902669 912103 919970 926605 932257 936531 938812 939082 937851 935240
47719 935240 930758 924157 915914 906438 895328 882071 867216 852187 837967 824549 811634 799362
47707 799362 788169 778311 769683 761913 754647 747974 742489 738662 736263 734713 733857 734017 735476 738408
47693 738408 743175 750015 758329 766938 775348 784304 794822 807062 820378 834071 847760 861383 875158
47680 875158 889297 903395 916308 926954 935149 941507 946734 951179 954740 956862 956815 954318 949794 943821
47666 943821 936568 927987 918240 907517 895633 882331 867951 853398 839348 825827 812573 799464
47654 799464 786575 774178 762842 753235 745655 739890 735557 732345 729924 728013 726667 726187 726535 727168
47640 727168 727686 728429 730107 733077 737183 742090 747361 752377 756664 760374 764089 768136 772444 777127 782842
47625 782842 790338 799857 811169 824047 838583 855178 874290 896008 919807 944916 970997 998173
47613 998173 1026260 1054338 1081297 1106453 1129253 1148702 1163593 1173232 1177460 1176052 1168630 1155237
47601 1155237 1136514 1113109 1085310 1053507 1018680 982130 944986 908121 872235 837685 804449
47590 804449 772654 743003 716346 692915 672311 654126 638167 624121 611526 600274 590709 582913
47578 582913 576260 570050 564311 559469 555406 551503 547707 544821 543344 542575 541430 539817 538501 537822 537281
47563 537281 536466 535544 534586 533120 530839 528243 526084 524589 523708 523645 524417 525220 525007 523671 522004 520664
47547 520664 519835 519835 521043 522989 524357 524334 523398 522313 520975 518847 516087 513571 511937 511151 510887 510790 510379
47530 510379 509269 507725 506674 506890 508239 509864 511023 511644 512084 512547 512908 513061 513189 513548 514182 515013 516002
47513 516002 516992 517641 517837 517974 518350 518503 517712 516084 514513 513497 512628 511407 509950 508631 507614 507061
47497 507061 507238 508025 508822 509367 510181 511773 513833 515757 517598 519867 522614 525280 527416 529109 530749
47482 530749 532682 534984 537337 539261 540706 542197 544207 546682 549429 552579 556250 560052 563346 565775
47468 565775 567331 568234 569026 570240 571583 572032 571319 570687 571324 572592 572843 571707 570435 569965 569831 569364 569015
47451 569015 569876 572412 576170 580501 585244 590832 597758 605765 613758 620981 628171 636991 648335 661772
47437 661772 676606 692757 710476 729877 751114 774432 799713 826358 853900 882305 911389
47426 911389 940372 968237 994206 1017641 1037854 1054276 1066555 1074361 1077487 1076234 1071266 1062886
47414 1062886 1050862 1035176 1016498 995735 973508 950321 926785 903401 880493 858570 838338
47403 838338 820127 803764 789243 776992 767129 759045 752184 746764 743144 740965 739585 739123 740337
47390 740337 743568 748400 754339 761203 768841 777026 785777 795317 805475 815513 824826 833583 842365 851275
47376 851275 859611 866447 871346 874371 875499 874331 870524 864315 856348 847108 836841 825878 814481
47363 814481 802275 788388 772519 755573 738937 723363 708750 694620 680445 665787 650701
47352 650701 636011 622816 611634 602106 593518 585437 577946 571441 566176 561930 558186 554681 551628
47339 551628 549398 548195 548050 548782 549874 550726 551304 552235 554058 556731 560087 564329 569589 575332 580703
47324 580703 585415 589824 594198 598251 601401 603182 603466 602622 601424 600493 599720 598413 596048 592750 589163
47309 589163 585996 583577 581621 579527 577159 575218 574612 575503 577178 578771 579930 580971 582610 585461 589586
47294 589586 594557 600088 606283 613083 619831 625891 631510 637527 644369 651851 659886 668687 678051 687107
47280 687107 695190 702606 710098 717839 725415 732588 739530 746199 751997 756371 759574 762462 765522 768365
47266 768365 770221 770690 769822 767748 764576 760537 755859 750495 744339 737766 731587 726288 721675 717453 713771
47251 713771 710944 709064 708279 709140 712091 716819 722689 729746 738681 749600 761304 772060 780785 787249
47237 787249 791464 793413 793449 792632 792326 793366 795712 799003 803308 809130 816771 826045 836712 848790 862220
47222 862220 876442 890543 903647 914901 923484 929116 932518 934886 936753 937499 935993 931601 924706
47209 924706 916437 907818 898984 889298 878327 866510 854720 843444 832701 822523 813140 804855 798080
47196 798080 793268 790428 788847 787788 787393 788470 791555 796647 803779 813198 824890 838398 853297 869422
47182 869422 886620 904700 923716 943833 964847 986341 1008345 1031168 1054402 1076732 1097098
47171 1097098 1115441 1131967 1146361 1158328 1168310 1176792 1183191 1186311 1185880 1182870 1178216 1171891 1163475
47158 1163475 1152997 1140867 1127416 1113009 1098347 1084217 1070895 1058068 1045356 1032762 1020652
47147 1020652 1009444 999425 990803 983837 978779 975574 973750 972805 972787 974260 977580 982310 987492 992391
47133 992391 996846 1001041 1005161 1009223 1012909 1015518 1016363 1015397 1013199 1010139 1005754 999248 990488 980185
47119 980185 969141 957729 946178 934881 924095 913593 902970 892188 881533 871087 860591
47108 860591 849932 839495 829845 821107 812836 804515 796070 787760 779628 771354 762842 754751 748009 742842
47094 742842 738682 735150 732660 731761 732273 733493 735087 737334 740551 744618 749096 753521 757599 761340 765000
47079 765000 768739 772388 775746 778939 782141 785043 786996 787719 787508 786729 785494 783954 782460 781144 779644
47064 779644 777651 775611 774477 774709 775820 776999 777965 779060 780715 783161 786598 791217 796808 802643 808170
47049 808170 813749 820259 827953 836114 843951 851346 858466 865148 871204 877047 883399 890415 897569 904441
47035 904441 911213 918267 925679 933291 941045 949018 957201 965327 972940 979626 985202 989616 992713 994326
47021 994326 994650 994152 992907 990359 986119 980706 975116 969842 964838 960175 956116 952557 949003 945313 941955
47006 941955 939387 937560 936221 935286 934669 934100 933457 933134 933828 935982 939520 944006 949023 954468 960469 966970
46990 966970 973570 980025 986663 993958 1001852 1009973 1018407 1027632 1037612 1047652 1057432 1067646 1079121
46977 1079121 1091631 1104109 1115879 1127264 1139020 1151525 1164536 1177404 1189313 1199478 1207509
46966 1207509 1213792 1219350 1224937 1230182 1233968 1235827 1236503 1236859 1236765 1235703 1234111 1233278 1233901 1235525 1237491
46951 1237491 1239714 1242364 1245506 1249377 1254357 1260241 1266113 1271431 1276802 1283205 1290817 1299105 1307786 1317105
46937 1317105 1327251 1337927 1348534 1358566 1367811 1376335 1384170 1391054 1396642 1400933 1404029 1405420 1404033
46924 1404033 1399302 1391768 1382343 1371330 1358563 1344113 1328420 1311926 1294978 1277981 1261346 1245462
46912 1245462 1230884 1218245 1207641 1198429 1189979 1182488 1176787 1173622 1173407 1176329 1182252 1190699 1201340
46899 1201340 1214295 1229655 1246947 1265534 1285381 1306957 1330449 1355426 1381168 1407001 1432402
46888 1432402 1457100 1480996 1503746 1524594 1542881 1558555 1571935 1583273 1592861 1601204 1608599 1614791
46876 1614791 1619514 1623193 1626580 1629928 1633103 1636330 1640169 1644829 1650244 1656889 1665781 1677386 1691011
46863 1691011 1705576 1720536 1735856 1751575 1767776 1784629 1802045 1819390 1835791 1850628 1863563
46852 1863563 1874305 1882604 1888445 1892127 1894129 1894803 1894065 1891419 1886557 1879914 1872359 1864298 1855551 1846280
46838 1846280 1837668 1831115 1826920 1824196 1822166 1821124 1821871 1824624 1828943 1834614 1841964 1851121 1861443 1872091
46824 1872091 1882861 1894001 1905418 1916602 1927174 1936919 1945367 1952008 1957016 1961093 1964420 1966349 1966358
46811 1966358 1964613 1961372 1956638 1950873 1945202 1940186 1935028 1928789 1921927 1915746 1910704 1906094 1901141 1895528
46797 1895528 1889139 1882262 1876047 1871831 1869884 1869495 1870193 1872049 1874827 1877871 1881093 1885206 1890642 1896974
46783 1896974 1903734 1911006 1918796 1926482 1933473 1939960 1946555 1953529 1960752 1968034 1975254 1982546 1990517 1999801
46769 1999801 2010195 2020798 2031270 2042356 2054819 2068488 2082892 2098185 2114847 2132951 2152372
46758 2152372 2173294 2195685 2218582 2240724 2261919 2283055 2304734 2326495 2347451 2367092 2385154
46747 2385154 2401181 2414632 2425328 2433564 2439824 2444457 2447555 2449114 2449296 2448429 2446722 2444124 2440618 2436542
46733 2436542 2432492 2429056 2426679 2425587 2425648 2426494 2428058 2430820 2435304 2441389 2448347 2455437 2462233 2468466 2473882
46718 2473882 2478356 2481881 2484295 2485048 2483409 2478953 2471845 2462501 2450909 2436515 2418963 2398782 2376999
46705 2376999 2354119 2329921 2304215 2277304 2249495 2220699 2190881 2160583 2130565 2101077 2071836
46694 2071836 2042571 2013308 1984284 1955887 1928608 1902771 1878325 1855046 1832927 1812273 1793551
46683 1793551 1777149 1763018 1750467 1738555 1726854 1715554 1704793 1694396 1684491 1675812 1668823 1662997
46671 1662997 1657583 1652736 1649201 1647011 1645387 1644014 1643637 1645044 1648024 1651775 1655940 1660741 1666249 1671972
46657 1671972 1677256 1681868 1686053 1690034 1693534 1695860 1696555 1695852 1694360 1692410 1689877 1686620 1682864 1679130
46643 1679130 1676007 1674013 1673551 1674937 1678536 1684806 1694088 1706374 1721409 1738902 1758466 1779430 1800957
46630 1800957 1822378 1843270 1863303 1882225 1899918 1916200 1930544 1942209 1950661 1955645 1956871 1953992
46618 1953992 1947059 1936749 1923918 1908960 1891811 1872618 1852247 1831920 1812219 1792614 1772255
46607 1772255 1751269 1730910 1712298 1695379 1679489 1664600 1651462 1640595 1631595 1623536 1615723 1608069
46595 1608069 1601043 1595232 1590638 1586445 1581817 1576798 1571956 1567193 1561654 1555007 1548135 1542087 1536841 1531616
46581 1531616 1526075 1520636 1515730 1511329 1507238 1503477 1500264 1497861 1496397 1495721 1495505 1495700 1496742 1499044 1502396
46566 1502396 1506115 1509691 1513002 1516017 1518726 1521414 1524618 1528650 1533282 1537978 1542311 1546242 1550243 1555052
46552 1555052 1561026 1567699 1574322 1580828 1587899 1596048 1605063 1614580 1624722 1635851 1647954 1660730 1674117
46539 1674117 1688401 1703898 1720815 1739349 1759547 1781121 1803708 1827375 1852655 1880071 1909798
46528 1909798 1941705 1975410 2010300 2045863 2082032 2118973 2156468 2193800 2230312 2265751 2299924
46517 2299924 2332375 2362624 2390436 2415612 2437787 2456772 2472862 2486400 2497162 2504553 2508441 2509494
46505 2509494 2508656 2506553 2503371 2498980 2493120 2485783 2477546 2469304 2461486 2453713 2445297 2435855 2425282 2413379
46491 2413379 2399905 2384944 2368866 2351734 2332914 2311476 2287030 2260037 2231274 2201107 2169374
46480 2169374 2135872 2100717 2064196 2026476 1987703 1948283 1908955 1870547 1833740 1798964 1766396
46469 1766396 1736121 1708425 1683904 1663176 1646528 1633918 1625228 1620366 1619201 1621588 1627384 1636320
46457 1636320 1647923 1661764 1677671 1695483 1714656 1734394 1754151 1773743 1792968 1811346 1828283
46446 1828283 1843286 1856049 1866579 1875166 1881923 1886409 1888080 1887098 1884205 1879736 1873309 1864781 1854968
$$ [...]
##END NTUPLES=NMR SPECTRUM
##END=
