
##TITLE=AC1207_MCiAH12041_7160663_rmRSlF5kEr
##JCAMPDX= 6.0         $$ Bruker NMR JCAMP-DX V2.0
##DATA TYPE= NMR SPECTRUM
##DATA CLASS= NTUPLES
##ORIGIN= BRUKER
##OWNER= Administrator
$$ 1.72 TOPSPIN		Version 2.1
$$ 2012-12-01 02:02:25.583 -0500  Administrator@X
$$ Compression mode = diff/dup
##.OBSERVE FREQUENCY= 400.02188249412
##.OBSERVE NUCLEUS= ^1H
##.ACQUISITION MODE= SIMULTANEOUS (DQD)
##.ACQUISITION SCHEME= undefined
##.AVERAGES= 8
##.DIGITISER RES= 22
##SPECTROMETER/DATA SYSTEM= spect
##.PULSE SEQUENCE= zg30
##.SOLVENT NAME= COFFEE_meoh
##.SHIFT REFERENCE= INTERNAL, COFFEE_meoh, 1, 14.98509
##AUDIT TRAIL= $$ (NUMBER, WHEN, WHO, WHERE, PROCESS, VERSION, WHAT)
$$ ##TITLE= Audit trail, TOPSPIN		Version 2.1
$$ ##JCAMPDX= 5.01
$$ ##ORIGIN= Bruker BioSpin GmbH
$$ ##OWNER= Administrator
$$ $$ E:\/data/COFFEE/nmr/AC1207_MCiAH12041_7160663_rmRSlF5kEr/20/pdata/1/auditp.txt
$$ ##AUDIT TRAIL=  $$ (NUMBER, WHEN, WHO, WHERE, PROCESS, VERSION, WHAT)
(   1,<2012-12-01 02:02:14.536 -0500>,<Administrator>,<X>,<go>,<TOPSPIN 2.1>,
      <created by zg
	started at 2012-12-01 02:01:11.813 -0500,
	POWCHK enabled, PULCHK disabled,
       configuration hash MD5:
       86 BA 57 50 F2 9D 5C 9B 26 00 A9 28 5F 66 2E 89
       data hash MD5: 64K
       7D 64 86 D8 05 D9 10 9D CF BE E4 4E 37 B8 78 61>)
(   2,<2012-12-01 02:02:18.570 -0500>,<Administrator>,<X>,<proc1d>,<TOPSPIN 2.1>,
      <Start of raw data processing
       efp LB = 0 FT_mod = 6 PKNL = 1 PHC0 = 0 PHC1 = 0 SI = 32K 
       data hash MD5: 32K
       E0 C7 8B 17 3A 72 79 80 8D 14 0A A7 3F E0 E0 B5>)
(   3,<2012-12-01 02:02:19.198 -0500>,<Administrator>,<X>,<proc1d>,<TOPSPIN 2.1>,
      <pk PHC0 = 96.65771 PHC1 = 0 
       data hash MD5: 32K
       CB BD 9B BA A7 27 79 29 70 39 30 3F 28 2B 90 36>)
(   4,<2012-12-01 02:02:19.522 -0500>,<Administrator>,<X>,<proc1d>,<TOPSPIN 2.1>,
      <abs ABSG = 1 
       data hash MD5: 32K
       96 BD 50 C7 15 A8 70 DE 59 A6 D8 91 29 55 EA 6E>)
(   5,<2012-12-01 02:02:19.725 -0500>,<Administrator>,<X>,<proc1d>,<TOPSPIN 2.1>,
      <abs ABSG = 2 
       data hash MD5: 32K
       35 6B B3 5B 2D 23 3A C6 80 E6 9B 1B 48 DB 37 D9>)
(   6,<2012-12-01 02:02:19.988 -0500>,<Administrator>,<X>,<proc1d>,<TOPSPIN 2.1>,
      <abs ABSG = 3 
       data hash MD5: 32K
       48 C3 72 C0 05 61 0E EC 42 0C 63 48 1B B8 04 67>)
(   7,<2012-12-01 02:02:20.191 -0500>,<Administrator>,<X>,<proc1d>,<TOPSPIN 2.1>,
      <abs ABSG = 4 
       data hash MD5: 32K
       00 DE 89 5E AC 7C 48 C7 C5 5F CB 37 BB 60 54 EE>)
(   8,<2012-12-01 02:02:20.394 -0500>,<Administrator>,<X>,<proc1d>,<TOPSPIN 2.1>,
      <abs ABSG = 5 
       data hash MD5: 32K
       3A 1F 3E F2 1B 53 73 25 7D 64 46 90 C7 8C 7D 98>)
$$ ##END=
$$ 
$$ $$ hash MD5
$$ $$ 13 D0 F2 72 50 34 6E 0A 0F 5D 65 6A C3 2A 51 E1
##$RELAX= 
##$RELAX= 
##$RELAX= 
##$RELAX= 
##$RELAX= 
##$RELAX= 
##$RELAX= 
$$ Bruker specific parameters
$$ --------------------------
##$DU= <E:\>
##$EXPNO= 20
##$NAME= <AC1207_MCiAH12041_7160663_rmRSlF5kEr>
$$ [...]
##$TP= (0..7)
150 150 150 150 150 150 150 150
##$TP07= 0
##$TPNAME0= <>
##$TPNAME1= <>
##$TPNAME2= <>
##$TPNAME3= <>
##$TPNAME4= <>
##$TPNAME5= <>
##$TPNAME6= <>
##$TPNAME7= <>
##$TPOAL= (0..7)
0.5 0.5 0.5 0.5 0.5 0.5 0.5 0.5
##$TPOFFS= (0..7)
0 0 0 0 0 0 0 0
##$TUNHIN= 0
##$TUNHOUT= 0
##$TUNXOUT= 0
##$USERA1= <user>
##$USERA2= <user>
##$USERA3= <user>
##$USERA4= <user>
##$USERA5= <user>
##$V9= 5
##$VALIST= <valist>
##$VCLIST= <CCCCCCCCCCCCCCC>
##$VD= 0
##$VDLIST= <DDDDDDDDDDDDDDD>
##$VPLIST= <PPPPPPPPPPPPPPP>
##$VTLIST= <TTTTTTTTTTTTTTT>
##$WBST= 1024
##$WBSW= 4
##$XGAIN= (0..3)
0 0 0 0
##$XL= 0
##$YL= 0
##$YMAX_a= 623472
##$YMIN_a= -526326
##$ZGOPTNS= <>
##$ZL1= 120
##$ZL2= 120
##$ZL3= 120
##$ZL4= 120
##$ABSF1= 14.98509
##$ABSF2= -5.573092
##$ABSG= 5
##$ABSL= 3
##$ALPHA= 0
##$AQORDER= 0
##$ASSFAC= 0
##$ASSFACI= 0
##$ASSFACX= 0
##$ASSWID= 0
##$AUNMP= <proc_prof1d_extract_pilot.lims>
##$AXLEFT= 0
##$AXNAME= <>
##$AXNUC= <1H>
##$AXRIGHT= 0
##$AXTYPE= 0
##$AXUNIT= <>
##$AZFE= 0.1
##$AZFW= 0.1
##$BCFW= 0
##$BC_mod= 0
##$BYTORDP= 0
##$COROFFS= 0
##$CY= 15
##$DATMOD= 1
##$DC= 0
##$DFILT= <>
##$DTYPP= 0
##$F1P= 0
##$F2P= 0
##$FCOR= 0.5
##$FTSIZE= 32768
##$FT_mod= 6
##$GAMMA= 0
##$GB= 0
##$INTBC= 1
##$INTSCL= 1
##$ISEN= 128
##$LB= 0
##$LEV0= 0
##$LPBIN= 0
##$MAXI= 10000
##$MC2= 0
##$MEAN= 0
##$ME_mod= 0
##$MI= 0
##$NCOEF= 0
##$NC_proc= -8
##$NLEV= 6
##$NOISF1= 0
##$NOISF2= 0
##$NSP= 0
##$NTH_PI= 0
##$NZP= 0
##$OFFSET= 14.98509
##$PC= 1
##$PHC0= 96.65771
##$PHC1= 0
##$PH_mod= 1
##$PKNL= yes
##$PPARMOD= 0
##$PPDIAG= 0
##$PPIPTYP= 0
##$PPMPNUM= 2147483647
##$PPRESOL= 1
##$PSCAL= 4
##$PSIGN= 0
##$PYNMP= <proc.py>
##$REVERSE= no
##$SF= 400.02
##$SI= 32768
##$SIGF1= 0
##$SIGF2= 0
##$SINO= 400
##$SIOLD= 32768
##$SPECTYP= <>
##$SREGLST= <1H.CDCl3>
##$SSB= 0
##$STSI= 32768
##$STSR= 0
##$SW_p= 8223.68421052631
##$SYMM= 0
##$S_DEV= 0
##$TDeff= 65536
##$TDoff= 0
##$TI= <>
##$TILT= no
##$TM1= 0
##$TM2= 0
##$TOPLEV= 0
##$USERP1= <user>
##$USERP2= <user>
##$USERP3= <user>
##$USERP4= <user>
##$USERP5= <user>
##$WDW= 1
##$XDIM= 32768
##$YMAX_p= 474112423
##$YMIN_p= -641884
##$CURPLOT= <Network HP LaserJet P1505>
##$CURPRIN= <$Network HP LaserJet P1505>
##$DFORMAT= <normdp>
##$LAYOUT= <+/1D_H.xwp>
##$LFORMAT= <normlp>
##$PFORMAT= <normpl>
##$SURQMSG= 1
$$ End of Bruker specific parameters
$$ ---------------------------------
##NTUPLES= NMR SPECTRUM
##VAR_NAME=  FREQUENCY,     SPECTRUM/REAL,   SPECTRUM/IMAG
##SYMBOL=    X,             R,               I
##VAR_TYPE=  INDEPENDENT,   DEPENDENT,       DEPENDENT
##VAR_FORM=  AFFN,          ASDF,            ASDF
##VAR_DIM=   32768,         32768,           32768
##UNITS=     HZ,            ARBITRARY UNITS, ARBITRARY UNITS
##FACTOR=    0.250966925370066, 1,           1
##FIRST=     8223.43324360094, -165753,      51079
##LAST=      0,             38401,           -39495
##MIN=       0,             -641884,         0
##MAX=       8223.43324360094, 474112423,    0
$$ Real data points
##PAGE= N=1
##DATA TABLE= (X++(R..R)), XYDATA
$$ [...]
19505A55640I087J22112J52422a79384k31190A6041d6392j16296k7374C869a42830
19493c33299a40529L1557A13108c6360r1685K3270j02648D4883a8528b932q1737
19482h4669j9934L0459n2276e2998j61255A4303a57691j70576J51760B62133a66099
19470e4003l67777a70389G4703J4655b36714B89548G7463J31758A0670K41647
19460B52317n9383a54992B7014f028C3115b88610I1716f8074j31016B47122b81908
19448b00239B43617a75772A42639a91831A08868a4543j56069k8797A17324e85104
19437A22878J8255e5029k89557K0856a00510B29539a45960e576q7640K6887K8624
19426c7705m5342m90810F6110c79539A99566H3094h8950L9975C3817F418K9696
$$ plain form
19505 155640 9087 131199 283621 -179384 -410574 16041 -46392 -162688 -190062 3869 -142830
19493 -333299 -140529 -108972 113108 -36360 -128045 -104775 -207423 44883 -18528 -2932 -84669
19482 -84669 -104603 -74144 -126420 -52998 -214253 14303 -157691 -328267 -176507 262133 -166099
19470 -54003 -421780 -170389 74703 89358 -236714 289548 77463 209221 10670 252317
19460 252317 192934 -154992 27014 -6028 33115 -288610 91716 -68074 -199090 247122 -281908
19448 -200239 243617 -175772 142639 -191831 108868 -14543 -170612 -199409 117324 -585104
19437 122878 141133 -55029 -344586 -323730 -100510 229539 -145960 -5576 -93216 -66329 -37705
19426 -37705 -83047 -573857 66110 -379539 199566 83094 -88950 -48975 33817 6418 36114
19415C6114e49758C8738O4022a80684B92751a19019p9572B69183C2841f3270j26169
19404a89439o8211Q7103j6147e2418K1057j12080A97688d6745B54504D4475a4540
19392A53851b22122a08152A90761c2144p2621G9383I476b9431B54774e500B1117
19380d81315a10986m01928J85487i6501r574B6424a01072g321I9471a55067j10230
19369b65297j02529K248J61164d5849l19415a28457k8184K7407A88953g8647G8283
19357F3423b26405h1931A52708j7980a97185L5263e6725k66123A8371a77662K9749
19346a47913h917q8921j08435N8718O5800l59613a03666p2087g838k09973e5135
19334i3291m8905k27165f8278k3337j15217n4376I4776i8202K8697j36255e2892
$$ plain form
19415 36114 -549758 38738 102760 -180684 292751 -119019 -198591 269183 32841 -63270 -189439
19404 -189439 -257650 -170547 -186694 -52418 -31361 -143441 197688 -46745 254504 44475 -14540
19392 153851 -222122 -108152 190761 -32144 -104765 79383 9476 -29431 254774 -5500 21117
19380 -481315 -110986 -512914 -327427 -96501 -106075 26424 -101072 -7321 99471 -155067 -265297
19369 -265297 -367826 -365578 -204414 -45849 -365264 -128457 -156641 -129234 188953 -78647 78283
19357 63423 -226405 -81931 152708 134728 -197185 -161922 -56725 -322848 18371 -177662 -147913
19346 -147913 -8917 -97838 -206273 -147555 -81755 -441368 -103666 -175753 -7838 -217811 -55135
19334 -93291 -142196 -369361 -68278 -91615 -206832 -261208 94776 -98202 -69505 -205760 -52892
19322a49137l67720C2990b16786O1454A07265m1877O460P1203c01608i9468j25292
19311b24760J02569I5381K47456b87574B13245a29826F5210j6670c65747a2337
19300a81909b9170j84490b0204j21422j1810p3724c9806r3739o3658A33782b26205
19288A87038b03863f542r1856a7231H613K485d5003j66725P3906d5111F6605e3839
19275A95579q5779c59651A1802J07380E1229f92k8962A5086b02384j8959C0834
19263B02793h2055J3713p4208j50343K8259i3824j9311p7113a1887A94319C3459
19251C7413d9250l58466A1477i2564a6745j78759Q3635A13468A0159J28053J22277
19240B60489b48016O8779G137a52587J583B6005L4537a41991b2371j43552e147
$$ plain form
19322 -149137 -516857 32990 -216786 -155332 107265 65388 71848 143051 -301608 -99468 -224760
19311 -224760 -122191 95381 342837 -287574 213245 -129826 65210 48540 -365747 -12337
19300 -181909 -29170 -213660 -20204 -141626 -153436 -227160 -39806 -133545 -197203 133782 -226205
19288 187038 -203863 -6542 -98398 -17231 8613 11098 -45003 -211728 -137822 -45111 66605 -53839
19275 195579 109800 -359651 11802 119182 51229 -692 -29654 15086 -202384 -221343 30834
19263 202793 -82055 -68342 -142550 -292893 -264634 -93824 -113135 -190248 -11887 194319 33459
19251 37413 -49250 -407716 11477 -92564 -16745 -195504 -111869 113468 10159 138212 260489
19240 260489 -248016 -179237 7137 -152587 -151004 26005 60542 -141991 -22371 -165923 -5147
19228a31717o2773M2794L9252i732j47021j43219I776e5951a3275H3645c4090
19216a40952A74248c06261d0786j83592l4569i9186B9339J6291d03420a73385
19205C9302i6293C47129f6100K9177n0453D0218i0793m2815D2385a51171C490
19193e2249D0234M14901a03192c8060k38675A84307g8215o9064A51325M2392c3621
19181A45841a44591M5678c9290a7703n2983p0335H733b61118m1426A04867A5194
19169a52660c7102j94060C1611j1786b42329c5378k97465d6443F4521d8887k53689
19158c02576B9549J00386J04387i9043j38406A3544a30147A27313a13643n28241
19148f41884g2841k6992r1613B32445c23901D1736e7730r1160A66522J84150A39328
$$ plain form
19228 -131717 -194490 -151696 -112444 -9732 -156753 -299972 9776 -55951 -13275 83645 -34090
19216 -140952 174248 -306261 -40786 -224378 -258947 -99186 29339 45630 -403420 -173385
19205 39302 -96293 347129 -66100 -36923 -87376 40218 -90793 -133608 42385 -151171 3490
19193 -52249 40234 455135 -103192 -38060 -276735 184307 -78215 -147279 151325 193717 -33621
19181 145841 -144591 -98913 -39290 -17703 -70686 -141021 8733 -261118 -302544 104867 15194
19169 -152660 -37102 -231162 31611 19825 -242329 -35378 -332843 -46443 64521 -48887 -302576
19158 -302576 29549 129935 234322 -99043 -237449 13544 -130147 127313 -113643 -641884
19148 -641884 -72841 -99833 -191446 232445 -323901 41736 -57730 -148890 166522 350672 139328
19136d35770C4683a30607C6489b42962A01854c3418q3854A33446i4467j1677a1348
19124a53568e6619o9597A72602d2263A53455M8136G3596a4917k92895D3889a00270
19112i7384I0377a98902C61023H6242R0313a54643A76706A9812b55137e158j24189
19101a29347A11490M3695f3520C79189A1385b16079P0371B03865a30607J5760
19091a14847e2127A13223a26089A8852a17795G706c7682A15175K7050b19690K9023
19080a90667j65464D7269O045a23056A37641b68811G6361b13754O499e2764A60841
19068e9787A48207H321a12954d5373B07905r3513B0939K7001g3014q4526C29258
19056H582O2461A887a53579c5032j52285A94356p5195a9030j42083B30505b27185
$$ plain form
19136 -435770 34683 -130607 36489 -242962 101854 -33418 -117272 133446 -94467 -106144 -11348
19124 -153568 -56619 -126216 172602 -42263 153455 201591 73596 -14917 -307812 43889 -100270
19112 -97384 90377 -198902 361023 86242 176555 -154643 176706 19812 -255137 -5158 -129347
19101 -129347 111490 155185 -63520 379189 11385 -216079 -145708 203865 -130607 -114847
19091 -114847 -52127 113223 -126089 18852 -117795 7706 -37682 115175 142225 -219690 -190667
19080 -190667 -356131 47269 53314 -123056 137641 -268811 76361 -213754 -207255 -52764 160841
19068 -59787 148207 8321 -112954 -45373 207905 114392 20939 47940 -73014 -157540 329258
19056 8582 71043 1887 -153579 -35032 -187317 194356 119161 -19030 -161113 230505 -227185
19044b7696k11258K826E0462b97070R1284a8353l0297j57080N9650E877J15523
19033A21400A4713P714J80385g2867o8069O8169A47470c84970c3246B96071a93329
19021B22983b71810A45674A9993Q5737K17405A7927g7598n867A26521J6224c0160
19009c46639d3087J9390A72068a36337B51805A03610i8031j36531L2014I9418
18998C72056A0453J33526f3222D66061b12937m133A74884c7914j03235B38946
18987a5691b839l22301D1033a21547G3665a38620r7066h6143j73983c1843A20042
18975b32514g8567J6337A84288a11470E38940a03915E12280K59199C77823A2812
18964A2691a21942O390c1401A80780G2531B2796J23969c77550A75094e8439k88120
$$ plain form
19044 -27696 -238954 -236128 50462 -297070 -205786 -18353 -48650 -205730 -146080 5877 121400
19033 121400 14713 22427 202812 -72867 -140936 -72767 147470 -384970 -33246 296071 -193329
19021 222983 -271810 145674 19993 105730 323135 17927 -77598 -83465 126521 142745 -30160
19009 -346639 -43087 -23697 172068 -136337 251805 103610 -98031 -234562 -202548 99418
18998 372056 10453 143979 -63222 466061 -212937 -217070 174884 -37914 -141149 238946
18987 -15691 -2839 -325140 41033 -121547 73665 -138620 -235686 -86143 -260126 -31843 120042
18975 -232514 -78567 -62230 184288 -111470 538940 -103915 512280 771479 377823 12812
18964 12691 -121942 -115552 -31401 180780 72531 22796 146765 -377550 175094 -58439 -346559
18953c46559i6429p8545c6354j05702k83432b2152C91163A07078i8911M8401r0101
18942a40611m7638J5507f4342k09732J22648F5796A7561J01947H02a50343A0676
18930B47412a80122j59514R7792f7020p9115j172b0010j11807k53298j77630i3815
18918B05063a43416A8382c41769j423C48142f1581B1810e8520I2238i2936B41240
18906A79315L60899n2008k39566n5980K45248g5098G2655a64432I0061i0705C1418
18894a29163C20330a3703k9575A22186a29857A36323h889A06744a35948B46065
18883D1235c88694A95921D3177C740K04051J75269b15691j9802A0611J33474C1266
18871C4935K87667a36921d7297D1869a29801A81232d0155C2180g5093A86492J3199
$$ plain form
18953 -346559 -96429 -174974 -36354 -142056 -425488 -22152 391163 107078 -98911 -50510 -140611
18942 -140611 -188249 -172742 -64342 -274074 -151426 65796 17561 119508 802 -150343 10676
18930 247412 -180122 -339636 -241844 -67020 -146135 -147307 -20010 -131817 -385115 -562745 -93815
18918 205063 -143416 18382 -341769 -343192 348142 -61581 21810 -58520 92238 -92936 241240
18906 179315 540214 488206 248640 192660 437908 -75098 72655 -164432 90061 -90705 31418
18894 -129163 320330 -13703 -43278 122186 -129857 136323 -8889 106744 -135948 246065
18883 41235 -388694 195921 43177 3740 207791 383060 -215691 -235493 10611 144085 31266
18871 34935 322602 -136921 -47297 41869 -129801 181232 -40155 32180 -75093 186492 199691
18860A99691a57463D79028b7927j19096j97545F232b26024N2939l1870H3705l9046
18849D4659i3964b1124B20922d69339b25780d4594o6087D3377Q3263o2590b87626
18837B65081d14346A31959J54034h4526H7655p980a72501I3032J69999f2581B8462
18825c12871A21813m9884b16802Q4029A76570b30335H3172c53538B21529r8463
18815A23066Q1688B5125a76123a5293l65879A14037f77j07047c4324D6512J59201
18804B05713A5921c56244k1005J76878j21279Q2753A19790b44138j65467d2719
18793b33326A6088i3021n9602k09328J71137c2160B444a43678k13784A02227a77815
18781G0514a67247m1185k09390p5047G1422b20396A25006k2664e1483B58268g0975
$$ plain form
18860 199691 -157463 479028 -27927 -147023 -344568 6232 -226024 -173085 -204955 83705 44659
18849 44659 -93964 -21124 220922 -469339 -225780 -44594 -110681 43377 126640 64050 -287626
18837 265081 -414346 131959 285993 -84526 87655 79675 -172501 93032 263031 -62581 28462
18825 -312871 121813 71929 -216802 -132773 176570 -230335 83172 -353538 221529 123066
18815 123066 204754 25125 -176123 -15293 -381172 114037 -677 -107724 -34324 46512 205713
18804 205713 15921 -356244 -377249 -200371 -321650 -238897 119790 -244138 -409605 -42719
18793 -233326 16088 -93021 -152623 -361951 -190814 -32160 2444 -143678 -357462 102227 -177815
18781 70514 -167247 -208432 -417822 -492869 71422 -220396 125006 102342 -51483 258268 -70975
18769g8981C0092K5295J23429N4583a31273O4764F6727L7414C7628J75057c46191
18757D9486b26066J06090k6714n1638P5572C4986J24631b05716M0138k1920j01678
18746b89176f1164J5066j4275j262F6294a04518G6189a16855A75292e2768A68136
18734C5399a27101M2368j16706A52558c08203i2094B5424P1701c79847A982a10105
18722h0988E9574J40994c21961C04627H0866b15200B00515a02538A81b88436J26231
18711a62205A64172b15453A85066a84993k155M6774q9066k24603A4958L454K51390
18700B69802f2176A54979a35735A49324b04272l1373g9397B5526f2456o3045P476
18689a18025A98142M5649F4101a79932k19311a02277C9278J14683n7938a51488
$$ plain form
18769 -78981 30092 55387 178816 233399 -131273 -66509 66727 104141 37628 212685 -346191
18757 49486 -226066 -119976 -146690 -198328 -122756 34986 159617 -205716 -165578 -187498 -289176
18746 -289176 -61164 -46098 -60373 -61635 66294 -104518 76189 -116855 175292 -52768 168136
18734 35399 -127101 -84733 -201439 152558 -308203 -92094 25424 97125 -379847 1982 -110105
18722 -80988 59574 200568 -321961 304627 80866 -215200 200515 -102538 181 -288436 -162205
18711 -162205 164172 -215453 185066 -184993 -187148 -140374 -229440 -454043 14958 18412 269802
18700 269802 -62176 154979 -135735 149324 -204272 -235645 -79397 25526 -62456 -125501 -118025
18689 -118025 198142 243791 64101 -179932 -399243 -102277 39278 153961 96023 -151488
18678G5528i7417r8860J5117q7335A55500a66966j45893q472B20025j00251c4124
18666a14992j24050E0672f2023A17020f128m27194J4901c6946m5548c6248A10610
18654g3061p3477e6566H2584c06086e5759B5427L6415M670g0411B4490h7530H9141
18641A46657a35650j04703A3212J10569e4702p4874l0857j38179E7082d2420B04041
18629b06194R3214j98657C13616a25465C54145q4015M4242b12312A58291a17735
18618a30550A11541b29302E0733f6464a6698j68241o6621B8850a69378c8209k89648
18607c27857c9037D6103A1563N7623a03722L8117B46357b71109A34330o3028b65713
18595A75645p2550h8984F3098a55670a5397j92697a0428B77599A19856B5037a12296
$$ plain form
18678 75528 -97417 -196277 -181160 -268495 155500 -166966 -312859 -321331 220025 119774 -34124
18666 -114992 -239042 50672 -62023 117020 -6128 -433322 -418421 -36946 -82494 -36248 110610
18654 -73061 -146538 -56566 82584 -306086 -55759 25427 61842 66512 -70411 24490 -87530 89141
18641 146657 -135650 -240353 13212 123781 -54702 -129576 -160433 -298612 57082 -42420 204041
18629 -206194 -112980 -311637 313616 -125465 354145 270130 314372 -212312 158291 -117735
18618 -130550 111541 -229302 50733 -66464 -16698 -184939 -251560 28850 -169378 -38209 -327857
18607 -327857 -39037 46103 11563 69186 -103722 -65605 246357 -271109 134330 71302 -265713
18595 175645 103095 -88984 63098 -155670 -15397 -208094 -10428 277599 119856 25037 -112296
18583A45255b34389a12888D6528J38116b1306l2606j21779j70434C70254c9471
18572i0683A18890f4862B12518H8505P541C8659g4930j74628R2794a6623K20A59515
18559f0900k17668r5538C95711a911k58078G0280a68702b4435k37606O6382e3639
18547b82466r694h1273j98508B37987a07848p2353k25193I6805a3587A94316d55676
18535d842p3436j48457F3944b40366B8492J07412h2461c8114n6604j07573f0280
18523a81714k3330R4798N2607q0374n3312f1938j67886F9698i3450L812j70296
18512b59934r5441a72083A89883a66763P3551e63l12958a30936a1170j99879N5900
18501a55149A3881a48726r0650a05402o3285F6369Q674h9739o7061A73512c15648
$$ plain form
18583 145255 -234389 -112888 46528 184644 -21306 -53912 -175691 -346125 370254 -39471
18572 -90683 118890 -64862 212518 88505 96046 38659 -74930 -249558 -156764 -16623 -16403 159515
18559 -60900 -278568 -374106 395711 -1911 -259989 70280 -168702 -24435 -262041 -195659 -53639
18547 -282466 -292160 -81273 -279781 237987 -107848 -180201 -405394 96805 -13587 194316 -455676
18535 -4842 -78278 -226735 63944 -240366 28492 135904 -82461 -38114 -94718 -202291 -60280
18523 -181714 -205044 -110246 -57639 -138013 -191325 -61938 -229824 69698 -93450 -89638 -259934
18512 -259934 -355375 -172083 189883 -166763 -93212 -563 -313521 -130936 -11170 -211049 -155149
18501 -155149 13881 -148726 -239376 -105402 -168687 66369 75043 -89739 -156800 173512 -315648
18489g8989m3026l3404m6793C5878K7248g0055k9093A85606b9036C8831n803g9065
18476c56899f8300A60734a43363E8773b77346j4512b2290r1585j7105c5514j99788
18465b35302K0237B14429K6141H0034N6772e706B3817a68435A01799p403k5683
18454F8713J8791j6156R7728A2526e17684A76145i9956l1954A68017e5169F7996
18442d1502j82063a06208G522a7985j5654k72867a17100A19794b51535D3820b75018
18430B22974j01551f6568I9319K6248a7079k89207B5940M5712b6661B75367j6530
18419B58837d3730A12569a14357F0506J12300b67582B95010f9310q321H6577a55669
18407A25102j8959M9945E8047d9046j7863A2323J71359e0923H8948a17394O491
$$ plain form
18489 -78989 -122015 -155419 -202212 35878 63126 -70055 -99148 185606 -29036 38831 33028 -79065
18476 -356899 -68300 160734 -143363 58773 -277346 -291858 -22290 -113875 -130980 -35514 -235302
18465 -235302 -215065 214429 240570 80034 136806 -5706 23817 -168435 101799 94396 68713
18454 68713 87504 71348 169076 12526 -517684 176145 -99956 -131910 168017 -55169 67996
18442 -41502 -223565 -106208 7522 -17985 -33639 -306506 -117100 119794 -251535 43820 -275018
18430 222974 121423 -66568 99319 125567 -17079 -306286 25940 71652 -26661 275367 258837
18419 258837 -43730 112569 -114357 60506 172806 -267582 295010 -69310 -77631 86577 -155669
18407 125102 106143 156088 58047 -49046 -66909 12323 183682 -50923 88948 -117394 -110903
18396a10903B17490a6937l62833J24923A3452b81055a34500j76702J45364d1933
18385I5473q848J25388a11236j22140A1672J21710B0039a08741D8191e2598C33788
18373H6215e9290K7230l3208j4698j95682a22390B54110o5902h3212c2187r1287
18362a23474A41666B6054b78791J39076B29503d06733a72372C1554K4899a02830
18351i370j17368p2438A92409E8899a41498B25303d4523C4696K6889J21944K1054
18340B04583D091a48677E4751c0471B30652D5729e1552k25866D1371a90812f6806
18328b53442b5735M876C8412b86575a16903o6575B41607a23311L8006j08999e7736
18316B96117b1605A53927J05992a20205E6416b87588g1818k44289a24433B99397
$$ plain form
18396 -110903 217490 -16937 -379770 -254847 13452 -281055 -134500 -311202 -165838 -41933
18385 95473 86625 212013 -111236 -233376 11672 133382 20039 -108741 48191 -52598 333788
18373 86215 -59290 -32060 -65268 -79966 -275648 -122390 254110 188208 -83212 -32187 -123474
18362 -123474 141666 26054 -278791 -139715 229503 -406733 -172372 31554 56453 -102830
18351 -9370 -126738 -199176 192409 58899 -141498 225303 -44523 34696 61585 183529 204583
18340 204583 4091 -148677 54751 -30471 230652 45729 -51552 -277418 41371 -190812 -66806
18328 -253442 -25735 -20859 38412 -286575 -116903 -183478 241607 -123311 -85305 -194304 -57736
18316 296117 -21605 153927 259919 -120205 56416 -287588 -71818 -316107 -124433 299397
18305A15134d41494J97651A75609b06447a8521n1875l496c1152A77436b51192
18294e4833k34186R8043L7106A5059i2125A37726f7556A71377n9728e93567b04433
18282a8640A40178L6159b25069K2699L952H9017b70364d3911j1423B56434E9956
18270b7606j14141C1017b47464I1702b26486A45945i8233J3554j74353I005J15051
18259A24056J22451b55848B14570r2113k6830b20169l0732A39080G955a29113
18248b32804o977Q6870k96829F6871Q498a82525Q4679j65364a1894j65446j90918
18237c68258C99645d5189C4355N2854A1229R4796e329G46a78100B80107j05680
18226A74427a64210d8097A87672K42961b97091J43925E5620a8154A26717i8469
$$ plain form
18305 115134 -441494 -243843 175609 -206447 -18521 -70396 -73892 -31152 177436 -251192
18294 -54833 -289019 -190976 -153870 15059 -92125 137726 -67556 171377 111649 -593567 -204433
18282 -18640 140178 176337 -225069 -202370 -198418 89017 -270364 -43911 -55334 256434 59956
18270 -27606 -141747 31017 -247464 91702 -226486 145945 -98233 -84679 -259032 9005 124056
18259 124056 246507 -255848 214570 122457 95627 -220169 -250901 139080 7955 -129113
18248 -232804 -239781 -152911 -449740 66871 75369 -182525 -97846 -263210 -11894 -177340 -368258
18237 -368258 399645 -45189 34355 87209 11229 106025 -5329 746 -178100 280107 174427
18226 174427 -164210 -48097 187672 430633 -297091 -153166 55620 -18154 126717 -98469
18215f778j81439e9828C23518a7930B35362b27223A784a34351c7983n0175B81692
18203a31918F8440K47267E039f5294k1173r0231A44690n3013D4164O3402c7871
18191B68518A3579a5081j26907a2609k36160i4766L8443j25655f3795l68470a94568
18179a18693j42344i5673j96493P5395g808j67870k66567c8503J8749m8574R068
18168e9260b459j4631m5280l0444A8179a84773B03983h307H6058a04679q8766
18157a93445l3569J10754K3760A0125J58025h0340k2657o634A95362F9071k6190
18146D2881f1982A42982i2535A79390c2827k0881j10353a8610p8720A50259f3184
18134b73942A01569k2958J49096c86141A04708b39601M8325a8297j03608A39575
$$ plain form
18215 -6778 -188217 -59828 323518 -17930 235362 -227223 1784 -134351 -37983 -88158 281692
18203 -131918 68440 315707 5039 -65294 -86467 -176698 144690 91677 44164 107566 -37871
18191 268518 13579 -15081 -141988 -12609 -248769 -94766 -56323 -181978 -63795 -432265 -194568
18179 -118693 -261037 -95673 -292166 -216771 -7808 -175678 -442245 -38503 -19754 -68328 -59260
18168 -59260 -2459 -17090 -62370 -92814 18179 -184773 203983 -8307 86058 -104679 -193445
18157 -193445 -227014 -116260 -92500 10125 168150 -80340 -102997 -109631 195362 69071 42881
18146 42881 -61982 142982 -92535 179390 -32827 -53708 -164061 -18610 -97330 150259 -63184
18134 -273942 101569 78611 227707 -386141 104708 -239601 -191276 -18297 -121905 139575
18123b34206B1826b20305e4721B5145R3045M7515e8523D5747J40667b1125p6822
18112i7947G4558P4701Q2728E8924d09695a92044h5035D15239A049R1573a98418
18100A09857b05747E9163K7250B8252b29973A21124C8175M4537a1030k39411a8389
18088B8128b24341D0304d7908A51605L7234K6996G5644L7349a30813I7487b2710
18076g3265j32103l43374A76070a9217A23354f0493b9682G1716a24719N6011p7980
18065a46688M6476M9599J7132A74833b04122j00800D2698h8357B48968G2487h3019
18053A32973C2837N8739d4916E4597b27570n4995n656a00287D57716A41742K22215
18042C63957j76168G1672c7434j31650P1139r1515G7652K08740a14254l52198
$$ plain form
18123 -234206 21826 -220305 -54721 25145 118190 165705 -58523 45747 186414 -21125 -97947
18112 -97947 74558 149259 231987 58924 -409695 -192044 -85035 415239 1049 92622 -198418
18100 109857 -205747 59163 86413 28252 -229973 121124 38175 82712 -11030 -250441 -18389
18088 28128 -224341 40304 -47908 151605 188839 215835 75644 112993 -130813 97487 -22710
18076 -73265 -205368 -548742 176070 -19217 123354 -60493 -29682 71716 -124719 -68708 -146688
18065 -146688 -100212 -50613 -33481 174833 -204122 -304922 42698 -88357 248968 72487 -83019
18053 132973 32837 91576 -44916 54597 -227570 -282565 -288221 -100287 457716 141742 363957
18042 363957 187789 71672 -37434 -169084 -97945 -189460 77652 286392 -114254 -466452
18032d66452A20212m0906r755b3952A76376G4055k0025a72059A87609a24627A29885
18020F7494J04521b11435n8126A04962a45905n983n9845i8650o0601j9750B31216
18008a7315C27739a42171j94610D13631b80602a61A19527l4828d0685C05161b29424
17996B73051b38887a9625P821I02O6401b65195B28167a42590A769a0232j30628
17985a40860A34346k4702F369a63069A8367J03074g0491j77846C00380I3021a46012
17973i0491j7035j5529B25597h7700E9805L7412a90146A02651J6664J57832b19897
17961b13283B51512H5799e5228q6205j0134k33428A50854N1088R5702g4894B20223
17949B1851N8032a14299r9092A87490q0538C8733f8422A48651g7755j67173a19304
$$ plain form
18032 -466452 120212 79306 69551 -23952 176376 74055 54030 -172059 187609 -124627 129885
18020 67494 172015 -211435 -269561 104962 -145905 -151888 -211733 -98650 -159251 -179001 231216
18008 -17315 327739 -142171 -336781 413631 -280602 -161 119527 84699 -40685 305161 -229424
17996 273051 -238887 -19625 -11804 902 67303 -265195 228167 -142590 1769 -10232 -140860
17985 -140860 134346 109644 6369 -163069 18367 121441 -70491 -248337 300380 93021 -146012
17973 -90491 -107526 -123055 225597 -87700 59805 97217 -190146 102651 119315 277147 -219897
17961 -213283 251512 85799 -55228 -141433 -151567 -384995 150854 201942 297644 -74894 220223
17949 21851 79883 -114299 -213391 187490 106952 38733 -68422 148651 -77755 -244928 -119304
17937A69901m6487a37516H334M36791b87400C7999b72575e2603j53235D7348B916
17925a17982n1902D3652h2172J4641A6310N678a13688A34579a00454H6590Q0859
17914A67449a39148A59101G7011l2904a92045A74561g3493j26501I0497d0478
17903c22691H8808a28825a9215j61095j3104k22481a71882K2006k6872E7788e4531
17891e41289a67676a6395B49222K5377I0891K17408l493F053K0121e1301B31644
17879C6946J0680J33857B5951c45324A89043c172n0034c297A13717D2647J20698
17868A63345n0575B3495a21413c3591A3914P2394j018K5849J39605b03969B8671
17856A82033f1170B79916C4475K95252c28134A45100h0108r7243O9781H0026J4318
$$ plain form
17937 169901 123414 -137516 8334 445125 -287400 37999 -272575 -52603 -205838 47348 2916
17925 -117982 -169884 43652 -82172 -67531 16310 21988 -113688 134579 -100454 86590 167449
17914 167449 -139148 159101 77011 44107 -192045 174561 -73493 -199994 90497 -40478
17903 -322691 88808 -128825 -19215 -180310 -193414 -415895 -171882 -149876 -176748 57788 -54531
17891 -541289 -167676 -16395 249222 274599 90891 308299 304806 6053 26174 -51301 231644
17879 36946 47626 181483 25951 -345324 189043 -3172 -53206 -3297 113717 42647 163345
17868 163345 112770 23495 -121413 -33591 13914 86308 85290 111139 250744 -203969 28671
17856 182033 -61170 279916 34475 329727 -328134 145100 -80108 -177351 -107570 80026 94344
17845I4344K4519B5085M3598J4314K62290j11397J5496a70534h4477j76734f850
17833b72391E0875b68811h5834C54730a93911b3381j50528C20693j56945L9078
17823B02826J62085c12746D5107J30071a37405C9672K2201a06075E9856g127C465
17811c15240A10362b23675A64506a85108B492h9726b2061l3262F7188b1854C56962
17799H2835i5928A04280L942N7857G6075a40469C27784a43940B32432c5823n1398
17788h7221n6436a0555G7714b5270B87432D6467L07529C407d74530B8154a18220
17776E4011b83187J28194D8580b47950n7693P7120F4460j453R4818J54981g0742
17764a05092l1738j12940k10313A69180f4009D90739A04660b24775h8252l8862
$$ plain form
17845 94344 118863 25085 68683 82997 345287 233890 249386 -170534 -84477 -261211 -6850
17833 -272391 50875 -268811 -85834 354730 -193911 -23381 -173909 320693 163748 202826
17823 202826 364911 -312746 45107 175178 -137405 39672 61873 -106075 59856 -7127 3465
17811 -315240 110362 -223675 164506 -185108 2492 -89726 -22061 -55323 67188 -21854 356962
17799 82835 -95928 104280 108222 166079 76075 -140469 327784 -143940 232432 -35823 -87221
17788 -87221 -143657 -10555 77714 -25270 287432 46467 353996 3407 -474530 28154 -118220
17776 54011 -283187 -154993 48580 -247950 -305643 -228523 64460 63007 157825 312806 -70742
17764 -105092 -136830 -249770 -460083 169180 -64009 490739 104660 -224775 -88252 -127114
17754a27114a8918A84276n9140D8194O0630J20095d2058C4213b89259K0397b4920
17742B12694E1653O0808a61089A72698b51052A86648e339A64278J269a47798C02815
17730D28215D5035A711b84216B84316P1701a93196B34477a27480A64423J90754
17720C55177A09407C3513j0722b48463J10836C7058P037K74516g4710B38075b8156
17708C67674c52948B49951a31518B7617K05450B0258a16381j924j826M9635n7321
17697a27817G7036P4038a60392E9182P3140D452a73473p5405C58520j73967E2239
17685A42613a77684J7375E9792K0413a39810B42733L07659A13601l6386N8788
17675A36003L31029B9749M4914J61319c66640B06298n4685J6041F7619P5698J62022
$$ plain form
17754 -127114 -18918 184276 125136 48194 108824 228919 -42058 34213 -289259 -268862 -24920
17742 212694 51653 112461 -161089 172698 -251052 186648 -5339 164278 165547 -147798 302815
17730 428215 45035 1711 -284216 284316 356017 -193196 234477 -127480 164423 355177
17720 355177 109407 33513 22791 -248463 -137627 37058 44095 318611 -74710 238075 -28156
17708 367674 -352948 249951 -131518 27617 233067 20258 -116381 -118305 -120131 -70496 -127817
17697 -127817 77036 151074 -160392 59182 132322 4452 -173473 -248878 358520 184553 52239
17685 142613 -177684 -160309 59792 80205 -139810 242733 550392 113601 77215 136003
17675 136003 467032 29749 74663 235982 -366640 206298 151613 167654 67619 143317 305339
17664C05339d7439j46455P601A57901d573l0489D2502J79020a60842B44200m3932
17653B00268o1360N7073F5853J45441k324K8624k3798P0028E695a72421A14231
17641D79492c9475A29299b35079A72599N6379a78389B07385g2986A13468f8543
17630A24304a93426A51219G3263K34310a66818E14127A40231J88247d0174B37345
17619F10661A30847J14533e425A52787J88052K3435a98280A16390K22348e4826
17608e228B71634j34185J41099H7160L99175A84206e781C4846O9533j7736a32098
17596A44621f4847o8533B80261j39600o9924K31035F0235a33163C20755I8570
17585D26209g9588k71411a38606H5577J95352p7985C0960O5357b22119H3558J84562
$$ plain form
17664 305339 -47439 -193894 -186293 157901 -4573 -35062 42502 221522 -160842 244200 200268
17653 200268 138908 195981 65853 211294 208970 237594 213796 283824 5695 -172421 114231
17641 479492 -39475 129299 -235079 172599 228978 -178389 207385 -72986 113468 -68543
17630 124304 -193426 151219 73263 307573 -166818 514127 140231 328478 -40174 237345
17619 610661 130847 245380 -5425 152787 340839 364274 -198280 116390 338738 -54826
17608 -5228 271634 137449 278548 87160 486335 184206 -5781 34846 104379 86643 -132098
17596 144621 -64847 -133380 280261 140661 70737 301772 60235 -133163 320755 98570
17585 426209 -79588 -350999 -138606 85577 280929 202944 30960 96317 -222119 83558 268120
17574B68120B2824a96962A06766q291J6011a87204B66571a55271C91419j86491
17564B04928r6532J8483D2935a1691q5470C9565n599K64339l0525K05465E3675
17552A10333J51969I4782a94588K1607A19212b15293D0234a49429C42085A0503
17541D7761M22809A6663L10719K3412o7560A33542L95409B58848H439J20704L24423
17530D53566N6155k40238r6249o5432K17801K27969L28733N3692K63273l16006
17520H83264k66825j7783B14242p760J2497m6679L00562J8355q466A57184L39732
17509D96916N9316K07784m5612k5381J01545l60226n4520P9354A50337M4320n8034
17498A36623L34918D4279K80988A01694K10466B7579L84022q7127m9695L5007
$$ plain form
17574 268120 22824 -196962 106766 98475 114486 -187204 266571 -155271 391419 204928
17564 204928 108396 126879 42935 -11691 -97161 39565 33966 298305 267780 473245 53675
17552 110333 262302 94782 -194588 -172981 119212 -215293 40234 -149429 342085 10503
17541 47761 470570 16663 327382 350794 283234 133542 528951 258848 8439 129143 453566
17530 453566 509721 269483 173234 107802 325603 553572 882305 935997 1199270 883264
17520 883264 616439 598656 214242 206482 218979 172300 472862 491217 482751 157184 496916
17509 496916 556232 764016 718404 693023 794568 434342 379822 459176 150337 194657 136623
17498 136623 471541 44279 325267 101694 312160 27579 411601 324474 274779 309786
17488C09786N4580F7058L33990j75680A05874j581L06213B03744I5899L03676
17478C99575C9573L92831c9713E18464R8276B13603N82679C33525d6563A75824
17467C66012n1840h5386C83419A59432G3915K50452J23388A21526n1035Q8622
17457A59113K47686J35022E0715L42513j27938N967p8536q5451J45396J99630
17447D52296j32387h3553F74563j62661j44405N5334L1573B06407J97379A20096
17436E26277k9283J15652k24434P1869J26690B33989K13523j81837J16150p5604
17426C06221K5115j62657J35474A38177K47831N4229J70973Q0653A53333K81325
17416D34658D1726K10658K83806j21631J00007M6932J33365B37814J97120N1855
$$ plain form
17488 309786 364366 67058 401048 225368 105874 104293 410506 203744 95899 399575
17478 399575 39573 432404 -39713 518464 616740 213603 796282 333525 -46563 175824
17467 366012 314172 -85386 383419 159432 73915 324367 447755 121526 70491 159113
17457 159113 406799 541821 50715 393228 265290 271257 192721 107270 252666 452296
17447 452296 319909 -83553 674563 511902 367497 422831 454404 206407 403786 120096
17436 526277 496994 612646 388212 460081 586771 233989 447512 265675 381825 306221
17426 306221 331336 168679 304153 138177 386008 440237 611210 691863 153333 434658
17416 434658 41726 252384 536190 414559 514566 561498 694863 237814 434934 486789
17406D86789j53672J69143A18584A8906J06081J42420K5879O8039A79502D8698
17395b00384A8661J66967K01002A87224n404A0154L28319j35650R9308A8479L23982
17384C42461A25378D3039K25237q9314J49727j54774a06953C20817F2545d5591
17373B31669L40192B17470F3867J31311o1002K16807o7122k5048A25109Q7800
17363B12909J04581A26304J84364A37604J66997K46390A02894N36562A14651J9048
17353A33699R3923n4735C2146b21704A08168j0628j2044i865B39710J05175j56967
17342A87918C6694J34413j6075J24462A10476L48984G8815M9087J02260M3267
17332B73429j24159j4149C8354K57006A35718a14030B82070k4116j19980M4645
$$ plain form
17406 486789 333117 502260 118584 18906 124987 267407 293286 361325 179502 48698
17395 -200384 18661 185628 386630 187224 181820 10154 338473 202823 302131 18479 342461
17384 342461 125378 43039 268276 178962 328689 173915 -106953 320817 62545 -45591
17373 231669 571861 217470 63867 195178 134176 350983 283861 258813 125109 212909
17363 212909 317490 126304 310668 137604 304601 550991 102894 639456 114651 133699
17353 133699 227622 172887 32146 -221704 108168 97540 85496 -9865 239710 344885 187918
17342 187918 36694 171107 155032 279494 110476 459460 78815 127902 230162 273429
17332 273429 149270 135121 38354 295360 135718 -114030 282070 257954 137974 182619
17322A82619L09440k28751K471J96369A12649K13692b3376j2525B69504M4040
17312C13544C0669m255L97996A37770L7942q3852L93770B29063l9690H6132e7537
17300A24872M27446A53193M58920j03988H8965L42914A28535J48987J56837r6040
17290C38319A17039J31927L16959j90289M5146A66224K56493d7379F9095L21546
17280C90641k8104K07985F0906P7587f924E46399A49073j4220J96128M2818c0266
17268B65315J0093G9621K47283A42213j4893P4309K82206k03628J9177k9506M09582
17257F79460H8807K31198A10106L47441J6203m4098k14756L96190B43250j20148
17247A23102J22973m1975J73436A37770J9916M30162j52133F6615J46258o4100
$$ plain form
17322 182619 492059 263308 265779 462148 112649 326341 -23376 -35901 269504 313544
17312 313544 30669 26414 424410 137770 175712 91860 485630 229063 189373 86132 -57537
17300 124872 552318 153193 612113 508125 88965 431879 128535 277522 434359 338319
17290 338319 117039 248966 565925 375636 420782 166224 422717 -47379 69095 390641
17280 390641 362537 570522 60906 138493 -6924 546399 149073 134853 330981 373799 -30266
17268 265315 275408 79621 326904 142213 127320 201629 483835 280207 299384 269878 679460
17257 679460 88807 320005 110106 457547 473750 429652 214896 611086 243250 123102
17247 123102 246075 204100 377536 137770 157686 587848 435715 66615 212873 148773
17237A48773N7894q6013M16588k28514P0986l1436o945p5435K1004j40636R5381
17226B41647m8426M19356k23232m7884q8501J01979c4361D46291G3564K04645
17216B78209J58002p6889k381O8350j7516F0148K97552j59789m138J37497j17070
17205B14200R6957J29708F8129e72B60260I0677K24057D9744J44002L50026k60226
17194B83546J00432O6669K62645l47314J90954A01651M84325k71299o2070j17735
17184A34872N45792j55962B32781J25562J29797Q1123J02526M5127j47636k18270
17174C51010m7295F6895J76433K25590A78937K72837O1383k25070M75538o3350
17164G00275l03145j82220F8035L95906J76232k27276J98005B25853J13621L1113
$$ plain form
17237 148773 206667 120654 537242 308728 379714 348278 341333 265898 286902 146266 241647
17226 241647 193221 612577 389345 341461 252960 354939 -34361 446291 73564 278209
17216 278209 436211 359322 356941 425291 407775 60148 357700 197911 193773 331270 214200
17205 214200 311157 440865 68129 -572 260260 90677 314734 49744 193746 543772 283546
17194 283546 383978 450647 713292 365978 556932 101651 585976 314677 252607 134872
17184 134872 680664 524702 232781 358343 488140 569263 671789 716916 569280 351010
17174 351010 303715 66895 243328 468918 178937 451774 513157 288087 763625 700275
17164 700275 397130 214910 68035 463941 640173 412897 610902 225853 339474 370587
17154C70587K44849J42585k32328N6795p664J16945j76895L7877J60812B69856
17143A64841O5124R0598j50087M51364K25341l54546K04499H6689N06781j26582
17133D66888j4980N521k6949j07021L22803J2759H0157L49034j82033K55993A86686
17121E56154J17224C24508K52751j94690K58531j5446J5988j32474J74199N9876
17111G43243k58370j11623L619K96405N734j23806R5209Q689k94024J75039L91625
17100I31740l50355N7624j61957j26078M31814l0212k38066j6676k619j66637
17090C28578K64283j05375L10967o1702l50523L96633k41424k225K06288k13999
17080E31501q0923J93524j41874K00195o3918R796L21637k00704N7388p2106K73117
$$ plain form
17154 370587 615436 758021 525693 582488 574824 691769 514874 552751 713563 269856
17143 164841 229965 320563 170476 621840 847181 492635 697134 86689 593470 466888
17133 466888 451908 457429 430480 323459 646262 659021 80157 429191 247158 503151 186686
17121 556154 673378 324508 577259 382569 641100 625654 641642 509168 683367 743243
17111 743243 484873 373250 376869 673274 679008 555202 650411 659100 365076 540115 931740
17100 931740 581385 639009 477052 350974 782788 752576 514510 497834 495215 328578
17090 328578 592861 487486 798453 736751 386228 782861 541437 539212 745500 531501
17080 531501 450578 644102 502228 702423 638505 648301 969938 769234 826622 754516 1027633
17069A027633m79075L82241j18046l28260K27070j02642J58473K5775Q2976j40766
17059G35379o7623L67182m29638L58992D70568L10037k80290M79552m0238j0629
17049I29000k52277K34504P3002j91894j6727j54622L28149n8504J15248k17168
17039G88711M0909J1019J29683j09011J19248R582l37125M92558l89774k46976
17029E08824L13681J33678k4817j58349K32998l67685K79172k12401P64908p03558
17019G66451L837K64578J8470j82595p7537K66161k11415R1864J40238l67594
17009G12458L91499l29826L88619k30547J13278o640M60376k64405P2392k12213
16999A094991P3268k41288L07755M187l08931J40472L2746P820k28894J81230
$$ plain form
17069 1027633 548558 930799 812753 484493 711563 608921 767394 793169 876145 735379
17059 735379 667756 1034938 605300 964292 470568 780605 500315 979867 939629 929000
17049 929000 676723 911227 984229 792335 775608 620986 949135 890631 1005879 788711
17039 788711 829620 840639 970322 861311 980559 990141 653016 1145574 755800 508824
17029 508824 822505 956183 931366 773017 1006015 638330 917502 705101 1470009 766451
17019 766451 770288 1034866 1053336 870741 793204 1059365 847950 939814 1080052 712458
17009 712458 1103957 774131 1162750 932203 1045481 1038841 1499217 1234812 1307204 1094991
16999 1094991 1168259 926971 1234726 1238913 929982 1070454 1103200 1111020 882126 1063356
16989A063356L15035R721l13884m282N6641K42083k27683J39575k28872N96611
16979A648301n24333J0687K07262k6211O0105j35795K18954Q9538l90855K16654
16969A374307K89389j28510L5322j84129J40752m60371J7876M05988J82517l27538
16959A345603N6544M2539K08809j15349K50534k19548j91173K55234l2509j82476
16949A418208J59450j23527L38703J44107j26155j61101M1871n7103K27443q6018
16939A775878L3955j02475K01205J95700l56388Q2833N8755R3434j1332K3452
16929A995017K17794k14146j91581M7623L447J09560p9571P4845J80990J29956
16919B273934M0007j7755m4908K28840j14885r3440j16395K45480L7742J37483
$$ plain form
16989 1063356 1378391 1388112 1074228 1069946 1126587 1368670 1140987 1280562 1051690 1648301
16979 1648301 1123968 1134655 1341917 1315706 1375811 1240016 1458970 1548508 1157653 1374307
16969 1374307 1663696 1535186 1570508 1386379 1527131 1066760 1084636 1490624 1673141 1345603
16959 1345603 1402147 1444686 1653495 1538146 1788680 1569132 1377959 1633193 1600684 1418208
16949 1418208 1577658 1454131 1792834 1936941 1810786 1649685 1691556 1634453 1861896 1775878
16939 1775878 1809833 1707358 1908563 2104263 1747875 1830708 1889463 1982897 1971565 1995017
16929 1995017 2212811 1998665 1807084 1854707 1858154 1967714 1888143 1962988 2143978 2273934
16919 2273934 2313941 2296186 2251278 2480118 2365233 2271793 2155398 2400878 2438620 2576103
16909B576103k35288M27307k93409k56275O62783l76229K46090l86667L31353
16900B695768j83025J93244n3648L06228k84453q7848M41753k47634M7358r4970
16890B732773K28197J78893L5008K21991m00231K01282j67585P7610n4045K02522
16880C256415J28883j45999j04828O2224L65010j30568l7262N35040m31676R2302
16870C589541l10868P02154j98125M27194r6582k33299K27070j10279M39952l56684
16860D080074L25071o5518J71574J9220p7147J44593J48458K34297o2313R3155
16850E011464K27261l11411M25395l95053K37903M1501K31920K51944l17226j66008
16840E237690N14184J76102o4114K58336p1314N88257l09323J08464O6982J33061
$$ plain form
16909 2576103 2340815 2768122 2474713 2218438 2881221 2504992 2751082 2364415 2695768
16900 2695768 2512743 2705987 2652339 2958567 2674114 2586266 3028019 2780385 2827743 2732773
16890 2732773 2960970 3139863 3174871 3396862 2996631 3197913 3030328 3107938 3053893 3256415
16880 3256415 3385298 3239299 3134471 3196695 3561705 3431137 3393875 3928915 3497239 3589541
16870 3589541 3278673 3980827 3782702 4209896 4113314 3880015 4107085 3996806 4436758 4080074
16860 4080074 4405145 4339627 4511201 4530421 4453274 4597867 4746325 4980622 4918309 5011464
16850 5011464 5238725 4927314 5352709 4957656 5195559 5237060 5468980 5720924 5403698 5237690
16840 5237690 5751874 5927976 5863862 6122198 6050884 6639141 6329818 6438282 6505264 6638325
16830F638325K84770N5741K45945K9892n8110J46915n7947M88519J59587j2598
16820G921039N03958K6720k70525K62532L20369M88902O0478O1330k84910O00306
16810I690199R1737K30573N46428J04319K71739j02656K77721L72244K7813J90077
16800A1700194O82700L88601K90387J90454k0533N91866K89105L19123M07349
16791A4839246O20062k50116N00024K39103O58678P39581N42160M40209L34099
16782A8663046Q56976l7691J043517M79356K14719J103964P32320P85376M25653
16773B4267236L70299J095924P80060P80898J107276R26209J185220N87735J222291
16764C2323148J066626Q52308J354989J182994J533549J213426J450100J256200
$$ plain form
16830 6638325 6923095 6978836 7224781 7254673 7196563 7343478 7285531 7774050 7933637 7921039
16820 7921039 8424997 8451717 8181192 8443724 8764093 9252995 9313473 9374803 9089893 9690199
16810 9690199 9781936 10012509 10558937 10663256 10934995 10832339 11110060 11482304 11510117 11700194
16800 11700194 12382894 12771495 13061882 13252336 13231803 13823669 14112774 14431897 14839246
16791 14839246 15459308 15209192 15709216 15948319 16606997 17346578 17888738 18328947 18663046
16782 18663046 19520022 19482331 20525848 21005204 21219923 22323887 23056207 23841583 24267236
16773 24267236 24637535 25733459 26513519 27294417 28401693 29327902 30513122 31100857 32323148
16764 32323148 33389774 34242082 35597071 36780065 38313614 39527040 40977140 42233340
16756D2233340J683948J565399J670989J904484J753950K034315K038197K058380
16748E6943002K239933K137028K453037K358510K676341K578411K404361L109129
16740G6899752K658567K824808L018759K867820K439947L183757L235896K791680
16732I9920986K915380K301338K837499K185760K379486J824154J848029J635680
16724A17848312J030871R40346L58082N95854l25261l09836o41011j160478j421882
16715A16914997k022422j441383j878873k919915k762795k482830k891520k898136
16707I7617123k987270k597159l485540k790893k906518k927549k785113l051799
16699G4085282k448521k768863k369281k680410k379120k478245k096643j824521
$$ plain form
16756 42233340 43917288 45482687 47153676 49058160 50812110 52846425 54884622 56943002
16748 56943002 59182935 61319963 63773000 66131510 68807851 71386262 73790623 76899752
16740 76899752 79558319 82383127 85401886 88269706 90709653 93893410 97129306 99920986
16732 99920986 102836366 105137704 107975203 110160963 112540449 114364603 116212632 117848312
16724 117848312 118879183 119819529 120177611 120773465 120448204 120138368 119497357 118336879 116914997
16715 116914997 114892575 113451192 111572319 108652404 105889609 103406779 100515259 97617123
16707 97617123 94629853 92032694 88547154 85756261 82849743 79922194 77137081 74085282
16699 74085282 71636761 68867898 66498617 63818207 61439087 58960842 56864199 55039678
16691E5039678k288577k370144j341625j943560j832132j796281j098203j738080
16683D0631076j575526j210296j462107j237954j354361j034730j052577j017293
16675C0686232j305036o13679p94136j098178r03273q74057q47738n57531r49566
16666B2743038n50074l07211j132157n19454m87300m41366m18532o67744n83044
16657A7636156n04508k17592n83939m92304j79938q15131o4318j26892q53786
16648A3797748j07090l86903m59505n90232r6457m13095K2029n78227k7435J4665
16638A1175498m79188l86790j61471J43582q53568J27582j58885R8311n16492
16629H988579j14870m26610K59765o26557q1877J86729j36441j02260q8040m40048
$$ plain form
16691 55039678 52751101 50380957 49039332 47095772 45263640 43467359 42369156 40631076
16683 40631076 39055550 37845254 36383147 35145193 33790832 32756102 31703525 30686232
16675 30686232 29381196 28767517 27973381 26875203 25971930 25097873 24250135 23692604 22743038
16666 22743038 22192964 21885753 20753596 20234142 19746842 19305476 18886944 18219200 17636156
16657 17636156 17131648 16914056 16330117 15837813 15657875 14842744 14778426 14651534 13797748
16648 13797748 13690658 13303755 12844250 12254018 12157561 11744466 11766495 11188268 11160833 11175498
16638 11175498 10696310 10309520 10148049 10291631 9438063 9565645 9406760 9505071 8988579
16629 8988579 8873709 8447099 8706864 8080307 7998430 8185159 8048718 7946458 7858418 7418370
16619G418370N13499o40797k70626p5326j22337k14780M239m10209J59122m05654
16609E955501L19764j11327k29591K9143o1654m72965P0620J03383k49673l4693
16599E318508p6442k3245j24181m43034K40205j43148J24109m46344K50016j8550
16589D657894m90055j656j25628L43277k59279k06661L57558l61359J55730k8875
16579D040946j75288k92393J01161N2519m17004L64173k31922m27315O87126o80918
16569C021085K08599J12242j81299k20248N9026L11394j4022r1495j94236k1403
16559B989643M3387j52775j03850j35459n9321L40248O7453j32525m15701J04457
16549B545557N5882j38575k81599L49642j27793J73110r3014j29355J4088J0875
$$ plain form
16619 7418370 7931869 7291072 7020446 6945120 6822783 6608003 6612242 6202033 6361155 5955501
16609 5955501 6275265 6163938 5934347 5963490 5901836 5428871 5499491 5602874 5353201 5318508
16599 5318508 5242066 5218821 5094640 4651606 4891811 4748663 4872772 4426428 4676444 4657894
16589 4657894 4167839 4166183 4040555 4383832 4124553 3917892 4275450 3914091 4069821 4040946
16579 4040946 3865658 3573265 3674426 3726945 3309941 3674114 3442192 3014877 3702003 3021085
16569 3021085 3229684 3341926 3160627 2940379 2999405 3310799 3296777 3205282 3011046 2989643
16559 2989643 3033030 2880255 2776405 2640946 2581625 2921873 2989326 2856801 2441100 2545557
16549 2545557 2601439 2462864 2181265 2530907 2403114 2576224 2483210 2353855 2367943 2378818
16539B378818l51464J50313J01344j46361r0011N9463K400R0154K372o5586j11216
16528B020226l72585N97896j61006o1086k04551L12885L1638j21830J25115n20822
16518A645880J59962Q0349j14600j3757J23660q5166j62506K63785m64391K28250
16508A661466P4318k07557L01915k11994n771M8455P755j88399J81419J69278
16498A830885M3197H63826N81233L2503j19618j2008k0317K25757k17489l5497
16488A298390R063K56809k61165j71260J90779o5169k094p3594K09539j25243
16478A266055p2427k57762K56372q3983k05623o6227O48469l26871j25083j1407
16468A021513J67082K11437M7398m94923Q6208R5293J38038m09530N13102k02802
$$ plain form
16539 2378818 2027354 2177667 2279011 2132650 2042639 2102102 2104502 2194656 2197028 2131442 2020226
16528 2020226 1647641 2245537 2084531 2023445 1818894 2131779 2163417 2041587 2166702 1645880
16518 1645880 1805842 1886191 1771591 1757834 1881494 1796328 1633822 1897607 1433216 1661466
16508 1661466 1735784 1528227 1830142 1618148 1612377 1660832 1668587 1480188 1661607 1830885
16498 1830885 1874082 863826 1445059 1477562 1357944 1345936 1325619 1551376 1333887 1298390
16488 1298390 1307453 1564262 1303097 1131837 1322616 1257447 1255353 1181759 1391298 1266055
16478 1266055 1193628 935866 1192238 1108255 902632 836405 1484874 1158003 1032920 1021513
16468 1021513 1188595 1400032 1447430 952507 1038715 1134008 1272046 862516 1375618 1172816
16458A172816K52899n59351L63985l445j61443m7962J18006m2271m09601K45119
16448I28752j35174L47622p7497k84321j59716M25534q8853j28610J12650j88800
16438G51587p8268l0524J75498m5320L12793M0491m12496M58131j9350j64684
16428I87858j87462j49483L92297p0445P6162j46260K5732k55614J87691J70329
16418A030805l11752M45006m13448l2398k31884j02996K43503O14538m86473j83052
16408E71849J66037j86316L27411j54308J10637m8318J6762l24870p9269L21121
16398G20736L180L97384k34684j95669K91154D34889K64496J53800l42075n379
16388E05731K02673B69497N17944j892k92441k02596N99400l50220k62394J05068
$$ plain form
16458 1172816 1425715 866364 1230349 1226904 1065461 1017499 1135505 1093234 683633 928752
16448 928752 793578 1141200 1063703 779382 619666 1045200 956347 827737 940387 751587
16438 751587 673319 642795 818293 772973 1085766 1126257 713761 1171892 1152542 987858
16428 987858 800396 650913 1043210 972765 1048927 902667 928399 672785 860476 1030805
16418 1030805 719053 1164059 750611 718213 486329 383333 626836 1241374 754901 571849
16408 571849 737886 551570 878981 724673 835310 786992 803754 478884 399615 720736
16398 720736 723916 1121300 886616 690947 982101 434889 699385 853185 511110 505731
16388 505731 708404 269497 787441 785549 493108 290512 889912 539692 277298 382366
16378C82366O71373E14031B25478M40203k41936J21706j51189m8713M616J15172
16368D65337J75695k45112K79428j11881j69421J34747j27081A07178N10432l07107
16358C10503M70095j7887J21418j52832k83397L06672D5779K03645L27656J74240
16348G51320B07507M91762k39986j04205O8923a54524D25000j56993K84848B03889
16337C61655J00516l7786j03552J52074K67457l00288G9063N95107K50374C07200
16326E53435j11170J02663c0206D92499k03146O3956K4732J86455r6954o9110
16316C98432O6586q838N5765M4023j93852J99049L9986q1275m658A72365K00910
16305C73275o0237L7993b2051F1406J11504L93627a0263D18368r5162J71154C3724
$$ plain form
16378 382366 1053739 514031 225478 665681 423745 545451 394262 345549 350165 465337
16368 465337 641032 395920 675348 563467 394046 528793 401712 107178 617610 310503
16358 310503 780598 762711 884129 731297 447900 754572 45779 249424 577080 751320
16348 751320 207507 699269 459283 355078 424001 -154524 425000 268007 552855 203889
16337 361655 462171 424385 320833 472907 740364 440076 79063 674170 924544 307200
16326 553435 442265 544928 -30206 492499 289353 353309 378041 564496 467542 398432
16316 398432 465018 456180 511945 555968 362116 561165 601151 519876 515218 172365 373275
16305 373275 313038 351031 -22051 61406 172910 566537 -10263 418368 323206 494360 33724
16293C27615P7899r052M0809r7474A41059J28294m3987J89887O3656B27052o9682
16282A57370m7866J10544K15434k11489r848R8114J95187G2124J33920n7824M5540
16271A93760O8825B6876p240M41247A78494A2932K82674j16360J12743p3419J04296
16260C22866K3272j41537P5037D52L9312K36814M5944J02374p7935O0953d1820
16248A10559b76072E72263o2701B28112C9080P2850B7092K09074o7251b4112E35916
16236A03723N3630o9445A2198J43596J91913a37591D80707j01013N4417j58431
16226B75680j30482A7286K83445p2865P4995d7947B33116d6283C00788C7613a23518
16214E18612j13948A28708J16553K983A6590J32051K11672j60178D5839K30115
$$ plain form
16293 327615 405514 396462 437271 339797 141059 269353 225366 415253 478909 227052 157370
16282 157370 109504 220048 435482 223993 214145 312259 507446 72124 206044 148220 193760
16271 193760 262585 26876 19636 460883 178494 12932 295606 179246 291989 218570 322866
16260 322866 346138 204601 279638 452 39764 276578 322522 424896 346961 407914 -41820
16248 110559 -276072 572263 509562 228112 39080 111930 27092 236166 168915 -24112 535916
16236 103723 157353 87908 12198 155794 347707 -137591 480707 379694 434111 275680
16226 275680 145198 17286 300731 227866 302861 -47947 233116 -46283 300788 37613 -123518
16214 518612 404664 128708 245261 248244 16590 148641 360313 200135 45839 275954
16204B75954d0294A83736l3569N5695J63992H5304J84910c0550B98938i189B12429
16192B47230J79553H6946J01314F9681A2675K41534A271i5388D97234F0431N962
16181F6393K40708j7126A41948K15287j37801g6769c3814j3351l6503k17603d1593
16169F8776Q7337m7181J93599E4883J97059J98802A72259J09802b3956E38697
16158a4796C30555j10488G4038K80936A29566l8675A2999J75508K5045N2233J35783
16147D01568j67904A00629K24919e9290j4281K0517C1227a91199j50833b4970
16136a12268B42957q6385M5135R891p8287c8214e495p0786A52506K9207g3341
16124D48242k04823K190b49991A36750m8452f2606K5552B72331B7435J8982b02751
$$ plain form
16204 275954 -40294 183736 150167 205862 369854 85304 270214 -30550 298938 -9189 212429
16192 247230 426783 86946 188260 69681 12675 254209 1271 -95388 497234 60431 66393
16181 66393 307101 289975 141948 357235 219434 -76769 -33814 -47165 -83668 -301271 -41593
16169 68776 156113 108932 302531 54883 251942 450744 172259 282061 -23956 538697
16158 -14796 330555 220067 74038 354974 129566 90891 12999 188507 213552 265785 401568
16147 401568 233664 100629 325548 -59290 -73571 -53054 31227 -191199 -342032 -24970
16136 -112268 242957 156572 201707 211598 133311 -38214 -5495 -76281 152506 181713 -73341
16124 448242 243419 245609 -249991 136750 88298 -62606 -37054 272331 27435 46417 -202751
16112B6441a29201F2432M8739R5548g5062c7147F8702f9510J384H546a32659j09121
16100b41780J03012D3155J78641D4543J23497d0488k38436d3047G6032J253q658
16089F8627Q1611J34812M3804q0766o5427a01692b751p355A82575q0783B2733
16077F6818a39155F8105M9541a41517c9342A80131g1000d243k22980A20983J44299
16066B65282g2780J6457j08485k0998b6964A3329f9864A13021A3242L98837F1021
16054A38259J53939J22863A49165b4918A67181Q1550B3834d27606a42714j76394
16044c19108A53941K62563D6895h1859D8404P9127J00302a66232B4642a6053m1740
16033e7793o779D5396h0302A60119K9589d2268J4252j66551A70861K2202a05571
$$ plain form
16112 26441 -129201 62432 111171 206719 -75062 -37147 68702 -69510 -68126 8546 -132659 -241780
16100 -241780 -138768 43155 221796 44543 168040 -40488 -278924 -43047 76032 77285 68627
16089 68627 150238 285050 328854 248088 182661 -101692 -2751 -10106 182575 101792 22733
16077 66818 -139155 68105 117646 -141517 -39342 180131 -71000 -4243 -227223 120983 265282
16066 265282 -72780 -56323 -164808 -185806 -26964 13329 -69864 113021 13242 412079 61021
16054 138259 292198 415061 149165 -24918 167181 248731 23834 -427606 -142714 -319108
16044 -319108 153941 416504 46895 -81859 48404 127531 227833 -166232 24642 -16053 -57793
16033 -57793 -64572 45396 -80302 160119 189708 -42268 -28016 -194567 170861 193063 -105571
16021a6964b856A55914a23058j0513C71220A00647a8430m46112B9387a27165j8559
16010a45724c9226k62227E7994e7128j9115B61209c2003k8113b9602k10372B07479
15998C16894d3085E73475b12161H9930J63150r559B1204b92654G4641J87907j26162
15987A36386a95096F58802j32773M16772L03472k64303q6856D00606F8717M1533
15977A10250M7706G82i4278A6671J29202g1130F0587f5803C39749A48903a30114
15965b47362j08289J58305b1271k1903k5001C4626N4753i0126N083A78438a933
15953H0394f7281B37362E2548c62537P3138k59329a48576j6880N1648a855C1880
15941C7083a42118G8243c02113j404g2498B18734a0556j97892m2286B03169f7406
$$ plain form
16021 -16964 -2856 155914 -123058 -133571 371220 100647 -18430 -464542 29387 -127165 -145724
16010 -145724 -39226 -301453 57994 -57128 -76243 261209 -32003 -60116 -29602 -239974 207479
15998 316894 -43085 573475 -212161 89930 253080 243521 21204 -292654 74641 262548 136386
15987 136386 -195096 658802 526029 942801 1246273 981970 895114 400606 68717 110250
15977 110250 157956 782 -94278 16671 145873 -71130 60587 -65803 339749 148903 -130114
15965 -247362 -355651 -197346 -21271 -43174 -68175 34626 89379 -90126 -85043 178438 -1933
15953 80394 -67281 237362 52548 -362537 -289399 -548728 -148576 -165456 -113808 -1855 31880
15941 37083 -142118 78243 -302113 -303517 -72498 218734 -10556 -208448 -250734 203169 -67406
15929d87858D5928a51853A24604c18078a34419f6886k95777d7574D9780d7287
15918B83928c59301B4923c4542q3744L6128A83890d3963j25154f7960j82320L5111
15907b15169i7927a9019j4423A61522B4693J5884i5517F5590L9344O3134J20206
15896B88274b18918M8712I2762N7139d4564a6524A362a91149A9107J11865J78430
15885C09402H6968K6718J19189h2941j53322a00760B15667a55010K4640k6633
15875a57003J3122E4999P3311a32243D4400a27917l6456a3402A20429J12622l2491
15864B00560I2134j9880a26570h977k16582A6070a07802A69157h2984j33606d5185
15852B16027a98900O6788A88639a49733A09677J95618H5932g8113F3589K51026
$$ plain form
15929 -487858 45928 -151853 124604 -318078 -134419 -66886 -362663 -47574 49780 -47287
15918 283928 -359301 24923 -34542 -118286 -82158 183890 -43963 -169117 -67960 -250280 -215169
15907 -215169 -97927 -19019 -33442 161522 24693 40577 -95517 65590 104934 168068 288274
15896 288274 -218918 -170206 92762 149901 -44564 -16524 1362 -191149 19107 130972 309402
15885 309402 86968 113686 232875 -82941 -236263 -100760 215667 -155010 -130370 -157003
15875 -157003 -143881 54999 128310 -132243 44400 -127917 -164373 -13402 120429 233051 200560
15864 200560 92134 72254 -126570 -8977 -225559 16070 -107802 169157 -82984 -216590 -45185
15852 216027 -198900 -132112 188639 -149733 109677 305295 85932 -78113 63589 314615
15842C14615b24480C54679a46349F9207J60531d6760A36688c59134a08310A40858
15831i1843A87440F7625O4813m3738L1956a52195k02696B5121b36395N8554A5652
15819A26719K448a38031B22869D8715c63212B8722N9096i2533l8117k0113j67645
15808c18408B52728M1812j05330o1003J85018a14678B69970f1415p4623B74224
15797C16849a86807m0171J02071D5812Q578a40443O5647p1128f331H1850J42871
15786B24721p6600k6514n7374e7662A7805P8981J45771b6807C9857b06775A05397
15774B04670q9706d42555J46841b7215j9512J5308B36932B8929b52993l9234c0557
15762B62424b13937c3213k88689A1788J21911N6244D5863J39397b4194j84044
$$ plain form
15842 314615 -224480 354679 -146349 69207 229738 -46760 136688 -359134 -108310 140858
15831 -91843 187440 67625 132438 88700 120656 -152195 -354891 25121 -236395 -177841 15652
15819 126719 129167 -138031 222869 48715 -363212 28722 87818 -92533 -130650 -150763 -318408
15808 -318408 252728 294540 189210 128207 313225 -114678 269970 -61415 -136038 274224
15797 316849 -186807 -226978 -124907 45812 54390 -140443 -74796 -145924 -6331 81850 224721
15786 224721 148121 121607 64233 -57662 17805 96786 242557 -26807 39857 -206775 105397
15774 204670 114964 -442555 -295714 -27215 -46727 -31419 236932 28929 -252993 -292227 -30557
15762 262424 -213937 -33213 -321902 11788 133699 189943 45863 185260 -24194 -208238
15752b08238A10088J2458h2854r8909e5368A90430o3229e5216k02707B51266a28898
15740b93560B0203b97834N6004D6952P1130A2642f7057A0590c29236J5553a38126
15728F2290b37547B14031A03253a36338M6323C02499C0319R6726b71627b9256
15717b34161A00435J91489I5543B6755a26482c6541F5986L9967H031J70483G3508
15705a42438o271B26779j07942J90001a51360d6993m40673D42016c93115A0290
15694a14339m9305J1150E5962b4034A53944i0359A7973J17527K22831D1019J52595
15683A93614c38702J31695g0833B72695e3150A13490N2476C4455b25985h5855
15672f287r5638A89079a42944b5376A65831i0046C26949A17054J21290b74307
$$ plain form
15752 -208238 110088 122546 -82854 -181763 -55368 190430 127201 -55216 -257923 251266 -128898
15740 -293560 20203 -297834 -241830 46952 118082 12642 -67057 10590 -329236 -313683 -138126
15728 62290 -237547 214031 103253 -136338 -90015 302499 30319 127045 -271627 -29256
15717 -234161 100435 291924 95543 26755 -126482 -36541 65986 105953 8031 178514 73508
15705 -142438 -148709 226779 118837 308838 -151360 -46993 -487666 442016 -393115 10290
15694 -114339 -163644 -152494 55962 -24034 153944 -90359 17973 135500 358331 41019 193614
15683 193614 -338702 -207007 -70833 272695 -53150 113490 165966 34455 -225985 -85855
15672 -6287 -101925 189079 -142944 -25376 165831 -90046 326949 117054 238344 -274307
15661b17586O7009g4814m1214a9488j52152B20437g2681k5850A40255B1727c53308
15649B0071g1134B11238h1798a8794j3318j89092A22275J14382d38981B10966
15638B01278D7126b62519k12802b21854F8677J9371D1186A3784N2968a64624D2750
15626h2369j84547D6148M742Q8178E6309M45844A07937a43489F71b95833a7279
15614b09529C20538e9120q7850j49565a32708c0954o0512B15735H3256Q9145J0264
15603A82665H2751a38935m0408A96752G6827c3888C3549a86566j08323I6590i5215
15591a75875E5886K25834j11209b43080j4255B06810E6282a38304o1665Q9251
15581a10718k54693I3954Q1317N7611B8277c3806j88589D6914J75420i5600m7876
$$ plain form
15661 -217586 -150577 -74814 -116028 -19488 -171640 220437 -72681 -98531 140255 21727 -353308
15649 20071 -71134 211238 -81798 -18794 -32112 -221204 122275 236657 -438981 210966
15638 201278 47126 -262519 -475321 -221854 68677 88048 41186 13784 66752 -164624 42750
15626 -82369 -266916 46148 50890 139068 56309 502153 107937 -143489 671 -295833 -17279
15614 -209529 320538 -59120 -146970 -296535 -132708 -30954 -91466 215735 83256 172401 182665
15603 182665 82751 -138935 -179343 196752 76827 -33888 33549 -186566 -294889 96590 -95215
15591 -175875 55886 281720 170511 -243080 -257335 206810 56282 -138304 -199969 -110718
15581 -110718 -365411 93954 175271 232882 28277 -33806 -222395 46914 222334 -95600 -143476
15570a43476c488r4827l8771k31464Q1413C41368b8974A49399o8712N7482J12592
15559B50761F2974h3776k59275B08364E6593P7987P2946H2398J64307F1712a92320
15547A54624G2929a01591A164o8R8951d5963C496a59905A65833R3150d674I5145
15534a380k59940A72663m1269a92671c5461j02569G5643A5475a85150C175P4236
15523G7411k5633J58541k8719P1811A00167B9760O6556A2837K11591c7571C33888
15511C99268d2458C9145f6783A76675K65099A91249p4244Q3506c32729f2217B10789
15499a43647N2455k12483B17039b2956l0466J4172k7989B65387h7379A41360l8648
15488A02712a67360E8116c7341l24793B42877h7620I5727e0845A48149E0098a66290
$$ plain form
15570 -143476 -3488 -98315 -137086 -368550 -287137 341368 -28974 149399 80687 138169 250761
15559 250761 62974 -83776 -343051 208364 56593 134580 207526 82398 246705 61712 -192320
15547 154624 72929 -101591 1164 1096 100047 -45963 3496 -159905 165833 258983 -4674 95145
15534 -1380 -261320 172663 131394 -192671 -35461 -138030 75643 15475 -185150 3175 77411
15523 77411 51778 210319 181600 253411 100167 29760 96316 12837 224428 -37571 333888
15511 399268 -42458 39145 -66783 176675 441774 191249 117005 200511 -332729 -62217 210789
15499 -143647 -91192 -303675 217039 -22956 -53422 -39250 -67239 265387 -87379 141360 102712
15488 102712 -167360 58116 -37341 -362134 242877 -87620 95727 -50845 148149 50098 -166290
15476D5257A597J51571o8278L25841Q0089j57018l9378P2478b37812A59017L7717
15465A96734I286c3211j44795P9596I1512f3988A78918G9821K0226A6789L4992
15454E1781i059A20901N3085k1563i2428l2592K048a7121F0829L74765A89027
15442B51176e7275E07350N48726j19997l18018k26857I8179j5506L0068C0604
15431B5556Q4984a9225l5262I2522j6014C7993A5687a8963p2039C57899a9425
15419a00092A04543k2639K67843b4568A08573a00595D7532N5128c05706A47584
15408a44509L6656a8585k27494A51745a87659j11393E4378g5718r1011A04256
15397c4701I5775D3043a17980A79989a95117j8623A14493j595L00868B7862K74106
$$ plain form
15476 45257 1597 153168 84890 410731 490820 333802 294424 366902 -237812 159017 196734
15465 196734 9286 -33211 -178006 -98410 91512 -63988 178918 79821 100047 16789 51781
15454 51781 -9059 120901 173986 152423 -92428 -125020 -122972 -17121 60829 435594 189027
15442 251176 -57275 507350 1056076 936079 618061 391204 98179 82673 112741 30604
15431 25556 110540 -19225 -54487 92522 76508 37993 15687 -18963 -91002 357899 -19425
15419 -100092 104543 81904 349747 -24568 108573 -100595 47532 102660 -305706 147584
15408 -144509 -107853 -18585 -246079 151745 -187659 -299052 54378 -75718 -166729 104256
15397 -34701 95775 43043 -117980 179989 -195117 -213740 114493 112898 413766 27862 301968
15386C01968a46930F18989A39293h8899A80440a5361j47597E0163J08681b88843
15375C79293e3524B70206p2094g7410C107J96531l0968R2758H0246A7687K1767
15364C9454L68179d636C1113K86844c64135B67678q1921J67868A56161K34082
15354C90243F7791a5782j45648B00022H5064j304a74090B8225J29096G7684K46184
15343C23868O5897I3382L57480j71088d6523A52067f5987I9263b7416p596j0229
15332d5241o1757F0115O8455k8362J50916H1524O1617N7056J05458c6773B54784
15320B21280b7574A35017f8358r7248B73858j30838c208A12225D4212N9062J75932
15309B79206J21913j87674k5488Q41J00070H3171h5118a0538k1199A06462N1947
$$ plain form
15386 301968 -146930 618989 139293 -88899 180440 -15361 -162958 50163 158844 -288843
15375 379293 -53524 270206 198112 -77410 3107 199638 168670 261428 80246 17687 39454
15364 39454 407633 -4636 31113 317957 -364135 267678 185757 353625 156161 390243
15354 390243 67791 -15782 -161430 200022 85064 83760 -174090 28225 157321 77684 323868
15343 323868 389765 93382 450862 279774 -46523 152067 -65987 99263 -27416 -35012 -45241
15332 -45241 -106998 60115 128570 100208 251124 81524 143141 200197 305655 -36773 254784
15320 221280 -27574 135017 -68358 -165606 273858 143020 -3208 112225 44212 103274 279206
15309 279206 401119 213445 187957 188798 288868 83171 -85118 -10538 -31737 106462 158409
15298A58409E4581a34198B51160b21832A83933a5550A64451P5026d2597A96820
15287A00309L85912b01372f2048B19152A43L01661d3253K401j26045I0321N7326
15276A47647a0304B82483i4336b6834C14861a7478F2286a48028n6529o6097b1309
15264B03908K36428A30360J62036G3448h6112A01595a03107H3424N8460J2416
15254A54300O70G1841b6506m1041A30169a71985D22590d4936B25827a56044E8115
15242A44685P89612K75655J071991j005754Q09830o39246F32301j45402C2550
15232D19407a63774E2584N456L68419F1943c18982B8315C835A867h6448A4071
15220B911K13600e360n9574A57371C9406a29198F5001a21475l08267E6019a69191
$$ plain form
15298 158409 54581 -134198 251160 -221832 183933 -15550 164451 239477 -42597 196820
15287 100309 486221 -201372 -62048 219152 143 301804 -43253 -40852 -166897 90321 147647
15276 147647 -10304 282483 -94336 -26834 314861 -17478 62286 -148028 -204557 -270654 -21309
15264 203908 440336 130360 292396 73448 -86112 101595 -103107 83424 141884 154300
15254 154300 154970 71841 -26506 -67547 130169 -171985 422590 -44936 225827 -156044 58115
15242 144685 934297 1209952 2281943 1276189 2086019 1446773 632301 486899 32550
15232 419407 -163774 52584 58040 426459 61943 -318982 28315 3835 1867 -86448 14071
15220 2911 216511 -5360 -64934 157371 39406 -129198 65001 -121475 -429742 56019 -169191
15208b81198i7715L5284j64502a01650B29679J3221j04516A395a60697H9935b45684
15196B73273j03618c33276c1993A12733g2520a6710p3136B05064J40093e3820
15185C32116A13013a39762j7966C10748j24589L5151d3600l0326A70337a3968
15174G2786K6016J19397C0191N25504B58774a23793p3734C60985d3472j26399
15164a69871E3281G178b83423G7290R7016a0520J744B9324J64078a87086B68663
15152C6558a50145B019h2259q0694B803e03319a15655H2412L06383I0496b39044
15140B78737i5832C93577a33107A57857G1778K38709j05595L3071h8925A85364
15129e1817A05995q259J65777H9113k1830K37196b38243I973K00737r215J77743
$$ plain form
15208 -281198 -97715 -62431 -226933 -101650 229679 242900 138384 1395 -160697 89935 -245684
15196 273273 169655 -333276 -31993 112733 -72520 -16710 -89846 205064 345157 -53820
15185 332116 113013 -139762 -157728 310748 186159 221310 -43600 -73926 170337 -13968
15174 72786 98802 218199 30191 555695 258774 -123793 -197527 360985 -43472 -169871
15164 -169871 53281 7178 -283423 77290 174306 -10520 -8776 29324 193402 -187086 268663
15152 36558 -150145 2019 -82259 -162953 2803 -503319 -115655 82412 388795 90496 -239044
15140 278737 -95832 393577 -133107 157857 71778 310487 204892 237963 -88925 185364
15129 -51817 105995 97736 263513 89113 67283 304479 -238243 9973 210710 201495 379238
15118C79238q4787N81961C99417j80304a44612D08249b0303A98501R0622q8264
15108B00859J9105b66543B76992L56597A14798c046A11976R0453A3830d4017D53311
15096G7996d8202G8880c6105r7037K5225B79010q6675B5310J63600a23495c6295
15084B34850M6377c3371A90699a2261C03604b53381D2404L6916J33366M8172R2616
15073C53474F4411b00705K9184B18383a14600B85541J01627H0253g5359B604L84580
15062C87184F4927i5236L86B82985a1463C12501A0415M87378j98331J18961A64797
15050C38707C1418O3517J1069K02031J01919n8683d33B43360Q0569J18355A78739
15038D00205A21186D3523L82539c2956B69386J20798H268K37359P0059K53583
$$ plain form
15118 379238 294451 876412 399417 219113 -144612 408249 -20303 198501 289123 200859
15108 200859 219964 -266543 276992 633589 114798 -3046 111976 202429 13830 -44017 453311
15096 77996 -48202 78880 -36105 -133142 -107917 279010 192335 25310 188910 -123495 -36295
15084 234850 281227 -33371 190699 -12261 303604 -253381 42404 79320 212686 260858 353474
15073 353474 64411 -200705 -171521 218383 -114600 285541 387168 80253 -75359 2604 387184
15062 387184 64927 -95236 -94850 282985 -11463 312501 10415 497793 299462 418423 164797
15050 338707 31418 94935 106004 308035 409954 351271 -433 243360 323929 442284 178739
15038 400205 121186 43523 426062 -32956 269386 390184 8268 245627 315686 569269
15028E69269L0325j08514K05441P7452A70052k1831K29573j55921L51753B75053
15017B95527p3175Q3570K75739K54508A52765J77129Q0115r8956A08608J53347
15007B61955n0009R4631K471q9326Q5170j6650J49988k03720L3011k0376L8177
14996B85322P062q092R2405o2660K19975r0730k12287m6646L37783p8888G7358
14984C59102k7002L59166m3084Q7773L6667K56472l91725B75726J55873j45303
14974B86296L65803B46609L25988L11747k86232k33737K82744k11310j89695F4812
14963A18412L34470k06429K4426J23102J43352A53452L93231A4145K45294J45758
14953D05197A67666O9467K35432A66243J94502J65104E9467J56358K84233j45833
$$ plain form
15028 569269 599594 491080 696521 773973 170052 148221 377794 221873 573626 275053
15017 295527 222352 305922 581661 836169 152765 329894 410009 311053 108608 261955
15007 261955 211946 306577 309048 219722 304892 288242 438230 234510 267521 247145 285322
14996 285322 292384 284292 376697 314037 534012 443282 230995 184349 522132 443244 77358
14984 359102 332100 691266 648182 735955 772622 1029094 637369 275726 431599 286296
14974 286296 652099 246609 572597 884344 598112 364375 647119 435809 246114 64812
14963 118412 452882 246453 270879 393981 537333 153452 546683 14145 259439 405197
14953 405197 167666 237133 472565 166243 360745 525849 59467 215825 500058 354225
14943C54225q0344J06534J9324K51633l9393k38822A51168J10912L25114B23522
14932E82949k10738J05493L50667J30417C66012N95659K15215L46504l56582K49349
14922A416157l5813j24527q5549L8055j50586M09866K03434N57420m20723m42226
14912A365508K96438n85385j41258l96742p7602K19259B30003I2283R2206K45297
14902D29786A60740R5764k4350J13297o064A46921L08809K41304d4785A63029
14891D30251j18054K7880J32055N8582m5936j04858j30693K80382L05787J26428
14881I61824D30391J96198j08220M30135C71321P0705L40394k14961j2127B39092
14870C23022J55260J49569j59822A30365L96357R348K24698k75161K96122k55965
$$ plain form
14943 354225 273881 380415 399739 651372 611979 373157 151168 262080 587194 223522
14932 582949 372211 477704 828371 958788 366012 961671 1176886 1523390 1166808 1416157
14922 1416157 1380344 1255817 1170268 1208323 1057737 1467603 1671037 2228457 1807734 1365508
14912 1365508 1661946 1076561 935303 538561 460959 680218 230003 92283 184489 429786
14902 429786 160740 256504 232154 345451 339387 146921 455730 697034 -44785 163029
14891 430251 312197 340077 472132 530714 484778 379920 249227 529609 835396 961824
14881 961824 430391 626589 518369 948504 371321 442026 782420 567459 555332 239092
14870 323022 478282 627851 468029 130365 526722 536070 760768 485607 781729 525764
14860E25764j47235L038Q1177O0146n1596B33676J27124j35042J37164L23151
14850F86073j08003J0790l4131j71087l3714K22747K6321L35691j64900L38083
14840A107870j81164L82466k37840l6986k39363j82652j01587q0221P43P3779
14830E05045n9752l5683j14124K35552J73222k32781K04281J59875B51649L82908
14820F34557j51961N8388J6101J41882A73365M30829K1888j30135n5972L13095
14810G53070k86263j34596k7412N31650m2586C89662N65150J78946m64022R6718
14800G66454C76495J64130R3714k38240j33949J40367L966J70540K26780l36648
14790D67155P3514J28733B68548L38008j60516N3999J51577k20990L68604l47661
$$ plain form
14860 525764 378529 381567 462744 522890 471294 233676 360800 225758 362922 686073
14850 686073 578070 588860 554729 383642 349928 572675 598996 934687 769787 1107870
14840 1107870 926706 1309172 1071332 1034346 794983 612331 510744 430523 431266 505045
14830 505045 445293 409610 295486 531038 704260 471479 675760 835635 251649 634557
14820 634557 482596 540984 557085 698967 173365 604194 626082 495947 439975 753070
14810 753070 466807 332211 304799 836449 793863 389662 954812 1133758 669736 766454
14800 766454 376495 540625 634339 396099 262150 402517 406483 577023 803803 467155
14790 467155 540669 669402 268548 606556 446040 500039 651616 430626 799230 451569
14780D51569N833M06339M342l00477L32962P2117j21520L23193l82498l63885
14770D27975J08269J09142k64851K45614B82752L91393l05703K31646j06569m2786
14760D50733L3963l7682j7849K02216J14330o6441j65603O0525J25681C13069
14749F40271j45700L79861l84165A41693P39107k23932j04822L31660A71729N88181
14739G59910k25770o7050Q2769j89207L95754k28699P5377J39687J80644k50909
14729F72506K96013o7263M35304M8889L53156k97886m71337N6136K637J5100l77484
14718F65771R6911Q6537B65089N69313l65535k165K99469o6256P5525J5898n5143
14707G36195J63870Q0176j35984q3871O4052M15175K75387M28789k74625l49054
$$ plain form
14780 451569 457402 863741 868083 567606 900568 972685 851165 1174358 791860 427975
14770 427975 536244 645386 380535 626149 282752 674145 368442 600088 493519 450733
14760 450733 484696 447014 429165 631381 745711 679270 513667 574192 699873 313069
14749 640271 494571 874432 490267 141693 880800 656868 552046 883706 171729 759910
14739 759910 534140 467090 549859 360652 756406 527707 603084 742771 923415 672506
14729 672506 968519 901256 1336560 1385449 1738605 1440719 969382 1025518 1028155 1043255 665771
14718 665771 762682 849219 265089 834402 468867 466702 766171 699915 775440 791338 736195
14707 736195 900065 980241 844257 760386 824438 1239613 1515000 1943789 1669164 1320110
14697A320110K80711o11848j6351M6509l53351J47878j00749K14506k20870j08928
14687E97617K49732k18444M791M49406k55529j24020K15016j96740L18857j60567
14677H80119l9289o647O9202k39694J52506J56561m7155k15511L7141k26115J27157
14666F48275J23320r230Q7565L0287l20026L51684L83214k69029O9280j60919
14656I34421R2401K76522n372k32346O8722J4911p6907J12013J20754l6520l42603
14645I25996M20291k04582J12960k39082L10026j77190l14375K17570K08289l60894
14635H99009K14054k86531R4270k45356N22151J65229k97449m13429M62263K35366
14625A349577l06403K9630M3653Q8290j65612K57515l02372J2972J98957R520
$$ plain form
14697 1320110 1600821 988973 972622 1019131 665780 813658 712909 927415 706545 597617
14687 597617 847349 628905 633696 1083102 827573 703553 918569 721829 1040686 880119
14677 880119 840830 834183 903385 663691 816197 972758 925603 710092 747233 521118 648275
14666 648275 771595 762365 849930 880217 560191 911875 1295089 1026060 1095340 934421
14656 934421 1026822 1303344 1297972 1065626 1134348 1149259 1072352 1184365 1305119 1268599 925996
14645 925996 1346287 1141705 1254665 1015583 1325609 1148419 834044 1051614 1259903 899009
14635 899009 1113063 826532 920802 675446 1197597 1362826 1065377 651948 1114211 1349577
14625 1349577 1043174 1072804 1116457 1204747 1039135 1296650 994278 1007250 1206207 1215727
14615A215727J25331k48357J75557K13817m47435J79999K53968j92330J74590
14606A450867k27745J75719J81810m18653K32864l20952j22870M07919j56812
14597A202147O9191J54248Q7153k34073J92875K01777n3971j10338j32268L08996
14587A685737K45871k39552p0259R4100o5426o5124R7926l2854L8572k81294K00975
14576A608672o9166J64955K55160j89532K41988j02871k3802J62299l8229j25847
14566A883627M63928m88113L99158P2099k48506J84667j23695L87583j20164Q9240
14556B499824J83141l45339N61156N9228r0348R14214M11472J174804K994897
14547H363049P591295J4589618K0000796k3557931I662758D179080j249337n38540
$$ plain form
14615 1215727 1341058 1092701 1268258 1482075 1034640 1214639 1468607 1276277 1450867
14606 1450867 1223122 1398841 1580651 1161998 1394862 1073910 951040 1358959 1202147
14597 1202147 1271338 1425586 1512739 1278666 1471541 1673318 1619347 1509009 1376741 1685737
14587 1685737 1931608 1692056 1621797 1715897 1650471 1585347 1683273 1650419 1688991 1407697 1608672
14576 1608672 1539506 1704461 1959621 1770089 2012077 1909206 1885404 2047703 2009474 1883627
14566 1883627 2347555 1859442 2258600 2330699 2082193 2266860 2143165 2530748 2410584 2499824
14556 2499824 2682965 2337626 2898782 2958010 2867662 3781876 4193348 5368152 8363049
14547 8363049 15954344 30543962 50544758 26986827 9662758 4179080 2929743 2391203
14539B391203n57847O49146Q10846K095255j500679j731650m55668L60105k40770
14530A819941j0253j07769L61399j83386L2264J03237R6887L9160r1508j34163
14520A925809K52500q0087r9798J57528j05980K22559N7669J39378q9363J21230
14510B501445j7843k9209j4105P6553K89381m3168k44509J19488M34207n65199
14500B507041J99871J4578O6361j27489L92855m12612m2186M06025m01276N69430
14490C172598k59807K81585n8073o4078J43420j75402P5798k5675L83803j53013
14480C321156Q2548k3470O4915J23866J7452j13783M2976J82237j19632L05986
14470C884251j829k24411l3654j65588K74486L89876j07316J07979p1803L50055
$$ plain form
14539 2391203 1833356 2482502 3293348 5388603 3887924 2156274 1700606 2060711 1819941
14530 1819941 1809688 1701919 2063318 1879932 1912196 2015433 2112320 2151480 2059972 1925809
14520 1925809 2178309 2098222 1998424 2155952 2049972 2272531 2330200 2469578 2380215 2501445
14510 2501445 2483602 2454393 2440288 2516841 2806222 2763054 2518545 2638033 3072240 2507041
14500 2507041 2706912 2721490 2787851 2660362 3053217 2640605 2598419 3004444 2603168 3172598
14490 3172598 2912791 3194376 3136303 3072225 3215645 3040243 3116041 3090366 3474169 3321156
14480 3321156 3403704 3380234 3445149 3569015 3586467 3472684 3515660 3697897 3578265 3884251
14470 3884251 3882422 3658011 3624357 3458769 3733255 4123131 4015815 4123794 4051991 4402046
14460D402046l20057K29207M8778j7153l13326M54187L16188l29270J19880J1883
14450D602363K33036k08546K46023L48809k18928K9860m2061L07988j46944k182
14440E149418J2948L79406l29282M16699L72911j58998k84912L52818k84035M23354
14430F050327M42001j88431J81682m65659K28945K36281j19377L83649K5677J47319
14420F922414J18732M17627K09127j44897K13223k54603L00039n15300M79173
14411G745535N20592j16081K70032N858M2252M18911l94244P65209k72667O02305
14401I587702l12956K01139P4527o0469O6424K46747M29597K25730m62457O94128
14391A0690112j6818J60491M66609K31641r5550J30548M28435j18288N44469J74006
$$ plain form
14460 4402046 4081989 4311196 4359974 4342821 4029495 4483682 4799870 4470600 4590480 4602363
14450 4602363 4835399 4626853 4872876 5221685 5002757 5032617 4990556 5298544 5151600 5149418
14440 5149418 5162366 5541772 5212490 5629189 6002100 5843102 5558190 5911008 5626973 6050327
14430 6050327 6492328 6303897 6485579 6019920 6248865 6485146 6365769 6749418 6775095 6922414
14420 6922414 7041146 7458773 7667900 7523003 7736226 7481623 7781662 7266362 7745535
14411 7745535 8266127 8150046 8420078 8425936 8468188 8887099 8492855 9258064 8985397 9587702
14401 9587702 9274746 9475885 9550412 9489943 9556367 9803114 10232711 10458441 9995984 10690112
14391 10690112 10673294 10833785 11300394 11532035 11436485 11567033 11995468 11877180 12421649 12595655
14381A2595655O3439J74398J170654l54779J0522J94405J30957J52941M53986
14372A4592178J43461O43291l414N27428N9766N33583J48775Q33613L25300O97354
14362A8501335N04451l68308N34501K33069P75154J77618K98401Q21610K60067
14353B1737898Q51258M15028L12554J207959K89655P43164N53621L53823R46653
14344B7411613M30329P73211R14613R40230R58081O80202Q34976Q79780J224438
14335C5047473J019963P94477J391516J627208O80652J545153J125991J432563
14327D4664996J555021J797472J279632J806305J867860J850416J894040K466361
14319E9182103J802120K199598K537079K352730K669238K712661K749311L162302
$$ plain form
14381 12595655 12659094 12833492 14004146 13649367 13659889 13854294 13985251 14138192 14592178
14372 14592178 14735639 15378930 15375516 15902944 15962710 16496293 16645068 17478681 17803981 18501335
14362 18501335 19005786 18637478 19171979 19405048 20180202 20357820 20656221 21477831 21737898
14353 21737898 22589156 23004184 23316738 24524697 24814352 25557516 26111137 26464960 27411613
14344 27411613 27841942 28615153 29529766 30469996 31428077 32108279 32943255 33823035 35047473
14335 35047473 36067436 36861913 38253429 39880637 40561289 42106442 43232433 44664996
14327 44664996 46220017 48017489 49297121 51103426 52971286 54821702 56715742 59182103
14319 59182103 60984223 63183821 65720900 68073630 70742868 73455529 76204840 79367142
14311G9367142L515419L263125L965435L934699M124822M340901M540209N149676
14303A12201428N529700N142203O127081O731936O578702P303290P641022Q530305
14295A65785667Q405180R852997R751607J0398700J1494388J1742021J2518686
14288B39949246J3511103J3745218J4541621J5194458J5777772J6073410J6768160
14281C45560988J6845219J6837309J6418237J5956598J5240355J4135543J2225426
14274D53219675J0341518P929153K622077k649737m117521o477j879591n249888
14266D60209209p840672j0374190j2058820j3674836j4808088j5220227j6492432
14259C69739944j7352700j7009900j6414704j6327411j5501595j5028422j4613048
$$ plain form
14311 79367142 82882561 86145686 90111121 94045820 98170642 102511543 107051752 112201428
14303 112201428 117731128 122873331 129000412 135732348 142311050 149614340 157255362 165785667
14295 165785667 174190847 184043844 193795451 204194151 215688539 227430560 239949246
14288 239949246 253460349 267205567 281747188 296941646 312719418 328792828 345560988
14281 345560988 362406207 379243516 395661753 411618351 426858706 440994249 453219675
14274 453219675 463561193 471490346 474112423 471462686 467345165 467338688 465459097 460209209
14266 460209209 452368537 441994347 429935527 416260691 401452603 386232376 369739944
14259 369739944 352387244 335377344 318962640 302635229 287133634 272105212 257492164
14252B57492164j3598103j2963274j2568201j1707196j1005335r250587q298936
14245A78100532r883849q147282p820933p867475p288595o271373o395635n460734
14237A18964656m946057n398242n196574m151210m552970l697821l746379l193971
14229H4081432l793814l061335l160598l018538k521178k588989k145561k491431
14221F1299988k230147k077609j485597k255755j591312j910946j907986r64695
14213D6875941p39077j797757j893324r17645j459559j010324o39410m82690j730888
14204C6205267j180955q70347j016129o49898n18345r86539q28720r44862j194908
14195B8014564m00636l46853n61364j068041n68593n98624m89701j074667l09606
$$ plain form
14252 257492164 243894061 230930787 218362586 206655390 195650055 186399468 178100532
14245 178100532 168216683 160069401 152248468 144380993 137092398 130821025 124425390 118964656
14237 118964656 114018599 108620357 103423783 99272573 94719603 91021782 87275403 84081432
14229 84081432 80287618 77226283 74065685 71047147 68525969 65936980 63791419 61299988
14221 61299988 59069841 56992232 55506635 53250880 51659568 49748622 47840636 46875941
14213 46875941 46136864 44339107 42445783 41528138 40068579 39058255 38418845 37936155 36205267
14204 36205267 35024312 34153965 33137836 32487938 31969593 30983054 30154334 29209472 28014564
14195 28014564 27613928 27267075 26705711 25637670 25069077 24470453 23980752 22906085 22596479
14186B2596479k44444m03341r31679j83361m29227o17357K9937j027397L56751
14177A9146361q66130m51791k67088l40745m31117l95296k99798M1000n84727
14168A5550669p6598n24137k5441m33621l59222k16770o7189k32638o95375k4769
14158A2894909r8820k29872n35042n3660J13057m87496n11280K33120j25646l11961
14148A0887309o21065K84857k68191J61942m94431J29977k65663k11543k91431
14139I311761q8934J7325k7406m93245J19569j41514k56141n2831p1348l57758
14129G959478R9798j39011K01260n01390j75923J02355k49562o9027j78223r0428
14119F959327L5745J68670m42286J51677l62242J57989k70682k8737M64654n82886
$$ plain form
14186 22596479 22352035 21948694 21017015 20833654 20404427 19787070 19817007 18789610 19146361
14177 19146361 18280231 17828440 17561352 17220607 16789490 16394194 16094396 16135396 15550669
14168 15550669 15474071 14949934 14924493 14490872 14131650 13914880 13847691 13615053 12919678 12894909
14158 12894909 12796089 12566217 12031175 11977515 12090572 11603076 11091796 11324916 11199270 10887309
14148 10887309 10266244 10551101 10282910 10444852 9950421 10080398 9814735 9603192 9311761
14139 9311761 9222827 9240152 9212746 8719501 8839070 8697556 8441415 8388584 8317236 7959478
14129 7959478 8059276 7920265 8121525 7620135 7444212 7546567 7297005 7227978 7049755 6959327
14119 6959327 6995072 7163742 6721456 6873133 6510891 6668880 6398198 6369461 6834115 6251229
14109F251229j03971k8139r0463k37523J20823j46319L6338k17175k70060o1139
14099E253601j02984q2752L48089k00695M413j1005k34628L6954J12002k64712
14089D858283J21943j10862l66285M7265K34608k86384O7418o8704k06330J99177
14079D490129k4605N813l46179n0071r777R5871q9015j67096k38086K01664J52746
14068D021394n28258L42183K90820m57367K11788n6726J80568J20128K08600m33140
14058C899990m04242k3960J68514k66478P5537K39253o36475L32446l2260o1025
14048C291300R9619l16969k84541J73635R5305J38244l58190N16843l75833l2199
14038B947214k85913M49400k91657j229J27768k55894L34228J1866m25377L66178
$$ plain form
14109 6251229 6147258 6119119 6028656 5791133 5911956 5765637 5801975 5584800 5314740 5253601
14099 5253601 5150617 5067865 5415954 5215259 5219672 5208667 4974039 5010993 5122995 4858283
14089 4858283 4980226 4869364 4503079 4550344 4784952 4498568 4565986 4497282 4290952 4490129
14079 4490129 4465524 4471337 4125158 4075087 4065310 4161181 4072166 3905070 3666984 3868648 4021394
14068 4021394 3493136 3835319 4126139 3668772 3880560 3823834 4004402 4124530 4333130 3899990
14058 3899990 3495748 3471788 3640302 3373824 3449361 3688614 3052139 3384585 3352325 3291300
14048 3291300 3390919 3073950 2789409 2963044 3058349 3196593 2838403 3355246 2979413 2947214
14038 2947214 2661301 3110701 2819044 2817815 2945583 2689689 3023917 3035783 2610406 2976584
14028B976584k35724j12335K70391l57356N286k77217P5751K33212k3032P3478
14018B629038j81752k97572K09912Q5242J3243l10211P8902j22020K96207l96378
14008B004611K77957l542q0162Q3209n7452j48262j04364M3168m19884M83527
13998B078806j3677k20253k25926J56623j5899R0451J36139k69662J8106N89656
13988B324364J567133N449333J3215097K4409792j1821802A5900996p554906k536577
13980E809513j054200r46618K9990p27835P058l38374K1218q7090J38770m20687
13970B431745j24916j0278j07159K14753l32840R1527k57026N5819P4746j99117
13960A837254M5889M9587L0219Q6641k75394N4663J23164l86983M38419k65805
$$ plain form
14028 2976584 2740860 2628525 2898916 2541560 2546846 2269629 2345380 2578592 2555560 2629038
14018 2629038 2447286 2149714 2359626 2444868 2458111 2147900 2226802 2104782 2400989 2004611
14008 2004611 2282568 2279026 2198864 2282073 2224621 2076359 1971995 2015163 1595279 2078806
13998 2078806 2065129 1844876 1618950 1775573 1759674 1850125 1986264 1716602 1734708 2324364
13988 2324364 3891497 9340830 22555927 46965719 35143917 15900996 8346090 5809513
13980 5809513 4755313 3808695 3838685 3110850 3117908 2779534 2800752 2713662 2852432 2431745
13970 2431745 2306829 2296551 2189392 2404145 2071305 2162832 1905806 1961625 2036371 1837254
13960 1837254 1883143 1932730 1962949 2049590 1774196 1828859 1952023 1565040 2003459 1737654
13950A737654J8800O4489j94942k48477O34726j48685j69812k69186J14179J50494
13940A689240j59139K11311j59971j04016j81468N99207m00233M4473J0723j33162
13930A416965J71780O6649m15797L01117q1933M2040k58334k4564J81014k54995
13920A143942K08278j22375L67210k74802m6256Q1440K30546j71498K22233k53940
13910A384778j6976k56307J80351K95434j93428k5939j73958O7710J44490n00785
13900I05370L42006K21918l83613L43996m08391j9993M65692l0793K16442n17947
13890A134687q2784R2683j76116J30824K38590Q6679M9891m72830J15939r4198
13880A023365R1801K59815l65919J31603J47706k10084l0979k9253J70919k79206
$$ plain form
13950 1737654 1756454 1820943 1626001 1377524 2012250 1863565 1693753 1424567 1538746 1689240
13940 1689240 1530101 1741412 1581441 1477425 1295957 1895164 1494931 1539404 1550127 1416965
13930 1416965 1588745 1655394 1239597 1540714 1458781 1500821 1242487 1217923 1398937 1143942
13920 1143942 1352220 1229845 1597055 1322253 1275997 1357437 1587983 1416485 1638718 1384778
13910 1384778 1367802 1111495 1291846 1587280 1393852 1367913 1193955 1261665 1406155 905370
13900 905370 1247376 1469294 1085681 1429677 1021286 1001293 1466985 1436192 1652634 1134687
13890 1134687 1051903 1144586 968470 1099294 1337884 1424563 1474454 1001624 1117563 1023365
13880 1023365 1115166 1374981 1009062 1140665 1288371 1078287 1047308 1018055 1188974 909768
13870I09768q4434L7011K49739J10678j92493k4443L7231M2301k56705K79891
13860A108544M2748j42604j21536L42197k8229k93837J38724k46065K57500J38104
13850A195546k32930j93892L22763j55887J0508k4781K95728l18118k4964K07647
13840A081620J80106k22985k17085j45932j1331P9921M8912J0557J25287j5759
13830I13311J73042m87505K77563M1299j41138n7552J84914k04218j88840N04351
13820A015227q7990k67491M92427m50962J61039l36165K40846K0991K0596j1247
13810G97271j35792J27053j10683J81547N4640j20755K2462k26684J69096P7326
13800H35481k0650l62300K69771j22880J69891B22995N64225O2380k34082m9367
$$ plain form
13870 909768 825334 862345 1112084 1222762 1030269 1005826 1043057 1085358 828653 1108544
13860 1108544 1151292 1008688 887152 1229349 1201120 907283 1046007 799942 1057442 1195546
13850 1195546 962616 768724 1091487 935600 946108 921327 1217055 898937 873973 1081620
13840 1081620 1261726 1038741 821656 675724 664393 744314 793226 803783 929070 913311
13830 913311 1086353 598848 876411 917710 776572 719020 903934 699716 510876 1015227
13820 1015227 927237 659746 1152173 701211 862250 526085 766931 787922 808518 797271
13810 797271 661479 788532 677849 859396 914036 793281 815743 589059 758155 835481
13800 835481 814831 452531 722302 599422 769313 222995 787220 849600 615518 566151
13790E66151K52068J03742k65744q2677J40538k88945K12204Q1970m0738J8592
13780F97161P9954n3332j9503J41675k79265K84325k34781n2281j40859K30978
13770F54072N2427B90537M92861l55660O7825M18725l81538L20397j99790k60250
13760C93107l3409L14678J23259l03517A81030l1903N54155j49997j60970R2166
13750D84481j52559N8551K81783k14467P1499L39153j45048p4330j31710A38987
13739F83464B03551J54801q4228L96126O8911A86374M24183A09519K27546R444
13729C46509K24341J82967n5726j30713O40j76217m2699J52055A20064O95936
13719H16000m9291C73222O26369l57065K46390B44051L28501k84995N24564k68284
$$ plain form
13790 566151 818219 921961 656217 573540 714078 425133 637337 719307 678569 697161
13780 697161 777115 723783 704280 845955 566690 851015 616234 563953 423094 654072
13770 654072 706499 290537 783398 427738 495563 914288 532750 853147 653357 393107
13760 393107 359698 674376 797635 494118 181030 149127 703282 553285 392315 484481
13750 484481 331922 390473 672256 457789 529288 868441 723393 649063 517353 138987
13739 683464 203551 358352 274124 670250 739161 186374 610557 109519 337065 346509
13729 346509 570850 753817 698091 567378 568018 391801 349102 501157 120064 816000
13719 816000 766709 373222 999591 642526 888916 244051 572552 287557 812121 543837
13709E43837N4667k07486L34833l46761K33267r0939J09471C11453K42318K32102
13699G85873l10262Q0385k4052k45545L90799m6713j15736j30879d5825F31250
13688C64873A56361L19158M2758J87472B26209K57274j29512M9900J04880k7865
13678D80886c2668F03116A66869J83881J93632J26486A49171M69336j10970k23390
13668B84147A3409K68993r5975L60604k41393K88284j15952M0055j39926n032
13658C73067K04046B42944K86262l3814R6692p5923B56342E7453L40927n5146
13648C43234F1831M06632L0620J03731c4474C35952J93154k1695k6749l5473n907
13637D39282r5787j50640J8736P7730m8759J83579j39131J22132K86125B52865
$$ plain form
13709 543837 598504 391018 725851 379090 612357 521418 630889 311453 553771 785873
13699 785873 475611 555996 531944 286399 677198 630485 514749 383870 -45825 631250
13688 364873 156361 475519 518277 705749 226209 483483 353971 403871 508751 480886
13678 480886 -32668 603116 166869 350750 544382 670868 149171 618507 507537 284147
13668 284147 13409 282402 186427 547031 305638 593922 477970 518025 378099 373067
13658 373067 577113 242944 529206 495392 592084 516161 256342 57453 398380 343234
13648 343234 61831 468463 499083 602814 -34474 335952 529106 507411 480662 445189 439282
13637 439282 343495 192855 211591 289321 240562 424141 285010 407142 693267 252865
13626E12578o4532A427N65778R4792k78680J7530M8065j26500L18082B60525I394
13614C07178J80583R5827h2328D41769p2178j09644J60135j97654o1455K99293
13604D60266N2126j67866j57138J8110J11287K4852J14751j78828J02557j49062
13594B31055k5072o1620R6337f5472D14217J7702N5405k09919L87840j65687j83139
13583C16419j36866J72507k8603J44700j81767M8236I4918J29009M2499j8365
13573B48061K54611H8171M31404j40076A67088J07000j22744C2292M56154j02616
13563C85830j84921n4573L75915j63784j800J2495q3269N8625j45763J71546J78607
13552E48908A40307k5408L45816j70658K27521a01641B72349J71181A91158J12073
$$ plain form
13626 512578 448046 1427 567205 661997 383317 400847 448912 322412 640494 260525 9394
13614 307178 487761 583588 -82328 441769 369591 259947 420082 222428 160973 460266
13604 460266 512392 344526 187388 205498 316785 341637 456388 277560 380117 231055
13594 231055 205983 144363 240700 -65472 414217 431919 487324 277405 665245 499558 316419
13583 316419 179553 352060 323457 468157 286390 334626 94918 223927 266426 248061
13573 248061 502672 88171 519575 379499 167088 274088 151344 32292 488446 385830
13563 385830 200909 146336 522251 358467 356667 369162 285893 344518 198755 370301 548908
13552 548908 140307 114899 460715 290057 517578 -101641 272349 443530 191158 303231
13542C03231j4274p5380p5926R1589e9174E55977k34191J28593k07798o2434J74283
13531C54430A72481j9567L18083G2887K28704j43965K95495Q7998l8910B09601
13520A07448J90936j23914K32373J33359B13540N1743K8604j26478M44024A85944
13509B75664I4513L8470K131E5068K74187o3028n9210l1538R3056M64688B51161
13497a3402D22125k01962J54310n2752k2561A10699L38543c6355B78944a65971
13486C77626j38799j07880b3802C81100C891L74485K1442a15082A96177a5940
13475A95406q0962J67515e2272C05650p6167J03855J66305C3008a4083B23796
13464H9168K5141N7683a59059A06527e062A11466P5492E1644J04856l4581K2815
$$ plain form
13542 303231 288957 213577 137651 229240 -59174 555977 321786 450379 242581 180147 354430
13531 354430 172481 152914 470997 72887 301591 157626 453121 541119 502209 209601
13520 107448 298384 174470 406843 540202 213540 265283 293887 167409 611433 185944
13509 275664 94513 132983 135114 55068 329255 266227 207017 175479 268535 733223 251161
13497 -13402 422125 220163 374473 321721 299160 110699 449242 -36355 278944 -165971
13486 377626 238827 130947 -23802 381100 3891 378376 399818 -115082 196177 -15940
13475 195406 114444 281959 -52272 305650 229483 333338 499643 33008 -14083 223796
13464 89168 114309 171992 -159059 106527 -5062 111466 186958 51644 156500 121919 144734
13453A44734h8056D80735k13229J99618k31480a43347c4678B96509K69424A36969
13442A97153O7459m7012N4803P2593A02540O1625c7618B59862k947a19642C18944
13430C24919j17299K51443B6856f7699A89699b01092A02715J6337l2921K04977
13420B91108r6614H559J24865j6499L02082a51954B12415J62646A17421K74679
13410C92100C7406K39223I0568J97005r2564J12361m1749f0815A29037N0329J48029
13399C27395A09007J38073J82004n0873j55241j06611J74300H5372J05315E4444
13388D44329j35815R0343A43555R4125q61r5074P4141f8513B65166J84196A25651
13376B76571A29768J56620i4940C3312N35441A14124J76049F4772L22969q4086
$$ plain form
13453 144734 -88056 480735 267506 467124 235644 -143347 -34678 296509 565933 136969
13442 197153 264612 217600 272403 344996 102540 164165 -37618 259862 256915 -119642 318944
13430 324919 207620 459063 26856 -67699 189699 -201092 102715 119052 86131 291108
13420 291108 194494 8559 133424 116925 419007 -151954 212415 375061 117421 392100
13410 392100 37406 276629 90568 287573 195009 307370 265621 -60815 129037 179366 327395
13399 327395 109007 247080 429084 378211 222970 116359 290659 85372 190687 54444
13388 444329 308514 398857 143555 237680 236819 141745 215886 -68513 265166 449362 125651
13376 276571 129768 286388 -94940 33312 568753 114124 290173 64772 387741 303655
13366C03655A43489K08378j19754k9593m666J26288A52833K2594J22350M3768
13356C41545j11750J39220j10566r6640Q7864a08067p2180C06444O9996c6782
13345C13502n2608A5458M33460E7169M11482p650A66299K41941a47214D84948
13334B72801A08215O00652C30622j12797j1511A02219K53478C4555K33589J09028
13324C77172a22771A65060O4606C9042N26477a64865C19548A30441l1429N88566
13314F87578k28171A89719Q27o9515j7094R4387a5513j98752f5269B97145J05460
13303D02605A16153Q6193G0523L9168K13777l6396C2103J95371m98i1972K0884
13292g1088B1998a30604C08119A34367J19253b60230B85106i1291C27321b22863
$$ plain form
13366 303655 143489 351867 232113 202520 197854 324142 152833 175427 297777 341545
13356 341545 229795 369015 258449 161809 249673 -108067 -180247 306444 376440 -36782
13345 313502 260894 15458 448918 57169 468651 461001 166299 408240 -147214 484948
13334 272801 108215 708867 330622 217825 206314 102219 355697 34555 268144 377172
13324 377172 -122771 165060 229666 39042 565519 -164865 319548 130441 99012 687578
13314 687578 459407 189719 190546 121031 103937 198324 -15513 -214265 -65269 297145 402605
13303 402605 116153 202346 70523 109691 323468 287072 32103 227474 226976 -91972 -71088
13292 -71088 21998 -130604 308119 134367 253620 -260230 285106 -91291 327321 -222863
13281A51662J43156j41709J65312j32917p9045N0000K48752b68587A20474Q9390
13271B09864J88121b39561A40621K7376c0935A08711c24181C34138J62400j98146
13261B98392j16040F5893R1039a40218A93091E2728k5089L640P4004J16696d9929
13249A98158F6557j9491J0470L74813H3794e0879k22616A6943K19313J67117D3547
13237C11433K92134A56405R84c133E16025i7507L2732p4679B23797K26468f8117
13225B27355G0225J60428B9363J16188J7781J08066c38640D54927j97109q0284
13215A77534a21140A27253a93723N9856C44483j31514A6996L19446A19673a57887
13204F2708c11025C01142B5556b3222l6077j24460B23783h4586D1147j4785J45724
$$ plain form
13281 151662 294818 153109 318421 185504 106459 156459 405211 -268587 120474 209864
13271 209864 397985 -239561 140621 167997 -30935 108711 -324181 334138 496538 298392
13261 298392 182352 65893 156932 -140218 193091 52728 27639 31279 105283 221979 -49929
13249 198158 66557 47066 57536 432349 83794 -50879 -273495 16943 236256 403373 43547
13237 311433 603567 156405 157389 -3133 516025 -97507 -64775 -139454 223797 450265 -68117
13225 227355 70225 230653 29363 145551 163332 271398 -338640 454927 257818 177534
13215 177534 -121140 127253 -193723 -133867 344483 212969 16996 336442 119673 -157887
13204 62708 -311025 301142 25556 -23222 -59299 -183759 223783 -84586 41147 26362 172086
13193A72086G3436J36152a71109A36721e0867a1885j66842A27754K1477J13322
13183B62553q1975D9365b0641o2682l29511b8709r8967B9797L15297b2974B57484
13171A3718L5509b58659A39421l3643M1238E7386f6222A0086K05430a71553E06340
13159H4464L23664A30506D6502M3640J49378o7012e0136j3509B6439L0663a27540
13147B61609D3992J66711j04840a05006a5952A35781J7620g5935l6805F6158a72323
13135D17134a81251D56333C5215L12057l675I4181K2556c27504B17249d542B28839
13123a55744B63092n9945d50717B03256n6180B8528d524j43223A91008C5849c3874
13111A07261B0446b28634A34001c8863j74328A16304h437C31220h554q2923A64431
$$ plain form
13193 172086 73436 209588 -171109 136721 -50867 -11885 -178727 127754 149231 262553
13183 262553 180578 49365 -20641 -83323 -412834 -28709 -127676 29797 345094 -22974 257484
13171 13718 49227 -258659 139421 105778 147016 57386 -66222 10086 215516 -171553 506340
13159 84464 408128 130506 46502 90142 239520 172508 -50136 -63645 26439 57102 -127540
13147 261609 43992 210703 105863 -105006 -15952 135781 153401 -75935 -112740 66158 -172323
13135 417134 -181251 456333 35215 347272 343597 94181 116737 -327504 217249 -4542 228839
13123 -155744 263092 203147 -450717 203256 147076 28528 -4524 -147747 191008 35849 -33874
13111 107261 20446 -228634 134001 -38863 -213191 116304 -8437 331220 -8554 -91477 164431
13099a9359l07178J30240B21981a13158e0040a2826B63850i8745A08106a62044
13088I1799m1714l780a19894A29687K9844E1727G086J08511m3966q754i1347I1560
13075D26382c0685I7175f5862A92840L2425C2696M5673J18474b545D16161h0464
13063C35869M042i9949b0055D9882K02738g3767A97077I5628A2786N248O0637
13052G8671h0684C17374c9315A24945p548n1583J91068j25609a53068m2421C88230
13040D5038a43597H9054l9639L34289N1187b23434d828D1219A1590M51987B879
13028A15049b94160i767l1236r1559o9436A82997O2329b7726B32302L42886C7312
13016A90639i3889p675j99382e4861Q233l3827F6329b32008h4295D36080B04374
$$ plain form
13099 -19359 -326537 -196297 221981 -113158 -50040 -12826 263850 -98745 108106 -162044
13088 91799 50085 46305 -119894 129687 159531 51727 7086 115597 71631 62877 -91347 91560
13075 426382 -30685 97175 -65862 192840 225265 32696 78369 196843 -2545 416161 -80464
13063 335869 339911 -99949 -20055 49882 252620 -73767 197077 95628 12786 18034 78671
13052 78671 -80684 317374 -39315 124945 117397 65814 256882 131273 -153068 -195489 388230
13040 45038 -143597 89054 49415 383704 434891 -223434 -4828 41219 11590 463577 2879
13028 115049 -294160 -9767 -41003 -132562 -201998 182997 245326 -27726 232302 575188 37312
13016 190639 -93889 -101564 -300946 -54861 -46628 -80455 66329 -232008 -84295 436080 204374
13004B0919R6503h2889D04198A4703J70965d7380B22261I3742e2129n9838j3315
12993a25282M1980K7652A80443a17779E8740h5573j31411h1202P073r51b8899
12981G2542J36087B9854N2124c4734A63338a31448A385b48955D8558N0611c1708
12969B4427K05794q996C3869M03880b1291A42713J47167i6231B13608A9153J18641
12958A37794L8329A5768e3436A68868d03225C6989K73850H4551c49853J45817
12948b04036F755J18142N8841i0212E2724E877K20568d6956F3530j609c33815
12936D47049I8066d7794A11425O6385D1877J35229c76830b5707A29422C6140O0626
12925I6766J18434f2926A91891F0186a17880P083K3493o4392K5413j4781A44003
$$ plain form
13004 20919 117422 -82889 404198 14703 185668 -47380 222261 93742 -52129 -111967 -125282
12993 -125282 -83302 -55650 180443 -117779 58740 -85573 -216984 -81202 -74129 -75080 -28899
12981 72542 208629 29854 81978 -34734 163338 -131448 1385 -248955 48558 99169 -31708
12969 24427 230221 221225 33869 437749 -21291 142713 289880 -96231 213608 19153 137794
12958 137794 176123 15768 -53436 168868 -403225 36989 310839 84551 -349853 -204036
12948 -204036 6755 124897 183738 -90212 52724 5877 226445 -46956 63530 61921 -333815
12936 447049 98066 -47794 111425 177810 41877 177106 -376830 -25707 129422 36140 96766
12925 96766 215200 -62926 191891 60186 -117880 -110797 -87304 -151696 -126283 -141064 144003
12913D16593d1096A69911q3577I221i8519D12801g6852K5691D33948k09871G7887
12901G7525L07884j46944b4915k43762o4752B15833Q6457p798R8b19291c8389
12889B28506a95906G0658a31755N0596r361B02464m3734j8747k1214f4379j28445
12878a92824D6137d6977k0332n624K1551j88074a1312A15749a44659A17638e1051
12866g2993F0068K6320j6461K2613a00650a8466I5221M6473F5562A5476c10606
12854A24827N2431G87b2394l7404A18581h2497j9101C9425L36354I1975b0511
12842g5268J5331B15044m4673E4658a84045h1265B74952c119A94885K1920L659
12831B20464D4874e3060K4453o5197J7600g380A19365b9882A56970o8370l7663
$$ plain form
12913 416593 -41096 169911 86334 9221 -98519 412801 -76852 -51161 433948 224077 77887
12901 77525 385409 238465 -24915 -268677 -333429 215833 302290 294492 294590 -219291 -38389
12889 228506 -195906 70658 -131755 -81159 -90520 202464 158730 139983 118769 -64379 -192824
12878 -192824 46137 -46977 -67309 -72933 -51382 -239456 -11312 115749 -144659 117638 -51051
12866 -72993 60068 86388 69927 92540 -100650 -18466 95221 141694 65562 15476 -310606
12854 124827 177258 787 -22394 -59798 118581 -82497 -101598 39425 375779 91975 -20511
12842 -75268 -59937 215044 170371 54658 -184045 -81265 274952 -3119 194885 216805 220464
12831 220464 44874 -53060 -28607 -93804 -76204 -7380 119365 -29882 156970 88600 50937
12820E0937a90386D25725C3707K4953a9579A13930f554B91215b52336E04688f4496
12808H6718b66163A16332k5755b79716c5725C20017I6117h6699d506A19254a33229
12796B23775k3391C7232P4248B7848K17267e5745m7569F0502J3184q272h7538
12784A1815K86721a72045O5753C6951A7423K96980C2593i3858b6362A52967E1972
12772b18029K5648P6860B30720g4360l7760D6410L0349K0479Q4039b04240C60619
12760B23856E1165K05264b77700J10462C60695h832F9870L2552a01004j69545
12750b70549d8359A22197E8312R9837b38259A22148K76556G5393a22901r1490
12740b14391Q8099B33666j0564B0683Q5252K23321A41013k8515g4734C549j28
$$ plain form
12820 50937 -190386 425725 33707 58660 -19579 113930 -6554 291215 -252336 504688 -64496
12808 86718 -266163 116332 90577 -279716 -35725 320017 96117 -86699 -4506 119254 -133229
12796 223775 200384 37232 111480 27848 245115 -55745 -103314 60502 73686 65414 -87538
12784 11815 298536 -172045 -106292 36951 17423 314403 32593 -93858 -26362 152967 51972
12772 -218029 -192381 -115521 230720 -74360 -112120 46410 76759 97238 181277 -204240 360619
12760 223856 51165 256429 -277700 -167238 360695 -8832 69870 102422 -101004 -270549
12750 -270549 -48359 122197 58312 158149 -238259 122148 398704 75393 -122901 -214391
12740 -214391 -126292 233666 223102 20683 105935 329256 141013 112498 -74734 3549 3421
12729C421J239Q0514a0780j60061K3863m2340L7816l872H28K27119c07048J23432
12717a83616b6828k058A27842f6786p4344f3212J4756A6685J49793a11159C67698
12705B98757F71L65257a0234k55634B97433b8535j70396K3268r9982F4165a02051
12693C98438G8342J68958E6685a02971B5311K72155H7189b09771A37290a01858
12682D2700P9556J38252b45159E6565K97465A70588a19541B523b09815A11859
12671D44615b09897C7726J32052p5056a1652j06814B53171l4920o7313a3194B9677
12659h1868E0360P2966J38042j16481k3413M1190d8686A65309D0493L62982j93808
12648B09667j1270g1209C25606e0135A39223K67J66316A24357J82413A37959d7848
$$ plain form
12729 3421 4660 85174 -10780 -170841 -146978 -189318 -151502 -155374 828 227947 -307048 -183616
12717 -183616 -26828 -28886 127842 -66786 -141130 -63212 -48456 16685 166478 -111159 367698
12705 298757 671 365928 -10234 -265868 297433 -28535 -198931 -175663 -275645 64165 -102051
12693 398438 78342 247300 56685 -102971 25311 297466 87189 -209771 137290 -101858
12682 42700 122256 260508 -245159 56565 354030 170588 -119541 2523 -209815 111859
12671 444615 -209897 37726 169778 94722 -11652 -118466 253171 218251 150938 -13194 29677
12659 -81868 50360 123326 261368 144887 121474 162664 -48686 165309 40493 403475 209667
12648 209667 198397 -71209 325606 -50135 139223 139490 305806 124357 306770 137959 -47848
12636A33707n3383P5485J39386G2699J81374H711J91796c36818D26724H3043i9182
12624D4286K08551A10751g9790A35769K4643Q9119B1888K0361a59981O2556d7764
12612a86350N4172A27685D0314A5702a77876A14481a74257G57K9249a21508b2706
12600a62591A61646D733e7274B03053p3783m2491g4510H816Q5674b188H1708L45942
12588D27650j88200K41826b4563B48514K0660p0185d4998j88232I6321b12231
12577G1545a50087A52522H143h1854A89455o8702d4456I9950J55922c13777A46524
12565C9798j4467b3373d747k24460K1751i302j13752A66288g6595j74257b4981
12553C26903b42095R9720P847A9788K75669i0395A54663E9513k7415a05948A28230
$$ plain form
12636 133707 80324 155809 295195 72699 254073 8711 200507 -336818 426724 83043 -99182
12624 44286 252837 110751 -79790 135769 160412 249531 21888 42249 -159981 -97425 -47764
12612 -186350 -132178 127685 40314 15702 -177876 114481 -174257 757 30006 -121508 -22706
12600 -162591 161646 4733 -57274 203053 129270 86779 -74510 8816 94490 -2188 81708 427650
12588 427650 239450 481276 -24563 248514 269174 198989 -44998 -233230 96321 -212231
12577 71545 -150087 152522 8143 -81854 189455 120753 -44456 99950 255872 -313777 146524
12565 39798 25331 -23373 -4747 -229207 -207456 -9302 -123054 166288 -76595 -250852 -24981
12553 326903 -242095 -142375 -134528 19788 295457 -90395 154663 59513 32098 -105948 128230
12541I4937a48858R520n4226k6232e7417I4459J38445a09723j05019q1342R8576
12530a97508A49103o4965a56387N1498E5014b68526K618d960G5157b11045E844
12518e196J955j87542K4036B77952j26383k896c7837B27177b7527F4554j7570
12507D6984K458b5328H7722R6608a14693j04525p6213R9923B64591H567R4865
12496A03432M2643h3714j6201a2928B05802R181h5913B34647A7347J40481J79495
12485C37323N0889a16811G8002Q0389j4360O0659L2531i5467k8925B78079i6733
12473D3116a73800C89657c4633B8075L46570J0407q5035c70890A29689C1119R203
12462D0322c74917H8853b43844e3958J3214k49316B96379E2772J37492e2275A55615
$$ plain form
12541 94937 -148858 -139338 -193564 -219796 -57417 94459 232904 -109723 -214742 -296084 -197508
12530 -197508 149103 84138 -156387 -104889 55014 -268526 -265908 -4960 75157 -211045 5844
12518 -5196 -3241 -190783 -166747 277952 151569 148673 -37837 227177 -27527 64554 46984
12507 46984 49442 -25328 87722 184330 -114693 -219218 -295431 -195508 264591 8567 103432
12496 103432 146075 -83714 -99915 -12928 205802 214983 -85913 234647 17347 157828 337323
12485 337323 388212 -116811 78002 158391 144031 204690 237221 -95467 -124392 278079 -96733
12473 43116 -173800 389657 -34633 28075 374645 385052 300017 -370890 129689 31119 40322
12462 40322 -374917 88853 -243844 -53958 -40744 -290060 296379 52772 190264 -52275 155615
12450B23162B0570N6740J44206c49888B4798i7232k12327J23702Q3855A61178
12439a17960e8956j77627n974G5647C603N5080e2308a2709p3418M768D504a77595
12426D1652h5013E9306d6894C06165c48901a15273I0421c36829J06281A06538
12415f9885a1336l88886J92286C8315b32142P0258j13818A7170J60184J04763
12405B82117b34621C44121b04379D41580a09047N2544l44589d5757C06978f1924
12394B31161E3537J19470f3297A30045L7316P9517F8401l2843R5491e9602A74818
12382E3913b7509j77399a7960E3685J21252D2345M9164J43779a27177A18797K21776
12371C40573I37K8897N47259H1354b89049F3709a39030j13529P0869A07906j0882
$$ plain form
12450 223162 20570 77310 221516 -349888 24798 -97232 -309559 -185857 -102002 161178
12439 -117960 -58956 -236583 -242557 75647 3603 58683 -52308 -12709 -86127 -81359 4504 -177595
12426 41652 -85013 59306 -46894 306165 -348901 -115273 90421 -336829 -230548 106538
12415 -69885 -11336 -400222 -207936 38315 -232142 -161884 -275702 17170 177354 282117
12405 282117 -234621 344121 -204379 441580 -109047 -56503 -401092 -45757 306978 -61924
12394 231161 53537 173007 -63297 130045 167361 246878 68401 35558 131049 -59602 174818
12382 53913 -27509 -204908 -17960 53685 174937 42345 91509 235288 -127177 118797 340573
12371 340573 937 29834 577093 81354 -289049 63709 -139030 -252559 -181690 107906 97024
12360I7024c5171j58305C84004b95120H8439M4092a80504F1721R8317K54750a64339
12348A34863J69196g0127g356p4461b5725B66832A1243Q7380a36569G6693C4567
12336A12895E939K46100e77850a931j59071E7547P567b9189P215A68989K2720
12325A91709H2021J95651a83087A47393P2735J53623b25387A25274l1337L32235
12315D26172b5292p5268C47760A34424J27417a59033G450K30673L711j11481o3917
12304F6436L2606O5084h6089k65691B89297A0009K65029r3542H9268a09605M6518
12293f3087A98829O0153J6902o6281a9736C04644n5702c1372C3612j3L61612A4209
12280I8669J35865L3842a4892E48016A23273d581B41844F2349k3286L46709j10989
$$ plain form
12360 97024 -35171 -193476 384004 -295120 88439 132531 -180504 61721 160038 414788 -164339
12348 134863 304059 -70127 -7356 -81817 -25725 266832 11243 98623 -136569 76693 34567
12336 112895 5939 252039 -577850 -1931 -161002 57547 65114 -29189 -21974 168989 191709
12325 191709 82021 277672 -183087 147393 220128 373751 -225387 125274 93937 426172
12315 426172 -25292 -100560 347760 134424 261841 -159033 7450 238123 241834 130353 66436
12304 66436 99042 164126 -86089 -351780 289297 10009 275038 181496 89268 -109605 -63087
12293 -63087 198829 258982 275884 209603 -19736 304644 248942 -31372 33612 33599 395211 14209
12280 98669 234534 268376 -14892 548016 123273 -4581 241844 62349 39063 385772 274783
12269B74783p9682h5055A79608K50155a32017B38163J1365j6866a78046A09626
12258B66758a4923j2323m4752K1200A06206N5579C9428P1975Q2100J20960Q576
12247C23039j25838b64357A49683n9622K16939o5354R7897e9113a5760C59819
12236A73310L4100K30426a45965f0997A93155f8774B99779b4020B42086O401a80908
12224G8794L77283A58170J96555N7351j26643O4437j4045K5083K44927k58964
12214C46871K02114B40197J57442J34011A85835e472B14626i8760G3924C5373
12203A70780D2324K8238J77079A2702J81612B7453K4804J16099D1857L79436k5752
12192C95541m9489p0546k3960L46368I8053K28228D0447M42711A11231a64236
$$ plain form
12269 274783 195101 -85055 179608 429763 -132017 238163 249528 232662 -178046 109626
12258 266758 -14923 -27246 -71998 -50798 106206 161785 39428 111403 193503 314463 323039
12247 323039 197201 -264357 149683 90061 307000 241646 339543 -59113 -15760 359819
12236 173310 207410 437836 -145965 -60997 193155 -68774 299779 -24020 242086 248487 -180908
12224 78794 456077 158170 354725 412076 285433 349870 335825 360908 605835 346871
12214 346871 548985 240197 397639 531650 185835 -5472 214626 -98760 73924 35373
12203 170780 42324 70562 247641 12702 194314 27453 52257 168356 41857 421293 395541
12192 395541 346052 275506 251546 597914 98053 326281 40447 483158 111231 -164236
12181C75537j77541b534H7756D414a42042A92884J46655b5048C19810J15577A0596
12169A59184e237F24183C02995J15377A27509J25047A22593a1548A37498d3835
12158B83955o7923E2450N0741P5223J95053K5446L520E1825j0179J53287c1496
12146A70088l3370F2611K7167N1843F5376J67813P5872n5084E856K72986j16521
12135A62321d8590B49219n0722F5656N27178f1861B24667q2148J90667G9130c62172
12123I145a71155B41418O8849H1806J67075a41764j26449A46707J80375i3755
12112B43338a36891A97775r6727D4237a6890B63782I6862Q5124L85359B21316
12101b26893m7973A09903L6346D4949L49434G534a41730A95585b3804O435A00027
$$ plain form
12181 375537 197996 -2534 87756 4414 -142042 192884 339539 -25048 319810 435387 10596
12169 159184 -5237 624183 302995 418372 127509 252556 122593 -11548 137498 -43835
12158 283955 216032 52450 103191 178414 373467 398913 402433 51825 41646 194933 -31496
12146 170088 136718 62611 89778 141621 65376 233189 309061 253977 5856 278842 162321
12135 162321 -48590 249219 198497 65656 592834 -61861 224667 142519 333186 79130 -362172
12123 9145 -171155 241418 310267 81806 248881 -141764 -268213 146707 327082 -93755
12112 243338 -136891 197775 101048 44237 -16890 263782 96862 181986 567345 221316
12101 -226893 -274866 109903 146249 44949 394383 7534 -141730 195585 -23804 -17369 100027
12089C54360j14813e5013B25090P231b14438D161L68870j04958P3463A63561A9401
12077d3911j7922m7394J1759B23447l8910P2617b24463G5893B5160R6413K74003
12066C95576E0079Q281J02256l0041D438b64531I483a1631G5659r65j6598P1611
12054A29707c37734A0372L9574M6910O9011B1345J5622f3347o1080A24338J36274
12043B60612M8231E3382a03918o7036B7458O9389a5585j57782E1232b09817E5548
12031a15571a4519B68552e4434D09879H1226b20903a07099e630q7485m706n1743
12020a49564a2652k6228r8307M7496I7416J70290Q8003i5535C0300J69864Q7185
12009B87349a45023H2123J66002J73263j17781q6176E1033f9227b6241k4215A26286
$$ plain form
12089 354360 239547 -55013 225090 232321 -214438 4161 373031 268073 341536 163561 19401
12077 -43911 -61833 -109227 -97468 223447 184537 257154 -224463 75893 25160 121573 395576
12066 395576 50079 58360 160616 130575 4438 -264531 9483 -11631 75659 74694 58096 129707
12054 129707 -337734 10372 49946 96856 165867 21345 36967 -63347 -124427 124338 260612
12043 260612 308843 53382 -103918 -170954 27458 96847 -15585 -173367 51232 -209817 55548
12031 -115571 -14519 268552 -54434 409879 81226 -220903 -107099 -5630 -93115 -97821 -149564
12020 -149564 -12652 -38880 -137187 -89691 97416 267706 355709 -95535 30300 200164 287349
12009 287349 -145023 82123 248125 421388 303607 217431 51033 -69227 -26241 -50456 126286
11997F2910r030a55973b6684C5951A7257P9307h1722H7047a6071E341K33575a03488
11984c8686D01070A91824a68292A35037J62531j41535a06169A51358b20526d1928
11973h8990H6757b33517j11214a14048a5611j43079A19806m4561a5990j59112
11963a75102K5881B4329R7233m480J4311a27277J5730j65657A67879e3570A14045
11951f3313o7929f0889A90866b00874j40820J64208H00i7073c139q6653B2351
11939A37408b37131g6764A95506i2332F8650a61093G5426b51479A04626b09751
11928B1076O4677J74003q1135b27437j76690J07488A86689i6018j08712B66107
11917b15212h0303b5294a2375j06202A05933l2821O7894d69898A01013j9576F947
$$ plain form
11997 62910 53880 -155973 -26684 35951 17257 96564 -81722 87047 -16071 5341 238916 -103488
11984 -38686 401070 191824 -168292 135037 297568 156033 -106169 151358 -220526 -41928
11973 -88990 86757 -233517 -344731 -114048 -15611 -158690 119806 75245 -15990 -175102
11963 -175102 -149221 24329 121562 117082 131393 -127277 -111547 -277204 167879 -53570 114045
11951 -63313 -131242 -60889 190866 -200874 -341694 -177486 800 -97073 -3139 -89792 22351
11939 137408 -237131 -76764 195506 -92332 68650 -161093 75426 -251479 104626 -209751
11928 21076 85753 259756 178621 -227437 -404127 -296639 186689 -96018 -204730 266107
11917 -215212 -80303 -25294 -12375 -118577 105933 73112 141006 -469898 101013 81437 6947
11905G0705N2225n2387B0029a41528f1199j01311C09961I2376J13664J21421a59065
11893A20732B6165b25015l7061Q5832B30773b49089A32284b96174a21895K4159
11883i7736L3363F4263a05793A06965a6360B27149H399K79340a97858A41334h4190
11871A2288b31738C95174b16123a6416A66391a64359K957f0694I1597A8519O1576
11860H0095K55859B5161d3034j44251h9624m86535K55420g1823C1520a77244I4653
11848f0313I6511A4608a60069A65232a30347C4435c01431O1493H5673J6748L4842
11837A37263k8726O2220m8398b8109B77408A22369b44216r1256i9182A17636g4909
11825G0082Q968L6351k4239c065o0581C73599A89b61303A32434A0063g6063l94243
$$ plain form
11905 70705 122930 70543 20029 -141528 -61199 -162510 309961 92376 206040 327461 -159065
11893 120732 26165 -225015 -262076 -176244 230773 -249089 132284 -296174 -121895 -97736
11883 -97736 -64373 64263 -105793 106965 -16360 227149 8399 287739 -197858 141334 -84190
11871 12288 -231738 395174 -216123 -16416 166391 -164359 -161402 -60694 91597 18519 80095
11860 80095 335954 25161 -43034 -187285 -89624 -576159 -320739 -71823 31520 -177244 94653
11848 -60313 96511 14608 -160069 165232 -130347 34435 -301431 -239938 85673 102421 137263
11837 137263 108537 170757 122359 -28109 277408 122369 -244216 -335472 -99182 117636 -74909
11825 70082 79050 115401 91162 -3065 -63646 373599 189 -261303 132434 10063 -76063 -470306
11813d70306A81189p0114g4874A82196i4670b9941a4588B09187g8579F7004h835
11801a4088B25411D4247f4118C16830a1522r0037A30293h9116j11621O1287c9719
11789a23360D0594Q4735a18458d9777E5716J76063a27232k20401H9085L3369c8189
11777A1674L6203n88P4195K44872h7241D7402b12394C29886d28874g5279H7549
11765g4181E8155O8446a09938j82650c5899o9821k54160a05259k5206A11468C7743
11753I2204g1388k7017F8273B2085a85401D5072K8141J62187J1669I4007a00730
11741F4794K86288H1906a30840B56647A10183c01517B2632B158c76119e691o4601
11730g0292A5295a49948r800l20362a60172o181B70066j12576d6861j19897m7917
$$ plain form
11813 -470306 181189 111075 -74874 182196 -94670 -29941 -14588 209187 -78579 67004 -8835
11801 -14088 225411 44247 -64118 316830 -11522 -101559 130293 -89116 -200737 -139450 -39719
11789 -123360 40594 125329 -118458 -49777 55716 231779 -127232 -347633 89085 122454 -38189
11777 11674 47877 47289 121484 366356 -87241 47402 -212394 329886 -428874 -75279 87549
11765 -74181 58155 126601 -109938 -292588 -35899 -105720 -359880 -105259 -130465 111468 37743
11753 92204 -71388 -98405 68273 22085 -185401 45072 73213 235400 247069 94007 -100730
11741 64794 351082 81906 -130840 256647 110183 -301517 22632 2158 -376119 -5691 -70292
11730 -70292 15295 -149948 -159748 -480110 -160172 -166353 270066 157490 -46861 -166758 -214675
11719b14675A76547l9551n6779b27747a11425G6590b34779C6366d9404j77439
11709b26843h2950A99684B1415a22249j0848d6928A56548Q0529i7739n8522b2477
11697C3979K09524c129a80l9639r1613l5848A13597J10581K19890G2992J9481
11686I2473a8876A3919d8526m1751D379a23866K3510A47646i9905R230E26528
11674C52281o144b39542B82718a75865j19142h8376k00867P2627E5056J15243
11664A70299a27509b8968j13261F4479K7135b22067A02840K07935I3831c07834
11653B64385j21051b28778B23039F1662k1988J40007h0554A5386b19391B14423
11642g5650q3661r4603J09212B38824f33015c4123A78889a031l96792a18458A58911
$$ plain form
11719 -214675 176547 136996 80217 -227747 -111425 76590 -234779 36366 -49404 -226843
11709 -226843 -82950 199684 21415 -122249 -133097 -46928 156548 237077 -97739 -156261 -22477
11697 33979 243503 -3129 -180 -39819 -131432 -167280 113597 224178 444068 72992 92473
11686 92473 -18876 13919 -48526 -90277 4379 -123866 -100356 147646 -99905 -90675 526528
11674 352281 346137 -239542 282718 -175865 -295007 -88376 -289243 -216616 55056 170299
11664 170299 -127509 -28968 -142229 64479 91614 -222067 102840 310775 93831 -307834
11653 264385 143334 -228778 223039 61662 39674 179681 -80554 15386 -219391 214423
11642 -75650 -159311 -253914 -144702 238824 -633015 -34123 178889 -1031 -397823 -118458 158911
11630D4136a73584N8876B6024L80034f4471k3470D5519K9416J74898d2785j23489
11619a66274f0490l5971B57073r7909F0365J00030K9375c25497P3275b2983k16029
11608b39012J03294D8950k4386b51594J6410A29794b4184j72510Q2749C9300P8256
11597A17556a28775D28017A11061J35354a31665A26934N7663c42703a8191k52600
11587b70791B82126I9160J62889A19490L8142J312D6457a10667B52887a59027
11576a9873A67916l2567c48248g362j65821A20007b0083A17413d9026D1464P4254
11565A15718N1528h330A91856H0970O1210J7731N8161N3370M00829C8570K06876
11554B45446p6333b19312M6896A04611M8814E9054O5987a18344E7843O230c28345
$$ plain form
11630 44136 -173584 -114708 26024 406058 -64471 -87941 45519 74935 249833 -42785 -166274
11619 -166274 -60490 -96461 257073 159164 60365 160395 189770 -325497 -252222 -22983 -239012
11608 -239012 -135718 48950 24564 -251594 -235184 129794 -24184 -196694 -113945 39300 117556
11597 117556 -128775 428017 111061 246415 -131665 126934 184597 -342703 -18191 -270791
11587 -270791 282126 99160 262049 119490 157632 158944 46457 -110667 252887 -159027
11576 -19873 167916 135349 -348248 -7362 -173183 120007 -20083 117413 -49026 41464 115718
11565 115718 167246 -8330 191856 80970 142180 159911 218072 271442 672271 38570 245446
11554 245446 169113 -219312 -172416 104611 153425 59054 125041 -118344 57843 64073 -328345
11542A28659F3688b38793R0251A09143b11268b4162g28k75853B43300o8805a25284
11530C02792A404O4358b37430B18017a1310B26131i370A1385J74301H2834a84472
11518G3595J26143D3278L52946B6469J4837e4399C81717j03032a82604B03639
11507H6429K38379a52485B97662A00168j1573K6327J94835A04769J17199n0836
11497A71132o0074C0540J99281j11636J68454N1282b46296B55506m4779J71239
11487C81966A57980m107a55128A19864K77907D0489a52118A16443m3193Q1445
11477A54695J17156d9364A73760K32562A40596k5326L47119j79504O4596A17902
11466A5443a08107A13900L41117j44678m380J05376A71006c5593C62129A51020
$$ plain form
11542 128659 63688 -238793 -148542 109143 -211268 -24162 -728 -276581 243300 174495 -125284
11530 302792 1404 65762 -237430 218017 -11310 226131 -9370 11385 185686 82834 -184472
11518 73595 199738 43278 396224 26469 41306 -54399 381717 278685 -182604 203639
11507 86429 324808 -152485 297662 100168 88595 114922 309757 104769 221968 171132
11497 171132 111058 30540 229821 118185 286639 337921 -246296 255506 210727 381966
11487 381966 157980 153873 -155128 119864 397771 40489 -152118 116443 73250 154695
11477 154695 271851 -49364 173760 406322 140596 115270 462389 282885 347481 117902
11466 15443 -108107 113900 455017 310339 305959 411335 171006 -35593 362129 151020
11455B02327Q7244A9833a80284A06038J71666Q1129r5740c79217B23420P9824
11445C03244i8341k10963e3558C29145B2314R0638m5903J55138L32385B41200
11434C42423B1910K34555K70119E2387b52892A34676C1903K7578L51621j88820
11424B22282E3472N3332N1094F2711c55564A54709E5941J26014a86616A28369
11413a61424N2084H2330M0906L00114g7154D065b4037d374A03015K6799M4417
11402A74231J17343A24486a87627I9167a9019B33832b48699A57650K85011i6520
11391h4113r762A61800m4849a4340j31237k39B24812r8510j6246b52889B2209
11379c53526O0518A15442a63150j09812A23101i9171C77105a99857I2936c27087
$$ plain form
11455 202327 289571 19833 -180284 106038 277704 358833 263093 -379217 223420 303244
11445 303244 -98341 -309304 -53558 329145 22314 112952 67049 222187 554572 241200
11434 342423 21910 256465 526584 52387 -252892 134676 31903 59481 411102 222282
11424 222282 53472 106804 157898 62711 -355564 154709 55941 181955 -186616 128369
11413 -161424 -109340 82330 123236 423350 -77154 4065 -24037 -4374 103015 129814 174231
11402 174231 291574 124486 -187627 99167 -19019 233832 -248699 157650 442661 -96520
11391 -84113 -93875 161800 116951 -14340 -145577 -145816 224812 126302 110056 -252889 22209
11379 -353526 -293008 115442 -163150 -272962 123101 -99171 377105 -199857 92936 -327087
11368a89480O0446I3609A3451d96961B56060b76441C37235A00167h8314j00866
11358a89180q9110J16102m2541H6711d74357d218H802a23020B96671C6212j0233
11347B5979a5640q4525C70291a30425j86269a17844r2156o3961A28791C057b40198
11335C08006A5030f48m4555k85504E2652J63482c18427g3980H5334D208K01810
11324B06018b35890E4547L7792a16167j90712q8454C4224L4575J32559d7920j06918
11313a54838A04297i5344l68777H6202O546b98000G1371I937h8254B48097E8260
11301c24355F9099b89165H1449b5811c793A2368N161b18290R0161R184j31686
11290b50631a00830f299D0751a81449P6363F5452R6064J08817a05359k34396e6218
$$ plain form
11368 -189480 -129034 93609 13451 -496961 256060 -276441 337235 100167 -88314 -189180
11358 -189180 -278290 -162188 -204729 86711 -474357 -4218 8802 -123020 296671 36212 25979
11347 25979 -15640 -100165 370291 -130425 -316694 -117844 -210000 -273961 128791 3057 -240198
11335 308006 15030 -648 -45203 -330707 52652 216134 -318427 -73980 85334 4208 206018
11324 206018 -235890 54547 92339 -116167 -306879 -395333 34224 68799 201358 -47920 -154838
11313 -154838 104297 -95344 -464121 86202 92748 -298000 71371 9937 -88254 248097 58260
11301 -324355 69099 -289165 81449 -25811 -3793 12368 17529 -218290 -128129 -118945 -250631
11290 -250631 -100830 -6299 40751 -181449 -105086 65452 161516 270333 -105359 -339755 -56218
11278B3797b17289Q6916j72672a6159j67814G6888b1536A42048e0218A11585e6137
11266a04613n9709P6314C09362d650B2862M2367J6164g2557A2717g2231B7822
11254a08173A8817a78464B83838g7446j46071h1430B5892J1509J83949c9728j25246
11243a64974I2927j5067M437b33551a4156l0948k26754J34583D8988i4017A49438
11231f6001m5929A03860b1734I6541c31875h4251m53659a55075c9030I3518j2284
11220H1234l7700a98575M8210A2587b80516A24525b41630N5501A08379B5666O1587
11209H7253J441d8378l97201B3115a72721D7682b57106a3747k03428R4496b5243
11197C6646g6705B14679K3574j11218L211A7844a10938k12577p7830g5210l1936
$$ plain form
11278 23797 -217289 -130373 -303045 -16159 -183973 76888 -21536 142048 -50218 111585 -56137
11266 -104613 -164322 -88008 309362 -4650 22862 65229 81393 -72557 12717 -72231 27822
11254 -108173 18817 -178464 283838 -77446 -223517 -81430 25892 37401 221350 -39728 -164974
11243 -164974 92927 77860 82297 -233551 -14156 -45104 -271858 -137275 48988 -94017 149438
11231 -66001 -111930 103860 -21734 96541 -331875 -84251 -537910 -155075 -39030 93518 81234
11220 81234 43534 -198575 -150365 12587 -280516 124525 -241630 -186129 108379 25666 87253
11209 87253 88694 -48378 -445579 23115 -172721 47682 -257106 -13747 -217175 -122679 -25243
11197 36646 -76705 214679 238253 127035 130246 17844 -110938 -323515 -401345 -75210 -107146
11186a07146K4459k76043h1535A52020K3603C7387f0136A83931a07013k25519
11176c32532a23087L3979l0141d0092A04956O9914d6990a7570l62390h0980j66464
11165b47444L3978A98591q4164i9813L7140j15326D12415a44667e8707p1843L1548
11154i9002k8310f3335A19452A6151b98012g6734J81A09508h8277b8544H9861
11142B2696a31021m1574D8b13805e0434A13226R8860b44442A52324f6251A67869
11130g2600C54161a60859F8429J75362J02993D5554j4839c6189n2587B0974J45475
11119A66449j0200G1758G07J35838F7899K4684h3393E1240k0838K73141D7184
11107a4835O523B07701F3702l760N3325j3126a38777D3575R0727b38212E29874
$$ plain form
11186 -107146 -82687 -358730 -81535 152020 175623 37387 -60136 183931 -107013 -332532
11176 -332532 -123087 -89108 -119249 -40092 104956 174870 -46990 -17570 -379960 -80980 -247444
11165 -247444 -213466 198591 114427 -99813 -62673 -177999 412415 -144667 -58707 -130550 -99002
11154 -99002 -127312 -63335 119452 16151 -298012 -76734 -76553 109508 -88277 -28544 89861
11142 22696 -131021 -172595 48 -213805 -50434 113226 212086 -244442 152324 -66251 167869
11130 -72600 354161 -160859 68429 243791 346784 45554 30715 -36189 -88776 20974 166449
11119 166449 156249 71758 707 136545 67899 92583 -83393 51240 30402 303543 47184
11107 -14835 -8312 207701 63702 59942 113267 100141 -138777 43575 134302 -238212 529874
11095C05931J58874b083A44987n5361J44196m4206J00972i7188A87723K36666
11085D24389j56528a21366C17394m5926D0620L1662Q0526J65273j08535j5599
11075A93947J84784K16960j98796G1885K23113J0046J0749l9446j188L50527B53629
11063F20915j85138O8139j33959L33984j72887J50588l5092j07694K34777n5196
11053G18437N9309l55l70071M13826k01413N19724l77960K39915k34051L43378
11043A110739p9514q4218O2435N7078J30469p607k22643j10492K65025j35949
11033I85323K47661l36923p6197K55792m91461L80145j3791j09791p7092L3190
11023G96856K08481k23970j6423P0738l14938N11473k27558k18865N67766E48070
$$ plain form
11095 305931 464805 -2083 144987 89626 233822 189616 290588 -97188 187723 424389
11085 424389 267861 -121366 317394 271468 40620 72282 152808 318081 209546 193947
11075 193947 378731 595691 396895 71885 294998 305044 315793 276347 275159 625686 253629
11063 620915 435777 503916 369957 703941 531054 681642 646550 538856 773633 718437
11053 718437 777746 777391 407320 821146 619733 1139457 761497 1001412 767361 1110739
11043 1110739 1031225 947007 1009442 1066520 1196989 1189382 966739 856247 1121272 985323
11033 985323 1232984 896061 819864 1075656 584195 964340 950549 840758 763666 796856
11023 796856 1005337 781367 764944 835682 520744 1032217 804659 585794 1153560 548070
11012H27418k11231L83445k60462J48163n1055q8139L63704j76765m40183M28342
11002I23237l43601J75959m4527Q5493k9603j23919J90233Q22J0405K04366j67267
10991H81598j58226j67977k00397M34500J04653N9497K6829J12403k50044k9773
10981H13063k12036N68718r710J37700O9997j40562L58822J06513n7004K15014
10971A850515M11713L40017L79251M75866j92358K74661O961l11233m0377l04927
10961B890089l37742m32858m61337K96013q3565K03169k49378q4354K53260l43653
10951A649644J01752l15902j24408q4046m32840j27989N927n6479j31385B15190
10940A81303M0331J15591r6068J45938r9978j32893k1653N7869M9946r3617l7707
$$ plain form
11012 827418 616187 999632 739170 887333 836278 748139 1111843 935078 494895 923237
11002 923237 579636 755595 711068 796561 766958 643039 833272 834094 844499 1048865 881598
10991 881598 723372 555395 354998 789498 894151 953648 980477 1092880 842836 813063
10981 813063 601027 1169745 1160035 1297735 1367732 1227170 1585992 1692505 1635501 1850515
10971 1850515 2262228 2602245 2981496 3457362 3265004 3539665 3546626 3235393 3195016 2890089
10961 2890089 2552347 2119489 1658152 1954165 1870600 2073769 1824391 1740037 1993297 1649644
10951 1649644 1751396 1435494 1311086 1227040 794200 666211 672138 615659 484274 215190
10940 181303 221634 337225 241157 387095 287117 154224 132571 190440 240386 146769 109062
10929A09062j6141K7510c31414d220F868b06610b5432r0290A73280c6058B53910
10917E4431a74717A71335m3726i165n083A86556a41133f3786j05840a7091r2211
10906a09302A24387c54601a1112E9602b81519h8700B26089A03245M4415D9167
10895b28030B16135c1688h996j2846l39486j6055C65577c42294C79403h1704C13001
10883D3557b85048N7125B6690b55435b036k46164J19699Q803j08325A9096J59507
10872A78603b80419i0262o7205c1399A57878k5985c7656j46711B10558E7953f6064
10860a29124j37458C78212a71743q6485J17135b3324k07122O0983e9660G0132
10849D3325f1869A40803a35507B14008C6950P0120J32807b04706O0533I235a49406
$$ plain form
10929 109062 92921 120431 -331414 -4220 6868 -206610 -25432 -115722 173280 -36058 253910
10917 54431 -174717 171335 127609 -9165 -14248 186556 -141133 -63786 -169626 -17091 -109302
10906 -109302 124387 -354601 -11112 59602 -281519 -88700 226089 103245 147660 49167
10895 -228030 216135 -31688 -8996 -21842 -361328 -377383 365577 -342294 379403 -81704 313001
10883 43557 -285048 -227923 26690 -255435 -2036 -248200 -128501 -119698 -228023 19096 178603
10872 178603 -280419 -90262 -157467 -31399 157878 131893 -37656 -184367 210558 57953 -66064
10860 -129124 -266582 378212 -171743 -258228 -141093 -23324 -230446 -169463 -59660 70132
10849 43325 -61869 140803 -135507 214008 36950 107070 239877 -204706 -144173 9235 -149406
10837a81825A80517a19839B6881a53065J6665B49647k6511b950C14590A39913
10826c73005Q5234j01105A2796a49103M4837A9858J61263D0986g1678q3843o4305
10815b19826h4387j31824M7804j41172G0977O8214b82821A30709b9918j21249
10805a51167q0821d8957j74001h356j1250D5110h2659c3223A85444b72337O2983
10794b09354o3116A14638J93127a28169A6079P7510R9574b3048A95073b11171
10783b83513m7477a55160B4268c48327A45570d39418B1039K22572g2182m3426
10773a15608k05155B5347a55733A91792A6361J27297K6933A5062b45507F30J30520
10762A31150a86027iD2062L3232c1882r8502B86044p2319h0976A9060E371M9349
$$ plain form
10837 -181825 180517 -119839 26881 -153065 -136400 249647 223136 -2950 314590 139913
10826 -373005 -287771 -388876 12796 -149103 -104266 19858 181121 40986 -71678 -155521 -219826
10815 -219826 -84387 -216211 -168407 -309579 70977 139191 -282821 130709 -29918 -151167
10805 -151167 -231988 -48957 -222958 -8356 -19606 45110 -82659 -33223 185444 -272337 -209354
10794 -209354 -272470 114638 307765 -128169 16079 93589 193163 -23048 195073 -211171
10783 -283513 -330990 -155160 24268 -348327 145570 -439418 21039 243611 -72182 -115608
10773 -115608 -320763 25347 -155733 191792 16361 143658 170591 15062 -245507 630 131150
10762 131150 -186027 -9 42062 75294 -31882 -130384 286044 213725 -80976 19060 5371 54720
10750E4720L7134J91039a51186A02722D3997c16551A48549j3180d327D4938e4854
10738H8170j996C5570a81778N0334n0876r4702i2842k85062J79832l5392A26417
10726A85504j170a68232j61965a61760k3001q9163H3575l0491c24704J13689g2660
10714g3447a7283F7483C1411b65087H8371I465J96945m9544G6902d9112n1233
10703a00345A77325K6611a89738B3973c30708a53575P585A00009a58096D2193
10692a65820C0236b8234C18329b62821A84529c4650R731A03030b38539j14189
10682c52728J74033A11657J6637c04238A47124P0045b32441i4601k21631P3987
10672b42245G2556a50204f5238D2697b81423B9685a90730P2778C93363e2216p3331
$$ plain form
10750 54720 91854 282893 -151186 102722 43997 -316551 148549 135369 -4327 44938 -54854
10738 88170 86174 35570 -181778 -131444 -182320 -277022 -92842 -377904 -198072 -233464 126417
10726 185504 184334 -168232 -330197 -161760 -184761 -273924 83575 53084 -324704 -211015 -72660
10714 -73447 -17283 67483 31411 -265087 88371 9465 206410 156866 76902 -49112 -100345
10703 -100345 177325 203936 -189738 23973 -330708 -153575 -145990 100009 -158096 42193
10692 -165820 30236 -28234 318329 -262821 184529 -34650 -24919 103030 -238539 -352728
10682 -352728 -178695 111657 128294 -304238 147124 217169 -232441 -94601 -316232 -242245
10672 -242245 72556 -150204 -65238 42697 -281423 29685 -190730 -117952 393363 -52216 -125547
10661a25547f1122M810B37520a50914J1861J2701J5631L9450B16184a2149C720
10649c4284k8644k6593k1950A18843C5950K55608b40640b9860G5540O3057b23541
10637A95822b06685Q0352k35805D6279N0857b97537G7282a04537A96404G4653
10626I2585e446q171j16444R348k9536r6234A38021E1024c73276a80522j0498
10615a91020h2170A67155a0114l71025a89833R2322a1376o2882A05279i0487A49788
10603I4909a46501L3546B3280c11236b3678l581B73804J08346b12990A72963n4842
10592A18121h4406l5496n5266N8041B7089f8482k37056q2792A7709g9139c0188
10580A33953J6791f0841K549p6556A28608a05973d6139j55758j2571a7418k29167
$$ plain form
10661 -125547 -61122 -56312 237520 -150914 -139053 -126352 -110721 -71271 216184 -12149 3720
10649 -34284 -62928 -89521 -111471 118843 35950 291558 -240640 -29860 75540 138597 -223541
10637 195822 -206685 -126333 -362138 46279 97136 -297537 77282 -104537 196404 74653
10626 92585 -5446 -13617 -130061 -120713 -150249 -246483 138021 51024 -373276 -180522 -191020
10615 -191020 -82170 167155 -10114 -381139 -189833 -97511 -11376 -74258 105279 -90487 149788
10603 94909 -146501 -112955 23280 -311236 -23678 -27259 273804 382150 -212990 172963 118121
10592 118121 -84406 -119902 -175168 -117127 27089 -68482 -305538 -388330 17709 -79139 -30188
10580 133953 150744 -60841 -58292 -134848 128608 -105973 -46139 -201897 -214468 -17418 -246585
10569b46585D63072A82422H1762P798l008i6188l6957A02623J84086f2487k9209
10558i1696a6397h163k8965j12106p6705A35088a3633l28638a09255C27535c49024
10546G086J76897b38476P0881K7235d4968j16996k4797A90566h9598j24116k69535
10535d83249f4506F6570f8486o4534c3917F9101b23510p984A26753b25962J8252
10524b07710D05002b26730e8043F618a87430L8756C7887a75859c6266k87883i6467
10512C75847C7684J920a85649e9692n2954A36091o7921d38548A12067l1444a57320
10500c70847c4218k40186P7851i2015l20843A4822K14681I3081P1508c34490A22758
10488B89308m7005a67131P691A67632B2069b37290h5978m3246n5111A95K0514
$$ plain form
10569 -246585 463072 182422 81762 89560 86552 -96188 -133145 102623 286709 -62487 -91696
10558 -91696 -16397 -8163 -37128 -149234 -225939 135088 -13633 -342271 -109255 327535 -349024
10546 7086 183983 -238476 -167595 -140360 -44968 -161964 -186761 190566 -89598 -213714 -483249
10535 -483249 -64506 66570 -68486 -133020 -33917 69101 -223510 -231494 126753 -225962 -207710
10524 -207710 405002 -226730 -58043 6618 -187430 -148674 37887 -175859 -36266 -324149 -96467
10512 375847 37684 39604 -185649 -59692 -112646 136091 68170 -438548 112067 80623 -157320
10500 -370847 -34218 -274404 -196553 -92015 -412858 14822 229503 93081 164589 -334490 122758
10488 289308 242303 -167131 -159440 167632 22069 -237290 -85978 -129224 -184335 195 20709
10477B0709g0394H9628K01271P96M01891j75676j81452d5006k404A3256Q2230
10466I5486j2813N2079a92979j6344A63386J3118a37026A12523k6465c13622A56506
10454d45284f0578j56939J08495I385f5723k61449f768C85101c32774O6209I6251
10442H6931c07572A04824b9018q7323B3882b76123J26185A13938c87838a91625
10431d25731a02342q8081d9027j70696l7992a06725A43759c31963d9280r7632
10421a46912D7165g7621j32954B21809a09411j05087G1599b13443f8408p2134
10411a40542f3162I2162a88301L7022C79020a54818A34534F3216Q325b18560G9000
10399a25147l27319H0688J06057b29493E9283a34432B64230g778E6668M2996J87955
$$ plain form
10477 20709 -70394 89628 290899 291695 693586 517910 336458 -45006 -47410 13256 95486
10466 95486 82673 134752 -192979 -209323 163386 176504 -137026 112523 86058 -313622 156506
10454 -445284 -60578 -217517 -109022 9385 -65723 -327172 -6768 385101 -332774 -266565 96251
10442 86931 -307572 104824 -29018 -116341 23882 -276123 -149938 113938 -387838 -191625
10431 -425731 -102342 -190423 -49027 -219723 -257715 -106725 143759 -331963 -49280 -146912
10421 -146912 47165 -77621 -210575 221809 -109411 -214498 71599 -213443 -68408 -140542
10411 -140542 -63162 92162 -188301 -151279 379020 -154818 134534 63216 71541 -218560 79000
10399 -125147 -452466 80688 186745 -229493 59283 -134432 264230 -7778 56668 99664 287619
10388B87619l2716a16489B92494p3002R9097F8789K61457f394I2956B6639d38678
10376B97355C404K60840j28497M35188j75468m9993L7497A72026J02446J40229
10366D14701n5646m9005Q9340Q3884i877F01973A80248o448j3732K633J23545
10355B86246B6152L1413L70304j02718j0827J07951q0243L05165J15369k57805
10345E04761k35150L724E0957K40884L13775k83806K41308B8413K71999n3999
10335B46413Q4872A5525L08448r6534I3021b3111D45176o6957C1733i33C10398
10323b26060A05796a69004D17438M8542A26916O03b51920A81450F6584a13761
10312A51743l9152a71675b4107D2703f5057B40288I3671K0635L8088E1326c9746
$$ plain form
10388 287619 254903 -116489 292494 219492 318589 68789 330246 -6394 92956 26639 -438678
10376 297355 3404 264244 135747 570935 395467 345474 382971 172026 274472 414701
10366 414701 359055 310050 399390 483274 -9877 601973 180248 173800 160068 162701 286246
10355 286246 26152 57565 427869 325151 314324 422275 342032 647197 762566 504761
10345 504761 269611 273335 50957 291841 605616 321810 563118 28413 300412 246413
10335 246413 331285 15525 323973 227439 93021 -23111 445176 378219 31733 -933 310398
10323 -226060 105796 -169004 417438 465980 126916 127519 -251920 181450 66584 -113761
10312 151743 112591 -171675 -24107 42703 -65057 240288 93671 114306 152394 51326 -39746
10300B09398b00922A3681K6163i0560A36975D547a94776c9171A25023j4964b3386
10288G8480J44221j280g6145J1770j07087I2783c56301A26587o2842g3490I5674
10276h7802k1789A05766m7056p731A6569h1615r6305l1915i4179H7229b43030
10264A77998c0762A47927N9979a4031F624b88292B33887p6409l7813O0845k3355
10253A57155L10959p1959K30673o4318C6354J44989k9869D745c32118f863A00940
10241H3267b36568j726e240B34054a73217j0937A14996e25504F7564J73316A09416
10229d7896J3155A2598f702B4914i8239k17892B01543a65318B9936e1733k8647
10218h0380k39605c2262A03684K9981m1445l653a83415N12D6269f0575D870b77777
$$ plain form
10300 209398 -200922 13681 39844 -90560 136975 4547 -194776 -39171 125023 110059 -23386
10288 78480 222701 221421 -76145 -64375 -171462 92783 -356301 126587 63745 -73490 95674
10276 -87802 -109591 105766 58710 50979 16569 -81615 -177920 -209835 -94179 87229 -243030
10264 177998 -30762 147927 207906 -14031 6624 -288292 233887 157478 119665 180510 157155
10253 157155 468114 396155 626828 562510 36354 181343 151474 4745 -332118 -6863 100940
10241 83267 -236568 -238294 -5240 234054 -173217 -184154 114996 -525504 67564 240880 109416
10229 -47896 -34741 12598 -6702 24914 -98239 -316131 201543 -165318 29936 -51733 -80380
10218 -80380 -319985 -32262 103684 133665 92220 88567 -183415 -182903 46269 -60575 4870 -277777
10205b0151k4090m7841B2207a9752G0836P5924a55670P4109B4147a97399A90608
10193c83377a76228A76164o1906b60591A1517b30761A3129J95335F8110a5111
10182e4820B21894O443a61588k61042A31637c43819B34384b01712P8943j7420
10172a40189f0085E5501i6280A38666a14491A33091b50578d3415q3013C10232
10161a6900p4401B05933o1820j3639a06633F0023b18888Q183o4322J25953B03316
10149a89597i2129F3979g5711J3477j89564d3156n8608D49373a7540I4457c72085
10137d1618b0279B0617b31653p910d0913A46020a65094j11792A92993a73706C30521
10125H5225a94022l06204i5834j07638J5456A23674a63152c2949E9453a96963
$$ plain form
10205 -20151 -44241 -92082 22207 -19752 70836 146760 -155670 -81561 24147 -197399 190608
10193 -383377 -176228 176164 114258 -260591 11517 -230761 13129 208464 68110 -15111
10182 -54820 221894 228337 -161588 -422630 131637 -343819 234384 -201712 -122769 -140189
10172 -140189 -60085 55501 -96280 138666 -114491 133091 -250578 -43415 -126428 310232
10161 -16900 -91301 205933 144113 130474 -106633 60023 -218888 -210705 -275027 -149074 203316
10149 -189597 -92129 63979 -75711 -62234 -251798 -43156 -101764 449373 -17540 94457 -372085
10137 -41618 -20279 20617 -231653 -239563 -40913 146020 -165094 -276886 192993 -173706 330521
10125 85225 -194022 -500226 -95834 -203472 -188016 123674 -163152 -32949 59453 -196963
10114A34443a7400p9367J2862A24007g6262k1495K5059j42026B37913c01749B0883
10102a28408l1062N064k73042a38604k4345j45122C3550J32183a80976A19893
10091a16205A30180e2760B03521a769I8198b88678a17263d0506j22370O2212q0840
10080a81504k13421B5969g8829b2214j42901K4452B51331b52654b4857k92922
10070c17779A80216N2057f0648j84751D4786b84258J37096O7824B02879a55882
10059a16885B2393b4191o1330A37516b09368b7618j57443P0972D3682K245i9072
10047b57730j75146P5390A84335b28623J04343L1057L3498A64205j3953h3798
10036b99981e9120n70340h9842j86038B58945c5739l90239H7034b52222A56322
$$ plain form
10114 134443 -17400 -96767 -83905 124007 -76262 -97757 -72698 -214724 237913 -301749 20883
10102 -128408 -159470 -154406 -427448 -138604 -162949 -308071 33550 165733 -180976 119893
10091 -116205 130180 -52760 203521 -1769 98198 -288678 -117263 -40506 -162876 -100664 -181504
10080 -181504 -394925 25969 -78829 -22214 -165115 -140663 251331 -252654 -24857 -317779
10070 -317779 180216 232273 -60648 -245399 44786 -284258 -147162 -79338 202879 -155882
10059 -116885 22393 -24191 -85521 137516 -209368 -27618 -185061 -114089 43682 45927 -99072
10047 -257730 -432876 -357486 184335 -228623 -124280 -93223 -59725 164205 150252 -83798
10036 -299981 -59120 -629460 -89842 -275880 258945 -35739 -425978 87034 -252222 156322
10025c22902D9460L0540c38466f7942C4869a48364F8695g941A15335b7992k94360
10014c22352O535A19272B5979a32850m8353b9305B01204a16761e8369n8977A12189
10002a74042l0796r2899A95895d65818A60263G9137a10077d5882j87843f4728
9991f9910A32565d6737j13453a9977m4841j05477f8430j4120B8312a60356j35015
9980b95371a04088j17445A54986m6019P5807J67767F0467P4582D6937L70030a2054
9968c92195B64550b49897j07781J21830a14695k83015g0164m35397a11549g675
9957A5557e7520F9372c7951j51084O9244e604q5914D4096a86008I5062b78253
9945c97436E7412d21704a61748k24381B40232a8400O670j45178A41201e4497A07495
$$ plain form
10025 -322902 49460 80000 -338466 -67942 34869 -148364 68695 -7941 115335 -27992 -322352
10014 -322352 -315817 119272 25979 -132850 -181203 -29305 201204 -116761 -58369 -117346 112189
10002 -174042 -204838 -297737 195895 -465818 160263 79137 -110077 -45882 -233725 -64728
9991 -69910 132565 -46737 -160190 -19977 -64818 -170295 -68430 -82550 28312 -160356 -295371
9980 -295371 -104088 -221533 154986 108967 184774 352541 60467 135049 46937 416967 -12054
9968 -392195 264550 -249897 -357678 -235848 -114695 -397710 -70164 -505561 -111549 -7675
9957 15557 -57520 69372 -37951 -189035 -119791 -5604 -91518 44096 -186008 95062 -278253
9945 -397436 57412 -421704 -161748 -386129 240232 -18400 -11730 -156908 141201 -54497 107495
9933b28532b4950k2648a7709B11448i9676a5869k32855j4420M2159A28940b31674
9921A55189a43769j63835B40553h7232J3650j32056o1264P9117E2621b18072o7789
9910b85861A8676O6469b44960L7271A71753J78727a00749B15829a6800D081g4032
9898G5314d1964j33571g780j1327A71056c43545b6941k40840g5609m8419K9904
9887i4124A43146a18129j10827b3178A50222M5772i0794A3910a47247E5749h5997
9875A39234i4690r4718m2164Q6418K7457j35514i5320A19809A4699M55778a72202
9863a76797B99789b79939H7232J75440D1965a75599P6964b0315B46662G2321b99504
9851a753j03232k87452G8285d38776G9956b12391C3693b37396j15394A7004N7694
$$ plain form
9933 -228532 -24950 -47598 -17709 211448 -99676 -15869 -248724 -263144 -220985 128940 -231674
9921 155189 -143769 -307604 240553 -87232 -73582 -205638 -266902 -187785 52621 -218072 -285861
9910 -285861 18676 85145 -244960 -207689 171753 350480 -100749 215829 -16800 4081 -74032
9898 75314 -41964 -175535 -7780 -19107 171056 -343545 -26941 -267781 -75609 -124028 -94124
9887 -94124 143146 -118129 -228956 -23178 150222 195994 -90794 13910 -147247 55749 -85997
9875 139234 -94690 -189408 -231572 -145154 -117697 -253211 -95320 119809 14699 470477 -172202
9863 -176797 299789 -279939 87232 262672 41965 -175599 -98635 -20315 246662 72321 -299504
9851 -1753 -104985 -392437 78285 -438776 79956 -212391 33693 -237396 -352790 17004 74698
9840G4698J4123J1761b91366K9438g9639n5584B3150b18251B10097A2283J26744
9829A39027E9052c49579e3776j25219k69013A24234F0542a8490C69545c09098
9818D5325A2511c6593A06246a73717j15212f1790j00118F6000e636j73230N1559
9807a27307e6947j72884b3001o1857l09950E1804b57144J24694f4853j9074b7765
9795C30467C5422b38400O3779D3248b18468I6035b28371K5772H1317J26581c29473
9783a05341A98533D4203a59365b8957l4810n00704h9786p3439a8106k35145a07016
9771d320A23036a55842l04861b01178B97815A41513a8096j29251c1102B5505b62663
9759A76557a74023l2083f7048j09769A17678c9627D61940A63918b12474a01115
$$ plain form
9840 74698 88821 100582 -291366 -261928 -79639 -135223 23150 -218251 210097 12283 139027
9829 139027 59052 -349579 -53776 -178995 -448008 124234 60542 -18490 369545 -309098
9818 45325 12511 -36593 106246 -173717 -288929 -61790 -161908 66000 -5636 -178866 -127307
9807 -127307 -56947 -229831 -23001 -84858 -394808 51804 -257144 -132450 -64853 -83927 -27765
9795 330467 35422 -238400 -174621 43248 -218468 96035 -228371 -202599 81317 207898 -329473
9783 -105341 198533 44203 -159365 -28957 -63767 -564471 -89786 -163225 -18106 -253251 -107016
9771 -4320 123036 -155842 -460703 -201178 297815 141513 -18096 -147347 -31102 25505 -262663
9759 176557 -174023 -206106 -67048 -176817 117678 -39627 461940 163918 -212474 -101115
9748H3442b91693e7355B55332b68595J25869N101n0861A56891E1352i4813c49
9736b14718e6992E3774a62259q0897I7674M5043l8256J53008j24742b63232A84524
9724a58118A1856J79583a62676E1237J01643B3559K4200j2824b30292A99696b50815
9712a59965B1618a85398B07115G3438c1409A10429e8317k8868j54003j56298g9488
9700a85002J5828M7508k03926J56134C1201A2613Q8382b4578D1451a69774k06358
9689c76132B68029d28815A27638i8958j57178M3633p375H6967A3299a10063k49724
9678c59787h5426A41855b841B00617f3299B94776c93102a94204k7712a9334j40987
9667a60321A4424b0974F6153e6722A30048B6546a92974f1738a4230j36024A49378
$$ plain form
9748 83442 -291693 -57355 255332 -268595 -142726 -137625 -188486 156891 51352 -94813 -349
9736 -214718 -56992 53774 -162259 -243156 97674 142717 104461 257469 132727 -263232 184524
9724 -158118 11856 191439 -162676 51237 152880 23559 47759 34935 -230292 199696 -250815
9712 -159965 21618 -185398 207115 73438 -31409 110429 -58317 -87185 -241188 -397486 -79488
9700 -185002 -169174 -121666 -325592 -169458 31201 12613 100995 -24578 41451 -169774 -376132
9689 -376132 268029 -428815 127638 -98958 -256136 -212503 -219878 86967 13299 -110063 -359787
9678 -359787 -85426 141855 -2841 200617 -63299 294776 -393102 -194204 -221916 -19334 -160321
9667 -160321 14424 -20974 66153 -56722 130048 26546 -192974 -61738 -14230 -150254 149378
9655I9981i9754b5995k75700p5802a4862j12603B06246E1442J44501K7521b95230
9643B3954e2245C10624D2173b91833A0796h7195A20950a49266D43439b71564a34506
9631a23928L5780j05471L5523O5040F0770b40394e4026q5809C6714c26844a17116
9619i9802B515N1688k6301P0472b84787h3527o7872G7480k1636K55400a3061n3614
9607f6675J1763J7275j13330E1828k3317i3091B96938a92351C34269a67404E1694
9595e1826j19832A83859I0129O8878a61118N9721K0131n1764C0123N6243a41111
9583a45913E5288b27056A0202O6420a70334k0600M3952C358J4864a54470A87522
9571c6576j08332n8255N1566O072d2878F7078j7692a44490C1718N5579a15404
$$ plain form
9655 99981 -99754 -25995 -301695 -377497 -14862 -127465 206246 51442 195943 223464 -295230
9643 23954 -52245 310624 42173 -291833 10796 -87195 120950 -149266 443439 -271564 -134506
9631 -123928 -88148 -193619 -158096 -93056 60770 -240394 -54026 -139835 36714 -326844 -117116
9619 -99802 2515 54203 27902 98374 -284787 -83527 -151399 77480 55844 311244 -13061 -66675
9607 -66675 -54912 -37637 -150967 51828 28511 -93091 296938 -192351 334269 -167404 51694
9595 -51826 -171658 183859 90129 159007 -161118 -101397 -81266 -133030 30123 86366 -141111
9583 -145913 55288 -227056 10202 76622 -170334 -190934 -146982 3358 18222 -154470 187522
9571 -36576 -144908 -203163 -151597 -145525 -42878 67078 49386 -144490 31718 87297 -115404
9559a63901C740J21771a67444m3773L0565A52991b5828A36500J04840c20769a11927
9547e7994c656l21103H9241b82558A52203a59345d6003B4613b4454M671M275j27595
9535a43103B2509c7957D10162G5727a22788n3842n0206i6406O333F5183g6972
9523B731a38004k31934a39122k35873a58067k09643i7808A2722g3679n7294A59840
9511A46602K87055a76953f305F7544a06925M0724Q995K7999j45607G7908B378
9499a13701F1825c97526a07009M2506j79691I5553a9971k20937b1933m8281c4337
9487A53040d08710B57861J65761a57095O0258c4068l888A21939m6669J38496K4287
9476B38053A06433f1294l15950a85303j79292A58569f2954q0723j38089h2365
$$ plain form
9559 -163901 3740 125511 -167444 -211217 -180652 152991 -25828 136500 241340 -320769 -111927
9547 -57994 -3656 -324759 89241 -282558 152203 -159345 -46003 24613 -24454 -19783 -15508 -143103
9535 -143103 22509 -37957 410162 75727 -122788 -176630 -226836 -96406 -90073 65183 -76972
9523 2731 -138004 -369938 -139122 -374995 -158067 -367710 -97808 12722 -73679 -130973 159840
9511 146602 433657 -176953 -6305 67544 -106925 -66201 -57206 -29207 -174814 77908 2378
9499 -113701 61825 -397526 -107009 -64503 -244194 95553 -19971 -240908 -21933 -70214 -34337
9487 153040 -408710 257861 423622 -157095 -96837 -34068 -37956 121939 75270 213766 238053
9476 238053 106433 -61294 -377244 -185303 -364595 158569 -62954 -143677 -281766 -82365
9465c3801k44425J13112r4465d6522k34269A45468F7693a50341A2802K46959L9422
9454B99183A48940j3151F1405P3860c78137J56311Q0618J2957f1479c139A16822
9442c08278g4533e230I6475a88799C1998b62968h6883C5740j2770b16274L0281
9431a85993c9825l52088M0696a56822l6774B95712B777g7836B03016a90414I8203
9419D8107a86793A04672B6580c9038j15705o1078B14241k8162c2715j54723E7827
9407A09117B4561J64665G6502c23258k3842c9906k89622C68394c56358b878A97201
9395i2556j27347J04652M850B00690b05140e5236k60438i7303j73553k69977B65768
9383A53863o8798C9112a91028j28632c6192B26314c31533m8728a9261A1358J8289
$$ plain form
9465 -33801 -278226 -165114 -259579 -46522 -280791 145468 67693 -150341 12802 259761 299183
9454 299183 148940 135789 61405 135265 -378137 -221826 -141208 -128251 -61479 -3139 116822
9442 -308278 -74533 -5230 96475 -188799 31998 -262968 -86883 35740 22970 -216274 -185993
9431 -185993 -39825 -391913 -351217 -156822 -193596 295712 2777 -77836 203016 -190414 98203
9419 48107 -186793 104672 26580 -39038 -154743 -215821 214241 186079 -32715 -187438 57827
9407 109117 24561 189226 76502 -323258 -347100 -39906 -329528 368394 -356358 -2878 197201
9395 -92556 -219903 -115251 -110401 200690 -205140 -55236 -315674 -97303 -270856 -540833 265768
9383 153863 85065 39112 -191028 -319660 -36192 226314 -331533 -380261 -19261 11358 29647
9372B9647J8180j2788L5536d0400k1001A69326b4256j10668J7353c6122H6435
9360f4742j02642m0089f7611A16172h5042F4386c89631i5628k8662R343r1247
9349b06194A95016r4595a50940A1778L195P6144b86749P5228B25638b24750D820
9337B0334E499b71863a16014A71744a03200A90468D0333d9161H7689b50635J20272
9326a30363A56270a54055m0022g8277p6215r4158c3023C48360j36587b25317J8358
9315b06959d744B77584g2048k15968C1362J47605D6675d3658l7155C0299b54153
9303c15365e3046A6042Q9232b66822e4159j50997I6141P5654a88306j50100J44404
9292a94002h7924k7106K1861o9920j95802A27661a97281f3294A23122c86009b5964
$$ plain form
9372 29647 47827 35039 70575 -40400 -61401 169326 -24256 -134924 -117571 -36122 86435
9360 -64742 -167384 -207473 -67611 116172 -85042 64386 -389631 -95628 -124290 -114947 -206194
9349 -206194 195016 100421 -150940 11778 14973 91117 -286749 -211521 225638 -224750 4820
9337 20334 5499 -271863 -116014 171744 -103200 190468 40333 -49161 87689 -250635 -130363
9326 -130363 156270 -154055 -194077 -78277 -154492 -248650 -33023 348360 211773 -225317 -206959
9315 -206959 -4744 277584 -72048 -288016 31362 178967 46675 -43658 -80813 30299 -254153
9303 -315365 -53046 16042 105274 -266822 -54159 -205156 96141 171795 -188306 -338406 -194002
9292 -194002 -87924 -115030 -93169 -163089 -358891 127661 -197281 -63294 123122 -386009 -25964
9280b30699l11625H9213a38914L0183l9627B84908a25772j17858r50D6259a35816
9268A65217P5619I2246b02234a0414B07473a95531g2461B51419h535j95052A76639
9256F6701i6406k5545N8276C7035A5401a41297D7340a92742j45881a09776b4884
9244a28062A17493a69911C3550J29722J01504b14329i088m1536d378I6409c20464
9232c31204a14905j99858F514L2314J72958b76258k01236a12281H8037p305a0775
9220a37421D3423d05109H981a29371j05918d7099J6839j16458m627j28816a24138
9208H9663a14190N2023j09026k6798h1221j3518B0970b43515A23239a62767p5459
9197b38226D0876b67581A22804f2602A57514b60957A8554b92911j1156C77334
$$ plain form
9280 -230699 -542324 89213 -138914 -108731 -148358 284908 -125772 -243630 -244580 46259 -135816
9268 165217 240836 92246 -202234 -10414 207473 -195531 -72461 251419 -8535 -203587 176639
9256 66701 -96406 -121951 -63675 37035 15401 -141297 47340 -192742 -338623 -109776 -24884
9244 -128062 117493 -169911 33550 163272 264776 -214329 -9088 -50624 -4378 96409 -320464
9232 -331204 -114905 -314763 6514 38828 211786 -276258 -477494 -112281 88037 80732 -10775
9220 -137421 43423 -405109 8981 -129371 -235289 -47099 -30260 -146718 -151345 -280161 -124138
9208 89663 -114190 -62167 -171193 -197991 -81221 -94739 20970 -243515 123239 -162767 -238226
9197 -238226 40876 -267581 122804 -62602 157514 -260957 18554 -292911 -304067 377334
9186g0532I647e14756C35193I670K7210c47886J01579J21627A7102a54166a7886
9174i9821j49270a4207j15370B31305d33925f1881j2503q3891k9720j89911F5708
9162a03662j75739e8101C29968b17278C3459a17742E5470f6230k2715K2072A8961
9150a89699C034c10127G1947f8735j92945I7229B5033K43448H8771c05289f3477
9138c31558j62613J02337c2822D6639O9467n3063a47809L2384M2422K0700j39917
9127a92220a1226j28723I4881e4372l7965j83201O6182B09736E1860O2919R7601
9116B12380b46095C0173K57659a60886j63182G4793J2450J46919a00223k64250
9106c64473n2262I0646J2691a48745G5155a03013a0881k35974A5751g8611L409
$$ plain form
9186 -70532 9647 -514756 335193 9670 36880 -347886 -246307 -124680 17102 -154166 -17886
9174 -99821 -249091 -14207 -129577 231305 -433925 -61881 -74384 -158275 -187995 -377906 65708
9162 -103662 -279401 -58101 329968 -217278 33459 -117742 55470 -66230 -88945 -66873 18961
9150 -189699 3034 -310127 71947 -68735 -261680 97229 25033 268481 88771 -305289 -63477
9138 -331558 -494171 -391834 -32822 46639 116106 63043 -147809 -115425 -73003 -52303 -192220
9127 -192220 -11226 -139949 94881 -54372 -92337 -275538 -209356 209736 51860 114779 212380
9116 212380 -246095 30173 287832 -160886 -324068 74793 87243 234162 -100223 -364473
9106 -364473 -416735 90646 103337 -148745 75155 -103013 -10881 -246855 15751 -78611 -75202
9095g5202l78352c0505A3005a92674o2886a24082n9762M673C0627a54138r3339
9084b47477I8358K48525D2413o867b18784a7656m78223b1141j93770g1565k91022
9073c62587J15450a14521A17616g5610k68217A52527b05569k2921A19527b21570
9062A05372b56084B10382b8859B48033f4636e939m2734p0019A39064g8757I0208
9050b6237l38406h4918B08746q367I4329a61381O9899D1769b65769I3928b6066
9038c17424A0843b04799j9001A11005e76510b13301o1042c3257A51983l8651c9196
9026h8837j51984a18570l5878A0191a15585A57074b52147H9995a9033A95185D2052
9014f8485J2588q2275K0477G9411a09758j45624j5719A21505d41377C951K7607
$$ plain form
9095 -75202 -453554 -30505 13005 -192674 -255560 -124082 -183844 -179171 30627 -154138 -247477
9084 -247477 98358 346883 42413 35546 -218784 -17656 -495879 -21141 -214911 -71565 -362587
9073 -362587 -247137 -114521 117616 -75610 -343827 152527 -205569 -228490 119527 -221570
9062 105372 -256084 210382 -28859 248033 -64636 -5939 -48673 -118692 139064 -78757 90208
9050 -26237 -364643 -84918 208746 200379 94329 -161381 -91482 41769 -265769 93928 -26066
9038 -317424 10843 -204799 -223800 111005 -576510 -213301 -274343 -33257 151983 113332 -39196
9026 -88837 -240821 -118570 -154448 10191 -115585 157074 -252147 89995 -19033 195185 42052
9014 -68485 -55897 -138172 -117695 79411 -109758 -255382 -271101 121505 -441377 3951 31558
9003C1558a55387C4329b23222G8830f6123N146j28550j67279a36002k009J6850
8992a21161b3447A34984f5753G0297K3118o212b3649k65980B20081C0896a59262
8980a7816j76027Q8768k13400h2704A49955n8612J10753b19824P7116N616j05041
8969b42133k3922e1906A31448O9364a86532B61478g628r0227L5722p1155k12147
8958c45435h4528K4074m01430j055J86917B6240c61900J06347c0176k46128M3339
8947b32965a03496A14768b5544k16433E4402q159b5169k33036F9409k0502R1812
8936A40719o0037l3042a90751F4053J00479B5548J73989I3559i0548C3241b978
8924B06707a09754L9564B22617J114731K557571P369453m073195B048207I20427
$$ plain form
9003 31558 -155387 34329 -223222 78830 -66123 -60977 -189527 -356806 -136002 -138011 -121161
8992 -121161 -23447 134984 -65753 70297 93415 87203 -23649 -289629 220081 30896 -159262
8980 -17816 -193843 -105075 -318475 -82704 149955 91343 202096 -219824 -142708 -137092 -242133
8969 -242133 -266055 -51906 131448 200812 -186532 261478 -7628 -97855 -62133 -133288 -345435
8958 -345435 -84528 -60454 -461884 -462939 -276022 26240 -361900 -255553 -30176 -276304 -232965
8947 -232965 -103496 114768 -25544 -241977 54402 46243 -25169 -258205 69409 48907 140719
8936 140719 80682 47640 -190751 64053 164532 25548 199537 93559 -90548 33241 -2978
8924 206707 -109754 -70190 222617 1337348 3894919 11264372 7191177 2048207 920427
8914E76996r9765H9673K57144B7861K05172e4364m55870B141O7320K98911c12413
8902I2962d311p0749A20908E5966i9343H7832J5629b18108l5940L397B5204c72994
8889a59948R541d0249A19927a51886p4119G3769o553f6914B45314d7986A36409
8877f9236A72268J08907d9744j85068B6074a103k2670F5018J21949a31635N7887
8866g3748G039e716A41774a39695D425b96036N5784A05008b37752r4312A11371
$$ plain form
8914 576996 477231 89673 346817 27861 233033 -54364 -510234 2141 69461 368372 -312413
8902 92962 -4311 -75060 120908 55966 -99343 87832 103461 -218108 -254048 -250651 25204 -372994
8889 -159948 -150407 -40249 119927 -151886 -226005 73769 67216 -66914 245314 -47986 136409
8877 -69236 172268 281175 -49744 -234812 26074 -1103 -23773 65018 186967 -131635 -73748
8866 -73748 7039 -5716 141774 -139695 4425 -296036 -240252 105008 -237752 -332064 111371
$$ [...]
##END NTUPLES=NMR SPECTRUM
##END=
