
##TITLE=AC1207_MCiAH12041_7160663_rmRSlF5kEr
##JCAMPDX= 6.0         $$ Bruker NMR JCAMP-DX V2.0
##DATA TYPE= NMR SPECTRUM
##DATA CLASS= NTUPLES
##ORIGIN= BRUKER
##OWNER= Administrator
$$ 1.72 TOPSPIN		Version 2.1
$$ 2012-12-01 02:15:29.591 -0500  Administrator@X
$$ Compression mode = diff/dup
##.OBSERVE FREQUENCY= 400.02188249412
##.OBSERVE NUCLEUS= ^1H
##.ACQUISITION MODE= SIMULTANEOUS (DQD)
##.ACQUISITION SCHEME= undefined
##.AVERAGES= 64
##.DIGITISER RES= 22
##SPECTROMETER/DATA SYSTEM= spect
##.PULSE SEQUENCE= noesygpps1d.comp
##.SOLVENT NAME= COFFEE_meoh
##.SHIFT REFERENCE= INTERNAL, COFFEE_meoh, 1, 14.96265
##AUDIT TRAIL= $$ (NUMBER, WHEN, WHO, WHERE, PROCESS, VERSION, WHAT)
$$ ##TITLE= Audit trail, TOPSPIN		Version 2.1
$$ ##JCAMPDX= 5.01
$$ ##ORIGIN= Bruker BioSpin GmbH
$$ ##OWNER= Administrator
$$ $$ E:\/data/COFFEE/nmr/AC1207_MCiAH12041_7160663_rmRSlF5kEr/22/pdata/1/auditp.txt
$$ ##AUDIT TRAIL=  $$ (NUMBER, WHEN, WHO, WHERE, PROCESS, VERSION, WHAT)
(   1,<2012-12-01 02:15:23.184 -0500>,<Administrator>,<X>,<go>,<TOPSPIN 2.1>,
      <created by zg
	started at 2012-12-01 02:03:48.550 -0500,
	POWCHK enabled, PULCHK disabled,
       configuration hash MD5:
       86 BA 57 50 F2 9D 5C 9B 26 00 A9 28 5F 66 2E 89
       data hash MD5: 64K
       7E F7 28 6C 24 17 87 0C 2A 7B AB 12 40 DF 3A E2>)
(   2,<2012-12-01 02:15:26.467 -0500>,<Administrator>,<X>,<proc1d>,<TOPSPIN 2.1>,
      <Start of raw data processing
       efp LB = 0.3 FT_mod = 6 PKNL = 1 PHC0 = 0 PHC1 = 0 SI = 128K 
       data hash MD5: 128K
       87 59 24 18 A0 20 7B 21 04 35 7E A2 79 35 49 30>)
(   3,<2012-12-01 02:15:27.672 -0500>,<Administrator>,<X>,<proc1d>,<TOPSPIN 2.1>,
      <pk PHC0 = -80.98572 PHC1 = 0 
       data hash MD5: 128K
       EF 20 D1 AB 3A 86 9C DC 62 1C 4D BB 47 01 E9 76>)
(   4,<2012-12-01 02:15:28.434 -0500>,<Administrator>,<X>,<proc1d>,<TOPSPIN 2.1>,
      <abs ABSG = 1 
       data hash MD5: 128K
       7E 8D B1 CC A8 88 01 EA 5D 13 13 04 A3 51 1E 36>)
(   5,<2012-12-01 02:15:28.656 -0500>,<Administrator>,<X>,<proc1d>,<TOPSPIN 2.1>,
      <abs ABSG = 2 
       data hash MD5: 128K
       32 45 71 8A 1C 69 FA E4 55 E8 9A 63 8C 7A 4A 97>)
(   6,<2012-12-01 02:15:28.814 -0500>,<Administrator>,<X>,<proc1d>,<TOPSPIN 2.1>,
      <abs ABSG = 3 
       data hash MD5: 128K
       75 E0 78 BE A6 0D DD AE D0 6E 53 92 08 D5 F5 B2>)
(   7,<2012-12-01 02:15:29.036 -0500>,<Administrator>,<X>,<proc1d>,<TOPSPIN 2.1>,
      <abs ABSG = 4 
       data hash MD5: 128K
       0B 21 4E 76 C6 BA D6 DF 83 37 6E 18 A0 54 A9 59>)
(   8,<2012-12-01 02:15:29.242 -0500>,<Administrator>,<X>,<proc1d>,<TOPSPIN 2.1>,
      <abs ABSG = 5 
       data hash MD5: 128K
       ED C2 E8 41 49 33 3C E7 F7 64 73 13 99 A0 24 77>)
$$ ##END=
$$ 
$$ $$ hash MD5
$$ $$ 54 0E 10 89 D6 34 C0 6C 82 C4 99 0E 5D 51 77 67
##$RELAX= 
##$RELAX= 
##$RELAX= 
##$RELAX= 
##$RELAX= 
##$RELAX= 
##$RELAX= 
##$RELAX= 
$$ Bruker specific parameters
$$ --------------------------
##$DU= <E:\>
##$EXPNO= 22
$$ [...]
##$TP07= 0
##$TPNAME0= <>
##$TPNAME1= <>
##$TPNAME2= <>
##$TPNAME3= <>
##$TPNAME4= <>
##$TPNAME5= <>
##$TPNAME6= <>
##$TPNAME7= <>
##$TPOAL= (0..7)
0.5 0.5 0.5 0.5 0.5 0.5 0.5 0.5
##$TPOFFS= (0..7)
0 0 0 0 0 0 0 0
##$TUNHIN= 0
##$TUNHOUT= 0
##$TUNXOUT= 0
##$USERA1= <user>
##$USERA2= <user>
##$USERA3= <user>
##$USERA4= <user>
##$USERA5= <user>
##$V9= 5
##$VALIST= <valist>
##$VCLIST= <CCCCCCCCCCCCCCC>
##$VD= 0
##$VDLIST= <DDDDDDDDDDDDDDD>
##$VPLIST= <PPPPPPPPPPPPPPP>
##$VTLIST= <TTTTTTTTTTTTTTT>
##$WBST= 1024
##$WBSW= 4
##$XGAIN= (0..3)
0 0 0 0
##$XL= 0
##$YL= 0
##$YMAX_a= 7929881
##$YMIN_a= -17120843
##$ZGOPTNS= <>
##$ZL1= 120
##$ZL2= 120
##$ZL3= 120
##$ZL4= 120
##$ABSF1= 14.96265
##$ABSF2= -5.595531
##$ABSG= 5
##$ABSL= 3
##$ALPHA= 0
##$AQORDER= 0
##$ASSFAC= 0
##$ASSFACI= 0
##$ASSFACX= 0
##$ASSWID= 0
##$AUNMP= <proc_prof1d_extract.lims>
##$AXLEFT= 0
##$AXNAME= <>
##$AXNUC= <1H>
##$AXRIGHT= 0
##$AXTYPE= 0
##$AXUNIT= <>
##$AZFE= 0.1
##$AZFW= 0.1
##$BCFW= 0
##$BC_mod= 0
##$BYTORDP= 0
##$COROFFS= 0
##$CY= 15
##$DATMOD= 1
##$DC= 0
##$DFILT= <>
##$DTYPP= 0
##$F1P= 0
##$F2P= 0
##$FCOR= 0.5
##$FTSIZE= 131072
##$FT_mod= 6
##$GAMMA= 0
##$GB= 0
##$INTBC= 1
##$INTSCL= 1
##$ISEN= 128
##$LB= 0.3
##$LEV0= 0
##$LPBIN= 0
##$MAXI= 10000
##$MC2= 0
##$MEAN= 0
##$ME_mod= 0
##$MI= 0
##$NCOEF= 0
##$NC_proc= -2
##$NLEV= 6
##$NOISF1= 0
##$NOISF2= 0
##$NSP= 0
##$NTH_PI= 0
##$NZP= 0
##$OFFSET= 14.96265
##$PC= 1
##$PHC0= -80.98572
##$PHC1= 0
##$PH_mod= 1
##$PKNL= yes
##$PPARMOD= 0
##$PPDIAG= 0
##$PPIPTYP= 0
##$PPMPNUM= 2147483647
##$PPRESOL= 1
##$PSCAL= 4
##$PSIGN= 0
##$PYNMP= <proc.py>
##$REVERSE= no
##$SF= 400.020008976475
##$SI= 131072
##$SIGF1= 0
##$SIGF2= 0
##$SINO= 400
##$SIOLD= 131072
##$SPECTYP= <>
##$SREGLST= <1H.CDCl3>
##$SSB= 0
##$STSI= 131072
##$STSR= 0
##$SW_p= 8223.68421052631
##$SYMM= 0
##$S_DEV= 0
##$TDeff= 65536
##$TDoff= 0
##$TI= <>
##$TILT= no
##$TM1= 0
##$TM2= 0
##$TOPLEV= 0
##$USERP1= <user>
##$USERP2= <user>
##$USERP3= <user>
##$USERP4= <user>
##$USERP5= <user>
##$WDW= 1
##$XDIM= 131072
##$YMAX_p= 429848894
##$YMIN_p= -12301
##$CURPLOT= <Network HP LaserJet P1505>
##$CURPRIN= <$Network HP LaserJet P1505>
##$DFORMAT= <normdp>
##$LAYOUT= <+/1D_H.xwp>
##$LFORMAT= <normlp>
##$PFORMAT= <normpl>
##$SURQMSG= 1
$$ End of Bruker specific parameters
$$ ---------------------------------
##NTUPLES= NMR SPECTRUM
##VAR_NAME=  FREQUENCY,     SPECTRUM/REAL,   SPECTRUM/IMAG
##SYMBOL=    X,             R,               I
##VAR_TYPE=  INDEPENDENT,   DEPENDENT,       DEPENDENT
##VAR_FORM=  AFFN,          ASDF,            ASDF
##VAR_DIM=   131072,        131072,          131072
##UNITS=     HZ,            ARBITRARY UNITS, ARBITRARY UNITS
##FACTOR=    0.0627417313425164, 1,          1
##FIRST=     8223.62146879497, -286,         -66901
##LAST=      0,             1618,            -67905
##MIN=       0,             -12301,          0
##MAX=       8223.62146879497, 429848894,    0
$$ Real data points
##PAGE= N=1
##DATA TABLE= (X++(R..R)), XYDATA
$$ [...]
61002A000267K4999K8982L2555L6424M1435M6778N0901N3753N6591N9917O3506
60991A496108O8072P4897Q3774R3422J03961J16880J32204J47864J62566J77596
60981B657344J95602K19622K53795L02645L68832M53451N58875O88637Q43922
60972F542725J023276J226850J457780J719161K014225K345757K694350K976931
60964B2001055L037670K724277K016063J085842K17056l59909n67322m53613j21118
60955B9580001K91273N86939N50320P0081p61198j685185k431674k854555k954883
60946B0391119k816794k538745k201784j862451j552193j282309j054109q65914
60938F216820p13392n89570m88262m06469l42586k94046k57440k29403k06566
$$ y = [1000267, 1025266, 1054248, 1086803, 1123227, 1164662, 1211440, 1262341, 1316094, 1372685, 1432602, 1496108, 1564180, 1639077, 1722851, 1816273, 1920234, 2037114, 2169318, 2317182, 2479748, 2657344, 2852946, 3072568, 3326363, 3629008, 3997840, 4451291, 5010166, 5698803, 6542725, 7566001, 8792851, 10250631, 11969792, 13984017, 16329774, 19024124, 22001055, 25038725, 27763002, 29779065, 30864907, 31081963, 30722054, 30154732, 29701119, 29580001, 29871274, 30458213, 31008533, 31078614, 30317416, 28632231, 26200557, 23346002, 20391119, 17574325, 15035580, 12833796, 10971345, 9419152, 8136843, 7082734, 6216820, 5503428, 4913858, 4425596, 4019127, 3676541, 3382495, 3125055, 2895652, 2689086]
60929B689086j86205j67643j51766j38579j26489j14312j02435r1445q1089p1488
60919A457635o3995n9742n8128n7556n6845n5266n2247m8039m3828m0208l6335
60908H85446l1464k6505k2887k0502j8112j5387j3216j2000j0938r260p173n234
60896F92768l604k276j307n24N47K043L488M419M901N192N335N348N332N072L899
60881G30633J429j700m328n933p062q601j0817j3176j4902j5661j5710j5388j4650
60868F04134j3310j1572r972q720p516o170n001m288l699k651j015P94K318L320
60854E36652L834M274N326P214R207J0303J0443J0626J1860J4317J7434K0353
60842F61843K2207K2518K1579K0205J8982J7985J7152J6400J5314J3230R977O202
$$ y = [2689086, 2502881, 2335238, 2183472, 2044893, 1918404, 1804092, 1701657, 1610212, 1529123, 1457635, 1393640, 1333898, 1275770, 1218214, 1161369, 1106103, 1053856, 1005817, 961989, 921781, 885446, 853982, 827477, 804590, 784088, 765976, 750589, 737373, 725373, 714435, 705175, 698002, 692768, 689164, 686888, 685581, 685057, 685604, 687647, 691135, 695554, 700455, 705647, 710982, 716330, 721662, 726734, 730633, 732062, 730362, 726034, 720101, 713039, 704438, 693621, 680445, 665543, 649882, 634172, 618784, 604134, 590824, 579252, 569280, 560560, 553044, 546874, 541873, 537585, 533886, 531235, 530220, 531014, 533332, 536652, 540486, 544760, 550086, 557300, 566507, 576810, 587253, 597879, 609739, 624056, 641490, 661843, 684050, 706568, 728147, 748352, 767334, 785319, 802471, 818871, 834185, 847415, 857392, 863594]
60830H63594K772J32j531k062j637j016j048k033l715n646p334q398r022r951
60816H13105j1618j3473j4594j4860j4985j5479j6027j6035j5331j4146j2708
60805F53849j1160r706q570p787p099o202n089m036l168k170o43J242K807L645
60791E95913M108M851O112P635R112J0474J1767J2933J3768J4100J4056J4007
60779G18836J4087J3930J3172J2066J1165J0520R787R033Q744Q868Q660P856P230
60766H53954P398P788P523O849O656O920O600N156L273J851R50P9r60j895k434
60751I09708k549k427k271k177k129k180k473l042l698m237m647n033n563o566
60737H60716q225j0046j1081j0985j0422r962r221p655n754m547m122l596k593
$$ y = [863594, 866366, 866498, 864967, 862905, 861268, 860252, 859204, 857171, 853456, 847810, 840476, 832078, 823056, 813105, 801487, 788014, 773420, 758560, 743575, 728096, 712069, 696034, 680703, 666557, 653849, 642689, 632983, 624413, 616626, 609527, 603325, 598236, 594200, 591032, 588862, 588219, 589461, 592268, 595913, 600021, 604872, 610984, 618619, 627731, 638205, 649972, 662905, 676673, 690773, 704829, 718836, 732923, 746853, 760025, 772091, 783256, 793776, 803563, 812596, 821340, 830208, 838868, 846724, 853954, 861352, 869140, 876663, 883512, 890168, 897088, 903688, 908844, 912117, 913968, 914918, 914997, 914037, 912142, 909708, 907159, 904732, 902461, 900284, 898155, 895975, 893502, 890460, 886762, 882525, 877878, 872845, 867282, 860716, 852491, 842445, 831364, 820379, 809957, 799995, 790774, 783119, 777365, 772818, 768696, 765100, 762507]
60724G62507j848k076l003l951m710n335n540m922l678k579k114k036j799j212
60710G17704m39M83J721L131L999L732K682J837J701J897J934J667R39n60k649
60695G39779m509n737o953q827j1005j2679j3753j4602j5076j4730j3830j3179
60683F04899j2959j2583j1769j0925j0300r631q822q223p856p113n645m000k841
60670D92232k001p89R43K575L492L745L873M230M622M691M543M668N150N405N025
60655E42404M505M578N145N499N416N359N635O024O367O871P666Q486Q989R077
60641F32021Q811Q331P915P793P959Q396R283J0669J2193J3535J4813J6120J7012
60628G74851J7155J7027J7130J6855J5213J2454R782P482M563N84l426o415q629
$$ y = [762507, 760659, 758583, 755580, 751629, 746919, 741584, 736044, 731122, 727444, 724865, 722751, 720715, 718916, 717704, 717265, 717748, 719469, 722600, 726599, 730331, 733013, 734850, 736551, 738448, 740382, 742049, 742988, 742428, 739779, 735270, 729533, 722580, 713753, 702748, 690069, 676316, 661714, 646638, 631908, 618078, 604899, 591940, 579357, 567588, 556663, 546363, 536732, 527910, 519687, 511831, 504718, 499073, 495073, 492232, 490231, 489442, 490385, 492960, 496452, 500197, 504070, 508300, 512922, 517613, 522156, 526824, 531974, 537379, 542404, 546909, 551487, 556632, 562131, 567547, 572906, 578541, 584565, 590932, 597803, 605469, 613955, 622944, 632021, 640832, 649163, 657078, 664871, 672830, 681226, 690509, 701178, 713371, 726906, 741719, 757839, 774851, 792006, 809033, 826163, 843018, 858231, 870685, 880467, 887949, 892512, 893096, 889670, 883255, 874626]
60615H74626j0849j3170j5207j6801j7828j7882j6816j5235j3804j2468j0795
60604G13771q686o306l749j196R26K409L452M139M110L182J794M85o68j731k501
60589G09431k861k999k904k078l52J609L117M296N539O538O667O035N396N175
60575G42609N185N140M885M173K854J265l6q95j522j979k249k689l798n477p071
60560G40395q222r185j0091j0526j0130r277q712q641q637q308p699o933n834
60547F28200m221k277l38J599L680N609O793P301Q137J0153J3139J6381J9721
60534G13877K3456K7579L1727L5772L9782M3436M5915M6251M3472L6873K6856
60523A114996J5131L380p998j8939k8094l3469l4621l2937k9634k4799j8655j2365
$$ y = [874626, 863777, 850607, 835400, 818599, 800771, 782889, 766073, 750838, 737034, 724566, 713771, 705085, 698779, 695030, 693834, 694760, 697169, 700621, 704760, 708870, 712052, 713846, 714331, 713663, 711932, 709431, 706570, 703571, 700667, 698589, 698237, 699846, 702963, 707259, 712798, 719336, 726003, 732038, 737434, 742609, 747794, 752934, 757819, 761992, 764846, 766111, 766075, 765180, 763658, 761679, 759430, 756741, 752943, 747466, 740395, 732173, 722988, 712897, 702371, 692241, 682964, 674252, 665611, 656974, 648666, 640967, 634034, 628200, 623979, 621702, 621364, 622963, 626643, 632252, 639045, 646346, 654483, 664636, 677775, 694156, 713877, 737333, 764912, 796639, 832411, 872193, 915629, 961544, 1007795, 1051267, 1088140, 1114996, 1130127, 1133507, 1125509, 1106570, 1078476, 1045007, 1010386, 977449, 947815, 923016, 904361, 891996]
60511H91996o867k023K423N973Q071Q830Q451O891M687L193L196M124N313P151
60497I51409J0217J4161J8454K3423K9533L6320M3184N0586N9313O8982P8423
60486A384005Q7320R6356J05978J16125J27198J40383J56920J77562K02608K31766
60476B826221K63916K97193L28632L53135L63420L52254L15195K51539J64188
60467E515693N9843n1421j58588k52250l25143l72095l91762l88242l69053l40876
60457B926106l07833k72962k39107k07884j79423j53835j31883j13727r8374q4951
60447A136127p3522o4062n5759m7946m0815l4526k8697k3439j9830j8363j7755
60436G11413j6433j4510j3285j3294j3916j4480j4670j4063j2418j0415r113q585
$$ y = [891996, 885129, 883106, 885529, 891502, 899573, 908403, 916854, 923745, 928432, 931625, 934821, 938945, 944258, 951409, 961626, 975787, 994241, 1017664, 1047197, 1083517, 1126701, 1177287, 1236600, 1305582, 1384005, 1471325, 1567681, 1673659, 1789784, 1916982, 2057365, 2214285, 2391847, 2594455, 2826221, 3090137, 3387330, 3715962, 4069097, 4432517, 4784771, 5099966, 5351505, 5515693, 5575536, 5524115, 5365527, 5113277, 4788134, 4416039, 4024277, 3636035, 3266982, 2926106, 2618273, 2345311, 2106204, 1898320, 1718897, 1565062, 1433179, 1319452, 1221078, 1136127, 1062605, 998543, 942784, 894838, 854023, 819497, 790800, 767361, 747531, 729168, 711413, 694980, 680470, 667185, 653891, 639975, 625495, 610825, 596762, 584344, 573929, 564816, 556231]
60424E56231p898o555n083m031l209k349j744j651j590q60M60J495J517N84o02
60409E24715j177o81M88J308J241R91J628L052M003L769L131L195L897M388M403
60394E58351M421M648M790M830N177N860O352O405O418O560O280N128L523K102
60380F30845Q48o22k213l461m173m524m668m664m600m473m114l502k862k300j706
60365E83811j161q98o61J77J542K425K239J654J484J536J357J260J687K263K546
60350F01261L058M348N604N646M920M941N950O728O800P103Q013Q334P101N136
60336F84943L832L346K878K085J267O22J26j52j72q5J28P91J914K916L363L550
60320G11352L931M319M107K966R92j461l754n243n911o387p005p326o975o391
$$ y = [556231, 548333, 541778, 536695, 532664, 529455, 527106, 525362, 523711, 522121, 521261, 521721, 523216, 524733, 525317, 524715, 523538, 522857, 523345, 524653, 525894, 526885, 528513, 531565, 535568, 539337, 542468, 545663, 549560, 553948, 558351, 562772, 567420, 572210, 577040, 582217, 588077, 594429, 600834, 607252, 613812, 620092, 625220, 628743, 630845, 631693, 631071, 628858, 625397, 621224, 616700, 612032, 607368, 602768, 598295, 594181, 590679, 587817, 585517, 583811, 582650, 581752, 581091, 581268, 582810, 585235, 587474, 589128, 590612, 592148, 593505, 594765, 596452, 598715, 601261, 604319, 608667, 614271, 619917, 624837, 629778, 635728, 642456, 649256, 656359, 664372, 672706, 679807, 684943, 688775, 692121, 694999, 697084, 698351, 698973, 699099, 698947, 698775, 698690, 698818, 699609, 701523, 704439, 707802, 711352, 715283, 719602, 723709, 726675, 727667, 726206, 722452, 717209, 711298, 704911, 697906, 690580, 683605, 677214]
60306F77214o202o225n795m779l691k895k303j771j313q12j1J096K099K600K668
60291F49880K724L021L254K930K089J510J833K682L034K465J538R56Q17Q70J051
60276F80654J435J996K632L259L702L741L473L299L463L803M124M462M919N525
60262G30487O420P788R483J1086J2470J3972J5794J7716J9544K1484K3754K6253
60250I16251K8879L1874L5483L9592M4004M8817N4192N9991O5947P1977P8016
60239A475023Q3764Q8958R3679R8036J01679J03932J04344J02869R9527R4190
60229B446001Q6670P6984O5573N3314M1055K9014J6842M371p933j9339k9378l7755
60217B725419m4035m7819m9099m8202m5383m0710l4279k6348j7325p671K300J2642
$$ y = [677214, 671012, 664787, 658992, 654213, 650522, 647627, 645324, 643553, 642240, 641428, 641417, 642513, 644612, 647212, 649880, 652604, 655625, 658879, 661809, 663898, 665408, 667241, 669923, 672957, 675422, 676960, 677916, 678733, 679603, 680654, 682089, 684085, 686717, 689976, 693678, 697419, 700892, 704191, 707654, 711457, 715581, 720043, 724962, 730487, 736907, 744695, 754178, 765264, 777734, 791706, 807500, 825216, 844760, 866244, 889998, 916251, 945130, 977004, 1012487, 1052079, 1096083, 1144900, 1199092, 1259083, 1325030, 1397007, 1475023, 1558787, 1647745, 1741424, 1839460, 1941139, 2045071, 2149415, 2252284, 2351811, 2446001, 2532671, 2609655, 2675228, 2728542, 2769597, 2798611, 2815453, 2819824, 2811891, 2792552, 2763174, 2725419, 2681384, 2633565, 2584466, 2536264, 2490881, 2450171, 2415892, 2389544, 2372219, 2364548, 2366848, 2379490]
60205B379490K3698L5642M8150O0613P2530Q3567R3362J01486J07566J11402J12871
60194C230377J11715J07399R9381Q7658P3034N6631L9262K1409L587j3676l0141
60183C786636m5787o0315p3055q3296r0415r3798r3104q8715q1519p2110o0559
60172B943963m7155l2843j8669m982Q578K2498L6840N0930O3468P3298Q0216Q4614
60160C260756Q6275Q4095P7448O7350N5639M3161K9398J4009j917j6483k8596
60149C671135l8440m6354n1759n3596n1631m6693l9563l0172j8281m373J0615
60138C300888K6238M2644N9967P8223R7656J18571J40829J64085J88348K13657
60128D431106K39277K63986K87192L08930L28488L44021L54003L58212L56686
$$ y = [2379490, 2403188, 2438830, 2486980, 2547593, 2620123, 2703690, 2797052, 2898538, 3006104, 3117506, 3230377, 3342092, 3449491, 3548872, 3636530, 3709564, 3766195, 3805457, 3826866, 3830453, 3816777, 3786636, 3740849, 3680534, 3607479, 3524183, 3433768, 3339970, 3246866, 3158151, 3076632, 3004522, 2943963, 2896808, 2863965, 2845296, 2840314, 2848892, 2871390, 2908230, 2959160, 3022628, 3095926, 3176142, 3260756, 3347031, 3431126, 3508574, 3575924, 3631563, 3674724, 3704122, 3718131, 3716214, 3699731, 3671135, 3632695, 3586341, 3534582, 3480986, 3429355, 3382662, 3343099, 3312927, 3294646, 3290273, 3300888, 3327126, 3369770, 3429737, 3507960, 3605616, 3724187, 3865016, 4029101, 4217449, 4431106, 4670383, 4934369, 5221561, 5530491, 5858979, 6203000, 6557003, 6915215, 7271901]
60119G271901L48404L32004L07411K75984K39220J98082J53434J06221N6964N667
60109I295292m7273j00302j51170j97994k39621k75008l02568l20533l28113l26118
60099G006592l16265k99904k77690k50368k19412j86612j53203j19647q6097n2854
60089E044540k0364J0921M0445O7259R0105J07981J20568J27759J28951J23311
60079E841476J10952R3241P1698M7185K0662n980l0723n2823p2573r0003j04739
60068E828373j17086j28083j38166j46565j52374j55491j56156j54260j49615
60059D530577j42527j33595j23308j12048j00119q7488p3823n9050m3511k7465
60049C627643j0943N777K2047L7581N2841O8240Q3315R6946J08139J16233J20608
$$ y = [7271901, 7620305, 7952309, 8259720, 8535704, 8774924, 8973006, 9126440, 9232661, 9289625, 9295292, 9248019, 9147717, 8996547, 8798553, 8558932, 8283924, 7981356, 7660823, 7332710, 7006592, 6690327, 6390423, 6112733, 5862365, 5642953, 5456341, 5303138, 5183491, 5097394, 5044540, 5024176, 5035097, 5075542, 5142801, 5232906, 5340887, 5461455, 5589214, 5718165, 5841476, 5952428, 6045669, 6117367, 6164552, 6185214, 6179234, 6148511, 6095688, 6023115, 5933112, 5828373, 5711287, 5583204, 5445038, 5298473, 5146099, 4990608, 4834452, 4680192, 4530577, 4388050, 4254455, 4131147, 4019099, 3918980, 3831492, 3757669, 3698619, 3655108, 3627643, 3616700, 3622477, 3644524, 3682105, 3734946, 3803186, 3886501, 3983447, 4091586, 4207819, 4328427]
60038D328427J20635J15887J06252R2053P4155N3794L2060R491j3786l7533o0828
60027D820607q2059r9831j13997j25307j33814j38254j37659j32819j25305j15731
60017C615831j04049r1057p8037o5028n0995l5893k1091p284O581K1629L7569
60006C228176N3636O9887Q6682J03696J20351J36392J51193J63190J70911J73982
59996D458096J72383J65459J52593J34324J11962Q6598N9301L1633M839k1176
59986E356012m7050p2299r5333j14951j30874j42846j50075j51883j48457j40731
59976D161513j29818j16570j01396q4469o6166m7168k8079r286Q875K6219M2884
59965C656539N8789P2939Q4153R2634R9673J05458J08261J06594J01151R3725
$$ y = [4328427, 4449062, 4564949, 4671201, 4763254, 4837409, 4891203, 4923263, 4932754, 4918968, 4881435, 4820607, 4738548, 4638717, 4524720, 4399413, 4265599, 4127345, 3989686, 3856867, 3731562, 3615831, 3511782, 3420725, 3342688, 3277660, 3226665, 3190772, 3169681, 3162397, 3168978, 3190607, 3228176, 3281812, 3351699, 3438381, 3542077, 3662428, 3798820, 3950013, 4113203, 4284114, 4458096, 4630479, 4795938, 4948531, 5082855, 5194817, 5281415, 5340716, 5372349, 5377188, 5356012, 5308962, 5236663, 5141330, 5026379, 4895505, 4752659, 4602584, 4450701, 4302244, 4161513, 4031695, 3915125, 3813729, 3729260, 3663094, 3615926, 3587847, 3578561, 3587436, 3613655, 3656539, 3715328, 3788267, 3872420, 3965054, 4064727, 4170185, 4278446, 4385040, 4486191, 4579916]
59955D579916Q5017P4643O2660M9850L6838K3957J1867J502o502j1676j3380j1273
59943D883419n742K875J5137L1861N2928P7535J05273J36137J69690K05017K41330
59932E915460K77865L13361L46304L75423L99068M14262M17284M05362L77337
59923I241726L32960K72491J97305J10517J6913p7602j66923k45852l10620l58785
59913I012130l89486m04088m05626l96762l78757l52888l21801k88406k54088
59904E820228k19064j83911j49551j16186q3491n1585k0755R474L9743O9507R7426
59893E211835J22927J46101J66101J80989J89308J90647J84415J69289J44394
59884F706006J10186O7946J9256l3497q6972j37664j82695k19920k48128k67327
$$ y = [4579916, 4664933, 4739576, 4802236, 4852086, 4888924, 4912881, 4924748, 4926250, 4919748, 4908072, 4894692, 4883419, 4877677, 4880552, 4895689, 4927550, 4980478, 5058013, 5163286, 5299423, 5469113, 5674130, 5915460, 6193325, 6506686, 6852990, 7228413, 7627481, 8041743, 8459027, 8864389, 9241726, 9574686, 9847177, 10044482, 10154999, 10171912, 10094310, 9927387, 9681535, 9370915, 9012130, 8622644, 8218556, 7812930, 7416168, 7037411, 6684523, 6362722, 6074316, 5820228, 5601164, 5417253, 5267702, 5151516, 5068025, 5016440, 4995685, 5005159, 5044902, 5114409, 5211835, 5334762, 5480863, 5646964, 5827953, 6017261, 6207908, 6392323, 6561612, 6706006, 6816192, 6884138, 6903394, 6869897, 6782925, 6645261, 6462566, 6242646, 5994518, 5727191]
59874E727191k78197k81217k76887k66644k52612k36301k18268j99051j79535
59865C538479j60317j41505j23367j06351r0455p5413o1649n0118m1038l3692
59855B654574k7767k3917k2622k3374k5331k7890l0156l0853k9497k6958k4133
59844B362076k0664j5755r833m464p97J141J548o0m399j1312j9520k7551l4662
59831B215748m0608m4794m6381m5287m2451l8718l4114k8589k2679j6712j0077
59820A845338k326N616J2444J8321K4451L1009L6719M0598M2990M4709M6311M8469
59808B194649N1904N6341O0284O2206O1414N7588N0440M0312K8451J6304M987
59797B684880m484j1182j4922j6411j6499j5537j3427r719l768M524J4202K4170
$$ y = [5727191, 5448994, 5167777, 4890890, 4624246, 4371634, 4135333, 3917065, 3718014, 3538479, 3378162, 3236657, 3113290, 3006939, 2916484, 2841071, 2779422, 2729304, 2688266, 2654574, 2626807, 2602890, 2580268, 2556894, 2531563, 2503673, 2473517, 2442664, 2413167, 2386209, 2362076, 2341412, 2325657, 2315824, 2311360, 2310563, 2311704, 2313252, 2313192, 2308793, 2297481, 2277961, 2250410, 2215748, 2175140, 2130346, 2083965, 2038678, 1996227, 1957509, 1923395, 1894806, 1872127, 1855415, 1845338, 1843012, 1848628, 1861072, 1879393, 1903844, 1934853, 1971572, 2012170, 2055160, 2099869, 2146180, 2194649, 2246553, 2302894, 2363178, 2425384, 2486798, 2544386, 2594826, 2635138, 2663589, 2679893, 2684880, 2680396, 2669214, 2654292, 2637881, 2621382, 2605845, 2592418, 2582699, 2578931, 2583455, 2597657, 2621827]
59785B621827L4538M6257N9721P4728R1735J11776J34985J60408J87605K17162
59775C740742K49071K81731L13076L41350L63667L74564L67087L35333K76310
59766F642931J91242Q6895k4674j29374k15625k77040l12413l24392l17800k98039
59756E021711k70100k38193k05543j74110j44870j18365r4680p3124n2886l4045
59746C615795j7251k341J1839K6010L9825N2914O5690P8702R2059J05944J20886
59735D190072J36990J53658J70656J88808K09084K31656K56329K83253L12574
59726F133080L43972L77065M11731M47416M82580N15218N43570N65918N80306
59717A0400856N84998N78860N61324N32911M96348M56479M18431L86235L63220
$$ y = [2621827, 2656365, 2702622, 2762343, 2837071, 2928806, 3040582, 3175567, 3335975, 3523580, 3740742, 3989813, 4271544, 4584620, 4925970, 5289637, 5664201, 6031288, 6366621, 6642931, 6834173, 6921068, 6896394, 6767020, 6551395, 6274355, 5961942, 5637550, 5319750, 5021711, 4751611, 4513418, 4307875, 4133765, 3988895, 3870530, 3775850, 3702726, 3649840, 3615795, 3598544, 3596203, 3608042, 3634052, 3673877, 3726791, 3792481, 3871183, 3963242, 4069186, 4190072, 4327062, 4480720, 4651376, 4840184, 5049268, 5280924, 5537253, 5820506, 6133080, 6477052, 6854117, 7265848, 7713264, 8195844, 8711062, 9254632, 9820550, 10400856, 10985854, 11564714, 12126038, 12658949, 13155297, 13611776, 14030207, 14416442, 14779662]
59708A4779662L52437L55597L72031L99301M34265M73029N10564N41489N61138
59699A8779513N65603N51423N16109M58976L81344K86581J80399P0317l6165j33029
59689B1621071k15530k79568l22220l42578l41504l20896k83469k32553j71095
59680A9111658j00920k3123O1286J51530K47173L47397M50528N54594O57742P57217
59670B2215082Q48244R24346R78424J003093R90709R34211Q28555O72031M67608
59661B9862303K24286m2889l14956n72057p96143r73428j096531j164827j182589
59652B3943169j157018j097468j014702r19149q19773p24820o42942n82615n50328
59643A6434354n48983n76514o24977o81699p33070p68575p82537p74065p46313
$$ y = [14779662, 15132099, 15487696, 15859727, 16259028, 16693293, 17166322, 17676886, 18218375, 18779513, 19345116, 19896539, 20412648, 20871624, 21252968, 21539549, 21719948, 21790265, 21754100, 21621071, 21405541, 21125973, 20803753, 20461175, 20119671, 19798775, 19515306, 19282753, 19111658, 19010738, 18987615, 19048901, 19200431, 19447604, 19795001, 20245529, 20800123, 21457865, 22215082, 23063326, 23987672, 24966096, 25969189, 26959898, 27894109, 28722664, 29394695, 29862303, 30086589, 30043700, 29728744, 29156687, 28360544, 27387116, 26290585, 25125758, 23943169, 22786151, 21688683, 20673981, 19754832, 18935059, 18210239, 17567297, 16984682, 16434354, 15885371, 15308857, 14683880, 14002181, 13269111, 12500536, 11717999, 10943934, 10197621]
59634A0197621p04762o54669n99795n43329m88586m37869l91553l49279l11304
59625E716475k77741k47467k19237j93278j70497j50604j32414j15613j00694
59616D108930q7370p4631o2423n1870m3526l6828l1609k8883k9400l2459l6823
59605C593108m2109m8554n5994o3717p0993p7202q1760q4381q5288q4723q2451
59594B815936p8102p2010o5306n8958n2874m6232l8684l0919k3806j7296j0668
59583B321081l814K428P301J1019J4299J7414K0008K1606K2113K1941K1615K1148
59571B498159K0057J8386J7209J7441J8557J9526K0751K3748K8887L4953M1150
59560B758824M8090N6129O4333P2013Q0085Q9830J01262J13783J27452J42501
$$ y = [10197621, 9492859, 8838190, 8238395, 7695066, 7206480, 6768611, 6377058, 6027779, 5716475, 5438734, 5191267, 4972030, 4778752, 4608255, 4457651, 4325237, 4209624, 4108930, 4021560, 3946929, 3884506, 3832636, 3789110, 3752282, 3720673, 3691790, 3662390, 3629931, 3593108, 3550999, 3502445, 3446451, 3382734, 3311741, 3234539, 3152779, 3068398, 2983110, 2898387, 2815936, 2737834, 2665824, 2600518, 2541560, 2488686, 2442454, 2403770, 2372851, 2349045, 2331749, 2321081, 2317267, 2319695, 2326996, 2338015, 2352314, 2369728, 2389736, 2411342, 2433455, 2455396, 2477011, 2498159, 2518216, 2536602, 2553811, 2571252, 2589809, 2609335, 2630086, 2653834, 2682721, 2717674, 2758824, 2806914, 2863043, 2927376, 2999389, 3079474, 3169304, 3270566, 3384349, 3511801, 3654302]
59550C654302J58399J74540J91112K08244K24915K39754K52274K62383K69411
59541E635334K72677K72330K68514K60372K47164K29878K10678J91187J72003
59532G760137J52942J32605J08860Q1564N4386L2351J7810J0041Q101J2207K2472
59521H393476L8110N8105Q1274J05439J27635J45226J55837J56587J44866J19973
59511I526528Q2960L5226k1339q3242j46289k07783k66248l18984l61841l92105
59501G846883m10142m17581m15254m03678l84212l58808l29431k98302k67701
59492D561774k38770k11175j84509j59286j36231j15472r6889q0418o5477n0978
59482C222569l6466k2559r737K559J5105K7967M0956N4390O8754Q4085J00268
$$ y = [3654302, 3812701, 3987241, 4178353, 4386597, 4611512, 4851266, 5103540, 5365923, 5635334, 5908011, 6180341, 6448855, 6709227, 6956391, 7186269, 7396947, 7588134, 7760137, 7913079, 8045684, 8154544, 8236108, 8290494, 8322845, 8340655, 8350696, 8358797, 8371004, 8393476, 8431586, 8489691, 8570965, 8676404, 8804039, 8949265, 9105102, 9261689, 9406555, 9526528, 9609488, 9644714, 9623375, 9540133, 9393844, 9186061, 8919813, 8600829, 8238988, 7846883, 7436741, 7019160, 6603906, 6200228, 5816016, 5457208, 5127777, 4829475, 4561774, 4323004, 4111829, 3927320, 3768034, 3631803, 3516331, 3419442, 3339024, 3273547, 3222569, 3186103, 3163544, 3153807, 3156366, 3171471, 3199438, 3240394, 3294784, 3363538, 3447623, 3547891]
59471C547891J17443J35577J54018J72032J89464K06339K21962K34881K43691
59462E223298K47538K45750K37147K20012J93118J56833J12905O3254R592m5592
59452F663855r8732j46713j88110k22342k48360k65292k73739k75260k70985k61814
59442D412508k49411k35553k20658k04387j87461j71399j56464j41571j26485
59433B719119j12558j00731r0271q0168p0525o1880n4130m6899m0153l3847k7717
59422B000240k1920j7054j3070q924l935J268N673R082J1949J4560J6953J9273
59410B014095K1878K5219K9432L3412L4721L1562K4997J8350J4341J3712J6335
59399B278054K2069L0123L9101M8360N8182O7923P5292P8554P8738P9004Q2450
$$ y = [3547891, 3665334, 3800911, 3954929, 4126961, 4316425, 4522764, 4744726, 4979607, 5223298, 5470836, 5716586, 5953733, 6173745, 6366863, 6523696, 6636601, 6699855, 6709447, 6663855, 6565123, 6418410, 6230300, 6007958, 5759598, 5494306, 5220567, 4945307, 4674322, 4412508, 4163097, 3927544, 3706886, 3502499, 3315038, 3143639, 2987175, 2845604, 2719119, 2606561, 2505830, 2415559, 2335391, 2264866, 2202986, 2148856, 2101957, 2061804, 2027957, 2000240, 1978320, 1961266, 1948196, 1939272, 1935337, 1936605, 1942278, 1951360, 1963309, 1977869, 1994822, 2014095, 2035973, 2061192, 2090624, 2124036, 2158757, 2190319, 2215316, 2233666, 2248007, 2261719, 2278054, 2300123, 2330246, 2369347, 2417707, 2475889, 2543812, 2619104, 2697658, 2776396, 2855400, 2937850]
59388B937850R0948J04944J23418J44677J67945J93742K22469K53593K86787L22594
59378D848967L61010M00225M37921M72977N04755N31046N48049N52461N43046
59369I200457N20596M87347M46389M00880L53483L06471K61895K21187J84820
59360A2383525J52631J23965R7240P0009M0215P136k9287o9498j13821j60938
59350A2501177k07427k49110k82800l07155l22443l29816l30877l27774l23232
59341I820543l19902l19468l22391l28050l34756l40084l42059l40081l34364
59332F839388l24834l11272k94125k74258k52137k28193k03729j80259j58035
59323D612546j36309j14972r4778p5916n7820m0519k4772j0589K966J5991K7177
$$ y = [2937850, 3028798, 3133742, 3257160, 3401837, 3569782, 3763524, 3985993, 4239586, 4526373, 4848967, 5209977, 5610202, 6048123, 6521100, 7025855, 7556901, 8104950, 8657411, 9200457, 9721053, 10208400, 10654789, 11055669, 11409152, 11715623, 11977518, 12198705, 12383525, 12536156, 12660121, 12757361, 12827370, 12867585, 12874721, 12845434, 12775936, 12662115, 12501177, 12293750, 12044640, 11761840, 11454685, 11132242, 10802426, 10471549, 10143775, 9820543, 9500641, 9181173, 8858782, 8530732, 8195976, 7855892, 7513833, 7173752, 6839388, 6514554, 6203282, 5909157, 5634899, 5382762, 5154569, 4950840, 4770581, 4612546, 4476237, 4361265, 4266487, 4190571, 4132751, 4092232, 4067460, 4056871, 4059837, 4075828, 4103005]
59312D103005L5613M1885M6637M9341M9261M6568M1563L3865K3357J1033j948
59301D480180j5332k9048m2229n3743o3082p0020p4170p5557p4868p2461o7863
59290C841807o0937n2627m3776l4014k2733j0371K190J4890K8267M2475N7268
59279C762439P2498Q7886J02900J17392J31788J46021J58990J69688J78107J84271
59269E111980J87161J85388J78530J67016J51293J31506J07401P8201M3674N999
59259F348149l0402o1777q7011j06429j20134j28719j34242j38821j42817j45485
59249E252312j46751j47115j46521j44594j41487j37310j31410j23299j13789
59240D020036j03941r3527q1710o8633n4982m0491k4337o664J1738L1012N2156
$$ y = [4103005, 4138618, 4180503, 4227140, 4276481, 4325742, 4372310, 4413873, 4447738, 4471095, 4482128, 4480180, 4464848, 4435800, 4393571, 4339828, 4276746, 4206726, 4132556, 4056999, 3982131, 3909670, 3841807, 3780870, 3728243, 3684467, 3650453, 3627720, 3617349, 3619539, 3634429, 3662696, 3705171, 3762439, 3834937, 3922823, 4025723, 4143115, 4274903, 4420924, 4579914, 4749602, 4927709, 5111980, 5299141, 5484529, 5663059, 5830075, 5981368, 6112874, 6220275, 6298476, 6342150, 6348149, 6317747, 6255970, 6168959, 6062530, 5942396, 5813677, 5679435, 5540614, 5397797, 5252312, 5105561, 4958446, 4811925, 4667331, 4525844, 4388534, 4257124, 4133825, 4020036, 3916095, 3822568, 3740858, 3672225, 3617243, 3576752, 3552415, 3545751, 3557489, 3588501, 3640657]
59229C640657P5528J00698J27629J56772J88012K20653K54258K88345L21374L51178
59219E725104L76108L94526M03341L98676L78312L42436K92046K28044J52268
59210H690861O8083k0569j09894j95646k72929l37454l86689m19710m36651m38733
59200F140669m28208m07906l80876l50226l18518k87093k56367k26840j99353
59191C285282j74507j52352j32690j15272r9824q6287p4805o5076n6172m7580
59181B280717l9907l3817k8670k3194j7148j1327o062q24M592R527J3392J6463
59169B163742J9511K3186K7803L3131L8339M2741M6694N1187N6562O2153O7250
59158B632299P1812P6102Q0080Q3265Q4911Q4390Q1611P7014P0899O3049N3159
$$ y = [3640657, 3716185, 3816883, 3944512, 4101284, 4289296, 4509949, 4764207, 5052552, 5373926, 5725104, 6101212, 6495738, 6899079, 7297755, 7676067, 8018503, 8310549, 8538593, 8690861, 8758944, 8738375, 8628481, 8432835, 8159906, 7822452, 7435763, 7016053, 6579402, 6140669, 5712461, 5304555, 4923679, 4573453, 4254935, 3967842, 3711475, 3484635, 3285282, 3110775, 2958423, 2825733, 2710461, 2610637, 2524350, 2449545, 2384469, 2328297, 2280717, 2240810, 2206993, 2178323, 2155129, 2137981, 2126654, 2120592, 2119768, 2124360, 2133887, 2147279, 2163742, 2183253, 2206439, 2234242, 2267373, 2305712, 2348453, 2395147, 2446334, 2502896, 2565049, 2632299, 2704111, 2780213, 2860293, 2943558, 3028469, 3112859, 3194470, 3271484, 3342383, 3405432, 3458591]
59147C458591M1296K7737J2961j884j5232k6485l6469m5890n4030n9697o2727
59136C238171o3627o2425n9118n4605m9869m4470l7182k7956j8086q461J089J0746
59124B824207K0272K9856M0263N1723O3538P5165Q6924R9332J12457J26122J40204
59113C670063J54441J68487J82370J96507K11204K26316K41157K54335K64077
59104E568957K69289K69925K65605K54409K33981K03558J64113J16857O2876M160
59094G413730n6126j14630j68367k14580k51315k78450k97271l08783l13264l11400
59084E099544l04803k94921k82234k66899k49571k31267k12922j95346j79069
59075B882512j64038j49847j36386j23941j12711j02675r3815q5968p8749p2056
$$ y = [3458591, 3499887, 3527624, 3540585, 3538701, 3523469, 3496984, 3460515, 3414625, 3360595, 3300898, 3238171, 3174544, 3112119, 3053001, 2998396, 2948527, 2904057, 2866875, 2838919, 2820833, 2812372, 2813461, 2824207, 2844479, 2874335, 2914598, 2966321, 3029859, 3105024, 3191948, 3291280, 3403737, 3529859, 3670063, 3824504, 3992991, 4175361, 4371868, 4583072, 4809388, 5050545, 5304880, 5568957, 5838246, 6108171, 6373776, 6628185, 6862166, 7065724, 7229837, 7346694, 7409570, 7413730, 7357604, 7242974, 7074607, 6860027, 6608712, 6330262, 6032991, 5724208, 5410944, 5099544, 4794741, 4499820, 4217586, 3950687, 3701116, 3469849, 3256927, 3061581, 2882512, 2718474, 2568627, 2432241, 2308300, 2195589, 2092914, 1999099, 1913131, 1834382, 1762326]
59065A762326o6377o1859n7531n2303m6501m1427l7568l4312l1343k9117k7689
59054A276299k6205k4022k1590j9704j8599j8146j8256j8612j8409j6964j4420
59043A061372j1607r252p392n499l159o06J685L870O480R122J0289R307P648P421
59029A079679Q961J1032J2885J4982J7713K0545K2633K3391K2450J9858J6449
59018A270578J3271J0563P819M876K239L82o49q96l08J089L176N792Q498J0658
59004A337088J2107J3262J4187J4123J2493R674O125J653l667q725j2625j5859
58992A379836j9054k1301k1209j9039j6393j4150j2071j0051q290o490m254k113
58980A225421q47j12R54K203L023L970O083Q824J0519J0913J1473J3031J4846
$$ y = [1762326, 1695949, 1634090, 1576559, 1524256, 1477755, 1436328, 1398760, 1364448, 1333105, 1303988, 1276299, 1250094, 1226072, 1204482, 1184778, 1166179, 1148033, 1129777, 1111165, 1092756, 1075792, 1061372, 1049765, 1040513, 1033121, 1027622, 1024463, 1023857, 1025542, 1029412, 1035892, 1045014, 1055303, 1064610, 1072258, 1079679, 1088640, 1099672, 1112557, 1127539, 1145252, 1165797, 1188430, 1211821, 1234271, 1254129, 1270578, 1283849, 1294412, 1302231, 1307107, 1309346, 1309728, 1309079, 1308183, 1307875, 1308964, 1312140, 1317932, 1326430, 1337088, 1349195, 1362457, 1376644, 1390767, 1403260, 1412934, 1419059, 1420712, 1417045, 1408320, 1395695, 1379836, 1360782, 1339481, 1318272, 1299233, 1282840, 1268690, 1256619, 1246568, 1238278, 1231788, 1227534, 1225421, 1224574, 1224462, 1225416, 1227619, 1230642, 1234612, 1240695, 1249519, 1260038, 1270951, 1282424, 1295455, 1310301]
58967A310301J6321J7905J9851K1582K2736K3602K4174K4083K3636K3594K3796
58956A551581K3366K2428K2134K2816K3782K5033K7336L0337L2557L3880L6130
58945A851380M0318M5119M9086N2781N7477O3149O8946P4585Q0120Q5344R0448
58934B558753R6409J03676J11275J18110J24556J32030J41680J53996J68990J86095
58924C895570K04612K24753K47571K73621L02415L33444L66755M02304M39831
58915F690876M79450N21215N63752O04643O42313O75986P03314P19728P20947
58906A2322224P04635O69006O11601N30952M28358L07123J71399K7040j17775
58897A5654563k54584l77275m82105n66422o28644o68981o89075o91322o79053
$$ y = [1310301, 1326622, 1344527, 1364378, 1385960, 1408696, 1432298, 1456472, 1480555, 1504191, 1527785, 1551581, 1574947, 1597375, 1619509, 1642325, 1666107, 1691140, 1718476, 1748813, 1781370, 1815250, 1851380, 1891698, 1936817, 1985903, 2038684, 2096161, 2159310, 2228256, 2302841, 2382961, 2468305, 2558753, 2655162, 2758838, 2870113, 2988223, 3112779, 3244809, 3386489, 3540485, 3709475, 3895570, 4100182, 4324935, 4572506, 4846127, 5148542, 5481986, 5848741, 6251045, 6690876, 7170326, 7691541, 8255293, 8859936, 9502249, 10178235, 10881549, 11601277, 12322224, 13026859, 13695865, 14307466, 14838418, 15266776, 15573899, 15745298, 15772338, 15654563, 15399979, 15022704, 14540599, 13974177, 13345533, 12676552, 11987477, 11296155, 10617102]
58888A0617102o56379o26658n91556n52249n10782m69481m29674l91920l56837
58879F031566l24878k95820k69321k45546k24746k06699j91048j77518j65368
58870C930622j53472j41522j30366j20584j11514j02359r3446q5638p9074p3196
58860B839451o7521o1935n6669n2247m8861m5631m1330l5899l0337k5059j9580
58849B354382j4013r267n311p21N187J1215J6083K0163K4458K9151L4166M0010
58837B505503M6889N3918O0271O6338P2827P9571Q6129R2751R9856J07314J15119
58826C386486J23970J34364J45930J58342J72129J87882K05555K25213K47561
58817D987432K73025L01233L32117L66370M04082M43956M84682N25964N67266
$$ y = [10617102, 9960723, 9334065, 8742509, 8190260, 7679478, 7209997, 6780323, 6388403, 6031566, 5706688, 5410868, 5141547, 4896001, 4671255, 4464556, 4273508, 4095990, 3930622, 3777150, 3635628, 3505262, 3384678, 3273164, 3170805, 3077359, 2991721, 2912647, 2839451, 2771930, 2709995, 2653326, 2601079, 2552218, 2506587, 2465257, 2429358, 2399021, 2373962, 2354382, 2340369, 2331102, 2325791, 2325070, 2330257, 2341472, 2357555, 2377718, 2402176, 2431327, 2465493, 2505503, 2552392, 2606310, 2666581, 2732919, 2805746, 2885317, 2971446, 3064197, 3164053, 3271367, 3386486, 3510456, 3644820, 3790750, 3949092, 4121221, 4309103, 4514658, 4739871, 4987432, 5260457, 5561690, 5893807, 6260177, 6664259, 7108215, 7592897, 8118861, 8686127]
58808H686127O06551O41139O68764O86867O91909O80411O49873N98037N22748
58799A4432426M23971L05142J71705K9348j15415k54504l80080m86928n72443
58790A3553222o35361o75802o95770o98363o86702o63973o33426n97429n57485
58781G708911n15715m75022m36920m00672l65727l33446l05144k79898k56110
58772D340257k34051k15109j99409j85921j74137j63938j54366j44311j34037
58763B734978j24597j16040j07529r8839r0525q2938p6069o9923o4138n7797n0627
58752A795956m3680l7943l3030k8209k3786k0303j7298j4066j0844q085n396k418
58740A550898R9J390J923K268J646r60m978q985j2585j6136j9298k1281k2071
$$ y = [8686127, 9292678, 9933817, 10602581, 11289448, 11981357, 12661768, 13311641, 13909678, 14432426, 14856397, 15161539, 15333244, 15362592, 15247177, 14992673, 14612593, 14125665, 13553222, 12917861, 12242059, 11546289, 10847926, 10161224, 9497251, 8863825, 8266396, 7708911, 7193196, 6718174, 6281254, 5880582, 5514855, 5181409, 4876265, 4596367, 4340257, 4106206, 3891097, 3691688, 3505767, 3331630, 3167692, 3013326, 2869015, 2734978, 2610381, 2494341, 2386812, 2287973, 2197448, 2114510, 2038441, 1968518, 1904380, 1846583, 1795956, 1752276, 1714333, 1681303, 1653094, 1629308, 1609005, 1591707, 1577641, 1566797, 1558712, 1553316, 1550898, 1550997, 1552387, 1554310, 1556578, 1558224, 1557264, 1552286, 1543301, 1530716, 1514580, 1495282, 1474001, 1451930]
58727A451930k2140k1495k0188j9115j9089j9713k0259k0998k2537k4605k6588
58716A215203k8480l0230l1107l0857l0430l0364k9569k7114k4091k2097k0997
58705I09867j9752j8438j7672j6942j5369j3432j2185j1435j0334r167q825r137
58693G47179r291r257r337r055p961o755o085n177l275j323m73lJ284K583K218
58678F85272M16j244k408l709m656m108k482j180j27J824M316N608N305M800M856
58663F92483M829M427M337M777M995M529L567K076j53k679m837o650q197q675
58649F94829p456n383l569j707Q89L522N149O316Q130J0190J1467J2438J4173
58636G48988J6160J7300J8254K0394K3137K4887K6132K8886L3367L7847M1713
$$ y = [1451930, 1429790, 1408295, 1388107, 1368992, 1349903, 1330190, 1309931, 1288933, 1266396, 1241791, 1215203, 1186723, 1156493, 1125386, 1094529, 1064099, 1033735, 1004166, 977052, 952961, 930864, 909867, 890115, 871677, 854005, 837063, 821694, 808262, 796077, 784642, 774308, 765141, 756316, 747179, 737888, 728631, 719294, 710239, 702278, 695523, 689438, 684261, 680986, 679663, 679190, 679187, 680471, 683054, 685272, 685688, 684444, 682036, 678327, 673671, 669563, 667081, 665901, 665774, 667598, 671914, 677522, 682827, 687627, 692483, 697312, 701739, 706076, 710853, 715848, 720377, 723944, 726020, 725867, 723188, 718351, 711701, 703504, 694829, 687373, 681990, 678421, 676714, 677603, 681125, 686274, 692590, 700720, 710910, 722377, 734815, 748988, 765148, 782448, 800702, 821096, 844233, 869120, 895252, 924138, 957505, 995352, 1037065]
58625A037065M6069N1351N6840O2629O9650P7687Q5703R4212J05036J18475J33052
58614A937769J48034J63923J80257J95242K07768K17612K23435K22762K14141
58605C710943J97291J71219J34686Q8911L7771j4885o6155j12595j50511j78293
58595C818382j96542k05873k06644k00762j91245j79701j66289j51960j38338
58586B181028j25462j12216r9060q7706p8025o8102n7640m8458m1203l4401k7385
58575A401370k1409j7117j3550j0367q458p599o134l835k444k517k295o77J098
58562A306066J798J771J137j214n636j0777j5664k0708k5816k9623l1507l2280
58550A137547l2116l0024k6212k2805k1137k0395j9768j9764k0499k0851k0379
$$ y = [1037065, 1083134, 1134485, 1191325, 1253954, 1323604, 1401291, 1486994, 1581206, 1686242, 1804717, 1937769, 2085803, 2249726, 2429983, 2625225, 2832993, 3050605, 3274040, 3496802, 3710943, 3908234, 4079453, 4214139, 4303050, 4340821, 4325936, 4259781, 4147186, 3996675, 3818382, 3621840, 3415967, 3209323, 3008561, 2817316, 2637615, 2471326, 2319366, 2181028, 2055566, 1943350, 1844290, 1756584, 1678559, 1610457, 1552817, 1504359, 1463156, 1428755, 1401370, 1379961, 1362844, 1349294, 1338927, 1330469, 1322870, 1316736, 1312901, 1310457, 1307940, 1305645, 1304968, 1306066, 1307864, 1309635, 1310772, 1309558, 1303922, 1293145, 1277481, 1256773, 1230957, 1201334, 1169827, 1137547, 1105431, 1075407, 1049195, 1026390, 1005253, 984858, 965090, 945326, 924827, 903976, 883597]
58539H83597k0112k0413k0049j8245j5910j3999j2422j1189j0754j0645r714q114
58527G12031p170o993o447n644o005p551q679q954r464j0119r589q309q345r545
58513E99217r158o333l669k985k798j581l42j04K80J757L046L014K844M045O224
58498E93457Q415J0608J2600J3404J3149J3569J5473J7659J9260K0823K2203K2035
58486G82655K0248J8429J6718J3214P629K418j097m652r562j4323j7480j9786
58474G94411k1754k1982j9999j7946j7330j6801j5186j3881j4022j4015j2299
58463F09196j0106r143q734p596o242n477m589l042j918j749j195M11J539J318
58449E52673J397L032M795N236N317O147O793O508O715Q591J0989J2805J5004
$$ y = [883597, 863485, 843072, 823023, 804778, 788868, 774869, 762447, 751258, 740504, 729859, 720145, 712031, 704861, 697868, 691421, 685777, 679772, 672221, 663542, 654588, 645124, 635005, 625416, 617107, 608762, 599217, 590059, 583726, 580057, 577072, 574274, 572693, 572351, 572247, 572527, 574284, 577330, 580344, 583188, 587233, 593457, 601872, 612480, 625080, 638484, 651633, 665202, 680675, 698334, 717594, 738417, 760620, 782655, 802903, 821332, 838050, 851264, 858893, 861311, 860214, 855562, 846000, 831677, 814197, 794411, 772657, 750675, 730676, 712730, 695400, 678599, 663413, 649532, 635510, 621495, 609196, 599090, 589947, 581213, 573617, 567375, 561898, 557309, 554267, 552349, 550600, 549405, 549816, 551355, 552673, 554070, 557102, 561897, 567133, 572450, 578597, 585390, 591898, 598613, 607204, 618193, 630998, 646002]
58436F46002J8253K0996K2001K2358K2949K2397J9600J5706J1579O121p41o328
58424H20893q860j0119j2050j3577j3311j2589j3012j3454j2257j0035p927n472
58412F88230k549o81j45J423N140Q590R871J0763J3133J5427J5718J5033J4489
58399G94442J2265O865N14m078p589j1445j4284j4492j3567j3419j3005j1018
58387G11189r120q957q751o548m050l516l593k045N3P40J170L186N412N720N220
58372F86110N916O811O249N600O660P881P301O610Q104J0134R934Q600Q811R946
58358G94667R903R563J0905J2737J2791J2217J3469J5701J6506J6362J7077J7663
58346I59561J5982J2687R509N717J69n245q242r903j1942j2856j0889q066o932
$$ y = [646002, 664255, 685251, 707252, 729610, 752559, 774956, 794556, 810262, 821841, 827962, 827221, 820893, 812033, 801914, 789864, 776287, 762976, 750387, 737375, 723921, 711664, 701629, 693702, 688230, 685681, 685000, 684855, 686278, 691418, 700008, 709879, 720642, 733775, 749202, 764920, 779953, 794442, 806707, 813572, 814086, 810008, 802419, 790974, 776690, 762198, 748631, 735212, 722207, 711189, 702069, 693112, 684361, 677813, 673763, 670247, 666654, 664609, 664662, 665402, 666572, 669758, 675170, 680890, 686110, 692026, 698837, 705086, 710686, 717346, 725227, 732528, 739138, 747242, 757376, 767310, 775910, 784721, 794667, 804570, 814133, 825038, 837775, 850566, 862783, 876252, 891953, 908459, 924821, 941898, 959561, 975543, 988230, 997739, 1003456, 1003625, 998380, 990138, 980235, 968293, 955437, 944548, 936482, 929550]
58333I29550o035l058M36J992K988N612Q124Q133P629R591J2475J3297J3247J4891
58319A018872J6770J6395J5676J7628K0496K0965K0362K1788K3845K3248K0858
58308A236903J9241J7108J2257P051M693L230l91l634k537P55J798J800M385P704
58294A310363P724O374Q226J1804J2469J1442J3443J7605J9267J8808K0266K3074
58282A480865K3675K3376K6126L0442L2083L2664L6857M3105M6048M6193M8046
58271A869480N0723M9845M6741M6123M6361M1958L3994K8451K5845K2430J9609
58260B281560K1799K6677K8132K7290L0088L5855L9091M0636M5632N2427N5122
58249B684309N5354N9590O6548O9668P0132P4737Q2586Q6914Q8439R3556J01119
$$ y = [929550, 923515, 920457, 920893, 922885, 925873, 931485, 939609, 947742, 955371, 964962, 977437, 990734, 1003981, 1018872, 1035642, 1052037, 1067713, 1085341, 1105837, 1126802, 1147164, 1168952, 1192797, 1216045, 1236903, 1256144, 1273252, 1285509, 1292560, 1297253, 1300483, 1300092, 1296458, 1293921, 1294676, 1296474, 1298274, 1302659, 1310363, 1318087, 1324461, 1332687, 1344491, 1356960, 1368402, 1381845, 1399450, 1418717, 1437525, 1457791, 1480865, 1504540, 1527916, 1554042, 1584484, 1616567, 1649231, 1686088, 1729193, 1775241, 1821434, 1869480, 1920203, 1970048, 2016789, 2062912, 2109273, 2151231, 2185225, 2213676, 2239521, 2261951, 2281560, 2303359, 2330036, 2358168, 2385458, 2415546, 2451401, 2490492, 2531128, 2576760, 2629187, 2684309, 2739663, 2799253, 2865801, 2935469, 3005601, 3080338, 3162924, 3249838, 3338277, 3431833, 3532952]
58238C532952J04794J06583J13750J24251J30095J33136J42037J55472J64614
58229D707684J70430J81712J97681K09989K20267K37563K59983K77704K92515
58220F755528L14865L43438L68157L91355M24375M65433N03830N43690N99095
58211A0709766O68205P38169Q12957R08489J023275J144352J279495J451086J661760
58202B0397554J902327K190866K565561L044301L637664M399668N414909O734736
58194E0287586Q377028J0382024J2800413J5624101J8801769K2329754K6256083
58187A64858758L0592213L5247527L9852553M3271994M3261553L7223358K4104193
58180D18412149N858791j3180636k8689235l8407618m2400722m2004164l8795739
$$ y = [3532952, 3637746, 3744329, 3858079, 3982330, 4112425, 4245561, 4387598, 4543070, 4707684, 4878114, 5059826, 5257507, 5467496, 5687763, 5925326, 6185309, 6463013, 6755528, 7070393, 7413831, 7781988, 8173343, 8597718, 9063151, 9566981, 10110671, 10709766, 11377971, 12116140, 12929097, 13837586, 14860861, 16005213, 17284708, 18735794, 20397554, 22299881, 24490747, 27056308, 30100609, 33738273, 38137941, 43552850, 50287586, 58664614, 69046638, 81847051, 97471152, 116272921, 138602675, 164858758, 195450971, 230698498, 270551051, 313823045, 357084598, 394307956, 418412149, 424270940, 411090304, 382401069, 343993451, 301592729, 259588565, 220792826]
58173B20792826l4155420k9128003k4347859k0095299j6467614j3483269j1081325
58166G2034037r145148p575277o309719n283666m423268l681736l040061k472278
58158C0102884j943964j439182r55699m79279R276N11465J021863J551161K117433
58149C0495958K724124L339769L838332L934292L276034J737255l65636k419127
58141D6561001l909625m674220m827686m565440m066428l482810k919551k416817
58133A5698424j980114j617152j331531j106633r22126p73282o58470n64311m79507
58124F265298m08529l57195l18172k83228k56089k41030k31288k19753k09225
58115C740789k02150j92075j74802j56710j43148j29470j11720r5149q4249p5103
$$ y = [220792826, 186637406, 157509403, 133161544, 113066245, 96598631, 83115362, 72034037, 62888889, 55313612, 49003893, 43720227, 39296959, 35615223, 32575162, 30102884, 28158920, 26719738, 25764039, 25284760, 25294036, 25805501, 26827364, 28378525, 30495958, 33220082, 36559851, 40398183, 44332475, 47608509, 49345764, 48980128, 46561001, 42651376, 37977156, 33149470, 28584030, 24517602, 21034792, 18115241, 15698424, 13718310, 12101158, 10769627, 9662994, 8740868, 7967586, 7309116, 6744805, 6265298, 5856769, 5499574, 5181402, 4898174, 4642085, 4401055, 4169767, 3950014, 3740789, 3538639, 3346564, 3171762, 3015052, 2871904, 2742434, 2630714, 2535565, 2451316, 2376213]
58105B376213o5354o0951o5163p0987p2059p1418p2447p0986o3844n5852n1168
58094A655984m6338l8755l3254l3393l4535l2390l0462l2567l5603l6096l6464
58083A266127l8715l9231l5817l2810l3444l3991l1075k7884k7588k7393k4627
58072I13552k2185k2408k2016j8553j5564j5990j6505j3783j0553j0133j0488
58061G35374q956p449p983q243o312m814n899p196o837p220r699j1055r408q096
58047F26207r472j0410q393o406p127p800n714l504m050n072l763k011k145k182
58033E48158r1J718R80J62J740L243J888j03L45J645J034k24J45Q89K39n1J822
58016E63539L765L601L324N163P019O202M305L991M228L064J781J926J593r16
$$ y = [2376213, 2310859, 2249908, 2184745, 2113758, 2041699, 1970281, 1897834, 1826848, 1763004, 1707152, 1655984, 1609646, 1570891, 1537637, 1504244, 1469709, 1437319, 1406857, 1374290, 1338687, 1302591, 1266127, 1227412, 1188181, 1152364, 1119554, 1086110, 1052119, 1021044, 993160, 965572, 938179, 913552, 891367, 868959, 846943, 828390, 812826, 796836, 780331, 766548, 755995, 745862, 735374, 726418, 718969, 710986, 702743, 696431, 691617, 685718, 678522, 671685, 664465, 654766, 643711, 634303, 626207, 616735, 606325, 597932, 591526, 584399, 576599, 570885, 567381, 563331, 558259, 554496, 552485, 550340, 548158, 548067, 549785, 550765, 550927, 552667, 555910, 557798, 557695, 558040, 559685, 560719, 560495, 560640, 561529, 561768, 561717, 563539, 567304, 570905, 574229, 579392, 586411, 592613, 596918, 600909, 605137, 608201, 609982, 611908, 613501, 612585]
58002F12585k968j726P06Q01o07o68N4q89l145m764n936p676q951q842r202j1591
57986E47181j4006j4093j2930j2252j0877p614m648m064l932j861N17Q02N78K388
57972D65189M756M865L753M184N502N318M205M129M137K309J55L51J674R58j280
57957E10205j938r42j066k878m313m798n729p129p580p105o760o047l996j941
57943D47983j794k503j621M18J163L51k23k73r79j950j697p69j120k826m351n563
57927D24246p508r800j1176j1989j3277j4145j2981j0486q634p425n656l915l634
57914C03620l982k925p73M97Q53J972L861M945N163N925P255P850P751Q109Q666
57899C58787Q165O998O670P014O672N867N972O686O501N532N099M903L455J064
$$ y = [612585, 609617, 607891, 608597, 609398, 608791, 608123, 608177, 607288, 604143, 599379, 593443, 585767, 576816, 567974, 558772, 547181, 533175, 519082, 506152, 493900, 483023, 475409, 470761, 466697, 462765, 460904, 461421, 462223, 462801, 465189, 469945, 474810, 478563, 482747, 488249, 493567, 497772, 501901, 506038, 508347, 508502, 508853, 510527, 511485, 510205, 508267, 507325, 506259, 503381, 499068, 494270, 488541, 481412, 473832, 466727, 459967, 453920, 449924, 447983, 446189, 443686, 442065, 442483, 443646, 443997, 443774, 443501, 442522, 440572, 438875, 438106, 436986, 434160, 429809, 424246, 416738, 406938, 395762, 383773, 370496, 356351, 343370, 332884, 324250, 316825, 311169, 307254, 303620, 299638, 296713, 295940, 296437, 297290, 299262, 303123, 308068, 313231, 319156, 326411, 334261, 342012, 350121, 358787, 366952, 373950, 380620, 387634, 394306, 400173, 406145, 412831, 419332, 424864, 429963, 434866, 438321, 439385]
57885D39385m93j085k171l823m626m492m769n515n421m518m347n219n774n431
57871C81701m904m285k905j195l71k23N70J972K676K541K741L504L902L811L917
57856C93452L928K975J607J210J562J260L40J49P19P00r8m42QK99J95M44J050
57839D09358J270J217J502J516L06j210j254k52l63k027l548m150m891o216p078
57824C84180p016o904p142p142o988p614q924r637r344q924q735q136p020o095
57810B74559n555n119n151n948o307m842k475j339j461r63O01J730J841K093K869
57795B44533L041K368K308L723N733P477R045J0141R789P986N968M353K666R27
57781C20058j59p65j809l017l085k080j657k607m023n239o524p591p464o341n670
$$ y = [439385, 438892, 437807, 435636, 431813, 427187, 422695, 417926, 412411, 406990, 402472, 398125, 392906, 387132, 381701, 376797, 372512, 369607, 368412, 368041, 367818, 368388, 370360, 373036, 375577, 378318, 381822, 385724, 389535, 393452, 397380, 400355, 401962, 403172, 404734, 405994, 406334, 406483, 407202, 407902, 407804, 407362, 407370, 407669, 407864, 408308, 409358, 410628, 411845, 413347, 414863, 415169, 413959, 412705, 412453, 412090, 410063, 406515, 402365, 397474, 391258, 384180, 377164, 370260, 363118, 355976, 348988, 341374, 332450, 322813, 313469, 304545, 295810, 287674, 280654, 274559, 269004, 263885, 258734, 252786, 246479, 241637, 239162, 237823, 236362, 235399, 236000, 237730, 239571, 241664, 244533, 247574, 249942, 252250, 255973, 261706, 269183, 278228, 288369, 298158, 306144, 312112, 316465, 319131, 320058, 319899, 319134, 317325, 314308, 311223, 309143, 307486, 304879, 300856, 295617, 289093, 281502, 274038, 267697, 262027]
57766B62027n867n804m918l940l169j969m10M93O07Q97J577J855J745K125K830
57751B48079K800K306K776M069M357L185K255K479K687K047J466J636J854J727
57737B83723J959K551K336J159M71Q22R65L81L99J700K932L154L470M783N939
57722C16744N733N010N118N840O389O949P744Q021P435P176Q259R849J0649J0830
57708D21746J1294J2092J2757J3264J3728J4081J4853J7008K0229K2719K3694
57697E97465K4656K7241L1148L5275L9558M4504N0137N6561O4501P4216Q4914
57686A130176R6093J08376J22196J36869J51785J67231J83160J98370K11558K21767
57676B727581K27116K24837K13608J94394J68213J35035R6246N6301K0276q973
$$ y = [262027, 256160, 250356, 245438, 241498, 238329, 236360, 235950, 236443, 237050, 237947, 239524, 241379, 243124, 245249, 248079, 250879, 253185, 255961, 260030, 264387, 267572, 269827, 272306, 274993, 277040, 278506, 280142, 281996, 283723, 285682, 288233, 290569, 291728, 292199, 293021, 293986, 294367, 294766, 296466, 299398, 302552, 306022, 310805, 316744, 322477, 327487, 332605, 338445, 344834, 351783, 359527, 367548, 374983, 382159, 390418, 400267, 410916, 421746, 433040, 445132, 457889, 471153, 484881, 498962, 513815, 530823, 551052, 573771, 597465, 622121, 649362, 680510, 715785, 755343, 799847, 849984, 906545, 971046, 1045262, 1130176, 1226269, 1334645, 1456841, 1593710, 1745495, 1912726, 2095886, 2294256, 2505814, 2727581, 2954697, 3179534, 3393142, 3587536, 3755749, 3890784, 3987030, 4043331, 4063607, 4054634]
57666D054634l0266m3190n0243n8499p6106j06394j45832j86552k19865k39152
57656B898535k42306k32068k13245j89903j65197j41996j21848j04190q7989p3533
57646A326260o1466n1246m1909l3600k6864k1209j5720j0444n845j551L149Q171
57634A067726J3182J8569K4718L1107L7321M4175N2587O2075P1648Q1535R2727
57623A597370J05349J18720J32430J46080J58452J68199J74909J78369J77162
57614B957040J69091J52644J27359R3487N2541P726l7217p9371j16385j45952
57604C180963j66761j79296j84751j83807j77402j67715j56912j45526j33279
57595A685514j20805j09325r9096q9627q0954p3483o6857o0290n3801m8017m3066
$$ y = [4054634, 4024368, 3981178, 3930935, 3872436, 3796330, 3689936, 3544104, 3357552, 3137687, 2898535, 2656229, 2424161, 2210916, 2021013, 1855816, 1713820, 1591972, 1487782, 1399793, 1326260, 1264794, 1213548, 1171639, 1138039, 1111175, 1089966, 1074246, 1063802, 1057957, 1056406, 1059555, 1067726, 1080908, 1099477, 1124195, 1155302, 1192623, 1236798, 1289385, 1351460, 1423108, 1504643, 1597370, 1702719, 1821439, 1953869, 2099949, 2258401, 2426600, 2601509, 2779878, 2957040, 3126131, 3278775, 3406134, 3499621, 3552162, 3559888, 3522671, 3443300, 3326915, 3180963, 3014202, 2834906, 2650155, 2466348, 2288946, 2121231, 1964319, 1818793, 1685514, 1564709, 1455384, 1356288, 1266661, 1185707, 1112224, 1045367, 985077, 931276, 883259, 840193]
57584H40193l8576l4557l1300k8705k6474k4586k2928k1034j8904j7371j6746
57573E59012j5874j3628j0617q346p326p031p084p243o858n551l965k806j732
57560D60951k28J157J715J977K847L988M515M734N673P278Q613R568J0789J2161
57546E35738J2875J3109J4060J6191J8692K0947K3334K6303K9710L3379L7532
57535G81870M2436M8140N4610O1618O8776P6193Q4697R4769J05713J16605J27337
57524A662764J37693J46105J50620J50617J46310J36884J20660R7095O7413L3361
57514B849522l336m0158p3766j01436j21980j35418j42426j44098j41517j35490
57504A809897j27088j17891j08884r9665q9685p9757p1185o3919n6879m9857m3628
$$ y = [840193, 801617, 767060, 735760, 707055, 680581, 655995, 633067, 612033, 593129, 575758, 559012, 543138, 529510, 518893, 510547, 503221, 496190, 489106, 481863, 475005, 469454, 465489, 462683, 460951, 460723, 461880, 463595, 465572, 468419, 472407, 476922, 481656, 487329, 494607, 503220, 512788, 523577, 535738, 548613, 561722, 575782, 591973, 610665, 631612, 654946, 681249, 710959, 744338, 781870, 824306, 872446, 927056, 988674, 1057450, 1133643, 1218340, 1313109, 1418822, 1535427, 1662764, 1800457, 1946562, 2097182, 2247799, 2394109, 2530993, 2651653, 2748748, 2816161, 2849522, 2846186, 2806028, 2732262, 2630826, 2508846, 2373428, 2231002, 2086904, 1945387, 1809897, 1682809, 1564918, 1456034, 1356369, 1266684, 1186927, 1115742, 1051823, 994944, 945087, 901459]
57493I01459l8292l2961k7291k2055j7828j4268j0960p996n272k218J359M816
57481G28493P539R763J2219J5383J9310K3817K8767L4286M0733M8187N6170O4135
57469A088802P2027Q0127Q8717R7985J07734J17020J24728J30669J35092J36807
57459B179708J33046J21858J03527P9004M8529J3072k4198n9514r0719j16626
57449B387687j35540j46364j50398j50041j46194j38692j28671j18308j08434
57440A165045r8374q8126p8821p0910o3700n6886n0937m5803m0858l6276l2859
57429E01495l0324k7396k3829k0753j8699j6919j5034j3717j3264j2984j2516
57418B96060j2307j2212j1197r094p248o598o424n820n209n435o280o796o476
$$ y = [901459, 863167, 830206, 802915, 780860, 763032, 748764, 737804, 729808, 724536, 722318, 723677, 728493, 736032, 745795, 758014, 773397, 792707, 816524, 845291, 879577, 920310, 968497, 1024667, 1088802, 1160829, 1240956, 1329673, 1427658, 1535392, 1652412, 1777140, 1907809, 2042901, 2179708, 2312754, 2434612, 2538139, 2617143, 2665672, 2678744, 2654546, 2595032, 2504313, 2387687, 2252147, 2105783, 1955385, 1805344, 1659150, 1520458, 1391787, 1273479, 1165045, 1066671, 978545, 899724, 828814, 765114, 708228, 657291, 611488, 570630, 534354, 501495, 471171, 443775, 419946, 399193, 380494, 363575, 348541, 334824, 321560, 308576, 296060, 283753, 271541, 260344, 251250, 244002, 237404, 230980, 225160, 219951, 214516, 208236, 201440, 194964]
57405A94964n381l784k230j353j249j542k163l208m012l524j928p17p25j115q35
57390A61198o5L90L25P6p0K3L13L46l21j325j797j545j149r38p33o06q17j053
57372A52252q70q01j765l273l717k680j495j120j021o84o10j032j119m92k41j293
57356A30039k773l159k283j188n73l00%N71J386J923J622P82L41N02N28J26l0
57339A27514L93O79K76k91l25J51Q89J787K298J621R1p69k52O42R94J231J775
57322A38704J848Q58k45l89r5l25o00J52J576K335K225K272K882L365L305L153
57306A61021L305L556L714L959M405M909N349N642N559N058M674N091O339P757
57292B30338Q658Q886Q914R543J1168J3261J5007J6393J8041K0023K1739K3026
$$ y = [194964, 189583, 185799, 183569, 182216, 180967, 179425, 177262, 174054, 170042, 166518, 164590, 163873, 163148, 162033, 161198, 161133, 161523, 161848, 161924, 161854, 161877, 162190, 162536, 162215, 160890, 159093, 157548, 156399, 155461, 154728, 154122, 153305, 152252, 151382, 150581, 148816, 145543, 141826, 139146, 137651, 136531, 135510, 134826, 134216, 133184, 132065, 131573, 131332, 130039, 127266, 124107, 121824, 120636, 120063, 119763, 119763, 120334, 121720, 123643, 125265, 126047, 126388, 126890, 127418, 127544, 127514, 127907, 128586, 128862, 128571, 128246, 128397, 129286, 131073, 133371, 134992, 135083, 134314, 134062, 134704, 135698, 136929, 138704, 140552, 141410, 141165, 140776, 140681, 140356, 139756, 139908, 141484, 143819, 146044, 148316, 151198, 154563, 157868, 161021, 164326, 167882, 171596, 175555, 179960, 184869, 190218, 195860, 201419, 206477, 211151, 216242, 222581, 230338, 238996, 247882, 256796, 266339, 277507, 290768, 305775, 322168, 340209, 360232, 381971, 404997]
57280D04997K4333K5574K5985K5510K5089K5013K4253K2169J9564J7127J4108
57269F53722R667M358r61o690j3430k0218k5285k8138k9522k9882k9155k7682
57257D56784k5960k3807k0982j8265j6764j6383j6096j5417j4474j3053j0863
57246B64720q526p041o384n757n032m713m720m369l578k836k106r64K17M90j13
57231B09288m94j52K39J71J52P44J699K452K773K621J954J038L96L15P20J417
57215B25333K036K017J271O07P37J256J391J339J827K750L412L839M596N465N650
57200B63526N319N501O361O970P013P325Q345R348R700R668R480Q836P903P587
57186C72882Q144Q623Q420Q199Q555Q921Q801Q932J0082J1528J2001J1550J1264
$$ y = [404997, 429330, 454904, 480889, 506399, 531488, 556501, 580754, 602923, 622487, 639614, 653722, 663389, 667747, 666786, 660096, 646666, 626448, 601163, 573025, 543503, 513621, 484466, 456784, 430824, 407017, 386035, 367770, 351006, 334623, 318527, 303110, 288636, 275583, 264720, 256194, 249153, 242769, 237012, 231980, 227267, 222547, 218178, 214600, 211764, 209658, 208694, 208911, 209401, 209288, 208794, 208642, 208881, 209052, 209204, 209948, 211647, 214099, 216872, 219493, 221447, 222485, 222881, 223196, 223916, 225333, 227369, 229386, 230657, 231264, 232001, 233257, 234648, 235987, 237814, 240564, 243976, 247815, 252411, 257876, 263526, 268845, 274346, 280707, 287677, 294690, 302015, 310360, 319708, 329408, 339076, 348556, 357392, 365295, 372882, 381026, 389649, 398069, 406268, 414823, 423744, 432545, 441477, 451559, 463087, 475088, 486638, 497902]
57173D97902J1582J2045J2401J2877J3421J3673J3744J4183J5168J6261J7025
57162F50282J7387J7527J7847J8870K0686K2644K4024K4862K5757K7101K8803
57151H95790L0564L2002L2843L3278L3755L4194L3916L2854L2081L2545L3914
57140A257736L5376L6945L9048M1335M3010M4022M4913M5722M6085M6233M6804
57129A727229M7743M8467M8997M9906N1206N2523N4313N7588O2238O7004P1396
57118B338610P6317Q2459Q9480R7268J06445J16877J27120J36328J45503J56077
57108C472484J68662J84064K04034K29748K61097K98802L45634M04246M75722
57099F044493N62388O70508Q08255R82864J202019J475420J810958K209997K668221
$$ y = [497902, 509484, 521529, 533930, 546807, 560228, 573901, 587645, 601828, 616996, 633257, 650282, 667669, 685196, 703043, 721913, 742599, 765243, 789267, 814129, 839886, 866987, 895790, 926354, 958356, 991199, 1024477, 1058232, 1092426, 1126342, 1159196, 1191277, 1223822, 1257736, 1293112, 1330057, 1369105, 1410440, 1453450, 1497472, 1542385, 1588107, 1634192, 1680425, 1727229, 1774972, 1823439, 1872436, 1922342, 1973548, 2026071, 2080384, 2137972, 2200210, 2267214, 2338610, 2414927, 2497386, 2586866, 2684134, 2790579, 2907456, 3034576, 3170904, 3316407, 3472484, 3641146, 3825210, 4029244, 4258992, 4520089, 4818891, 5164525, 5568771, 6044493, 6606881, 7277389, 8085644, 9068508, 10270527, 11745947, 13556905, 15766902, 18435123]
57090A8435123L176818L717099M257515M764800N216953N594755N861350N970490
57082E6994903N912411N743869N549497N360593N114922M700285M036349L119276
57074I6532105K003887P58949n58034j893357l178667m329989n269976n952529
57066G8112389o367664o529130o464029o212008n823273n348519m829639m299544
57058C2238583l785307l306371k871478k481532k135802j833913j574023j352763
57050A2897394j167146j014537q90904p90829p09045o40839n81800n28769m80611
57041F092914m36870l96377l58243l23078k91751k63741k38105k15113j95356
57032C374280j78122j62268j47978j36072j26218j17334j09203j02166r5839q9607
$$ y = [18435123, 21611941, 25329040, 29586555, 34351355, 39568308, 45163063, 51024413, 56994903, 62907314, 68651183, 74200680, 79561273, 84676195, 89376480, 93412829, 96532105, 98535992, 99294941, 98736907, 96843550, 93664883, 89334894, 84064918, 78112389, 71744725, 65215595, 58751566, 52539558, 46716285, 41367766, 36538127, 32238583, 28453276, 25146905, 22275427, 19793895, 17658093, 15824180, 14250157, 12897394, 11730248, 10715711, 9824807, 9033978, 8324933, 7684094, 7102294, 6573525, 6092914, 5656044, 5259667, 4901424, 4578346, 4286595, 4022854, 3784749, 3569636, 3374280, 3196158, 3033890, 2885912, 2749840, 2623622, 2506288, 2397085, 2294919, 2199080, 2109473]
57022B109473q3814p9032p4760p0254o5910o2316n8694n4001m8879m4775m1701
57011A425337l8583l5335l2629l0070k6515k1957j7206j1878m509N333J6957L0425
56999A259370M6728O5840Q6525J08695J34758J67784K07625K46619K67462K48760
56989B840166J79117O9117n2125j54163k20234k49014k47733k26281j94675j61432
56979A582743j32388j10772r7420r0550q6719q3146p8794p3319o6294n7948m9383
56968F56010m1315l3560k6165j9824j4666r743m350J182O495J1855J7299K2322
56956E65540K6953L1787L6091L6945L1454J9400L329j3088k6437l4556l7340l6303
56944F03775l2995k8269k2984j8162j4003r740n007l90L785Q076J2849J7592K2007
$$ y = [2109473, 2025659, 1946627, 1871867, 1801613, 1735703, 1673387, 1614693, 1560692, 1511813, 1467038, 1425337, 1386754, 1351419, 1318790, 1288720, 1262205, 1240248, 1223042, 1211164, 1206655, 1211988, 1228945, 1259370, 1306098, 1371938, 1458463, 1567158, 1701916, 1869700, 2077325, 2323944, 2591406, 2840166, 3019283, 3088400, 3036275, 2882112, 2661878, 2412864, 2165131, 1938850, 1744175, 1582743, 1450355, 1339583, 1242163, 1151613, 1064894, 981748, 902954, 829635, 763341, 705393, 656010, 614695, 581135, 554970, 535146, 520480, 510737, 506387, 507569, 514064, 525919, 543218, 565540, 592493, 624280, 660371, 697316, 728770, 748170, 751499, 738411, 711974, 677418, 640078, 603775, 570780, 542511, 519527, 501365, 487362, 477622, 472615, 472225, 476010, 484086, 496935, 514527, 536534]
56931E36534K6865L3046M0122M6155M8196M3108K9426R224j2559l1218m4272n0928
56919F73699n1410m7394m1614l5973l0732k5855k1861j8857j6057j3090j0716
56908C60140r547r068q582p929o767m508j637K45O07Q58K094L572M489N763Q455
56893C38185J1682J3841J5078J6793J9353K1984K4507K7597L1284L4502L6074
56882E90880L5109L0609K1903R771l529j5411k3993k8474k9265k7574k4439k0308
56870E15279j5591j0826o050p19N365J1809J8634K6400L4999M3504N1867O1342
56858G36013P2116Q1372Q4530P7743N9103K9638n286l7103n9004o9831p2411o9288
56846H27592o1558n0646l8724k7224j6327n868M396J5180K7127M0108N3844O8708
$$ y = [536534, 563399, 596445, 636567, 682722, 730918, 774026, 803452, 812676, 800117, 768899, 724627, 673699, 622289, 574895, 533281, 497308, 466576, 440721, 418860, 400003, 383946, 370856, 360140, 350593, 341525, 332943, 325014, 318247, 313739, 312102, 312347, 312954, 313812, 315906, 319478, 323967, 329730, 338185, 349867, 363708, 378786, 395579, 414932, 436916, 461423, 489020, 520304, 554806, 590880, 625989, 656598, 678501, 688272, 684743, 669332, 645339, 616865, 587600, 560026, 535587, 515279, 499688, 488862, 482812, 482093, 487458, 499267, 517901, 544301, 579300, 622804, 674671, 736013, 808129, 889501, 974031, 1051774, 1110877, 1140515, 1135229, 1098126, 1039122, 969291, 896880, 827592, 766034, 715388, 676664, 649440, 633113, 627245, 631641, 646821, 673948, 714056, 767900, 836608]
56834H36608Q4872J01356J16834J30062J37610J32258J06845O1188M213n1101
56824A660745r4527j21511j32408j30443j19713j03885q6050o8838n3594l9719
56814G10057k5889j1888J468J3894K5992L8196N0437O2953P6211Q9194R8086R7072
56802A225783Q1168M9668P914l4737o9765r2913j03763j03826r6015q4339p1999
56791G07176n9850m7660l6075k6069j7285q692l98O814J3447K0989K9676L8153
56779F20226M5207N0067N0812M4472K9741Q745j4243l4955n0147n8228n9860n7275
56767E74562n2497m6534m0113l4044k8663k3765j9323j5598j2611j0230q660p957
56755B74567p314n900m261l664m137m344l565k493j890j678j607j746j906j581
$$ y = [836608, 921480, 1022836, 1139670, 1269732, 1407342, 1539600, 1646445, 1707633, 1711846, 1660745, 1566218, 1444707, 1312299, 1181856, 1062143, 958258, 872208, 803370, 749776, 710057, 684168, 672280, 673748, 687642, 713634, 751830, 802267, 865220, 941431, 1030625, 1128711, 1225783, 1306951, 1356619, 1364533, 1329796, 1260031, 1167118, 1063355, 959529, 863514, 779175, 707176, 647326, 599666, 563591, 537522, 520237, 511545, 511147, 517961, 531408, 552397, 582073, 620226, 665433, 715500, 766312, 810784, 840525, 849270, 835027, 800072, 749925, 691697, 631837, 574562, 522065, 475531, 435418, 401374, 372711, 348946, 329623, 314025, 301414, 291184, 282524, 274567, 267253, 261353, 257092, 253428, 249291, 244947, 241382, 238889, 236999, 235321, 233714, 231968, 230062, 228481]
56741B28481q67m98p62j142j263j313j408j404j457j901k494k663k485k443k334
56726B04047j541m20j01o94j001m45M8l92j271j637j412j120j039j181j497j661
56710A88683j218k62N30P85P24N78L24J20K21L88J32m26p13p01q44j070q13j06
56692A86332L58L20J29k47j148k098k009q41J10P3k21J41R53J536J738J722J443
56675A88291R38N12K97J47J28M44Q41P93L31j19o02j429k157j915q21J15N03Q34
56657A87131J182J061P81J460L225M746N096M792M519M152L638L572M077M230
56643B33662L419K334J838J776J554J025J93j105k617l550l616l429l518l710
56629B24256l845m125m408m161l474l103l153k827j850j015r14j269j783k432
$$ y = [228481, 227614, 227116, 226354, 225212, 223949, 222636, 221228, 219824, 218367, 216466, 213972, 211309, 208824, 206381, 204047, 202506, 202086, 201985, 201291, 200290, 199845, 199893, 199501, 198230, 196593, 195181, 194061, 193022, 191841, 190344, 188683, 187465, 187203, 187733, 188518, 189242, 189820, 190144, 190264, 190485, 190873, 191005, 190579, 189866, 189165, 188321, 187251, 186438, 186332, 186690, 187010, 187139, 186892, 185744, 183646, 181637, 180796, 180906, 180979, 180758, 180899, 181852, 183388, 185126, 186848, 188291, 189229, 189741, 190038, 190185, 190313, 190757, 191598, 192391, 192722, 192603, 192001, 190572, 188415, 186500, 185679, 185794, 186297, 187131, 188313, 189374, 190155, 191615, 194840, 199586, 204682, 209474, 213993, 218145, 221783, 225355, 229432, 233662, 237081, 239415, 241253, 243029, 244583, 245608, 245801, 244696, 242079, 238529, 234913, 231484, 227966, 224256, 220411, 216286, 211878, 207717, 204243, 201140, 197987, 195160, 193310, 192295, 191381, 190112, 188329, 185897]
56615A85897k630j562K80J379J443J654K268J912J90j123p11L20N66O02J354J809
56599A93648N42j579k373j353P5R38J430J609J140K82k18k29j99j23M30J356K027
56582A97403K057J489N44k07L4J216K169K118J796K181K898K927K316K046K621
56567B23608L731M998O134O785O944P155P653P938P839Q191R550J1045J1534J1187
56553C34292J0938J0892J0512R819R305Q925Q178O915N343L515J525k48j674l180
56539D15057m963o530p587q515r457r837r568r590j0379j0942j0415r548r437
56526B98289r710r305q182o938n547l830k544k487l125l376l225l304l435l001
56512B30280k260j977k086j992j781j898k086j758j055m99j08J29l27j494k002
$$ y = [185897, 183267, 181705, 181985, 183364, 184807, 186461, 188729, 190641, 190831, 189708, 188997, 189317, 189883, 190485, 191839, 193648, 194190, 192611, 190238, 188885, 188960, 189898, 191328, 192937, 194077, 194359, 194141, 193912, 193713, 193590, 194020, 195376, 197403, 199460, 200949, 201493, 201286, 201320, 202536, 204705, 206823, 208619, 210800, 213698, 216625, 218941, 220987, 223608, 227339, 232337, 238471, 245256, 252200, 259355, 267008, 274946, 282785, 290976, 300526, 311571, 323105, 334292, 345230, 356122, 366634, 376453, 385758, 394683, 402861, 409776, 415119, 418634, 420159, 419911, 418237, 415057, 410094, 403564, 395977, 387462, 378005, 368168, 358600, 349010, 338631, 327689, 317274, 307726, 298289, 288579, 279274, 271092, 264154, 258607, 254777, 252233, 249746, 246621, 243245, 240020, 236716, 233281, 230280, 228020, 226043, 223957, 221965, 220184, 218286, 216200, 214442, 213387, 212888, 212780, 212909, 212582, 211088, 209086]
56497B09086p21J323K178J558P35M07J72j85l76m23m99k90L72P45L23M6R16K103
56479B17470K120J280J208K173K860K630K226K167K139K138K662L596M225M445
56465B53339M672M746M266L877M545N702N750M559L753M183M761M267K920J574
56451C12914M99l06n83k06M15P17M13l42q87n05N45R98K60o46o24o5J87L57Q47
56432C13988Q31n18k236k823k597k842l286k644j258q63j769k590k792l270m107
56417B81224m061k804j650j415j398j081j048j535j757j440j439k152k799k883
56403B53762k909k984k226l82J268J554Q74L14K54M71P80J003R84R50J182J362
56387B56257J026N10M37N52K31j67J83R18R17K29n0K75L34p1k18j2qJ17J233K815
$$ y = [209086, 208365, 209688, 211866, 213424, 214159, 214566, 214738, 214553, 214177, 213754, 213255, 212965, 213337, 214082, 214405, 214451, 215367, 217470, 219590, 220870, 222078, 224251, 227111, 229741, 231967, 234134, 236273, 238411, 241073, 244669, 248894, 253339, 258011, 262757, 267023, 270900, 275445, 281147, 286897, 291456, 295209, 299392, 304153, 308420, 311340, 312914, 313413, 313107, 312524, 312318, 312733, 313450, 313863, 313521, 312634, 312129, 312674, 313672, 313932, 313286, 312662, 312597, 312784, 313141, 313988, 314819, 314301, 312065, 309242, 306645, 303803, 300517, 297873, 296615, 295752, 293983, 291393, 288601, 285331, 281224, 277163, 274359, 272709, 271294, 269896, 268815, 267767, 266232, 264475, 263035, 261596, 259444, 256645, 253762, 250853, 247869, 245643, 245261, 246529, 248083, 248957, 249271, 249525, 249996, 250776, 251779, 252763, 253713, 254895, 256257, 257283, 257793, 258230, 258782, 259013, 258846, 259029, 259947, 260864, 261093, 261043, 261318, 261652, 261581, 261363, 261351, 261343, 261460, 262693, 265508]
56367B65508L213K211J382J593K019K057K252K747K758K136J819K071K047J593
56353B95406J665K369K437J438O59R64J477J249O70L14k5l39J2R66J410R47N66
56336C12185R37J510J890K489L233L267K635K599L543M335M367M470N011N105
56322C57576M598M860O433P764P625P060P508Q620R338R755J0334J0527R637Q110
56308D69745O713N318L551J772N00l92j150j699k121k664k926k298j394j463k142
56293D69350j678J71J548J509J505K780M375N044N362O446Q015R186R982J0836
56279E34431J1756J2899J4826J7331J9315K0521K1989K4154K6129K7624K9798
56268G60773L3373L7543M1651M6242N1643N7258O3184P0642P9913Q9683R9294
$$ y = [265508, 268721, 270932, 272314, 273907, 275926, 277983, 280235, 282982, 285740, 287876, 289695, 291766, 293813, 295406, 297071, 299440, 301877, 303315, 303974, 304938, 306415, 307664, 308334, 308648, 308623, 308284, 308296, 309262, 310672, 311619, 312185, 313122, 314632, 316522, 319011, 322244, 325511, 328146, 330745, 334288, 338623, 342990, 347460, 352471, 357576, 362174, 367034, 373467, 381231, 388856, 395916, 403424, 412044, 421382, 431137, 441471, 451998, 461635, 469745, 476458, 481776, 485327, 487099, 487599, 487207, 486057, 484358, 482237, 479573, 476647, 474349, 472955, 471492, 469350, 467672, 467843, 469391, 470900, 472405, 475185, 479560, 484604, 489966, 496412, 504427, 513613, 523595, 534431, 546187, 559086, 573912, 591243, 610558, 631079, 653068, 677222, 703351, 730975, 760773, 794146, 831689, 873340, 919582, 971225, 1028483, 1091667, 1162309, 1242222, 1331905, 1431199]
56257A431199J09694J21265J32796J43614J54548J65668J75173J81672J85455
56248B801084J86413J83016J74649J62597J47346J27313J01886P3431M4654J6169
56238D018558j1713l7161n8710p6791r1691j02216j08103j11345j13267j12707
56228C194854j09143j05079j02966j02027j00554r9081r8755r8705r7756r6851
56218B183937r7192r7708r6824r4959r2921q9795q4976q0287p7297p4389o9323
56207A228266o2974n7595n3031m7686m1920l7493l4552l1809k8774k5643k2191
56196G84598j8770j6895j6801j6285j4067j2080j2013j2081j0184p799p289p543
56184F32791o100l728k905l179k097K06J419J361K124M199N915O582P163P981
$$ y = [1431199, 1540893, 1662158, 1794954, 1938568, 2093116, 2258784, 2433957, 2615629, 2801084, 2987497, 3170513, 3345162, 3507759, 3655105, 3782418, 3884304, 3957735, 4002389, 4018558, 4006845, 3969684, 3910974, 3834183, 3742492, 3640276, 3532173, 3420828, 3307561, 3194854, 3085711, 2980632, 2877666, 2775639, 2675085, 2576004, 2477249, 2378544, 2280788, 2183937, 2086745, 1989037, 1892213, 1797254, 1704333, 1614538, 1529562, 1449275, 1371978, 1297589, 1228266, 1165292, 1107697, 1054666, 1006980, 965060, 927567, 893015, 861206, 832432, 806789, 784598, 765828, 748933, 732132, 715847, 701780, 689700, 677687, 665606, 655422, 647623, 640334, 632791, 626691, 622963, 620058, 616879, 614782, 614988, 616407, 617768, 619892, 624091, 630006, 636588, 643751, 651732]
56170F51732Q555R290J0861J2401J2722J2477J2791J2899J1597R748Q740P779
56158G81592N523K929J620R17n19j638q42P54J246J570L672O529P851Q409J0806
56143H30419J5045J9152K3221K8958L6076M3164N1285O2756P6933R0994J04248
56132A382251J17818J30526J38988J41399J37944J28318J12732R4700P8965O7034
56122B530675N7863N1572M8384M4979L6633K2851P200p693k1051l1037l5884l7860
56110B666632m1891n0230o1926p6500r3717j10282j21450j25862j25100j19373
56100A740301j08041r3541p9961o7982n5713m3894l5459l0414k6057k1991k0074
56089A157174j9718j8189j5504j4135j4070j2933j0803r949j0029q553n767m150
$$ y = [651732, 660287, 669577, 680438, 692839, 705561, 718038, 730829, 743728, 755325, 765073, 773813, 781592, 787115, 790044, 791664, 792581, 792062, 790424, 789582, 790336, 791582, 793152, 796824, 803353, 811204, 819613, 830419, 845464, 864616, 887837, 916795, 952871, 996035, 1047320, 1110076, 1187009, 1278003, 1382251, 1500069, 1630595, 1769583, 1910982, 2048926, 2177244, 2289976, 2384676, 2463641, 2530675, 2588538, 2640110, 2688494, 2733473, 2770106, 2792957, 2800157, 2792464, 2771413, 2740376, 2704492, 2666632, 2624741, 2574511, 2512585, 2436085, 2342368, 2232086, 2110636, 1984774, 1859674, 1740301, 1632260, 1538719, 1458758, 1390776, 1335063, 1291169, 1255710, 1225296, 1199239, 1177248, 1157174, 1137456, 1119267, 1103763, 1089628, 1075558, 1062625, 1051822, 1041873, 1031844, 1023291, 1017524, 1013374]
56077A013374l415j243J560K064R52J609L964M953M757O393R378J0097Q581Q563
56063A071587J0574J1409J0708J1487J3731J4080J2492J2550J4509J4759J2974
56052A210860J2919J5288J6626J6259J7289J9711J9801J7500J7137J9506K0599
56041A403495J9584K0400K3805K5610K4738K5329K8687L0725K9791K9558L1725
56030A693447L3152L2623L3205L5767L7259L7406L9633M3781M5624M5114M6852
56019B123863N0938N2232N0376N1148N5743N8339N6895N6661O0143O3226O4175
56008B743739O6692P1182P2959P2061P4540Q1265Q6045Q7577R1816R9658J04507
55997C652041J05493J10331J21119J30336J35201J42584J54944J65335J71513
$$ y = [1013374, 1009959, 1008716, 1010276, 1012340, 1013292, 1014901, 1018865, 1023818, 1028575, 1034968, 1044346, 1054443, 1063024, 1071587, 1082161, 1093570, 1104278, 1115765, 1129496, 1143576, 1156068, 1168618, 1183127, 1197886, 1210860, 1223779, 1239067, 1255693, 1271952, 1289241, 1308952, 1328753, 1346253, 1363390, 1382896, 1403495, 1423079, 1443479, 1467284, 1492894, 1517632, 1542961, 1571648, 1602373, 1632164, 1661722, 1693447, 1726599, 1759222, 1792427, 1828194, 1865453, 1902859, 1942492, 1986273, 2031897, 2077011, 2123863, 2174801, 2227033, 2277409, 2328557, 2384300, 2442639, 2499534, 2556195, 2616338, 2679564, 2743739, 2810431, 2881613, 2954572, 3026633, 3101173, 3182438, 3268483, 3356060, 3447876, 3547534, 3652041, 3757534, 3867865, 3988984, 4119320, 4254521, 4397105, 4552049, 4717384, 4888897]
55988D888897J80839J95789K09128K19010K33638K54997K73985K87920L06273
55979G050476L32388L57189L78093M05684M43788M82587N19856N68430O33421
55970A1171912P03753P76093Q64018R73135J092283J221054J379343J577458J806594
55961B1565643K073278K411719K847974L390139M074039M978571O171602P680417
55953E5193382R536151J1793808J4475025J7543520K0971839K4778539K8975753
55946A83268017L3533719L8299873M2583627M4572828M1528260L1376780J4685790
55939D29848894m955513k2798689l5452514m2005863m3395802m1218297l7006626
55932B03015590l1990524k6995479k2438616j8475341j5155520j2457374j0283640
$$ y = [4888897, 5069736, 5265525, 5474653, 5693663, 5927301, 6182298, 6456283, 6744203, 7050476, 7382864, 7740053, 8118146, 8523830, 8967618, 9450205, 9970061, 10538491, 11171912, 11875665, 12651758, 13515776, 14488911, 15581194, 16802248, 18181591, 19759049, 21565643, 23638921, 26050640, 28898614, 32288753, 36362792, 41341363, 47512965, 55193382, 64729533, 76523341, 90998366, 108541886, 129513725, 154292264, 183268017, 216801736, 255101609, 297685236, 342258064, 383786324, 415163104, 429848894, 424893381, 402094692, 366642178, 324636315, 281240513, 240022216, 203015590, 171025066, 144029587, 121590971, 103115630, 87960110, 75502736, 65219096]
55925F5219096q522043p102338n972231n060594m302761l672617l158223k730750
55917B4697539k362854k052139j800555j591065j405839j247030j119257j010142
55909A2108658r06866q14401p39688o74074o07796n46471m97507m54502m09865
55900F457488l69264l39385l14142k86396k61210k44642k30997k13444j96328
55891D001680j85180j75131j60729j47100j40151j35224j26178j16564j11519
55882B703904j07363r9326r1127q7299q4078p7188p0567o8380o6402o0206n4093
55871A837875n2866n2398m7351m0994l8444l7152l3003k9219l0250l3053l2983
55860A410162l2362l4719l6492l3009k7286k4382k2306j6829j0208o772m528M15
$$ y = [65219096, 56697053, 49594715, 43622484, 38561890, 34259129, 30586512, 27428289, 24697539, 22334685, 20282546, 18481991, 16890926, 15485087, 14238057, 13118800, 12108658, 11201792, 10387391, 9647703, 8973629, 8365833, 7819362, 7321855, 6867353, 6457488, 6088224, 5748839, 5434697, 5148301, 4887091, 4642449, 4411452, 4198008, 4001680, 3816500, 3641369, 3480640, 3333540, 3193389, 3058165, 2931987, 2815423, 2703904, 2596541, 2497215, 2406088, 2318789, 2234711, 2157523, 2086956, 2018576, 1952174, 1891968, 1837875, 1785009, 1732611, 1685260, 1644266, 1605822, 1568670, 1535667, 1506448, 1476198, 1443145, 1410162, 1377800, 1343081, 1306589, 1273580, 1246294, 1221912, 1199606, 1182777, 1172569, 1165797, 1161269, 1161684]
55848A161684N164L977k673j0360j8263k7192l3828l4475l1475k9134k6520k0877
55836I36028j4572j1686j0952q992p455r951j4592j6647j6369j7511k0015k0629
55824G66657j9232j8465j8512j7692j6790j7633j9008j8673j7698j8099j8387
55813E66468j6119j2727j1082j0409q384n982n427n428l256K50K389L340M794
55800D98427O009N586N069O256P138N011J444m47j440m177p841r702j0175j1456
55786D89702j2889j2388j0910j0809j1249r871p526o754o969n721l415k322k170
55773C86709j294q41l258p627j0804j2273j3582j4198j2375r222p491p045n604
55760B81095l234j977j902j559j521l330n760o222n184n116n881n373m006m215
$$ y = [1161684, 1166848, 1170825, 1168152, 1157792, 1139529, 1112337, 1078509, 1044034, 1012559, 983425, 956905, 936028, 921456, 909770, 898818, 889826, 882371, 872420, 857828, 841181, 824812, 807301, 787286, 766657, 747425, 728960, 710448, 692756, 675966, 658333, 639325, 620652, 602954, 584855, 566468, 550349, 537622, 526540, 516131, 507747, 501765, 496338, 490910, 487654, 487904, 490293, 493633, 498427, 504436, 510022, 515091, 521347, 528485, 533496, 534940, 534493, 533053, 528876, 521035, 511333, 501158, 489702, 476813, 464425, 453515, 442706, 431457, 421586, 414060, 407306, 400337, 394616, 391201, 388879, 386709, 385415, 384574, 381316, 373689, 362885, 350612, 337030, 322832, 310457, 301235, 293744, 286699, 281095, 277861, 275884, 273982, 272423, 270902, 267572, 261812, 255590, 250406, 245290, 239409, 234036, 230030, 225815]
55746B25815n877o409n292m417m202l294k033k257l544l496j837p45r39q55J07
55731A80725Q09R85J526K131J576K40n32j165l024n280n801m780m341m856m841
55716A53372m158m056m249l239j398n33n57K48J824K412K015K487M147N372N710
55701A59397O335P313P285O102M948L830J706q92k138j822j288o58J043L264M318
55686A98743M316M762N412M553K352R10Q65Q30K37j01k27r35j511n58J098J304
55670B22050K68J72J174J219o8p39j83J1o16m39R90J942J565J098J253J198Q87
55653B31782J560L120L740K847J873J400K92j691l155l709m646o275p287p422
55639B12429q017r109r017p643p203q533r532q647p162o574o263n333m449m268
$$ y = [225815, 219938, 213529, 208237, 203820, 199618, 196324, 194291, 192034, 188490, 184994, 183157, 182412, 181473, 180618, 180725, 181534, 182519, 184045, 186176, 187752, 187992, 187460, 186295, 183271, 177991, 172190, 167410, 163069, 158213, 153372, 149214, 145158, 140909, 137670, 136272, 135739, 135182, 135430, 137254, 139666, 141681, 144168, 148315, 153687, 159397, 165732, 173045, 180330, 186432, 191380, 195210, 196916, 196024, 193886, 192064, 190776, 190118, 191161, 194425, 198743, 203059, 207821, 213233, 217786, 220138, 221048, 221913, 222743, 222980, 222879, 222652, 221717, 220206, 219648, 220746, 222050, 222318, 222490, 223664, 224883, 224815, 224076, 223893, 223904, 223288, 222849, 223839, 225781, 227346, 228444, 229697, 230895, 231782, 233342, 236462, 240202, 243049, 244922, 246322, 246614, 244923, 241768, 238059, 233413, 227138, 219851, 212429, 204412, 195303, 186286, 178643, 171440, 162907, 153375, 144728, 137566, 130992, 124729, 119396, 114947, 110679]
55625A10679m040l297k951l483l833l264k534k177j518l93J10l92p68m58m34j077
55609H0170j211k87M43J05l53j19j9q36j793j935j573j260q23k93l50j033j435
55592F7398j327j510k062j986j150o98r61q97k77k45r84j012K13J148P73K30O04
55575E7257J047N43k68m57l92o00n29K20P94M27k91n33m13k21K19P28O10q6m83
55556E7572n20j075k067k251j446r50j199j094l01km76l22Q98J606J043P25J620
55539E1761K272J463N50J175K569L195L369M136N019M951M250L819L474K730K175
55524I6908K397K636K045J193Q40M17p63j980k364k536l407m488m949n305o406
55509G4238p700q062p523o738n641l991k419j479o29O07J428J070K57p5l79j315
$$ y = [110679, 106639, 103342, 100391, 96908, 93075, 89811, 87277, 85100, 83582, 83189, 83299, 82907, 82139, 81681, 81247, 80170, 78959, 78672, 79115, 79220, 78867, 78748, 78729, 77893, 76100, 74165, 72592, 71332, 70509, 70216, 69866, 68833, 67398, 66071, 64561, 62499, 60513, 59363, 58665, 57704, 56807, 56530, 56285, 55301, 54289, 54502, 55650, 56423, 56653, 57257, 58304, 58847, 58579, 58122, 57730, 57130, 56601, 56821, 57615, 58042, 57751, 57218, 56805, 56584, 56803, 57531, 58141, 58055, 57572, 57052, 55977, 53910, 51659, 50213, 49263, 48064, 46970, 46669, 46667, 46191, 45869, 46767, 48373, 49416, 50141, 51761, 54033, 55496, 56046, 57221, 59790, 62985, 66354, 70490, 75509, 80460, 84710, 88529, 92003, 94733, 96908, 99305, 101941, 103986, 105179, 106019, 106436, 105673, 103693, 101329, 98793, 95386, 90898, 85949, 80644, 74238, 66538, 58476, 50953, 44215, 38574, 34583, 32164, 30685, 30056, 30663, 32091, 33161, 33418, 33343, 32964, 31649]
55493C1649k102j693o61k54l96l01k46r58j888j831q51j0L67P01Q74M23k89m91
55475B2043l12m32p91q04n58n92q13p29l98k01l5L67P21O95N46M90O1j016j988
55456A6254k087j654j323q56J39J097J321J172J290J284M24q20j277p63j56k2
55440A4023j33j25J34O04R22O75J74K57Q54Q28j20o12L54J722J913J070L73P7
55422B2990l63q91r72o78m66k83R9L68K66K25N29N63m6m29K19J155J227P90J034
55403B5337K001K608K390J841J342Q19K89j91q25j559j810j414j177j610j962
55388B6079j506q95j059j552j347n71j43k22k91k93l93j35R11K022K124J305M58
55371B4492j45p92j319j366j212j301j297p08J31O43J058J735K094J452L74m1
$$ y = [31649, 29547, 27854, 27193, 26939, 26543, 26242, 25996, 25038, 23150, 21319, 20468, 20458, 20825, 21526, 22400, 22823, 22534, 22043, 21731, 21299, 20508, 19704, 19146, 18554, 17741, 17012, 16614, 16413, 16378, 16745, 17466, 18161, 18707, 19197, 19258, 18242, 16254, 14167, 12513, 11190, 10334, 10473, 11570, 12891, 14063, 15353, 16637, 17061, 16241, 14964, 14201, 14045, 14023, 13890, 13765, 13899, 14503, 15425, 16100, 16274, 16531, 17385, 18213, 18093, 17481, 17835, 19557, 21470, 22540, 22913, 22990, 22627, 21736, 20764, 20086, 19620, 19337, 19436, 19804, 20070, 20295, 20824, 21387, 21341, 20912, 21131, 22286, 23513, 24303, 25337, 27338, 29946, 32336, 34177, 35519, 36338, 36627, 36436, 35611, 34052, 32242, 30828, 29651, 28041, 26079, 24573, 23678, 22619, 21067, 19720, 19149, 19006, 18784, 18493, 18200, 17807, 17672, 18583, 20605, 22729, 24034, 24492, 24347, 23555, 22236, 20870, 19658, 18357, 17060, 16352, 16483, 17126, 18184, 19919, 22013, 23465, 23839, 23798]
55355B3798K23L60J67L0p8l82n76l32r9l55o68m96k24k80j17P16J322P39l32o03
55335B2813k50k43m34n5M75J13q37j170q88j013j545j517r30p29q67k96Q77J209
55317A4713K48o71m43M49J133J516J650J221K24p17j192j376j340q87j61L71O13
55300A5351P73P12K55j17J54P04Q00N84O30O80Q9p75r10l02J41J27J04O8l35o72
55280A8061k12N37L35p06j138m57J93q6q02j191j157o92L69J628K243K119J947
55263B0991J920J506O51k4l78q77j442j387o93j26P6L71O16J06q74j016l0P22
55245B0112K23q23j295j148q43l82L09Q49R70R80J138J191R68P56P42O69L53o0
55227B4709m70q80j008m96M74J354J905K055J498L22m10J16J040Q65l83j410j712
$$ y = [23798, 24021, 24381, 24548, 24578, 24500, 24118, 23542, 23210, 23111, 22756, 22088, 21592, 21368, 21088, 20971, 21687, 23009, 23748, 23416, 22813, 22563, 22320, 21886, 21831, 22306, 22419, 21582, 20412, 19524, 18511, 16966, 15449, 14519, 13790, 12923, 12627, 13504, 14713, 14961, 14290, 13847, 14296, 15429, 16945, 18595, 19816, 20040, 19323, 18131, 16755, 15415, 14528, 14367, 14738, 15351, 16124, 16836, 17091, 16974, 17128, 17832, 18632, 19216, 19846, 20526, 20615, 19840, 18930, 18628, 18769, 18896, 19000, 19068, 18733, 18061, 17849, 18386, 18721, 18015, 16877, 16420, 16613, 16527, 15725, 14534, 13377, 12685, 13054, 14682, 16925, 19044, 20991, 22911, 24417, 25068, 25044, 24666, 23789, 22347, 20960, 20267, 20141, 20217, 20588, 21204, 21310, 20436, 19420, 19390, 20112, 20335, 19512, 18217, 17069, 16226, 15844, 16153, 17002, 17972, 18952, 20090, 21281, 22249, 23005, 23747, 24416, 24769, 24709, 24239, 23359, 22351, 21855, 22329, 23683, 25588, 27643, 29141, 29463, 29053, 29169, 30209, 31074, 30691, 29281, 27569]
55210B7569j783j529l03J324J744O87l32m10l75q56r66N7J367J774J388J053J012
55193C1421J025J060J115J000P11M80K06l55q19n94j09l56j120j118j67M08j8
55176C2770m23o9J51o63j866k363k142j762j333r50j125j861k207j505l14O08
55160A4946J205J465R69m8l73N02J401J165K78j63j45k37l67j77M5j9J26R89J954
55141B3516K045J324N80O3n52j310j906k184k076j451n30N9J79M62J211J798J764
55124B2992J697K173K636K286J438R48Q75O20N1m10n54m20M8P23R94M59m31r94
55106C5131j155j068m69P30J713J508L48m86k06P08J263J025M40K76P17J117Q31
55089D2423J66o4K54M04J7m51n02j08O17J426J680J037L91Q97K054K183J055L26
$$ y = [27569, 25786, 24257, 23954, 25278, 27022, 27709, 27377, 26967, 26592, 25736, 24770, 24827, 26194, 27968, 29356, 30409, 31421, 32446, 33506, 34621, 35621, 36332, 36812, 37018, 36663, 35844, 35250, 35141, 34785, 33665, 32547, 32380, 32788, 32770, 32347, 32278, 32429, 31766, 29900, 27537, 25395, 23633, 22300, 21350, 20225, 18364, 16157, 14652, 14338, 14946, 16151, 17616, 18585, 18537, 18164, 18666, 20067, 21232, 21510, 21347, 21202, 20965, 20598, 20421, 20466, 20447, 20573, 21562, 23516, 25561, 26885, 27465, 27528, 26976, 25666, 23760, 21576, 19500, 18049, 17519, 17578, 17757, 18219, 19430, 21228, 22992, 24689, 26862, 29498, 31784, 33222, 34170, 35045, 35665, 35716, 35306, 34752, 34332, 34380, 35103, 36097, 36556, 36125, 35131, 33976, 32908, 32439, 33169, 34882, 36390, 36738, 36252, 36046, 36754, 38017, 39042, 39482, 39758, 40475, 41592, 42423, 42589, 42525, 42779, 43183, 43200, 42749, 42247, 42139, 42756, 44182, 45862, 46899, 47290, 48187, 50241, 52424, 53479, 53805]
55071E3805Q72J415P66k48l95p8k78o09j24P61P77k04j104j284j056q00o20o66
55053E0930q84p70p7N97O33L18J89P6l96r82j300j539j828j585m71P06J047Q79
55035D5543R55J035M78l09l83J34K69j92n65o02p74j187j278p17J78J011J586
55018D5182J694J328R93J156J510J432Q84K99j32m07k84L12P50M04l43n60j03
55001E4115K84J10l67o90p08n76n76q39r95n17M67J218J446J537J464N94r06j640
54983E3421q66K86M81Q1K15Q32J058P93O29O37N30N46R16R94K08o58m53M64Q00
54964F0914L69J12L11L56J59L70J084J685K033K583L279L583L695M444N886P137
54948I8000P780Q297R025R787J0655J1872J2818J2286J0057P163M340J312k154
$$ y = [53805, 54677, 56092, 56858, 56610, 56215, 56137, 55859, 55250, 55126, 55887, 56664, 56460, 55356, 54072, 53016, 52216, 51596, 50930, 50046, 49276, 49199, 49796, 50429, 50747, 50936, 51012, 50616, 49634, 48334, 46795, 44967, 43382, 42911, 43617, 44664, 45543, 46498, 47533, 48011, 47702, 47319, 47453, 47722, 47530, 46965, 46363, 45589, 44402, 43124, 42407, 42585, 43596, 45182, 46876, 48204, 49197, 50353, 51863, 53295, 54179, 54478, 54346, 53939, 53655, 53967, 54717, 55121, 54778, 54218, 54115, 54399, 54509, 54142, 53452, 52744, 52168, 51592, 50753, 49758, 49241, 49708, 50926, 52372, 53909, 55373, 55967, 55061, 53421, 52555, 52841, 53322, 53403, 53618, 54450, 55508, 56301, 56930, 57567, 58097, 58643, 59559, 60553, 60761, 60103, 59650, 60114, 60914, 61283, 61395, 61706, 62062, 62221, 62591, 63675, 65360, 67393, 69976, 73255, 76838, 80533, 84977, 90863, 98000, 105780, 114077, 123102, 132889, 143544, 155416, 168234, 180520, 190577, 197740, 202080, 203392, 201238]
54935B01238n534q275j0254j1330j1337j0777j0532j0550r836q032o038m717l956
54922I0070l392l147l265l200k481j370m98k39n98j196j213l8J896L494M300M775
54906H3898N307N796O382P651R715J1704J2598J2158J0910R543Q344O753L745
54893A94504p35n090p637q604r553j1002j1875j1343r990q721p684o709n899n268
54879H4394m546l753l276l055k443j209j1M56J99l60q30q52l33J96J41k84m96
54862F3938p30j693l039l385k266q30j90j53j24k28p18j214j248r48n66l9M15
54845D6982Q9j081j888j241K95J160O30o31j607j787j211l12L38M71L03K10M04
54828D1124R39J648K057J789J179R17J069J016M44k31o10p09m83K36J113J438
$$ y = [201238, 195704, 187429, 177175, 165845, 154508, 143731, 133199, 122649, 112813, 104781, 98743, 94026, 90070, 86678, 83531, 80266, 77066, 74585, 73215, 72717, 72478, 71880, 70684, 69471, 69433, 71329, 74823, 79123, 83898, 89205, 95001, 101383, 109034, 118749, 130453, 143051, 155209, 166119, 175662, 184006, 190759, 194504, 193769, 188679, 181042, 172438, 162885, 151883, 140008, 128665, 118675, 109954, 102270, 95561, 89662, 84394, 79848, 76095, 72819, 69764, 67321, 66112, 66101, 66557, 66756, 66396, 65566, 64714, 64381, 64577, 64718, 64434, 63938, 63208, 61515, 58476, 55091, 52825, 51995, 51805, 51652, 51528, 51300, 50582, 49368, 48120, 47172, 46606, 46567, 46982, 47071, 45990, 44102, 42861, 43156, 44316, 44946, 44315, 42708, 40921, 39710, 39398, 39736, 40207, 40510, 40720, 41124, 42063, 43711, 45768, 47557, 48736, 49653, 50722, 51738, 52182, 51951, 51341, 50632, 50149, 50385, 51498, 52936]
54812E2936J223J320K002K359J703P25M98J016J585K072K810L577L698L141K764
54797H3429L337M796O510P911Q775R248R707J0475J1529J2464J2739J2102J0849
54784B03871R471P824N035O95m204q042j0153j1019j1192j0805j0131r570q999
54771A42781p850o138m689m074l914l492k503j117J77P32M24R0O25J801K745L454
54755A19052M636O151P031P246P962R546J0828J1095J1399J2741J4197J4180J2578
54742B48642J0325P535L613j122n402q588j1183j3629j5509j6064j5004j2755
54730A70859j0381r006q817q840q188p131o355n681m469l043k525l152l716l103
54716H6452j637m39JM9N5r4m96q03o16j18J18n8j60J13L49J68NM84J255J308M20
$$ y = [52936, 54159, 55479, 57481, 59840, 61543, 62268, 62766, 63782, 65367, 67439, 70249, 73826, 77524, 80665, 83429, 86766, 91562, 98072, 105983, 114758, 124006, 133713, 144188, 155717, 168181, 180920, 193022, 203871, 213342, 221166, 226201, 226896, 222692, 214650, 204497, 193478, 182286, 171481, 161350, 151780, 142781, 134931, 128793, 124104, 120030, 116116, 112624, 110121, 109004, 109181, 109913, 110337, 110427, 111052, 112853, 115598, 119052, 123688, 129839, 136870, 144116, 152078, 161624, 172452, 183547, 194946, 207687, 221884, 236064, 248642, 258967, 266502, 270115, 268993, 263591, 255003, 243820, 230191, 214682, 198618, 183614, 170859, 160478, 151472, 142655, 133815, 125627, 118496, 112141, 106460, 101991, 98948, 96423, 93271, 89555, 86452, 84815, 84376, 84377, 84426, 84481, 84387, 83891, 83088, 82472, 82354, 82472, 82414, 82254, 82367, 82716, 82884, 82889, 83373, 84628, 85936, 86356]
54695H6356m82n88r7L49M87M20L38M39P26Q22M94K04M56P75L49l90r8J300K119
54676I3979J202m41j090m50N74J353J860K093K080K126K357K451K287K323K770
54661A15474L078K835K479K481K485K027J482J452J791J964J845J532R48M09Q82
54646A43164K739M855N942O153O487P149P607P765P883P659O554M803L072J327
54632B23159r08l421n571p427r415j0981j0916r277p700p409p904p988p224n927
54618A21091m481l226k446k053j618r85m46j80P2N98J409K351L169L414K822J790
54602A21281J012O20J53n84j179j270j113j231j771k369k579k465k683l718m987
54587I7117n243m134k747k116j954j515j018j135j598j532j018j035j745k080
$$ y = [86356, 85874, 85286, 85189, 85538, 86025, 86445, 86783, 87222, 87948, 88770, 89264, 89468, 89924, 90699, 91048, 90658, 90560, 91860, 93979, 95181, 94740, 93650, 93200, 93774, 95127, 96987, 99080, 101160, 103286, 105643, 108094, 110381, 112704, 115474, 118552, 121387, 123866, 126347, 128832, 130859, 132341, 133793, 135584, 137548, 139393, 140925, 141873, 142282, 143164, 145903, 150758, 156700, 162853, 169340, 176489, 184096, 191861, 199744, 207403, 213957, 218760, 221832, 223159, 222251, 218830, 213259, 205832, 196417, 185436, 174520, 165243, 157543, 150134, 142230, 134242, 127018, 121091, 116610, 113384, 110938, 108885, 107267, 106282, 105836, 105656, 105728, 106326, 107735, 110086, 113255, 116669, 119491, 121281, 122293, 122913, 123066, 122482, 121303, 120033, 118920, 117689, 115918, 113549, 110970, 108505, 105822, 102104, 97117, 91874, 87740, 84993, 82877, 80923, 79408, 78390, 77255, 75657, 74125, 73107, 72072, 70327, 68247]
54573F8247j379l89j16m77o52k42M50R01P44L3o83q43o19o75j154j345o49O06
54555F1758J553J667J044J48n05o72n11k25L06J190J945J875J063M77Q19J680
54539G3612K191K083J818J841K086K252K340K736L656M617M844M235L530L228
54525A15069K883J809J46j392k460l202l686l882m050m422m657m242l377k771
54511H1766k546k188j572j281j615k029j939j467j025o50k16P8p3n06o64k48M89
54494F4314J135J624K134K507K123P63o34q09J52P83K34n75l88N83J176J024P09
54477G6855N37L19J95N50J123J211Q38P05R12P99K40KL88N78r0j076j479j176
54459H1431n68J76R26J226Q53L54L51O19M36l25j067j310j140q51n05m8L81M16
$$ y = [68247, 66868, 66479, 66363, 65886, 65234, 64992, 65442, 66343, 67087, 67120, 66437, 65594, 64975, 64300, 63146, 61801, 61152, 61758, 63311, 64978, 66022, 66170, 65665, 64993, 64482, 64257, 64563, 65753, 67698, 69573, 70636, 71113, 71932, 73612, 75803, 77886, 79704, 81545, 83631, 85883, 88223, 90959, 94615, 99232, 104076, 108311, 111841, 115069, 117952, 119761, 119907, 118515, 116055, 112853, 109167, 105285, 101235, 96813, 92156, 87914, 84537, 81766, 79220, 77032, 75460, 74179, 72564, 70535, 68596, 67129, 66104, 65454, 65238, 65316, 65243, 64737, 64073, 63825, 64314, 65449, 67073, 69207, 71714, 73837, 74600, 73966, 73157, 73309, 74092, 74326, 73751, 73363, 73946, 75122, 76146, 76855, 77392, 77711, 77906, 78456, 79579, 80790, 81628, 82333, 83245, 84044, 84284, 84286, 84674, 85252, 85162, 84086, 82607, 81431, 80863, 81039, 81965, 83191, 84044, 84398, 84749, 85368, 85804, 85479, 84412, 83102, 81962, 81111, 80606, 80558, 80939, 81355]
54441H1355j17p91q27l3P40N31n34j445j569j174o85j69L71P65R62J085R81L54
54423G9800n66j066r24p31r24j046m44P60J814K121J643P70P2j50j28j88n6P96
54405H1553K073K762K519K239K718L533L792L438L111L161L453L854M265M387
54391A26858M045L548L256K971K258J142K6r33j800k444k617k445k345k489k693
54376A26338k849l044l281l365l113k504j723j156j173j663k018j843j443j285
54362I5878j205o45M37J367J500Q43q7p52r14o54j44N92J578K441K515J665P04
54345A05119N13R87J364J446J795K698L664M167M351M584M711M344L562K816K223
54330A48344J437K98q90j834k643l470m093m239m107m125m298m173l615l108l141
$$ y = [81355, 81238, 80447, 79620, 79587, 80327, 80858, 80324, 78879, 77310, 76136, 75451, 75282, 75653, 76418, 77380, 78465, 79446, 79800, 79234, 78168, 77244, 76513, 75589, 74543, 74099, 74859, 76673, 78794, 80437, 81207, 81279, 81129, 81001, 80813, 80757, 81553, 83626, 86388, 88907, 91146, 93864, 97397, 101189, 104627, 107738, 110899, 114352, 118206, 122471, 126858, 130903, 134451, 137707, 140678, 142936, 144078, 144104, 143171, 141371, 138927, 136310, 133865, 131520, 129031, 126338, 123489, 120445, 117164, 113799, 110686, 108182, 106459, 105303, 104130, 102467, 100449, 98606, 97163, 95878, 94673, 94028, 94465, 95832, 97332, 98175, 98088, 97336, 96422, 95768, 95624, 96216, 97794, 100235, 102750, 104415, 105119, 105632, 106619, 107983, 109429, 111224, 113922, 117586, 121753, 126104, 130688, 135399, 139743, 143305, 146121, 148344, 149781, 150079, 149189, 147355, 144712, 141242, 137149, 132910, 128803, 124678, 120380, 116207, 112592, 109484, 106343]
54315A06343l494l526k960k142j589j535j867k252k340k017j551j359j567j869
54301G6275j845j458j160j426k080k292j481j08P85P68L66J89J42k21j005j831
54285F3618k129j500j36J023J057J36o23n80k36k13l55l11k16j74K88J378K250
54268F3277J981R39K15L6k13o70p77l57J45N64J147J718J675J038N59N69N73K36
54250G2655r7k20n14j071j214m35P06J249R60M18J95L36M49J73k45l6R83J692
54232G5984Q94r26j995j501m07J70K65K99Q9n80j196j178p59n80p90j086j237
54215F5466j088n11K04L67k08q19q19m25j62k7J81K51r7o13q12o06j24O13J450
54196F2221J867J538Q11K08k13o30r72j109j072q05j29O50P30j11r82j011l98
$$ y = [106343, 102849, 99323, 96363, 94221, 92632, 91097, 89230, 86978, 84638, 82621, 81070, 79711, 78144, 76275, 74430, 72972, 71812, 70386, 68306, 66014, 64533, 64425, 65210, 65978, 66344, 66533, 66675, 66454, 65449, 63618, 61489, 59989, 59853, 60876, 61933, 62069, 61446, 60866, 60630, 60417, 60062, 59751, 59535, 59361, 59649, 61027, 63277, 65258, 66197, 66412, 66448, 66235, 65565, 64788, 64431, 64576, 65140, 66287, 68005, 69680, 70718, 71277, 71846, 72419, 72655, 72558, 72338, 71824, 70753, 69539, 69104, 69810, 71059, 72019, 72437, 72632, 72968, 73417, 73590, 73345, 73309, 74292, 75984, 76878, 75952, 73957, 72456, 72049, 72219, 72484, 72783, 72872, 72292, 71096, 69918, 69159, 68579, 67789, 66703, 65466, 64378, 63867, 64071, 64438, 64230, 63411, 62592, 62167, 62005, 61978, 62159, 62410, 62313, 61700, 60888, 60282, 60158, 60771, 62221, 64088, 65626, 66437, 66645, 66432, 65802, 64830, 63721, 62649, 61844, 61715, 62365, 63095, 62984, 62002, 60991, 60593]
54179F0593J96P01J347J812J595Q57J18n37j220j561j102j85L45K32o4j66m9K44
54161F3156N08K83m77r02k11R93J370O73k3M1M43N38L94L43K95K3l72o38p15o16
54141F5106l45p6j55o63j275j631j597j088m6J232K008J679L71j117j868j465
54125E9070k74Q75J370J244Q09J67o46j206r20J69J191J251L25p84j256r61m06
54108F0018j63l55o46o45k22L93O96K98n62j079p27J37Q64J315J601J394M05o81
54090F2041q11j51L1p24j428j340j064j261j379o79L84Q95R44J245J802J993J666
54073F2164J144N34r3k19M61J192J051L80K80Q91J312J101P36N33K25k03k94j9
54055G1176O1k33l31J06N97N96K97L09R38J955K753K765K099J606J825K190J955
$$ y = [60593, 60789, 61490, 62837, 64649, 66244, 67101, 67219, 66682, 65462, 63901, 62799, 62614, 62959, 63191, 63127, 62961, 62912, 63156, 63664, 63947, 63470, 62568, 62357, 63350, 64720, 65393, 65370, 65411, 65854, 66392, 66786, 67129, 67424, 67447, 67075, 66437, 65722, 65106, 64761, 64685, 64530, 63867, 62592, 60961, 59364, 58276, 58230, 59462, 61470, 63149, 63520, 62403, 60535, 59070, 58796, 59671, 61041, 62285, 63094, 63261, 62615, 61409, 60489, 60658, 61849, 63100, 63425, 62641, 61385, 60424, 60018, 59855, 59500, 58854, 58209, 57987, 58380, 59076, 59374, 58812, 57733, 57006, 57143, 58007, 59322, 60923, 62317, 62722, 62041, 61230, 61079, 61110, 60386, 58958, 57618, 56554, 55293, 53914, 53235, 53619, 54514, 55458, 56703, 58505, 60498, 62164, 63308, 63842, 63749, 63530, 63991, 65183, 66234, 66614, 66894, 67785, 69097, 70198, 70934, 71467, 71692, 71489, 71195, 71176, 71237, 71004, 70673, 70779, 71376, 71972, 72269, 72578, 73516, 75471, 78224, 80989, 83088, 84694, 86519, 88709, 90664]
54038I0664J621K319L960N097M892M142M001M567N276N829O190O233O023N999
54024A56813O392O778O487N307L606K077J377J576K008K044J872J986K132J574
54010B02029M01m24m90n17j155k065k625k800k846k758k550k553k931l360l531
53995A71825l574l631l524l193k973l053l103k777k151j457p79l24l57o49n38
53980A39742R2M45n0q35r49k30P30J443J784J741J385Q69J91p80j761k022j278
53963A40517k30J76k43j001j644j975j937j642j330j052p14n43r27j595j624p13
53947A23523K51M58L16O58J406J974K421L300M449N059M864M442M294M393M685
53932A66493N270N816N511L990J862K8j143j722j777j419r87p91p25l65N09J641
$$ y = [90664, 92285, 94604, 98564, 103661, 108553, 112695, 116696, 121263, 126539, 132368, 138558, 144791, 150814, 156813, 163205, 169983, 176470, 181777, 185383, 187460, 188837, 190413, 192421, 194465, 196337, 198323, 200455, 202029, 202430, 202006, 201516, 200999, 199844, 197779, 195154, 192354, 189508, 186750, 184200, 181647, 178716, 175356, 171825, 168251, 164620, 161096, 157903, 154930, 151877, 148774, 145997, 143846, 142389, 141610, 141286, 140929, 140280, 139742, 139834, 140279, 140229, 139394, 138445, 138215, 138945, 140388, 142172, 143913, 145298, 146167, 146358, 145578, 143817, 141795, 140517, 140287, 140463, 140220, 139219, 137575, 135600, 133663, 132021, 130691, 129639, 128925, 128382, 127455, 125860, 124236, 123523, 123774, 124232, 124548, 125206, 126612, 128586, 131007, 134307, 138756, 143815, 148679, 153121, 157415, 161808, 166493, 171763, 177579, 183090, 187080, 188942, 188970, 187827, 186105, 184328, 182909, 181922, 181131, 180406, 180041, 180550, 182191]
53916A82191K518K874K933L189L938N061O207P020P208O708N916N559O053P067
53902B54442P904Q126P701O718N263L446J457m06j644j869j391j201j960l167
53888B83419l671l025j997j748k714m337n699o326o468o577o735o723o608o734
53874B14057p028o799n649m255l687m086m579m468m000l764l800l607k828j670
53860A53837p56o79j617l163m491m863m143k868j756j169j049j250j692k138k172
53845A20031j711j274j363j731j720j266r89j218j460j185o34l89m92m78j79K7
53829A03969j82n45n16O2P20Q86N74L35M86O05J65n27n43L78J319J246K49o17
53811A08064n41K95J111J336J119J082J615K352K569K038J326J131J605K413L199
$$ y = [182191, 184709, 187583, 190516, 193705, 197643, 202704, 208911, 215931, 223139, 229847, 235763, 241322, 247375, 254442, 262346, 270472, 278173, 284891, 290154, 293600, 295057, 294651, 293007, 291138, 289747, 288546, 286586, 283419, 279748, 276723, 274726, 272978, 270264, 265927, 260228, 253902, 247434, 240857, 234122, 227399, 220791, 214057, 207029, 200230, 194581, 190326, 186639, 182553, 177974, 173506, 169506, 165742, 161942, 158335, 155507, 153837, 153081, 152402, 150785, 147622, 143131, 138268, 134125, 131257, 129501, 128332, 127283, 126033, 124341, 122203, 120031, 118320, 117046, 115683, 113952, 112232, 110966, 109977, 108759, 107299, 106114, 105480, 105091, 104599, 104121, 103942, 103969, 103787, 103242, 102726, 102788, 103508, 104394, 104968, 105303, 105789, 106394, 106559, 106032, 105489, 105867, 107186, 108432, 108681, 108064, 107523, 107818, 108929, 110265, 111384, 112466, 114081, 116433, 119002, 121040, 122366, 123497, 125102, 127515, 130714]
53796A30714L799M229M626N121N676O124O411O567O500O096N527N127M938M642
53782B06097M049L295K539J796J118O32K75j00l90l74k45n42j396k311k820k928
53766B08695k816k589k466k635k844k647k228k218k522k225j034L6O7m80o44m31
53750A81019m85q22r20p73q64j264j577j756k139k690k980k930k867k812k478
53735A53662j994j895k208k294j858j420j453j639j430q82m69l92m86n53m39Q6
53719A34336J076K136K631K307J572J105J242J735K036J825J246P25O67J217K163
53704A58019L057L648M157M860N464N355M571L932L916M001L572K994L025L579
53690B14150L781L269K576K200J923J361O92M28P43J300J692J869K160K784L406
$$ y = [130714, 134513, 138742, 143368, 148489, 154165, 160289, 166700, 173267, 179767, 185863, 191390, 196517, 201455, 206097, 210146, 213441, 215980, 217776, 218894, 219526, 219801, 219701, 219311, 218937, 218692, 218150, 216754, 214443, 211623, 208695, 205879, 203290, 200824, 198189, 195345, 192698, 190470, 188252, 185730, 183505, 182471, 182507, 182574, 182094, 181450, 181019, 180534, 179712, 178792, 178019, 177155, 175891, 174314, 172558, 170419, 167729, 164749, 161819, 158952, 156140, 153662, 151668, 149773, 147565, 145271, 143413, 141993, 140540, 138901, 137471, 136589, 136120, 135728, 135242, 134689, 134250, 134336, 135412, 137548, 140179, 142486, 144058, 145163, 146405, 148140, 150176, 152001, 153247, 153972, 154639, 155856, 158019, 161076, 164724, 168881, 173741, 179205, 184560, 189131, 193063, 196979, 200980, 204552, 207546, 210571, 214150, 217931, 221200, 223776, 225976, 227899, 229260, 229952, 230380, 231123, 232423, 234115, 235984, 238144, 240928, 244334]
53675B44334L361K486J481J181J637K193K327K038J532R19K48l79p39n32K85J114
53659B63486J141L47l61m24m20j033j780j683q57l92p13j124j129j175j690k235
53643B49958k252k009k139k648k963k732k142j484q89m30j26J12M02O96P82N08
53627B32644j0l67j55O43J632K430K956L142K744J779R09Q72J608K443K950L156
53611B59376L056K617K246K527L339L921M050M435N612P097Q081Q369Q177P531
53597C30434O493N617N480N894O134N889N550N598O107O807P333P503P538P864
53583D20241Q474Q641P677N860M244L596L835M374M687M509L910L273L008L125
53569D89454L285L209K917K563K264K053J854J495R45M51K28O5m15j092j357r49
$$ y = [244334, 247695, 250181, 251662, 252843, 254480, 256673, 259000, 261038, 262570, 263489, 263737, 263358, 262619, 262087, 262372, 263486, 264627, 264974, 264613, 264189, 263769, 262736, 260956, 259273, 258416, 258024, 257311, 256187, 255058, 253883, 252193, 249958, 247706, 245697, 243558, 240910, 237947, 235215, 233073, 231589, 230700, 230270, 230144, 230256, 230658, 231354, 232136, 232644, 232634, 232267, 232112, 232755, 234387, 236817, 239773, 242915, 245659, 247438, 248347, 249219, 250827, 253270, 256220, 259376, 262432, 265049, 267295, 269822, 273161, 277082, 281132, 285567, 291179, 298276, 306357, 314726, 322903, 330434, 336927, 342544, 348024, 353918, 360052, 365941, 371491, 377089, 383196, 390003, 397336, 404839, 412377, 420241, 428715, 437356, 445033, 450893, 455137, 458733, 462568, 466942, 471629, 476138, 480048, 483321, 486329, 489454, 492739, 495948, 498865, 501428, 503692, 505745, 507599, 509094, 510039, 510490, 510718, 510783, 510368, 509276, 507919, 506970]
53553E06970m49n81j272j799j807j720k007k467k521j999j322r46r48j161j418
53538D84553j554j431j169j125j437j742j549p74L03J471K638L505L616K972K317
53523D90594K503L633N082O318P409Q616R797J0522J0761J1117J2162J3742J5140
53510F07396J5918J6337J7038J8410K0316K2152K3260K3502K3503K4097K5464
53499H37393K7030K8236K9171L0295L1819L3529L5058L6193L6995L7662L8188
53488A201569L8240L7659L6890L6590L6783L6961L7073L7726L9151M0600M1289
53477A620531M1367M1403M1388M0879L9852L8682L7385L5550L3014L0117K7346
53466B027514K5108K3681K2907K2048K0475J8435J6645J5349J4324J3618J3448
$$ y = [506970, 506521, 505940, 504668, 502869, 501062, 499342, 497335, 494868, 492347, 490348, 489026, 488080, 487132, 485971, 484553, 482999, 481568, 480399, 479274, 477837, 476095, 474546, 473772, 474075, 475546, 478184, 481689, 485305, 488277, 490594, 493097, 496730, 501812, 508130, 515539, 524155, 533952, 544474, 555235, 566352, 578514, 592256, 607396, 623314, 639651, 656689, 675099, 695415, 717567, 740827, 764329, 787832, 811929, 837393, 864423, 892659, 921830, 952125, 983944, 1017473, 1052531, 1088724, 1125719, 1163381, 1201569, 1239809, 1277468, 1314358, 1350948, 1387731, 1424692, 1461765, 1499491, 1538642, 1579242, 1620531, 1661898, 1703301, 1744689, 1785568, 1825420, 1864102, 1901487, 1937037, 1970051, 2000168, 2027514, 2052622, 2076303, 2099210, 2121258, 2141733, 2160168, 2176813, 2192162, 2206486, 2220104, 2233552]
53455B233552J3362J2257R591N906K020j855n778r484j2475j4590j6162j7834
53443B198510k0217k3463k7052l0224l2650l4453l5776l6678l7403l8197l8907
53432A843490l9254l9495m0153m1050m1294m0440l9001l7592l6204l4641l3065
53421A421301l1583k9863k7598k5029k2508j9968j7248j4609j2398j0454q279
53410A201764n689k868K7L009O093R334J2791J6333J9543K2138K4225K5980K7366
53397A360046K8450K9627L1256L3265L5501L8089M1091M4092M6643M8933N1531
53386A788524N4596N7780O0823O3797O6784O9776P2904P6299P9686Q2515Q4646
53375B558130Q6535Q8523R0283R1158R0919Q9948Q8779Q7597Q6182Q4182Q1379
$$ y = [2233552, 2246914, 2259171, 2268762, 2274668, 2276688, 2274833, 2269055, 2259571, 2247096, 2232506, 2216344, 2198510, 2178293, 2154830, 2127778, 2097554, 2064904, 2030451, 1994675, 1957997, 1920594, 1882397, 1843490, 1804236, 1764741, 1724588, 1683538, 1642244, 1601804, 1562803, 1525211, 1489007, 1454366, 1421301, 1389718, 1359855, 1332257, 1307228, 1284720, 1264752, 1247504, 1232895, 1220497, 1210043, 1201764, 1196075, 1193207, 1193234, 1196243, 1202336, 1211670, 1224461, 1240794, 1260337, 1282475, 1306700, 1332680, 1360046, 1388496, 1418123, 1449379, 1482644, 1518145, 1556234, 1597325, 1641417, 1688060, 1736993, 1788524, 1843120, 1900900, 1961723, 2025520, 2092304, 2162080, 2234984, 2311283, 2390969, 2473484, 2558130, 2644665, 2733188, 2823471, 2914629, 3005548, 3095496, 3184275, 3271872, 3358054, 3442236, 3523615]
53364C523615P7721P3244O8119O2748N7681N3348M9938M7419M5382M2897L8958
53353D141070L3403K7100K0927J4761P846q2q602j7504k7275l8378n0355o2016
53341D040895p2381q1112q8099r3001r5417r5429r3827r1794r0330q9764q9609
53330C060132q9010q7609q6012q5121q4949q4503q3019q0902p8979p7226p4820
53319B147982p1423o7563o3656n9375n4442m9429m5140m1522l7820l3778l0066
53308A593768k7374k5533k3749k1387j8311j4748j1119p955n626m007k595j075
53296A430289L55J323J837K308L066M146N506P133Q777J0017J0798J1734J3488
53283A510777J6105J9214K2668K6448L0170L3228L5539L7613L9697M1289M1710
$$ y = [3523615, 3601336, 3674580, 3742699, 3805447, 3863128, 3916476, 3966414, 4013833, 4059215, 4102112, 4141070, 4174473, 4201573, 4222500, 4237261, 4245107, 4245025, 4236423, 4218919, 4191644, 4153266, 4102911, 4040895, 3968514, 3887402, 3799303, 3706302, 3610885, 3515456, 3421629, 3329835, 3239505, 3149741, 3060132, 2971122, 2883513, 2797501, 2712380, 2627431, 2542928, 2459909, 2379007, 2300028, 2222802, 2147982, 2076559, 2008996, 1945340, 1885965, 1831523, 1782094, 1736954, 1695432, 1657612, 1623834, 1593768, 1566394, 1540861, 1517112, 1495725, 1477414, 1462666, 1451547, 1443592, 1437966, 1433959, 1431364, 1430289, 1430644, 1431967, 1433804, 1436112, 1439178, 1443324, 1448830, 1455963, 1464740, 1474757, 1485555, 1497289, 1510777, 1526882, 1546096, 1568764, 1595212, 1625382, 1658610, 1694149, 1731762, 1771459, 1812748, 1854458]
53272A854458M0945L9676L8660L8227L8266L8458L8487L8054L6813L4624L1921
53261B268589K9534K7846K6471K4998K3597K2396K0712J7666J3407Q944M800O05
53249B489565l964q685j3395j8322k3472k8339l2608l6504m0154m3220m5523m7368
53237B148011m8912m9722m9492m8605m7572m6391m4956m3564m2402m1088l9362
53226A645945l7827l7346l7951l8943l9806m0411m0579m0133l9270l8285l7104
53215A218290l5498l3577l1494k9005k5941k2959k0967j9961j9146j8241j7826
53204I43675j8185j8626j8411j7777j7575j8133j8924j9248j8961j8527j8509
53193G40799j8911j9136j8664j7665j6680j5880j5027j4170j3853j4405j5381
$$ y = [1854458, 1895403, 1935079, 1973739, 2011966, 2050232, 2088690, 2127177, 2165231, 2202044, 2236668, 2268589, 2298123, 2325969, 2352440, 2377438, 2401035, 2423431, 2444143, 2461809, 2475216, 2484160, 2488960, 2489565, 2485601, 2476916, 2463521, 2445199, 2421727, 2393388, 2360780, 2324276, 2284122, 2240902, 2195379, 2148011, 2099099, 2049377, 1999885, 1951280, 1903708, 1857317, 1812361, 1768797, 1726395, 1685307, 1645945, 1608118, 1570772, 1532821, 1493878, 1454072, 1413661, 1373082, 1332949, 1293679, 1255394, 1218290, 1182792, 1149215, 1117721, 1088716, 1062775, 1039816, 1018849, 998888, 979742, 961501, 943675, 925490, 906864, 888453, 870676, 853101, 834968, 816044, 796796, 777835, 759308, 740799, 721888, 702752, 684088, 666423, 649743, 633863, 618836, 604666, 590813, 576408, 561027]
53182E61027j5981j5899j5512j5331j5408j5303j4537j3135j1667j0736j0450
53171D07068j0444j0308r865r199q550q131p881p455o689o007o033o755p282o680
53157B95789n021l458l168m203n462n847n239m324l628l163k840k737k783k623
53143B41293k073j469j301j633k095k278j972j222l39K28J97l55j112j697j837
53128B22335j545j154q77n10J29O42M94p8k57J79O45Q36J194J936K454K248J809
53111B30480J904K505L094L520L858L819L135K163J397O61m88j796k581k844l209
53096B45618l829m150l904l575l634l911m001l837l615l499l556l689l574k978
53082A93866k204j919k372l063l203k449j215l20l05r21j500j777k001k149j754
$$ y = [561027, 545046, 529147, 513635, 498304, 482896, 467593, 453056, 439921, 428254, 417518, 407068, 396624, 386316, 376451, 367252, 358702, 350571, 342690, 335235, 328546, 322539, 316506, 309751, 302469, 295789, 290768, 287310, 284142, 279939, 274477, 268630, 263391, 259067, 255439, 252276, 249436, 246699, 243916, 241293, 239220, 237751, 236450, 234817, 232722, 230444, 228472, 227250, 226911, 227139, 227336, 226981, 225869, 224172, 222335, 220790, 219636, 218759, 218249, 218378, 219020, 219514, 219436, 219179, 219358, 220003, 220839, 222033, 223969, 226423, 228671, 230480, 232384, 234889, 237983, 241503, 245361, 249180, 252315, 254478, 255875, 256536, 256048, 254252, 251671, 248827, 245618, 241789, 237639, 233735, 230160, 226526, 222615, 218614, 214777, 211162, 207663, 204107, 200418, 196844, 193866, 191662, 189743, 187371, 184308, 181105, 178656, 177441, 177121, 176816, 175895, 174395, 172618, 170617, 168468, 166714]
53067A66714q13j60l93r55j028p46p44q75m41M54P75r3j639k925l370k913j993
53050A48855j362j330j233k78J234K189K030J100r5j144j391m87P13P95m18j709
53034A47469k189k138j960j523r56r56j606j893j171j54K74L76P84J160P65j58
53018A36124p18q04j097j761k129j811j244q74m95K57J120J397P47m22j316j472
53002A25502j131p89n38p3O32J101J025P27O24N86L18O7L19R15J000J38r66j176
52984A28281k40R30J301Q32L27L55P11J008J346J980K658K836K436J904J627J710
52968A50002K242L176M010M216M012M100M550M689M195L566L204K779J961J059
52954A97761N01J23m56j166j715k060k263k252k063j946j890j500p57l42p28j450
$$ y = [166714, 165901, 165741, 165348, 164393, 163365, 162619, 161875, 161000, 160559, 161013, 161788, 161695, 160056, 157131, 153761, 150848, 148855, 147493, 146163, 144930, 144652, 145886, 148075, 150105, 151205, 151110, 149966, 148575, 148088, 148801, 149596, 149178, 147469, 145280, 143142, 141182, 139659, 138703, 137747, 136141, 134248, 133077, 132923, 133197, 133573, 134357, 135517, 136282, 136124, 135406, 134602, 133505, 131744, 129615, 127804, 126560, 125686, 125191, 125448, 126568, 127965, 128712, 128290, 126974, 125502, 124371, 123582, 123044, 122971, 123603, 124704, 125729, 126456, 127080, 127666, 127984, 128051, 128370, 129285, 130285, 130423, 129457, 128281, 128041, 128971, 130272, 131104, 131431, 131786, 132497, 133505, 134851, 136831, 139489, 142325, 144761, 146665, 148292, 150002, 152244, 155420, 159430, 163646, 167658, 171758, 176308, 180997, 185192, 188758, 191962, 194741, 196702, 197761, 198262, 198385, 197929, 196763, 195048, 192988, 190725, 188473, 186410, 184464, 182574, 181074, 180317, 179975, 179247, 177797]
52938A77797j824j819j729j470r94q02j254j739j434o30l55q18j206j015n90l38
52922A59780k37l75j012j769j596j00J657K248J386r7j317j909j857j323o48j06
52906A52725K86O03Q01Q96J103J536J911J882J548J263J045N76j99q54j054r98
52890A63070j039j074p22%N41N29K53K84P99J458J846J782J342Q31O59J002J533
52873A73094J768J526R65K13o08j105q82j23M48M26Q8k37o46j175j244k69J340
52856A73579K398K239J376P00M63L25J70L29R85J750K141K260K590L212L681L817
52840B02015M095M890N734N854N170M220L215J818o6j858k904l086k792k516k657
52825B21132l280l977m212l928l493l189l091l369m097m782m691l760k711k129
$$ y = [177797, 175973, 174154, 172425, 170955, 169961, 169159, 167905, 166166, 164732, 164102, 163747, 162929, 161723, 160708, 160118, 159780, 159543, 159168, 158156, 156387, 154791, 154691, 156348, 158596, 159982, 159885, 158568, 156659, 154802, 153479, 152831, 152725, 153011, 153614, 154415, 155311, 156414, 157950, 159861, 161743, 163291, 164554, 165599, 166175, 165976, 165122, 164068, 163070, 162031, 160957, 160235, 160235, 160776, 161305, 161558, 161842, 162641, 164099, 165945, 167727, 169069, 169900, 170559, 171561, 173094, 174862, 176388, 177353, 177566, 176958, 175853, 174971, 174848, 175296, 175722, 175810, 175573, 174927, 173752, 172508, 172239, 173579, 175977, 178216, 179592, 180292, 180755, 181080, 181250, 181579, 182564, 184314, 186455, 188715, 191305, 194517, 198198, 202015, 206110, 211000, 216734, 222588, 227758, 231978, 235193, 237011, 236945, 235087, 232183, 229097, 226305, 223789, 221132, 217852, 213875, 209663, 205735, 202242, 199053, 195962, 192593, 188496, 183714, 179023, 175263, 172552, 170423]
52811A70423k031k297k827l101k453j165m27p80j359j248p56o68r08r04p24q49
52795A47926j117r54m84m72j027j319p81P8M30J02n37j276k176l063l387k741
52779A29202j513p01q83j549j811j556j366j367j070m95m39j155j628r99Q7M39
52763A13196M4k41k07l71p91r76r38j224j845k104j711j132p75o02p40j356j831
52746I6396j151M37J275L94j193k013k032k107k319k047j308p94o24j34R04J708
52730H5392J546O97J1o4L24P90Q83K22j070k111j994p88M42P76L64L3J53K50k50
52711H5606j173j705j268j14R32J215P71J60j40j33p5N5O11J766L155M123M264
52694I8050L623K604J748J471J788K325K651K512J859Q96Q0k34k08k91n78p72
$$ y = [170423, 168392, 166095, 163268, 160167, 157714, 156549, 156122, 155342, 153983, 152735, 151979, 151311, 150403, 149499, 148775, 147926, 146809, 145855, 145371, 144899, 143872, 142553, 141772, 141850, 142280, 142382, 141845, 140569, 138393, 135330, 131943, 129202, 127689, 126988, 126105, 124556, 122745, 121189, 119823, 118456, 117386, 116891, 116452, 115297, 113669, 112670, 112757, 113196, 113240, 112999, 112792, 112421, 111630, 110654, 109716, 108492, 106647, 104543, 102832, 101700, 100925, 100323, 99583, 98227, 96396, 95245, 95682, 96957, 97351, 96158, 94145, 92113, 90006, 87687, 85640, 84332, 83538, 82914, 82780, 83684, 85392, 86938, 87635, 87646, 87582, 87906, 88696, 89579, 89801, 88731, 86620, 84626, 83838, 84280, 85056, 85420, 85453, 85606, 85856, 85606, 84433, 82728, 81460, 81346, 82278, 83493, 84264, 84424, 84284, 84151, 84076, 84131, 84742, 86508, 89663, 93786, 98050, 101673, 104277, 106025, 107496, 109284, 111609, 114260, 116772, 118631, 119527, 119607, 119373, 119165, 118874, 118296, 117524]
52678A17524q26j088j603j799j298o17n40j117j781k178k369k398k179j800j570
52663I4361j697k173k767l007k405j047K96R97J141R99M72l87q32k43P68R81J62
52646H5619p42j003q40o60m48j80q7j74m4M52R29J070J013R17O48K73K74Q38J388
52627H9243J250N08k23o08p60q17p87p53q66j095j160p80L2Q80J241R55M50K32
52609H6942L09L38K40K47L61K68j11l25J05J183K497L449L419K209M77o49o24
52592A00335Q0P15J031J183J268J270J169Q56J82o53j063o26M59J577K166J982
52576A11931J268P64J105K040K595K263J648J611K172K606K378J646R48P55J154
52561A36884J753K054K036K151K570K815K431J670J117R03P17M34K15Q9j30m53
$$ y = [117524, 116698, 115610, 114007, 112208, 110910, 110293, 109753, 108636, 106855, 104677, 102308, 99910, 97731, 95931, 94361, 92664, 90491, 87724, 84717, 82312, 81265, 81561, 82558, 83699, 84698, 85170, 84783, 83951, 83708, 84476, 85457, 85619, 84877, 83874, 83034, 82374, 81926, 81746, 81659, 81485, 81441, 81893, 82822, 83892, 84905, 85822, 86470, 86743, 87017, 87855, 89243, 90493, 91001, 90778, 90170, 89410, 88593, 87806, 87053, 86187, 85092, 83932, 83152, 83184, 84064, 85305, 86260, 86710, 86942, 87251, 87589, 87829, 88076, 88437, 88705, 88594, 88269, 88374, 89557, 92054, 95503, 98922, 101131, 101608, 100959, 100335, 100415, 101130, 102161, 103344, 104612, 105882, 107051, 107907, 108089, 107436, 106373, 105747, 106206, 107783, 109949, 111931, 113199, 113963, 115068, 117108, 119703, 121966, 123614, 125225, 127397, 130003, 132381, 134027, 134975, 135730, 136884, 138637, 140691, 142727, 144878, 147448, 150263, 152694, 154364, 155481, 156384, 157101, 157535, 157750, 157839, 157709, 157256]
52545A57256o22m75j36J49J96n6m01m15N9M86K09n52p92n2P96N92n84j506j359
52526A52793n69N4L40M99L91j92q06o73J48O82L63k13k94l5k4j96j8N15Q69Q79
52506A54513R47J233J369J134Q59Q78J042J053Q91O75L78l6m49p63j090j538j952
52489A59144k005j482m65O36J314J401J239J236J336J183O94J51j98l21k31N7
52473A63689M48R23J580K249K297J386J91k52K06Q64J345J923K612K904K663K476
52457A87504K669K712K137J382J083J063O95J8l06K4N38O06K8r28j835k339k383
52440A92668k219k130k204k325k314k061j773j913k584l110k717j603p59o68q57
52425A63431q26o83n23JR38J496R65k46j099j156p46k17K96N57M04J83N01J398
$$ y = [157256, 156634, 156159, 156023, 156172, 156368, 156312, 155911, 155496, 155555, 156041, 156250, 155698, 154906, 154854, 155650, 156242, 155658, 154152, 152793, 152224, 152278, 152618, 153117, 153508, 153316, 152510, 151837, 151985, 152667, 153030, 152817, 152523, 152488, 152464, 152268, 152250, 152765, 153634, 154513, 155460, 156693, 158062, 159196, 160055, 160933, 161975, 163028, 163919, 164594, 164972, 164936, 164487, 163724, 162634, 161096, 159144, 157139, 155657, 155192, 155828, 157142, 158543, 159782, 161018, 162354, 163537, 164231, 164382, 164184, 163863, 163632, 163689, 164137, 165060, 166640, 168889, 171186, 172572, 172763, 172511, 172717, 173581, 174926, 176849, 179461, 182365, 185028, 187504, 190173, 192885, 195022, 196404, 197487, 198550, 199245, 199263, 198957, 198981, 199519, 200125, 200153, 199225, 197390, 195051, 192668, 190449, 188319, 186115, 183790, 181476, 179415, 177642, 175729, 173145, 170035, 167318, 165715, 164956, 164288, 163431, 162605, 161922, 161399, 161400, 162338, 163834, 164799, 164553, 163454, 162298, 161552, 161335, 161631, 162188, 162592, 162775, 163276, 164674]
52407A64674K221K357J776Q37k0l59J14J197K144K234J497Q14J072K137K908K576
52391A88179J632J203J644K222K166J428M45k79k51O98J989K714K655K382K308
52376B11135K267K144K156K230J933J394J418K229K865K495J601J158J259J317
52362B37601J165J122J350J798K474L160L335K899K550K721K797K189J573J966
52348B68700K988L240K318J292J082J411J600J531J502J702K114K476K333J564
52334B95853Q07Q02J393J796J726J648J921K387K794K949K502J318Q9j48O89J678
52318C20204K162K386K697K928K931L070L701M600N339N814O166O476O868P569
52304C82911Q633R787J0694J1236J1497J1732J2298J3313J4413J5126J5362J5228
$$ y = [164674, 166895, 169252, 171028, 171865, 171845, 171486, 171600, 172797, 174941, 177175, 178672, 179486, 180558, 182695, 185603, 188179, 189811, 191014, 192658, 194880, 197046, 198474, 198919, 198640, 198389, 199087, 201076, 203790, 206445, 208827, 211135, 213402, 215546, 217702, 219932, 221865, 223259, 224677, 226906, 229771, 232266, 233867, 235025, 236284, 237601, 238766, 239888, 241238, 243036, 245510, 248670, 252005, 254904, 257454, 260175, 262972, 265161, 266734, 268700, 271688, 274928, 277246, 278538, 279620, 281031, 282631, 284162, 285664, 287366, 289480, 291956, 294289, 295853, 296660, 297462, 298855, 300651, 302377, 304025, 305946, 308333, 311127, 314076, 316578, 317896, 317985, 317837, 318526, 320204, 322366, 324752, 327449, 330377, 333308, 336378, 340079, 344679, 350018, 355832, 361998, 368474, 375342, 382911, 391544, 401331, 412025, 423261, 434758, 446490, 458788, 472101, 486514, 501640, 517002, 532230]
52292E32230J4672J3793J3200J3387J3945J4062J3730J3583J3719J3585J3095
52281F83001J2788J2723J2258J1344J0926J1439J1871J1161R794Q997Q925Q613
52269H13840P528O198N294M815M389L787K972J934P46l99j251j631j568j347j175
52254H44132r06l64lo60k406m060m327l131j513m24K0L17R91K235L818N364O712
52237H45795P907Q837R319R572J0183J1300J2274J2488J2211J2192J2622J2990
52225I77690J2805J2077J1117J0308R954J0029R988R195P651O067N104M645L992
52212A090622K744J295M11K44J9j124l077m858n700n733n528n444n510n670n829
52197A046862n890n950o177o369n911m550k916j927j786j873j506n81N37J377
$$ y = [532230, 546902, 560695, 573895, 587282, 601227, 615289, 629019, 642602, 656321, 669906, 683001, 695789, 708512, 720770, 732114, 743040, 754479, 766350, 777511, 787305, 796302, 805227, 813840, 821368, 827566, 832860, 837675, 842064, 845851, 848823, 850757, 851503, 851104, 849853, 848222, 846654, 845307, 844132, 843226, 842862, 842859, 842199, 839793, 835733, 831406, 828275, 826762, 826338, 826358, 826675, 827666, 829901, 833719, 839083, 845795, 853702, 862539, 871858, 881430, 891613, 902913, 915187, 927675, 939886, 952078, 964700, 977690, 990495, 1002572, 1013689, 1023997, 1033951, 1043980, 1053968, 1063163, 1070814, 1076881, 1081985, 1086630, 1090622, 1093366, 1094661, 1095072, 1095316, 1095335, 1094211, 1091134, 1086276, 1080576, 1074843, 1069315, 1063871, 1058361, 1052691, 1046862, 1040972, 1035022, 1028845, 1022476, 1016565, 1012015, 1009099, 1007172, 1005386, 1003513, 1002007, 1001426, 1001963, 1003340]
52183A003340J693J639J653K040K668L133L162K701J791N55o84j506j711j494
52169A018980j334j600k283l017l471l637l783m122m686n378n953o050n505m677
52155I63484m155m097m129m003m026m621n618o261n942m833l741l346l598l951
52141I01163m150m457n087n691n838n646n558n640n594n297m869m339l818l797
52127H31382m533n285n005l947l514m317n347n579n330n301n175m268k963k267
52113G68551k276k161j633j222j064n29N92J517J706J818K734M204N274N786O600
52098G89897Q283J0283J1663J2229J2576J3313J4517J5888J7150J8180J8968J9619
52086I62566K0318K1114K1737K1805K1274K0537J9942J9348J8343J6836J5225
$$ y = [1003340, 1005033, 1006672, 1008325, 1010365, 1013033, 1016166, 1019328, 1022029, 1023820, 1024375, 1023691, 1022185, 1020474, 1018980, 1017646, 1016046, 1013763, 1010746, 1007275, 1003638, 999855, 995733, 991047, 985669, 979716, 973666, 968161, 963484, 959329, 955232, 951103, 947100, 943074, 938453, 932835, 926574, 920632, 915799, 912058, 908712, 905114, 901163, 897013, 892556, 887469, 881778, 875940, 870294, 864736, 859096, 853502, 848205, 843336, 838997, 835179, 831382, 826849, 821564, 816559, 812612, 809098, 804781, 799434, 793855, 788525, 783224, 778049, 773781, 770818, 768551, 766275, 764114, 762481, 761259, 760195, 759666, 760258, 761775, 763481, 765299, 768033, 772237, 777511, 783297, 789897, 798180, 808463, 820126, 832355, 844931, 858244, 872761, 888649, 905799, 923979, 942947, 962566, 982884, 1003998, 1025735, 1047540, 1068814, 1089351, 1109293, 1128641, 1146984, 1163820, 1179045]
52075A179045J3946J2983J1925J0439Q639O958N671M632L531K421J674J331P48
52062A263943p79l101n236o394o666o651o659o574o273n854n477n247n213n237
52048A188582m849l636j882m75M8J00L97J061J681K013K188K365K635L121L721
52033A197070L922L481L043L461M478M948M416L634L269L062K685K481K665K633
52019A245248J915J121R88J075M02j019k307l112l862m811n803o938q480j0160
52005A204257j1437j2418j3604j4841j5483j5678j6426j8164k0223k1872k2996
51994A021115k3599k3646k3620k4208k5130k5359k4796k4617k5458k6377k6348
51983G47957k5703k5248k4891k4104k3053k2179k1285k0035j8902j8624j8962
$$ y = [1179045, 1192991, 1205974, 1217899, 1228338, 1236977, 1243935, 1249606, 1254238, 1257769, 1260190, 1261864, 1263195, 1263943, 1263164, 1260063, 1254827, 1248433, 1241767, 1235116, 1228457, 1221883, 1215610, 1209756, 1204279, 1199032, 1193819, 1188582, 1183733, 1180097, 1178215, 1177740, 1177788, 1177888, 1178285, 1179346, 1181027, 1183040, 1185228, 1187593, 1190228, 1193349, 1197070, 1200992, 1204473, 1207516, 1210977, 1215455, 1220403, 1224819, 1228453, 1231722, 1234784, 1237469, 1239950, 1242615, 1245248, 1247163, 1248284, 1249272, 1250347, 1250749, 1249730, 1247423, 1244311, 1240449, 1235638, 1229835, 1222897, 1214417, 1204257, 1192820, 1180402, 1166798, 1151957, 1136474, 1120796, 1104370, 1086206, 1065983, 1044111, 1021115, 997516, 973870, 950250, 926042, 900912, 875553, 850757, 826140, 800682, 774305, 747957, 722254, 697006, 672115, 648011, 624958, 602779, 581494, 561459, 542557, 523933, 504971]
51972E04971j8905j7976j6559j5044j3443j1863j0733j0355j0522j0581r929q606
51960C50455p406o944o697n762m525m381n495o119m988l164k365k514k329j559
51946B86207j059j089j173j445k518l911m188l040j891j940k747l351l668m038
51932B50149m262l925l182k495j966j445j050j025j320j689k028k292k260j689
51918B19521o43M38R75O36l12j126j357j333j571j900j703j034o99j130j735j798
51902B05229j481j495k001k384k152j629j617k373l213l239k374j412j039j177
51888A77643j370j386j202q45n81q28j453j635r55k07l91j252j713j439j095j032
51872A60259p41J21J052J419J259R80P44N57N75R65J633K308K726K715K329J923
$$ y = [504971, 486066, 468090, 451531, 436487, 423044, 411181, 400448, 390093, 379571, 368990, 359061, 350455, 343049, 336105, 329408, 323646, 319121, 314740, 309245, 303126, 298138, 294974, 292609, 290095, 287766, 286207, 285148, 284059, 282886, 281441, 278923, 275012, 270824, 267784, 265893, 263953, 261206, 257855, 254187, 250149, 245887, 241962, 238780, 236285, 234319, 232874, 231824, 230799, 229479, 227790, 225762, 223470, 221210, 219521, 218878, 219316, 220291, 220927, 220615, 219489, 218132, 216799, 215228, 213328, 211625, 210591, 209892, 208762, 207027, 205229, 203748, 202253, 200252, 197868, 195716, 194087, 192470, 190097, 186884, 183645, 181271, 179859, 178820, 177643, 176273, 174887, 173685, 172840, 172259, 171431, 169978, 168343, 167388, 167181, 166790, 165538, 163825, 162386, 161291, 160259, 159518, 159639, 160691, 162110, 163369, 164349, 165093, 165650, 166225, 167190, 168823, 171131, 173857, 176572, 178901, 180824]
51856A80824J868K173K541K693K433J670P21K77N49P94K40p59j248j018p06o87
51840A92365p74q74j020p69L54J761K199J555J127J697K442K356J789J613J784
51825B07605J633J181J065J479J937K000J604Q75R5k94j71k3l51r47j275j244
51809B15169j139r94o38k05n0q5K35J121J975K023J250M83M99J149J624J528J296
51792B25241J378J516J333J237J817K661K760K117J814K257K512J932J285J456
51778B51316K026K105J839J921K198J931J206Q47J094J296J094R37J268J946K647
51763B75671L192L421L303L237L659M280M342L625K616J643N47o64j544j837j826
51748C03665j799j727j594j496j203l04R76J706J434Q85R51J510J772J450R86
$$ y = [180824, 182692, 184865, 187406, 190099, 192532, 194202, 194923, 195200, 195749, 196543, 196783, 196024, 194776, 193758, 193052, 192365, 191591, 190717, 189697, 188928, 189282, 191043, 193242, 194797, 195924, 197621, 200063, 202419, 204208, 205821, 207605, 209238, 210419, 211484, 212963, 214900, 216900, 218504, 219379, 219474, 219180, 219009, 218986, 218635, 217688, 216413, 215169, 214030, 213036, 212398, 212193, 212143, 212058, 212293, 213414, 215389, 217412, 218662, 219145, 219644, 220793, 222417, 223945, 225241, 226619, 228135, 229468, 230705, 232522, 235183, 237943, 240060, 241874, 244131, 246643, 248575, 249860, 251316, 253342, 255447, 257286, 259207, 261405, 263336, 264542, 265389, 266483, 267779, 268873, 269810, 271078, 273024, 275671, 278863, 282284, 285587, 288824, 292483, 296763, 301105, 304730, 307346, 308989, 309536, 308872, 307328, 305491, 303665, 301866, 300139, 298545, 297049, 295846, 295542, 296518, 298224, 299658, 300543, 301494, 303004, 304776, 306226, 307212]
51733C07212P61P25O55L83j89r09j255q36L4O02N69L37L92P22R01N35m27j546
51715C08666k029j333J64J334J333L00j013k135l120m022m522m266l387k498k100
51700B81372k189k482k855l370l917m167l982l587l135k341r58N43J303J221J252
51685B52708K261L954N363O174O935Q173R769J1207J1879J1035Q195L923k92l332
51671C37952n289o662p326p007o298o304p107p532o643m972l783l597l873l791
51657B57768k902j154J093L038L775K952J069r89k697m126n481o568o909o390
51643B32479n525m970m871m862m571l917l014k086j425j224j341j457j458j474
51629A90284j574j538j136m69j1k19r95j605j410p09m54r88j546j342o04NM87
$$ y = [307212, 307973, 308698, 309353, 309736, 309547, 308638, 307383, 306547, 306581, 307183, 307752, 308089, 308481, 309203, 310104, 310639, 310212, 308666, 306637, 305304, 305468, 306802, 308135, 308435, 307422, 305287, 302167, 298145, 293623, 289357, 285970, 283472, 281372, 279183, 276701, 273846, 270476, 266559, 262392, 258410, 254823, 251688, 249347, 248389, 248932, 250235, 251456, 252708, 254969, 258923, 264286, 270460, 277395, 285568, 295337, 306544, 318423, 329458, 337653, 341576, 341284, 337952, 332663, 326001, 318675, 311668, 305370, 299066, 291959, 284427, 277784, 272812, 269029, 265432, 261559, 257768, 254866, 253712, 254805, 257843, 261618, 264570, 265639, 264650, 261953, 257827, 252346, 245778, 238869, 232479, 226954, 221984, 217113, 212251, 207680, 203763, 200749, 198663, 197238, 196014, 194673, 193216, 191758, 190284, 188710, 187172, 186036, 185567, 185556, 185337, 184342, 182737, 181327, 180618, 180164, 179176, 177630, 176288, 175684, 175689, 176176]
51612A76176J181J735J400M07m7O10J603K092K251K554K718K276J615J602K345
51597B00518L143L582L953M489M855M714M407M615N507O471O793O368N680N134
51583B70229M626L792K534J117p7p84j016j160j714k658l260k930j977j201q56
51568B64665m89L72J755L353M591M891M382M090M709N513N458M929N184O092O018
51553C25513M291K266J250P72j17j054j117m65P0L76Q51J279J172Q25Q59J000
51537C37771M51o87j493j682j812k191k577l033l912m949n296m733l904l235k566
51522B96152j976j968k528k852k443j672j059o84n69q00j012n69L60P54J77n68
51506B78743o31j86K33N65P92M98l29q07l01N43P88O13P35R79O10j34j23R26J935
$$ y = [176176, 177357, 179092, 180492, 180899, 180852, 181462, 183065, 185157, 187408, 189962, 192680, 194956, 196571, 198173, 200518, 203661, 207243, 211196, 215685, 220540, 225254, 229661, 234276, 239783, 246254, 253047, 259415, 265095, 270229, 274855, 278647, 281181, 282298, 282221, 281437, 280421, 279261, 277547, 274889, 271629, 268699, 266722, 265521, 264665, 264176, 264548, 266303, 269656, 274247, 279138, 283520, 287610, 292319, 297832, 303290, 308219, 313403, 319495, 325513, 329804, 332070, 333320, 334092, 333975, 332921, 331804, 331339, 331409, 331785, 332636, 333915, 335087, 335912, 336771, 337771, 338222, 337535, 336042, 334360, 332548, 330357, 327780, 324747, 320835, 315886, 310590, 305857, 301953, 298718, 296152, 294176, 292208, 289680, 286828, 284385, 282713, 281654, 280970, 280401, 279601, 278589, 278020, 278380, 279134, 279311, 278743, 278112, 277926, 278159, 278724, 279516, 280014, 279685, 278878, 278577, 279120, 279908, 280521, 281256, 282235, 282845, 282711, 282588, 283514, 285449]
51487B85449J986J455J208J450J908K513L292L888L838L226K657K639L135L757
51473C22401M177M449M945N858O810P166O790O186N778N398M721L903L349L040
51459C94971K581J785Q51j37j306k470k934k283j081l79o32j476k480l628n005
51444C76377o382p365p798p881p987q293q480p970o736n610n275n164m177k445
51430B84814j411j699k060j221R3K04q51j181L58K640L834L600L031L052L502
51415B96705L624K955J772P76K94j68j261k811m049m735n384o277o935o964o669
51400B60873o378n791m637l498l203l680m095m019l769l689l692l667l742m010
51386B03003m304m312l800k762j676j304j817k326j919r96q13j651k379k125j453
$$ y = [285449, 287435, 288890, 290098, 291548, 293456, 295969, 299261, 303149, 306987, 310213, 312870, 315509, 318644, 322401, 326578, 331027, 335972, 341830, 348640, 355806, 362596, 368782, 374560, 379958, 384679, 388582, 391931, 394971, 397552, 399337, 400188, 400051, 398745, 396275, 393341, 391058, 389977, 389598, 388966, 387490, 385010, 381382, 376377, 369995, 362630, 354832, 346951, 338964, 330671, 322191, 314221, 307485, 301875, 296600, 291436, 287259, 284814, 283403, 281704, 279644, 278423, 278516, 278720, 277869, 276688, 277046, 279686, 283520, 287120, 290151, 293203, 296705, 300329, 303284, 305056, 305832, 306126, 305958, 304697, 301886, 297837, 293102, 287718, 281441, 274506, 267542, 260873, 254495, 248704, 244067, 240569, 237366, 233686, 229591, 225572, 221803, 218114, 214422, 210755, 207013, 203003, 198699, 194387, 190587, 187825, 186149, 184845, 183028, 180702, 178783, 177787, 176974, 175323, 172944, 170819, 169366]
51371A69366j185q90L92K322L258K218J4j849k717k912k926k973l053l013k687
51356A53365k200j870j752j487r08l38l3K86R37J667J991J922J788J586J208J076
51340A57238J836L273M329M403M126M479N577O650O864N994M552L462L254L481
51326B19518L236K245R93k42j740l535m988n585n613n600n610n505n341n116m620
51311A72497l964l661l755l580k934k661l216l594k738j354r02j335j369p78p80
51296A35876j807k560j869l08P92J034Q93P37O69Q12J140J314J151Q37N01Rn44
51279A38677q02p81r11j136p93K18R74P92K98M15R92J173O64j02p46j153j195
51262A36584r84j081j840k658k613j703q37o51r24j109r53n64k30j96l46l03k4
$$ y = [169366, 168181, 167291, 167683, 170005, 173263, 175481, 175495, 173646, 170929, 168017, 165091, 162118, 159065, 156052, 153365, 151165, 149295, 147543, 146056, 145148, 144810, 144777, 145063, 146000, 147667, 149658, 151580, 153368, 154954, 156162, 157238, 159074, 162347, 166676, 171079, 175205, 179684, 185261, 191911, 198775, 204769, 209321, 212783, 216037, 219518, 222754, 224999, 225992, 225750, 224010, 220475, 215487, 209902, 204289, 198689, 193079, 187574, 182233, 177117, 172497, 168533, 164872, 161117, 157537, 154603, 151942, 148726, 145132, 142394, 141040, 140138, 138803, 137434, 136656, 135876, 134069, 131509, 129640, 129332, 130124, 131158, 132051, 132788, 133457, 134269, 135409, 136723, 137874, 138711, 139212, 139221, 138677, 137875, 137094, 136183, 135047, 134254, 134472, 135446, 136238, 136536, 136951, 137943, 139116, 139780, 139678, 138932, 137779, 136584, 135600, 134519, 132679, 130021, 127408, 125705, 124868, 124217, 123293, 122184, 121231, 120667, 120437, 120241, 119895, 119592, 119568]
51245A19568k7o10j273j343q49k54L19R68J414J249O73K42om40q80o10N32J735
51227A20408K219J993J442P40R9k0N20J065Q43l8p28o96k17K31N92J051J499J601
51209A32604J313R81P68L82k79o03J07J523K470K280J430P45N90J038K059L061
51193A50469K981J619K49J50R02J055K08n75l89M18R49Q16K20m16o85n33m31q52
51175A56155j542j875j811j831k006j951j789k131k827k771j505j96j53j099j652
51160A31016j149r8P98J273J285R74Q39J244J750J529M82n64q83n10J24P33J141
51143A39984J192J005Q52O15k50j818l172l246k101q88n54r95j505j657j456r97
51127A25009m05l7k87j000j446j100k66L18L31P7l7J89P93J638K188J861P41l16
$$ y = [119568, 119541, 118931, 117658, 116315, 115466, 115212, 115531, 116499, 117913, 119162, 119835, 120077, 120071, 119631, 118751, 118141, 118673, 120408, 122627, 124620, 126062, 126802, 126901, 126881, 127401, 128466, 129309, 129271, 128543, 127847, 127630, 127861, 128453, 129504, 131003, 132604, 133917, 134898, 135666, 136048, 135769, 135166, 135273, 136796, 139266, 141546, 142976, 143721, 144311, 145349, 147408, 150469, 153450, 155069, 155318, 155468, 156370, 157425, 157633, 157058, 156669, 157087, 158036, 158852, 159072, 158656, 157971, 157438, 157007, 156155, 154613, 152738, 150927, 149096, 147090, 145139, 143350, 141219, 138392, 135621, 134116, 133920, 133767, 132668, 131016, 129867, 129769, 130567, 131840, 133125, 134099, 134938, 136182, 137932, 139461, 139943, 139379, 138496, 137986, 138110, 138843, 139984, 141176, 142181, 143033, 143648, 143398, 141580, 138408, 135162, 133061, 132173, 131619, 130624, 129119, 127462, 126006, 125009, 124604, 124567, 124280, 123280, 121834, 120734, 120468, 120786, 121117, 121194, 121157, 121346, 122139, 123777, 125965, 127826, 128567, 128251]
51109A28251o06k85Rk0k21m01m43j50N43J270J506J234R39R30J016R26O74M14
51091A35586J91J23M65J214J826J750J167Q31J134J668J855J674J501J425J197
51076A53607Q63R70J855K959L327K689J751J347J616K129K527K761K897K960K944
51061A87202K793K398J718Q73N2n96q93p30k88rm9n7K74O60O14J84k18n85j269
51042A92074k102k288j417n8J040J747K146J905P70o27j230q28j86J6j69m58p81
51025A89554j005p81m8O82Q96O78M09J42l43j015j444j279o52r0l1m02p28p10
51007A83833n87p07q76n05N73J816K680L168L474L499L088K515K281K578L184
50992B10014L836M406M810N056N324N857O691P563Q012P677O742O089O580Q098
$$ y = [128251, 127645, 127360, 127369, 127349, 127128, 126727, 126284, 126134, 126677, 127947, 129453, 130687, 131626, 132556, 133572, 134498, 135172, 135586, 135777, 135900, 136365, 137579, 139405, 141155, 142322, 143153, 144287, 145955, 147810, 149484, 150985, 152410, 153607, 154470, 155440, 157295, 160254, 163581, 166270, 168021, 169368, 170984, 173113, 175640, 178401, 181298, 184258, 187202, 189995, 192393, 194111, 194984, 195036, 194440, 193547, 192817, 192529, 192520, 192471, 192414, 192688, 193348, 193962, 194146, 193928, 193343, 192074, 189972, 187684, 186267, 186209, 187249, 188996, 191142, 193047, 193817, 193190, 191960, 191132, 190946, 190962, 190793, 190335, 189554, 188549, 187768, 187720, 188402, 189298, 189976, 190385, 190527, 190184, 189169, 187725, 186446, 185794, 185704, 185673, 185271, 184543, 183833, 183246, 182539, 181663, 181158, 181731, 183547, 186227, 189395, 192869, 196368, 199456, 201971, 204252, 206830, 210014, 213850, 218256, 223066, 228122, 233446, 239303, 245994, 253557, 261569, 269246, 275988, 282077, 288657, 296755]
50978B96755R656J0644J1468J2724J4322J5911J7675J9976K2506K4614K6370K8615
50966E11236L1887L5805L9681M3216M6437M9388N2054N4362N6150N7365N8216
50955A035797N8839N8871N7710N5121N1336M6640M1312L5834L0664K5847K1232
50944A519203J7029J3663J1161R196P704O926O835P125P784R027J0565J1446J0887
50931A648551Q745N119J23n776j1873j7987k4547l1670l8734m5112n0761n5695
50919A380383n9584o2314o4316o5789o6118o4604o1451n7422n2994m8383m4025
50908G33383m0235l6607l2488k8034k4184k1512j9626j7775j5614j3276j1036
50897D72996r125p663o560n530m249k659j143k80k26m05j31N87J189J379J366
$$ y = [296755, 306411, 317055, 328523, 341247, 355569, 371480, 389155, 409131, 431637, 456251, 482621, 511236, 543123, 578928, 618609, 661825, 708262, 757650, 809704, 864066, 920216, 977581, 1035797, 1094636, 1153507, 1211217, 1266338, 1317674, 1364314, 1405626, 1441460, 1472124, 1497971, 1519203, 1536232, 1549895, 1561056, 1570252, 1577956, 1584882, 1591717, 1598842, 1606626, 1615653, 1626218, 1637664, 1648551, 1657296, 1662415, 1662538, 1656762, 1644889, 1626902, 1602355, 1570685, 1531951, 1486839, 1436078, 1380383, 1320799, 1258485, 1194169, 1128380, 1062262, 997658, 936207, 878785, 825791, 777408, 733383, 693148, 656541, 624053, 596019, 571835, 550323, 530697, 512922, 497308, 484032, 472996, 463871, 456208, 449648, 444118, 439869, 437210, 436067, 435787, 435561, 435156, 435025, 435612, 436801, 438180, 439546]
50882D39546J353J389J702K521L450L750L422L332L954M860N714O866Q434R667
50868D99960J0010J0083J0755J1901J2909J3848J5202J6832J8262J9721K1961
50857F61444K5185K8998L3223L7946M2869M7554N2273N7832O4549P2072Q0066
50846A204011Q8342R6423J03833J10789J17774J24395J29490J32478J33722J33393
50836B374650J30762J24931J15650J03272Q8531P2595N6759M1847K8275J6664
50826C153936P780J854j357j840O77N845J2609K0061K7687L4606L9281M0341L7138
50813C378618K9438J7366J911j5413l3787n3300p3601r3082j10025j23913j35064
50802B789148j43457j48580j50083j48022j42712j34732j24885j13803j01749
$$ y = [439546, 440899, 442288, 443990, 446511, 449961, 453711, 457133, 460465, 464419, 469279, 474993, 481859, 490293, 499960, 509970, 520053, 530808, 542709, 555618, 569466, 584668, 601500, 619762, 639483, 661444, 686629, 715627, 748850, 786796, 829665, 877219, 929492, 987324, 1051873, 1123945, 1204011, 1292353, 1388776, 1492609, 1603398, 1721172, 1845567, 1975057, 2107535, 2241257, 2374650, 2505412, 2630343, 2745993, 2849265, 2937796, 3010391, 3067150, 3108997, 3137272, 3153936, 3161716, 3163570, 3162213, 3160373, 3161050, 3166895, 3179504, 3199565, 3227252, 3261858, 3301139, 3341480, 3378618, 3408056, 3425422, 3427333, 3411920, 3378133, 3324833, 3251232, 3158150, 3048125, 2924212, 2789148, 2645691, 2497111, 2347028, 2199006, 2056294, 1921562, 1796677, 1682874, 1581125]
50793A581125q8934p5748o2516m9398l6700k4910j4245m581M119J1744J8551K5093
50781A283600L1372L6544L9671M0302L8276L3677K7277K0290J3345O352m94o365
50769A563847j0984j5121j9355k3157k6009k8627l2032l5977l9268m1335m2502
50758A249480m3017m2825m2111m1173l9752l7297l3886l0155k6343k2173j7692
50747H73056j3447r690o086k382J332N102R268J3840J8239K2023K5478K9231L3644
50734I99608L8752M4475N0619N6876O3044O9151P5252Q1236Q6725R1055R3445
50723A750238R3461R1308Q7390Q1723P4089O4653N4014M2624L0538J7829M969
50712B392836p254j7943k6256l1711l4381l4544l2174k7122j9824j1443l200M158
$$ y = [1581125, 1492191, 1416443, 1353927, 1304529, 1267829, 1242919, 1228674, 1224093, 1228212, 1239956, 1258507, 1283600, 1314972, 1351516, 1391187, 1431489, 1469765, 1503442, 1530719, 1551009, 1564354, 1570706, 1570212, 1563847, 1552863, 1537742, 1518387, 1495230, 1469221, 1440594, 1408562, 1372585, 1333317, 1291982, 1249480, 1206463, 1163638, 1121527, 1080354, 1040602, 1003305, 969419, 939264, 912921, 890748, 873056, 859609, 849919, 843833, 841451, 842783, 847885, 857153, 870993, 889232, 911255, 936733, 965964, 999608, 1038360, 1082835, 1133454, 1190330, 1253374, 1322525, 1397777, 1479013, 1565738, 1656793, 1750238, 1843699, 1935007, 2022397, 2104120, 2178209, 2242862, 2296876, 2339500, 2370038, 2387867, 2392836, 2385582, 2367639, 2341383, 2309672, 2275291, 2240747, 2208573, 2181451, 2161627, 2150184, 2146984, 2151142]
50700B151142J0210J4570J6895J6900J4267Q812Q04r225k0999l4429m8751o2198
50688B057998p2971q0380q4672q6035q4286p9624p3014o5543n7609m9075m0015
50677A284774l0820k1648j2148k041Q364J8570K8651L9219N0579O2284P3669Q4446
50665A583899R4483J03207J09569J12645J12053J07774R9876Q8669P5002O0156
50655B547333M5241L0827J7263N167m870j3106k0615k8107l5104m0727m4935m8393
50643B409974n1287n3081n3447n2664n0876m7567m2278l5362k7724k0147j3175
50632A962366p117j790L392Q492J2565J4546J4478J3365J1980J0269P849M666
50620B055061J108k098m116m419l088n57K856P046J1880J7051K2184K6797L0273
$$ y = [2151142, 2161352, 2175922, 2192817, 2209717, 2223984, 2232796, 2233600, 2224375, 2203376, 2168947, 2120196, 2057998, 1985027, 1904647, 1819975, 1733940, 1649654, 1570030, 1497016, 1431473, 1373864, 1324789, 1284774, 1253954, 1232306, 1220158, 1218117, 1226481, 1245051, 1273702, 1312921, 1363500, 1425784, 1499453, 1583899, 1678382, 1781589, 1891158, 2003803, 2115856, 2223630, 2323506, 2412175, 2487177, 2547333, 2592574, 2623401, 2640664, 2645831, 2640961, 2627855, 2607240, 2579133, 2544029, 2503302, 2458367, 2409974, 2358687, 2305606, 2252159, 2199495, 2148619, 2101052, 2058774, 2023412, 1995688, 1975541, 1962366, 1955249, 1953459, 1956851, 1965343, 1977908, 1992454, 2006932, 2020297, 2032277, 2042546, 2050395, 2055061, 2056169, 2054071, 2049955, 2045536, 2042448, 2041891, 2044747, 2051793, 2063673, 2080724, 2102908, 2129705, 2159978]
50607B159978L1976L1507K8870K4475J8958J2804O099j199q848j6506k4213l2271
50595B231630m0635m8891n6839o4459p1244p6284p9319q0959q1501q0320p6966
50584A474213p2225o7373o2864n8373n3647m8681m3451l8284l3977l0776k7644
50573I36918k3444j8571j4468j1686r367o568l179M92M123P258R555J1357J3439
50560H95859J6154J9395K3227K7671L2037L5489L8459M2435M8090N4542O0810
50549A294168O6946P3261P9312Q4381Q8269R0897R1697R0021Q5763P9079P0048
50538B193842N9292M8374L8859L1176K4988K0322J7683J7175J8130J9499K0347
50527B509687K0248J9644J9695K1203K3946K7352L1439L6484M2062M7215N1470
$$ y = [2159978, 2191954, 2223461, 2252331, 2276806, 2295764, 2308568, 2314667, 2313468, 2304620, 2288114, 2263901, 2231630, 2190995, 2142104, 2085265, 2020806, 1949562, 1873278, 1793959, 1713000, 1631499, 1551179, 1474213, 1401988, 1334615, 1271751, 1213378, 1159731, 1111050, 1067599, 1029315, 995338, 964562, 936918, 913474, 894903, 880435, 868749, 859382, 852814, 849635, 850127, 854250, 861508, 871063, 882420, 895859, 912013, 931408, 954635, 982306, 1014343, 1049832, 1088291, 1130726, 1178816, 1233358, 1294168, 1361114, 1434375, 1513687, 1598068, 1686337, 1777234, 1868931, 1958952, 2044715, 2123794, 2193842, 2253134, 2301508, 2340367, 2371543, 2396531, 2416853, 2434536, 2451711, 2469841, 2489340, 2509687, 2529935, 2549579, 2569274, 2590477, 2614423, 2641775, 2673214, 2709698, 2751760, 2798975, 2850445]
50516B850445N5011N7716N8799N7542N3886M8022L9928K9745J8221O293n737j8246
50504C251625l1464m4817n7189o7712p6120q2319q5861q6086q2821p6612o8110
50493B492514n7550m4970l0819j6073j920J0497K0260K7107L1612L4439L5207
50482B500304L2466K5134J3733j34j5388l2051n0075o8101q3918r6036j04361
50471B121573j09316j10998j09543j05761j00727r4885q8159q0793p3466o6519
50461A181406n9730n3055m6983m1786l6974l1967k6916k2355j8326j4384j0402
50450H18528o764l826j518M45K263M081N990P946R814J1553J3281J5183J7386
50437H94362J9809K2011K3426K4036K4678K6390K9357L2699L5279L6615L7073
$$ y = [2850445, 2905456, 2963172, 3021971, 3079513, 3133399, 3181421, 3221349, 3251094, 3269315, 3275608, 3269871, 3251625, 3220161, 3175344, 3118155, 3050443, 2974323, 2892004, 2806143, 2720057, 2637236, 2560624, 2492514, 2434964, 2389994, 2359175, 2343102, 2341182, 2351679, 2371939, 2399046, 2430658, 2465097, 2500304, 2532770, 2557904, 2571637, 2571503, 2556115, 2524064, 2473989, 2405888, 2321970, 2225934, 2121573, 2012257, 1901259, 1791716, 1685955, 1585228, 1490343, 1402184, 1321391, 1247925, 1181406, 1121676, 1068621, 1021638, 979852, 942878, 910911, 883995, 861640, 843314, 828930, 818528, 811764, 807938, 806420, 806865, 809128, 813209, 819199, 827145, 836959, 848512, 861793, 876976, 894362, 914171, 936182, 959608, 983644, 1008322, 1034712, 1064069, 1096768, 1132047, 1168662, 1205735]
50426A205735L7386L7940L8463L8420L7780L7206L7251L7661L7689L6959L5644
50415A618134L4010L2225L0582K9445K8936K9019K9856L1563L3613L5053L5479
50404A967915L5301L4803L3583L1281K8322K5352K2372J8956J4971J0367M628
50393B227851k671j0909j8861k6194l3663m1701m9796n7475o4878p1668p6370
50382A773665p7809p6593p4194p0910o5891n8952n1143m3336l5261k6471j7355
50371A175750q742r49O208J2761J8242K1797K2592K0490J6332J1067M615l689
50359A296474j3394k2597k9648l4533l8067m0537m1844m2262m2166m1367l9565
50348I10494l7119l4591l1876k8635k5310k2758k0990j9176j6987j4962j3373
$$ y = [1205735, 1243121, 1281061, 1319524, 1357944, 1395724, 1432930, 1470181, 1507842, 1545531, 1582490, 1618134, 1652144, 1684369, 1714951, 1744396, 1773332, 1802351, 1832207, 1863770, 1897383, 1932436, 1967915, 2003216, 2038019, 2071602, 2102883, 2131205, 2156557, 2178929, 2197885, 2212856, 2223223, 2227851, 2225180, 2214271, 2195410, 2169216, 2135553, 2093852, 2044056, 1986581, 1921703, 1850035, 1773665, 1695856, 1619263, 1545069, 1474159, 1408268, 1349316, 1298173, 1254837, 1219576, 1193105, 1175750, 1167008, 1166059, 1172267, 1185028, 1203270, 1225067, 1247659, 1268149, 1284481, 1295548, 1300163, 1296474, 1283080, 1260483, 1230835, 1196302, 1158235, 1117698, 1075854, 1033592, 991426, 950059, 910494, 873375, 838784, 806908, 778273, 752963, 730205, 709215, 690039, 673052, 658090, 644717]
50337F44717j1681r435p028n087l648k328r21N71K187L944N731P412Q897J0135
50323F43466J1286J2769J4707J6428J7139J7057J7221J8144J9324K0221K0948
50312H28710K1683K2247K2709K3734K5582K7325K7838K7180K6281K5541K4567
50301A103397K3128K1503J9762J7461J4396J1130Q277N605K412j364m887p364
50289A213456q883j0037j1071j1838j2495j3660j5619j7831j9635k1130k2815
50278A048442k4597k5743k5902k5519k5106k4627k3820k2726k1602k0564j9559
50267G88677j8433j6984j5216j3617j2724j2312j1483r769p674n865m320k707
50255F57573j092K28J272K185K812L049L449M672O340P123O317M835M206M889
$$ y = [644717, 633036, 623601, 616573, 611486, 607838, 605510, 604589, 605160, 607347, 611291, 617022, 624434, 633331, 643466, 654752, 667521, 682228, 698656, 715795, 732852, 750073, 768217, 787541, 807762, 828710, 850393, 872640, 895349, 919083, 944665, 971990, 999828, 1027008, 1053289, 1078830, 1103397, 1126525, 1148028, 1167790, 1185251, 1199647, 1210777, 1219054, 1224659, 1227071, 1225707, 1220820, 1213456, 1204573, 1194536, 1183465, 1171627, 1159132, 1145472, 1129853, 1112022, 1092387, 1071257, 1048442, 1023845, 998102, 972200, 946681, 921575, 896948, 873128, 850402, 828800, 808236, 788677, 770244, 753260, 738044, 724427, 711703, 699391, 687908, 678139, 670465, 664600, 660280, 657573, 656481, 656709, 657981, 660166, 662978, 666027, 669476, 674148, 680488, 687611, 693928, 698763, 702969, 707858]
50241G07858N982O443O096N363M473L353K071R51N8j042k679m542n983o743p010
50226G14649o925o511o018n814n844n647n118m744m831m918m302k934j420k40
50212F49383O36J453K270K962L524M157N038N951O389O058N151M039K907J925
50198G01843J434J512J517O09j326l605n516o705p020o613o169o355p012p450
50184F49144p562p908q608r061q985q913r246r554r324q699q010p230o399n968
50170E33677n993n706m529l072k299k146j800j015k66K42Q31J546J905J555O44
50155E13574n61j978l429m528m929m612l868l197l006l171l086k390j464q83o96
50140D71776n16r3N08J050J217Q99O15J170K524L615L709L402L628M252M497M285
$$ y = [707858, 713840, 720283, 726379, 731742, 736215, 739568, 741639, 742590, 742648, 741606, 738927, 734385, 728402, 721659, 714649, 707724, 701213, 695195, 689381, 683537, 677890, 672772, 668028, 663197, 658279, 653977, 651043, 649623, 649383, 650019, 651472, 653742, 656704, 660228, 664385, 669423, 675374, 681763, 687821, 692972, 697011, 699918, 701843, 703277, 704789, 706306, 706915, 705589, 701984, 696468, 689763, 682743, 676130, 669961, 663606, 656594, 649144, 641582, 633674, 625066, 616005, 607020, 598107, 588861, 579307, 569983, 561284, 553274, 546044, 539645, 533677, 527684, 521978, 517449, 514377, 512078, 509932, 508132, 507117, 506851, 507093, 507924, 509470, 511375, 512930, 513574, 513013, 511035, 507606, 503078, 498149, 493537, 489669, 486472, 483466, 480295, 477209, 474819, 473355, 472472, 471776, 471260, 471167, 471675, 472725, 473942, 474841, 475456, 476626, 479150, 482765, 486474, 489876, 493504, 497756, 502253, 506538]
50124E06538M145M142L884L484L550M127M615M778N031N472N515M712L351J980
50110E65324R61O09J048J722J708Q62R3K33J089J954K481K733K832K913L218L841
50094E93621M689N715O887P906Q393Q605R370J1049J2998J4401J5214J5955J6873
50081G31676J7792J8598J9513K0911K3038K5809K8804L1635L4410L7660M1742
50070A031588M6639N2312N9006O6959P6076Q5991R6170J05964J14806J22418J28488
50059A986417J32078J31693J26187J15388R9908Q0880O0190M0527K4604J4035
50049B811907Q877P991R809J2754J5177J5074J0475M83j4230l2260n2471p3679
50037B719907r3746j10029j20957j26653j27898j25237j19283j11143j01925r2209
$$ y = [506538, 510683, 514825, 518709, 522193, 525743, 529870, 534485, 539263, 544294, 549766, 555281, 559993, 563344, 565324, 566285, 566894, 567942, 569664, 571372, 572234, 572327, 572560, 573649, 575603, 578084, 580817, 583649, 586562, 589780, 593621, 598310, 604025, 610912, 618818, 627211, 635816, 645186, 656235, 669233, 683634, 698848, 714803, 731676, 749468, 768066, 787579, 808490, 831528, 857337, 886141, 917776, 952186, 989846, 1031588, 1078227, 1130539, 1189545, 1256504, 1332580, 1418571, 1514741, 1620705, 1735511, 1857929, 1986417, 2118495, 2250188, 2376375, 2491763, 2591671, 2672551, 2732741, 2773268, 2797872, 2811907, 2820784, 2828775, 2838584, 2851338, 2866515, 2881589, 2892064, 2892547, 2878317, 2846057, 2793586, 2719907, 2626161, 2516132, 2395175, 2268522, 2140624, 2015387, 1896104, 1784961, 1683036, 1590827]
50027A590827q2370p3032o4741n7554n1278m5831m1076l6589l2024k7482k3273
50016A055577j9545j6359j3847j1908j0087q097o233m915l997k926j452Q9J181
50003I57481J512J146N10J24J57K61Kp48j825k997l964m469m569m663n060n780
49987I27118o786q041r138r351q358o709n196m084l188k398j628n81Q99K372L302
49972H68233L955N246P575J0254J2257J3234J3642J4183J5406J7608K0723K4217
49960A026533K7252K9303L0810L3073L7242M3239N0032N7053O5054P5248Q7838
49949A562677J01904J16563J31735J47568J63536J78272J89892J96239J95318
49940B983704J86219J69999J49296J27075J05793Q7534P3982O5549O0799N7552
$$ y = [1590827, 1508457, 1435425, 1370684, 1313130, 1261852, 1216021, 1174945, 1138356, 1106332, 1078850, 1055577, 1036032, 1019673, 1005826, 993918, 983831, 975734, 969501, 964586, 960589, 957663, 956211, 956300, 957481, 958993, 960139, 960649, 960773, 960930, 961191, 961193, 960445, 958620, 955623, 951659, 947190, 942621, 937958, 932898, 927118, 920332, 912291, 903153, 893802, 885444, 878735, 873539, 869455, 866267, 863869, 862241, 861660, 862559, 864931, 868233, 872188, 877434, 885009, 895263, 907520, 920754, 934396, 948579, 963985, 981593, 1002316, 1026533, 1053785, 1083088, 1113898, 1146971, 1184213, 1227452, 1277484, 1334537, 1399591, 1474839, 1562677, 1664581, 1781144, 1912879, 2060447, 2223983, 2402255, 2592147, 2788386, 2983704, 3169923, 3339922, 3489218, 3616293, 3722086, 3809620, 3883602, 3949151, 4009950, 4067502]
49930D067502N4556N1447M6986L8347K2869K28k7689n8493q9964j19351j43461
49919C842977j60342j70510j75983j78328j78002j75187j70544j64821j58172
49910B311088j50177j40616j30074j19652j10107j01349r2764q3940p5020o6587
49900A240802n9254n3241m8270m3917m0019l6524l3090k9356k5654k2795k0967
49889H27715j9506j8158j7664j8507j9795k0322k0084j9735j9102j7531j5417
49878F21894j3929j3223j2314j0900r847r456q736p027n136l980l262k403j799
49865E19882k009k471k241j401o57l9Q59J773K047J835J957K664L454M016M493
49850E34162M902N177N669O645P430P084O018N782P067Q892J0207J1247J2801
$$ y = [4067502, 4122058, 4173505, 4220491, 4258838, 4281707, 4281935, 4254246, 4195753, 4105789, 3986438, 3842977, 3682635, 3512125, 3336142, 3157814, 2979812, 2804625, 2634081, 2469260, 2311088, 2160911, 2020295, 1890221, 1770569, 1660462, 1559113, 1466349, 1382409, 1307389, 1240802, 1181548, 1128307, 1080037, 1036120, 996101, 959577, 926487, 897131, 871477, 848682, 827715, 808209, 790051, 772387, 753880, 734085, 713763, 693679, 673944, 654842, 637311, 621894, 607965, 594742, 582428, 571528, 561681, 552225, 543489, 536462, 531326, 527346, 524084, 521681, 519882, 517873, 515402, 513161, 511760, 511103, 511064, 511923, 513696, 515743, 517578, 519535, 522199, 525653, 529669, 534162, 539064, 544241, 549910, 556555, 563985, 571069, 577087, 582869, 589936, 598828, 609035, 620282, 633083]
49837F33083J5016J7657K0902K5034K9798L4757M0089M6441N4132O3029P2986
49826A052924Q3962R5740J07909J19973J31065J39602J43683J42012J34283J20873
49816B272026J02540Q0643N7386L5589J8003O463J271J230M420Q945J2886J3863
49804B615265R285k439k0990m4445p0205r5469j17388j33622j43230j46654j44784
49793A705324j38368j28442j16698j04743r3176q1833p0860o0984n2757m6054
49783H11409m0452l5683l1578k7956k4744k1973j9572j7404j5517j4061j2876
49772E49593j1602j0214r117q528q179p710p016o108n055m173l802l743l418k797
49758D58131k492k702k659j721m32J70m5l71m35n37p99p40l7P62P49k20j209j160
$$ y = [633083, 648099, 665756, 686658, 711692, 741490, 776247, 816336, 862777, 916909, 979938, 1052924, 1136886, 1232626, 1340535, 1460508, 1591573, 1731175, 1874858, 2016870, 2151153, 2272026, 2374566, 2455209, 2512595, 2548184, 2566187, 2572650, 2573921, 2575151, 2579571, 2588516, 2601402, 2615265, 2624550, 2622111, 2601121, 2556676, 2486471, 2391002, 2273614, 2139992, 1996762, 1850108, 1705324, 1566956, 1438514, 1321816, 1217073, 1123897, 1042064, 971204, 910220, 857463, 811409, 770957, 735274, 703696, 675740, 650996, 629023, 609451, 592047, 576530, 562469, 549593, 537991, 527777, 518660, 510132, 501953, 494243, 487227, 481119, 476064, 471891, 468089, 464346, 460928, 458131, 455639, 452937, 450278, 448557, 448125, 448295, 448250, 447879, 447444, 446907, 446108, 445368, 445331, 446093, 446842, 446622, 445413, 444253]
49740D44253o7J006J213Q67Q25J231J513J487J583J866J757J101P14J169J771
49725D62289J511N01l56o72p72p89n78l33n40j159j562j364p85j38M92R72J099
49708D57816R33P64P23P23Q04J131J660K163K521K689K528K075J746J847K052
49693D82175J887J567J706K258K438J766O35k87p11o55k04M07P90P86N97M80M33
49676D96068K71j94r49j652j849j547j286j364j286m96O20J047M66l75o36k91
$$ y = [444253, 444186, 445192, 446405, 447272, 448097, 449328, 450841, 452328, 453911, 455777, 457534, 458635, 459349, 460518, 462289, 463800, 464301, 463945, 463273, 462501, 461712, 461134, 460801, 460261, 459102, 457540, 456176, 455391, 455253, 455745, 456717, 457816, 458749, 459513, 460236, 460959, 461763, 462894, 464554, 466717, 469238, 471927, 474455, 476530, 478276, 480123, 482175, 484062, 485629, 487335, 489593, 492031, 493797, 494432, 494145, 493434, 492779, 492575, 492982, 493772, 494558, 495155, 495635, 496068, 496339, 496145, 495196, 493544, 491695, 490148, 488862, 487498, 486212, 485716, 486336, 487383, 487849, 487474, 486838, 486547]
$$ [...]
##END NTUPLES=NMR SPECTRUM
##END=
