
##TITLE=AC1208_HCOAH12050_6673652_9lKH1umkHA
##JCAMPDX= 6.0         $$ Bruker NMR JCAMP-DX V2.0
##DATA TYPE= NMR SPECTRUM
##DATA CLASS= NTUPLES
##ORIGIN= BRUKER
##OWNER= Administrator
$$ 1.72 TOPSPIN		Version 2.1
$$ 2012-08-14 19:54:21.890 -0500  Administrator@TOPSPIN
$$ Compression mode = diff/dup
##.OBSERVE FREQUENCY= 400.02188249412
##.OBSERVE NUCLEUS= ^1H
##.ACQUISITION MODE= SIMULTANEOUS (DQD)
##.ACQUISITION SCHEME= undefined
##.AVERAGES= 8
##.DIGITISER RES= 22
##SPECTROMETER/DATA SYSTEM= spect
##.PULSE SEQUENCE= zg30
##.SOLVENT NAME= COFFEE_meoh
##.SHIFT REFERENCE= INTERNAL, COFFEE_meoh, 1, 14.98509
##AUDIT TRAIL= $$ (NUMBER, WHEN, WHO, WHERE, PROCESS, VERSION, WHAT)
$$ ##TITLE= Audit trail, TOPSPIN		Version 2.1
$$ ##JCAMPDX= 5.01
$$ ##ORIGIN= Bruker BioSpin GmbH
$$ ##OWNER= Administrator
$$ $$ C:\Bruker\TOPSPIN/data/COFFEE/nmr/AC1208_HCOAH12050_6673652_9lKH1umkHA/10/pdata/1/auditp.txt
$$ ##AUDIT TRAIL=  $$ (NUMBER, WHEN, WHO, WHERE, PROCESS, VERSION, WHAT)
(   1,<2012-08-14 19:54:14.578 -0500>,<Administrator>,<TOPSPIN>,<go>,<TOPSPIN 2.1>,
      <created by zg
	started at 2012-08-14 19:53:08.031 -0500,
	POWCHK enabled, PULCHK disabled,
       configuration hash MD5:
       6B 1B 68 BB D9 2E 58 E2 7F 35 AD 54 07 DF 0E 41
       data hash MD5: 64K
       AF 2B 5D 37 51 06 1B C9 1A 9A E8 84 81 54 D7 A1>)
(   2,<2012-08-14 19:54:17.296 -0500>,<Administrator>,<TOPSPIN>,<proc1d>,<TOPSPIN 2.1>,
      <Start of raw data processing
       efp LB = 0 FT_mod = 6 PKNL = 1 PHC0 = 0 PHC1 = 0 SI = 32K 
       data hash MD5: 32K
       65 8D 4B 08 9F FD E0 51 08 4B 68 9F 95 08 17 B2>)
(   3,<2012-08-14 19:54:17.703 -0500>,<Administrator>,<TOPSPIN>,<proc1d>,<TOPSPIN 2.1>,
      <pk PHC0 = 177.995 PHC1 = 0 
       data hash MD5: 32K
       E8 63 6D 11 D4 80 E1 1E F5 DC DB 4F AC 56 BE 57>)
(   4,<2012-08-14 19:54:17.812 -0500>,<Administrator>,<TOPSPIN>,<proc1d>,<TOPSPIN 2.1>,
      <abs ABSG = 1 
       data hash MD5: 32K
       89 12 CC 99 ED D7 90 80 11 79 B0 3A AF 64 C3 5B>)
(   5,<2012-08-14 19:54:17.875 -0500>,<Administrator>,<TOPSPIN>,<proc1d>,<TOPSPIN 2.1>,
      <abs ABSG = 2 
       data hash MD5: 32K
       4F B4 90 A5 40 A4 5C E9 A8 10 12 31 3C 1B 06 F5>)
(   6,<2012-08-14 19:54:17.921 -0500>,<Administrator>,<TOPSPIN>,<proc1d>,<TOPSPIN 2.1>,
      <abs ABSG = 3 
       data hash MD5: 32K
       67 E7 91 F5 A3 08 6E 2A FA D8 39 5D F0 72 45 21>)
(   7,<2012-08-14 19:54:17.937 -0500>,<Administrator>,<TOPSPIN>,<proc1d>,<TOPSPIN 2.1>,
      <abs ABSG = 4 
       data hash MD5: 32K
       BC 25 3E B3 EE A7 1E 3F 3D 7E 06 F5 60 FF 40 E1>)
(   8,<2012-08-14 19:54:17.968 -0500>,<Administrator>,<TOPSPIN>,<proc1d>,<TOPSPIN 2.1>,
      <abs ABSG = 5 
       data hash MD5: 32K
       38 92 41 7E 03 2C FC 14 A4 6D F7 D6 8D 70 85 23>)
$$ ##END=
$$ 
$$ $$ hash MD5
$$ $$ 45 5F 3A 49 CF B5 35 48 2E 05 E6 82 56 25 1A F0
##$RELAX= 
##$RELAX= 
##$RELAX= 
##$RELAX= 
##$RELAX= 
##$RELAX= 
##$RELAX= 
$$ Bruker specific parameters
$$ --------------------------
$$ [...]
##$TP= (0..7)
150 150 150 150 150 150 150 150
##$TP07= 0
##$TPNAME0= <>
##$TPNAME1= <>
##$TPNAME2= <>
##$TPNAME3= <>
##$TPNAME4= <>
##$TPNAME5= <>
##$TPNAME6= <>
##$TPNAME7= <>
##$TPOAL= (0..7)
0.5 0.5 0.5 0.5 0.5 0.5 0.5 0.5
##$TPOFFS= (0..7)
0 0 0 0 0 0 0 0
##$TUNHIN= 0
##$TUNHOUT= 0
##$TUNXOUT= 0
##$USERA1= <user>
##$USERA2= <user>
##$USERA3= <user>
##$USERA4= <user>
##$USERA5= <user>
##$V9= 5
##$VALIST= <valist>
##$VCLIST= <CCCCCCCCCCCCCCC>
##$VD= 0
##$VDLIST= <DDDDDDDDDDDDDDD>
##$VPLIST= <PPPPPPPPPPPPPPP>
##$VTLIST= <TTTTTTTTTTTTTTT>
##$WBST= 1024
##$WBSW= 4
##$XGAIN= (0..3)
0 0 0 0
##$XL= 0
##$YL= 0
##$YMAX_a= 442519
##$YMIN_a= -561460
##$ZGOPTNS= <>
##$ZL1= 120
##$ZL2= 120
##$ZL3= 120
##$ZL4= 120
##$ABSF1= 14.98509
##$ABSF2= -5.573092
##$ABSG= 5
##$ABSL= 3
##$ALPHA= 0
##$AQORDER= 0
##$ASSFAC= 0
##$ASSFACI= 0
##$ASSFACX= 0
##$ASSWID= 0
##$AUNMP= <proc_prof1d_extract_pilot.lims>
##$AXLEFT= 0
##$AXNAME= <>
##$AXNUC= <1H>
##$AXRIGHT= 0
##$AXTYPE= 0
##$AXUNIT= <>
##$AZFE= 0.1
##$AZFW= 0.1
##$BCFW= 0
##$BC_mod= 0
##$BYTORDP= 0
##$COROFFS= 0
##$CY= 15
##$DATMOD= 1
##$DC= 0
##$DFILT= <>
##$DTYPP= 0
##$F1P= 0
##$F2P= 0
##$FCOR= 0.5
##$FTSIZE= 32768
##$FT_mod= 6
##$GAMMA= 0
##$GB= 0
##$INTBC= 1
##$INTSCL= 1
##$ISEN= 128
##$LB= 0
##$LEV0= 0
##$LPBIN= 0
##$MAXI= 10000
##$MC2= 0
##$MEAN= 0
##$ME_mod= 0
##$MI= 0
##$NCOEF= 0
##$NC_proc= -8
##$NLEV= 6
##$NOISF1= 0
##$NOISF2= 0
##$NSP= 0
##$NTH_PI= 0
##$NZP= 0
##$OFFSET= 14.98509
##$PC= 1
##$PHC0= 177.995
##$PHC1= 0
##$PH_mod= 1
##$PKNL= yes
##$PPARMOD= 0
##$PPDIAG= 0
##$PPIPTYP= 0
##$PPMPNUM= 2147483647
##$PPRESOL= 1
##$PSCAL= 4
##$PSIGN= 0
##$PYNMP= <proc.py>
##$REVERSE= no
##$SF= 400.02
##$SI= 32768
##$SIGF1= 0
##$SIGF2= 0
##$SINO= 400
##$SIOLD= 32768
##$SPECTYP= <>
##$SREGLST= <1H.CDCl3>
##$SSB= 0
##$STSI= 32768
##$STSR= 0
##$SW_p= 8223.68421052631
##$SYMM= 0
##$S_DEV= 0
##$TDeff= 65536
##$TDoff= 0
##$TI= <>
##$TILT= no
##$TM1= 0
##$TM2= 0
##$TOPLEV= 0
##$USERP1= <user>
##$USERP2= <user>
##$USERP3= <user>
##$USERP4= <user>
##$USERP5= <user>
##$WDW= 1
##$XDIM= 32768
##$YMAX_p= 444886334
##$YMIN_p= -721835
##$CURPLOT= <Network HP LaserJet P1505>
##$CURPRIN= <$Network HP LaserJet P1505>
##$DFORMAT= <normdp>
##$LAYOUT= <+/1D_H.xwp>
##$LFORMAT= <normlp>
##$PFORMAT= <normpl>
##$SURQMSG= 1
$$ End of Bruker specific parameters
$$ ---------------------------------
##NTUPLES= NMR SPECTRUM
##VAR_NAME=  FREQUENCY,     SPECTRUM/REAL,   SPECTRUM/IMAG
##SYMBOL=    X,             R,               I
##VAR_TYPE=  INDEPENDENT,   DEPENDENT,       DEPENDENT
##VAR_FORM=  AFFN,          ASDF,            ASDF
##VAR_DIM=   32768,         32768,           32768
##UNITS=     HZ,            ARBITRARY UNITS, ARBITRARY UNITS
##FACTOR=    0.250966925370066, 1,           1
##FIRST=     8223.43324360094, -81939,       103198
##LAST=      0,             -93144,          -152997
##MIN=       0,             -721835,         0
##MAX=       8223.43324360094, 444886334,    0
$$ Real data points
##PAGE= N=1
##DATA TABLE= (X++(R..R)), XYDATA
$$ [...]
19545b03182J551b0414H7820a21019q1002A70209K95128F4400d92005H4591a72523
19533c05461G88a57360B50173a15642k42806a3817A14901a93869q9438R8895N442
19522a78970f9152k29362N1323K6387P2275c7209o4234d4934A81918b54639A3225
19510C5910c54403A0380Q4754c50768h076A25694J12096D4914d812I9465c84639
19498a00858B69077i9541j83839m8327h0993j32350A18604B2121O0907a70215
19487a92989j84688J15967A05336c60993I8145b14985B35085F1570L6533c19763
19476b25085J02410j42476J23550A26529a43450B83684G9663f5135k8846j70755
19466b64736E9275a85999A38313b87431f143j87113A77349c3423B89845i3694
$$ plain form
19545 -203182 -201631 -20414 87820 -121019 -202021 170209 465337 64400 -492005 84591 -172523
19533 -305461 788 -157360 250173 -115642 -358448 -13817 114901 -193869 -283307 -184412 -178970
19522 -178970 -69152 -298514 -247191 -220804 -148529 -37209 -101443 -44934 181918 -254639 13225
19510 35910 -354403 10380 95134 -350768 -8076 125694 237790 44914 -4812 99465 -384639
19498 -100858 269077 -99541 -283380 -331707 -80993 -213343 118604 22121 83028 -170215
19487 -192989 -377677 -261710 105336 -360993 98145 -214985 235085 61570 98103 -319763
19476 -225085 -122675 -265151 -141601 126529 -143450 283684 79663 -65135 -93981 -264736
19466 -264736 59275 -185999 138313 -287431 -6143 -193256 177349 -33423 289845 -93694
19455A56081h5288M2176l11967f7851b2985l46132J80152h1812j73937A00263
19444d8685l80430B39469A08791e759o4526A1715M8135a34793M9079j47447i8973
19432i8738C02604h4062m594B27874J3403j03813c00730m4756a51530a9384j58978
19421a78362I3987A4840c36751B7264a64504k00185n2875A17032c6379B3508c9273
19409e2028K1153j87810M7237E7890J96187E221c49464i6487c8369k24842J09553
19398a53658O8703A53861C9284A2493O9084l1058i3880A53950a4869k0181k37667
19387b72717a22434q965A65285c65669D2529a37235I7682l0433e6952k12157R4397
19376a74712K7423A19910c8168B54012g2742H4022J71181f9462n5738A33018l7945
$$ plain form
19455 156081 -85288 -43112 -355079 -67851 -22985 -369117 -188965 -81812 -255749 100263
19444 -48685 -429115 239469 108791 -5759 -70285 11715 59850 -134793 -85714 -233161 -98973
19432 -98738 302604 -84062 -88656 227874 241277 137464 -300730 -345486 -151530 -19384 -178362
19421 -178362 93987 14840 -336751 27264 -164504 -364689 -417564 117032 -36379 23508 -39273
19409 -52028 -30875 -218685 -171448 57890 254077 5221 -349464 -96487 -38369 -263211 -153658
19398 -153658 -84955 153861 39284 12493 81577 50519 -93880 153950 -14869 -35050 -272717
19387 -272717 -122434 -131399 165285 -365669 42529 -137235 97682 67249 -56952 -269109 -174712
19376 -174712 -147289 119910 -38168 254012 -72742 84022 255203 -69462 -125200 133018 95073
19365I5073b49371d4623C9127J76651b05688N7737j09032h2153H5011a15495j0105
19354a25600K4191j0979l10750a94687f9044I1729a16283M1714c3347C4553f4974
19342E4118a77310J7339A02528K1237a12940c4821J0403r028J2219A21186c6685
19330c02215J02917D71680b63911D3893a41082d6368k89551a20467G9656a4694
19319b31410K752h0834B2239a79859F2605K8919k3963a1762A12264a60877K1303
19308a39574j55501j6520d1155E6324g4496g04o7503B57913D7244J80605b5886
19296e3066A46857a78890p742k4516E0636a76142G394O4836M9641b25643M7674
19285a77969L7190k6229j45997r1883a48589F0941a9154B71017D6494L3816a23876
$$ plain form
19365 95073 -249371 -44623 39127 215778 -205688 -147951 -256983 -82153 85011 -115495 -125600
19354 -125600 -101409 -112388 -423138 -194687 -69044 91729 -116283 -74569 -33347 34553 -64974
19342 54118 -177310 -159971 102528 123765 -112940 -34821 -24418 -33446 -21227 121186 -36685
19330 -302215 -199298 471680 -263911 43893 -141082 -46368 -335919 -120467 79656 -14694
19319 -231410 -228658 -80834 22239 -179859 62605 91524 67561 -11762 112264 -160877 -139574
19308 -139574 -295075 -311595 -41155 56324 -74496 -704 -68207 257913 47244 227849 -25886
19296 -53066 146857 -178890 -186632 -211148 50636 -176142 7394 72230 121871 -225643 -177969
19285 -177969 -140779 -167008 -313005 -404888 -148589 60941 -19154 271017 46494 80310 -123876
19273B55859A09851a9322D4706b15600J5215E0697J95682A2262J28312d73657
19262A37336A7008b19909B71424B5083c17679F9426a08202j22116N4754g8867
19251a31172k96971J22708a23513A6937L29798a114n0960A61517a40977p0603
19241b11580f1098H4373l5594O0245K579R9406b83840B39221c5462J3386F9398
19229A43718O4126n0453a51063N7905A03357h1648j35800C5471a00238A22024
19218A60988a21840K5495B77523a28168N8910B00445q4815c74144a56387A67099
19207g4787C4161i970k3997M772A87043a26160B86137a52480C09706d365B51133
19195C3564J78488c21927a16509B76h3257r8039B49879g7144k84876J51933L2564
$$ plain form
19273 255859 109851 -19322 44706 -215600 -200385 50697 246379 12262 140574 -473657
19262 137336 17008 -219909 271424 25083 -317679 69426 -108202 -230318 -175564 -78867
19251 -131172 -428143 -305435 -123513 16937 346735 -1114 -52074 161517 -140977 -211580
19241 -211580 -61098 84373 48779 109024 111603 211009 -283840 239221 -35462 -22076 69398
19229 143718 207844 157391 -151063 -93158 103357 -81648 -217448 35471 -100238 122024
19218 160988 -121840 -96345 277523 -128168 -69258 200445 115630 -374144 -156387 167099
19207 -74787 34161 -9970 -33967 -29195 187043 -126160 286137 -152480 309706 -4365 251133
19195 33564 212052 -321927 -116509 276 -83257 -181296 249879 -77144 -362020 -210087 -177523
19184a77523a884p4328E2584B0076a11187L5527B02495b86725A98955H326c43369
19172f446q2313l37641a92108M1497f9597j57885A51746b2088k05075N5494n9558
19161b31227E623a88410j04494K6682I4968B0482E264a60217g6511n6568E7681
19149c32324A36756a816B3508M8459N8562g1454A61675f8905m2438c9815J0329
19138b9486k20653a103A21842h3751k07704d0238H5119a49726d2985j05624r9206
19127b47815J12546E9735k9250d959B37012I9683a42089b2769E7057b3382l19453
19116c42835A23948g3685C2162a64277j45300J23785o1734o1999B2842b01332
19105B6089C830J9047b04744f6130A3532J05449B3543a06458I228K00465a37693
$$ plain form
19184 -177523 -1884 -76212 52584 20076 -111187 -75660 202495 -286725 198955 8326 -343369
19172 -6446 -88759 -426400 -192108 -150611 -69597 -227482 151746 -22088 -227163 -171669 -231227
19161 -231227 5623 -188410 -292904 -266222 94968 20482 5264 -160217 -76511 -133079 57681
19149 -332324 136756 -1816 23508 71967 130529 -71454 161675 -68905 -111343 -39815 -29486
19138 -29486 -250139 -1103 121842 -83751 -291455 -40238 85119 -149726 -42985 -148609 -247815
19127 -247815 -135269 59735 30485 -4959 237012 99683 -142089 -22769 57057 -23382 -342835
19116 -342835 123948 -73685 32162 -164277 -309577 -185792 -247526 -309525 22842 -201332
19105 26089 3830 22877 -204744 -66130 13532 118981 23543 -106458 9228 209693 -137693
19093b28796A28697e9462A33630K34124a41983O0425l38487O5152G5020H950J15212
19082A24162E0580B4431J74339p8681C0593b59957F47a92338D378J27752j8117
19071A14013b82051C200J28817a26525B1048a73281f7149k92058H8395J89714
19061B78109c20033a5558k90422B90899A8694N111L03684c37282i3014B0278L65734
19050C86012a7364A83791j8734R8398b4886r9069e2042F865J41783a42525B68057
19038e6580J848p2749n9587A39816E7366J21151J35669c62371i6145I4195M2144
19027A36339J43096c26384A63232F4721a12950B91462E9546i9714B5802K41785
19017B67587I206J43303b30207K1089A03656n1714J04906a08683I1681a01120
$$ plain form
19093 -228796 128697 -59462 133630 367754 -141983 -81558 -420045 -354893 75020 8950 124162
19082 124162 50580 24431 198770 120089 30593 -259957 647 -192338 4378 132130 114013
19071 114013 -282051 3200 132017 -126525 21048 -173281 -67149 -359207 88395 278109
19061 278109 -320033 -15558 -305980 290899 18694 23805 327489 -337282 -93014 20278 386012
19050 386012 -17364 183791 165057 263455 -24886 -123955 -52042 6865 148648 -142525 268057
19038 -56580 -54732 -127481 -187068 139816 57366 178517 314186 -362371 -96145 94195 136339
19027 136339 279435 -326384 163232 64721 -112950 291462 59546 -99714 25802 267587
19017 267587 9206 152509 -230207 -209118 103656 51942 156848 -108683 91681 -101120
19006I5958b21238O1034D4842J42507b8039m3792o4262I9058J81268a67544A19525
18994a26332N4477j5518p2066A30142a13976B20273b5650c795k87380A01323b49714
18982d2242r5592f8154k6674j99517B34618n8361J2571a74432L4280F717a10469
18970c01353B28323f4365b7568B48a32259F9232a30375B79511j01126a23445l58471
18959d81916a72252e2455k27471h8776A09097c06480A61630b91158F5418J17647
18949A83065J89315B0255d56913B5687a07901O312A49998D0542b75376J37021
18939a38355L3227m0128j50808a9845o3315a6928j2267A77957c04085q4767I6438
18927f9881j01158B08704b19146A16668b59153A80272O7247a86393D3663b22648
$$ plain form
19006 95958 -221238 -160204 44842 187349 -28039 -71831 -136093 99058 280326 -167544 119525
18994 -126332 -71855 -87373 -159439 130142 -113976 220273 -25650 -3795 -291175 101323 -249714
18982 -42242 -137834 -68154 -94828 -294345 234618 176257 188828 -174432 -140152 6717 -110469
18970 -301353 228323 -64365 -27568 248 -132259 69232 -130375 279511 178385 -123445 -481916
18959 -481916 -172252 -52455 -279926 -88776 109097 -306480 161630 -291158 65418 183065
18949 183065 372380 20255 -456913 25687 -107901 -101589 149998 40542 -275376 -138355
18939 -138355 -105128 -145256 -296064 -19845 -83160 -16928 -29195 177957 -304085 -388852 96438
18927 -69881 -171039 208704 -219146 116668 -259153 180272 247519 -186393 43663 -222648
18916a35006K9430k14875R1478H1981e3312o8326A35309a81913r2929g182l5401
18905d2583m8704k7956B93778a47684E2752n60j7932d38972B210i0506B52243
18893a91542c5502j5413A80284b04977B93822c28508C5244L0044h6263m4944a4162
18881b5384k61810h5469B78202b04120h5572k67040B29759m45j00239b03152I0560
18869a58354H7452O3603b41983j65635A25646o1447b55407o7455h4403A769L6671
18858C8440j9024L29217b39469h8154j42933h3650A74856a25167C987N1720K66145
18847C21852r2878a67143H3996l0911J34528b4172j21254A900J47402c58961a70212
18835B58498a50378a3404k56979N0489A0730J41809a67203P6792B65824h3459
$$ plain form
18916 -135006 -105576 -320451 -228973 81981 -53312 -121638 135309 -181913 -274842 -7182 -42583
18905 -42583 -91287 -119243 293778 -147684 52752 52192 34260 -438972 2210 -90506 252243
18893 -191542 -35502 -50915 180284 -204977 293822 -328508 35244 65288 -86263 -131207 -14162
18881 -25384 -287194 -85469 278202 -204120 -85572 -352612 229759 229314 129075 -203152 90560
18869 -158354 87452 151055 -241983 -407618 125646 64199 -255407 -322862 -84403 1769 38440
18858 38440 19416 348633 -239469 -88154 -231087 -83650 174856 -125167 3987 55707 321852
18847 321852 228974 -167143 83996 53085 187613 -24172 -145426 1900 149302 -358961 -170212
18835 258498 -150378 -13404 -270383 -219894 10730 152539 -167203 -90411 265824 -83459
18824E9350c48259C2543M3919a69911a2148l3986C0021J78636f0152j44180D7619
18812B67626P0734a97022g001A61926J21308b08283B52877c7649G3292b21125
18801h6656j26765N246O3601B6693d30560J24971c9980A60098Q4226h4789n00138
18790e84927f5783I2956D4616N9913a15267j22992C8520g2935E29511A48082C2977
18778A9020a57642O4671C537e44168a60096c1531C839L8988J7512d7934j82256
18767b30190A86193I2228A3050a45486r0704F3724a96663e0516B6548a42550D5631
18755G4919a54613j6032h2110A84925b07758H3822R939a06550E8345i5383k00428
18744b95811A4485f8880j47953J6312A98152b80315Q0640L3026k0326c2615q3745
$$ plain form
18824 59350 -348259 32543 76462 -169911 -12148 -46134 30021 208657 -60152 -204332 47619
18812 267626 338360 -197022 -7001 161926 283234 -208283 252877 -37649 73292 -221125
18801 -86656 -213421 -208175 -144574 26693 -430560 -305589 -39980 160098 244324 -84789 -584927
18790 -584927 -65783 92956 44616 104529 -115267 -238259 38520 -72935 529511 148082 32977
18778 19020 -157642 -92971 3537 -544168 -160096 -31531 3839 42827 60339 -47934 -230190
18767 -230190 186193 92228 13050 -145486 -236190 63724 -196663 -50516 26548 -142550 45631
18755 74919 -154613 -170645 -82110 184925 -207758 83822 93761 -106550 58345 -95383 -295811
18744 -295811 14485 -68880 -216833 -200521 198152 -280315 -199675 -166649 -186975 -32615 -116360
18733a16360C74136a21489n2976B38763b7042B5128J41709a23885A27892l0829
18723I7063c1665A16954c77000J7380Q9296B5082a24582j9835c6672A9564d31261
18711b08658k00933C43849d5872j98936C9490g0325b874k02270G171b09649b4845
18699A52845a9501q6668k77997f2437o9565A6634Q8477i6605k8261M8537c1400
18687E9179g5876A28863M6112c91140G5218K29332b14307A43103a59895P3698
18677h6197k55369C1311J03551O4315D844g9737k57757b2039k9896A5393M2414
18666E7807P2721L71374a67648O1707B5935a21226c3111H9209L8529b4722A34806
18654i3081A39991b65710e2151D4736L6368J02943b44830B27848A11408a51188
$$ plain form
18733 -116360 374136 -121489 -174465 238763 -27042 25128 166837 -123885 127892 97063
18723 97063 -31665 116954 -377000 -359620 -270324 25082 -124582 -144417 -36672 19564 -431261
18711 -208658 -409591 343849 -45872 -244808 39490 -70325 -2874 -205144 7171 -209649 -24845
18699 152845 -19501 -106169 -384166 -62437 -132002 16634 105111 -96605 -124866 -76329 -31400
18687 59179 -75876 128863 174975 -391140 75218 304550 -214307 143103 -159895 -86197
18677 -86197 -341566 31311 134862 199177 4844 -79737 -337494 -22039 -51935 15393 57807
18666 57807 130528 501902 -167648 -105941 25935 -121226 -33111 89209 127738 -24722 134806
18654 -93081 139991 -265710 -52151 44736 81104 184047 -244830 227848 111408 -151188
18643a17224k48379i7867C5390M5346J1768k7003j2874f3231o1109k82450J14963
18632b91827Q8643B38527k4147a90494R1233H6461a67089l3165j18409G5164J80371
18621B55535A2084d4507D6193g1121I3640b23306k7301i2422j2215d0153A25823
18609a70920A57952h4858L5756l26022h9146j89043Q8918K8344j881d1605G1856
18597a94445a5502j36559d7588j52281A69392E8526b79472J25214b7934j07284
18587a35218n4483e8053K7221a4916j22314o7140j5585K7878P1331A62919C6323
18575d1854G9046b00857q7927Q8527E3902K983Q1889c28735e1228j50395R9867
18564a01756B6363a21660k9434g670A44192a36620f8160m764B78302a44635D0516
$$ plain form
18643 -117224 -365603 -97867 35390 80736 92504 65501 52627 -63231 -124340 -406790 -291827
18632 -291827 -203184 238527 214380 -190494 -99261 86461 -167089 -200254 -318663 75164 255535
18621 255535 12084 -44507 46193 -71121 93640 -223306 -250607 -92422 -104637 -40153 125823
18609 -170920 157952 -84858 -49102 -375124 -89146 -278189 -189271 -160927 -162808 -41605 71856
18597 -194445 -15502 -152061 -47588 -199869 169392 58526 -279472 -154258 -27934 -135218
18587 -135218 -189701 -58053 -30832 -14916 -137230 -204370 -219955 -192077 -120746 162919 36323
18575 -41854 79046 -200857 -288784 -200257 53902 56885 138774 -328735 -51228 -201623 -101756
18564 -101756 26363 -121660 -151094 -7670 144192 -136620 -68160 -72924 278302 -144635 40516
18552B69858A12453b27808G0431b89681C47496D4397b8747k94090D03683d94609
18541b13766H1640l8491b32629G7401C720a98325D4632J05042C9190b09679B62279
18529c7414A94848c16318B67608A10900b544l80244a685B5185a15430C4985K13576
18518B48561a51900j60987f6755a5792j72967a4909m8406K4757j55140h24l055
18507c879j48444l10225E1298A0287R0936l7273J29038b25605a01773c7388C36244
18495c27479J3291A30941o2148a59284I460e2265k18071d1226q7597a9006C0947
18483B5751O8602N6281m0831j0777d6482l2011b7719I374b06432j25896C6968
18471A39597g7540E432N1330N4687M1977a04441k23768k3624a18186L7661b1380
$$ plain form
18552 269858 112453 -227808 70431 -289681 347496 44397 -28747 -322837 403683 -494609
18541 -213766 81640 43149 -232629 77401 3720 -198325 44632 149674 39190 -209679 262279
18529 -37414 194848 -316318 267608 110900 -2544 -382788 -1685 25185 -115430 34985 248561
18518 248561 -151900 -312887 -66755 -15792 -188759 -14909 -63315 -38558 -193698 -824 -3879
18507 -3879 -152323 -462548 51298 10287 101223 63950 192988 -225605 -101773 -37388 336244
18495 -327479 -314188 130941 68793 -159284 9460 -52265 -270336 -41226 -128823 -19006 30947
18483 25751 94353 150634 109803 99026 -46482 -78493 -27719 9374 -206432 -332328 36968
18471 139597 -77540 5432 56762 111449 153426 -104441 -328209 -351833 -118186 -80525 -21380
18459c54763A40998d26030B10080p4960a10503J092f274A91883e1570k26185a1702
18447d81577A3198a29941d0323C21387a38596A31153h4695A44148f4941b0582
18436A66362b55368A68078p021P5482J6355p7186c7390E4594c4174n7446H1839
18424B33432a07436P155B91987b54649A25519a29244A71342A4717J35247a71073
18413a63699e5580k24739N8662A16698e5146A13525f0284C10966H0878a47579
18402A47131J4764g5406c3229B057J30724P2743a53984D90921a94904C5368e8991
18390I5621a96488C32L89510A0083f3218J2617r0191B3946K632b5121j12083c2236
18377b39859A14040a21413k30290e3068B2098e2856F665c5875k01554c2964C8795
$$ plain form
18459 -354763 140998 -426030 210080 135120 -110503 -109411 -6274 191883 -51570 -277755 -11702
18447 -481577 13198 -129941 -40323 321387 -138596 131153 -84695 144148 -64941 -20582
18436 166362 -255368 168078 161057 236539 252894 175708 -37390 54594 -34174 -91620 81839
18424 233432 -107436 -100281 291987 -254649 125519 -129244 171342 14717 149964 -171073
18413 -163699 -55580 -280319 -221657 116698 -55146 113525 -60284 310966 80878 -147579
18402 147131 161895 -75406 -33229 2057 132781 205524 -153984 490921 -194904 35368 -58991
18390 95621 -196488 332 389842 10083 -63218 -50601 -140792 23946 26578 -25121 -137204 -32236
18377 -239859 114040 -121413 -351703 -53068 22098 -52856 6665 -35875 -237429 -32964 38795
18365a13190A6464R1031a0025j0056A68812o6280a55287G195g8617I8972i0206
18353A99857j2863c04844B18442a07300G1078b69221n946B40475I2410B6877b16884
18341b55675B29520G4238b54121g9361j18172i051p9933A49877f6425A0232i7759
18329c96653h5180j40367N5802A27322c9466B11626b50645A04132K23078c17988
18318b4947l4735o7383H4031f3620n1804L2945G3722a87651C31018a61619j10089
18307b71708L3864e8892a7971n7314j68282C1672c02067J31176j51280B68376
18296a96932L7864A46802A8058M06338a54559E4931J2302f414k5893k97106f276
18284A8206J12993b52402B25331g9963A51740b35571Q7378I141b68082A45714
$$ plain form
18365 -113190 16464 107495 -10025 -20081 168812 102532 -155287 7195 -78617 98972 -90206
18353 199857 186994 -304844 218442 -107300 71078 -269221 -275167 240475 92410 26877 -216884
18341 -255675 229520 74238 -254121 -79361 -197533 -9051 -88984 149877 -66425 10232 -97759
18329 -396653 -85180 -225547 -169745 127322 -39466 211626 -250645 104132 327210 -317988
18318 -24947 -59682 -127065 84031 -63620 -115424 -82479 73722 -187651 331018 -161619 -271708
18307 -271708 -237844 -58892 -17971 -75285 -243567 31672 -302067 -170891 -322171 268376
18296 -196932 -159068 146802 18058 424396 -154559 54931 67233 -6414 -32307 -329413 -6276
18284 18206 131199 -252402 225331 -79963 151740 -235571 -148193 9141 -268082 145714
18273A38705e6039a5583k50331J27327o5882B8811J68843b17963c7351a8617A24479
18261g21835f0554D7937e1689A63400d9302C24121C9223b42162M5360n730e0030
18249C5762a47387B70850C0331K91194A56650D1989a98988A42924k3058g9765
18238b90471k198E12138a12935J1567d4253G954b23025b7024l24633A76753a68725
18226b2136L669B18699a5428H9010A6012K10370A07874e003B1883K0796d0783
18214C652a50139n759G517N6256b568m5911o0972r4279b967j36095A56158a31504
18201c5165I9320O9440Q5135b24416b940A02214a18869r2540C43373b19457B09723
18189A21460a02632D2286b73657R7176a8910B17330G5916K1802c06836e1517h380
$$ plain form
18273 138705 -56039 -15583 -265914 -138587 -204469 28811 197654 -217963 -37351 -18617 124479
18261 -721835 -60554 47937 -51689 163400 -49302 324121 39223 -242162 -196802 -202532 -50030
18249 35762 -147387 270850 30331 321525 156650 41989 -198988 142924 119866 -79765
18238 -290471 -292669 512138 -112935 -101368 -44253 7954 -223025 -27024 -351657 176753 -168725
18226 -22136 -18467 218699 -15428 89010 16012 226382 107874 -5003 21883 42679 -40783
18214 3652 -150139 -155898 7517 63773 -2568 -48479 -109451 -203730 -2967 -139062 156158 -131504
18201 -35165 99320 168760 253895 -224416 -2940 102214 -118869 -211409 343373 -219457 209723
18189 121460 -102632 42286 -273657 -176481 -18910 217330 75916 97718 -306836 -51517 -8380
18177G0072J56746j5511e372I8774a44856n6016H0449B0088a04492M0657B25034
18165h8924G9749c24272B4880a22265k09646A0231a71172Q1810r0010B61137a06608
18153A36690o0439a75206c6845A00922O975d9095r1717e5819C28984h7255k2456
18142a09711c1735j92269N9272D08713b85394m5826B3026e2954k8825m91818a04442
18130a68254O0694A3646J57774a49011C2750b96386C960g1981E579b4853C6347
18118a27811K9746G0198a48767B05397k2832d1697I2773l0240b42156E4176a33308
18106c73010B73507J5154A43573h543A57223c813k38433H2419K1125q725b35886
18094b96E9299a41205e889E6100G928i3457C12001h9595A58320b89940A11072
$$ plain form
18177 70072 226818 211307 -5372 98774 -144856 -200872 80449 20088 -104492 -63835 225034
18165 -88924 79749 -324272 24880 -122265 -331911 10231 -171172 -89362 -179372 261137 -106608
18153 136690 76251 -175206 -36845 100922 107897 -49095 -140812 -55819 328984 -87255 -109711
18142 -109711 -31735 -224004 -164732 408713 -285394 -331220 23026 -52954 -81779 -573597 -104442
18130 -168254 -107560 13646 171420 -149011 32750 -296386 3960 -71981 5579 -24853 36347
18118 -127811 -98065 70198 -148767 205397 182565 -41697 92773 62533 -242156 54176 -133308
18106 -373010 273507 288661 143573 -8543 157223 -3813 -242246 82419 103544 94819 -235886
18094 -296 59299 -141205 -5889 56100 7928 -93457 312001 -89595 158320 -289940 111072
18082B04652a99328A8487c00644j10341a55232A81492h2646q3338B38539F085
18071f9245n3543j7360C2922J3865J33109J8844C7028N7422a52057c1799j05463
18060a37262c2208A09722l2629b31532l967j67302c7218A68232A8402E773f7739
18048c90944a14631m7587e9984J6279q5506D4600A4382c93661B04213D2904b9367
18036A79158l5773f7066j46862C86405a71928a1630b014j89501A4557J51470L27688
18025D93715i5572k33963g6077j66734D5293j5843d01376d2339l0780A50640a36945
18013A65451c8155j54314B71923e3677j23851M4409a7033k33300G098c92553D3690
18001c1534B6421c9526I9876a78127m9620h4304B48176A1781J21238n1405a73952
$$ plain form
18082 204652 -199328 18487 -300644 -410985 -155232 181492 -82646 -165984 238539 6085
18071 -69245 -122788 -140148 32922 46787 179896 198740 37028 94450 -152057 -31799 -137262
18060 -137262 -32208 109722 77093 -231532 -235499 -402801 -37218 168232 18402 5773 -67739
18048 -390944 -114631 -162218 -59984 -43705 -129211 44600 14382 -393661 204213 42904 -29367
18036 179158 143385 -67066 -213928 386405 -171928 -11630 -2014 -191515 14557 166027 493715
18025 493715 -95572 -329535 -76077 -242811 45293 29450 -401376 -42339 -73119 150640 -136945
18013 165451 -38155 -192469 271923 -53677 -177528 -133119 -17033 -250333 7098 -392553 43690
18001 -31534 26421 -39526 99876 -178127 -227747 -84304 248176 11781 133019 81614 -173952
17989A15544m4553c12786a46187d2952m4786A15747b99598A64842h2604A65379
17978b1824j870k459H8300c78267A8702c33776B33051b72538A44435J17707b7490
17966C9492d83728A17296d4447j68510b1868n8475j04948l06492I7205a39741
17955b05019f2410A24509a52158A74884A1709J70578a2486m46662A5516P1448
17945H6964p4P0676p0131A7207P3207h1236j21326j51351B2493K1768K92168A25605
17932b13935j56622l8601D54766A65879b22501A78756f1678A77596a65873b2902
17921a74731G9863C8192L37264a57132F102e9157A82639f8134C45255b5109k51756
17910b76865J196a2189F1465b77020E6990L1239a04824d1746A77775a32032A13930
$$ plain form
17989 115544 70991 -312786 -146187 -42952 -87738 115747 -299598 164842 -82604 165379
17978 -21824 -23694 -26153 88300 -378267 18702 -333776 233051 -272538 144435 262142 -27490
17966 39492 -483728 117296 -44447 -212957 -21868 -80343 -185291 -491783 97205 -139741
17955 -205019 -62410 124509 -152158 174884 11709 182287 -12486 -459148 15516 86964
17945 86964 86890 157566 87435 17207 90414 -81236 -202562 -353913 22493 44261 336429 125605
17932 -213935 -370557 -409158 454766 165879 -222501 178756 -61678 177596 -165873 -22902
17921 -174731 79863 38192 375456 -157132 6102 -59157 182639 -68134 345255 -25109 -276865
17910 -276865 -275669 -12189 61465 -277020 56990 88229 -104824 -41746 177775 -132032 113930
17898a51684k90492a12066f505C31244C9318g5590l22361G7007b19452o8715C7843
17886d2475C88410c13007C8113h5227F5679M2562J04555d708j97449h722l9283
17875d8005J5517m21756f9126J9610l563A37010o188k6757a78847o5914C893N3622
17863E7515K45936a48487C0498b22819B8899J08133J13141a9615A46499K08159
17853C54658F1541D079J2273M8012j0278a84065B92999a5745f050A5751L60559
17842C76310A84627k6697a93639N5488A47619c2932E1774M6445a74929A6171a09808
17830F7267a99215d5632C55191m9790b41105M9221i485j56717E3660M6823Q8003
17819A88486b24068A13449Q7178a03529G222a22408A2454K36959n7832A3725J10547
$$ plain form
17898 -151684 -442176 -112066 -6505 331244 39318 -75590 -397951 77007 -219452 -288167 37843
17886 -42475 388410 -313007 38113 -85227 65679 108241 212796 -4708 -202157 -8722 -48005
17875 -48005 -32488 -454244 -69126 -49516 -53079 137010 130822 104065 -178847 -244761 3893 57515
17863 57515 303451 -148487 30498 -222819 28899 137032 250173 -19615 146499 354658
17853 354658 61541 4079 16352 64364 54086 -184065 292999 -15745 -6050 15751 376310
17842 376310 184627 157930 -193639 -138151 147619 -32932 51774 98219 -174929 16171 -109808
17830 67267 -199215 -45632 355191 305401 -241105 -191884 -9485 -166202 53660 100483 188486
17819 188486 -224068 113449 200627 -103529 7222 -122408 12454 249413 191581 13725 124272
17808A24272E0417L0206e8329J7137k8615E2732L8354a17860G0366f3745r7166
17797a60911B3065a12752G4328Q8707K4421a52079j51671R0944Q5004b1111j73225
17786a94336A9177h4437A16220b3994A87077J98118j65932c2405j01546r992A03769
17774c66499h0276l7516C6729c35688A10739J36551c41686B15666a40500A91986
17763b39895a08598F3890f4116l01640H7539D0482c46833a37596B12155a68761
17752C21489H0244j3292c5104B11647n7571E4683j2878J61700e5552j5715n3584
17741a24851B00796b20544f0484j66513i8569m08H4126b64470g9555G454J98792
17730B06246N0905C0249n855K29515A06115a21150O711d7793J1106A4232K6520
$$ plain form
17808 124272 50417 80623 -58329 -41192 -69807 52732 91086 -117860 70366 -63745 -160911
17797 -160911 23065 -112752 74328 163035 187456 -152079 -303750 -212806 -127802 -21111 -194336
17786 -194336 19177 -84437 116220 -23994 187077 385195 219263 -32405 -133951 -143943 103769
17774 -366499 -80276 -117792 36729 -335688 110739 247290 -341686 215666 -140500 191986
17763 -239895 -108598 63890 -64116 -365756 87539 40482 -346833 -137596 212155 -168761
17752 321489 80244 66952 -35104 211647 154076 54683 41805 203505 -55552 -71267 -124851
17741 -124851 200796 -220544 -60484 -226997 -98569 -98977 84126 -264470 -79555 7454 206246
17730 206246 257151 30249 24394 253909 106115 -121150 -114439 -47793 -36687 14232 40752
17719D0752a3957A17184a11070B23317a80187c7062k9925j79892a9786A82186
17708b46147k8101a2069A16539J26789b38610B4465b56097i477m5683j47819B13442
17696A02443O8531d3876J8957C322f3894j01597C2534J42036b30294h2868m9522
17685a32390G1527a90204H1800q263h6828A75531c97354f6645A62962D3063a66926
17673b2990j05863I7104a29699c982j87798k7207d7035A57067a33396D069O4340
17662F8409L07720B0610J77196g8792m8714A31768a9653C0967N7524g0817F6613
17650a64001B01878d0934q4092A1338K55131e2558C6203R5532a25656F48751a04291
17638b64582i6026H7991h6613A4882p204M5593a64669F9323j2425f3898B46307
$$ plain form
17719 40752 -13957 117184 -111070 223317 -180187 -37062 -66987 -246879 -19786 182186
17708 -246147 -274248 -12069 116539 243328 -238610 24465 -256097 -9477 -55160 -202979 213442
17696 102443 170974 -43876 -24919 3322 -63894 -165491 32534 174570 -230294 -82868 -132390
17685 -132390 71527 -190204 81800 73537 -86828 175531 -397354 -66645 162962 43063 -166926
17673 -22990 -128853 97104 -129699 -3982 -191780 -218987 -47035 157067 -133396 4069 68409
17662 68409 376129 20610 197806 -78792 -127506 131768 -19653 30967 88491 -70817 66613
17650 -164001 201878 -40934 -125026 11338 266469 -52558 36203 131735 -125656 648751 -104291
17638 -264582 -96026 87991 -86613 14882 7678 53271 -164669 69323 56898 -63898 246307
17626A75870c7621j24163B59190a12136D5924a4135j16560e9j11649k20427a53405
17614g7968I2355r023a0593j96361C52458A26682h3489j65058K0817e8718E4278
17602A78125n9087a08401F2937b816B86119p4449D007J21049A3001L00852a18540
17590h7762j34383C3636J70432E8178a62035B73281a03489A08594n1677Q7877
17580A44794J59028a13817m8700A41389d8579H5635j3812l5874a96770L5180A8390
17568c6733k49734I524b472l0810A09320m2227L6625J66761L1412a3953A75039
17556B16032F790a23568m3821A87681J32175e9435j11867D4671a54104D8408A6792
17544c5154l76921b05381g0493L428G0668d9499J5967J658C1451N4045j6642b08201
$$ plain form
17626 175870 -37621 -161784 259190 -112136 45924 -14135 -130695 -59 -111708 -332135 -153405
17614 -77968 92355 83332 -10593 -206954 352458 126682 -83489 -248547 -227730 -58718 54278
17602 178125 119038 -108401 62937 -2816 286119 211670 4007 125056 13001 313853 -118540
17590 -87762 -222145 33636 204068 58178 -162035 273281 -103489 108594 56917 144794
17580 144794 303822 -113817 -162517 141389 -48579 85635 71823 35949 -196770 -161590 18390
17568 -36733 -286467 9524 -2472 -33282 109320 67093 103718 270479 301891 -13953 175039
17556 216032 6790 -123568 -167389 187681 319856 -59435 -171302 44671 -154104 48408 16792
17544 -35154 -412075 -205381 -70493 -67065 70668 -49499 -33532 -31874 31451 85496 68854 -208201
17531i0769K1177F3308L8525j9400k9143J61196m5026c01315I5257b06776A67261
17519a39710E9143a28152n3991C07423K04801a68486d8902F1336J00445a27409
17508B62446a33947j6131K3149D3213K38921l061A04423N7589j6793a0119A51343
17496C86172g727F13026d0072I2125d6162F1160J46696G5708A5475a30497K5771
17485a04726A94050C3657a29111M3388k29584A59351J95505A31461J01120p4328
17475A58253a03612B5270L28824q4864A14041Q2266c07902A06139a29514F5590
17464C04757b75272C35700d4730B13314J7288J48112c1003k04013h4952B307J86862
17453A89169J00760J53338j53855q8482O788K18229A11532b5606A79135o5897
$$ plain form
17531 -90769 -69592 63308 101833 82433 53290 214486 169460 -301315 95257 -206776 167261
17519 -139710 59143 -128152 -182143 307423 512224 -168486 -48902 61336 161781 -127409
17508 262446 -133947 -150078 -126929 43213 282134 279073 104423 162012 145219 -10119 151343
17496 386172 -7727 613026 -40072 92125 -46162 61160 207856 75708 15475 -130497 -104726
17485 -104726 194050 33657 -129111 -85723 -315307 159351 354856 131461 232581 158253
17475 158253 -103612 25270 354094 269230 114041 196307 -307902 106139 -129514 65590
17464 304757 -275272 335700 -44730 213314 230602 378714 -31003 -235016 -84952 2307 189169
17453 189169 289929 443267 289412 200930 207718 425947 111532 -25606 179135 113238
17443A13238J59266A33960L634J86632k6937A06363J09268J50766J85108k22248
17433C29257o1443K8808j31665h326G2745J84284h6200B47117K22514A53888D7903
17421A74479a71892E66638b26150C27450N6663j03970b9408C59702D2974K16684
17411B59658A10167b1038B49451F5853k764J31438G8696K89227g6685C40424F1766
17399B19836h3147E72494D0810A5371M6940K01875E9360c82845B65817G1249j5650
17388E5599K0974k2034f5960B22782K35347A2805J69032a86273G8322l1763Q8154
17377A34713D9273K04549L3307h7457J2704C70023a86027g3597A65319A1874Q7032
17366I8906N6095P6289M0807a4670j14139C92324A69259g7036a1072B03574F3131
$$ plain form
17443 113238 272504 133960 137594 324226 297289 106363 215631 366397 551505 329257
17433 329257 267814 296622 164957 -8326 72745 257029 -86200 247117 469631 153888 47903
17421 174479 -171892 566638 -226150 327450 384113 280143 -29408 359702 42974 259658
17411 259658 110167 -21038 249451 65853 63089 194527 78696 367923 -76685 340424 61766
17399 219836 -83147 572494 40810 15371 62311 264186 59360 -382845 265817 71249 55599
17388 55599 76573 54539 -65960 222782 458129 12805 181837 -186273 78322 46559 134713
17377 134713 49273 253822 287129 -87457 -74753 370023 -186027 -73597 165319 11874 98906
17366 98906 155001 231290 272097 -14670 -128809 392324 169259 -77036 -11072 203574 63131
17354e109B22480J74314a146B81846j18959d518F8661L611K4896J82869b4451
17342B12161j3114M4588J63868H8089J03135a77669C30266r2669l7812J05664
17332C05449o493F9788M2205m0202f584A89162a62561C6825n955J75509b6391
17320D57888H5583Q4338C6992K16911i092B1545L26431h1137b4504C3045A2746
17308a7332C18016F7795B6274P5660M572Q8452M4260k127o6633b617j0577C18753
17295a9148B85984o9307n0294J44653R9589A24852A2920J09946R3982h6557R690
17284g6867L5815B04715J85105r972j51286j13351J59583h8964I6798L50992A71306
17272A44089b8635A17954J89268j32194F7528k1341L11045j41537b0421B435c43629
$$ plain form
17354 -5109 222480 396794 -1146 281846 162887 -4518 68661 72272 97168 280037 -24451
17342 212161 199047 243635 407503 88089 191224 -177669 330266 237597 199785 305449
17332 305449 298956 69788 111993 71791 -6584 189162 -162561 36825 30870 206379 -26391
17320 457888 85583 169921 36992 253903 -9092 21545 347976 -81137 -24504 33045 12746
17308 -17332 318016 67795 26274 101934 106506 194958 239218 237091 170458 -2617 -13194 318753
17295 -19148 285984 216677 166383 311036 410625 124852 12920 122866 216848 -86557 -76867
17284 -76867 -41052 204715 389820 379848 228562 115211 274794 -88964 96798 447790 171306
17272 144089 -28635 117954 307222 175028 67528 46187 357232 215695 -20421 2435 -343629
17260A49850d91G4584A8088P1391J68030K16919o803k05043K40610A3308J87861
17249B01169J28238A50511a0494C58583A35299J92608a60031A62611d735j44524
17239a49259d116n1570D45957j23582e294A4607O9453B5066I547J35789A415L89238
17227C90653j41121a00377r0182B78936a10017A14388M23634A06787i6242H9956
17216D66498A0939L06256a05614E8680J50534L19820a44549A73518n3669K43312
17206C63161N1092b00246A42628K62334k8817A84027k3066M66769C2581K8680
17196F1261P9557L19492a8731C36100D4419J97203Q3699B2296J18216A0639h3738
17184A27047J07411J34671j46565b2439C5668J99285k1682C5238K68976l3165
$$ plain form
17260 149850 -491 74584 18088 89479 257509 474428 467625 262582 503192 13308 201169
17249 201169 329407 150511 -10494 358583 135299 327907 -160031 162611 -4735 -149259
17239 -149259 -4116 -55686 445957 322375 -5294 14607 84060 25066 9547 145336 1415 390653
17227 390653 249532 -100377 -190559 278936 -110017 114388 538022 106787 -96242 89956
17216 466498 10939 317195 -105614 58680 209214 529034 -144549 173518 119849 363161
17206 363161 414253 -200246 142628 404962 376145 184027 160961 627730 32581 61261
17196 61261 140818 460310 -18731 336100 44419 241622 325321 22296 140512 10639 -83738
17184 127047 234458 369129 222564 -22439 35668 234953 213271 35238 304214 271049
17174B71049P4934j65852K20515e1916A63460K36015G9073L91166j30425j57181
17164A82633K31335j76661K46069k26555J1066C191M10063K2845J4488A74153
17153C16612c6499F78541l21519O736A11737M6849b25009B87758J7883d8977D54751
17141F53919B6264g260B20834J4268k0665J07575L77j14228k6485a6791E78542
17129E26288k06281m2942p4145J34002A57686o4466L52121M8161j47628E3603
17118A53694K45540H7840M71413B75668h6921A45759D4105K41277Q6600b8087
17107G12547k48390A57250L37303j08861J05962k15820Q9805A11872L63136q6073
17097C88935L07020A52047R3067m7247o577K96567j17785j11023J21945k9292
$$ plain form
17174 271049 345983 180131 400646 -51916 163460 399475 79073 470239 339814 182633
17164 182633 413968 237307 483376 256821 267887 3191 413254 436099 450587 174153
17153 316612 -36499 678541 357022 363758 111737 158586 -225009 287758 305641 -48977 454751
17141 653919 26264 -7260 220834 235102 214437 322012 322389 208161 181676 -16791 578542
17129 526288 320007 277065 202920 336922 157686 93220 445341 493502 345874 53603
17118 153694 399234 87840 559253 275668 -86921 145759 44105 285382 371982 -28087
17107 712547 464157 157250 494553 385692 491654 275834 365639 111872 475008 388935
17097 388935 695955 152047 245114 197867 191290 487857 370072 259049 380994 351702
17087C51702m9506o2911L35894N6535M4494A3677M70412M9071j90659p9536K21533
17076D84498k16443l8584K10823J59899k98931J32409k3429j47979L06237K7841
17066E96341k36205J81174j85583P2642j57592A5914O85243k43476L34236A32767
17055C80824O9466R5069j97960K72059o3705J1025J28557A62785M16900q7754
17045D91931n9327Q8797A96413L53527L7681B51145L14777L23413C68783J5103
17035C83886J2742l1912L38254j53824K33786C57667J49951J2428P4233O668p5422
17024E25525k29250K65587k33703J33995L23929j90274k73014M6542m654K14477
17014E79160K38379j65314j5596k14259J67605k29036K65942K05769j50174j90784
$$ plain form
17087 351702 302196 239285 575179 631714 676208 13677 484089 533160 342501 262965 484498
17076 484498 268055 229471 440294 600193 301262 433671 410242 262263 568500 596341
17066 596341 360136 541310 355727 428369 270777 15914 701157 457681 791917 132767
17055 380824 450290 545359 347399 619458 555753 566778 695335 162785 579685 491931
17045 491931 432604 521401 196413 549940 587621 251145 565922 889335 368783 383886
17035 383886 396628 364716 702970 549146 782932 357667 507618 520046 594279 600947 525525
17024 525525 296275 561862 328159 462154 786083 595809 322795 369337 364683 579160
17014 579160 817539 652225 636629 422370 589975 360939 626881 832650 682476 491692
17004D91692p9458O6236K55323j55795R8802K64442r8056n6515K35010l66180
16994F55501j16823B67277L75132j53540K01491J9559K542J62044k61176L98086
16984A011415D86186O03626m67249J53045j69656L53889j56484j71752L93818
16975A025423k2810o1965k67675Q0644k1123j91122L07M05842A56110P31481j58433
16964G29158j51256j49425J80843K74122M7212q8444N9499k10264J4672M25841
16954A131958l28527J33051r1973K18453j3291j46237K19120n0775j82799j9010
16944H69970o2636N25814l98863O3545o1630K61921j98376j12416J17331l1123
16934I73537L40399k68947R169J34097O1063l7076k75818M09880j67022R1133
$$ plain form
17004 491692 412234 478470 733793 577998 676800 941242 843186 786671 1021681 655501
16994 655501 538678 267277 642409 488869 690360 709919 712461 874505 613329 1011415
16984 1011415 486186 1089812 622563 775608 605952 959841 803357 631605 1025423
16975 1025423 1002613 940648 672973 753617 732494 541372 541679 947521 156110 887591 729158
16964 729158 577902 428477 609320 883442 930654 842210 901709 691445 706117 1131958
16954 1131958 803431 936482 844509 1062962 1049671 903434 1122554 1071779 888980 869970
16944 869970 807334 1333148 934285 997830 936200 1198121 999745 887329 1004660 973537
16934 973537 1313936 1044989 1054158 1188255 1249318 1212242 936424 1346304 1179282 1270415
16924A270415k478n9163K18592n0374K05336m45894j23256k3020L09837j4294
16914A285701j15922Q3000K14951j97999Q5585L6447R8210r0178l7415o8678K16329
16903A510031K98411J09318m68578L25676p3789k18788K906L39723n11992J13541
16893A426459L77499k92500K76296J00722J44913k16456K53242j96054P595J22959
16883B004675r062j2260o809k38913J94002j90561Q06779m86840J03842l96484
16873A768369L39027J88221j33751j26336K53573M8222N8537j26045k31443J25770
16863B164144L54809j55628N3913K1646K06819J57327l67353P4993N5422K39995
16853B806087P4646J48863j29346j41656k82243J62143M29434k17104M4351J55585
$$ plain form
16924 1270415 1267937 1208774 1427366 1376992 1582328 1136434 1013178 990158 1299995 1285701
16914 1285701 1169779 1252779 1467730 1269731 1355316 1391763 1489973 1399795 1362380 1293702 1510031
16903 1510031 1808442 1917760 1449182 1774858 1701069 1482281 1485187 1824910 1312918 1426459
16893 1426459 1803958 1511458 1787754 1888476 2033389 1816933 2070175 1874121 1881716 2004675
16883 2004675 1995613 1983353 1976544 1737631 1931633 1741072 2547851 2061011 2164853 1768369
16873 1768369 2107396 2295617 2161866 2035530 2289103 2337325 2395862 2269817 2038374 2164144
16863 2164144 2518953 2363325 2417238 2438884 2645703 2803030 2435677 2510670 2566092 2806087
16853 2806087 2880733 3029596 2900250 2758594 2476351 2638494 3067928 2850824 2895175 3050760
16843C050760J92846k06220L35412P4669k052j15817K50417P6526k44495K58358
16833C670404k42333J59775L16066m5958j78746L91699j20284K93334K92859l64980
16823D171836k791L20000Q2513K32985l00177O0653N17992k63868j22409M66728
16813E163462L1442K34051J69123j35394N18806k44839J53561K40470j9229J91176
16803F302629O40499k54213J52196j91708N57526L76224J74869L55995K28014
16794H342031j08107l0666O08353j27314M00684J55175J76942M8581J77122J51000
16784I793801O44785L46631K82687J71789N96362L89490K53032O09897K71089
16775A3359563K40727P11973K33122O27165K99029P46061O79922K77668P58321
$$ plain form
16843 3050760 3243606 3037386 3372798 3447467 3445415 3329598 3580015 3656541 3412046 3670404
16833 3670404 3428071 3587846 3903912 3857954 3679208 4070907 3950623 4243957 4536816 4171836
16823 4171836 4169045 4489045 4571558 4804543 4504366 4565019 5083011 4819143 4696734 5163462
16813 5163462 5194904 5428955 5598078 5462684 5981490 5736651 5890212 6130682 6111453 6302629
16803 6302629 6943128 6688915 6841111 6649403 7206929 7583153 7758022 8114017 8342031
16794 8342031 8233924 8203258 8811611 8684297 9084981 9240156 9417098 9465679 9642801 9793801
16784 9793801 10438586 10785217 11067904 11239693 11836055 12225545 12478577 13088474 13359563
16775 13359563 13600290 14312263 14545385 15172550 15471579 16217640 16897562 17175230 17933551
16766A7933551O62734M45627J018837P88723O64936Q04561P63502J105830J025470
16757B5213771J118491J290379J106123J287257J531180J108736J863299J344652
16749C5863888K199456J453243K111591K087604K616140K494436K719683K552908
16741E4098949K925882L448648L267700L858088L907843M139136M662985M753357
16733H5062588M837770N732355N457397N979866N944442O538478O572371O628441
16725A32753708O383138O493665N519940N786353N278454L636983L581798K425556
16717A71859595J226148Q1690j397619j851465l425420m006955m927598n770001
16709A51788375n719888o615591o590465o604135o515696o754037n987860o547759
$$ plain form
16766 17933551 18596285 19041912 20060749 20849472 21514408 22318969 23082471 24188301 25213771
16757 25213771 26332262 27622641 28728764 30016021 31547201 32655937 34519236 35863888
16749 35863888 38063344 39516587 41628178 43715782 46331922 48826358 51546041 54098949
16741 54098949 57024831 60473479 63741179 67599267 71507110 75646246 80309231 85062588
16733 85062588 89900358 95632713 101090110 107069976 113014418 119552896 126125267 132753708
16725 132753708 139136846 145630511 151150451 156936804 162215258 165852241 169434039 171859595
16717 171859595 173085743 173167433 171769814 169918349 166492929 162485974 157558376 151788375
16709 151788375 146068487 139452896 132862431 126258296 119742600 112988563 107000703 100452944
16701A00452944n245738n482119n806763m539281m415220m512670l743490l974333
16693F2733330l889997k695988l083408l152442k264587k682307k097050k295194
16685D0572357k009378k124274j257887j640666j702744j508899j349757j340683
16677B7638069j217917r43442q05125j379429p77801q44377q38216j040614r59157
16668A8831991k85893q97807m30663j034172k70889r54573k13900j55678m41324
16659A4147092m61266l26633q84604j70729m66729o53235k65505j19077l81215
16650A0418099l09909k47767l03177j99018m09537l11259n9188k13845j25797
16641H238602m25963L881p1556n68027j94148m0258k05334k43320J35546l91179
$$ plain form
16701 100452944 95207206 89725087 83918324 79379043 74963823 70451153 66707663 62733330
16693 62733330 58843333 56147345 53063937 49911495 47646908 44964601 42867551 40572357
16685 40572357 38562979 36438705 35180818 33540152 31837408 30328509 28978752 27638069
16677 27638069 26420152 25476710 24671585 23292156 22514355 21669978 20831762 19791148 18831991
16668 18831991 18546098 17648291 17217628 16183456 15912567 14957994 14744094 14588416 14147092
16659 14147092 13685826 13359193 12474589 12303860 11837131 11183896 10918391 10799314 10418099
16650 10418099 10108190 9860423 9557246 9358228 8948691 8637432 8578244 8364399 8238602
16641 8238602 7812639 7816520 7744964 7176937 6982789 6942531 6737197 6493877 6629423 6238244
16631F238244J47841m53326K60889l13999l10457j4257j13418m0437P0155l13288
16621E157947j68401J5933k38983p5014q4134N720J02717l02487l32609k7518
16611D053171J75232j28407k80709j15246j26724K47484j03709n0110o9688m26365
16601C174929P1078J25509n17377L82054k10938k49845M12093k14954J9370j37243
16591B854676O4994j51975j97315R0597r1175m61070K74202K78606j09787Q9710
16581B641463j93273j79100R0693N0124k55957k04888M57843o2494k77822R0960
16571B157549Q615l67219K00607O6036j81573j837n5824K8935Q6808J4511l16211
16560A640397K11989q8615j40553L55961J28899j24308n90206J87731J66483r7869
$$ plain form
16631 6238244 6386085 5932759 6193648 5879649 5569192 5554935 5441517 5401080 5471235 5157947
16621 5157947 4989546 5005479 4766496 4691482 4607348 4613068 4715785 4413298 4080689 4053171
16611 4053171 4228403 4099996 3819287 3704041 3577317 3824801 3721092 3670982 3601294 3174929
16601 3174929 3246007 3371516 2854139 3236193 3025255 2775410 3187503 2972549 2991919 2854676
16591 2854676 2919670 2767695 2570380 2660977 2569802 2108732 2382934 2661540 2551753 2641463
16581 2641463 2448190 2269090 2359783 2409907 2153950 1949062 2406905 2344411 2066589 2157549
16571 2157549 2166164 1798945 1999552 2065588 1884015 1882178 1826354 1855289 1942097 1956608 1640397
16560 1640397 1852386 1763771 1623218 1979179 2108078 1983770 1393564 1581295 1747778 1649909
16550A649909O2902j47169l0534J52089k01644k44483k26731M30560k12018L55376
16540A588257k03721j59938L288k85265M07731j38404R0943K0174j57030K15306
16530A381341k49471N1231J27645k12256J06245j09372L37780k74595K06387l71715
16520I93220O9644l53666K24591Q8640l5067P5883j38526M57110F59051N26190
16510A185241l13468R4140N0710j2391l40215K6112J12816J43208J8251k52408
16500G11996K28058R2166N3957M4015m02968j05364M57499l56670N00621k95807
16490I27503k03787J54478l45625K01359j31080k3238o5642J32849J52974k21153
16480E78638J98994k86716R2242k30687J49661K14738J26566j66901N722k12629
$$ plain form
16550 1649909 1712811 1565642 1535108 1687197 1485553 1241070 1014339 1444899 1232881 1588257
16540 1588257 1384536 1224598 1227886 942621 1350352 1211948 1302891 1323065 1166035 1381341
16530 1381341 1131870 1183101 1310746 1098490 1204735 1095363 1433143 1158548 1364935 993220
16520 993220 1062864 709198 933789 1022429 987362 1063245 924719 1381829 659051 1185241
16510 1185241 871773 965913 1016623 1004232 664017 690129 802945 946153 964404 711996
16500 711996 940054 1032220 1086177 1130192 727224 621860 1079359 722689 1223310 927503
16490 927503 723716 878194 532569 733928 602848 579610 513968 646817 799791 578638
16480 578638 777632 490916 583158 352471 502132 716870 843436 676535 682257 469628
16470D69628M97895C45923L65004J56819j22810k49161L9046L9503k9737m407
16460E40180q6817K46554K71191m38428n2158K83515J1505l33275J56457r9140
16450D99584M63509C09826N53430l37028r4356L06614l12598p2848K12257m2190
16440E23107B08914L54657q0336L7874p395q6865p8672J42911m2925J74232k33214
16429C89181O2014r6470P6976M8950J25788j20243A65219J65058o3762N8803O6786
16418C92104r4325J55311j67966J38962A92486L5447J11596M10366k64119j56524
16408C29252L97409C44444J30708B10380j04874J40718J26330j04484K13438k22955
16398B58553o7827L29502K5053q1026A99288J86250F9279N92361j60779B13585
$$ plain form
16470 469628 967523 345923 710927 867746 744936 495775 534821 574324 544587 540180
16460 540180 453363 699917 971108 532680 480522 764037 775542 442267 598724 499584
16450 499584 963093 309826 863256 526228 431872 738486 425888 353040 565297 523107
16440 523107 208914 563571 483235 521109 513714 426849 348177 491088 448163 622395 389181
16429 389181 451195 354725 431701 480651 606439 486196 165219 330277 266515 325318 392104
16418 392104 297779 453090 285124 424086 192486 227933 339529 749895 485776 329252
16408 329252 726661 344444 475152 210380 105506 246224 372554 268070 481508 258553
16398 258553 190726 520228 545281 464255 199288 385538 69279 661640 500861 213585
16387E69771k12843I8993K14617j07462J22545P4165A46549R2312j18299J93820
16377C14382J2182L6001p1161j2909D2376N13733j02311O7735B00663J7586G8840
16365E03063B48323E14M07624A90687K96577o4000j81130m1387J33291j32604
16355B01434n7293M5667J25315J3341F5123K20572j486n6363Q0801j06943K55075
16344D56779a26091C77201P6396j54849m6373j12169e1880D33051r130j99120
16334B24801B5638M3935J45324l4171E8744k4306L7149K87220A16238j1127J20560
16323B25671a38299C97376j35795l0146R6397j57084g7751E46452k26314j9922
16313C00216G2310K02544L2905j27712c45230B32078K11868I35R9594J18861E2452
$$ plain form
16387 569771 356928 98993 313610 206148 328693 402858 146549 238861 120562 314382
16377 314382 326564 362565 291404 278495 42376 556109 453798 521533 200663 218249 78840
16365 503063 248323 514 408138 190687 487264 423264 242134 200747 334038 201434
16355 201434 144141 189808 315123 328464 65123 285695 284209 227846 308647 201704 456779
16344 456779 -126091 377201 453597 298748 252375 140206 -51880 433051 423921 224801
16334 224801 25638 69573 214897 180726 58744 34438 71587 358807 116238 105111 225671
16323 225671 -138299 397376 261581 231435 327832 170748 -77751 546452 320138 300216
16313 300216 72310 274854 307759 180047 -345230 232078 443946 935 100529 219390 52452
16301A00813J94248K09558B5486a82878B26105G3987h2211B55078n9955o2714
16291A32409L6101Q7584q435j2392O8880b48072B46869f7404A79798E0014K26355
16280B76369h8685C7333h3785C10733I4203K46789j33078c5707B50968C8072J03338
16269A41410k2580a59830C21852I1520K58665j22219e7267A70486K5050p1293
16259A24243O7012n3581a98546B28407J12224A37133J44279D7804i6223A61310
16248D222f5633I9197Q7424o5333l536d9029B5285L280J49894a01255C19105r6602
16236B22503I2580a41392H6895d49328J74101B81231A33613J87791A25483a21002
16225A16775J84519c97247A5931a72178h2733q4201A19182b48282a16139m0122
$$ plain form
16301 100813 295061 504619 25486 -182878 226105 73987 -82211 255078 195123 132409
16291 132409 168510 256094 247659 235267 304147 -248072 246869 -67404 179798 50014 276369
16280 276369 -88685 37333 -83785 310733 94203 340992 207914 -35707 250968 38072 141410
16269 141410 118830 -159830 321852 91520 350185 227966 -57267 170486 195536 124243
16259 124243 191255 137674 -198546 228407 340631 137133 281412 47804 -96223 161310
16248 4222 -65633 99197 186621 121288 117752 -49029 25285 28565 178459 -101255 319105 222503
16236 222503 92580 -141392 86895 -449328 -275227 281231 133613 321404 125483 -121002
16225 116775 301294 -397247 15931 -172178 -82733 -166934 119182 -248282 -116139 -156261
16215a56261A22123g8382B87672q8886b47120e4005j26691B01144b29847A39646
16204A59178o4955A5086J95555n5871b61822B18321B2562e961B59017H2392h2889
16192a7979A05255a15268B74495G2345K0535a64936p1426A52637D3246J19070
16182A62316J27835J66831r3032a45347L644B16990h1196A60047F5545c5335C19373
16170a67612l4257A81846p6546R0544b6511F5681J21970M2470J12137A4451N952
16159B0403J27465B4590c21092D7094I85K41496H4338b73926D65758j94506j05798
16148A65454a58128d9552A96671e6753A13779m8648d57796a15182j59289d2419
16137a09987j26414R3486H8544b12670A29471B6088a35105a7414m7600C9256R3377
$$ plain form
16215 -156261 122123 -78382 287672 198786 -247120 -54005 -180696 201144 -229847 139646
16204 159178 94223 15086 210641 154770 -261822 218321 22562 -5961 259017 82392 -82889
16192 -17979 105255 -115268 274495 72345 92880 -164936 -236362 152637 43246 162316
16182 162316 290151 456982 363950 -145347 -141703 216990 -81196 160047 65545 -35335 319373
16170 -167612 -201869 181846 105300 195844 -26511 65681 187651 230121 342258 14451 20403
16159 20403 147868 24590 -321092 47094 985 242481 84338 -273926 465758 271252 165454
16148 165454 -158128 -49552 196671 -56753 113779 65131 -457796 -115182 -274471 -42419
16137 -109987 -236401 -142915 88544 -212670 129471 26088 -135105 -17414 -65014 39256 132633
16126A32633C7257J40408d5463A40191b13725g9751A54893Q5290h7642A9811K4476
16115D4287a88835b4038I2994J60995J58486c1194D6010a72751d1905A60221c1077
16103B12842o493J9947L680b17243Q3905G9502B3451N4429b25482B17635c88379
16091b67755A48968a68805B686J27996c1701J2189k91629a5021j19136B08063
16080A99359h7594J9065b7884j93796A19575b6904B64411M0910j36961a11405
16069b2057A99153b94309J34724b9064j83227F3412k3142a57443p9180d8330A00614
16057A46498E0897b16216B33741f6091q1375B09003b23786D3035a12928m2907
16047a55835g4985A36763B2863K14308h3778J4792a0713k0441A33092K08371a6881
$$ plain form
16126 132633 37257 177665 -45463 140191 -213725 -79751 154893 240183 -87642 19811 44287
16115 44287 -188835 -24038 92994 253989 412475 -31194 46010 -172751 -41905 160221 -31077
16103 212842 206349 226296 229976 -217243 -133338 79502 23451 77880 -225482 217635 -388379
16091 -267755 148968 -168805 2686 130682 -31701 -19512 -311141 -15021 -134157 208063
16080 199359 -87594 -68529 -27884 -221680 119575 -26904 264411 305321 168360 -111405
16069 -22057 199153 -294309 -159585 -29064 -212291 63412 40270 -157443 -236623 -48330 100614
16057 146498 50897 -216216 233741 -66091 -147466 209003 -223786 43035 -112928 -155835
16047 -155835 -74985 136763 22863 237171 -83778 -68986 -10713 -31154 133092 341463 -16881
16035b35878A75901B7181n57R6473g8707A79520h8726B20180J09084a58548A73594
16023F1680R8989G1617a30014b9201k5150j7684A2110b80905g7492l9296B55644
16011D05849b03597b1928G5092A919J5646K67942j13221k0335b53120e4632i687
15999a32835J2935b6154C8946b07015a1763j69177E928d3923B75911L4229c3753
15987A45483j182g0662j07287A26894C8965J7935M39078q1107O1464a5554p0362
15976h5916E5276l843g2862C82696q9216a82133l3729l7871h823A44150m5864
15965I8286a83462j22650d4482d700k40360m1660B01331a90416A5147L8843a14052
15953a7404l13966O2459Q1604J2709D30144a39932o2648C16811d5200E8530N4291
$$ plain form
16035 -235878 175901 27181 26624 123097 -78707 179520 -88726 220180 329264 -158548 173594
16023 61680 160669 71617 -130014 -29201 -54351 -72035 12110 -280905 -77492 -116788 255644
16011 405849 -203597 -21928 75092 1919 17565 285507 172286 151951 -253120 -54632 -9687
15999 -132835 -119900 -26154 38946 -207015 -11763 -180940 5928 -43923 275911 310140 -33753
15987 145483 144301 -70662 -177949 126894 38965 56900 495978 414871 476335 -15554 -85916
15976 -85916 55276 51433 -72862 382696 293480 -182133 -215862 -253733 -8823 144150 98286
15965 98286 -183462 -306112 -44482 -4700 -245060 -286720 201331 -190416 15147 53990 -114052
15953 -17404 -331370 -268911 -187307 -174598 430144 -139932 -202580 316811 -45200 58530 112821
15942A12821J5393D9259g2730o4919b2026F1196L968K8840c83019C63842g7891
15930b31507j95454a26655B03315q2797a20891d0473A04228b24472H0960n352
15920G5608a6148I1118b13999e8852n4936j82541A37392A7716J90997J4850C501
15908B11654J06179a65244C23329a82618a1389A25728b8617A30040h1139o6379
15898a47518e2680I9766c94569A3631J19866O9471c06953A72774g6422A99850
15887A72440c230l45123J4305C92751f9229m0065D303N3108a24683j64339O274
15876b82748r0022A79593c54835J72721q2877A29050C7933e9573A6308d10502
15865b8222A80808a75924A60833p6842J3314i7941d4801k05688A36534j8954b65651
$$ plain form
15942 112821 128214 49259 -72730 -137649 -22026 61196 65164 94004 -383019 363842 -77891
15930 -231507 -426961 -126655 203315 120518 -120891 -40473 104228 -224472 80960 75608
15920 75608 -16148 91118 -213999 -58852 -113788 -296329 137392 17716 208713 223563 3501
15908 211654 317833 -165244 323329 -182618 -11389 125728 -28617 130040 -81139 -147518
15898 -147518 -52680 99766 -394569 13631 133497 202968 -306953 172774 -76422 199850
15887 172440 -3230 -348353 -334048 392751 -69229 -109294 4303 57411 -124683 -289022 -282748
15876 -282748 -372770 179593 -354835 -182114 -264991 129050 37933 -59573 16308 -410502
15865 -28222 180808 -175924 160833 83991 97305 -97941 -44801 -250489 136534 117580 -265651
15853d46618D9384M7619h6688K4951l9206n1552k7654A46866a89798F1071K02843
15842B63914j8703c08361a24517A71134b2921k7634j35281C2464a02173D1057
15831A55243c54050E6316K7506a32855k71165a79896A16704j9515a2198A42181
15820d9287K0780A39618a22385j09835I6765f7319k43414A1743b55680B72345
15809A27644b0764Q084A28204b41623g5260A85494H7803J17109b8237A08771j0730
15798I8041d9429k4103A1211D966N370a05288f170C16696a18020D15029A35448
15786b49392f9655L041C81522a28321j773O2234j17135f0960C2682J935f1768
15774C9398c4609q2421A34938a08567C06529B9339a54561D6426O1679N2704a61902
$$ plain form
15853 -446618 49384 97003 -86688 -61737 -100943 -152495 -180149 146866 -189798 61071 263914
15842 263914 245211 -308361 -124517 171134 -22921 -50555 -185836 32464 -102173 41057
15831 155243 -354050 56316 83822 -132855 -404020 -179896 116704 97189 -12198 142181
15820 -49287 -28507 139618 -122385 -232220 96765 -67319 -310733 11743 -255680 272345
15809 127644 -20764 -12680 128204 -241623 -75260 185494 87803 204912 -28237 108771 98041
15798 98041 -49429 -73532 11211 4966 10336 -105288 -6170 316696 -118020 415029 135448
15786 -249392 -69655 -66614 381522 -128321 -130094 -67860 -184995 -60960 32682 34617 -61768
15774 39398 -34609 -117030 134938 -108567 306529 29339 -154561 46426 108105 160809 -161902
15762b67013E8621K02483a09022B08582c5327A81077q064g9473a2855C85774c55644
15750B32291o9726M18390F5512B0940b07320A12902P0502b63941A08334O3037
15740A71371D2231a81064M8692k27871C2013b1284A10615b10543B35930c11976
15729g0188A02491C8325b52268A74422p1780l5492J2221b05287i3259k22532A31550
15717G9895a69725e0376I9858k8495b31158P5622d7551B16469e773j41649A26570
15705h2886B98027a68186M4958K5688k3147p2772H8194k6760K23484b4632A00138
15693D1168d8229G1970M7880c3346j49801M6897B0643K16068C4541J81922d49657
15681A91327b45002A88837a6764k71005E4366b24439b0915j02533b9031E2662
$$ plain form
15762 -267013 58621 261104 -109022 208582 -35327 181077 173013 -79473 -12855 385774 -355644
15750 232291 162565 580955 65512 20940 -207320 112902 183404 -263941 108334 171371
15740 171371 42231 -181064 -132372 -360243 32013 -21284 110615 -210543 235930 -311976
15729 -70188 102491 38325 -252268 174422 102642 67150 79371 -205287 -93259 -315791 131550
15717 79895 -169725 -50376 99858 71363 -231158 -155536 -47551 216469 -5773 -147422 126570
15705 -82886 298027 -168186 -123228 -97540 -120687 -193459 88194 61434 284918 -24632 100138
15693 41168 -48229 71970 119850 -33346 -183147 -136250 20643 236711 34541 216463 -449657
15681 191327 -245002 188837 -16764 -287769 54366 -224439 -20915 -123448 -29031 52662
15670g32k65104h3019B22823r1040o5704J80955a35575j98553L5869e0450A7148
15658B01382b65987A64901a20200H6211a05702p18l01234d4112A43482o9762J49988
15647B23708j02890b1811r8653H6417R2248p1098d30919c3919a2759k25544D5002
15635A29499c43495B1022d5206B37704I698J66692a94068e6185b2591l87243C982
15623a52930j65941D5353J71260A2391L56726o9359a28119K838o7975A21350K22995
15612C44345a85686D5770b01798g8189A38916M0847a37785q3408e2475r790G8632
15600a51029A6729i2235n4223m2707M0326f8143I8252c33533f7513j67123A78580
15588A03818b3493a0574A7370K00811n4538a09761A46847b51719K348A64096L98143
$$ plain form
15670 -732 -265836 -83019 222823 131783 66079 247034 -135575 -334128 -298259 -50450 17148
15658 201382 -265987 164901 -120200 86211 -105702 -106420 -407654 -44112 143482 73720 223708
15647 223708 120818 -21811 -120464 86417 178665 107567 -430919 -33919 -12759 -238303 45002
15635 129499 -343495 21022 -45206 237704 9698 176390 -194068 -56185 -22591 -409834 3982
15623 -152930 -318871 45353 216613 12391 369117 299758 -128119 -125281 -193256 121350 344345
15612 344345 -185686 45770 -201798 -78189 138916 179763 -137785 -221193 -52475 -62265 78632
15600 -151029 16729 -92235 -146458 -189165 -148839 -68143 98252 -333533 -67513 -234636 178580
15588 103818 -23493 -10574 17370 218181 163643 -109761 146847 -251719 -249371 164096 562239
15577E62239B40616h0055A78429b18322B64255A2366a35515A28388b2651j55285
15567a77936k4108b9431j01276g372A79150b33197R3924A29623a9486f455m8088
15556e4543k71321B82840b73217j02090g0581p5797E1800a6940o8871C54570b62546
15544i8239R444k21439L4517J28433M1555G4941h7086L4465A76858o3369m9424
15533F4065a66580M2732A06653L38204a27778A95790b06857G7281a98658h9999
15522A96947F1361J11693p4058f042A17999a15833k13777a19336A93063c11509
15511A41723o1940J65288e0847C6393Q8335L3254o6773J5493D1610K7259j7817
15500E1052a04081d6294k63266A93112I4851e6806m26363C0645b13417A31976
$$ plain form
15577 562239 240616 -80055 178429 -218322 264255 12366 -135515 128388 -22651 -177936
15567 -177936 -202044 -29431 -130707 -7372 179150 -233197 -139273 129623 -19486 -6455 -54543
15556 -54543 -325864 282840 -273217 -375307 -70581 -146378 51800 -16940 -85811 354570 -262546
15544 -98239 -88795 -310234 -275717 -147284 -105729 74941 -87086 -52621 176858 113489 64065
15533 64065 -166580 -123848 106653 444857 -127778 195790 -206857 77281 -198658 -89999
15522 196947 61361 173054 98996 -6042 117999 -115833 -329610 -119336 193063 -311509
15511 141723 79783 245071 -50847 36393 124728 157982 91209 106702 41610 68869 51052
15500 51052 -104081 -46294 -309560 193112 94851 -56806 -483169 30645 -213417 131976
15489i0921C5897e3979E41138B0042L0987M0946K096b34506j1690D2703a14268
15477f4319p3579F1774a35655D1150d7643C4381J8613b71558A40762e9690I1433
15465c194A41815P0752D9392a52035D2860b18271D6366K3681K6191A9257L43509
15454C62766C6837a49370A31554m2882J3650A5011J4340J27210a09270k11469
15444c20739a10740j09569A64550c06446B4197a06255A20418a11066C31122f8981
15433b17607B46671e1450A18195d05961A59874O8178a20768A32202m9569b33860
15422a99933L6272A33232h0958K3462B05158K50453h2321A78591b32768q7230
15412c19998I7508m583a1418k98056d7770E2095R3081E1748L107d1211N497g631
$$ plain form
15489 -90921 35897 -53979 541138 20042 51029 91975 94071 -234506 -246196 42703 -114268
15477 -64319 -137898 61774 -135655 41150 -47643 34381 52994 -271558 140762 -59690 91433
15465 -3194 141815 212567 49392 -152035 42860 -218271 46366 70047 96238 19257 362766
15454 362766 36837 -149370 131554 88672 102322 15011 29351 156561 -109270 -320739
15444 -320739 -110740 -220309 164550 -306446 24197 -106255 120418 -111066 331122 -68981
15433 -217607 246671 -51450 118195 -405961 159874 228052 -120768 132202 82633 -233860
15422 -199933 -163661 133232 -80958 -57496 205158 455611 -82321 178591 -232768 -319998
15412 -319998 97508 92925 -11418 -309474 -47770 52095 145176 51748 54855 -41211 -35714 -7631
15399b64743A79797P7365n8123l6918a91446p2440B31711H6767a16676G9328Q3110
15388A62438m2874b86515A84178O580a80213M7511B09643N9074A22552a77110
15377F3021c2649f394j56547m5777E8738a8177j19702n3160j72998F2164a84183
15365b1227A43294K03417A14308a26320A18882C1195M63412D6402J4919B9764
15354F5692j3679J11357E8454k948B6163J62863a9052k21774A69049e5303K7407
15343b7896A10617f6725A10612J01411a93002d3151A71816b29879C09317A1472
15332I5177D903i4949C64747A19832l1260c23109f8371F3226e6159l5004J7118
15321g4045D25321c15225i5355A2820a37357m386a1711B99513j0536D6849B1295
$$ plain form
15399 -264743 179797 257162 199039 162121 -191446 -263886 231711 86767 -116676 79328 162438
15388 162438 119564 -286515 184178 190758 -180213 -132702 209643 268717 122552 -177110
15377 63021 -32649 -6394 -162941 -208718 58738 -18177 -137879 -191039 -364037 62164 -184183
15365 -21227 143294 346711 114308 -126320 118882 31195 494607 46402 61321 29764
15354 65692 52013 163370 58454 55506 26163 189026 -19052 -240826 169049 -55303 -27896
15343 -27896 110617 -66725 110612 212023 -193002 -43151 171816 -229879 309317 11472
15332 95177 4903 -94949 364747 119832 88572 -323109 -68371 63226 -56159 -91163 -74045
15321 -74045 425321 -315225 -95355 12820 -137357 -141743 -11711 299513 288977 46849 21295
15309I624c0607C2784A2528a41182I2559L2533B1151O451a70153A60835h2401
15297C23398j02667b25040c87m2606J4622q2469A47623c3299C5573d6212A5673
15285B72903A15349m1946g6973I2243J15012C8874J92091C9325b23185C352K01367
15274B04719a09151a074k2727D87225f8547A43611o6932m303K62287C9070g900
15262i5223A26021k9848g9961j42294F995K56229J21440a93132A70756b93007
15251i8479A25295J53326N36595N61718j54996Q8154m99195l42112A61013o922
15241A54091B2402b47716A9528J55602a34728B4982K68095A15771J04184F9080
15230C34665f4812D7156L16721a8766C37975f5691A54597n1645M38783i292k25554
$$ plain form
15309 9624 -30607 32784 12528 -141182 92559 125092 21151 27602 -170153 160835 -82401
15297 323398 220731 -225040 -387 -42993 -28371 -110840 147623 -33299 35573 -46212 15673
15285 272903 115349 73403 -76973 92243 207255 38874 230965 39325 -223185 3352 204719
15274 204719 -109151 -1074 -23801 487225 -68547 143611 76679 72376 334663 39070 -7900
15262 -95223 126021 96173 -79961 -222255 6995 263224 384664 -193132 170756 -293007
15251 -98479 125295 278621 815216 1376934 1221938 1310092 810897 468785 161013 154091
15241 154091 22402 -247716 19528 175130 -134728 24982 293077 115771 219955 69080
15230 334665 -64812 47156 363877 -18766 337975 -65691 154597 102952 541735 -9292 -234846
15219b34846A54742h9620j17912E0403b97787a8935n5652m4937G826b3363k39779
15208b63142A92166c8680G6526A0662c902p7185o7951D1758J4501N8159k9566
15197H4852C8712b06997H8003j9703g4147H8514a91608G1499j6819J65299l1312
15186A88667J12212d2882J0698B55112k1169B2433a15194F5950f6189j95349a8738
15174D2306J17859G7494b15766F6728b35764D05349a27514a9427A4636b89385
15163D6962L94161B6061c5079B79869g251A27129a90199A96058J68198a115E5582
15151c04851A61055J41832I9385P5172a1058M543j36037c3773A43260R9549q3836
15140A58973J46162A03161J30240L9117j32484h2194k51699A89035J3626J7803
$$ plain form
15219 -234846 154742 -89620 -207532 50403 -297787 -18935 -74587 -119524 7826 -23363 -263142
15208 -263142 192166 -38680 76526 10662 -3902 -81087 -149038 41758 56259 114418 84852
15197 84852 38712 -206997 88003 68300 -74147 88514 -191608 71499 54680 219979 188667
15186 188667 300879 -42882 -32184 255112 233943 22433 -115194 65950 -66189 -261538 -18738
15174 42306 160165 77494 -215766 66728 -235764 405349 -127514 -19427 14636 -289385
15163 46962 441123 26061 -35079 279869 -7251 127129 -190199 196058 364256 -1115 55582
15151 -304851 161055 302887 99385 174557 -11058 -6515 -142552 -33773 143260 242809 158973
15140 158973 305135 103161 233401 272518 140034 -82194 -333893 189035 202661 220464
15130B20464Q6676A36219m6676h1444A82351H782J16801J19093L595p9904m5532
15119A22835B149b2745B23849B9031c84990J24636A93954a05270B13094B5671
15108a52237e8534j41091A353K92432H7463b8218j19793D21404a0503B53943p9693
15097A74250M9163c1606C15452A3910b2639q1221M7738a1898j0410k00379C24812
15085A13390K20508m9644A18403j5665e0292E8149b68988I1629c8858B38986m0377
15074A98609C075O4993P2446i5058K8554A13343l1072J23588K97694j18774A11932
15062D09819e0081J9202k45567A03352J50762p6409G2682N4176i9519D88261k09880
15051B78381a25281D43240A83342P6252h1884B20932J3746Q2674n3164G7226c2131
$$ plain form
15130 220464 307140 136219 89543 -81444 182351 8782 125583 244676 248271 168367 122835
15119 122835 2149 -22745 223849 29031 -384990 -260354 193954 -105270 213094 25671
15108 -152237 -58534 -199625 1353 293785 87463 -28218 -148011 421404 -10503 253943 174250
15097 174250 223413 -31606 315452 13910 -22639 -103860 -56122 -11898 -22308 -222687 324812
15085 113390 333898 284254 118403 102738 -50292 58149 -268988 91629 -38858 238986 198609
15074 198609 3075 68068 140514 -95058 -66504 113343 82271 205859 503553 384779 111932
15062 409819 -50081 -30879 -276446 103352 254114 177705 72682 126858 -99519 488261 278381
15051 278381 -125281 443240 183342 259594 -81884 220932 234678 317352 264188 77226 -32131
15039a38631I9035J54122J39530a01B44069b52679B6951A3323K43202O4766j54889
15028A66402p2134C1547J03075b97128B64721D1895a1036C33002A53791e5746
15017B90469o9010G4634L8429R6782M2598K8546G1954H116K34790a33497B13440
15005b8801A90027d5905C50669A74019K60015G7400J81461m430p4208M2128d2394
14993B20648J68206a48126A59600o4725J13108I3491O85276G455a7184E91574
14982d9593J0899P556A87902N7785R1349A48938n7483J82839b26927C40618o4293
14971B76325j01919o9775a21701B90201L4185C3248a16915A08228J43261l1731
14961B19758P0178A29254K05375c5264A59652j1264L30515j49497j31063m2443
$$ plain form
15039 -138631 99035 253157 392687 -101 244069 -252679 26951 13323 256525 321291 166402
15028 166402 94268 31547 134622 -297128 264721 41895 -11036 333002 153791 -55746
15017 290469 221459 74634 113063 209845 252443 280989 71954 8116 242906 -133497 213440
15005 -28801 190027 -45905 350669 174019 434034 77400 258861 254431 180223 222351 -42394
14993 220648 388854 -148126 159600 94875 207983 93491 778767 7455 -17184 591574
14982 -49593 -38694 -31138 187902 245687 337036 148938 91455 274294 -226927 340618 276325
14971 276325 174406 104631 -121701 290201 324386 33248 -116915 108228 251489 219758
14961 219758 289936 129254 334629 -35264 159652 148388 478903 329406 198343 155900
14951A55900Q8788e0387D62005j39140A29549a5478F88484l12273O4870j68429
14941B72652K75103A56184b2131A90608R1351J74145B04281K8773O5763l0345
14931B68472n0102K11240A25967J71253D0828O8662b3323C64483K21546k42554
14921C43475o5890M8753A04603K02633b3268C29686A25080J52575E9537a18234
14910D34963A89300R8373A33804I435K94832j10046g4464D48268j03113o1274
14900B83881j11402L77060B32629J49946A3847J81051J91840q8141N8198o2144
14890B94651k9355K36444A36857J83775n4276M02533c5740D50375K57781l28665
14880C79491n1377K0110N9686Q4883n6723A62646K14190K20721k32909Q5105A62554
$$ plain form
14951 155900 244688 -50387 462005 322865 129549 -15478 688484 376211 441081 272652
14941 272652 547755 156184 -22131 190608 281959 456104 204281 233054 298817 268472
14931 268472 218370 429610 125967 297220 40828 109490 -23323 364483 586029 343475
14921 343475 277585 326338 104603 307236 -23268 329686 125080 277655 59537 -118234
14910 434963 189300 287673 133804 9435 304267 194221 -74464 448268 345155 283881
14900 283881 172479 549539 232629 382575 13847 194898 386738 298597 356795 294651
14890 294651 265296 501740 136857 320632 266356 668889 -35740 450375 708156 379491
14880 379491 328114 348224 407910 492793 436070 162646 376836 597557 364648 449753 162554
14868A02012N7697Q3977J17381A52913M46358B88223j1973N5071J04643K35537
14858F71501l24932J04245K392A89069K70991L42490l31814A21204J20586R2110
14848C33900L2563K58512k2740k20034n7087A42488K73297A34607Q4319J22483
14838C41409q1477L11036k78722D110M89052m4580a04692B84423K65964j77985
14828C72402m6904o345k8789r4375L07613n4279j1202j71332K69625j49049L1616
14817D18981k04893J60730Q8356q0631K59983r1144k05126j57286L2657J90598
14807D12225q3831J22378k9657N140O4939j00891j10334J75811j03745K85631
14797F37666k95214q0212M43223C35090J87364L9282J5012o3535p1418m0504o0536
$$ plain form
14868 102012 159709 243686 361067 152913 599271 288223 276250 331321 435964 671501
14858 671501 346569 450814 453206 189069 460060 802550 470736 121204 241790 333900
14848 333900 366463 624975 602235 382201 325114 142488 415785 134607 218926 341409
14838 341409 259932 570968 292246 4110 493162 448582 -104692 284423 550387 372402
14828 372402 325498 319153 290364 195989 503602 449323 438121 266789 536414 387365 418981
14817 418981 214088 374818 463174 382543 642526 551382 346256 188970 221627 412225
14807 412225 328394 450772 421115 426255 491194 390303 279969 455780 352035 637666
14797 637666 342452 262240 705463 335090 522454 561736 576748 513213 441795 401291 340755
14786C40755J52624j36823L35253B95527N31360j81874k03967o2891L78226k79234
14776D77147K00945j00668j41625B10276K61601L09024k48239j0726J51439l30755
14766C42620M52957j26873k39370M12081j74483P8213k49440J96874j70282r7559
14756D24738m5547J23416K3039J71185o7498l4902B63276K83322j702N307r4193
14745D56010L51210j78260n8004j65852K94682k84073L05567j42952O5322p3497
14735E70153J35259p1285k44511q5043K94489J9881j2274L9813O5843j56249r977
14724E46099J8911P7018P4409Q8317j72274J73073k26507j61074J29529L1306
14714E78807K78654j49362j90241K99116l20577J23894k09580L06835k9964J3593
$$ plain form
14786 340755 493379 356556 691809 295527 826887 645013 441046 378155 756381 477147
14776 477147 678092 577424 435799 210276 471877 780901 532662 521936 673375 342620
14766 342620 795577 668704 429334 841415 666932 745145 495705 692579 522297 424738
14756 424738 379191 502607 525646 696831 629333 594431 263276 546598 544896 550203 456010
14745 456010 807220 628960 570956 405104 699786 415713 721280 578328 643650 570153
14735 570153 705412 634127 389616 304573 599062 618943 606669 646482 712325 556076 546099
14724 546099 565010 642028 716437 804754 632480 805553 579046 417972 547501 578807
14714 578807 857461 708099 517858 816974 496397 620291 410711 717546 687582 701175
14704G01175k44611K85896O5102l46032K5969N84661l17522K45732j01220p5004
14694H24146o4676k40736K08598j0398K48769J7575p8619m05782L98250m18959
14684D78168K21700L91511m37221J38046Q9700r7252j83833K01598l45057N15688
14674I73048j57186N7378l14509M65493J76469l56119Q8703n6366L05145l84128
14664G97928J59702m01098K93944K23306L4366D96780L36344K77619j95118K45890
14654A161515k84871m773K6627j22231J5468p7611K48887L39116k69680r2841
14644I39606J65252q3179M24367p19283M03523j42315J25489k32165L27745j38179
14634A070861q6405N19675j17332n17869P4328M89748o40638J49422J41650J0567
$$ plain form
14704 701175 456564 742460 807562 461530 487499 1072160 754638 1000370 899150 824146
14694 824146 759470 518734 727332 716934 965703 983278 904659 498877 897127 478168
14684 478168 699868 1091379 654158 792204 881904 784652 600819 802417 457360 973048
14674 973048 815862 873240 558731 1024224 1200693 844574 933277 876911 1182056 797928
14664 797928 957630 556532 850476 1073782 1108148 496780 833124 1110743 915625 1161515
14654 1161515 876644 871871 898498 776267 791735 714124 963011 1302127 1032447 939606
14644 939606 1104858 1021679 1446046 726763 1130286 987971 1113460 881295 1209040 1070861
14634 1070861 984456 1504131 1386799 868930 943258 1433006 792368 941790 1083440 1094007
14624A094007j86070J60444l34132O94410l01469k80213M47897j14409J6383L47266
14614A544114k41499j56825N44444k57324k06259J41932J4825k50671L05407o3956
14604A374188l6058j02254N3271J99428j34675J21971J42943J45392l86117j04184
14594A273905O07082o55253M9215J72924J6859k99761M43263k42583L92958k29606
14584A529003J4151k88678L65339P0965j4181J66029k17172l1962m2540K76881
14574A827835L4872m62409N20616J04773l21075J01336J41779K8521J74132m45297
14564A705083N61712K1151J40644l50185k36143N34838K56671k52165L192K42927
14554B627725K75019L29512K51682Q67504Q32803J867241L161702Q728249K0438542
$$ plain form
14624 1094007 907937 1068381 734249 1428659 1127190 846977 1294874 1180465 1196848 1544114
14614 1544114 1302615 1145790 1690234 1432910 1226651 1368583 1383408 1132737 1438144 1374188
14604 1374188 1338130 1235876 1289147 1488575 1353900 1475871 1618814 1764206 1378089 1273905
14594 1273905 1880987 1225734 1274949 1447873 1464732 1164971 1608234 1365651 1758609 1529003
14584 1529003 1543154 1254476 1619815 1690780 1676599 1842628 1625456 1593494 1550954 1827835
14574 1827835 1862707 1400298 1920914 2025687 1704612 1805948 1947727 1976248 2150380 1705083
14564 1705083 2266795 2287946 2428590 2078405 1842262 2377100 2633771 2381606 2384798 2627725
14554 2627725 2902744 3232256 3483938 4351442 5184245 7051486 10213188 18941437 39379979
14545C9379979M569031A7616220F021887B697195n28253j38405j5598n58339K74314
14536A730914j02711L69102j7537k95276J85607k36381O5932J1556J96875k6569
14526A881512N8973m5317j42794L87660n45323N08545J59286K66616n07208r4325
14516A927625L26537N62131m56295j45271J72183M9912k35989K29254K14656o4600
14506B580143J30191p7175L12711k23163O877j65937J84008j68035L73815k93772
14496B659663J77632l2654m101j8927O6628L83057l02339J24003k50883L66149
14486C168228N2316n7688j10457j52167j484L20340N7111j87258J69376J96244
14476C454561k56288N1745M11245R1506o03013L86386J38144L67776l27823J76109
$$ plain form
14545 39379979 43949010 17616220 6021887 2697195 2168942 2030537 2014939 1456600 1730914
14536 1730914 1628203 1997305 1979768 1684492 1870099 1633718 1699650 1711206 1908081 1881512
14526 1881512 1940485 1895168 1752374 2140034 1594711 2103256 2262542 2529158 2021950 1927625
14516 1927625 2254162 2816293 2359998 2214727 2386910 2436822 2200833 2430087 2644743 2580143
14506 2580143 2710334 2633159 2945870 2722707 2729584 2563647 2747655 2579620 2953435 2659663
14496 2659663 2837295 2804641 2800540 2781613 2848241 3231298 2928959 3052962 2802079 3168228
14486 3168228 3220544 3162856 3052399 2900232 2898748 3219088 3276199 3088941 3258317 3454561
14476 3454561 3198273 3250018 3661263 3752769 3149756 3536142 3674286 4042062 3714239 3890348
14466C890348k00394J48197K1941O0953K1858K3596P4150J10113M36216j91480
14456D395498M5723q28j28051j08069K90085j69274L68409o131J50059j07109
14446D730312O2618J83990K38573k6115l28470K34854J37573K59032j46665j25478
14436E220224L9603K75293n7663J84531n327M03159l00481M46187k50922p9317
14426E875287L40493k5886J50499K18028L2197k0987M22770q3693R082J06986
14416G024776L3320J67897O6364Q5818L24277n6622K91862j237j08756M63368
14406H291067j35848K89362k18934O05533m63384K22085L40187J35583N0115L39587
14396I455353J72219k9433o36L55678K91268J20527M36024l49488M97810R0966
$$ plain form
14466 3890348 3689954 3838151 3860092 3921045 3942903 3966499 4040649 4150762 4586978 4395498
14456 4395498 4441221 4440393 4312342 4204273 4494358 4325084 4693493 4687362 4837421 4730312
14446 4730312 4792930 4976920 5215493 5189378 4860908 5095762 5233335 5492367 5345702 5220224
14436 5220224 5259827 5535120 5477457 5661988 5656661 6059820 5759339 6205526 5954604 5875287
14426 5875287 6215780 6189894 6340393 6558421 6590618 6569631 6992401 6908708 6917790 7024776
14416 7024776 7058096 7225993 7292357 7378175 7702452 7645830 7937692 7936455 7827699 8291067
14406 8291067 8155219 8444581 8225647 8831180 8367796 8589881 8930068 9065651 9115766 9455353
14396 9455353 9627572 9598139 9597503 9953181 10244449 10364976 10801000 10451512 10949322 11040288
14386A1040288J15805L36969R4950L13998J17785j67228Q46299L0107K45858L58281
14376A3333112j45850O09255q9544M52336J29471M44512J80321k0380O59427L66471
14366A5919131L40136N10967J40705J79716L21787N29279L91930N73694O23026
14357A9530371K43845J07355J323145j7552P16473L15874N30289L4973R83463
14348B3768236P57576P05114M82657R26995O05794N73663P80995J211513P44664
14339C0557207J80199J114848J165296J148354Q29649R69080J265200Q43271R91053
14330C9064157J285391J508225J335205J296942J164213K020761J501613J979559
14322E1156066J529136K034175J890247K056913K031398K556800K076944K714087
$$ plain form
14386 11040288 11156093 11493062 11588012 11902010 12019795 11852567 12698866 12728973 12974831 13333112
14376 13333112 13187262 13796517 13706973 14159309 14288780 14733292 14913613 14893233 15552660 15919131
14366 15919131 16259267 16770234 16910939 17090655 17412442 17941721 18333651 18907345 19530371
14357 19530371 19774216 19881571 21204716 21187164 21903637 22219511 22749800 22784773 23768236
14348 23768236 24525812 25230926 25713583 26640578 27246372 27820035 28601030 29812543 30557207
14339 30557207 30737406 31852254 33017550 34165904 34995553 35964633 37229833 38073104 39064157
14330 39064157 40349548 41857773 43192978 44489920 45654133 47674894 49176507 51156066
14322 51156066 52685202 54719377 56609624 58666537 60697935 63254735 65331679 68045766
14314F8045766K720217K772435L463207L029264L875583L267587L796800M318643
14306I5289502M326798M738180M728253N278880N373770N957698O566935O841083
14298A39101099O806379P888118P879251Q538074R473387R458591J0681384J1004345
14290B10830628J1354064J2458300J2605972J3375796J4474514J4366081J5135207
14283C04600562J5376734J5666775J5836201J5269723J5290959J4294517J3394149
14276D09729620J2140057J0013232P623199L409138J761185K09903j206809k888304
14268D40791221l496133m338055r509254j1742872j2667500j4444032j5347201
14261C69246174j5829664j6090221j6111405j5756727j5578610j5108243j3436918
$$ plain form
14314 68045766 70765983 73538418 77001625 80030889 83906472 87174059 90970859 95289502
14306 95289502 99616300 104354480 109082733 114361613 119735383 125693081 132260016 139101099
14298 139101099 145907478 153795596 161674847 170212921 179686308 189144899 199826283 210830628
14290 210830628 222184692 234642992 247248964 260624760 275099274 289465355 304600562
14283 304600562 319977296 335644071 351480272 366749995 382040954 396335471 409729620
14276 409729620 421869677 431882909 439506108 442915246 444676431 444886334 443679525 440791221
14268 440791221 437295088 432957033 423447779 411704907 399037407 384593375 369246174
14261 369246174 353416510 337326289 321214884 305458157 289879547 274771304 261334386
14254B61334386j3722020j3299221j2388707j1917453j1111843j0331238r899047
14247A78664857r088097r019963p690395p206437p488560o691475o472059o028251
14239A18979620n606763m716833m663853m607349m624835l881575m064495l414761
14231H3399156l289727k925062l143530l223495k774628k670301k185811k579656
14223F0606946k346121k120634j574297j439224k061985k012423j638043j426804
14215D5987415j771990m49102j833294j471981j005320j127149j256993q59680
14207C6211906l67805j426417j216586q60856j042936n59651p37922l45376j458753
14198B8195604m20705r98051m64299j171705l36030m36422n43414o89950l52467
$$ plain form
14254 261334386 247612366 234313145 221924438 210006985 198895142 188563904 178664857
14247 178664857 169576760 160556797 152866402 145659965 138171405 131479930 125007871 118979620
14239 118979620 113372857 108656024 103992171 99384822 94759987 90878412 86813917 83399156
14231 83399156 80109429 77184367 74040837 70817342 68042714 65372413 63186602 60606946
14223 60606946 58260825 56140191 54565894 53126670 51064685 49052262 47414219 45987415
14215 45987415 44215425 43766323 41933029 40461048 39455728 38328579 37071586 36211906
14207 36211906 35844101 34417684 33201098 32340242 31297306 30737655 29999733 29654357 28195604
14198 28195604 27774899 26776848 26312549 25140844 24804814 24368392 23824978 23135028 22782561
14189B2782561q29441m20636m59573r60289j69239o54926o8310q04429K06984
14180A8622702p59210l44166o01656P0959p19546n61105K65763l02439m63705
14171A5207597j97490m41144l43401l19045j13031l18912N1852n51798n72461
14162A2402167R0986R3853o24774r2636j1628m61916o00186L22368j27370n36811
14152A0454053L00886m08761l38035K63613l48301j68129j959m87198O4946l12641
14142I018474O2296J21290p87526Q5722J14656m21068o8918k40110J90882k43029
14132G832669K78703n20101n67274K45149L19665k88303k81947j33720L4252l85601
14122F533492J63131L521p57903J59570L98875J8148n27657L82214k55496r70
$$ plain form
14189 22782561 21953120 21532484 21072911 20112622 19943383 19288457 19220147 18415718 18622702
14180 18622702 17863492 17519326 16917670 16988629 16269083 15707978 15973741 15671302 15207597
14171 15207597 15010107 14568963 14225562 13906517 13793486 13474574 13526426 12974628 12402167
14162 12402167 12493153 12587006 11962232 11869596 11857968 11396052 10795866 11118234 10990864 10454053
14152 10454053 10754939 10346178 10008143 10271756 9923455 9755326 9753367 9266169 9331115 9018474
14142 9018474 9080770 9202060 8414534 8500256 8614912 8193844 8124926 7884816 8075698 7832669
14132 7832669 8111372 7591271 7023997 7269146 7588811 7300508 7018561 6884841 6919093 6533492
14122 6533492 6696623 6700144 5942241 6101811 6500686 6518834 5991177 6373391 6117895 6116925
14112F116925r5283j52817L8275j60102l60773k7482j10453n3998J0778K37052
14102E442122k57325J85040n39614L73684m67444k9579L85721k70339m71169K63599
14092D614696K10145k93791j89933j62936O9628K69611l70306M9361k17315K83410
14082D262570q7813l10078L94085j28984p7982m2032k83300L05566j32770k47707
14072C651555k58870O32690k42626k72909m9133K72711j60497K24835m45077L8851
14062C391530m7349M2706j64581M3664L93568m57646L21922k03861k70596l03625
14052B745732J85195J65302j05434n227K14293m05497J16317j22353k5836K51582
14042C014074l78778K11272k85348j62701M63476m32333J07951o2407r1622J45010
$$ plain form
14112 6116925 6021642 5868825 5907100 5746998 5386225 5358743 5248290 5194292 5205070 5442122
14102 5442122 5184797 5369837 4830223 5203907 4736463 4706884 5092605 4822266 4351097 4614696
14092 4614696 4824841 4531050 4341117 4178181 4247809 4517420 4147114 4196475 3979160 4262570
14082 4262570 4174757 3864679 4258764 4129780 4051798 4009766 3726466 4032032 3899262 3651555
14072 3651555 3392685 4025375 3782749 3509840 3460707 3733418 3572921 3797756 3352679 3391530
14062 3391530 3344181 3386887 3222306 3265970 3659538 3201892 3523814 3319953 3049357 2745732
14052 2745732 2930927 3096229 2990795 2985568 3199861 2794364 2910681 2788328 2762492 3014074
14042 3014074 2635296 2846568 2561220 2398519 2861995 2429662 2537613 2475206 2383584 2528594
14032B528594p2864j40921k1653L13188m11780N36045n25756L31216j64720Q4504
14022B455853K01329n57028J07660n1297O3529K085l37523J72806j21905L39134
14012B274643k44998n06089M99132k22877j10117M11411l55622J41261j71194
14003A715550J46156J68342l31081q1484L62037l82284K65941k20840J75402l52559
13993A465180J60753K17172J60787K66766J331411J828396O568451J9624043J2790996
13984D4413955k1970623A0117611m094356j241392q64592n18291j17338o83573
13976B598069j27026L11567r1870j31728o12863K92861j82949m2433j14189O9812
13966A969251l38227k29921N18322j1684o5846m0837J9245Q6109Q8736l68971
$$ plain form
14032 2528594 2455730 2314809 2293156 2606344 2194564 2730609 2204853 2536069 2371349 2455853
14022 2455853 2657182 2100154 2207814 2156517 2220046 2222131 1884608 2057414 1935509 2274643
14012 2274643 2029645 1523556 2022688 1799811 1689694 2101105 1745483 1886744 1715550
14003 1715550 1861706 2030048 1698967 1617483 1979520 1597236 1863177 1642337 1817739 1465180
13993 1465180 1625933 1843105 2003892 2270658 3602069 5430465 11998916 31622959 44413955
13984 44413955 22443332 10117611 6023255 4781863 3917271 3398980 3281642 2598069
13976 2598069 2471043 2782610 2690740 2559012 1946149 2239010 2056061 2013628 1899439 1969251
13966 1969251 1631024 1401103 1919425 1907741 1841895 1801058 1820303 1906412 1995148 1626177
13956A626177L13136m07661L22326k77885J69575j01181k46400K6186R6918k991
13946A518200K84435o1452j79236r8296r5213j5360L25936m65867P7495L48284
13936A638926m78492L18205j64898J5369j6467L5678J71531j52937J22986j61276
13926A328625j12088J04864j94982L44446m06036q753L19395j22550J79350l53483
13916A078788M24137k67556O0560j0669J65411l05754J60911m9985j14785k11970
13906I29088K95489k33593J43144P2259j56074K3483J17489n1350j03528j4802
13896A021605p8205J76210O0242J99904j92105j60296n3789O4605m850j50109
13886H83212Q8479J19842j29994J29675k17816J59862k72289J59995J38370p7134
$$ plain form
13956 1626177 1939313 1531652 1853978 1576093 1745668 1644487 1398087 1424273 1521191 1518200
13946 1518200 1802635 1741183 1561947 1463651 1368438 1353078 1679014 1213147 1290642 1638926
13936 1638926 1160434 1478639 1313741 1329110 1312643 1348321 1519852 1366915 1489901 1328625
13926 1328625 1216537 1321401 1126419 1470865 1064829 1056076 1375471 1252921 1432271 1078788
13916 1078788 1502925 1235369 1295929 1285260 1450671 1144917 1305828 1255843 1141058 929088
13906 929088 1224577 990984 1134128 1206387 1050313 1073796 1191285 1139935 1036407 1021605
13896 1021605 943400 1119610 1179852 1379756 1187651 1027355 973566 1038171 1033321 883212
13886 883212 971691 1091533 961539 1091214 873398 1033260 760971 920966 1059336 982202
13876I82202p9272K65556k3386L5286k11657J67920p6809k99766M3061j1567K61525
13865A053093k35390P8997j77545j04919J76818J63262k31197L22213r6241p3209
13855H75882k29018K42925j05837p0350j63328L15726K24236j08722k19053L69571
13845A132032j64710n8938j13092j65298J09114K57312k81153j46971J75367J34071
13835H77734l1726M7853M0472k45693J14353j7993l1963k42076L66371J12429
13825I89761l56666B22245O69663k21508p7839m2769L52740J07047r6114D48005
13814E33419L61405J7268N6863j98538P693j46696R9693j29267K82913k84908
13804E99845J22148l25042K17103K19034r8300k83868j49361K81892J29357J15839
$$ plain form
13876 982202 902930 1168486 1145100 1180386 968729 1136649 1059840 760074 803135 791568 1053093
13865 1053093 817703 896700 719155 614236 791054 954316 723119 1045332 949091 875882
13855 875882 646864 889789 783952 713602 550274 866000 1090236 981514 762461 1132032
13845 1132032 967322 908384 795292 629994 739108 996420 715267 568296 743663 877734
13835 877734 846008 893861 934333 688640 802993 785000 753037 510961 877332 989761
13825 989761 633095 222245 891908 670400 592561 549792 902532 1009579 913465 448005
13814 533419 894824 912092 968955 770417 778110 631414 731107 601840 884753 599845
13804 599845 721993 396951 614054 833088 734788 450920 301559 583451 712808 828647
13794H28647B79458M39363l11003J9775L8981j9522J62928J49568C52586K07109
13784E59695K59220k22305J87046N8495D19611J21726N7184k42304k9100K92339
13774F19456j38937j25340J96504R5832k83861N13916m07026k29187L48748m2564
13764E47541K81190r9897j74665k61384J44238A39494k6557N73799B40745K88981
13754E29726P855K71072j7600q9918A71516L49676J12357m3384o700o1402M3128
13743E65191p1523N5871K5699n8716K0265N6412K41605B96894j05614N68521A87848
13731B83095J44095N45693A65172K29217K8502j04445J76783K01977q8277k4151
13721E84778r5489B19707N96054p6333l61033l6002j68108K86999j19065J99199
$$ plain form
13794 828647 279458 718821 407818 427593 466574 447052 609980 759548 352586 559695
13784 559695 818915 596610 783656 842151 419611 541337 598521 356217 327117 619456
13774 619456 480519 355179 551683 647515 363654 877570 470544 241357 590105 547541
13764 547541 828731 728834 554169 292785 437023 139494 112937 686736 240745 529726
13754 529726 537581 808653 791053 701135 171516 521192 633549 590165 583465 522063 565191
13743 565191 493668 549539 575238 516522 536787 593199 834804 296894 191280 759801 187848
13731 283095 427190 972883 165172 394389 422891 318446 495229 697206 608929 584778
13721 584778 489289 219707 815761 739428 378395 342393 174285 461284 342219 541418
13711E41418k61902L4180J48382D3991N52628k41976p2828O7694j19984R971M677
13700B44173b3019B07624M47257j87622R7160N1833j10065j85409M11048k84993
13690D46833q970j69068K6582o7166L17414j19073J64370k06782p5422M66659
13680G75377l73847N1304j95716M8676p0099J53703M89659C83917j43930p5596
13670A64391L36011J38873n2711j85150A68763qN95948k57860k03432J02850E0336
13658B16102o8461J56504B0051K19989F8295L60706p9272j65252K50650j48831
13648B86296m3558J74128F6073J4498K75937R0212r9465J42005h0871G16712C36660
13636B12017J43419G3260K25720J4876K95334o8350B70202J9891J7826A27784
$$ plain form
13711 541418 279516 313696 462078 43991 596619 354643 281815 349509 229525 239496 244173
13700 244173 -23019 207624 654881 467259 564419 616252 506187 320778 731826 446833
13690 446833 437863 268795 295377 228211 545625 426552 590922 384140 308718 775377
13680 775377 401530 452834 257118 305794 235695 389398 879057 383917 239987 164391
13670 164391 500402 639275 586564 401414 168763 168755 764703 506843 303411 406261 50336
13658 216102 147641 304145 20051 240040 68295 429001 349729 184477 435127 286296
13648 286296 242738 416866 66073 80571 356508 446720 347255 489260 -80871 716712 336660
13636 212017 355436 73260 298980 313856 609190 540840 270202 290093 307919 127784
13625C19177K04280A78883J48662L4530K12951k9625r3290j58744E4455L90171
13615D44626K8269B10082o6221J92866q6360J4729A7289K02633K12656j46972
13605B85606H6030J92055n005j9394J13240j39953D4727J29527K29039J3647E7643
13593E88875k30114K444C5566L55754G1109J91943K37880k12536j43500M11878
13583E56774E9336K38819K59068A16362P4096m9038L92699A67491J52751j4709
13573C05533a6894C26964J5409j21418K04611j30328k3839O4426m1528A39724
13562B05817o7197J68093q5842L87271A54279D1082J60198g1834B00971K84498
13552D85469e4484D9633K75948l1411B4063K72481a1616D26630M186K30997B91134
$$ plain form
13625 319177 523457 178883 327545 362075 575026 545401 452111 293367 54455 444626
13615 444626 472895 210082 143861 336727 250367 265096 17289 219922 432578 285606
13605 285606 86030 278085 273080 253686 366926 226973 44727 174254 403293 416940 57643
13593 588875 358761 361205 35566 391320 71109 263052 500932 288396 144896 556774
13583 556774 59336 298155 557223 116362 190458 141420 534119 167491 320242 305533
13573 305533 -16894 326964 342373 220955 425566 295238 271399 335825 294297 139724
13562 205817 138620 306713 220871 608142 154279 41082 201280 -71834 200971 485469
13552 485469 -54484 49633 325581 294170 24063 296544 -11616 426630 430816 661813 291134
13540B04780J5256G2902J85348M03202j22087A40205a7201B42749m4580m4009
13530A54160k7286J83962b7960B56342J46630A63176J35176O9212A52419o1775
13520I0644M2821K68224e5157C02796A2056M5376B4309K58298a74355b1121B51002
13508D26660A62647N12987A30848K11023b84292B17605j00429N0182d7003C03065
13497C9870M6025a00262A29880e7194D02012J54059k43391A14810J57476g9026
13486C16779A57613G1932K03739J46105c0902R58D17314n5695a82324A59359O3653
13475B23012b4350A08889L14653e473C28540H4564J56043A13240K38341j10345
13465B41236R6732H1370g8584C85146A89376J29441A31044a1785C58870A41285
$$ plain form
13540 204780 220036 72902 258250 661452 539365 140205 -17201 242749 198169 154160
13530 154160 126874 310836 -27960 256342 402972 163176 298352 367564 152419 90644
13520 90644 133465 401689 -55157 302796 12056 57432 24309 282607 -174355 -21121 251002
13508 426660 162647 675634 130848 341871 -284292 217605 117176 167358 -47003 303065
13497 39870 85895 -100262 129880 -57194 402012 556071 312680 114810 272286 -79026
13486 316779 157613 71932 275671 421776 -30902 -29944 417314 361619 -182324 159359 223012
13475 223012 -24350 108889 423542 -5473 328540 84564 240607 113240 351581 241236
13465 241236 337968 81370 -78584 385146 189376 318817 131044 -11785 358870 141285
13454B42443a0605A91325p196b5475C66666A73391N9695o4320K90602j82118k5839
13443B51411e247C04887m4419m811p6183e0085I6742J46496C6174J27332Q2288
13432B45794K0406c90610e0005C65081b52891D2446L77607H1263b4686j4484e715
13420A35148M13920k67669h8183L4256A1159J64595O4835l1521n2571J21848o861
13409B71484G7143K75640a34673C71437K3660G6130b54732B8925M41393j13726
13399C56592l7495O339a04191I824P3299L8628j5837k0505k5601K46004f0400
13387A6918K32807J30410j41447q7042C6745J997K6960J20211a6371j57769B65357
13375A05451l4026J08421M9562O69N6804J1959d4712c359B63147A22075L57556
$$ plain form
13454 242443 -10605 191325 184129 -25475 366666 173391 233086 168766 459368 277250 251411
13443 251411 -5247 304887 260468 255657 179474 -50085 96742 243238 36174 163506 245794
13432 245794 266200 -390610 -50005 365081 -252891 42446 420053 81263 -24686 -39170 -5715
13420 135148 549068 281399 -88183 -53927 11159 175754 240589 209068 156497 278345 271484
13409 271484 77143 352783 -134673 371437 395097 76130 -254732 28925 470318 356592
13399 356592 319097 325436 -104191 9824 83123 121751 105914 85409 59808 305812 -60400
13387 16918 249725 380135 238688 151646 36745 38742 65702 185913 -16371 -174140 265357
13375 105451 71425 179846 229408 230077 286881 298840 -44712 -3359 263147 122075 479631
13364D79631e9821B11194D488a58814C85321B982g84j79489a675j14881B20493
13352A44471a34718B68031i74A34945n8851K16158A22478K37066N5245J37775
13342E52564a19796D00832j24291J33251A76776J9782J60891A76747b7907B48673
13331C57000I8571J7184a85657A62655K51016j70010L38585b07787C7062O9078
13321A06140J48125j5799Q349K9141P9440A38670D7528K26871q5876a13435A22372
13309b52163B01641J80479A15242i6305B8480J50908Q4311j29101k9633b32184
13298E95455E0761J9170i4968A17452a071A54703K68496A07321h6588F9091J47438
13287B16529J85946j21734e1186E0414L9023K2513a18321K5306k51833A82380
$$ plain form
13364 479631 -59821 211194 4488 -158814 385321 2982 -784 -180273 -1675 -116556 220493
13352 144471 -134718 268031 -974 134945 76094 292252 122478 359544 414789 552564
13342 552564 -119796 400832 276541 409792 176776 196558 357449 176747 -27907 248673
13331 357000 98571 115755 -185657 162655 413671 243661 582246 -207787 37062 106140
13321 106140 254265 238466 246815 275956 355396 138670 47528 274399 188523 -113435 122372
13309 -252163 201641 382120 115242 -96305 28480 179388 263699 134598 104965 -232184
13298 595455 50761 69931 -94968 117452 -1071 154703 423199 107321 -86588 69091 216529
13287 216529 402475 280741 -51186 50414 89437 111950 -118321 -93015 -344848 182380
13276C40752b08231J5253Q2947d2677B52723n4610O8712h099B96710a05123B9984
13264a8390B97294I7518N1268J70769J3772G6900M2740J05223k6305a2948j7477
13253c0425B15328a51037B5518b13514I5290e0743C32260g1281o7348f213o8538
13242g4751A68651M351B5271J6447b3285B00207d460m9225j45538H2105a553B69492
13229G8119K94727I8909C9284i3048j25002A24577c59945J62711O0830A9441K16022
13218B35463K58909G1752J6286g475A43744b1319o912G1381L83772C8658a09458
13206A97610b2365A33446a47906F0588L55823I2054C2161J06587i9140m8768A21570
13194f1871m5147B01115k0269e3522r5263A93427c7514B83867a05096j86383B31960
$$ plain form
13276 340752 -208231 -192978 -110031 -42677 252723 198113 266825 -8099 296710 -105123 29984
13264 -18390 297294 97518 148786 319555 333327 76900 119640 224863 198558 -12948 -30425
13253 -30425 215328 -151037 25518 -213514 95290 -50743 332260 -71281 -138629 -6213 -74751
13242 -74751 168651 173002 25271 41718 -23285 200207 -4460 -53685 -199223 82105 -1553 269492
13229 78119 372846 98909 39284 -93048 -218050 124577 -359945 -197234 -136404 19441 235463
13218 235463 494372 71752 88038 -7475 143744 -21319 -28231 71381 455153 38658 -109458
13206 197610 -22365 133446 -147906 60588 416411 92054 32161 138748 -99140 -147908 121570
13194 -61871 -107018 201115 180846 -53522 -148785 193427 -37514 283867 -105096 -291479 231960
13182A70774I952k375b8109A25613n2912d1611B15248d8233j06255B7896K6157
13171E4053K52743G3691g5164B23005C5570J8075K88198G3762k9026a70882a8493
13159a03950A31167D9466J65604D7862L12031O8684i8867b1802E14337a4138j353
13148a5491k07912B84996f6599C03632d34039e7800j62941c0842a039B29906a78398
13136a33831E1966c67869B25851E9684a1178C7937i9111G8709c87277A63540a33602
13124B0872a38144A10428J42599c5259k10108O7618E4597b3741j7899l039A60911
13112a15565A7530h6106I4487J58096L5147d5219B09060J30785a38320C22374
13101A03270A6612a62160L0225K8974k6868B61226K6315G6002a48730Q030B8601
$$ plain form
13182 170774 9952 7577 -28109 125613 72701 -41611 215248 -48233 -154488 27896 54053
13171 54053 306796 73691 -75164 223005 35570 53645 341843 73762 44736 -170882 -18493
13159 -103950 131167 49466 215070 47862 359893 428577 -98867 -21802 514337 -14138 -15491
13148 -15491 -223403 284996 -66599 303632 -434039 -57800 -220741 -30842 -1039 229906 -178398
13136 -133831 51966 -367869 225851 59684 -11178 37937 -99111 78709 -387277 163540 -133602
13124 20872 -138144 110428 253027 -35259 -245367 -177749 54597 -23741 -41640 -44679 160911
13112 -115565 17530 -86106 94487 252583 287730 -45219 209060 339845 -138320 322374
13101 103270 16612 -162160 -131935 -102961 -129829 261226 287541 76002 -148730 -140700 28601
13089E65153a21923A79121e2504A76058b35018J06069A01694P4374K4850q4082
13079A16836k0728a08075C09869a10524k49218B96272E9136K68835a7197B47870
13068B24377B4650a33926A52444d0824B77032F6916P4478K23043j55963k4268
13058A84206j0424k825a67870D8946b98660a25726I5231J21239J06699h3169K1129
13047f2040j54070H0750I310a59384P6836a1149A47790J48945a96926J8720B5811
13035g1280A7679K7917J7247J65003b48730B92312A8214J04339a54666G7357d3371
13023a02877B42885J05826a61244A50311K9494o69R0184l8442l4764a7586I0934
13011g2736B03939Q9188O3622A4858K50996g2253B9457c5325I9241a72451a0162
$$ plain form
13089 565153 -121923 179121 -52504 176058 -235018 -128949 101694 176068 200918 116836
13079 116836 96108 -108075 309869 -110524 -359742 296272 59136 327971 -17197 247870
13068 224377 24650 -133926 152444 -40824 277032 66916 141394 364437 208474 184206
13058 184206 173782 170957 -167870 48946 -298660 -125726 95231 216470 323169 -83169 -62040
13047 -62040 -216110 80750 9310 -159384 -82548 -11149 147790 296735 -196926 -178206 25811
13035 -71280 17679 45596 62843 227846 -248730 292312 18214 122553 -154666 77357 -43371
13023 -102877 242885 348711 -161244 150311 179805 179136 269320 230878 196114 -17586 90934
13011 -72736 203939 293127 356749 14858 265854 -72253 29457 -35325 99241 -172451 -10162
12999d8056J6327D1084a12135j78279F3661N59787b18324R2273d239A02646a30831
12987G0175a60919q1806C5881A7834L66116A09805D0803a25517D03524C0346a07172
12975h0064D9683a70653C039K0309K31287o5852e6854b5170E1827K49133c6279
12963C6078A4493Q9907b45157G3405K46612j47132F1822b4753A73379h1062H0075
12951b4632F7189N6423a22360D35194h5819B43439K25311j62331b60593a08339
12940c18690a08398B27324a45952B2125K39963N3942a84623A23061M3071c0408
12929B38418C0188J77675g1162o7580D6721K24214c6715A03849J36726D4425a54440
12917A54622a06131I642a09581L1324j09842A00014J65567e218j63416a6231A65588
$$ plain form
12999 -48056 -31729 41084 -112135 -290414 63661 623448 -218324 -126051 -4239 102646 -130831
12987 70175 -160919 -242725 35881 17834 383950 109805 40803 -125517 403524 30346 -107172
12975 -80064 49683 -170653 3039 23348 254635 188783 -56854 -25170 51827 300960 -36279
12963 36078 14493 104400 -245157 73405 320017 172885 61822 -24753 173379 -81062 80075
12951 -24632 67189 123612 -122360 435194 -85819 243439 468750 306419 -260593 -108339
12940 -318690 -108398 227324 -145952 22125 262088 316030 -184623 123061 166132 -30408
12929 238418 30188 207863 -71162 -138742 46721 270935 -36715 103849 240575 44425 -154440
12917 154622 -106131 9642 -109581 -78257 -188099 100014 265581 -5218 -168634 -16231 165588
12905i7102r985p8881o5293c0163I4787J54515i36D1375b69303j2620A60267m8536
12893A11731a34320A37091J07247j08281K79104A48994h5109B82996K51088a8381
12882C72622i5643A10845g028j70224L4760K9708N4405A34632l93n7408C7383
12870i249B50002G6912k0667j9141J0978a01021B57561j12576J20947A15018A8660
12858B41385i9849H7584M3061c02628a37745m5114c2335A90756q2207d2235o8090
12847a10325o6120P8643p7501D542K03485p6160J52026B2633m2q046L80443A10319
12834a13749H1938J42563o8216b72454L2236B873a02537j33906D65831j20776
12824C45055p6395C6380b44176A50335a89063A37715b78255I4747c3005A29912
$$ plain form
12905 -97102 -107087 -185968 -251261 -30163 94787 249302 -936 41375 -269303 -281923 160267 111731
12893 111731 -134320 137091 244338 136057 415161 148994 -85109 282996 534084 -18381
12882 372622 -95643 110845 -7028 -177252 -142492 -112784 -58379 134632 134239 76831 37383
12870 -9249 250002 76912 56245 37104 48082 -101021 257561 144985 265932 115018 18660
12858 241385 -99849 87584 130645 -302628 -137745 -182859 -32335 190756 108549 -42235 -110325
12847 -110325 -176445 -97802 -175303 4542 208027 131867 283893 22633 22591 14545 394988 110319
12834 -113749 81938 224501 156285 -272454 -240218 2873 -102537 -236443 465831 345055
12824 345055 268660 36380 -244176 150335 -189063 137715 -278255 94747 -33005 129912
12813A56275A0967a20770I0877J87304a1697j01724o3710J2282C1761a83658n1716
12802b35374A40624c03113A57722D036b0783B62684a96689c247n4038k5410A74577
12790c8967B6812i8042m4167J0877c9040B0971a51261E4210K13372b05230B4352
12778c09241c2094A24116E221a19828e264q2189A69960f102E5011J8886a27645
12766E933K9349g6761j61326B62118c6790B31291O5575j07139B1543c87422D1282
12754F8181J43273j7185a27811A55211E0221B1201K4645K72581b23267B4515b00514
12742F0552h1490B68313j01953D316P2305b15072H2609R4105F7450k6848K40484
12731B81086o322n2809a37777C2150J6659L6181O9348b34727F1410K354a13881
$$ plain form
12813 156275 10967 -120770 90877 278181 -11697 -113421 -177131 -164849 31761 -183658 -235374
12802 -235374 140624 -303113 157722 4036 -20783 262684 -196689 -3247 -57285 -82695 174577
12790 -38967 26812 -98042 -142209 -131332 -39040 20971 -151261 54210 267582 -205230 24352
12778 -309241 -32094 124116 5221 -119828 -5264 -87453 169960 -6102 55011 73897 -127645
12766 5933 35282 -76761 -238087 262118 -36790 231291 296866 189727 21543 -387422 41282
12754 68181 211454 194269 -127811 155211 50221 21201 45846 318427 -223267 24515 -200514
12742 60552 -81490 268313 166360 4316 76621 -215072 82609 176714 67450 40602 281086
12731 281086 274764 221955 -137777 32150 48809 84990 154338 -234727 61410 63764 -113881
12719A45073k2221N8166a63926L5846B75737J27159A21093b3598A58987E4893
12708a90643C1814L49418I5733L3637K20645a85187C14100j36723f3249A9405
12697A08925i3523A4288M5859e296p8992B25700O2702j07195L786e1550F5036
12685G4000B7615P1191m9099a31739A54217J74214J20790a36630j26970A55653
12674b0345C2811b56782B53336e1502A15220J87751b27819a6782l17464C83223
12663F4008F749K6158J2559Q3886N9065E880J31483J23303n7455J6456d5902D1458
12650b88871A32306a38313B46148a18287A30991a02921C39499c7248A07074J12727
12640B19801F2401a0303j3965m9697J5853o7662C4368c7286A21373n2569J79481
$$ plain form
12719 145073 122852 181018 -163926 -128080 275737 402896 121093 -23598 158987 54893
12708 -190643 31814 381232 95733 129370 350015 -185187 314100 177377 -63249 19405
12697 108925 -93523 14288 60147 -5296 -84288 225700 288402 181207 184993 -51550 65036
12685 74000 27615 98806 49707 -131739 154217 328431 449221 -136630 -263600 155653
12674 -20345 32811 -256782 253336 -51502 115220 302971 -227819 -16782 -334246 383223
12663 64008 6749 32907 45466 129352 188417 5880 137363 260666 203211 219667 -45902 41458
12650 -288871 132306 -138313 246148 -118287 130991 -102921 339499 -37248 107074 219801
12640 219801 62401 -10303 -24268 -73965 -58112 -125774 34368 -37286 121373 68804 248285
12629B48285A04481K00578q7786K48786b228A41140b12649E8279M41533A80305
12618G9081K20836a32504M5097k2815M4230D36291a70508b6273m1310B0870J49309
12607A70179a62548D8326r103f4873I2558a53969g6919B69913f5929C38421G2657
12595I1608N131b72337B46260M563F118b57181A32638D0759b18898A81681c70452
12583E4987b32656C8121h7913q8635f2734k9864a7387C8709i9540F1230d9968
12571b30919P5233A03608a17286J5159B5784J0126P7426l189a25200b4655j13011
12560a37666e9677p9838M7899B42735a98884j3632A43114n2824n562d2113B75463
12548i3199A48799a76600P1074k2424k4463A066c3314B34669a29458L636j38502
$$ plain form
12629 248285 104481 305059 217273 466059 -2228 141140 -212649 58279 499812 180305
12618 79081 299917 -132504 -87407 -110222 -65992 436291 -170508 -26273 -67583 20870 170179
12607 170179 -162548 48326 39223 -64873 92558 -153969 -76919 269913 -65929 338421 72657
12595 91608 96739 -272337 246260 250823 6118 -257181 132638 40759 -218898 181681 -370452
12583 54987 -232656 38121 -87913 -176548 -62734 -92598 -17387 38709 -99540 61230 -49968
12571 -230919 -155686 103608 -117286 -102127 25784 35910 113336 110147 -125200 -24655 -137666
12560 -137666 -59677 -139515 -91616 242735 -198884 -212516 143114 90290 84728 -42113 275463
12548 -93199 148799 -176600 -105526 -127950 -152413 1066 -33314 234669 -129458 -125822 -264324
12537b64324C6178a46158A84394c9202E0427a35331G4283J02102a70079B36466
12526D1526a91509d4845m0121A4695N9181a60239L4186l6713q4018I3401E615
12514C0515c742A92867h8088c5401G6560k9216a84881k24910F9417K82305A15721
12502a84757F9602L0314b0915B21483q1303h2856C50054o7369c16683C7897M00
12491C8297a15925L7307A97194A8500b22095a02096L7919k1522j75209A19683
12480a13350j22537D6533L28214c76865c6898j19133A37904i2577A44981J73328
12470C18309d3828Q093A46464M3640K57438j69278E4821R5830F8972c00910A99440
12458B37580G1345e8836K0847D9285J26026J7204A6575f6312j76256C0577i0993
$$ plain form
12537 -264324 36178 -146158 184394 -39202 50427 -135331 74283 176385 -170079 236466
12526 41526 -191509 -44845 -84966 14695 73876 -160239 -126053 -162766 -246784 93401 5615
12514 30515 -3742 192867 -88088 -35401 76560 47344 -184881 -409791 69417 351722 115721
12502 -184757 69602 99916 -20915 221483 140180 -82856 350054 282685 -316683 37897 38297
12491 38297 -115925 -78618 197194 18500 -222095 -102096 -64177 -85699 -260908 119683
12480 -113350 -235887 46533 374747 -376865 -36898 -156031 137904 -92577 144981 318309
12470 318309 -43828 -35735 146464 190104 447542 278264 54821 150651 68972 -300910 199440
12458 237580 71345 -58836 -37989 49285 175311 192515 16575 -66312 -242568 30577 -90993
12446f3010k10439e4697l4453A91671K0796H648b16111R0468k06192a7840A60243
12434e7948o0394J5772r4849A53183a03423C4333A5920a16992E8220M8918I744
12422A56888b88821J15265o2835i8132I9303C6270K13076a34138A04076b29551
12411c6076B42788a24150D9997M0891a61478b1524A39192i7871q3997e6120o4658
12400a20778A4459c91827D2298a24183m956M9581A25163a99838h7628F5377k7565
12389C7812M3780i6227r0666G2025k2877c8110A97124c43818E2462b99974A95471
12377A53694Q1912c1301j13664B01057a28647B84276j10841a63720g5178A05402
12366g287C7362b45564A07883c55168j75001e7237B25321q7404b71476b4991B30110
$$ plain form
12446 -63010 -273449 -54697 -89150 191671 212467 8648 -216111 -125643 -331835 -17840 160243
12434 -57948 -118342 -102570 -197419 153183 -103423 34333 15920 -116992 58220 107138 9744
12422 156888 -288821 -173556 -236391 -98132 99303 36270 249346 -134138 104076 -229551
12411 -36076 242788 -124150 49997 90888 -161478 -21524 139192 -97871 -181868 -56120 -120778
12400 -120778 14459 -391827 42298 -124183 -129139 -79558 125163 -199838 -87628 65377 37812
12389 37812 81592 -96227 -186893 72025 49148 -38110 197124 -343818 52462 -299974 195471
12377 153694 235606 -31301 -144965 201057 -128647 284276 173435 -163720 -75178 105402
12366 -7287 37362 -245564 107883 -355168 -530169 -57237 225321 137917 -271476 -24991 230110
12354B56956C8919a3893A22664a58282A17731J06731q852d7793G7824a7193G9414
12342i4254k10838A01557D797i2031b4700q3510J8238B9868h0916J3170E8686
12330A78943a63608E1853c28214H786i5358C3195K25305j20137D5941a56396k31661
12319c88057A22012J19018o1872J45115a43050E9202J5334a96136A67351h1233
12308b57644H519a38200p5921B8883i3696E95208g6828B063i6488k7928l4170
12297a58586a4133A3035a55515C17501G1316a17955L2931C01806l7137d7179l0912
12286g8091A92239c18952a44245k60812a39641A17881j6376a15847A85901B8209
12275B53501n1926e2514o0235A2817K34595D8006Q5722o2236o168P6448o899J09465
$$ plain form
12354 256956 38919 -13893 122664 -158282 117731 224462 215610 -47793 77824 -17193 79414
12342 -94254 -305092 101557 4797 -92031 -24700 -108210 -89972 29868 -80916 -67746 58686
12330 178943 -163608 51853 -328214 8786 -95358 33195 258500 138363 45941 -156396 -388057
12319 -388057 122012 241030 179158 324273 -143050 59202 74536 -196136 167351 -81233
12308 -257644 8519 -138200 -214121 28883 -93696 595208 -76828 2063 -96488 -124416 -158586
12297 -158586 -14133 13035 -155515 317501 71316 -117955 -85024 301806 264669 -47179 -78091
12286 -78091 192239 -318952 -144245 -405057 -139641 117881 101505 -115847 185901 28209
12275 253501 201575 -52514 -112749 12817 247412 48006 133728 71492 65324 141772 134873 244338
12263B44338a27790B96360C7364Q5730l2280R035f005A33262e90493C20542A15964
12251D14688b08286P0203L5265j10145D4634A7777a31088A8566c5748d922B5059
12239A36433k2592h4134l6611q6838A73421q1595K0749M0427Q1509n4476N2380
12228B32415j5277L2114b19514a3550D9757M09281j02459o1269A09466L25667
12218D35133A31081b23828A65076M8077J72426A05679a41213B11110R9242I3742
12207A01722b3434j3151A87716H501b4441C15708m5633D4898N0358j2338q673
12196G4245L3223J55808R3474k3114H2532K41310a06489A2513L47868f2196j5640
12185g7836G315R2147M17328F8540M8471L0501P5996A05220J42122j0507h8321
$$ plain form
12263 244338 -127790 296360 37364 123094 90814 99849 -6005 133262 -590493 320542 115964
12251 414688 -208286 -138083 -102818 -212963 44634 17777 -131088 18566 -35748 -4922 25059
12239 136433 113841 -84134 -120745 -207583 173421 91826 112575 153002 234511 180035 232415
12228 232415 217138 249252 -219514 -13550 49757 459038 356579 295310 109466 435133
12218 435133 131081 -223828 165076 213153 385579 105679 -141213 211110 310352 93742
12207 101722 -23434 -36585 187716 8501 -24441 315708 270075 44898 95256 82918 74245
12196 74245 107468 263276 356750 333636 82532 323842 -106489 12513 360381 -62196 -77836
12185 -77836 7315 99462 516790 68540 117011 147512 223508 105220 247342 236835 -88321
12173B42126n3046k0339J35468m9344H776J05477a36642B48103B2876J24028a05324
12161a13841K719A30683k1630l2518K17826j02413L0828J47553E9104a12164B34001
12149a1320A73366J18076A03275O9818D7164G191a24661A4853b12231g3266m8740
12138a22006j7560m4448p5280E4139b15683f6641j11749H7468a04552A64163m6804
12127A17359L16326H8566k3180h6833G5666k1398N721d4726j30681P5918j08967
12116b08456A4206L492N4337a0809F6674J02651a46700j18401a2658j55011B18331
12104c9948A80235E4746J12923e8747E7680a50882A84640c11787M4971g9329j06342
12093a85671I6935c0474j00122b8923o8642R663C7934a24363B79892H6985L6601
$$ plain form
12173 242126 189080 168741 304209 254865 8776 114253 -136642 248103 22876 146904 -105324
12161 -113841 -111122 130683 109053 76535 294361 191948 222776 370329 59104 -112164 234001
12149 -11320 173366 291442 103275 173093 47164 7191 -124661 14853 -212231 -73266 -122006
12138 -122006 -139566 -184014 -259294 54139 -215683 -66641 -178390 87468 -104552 164163 117359
12127 117359 433685 88566 65386 -86833 75666 54268 59989 -44726 -175407 -99489 -208456
12116 -208456 14206 17698 72035 -10809 66674 169325 -146700 -265101 -12658 -167669 218331
12104 -39948 180235 54746 167669 -58747 57680 -150882 184640 -311787 -266816 -79329 -185671
12093 -185671 96935 -30474 -130596 -28923 -97565 -87902 37934 -124363 279892 86985 123586
12082A23586H153b95955i2934A2404N0180k3483Q7237F0866L21329j08415K87698
12071E61478J683315G32656A76863A8898L15698j00887C4180a2381B03477h719
12060d8090B6224a98279b6701B34376j16619j7393b06652F5535J27271a21163
12049b87877g6676q1891A64281K41815d9536B5253L074i2657A4952L4352J73114
12038B22418f1534A55565b6154r4815d6224m8817E0476d08840a39441j32839R8310
12027a73970e8984A57503a44175B65280a58121G3819e5876F2796J01090a50019
12016A70425N6770i8672D4236K01296A79O7294L67315j71603a12850j0994l25192
12005d49036A54530Q072F2187h6038a3960A13167g1452j45255E4256b49611C8104
$$ plain form
12082 123586 8153 -295955 -92934 12404 62584 39101 126338 60866 382195 273780 561478
12071 561478 2244793 732656 176863 18898 334596 233709 34180 -12381 203477 -8719
12060 -48090 26224 -198279 -26701 234376 117757 100364 -206652 65535 192806 -121163
12049 -287877 -76676 -158567 164281 406096 -49536 25253 28327 -92657 14952 49304 222418
12038 222418 -61534 155565 -26154 -120969 -46224 -95041 50476 -408840 -139441 -272280 -173970
12027 -173970 -58984 157503 -144175 265280 -158121 73819 -55876 62796 163886 -150019
12016 170425 227195 -98672 44236 245532 179 67473 434788 263185 -112850 -123844 -449036
12005 -449036 154530 162602 62187 -86038 -13960 113167 -71452 -216707 54256 -249611 38104
11993H1675a01447g446E4603b8348C8629j7508J92313j06333c6755D3218a52160
11981b60112B61096h0900j59376D588b08621D621R0302J16232C9152a3254B01951
11969B3091J10275n365E2597b19757g9750j46952b5604k87633M8185I4111a36108
11957a19495A16769b06952g697m23350a52740H7415K01008J97239B7418J21699
11947A49117b66807B7654a02946A2307a64063B12240a42968d280G6652b92756
11936A35419a01298D2518J19184d9823j2977r2667A5754d5188H3597b49492B74906
11924F5042a36481p4343A99396N3348H4583h5826B91914A05965b12737k07329
11914d20066B02208n4205a77993F9710h2527j53349O2191j40113J39440j18687
$$ plain form
11993 81675 -101447 -7446 54603 -28348 38629 21121 213434 107101 -36755 43218 -152160
11981 -260112 261096 -80900 -240276 4588 -208621 4621 94923 211155 39152 -13254 201951
11969 23091 133366 128001 52597 -219757 -79750 -226702 -25604 -313237 -265052 94111 -136108
11957 -119495 116769 -206952 -7697 -431047 -152740 87415 288423 485662 27418 149117
11947 149117 -266807 27654 -102946 12307 -164063 212240 -142968 -4280 76652 -292756
11936 135419 -101298 42518 161702 -49823 -62800 -155467 15754 -45188 83597 -249492 274906
11924 65042 -136481 -210824 199396 252744 84583 -85826 291914 105965 -212737 -420066
11914 -420066 202208 148003 -177993 69710 -82527 -235876 -173685 -313798 -174358 -293045
11904b93045B8568e8926j17336B0749c26998O0727d9915A72411H4478a91622d7696
11892C05771a36794B17939a39769M2453C6605P3506a65402g7976d312H9290J23165
11881B12455a02432A3570K5400K77430o1722c44517A48054A6006d6450j96277
11871b42727B7044a98610n4233A88502a09843M7771A3795J57323j154a50274A24298
11859a00633L6255A11455i2835c3021C00994F0994K9484d6143A46751d946A39985
11847h1339A63498b05296e2160A45997m8645b60316G6837a88825A71759J37781
11837C09540a69811A75352B9532e28588B22229E6184M6214E793a37897K8257j0355
11826a19995C0224b6378k00820B9515L28857A36930i6727A01613b79597c7189
$$ plain form
11904 -293045 28568 -58926 -176262 20749 -326998 -266271 -49915 172411 84478 -191622 -47696
11892 305771 -136794 217939 -139769 -97316 36605 110111 -165402 -77976 -4312 89290 212455
11881 212455 -102432 13570 38970 316400 254678 -344517 148054 16006 -46450 -242727
11871 -242727 27044 -198610 -252843 188502 -109843 -62072 13795 171118 169964 -150274 124298
11859 -100633 -64378 111455 -92835 -33021 300994 60994 90478 -46143 146751 -4946 139985
11847 -81339 163498 -205296 -52160 145997 97352 -260316 76837 -188825 171759 309540
11837 309540 -169811 175352 29532 -528588 222229 56184 102398 5793 -137897 -109640 -119995
11826 -119995 30224 -26378 -227198 29515 358372 136930 -96727 101613 -279597 -37189
11815a9968C8607K4153a92536R3040L328r9554g1898A92211B1836c11647J00823
11804b10824F852Q5808a07711j48449A19225d1868q8062K2985j24032A08280c55082
11792a30148b3392A01304G962a67985j18273C25045A09264k878i1411k03026i4495
11780d939F1268a20118E081J56028A3242i2134A26944f1592l5898b7179q846k4774
11768f0799H0537a92467O949N2409A96464J42655J03555A26497e8215E7068b8703
11756b69502c6787j76285B42070e7282C373J44851b47328B67131C202a03091j91767
11745b94858A31479e4656B37088k8600Q4672A1013J58118m1051a94187d9607r2476
11734a42083b7230C70740a68296G7108a12138c4207n4872A09046j9678a75247
$$ plain form
11815 -19968 38607 62760 -192536 -99496 -96168 -195722 -71898 192211 21836 -311647 -210824
11804 -210824 6852 92660 -107711 -256160 119225 -41868 -129930 -106945 -230977 108280 -355082
11792 -130148 -23392 101304 7962 -167985 -286258 325045 109264 106386 -91411 -294437 -94495
11780 -4939 61268 -120118 5081 161109 13242 -92134 126944 -61592 -97490 -27179 -36025 -60799
11768 -60799 80537 -192467 -185518 -133109 196464 339119 442674 126497 -58215 57068 -28703
11756 -269502 -36787 -213072 242070 -57282 3373 148224 -247328 267131 3202 -103091 -294858
11745 -294858 131479 -54656 237088 208488 293160 11013 169131 128080 -194187 -49607 -142083
11734 -142083 -27230 370740 -168296 77108 -112138 -34207 -89079 109046 89368 -175247
11723A11256l2622j4167b36779B04646a62556J3142c4011A31434a68861j87286
11713c56147N0331b9356A04231A6309J23833E4843a68258C91288E1913R0717m4067
11702I8563b81834E6290c34391A53826A7129a20436A48727c05074O1634K189D4534
11690b13024E48030A18546c2509E4513b99151D1390I632b77857B1372K6500m717
11679D3155J5006b8012A10189D6457a77011P6535C78732J157A75934i0191A6919
11667c3807E16J25135d85732B40290p9240Q236i8751C5659i068o338k2107E76858
11654b6930A25263f2878A30772j1670a17703C33004F704h2889j9046A4162N4295
11643F8457a05511B6616l669L9184l968B1681L7877a66139e7838J2420E478a52488
$$ plain form
11723 111256 78634 64467 -236779 204646 -162556 -149414 -34011 131434 -168861 -356147
11713 -356147 -305816 -29356 104231 16309 140142 54843 -168258 391288 51913 142630 98563
11702 98563 -281834 56290 -334391 153826 17129 -120436 148727 -305074 -243440 -241251 44534
11690 -213024 548030 118546 -32509 54513 -299151 41390 9632 -277857 21372 47872 43155
11679 43155 58161 -28012 110189 46457 -177011 -100476 378732 379889 175934 -90191 16919
11667 -33807 516 125651 -485732 240290 161050 169286 -98751 35659 -9068 -15406 -37513 576858
11654 -26930 125263 -62878 130772 119102 -117703 333004 6704 -82889 -101935 14162 68457
11643 68457 -105511 26616 22947 62131 58163 21681 59558 -166139 -57838 -45418 5478 -152488
11630H1561k5240l709K09579D2868i7079j15902I3677k2411b07842C9269J5941
11619E5210J74374N4024f1983B45394f6066k67051A38979b3691q0923G5603h5364
11607B4558O4437i3046j34765e3918B92109A20978P9322C2086J0799K28068b00899
11595B95715f3050k9527B19269q7923J29504D1538f6091o8249H6298M5699j8571
11584A13426k7861C7079g1700H3324e3829j82723J16930A38481k5557K70248A68052
11572D8987a85046f5159a0024l0483h530C13193h7309m434o8177j4203d1763o0289
11560a02052j9284H8946M30227D0140K7251a1075j72871g7972A03657J03390b25067
11548F0674J28596L10110A17546J07499l2413i3507A20954A9718K74089D427M30812
$$ plain form
11630 81561 56321 52612 262191 42868 -97079 -212981 93677 71266 -207842 39269 55210
11619 55210 229584 283608 -61983 245394 -66066 -333117 138979 -23691 -104614 75603 -85364
11607 24558 88995 -93046 -227811 -53918 292109 120978 200300 32086 42885 270953 -200899
11595 295715 -63050 -92577 219269 131346 260850 41538 -66091 -134340 86298 131997 113426
11584 113426 85565 37079 -71700 83324 -53829 -236552 -119622 138481 112924 383172 168052
11572 48987 -185046 -65159 -10024 -40507 -8530 313193 -87309 -91743 -159920 -174123 -41763 -102052
11560 -102052 -121336 88946 519173 40140 67391 -11075 -183946 -77972 103657 207047 -225067
11548 60674 189270 499380 117546 225045 192632 -93507 120954 19718 293807 4427 435239
11537D35239A17005m338E1194j1248L31334b06960C38658j45393H2944i203C36670
11525A74023n4396b3273A66674a16874A35691J882d8335I8928J55971a310B87443
11513A17950J09276a39245A84997j8167h4450F0649b19917B51296j24835a04918
11502B46212p8230J24389a72352B01655E3319a03050l05204B83106o243P4589
11492C51452d3739D14727a79732B3587L6700h9713D38999k18207a8590E2201K43377
11481B95578L13467b74812b6020E21707A52132B2703P4329L16763A40030K10381
11471C50411E2340K93034b80661A39214l4956a42389D9767K8647c26907C8175
11460E3259I766M44655B09414j04569a0943l83746f5912k09396A22818D0539J5669
$$ plain form
11537 435239 117005 112667 51194 39946 371280 -206960 338658 193265 82944 -9203 336670
11525 174023 119627 -23273 166674 -116874 135691 137573 -48335 98928 254899 -1310 287443
11513 117950 227226 -139245 184997 166830 -84450 60649 -219917 251296 126461 -104918
11502 246212 167982 292371 -172352 201655 53319 -103050 -408254 283106 276863 351452
11492 351452 -43739 414727 -179732 23587 60287 -89713 438999 220792 -18590 52201 295578
11481 295578 609045 -274812 -26020 521707 152132 22703 97032 413795 140030 350411
11471 350411 52340 345374 -280661 139214 104258 -142389 49767 78414 -326907 38175
11460 53259 9766 454421 209414 104845 -10943 -394689 -65912 -275308 122818 40539 56208
11449E6208b73181B56511C2902K82369d2889C13257H7044a18167C7080b01811
11438A23748P0192a03775A10763m8167L0573R2771J09291H9012a00707C14992
11427b5880k63593B2094l147a4652D2925a31217B87625I4212J2122L56404B10002
11415e00451C30969D7878b46624b5617A19511K70012f9441A41113a87689g6198
11404B45187C5449A1290a8038A12814k9584b62474G2261K09114Q1174l5708B4319
11392D57138b1344G4400c2129H6933K16080a4087A70371l5414P7439O0875c99292
11380h348E8743K5956i4865e26k23084O2370B8188M6217C5302J97209H338a5921
11367a08204K6278k39857J25455A17456R7268e8931H734a60339B00930q346a77181
$$ plain form
11449 56208 -273181 256511 32902 315271 -42889 313257 87044 -118167 37080 -201811
11438 123748 193940 -103775 110763 62596 93169 185940 295231 89012 -100707 314992
11427 -25880 -289473 22094 18947 -14652 42925 -131217 287625 94212 106334 462738 210002
11415 -500451 330969 47878 -246624 -25617 119511 389523 -69441 141113 -187689 -76198
11404 245187 35449 11290 -18038 112814 83230 -262474 72261 281375 362549 326841 24319
11392 457138 -21344 74400 -32129 86933 303013 -14087 170371 134957 212396 273271 -399292
11380 -8348 58743 84699 -94865 -526 -223610 -161240 28188 74405 35302 232511 8338 -15921
11367 -108204 -81926 -321783 -196328 117456 214724 -58931 8734 -160339 200930 192584 -177181
11355c61723a71859A92J25154A795c95156a4619m96362B17355J9662b61683Q4079
11344a77604j95968A14368B1380b71901B13184I3249a70702K4226B10777D8354
11333E1601h5913k08049i911j40368k2276A00125a83860i155B13770D459a33871
11321c896p946E7647a28752o9398j39599C12321A06292B2102c17168h3009D00007
11309a21232A79168b44690J07069j66410c2302A06207e2602C43b10340A17522
11298c6222C758J2816a47572l64795a23306B4750b10251g9884j24988h4453A9480
11286f0794K2492A53484c0804B31000q7333n1444L0981o0137b5133l40127a14026
11274e819A85166b07692c3588r0218b7068i482F7170a81306P562h5101L8268A22039
$$ plain form
11355 -361723 -171859 192 125346 1795 -395156 -14619 -510981 217355 237017 -261683 -177604
11344 -177604 -373572 114368 21380 -271901 213184 93249 -170702 -146476 210777 48354
11333 51601 -85913 -293962 -9911 -150279 -172555 100125 -183860 -9155 213770 4459 -133871
11321 -3896 -11842 57647 -128752 -198150 -337749 312321 106292 22102 -317168 -83009 400007
11309 -121232 179168 -244690 -137621 -304031 -32302 106207 -52602 343 -210340 117522
11298 -36222 3758 16574 -147572 -512367 -123306 24750 -210251 -79884 -204872 -84453 19480
11286 -60794 -38302 153484 -30804 231000 143667 92223 123204 63067 -25133 -365260 -114026
11274 -5819 185166 -207692 -33588 -123806 -27068 -9482 67170 -181306 -173744 -85101 -46833 122039
11261F7467a6958G9231O9864a60400c8360J2703G7518a38203L19G2122P5257o166
11249A41213h6157M2090m7860I8907K37636A3130b41009a4285m0993A04768D0844
11237a83104N6802K9989j68196A07378b53656B32001i860k03684j47597d6047
11226a2566j56499H4829a44886B6168M6151Q4070b58626C7208r047g4089l7527
11215a11616d2844F6738a69686H7495a77008F1836B6809C917g4865A69748c62483
11203H0433a08676C24781b98402k8084J36882O0300j0945n5790r312A72502c36533
11191B13070b51717m471b5937m51608i5770k43096A18788k3074D0203b40648e8854
11179b7978j57824A36233a20667B21927I4857a24379B73394b91671A01630a29204
$$ plain form
11261 67467 -16958 79231 149095 -160400 -38360 -25657 77518 -138203 -137884 72122 147379 141213
11249 141213 -86157 -44067 -91927 98907 336543 13130 -241009 -14285 -55278 104768 40844
11237 -183104 -126302 -96313 -264509 107378 -253656 232001 -9860 -213544 -361141 -46047
11226 -12566 -169065 84829 -144886 26168 72319 156389 -258626 37208 28161 -74089 -111616
11215 -111616 -42844 66738 -169686 87495 -177008 61836 26809 3917 -74865 169748 -362483
11203 80433 -108676 324781 -298402 -326486 -189604 -129304 -140249 -196039 -205351 172502 -336533
11191 213070 -251717 -256188 -25937 -477545 -95770 -338866 118788 95714 40203 -240648 -58854
11179 -27978 -185802 136233 -120667 221927 94857 -124379 273394 -291671 101630 -129204
11168C6910a25085l47347a88885A445b9364A3114N63207A87571O8434c34968B55093
11156B13097j5218a3990k46978A72238A7033b40214j87632J87490A45393k9309
11146A16084D3913j3749J81964a80073a5256D1009b1090I809J25479j1130L8816
11135A62974b53699A83281n7019m2525h2099j21757C49603r3781L6174r8101i3597
11123a97766N9308A94307a01424d6661j5383r4138C26646a02348k17029A32335
11112B34173R3558I5506b0080A51794c5454B39171B580a41286B32047Q3613a33507
11100B62213o349J03014A25199K52805a9381B05362C9587L45686j31400m9979
11090B03894D5153J83726L3881a32150G3093J41986J5233A02453J49116H4841
$$ plain form
11168 36910 -125085 -472432 -188885 1445 -29364 13114 576321 187571 256005 -334968 255093
11156 213097 197879 -13990 -260968 172238 17033 -240214 -427846 -240356 145393 116084
11146 116084 43913 30164 212128 -180073 -15256 41009 -21090 9809 135288 124158 162974
11135 162974 -253699 183281 126262 83737 -82099 -203856 349603 255822 291996 193895 -93597
11123 -197766 -138458 194307 -101424 -46661 -62044 -156182 326646 -102348 -319377 132335
11112 234173 327731 95506 -20080 151794 -35454 239171 2580 -141286 232047 315660 -133507
11100 262213 255864 358878 125199 378004 -19381 205362 39587 385273 253873 203894
11090 203894 45153 228879 262760 -132150 73093 215079 230312 102453 251569 84841
11079C51796j29981A03347J25027Q2867N6766A64154F9963J27117q6119C2923
11068C72770D9850K93996L4126r990p6339K63214k06524K26311L062J48578j08204
11057F18080J36102B21294J19358K60272k14067P5970k0267j04538J03234K61582
11047G02838J8816Q4386j51447K17733C23905J11972K16806j71109N3037k9556
11037E05055j24839K08649R3226M2879J3931j33489j79958K59096k31771J41177
11027E93956J21072J50544j40463K21309l63875j76248J35077J69440A34441K89802
11017D24243J80855k04287A10647N84198k79441j77834L94109L2065K3788N357
11007F92889k28692K07631J43349A89583n5597K43872J59921L7888L17542A56163
$$ plain form
11079 351796 221815 103347 228374 311241 368007 164154 69963 197080 110961 32923
11068 372770 49850 343846 377972 367982 291643 554857 348333 574644 577706 726284 618080
11057 618080 754182 221294 340652 600924 386857 462827 442560 338022 441256 702838
11047 702838 721654 806040 654593 872326 323905 435877 652683 481574 534611 505055
11037 505055 380216 588865 682091 724970 738901 605412 425454 684550 452779 593956
11027 593956 715028 865572 725109 946418 582543 406295 541372 710812 134441 424243
11017 424243 605098 400811 110647 694845 415404 237570 631679 663744 687532 692889
11007 692889 464197 671828 815177 189583 133986 377858 537779 575667 893209 156163
10996F12182K06955l28146J96036k13423j9609M47901k12844j00458Q3913j27997
10986E44510K89156K44923j89215l38813N64540o1778N8510m9322R9283L90430
10976A552224J42207p5227P56996k76496O92191m12747k40770M41512m81898J2737
10966B110729n37464j72521J63652r4730l88766L21394n0218L83008L9971k61760
10956A513295J39296l34543O5128j84364j30488j90289j52481r3295k39077K38420
10946F31602A07750N6646J7014o5749L33251A82354H8212L8081o293a78966c1041
10934B94064C8865a79453D1455Q2559i0246A67019J65163G8881k256L19069c31943
10922A28394k3766b05487J7824P005M4040K4842A79947a90531G1215a90965A11153
$$ plain form
10996 612182 819137 490991 687027 473604 453995 901896 689052 588594 672507 544510
10986 544510 833666 1078589 889374 550561 1115101 1053323 1111833 1062511 1161794 1552224
10976 1552224 1694431 1619204 2376200 2099704 2791895 2379148 2138378 2579890 2097992 2110729
10966 2110729 1573265 1400744 1564396 1469666 1080900 1402294 1352076 1735084 1775055 1513295
10956 1513295 1652591 1318048 1383176 1198812 1068324 878035 725554 632259 393182 631602
10946 631602 107750 164396 181410 115661 448912 182354 88212 126293 120000 -178966 -31041
10934 294064 38865 -179453 41455 124014 -90246 167019 332182 78881 76625 395694 -331943
10922 128394 104628 -205487 -187663 -180658 -136618 -111776 179947 -190531 71215 -190965 111153
10910B44132q989j977c2599n5746L2346j45923m9061B27697a54436B64516E5818
10898A49222j6608a9339l7497k3896A56500a4568B6854b9933F5175L3129C514
10886B29950H8813N1025g5303j7102J1032p2044j42275A57763b7505j14509C8343
10874e19732E4912a07403G9039b39710N2145g3865G4297N6080a10068m7858A27327
10862D53973A80811j613a39185A59127j8560J7417e228C04983B2444c4767o2059
10851i6826A67544m7432c81777J79948A85848d5501p4220A9378f2466B9695L47899
10840C77594F2043b2494j16250p1130n448G0791h6166G2164B8826P5391K20965
10829C25182G5665a30341A95860G9804J94418b10335F70J13935A4386a62013k66032
$$ plain form
10910 244132 235143 233166 -32599 -88345 -55999 -201922 -250983 227697 -154436 264516 55818
10898 149222 132614 -19339 -56836 -80732 156500 -14568 26854 -29933 65175 98304 3514
10886 229950 88813 139838 -75303 -92405 -81373 -153417 -295692 157763 -27505 -142014 38343
10874 -519732 54912 -107403 79039 -239710 -187565 -73865 74297 130377 -110068 -157926 127327
10862 453973 180811 179198 -139185 159127 140567 157984 -5228 304983 22444 -34767 -96826
10851 -96826 167544 120112 -381777 -201829 185848 -45501 -119721 19378 -62466 29695 377594
10840 377594 62043 -22494 -138744 -209874 -215322 70791 -86166 72164 28826 104217 325182
10829 325182 75665 -130341 195860 79804 274222 -210335 670 114605 14386 -162013 -428045
10818d28045G5969c26642a2583n980B43089d90946b6356A4694a18985A51784b7954
10806a07310l9845k3987O521k62665a48247B57819c9931B8311j3958d5530k05625
10795b51155A69967D4365b02397c977j62556M6139j15958K8932M5086B75173d7193
10783G2456a04473I9964a81298r4088N5543Q8370n1532A08813n811a54669F1506
10771a32961M9669B32029C357a19819o5029F9398A3252J92309A4933b38940j54858
10760c93798H4979b19379j2137b8923k25654I405J4279b00407H3255a22692J4914
10749a07778k55585a50485q9532f497j15936C7243J24380c3324j89761C05354
10738d41979i9286j83076J27848A07790J3849a7413B73496j19392a23356F0131
$$ plain form
10818 -428045 75969 -326642 -12583 -18563 243089 -490946 -26356 14694 -118985 151784 -27954
10806 -107310 -147155 -171142 -164621 -427286 -148247 257819 -39931 28311 14353 -45530 -251155
10795 -251155 169967 44365 -202397 -3977 -166533 -120394 -236352 -207420 -162334 275173 -47193
10783 72456 -104473 99964 -181298 -275386 -219843 -131473 -183005 108813 103002 -154669 61506
10771 -132961 -83292 232029 3357 -119819 -184848 69398 13252 205561 14933 -238940 -393798
10760 -393798 84979 -219379 -231516 -28923 -254577 9405 23684 -200407 83255 -122692 -107778
10749 -107778 -363363 -150485 -240017 -6497 -122433 37243 161623 -33324 -223085 305354
10738 -441979 -99286 -282362 -154514 107790 121639 -17413 273496 154104 -123356 60131
10727G3482R0000a5384A4752J02235M2137J36203a35230C934a85779I8735K18005
10716C16740A3786b59116J0594C8571j115i4845A99966a65321k1108a7387j14700
10705a32087m8132n8754o1171f9484J4914I5527A9741b9548k10J1554l49932J45654
10693b22482E7075a12270l38484a43081D30692b21859B07125l0794a40314q679
10683a48993e2929H3978c3719A98299m8846J05522d41328i4868j20084C18663
10672h7436A50020a39367H5993b7425j57987A59707J14352c59874g4598A96141
10661F6877a43647m5268h6842k1992G6235a42206j68810J08249b9173A5787e5764
10649A85905a74093P3420a3211I1813L25631a07591A8052K43054I9282b29863
$$ plain form
10727 73482 163482 -15384 14752 116987 159124 295327 -135230 3934 -185779 98735 316740
10716 316740 13786 -259116 -248522 38571 37456 -94845 199966 -165321 -186429 -17387 -132087
10705 -132087 -180219 -238973 -300144 -69484 -54570 95527 19741 -29548 -29758 -18204 -368136 -222482
10693 -222482 57075 -112270 -450754 -143081 430692 -221859 207125 176331 -140314 -148993
10683 -148993 -52929 83978 -33719 198299 149453 254975 -441328 -94868 -214952 318663
10672 -87436 150020 -139367 85993 -27425 -185412 159707 274059 -359874 -74598 196141
10661 66877 -143647 -188915 -86842 -108834 76235 -142206 -311016 -202767 -29173 15787 -55764
10649 185905 -174093 -100673 -13211 91813 417444 -107591 18052 261106 99282 -229863
10638b34480I4185K9972i3142j09856k71397J04752a44015M5504F6458b52099
10627e9950C65080I9245J01946d77441d2625A32245E2222k5891a29165j277j18224
10616b48666A85395b75089A55874d2753m60357i3607m3121C5434K8692J26524
10606A90650c9997C14534f3609p2291m6408B12c31690H1325L95090a81360d8495
10594c00406e8831k25067Q3908A06444a60559a9272j32332n1241j12347O7442
10584b47750C00570O0152a59492d1347A70276a57427k1150B724K38503a05047
10573d91536C5802A1727i3290j55459j88484a14387B7891J40675c34466A14857
10562a38250L6504d9545D24215e47017I0132e3998K3223m40626A93152c03029
$$ plain form
10638 -234480 94185 124157 -93142 -202998 -474395 -369643 -144015 -98511 66458 -252099
10627 -59950 365080 99245 201191 -477441 -42625 132245 52222 26331 -129165 -130442 -248666
10616 -248666 185395 -275089 155874 -42753 -503110 -93607 -136728 35434 64126 190650
10606 190650 -39997 314534 -63609 -135900 -182308 212 -331690 81325 476415 -181360 -48495
10594 -300406 -58831 -283898 -199990 106444 -160559 -19272 -151604 -202845 -315192 -247750
10584 -247750 300570 360722 -159492 -41347 170276 -157427 -178577 2724 241227 -105047
10573 -491536 35802 11727 -93290 -248749 -437233 -114387 27891 168566 -334466 114857
10562 -138250 -101746 -49545 424215 -547017 90132 -53998 -30775 -471401 193152 -303029
10551B456Q2252a7700B20807f3914B10583b04546Q4512L7920j45052i1838A80902
10539a95380p9114i6879j24202E9610a53318i162j31440K3446j04434A7282a44433
10527f5564j16778a4269j44188B03717F2727K45863a79496a6606j71009A33605
10516A20375b85419A88978a87158g5822B70412A637c07281P4326A75711b26449
10505B5770f4627k14927A20582a9114B5966J51036a30862L7594A13756a66014
10494b29753M9844J6294A69118Q062C6682G677d0346A87205e8749r4707F5109
10482B65262J27643J69966k3359k04321o1317a819k96678K6931p7857A66301A4705
10470b45442I1871e907I9016r961J98499r0752N0429B1385a42105l742C25477
$$ plain form
10551 2456 84708 -17700 220807 -63914 210583 -204546 -120034 -82114 -227166 -91838 180902
10539 -195380 -274494 -96879 -221081 59610 -153318 -9162 -140602 -117156 -221590 17282 -144433
10527 -65564 -182342 -14269 -158457 203717 62727 308590 -179496 -16606 -187615 133605
10516 120375 -285419 188978 -187158 -75822 270412 1637 -307281 -232955 175711 -226449
10505 25770 -64627 -279554 120582 -19114 25966 177002 -130862 -93268 113756 -166014
10494 -229753 -179909 -163615 169118 177180 36682 7677 -40346 187205 -58749 -153456 65109
10482 265262 392905 562871 539512 335191 273874 -1819 -298497 -271566 -349423 166301 14705
10470 -245442 91871 -5907 99016 89055 287554 196802 247231 21385 -142105 -145847 325477
10458C37378A1419a70843c4806A60233M889L8174b2066B5165a18799k12617B76979
10446A13808C274Q9163i3735B2783M9129a46303A85792E4258a50728b2469k06425
10435b28894C4420b0685k09683D9131J611d3430B55468C0447d7657A43886n5727
10424H8159b54772J04968k1357A28134M2871R4474g6686K9870C113L0682K26237
10413B60032b15136B58344a01252j0314j53169E5090b616j28453H4962a44214
10402b47144k7520a35139A42638f2289j52471i2221A1324J19651J29433J09477
10392C69885j42244j4888G3299a04784A07377C5559N240J67449b87139a14367
10381C89797I8393K67794H4616J61812A09929L72528j87062L6988j06642L0815
$$ plain form
10458 337378 11419 -170843 -34806 160233 165122 203296 -22066 25165 -118799 -331416 276979
10446 113808 3274 92437 -93735 22783 71912 -146303 185792 54258 -150728 -22469 -228894
10435 -228894 34420 -20685 -230368 49131 50742 -43430 255468 30447 -47657 143886 88159
10424 88159 -254772 -149804 -171161 128134 171005 265479 -76686 -46816 3113 33795 260032
10413 260032 -215136 258344 -101252 -111566 -264735 55090 -2616 -131069 84962 -144214
10402 -247144 -274664 -135139 142638 -62289 -214760 -92221 11324 130975 260408 369885
10392 369885 227641 212753 73299 -104784 107377 35559 40799 208248 -287139 -114367
10381 389797 98393 366187 84616 246428 109929 482457 295395 332383 225741 256556
10371B56556I1586a67139b1B74783a2293F95236j3326A8147K66566B2882Q0980
10360A03862O4453L3321a95352p3014A87483G0482K67061Q8271R9247k09326j01700
10349B14035L93530A25076K20203e9957B19539L46789J60134B50674q9815l5195
10339A25664o2189j3533J3688K71177A25852O6652a17398A73556j1377l8350A5958
10327a89616g196E10707a32455C5318J44617J77333p1151D7672J37663a65024
10316A91683J46740O3985D9502c6993A73582d6679A24979N6339i2520j82675A06426
10304B3819i3467K7940A29966F579K79241Q1464E6677i737k71614B18907c2636
10292A90668a70960B28003a02523Q571L6388N346j9425A87264b00199g8545f43
$$ plain form
10371 256556 91586 -167139 -21 274783 -12293 695236 681910 18147 284713 22882 103862
10360 103862 168315 201636 -195352 -268366 187483 70482 337543 425814 525061 315735 214035
10349 214035 607565 125076 345279 -59957 219539 566328 726462 250674 160859 125664
10339 125664 63475 49942 63630 334807 125852 192504 -117398 173556 162179 123829 15958
10327 -189616 -7196 510707 -132455 35318 179935 357268 286117 47672 185335 -165024
10316 191683 338423 402408 49502 -36993 173582 -46679 124979 181318 -92520 -275195 106426
10304 23819 -93467 -65527 129966 6579 285820 367284 56677 -9737 -281351 218907 -32636
10292 190668 -170960 228003 -102523 -93952 -57564 -52218 -71643 187264 -200199 -78545 -643
10280a28376e696l28464d9532a4695k59442a23626k4306M8297j58861C2192a08575
10268H0734E057J43059c024A69288a45055N6797E42230A96440O6907I0763J14966
10257B05729I5741a08434B49146e6640A32486b60838g3962k5352p2286A24045
10246a08288L1206o4211I5639A0431a0245C0469a22394n4931A0737K2195a63488
10234h5510m0378A45194a47377p0082C92039A21070c0295k63618F1998b8300m6918
10223g5218j91664r5B00415l5528H303b2070j97117G2938k9564a07025B0481i5874
10210a89343C277a47651f312l73191C4692L43730b04948A66503b08872a5738o2460
10199g8198r8205n9721k3408J20330B9130a37082m62322K43411A12930a4364A92220
$$ plain form
10280 -128376 -5696 -334160 -49532 -14695 -274137 -123626 -147932 -99635 -258496 32192 -108575
10268 80734 5057 148116 -3024 169288 -145055 -88258 542230 196440 263347 90763 205729
10257 205729 95741 -108434 249146 -56640 132486 -260838 -73962 -99314 -171600 124045
10246 -108288 -77082 -141293 95639 10431 -10245 30469 -122394 -177325 10737 32932 -163488
10234 -85510 -125888 145194 -147377 -217459 392039 121070 -30295 -293913 61998 -28300 -75218
10223 -75218 -266882 -266977 200415 164887 8303 -22070 -219187 72938 43374 -107025 20481 -95874
10210 -189343 3277 -147651 -6312 -379503 34692 378422 -204948 166503 -208872 -15738 -78198
10199 -78198 -176403 -236124 -259532 -139202 29130 -137082 -599404 -355993 112930 -14364 192220
10187a23076O0604B94992F8128b52028c4980k8253j08523B71830J00999a50045
10176D948J44813P3813g8047k26447E6988a77k14963b0725E8247c0697A2103a37394
10163b17779r5724H4059i0458j99320e0910j64253C88363b7264j69709k9589B21648
10151C7466K6230a33454a3191l81776a79414k3791B36080C4029J04820b7649F7627
10139a79300A40296K40117f0042A4073c0028j99112i7134c592G1947N3836a02890
10127d0315m8536j22639a05701I729h3414B30151C7570R6272a11539C59477d27840
10115b29425M2280F2318a12951j81403B38415h4212F3467a34795H6944J76388
10105B63332a42556d7691j17594J5838d4375I2174a73352B5094a02896l212B96666
$$ plain form
10187 -123076 -62472 294992 68128 -252028 -34980 -63233 -171756 271830 372829 -150045
10176 4948 149761 223574 -78047 -304494 56988 -177 -215140 -20725 58247 -30697 12103 -137394
10163 -217779 -313503 84059 -90458 -289778 -50910 -215163 388363 -27264 -196973 -226562 221648
10151 37466 63696 -133454 -13191 -394967 -179414 -203205 236080 34029 138849 -27649 67627
10139 -179300 140296 380413 -60042 14073 -30028 -229140 -97134 -3592 71947 125783 -102890
10127 -40315 -88851 -211490 -105701 9729 -83414 230151 37570 133842 -111539 359477 -427840
10115 -229425 -187145 62318 -112951 -294354 238415 -84212 63467 -134795 86944 263332
10105 263332 -142556 -47691 -165285 -149447 -44375 92174 -173352 25094 -102896 -106108 296666
10093A76772c9131j14331O7373k31414a41302L9546G8536c1851D15734a22283
10082a21554N3173K8838k52014g7654j0269f934D657K9540a54104E4106c42193
10070a96k65192d8192j33490A08574D5036a14153B151c01277A18310d9341B13175
10058B10560c59550h6480I2928b10014B23925g5638j73738B1001Q8275L7993d43573
10046e04326a57055K8258a120j49984g2373B60310a78125r2116A11531c9253j22000
10035a61253G7168c64280j0079C01025b68349N9659r5736J43872D1432R9874g4932
10023G4679B8197K17315G5807a31944m4588e4687Q04j46947B8705K1149b17197
10011a57173B75071c44789b4321q8656J6160F1601k6508A0461a75251F0440e3438
$$ plain form
10093 176772 -39131 -153462 -86089 -317503 -141302 -101756 78536 -31851 415734 -122283
10082 -121554 -68381 -39543 -291557 -77654 -87923 -6934 4657 34197 -154104 54106 -342193
10070 -196 -265388 -48192 -181682 108574 45036 -114153 2151 -301277 118310 -49341 213175
10058 210560 -359550 -86480 92928 -210014 223925 -75638 -249376 21001 109276 147269 -443573
10046 -504326 -157055 -128797 -1120 -151104 -72373 260310 -178125 -270241 111531 -39253 -161253
10035 -161253 77168 -364280 -374359 301025 -268349 -208690 -304426 -160554 41432 141306 -74932
10023 74679 28197 245512 75807 -131944 -176532 -54687 -53883 -200830 28705 49854 -217197
10011 -157173 275071 -344789 -24321 -112977 -96817 61601 35093 10461 -175251 60440 -53438
9999b49108h9807H8822c32368a33979D2629b84783A61824b38301H8589J55339
9989B43928a01599k45738c6H6840l2639M1736K7018h9379k1883C20343A57188
9977B49442a66647C6056a51514j59841k31431A76125a31187B1848R2881b61512
9966c863j50777k45027B91450b28708R2847q3338b9950k74503a38990J4309n84230
9955g08911e9021p0122B8539J76790G8583J32535J04713C1022g9772l7863F685
9943e5079l08781A6842J50b33862G5284b2148D9976B0434a46787j44876g1571
9931e3091B22301A08793a45710l9554j54519H8618Q4934R5130a59371J8622B05751
9919A04572A197b46592O7715k36439A12756a6892l10513P8546k1660F429c14291
$$ plain form
9999 -249108 -89807 88822 -332368 -133979 42629 -284783 161824 -238301 88589 243928
9989 243928 -101599 -347337 -36 86840 54201 95937 122955 -89379 -111262 320343 157188
9977 249442 -166647 36056 -151514 -311355 -542786 176125 -131187 21848 114729 -261512
9966 -3863 -154640 -399667 291450 -228708 -135861 -219199 -29950 -304453 -138990 -124681 -708911
9955 -708911 -59021 -129143 28539 205329 78583 211118 315831 31022 -79772 -117635 6685
9943 -55079 -363860 16842 16992 -233862 75284 -22148 49976 20434 -146787 -291663 -71571
9931 -53091 222301 108793 -145710 -185264 -339783 88618 173552 268682 -159371 -140749 205751
9919 104572 1197 -246592 -178877 -415316 112756 -16892 -327405 -248859 -270519 6429 -314291
9907A10497b47218a6383A32168i3858K7365k98668e3742B2448b5017j94010A72905
9895B33477a89912j51941a53247b5853j23040L1874A58329B2503A312N2091a33100
9883C4588K94667E5908N5273b10674N9153l65274a53029l7073D44667A00916e7136
9871a42452e6100E2762f784m6121m7314A22249b26395A85518e1926k3381r3134
9860a68441A48632E9418c2688a0531n3506F1419a47877O2660o4888k6066j65790
9849c41961b3260j04304l1230e0416C9895a23431C3529Q5732R1771a44233B11293
9837E6740C635a69281A55812c97028J04082n741a48011c6896H8161a19934D44175
9825A63081b18742J02974A88460b50145A92068D9403c29729r77i2969l97529G54
$$ plain form
9907 110497 -247218 -16383 132168 -93858 -66493 -365161 -53742 22448 -25017 -219027 172905
9895 233477 -189912 -341853 -153247 -25853 -148893 -117019 158329 22503 1312 53403 -133100
9883 34588 329255 55908 111181 -210674 -151521 -516795 -153029 -190102 444667 100916 -57136
9871 -142452 -56100 52762 -6784 -52905 -100219 122249 -226395 185518 -51926 -75307 -168441
9860 -168441 148632 59418 -32688 -10531 -64037 61419 -147877 -85217 -150105 -176171 -341961
9849 -341961 -23260 -127564 -158794 -50416 39895 -123431 33529 119261 211032 -144233 211293
9837 56740 3635 -169281 155812 -397028 -292946 -298687 -148011 -36896 88161 -119934 444175
9825 163081 -218742 -115768 188460 -250145 192068 49403 -329729 -330706 -92969 -490498 754
9813d404A9263e3795A69244b9400E2158J3257j7790a8666j8433k35312B176K48773
9801B50949i2687l13555a10158A47319L4579q9293R2591c74303a39542j77897
9791c17439I2691L5277c4102m1138A28711b1145j2478a70p2371j61657A01177
9779e8610E544b02450M546M5480e9415A41848a12790k8692C4815j5452L58816
9768C78179j79095c4872j39423B27572f4358j08506m0557A54257a38132J9217
9758a18915p526a9406m72985c6700j52379N0121J5848N9004A33120h3111F876
9746f0928p0561E3864d16781B40375E5701a81267C7867b9557j95311c4117k88417
9735c22534D50012c71241k07993K17983A69819c99104i8832m8763l77627A13618
$$ plain form
9813 -4404 19263 -53795 169244 -29400 52158 65415 47625 -18666 -37099 -272411 2176 250949
9801 250949 -92687 -406242 -110158 147319 181898 92605 185196 -374303 -139542 -317439
9791 -317439 92691 127968 -34102 -75240 128711 -21145 -33623 -170 -72541 -234198 101177
9779 -58610 5544 -202450 -197904 -152424 -59415 141848 -112790 -141482 34815 19363 378179
9768 378179 199084 -34872 -174295 227572 -64358 -172864 -213421 154257 -138132 -118915
9758 -118915 -126441 -19406 -492391 -36700 -189079 -138958 -123110 -64106 133120 -83111 6876
9746 -60928 -131489 53864 -416781 240375 55701 -181267 37867 -29557 -224868 -34117 -322534
9735 -322534 450012 -371241 -579234 -361251 169819 -399104 -98832 -147595 -525222 113618
9724c03688A57297J33043C4875d48319e5344H2421e55720a53208o3171i1831B9481
9712a73252e2921I7197J0124N461b16328j58570f7435A23594c67243A2587a12576
9700b85831a17753A8300a36520L1613F2441A4854e3146A75561C216a51324L7421
9689a13903k11714d1476C21158a66572C49297I4953L6071h8790l03948a79935
9678D2421a89781k1384d4956A02714b7313j18695h019A62820a82699E3222h1210
9666d8248I6013i5303J9729k08980D5544L04854c5239G5557K26761g9140A5481
9654A43357f5189j53591F8348a19589M9296k99085F2030c85715A90724a55320
9643b24054m5278a05402I8215b94893P8070C53338e9902j37752j53988J15753
$$ plain form
9724 -303688 157297 290340 34875 -448319 -55344 82421 -555720 -153208 -216379 -91831 29481
9712 -173252 -52921 97197 107321 112782 -216328 -374898 -67435 123594 -367243 12587 -112576
9700 -285831 -117753 18300 -136520 -104907 62441 14854 -53146 175561 3216 -151324 -113903
9689 -113903 -325617 -41476 321158 -166572 349297 94953 131024 -88790 -392738 -179935
9678 42421 -189781 -211165 -44956 102714 -27313 -146008 -8019 162820 -182699 53222 -81210
9666 -48248 96013 -95303 -75574 -284554 45544 350398 -35239 75557 302318 -79140 15481
9654 143357 -65189 -218780 68348 -119589 -70293 -369378 62030 -385715 190724 -155320
9643 -224054 -269332 -105402 98215 -294893 -216823 353338 -59902 -197654 -351642 -235889
9633b35889F3632J54654M5689G1176b08523D3139K6166b59185B17933a1749o7884
9622g9633p0884d2301i698k39318e3170Q101I3793b01075j11431h6287j33616
9611b19903j42767g5134b6630E4500c26522R7233B29815C5098q21a70549A82852
9599b08754N4444B45719b97715C7859K78492j16297F2328K987J80460l6020a50899
9587c25828A09190a91654N1485j8586N1520l8853j79361d7087j2812A66196h4403
9575a52765E07J84399L0995F6192a74052A19764a67066O8662A80458c11353R4244
9564b17109i7254d30n8973m0696A07982K1374a7205l00551f6081j56585F6897
9552b80579J10205G2614B4315a62695f874j51603N9585l0002e7684k6235B80139
$$ plain form
9633 -235889 63632 218286 263975 71176 -208523 43139 69305 -259185 217933 -11749 -79633
9622 -79633 -150517 -42301 -9698 -249016 -53170 -45069 93793 -201075 -312506 -86287 -219903
9611 -219903 -362670 -75134 -26630 54500 -326522 -229289 229815 35098 34277 -170549 182852
9599 -208754 -154310 245719 -297715 37859 316351 200054 62328 65315 245775 209755 -150899
9587 -325828 109190 -191654 -140169 -158755 -107235 -146088 -325449 -47087 -59899 166196 -84403
9575 -152765 507 184906 215901 66192 -174052 119764 -167066 -98404 180458 -311353 -217109
9564 -217109 -97254 -430 -59403 -100099 107982 129356 -17205 -317756 -66081 -222666 66897
9552 -280579 -170374 72614 24315 -162695 -6874 -158477 -98892 -128894 -57684 -83919 280139
9540a74353K1620D4176M51971A69238R8760a54473g3176l0372l1870l954j53508
9529b92880J35874r1602B42945a69078I658J78396d2737B0934c05990e0055r2461
9518a42516O2787C8459Q3077b5279j72891A86020E3194i8605k56634h4684B44723
9506a48264O4234d1426A26023a63902J2432l61805a66239k18243J86679E0445
9495B95672b99682b779k2091k39386H7132c7477A41091J65955C5617N6759b69812
9483D0929J98200b17910P4880H2365i5299j88645a8899E0221A1985J41573a55906
9471a53434L8503k30143a20991l4930m1028k02083J95325A43350P4191B4809J5875
9460D0684c9197L839A0202a21857I2445a03120j19755H4233A259b03222C6063
$$ plain form
9540 -174353 -152733 44176 496147 169238 267998 -154473 -73176 -103548 -135418 -139372 -292880
9529 -292880 -157006 -248608 242945 -169078 9658 188054 -42737 20934 -305990 -50055 -142516
9518 -142516 -79729 38459 121536 -25279 -198170 186020 53194 -98605 -355239 -84684 244723
9506 -148264 -84030 -41426 126023 -163902 -151470 -513275 -166239 -384482 -197803 50445
9495 295672 -299682 -2779 -24870 -264256 87132 -37477 141091 307046 35617 92376 -269812
9483 40929 239129 -217910 -143030 82365 -95299 -283944 -18899 50221 11985 153558 -155906
9471 -153434 -114931 -345074 -120991 -155921 -196949 -399032 -203707 143350 217541 24809 40684
9460 40684 -39197 -35358 10202 -121857 92445 -103120 -222875 84233 1259 -203222 36063
9448A70080d52981a98872n5094A60h2160p4040A42356a62215A16583f2244j90100
9437b52344F3033i1367K8550m0088G4989a22831m5153I2962L8650K7956G1698
9425B77437A10772a27888O0818j60259B58133j22293n3315c92628h2404F1281
9414g9683o4825k73642j4565a3308A6747L0441L5198a36801E9398c049j88590
9403a91639g0196A1698e9687h811B16092a09559k82509A60164p2245a38035K3047
9392a14988D8085b98783C4644c33746A10b94354r1071d5097B22198A10484A0549
9380B9179j0788i2095E7668a99405j09918N6236g2509j82013K5369f3638m7796
9369a11434r1668J8442f4702A18009m91J76994b57527A67156a78576D39643j89708
$$ plain form
9448 170080 -452981 -198872 -253966 160 -82160 -156200 142356 -162215 116583 -62244 -252344
9437 -252344 63033 -91367 -62817 -102905 74989 -122831 -167984 92962 131612 159568 71698
9425 277437 110772 -127888 -67070 -227329 258133 135840 82525 -392628 -82404 61281
9414 -79683 -144508 -418150 -432715 -13308 16747 47188 82386 -136801 59398 -3049 -191639
9403 -191639 -70196 11698 -59687 -8811 216092 -109559 -392068 160164 87919 -138035 -114988
9392 -114988 48085 -298783 34644 -333746 110 -294354 -385425 -45097 222198 110484 10549
9380 29179 18391 -92095 57668 -199405 -309323 -253087 -72509 -254522 -229153 -63638 -111434
9369 -111434 -203102 -184660 -64702 118009 117518 294512 -257527 167156 -178576 439643 249935
9358B49935a44409l76519J07211B36629J932K03827B944M4897a84970o3120m2481
9347b90571e4799E0259J56632r3015c84747A33944c6490B71374E8583a40082A66641
9335A70445b2577a627l6689m21692Q7608a4584k49460l7209l9469D4387e6665
9323b9394I7382c3833j05811E0383Q2674f2012k7021j32016A90837b65980H4293
9311b86746a12784p7280i4161k53868j03941I4163h1873l38882a79986A2758b004
9299I0120A7381J35515k1224O1006c8510q4835a5811j51337F6805b06547A54327
9287A43362E0955a11224j3014j20037A37258c4129G8413a08708I5866b47520f8009
9275a36762E1615a55890C19821j13819J1201J2866b23087B84606C0996J59214
$$ plain form
9358 249935 -144409 -520928 -413717 236629 238561 442388 2944 47841 -184970 -248090 -290571
9347 -290571 -54799 50259 206891 113876 -384747 133944 -36490 271374 58583 -140082 166641
9335 170445 -22577 -1627 -38316 -460008 -372400 -14584 -264044 -301253 -340722 44387 -56665
9323 -29394 97382 -33833 -139644 50383 133057 -62012 -89033 -221049 190837 -265980 84293
9311 -286746 -112784 -190064 -94161 -348029 -451970 94163 -81873 -420755 -179986 12758 -2004
9299 90120 17381 152896 131672 192678 -38510 -123345 -15811 -167148 66805 -206547 154327
9287 143362 50955 -111224 -124238 -244275 137258 -34129 78413 -108708 95866 -247520 -68009
9275 -136762 51615 -155890 319821 206002 217203 230069 -223087 284606 30996 190210
9265A90210e3154j41477L9515n7146o4326J2820B02802E4627c9431D8903c30760
9253c42139j9427A24353a36232A13199L6607n0044a10771K2703G4118k86a64420
9241b327k46925A84288a97978A0488a93205r2873k03561a47880k60431A77760
9230a49176K3871r5088n3318j51272b01486g1313A69375g9029J1926A53164o1957
9219I1207J18135a20372F8123a17494c9283I9782d2565l07122B03565b02903C6884
9207A74674m0670c04865P7378b5748j73718D7137f6370K8519j9969B99894q3649
9196B16245q2008l3938D9207b38599g2434o959n3229e6801j879A78312d40663
9184B86607D5447i0101R728j13658p838L6044j50200A54042b68198c8429j33144
$$ plain form
9265 190210 -53154 -194631 -155116 -212262 -276588 -263768 202802 54627 -39431 48903 -330760
9253 -342139 -361566 124353 -136232 113199 149806 99762 -110771 -88068 74118 73832 -164420
9241 -2327 -249252 184288 -197978 10488 -193205 -286078 -489639 -147880 -408311 177760
9230 -149176 -125305 -220393 -273711 -424983 -201486 -71313 169375 -79029 -67103 153164 91207
9219 91207 209342 -120372 68123 -117494 -39283 99782 -42565 -349687 203565 -202903 36884
9207 174674 134004 -304865 -227487 -25748 -199466 47137 -66370 -37851 -57820 299894 216245
9196 216245 134237 100299 49207 -238599 -72434 -79393 -132622 -56801 -58680 178312 -440663
9184 286607 45447 -90101 -80373 -194031 -201869 -165825 -316025 154042 -268198 -38429 -171573
9173a71573B62230A14819b11837A02715M4785o0106C6277b32483J2925O7378A41179
9161A2591i9970j30159B06900b04760A11323a73573d6841C24892G7487a08345
9150C38502g8422j35626A35769P4405I1612b4006D5740b37612b081A30210E6467
9138b87992B02893g2886j52959e7301j5839A54234A3907L8409L6079J47949f1712
9126B47628G5227a13232j45271B64804c31957a45829k0282a3970j52704F7190
9115B135a52410j85743B0234J12356J6153J35270F9108c8610A41532a9581L051
9104a6530j70723f6343l7231E4633h7616A91297b06048G2796h0845m3140J0993
9093a12992p3467Q633B36026R015c28122R891a06527q7103J2116A07702O4661
$$ plain form
9173 -171573 262230 114819 -211837 102715 147500 87394 36277 -232483 -219558 -152180 141179
9161 12591 -99970 -230129 206900 -204760 111323 -173573 -46841 324892 77487 -108345
9150 338502 -78422 -214048 135769 210174 91612 -24006 45740 -237612 -2081 130210 56467
9138 -287992 202893 -72886 -225845 -57301 -73140 154234 13907 52316 88395 236344 -61712
9126 247628 75227 -113232 -258503 264804 -331957 -145829 -166111 -13970 -166674 67190
9115 2135 -152410 -338153 20234 132590 148743 284013 69108 -38610 141532 -19581 -16530
9104 -16530 -187253 -66343 -103574 54633 -87616 191297 -206048 72796 -80845 -123985 -112992
9093 -112992 -186459 -177826 236026 245041 -328122 -318231 -106527 -193630 -181514 107702 172363
9082A72363a50518c0216E0392c55250a44391a6384B9671J4269J31755h3151c5978
9070A01330B2279b40911B36484r2202A0802K60140K9784d543k70633A44828j2923
9059A31905b07403A12934a94345g6313j57124K0987j70906A00054D8111i2267
9048b99402i038j09615B1382H129L5578b82707c408j43228M8385p6351j7422e1388
9035D7790e0419B7972M9856P4426a22895A73215N676b93555O1874b6451n7394
9024h3845k26646a26000A88261E2161a50661r9663j06378A06749k36b34150e6573
9012A78645d594j42573B27269A908b12663i2268n219k43575C6399J07800l9023
9001A05176b66554J04169p5342j14100A15694h8588j9743M2999J5001G9876b53429
$$ plain form
9082 172363 -150518 -30216 50392 -355250 -144391 -16384 29671 43940 175695 -83151 -35978
9070 101330 22279 -240911 236484 144282 10802 270942 300726 -4543 -275176 144828 131905
9059 131905 -207403 112934 -194345 -76313 -233437 -212450 -383356 100054 48111 -92267
9048 -299402 -9038 -118653 21382 8129 43707 -282707 -3408 -146636 -98251 -174602 -192024 -51388
9035 47790 -50419 27972 77828 152254 -122895 173215 178891 -293555 -231681 -26451 -83845
9024 -83845 -310491 -126000 188261 52161 -150661 -250324 -356702 106749 106513 -234150 -56573
9012 178645 -4594 -147167 227269 1908 -212663 -92268 -97487 -341062 36399 144199 105176
9001 105176 -266554 -162385 -237727 -351827 115694 -88588 -108331 -65332 -50331 79876 -253429
8989a04288B021a63243D2593O7320h1394l71454d1077k59874A5328b08605L9962
8978a68643k54255h6752d1484k9458H9347b00076R0189B10671J4215c77981H8887
8966a13701q2318m550l9352b1933k41770J08248o187K4882A35611a0182r9893
8955a10075j71142O3524H7421J1830c40352A09624l6635a23017A02308a49958
8944b52195A442J73324B227J66090l6024J19137b3484k33975a20793D49903A80416
8932f5958j0350p6599F2239J05471b13827H7550K83539L19167J72142L349364
8922D211762J1798056G093565A616338A61685J54550b5816D7995b45833A42175
8912a6999o554p9591A74758P8226J87881A92561b01671c8721D7696i0697O085
$$ plain form
8989 -104288 2021 -163243 42593 109913 -81394 -452848 -41077 -300951 15328 -208605 -168643
8978 -168643 -422898 -86752 -41484 -70942 89347 -200076 -109887 210671 224886 -377981 88887
8966 -113701 -196019 -200569 -239921 -21933 -263703 -155455 -161642 -136760 135611 -10182 -110075
8955 -110075 -281217 -217693 87421 99251 -340352 109624 72989 -123017 102308 -149958
8944 -252195 1442 174766 2227 168317 132293 251430 -23484 -257459 -120793 449903 180416
8932 -65958 -76308 -152907 62239 167710 -213827 87550 371089 690256 862398 4211762
8922 4211762 16009818 7093565 1616338 161685 316235 -25816 47995 -245833 142175
8912 -16999 -23553 -103144 174758 252984 440865 192561 -201671 -38721 47696 -90697 -84612
8901h4612D6979b2219j21374q0123A14709A6709N2391R9502l2646n7448J79708
8890B58216a92326E758b41024B56140a53581a750l18459o9127J59664h9478D9101
8878b47362A09523a25056A78734a13868k9799B62148a96046j46274n9582D03707
8867g7881C2811c7227j143C23493a56402j16723i6179o5043j53328i2580d1793
8855e5298j67360l4480M855B07079I4958n239b39026A70232G659L0418K1878J60848
8843B20803B6920b96600J33840B6058e31917K36753j5820d0810n1884A85640C6445
$$ plain form
8901 -84612 46979 -22219 -143593 -223716 114709 16709 69100 168602 135956 78508 258216
8890 258216 -192326 5758 -241024 256140 -153581 -1750 -320209 -389336 -229672 -89478 49101
8878 -247362 109523 -125056 178734 -113868 -143667 262148 -196046 -342320 -401902 403707
8867 -77881 32811 -37227 -38370 323493 -156402 -273125 -96179 -161222 -314550 -92580 -41793
8855 -55298 -222658 -257138 -252283 207079 94958 89719 -239026 170232 7659 38077 59955 220803
8843 220803 26920 -296600 -162760 26058 -531917 -295164 -310984 -40810 -92694 185640 36445
$$ [...]
##END NTUPLES=NMR SPECTRUM
##END=
