
##TITLE=AC1208_HCOAH12050_6673652_9lKH1umkHA
##JCAMPDX= 6.0         $$ Bruker NMR JCAMP-DX V2.0
##DATA TYPE= NMR SPECTRUM
##DATA CLASS= NTUPLES
##ORIGIN= BRUKER
##OWNER= Administrator
$$ 1.72 TOPSPIN		Version 2.1
$$ 2012-08-14 20:07:27.015 -0500  Administrator@TOPSPIN
$$ Compression mode = diff/dup
##.OBSERVE FREQUENCY= 400.02188249412
##.OBSERVE NUCLEUS= ^1H
##.ACQUISITION MODE= SIMULTANEOUS (DQD)
##.ACQUISITION SCHEME= undefined
##.AVERAGES= 64
##.DIGITISER RES= 22
##SPECTROMETER/DATA SYSTEM= spect
##.PULSE SEQUENCE= noesygpps1d.comp
##.SOLVENT NAME= COFFEE_meoh
##.SHIFT REFERENCE= INTERNAL, COFFEE_meoh, 1, 14.96076
##AUDIT TRAIL= $$ (NUMBER, WHEN, WHO, WHERE, PROCESS, VERSION, WHAT)
$$ ##TITLE= Audit trail, TOPSPIN		Version 2.1
$$ ##JCAMPDX= 5.01
$$ ##ORIGIN= Bruker BioSpin GmbH
$$ ##OWNER= Administrator
$$ $$ C:\Bruker\TOPSPIN/data/COFFEE/nmr/AC1208_HCOAH12050_6673652_9lKH1umkHA/12/pdata/1/auditp.txt
$$ ##AUDIT TRAIL=  $$ (NUMBER, WHEN, WHO, WHERE, PROCESS, VERSION, WHAT)
(   1,<2012-08-14 20:07:22.187 -0500>,<Administrator>,<TOPSPIN>,<go>,<TOPSPIN 2.1>,
      <created by zg
	started at 2012-08-14 19:55:51.562 -0500,
	POWCHK enabled, PULCHK disabled,
       configuration hash MD5:
       6B 1B 68 BB D9 2E 58 E2 7F 35 AD 54 07 DF 0E 41
       data hash MD5: 64K
       1B 25 78 AF 73 CF 27 B3 E6 78 4A 6D 45 D7 C3 0B>)
(   2,<2012-08-14 20:07:25.046 -0500>,<Administrator>,<TOPSPIN>,<proc1d>,<TOPSPIN 2.1>,
      <Start of raw data processing
       efp LB = 0.3 FT_mod = 6 PKNL = 1 PHC0 = 0 PHC1 = 0 SI = 128K 
       data hash MD5: 128K
       EA C2 A2 3E E4 D0 EB 80 EF 2F AB 8D BC 54 3F 52>)
(   3,<2012-08-14 20:07:26.234 -0500>,<Administrator>,<TOPSPIN>,<proc1d>,<TOPSPIN 2.1>,
      <pk PHC0 = -0.3735352 PHC1 = 0 
       data hash MD5: 128K
       00 67 82 C2 29 5D 03 9D 11 AA 7B 00 17 8B 84 F3>)
(   4,<2012-08-14 20:07:26.468 -0500>,<Administrator>,<TOPSPIN>,<proc1d>,<TOPSPIN 2.1>,
      <abs ABSG = 1 
       data hash MD5: 128K
       A1 AF DB F1 6E 6E 44 7A 0B F7 6A EC 70 48 7C A6>)
(   5,<2012-08-14 20:07:26.531 -0500>,<Administrator>,<TOPSPIN>,<proc1d>,<TOPSPIN 2.1>,
      <abs ABSG = 2 
       data hash MD5: 128K
       A1 09 2C 37 4A E8 5F 5B 42 CD 14 A6 F1 47 72 E9>)
(   6,<2012-08-14 20:07:26.593 -0500>,<Administrator>,<TOPSPIN>,<proc1d>,<TOPSPIN 2.1>,
      <abs ABSG = 3 
       data hash MD5: 128K
       AE E4 69 EB 35 E0 04 CC F2 6A F5 01 E1 25 0D 6B>)
(   7,<2012-08-14 20:07:26.843 -0500>,<Administrator>,<TOPSPIN>,<proc1d>,<TOPSPIN 2.1>,
      <abs ABSG = 4 
       data hash MD5: 128K
       D5 CA C1 8E 5B 22 4E EC C7 BA 98 AF A9 A5 BD AD>)
(   8,<2012-08-14 20:07:26.906 -0500>,<Administrator>,<TOPSPIN>,<proc1d>,<TOPSPIN 2.1>,
      <abs ABSG = 5 
       data hash MD5: 128K
       BC D3 42 C7 32 4F 36 A7 B2 BD 2E 1B B3 4E 44 29>)
$$ ##END=
$$ 
$$ $$ hash MD5
$$ $$ 7B 19 E6 00 15 25 0D 75 A7 85 F1 28 FA BA A3 13
##$RELAX= 
##$RELAX= 
##$RELAX= 
##$RELAX= 
##$RELAX= 
##$RELAX= 
##$RELAX= 
##$RELAX= 
$$ Bruker specific parameters
$$ [...]
##$TP07= 0
##$TPNAME0= <>
##$TPNAME1= <>
##$TPNAME2= <>
##$TPNAME3= <>
##$TPNAME4= <>
##$TPNAME5= <>
##$TPNAME6= <>
##$TPNAME7= <>
##$TPOAL= (0..7)
0.5 0.5 0.5 0.5 0.5 0.5 0.5 0.5
##$TPOFFS= (0..7)
0 0 0 0 0 0 0 0
##$TUNHIN= 0
##$TUNHOUT= 0
##$TUNXOUT= 0
##$USERA1= <user>
##$USERA2= <user>
##$USERA3= <user>
##$USERA4= <user>
##$USERA5= <user>
##$V9= 5
##$VALIST= <valist>
##$VCLIST= <CCCCCCCCCCCCCCC>
##$VD= 0
##$VDLIST= <DDDDDDDDDDDDDDD>
##$VPLIST= <PPPPPPPPPPPPPPP>
##$VTLIST= <TTTTTTTTTTTTTTT>
##$WBST= 1024
##$WBSW= 4
##$XGAIN= (0..3)
0 0 0 0
##$XL= 0
##$YL= 0
##$YMAX_a= 11160680
##$YMIN_a= -8819900
##$ZGOPTNS= <>
##$ZL1= 120
##$ZL2= 120
##$ZL3= 120
##$ZL4= 120
##$ABSF1= 14.96076
##$ABSF2= -5.597422
##$ABSG= 5
##$ABSL= 3
##$ALPHA= 0
##$AQORDER= 0
##$ASSFAC= 0
##$ASSFACI= 0
##$ASSFACX= 0
##$ASSWID= 0
##$AUNMP= <proc_prof1d_extract.lims>
##$AXLEFT= 0
##$AXNAME= <>
##$AXNUC= <1H>
##$AXRIGHT= 0
##$AXTYPE= 0
##$AXUNIT= <>
##$AZFE= 0.1
##$AZFW= 0.1
##$BCFW= 0
##$BC_mod= 0
##$BYTORDP= 0
##$COROFFS= 0
##$CY= 15
##$DATMOD= 1
##$DC= 0
##$DFILT= <>
##$DTYPP= 0
##$F1P= 0
##$F2P= 0
##$FCOR= 0.5
##$FTSIZE= 131072
##$FT_mod= 6
##$GAMMA= 0
##$GB= 0
##$INTBC= 1
##$INTSCL= 1
##$ISEN= 128
##$LB= 0.3
##$LEV0= 0
##$LPBIN= 0
##$MAXI= 10000
##$MC2= 0
##$MEAN= 0
##$ME_mod= 0
##$MI= 0
##$NCOEF= 0
##$NC_proc= -2
##$NLEV= 6
##$NOISF1= 0
##$NOISF2= 0
##$NSP= 0
##$NTH_PI= 0
##$NZP= 0
##$OFFSET= 14.96076
##$PC= 1
##$PHC0= -0.3735352
##$PHC1= 0
##$PH_mod= 1
##$PKNL= yes
##$PPARMOD= 0
##$PPDIAG= 0
##$PPIPTYP= 0
##$PPMPNUM= 2147483647
##$PPRESOL= 1
##$PSCAL= 4
##$PSIGN= 0
##$PYNMP= <proc.py>
##$REVERSE= no
##$SF= 400.020009733297
##$SI= 131072
##$SIGF1= 0
##$SIGF2= 0
##$SINO= 400
##$SIOLD= 131072
##$SPECTYP= <>
##$SREGLST= <1H.CDCl3>
##$SSB= 0
##$STSI= 131072
##$STSR= 0
##$SW_p= 8223.68421052631
##$SYMM= 0
##$S_DEV= 0
##$TDeff= 65536
##$TDoff= 0
##$TI= <>
##$TILT= no
##$TM1= 0
##$TM2= 0
##$TOPLEV= 0
##$USERP1= <user>
##$USERP2= <user>
##$USERP3= <user>
##$USERP4= <user>
##$USERP5= <user>
##$WDW= 1
##$XDIM= 131072
##$YMAX_p= 431869372
##$YMIN_p= -23375
##$CURPLOT= <Network HP LaserJet P1505>
##$CURPRIN= <$Network HP LaserJet P1505>
##$DFORMAT= <normdp>
##$LAYOUT= <+/1D_H.xwp>
##$LFORMAT= <normlp>
##$PFORMAT= <normpl>
##$SURQMSG= 1
$$ End of Bruker specific parameters
$$ ---------------------------------
##NTUPLES= NMR SPECTRUM
##VAR_NAME=  FREQUENCY,     SPECTRUM/REAL,   SPECTRUM/IMAG
##SYMBOL=    X,             R,               I
##VAR_TYPE=  INDEPENDENT,   DEPENDENT,       DEPENDENT
##VAR_FORM=  AFFN,          ASDF,            ASDF
##VAR_DIM=   131072,        131072,          131072
##UNITS=     HZ,            ARBITRARY UNITS, ARBITRARY UNITS
##FACTOR=    0.0627417313425164, 1,          1
##FIRST=     8223.62146879497, -960,         -59209
##LAST=      0,             -246,            -60281
##MIN=       0,             -23375,          0
##MAX=       8223.62146879497, 431869372,    0
$$ Real data points
##PAGE= N=1
##DATA TABLE= (X++(R..R)), XYDATA
$$ [...]
61687D32821k276k511k491k422k625l049l375l364k936k260j819k004k524k683
61673C96482k291j942k172k760l021k486j256O4P30N71K53M73R63Q40p0q99q71
61656C82608j20P30J264J333R94O38O98J002R68O19P49J746K845L154K867K861
61640D04956L408L876L561K377P51p12j555j834k122k919m097n100n501n181m193
61625C85715k809j576r98j083j352j338r59n16l98o66r17p18k75l25j224k433
61609C68128l183l408l623m088m526m693m749m835m700m040l050k339k242k533
61595C16119k816k903k761k346j763j345j233j107o68k85o49j721k598k563j864
61580B89497j190p99n60m40n45q28j134j352j319q46j26K10j57p35q31m62j62
$$ y = [432821, 430545, 428034, 425543, 423121, 420496, 417447, 414072, 410708, 407772, 405512, 403693, 401689, 399165, 396482, 394191, 392249, 390077, 387317, 384296, 381810, 380554, 380618, 381348, 381919, 382172, 382645, 383608, 384448, 384378, 383479, 382608, 382488, 383218, 384482, 385815, 386809, 387447, 388145, 389147, 390115, 390734, 391483, 393229, 396074, 399228, 402095, 404956, 408364, 412240, 415801, 418178, 418929, 418217, 416662, 414828, 412706, 409787, 405690, 400590, 395089, 389908, 385715, 382906, 381330, 380332, 379249, 377897, 376559, 375600, 375084, 374686, 374020, 373103, 372385, 372110, 371785, 370561, 368128, 364945, 361537, 357914, 353826, 349300, 344607, 339858, 335023, 330323, 326283, 323233, 320894, 318652, 316119, 313303, 310400, 307639, 305293, 303530, 302185, 300952, 299845, 299177, 298892, 298243, 296522, 293924, 291361, 289497, 288307, 287508, 286948, 286508, 285963, 285135, 284001, 282649, 281330, 280484, 280358, 280568, 280411, 279676, 278845, 278383, 278221]
61563B78221j43j09K01O77J056J170J043R47J102J245Q84K01J27J103K294K651
61547B92670K230J739J351P47M7l03l53m55m11L08J534K472K782K758K509J861
61531C11486J059N27L2r41j893j680l56N61K18m59l86N2n3n14m93M3L66J74j56
61512C07587l38m41m58k44J42M75O83P94P36M40n7p53j664k461k646k261j886
61495B97648j723j286m03K46K00J34Q51J879K017J049k2l68r1M27J079J718J985
61478C05340J741J351J244J448J659J531R07j6p92j184j411j598j311j88J155
61463C09876J543P67k9J49Q49Q89P4n40p5J063J811J749J344J070Q19L38j86l50
61445C21161j51N3R2J79N21J077J748K517L275L740L726L320K778K329K120K101
$$ y = [278221, 278078, 277969, 278170, 278847, 279903, 281073, 282116, 283063, 284165, 285410, 286294, 286495, 286622, 287725, 290019, 292670, 294900, 296639, 297990, 298737, 298784, 298481, 298128, 297673, 297262, 297570, 299104, 301576, 304358, 307116, 309625, 311486, 312545, 313072, 313104, 312163, 310270, 308590, 308234, 308795, 309013, 308554, 308168, 308220, 308167, 307653, 307160, 307203, 307569, 307743, 307587, 307249, 306808, 306350, 306106, 306248, 306723, 307406, 308200, 308936, 309376, 309319, 308566, 306902, 304441, 301795, 299534, 297648, 295925, 294639, 294236, 294482, 294682, 294816, 295667, 297546, 299563, 300612, 300590, 300222, 300131, 300558, 301637, 303355, 305340, 307081, 308432, 309676, 311124, 312783, 314314, 315221, 315205, 314413, 313229, 311818, 310220, 308909, 308721, 309876, 311419, 312186, 312157, 312306, 313155, 314044, 314118, 313578, 313503, 314566, 316377, 318126, 319470, 320540, 321359, 321697, 321511, 321161, 321010, 321063, 321155, 321334, 321855, 322932, 324680, 327197, 330472, 334212, 337938, 341258, 344036, 346365, 348485, 350586]
61429C50586K045J825J645J684J688J307P32M99O07N15J02O4R10K168K978L112
61413C72467K870K411J707R67M31o1q03j526j619j100p77j159j775j920j717j821
61397C66575k299k459j933j330j413j999k223j745j110q87r54q32l32L25P41N58
61381C48683j77p68m69N27J205J132J023J533K202K314K137K356K779K591J736
61366C68804R74O81N29L41M34Q92J395J855K460L015L026K629K611L327M349N326
61350D02648O377P404P921P885P918Q266Q365P771O823N963N141M330L856L723
61336D94391L323K348J368R23O96J38o38j206j532j770j831j686j639j868k143
61321D88874k362k734k980k206k04J814K654K709L247M598O033P034P804Q586
$$ y = [350586, 352631, 354456, 356101, 357785, 359473, 360780, 361512, 362011, 362618, 363133, 363235, 363299, 364209, 366377, 369355, 372467, 375337, 377748, 379455, 380422, 380853, 380792, 379989, 378463, 376844, 375744, 374967, 373808, 372033, 370113, 368396, 366575, 364276, 361817, 359884, 358554, 357141, 355142, 352919, 351174, 350064, 349177, 348223, 347391, 347059, 347384, 348125, 348683, 348506, 347738, 347269, 347796, 349001, 350133, 351156, 352689, 354891, 357205, 359342, 361698, 364477, 367068, 368804, 369778, 370459, 370988, 371329, 371763, 372655, 374050, 375905, 378365, 381380, 384406, 387035, 389646, 392973, 397322, 402648, 409025, 416429, 424350, 432235, 440153, 448419, 456784, 464555, 471378, 477341, 482482, 486812, 490668, 494391, 497714, 500062, 501430, 502353, 503049, 503187, 502549, 501343, 499811, 498041, 496210, 494524, 492885, 491017, 488874, 486512, 483778, 480798, 478592, 478388, 480202, 482856, 485565, 488812, 493410, 499443, 506477, 514281, 522867]
61307E22867R386J0292J1377J2321J2706J2589J2210J1364R675P341M941K570
61295F39639j06l008n497p211q433r446j0058j0014r549r235r341r504r058p737
61281E31442o053m816m298m043l532k691j681n91N00J472K355L201L759L710L305
61266E22039L215L621M020M151M451N296O427P526Q763J0310J1784J2560J2244
61253F16407J0617P795M675K487J480P54k72j100j385j797k857l864m011l757
61239F25172l934m242l827k920k535k770k715j978j179q11o41l74l5N38J710L362
61223F02821M791N545N848O081O288O357O273O023N576M981M368L941M024M756
61209F77673N621N733M837L577K530J604P82O47J520K815L895N025O736Q903J1217
$$ y = [522867, 532253, 542545, 553922, 566243, 578949, 591538, 603748, 615112, 624787, 632128, 637069, 639639, 639533, 636525, 631028, 623817, 615384, 605938, 595880, 585866, 576317, 567082, 557741, 548237, 539179, 531442, 525389, 520573, 516275, 512232, 508700, 506009, 504328, 503737, 504237, 505709, 508064, 511265, 515024, 518734, 522039, 525254, 528875, 532895, 537046, 541497, 546793, 553220, 560746, 569509, 579819, 591603, 604163, 616407, 627024, 634819, 639494, 641981, 643461, 644215, 643943, 642843, 641458, 639661, 636804, 632940, 628929, 625172, 621238, 616996, 613169, 610249, 607714, 604944, 602229, 600251, 599072, 598261, 597620, 597246, 597211, 597749, 599459, 602821, 607612, 613157, 619005, 625086, 631374, 637731, 644004, 650027, 655603, 660584, 664952, 668893, 672917, 677673, 683294, 689027, 693864, 697441, 699971, 701575, 702357, 703004, 704524, 707339, 711234, 716259, 722995, 731898, 743115]
61194G43115J3876J6895J9352K0343K0145J9391J7703J4413J0259O858M653K678
61182I09681M31j294j675r86j53k3j141l453o024p736q387q612q903r351j0095
61167H42279j1225j2388j3232j4018j5055j5968j6319j6486j6856j6696j5115
61156F78921j2805j1295j0618r325o934m636l232j944n7J671K146J440K83j130
61142F22485k940m853o332p156p230o383m849l447k714k222j165O22K617M256
61128E80689N358O155P084Q432J0113J2028J4358J7129J9736K1483K2548K3755
61116G48868K5476K7294K8690K9475K9586K9118K8489K8041K7504K6413K4821
61105A053775K3040K0887J8001J4634J1348Q115M469L94l776q075j2632j6898
$$ y = [743115, 756991, 773886, 793238, 813581, 833726, 853117, 870820, 885233, 895492, 902350, 907003, 909681, 910112, 908818, 907143, 906157, 906004, 905981, 904840, 901387, 895363, 887627, 879240, 870628, 861725, 852374, 842279, 831054, 818666, 805434, 791416, 776361, 760393, 744074, 727588, 710732, 694036, 678921, 666116, 654821, 644203, 634878, 627944, 623308, 620076, 618132, 618075, 619746, 621892, 623332, 623615, 622485, 619545, 614692, 608360, 601204, 593974, 587591, 582742, 579295, 576581, 574359, 573194, 573816, 576433, 580689, 586047, 592202, 599286, 607718, 617831, 629859, 644217, 661346, 681082, 702565, 725113, 748868, 774344, 801638, 830328, 859803, 889389, 918507, 946996, 975037, 1002541, 1028954, 1053775, 1076815, 1097702, 1115703, 1130337, 1141685, 1149800, 1154269, 1154663, 1150887, 1142812, 1130180, 1113282]
61093A113282k0175k2729k5323k7820k9317k9652k9579k9488k9030k8120k7158
61082H14891k6137k4596k2628k0827j9198j7206j5003j3417j2430j0980q625o323
61070F17521m999m381l757l015k380j845j316p57L6J317K906M379N693P026Q160
61055F24588Q739Q955R275R756J0394J1612J3531J5309J6344J7380J9224K1093
61043G86200K1900K2364K3988K6514K8480K9785L1499L3437L4361L4484L5276
61032A108288L6801L7729L8128L9490M1674M2635M1775M0840M0838M0986M1504
61021A550688M4384N0207N7016O3680P1491Q1318R2122J03653J17595J34772J54610
61010B521536J78656K10722K52158L01752L62379M42371N47798O80087Q44295
$$ y = [1113282, 1093107, 1070378, 1045055, 1017235, 987918, 958266, 928687, 899199, 870169, 842049, 814891, 788754, 764158, 741530, 720703, 701505, 684299, 669296, 655879, 643449, 632469, 623844, 617521, 612522, 608141, 604384, 601369, 598989, 597144, 595828, 595071, 595107, 596424, 599330, 603709, 609402, 616428, 624588, 633327, 642282, 651557, 661313, 671707, 683319, 696850, 712159, 728503, 745883, 765107, 786200, 808100, 830464, 854452, 880966, 909446, 939231, 970730, 1004167, 1038528, 1073012, 1108288, 1145089, 1182818, 1220946, 1260436, 1302110, 1344745, 1386520, 1427360, 1468198, 1509184, 1550688, 1595072, 1645279, 1702295, 1765975, 1837466, 1918784, 2010906, 2114559, 2232154, 2366926, 2521536, 2700192, 2910914, 3163072, 3464824, 3827203, 4269574, 4817372, 5497459, 6341754]
61001F341754J048646J286002J524873J732315J895240J993246J952258J668572
60993A9442906J120103M48012j09906l88035l90646k29445l946K24698L67771
60984B0481512K89181r7678p20307j367610j833411k037520k022560j871686j650154
60975I169767j402222j162238r51214p73220o24734n03920m08516l32183k68831
60966B742689k17399j78692j50529j29102j12430r9543q8501p7896o8439o0795
60956A559363n3538m5243l6783k9512k2944j6366j1131r021r383j0029j0145j0423
60944A294845j1007j1078j0203q621o691n070m829o207p844q369q158q545r866
60931A188357j1349j2414j3066j3375j3448j3577j3872j4074j4235j4835j5876
$$ y = [6341754, 7390400, 8676402, 10201275, 11933590, 13828830, 15822076, 17774334, 19442906, 20563009, 21011021, 20901115, 20513080, 20122434, 19892989, 19889043, 20113741, 20481512, 20770693, 20673015, 19952708, 18585098, 16751687, 14714167, 12691607, 10819921, 9169767, 7767545, 6605307, 5654093, 4880873, 4256139, 3752219, 3343703, 3011520, 2742689, 2525290, 2346598, 2196069, 2066967, 1954537, 1854994, 1766493, 1688597, 1620158, 1559363, 1505825, 1460582, 1423799, 1394287, 1371343, 1354977, 1343846, 1334825, 1325442, 1315413, 1305268, 1294845, 1283838, 1272760, 1262557, 1253936, 1247245, 1242175, 1237346, 1231139, 1223295, 1214926, 1206768, 1198223, 1188357, 1177008, 1164594, 1151528, 1138153, 1124705, 1111128, 1097256, 1083182, 1068947, 1054112, 1038236]
60920A038236j6591j6610j6539j6772j6712j5903j4994j4733j4743j4208j3131
60909H67300j2118j1451j1107j1108j1167j0634r381q117p290o460n370m747n152
60896G53198n937o157n906n893o258o688p064p241o870o245o562q334j0223j0579
60882F53241r574q692q551q518q167p858p787p568o967o192n404m565l894l725
60868E55779l859l701l156k752k650k268j171P3M34l81j639k469k749k929l196
60853E23366l227k818k284j953j679j324j300j970k839l147l096l505m330m599
60839D85295m039l665m300n391n913n698n249m832m350l770l194k673k247j826
60825D28148j087R0J120J328R75R07J179J026L11j33J24M73L85J02k17q83j659
$$ y = [1038236, 1021645, 1005035, 988496, 971724, 955012, 939109, 924115, 909382, 894639, 880431, 867300, 855182, 843731, 832624, 821516, 810349, 799715, 790334, 782217, 774927, 768467, 763097, 758350, 753198, 747261, 741104, 735198, 729305, 723047, 716359, 709295, 702054, 695184, 688939, 682377, 674043, 663820, 653241, 643667, 634975, 626424, 617906, 609739, 601881, 594094, 586526, 579559, 573367, 567963, 563398, 559504, 555779, 551920, 548219, 545063, 542311, 539661, 537393, 536222, 536295, 536729, 536348, 534709, 532240, 529491, 526562, 523366, 520139, 517321, 515037, 513084, 511405, 510081, 508781, 506811, 503972, 500825, 497729, 494224, 489894, 485295, 481256, 477591, 473291, 467900, 461987, 456289, 451040, 446208, 441858, 438088, 434894, 432221, 429974, 428148, 427061, 427151, 428271, 429599, 430574, 431481, 432660, 433686, 433997, 433864, 433988, 434461, 434846, 434948, 434731, 433848, 432189]
60808D32189j533k98P13L87o01r22l85K85P03Q22M35l76q87p79q58j861l200l898
60790D19936l981l925l489k381j447j727k778l288l071l009l231k865j745r04
60776C82095r79j363j415j453j979k664k748j977o77P15J833K424K472K121J514
60761C77919R08P92J423K311K603K020J062L94L25P82J378J636J526J658K536
60746C99273L778M420L932K641J292M79K32j20j340l232m682n049n007n467o219
60731C84931o431n976n449n097m604l837l066k478k082j941j983j836j405j259
60717C37487j777k328k093j384j159j518j691j413j162j071p23j76j1j81J07R85
60701C21892J499J103N41N66P47M41J04N88J547J771R66K37O05J841L058L904
$$ y = [432189, 430656, 430358, 431071, 431458, 430857, 429935, 429550, 429835, 430538, 431360, 431795, 431419, 430532, 429753, 428895, 427034, 423834, 419936, 415955, 412030, 408541, 406160, 404713, 402986, 400208, 396920, 393849, 390840, 387609, 384744, 382999, 382095, 381116, 379753, 378338, 376885, 374906, 372242, 369494, 367517, 366840, 367555, 369388, 371812, 374284, 376405, 377919, 378827, 379619, 381042, 383353, 385956, 387976, 389038, 389432, 389757, 390539, 391917, 393553, 395079, 396737, 399273, 403051, 407471, 411403, 414044, 415336, 415815, 416047, 415927, 414587, 411355, 406673, 401624, 396617, 391150, 384931, 378500, 372524, 367075, 361978, 357374, 353537, 350471, 347993, 345911, 343970, 341987, 340151, 338746, 337487, 335710, 333382, 331289, 329905, 328746, 327228, 325537, 324124, 322962, 321891, 321168, 320992, 320981, 320800, 320907, 321892, 323391, 324494, 325035, 325601, 326348, 326789, 326893, 327481, 329028, 330799, 331765, 332002, 332607, 334448, 337506, 341410]
60685C41410M699N611O159N676M199K717K347L263M556N205M983M360L849L622
60671D02656L647L765L661K980J639m4j599k791l700m418m833m730m119l284k551
60656C86279k041j698j410j061n66J07R30J756K253K117J510J026R62Q07j01j634
60640C89236l103m204n109n626n200l975l033l068l415k985j656k07P40J096R58
60625C50449N46K77L94N87M62K04L41R33J514J750J718J528J099M34j78m47m44
60608C61167n61j032j427r45N36J912J939Q17J1L40J017R73L73J99Q30J778K502
60591C70429K870K877K425J435K5j301j701p49P50J434J098R21J608K254J809
60576C86184P85N29J383K600L663M688N767O882Q277J0041J1577J2261J2381J2468
$$ y = [341410, 346109, 351720, 357879, 363555, 367754, 370471, 372818, 376081, 380637, 385842, 390825, 395185, 399034, 402656, 406303, 410068, 413729, 416709, 418348, 418304, 416705, 413914, 410214, 405796, 400963, 396233, 392114, 388830, 386279, 384238, 382540, 381130, 380069, 379503, 379610, 380540, 382296, 384549, 386666, 388176, 389202, 390164, 390971, 390870, 389236, 386133, 381929, 376820, 371194, 365994, 362019, 358986, 355918, 352503, 349518, 347862, 347655, 348395, 349491, 350449, 350995, 351272, 351666, 352253, 352715, 352919, 353260, 354193, 355707, 357457, 359175, 360703, 361802, 362236, 362058, 361611, 361167, 360606, 359574, 358147, 357202, 357738, 359650, 361589, 362406, 362417, 362757, 363774, 364747, 365120, 365319, 366149, 367927, 370429, 373299, 376176, 378601, 380036, 380061, 378760, 377059, 376310, 377060, 378494, 379592, 380513, 382121, 384375, 386184, 386969, 387498, 388881, 391481, 395144, 399832, 405599, 412481, 420758, 430799, 442376, 454637, 467018, 479486]
60562D79486J2055J0224P220M312J992m62l431o099p654q283q418p801o066l660
60548D63415j571l58J77O44J697L578N804P596Q831J0165J2010J3868J5023J5444
60534E56323J5523J5181J3743J0781O772K806l30k723m923p009q272q075o781
60521E83016n521n072n254n362m897l883k674j564n26N51J447J752J549J492J999
60506E57053K848L884N613Q479J2071J5651J9180K3148K7618L2110L6289M0117
60494G84061M3443M6027M7795M8443M6923M2132L4210K4495J4152L412p810j9107
60482A108176k9622l8418m4770m8492n0036m9944m8297m5065m0821l6510l2592
60471F43609k8959k5605k2746k0292j7806j5118j2506j0268q501p357o957p018
$$ y = [479486, 491541, 501765, 508985, 513297, 515289, 514827, 511396, 505297, 497643, 489360, 480942, 473141, 467075, 463415, 461844, 461486, 461663, 462307, 464004, 467582, 473386, 480982, 489813, 499978, 511988, 525856, 540879, 556323, 571846, 587027, 600770, 611551, 618323, 621129, 620799, 618076, 613153, 606144, 597872, 589797, 583016, 577495, 572423, 567169, 561807, 556910, 553027, 550353, 548789, 548263, 548814, 550261, 552013, 553562, 555054, 557053, 559901, 563785, 569398, 577877, 589948, 605599, 624779, 647927, 675545, 707655, 743944, 784061, 827504, 873531, 921326, 969769, 1016692, 1058824, 1093034, 1117529, 1131681, 1135093, 1127283, 1108176, 1078554, 1040136, 995366, 946874, 896838, 846894, 798597, 753532, 712711, 676201, 643609, 614650, 589045, 566299, 546007, 528201, 513083, 500577, 490309, 481808, 474451, 467494, 460476]
60459D60476o990o585n873m941l906l085k679k433k072j865k201k812l059k821
60445D09154k500k258j951j678j684j711j213k88L01J16n16j115j471j455j017
60430C90714m25k0K58N84O39Or51j380j074o26m52l44o3L55Q68J409J637J356
60412C92491J038J202J512J366J075J400K058K001J168O43Q33R05M02Q1N25J189
60396D09889J555K090L151L974L752K968K621K776K802K547K334K213K044K051
60382D46767K485K956K856K264J864K033K524K948L123L033K794K629K604K591
60368D83471K511K392K091J410N65J41L55Q36J275J783K378K734K778L010L870
60353E11600N193O553P753Q712R383R953J0655J1139J0578Q619N737K478r36m094
$$ y = [460476, 453486, 446901, 441028, 436087, 432181, 429096, 426417, 423984, 421912, 420047, 417846, 415034, 411975, 409154, 406654, 404396, 402445, 400767, 399083, 397372, 396159, 395871, 396172, 396288, 395772, 394657, 393186, 391731, 390714, 390289, 390269, 390527, 391111, 391750, 391756, 390805, 389425, 388351, 387725, 387273, 386929, 386866, 387221, 388089, 389498, 391135, 392491, 393529, 394731, 396243, 397609, 398684, 400084, 402142, 404143, 405311, 405954, 406787, 407692, 408094, 408175, 408700, 409889, 411444, 413534, 416685, 420659, 424411, 427379, 430000, 432776, 435578, 438125, 440459, 442672, 444716, 446767, 449252, 452208, 455064, 457328, 459192, 461225, 463749, 466697, 469820, 472853, 475647, 478276, 480880, 483471, 485982, 488374, 490465, 491875, 492440, 492581, 492936, 493772, 495047, 496830, 499208, 501942, 504720, 507730, 511600, 516793, 523346, 531099, 539811, 549194, 559147, 569802, 580941, 591519, 600138, 605875, 608353, 607417, 603323]
60339F03323o326p514q288q943q976q133p118o628o326n540m382l483l083l063
60325E15520l459m242m940n091m807m374l645k362p63O31J631K333K845L388M268
60310D96933N403O391P409R450J3041J7281K0762K3044K4459K4947K3803K0472
60298F93395J5037Q085N59o535j2740j8155k2534k4898k4555k2068j8660j5047
60286E51884j1448q278o020m670l919l637l696l658l280k976l135l391l274l218
60272D87284l949n119n469m477k947j817j165o72m15p21j518k214k203j374j91
60257D53033P18J041Q39K68m70r76q75k45N08J187J709J598M40j108j664q76J46
60240D55273N12O25R58R13Kq30l68R03J453R82P04J341K166K291J873J636J892
$$ y = [603323, 596997, 589483, 581195, 572252, 563276, 555143, 548025, 541397, 535071, 529531, 525149, 521666, 518583, 515520, 512061, 507819, 502879, 497788, 492981, 488607, 484962, 482600, 481837, 482468, 484099, 486432, 489277, 492665, 496933, 502336, 508727, 516136, 525586, 538627, 555908, 576670, 599714, 624173, 649120, 672923, 693395, 708432, 716517, 717076, 710541, 697801, 679646, 657112, 632214, 607659, 585591, 566931, 551884, 540436, 532158, 526138, 521468, 517549, 513912, 510216, 506558, 503278, 500302, 497167, 493776, 490502, 487284, 483335, 478216, 472747, 468270, 465323, 463506, 462341, 461669, 461254, 460533, 459015, 456801, 454598, 453224, 453033, 453751, 454792, 455631, 455899, 455429, 454453, 453578, 453333, 453841, 455028, 456737, 458335, 458775, 457667, 456003, 455127, 455273, 455785, 456410, 457368, 458281, 458283, 457453, 457085, 457988, 459441, 460423, 461127, 462468, 464634, 466925, 468798, 470434, 472326]
60223D72326K394K692K476J944J814K546L695M529N001N574O308O900P350P862
60209E33411Q188P938P471P498P859P562O278M906M314M371M513M562M531M237
60195F17639L607K958K510J980J012k70j404k138k591l104l945m995n676n569
60181F00014n114n241o160o968o714n484m118l178k540j926j393j224j502j955
60167E46497k212k107j700j070l07L04L63j84p94p57J17J323K065J902J155O85
60151E45280J060J961K654K914L093L315L225K652J965J572J571K074L257M813
60137E81406N997O593P175Q034Q525Q071P148O521O066N189L932K882K172J396
60123F61107L56p76j821k540k432j288K04J089J270J352J580J566J082M06j68
$$ y = [472326, 474720, 477412, 479888, 481832, 483646, 486192, 489887, 494416, 499417, 504991, 511299, 518199, 525549, 533411, 541599, 549537, 557008, 564506, 572365, 579927, 586205, 591111, 595425, 599796, 604309, 608871, 613402, 617639, 621246, 624204, 626714, 628694, 629706, 629436, 628032, 625894, 623303, 620199, 616254, 611259, 605583, 600014, 594900, 589659, 583499, 576531, 569817, 564333, 560215, 557037, 554497, 552571, 551178, 549954, 548452, 546497, 544285, 542178, 540478, 539408, 539101, 539405, 539768, 539584, 538790, 538033, 538150, 539473, 541538, 543440, 544595, 545280, 546340, 548301, 550955, 553869, 556962, 560277, 563502, 566154, 568119, 569691, 571262, 573336, 576593, 581406, 587403, 593996, 601171, 609205, 617730, 625801, 632949, 639470, 645536, 650725, 654657, 657539, 659711, 661107, 661463, 660687, 658866, 656326, 653894, 652606, 652810, 653899, 655169, 656521, 658101, 659667, 660749, 661155, 660987]
60108F60987o79j285k051k892l539l713l602l768m300m637m557m651n152n094
60094F11067l597j433j37R4L91J251J883J672J154J115J589K142K516K651K539
60079F24897K345K301K385K339J972J097n34k740m718n970p058q642j0155j0437
60065E87082r512q563q137p616o705o176o548p030o553n236m062l521l199k524
60051E01700j437l22M51R59J675K820L975M597M801N126N703O099O028N674N298
60036E53147M932M452L660K463J216N03J49q89l010m958n411m989n364o685p420
60021E31796o843o116o352p014p028o378n735n289m831m424m204l985l639l468
60007D56490l621l620l002k081j419j030o05k78m16p78n75N31J881K479K043J266
$$ y = [660987, 660308, 659023, 656972, 654080, 650541, 646828, 643226, 639458, 635158, 630521, 625964, 621313, 616161, 611067, 607470, 606037, 605900, 605994, 606385, 607636, 609519, 611191, 612345, 613460, 615049, 617191, 619707, 622358, 624897, 627242, 629543, 631928, 634267, 636239, 637336, 636802, 634062, 629344, 623374, 616316, 607674, 597519, 587082, 577570, 569007, 560870, 553254, 546549, 540373, 533825, 526795, 520242, 515006, 510944, 507423, 504224, 501700, 500263, 499941, 500392, 501351, 503026, 505846, 509821, 514418, 519219, 524345, 530048, 536147, 542175, 547849, 553147, 558079, 562531, 566191, 568654, 569870, 570373, 570522, 569633, 566623, 561665, 556254, 551265, 545901, 539216, 531796, 524953, 518837, 512485, 505471, 498443, 492065, 486330, 481041, 476210, 471786, 467582, 463597, 459958, 456490, 452869, 449249, 446247, 444166, 442747, 441717, 441112, 440834, 440418, 439640, 439065, 439596, 441477, 443956, 445999, 447265]
59991D47265J073J733K734L479L844M023M163M301M327L829K404M37j003j446
59977D81163j641k306l001l019k739k901l114k406j066m67r78j412q30M19J721
59962D57423L027M132M369L736L287L642L979L264J795O48J86j18o84j359j737
59947D85590j566r74m94n13p25n83k45l46r00j323j573k226l173l428k654j748
59931D63119j286n38J073K649L057K719K949L991M862M973M795M965N491N948
59917E08767N931N387M799M836N424N592M640L137K166J958J828J200K42m34k96
59902E55177N97J358Q68r71k947l855l659k994k118r57K18R26J174J474K236L435
59886E49962M666N329N067M394M418N593P089P828P734P477P441P456P218O334
$$ y = [447265, 448338, 450071, 452805, 456284, 460128, 464151, 468314, 472615, 476942, 480771, 483175, 483612, 482609, 481163, 479522, 477216, 474215, 471196, 468457, 465556, 462442, 460036, 458970, 458503, 457525, 456113, 455283, 455702, 457423, 460450, 464582, 468951, 472687, 475974, 479616, 483595, 486859, 488654, 489302, 489488, 489370, 488686, 487327, 485590, 484024, 483050, 482556, 482043, 481318, 480735, 480490, 480144, 479244, 477921, 476348, 474122, 470949, 467521, 464867, 463119, 461833, 461295, 462368, 465017, 468074, 470793, 473742, 477733, 482595, 487568, 492363, 497328, 502819, 508767, 514698, 520085, 524884, 529720, 535144, 540736, 545376, 548513, 550679, 552637, 554465, 555665, 555907, 555473, 555177, 555774, 557132, 558000, 557029, 554082, 550227, 546568, 543574, 541456, 540499, 540717, 541643, 542817, 544291, 546527, 549962, 554628, 559957, 565024, 569418, 573836, 579429, 586518, 594346, 602080, 609557, 616998, 624454, 631672, 638006]
59872F38006M378J511j183k633l005l407m466n669o150n670m770m224m354m755
59858E93609m790m402m116m096l720k398l79J638L398N043O463P316P467O951
59844F07984N593L217L29j909k660k161j314o57k9O93Q89k50k468m379m981m692
59828E93205m346l849k751j656j814l251m547m673m019l311k653k124k289l270
59814E48652m137l940k866j805j331j551k305l009k951k314k160k906l531k999
59800E10847j720q36p38j131j896k874l308k543j139l21n24j178j655j697j129
59785D88158q8O40L06p12j283r20k46M3j1N0M26R08J165J069Q39P92R10R82J140
59766D94168J766K700L180K928K614K814L133K943K449K260K460K760L270M193
$$ y = [638006, 642384, 643895, 642712, 640079, 637074, 633667, 629201, 623532, 617382, 611712, 606942, 602718, 598364, 593609, 588819, 584417, 580301, 576205, 572485, 570087, 569708, 571346, 574744, 579787, 586250, 593566, 601033, 607984, 613577, 616794, 617123, 615214, 612554, 610393, 609079, 608422, 608393, 609086, 609975, 609725, 607257, 602878, 597897, 593205, 588859, 585010, 582259, 580603, 578789, 575538, 570991, 566318, 562299, 558988, 556335, 554211, 551922, 548652, 544515, 540575, 537709, 535904, 534573, 533022, 530717, 527708, 524757, 522443, 520283, 517377, 513846, 510847, 509127, 508291, 507553, 506422, 504526, 501652, 498344, 495801, 494662, 494341, 493817, 492639, 490984, 489287, 488158, 488070, 488710, 489016, 488304, 487021, 486101, 485855, 485898, 485887, 485937, 486363, 487271, 488436, 489505, 490344, 491136, 492046, 493028, 494168, 495934, 498634, 501814, 504742, 507356, 510170, 513303, 516246, 518695, 520955, 523415, 526175, 529445, 533638]
59752E33638N148N548N561N900O687P243P054O435O039O120O346O168N378M347
59738F17612L510K705J418k40j475j941k124k339k152j452j146j859k658k182
59724F05677o58K85k41j491k325k443k189j888j725j857k252k588k443j651n47
59709E81664K11L28L14P73J384J249L61k02J67P56Q02O84J094J764J886J345P22
59692E95302L99L37L51J37n20j161r27J09P26K84l18k34k35j458l386m465m245
59675E80696l577l080k742k866l923n491o431o314n607m573l078j547r31j461
59661E29075k252k414j776n36R94K084K037J181P66J535K915L845L925L527L171
59646E48077K969K505J313l73j689k173k322k765l464m130m777n175m526k624
$$ y = [533638, 538786, 544334, 549895, 555795, 562482, 569725, 576779, 583214, 589253, 595373, 601719, 607887, 613265, 617612, 621122, 623827, 625245, 625005, 623530, 621589, 619465, 617126, 614974, 613522, 612376, 610517, 607859, 605677, 605019, 605304, 605063, 603572, 601247, 598804, 596615, 594727, 593002, 591145, 588893, 586305, 583862, 582211, 581664, 581875, 582203, 582517, 583290, 584674, 585923, 586284, 586082, 586249, 587005, 587807, 588491, 589585, 591349, 593235, 594580, 595302, 595701, 596038, 596389, 596526, 596006, 594845, 593918, 594027, 594753, 595037, 594719, 594485, 594250, 592792, 589406, 584941, 580696, 577119, 574039, 571297, 568431, 564508, 559017, 552586, 546272, 540665, 536092, 533014, 531467, 530536, 529075, 526823, 524409, 522633, 522097, 523091, 525175, 527212, 528393, 529159, 530694, 533609, 537454, 541379, 544906, 548077, 551046, 553551, 554864, 554491, 552802, 550629, 548307, 545542, 542078, 537948, 533171, 527996, 523470, 520846]
59632E20846p13j56o45q21l12Ql88j085j648k112k436k468k483k922l551l693
59616D95421l332l113l218l114k479j644r38k85N04J470K573L553L944L675L257
59601D96274K899K062N74n26l33L91K85n52r49p10p11j074q88J3N37mr40j405
59583D94943j414j307j132r59j064j426j775k246l113l906l790k894k213k026
59569D65678j559m69M97P73P97J026J106O22q8n16o81p33m63K52J061J615K030
59552D70948K536L021L230L058K572K082K137K966L990M565N097O655R394J2188
59538E34439J4123J5661J7810K0339K1101J7434Q728k093j0303j3232j2054r456
59526F02497o600l221L81L172M808N714N911N065L608K370J261m01k385l797m793
$$ y = [520846, 520133, 519977, 519332, 518511, 518199, 518207, 517819, 516734, 515086, 512974, 510538, 508070, 505587, 502665, 499114, 495421, 492089, 488976, 485758, 482644, 480165, 478521, 477583, 477298, 477802, 479272, 481845, 485398, 489342, 493017, 496274, 499173, 501235, 501809, 501283, 500950, 501341, 501626, 501074, 500125, 499415, 498704, 497630, 496742, 496755, 497292, 497288, 496348, 494943, 493529, 492222, 491090, 490131, 489067, 487641, 485866, 483620, 480507, 476601, 472811, 469917, 467704, 465678, 464119, 463650, 464147, 464920, 465717, 466743, 467849, 468471, 468383, 467867, 467186, 466453, 465990, 466242, 467303, 468918, 470948, 473484, 476505, 479735, 482793, 485365, 487447, 489584, 492550, 496540, 501105, 506202, 512857, 522251, 534439, 548562, 564223, 582033, 602372, 623473, 640907, 649635, 647542, 637239, 624007, 611953, 602497, 595897, 592676, 593057, 596229, 601037, 606751, 612662, 617727, 621335, 623705, 624966, 624565, 622180, 618383, 613590]
59511F13590o408q664j0370j1062j1504j1971j1626j0183q646p705o750n235l753
59498D99713k916k301j410p61j090k076k593j894j63J640K344J596L90j1M68J074
59482D92010J650K543L395L510L327L990N322N860N130M268M033L799L127K689
59468E44653K939L245L046K590J937P34m92l90J109K342K488K942M980P583R026
59453E88732R327R668J0344J0771J0776J0531R724P921N377K581m49l680o519
59440F65104q530j0008j1181j1548j0783r458q184o806n242m184m011l823k564
59427E68782n12J322K744M367O421Q486J0252J1888J3731J5932J8308K0484K2310
59414G04515K3998K5521K6371K6421K6068K4386J8352O190q903k0715k5783k5229
$$ y = [613590, 607182, 598518, 588148, 577086, 565582, 553611, 541985, 531802, 523156, 515451, 508701, 503466, 499713, 496797, 494496, 493086, 492325, 491235, 489159, 486566, 484672, 484509, 486149, 488493, 490089, 490479, 490468, 490936, 492010, 493660, 496203, 499598, 503108, 506435, 510425, 515747, 521607, 526737, 531005, 535038, 538837, 541964, 544653, 547592, 550837, 553883, 556473, 558410, 559144, 558652, 558262, 559371, 561713, 564201, 567143, 572123, 579706, 588732, 598059, 607727, 618071, 628842, 639618, 650149, 659873, 667794, 673171, 675752, 675303, 671623, 665104, 656574, 646566, 635385, 623837, 613054, 603596, 595412, 588606, 583364, 579180, 575169, 571346, 568782, 568270, 569592, 572336, 576703, 583124, 591610, 601862, 613750, 627481, 643413, 661721, 682205, 704515, 728513, 754034, 780405, 806826, 832894, 857280, 875632, 881822, 872919, 852204, 826421, 801192]
59402H01192k1238j4771p195q41L611P478J0240Q185p45j2984k2724k7590k8721
59389F93897k7189k3277j8281j4050j0958q304o179n073m341l050j765j523j657
59376E68250o31J480L175L856M074L962L274K727L351M647N195M877M822N302
59362F18361N420M901M558M875N571O565P979R270R766R962J0884J2332J3197
59349G23641J3466J4291J6043J7742J8647J9003J9017J8293J6652J4495J2128
59338I03418R503O641L557k6m141q051j1114j3655j6080j7730j7848j7092j6760
59325H00622j6961j6875j6328j5661j4538j2452j0101q627p767o453m927m413
59313F65519m780m513l260k403k606k654j431N30K395M495P356J0330J2280J2969
$$ y = [801192, 779954, 765183, 757988, 757147, 760758, 768236, 778476, 786661, 785916, 772932, 750208, 722618, 693897, 666708, 643431, 625150, 611100, 600142, 591838, 585659, 580586, 576245, 573195, 571430, 569907, 568250, 567619, 569099, 572274, 576130, 580204, 584166, 587440, 590167, 593518, 598165, 603360, 608237, 613059, 618361, 623781, 628682, 633240, 638115, 643686, 650251, 658230, 667500, 677266, 687228, 698112, 710444, 723641, 737107, 751398, 767441, 785183, 803830, 822833, 841850, 860143, 876795, 891290, 903418, 912921, 919562, 923119, 923093, 918952, 910901, 899787, 886132, 870052, 852322, 834474, 817382, 800622, 783661, 766786, 750458, 734797, 720259, 707807, 697706, 689079, 681312, 674859, 669932, 665519, 660739, 656226, 652966, 650563, 647957, 645303, 643872, 644402, 646797, 651292, 658648, 668978, 681258, 694227]
59299F94227J2804J1618Q597L320l469j0178j5348j8419j9619j9156j7077j3976
59287F13324j1038q790o572l864j365R6Q95J819K710L104L532M860O780Q285R305
59272F23081J0594J2320J3962J5306J6277J6272J4797J2485J0271Q009N132K103
59260G60609k61k296m797p272q657r263j0216j1262j1072r652q409p758o632m658
59246F58404k875j892j061J1P64J055J663K815L687L980M556N850O960P035O362
59231F97314N494M380K988J742P71m73k282m238n969p518q734r228r095q821q294
59216F48037o900m747k862k041k357l655n494o734o437n185m324m080l680l129
59202E86412l223l773l553k284j083o50n67o48j348k316k246q71L93N39L77J057
$$ y = [694227, 707031, 718649, 727246, 730566, 727097, 716919, 701571, 683152, 663533, 644377, 627300, 613324, 602286, 593496, 586924, 583060, 581695, 581791, 582686, 584505, 587215, 590319, 593851, 598711, 605491, 613776, 623081, 633675, 645995, 659957, 675263, 691540, 707812, 722609, 735094, 745365, 753374, 758506, 760609, 760348, 758052, 753255, 745983, 737326, 728063, 717847, 706585, 695513, 685861, 677452, 669694, 663062, 658404, 655529, 653637, 652576, 652587, 653351, 654406, 656069, 658884, 662571, 666551, 671107, 676957, 683917, 690952, 697314, 702808, 707188, 710176, 711918, 712689, 712216, 709934, 705696, 699727, 692209, 683475, 674247, 665152, 656331, 648037, 641137, 636390, 633528, 631487, 629130, 625475, 619981, 613247, 606810, 601625, 597301, 593221, 589541, 586412, 583189, 579416, 575863, 573579, 572496, 571846, 571279, 570631, 569283, 566967, 564721, 563850, 564243, 564782, 565159, 566216]
59186E66216K364L339L570L232K740K814L927N382N883N322M882N167N532N575
59172F25945N863O691P518Q075Q857R896J0410J0199J0087J0419J0338R235P611
59159G41144N868L467J84l052n386p131q832j0204j0850j1176j1754j2411j2576
59146F57291j1927j0402q310o687o604p805q852q887q359p834p202o335n487m775
59132E47825m173m052m578m696l097l49J529J799J743K436L494M438N529O612
59118E54460O878O513O966Q680J0200J0404J0123J0439J0897J0561R581Q593P650
59105F71945O753O345O342N745M154K600J954J633P43m91j425k095k701k900k502
59090F96100k021j821j553j013o30n69n37q84k536n191p020p058o489o679p293
$$ y = [566216, 568580, 571919, 575489, 578721, 581461, 584275, 588202, 593584, 599467, 604789, 609671, 614838, 620370, 625945, 631808, 638499, 646017, 654092, 662949, 672845, 683255, 693454, 703541, 713960, 724298, 733533, 741144, 747012, 750479, 750663, 747611, 742225, 735094, 726262, 716058, 705208, 694032, 682278, 669867, 657291, 645364, 634962, 626652, 619965, 613361, 605556, 596704, 587817, 579458, 571624, 564422, 558087, 552600, 547825, 543652, 539600, 535022, 530326, 527229, 526880, 528409, 530208, 531951, 534387, 537881, 542319, 547848, 554460, 561338, 567851, 574817, 583497, 593697, 604101, 614224, 624663, 635560, 646121, 655702, 664295, 671945, 678698, 685043, 691385, 697130, 701284, 703884, 705838, 707471, 708214, 707723, 706298, 704203, 701502, 698602, 696100, 694079, 692258, 690705, 689692, 689062, 688493, 687956, 687072, 684536, 679345, 672325, 665267, 658778, 652099, 644806]
59075F44806p445p354p615p845p334o264n269m495l859l494l332l029k791l207
59061E71473l923l770k630j795j898k037j659j576k207k476j609n38l30o05o48
59046E43772o96r66p86P5M98k70j261j325q15n21k18M76J010R65J068J927K969
59029E45902L732M877O655P895P906Q075R915J2717J4674J5312J5281J4829J3952
59016F81722J3065J2104R959O132J908j407m145o830q516q267o999o094n282l628
59002F73722j506K07J886M196O377P304P436P895Q424Q102P188O435N384L283
58988G46333R76j55m89j529l376m760n165n138m782l724k320j264k48J519L771
58973G19649N561O805Q034R074R390R356R860J0977J2206J3372J4171J3681J1733
$$ y = [644806, 637361, 630007, 622392, 614547, 607213, 600949, 595680, 591185, 587326, 583832, 580500, 577471, 574680, 571473, 567550, 563780, 561150, 559355, 557457, 555420, 553761, 552185, 549978, 547502, 545893, 545355, 545025, 544420, 543772, 543076, 542110, 541324, 541399, 541897, 541627, 540366, 539041, 538226, 537705, 537487, 537963, 538973, 539938, 541006, 542933, 545902, 549634, 554511, 561166, 569061, 576967, 585042, 594957, 607674, 622348, 637660, 652941, 667770, 681722, 694787, 706891, 716850, 722982, 724890, 723483, 719338, 712508, 703992, 695725, 688726, 682632, 677350, 673722, 672216, 672423, 674309, 678505, 684882, 692186, 699622, 707517, 715941, 724043, 731231, 737666, 743050, 746333, 747309, 747154, 746665, 745136, 741760, 737000, 731835, 726697, 721915, 718191, 715871, 714607, 714359, 715878, 719649, 725210, 732015, 740049, 749123, 758513, 767869, 777729, 788706, 800912, 814284, 828455, 842136, 853869]
58960H53869R847R311R166P669M887K067o94m240q407j2183j5307j8005j9644
58947H18336j9474j8273j7503j7198j6290j4571j2751j1038r263p865p236o616
58935F60258n111l239j901p82O45J520R37q9r1L28k88j394j330l78l05j214j589
58918F45977j298j737k886k998j675o88r96j341o04N78J469K610M503O481P850
58903F55245Q889R994J0954J1655J2413J3176J3426J3160J2970J3021J2995J3160
58891H01058J4315J6584J9268K1896K4400K6315K6935K6338K5181K3605K1214
58880A047109J7933J3982R362M280m37m327q095j2336j6276j8961k0723k2128
58868I89383k2434k0766j7959j5530j3559j1405r648r354j0054j0379j0218j0356
$$ y = [853869, 863716, 873027, 882193, 889862, 894749, 896816, 896122, 891882, 883475, 871292, 855985, 837980, 818336, 798862, 780589, 763086, 745888, 729598, 715027, 702276, 691238, 681975, 674110, 666874, 660258, 655147, 651908, 650007, 649225, 649870, 651390, 652327, 652238, 652147, 652475, 652187, 650793, 649463, 649085, 648780, 647566, 645977, 644679, 642942, 640056, 637058, 635383, 634695, 633699, 632358, 631754, 632332, 633801, 636411, 640914, 647395, 655245, 664134, 674128, 685082, 696737, 709150, 722326, 735752, 748912, 761882, 774903, 787898, 801058, 815373, 831957, 851225, 873121, 897521, 923836, 950771, 977109, 1002290, 1025895, 1047109, 1065042, 1079024, 1088386, 1092666, 1092229, 1087902, 1079807, 1067471, 1051195, 1032234, 1011511, 989383, 966949, 946183, 928224, 912694, 899135, 887730, 878082, 868728, 858674, 848295, 838077, 827721]
58856H27721j0654j0492j0390j1153j2035j1759j0721j0133r718q463o904o294
58844G09005o269n763n499o855q900r492q843r011j0075r972q240o755o368n797
58830F01166m374l181k776k358j755j811k272j723j34R85J273J960L258L933L856
58815E96047M412N773O416N902N475N336M082J629p2j47q2r23j771k004k497l520
58799F24056l906l372l304m229m908m894n448o836p309o046m666m388m123k777
58785E57850j146n7J179K916L972L770L610M361M900M360L802M057L937K285l7
58770E99759j852l528n544o910o723n781n138m535l615l116l408l387k226p32
58756E43264K49J216K534L281K959K702L367L920L212J878J161J195J697K820
$$ y = [827721, 817067, 806575, 796185, 785032, 772997, 761238, 750517, 740384, 730666, 722203, 715299, 709005, 702736, 696973, 691474, 684619, 675719, 666227, 657384, 648373, 638298, 628326, 620086, 613331, 606963, 601166, 596792, 593611, 590835, 588477, 586722, 584911, 582639, 580916, 580782, 581767, 583040, 585000, 588258, 592191, 596047, 600459, 606232, 612648, 618550, 624025, 629361, 633443, 635072, 635000, 634853, 634771, 633848, 632077, 630073, 627576, 624056, 620150, 616778, 613474, 609245, 604337, 599443, 593995, 587159, 579850, 573804, 569138, 564750, 560627, 557850, 556704, 556647, 557826, 560742, 564714, 568484, 572094, 576455, 581355, 585715, 589517, 593574, 597511, 599796, 599759, 597907, 594379, 588835, 581925, 575202, 569421, 564283, 559748, 556133, 553017, 549609, 546222, 543996, 543264, 543513, 544729, 547263, 550544, 553503, 556205, 559572, 563492, 566704, 568582, 569743, 570938, 572635, 575455]
58742E75455M167M512L804L778N292O709O396N171M723N038N085M827M993N763
58728F45713O945Q472R792R839Q465O752N335L875K684L001M861O555P139P578
58714G37006Q533R101Q809Q706R154Q623O107K810N5k556n511p981r657j1910
58700G61289j5412j8495j9632j9775k0437k1173k0823j9637j8347j6566j3906
58689E57086j1297r575q129o401n264n331n459m576l528l485l889l633k917k429
58675D81173j986j321r23q52j44J489K907L599M640O563Q262R213J0587J2662
58661E35869J3504J1886R353P533N576K306j196l337m438n377n670n040m932o200
58647E49837p080n869l870l359m136m496m140l793l259k132j258j337j292l0J499
$$ y = [575455, 579622, 584134, 587938, 591716, 597008, 603717, 610113, 615284, 620007, 625045, 630130, 634957, 639950, 645713, 652658, 661130, 670922, 680761, 689226, 695978, 701313, 705188, 707872, 710873, 715734, 722289, 729428, 737006, 745539, 754640, 763449, 772155, 781309, 789932, 796039, 798849, 798904, 796348, 790837, 782856, 773199, 761289, 745877, 727382, 707750, 687975, 667538, 646365, 625542, 605905, 587558, 570992, 557086, 545789, 536214, 528085, 521684, 516420, 511089, 505630, 501054, 497526, 494041, 490152, 486519, 483602, 481173, 479187, 477866, 476943, 476091, 475947, 477436, 480343, 483942, 488582, 495145, 503407, 512620, 523207, 535869, 549373, 561259, 570612, 578145, 583721, 586027, 584831, 581494, 577056, 571679, 566009, 560969, 556037, 549837, 542757, 536888, 533018, 529659, 525523, 521027, 516887, 513094, 509835, 507703, 506445, 505108, 503816, 503786, 505285]
58632E05285J895J596J646J621P70k41o53j227k649l842l771l294l307k796q00
58617D90233J510K865M207O684R164J0126J0341J1136J1662J0442Q165O394M869
58604E87798K574J59j102j501j859j720p91n28k030l917m540m556m972m624k249
58589E56142P59K462L487N298P164P796Q233J0015J2021J2212J1100J0445J0028
58576F57162Q834P861Q473R386Q649P366Q021J0319J2075J3185J5228J8072K0257
58563H04888K2028K4643K7344K8270K7702K7306K6832K4633K0733J6332J1150
58552A061861M304k870p976j0813j2619j3053j1131q269p056p588q128q594j0289
58539I57779j2945j5239j7472k0583k3315k3704k2513k1900k1416j8922j4749
$$ y = [505285, 507180, 508776, 510422, 512043, 512813, 512572, 511919, 510692, 508043, 504201, 500430, 497136, 493829, 491033, 490233, 491743, 494608, 498815, 505499, 514663, 524789, 535130, 546266, 557928, 568370, 576535, 582929, 587798, 590372, 590531, 589429, 587928, 586069, 584349, 583558, 583030, 581000, 577083, 572543, 567987, 563015, 558391, 556142, 556901, 559363, 562850, 568148, 575312, 583108, 591341, 601356, 613377, 625589, 636689, 647134, 657162, 665996, 673857, 682330, 691716, 700365, 707731, 715752, 726071, 738146, 751331, 766559, 784631, 804888, 826916, 851559, 878903, 907173, 934875, 962181, 989013, 1013646, 1034379, 1050711, 1061861, 1066165, 1063295, 1055319, 1044506, 1031887, 1018834, 1007703, 999434, 992378, 984790, 976662, 968068, 957779, 944834, 929595, 912123, 891540, 868225, 844521, 822008, 800108, 778692, 759770, 745021]
58528G45021j1356r240o741l638j478n14M79J471J385P22R22J478P05j055k018
58513G16143k222l069m218m101l136l168m120m270l450k983k954k449j885k182
58499F71936k472j597q73k117l974l721j722o30r47r56j86N67J776M139O027N593
58483F70843M449N507Q300J0256J1389J3499J5914J6449J5730J5982J6400J4266
58471H18984R939O052K450l068r448j2934j2926j2396j2427j1104q071n404l563
58458G46084r04K432M421N190O905R630J1381J2086J3176J3584J0785N548J103
58445H41421k098o035j0099j1633j1127j1537j2535j0939o883l925k814q46K131
58432G53081K979J338O73K291L742M174N741Q661J0232R955J0360J1725J1215
$$ y = [745021, 733665, 724425, 717684, 714046, 712568, 712054, 712533, 714004, 715389, 716111, 717033, 718511, 719216, 718161, 716143, 713921, 710852, 706634, 702533, 699397, 696229, 692109, 687839, 684389, 681406, 678452, 676003, 674118, 671936, 669464, 667867, 666994, 664877, 660903, 657182, 655460, 654830, 653883, 652927, 652741, 653308, 655084, 659223, 665250, 670843, 675292, 680799, 689099, 699355, 710744, 724243, 740157, 756606, 772336, 788318, 804718, 818984, 828923, 834975, 837425, 834357, 824909, 811975, 799049, 786653, 774226, 763122, 755051, 749647, 746084, 745180, 747612, 752033, 757223, 764128, 773758, 785139, 797225, 810401, 823985, 834770, 840318, 841421, 839323, 833288, 823189, 811556, 800429, 788892, 776357, 765418, 758535, 754610, 751796, 750950, 753081, 756060, 757398, 758071, 760362, 764104, 768278, 774019, 782680, 792912, 802867, 813227, 824952, 836167]
58419H36167Q253N483L507J59m174o187n666o164q588r857r123r277j0963j1134
58405G72436r194q519j0046j0268p613m999m033k502L68J858J205J467L800N281
58391G29241M509L841M263L573J558J208K866K988O88m82P37J046q50j609M11
58376G53988K371K907M651Q278J0217R045Q039Q919R099P701P893J0580J2158
58363H55846J1200J1015J2935J3736J2393J2505J5010J5509J2028Q554P558O091
58351I94380K627N25J082M51k748m000j054J775J574J693M443O462N864O575J0720
58336A030369J3962J3430J3045J5937J8678J8231J7495J8754J8684J5171J2038
58325A205794J1750J0453N637J542J431J786l63j653M78K285J148R83M423P140
$$ y = [836167, 844420, 849903, 853410, 853569, 849395, 843208, 837542, 831378, 822790, 812933, 803810, 794533, 783570, 772436, 763242, 754723, 744677, 734409, 726796, 721797, 717764, 715262, 715630, 717488, 718693, 720160, 723960, 729241, 733750, 737591, 741854, 745427, 746985, 748193, 751059, 754047, 754735, 754253, 754990, 756036, 755186, 753577, 753988, 756359, 759266, 763917, 772195, 782412, 791457, 799496, 808415, 817514, 825215, 833108, 843688, 855846, 867046, 878061, 890996, 904732, 917125, 929630, 944640, 960149, 972177, 980731, 988289, 994380, 997007, 997532, 998614, 999065, 996317, 992317, 991263, 993038, 994612, 996305, 1000748, 1007210, 1013074, 1019649, 1030369, 1044331, 1057761, 1070806, 1086743, 1105421, 1123652, 1141147, 1159901, 1178585, 1193756, 1205794, 1217544, 1227997, 1233634, 1235176, 1236607, 1238393, 1238030, 1236377, 1236855, 1239140, 1240288, 1241271, 1245694, 1252834]
58311A252834N992N211Q281J1328J0878J0457J3079J4968J3317J2413J5305J7424
58299A391487J5308J3518J5790J7682J5375J3408J5979J8896J7949J6942J9498
58288A571832K1391J9116J7540K0682K3627K2041K0772K4245K7408K5436K3338
58277A817428K6410L0173K9481K8508L1874L5092L3845L3411L8626M3947M3939
58266B192734M3814M8951N4084N3996N4380O0622O6393O5526O4227O8918P3158
58255B846803O9925O5648O8102P1622O8746O5373O9401P5434P5967P6543Q4325
58244C637889R3013R4994R6732J05905J15604J18031J20970J33107J46350J51148
58234D813743J55525J69590J85461J92884K00119K17870K37612K48262K58885
$$ y = [1252834, 1258826, 1264037, 1272318, 1283646, 1294524, 1304981, 1318060, 1333028, 1346345, 1358758, 1374063, 1391487, 1406795, 1420313, 1436103, 1453785, 1469160, 1482568, 1498547, 1517443, 1535392, 1552334, 1571832, 1593223, 1612339, 1629879, 1650561, 1674188, 1696229, 1717001, 1741246, 1768654, 1794090, 1817428, 1843838, 1874011, 1903492, 1932000, 1963874, 1998966, 2032811, 2066222, 2104848, 2148795, 2192734, 2236548, 2285499, 2339583, 2393579, 2447959, 2508581, 2574974, 2640500, 2704727, 2773645, 2846803, 2916728, 2982376, 3050478, 3122100, 3190846, 3256219, 3325620, 3401054, 3477021, 3553564, 3637889, 3730902, 3825896, 3922628, 4028533, 4144137, 4262168, 4383138, 4516245, 4662595, 4813743, 4969268, 5138858, 5324319, 5517203, 5717322, 5935192, 6172804, 6421066, 6679951]
58225F679951K81373L06771L23544L42396L76741M16089M46648M79977N31549
58216A0185039N90044O39743O93595P70268Q59207R44637J042455J174477J329361
58207A8228826J491172J682507J934330K239638K585624L001440L519065M120243
58199C8802845M785916N565417O531599P713217R155939J1003993J3423875J6493972
58191A13476773K0257936K4760538K9809758L4760116L8785802M1311109M1772696
58184C44934728L8904633L0917032J7112979o15409j8313505l2217674m0572619
58177C40150165m3658637m2737079l9221471l4386463k9221620k4316467j9937585
58170A06670843j6210700j3176625j0757911q816341p259417o037714n076093
$$ y = [6679951, 6961324, 7268095, 7591639, 7934035, 8310776, 8726865, 9173513, 9653490, 10185039, 10775083, 11414826, 12108421, 12878689, 13737896, 14682533, 15724988, 16899465, 18228826, 19719998, 21402505, 23336835, 25576473, 28162097, 31163537, 34682602, 38802845, 43588761, 49154178, 55685777, 63398994, 72554933, 83558926, 96982801, 113476773, 133734709, 158495247, 188305005, 223065121, 261850923, 303162032, 344934728, 383839361, 414756393, 431869372, 431253963, 412940458, 380722784, 340150165, 296491528, 253754449, 214532978, 180146515, 150924895, 126608428, 106670843, 90460143, 77283518, 66525607, 57709266, 50449849, 44412135, 39336042]
58163C9336042m286701l632102l110342k693268k335848k028466j784561j589665
58155A7875089j411913j249727j122057j022259r24963q28596p50210o86903o20638
58146I257823n53542n02325m64347m22757l78895l47887l28108l05270k80900
58137E673792k67635k61554k47214k25627k10701k02384j88903j71354j61095
58128C737325j56345j45323j29528j20933j18979j12457j01534r6341r6112r0580
58118B569193q0166p4749p4222o9500o1159n8196n9830n6732m9119m5948m7407
58107A892165m5324l9892l9098m2414m1439l6094l4369l6573l5311l0553k9578
58096A481520l2288l1392k6933k6293k9789l0218k6662k5269k6453k4486j9795
$$ y = [39336042, 35049341, 31417239, 28306897, 25613629, 23277781, 21249315, 19464754, 17875089, 16463176, 15213449, 14091392, 13069133, 12144170, 11315574, 10565364, 9878461, 9257823, 8704281, 8201956, 7737609, 7314852, 6935957, 6588070, 6259962, 5954692, 5673792, 5406157, 5144603, 4897389, 4671762, 4461061, 4258677, 4069774, 3898420, 3737325, 3580980, 3435657, 3306129, 3185196, 3066217, 2953760, 2852226, 2755885, 2659773, 2569193, 2489027, 2414278, 2340056, 2270556, 2209397, 2151201, 2091371, 2034639, 1985520, 1939572, 1892165, 1846841, 1806949, 1767851, 1725437, 1683998, 1647904, 1613535, 1576962, 1541651, 1511098, 1481520, 1449232, 1417840, 1390907, 1364614, 1334825, 1304607, 1277945, 1252676, 1226223, 1201737, 1181942]
58085A181942j8710k1125k0924j8323j9247k2929k2751j9159j9063k2539k2622
58074I54550j8421j6171j7000j5829j2772j3447j7320j7669j3949j2533j4391
58063G85048j3680r568p877r592r065n266l827o114p033n368n893r310j0416q183
58049F73856p605r591r071n159l280m962n273k710k080m953o629n295n153p628
58035E94467q324n688m236o103p520o623o812r398j0596q788p523q450q439o291
58021D89676n303o635p026n448n181o982p199m875l854n436n876l561j913k667
58007D17720k908j257n14j733j947j55P21p9N32L040L722J686R75L350N423N287
57991D33863N584P391P557M799K297J605M2l259m986l977l807o209p904o870n742
$$ y = [1181942, 1163232, 1142107, 1121183, 1102860, 1083613, 1060684, 1037933, 1018774, 999711, 977172, 954550, 936129, 919958, 902958, 887129, 874357, 860910, 843590, 825921, 811972, 799439, 785048, 771368, 761800, 753923, 744331, 735266, 730000, 726173, 720059, 713026, 707658, 701765, 692455, 682039, 673856, 666251, 656660, 647589, 642430, 639150, 634188, 628915, 626205, 624125, 619172, 612543, 607248, 602095, 594467, 586143, 580455, 576219, 570116, 562596, 555973, 549161, 539763, 529167, 520379, 512856, 504406, 495967, 489676, 484373, 477738, 470712, 465264, 460083, 453101, 445902, 441027, 437173, 431737, 425861, 422300, 420387, 417720, 414812, 413555, 413041, 411308, 409361, 409206, 409927, 409848, 410380, 413420, 417142, 418828, 419803, 423153, 428576, 433863, 439447, 446838, 454395, 459194, 461491, 463096, 463138, 459879, 454893, 450916, 447109, 440900, 432996, 426126, 420384]
57976D20384o118n514k977j784l343m174k302q49j900k447j76K147J876J015J722
57961C95560K138N59p40L50J934J844J197J127R4k449l859k844k067l276m117
57946C85451k713j225j581j868k05J711K141K617M550O243O317O627Q714J0823
57932D27602J1242J1159J1592J0925Q161N153L248J186j526l023l050m320p567
57919D70782r497q338o965p639q098o121l703l162l055j615n17j513k764k146
57905D05649j065j457k136j523j020k308m096m689m996n987o158m512l099l531
57891C59072l951k447m60K08P26K439L742K945J489J180J065J1m97P23J711N72
57875C68528j188j578j536k354k667j238Q2m50j070K38J789J092p27r71K62J190
$$ y = [420384, 414266, 408752, 405775, 403991, 400648, 396474, 394172, 393323, 391423, 388976, 388800, 390947, 392823, 393838, 395560, 397698, 398257, 397517, 397867, 399801, 401645, 402842, 403969, 404063, 401614, 397755, 394911, 392844, 389568, 385451, 382738, 381513, 379932, 378064, 377859, 379570, 381711, 384328, 388878, 395121, 401438, 408065, 416779, 427602, 438844, 450003, 461595, 472520, 480681, 485834, 489082, 490268, 488742, 485719, 482669, 478349, 470782, 461285, 452947, 445982, 438343, 430245, 424124, 420421, 417259, 414204, 412589, 412072, 410559, 407795, 405649, 404584, 403127, 400991, 399468, 398448, 396140, 392044, 387355, 382359, 376372, 370214, 365702, 362603, 359072, 355121, 352674, 352214, 352422, 353148, 355587, 359329, 362274, 363763, 364943, 366008, 366019, 365522, 366245, 367956, 368528, 367340, 365762, 364226, 361872, 359205, 357967, 358049, 357599, 356529, 356767, 358556, 359648, 358921, 357950, 358212, 359402]
57859C59402J766K780L462L009K597L135L188J770P21J498K228J025n06l12J90
57844C85953j247l552m398m234m705n167m337l472m326n624n101l406k684k866
57830C30834k537j968k122k177j055J56J28p2Q91J863J506J284K905M769M383
57815C38788K530J619J445M3k545m671o000p095p413o565o040o852p141n054k177
57800B82872j054j087k06J167J298P08J154K272K564K458L228M183M029L639M366
57785C11591N110M188K614K279K539J882J317K562M439M714M075M583N502M613
57771C62008K474J471J566P96q13j591j737k747m057l912k894l027l972l698k352
57756C37515j861k286k058j340j534k080j315Nk51j488j072J130K606K415J942
$$ y = [359402, 361168, 363948, 367410, 370419, 373016, 376151, 379339, 381109, 381830, 383328, 385556, 386581, 386075, 385763, 385953, 384706, 381154, 376756, 372522, 367817, 362650, 358313, 354841, 350515, 344891, 339790, 336384, 333700, 330834, 328297, 326329, 324207, 322030, 320975, 321131, 321259, 321187, 322078, 323941, 325447, 326731, 329636, 334405, 338788, 341318, 342937, 344382, 344425, 341880, 337209, 331209, 324114, 316701, 310136, 304096, 297244, 290103, 285049, 282872, 281818, 280731, 280525, 281692, 282990, 283698, 284852, 287124, 289688, 292146, 295374, 299557, 303586, 307225, 311591, 316701, 320889, 323503, 325782, 328321, 330203, 331520, 334082, 338521, 343235, 347310, 351893, 357395, 362008, 364482, 365953, 367519, 368315, 367502, 365911, 364174, 361427, 357370, 353458, 350564, 347537, 343565, 339867, 337515, 335654, 333368, 331310, 329970, 328436, 326356, 325041, 325046, 324795, 323307, 322235, 323365, 325971, 328386, 330328]
57741C30328J613M27j196j589r67j102j935j830j015j408l006l837l450l160k946
57726C04927j656j87p71k904l672k435j575k153k514j895j809k898l645l316l167
57711B70330l801m085l541l170l245k826k027k108k949l026k186j696j472k05
57697B33993J593J868O59J58O81J18j932l028k009q33r29r23L87J677J512P95
57681B33787J082K489M523P131R828J1742J3370J6426K1368K7075L3314M1009
57669D23144M9556N6581O1109O4025O4266N7418M0110J4180j4559l9998n7644
57658G18188o5662o5728o1525n5390m7639l9019l1379k5396k0092j5330j2367
57647B78661j1160r634o748l990k736k294j666j099p85n2J102J560J143J162K033
$$ y = [330328, 331941, 332368, 331172, 329583, 328616, 327514, 325579, 323749, 322734, 321326, 318320, 314483, 311033, 307873, 304927, 303271, 303084, 302313, 299409, 295737, 293302, 291727, 289574, 287060, 285165, 283356, 280458, 276813, 273497, 270330, 266529, 262444, 258903, 255733, 252488, 249662, 247635, 245527, 242578, 239552, 237366, 235670, 234198, 233993, 235586, 237454, 238113, 238271, 238952, 239070, 237138, 234110, 232101, 231268, 230339, 229416, 229803, 231480, 232992, 233787, 234869, 237358, 241881, 249012, 258840, 270582, 283952, 300378, 321746, 348821, 382135, 423144, 472700, 529281, 590390, 654415, 718681, 776099, 816209, 830389, 815830, 775832, 718188, 652526, 586798, 525273, 469883, 422244, 383225, 351846, 326450, 306358, 291028, 278661, 267501, 257867, 251119, 247129, 244393, 242099, 240433, 239334, 238549, 238497, 239599, 241159, 242302, 243464, 245497]
57632B45497K388J459L36p8l56r16j038n30m01j014j440j354j627k356k384j544
57616B34642j164j603j541n46k2o22j113q10p70j491j745r59l89p00o93J86M21
57599B21081q63k110j848j083j337k203k586k646k891k828k080j484j714k148
57585A93260k124j893j445k04J302J447J40o85l20n72k472m103l544j806q43o55
57569A75483l22k04r21j631j344p08p86j274j495j795k337k015k32J589J985J607
57553A65600J731K029J586Q88R25J311J020J20p73j812l224m224m048l216k532
57538A55381j756m93O37Q97N07j95j439k943l516k907k596l514m456m082l040
57523A26485k643k819k886k993l279k893j380J69P56J078K048L045L200L128L800
$$ y = [245497, 247885, 249344, 249680, 249602, 249246, 248330, 247292, 246762, 246361, 245347, 243907, 242553, 240926, 238570, 236186, 234642, 233478, 231875, 230334, 229788, 229766, 229144, 228031, 227221, 226451, 224960, 223215, 222256, 221867, 221167, 220474, 220660, 221081, 220218, 218108, 216260, 215177, 213840, 211637, 209051, 206405, 203514, 200686, 198606, 197122, 195408, 193260, 191136, 189243, 187798, 187594, 188896, 190343, 190483, 189798, 189478, 188906, 186434, 182331, 178787, 176981, 176138, 175483, 175161, 174957, 174036, 172405, 171061, 170353, 169567, 168293, 166798, 165003, 162666, 160651, 160419, 162008, 163993, 165600, 167331, 169360, 170946, 171834, 172759, 174070, 175090, 175210, 174437, 172625, 169401, 165177, 161129, 157913, 155381, 153625, 153132, 153769, 154666, 155173, 154978, 153539, 150596, 147080, 144173, 141577, 138063, 133607, 129525, 126485, 123842, 121023, 118137, 115144, 111865, 108972, 107592, 107761, 108517, 109595, 111643, 114688, 117888, 121016, 124816]
57508A24816M774N094M885M694M325L691L608M364M747L824K380J304O1j726k801
57493A68040k188j126j239k051k173j758j783k070j881j553j628j413k15J005
57479A47967R90L04K19M86J06o63r44j080j903k937l156k767k533k142j051p4
57463A30822k66r91r08j65K50M91J271K062J819R36N50N02q6q43o90N5J26n26
57445A34409q23n63n11p25n36l3J0m18n47r6N92J244J476O58q78j449j89J398
57427A33019J573Q78Q59J386J283O67M82M36m04j517j598q53n12n19J27J095J036
57410A37438J4n11q7L27L23N06R27R20N57N57Q04N55M9J40N37J89p09q49K4Q41
57390A42552J069J127J072O06L70J324K872L351K512J738J723J701J150N41R2
$$ y = [124816, 129590, 134684, 139569, 144263, 148588, 152279, 155887, 160251, 164998, 168822, 171202, 172506, 172567, 170841, 168040, 165852, 164726, 163487, 161436, 159263, 157505, 155722, 153652, 151771, 150218, 148590, 147177, 146962, 147967, 148957, 149261, 149480, 149966, 150072, 149409, 148465, 147385, 145482, 142545, 139389, 136622, 134089, 131947, 130896, 130822, 130556, 129565, 128657, 128492, 128742, 129233, 130504, 132566, 134385, 135321, 135871, 136373, 136287, 135444, 134754, 134809, 134935, 134409, 133586, 133023, 132512, 131787, 131251, 131218, 131228, 130810, 130263, 130167, 130759, 132003, 133479, 134137, 133259, 131810, 131621, 133019, 134592, 135470, 136329, 137715, 138998, 139665, 140147, 140583, 140179, 138662, 137064, 136211, 135699, 135180, 135307, 136402, 137438, 137452, 136941, 136854, 137181, 137504, 138010, 138937, 139857, 140414, 140971, 141775, 142330, 142379, 142519, 143056, 143245, 142536, 141687, 141711, 142552, 143621, 144748, 145820, 146426, 146796, 148120, 150992, 154343, 156855, 158593, 160316, 162017, 163167, 163708, 163800]
57375A63800n28j031o04M80R10K75m71o88p94j046r93n09j37j02r2m1j30l6O64
57356A58927J461J505J001P67O79Kr57j064j31Q99J492J802J656P51k41k61N34
57339A68822J086J133J151J001K70m17j57M11m5j176j415o46k74n82k94Q65J423
57322A71156O08m48p39p94j241j543j150n73m10m19k51j56l43n20n03m90m84k18
57304A61482K79P88J400K096K259J601J048J420J906J426Q10J653L458M134L168
57289A88928K148K024K017J586J372J687J913J944K466L345L456K572J775J614
57275B18847J470J117J161J563J437P35M15N68J73q58j217l86N18O87O99J020
57259B27949J186J116J572K608L156K844K628L018L279K957K612K449J932J292
$$ y = [163800, 163272, 162241, 161637, 162117, 163027, 163302, 162831, 162143, 161349, 160303, 159310, 158801, 158664, 158562, 158470, 158429, 158299, 158263, 158927, 160388, 161893, 162894, 163661, 164340, 164342, 163385, 162321, 162190, 163089, 164581, 166383, 168039, 168790, 168549, 168288, 168822, 169908, 171041, 172192, 173193, 173463, 173046, 172889, 173300, 173255, 172079, 170664, 170018, 169744, 169162, 168868, 169733, 171156, 171764, 171316, 170577, 169783, 168542, 166999, 165849, 165276, 164866, 164447, 164196, 164040, 163697, 163177, 162674, 162184, 161700, 161482, 161761, 162549, 163949, 166045, 168304, 169905, 170953, 172373, 174279, 175705, 176515, 178168, 181626, 185760, 188928, 191076, 193100, 195117, 196703, 198075, 199762, 201675, 203619, 206085, 209430, 212886, 215458, 217233, 218847, 220317, 221434, 222595, 224158, 225595, 226330, 226745, 227313, 227486, 226628, 225411, 225025, 225543, 226230, 226929, 227949, 229135, 230251, 231823, 234431, 237587, 240431, 243059, 246077, 249356, 252313, 254925, 257374, 259306, 260598]
57245B60598J614K806L322K643K097K453K701K222K109L060L878L468K713K802
57231B98486L221K946K390K496K955K846K302K116K369K617K927L673M717N606
57217C41667O230O797P525Q641J0008J0822J0477R702R692J0251J0219R643R837
57204D61511J1091J2132J2304J2501J3393J4392J5018J5620J6215J6247J6005
57193F16429J6529J7574J7671J6791J6808J8406J9759J9434J8499J8368J8519
57182H14787J7993J7408J7734J8541J9043J9564K0519K1222K1173K1254K2165
57171A031403K2945K2539K1641K1506K1927K1934K1520K1353K1554K1986K2911
57160A273219K4247K5172K5329K5474K6019K6219K5777K5849K7164K8540K8587
$$ y = [260598, 262212, 265018, 268340, 270983, 273080, 275533, 278234, 280456, 282565, 285625, 289503, 292971, 295684, 298486, 301707, 304653, 307043, 309539, 312494, 315340, 317642, 319758, 322127, 324744, 327671, 331344, 336061, 341667, 347897, 354694, 362219, 370860, 380868, 391690, 402167, 411869, 421561, 431812, 442031, 451674, 461511, 472602, 484734, 497038, 509539, 522932, 537324, 552342, 567962, 584177, 600424, 616429, 632958, 650532, 668203, 684994, 701802, 720208, 739967, 759401, 777900, 796268, 814787, 832780, 850188, 867922, 886463, 905506, 925070, 945589, 966811, 987984, 1009238, 1031403, 1054348, 1076887, 1098528, 1120034, 1141961, 1163895, 1185415, 1206768, 1228322, 1250308, 1273219, 1297466, 1322638, 1347967, 1373441, 1399460, 1425679, 1451456, 1477305, 1504469, 1533009, 1561596]
57149A561596K7753K7251K7113K6628K5841K5248K4818K4427K4346K4436K3950
57138A843407K2950K2647K3427K3999K3572K3303K4306K5780K6653K7573K9640
57127B117257L2414L4871L7259M0298M3550M6165M8361N0754N3140N5381N8532
57116B617982O3682P0559P8585Q8207R9807J12384J24784J37204J50132J63014
57106C706340J75713J90332K09917K36147K69763L12482L66836M34753N17717
57097F420000O17802P37428Q78470J042345J229947J440567J671445J918520K175831
57088A8132355K433218K675959K887527L052391L158451L201100L183772L105739
57080D1830512K943364K649150K180606J536435P65706n6079q59269j596821k242650
$$ y = [1561596, 1589349, 1616600, 1643713, 1670341, 1696182, 1721430, 1746248, 1770675, 1795021, 1819457, 1843407, 1866357, 1889004, 1912431, 1936430, 1960002, 1983305, 2007611, 2033391, 2060044, 2087617, 2117257, 2149671, 2184542, 2221801, 2262099, 2305649, 2351814, 2400175, 2450929, 2504069, 2559450, 2617982, 2681664, 2752223, 2830808, 2919015, 3018822, 3131206, 3255990, 3393194, 3543326, 3706340, 3882053, 4072385, 4282302, 4518449, 4788212, 5100694, 5467530, 5902283, 6420000, 7037802, 7775230, 8653700, 9696045, 10925992, 12366559, 14038004, 15956524, 18132355, 20565573, 23241532, 26129059, 29181450, 32339901, 35541001, 38724773, 41830512, 44773876, 47423026, 49603632, 51140067, 51905773, 51849694, 50990425, 49393604, 47150954]
57071D7150954k781201l197807l476839l609083l600459l472359l254186k976514
57063B0782506k668169k353686k050450j768891j515409j293504j102872r40362
57055G089163q02841o87858n92094n11506m43369l86346l38578k97575k61997
57046B766999k31595k05374j81707j60272j41889j26311j12134r8976q7702p8221
57036A342818o9061n9565n0658m2698l4213k3619j1105J882J4143K4890L2485
57025A125299L3280K2571j270l2710o0960p7853q3178q1457p5814o7221n7560
57014F43127m9411m3137l7103l0945k6057k2882k0228j7453j5099j3214j1225
57003C56373r526r147r747r945r601r725j0203r837q532p349o450n140l806l450
$$ y = [47150954, 44369753, 41171946, 37695107, 34086024, 30485565, 27013206, 23759020, 20782506, 18114337, 15760651, 13710201, 11941310, 10425901, 9132397, 8029525, 7089163, 6286322, 5598464, 5006370, 4494864, 4051495, 3665149, 3326571, 3028996, 2766999, 2535404, 2330030, 2148323, 1988051, 1846162, 1719851, 1607717, 1508741, 1421039, 1342818, 1273757, 1214192, 1163534, 1120836, 1086623, 1063004, 1051899, 1053781, 1067924, 1092814, 1125299, 1158579, 1181150, 1179880, 1147170, 1086210, 1008357, 925179, 843722, 767908, 700687, 643127, 593716, 550579, 513476, 482531, 456474, 433592, 413364, 395911, 380812, 367598, 356373, 346847, 337700, 327953, 318008, 308407, 298682, 288479, 278642, 270110, 262761, 256311, 251171, 247365, 243915]
56989B43915l343j655J513M227N903P830J0210J1390J0554Q600N726P76o039j2185
56975B87422j5641j6749j6482j4943j2450j0063p994n347k152J56J097K117M383
56962A93354P335J0217J3250J6456J8995K0511K1471K1475J8790J2457L528o162
56950C51677j5046k1428k4029k3486k1757j9651j6554j2635r146o216k633J610
56938A80706M868O693Q861J2666J7204K1296K5002K8269K9950K9207K6064J9788
56926D10574R030n270j9043k8602l3455l4861l3564l0205k6105k2133j8015j3766
56914A54585j0323q064o284m887m759n691n895m602l217k810k493j417l92j20
56900I3631K46J331K160K028K108L592N783P506R035J1184J3835J6721K0295K4510
$$ y = [243915, 240572, 238917, 240430, 244657, 250560, 258390, 268600, 279990, 290544, 299144, 304870, 305646, 299607, 287422, 271781, 255032, 238550, 223607, 211157, 201094, 193100, 187753, 185601, 185757, 186854, 188971, 193354, 200689, 210906, 224156, 240612, 259607, 280118, 301589, 323064, 341854, 354311, 357839, 351677, 336631, 315203, 291174, 267688, 245931, 226280, 209726, 197091, 187945, 181729, 179096, 180706, 185574, 192267, 201128, 213794, 230998, 252294, 277296, 305565, 335515, 364722, 390786, 410574, 419604, 414334, 395291, 366689, 333234, 298373, 264809, 234604, 208499, 186366, 168351, 154585, 144262, 136198, 129914, 125027, 120268, 114577, 108682, 104080, 100863, 98053, 95560, 94143, 93751, 93631, 93877, 95208, 97368, 99396, 101504, 105096, 110879, 118385, 127420, 138604, 152439, 169160, 189455, 213965]
56886B13965K8064K9960L0449K9238K4650J6031N615l572j0453j5252j7635j7174
56874C13886j4611j1223p663m350j783N66M361J0251J6798K2620K8312L5108M2891
56861D35163N0539N7101O1536O2349N8296M8498L1930Q865j6546l7534m9911n4493
56849F55793n3809m8914m0608l1072k2049j3278m357L702J0535J8044K7988L9669
56837E41644N1844O4931P9127R2064J00604J03346R9065Q4381N6322J7066k5740
56826A264654o3218q8996j00766j00703r3846q4155p2421n8629m4608l2521k2247
56815E02544j2298k275P527J7730K9102M0915N1836O1552O9849P4864P3744O4304
56803I79394M5300J7052j6395m7341o9074p9964q2161p8095o9958o0441n1331
$$ y = [213965, 242029, 271989, 302438, 331676, 356326, 372357, 377972, 374400, 363947, 348695, 331060, 313886, 299275, 288052, 280389, 276039, 274256, 274822, 279183, 289434, 306232, 328852, 357164, 392272, 435163, 485702, 542803, 604339, 666688, 724984, 773482, 805412, 814277, 797731, 760197, 710286, 655793, 601984, 553070, 512462, 481390, 459341, 446063, 441706, 445408, 455943, 473987, 501975, 541644, 593488, 658419, 737546, 829610, 930214, 1033560, 1132625, 1217006, 1273328, 1290394, 1264654, 1201436, 1112440, 1011674, 910971, 817125, 732970, 660549, 601920, 557312, 524791, 502544, 490246, 487971, 495498, 513228, 542330, 583245, 635081, 696633, 766482, 841346, 915090, 979394, 1024694, 1041746, 1025351, 978010, 908936, 828972, 746811, 668716, 598758, 538317, 486986]
56792D86986m2226l2522k3379j5919r190j956N087J1094J7229K4574L1460L5651
56780D86889L7580L8375L6010K6890J0820q316k6264m0298m8461n0245m7869m4291
56768C70820m0090l4424k8163k3311j9917j6445j2896j0714r833q577o581n211
56756A54658m957m807m354m246m430m022k958j930r16L08P78l74j777j360L48
56741A19961R22k89j645k168k378k363j549m60k53m95K21J535J700O85K55Q38
56725A14517R86K41m3P17J346J124Q30J003J171J193J431J393J99j376j503p9
56709A23150J155J491J870K504K298J141M34O87P02j73r73r79p62q02q07q16j211
56692A28909j430n05R78J435Q85Q38J495J407L04j96O74J617J549J014O33J58
$$ y = [486986, 444760, 412238, 388859, 372940, 363750, 361794, 366881, 377975, 395204, 419778, 451238, 486889, 524469, 562844, 598854, 625744, 636564, 628248, 601984, 561686, 513225, 462980, 415111, 370820, 330730, 296306, 268143, 244832, 224915, 208470, 195574, 184860, 175027, 166450, 159869, 154658, 149701, 144894, 140540, 136294, 131864, 127842, 124884, 122954, 122038, 122346, 123124, 122750, 120973, 119613, 119961, 120883, 120594, 118949, 116781, 114403, 112040, 110491, 110031, 109778, 109283, 109504, 111039, 112739, 113424, 113679, 114517, 115503, 115744, 115701, 116418, 117764, 118888, 119718, 120721, 121892, 123085, 124516, 125909, 126108, 124732, 123229, 123150, 124305, 125796, 127666, 130170, 132468, 133609, 134043, 134730, 135432, 135259, 134286, 133307, 132545, 131743, 130936, 130120, 128909, 127479, 126974, 127952, 129387, 130272, 131110, 132605, 134012, 134316, 134120, 134794, 136411, 137960, 138974, 139607, 139765]
56676A39765k37K67J340J414O6j255j512j222q08K36J794K660K325J652J252Q12
56660A48549M70J017K241K856K519K152J979J150l04j100p86k86OO44J347R33
56644A63387m09r97k79M22L64L82Q68R22K42k52l14q23j705j688p36m25j162j382
56626A56415m36J01q70k234k766k869l027k649j627j108j527j717j058n75q29
56611A33224p57K49J057Q21L81M12Q4j096j917j340j57M52N67O26M69K36O16J315
56593A35242R94l53q85K87J650J765J230R57M39q35j958j972j258m61M79J345
56577A36666J318O15O70J767K378J795J403K268L390L615L402L490L616L706M529
56562A74628O023O909O982P740R574J0565R387P261N518L474M46k166k809k138
$$ y = [139765, 139528, 139795, 141135, 142549, 142615, 141360, 139848, 138626, 137818, 138054, 139848, 142508, 144833, 146485, 147737, 148549, 149019, 150036, 152277, 155133, 157652, 159804, 161783, 162933, 162629, 161529, 160743, 160457, 160463, 161107, 162454, 163387, 162978, 161981, 161702, 162124, 162488, 162870, 163738, 164660, 164902, 164650, 164336, 163513, 161808, 160120, 159384, 158959, 157797, 156415, 155979, 156080, 155210, 152976, 150210, 147341, 144314, 141665, 140038, 138930, 137403, 135686, 134628, 134053, 133224, 132467, 132716, 133773, 134594, 134975, 135387, 135471, 134375, 132458, 131118, 130961, 131413, 131980, 132606, 133075, 133311, 133927, 135242, 136236, 135883, 134998, 135285, 136935, 138700, 139930, 140887, 141326, 140491, 138533, 136561, 135303, 134842, 135321, 136666, 137984, 138599, 139269, 141036, 143414, 145209, 146612, 148880, 152270, 155885, 159287, 162777, 166393, 170099, 174628, 180651, 187560, 194542, 202282, 211856, 222421, 231808, 239069, 244587, 248061, 248507, 246341, 243532, 241394]
56548B41394j703j769j870k047k117j358j32p5j474k408j761r90j434k090j770
56533B18396j310j788k433k221j796j922j840r55l62q84j363p24nm43j235j195
56517A97920r39j525k379k477k108j834j280m54n07j564j787l21R09K38j045j162
56501A79685q50j512k339j899r17r33j613j768j667j987j897m93J116J462J137
56486A65525J356J621R80K02L67O60j03j099r04rL44M73J225J967J837J624K213
56469A78279K619J794Q50J116J597Q81n2L69J217O50p03r11j08J21l11m42o79
56452A86287j921l133k574p54M48Q11J371J917J548R08J206J760J096k08l64N73
56436A88971J064Q52Q51R60M41j76O1M34k79j300r55L71Q50J79l75l36j81K43
$$ y = [241394, 239691, 237922, 236052, 234005, 231888, 230530, 230398, 230323, 228849, 226441, 224680, 223690, 222256, 220166, 218396, 217086, 215298, 212865, 210644, 208848, 206926, 205086, 204131, 203769, 202885, 201522, 200798, 200793, 200350, 199115, 197920, 196981, 195456, 193077, 190600, 188492, 186658, 185378, 184924, 184417, 182853, 181066, 180745, 181654, 181892, 180847, 179685, 178835, 177323, 174984, 173085, 172168, 171235, 169622, 167854, 166187, 164200, 162303, 161810, 162926, 164388, 165525, 166881, 168502, 169482, 169684, 170051, 170711, 170608, 169509, 168605, 168596, 168940, 169413, 170638, 172605, 174442, 176066, 178279, 180898, 182692, 183542, 184658, 186255, 187136, 187084, 187453, 188670, 189320, 188617, 187706, 187598, 187719, 187408, 186966, 186287, 184366, 181233, 178659, 177905, 178353, 179164, 180535, 182452, 184000, 184908, 186114, 187874, 188970, 188762, 188398, 188971, 190035, 190887, 191738, 192698, 193139, 192963, 193024, 193458, 193179, 191879, 190924, 191295, 192145, 192324, 191949, 191613, 191432, 191675]
56418A91675J275K112J944J529J726J653M29o37l0J157R95J9K3Q23J048R82J669
56401B08392K275J365j26k40N78L81q08j482j708k584l435k712j117o71j321j448
56385A95339j068j368j715m58J703K361J160m4m35p27q13K5R50N42m07P8J764
56368A96887K705K551K500K564J895J209J850L047L062K335K373K506J157n19
56354B26122O6K492L864L318K470J887P56l43p6O03k32j582p75J675K638J648
56338B44531J386K778L789L566L711M697M901L941L454L836L676K992L479M948
56324B95685N038L201J635J505J427M27o55j238j668j522j45J133M51j129q84
56309C03261J002J795R33O55J765K628K614K876L420L089K540L559N321N274L700
$$ y = [191675, 192950, 195062, 197006, 198535, 200261, 201914, 202343, 201706, 201676, 202833, 203828, 203847, 203870, 204693, 205741, 206723, 208392, 210667, 212032, 211906, 211666, 212244, 212625, 211817, 210335, 208627, 206043, 202608, 199896, 198779, 198108, 196787, 195339, 194271, 192903, 191188, 190730, 192433, 194794, 195954, 195910, 195475, 194748, 193935, 193960, 194910, 195452, 195045, 195123, 196887, 199592, 202143, 204643, 207207, 209102, 210311, 212161, 215208, 218270, 220605, 222978, 225484, 226641, 226122, 226188, 228680, 232544, 235862, 238332, 240219, 240975, 240632, 240556, 241159, 240927, 239345, 238570, 240245, 242883, 244531, 245917, 248695, 252484, 256050, 259761, 264458, 269359, 273300, 276754, 280590, 284266, 287258, 290737, 295685, 300723, 303924, 305559, 307064, 308491, 308918, 308263, 307025, 305357, 303835, 303690, 304823, 305274, 304145, 303261, 304263, 306058, 306991, 307646, 309411, 312039, 314653, 317529, 320949, 324038, 326578, 330137, 335458, 340732, 344432]
56294C44432L316M306M116K367J617K649L432L354M074N555N659M440M517O401
56280D00235P758P959Q838J0290R847P647P025R020J0957J1625J3057J5826J7408
56267E37492J6889J6692J7971J8859J8879K0458K4303K7845L0100L3546L9246
56256H02280M4677M8510N3128O0262O8352P6264Q5374R5880J05302J12725J20383
56245A673137J29050J36100J40058J42726J44671J43087J36371J26519J14711
56236B886430R8839P7846N4296L0304N054k1379m5928o6633q4822j01103j13345
56225B719559j20768j25747j29455j30049j27166j23592j20305j14707j06077
56216A621693r7913r2241q6501p8790p1281o5654o0000n3290m8038m5426m2519
$$ y = [344432, 347748, 352054, 356170, 358537, 360154, 362803, 366235, 369589, 373663, 379218, 384877, 389317, 393834, 400235, 407993, 415952, 424790, 435080, 444927, 452574, 459599, 468619, 479576, 491201, 504258, 520084, 537492, 554381, 571073, 589044, 607903, 626782, 647240, 671543, 699388, 729488, 763034, 802280, 846957, 895467, 948595, 1008857, 1077209, 1153473, 1238847, 1334727, 1440029, 1552754, 1673137, 1802187, 1938287, 2078345, 2221071, 2365742, 2508829, 2645200, 2771719, 2886430, 2985269, 3063115, 3117411, 3147715, 3152769, 3131390, 3085462, 3018829, 2934007, 2832904, 2719559, 2598791, 2473044, 2343589, 2213540, 2086374, 1962782, 1842477, 1727770, 1621693, 1523780, 1431539, 1345038, 1266248, 1194967, 1129313, 1069313, 1016023, 967985, 922559, 880040]
56205H80040l7513l2989l0868k8843k5108k1842k0638j9208j6019j3532j3378
56194F20102j3007j0614q547q430p770n076l400m870o538n614m069m020l510j061
56180E33576M14j263l127k192n31q25j408j67J055M20P3J821L217K335J835L912
56164E39145N846N165M512O572Q868Q541P721R153J0900J0496R972J1707J3681
56151F52279J3835J4685J8560K2693K4225K5600K9893L5413M0107M6515N6882
56140I80687O8111P6978Q5601R6076J04626J06921J04397R9505Q9989P4393N8324
56129A945608M8286M3480L9858L7495L7223L4824K5995J3382K064p844j7819k5162
56117B177390k7749l0170l7933m9577o1187p3768q8748j00996j04561j01456r7085
$$ y = [880040, 842527, 809538, 778670, 749827, 724719, 702877, 682239, 663031, 647012, 633480, 620102, 607095, 596481, 587934, 579504, 571734, 566658, 563258, 558388, 551850, 546236, 542167, 538147, 534637, 533576, 533990, 532727, 529600, 527408, 526877, 526052, 524644, 524477, 525532, 525952, 526025, 527846, 531063, 533398, 535233, 539145, 544991, 550156, 554668, 561240, 570108, 578649, 586370, 595523, 606423, 616919, 626891, 638598, 652279, 666114, 680799, 699359, 722052, 746277, 771877, 801770, 837183, 877290, 923805, 980687, 1048798, 1125776, 1211377, 1307453, 1412079, 1519000, 1623397, 1722902, 1812891, 1887284, 1945608, 1993894, 2037374, 2077232, 2114727, 2151950, 2186774, 2212769, 2226151, 2228215, 2220371, 2202552, 2177390, 2149641, 2119471, 2081538, 2031961, 1970774, 1897006, 1808258, 1707262, 1602701, 1501245, 1404160]
56106A404160r1011q0123o6817n5890m6743l6510k7268k2464j9751j5069j0197
56095I32317q705q443n636k393k240k505Q24M985N353M110N708Q142P358N800
56081I44675P703J0342R061O558P884J0678R826P458Q607J1255J0611Q937J1084
56068A064679J4466J3755J1303J2639J5801J5590J4056J6045J8834J7152J4098
56057A228418J5740J9359J8529J5447J6326J8995J7398J4049J5376J8925J7942
56046A416504J4635J5817J9508J9068J6639J8848K3175K2508J9304K1130K5973
56035A633109K6383K4240K6744L1698L1824K9665L2827L8468L8403L5500L8560
56024A987421M4999M5552M2286M4460N0299N0870M8356N2150O0260O3224O2855
$$ y = [1404160, 1313149, 1233026, 1166209, 1110319, 1063576, 1027066, 999798, 977334, 957583, 942514, 932317, 923612, 915169, 909533, 907140, 904900, 902395, 903219, 908204, 913557, 917667, 923375, 931517, 938875, 944675, 952378, 962720, 971781, 978339, 986223, 996901, 1006727, 1014185, 1022792, 1034047, 1044658, 1053595, 1064679, 1079145, 1092900, 1104203, 1116842, 1132643, 1148233, 1162289, 1178334, 1197168, 1214320, 1228418, 1244158, 1263517, 1282046, 1297493, 1313819, 1332814, 1350212, 1364261, 1379637, 1398562, 1416504, 1431139, 1446956, 1466464, 1485532, 1502171, 1521019, 1544194, 1566702, 1586006, 1607136, 1633109, 1659492, 1683732, 1710476, 1742174, 1773998, 1803663, 1836490, 1874958, 1913361, 1948861, 1987421, 2032420, 2077972, 2120258, 2164718, 2215017, 2265887, 2314243, 2366393, 2426653, 2489877, 2552732]
56013B552732O8031P5701P6019P2459P6239Q4570Q5870Q2717Q7210R7158J00246
56002C458952R8606J05076J17885J23936J24598J32751J46584J52747J53280J62298
55992D776713J78121J86713J90431K04140K25118K37385K43754K61610K89071
55983F793056L08771L23188L50909L89751M20736M47089M90113N47640N97995
55974A0669248O44043P09646P93645Q74123R57428J072937J219842J373141J542360
55965A9856413J766906K053690K381910K767796L253855L834845M474386N198305
55957D5588106O088359P188560Q522226J0202946J2408251J5236048J8708410
55950A23942906K2868644K7622934L2437707L6468029L9067356L9775886L7558728
$$ y = [2552732, 2620763, 2696464, 2772483, 2844942, 2921181, 3005751, 3091621, 3174338, 3261548, 3358706, 3458952, 3557558, 3662634, 3780519, 3904455, 4029053, 4161804, 4308388, 4461135, 4614415, 4776713, 4954834, 5141547, 5331978, 5536118, 5761236, 5998621, 6242375, 6503985, 6793056, 7101827, 7425015, 7775924, 8165675, 8586411, 9033500, 9523613, 10071253, 10669248, 11313291, 12022937, 12816582, 13690705, 14648133, 15721070, 16940912, 18314053, 19856413, 21623319, 23677009, 26058919, 28826715, 32080570, 35915415, 40389801, 45588106, 51676465, 58865025, 67387251, 77590197, 89998448, 105234496, 123942906, 146811550, 174434484, 206872191, 243340220, 282407576, 322183462, 359742190]
55943C59742190L0612418J7825200O66220j6876575l0654748l8694831m1444812
55936B81175062m0420449l7060115l2493724k7615649k3005034j8905942j5401452
55929H6272697j2533112j0256120q435442o959376n787459m873167m131225l507264
55921B9789532l002733k607098k272123j971542j722514j528669j358266j195193
55913A4131394j058361r54243q58845p61596o81391o24880n71417n12604m66332
55904G641725m38715m10380l72894l42494l25726l06096k76673k52870k41186
55895D674691k26668k02783j83818j76352j67091j49797j36832j33285j26337
55886C171728j10828r9760r8899r5870q5061p9212q5152r0869q7676q3675q4522
$$ y = [359742190, 390354608, 408179808, 408846028, 391969453, 361314705, 322619874, 281175062, 240754613, 203694498, 171200774, 143585125, 120580091, 101674149, 86272697, 73739585, 63483465, 55048023, 48088647, 42301188, 37428021, 33296796, 29789532, 26786799, 24179701, 21907578, 19936036, 18213522, 16684853, 15326587, 14131394, 13073033, 12118790, 11259945, 10498349, 9816958, 9192078, 8620661, 8108057, 7641725, 7203010, 6792630, 6419736, 6077242, 5751516, 5445420, 5168747, 4915877, 4674691, 4448023, 4245240, 4061422, 3885070, 3717979, 3568182, 3431350, 3298065, 3171728, 3060900, 2961140, 2862241, 2766371, 2681310, 2602098, 2516946, 2426077, 2338401, 2254726, 2170204]
55875B170204q1797p1320o3323o3664o3360n6648n1428n2344n1224m3776l8633
55864A532687m0522m0971l4815k9765l0709l0324k4201j9928k2264k4107k0894
55853A214187j9466k3936k6938k3655k0954k3951k6641k4385k2899k6355k8856
55842I46151k6048k3402k4873k4989k0066j5954j6874j7627j4400j2316j4803
55831G34799j6250j2800r876j1613j3018j0035p295q608r626p118n839q990j1385
55818F02346r185p131r136j0876q694o801q614r779o797l842m295m005R8L369
55804E16658K248J318M607Q078P757P214R887J1804R147N560M911M038l53m728
55790E88146n502n811q834j1203r726p820q786r552p687p564j2552j7741j7645
$$ y = [2170204, 2088407, 2017087, 1953764, 1890100, 1826740, 1770092, 1718664, 1666320, 1615096, 1571320, 1532687, 1492165, 1451194, 1416379, 1386614, 1355905, 1325581, 1301380, 1281452, 1259188, 1235081, 1214187, 1194721, 1170785, 1143847, 1120192, 1099238, 1075287, 1048646, 1024261, 1001362, 975007, 946151, 920103, 896701, 871828, 846839, 826773, 810819, 793945, 776318, 761918, 749602, 734799, 718549, 705749, 695873, 684260, 671242, 661207, 653912, 645304, 635678, 628560, 622721, 613731, 602346, 593161, 586030, 576894, 566018, 557324, 550523, 541909, 532130, 525333, 521491, 517196, 513191, 513289, 516658, 518906, 520224, 524831, 532909, 540666, 547880, 557767, 569571, 578718, 584278, 589189, 593227, 592874, 588146, 582644, 576833, 567999, 556796, 547070, 539250, 530464, 520912, 513225, 505661, 493109, 475368, 457723]
55777D57723j4808j3777j2767q623m070k671j843J942N947N900L179R87j787o629
55763D08703j0224r409o829n953n218k630r73k615m139k103P71Q14k53K2r00n408
55747C53656r906j0391r206j0009j0812q363m969m319m721k915p21j447l357k995
55733B69525j595k157l417k577r14j117k159j997k098m197n992n067l535l881
55719B28822m093j880L45k5n47J638L973L051R70J358K846K403J401K357L225
55704B45844J148j545j204M28n61l338m668n174p138q950p764n121m105l637j308
55689A92907R80K23j642r39J131J174K57J544L794L648K305L392O027O339M345
55674B25485L074K421P4k800l030j490j710l469l542j907j364j849q44J217J511
$$ y = [457723, 442915, 429138, 416371, 407748, 403678, 401007, 399164, 401106, 407053, 412953, 416132, 417119, 415332, 408703, 398479, 389070, 382241, 376288, 371070, 368440, 367467, 364852, 360713, 358610, 359381, 360195, 359942, 359964, 359064, 353656, 343750, 333359, 324153, 314144, 303332, 294969, 290000, 285681, 280960, 278045, 277324, 275877, 272520, 269525, 267930, 265773, 262356, 259779, 258865, 257748, 255589, 253592, 251494, 247297, 241305, 236238, 232703, 228822, 224729, 222849, 223194, 223169, 222622, 224260, 228233, 231284, 232254, 233612, 236458, 238861, 240262, 242619, 245844, 246992, 245447, 244243, 244671, 244110, 240772, 236104, 230930, 223792, 214842, 207078, 201957, 197852, 194215, 192907, 193887, 194110, 192468, 191529, 192660, 193834, 194091, 195635, 199429, 203077, 205382, 208774, 214801, 221140, 225485, 228559, 230980, 231054, 228254, 225224, 223734, 222024, 218555, 215013, 213106, 211742, 209893, 209049, 210266, 211777]
55659B11777K72L25J709J870P63P70K006K505K485L633M947L978J544N38Q11j33
55643B39800k159l029l076m565p089q201q008q527r283q217o166n679o144m833
55629A54824k198j200j919j671j87J75q20r92r2n9r42q97q5m13j612j648p31q34
55611A38699j669j302k54p36k257k341j139j029j977j760m81m06j520j570m78
55596A19780l39j152r00K82K81o91l43J122J161l29p07N62J068j6o98J3Q37J270
55578A21201K208L217K786J518J534K599K559J552J911L795M777M012L048K373
55564A59090Q41j206j948j450j501k163k037j680k873m806m959l601l246l874
55550A24587l075r61k62j231j105P68J792R39L23R32J107L01L03J510J896Q67
$$ y = [211777, 212049, 212374, 214083, 215953, 216716, 217486, 219492, 221997, 224482, 228115, 233062, 237040, 238584, 239122, 239933, 239800, 237641, 234612, 231536, 226971, 219882, 211681, 203673, 195146, 185863, 177646, 171480, 165801, 159657, 154824, 152626, 151426, 149507, 147836, 147649, 147824, 147004, 146012, 145920, 145861, 144919, 144022, 143937, 143524, 141912, 140264, 139533, 138699, 137030, 135728, 135474, 134738, 132481, 130140, 129001, 127972, 125995, 124235, 123754, 123348, 121828, 120258, 119780, 119441, 118289, 117389, 117671, 117952, 117261, 116918, 118040, 119201, 118872, 118165, 118727, 119795, 119779, 119081, 119094, 119931, 121201, 123409, 126626, 129412, 130930, 132464, 135063, 137622, 139174, 141085, 144880, 149657, 153669, 156717, 159090, 159931, 158725, 156777, 155327, 153826, 151663, 149626, 147946, 145073, 140267, 135308, 131707, 128461, 124587, 121512, 120551, 120289, 119058, 117953, 118721, 120513, 121452, 121775, 122707, 123814, 124115, 124418, 125928, 127824, 128691]
55534A28691M39J378J821Q36j04k78q26j855j870r71j075k173j997k22O93j72
55518A22315p56K3O08K05K93J411J854Q32j92m34q78j643j510q52j547l213l143
55501A13373r47M82l11j344j134q88j475j759j394j798l034l118j743j169k115
55486I1626k413j149l96j190j501j29J023M81l37k00k22j032r97N42J482N37m34
55469H5691P1M95o95k008j579k66K94M24R85J344Q69M61P21O26l57q96j77N42
55451H6545K70l5M01O09o4n40j34J28k97l02N61R85L79M8N85O28m75j297r38m42
55431H6615l64L38J688J885N03l88J87M79m54p96N88J864J504R04J484K109J625
55414I9771J172J613J444k58j533p78L20k48j414j385j001j767k665k030q07r20
$$ y = [128691, 129130, 130508, 132329, 133165, 133061, 132783, 131957, 130102, 128232, 127261, 126186, 124013, 122016, 121794, 122487, 122315, 121559, 121582, 122190, 122395, 122688, 124099, 125953, 126785, 126593, 126159, 125281, 123638, 122128, 121276, 119729, 116516, 113373, 112426, 112908, 112597, 111253, 110119, 109231, 107756, 105997, 104603, 102805, 99771, 96653, 94910, 93741, 91626, 89213, 88064, 87668, 86478, 84977, 84848, 85871, 86352, 86015, 85815, 85593, 84561, 83564, 84106, 85588, 86125, 85691, 85762, 86257, 85562, 83554, 81975, 81709, 82003, 82427, 83412, 84756, 85625, 86086, 86807, 87433, 87076, 86180, 86003, 86545, 86815, 86780, 87181, 87790, 87726, 87186, 87052, 87180, 86883, 86581, 87142, 88127, 88506, 88554, 89139, 89767, 89292, 87995, 87057, 86615, 86251, 86589, 88277, 90162, 90665, 90277, 90464, 90943, 90489, 89693, 90281, 92145, 93649, 94553, 96037, 98146, 99771, 100943, 102556, 104000, 103742, 102209, 101431, 101751, 101503, 100089, 98704, 97703, 95936, 93271, 91241, 90434, 89514]
55398H9514j824j563q4J070J388J358R30J2m58J58R13P99L45K63N0o16p54J72
55380I1673J015R11P05J067J108L04k30J41K94l64o34k3k2j223j826q74k34j199
55362I0589j915p20O39m8j609j607k63O27Q74J210J042k89j552j463r50j234j364
55345H1967j75J107Q59l6O8O10L15q8N40J122J97j062p14N29O64q6j73J48l80
55326H5412j171p96P2k38j195q98N54J384J210J098J138O36J16N38J138N71m55
55309H9114l25M47M6j299j656p04o0l77o64m66l63l48K16R96R96L50K8J20J01
55290H6152K43J002J575R42k42o51m29n97j051j083j038j447j510m65N37J07q24
55273H1221m89O26P33p6k53K39Q5o46o32P6J16n74o97r6L0n01n56J29N31L08K83
$$ y = [89514, 87690, 86127, 86043, 87113, 88501, 89859, 90789, 90801, 90343, 90501, 91414, 92213, 92558, 92821, 92871, 92255, 91501, 91673, 92688, 93599, 94304, 95371, 96479, 96783, 96553, 96694, 96988, 96624, 95990, 95967, 95945, 94722, 92896, 92022, 91788, 90589, 88674, 87954, 88593, 88545, 86936, 85329, 85066, 85693, 86567, 87777, 88819, 88530, 86978, 85515, 84565, 83331, 81967, 81792, 82899, 83758, 83722, 83790, 84400, 84715, 84627, 85167, 86289, 86486, 85424, 84710, 85239, 85903, 85817, 85644, 85792, 85412, 84241, 83445, 83517, 83279, 82084, 81186, 81740, 83124, 84334, 85432, 86570, 87206, 87322, 87860, 88998, 89569, 89114, 88789, 89236, 89282, 87983, 86327, 85623, 85563, 85186, 84522, 84056, 83693, 83345, 83561, 84557, 85553, 85903, 85931, 86051, 86152, 86395, 87397, 88972, 89914, 89672, 89021, 88592, 87995, 86944, 85861, 84823, 83376, 81866, 81401, 81938, 82045, 81221, 80732, 81358, 82091, 82015, 81762, 82001, 82086, 81440, 80808, 80884, 81000, 80426, 79729, 79633, 79663, 79162, 78606, 78735, 79266, 79574, 79857]
55252G9857P65J101R69O43J12o76j103p32l47o25o86M07J625J401J87m61m82q19
55234H1136j107k36J285J820J115K39m37j184j470p06J85Q2k17O16J804J682O74
55217H5281M07O15j81j470j316J73R78O62P36J447J330K78P1J151J644M57j055
55200I1208j388p41J58J074J522Q29n02j187j162j414j826j281K5N17j25m81J66
55183H5392Q81J073J317J746J559O79J42L68O62O88Q65J060O43j02k63k2l39j037
55165I5312j099p53j127j956j829p53k49o64o48L73J328J429J006K33r68j725
55149H7910j032J95J71p14l66J353K259J467O16P31O77k83r40l61N58R00J093
55132I4234J406J089N9n32l08l62j045j078J26J182R76L34K99M75K05j55k20l79
$$ y = [79857, 80622, 81723, 82692, 83335, 83447, 82771, 81668, 80936, 80589, 79964, 79278, 79685, 81310, 82711, 82898, 82437, 81955, 81136, 80029, 79793, 81078, 82898, 84013, 84252, 83815, 82631, 81161, 80455, 80640, 80722, 80505, 81121, 82925, 84607, 85281, 85688, 86303, 86122, 84652, 83336, 83509, 84487, 85149, 85885, 87332, 88662, 88940, 89011, 90162, 91806, 92263, 91208, 89820, 89079, 89237, 90311, 91833, 92662, 92160, 90973, 89811, 88397, 86571, 85290, 85315, 85832, 85707, 85226, 85392, 86273, 87346, 88663, 90409, 91968, 92647, 92789, 93157, 93819, 94507, 95372, 96432, 97075, 96973, 96710, 96688, 96349, 95312, 94213, 93460, 92333, 90377, 88548, 87795, 87546, 86882, 86234, 86607, 87935, 89364, 90370, 90603, 89635, 87910, 86878, 87073, 87244, 86530, 86164, 87517, 89776, 91243, 91859, 92590, 93267, 92984, 92044, 91683, 92241, 93141, 94234, 95640, 96729, 96788, 96256, 95948, 95586, 94541, 93463, 93589, 94771, 95747, 96081, 96380, 96855, 97060, 96905, 96685, 96306]
55114I6306o68l04Q14J542J201M50j27p46j193o46O08J019J05p39m49L91J094
55097I8658J830K377J809L39l88K35Q56O00M03R08J075J91o31m19r9p41j537j188
55079A04278k2P21O84K80l26r32j000n00j41p7M27J412J715Q76M6Q1J78n09j257
55060A05934j022j55K98J42j38k82k74j76l60j089j651j116j5J54p06j167o51
55043I7726j11N0N70J353J106j98p65J22Q18K03m38J48R37N83k13j67L63L61J7
55024A02465q2l53j161j575p83L96Q37Q58J185J415R49L98N16Q47P22N45P04M22
55006A08305q37j981j831r83o20n49k7N22L25o6L72J328J758J624J528J304N17
54989A10689k80k71J67J09l37l91k7K89O79J392J833J383P19Q73J466J178k11
$$ y = [96306, 95638, 95334, 96148, 97690, 98891, 99341, 99214, 98468, 97275, 96629, 97237, 98256, 98361, 97622, 97173, 97564, 98658, 100488, 102865, 104674, 105013, 104625, 104860, 105716, 106316, 106719, 107627, 108702, 108893, 108262, 107843, 107744, 107003, 105466, 104278, 104256, 104977, 105661, 105941, 105615, 104683, 103683, 103183, 103042, 102965, 103392, 104804, 106519, 107395, 107441, 107522, 107700, 107191, 105934, 104912, 104757, 105055, 105197, 105059, 104777, 104503, 104327, 103967, 102878, 101227, 100111, 100096, 100250, 99544, 98377, 97726, 97615, 97665, 98235, 99588, 100694, 100496, 99731, 99853, 100671, 100874, 100436, 100584, 101521, 102104, 101891, 101724, 102087, 102448, 102465, 102383, 102030, 100869, 99294, 98511, 98907, 99744, 100602, 101787, 103202, 104151, 104549, 105065, 105912, 106634, 107179, 107883, 108305, 107468, 105487, 103656, 102673, 102053, 101504, 101477, 101999, 102324, 102258, 102630, 103958, 105716, 107340, 108868, 110172, 110689, 110409, 110138, 110305, 110414, 110077, 109686, 109659, 109948, 110627, 112019, 113852, 115235, 115954, 116827, 118293, 119471, 119260]
54972A19260j593k128j972j450o14L20Q20N66k53j015j007j00Q25Q64M70Q78K072
54955A15943K657K011J073M91l79j770k477j710n90m81j045j242j069j045r40
54940A09427m14Rj73l61J41Q73J083R70J068J208J160J341J886K082J688J710
54924A23698K725L696L705L635M629O099O833P034P492P652O368L978J803L3k186
54909A87194m857o909p759p773p238o134m826l944l569l306k932k429j758j176
54895A22584j143j441j190l33j6p39j350q05K39P14Q21J180J441J137J001J940
54879A24040L488M601N276O098O897P170P079O852N925L909J612o6j480l261m949
54864A73191n829o210o511o119m592l028k663k945k572j644j185j262j251j300
$$ y = [119260, 117667, 115539, 113567, 112117, 111503, 111823, 112643, 113209, 112956, 111941, 110934, 110834, 111659, 112523, 112993, 113871, 115943, 118600, 120611, 121684, 122175, 121796, 120026, 117549, 115839, 115249, 114768, 113723, 112481, 111412, 110367, 109427, 109013, 109022, 108849, 108488, 108629, 109502, 110585, 111555, 112623, 113831, 114991, 116332, 118218, 120300, 121988, 123698, 126423, 130119, 133824, 137459, 142088, 148187, 155020, 162054, 169546, 177198, 183566, 187544, 189347, 189380, 187194, 182337, 175428, 167669, 159896, 152658, 146524, 141698, 137754, 134185, 130879, 127947, 125518, 123760, 122584, 121441, 120000, 118810, 118477, 118461, 117722, 116372, 115567, 115806, 116520, 117341, 118521, 119962, 121099, 122100, 124040, 127528, 132129, 137405, 143503, 150400, 157570, 164649, 171501, 177426, 181335, 182947, 182881, 181401, 178140, 173191, 167362, 161152, 154641, 148522, 143930, 140902, 138239, 135294, 132722, 131078, 129893, 128631, 127380, 126080]
54850A26080j890k486k247j517j178j082o05j05k39n11j42K66l45j457j618p40
54834A10184l4J0m7o4m51r60q31q3N85R50J197J099M65o2R0L03j67o95l20M31
54814A11600K74p43j481j548j387j012j60O96R66J046J442J462M09o94l49R52
54798A11473J485J017P81J098J012L18lM83J111J384J391J049K92k18N9L05m77
54781A22560j539j297K20J565K168K554K644J849P62P22J637K200K323L341N489
54766A47198P159P271O657O470O656O593O001M710K610J62j943l721n572p182
54752A83069p821p526o904o033m722l492l006k908k494k056k210k492k161j727
54738A27517k023k385j621k64K31M5N82J871K579K484K647L174L094K550K850
$$ y = [126080, 124190, 121704, 119457, 117940, 116762, 115680, 115075, 114970, 114731, 114220, 114078, 114344, 113999, 112542, 110924, 110184, 110150, 110160, 110113, 110049, 109598, 108638, 107807, 107724, 108309, 109259, 110456, 111555, 112020, 111958, 112048, 112351, 112184, 111489, 111169, 111600, 111874, 111131, 109650, 108102, 106715, 105703, 105543, 106239, 107205, 108251, 109693, 111155, 111564, 110870, 110521, 111473, 112958, 113975, 114756, 115854, 116866, 117184, 117181, 117664, 118775, 120159, 121550, 122599, 122891, 122673, 122732, 123037, 122560, 121021, 119724, 119944, 121509, 123677, 126231, 128875, 130724, 131486, 132208, 133845, 136045, 138368, 141709, 147198, 154357, 161628, 168285, 174755, 181411, 188004, 194005, 198715, 201325, 201487, 199544, 195823, 190251, 183069, 175248, 167722, 160818, 154785, 150063, 146571, 143565, 140657, 138163, 136107, 133897, 131405, 129244, 127517, 125494, 123109, 121488, 121224, 121455, 121500, 122082, 123953, 126532, 129016, 131663, 134837, 137931, 140481, 143331]
54723A43331M044M698M399M390N264O023N869N045L582J135j573l118l490m019
54709A75580m974n267m754m598m943m459k811j486j476k090k599l095l213k146
54695A27669n22o5q61j151m73m95j878k816j980n29J73N99J325J385J98q13l40
54678A19426O23M99l84p23m54k74j16L37N14j61j074j330j102r52p15j39K97J96
54660A14468L9K06J58m41q57m71J28J91OJ24L34L47N19J088J534J494J329J167
54642A21363M99o04j130p67n68j164j570q68K59P58P73Q69Q35M20J48K86N2j009
54624A18582j914j741j108q70m63R24K406K311O06j061j511r75q8Q94J800K313
54608A20105K239J675J016P78J016R66oj177j208r4Q18Q44O44N80O7r38j360p84
$$ y = [143331, 147375, 152073, 156472, 160862, 166126, 172149, 178018, 183063, 186645, 187780, 186207, 183089, 179599, 175580, 170606, 165339, 160585, 155987, 151044, 146585, 143774, 142288, 140812, 138722, 136123, 133028, 129815, 127669, 127147, 127082, 126221, 125070, 124597, 124102, 122224, 119408, 117428, 116899, 117072, 117671, 118996, 120381, 120579, 119766, 119426, 120049, 120548, 120164, 119441, 118987, 118713, 118597, 118934, 119448, 119287, 118213, 116883, 115781, 114829, 114114, 113975, 114272, 114468, 114507, 114713, 114871, 114430, 113573, 113102, 113230, 113421, 113427, 113551, 113885, 114232, 114751, 115839, 117373, 118867, 120196, 121363, 121862, 121258, 120128, 119361, 118793, 117629, 116059, 115191, 115450, 116208, 116981, 117850, 118685, 119105, 119253, 119539, 119591, 118582, 116668, 114927, 113819, 112949, 112486, 113410, 115816, 118127, 118733, 117672, 116161, 115186, 115098, 115992, 117792, 120105, 122344, 124019, 125035, 125813, 126829, 127795, 127789, 126612, 125404, 125310, 126128, 126972, 127616, 128196, 128263, 127325, 125965, 125181]
54590A25181l25p75j235o60M13Q37M98Q1j8K95R46J227L04j294j877r42J00K33
54572A22989K08P18Q96p4j299j531r75m43R7Q29J073L98l11j82K07Jl26Q2Q62
54553A23219J139R84R64R41N65J53J01J24L2L18J079J448J043P72J177J364P16
54536A36139K20O85J040O7j412j864j436j276j401j095n97o14p97m03J83J13l40
54519A27212l45PJ83L85P96O18n29j231j57J551J791O32j78k17o21j587j908j202
54501A25200n08m31l37K28Q01R74Q24K86p17j485j123P5R87J245J320J248O67
54484A29254l8M4Q88J472J215M84k68q12p93j28M89M72L92J003J697J303P6n70
54466A36180j66M02N76P53J126J160O09m2l19k62r3p3n55j463j973j510o37k41
$$ y = [125181, 124856, 124081, 122846, 122186, 122599, 123436, 123934, 124015, 123997, 124292, 125238, 126465, 126769, 125475, 123598, 122656, 122756, 122989, 123197, 123915, 124811, 124737, 123438, 121907, 120932, 120489, 120586, 121415, 122488, 122886, 122575, 122393, 122600, 122601, 122275, 122357, 123219, 124358, 125342, 126306, 127247, 127812, 127965, 128066, 128190, 128222, 128540, 129619, 131067, 132110, 132882, 134059, 135423, 136139, 136359, 137044, 138084, 138151, 136739, 134875, 133439, 132163, 130762, 129667, 129070, 128456, 127659, 127256, 127439, 127552, 127212, 126867, 126874, 127057, 127442, 128238, 128856, 128327, 127096, 126939, 128490, 130281, 130913, 130735, 130518, 129897, 128310, 126402, 125200, 124692, 124261, 123924, 124152, 124953, 125927, 126751, 127037, 126320, 124835, 123712, 123787, 124774, 126019, 127339, 128587, 129254, 129216, 129260, 130148, 131620, 132835, 133319, 133051, 132239, 131446, 131318, 131807, 132279, 132671, 133674, 135371, 136674, 136750, 136180, 136014, 136416, 136992, 137745, 138871, 140031, 140640, 140598, 140279, 140017, 139924, 139851, 139296, 137833, 135860, 134350, 133713, 133472]
54448A33472k57j05J47R6q1n3j24m96l98P73J987J699N5j328j543j009k58N76
54430A33153J152J167J024J245J490J168N58K36m7o84j046m41L77K30m89n35n1
54413A38507k35j026j065K1J061J213Q71N33K83M40J252J924J429L13J15R76J497
54396A48109J039N44O44P03J59n54r25r46m61Q14K252K613J713O35N0m13q87p65
54378A54324M0N83K25n52j041j152r97n50M0N39J111J865K105J140k93o45L51
54361A57093J438J682J396J132J027J244J960K684K821K705L037L431K945J930
54347A86525J687K250K183Q23q14j792k331k746k754k419k456l080l663l872l987
54332A63554l870k942j487o57q14j123j069j001r30k53Q97J506J248Q34M57m73
$$ y = [133472, 133215, 133110, 133257, 133353, 133272, 133219, 133095, 132599, 132201, 132974, 134961, 136660, 136715, 135387, 133844, 132835, 132577, 133153, 134305, 135472, 136496, 137741, 139231, 140399, 140957, 141193, 141146, 140462, 139416, 138975, 139352, 139582, 139093, 138558, 138507, 138272, 137246, 136181, 136202, 137263, 138476, 139347, 139880, 140163, 140603, 141855, 143779, 145208, 145521, 145636, 146612, 148109, 149148, 149692, 150336, 151039, 151198, 150644, 149719, 148773, 148312, 149126, 151378, 153991, 155704, 156339, 156389, 155976, 155089, 154324, 154364, 154947, 155172, 154620, 153579, 152427, 151430, 150880, 150920, 151459, 152570, 154435, 156540, 157680, 157387, 156742, 157093, 158531, 160213, 161609, 162741, 163768, 165012, 166972, 169656, 172477, 175182, 178219, 181650, 184595, 186525, 188212, 190462, 192645, 193468, 192654, 190862, 188531, 185785, 183031, 180612, 178156, 175076, 171413, 167541, 163554, 159684, 156742, 155255, 154598, 153784, 152661, 151592, 150591, 149661, 149408, 150305, 151811, 153059, 153893, 154350, 153877]
54316A53877j677j840p67k8n99j456j469j143j298j452p96J99M87k1n87p71n30
54299A40129O4O28O24K10J91P03R26M61j07m36r57j586j267K99J737J840J214
54282A44673J074J355J211O11J97K8m29j223j700j278oJ449K136J591M88J9N05
54265A50701J235J674J891J740P77o36j246n11O20J036P55M06K51K04J10k92j071
54248A57644j547r39L59J114R70P40Q81R36O45L20j18j079j966j528N3J008N05
54231A57998l06m88o76j340j461l48P46M11p00r51j51O00P34M89K9m75l92N77
54213A54296J572J584Q33K36qk93o23o78n38n25o12n71l55N3O49R82N11l24m04
54194A55785L07M90m87j515j567j237j429j706j259m67j25L3O35J272J142N59
$$ y = [153877, 152200, 150360, 149593, 149565, 148966, 147510, 146041, 144898, 143600, 142148, 141352, 141551, 142038, 142017, 141430, 140659, 140129, 140193, 140821, 141445, 141655, 141846, 142549, 143475, 143936, 143829, 143393, 142436, 140850, 139583, 139882, 141619, 143459, 144673, 145747, 147102, 148313, 148924, 149121, 149149, 148720, 147497, 145797, 144519, 144513, 145962, 148098, 149689, 150177, 150196, 150701, 151936, 153610, 155501, 157241, 158018, 157382, 156136, 155625, 156245, 157281, 158036, 158442, 158693, 158897, 159007, 158715, 157644, 156097, 155158, 155517, 156631, 157601, 158341, 159222, 160158, 160803, 161123, 161005, 159926, 157960, 156432, 156485, 157493, 157998, 157692, 157204, 156528, 155188, 153727, 153379, 154125, 154536, 153836, 152885, 152734, 153334, 154068, 154557, 154586, 154111, 153719, 154296, 155868, 157452, 158285, 158521, 158513, 158220, 157597, 156919, 156381, 155856, 155244, 154673, 154318, 154371, 155020, 156002, 156513, 156189, 155785, 156092, 156582, 156095, 154580, 153013, 151776, 150347, 148641, 147382, 146915, 146790, 146823, 147458, 148730, 149872, 150431]
54178A50431L98N20J12o96r25l39K61M06M58O98P92M24j60m97m25j94k36o65j011
54159A49352p33n8K59Ll25m23m34j69P32J699J502J41q12m51J54k40j133j282
54141A47782o38n9J59L69O92J010J327J431Q12l88j124q58m12o18r79n72M45J210
54123A49589J358J074N97L94J063K309K831K024Q61L40J68j67j63O42J447J345
54107A65712Q36Q97J335J316Q75N18M6q79j625j378n63k19m33n81o04p48n18P04
54089A64691K297K900K164R81K13O7M62J046J237J016J191K160L093L221L121
54074A89860L697M728N589O592Q264R937J0462R816Q646O764L457r78n245q317
54060B53272r785r531q195p231p264p064n377k973j415o49M15J624J849J199R90
$$ y = [150431, 150829, 151349, 151461, 150765, 149840, 149501, 149762, 150168, 150626, 151324, 152116, 152540, 152380, 151883, 151458, 151264, 151028, 150363, 149352, 148619, 148561, 148820, 148823, 148498, 148075, 147641, 147472, 148204, 149903, 151405, 151546, 150734, 150283, 150437, 150197, 149064, 147782, 147144, 147085, 147244, 147613, 148305, 149315, 150642, 152073, 152885, 152497, 151373, 150515, 150103, 149485, 148506, 147934, 148379, 149589, 150947, 152021, 152618, 153012, 154075, 156384, 159215, 161239, 162100, 162440, 162608, 162441, 162278, 162920, 164367, 165712, 166548, 167445, 168780, 170096, 170971, 171489, 171535, 170656, 169031, 167653, 167090, 166871, 166438, 165857, 165253, 164505, 163987, 164691, 166988, 169888, 172052, 173033, 173246, 173313, 173775, 174821, 176058, 177074, 178265, 180425, 183518, 186739, 189860, 193557, 198285, 203874, 210466, 218730, 228667, 239129, 248945, 257591, 264355, 267812, 266834, 261589, 253272, 243487, 233956, 225761, 218530, 211266, 204202, 198825, 195852, 194437, 193788, 194203, 195827, 197676, 198875, 199865]
54045A99865J569K015K047K526L814N109N747N890N817N677N933O830P508O868
54031B67215N255M026L602L302K900K894L220L169K611K029J348J43j090j352
54017B99272q37p37j295j624j626k318l891n073n030m536m548m901n018m817m271
54002B48750l063j344M6O56R88J587K330K895L166K924J873K96j097k105l165
53987B54737m428n466n970o008n633m959m451m349l979k613p95K35K60M7j88q72
53971B05568j673j483j84R45R96M76K27K67K09n5m26o46k27R07J845J701J034
53954B09481J108J821J756M65o87l66J197K899L954M137L748L628M288M984M657
53939B47070L691L526M490N439N712N936O507O790O480O409P241Q472R476J0537
$$ y = [199865, 201434, 203449, 205496, 208022, 211836, 216945, 222692, 228582, 234399, 240076, 246009, 252839, 260347, 267215, 272470, 276496, 280098, 283400, 286300, 289194, 292414, 295583, 298194, 300223, 301571, 301714, 300624, 299272, 298435, 297698, 296403, 294779, 293153, 290835, 286944, 281871, 276841, 272305, 267757, 262856, 257838, 253021, 248750, 245687, 244343, 244389, 245045, 246033, 247620, 249950, 252845, 256011, 258935, 260808, 261104, 260007, 257902, 254737, 250309, 244843, 238873, 232865, 227232, 222273, 217822, 213473, 209494, 206881, 206086, 206321, 206581, 206628, 206440, 205568, 203895, 202412, 202228, 203173, 204169, 204645, 204872, 205139, 205348, 205293, 204867, 204221, 203994, 204901, 206746, 208447, 209481, 210589, 212410, 214166, 214631, 213944, 213578, 214775, 217674, 221628, 225765, 229513, 233141, 237429, 242413, 247070, 250761, 254287, 258777, 264216, 269928, 275864, 282371, 289161, 295641, 302050, 309291, 317763, 327239, 337776]
53925C37776J2185J4362J6794J9432K1913K3258K2496J9092J2874M591l498q805
53913D92470j0601j0189q917p219n583m812m843m741m297m300m816m767l905l582
53899D09898m631n890n971n176m598m431m427m944o226p411p622p383p737q473
53885C24978q465p521o668o615o871o564n462m095l171k912k892k646k334k411
53871B56351k688k497j858j672k485l675m230l743k526j292q66j499k375k456
53857B22489j850j506j683j712j309r66q79o87m82p95j331j076q7K68n81j404
53841B06409j074j50L07K94K61K1n80q93m42N0k41p88m48Q12J907K044J321K26
53823B09036o92r82o62k61o3K63J030J986K722L083K995K482K035K205K694K706
$$ y = [337776, 349961, 364323, 381117, 400549, 422462, 445720, 468216, 487308, 500182, 504773, 501275, 492470, 481869, 471680, 462763, 455544, 449961, 445149, 440306, 435565, 431268, 426968, 422152, 417385, 413480, 409898, 405267, 399377, 393406, 388230, 383632, 379201, 374774, 369830, 363604, 356193, 348571, 341188, 333451, 324978, 316513, 308992, 302324, 295709, 288838, 282274, 276812, 272717, 269546, 266634, 263742, 261096, 258762, 256351, 253663, 251166, 249308, 247636, 245151, 241476, 237246, 233503, 230977, 229685, 228819, 227320, 224945, 222489, 220639, 219133, 217450, 215738, 214429, 213463, 212584, 211897, 211415, 210620, 209289, 208213, 208126, 208394, 207813, 206409, 205335, 205185, 205492, 205786, 206047, 206068, 205488, 204595, 204153, 204203, 203962, 203174, 202726, 203538, 205445, 207489, 208810, 209036, 208344, 207362, 206700, 206439, 206376, 206639, 207669, 209655, 212377, 215460, 218455, 220937, 222972, 225177, 227871, 230577]
53807B30577K301K400L261M112M653N486O668P172O577N840N611N064L541K060
53793B95323J920K773L323L171K707J974Q61j23m42m89r27j594j950k147k663
53778C01717l435m186n057o080o591o169n548n577n837n322m066l036k675k604
53764B35534k576k713k959l005k792k477k079j606j264j136j011q85j099j587
53750B08345j676j120n95n74m93K47J187J499J160O64K28o4P9O24R73Q57P76R42
53732B13059P52k9n14p5N79O90Q19J645K392J964Q46L75O50P68P19J362K598L198
53714B31798K616J622R27M06n5k5O90J626K353K978L633L962L511K314J030N61
53698B59947J287K535L208L100L072L587L895L225K033J285J074P55Lr90j892
$$ y = [230577, 232878, 235278, 238539, 242651, 247304, 252790, 259458, 266630, 273207, 279047, 284658, 289722, 293263, 295323, 297243, 300016, 303339, 306510, 309217, 311191, 312052, 311929, 311487, 310998, 310071, 308477, 306527, 304380, 301717, 298282, 294096, 289039, 282959, 276368, 270199, 264651, 259074, 253237, 247915, 243849, 240813, 238138, 235534, 232958, 230245, 227286, 224281, 221489, 219012, 216933, 215327, 214063, 212927, 211916, 211031, 209932, 208345, 206669, 205549, 204954, 204380, 203887, 204134, 205321, 206820, 207980, 208644, 208872, 208808, 208887, 209511, 210484, 211341, 212117, 213059, 213811, 213782, 213268, 213193, 213772, 214462, 215281, 216926, 219318, 221282, 222128, 222503, 223153, 223921, 224640, 226002, 228600, 231798, 234414, 236036, 236963, 237369, 237314, 237289, 237979, 239605, 241958, 244936, 248569, 252531, 256042, 258356, 259386, 259947, 261234, 263769, 266977, 270077, 273149, 276736, 280631, 283856, 285889, 287174, 288248, 289003, 289006, 288016, 286124]
53683B86124k232j552k25N02n5j160j827k024j988j354m0R03N52m55r33q69q94
53666B72473p83K9R23P29m04j190j132q52n91Q2J024J324P11kj26J15K78L02J97
53647B73107j03m36m78j75L36J066J844K090J552R40J017J507J702J673J867J989
53631B89498J407M91L47J309K644L663M183M049L179K062J446J572K229L232M174
53616C25485M303L494K808L154L959M191L972M021M230M156M344N500O882P216
53602C87715O867P200Q001P504N196K672J206J79j408l293m633n154m992m336
53588D02724l680l509l484k842j807j489k149k754k550j969j590j347j191j426
53574C70937j983k242k033j877j965j894j650j689j741q13J069K363J975P33J12
$$ y = [286124, 283892, 282340, 282115, 282617, 282562, 281402, 279575, 277551, 275563, 274209, 274169, 275072, 275624, 275169, 274236, 273367, 272473, 271690, 271719, 272642, 273371, 272967, 271777, 270645, 269793, 269202, 269284, 270308, 271632, 272343, 272341, 272215, 272330, 272608, 272910, 273107, 273004, 272568, 272090, 271915, 272251, 273317, 275161, 277251, 278803, 279743, 280760, 282267, 283969, 285642, 287509, 289498, 290905, 291396, 291743, 293052, 295696, 299359, 303542, 307591, 310770, 312832, 314278, 315850, 318079, 321311, 325485, 329788, 333282, 336090, 339244, 343203, 347394, 351366, 355387, 359617, 363773, 368117, 373617, 380499, 387715, 394582, 401782, 409783, 417287, 422483, 425155, 426361, 426540, 425132, 421839, 417206, 412052, 407060, 402724, 399044, 395535, 392051, 389209, 387402, 385913, 383764, 381010, 378460, 376491, 374901, 373554, 372363, 370937, 368954, 366712, 364679, 362802, 360837, 358943, 357293, 355604, 353863, 353050, 354119, 356482, 358457, 359190, 359302]
53559C59302L59O80O03L83M71J137K190K831K344J157N17Q52J228Q55K79N49J798
53542C77535L198L907L705L101K967L689M598M822M582M896O055P234P824Q201
53528D46314Q920R924J0840J1447J1641J1548J1694J2399J3124J3260J3312J4274
53516E88697J5850J6715J6600J6820J8274K0234K1689K2718K3785K4698K5087
53505H11167K5138K5108K4746K3839K2741K1863K1112K0241J9264J8213J7092
53494A050524J6273J6264J6879J7358J7412J7447J7626J7633J7496J7625J7834
53483A240371J7405J6434J5977J6424J6813J6246J5000J3617J2010J0004P840
53472A398141N504K589o30l009m204n460p922j1040j3521j5003j5835j6004j5337
$$ y = [359302, 359661, 360341, 360944, 361327, 361798, 362935, 365125, 367956, 370300, 371457, 371974, 372826, 374054, 374909, 375188, 375737, 377535, 380733, 384640, 388345, 391446, 394413, 398102, 402700, 407522, 412104, 417000, 423055, 430289, 438113, 446314, 455234, 465158, 475998, 487445, 499086, 510634, 522328, 534727, 547851, 561111, 574423, 588697, 604547, 621262, 637862, 654682, 672956, 693190, 714879, 737597, 761382, 786080, 811167, 836305, 861413, 886159, 909998, 932739, 954602, 975714, 995955, 1015219, 1033432, 1050524, 1066797, 1083061, 1099940, 1117298, 1134710, 1152157, 1169783, 1187416, 1204912, 1222537, 1240371, 1257776, 1274210, 1290187, 1306611, 1323424, 1339670, 1354670, 1368287, 1380297, 1390301, 1398141, 1403645, 1406234, 1405604, 1402595, 1398391, 1392931, 1385009, 1373969, 1360448, 1345445, 1329610, 1313606, 1298269]
53459A298269j4246j3438j3234j3783j5281j7319j8723j8889j8633j9011j9864
53448A115848k0337k0212j9805j9064j7746j6175j4859j3537j1530q854o328m506
53436I42895l235k184j361r22q28p25j04J306L250N236P005Q421R185R227R258
53421I86424J0147J1815J3492J4969J6635J8322J9371J9968K1158K3174K5016
53410A180491K6229K7661K9821L1755L2548L2844L3777L5352L6932L8563M0640
53399A546613M2934M5022M7136M9551N1648N2625N2684N2639N2769N2948N3348
53388B099917N4007N4083N2601M9789M6785M4274M2101L9986L7803L5306L2245
53377B588897K8636K4522J9850J4986J0743P324L765q94o502j2521j9073k6310
$$ y = [1298269, 1284023, 1270585, 1257351, 1243568, 1228287, 1210968, 1192245, 1173356, 1154723, 1135712, 1115848, 1095511, 1075299, 1055494, 1036430, 1018684, 1002509, 987650, 974113, 962583, 953729, 947401, 942895, 939660, 937476, 936115, 935193, 934365, 933640, 933536, 934842, 938092, 943328, 950333, 958754, 967939, 977166, 986424, 996571, 1008386, 1021878, 1036847, 1053482, 1071804, 1091175, 1111143, 1132301, 1155475, 1180491, 1206720, 1234381, 1264202, 1295957, 1328505, 1361349, 1395126, 1430478, 1467410, 1505973, 1546613, 1589547, 1634569, 1681705, 1731256, 1782904, 1835529, 1888213, 1940852, 1993621, 2046569, 2099917, 2153924, 2208007, 2260608, 2310397, 2357182, 2401456, 2443557, 2483543, 2521346, 2556652, 2588897, 2617533, 2642055, 2661905, 2676891, 2687634, 2694958, 2698723, 2697829, 2691327, 2678806, 2659733, 2633423]
53365B633423l3365l9055m3312m6833m9698n1411n2142n2717n3350n3306n2086
53354B106148n0186m8361m6681m4636m1895l8906l6710l5958l6164l6370l6510
53343A653771l7284l8460l8459l6307l3026l0242k8187k6092k3721k1362j8873
53332A321758j6049j3520j2098j1449j0613r616r428j0421j2018j3744j5440j6433
53320A170929j5764j3561j1209r809r246q898q390p430n764l693j985r16M3J340
53306A075647K779M068N325O699Q032R245J0675J2623J4885J6995J8750K0353
53294A206076K2060K3848K5362K6273K6670K6908K6975K6461K5206K3559K1699
53283A481097J9378J6730J4629J3457J2198R699O319L226M48k995p059j0266j1743
$$ y = [2633423, 2600058, 2561003, 2517691, 2470858, 2421160, 2369749, 2317607, 2264890, 2211540, 2158234, 2106148, 2055962, 2007601, 1960920, 1916284, 1874389, 1835483, 1798773, 1762815, 1726651, 1690281, 1653771, 1616487, 1578027, 1539568, 1503261, 1470235, 1439993, 1411806, 1385714, 1361993, 1340631, 1321758, 1305709, 1292189, 1280091, 1268642, 1258029, 1248413, 1238985, 1228564, 1216546, 1202802, 1187362, 1170929, 1155165, 1141604, 1130395, 1120586, 1111340, 1102442, 1094052, 1086622, 1080858, 1077165, 1075180, 1074264, 1074307, 1075647, 1078426, 1082494, 1087819, 1094518, 1102550, 1111795, 1122470, 1135093, 1149978, 1166973, 1185723, 1206076, 1228136, 1251984, 1277346, 1303619, 1330289, 1357197, 1384172, 1410633, 1435839, 1459398, 1481097, 1500475, 1517205, 1531834, 1545291, 1557489, 1567188, 1573507, 1576733, 1577181, 1574186, 1567127, 1556861, 1545118]
53270A545118j2485j3875j5991j8106k0073k2217k4398k6073k7163k7982k8469
53259A308286k8214k7337k6610k6472k6517k6274k5975k6020k6087k5431k3971
53248A019378k2530k1916k2197k2899k3396k3046k1676k0120j9563j9930j9735
53237G82370j8096j6097j5295j5508j5211j3697j1606r607p826o520o112o376
53225F40419o668p047q142r829j1246j2171j3145j4117j4359j4009j4161j4917
53213E00608j4915j3477j1769j0917j0398r302p955p124o692o310o311o871p259
53200C81308p035o991p670q062p180n923n747o328o198n115m123l678l315k961
53186C00982k964l051k614j952j820j966j534p23n69j099j268q23p41j441j990
$$ y = [1545118, 1532633, 1518758, 1502767, 1484661, 1464588, 1442371, 1417973, 1391900, 1364737, 1336755, 1308286, 1280072, 1252735, 1226125, 1199653, 1173136, 1146862, 1120887, 1094867, 1068780, 1043349, 1019378, 996848, 974932, 952735, 929836, 906440, 883394, 861718, 841598, 822035, 802105, 782370, 764274, 748177, 732882, 717374, 702163, 688466, 676860, 667253, 659427, 652907, 646795, 640419, 633751, 626704, 618562, 608733, 597487, 585316, 572171, 558054, 543695, 529686, 515525, 500608, 485693, 472216, 460447, 449530, 439132, 429830, 421875, 414751, 408059, 401749, 395438, 388567, 381308, 374273, 367282, 359612, 351550, 344370, 338447, 332700, 326372, 320174, 315059, 310936, 307258, 303943, 300982, 298018, 294967, 292353, 290401, 288581, 286615, 285081, 284358, 283789, 282690, 281422, 280599, 279858, 278417, 276427]
53171B76427j612q38n46q17j251j697k138k447k513k336j824r95k52m2l06p68
53155B56045j394k042k059j097O6L25l17r89j294j443j405r28k91j4L8L84R03
53138B44488J069R62J084J357J307J031R97J094R10O84Q71J023M53k97o1R71J403
53121B59346Q70N27J038J585J368P77M21J96q1j22J05K2o20j278j528j660j982
53104B58984k265k241j966j428n55J65J0q40j388j247j039j125j039n51k46m92
53088B42737q05p55o63p78o73l6O17O69K69m5n5J97N94P34J44r47j612j351o31
53069B37610j12J5k58r56j711j876j342o92l16j1L58N73O08P12Q09N70J58O0J52
53050B34351o1k35N11J860K268J203J1k10k62j274k625k739j304M76J492J598
$$ y = [276427, 274815, 273977, 273431, 272614, 271363, 269666, 267528, 265081, 262568, 260232, 258408, 257413, 257161, 257119, 256813, 256045, 254651, 252609, 250550, 249453, 249519, 249844, 249527, 248538, 247244, 245801, 244396, 243468, 243177, 243163, 243201, 243585, 244488, 245557, 246519, 247603, 248960, 250267, 251298, 252295, 253389, 254299, 254983, 255854, 256877, 257330, 257033, 256972, 257943, 259346, 260216, 260743, 261781, 263366, 264734, 265511, 265932, 266128, 266047, 265925, 266030, 266052, 265432, 264154, 262626, 260966, 258984, 256719, 254478, 252512, 251084, 250529, 250694, 250704, 249864, 248476, 247229, 246190, 245065, 244026, 243475, 243229, 242737, 241932, 241177, 240514, 239736, 239063, 239027, 239644, 240313, 240582, 240537, 240482, 240679, 241273, 242007, 242151, 241204, 239592, 238241, 237610, 237498, 237513, 237255, 236299, 234588, 232712, 231370, 230678, 230362, 230351, 230709, 231282, 231890, 232602, 233411, 233981, 234139, 234199, 234351, 234290, 234055, 234566, 236426, 238694, 239897, 239908, 239698, 239436, 238162, 235537, 232798, 231494, 231970, 233462, 235060]
53034B35060J151M89j42o67j036q65J91J468J616L78p83n70M35Q19M12J93N57
53017B38706Q50O11K89M78J107J650J720J332P79L41k3n63j298j773j461l50R15
53000B43310J417P16n84j261q08pJ65j81l53l66p48j314j218l63L38K83j00j49
52982B38777L56J429K892M045M235L852L813L969L279J669M12K62M89L58K61O26
52966B70724R35O62K15J18J30m2r9P0j09q24j288j001o80j007j480j500j590k373
52948B60861l140k778j529o05m83o71p95q35o49k71l05j035j584r77L20J024P71
52931B47319K64r4n19r49r60n92l17j53K95R29J149P90K93j24o72j271j406r25
52913B43057l36n0J60O93J455J877J456K10j216k037k019j559j085p28o05q59
$$ y = [235060, 236211, 236700, 236558, 235891, 234855, 233990, 234181, 235649, 237265, 237643, 236860, 236290, 236725, 237544, 237956, 238149, 238706, 239556, 240167, 240456, 240934, 242041, 243691, 245411, 246743, 247522, 247863, 247840, 247277, 245979, 244206, 242745, 242395, 243310, 244727, 245443, 244859, 243598, 242790, 242783, 242948, 242767, 242414, 242048, 241300, 239986, 238768, 238405, 238743, 239026, 238926, 238777, 239133, 240562, 243454, 247499, 251734, 255586, 259399, 263368, 266647, 268316, 268728, 268990, 269479, 269837, 270098, 270724, 271659, 272321, 272536, 272654, 272784, 272742, 272643, 272713, 272604, 271780, 270492, 269491, 268811, 267804, 266324, 264824, 263234, 260861, 257721, 254943, 253414, 252809, 252326, 251655, 250860, 250025, 249376, 249105, 248800, 247765, 246181, 245204, 245524, 246548, 247319, 247583, 247489, 246970, 246021, 245061, 244469, 244152, 243999, 244294, 245223, 246372, 247162, 247455, 247331, 246659, 245388, 243982, 243057, 242721, 242671, 242831, 243524, 244979, 246856, 248312, 248522, 247306, 245269, 243250, 241691, 240606, 239878, 239273, 238414]
52897B38414j154q02K22J044J082Q54R81J136P26N9n3M33P93N92M2n06p70n00
52879B42593K50R38J189J297J552J577R91L13L40Q87J088Q09Q33J597K503K705
52863B61462K024R63K66M29J237J808J429K75r34j802k367k672k764k882l199
52848B53273l472l415l121k827k456j941j619j759j984j716j015m17j30N9K48
52833B27708L57M75P16Q11L65m74j052r11j72O67J098Q50O9q22j534j993k043
52816B24115j491n80J36N35J043J757K249K391K648L082K923J754K88o98j492
52801B38660k587l462l250k142j124o15l13j05k00n02o77p64r84j086o03L28J056
52784B21630J237J044P42N16N16N83K87l17m84J51P71M76l99q72p44n43m12o2
$$ y = [238414, 237260, 236458, 236680, 237724, 238806, 239660, 240641, 241777, 242503, 242562, 242509, 242942, 243735, 244327, 244369, 243863, 243093, 242593, 242843, 243781, 244970, 246267, 247819, 249396, 250387, 250700, 251040, 251927, 253015, 253824, 254657, 256254, 258757, 261462, 263486, 264449, 264715, 265144, 266381, 268189, 269618, 269893, 268959, 267157, 264790, 262118, 259354, 256472, 253273, 249801, 246386, 243265, 240438, 237982, 236041, 234422, 232663, 230679, 228963, 227948, 227531, 227401, 227460, 227708, 228065, 228540, 229256, 230067, 230432, 229958, 228906, 227995, 227823, 228490, 229588, 230438, 230507, 229685, 228151, 226158, 224115, 222624, 222044, 222180, 222715, 223758, 225515, 227764, 230155, 232803, 235885, 238808, 240562, 240850, 240152, 238660, 236073, 232611, 229361, 227219, 226095, 225480, 225167, 225062, 224862, 224360, 223683, 222919, 221935, 220849, 220246, 220574, 221630, 222867, 223911, 224653, 225169, 225685, 226268, 226555, 226238, 225754, 225905, 226676, 227152, 226753, 225881, 225137, 224594, 224182, 224120]
52766B24120L80M32J26j09l14r18j737j908r47O47J974K485K233J765J548J336
52750B31113N22o26q99J31J187J033K88M00J402K085K018J915K102J951J134K59
52734B46015n1J49N45R08R70O63N09J011J663J467L92n59q59j049j648k319k486
52717B45321k119j532r31m06l5J67J94Nk01j2N19O86J03o18p83o83r08j123o03
52698B37041L75Q63P36P62J223J524J312R93R40J009R34O01j3o60p36j45J88n05
52680B46442j511j533n38M02Q13J072J207Q47L30M76J098J080J09r52j496j742
52664B46104j655q28L01N81M3J45J476K649K365J292Q67J277J736J929J989J690
52648B61961P12o07j634k217k508k378j699q36k96j06j6P1K59P94J579J961J533
$$ y = [224120, 224500, 224932, 225058, 224949, 224635, 223717, 221980, 220072, 219125, 219772, 221746, 224231, 226464, 228229, 229777, 231113, 231635, 231009, 230110, 230241, 231428, 232461, 232749, 233149, 234551, 236636, 238654, 240569, 242671, 244622, 245756, 246015, 245964, 246113, 246658, 247566, 248536, 249199, 249708, 250719, 252382, 253849, 254241, 253682, 252823, 251774, 250126, 247807, 245321, 243202, 241670, 240739, 240333, 240298, 240465, 240659, 240664, 240463, 240451, 240970, 241656, 241759, 241141, 240358, 239675, 238767, 237644, 237041, 237416, 238279, 239015, 239777, 241000, 242524, 243836, 244829, 245769, 246778, 247712, 248313, 248300, 247640, 246904, 246759, 246947, 246442, 244931, 243398, 242860, 243262, 244075, 245147, 246354, 247201, 247531, 248007, 249105, 250185, 250294, 249342, 247846, 246104, 244449, 243621, 243922, 244503, 244546, 244691, 246167, 248816, 251181, 252473, 253340, 254617, 256353, 258282, 260271, 261961, 262673, 262066, 260432, 258215, 255707, 253329, 251630, 250794, 250498, 250392, 250376, 250447, 250706, 251500, 253079, 255040, 256573]
52631B56573P71M74Q81J762K941M149M657L730J487j043k839l655l891l837l299
52616B58861k093p55k71q75j664j730j207p07k99L11R79J375J644K028K165J651
52600B59413J007J016J416J307O75L46M48K45m13o82j52M95O31M61L14K5m79q28
52582B65245q23o98n13n5N25P12M77L23L60J97j54k43j94o81j641k071j482o09
52564B58675k43l21n30q39j077q20j97Q2k10n07m64l74l13R2P01P39Q3l85j21
52545B53971L65N62O64P74M96j84n89n07n73r73r37o7Q58J159J216J422J313N33
52527B59503k26j97L55P67R11Q41L74k95m17J82O56M57J47L04O57J036J972L491
52509B70518M428M010L102K793K753K106J035K19n68j899l340l893l452k729k111
$$ y = [256573, 257344, 257818, 258699, 260461, 263402, 267551, 272208, 275938, 277425, 276382, 273543, 269888, 265997, 262160, 258861, 256768, 256013, 255742, 254867, 253203, 251473, 250266, 249559, 249260, 249571, 250550, 251925, 253569, 255597, 257762, 259413, 260420, 261436, 262852, 264159, 264834, 265180, 265628, 265873, 265460, 264778, 264626, 265121, 265752, 266213, 266527, 266552, 266073, 265245, 264422, 263724, 263211, 263156, 263681, 264393, 264870, 265193, 265553, 265750, 265596, 265353, 265159, 264478, 262837, 260766, 259284, 258675, 258432, 258111, 257581, 256742, 255665, 254845, 254648, 254730, 254520, 254013, 253549, 253175, 252862, 252954, 253655, 254394, 254477, 254092, 253971, 254336, 254898, 255562, 256336, 256832, 256648, 256059, 255552, 254979, 254006, 253069, 253002, 253860, 255019, 256235, 257657, 258970, 259503, 259277, 259080, 259435, 260202, 261113, 261954, 262328, 262033, 261616, 261798, 262454, 262911, 263058, 263362, 264019, 265055, 267027, 270518, 274946, 278956, 282058, 284851, 287604, 289710, 290745, 290964, 290396, 288497, 285157, 281264, 277812, 275083, 272972]
52494B72972j520r80n31k4L24j91j539k436j894n88K36M25N75P57P07O01O42N17
52476B68053J76L48J290J981J624R84R91J111N68J57R99K328K493J644J347J859
52460B87953J886J059N11O62M14q85k281k779k705k830l239l686m048l904k698
52445B63430q36L31J58n11p04n99q03j189j188p56l49k57l74m43k75J00L67K54
52427B56356m7o2L90J077J701J965J531L90p75j078k76J095K269K715K455K325
52411B72031L355N418P053P319P152Q036R849J1176J1311J0610R052N903J111
52398C69376m022q051j0457j1243j0464q573o560n149m251l439k611j876j186
52385B91494l58O47J553J887J448P70O96J337J975K290K935M279N398N286M456
$$ y = [272972, 271452, 270472, 269941, 269917, 270241, 270050, 268511, 266075, 264181, 263593, 263829, 264254, 264829, 265586, 266293, 266894, 267536, 268053, 268229, 268577, 269867, 271848, 273472, 274456, 275447, 276558, 277126, 277283, 278282, 280610, 283103, 284747, 286094, 287953, 289839, 290898, 291409, 292071, 292485, 291600, 289319, 286540, 283835, 281005, 277766, 274080, 270032, 266128, 263430, 262594, 262925, 263083, 262572, 261868, 261269, 260466, 259277, 258089, 257333, 256984, 256727, 256353, 255910, 255635, 255735, 256102, 256356, 256309, 256247, 256637, 257714, 259415, 261380, 262911, 263301, 262526, 261448, 261172, 262267, 264536, 267251, 269706, 272031, 275386, 280804, 287857, 295176, 302328, 310364, 320213, 331389, 342700, 353310, 362362, 368265, 369376, 365354, 357303, 346846, 335603, 325139, 316566, 310006, 304857, 300606, 297167, 294556, 292680, 291494, 291136, 291783, 293336, 295223, 296671, 297441, 298137, 299474, 301449, 303739, 306674, 310953, 316351, 321637, 326093]
52370C26093M200M636M744M087L277K666J825N66n49j036j040q34m83k04l32o49
52354C46967n17J75Q03R44Q59Q52Q28O73N87P80J323K263L452M306M371M056M233
52337C76955N087O023O703P411Q354R321J0232J1337J2674J3913J4903J5877J6991
52324E15781J8154J9380K0765K2015K2485K1908K0643J9248J8179J7796J8115
52313G34469J8581J8579J8134J7669J7285J6838J6496J6470J6383J5644J4458
52302I21006J3617J3311J2853J1745J0284Q893P493N714L296J73l394o707r091
52289I89193j0459j1076j1000j0315r615r451r379q353o137l665j880q60j28P27
52275H97602J923L465N139O839Q766J1012J3167J4683J5375J5239J4268J2930
$$ y = [326093, 330293, 334929, 339673, 343760, 347037, 349703, 351528, 352094, 351545, 350509, 349469, 348635, 348152, 347948, 347616, 346967, 346450, 346625, 347428, 348372, 349231, 350083, 350911, 351584, 352171, 352951, 354274, 356537, 359989, 364295, 368666, 372722, 376955, 382042, 388065, 394768, 402179, 410533, 419854, 430086, 441423, 454097, 468010, 482913, 498790, 515781, 533935, 553315, 574080, 596095, 618580, 640488, 661131, 680379, 698558, 716354, 734469, 753050, 771629, 789763, 807432, 824717, 841555, 858051, 874521, 890904, 906548, 921006, 934623, 947934, 960787, 972532, 982816, 991709, 999202, 1004916, 1008212, 1008385, 1004991, 998284, 989193, 978734, 967658, 956658, 946343, 936728, 927277, 917898, 909545, 903408, 899743, 897863, 897003, 896875, 897602, 899525, 902990, 908129, 914968, 923734, 934746, 947913, 962596, 977971, 993210, 1007478, 1020408]
52263A020408J2206J2407J2642J2215J1888J2651J3913J4257J3560J2925J2740
52252A161812J2266J1108R658P912N213J505k324n576q202j0041j0843j1200j2162
52239A149126j3597j4248j3689j2961j2823j2665j1822j0785j0311j0342j0431
52228A015452j0458j0236r286p616n930m599l260j902j328j751j958q02J185K600
52214I60111L080L438M264N275N963O220O263O327O475O496O121N359M524L956
52200A033872L889M365N000N155M814M868N856O940P002O282N745N291M010K077
52186A105166P23J90p07k569m487n676o622p901r119r820j0285j0639j0289r017
52172A018948p585o514n330l801k744k592k267o91J501K957L645M482N518N767
$$ y = [1020408, 1032614, 1045021, 1057663, 1069878, 1081766, 1094417, 1108330, 1122587, 1136147, 1149072, 1161812, 1174078, 1185186, 1194844, 1202756, 1207969, 1209474, 1207150, 1201574, 1193372, 1183331, 1172488, 1161288, 1149126, 1135529, 1121281, 1107592, 1094631, 1081808, 1069143, 1057321, 1046536, 1036225, 1025883, 1015452, 1004994, 994758, 985472, 977856, 971926, 967327, 964067, 962165, 960837, 959086, 957128, 956326, 957511, 960111, 963191, 966629, 970893, 976168, 982131, 988351, 994614, 1000941, 1007416, 1013912, 1020033, 1025392, 1029916, 1033872, 1037761, 1042126, 1047126, 1052281, 1057095, 1061963, 1067819, 1074759, 1081761, 1088043, 1093788, 1099079, 1103089, 1105166, 1105889, 1106079, 1105372, 1102803, 1098316, 1092640, 1086018, 1078117, 1068998, 1059178, 1048893, 1038254, 1027965, 1018948, 1011363, 1004849, 999519, 995718, 992974, 990382, 988115, 987424, 988925, 991882, 995527, 1000009, 1005527, 1011294]
52158A011294M810L433K567K309K061J261%r31r17m19l89p42m05Q43J763J463
52142A028001P15O24J010J093R48J104J377J266J137J852L465N283P010R042J1719
52127A075646J4922J8324K1540K4173K6124K7655K8825K9422K9611K9989L0598
52116A356829L0642K9737K8579K7716K6487K4062K0811J7736J5062J2373R638
52105A599672P218N246L782L147L317L427K687J311k14k152m891p827j0024j1727
52091A592972j4009j7113k0094k2085k2981k2868k1662j9496j6784j3800j0595
52080A391485p283m090j279P01J484J638K639N296Q669J1266J2847J4174J5493
52067A453040J6301J6473J6553J6908J7240J7100J6291J4907J3402J2416J2013
$$ y = [1011294, 1016104, 1019537, 1022104, 1024413, 1026474, 1027735, 1027735, 1026804, 1025887, 1025468, 1025079, 1024337, 1023932, 1024775, 1026538, 1028001, 1028716, 1029340, 1030350, 1031443, 1032391, 1033495, 1034872, 1036138, 1037275, 1039127, 1042592, 1047875, 1054885, 1063927, 1075646, 1090568, 1108892, 1130432, 1154605, 1180729, 1208384, 1237209, 1266631, 1296242, 1326231, 1356829, 1387471, 1417208, 1445787, 1473503, 1499990, 1524052, 1544863, 1562599, 1577661, 1590034, 1599672, 1606890, 1612136, 1615918, 1619065, 1622382, 1625809, 1628496, 1629807, 1629593, 1627441, 1622550, 1614723, 1604699, 1592972, 1578963, 1561850, 1541756, 1519671, 1496690, 1473822, 1452160, 1432664, 1415880, 1402080, 1391485, 1384202, 1380112, 1378833, 1379534, 1381018, 1382656, 1385295, 1390591, 1399260, 1410526, 1423373, 1437547, 1453040, 1469341, 1485814, 1502367, 1519275, 1536515, 1553615, 1569906, 1584813, 1598215, 1610631, 1622644]
52056A622644J1379R820P705N901M535K953N72k730o731j0758j3942j6131j8083
52043A597134k0252k2015k2880k3501k4490k4963k3710k1268j9392j8638j7978
52032A358047j6739j5408j4334j3105j1679j0906j1251j1990j2274j2222j2336
52021A215803j2547j2417j1842j1013j0162r658r818j0319j0234r140p798p296
52009A093559p857q883r896j0939j2164j3516j4976j6706j8713k0417k0942j9996
51997I18554j8255j6606j5241j3781j2162j0789r943r568r692j0352j1107j1427
51985G69631j1613j2432j3597j3798j2670j1602j1809j2744j3294j3451j3613
51974F29008j3220j1647r691q558p749n609j933J582L662M817O048P421Q509R171
$$ y = [1622644, 1634023, 1643843, 1651548, 1657449, 1661984, 1664937, 1665509, 1662779, 1656048, 1645290, 1631348, 1615217, 1597134, 1576882, 1554867, 1531987, 1508486, 1483996, 1459033, 1435323, 1414055, 1394663, 1376025, 1358047, 1341308, 1325900, 1311566, 1298461, 1286782, 1275876, 1264625, 1252635, 1240361, 1228139, 1215803, 1203256, 1190839, 1178997, 1167984, 1157822, 1148164, 1138346, 1128027, 1117793, 1108653, 1100855, 1093559, 1085702, 1076819, 1066923, 1055984, 1043820, 1030304, 1015328, 998622, 979909, 959492, 938550, 918554, 900299, 883693, 868452, 854671, 842509, 831720, 821777, 812209, 802517, 792165, 781058, 769631, 758018, 745586, 731989, 718191, 705521, 693919, 682110, 669366, 656072, 642621, 629008, 615788, 604141, 594450, 585892, 578143, 572534, 570601, 572183, 575845, 580662, 586710, 594131, 602640, 611811]
51960F11811R266Q390O462M097J936p5k429n332q342j0483j0903r711p942o375
51946E80370m770k654l40J631L511N857Q379J0278J1515J2716J3910J4416J3917
51933F68736J2661J0594P353L231q44m448p880j1058j3272j4273j4674j4899j4612
51920F06615j3533j2067j0692r331p630n333k299J222M298O147P328R079J1299
51907E85103J2255J0754P585M260J334j256l101l709l526l603m381n557o994r015
51893E80149j1739j4620j6837j7879j7708j6555j4655j2107r022n722k641%K231
51880D42895M120N667O875P787Q531R405J0633J1829J2059J0848Q720O391L842
51867E49602P88k387m945o802q384r615r976r407q275o495l694l34K322L676M324
$$ y = [611811, 621077, 629467, 635929, 640026, 641962, 641887, 639458, 634126, 625784, 615301, 604398, 594687, 586745, 580370, 575600, 572946, 572606, 574237, 577748, 583605, 591984, 602262, 613777, 626493, 640403, 654819, 668736, 681397, 691991, 699344, 702575, 701731, 697283, 689403, 678345, 665073, 650800, 636126, 621227, 606615, 593082, 581015, 570323, 560992, 553362, 548029, 545730, 546952, 551250, 557397, 564725, 573804, 585103, 597358, 608112, 615697, 619957, 621291, 620035, 616934, 613225, 609699, 606096, 601715, 596158, 589164, 580149, 568410, 553790, 536953, 519074, 501366, 484811, 470156, 458049, 449027, 443305, 440664, 440664, 442895, 447015, 452682, 459557, 467344, 475875, 485280, 495913, 507742, 519801, 530649, 539369, 545760, 549602, 550390, 548003, 543058, 536256, 527872, 518257, 508281, 498874, 490599, 484104, 480410, 480076, 482398, 486074, 490398]
51852D90398M814M764L652J727m35k605m600n936o412o613p215q020q244p582
51838D47693o471n412m394l077j336M63J751K323K517K715K839K534J654L15j253
51823D42861k620l238l063k819l082l431l075k026r33J2J098K149K561K332K174
51808D28900K374K307J423k3j491k721l464l362k498j565j020n29L46J213J130
51793D21020l21k461m042m309l550k591j732o21P38J516J118J52l90m68o40q36
51777D02583n09J81N28O01J255K687M069M850N492O585Q146J0005J1965J3260
51763D71698J2859J0776Q214N918L266m38m607p985r983j0755j0555r708q889
51750D49811q599q530p915o474m734l499l133l194k758j321O55K373L722N186
$$ y = [490398, 495212, 499976, 503628, 505355, 504920, 502315, 497715, 491779, 485367, 478754, 471539, 463519, 455275, 447693, 441222, 435810, 431416, 428339, 427003, 427466, 429217, 431540, 434057, 436772, 439611, 442145, 443799, 444114, 442861, 440241, 437003, 433940, 431121, 428039, 424608, 421533, 419507, 418574, 418586, 419684, 421833, 424394, 426726, 428900, 431274, 433581, 435004, 434981, 433490, 430769, 427305, 423943, 421445, 419880, 418860, 418331, 418677, 419890, 421020, 420699, 418238, 414196, 409887, 406337, 403746, 402014, 401393, 402131, 403647, 404765, 404917, 404527, 404059, 403419, 402583, 402074, 402255, 402783, 403384, 404639, 407326, 411395, 416245, 421737, 428322, 436468, 446473, 458438, 471698, 484557, 495333, 503547, 509465, 512731, 512293, 507686, 499701, 489718, 478963, 468408, 458700, 449811, 441212, 432682, 424767, 418293, 413559, 410060, 406927, 403733, 400975, 399654, 400309, 402682, 406404, 411590]
51736D11590O941Q618R843J0371R768P771M950K379N41p39j414j190l65K22J61
51721D69447m49j825m253o824p756o419m098k239j026j96n6q15j743j919j268
51706D28561k49R34K217L361M211M762M587L001K81k068k861k385j471k74J312
51691D43919K778L426L179K240M89k090m762o528p049o569n453m157l167k444
51677D13812j437j10P52P84Q36J793L238M090M106L911L986M477N566P207Q584
51662D61595Q669P206M660J483j995n130p065p184n256j520K978O688Q862J0106
51648D84097J1047J0963Q553L723k117p390j1256j3439j4082j3816j3364j2826
51636D30093j1797j0147q285o664n374m234l031j640j42J225K301L012L156K545
$$ y = [411590, 418531, 427149, 436992, 447363, 457131, 464902, 469852, 472231, 472772, 472033, 470619, 469429, 469064, 469286, 469447, 468998, 467173, 462920, 456096, 448340, 441921, 437823, 435584, 434558, 434362, 434306, 433491, 431748, 429829, 428561, 428312, 429246, 431463, 434824, 439035, 443797, 448384, 451385, 451666, 449598, 446737, 444352, 442881, 442607, 443919, 446697, 450123, 453302, 455542, 456031, 453941, 449179, 442651, 435602, 429033, 423580, 419423, 416256, 413812, 412375, 412265, 413017, 413801, 414637, 416430, 419668, 423758, 427864, 431775, 435761, 440238, 445804, 453011, 461595, 470264, 477470, 482130, 483613, 481618, 476488, 469423, 462239, 456983, 455463, 458441, 465129, 473991, 484097, 495144, 506107, 514660, 518383, 516266, 508876, 497620, 484181, 470099, 456283, 442919, 430093, 418296, 408149, 399864, 393200, 387826, 383592, 380561, 378921, 378779, 380004, 382305, 385317, 388473, 391018]
51622C91018J479N83K0o56j623k307k206j631j147p53j32O17J091J124P56m5j108
51605C85080j773j424k63R52J893K936M444O170P591Q623R712J1099J2077J1385
51591D58502Q464M058o30m892q281j0056r742p962n873l893j704P84L317N957
51577D28049Q851J1529J3400J4801J6347J7546J7470J6790J7362J9535K1484K1780
51565F24944K0988K0053J8960J8131J9470K4426L1877L9248M5048M9110N1127
51554I63382N0201M5587L7127K5461J2351M7j0448j9848k8838l6880m3208m7815
51542I47119n0623n0934m8805m5755m2926l9648l5045k9919k5611k2049j8531
51531E37273j5529j3941j3141j1582r042o729n374m641m205m033l797l172k568
$$ y = [391018, 392497, 393080, 393100, 392444, 390821, 388514, 386308, 384677, 383530, 382777, 382645, 383262, 384353, 385477, 386233, 386188, 385080, 383307, 381883, 381620, 382572, 384465, 387401, 391845, 398015, 405606, 414229, 423941, 435040, 447117, 458502, 466966, 471024, 470394, 465502, 457221, 447165, 437423, 429461, 423588, 419695, 417991, 418775, 422092, 428049, 436900, 448429, 461829, 476630, 492977, 510523, 527993, 544783, 562145, 581680, 603164, 624944, 645932, 665985, 684945, 703076, 722546, 746972, 778849, 818097, 863145, 912255, 963382, 1013583, 1059170, 1096297, 1121758, 1134109, 1134156, 1123708, 1103860, 1075022, 1038142, 994934, 947119, 896496, 845562, 796757, 751002, 708076, 668428, 633383, 603464, 577853, 555804, 537273, 521744, 507803, 494662, 483080, 474038, 467309, 461935, 457294, 453089, 449056, 445259, 442087, 439519]
51518D39519k470k394j635n39J55P31J891L167L420K622J693Q09o69k682m329
51503D39289n205n617n554m724l479k454j510l27K42r53l140m041k771q07K78
51488C99227O10R67J276R90Q0j036k018k685l009l142l116k713k119k218l427
51473C77667m712m759l733k829k552k539k660k918k763j828r89j142j411l38J526
51458C44020K218J481J069J767K287J792J344J957L000L749M833O967R408J0963
51444C96855J1582J2046J2854J4107J5437J5462J2516O801P88l320n456o317n685
51431D77670l486j429j836n022r036j1760j2462j1545r805p992o474n199m074
51418C87550l041j821j75J376J945J623J609K543L626L886L463L003K621K243
$$ y = [439519, 437049, 434655, 433020, 432481, 432636, 433367, 435258, 438425, 441845, 444467, 446160, 446969, 446300, 443618, 439289, 434084, 428467, 422913, 418189, 414710, 412256, 410746, 410419, 410661, 409708, 406568, 402527, 399756, 398949, 399227, 399837, 400804, 402080, 403070, 403150, 402114, 400096, 397411, 394402, 391260, 388144, 385431, 383312, 381094, 377667, 372955, 368196, 364463, 361634, 359082, 356543, 353883, 350965, 348202, 346374, 345385, 344243, 342832, 342494, 344020, 346238, 347719, 348788, 350555, 352842, 354634, 355978, 357935, 360935, 364684, 369517, 376484, 385892, 396855, 408437, 420483, 433337, 447444, 462881, 478343, 490859, 497660, 498448, 495128, 489672, 483355, 477670, 474184, 472755, 470919, 465897, 456861, 445101, 432639, 421094, 411289, 403297, 396823, 391624, 387550, 384509, 382688, 382513, 383889, 385834, 387457, 389066, 391609, 395235, 399121, 402584, 405587, 408208, 410451]
51404D10451K198K654L059K911K599K718L023K852K179J585J513K124L526N469
51390D48861P208Q286R200J0734J3007J5709J8911K2958K7812L3146L8927M5321
51378G00080N1993N8138O3215O7183O9743O9659O5203N5575M1923K6778J2259
51367A281749j082j3636k5472l6203m5574n3480n9417o2698o3296o1926n9249
51356G99716n5539n1055m6068m0600l4691k8974k4213k0387j6860j3456j0616
51345D57257q535o987n937n549n531n337n011m928m819m086l042k659l036l305
51331C88495l211l417l942l780k671j822k089k635k398j748j625j803j275J00
51317C56179J353J695J332J065J475K418L183L372L425L811M024L327K182J778
$$ y = [410451, 412649, 415303, 418362, 421273, 423872, 426590, 429613, 432465, 434644, 436229, 437742, 439866, 443392, 448861, 456069, 464355, 473555, 484289, 497296, 513005, 531916, 554874, 582686, 615832, 654759, 700080, 752073, 810211, 873426, 940609, 1010352, 1080011, 1145214, 1200789, 1242712, 1269490, 1281749, 1280667, 1267031, 1241559, 1205356, 1159782, 1106302, 1046885, 984187, 920891, 858965, 799716, 744177, 693122, 647054, 606454, 571763, 542789, 518576, 498189, 481329, 467873, 457257, 448722, 441735, 435798, 430249, 424718, 419381, 414370, 409442, 404623, 400537, 397495, 394836, 391800, 388495, 385284, 381867, 377925, 374145, 371474, 369652, 367563, 364928, 362530, 360782, 359157, 357354, 356079, 356179, 357532, 359227, 360559, 361624, 363099, 365517, 368700, 372072, 375497, 379308, 383332, 386659, 388841, 390619]
51303C90619K118K015J165N82O19J04j728l956n531o686p721p733o002l625k260
51288C51980j965j548m76Q09K015L195M140M603M854N230N415M957L985K769J161
51273C91124o96j863j782j232j106q99L04J964K690K433K540L515M148L247J169
51258D05556q84k268l068l487l589l449l181k898k712k693k822k984k884k109
51244C66528n63J162K285K631K539K058R23o47j916k518k650k405j780j366j892
51229C62389k902l060k113j226j020p00K22Q73O67N20J278K189K295K094K446
51214C63952K860K487J860J998K541K450J955K097K809L200L337M033M976M856
51200D05411L446J965J174N07n52j637k362k952l573m001m143m087l551k181m65
$$ y = [390619, 392737, 394752, 395917, 396499, 397118, 397222, 395494, 391538, 386007, 379321, 371600, 363867, 357865, 354240, 351980, 350015, 348467, 347991, 348800, 350815, 354010, 358150, 362753, 367607, 372837, 378252, 383209, 387194, 389963, 391124, 390428, 388565, 386783, 385551, 384445, 383546, 383850, 385814, 388504, 390937, 393477, 396992, 401140, 404387, 405556, 404672, 402404, 399336, 395849, 392260, 388811, 385630, 382732, 380020, 377327, 374505, 371521, 368637, 366528, 365965, 367127, 369412, 372043, 374582, 376640, 377563, 376916, 375000, 372482, 369832, 367427, 365647, 364281, 362389, 359487, 356427, 354314, 353088, 352068, 351368, 351590, 352463, 353130, 353650, 354928, 357117, 359412, 361506, 363952, 366812, 369299, 371159, 373157, 375698, 378148, 380103, 382200, 385009, 388209, 391546, 395579, 400555, 405411, 408857, 410822, 411996, 412503, 411951, 410314, 407952, 405000, 401427, 397426, 393283, 389196, 385645, 383464, 382999]
51185C82999O35R57J133J319J046M33L37R29J217M91o64j250j052m64K00P61J018
51168C90045R30O80M13K13L60J144K341L300L539K989J805L79o84j100j248j515
51152D03591j601j131n53o08j099j072k49N70O39O0o82j390k152l042l888m175
51136C83218l369j734l80r7m83p35q12j067j243p40M11J608K510L059L030K411
51120C85587J869J982K295K090J777K362L756M730M559L725K979K648K816L273
51106D26448L322K530J594J435J676J177J9m43K39P91J03j214j892j698j383j456
51090D31248j711j612q39L22J025O60k97p44k46O18J127J011L62m11o23L8R81
51073D30909J452J553J792J996J698J347J849L064M022M750O439R356J2056J3365
$$ y = [382999, 383634, 384591, 385724, 387043, 388089, 388522, 388859, 389788, 391005, 391496, 390832, 389582, 388530, 388066, 388266, 389027, 390045, 390975, 391655, 392068, 392281, 392641, 393785, 396126, 399426, 402965, 405954, 407759, 408138, 407454, 406354, 405106, 403591, 401990, 400859, 400306, 399698, 398599, 397527, 397278, 397848, 398487, 398547, 397865, 396475, 394323, 391281, 387393, 383218, 379849, 378115, 377735, 377638, 377155, 376420, 375608, 374541, 373298, 372558, 372969, 374577, 377087, 380146, 383176, 385587, 387456, 389438, 391733, 393823, 395600, 397962, 401718, 406448, 411007, 414732, 417711, 420359, 423175, 426448, 429770, 432300, 433894, 435329, 437005, 438182, 438201, 437758, 437997, 438788, 438891, 437677, 435785, 434087, 432704, 431248, 429537, 427925, 427086, 427408, 428433, 429093, 428796, 428052, 427806, 428424, 429551, 430562, 430924, 430513, 429890, 429928, 430909, 432361, 433914, 435706, 437702, 439400, 440747, 442596, 445660, 449682, 454432, 460871, 470227, 482283, 495648]
51059D95648J3988J5135J6420J6189J3700J0105P385O817Q359J1121J4177J6869
51047F45913J8434J7983J5341J1568P876M324K83m135q007j0791j2561j3156j2230
51034F60842j0337r029r482j1636j4663j7496j8872j7961j5243j2128r517p345
51022E07133n334l336j004J829M420N783O102O499P324P932Q146Q618R424R752
51008E73288R422R410J0236J1067J1133J0875J0889J0854J0431J0248J0921J1802
50996G00576J1750J0652R382Q627Q407Q391Q012O712M543K283O43j92o9J324L769
50981G84810O340Q397J0074J1456J2085J1883J1792J2818J4993J7808K1096K4957
50969I48509K9372L4427M0319M6592N2009N5747N8296O0733O3625O6966P0375
$$ y = [495648, 509636, 524771, 541191, 557380, 571080, 581185, 588570, 595387, 603746, 614867, 629044, 645913, 664347, 682330, 697671, 709239, 717115, 721439, 721722, 717587, 709580, 698789, 686228, 673072, 660842, 650505, 641476, 631994, 620358, 605695, 588199, 569327, 551366, 536123, 523995, 514478, 507133, 501799, 498463, 497459, 499288, 503708, 509491, 515593, 522092, 529416, 537348, 545494, 554112, 563536, 573288, 582710, 592120, 602356, 613423, 624556, 635431, 646320, 657174, 667605, 677853, 688774, 700576, 712326, 722978, 732360, 740987, 749394, 757785, 765797, 772509, 777052, 779335, 779978, 779786, 779717, 781041, 784810, 791150, 799547, 809621, 821077, 833162, 845045, 856837, 869655, 884648, 902456, 923552, 948509, 977881, 1012308, 1052627, 1099219, 1151228, 1206975, 1265271, 1326004, 1389629, 1456595, 1526970]
50958A526970P2795P2813P0074O5795O1245N6288N0130M2843L5229K7627J9876
50947B101685J2309N899J317j638l558m760n169m798m346n120p895j1945j5686
50934B056295j8263j9945k1118k1902k2852k4984k8563l2763l6856m0964m5238
50923A742847m9232n2604n5531n7884n8908n8328n6875n5031n2230m8124m3690
50912A154410m0029l6838l3189k9127k5425k2230j9151j6358j4487j3542j2873
50901H91161j2094j1305j0513r569q557p645o671n482m405l788l363k689j909
50888H03171j383q95O7J381K384K809L055L518M133M625M887N164O018P759R795
50873H56488J1077J1450J1993J3547J5584J7106J8091J9296K1087K3190K5337
$$ y = [1526970, 1599765, 1672578, 1742652, 1808447, 1869692, 1925980, 1976110, 2018953, 2054182, 2081809, 2101685, 2113994, 2119893, 2121210, 2119572, 2116014, 2111254, 2106085, 2101287, 2096941, 2091821, 2083926, 2071981, 2056295, 2038032, 2018087, 1996969, 1975067, 1952215, 1927231, 1898668, 1865905, 1829049, 1788085, 1742847, 1693615, 1641011, 1585480, 1527596, 1468688, 1410360, 1353485, 1298454, 1246224, 1198100, 1154410, 1114381, 1077543, 1044354, 1015227, 989802, 967572, 948421, 932063, 917576, 904034, 891161, 879067, 867762, 857249, 847680, 839123, 831478, 824807, 819325, 814920, 811132, 807769, 805080, 803171, 801788, 800893, 800960, 802341, 804725, 807534, 810589, 814107, 818240, 822865, 827752, 832916, 838934, 846693, 856488, 867565, 879015, 891008, 904555, 920139, 937245, 955336, 974632, 995719, 1018909, 1044246]
50862A044246K7581L0108L3237L7296M2128M7090N1979N7452O4135P1870Q0279
50851A587401Q9341R8936J08414J17367J26117J34773J42550J48806J53969J58400
50841B866074J61095J60659J56986J50565J40702J25980J06560Q4552O1929L9296
50831D054398J6953m031k2420l7572m9009n5905n7686n4810m8577m0357l1090
50820C669894k1346j1766l616J234J296l612j2643k4847l9499n5715p2453q8810
50808C338117j04043j17385j28241j36436j41925j44416j43616j39603j32738
50799B149714j23559j12989j02115r1279p9939o7978n6464m6461l7701k9337k1486
50788A380406j5059j0370o949m457k809j528j26R92R11m50k276m072n932p643
$$ y = [1044246, 1071827, 1101935, 1135172, 1172468, 1214596, 1261686, 1313665, 1371117, 1435252, 1507122, 1587401, 1676742, 1775678, 1884092, 2001459, 2127576, 2262349, 2404899, 2553705, 2707674, 2866074, 3027169, 3187828, 3344814, 3495379, 3636081, 3762061, 3868621, 3953173, 4015102, 4054398, 4071351, 4067320, 4044900, 4007328, 3958319, 3902414, 3844728, 3789918, 3741341, 3700984, 3669894, 3648548, 3636782, 3633166, 3634400, 3635696, 3632084, 3619441, 3594594, 3555095, 3499380, 3426927, 3338117, 3234074, 3116689, 2988448, 2852012, 2710087, 2565671, 2422055, 2282452, 2149714, 2026155, 1913166, 1811051, 1719772, 1639833, 1571855, 1515391, 1468930, 1431229, 1401892, 1380406, 1365347, 1354977, 1348028, 1343571, 1340762, 1339234, 1339108, 1340100, 1341011, 1340561, 1338285, 1334213, 1328281, 1320638]
50774A320638q662r167j0054j1569j2923j3669j4481j5993j7771j9090k0011k0897
50762A146351k1423k0955j9647j8326j7326j6104j4098j1448q616n709k573O28
50750I90754L358N337O963Q841J1028J3169J5290J8041K1956K6872L2307L7999
50738A191915M3842M9591N5042O0319O5664P1054P6130Q0321Q2998Q3924Q3726
50727A944526Q3452Q3385Q2688Q0509P6944P2627O7795O2139N5056M5680L3190
50716B687991J7703O05j6275l1546m4100n2854n7189n7238n3458m6441l7436k8149
50704B281613j9478j1242l675J837M305M462L312K19o239j6032k7660m0002n2687
50691B118733o4755p4391q0291q2459q1573p8384p3668o7818o0602n2000m3053
$$ y = [1320638, 1311976, 1302809, 1292755, 1281186, 1268263, 1254594, 1240113, 1224120, 1206349, 1187259, 1167248, 1146351, 1124928, 1103973, 1084326, 1066000, 1048674, 1032570, 1018472, 1007024, 998408, 992699, 990126, 990754, 994112, 999449, 1006412, 1015253, 1026281, 1039450, 1054740, 1072781, 1094737, 1121609, 1153916, 1191915, 1235757, 1285348, 1340390, 1400709, 1466373, 1537427, 1613557, 1693878, 1776876, 1860800, 1944526, 2027978, 2111363, 2194051, 2274560, 2351504, 2424131, 2491926, 2554065, 2609121, 2654801, 2687991, 2705694, 2706299, 2690024, 2658478, 2614378, 2561524, 2504335, 2447097, 2393639, 2347198, 2309762, 2281613, 2262135, 2250893, 2247218, 2249055, 2253360, 2257822, 2261134, 2261353, 2255114, 2239082, 2211422, 2171420, 2118733, 2053978, 1979587, 1899296, 1816837, 1735264, 1656880, 1583212, 1515394, 1454792, 1402792, 1359739]
50680A359739l4907k7364j9469j1357m224J530O815J2411J8111K3486K8313L1961
50668A385045L3525L2984L1321K9142K6208K2561J9115J6576J4712J3163J2151
50657A636503J1850J1805J1502J0944J0214R185Q074P702Q706J0961J4068J7849
50645A769363K2059K6237L0232L4359L8741M3029M6951N0477N3210N4315N3468
50634B222441N1292M8523M5446M2446M0232L8914L7611L5630L3190K9948K3368
50623B649041J0130j0232l3606n3620o5631o8850o5382n7906m8212l7368k6469
50612B191895j6627q346j395M472Q910J1221J0966Q220L264l846j3249k4675l6882
50599B133928m8165n7545o5055p0680p3682p3535p0975o7380o3356n8732n3649
$$ y = [1359739, 1324832, 1297468, 1277999, 1266642, 1262418, 1263948, 1270763, 1283174, 1301285, 1324771, 1353084, 1385045, 1418570, 1451554, 1482875, 1512017, 1538225, 1560786, 1579901, 1596477, 1611189, 1624352, 1636503, 1648353, 1660158, 1671660, 1682604, 1692818, 1702003, 1710077, 1717779, 1726485, 1737446, 1751514, 1769363, 1791422, 1817659, 1847891, 1882250, 1920991, 1964020, 2010971, 2061448, 2114658, 2168973, 2222441, 2273733, 2322256, 2367702, 2410148, 2450380, 2489294, 2526905, 2562535, 2595725, 2625673, 2649041, 2659171, 2648939, 2615333, 2561713, 2496082, 2427232, 2361850, 2303944, 2255732, 2218364, 2191895, 2175268, 2166922, 2165527, 2169999, 2178909, 2190130, 2201096, 2209316, 2212580, 2208734, 2195485, 2170810, 2133928, 2085763, 2028218, 1963163, 1892483, 1818801, 1745266, 1674291, 1606911, 1543555, 1484823, 1431174]
50588A431174m8727m4216l9807l5455l1646k8666k6158k3627k0980j8507j6651
50577A096734j5598j4744j2894r612o003l428j794N5K537M990P048R115J1372
50564A067778J3362J4931J6570J8514K0328K1758K3235K5129K7247K9348L1419
50553A309619L3165L3935L3549L2500L1020K8738K5688K2851K1149K0607K0935
50542A613756K2370K5215K9121L3391L7757M2329M7182N2355N7958O3882O9723
50531B095039P5337Q1245Q8114R6065J04610J12968J20239J25645J28886J30058
50521C158206J29151J25872J19988J11489J00343Q6506P0126N1527L1045R242
50511C993495j2893l4430n4983p4212r1144j04689j14594j20986j23169j20015
$$ y = [1431174, 1382447, 1338231, 1298424, 1262969, 1231323, 1202657, 1176499, 1152872, 1131892, 1113385, 1096734, 1081136, 1066392, 1053498, 1043886, 1037883, 1034455, 1032661, 1032716, 1035253, 1040243, 1047291, 1056406, 1067778, 1081140, 1096071, 1112641, 1131155, 1151483, 1173241, 1196476, 1221605, 1248852, 1278200, 1309619, 1342784, 1376719, 1410268, 1442768, 1473788, 1502526, 1528214, 1551065, 1572214, 1592821, 1613756, 1636126, 1661341, 1690462, 1723853, 1761610, 1803939, 1851121, 1903476, 1961434, 2025316, 2095039, 2170376, 2251621, 2339735, 2435800, 2540410, 2653378, 2773617, 2899262, 3028148, 3158206, 3287357, 3413229, 3533217, 3644706, 3745049, 3831555, 3901681, 3953208, 3984253, 3993495, 3980602, 3946172, 3891189, 3816977, 3725833, 3621144, 3506550, 3385564, 3262395, 3142380]
50501C142380j11626r9569q5171o8500m9431k8840q326J0732K7424M1274N2134
50490B822481N9649O2626N9562M9821L3824J2326j3507m1328o8027r1294j10135
50479B775998j23963j32267j35356j34324j29961j22716j13741j04702r6088q7089
50469A595791p7553o8728o1329n4394m7088m0334l5341l1514k7236k2053j6763
50458A113458j1802o913k235J488L844N065N378M806L689K806K824L874N566P303
50444A139151Q739J0083J1646J3031J3341J2279J0478Q629O952N646N047N032
50432A250054N096N284O152P498Q234Q058Q184R626J1794J3649J5313J7485J9988
50419A386415K2072K3771K5902K8980L2881L7308M1969M6534N0969N5498N9861
$$ y = [3142380, 3030754, 2931185, 2846014, 2777514, 2728083, 2699243, 2690917, 2701649, 2729073, 2770347, 2822481, 2882130, 2944756, 3004318, 3054139, 3087963, 3100289, 3086782, 3045454, 2977427, 2886133, 2775998, 2652035, 2519768, 2384412, 2250088, 2120127, 1997411, 1883670, 1778968, 1682880, 1595791, 1518238, 1449510, 1388181, 1333787, 1286699, 1246365, 1211024, 1179510, 1152274, 1130221, 1113458, 1101656, 1094743, 1092508, 1093996, 1097840, 1102905, 1108283, 1113089, 1116778, 1119584, 1122408, 1126282, 1131848, 1139151, 1147890, 1157973, 1169619, 1182650, 1195991, 1208270, 1218748, 1227377, 1234329, 1239975, 1245022, 1250054, 1255150, 1260434, 1266586, 1274084, 1282318, 1290376, 1298560, 1308186, 1319980, 1333629, 1348942, 1366427, 1386415, 1408487, 1432258, 1458160, 1487140, 1520021, 1557329, 1599298, 1645832, 1696801, 1752299, 1812160]
50408A812160O3113O4669O4853O4038O1957N8465N4104M9182M3148L5662K7388
50397B398739J8726Q659l949j8367l2507m5012n5829o5140p2769p8406q1471q1051
50385A891623p6810o9711o1101n1500m0960k9970j9080q180K752J2663K0250K5370
50373A595346K8630K9920K8426K3705J5762M674q686k2080l3476m2894n1293n8129
50361A509905o1662o1603n9660n7180n3904m9625m5421m2379m0177l7779l4730
50350I65785l1112k7032k2854j9264j6420j3551r973o022k453O97M049P938J1915
50337H41703J5148J7108J8005J8468J8589J7359J3519P062m09o834j0927j2456
50325I36335j1917j0050p422m391j535L36J063J605K911M530N088M068K378J120
$$ y = [1812160, 1875273, 1939942, 2004795, 2068833, 2130790, 2189255, 2243359, 2292541, 2335689, 2371351, 2398739, 2417465, 2426124, 2422175, 2403808, 2371301, 2326289, 2270460, 2205320, 2132551, 2054145, 1972674, 1891623, 1814813, 1745102, 1684001, 1632501, 1591541, 1561571, 1542491, 1534311, 1537063, 1549726, 1569976, 1595346, 1623976, 1653896, 1682322, 1706027, 1721789, 1726463, 1717777, 1695697, 1662221, 1619327, 1568034, 1509905, 1448243, 1386640, 1326980, 1269800, 1215896, 1166271, 1120850, 1078471, 1038294, 1000515, 965785, 934673, 907641, 884787, 865523, 849103, 835552, 825579, 819557, 817104, 817801, 821850, 829788, 841703, 856851, 873959, 891964, 910432, 929021, 946380, 959899, 966961, 966552, 959718, 948791, 936335, 924418, 914368, 906946, 902555, 901020, 901356, 902419, 904024, 906935, 911465, 916553, 920621, 922999, 924119]
50311I24119N74N31P99J089R52K71m37n24J90J344K429L205L889M865O103P151
50295I56550P936R056J0833J2493J2976J2338J1634J1620J2286J3513J5322J7073
50283A103630J7081J3530N980l905j2975j8427j9595j7984j5382j2337q702m944
50271A025970k123p65n20p86j138j361j607k313l453m204l950l200k786k553j712
50256I93499k13J127J803K104K540L591N770R140J2842J5918J8500K1334K4372
50243A112327K6767K8243K9327L0186L0252K9272K7759K6125K4252K2215K0529
50232A407254J9222J7416J4333J0068M918j434r387j8379k6972l3861l8545m1136
50220A303497m1821m0620l7721l3811k9706k5539k0838j5793j1931j0949j3167
$$ y = [924119, 924693, 925224, 926023, 927112, 928064, 928335, 927898, 927374, 927564, 928908, 931337, 934542, 938431, 943296, 949399, 956550, 964486, 973542, 984375, 996868, 1009844, 1022182, 1033816, 1045436, 1057722, 1071235, 1086557, 1103630, 1120711, 1134241, 1140221, 1136316, 1123341, 1104914, 1085319, 1067335, 1051953, 1039616, 1030914, 1025970, 1023847, 1023082, 1022562, 1021776, 1020638, 1019277, 1017670, 1015357, 1011904, 1007700, 1003750, 1000550, 997764, 995211, 993499, 993286, 994413, 996216, 998320, 1000860, 1004451, 1010221, 1019361, 1032203, 1048121, 1066621, 1087955, 1112327, 1139094, 1167337, 1196664, 1226850, 1257102, 1286374, 1314133, 1340258, 1364510, 1386725, 1407254, 1426476, 1443892, 1458225, 1468293, 1473211, 1471777, 1462390, 1444011, 1417039, 1383178, 1344633, 1303497, 1261676, 1221056, 1183335, 1149524, 1119818, 1094279, 1073441, 1057648, 1045717, 1034768, 1021601]
50209A021601j7561k2713k7136k9332k8641k5915k2600j9385j6409j4154j3000
50198G84755j2225j0732q679p245o814o594o105n822o081o417o401o192n930n444
50184F84074m815m429m268l928l529l681m315m493l723k648k071k020k048j805
50170F36301j040K24J350J609J186J002J478K283L188M238N074N241N207N938
50156F73279P308Q235Q543R270J0752J1936J2173J2108J1956J0491P024L117Q13
50143G87005J33k89q25o33O93K733N273Q455J1979J5337J8795K3156K8451L3767
50129I34030L8456M2676M6562M9655N1460N2087N2064N1762N1173N0119M8697
50118A468741M7484M7083M7254M6886M5062M1701L6783K9474J8815N129r760k3811
$$ y = [1021601, 1004040, 981327, 954191, 924859, 896218, 870303, 847703, 828318, 811909, 797755, 784755, 772530, 761798, 753119, 745874, 739060, 732466, 726361, 720539, 714458, 708041, 701640, 695448, 689518, 684074, 679259, 674830, 670562, 666634, 663105, 659424, 655109, 650616, 646893, 644245, 642174, 640154, 638106, 636301, 635261, 635485, 636835, 638444, 639630, 640632, 642110, 644393, 647581, 651819, 656893, 662134, 667341, 673279, 680587, 688822, 697365, 706635, 717387, 729323, 741496, 753604, 765560, 776051, 783075, 786192, 787005, 787138, 786849, 786024, 785391, 786084, 788817, 794090, 802545, 814524, 829861, 848656, 871812, 900263, 934030, 972486, 1015162, 1061724, 1111379, 1162839, 1214926, 1266990, 1318752, 1369925, 1420044, 1468741, 1516225, 1563308, 1610562, 1657448, 1702510, 1744211, 1780994, 1810468, 1829283, 1834412, 1824652, 1800841]
50106A800841l5898m5828n3762n9721o3483o4850o4045o1694n8313n3980m8653
50095A190614m2641l6649l1381k7102k3481j9998j6655j4097j2681j1747j0252
50084I43930p958n403k961o43J284K387K755K780K321J053l46n88K78N68q08k921
50068I35728m454n575p136q756r154q074o740o315o792p435p661p343o701o029
50054H37563n310m266k938j892j461j126r9J714L723N450O924Q380R857J1048
50040H67567J1482J1092J0575J0763J1556J2059J1864J1457J1128J0394R117Q249
50028I97303Q532Q985P875N024K053K66p33j987l559m640m812m453l932l123j951
50013A000848r02k67Q64L990R204J4606J8288K0383K2379K4982K7611K9673L1165
$$ y = [1800841, 1764943, 1719115, 1665353, 1605632, 1542149, 1477299, 1413254, 1351560, 1293247, 1239267, 1190614, 1147973, 1111324, 1079943, 1052841, 1029360, 1009362, 992707, 978610, 965929, 954182, 943930, 935972, 930569, 927608, 926965, 928249, 930636, 933391, 936171, 938492, 939545, 939199, 938611, 938889, 939457, 938649, 935728, 931274, 925699, 918563, 909807, 900653, 892579, 885839, 879524, 872732, 865297, 857636, 850293, 843592, 837563, 832253, 827987, 825049, 823157, 821696, 820570, 820471, 822185, 825908, 831358, 838282, 846662, 856519, 867567, 879049, 890141, 900716, 911479, 923035, 935094, 946958, 958415, 969543, 979937, 989054, 997303, 1005835, 1014820, 1022695, 1027719, 1029772, 1030038, 1029305, 1027318, 1023759, 1019119, 1014307, 1009854, 1005922, 1002799, 1000848, 999946, 999679, 1000543, 1004533, 1013737, 1028343, 1046631, 1067014, 1089393, 1114375, 1141986, 1171659, 1202824]
50000A202824L2030L2114L1984L2679L4176L4961L3636L0139K4909J7815Q571
49989A515838k402j4196k6048l7242m6860n4219n9204o1772o1630n8848n4313
49978A039104m9103m3699l8164l2706k7632k3105j9244j6161j3715j1582r773
49967G54220q625q235q266q425q481p891o136l595j266N19K305M388O459Q466
49953G15437J0733J2908J4013J4001J3999J4422J4061J1914Q735N894L714J929
49941H41760P18Q5r29l185o207r090j1923j5174j8335k0463k1567k2208k2158
49928F91324k0687j7949j4893j2023r301p025n680m961l998k524r46N49K073L340
49914E97299L893L981M322N041N625N910O343P263Q642J0397J2283J3676J4225
$$ y = [1202824, 1234854, 1266968, 1298952, 1331631, 1365807, 1400768, 1434404, 1464543, 1489452, 1507267, 1515838, 1513436, 1499240, 1473192, 1435950, 1389090, 1334871, 1275667, 1213895, 1152265, 1093417, 1039104, 990001, 946302, 908138, 875432, 847800, 824695, 805451, 789290, 775575, 763993, 754220, 745595, 737360, 729094, 720669, 712188, 704297, 698161, 694566, 693300, 693819, 696124, 700512, 706971, 715437, 726170, 739078, 753091, 767092, 781091, 795513, 809574, 821488, 830223, 836117, 839831, 841760, 842478, 842563, 841634, 838449, 832242, 823152, 811229, 796055, 777720, 757257, 735690, 713482, 691324, 670637, 652688, 637795, 625772, 616471, 609446, 603766, 598805, 594807, 592283, 591337, 591886, 593959, 597299, 601192, 605173, 609495, 614536, 620161, 626071, 632414, 639677, 648319, 658716, 670999, 684675, 698900]
49901F98900J4558J5487J6672J6949J5856J3912J1531Q598N213J930j030m017
49889H14559p193j0154j2529j4423j5989j7049j7293j6627j5344j4139j3743j4098
$$ y = [698900, 713458, 728945, 745617, 762566, 778422, 792334, 803865, 812463, 817676, 819606, 818576, 814559, 807366, 797212, 784683, 770260, 754271, 737222, 719929, 703302, 687958, 673819, 660076, 645978]
$$ [...]
##END NTUPLES=NMR SPECTRUM
##END=
