
##TITLE=AC1208_HCOAH12050_7160530_pt4Y0gEDqu
##JCAMPDX= 6.0         $$ Bruker NMR JCAMP-DX V2.0
##DATA TYPE= NMR SPECTRUM
##DATA CLASS= NTUPLES
##ORIGIN= BRUKER
##OWNER= Administrator
$$ 1.72 TOPSPIN		Version 2.1
$$ 2012-11-30 22:22:21.759 -0500  Administrator@X
$$ Compression mode = diff/dup
##.OBSERVE FREQUENCY= 400.02188249412
##.OBSERVE NUCLEUS= ^1H
##.ACQUISITION MODE= SIMULTANEOUS (DQD)
##.ACQUISITION SCHEME= undefined
##.AVERAGES= 8
##.DIGITISER RES= 22
##SPECTROMETER/DATA SYSTEM= spect
##.PULSE SEQUENCE= zg30
##.SOLVENT NAME= COFFEE_meoh
##.SHIFT REFERENCE= INTERNAL, COFFEE_meoh, 1, 14.98509
##AUDIT TRAIL= $$ (NUMBER, WHEN, WHO, WHERE, PROCESS, VERSION, WHAT)
$$ ##TITLE= Audit trail, TOPSPIN		Version 2.1
$$ ##JCAMPDX= 5.01
$$ ##ORIGIN= Bruker BioSpin GmbH
$$ ##OWNER= Administrator
$$ $$ E:\/data/COFFEE/nmr/AC1208_HCOAH12050_7160530_pt4Y0gEDqu/10/pdata/1/auditp.txt
$$ ##AUDIT TRAIL=  $$ (NUMBER, WHEN, WHO, WHERE, PROCESS, VERSION, WHAT)
(   1,<2012-11-30 22:22:11.190 -0500>,<Administrator>,<X>,<go>,<TOPSPIN 2.1>,
      <created by zg
	started at 2012-11-30 22:21:09.959 -0500,
	POWCHK enabled, PULCHK disabled,
       configuration hash MD5:
       86 BA 57 50 F2 9D 5C 9B 26 00 A9 28 5F 66 2E 89
       data hash MD5: 64K
       78 91 D8 08 79 B9 97 06 82 35 14 BA 2A D8 F3 41>)
(   2,<2012-11-30 22:22:15.102 -0500>,<Administrator>,<X>,<proc1d>,<TOPSPIN 2.1>,
      <Start of raw data processing
       efp LB = 0 FT_mod = 6 PKNL = 1 PHC0 = 0 PHC1 = 0 SI = 32K 
       data hash MD5: 32K
       A9 78 23 34 5C 95 53 2D EA 0B 9E CC 26 AF 41 58>)
(   3,<2012-11-30 22:22:15.669 -0500>,<Administrator>,<X>,<proc1d>,<TOPSPIN 2.1>,
      <pk PHC0 = 98.16284 PHC1 = 0 
       data hash MD5: 32K
       77 29 70 E5 EC 00 42 B5 4D 5D 09 80 EE 9D AF 8C>)
(   4,<2012-11-30 22:22:15.953 -0500>,<Administrator>,<X>,<proc1d>,<TOPSPIN 2.1>,
      <abs ABSG = 1 
       data hash MD5: 32K
       90 6D 40 E1 E5 C1 84 05 D6 9A CC 43 9F 32 55 E6>)
(   5,<2012-11-30 22:22:16.142 -0500>,<Administrator>,<X>,<proc1d>,<TOPSPIN 2.1>,
      <abs ABSG = 2 
       data hash MD5: 32K
       78 49 FD CC 56 88 63 02 97 55 28 E3 1C 51 4B 49>)
(   6,<2012-11-30 22:22:16.331 -0500>,<Administrator>,<X>,<proc1d>,<TOPSPIN 2.1>,
      <abs ABSG = 3 
       data hash MD5: 32K
       5C 02 86 0A 0A C5 EB AB 6A 32 82 C3 25 93 B1 32>)
(   7,<2012-11-30 22:22:16.539 -0500>,<Administrator>,<X>,<proc1d>,<TOPSPIN 2.1>,
      <abs ABSG = 4 
       data hash MD5: 32K
       D6 0B A0 11 7C D0 98 D3 10 DD 84 76 7C 03 AC D2>)
(   8,<2012-11-30 22:22:16.709 -0500>,<Administrator>,<X>,<proc1d>,<TOPSPIN 2.1>,
      <abs ABSG = 5 
       data hash MD5: 32K
       56 DC 7D 3E B6 ED 3E 6A AD 78 C9 0A A8 7D FA AF>)
$$ ##END=
$$ 
$$ $$ hash MD5
$$ $$ 5A A9 B9 C8 8B 72 DC CC E1 7F DE 13 7B D1 60 44
##$RELAX= 
##$RELAX= 
##$RELAX= 
##$RELAX= 
##$RELAX= 
##$RELAX= 
##$RELAX= 
$$ Bruker specific parameters
$$ --------------------------
##$DU= <E:\>
##$EXPNO= 10
##$NAME= <AC1208_HCOAH12050_7160530_pt4Y0gEDqu>
$$ [...]
##$TP= (0..7)
150 150 150 150 150 150 150 150
##$TP07= 0
##$TPNAME0= <>
##$TPNAME1= <>
##$TPNAME2= <>
##$TPNAME3= <>
##$TPNAME4= <>
##$TPNAME5= <>
##$TPNAME6= <>
##$TPNAME7= <>
##$TPOAL= (0..7)
0.5 0.5 0.5 0.5 0.5 0.5 0.5 0.5
##$TPOFFS= (0..7)
0 0 0 0 0 0 0 0
##$TUNHIN= 0
##$TUNHOUT= 0
##$TUNXOUT= 0
##$USERA1= <user>
##$USERA2= <user>
##$USERA3= <user>
##$USERA4= <user>
##$USERA5= <user>
##$V9= 5
##$VALIST= <valist>
##$VCLIST= <CCCCCCCCCCCCCCC>
##$VD= 0
##$VDLIST= <DDDDDDDDDDDDDDD>
##$VPLIST= <PPPPPPPPPPPPPPP>
##$VTLIST= <TTTTTTTTTTTTTTT>
##$WBST= 1024
##$WBSW= 4
##$XGAIN= (0..3)
0 0 0 0
##$XL= 0
##$YL= 0
##$YMAX_a= 622669
##$YMIN_a= -525789
##$ZGOPTNS= <>
##$ZL1= 120
##$ZL2= 120
##$ZL3= 120
##$ZL4= 120
##$ABSF1= 14.98509
##$ABSF2= -5.573092
##$ABSG= 5
##$ABSL= 3
##$ALPHA= 0
##$AQORDER= 0
##$ASSFAC= 0
##$ASSFACI= 0
##$ASSFACX= 0
##$ASSWID= 0
##$AUNMP= <proc_prof1d_extract_pilot.lims>
##$AXLEFT= 0
##$AXNAME= <>
##$AXNUC= <1H>
##$AXRIGHT= 0
##$AXTYPE= 0
##$AXUNIT= <>
##$AZFE= 0.1
##$AZFW= 0.1
##$BCFW= 0
##$BC_mod= 0
##$BYTORDP= 0
##$COROFFS= 0
##$CY= 15
##$DATMOD= 1
##$DC= 0
##$DFILT= <>
##$DTYPP= 0
##$F1P= 0
##$F2P= 0
##$FCOR= 0.5
##$FTSIZE= 32768
##$FT_mod= 6
##$GAMMA= 0
##$GB= 0
##$INTBC= 1
##$INTSCL= 1
##$ISEN= 128
##$LB= 0
##$LEV0= 0
##$LPBIN= 0
##$MAXI= 10000
##$MC2= 0
##$MEAN= 0
##$ME_mod= 0
##$MI= 0
##$NCOEF= 0
##$NC_proc= -8
##$NLEV= 6
##$NOISF1= 0
##$NOISF2= 0
##$NSP= 0
##$NTH_PI= 0
##$NZP= 0
##$OFFSET= 14.98509
##$PC= 1
##$PHC0= 98.16284
##$PHC1= 0
##$PH_mod= 1
##$PKNL= yes
##$PPARMOD= 0
##$PPDIAG= 0
##$PPIPTYP= 0
##$PPMPNUM= 2147483647
##$PPRESOL= 1
##$PSCAL= 4
##$PSIGN= 0
##$PYNMP= <proc.py>
##$REVERSE= no
##$SF= 400.02
##$SI= 32768
##$SIGF1= 0
##$SIGF2= 0
##$SINO= 400
##$SIOLD= 32768
##$SPECTYP= <>
##$SREGLST= <1H.CDCl3>
##$SSB= 0
##$STSI= 32768
##$STSR= 0
##$SW_p= 8223.68421052631
##$SYMM= 0
##$S_DEV= 0
##$TDeff= 65536
##$TDoff= 0
##$TI= <>
##$TILT= no
##$TM1= 0
##$TM2= 0
##$TOPLEV= 0
##$USERP1= <user>
##$USERP2= <user>
##$USERP3= <user>
##$USERP4= <user>
##$USERP5= <user>
##$WDW= 1
##$XDIM= 32768
##$YMAX_p= 475027194
##$YMIN_p= -729405
##$CURPLOT= <Network HP LaserJet P1505>
##$CURPRIN= <$Network HP LaserJet P1505>
##$DFORMAT= <normdp>
##$LAYOUT= <+/1D_H.xwp>
##$LFORMAT= <normlp>
##$PFORMAT= <normpl>
##$SURQMSG= 1
$$ End of Bruker specific parameters
$$ ---------------------------------
##NTUPLES= NMR SPECTRUM
##VAR_NAME=  FREQUENCY,     SPECTRUM/REAL,   SPECTRUM/IMAG
##SYMBOL=    X,             R,               I
##VAR_TYPE=  INDEPENDENT,   DEPENDENT,       DEPENDENT
##VAR_FORM=  AFFN,          ASDF,            ASDF
##VAR_DIM=   32768,         32768,           32768
##UNITS=     HZ,            ARBITRARY UNITS, ARBITRARY UNITS
##FACTOR=    0.250966925370066, 1,           1
##FIRST=     8223.43324360094, -113442,      1996
##LAST=      0,             13548,           44520
##MIN=       0,             -729405,         0
##MAX=       8223.43324360094, 475027194,    0
$$ Real data points
##PAGE= N=1
##DATA TABLE= (X++(R..R)), XYDATA
$$ [...]
19500b19657A25501b66440e4008A119N1995i9390A87961e3196j12864j2147c0758
19488b12830K8060C8094b43036J15638j07440L9522A17507d7149j57080Q4724
19478a19505N3536a4408l14247G2082h6825j01923o881R704H484O8261b2185H0670
19465G9672a26087J2540A03414i5705n643A452f795k50630A39590g5342l1514
19454a06856k60122a28546C9072J26000e6954F4824O5245a82906c2179C0570c45784
19442B35369f6297n2964k5084B03685m2702L2826d4128A38356a21242e5699O28
19431e5071o6643j36418P0670l52375a11368j47975c1798r3733e8011F8858e95994
19419F5391f9388k53036R8167A55852c73403H2511K02086d14056J66133M9730
$$ plain form
19500 -219657 125501 -266440 -54008 1119 53114 -99390 187961 -53196 -166060 -178207 -30758
19488 -212830 -184770 38094 -243036 -127398 -234838 -195316 117507 -47149 -204229 -119505
19478 -119505 -65969 -14408 -328655 72082 -86825 -188748 -195629 -185925 8484 76745 -22185 80670
19465 79672 -126087 -113547 103414 -95705 -101348 1452 -6795 -257425 139590 -75342 -106856
19454 -106856 -366978 -128546 39072 165072 -56954 64824 130069 -182906 -32179 30570 -345784
19442 235369 -66297 -119261 -144345 203685 160983 193809 -44128 138356 -121242 -55699 -55071
19431 -55071 -121714 -258132 -187462 -539837 -111368 -259343 -31798 -125531 -58011 68858 -595994
19419 65391 -69388 -322424 -224257 155852 -373403 82511 284597 -414056 -247923 -198193
19409a98193p0565H3659c3463j40827A14564a25334B9517l372f2589l97179K20766
19398b39002R6127q7277P7561L8652K9097J2622F6651H140J30975n4512b68353
19386A25288b2989l4868b1826d434j85654N0206a5437J802j76593B03821f8371
19374e3153K4181K658l79896J74958i6416l7190A08908g2508p6520B76271i2566
19362g2851b3714j73755O7102F8849h0534A25592g1316B16590a92166O1759N1856
19351g8551A51683B6214J01885d1173q4209B54197C5201a73934Q323I6520i5111
19339b74263f7261D8223a38095b9288G4310B8090b09413L5040O7601k1129L6814
19328i1087d4844A52637a35323A17519b47488a22999e7145m08030A8777L7158
$$ plain form
19409 -198193 -268758 83659 -33463 -174290 114564 -125334 29517 26145 -62589 -459768 -239002
19398 -239002 -142875 -230152 -152591 -113939 -84842 -72220 66651 8140 139115 84603 -268353
19386 125288 -22989 -57857 -21826 -4434 -190088 -139882 -15437 -13635 -190228 203821 -68371
19374 -53153 -28972 -26314 -406210 -231252 -96416 -133606 108908 -72508 -149028 276271 -92566
19362 -72851 -23714 -197469 -130367 68849 -80534 125592 -71316 216590 -192166 -130407 -78551
19351 -78551 151683 26214 128099 -41173 -125382 254197 35201 -173934 -165611 96520 -95111
19339 -274263 -67261 48223 -138095 -29288 74310 28090 -209413 -174373 -106772 -127901 -91087
19328 -91087 -44844 152637 -135323 117519 -247488 -122999 -57145 -465175 18777 55935
19318E5935K06459J51700B0582b60763l0338h491p7218A36014c19885g8247j8355
19307i6602A11067e2124j78643A30595d7480A42744o7828d39417a58629p9635
19297b38264J1689B29528j03722a29236b3882A59183a90997k77715a0571m5094
19287e5665j78365K3479A59977c9458F2440M7077b02251j21065D3211c19787A36354
19275g4119A06772J65551h5866Q621O978E00349b18870c9099k51457a38222C0380
19263A00500O3781E1330j7165b08602i0664b9215f71p4028j93365G1907K5802
19252I7709f9660k46241J33433A20948l7887k5456Q055J81093B3759b17906c9180
19240A22050R9654h6943p0421k40488B04128c89823J88216O7712e0266n0043o3970
$$ plain form
19318 55935 262394 414094 20582 -260763 -291101 -8491 -85709 136014 -319885 -78247 -96602
19307 -96602 111067 -52124 -230767 130595 -47480 142744 74916 -439417 -158629 -238264
19297 -238264 -226575 229528 125806 -129236 -23882 159183 -190997 -468712 -10571 -55665
19287 -55665 -234030 -210551 159977 -39458 62440 109517 -202251 -323316 43211 -319787 136354
19275 -74119 106772 272323 -85866 -77245 -70267 500349 -218870 -39099 -290556 -138222 30380
19263 100500 164281 51330 34165 -208602 -90664 -29215 -671 -74699 -268064 71907 97709
19252 97709 -69660 -315901 -182468 120948 83061 57605 65660 246753 23759 -217906 -39180
19240 122050 221704 -86943 -157364 -397852 204128 -389823 -201607 -133895 -50266 -100309 -164279
19229a64279O9324A8117b81929M9661l2057b9733A66263i4939E0996g4499A77841
19217e8095k94489f4501A75814b41783F1907K3435a27441A52940q720C4482J84718
19206B19200a13237A21715M62785a85237C1415a57900N6090l28606a16738p7759
19196a94497Q9855h054r9248B29026j08970a4131j71988d3858A00737B813K63913
19185B66726d8716k90018h2293m49581N7355J70493J42258c8047L987B20345G1808
19173A57568m6530m1577a04101B18388B4686a44768k7521B95255a29474M032l8821
19162a64263L8298r550I4450a29596B51499F7426J58534a03877L0433j43739g687
19150i7208j06711q9213H9281i1001j01444O8431b5604l825G1702P3965a60673
$$ plain form
19229 -164279 -94955 18117 -281929 -232268 -264325 -29733 166263 -94939 50996 -74499 177841
19217 -58095 -352584 -64501 175814 -241783 61907 85342 -127441 152940 144220 34482 219200
19206 219200 -113237 121715 584500 -185237 31415 -157900 -101810 -430416 -116738 -194497
19196 -194497 -104642 -8054 -107302 229026 120056 -14131 -186119 -43858 100737 2813 266726
19185 266726 -48716 -338734 -82293 -531874 -474519 -304026 -161768 -38047 -34060 220345 71808
19173 157568 111038 69461 -104101 218388 24686 -144768 -172289 295255 -129474 -125442 -164263
19162 -164263 -125965 -135515 94450 -129596 251499 67426 225960 -103877 -73444 -217183 -7687
19150 -97208 -203919 -293132 89281 -91001 -192445 -124014 -25604 -29429 71702 145667 -160673
19138B11959C007b39488J6086j1801B18283a31002F9146J94020a58011b4315j43085
19127a67400j36105B460a89966J3458b6622J1847o3465j08813a2677B7549b28744
19115a2099k2653l81135J13589J13269L4256p1112B2496c07704f0777o298l99868
19104d66943H0607B0179J49298e3574j17441o61B02101c17231I0836a118A2604
19092B25650g1244q7994B54023G1711N9144j0886m1673e50820F337a69394A17132
19080b20212h0049a2808j83353N990g2887a4637l18032i7375p0120e2977m2218
19069i5195a1253j63539f4378j1775o1464A7744J11772b73359Q2554A67007c31763
19057b34510F5033L50467c58640f372A19360a24056A7993N6416J09905a6703j00851
$$ plain form
19138 211959 3007 -239488 -223402 -235203 218283 -131002 69146 263166 -158011 -24315 -167400
19127 -167400 -303505 2460 -189966 -176508 -26622 -14775 -78240 -187053 -12677 27549 -228744
19115 -12099 -34752 -415887 -302298 -189029 -154773 -225885 22496 -307704 -60777 -67075 -466943
19104 -466943 80607 20179 169477 -53574 -171015 -171676 202101 -317231 90836 -1118 12604
19092 225650 -71244 -159238 254023 71711 130855 119969 78296 -550820 6337 -169394 117132
19080 -220212 -80049 -12808 -196161 -190171 -72887 -14637 -332669 -97375 -167495 -52977 -95195
19069 -95195 -11253 -174792 -64378 -76153 -137617 17744 129516 -273359 -190805 167007 -331763
19057 -234510 65033 415500 -358640 -6372 119360 -124056 17993 74409 184314 -16703 -117554
19046a17554A02454q81b00960M0752e874D35296c71835F9852g1917A84274A0735
19034e4800k73912b4777A16827a88680b6695C2660J44556b34670A52366R3312
19024B45678j11690m6649C3064K51166j35018J72318a11924A19332h7261A47304
19013B07671b61158g2429A94623H8360b40361D690J22717i8585j72870a28965
19002D76832B213J56021a0303B01574A8627d99451b00981A36753f6581A55021
18991A01140h4047H7406K04128h6955l01057H9895J89301e11541a42713F4021
18980B38568a6884l95007B2623J2085L77011F5987J3881a11541o9034B50406R4158
18969C44564J21748J7801A26218k0047L07155D591J40267d897A51170F9203b13498
$$ plain form
19046 -117554 102454 101573 -200960 -160208 -5874 435296 -371835 69852 -71917 184274 10735
19034 -54800 -328712 -24777 116827 -188680 -26695 32660 177216 -234670 152366 245678
19024 245678 133988 87339 33064 284230 149212 321530 -111924 119332 -87261 147304
19013 207671 -261158 -72429 194623 88360 -240361 4690 127407 -98585 -271455 -128965
19002 476832 2213 158234 -10303 201574 18627 -499451 -200981 136753 -66581 155021
18991 101140 -84047 87406 291534 -86955 -388012 89895 279196 -511541 -142713 64021
18980 238568 -16884 -411891 22623 34708 411719 65987 79868 -111541 -180575 250406 344564
18969 344564 466312 484113 126218 106171 413326 4591 144858 -4897 151170 69203 -213498
18957a90507J3102F3822d48543b3967p9472k8127m3544j71330a49471A5892K4622
18946D0514f7694o3172m92035A29989c19309h5098a1963m6345C70894B7421d16897
18934b26202d5496B26172A02897m0396a18818A4186a15482A25850l7487B3024
18923G4239a14781L2658k91011O0857D3162F300K135e0619a4014j8594j75523
18912b08131B91431F125a66838h1470B33287L48055P6625k47959D3328H84J43503
18901A44387a65158A83234i3045M1508l21732f7522A15160A5703f36171A1279
18890B0750J49718a09741o76l577j71502L5124A63869g5037B63542b03506j84942
18879c88448B56496b45471B5462h531j78415f9561j18820G3101K1149a22105j8972
$$ plain form
18957 -190507 -177405 63822 -448543 -23967 -103439 -131566 -175110 -346440 -149471 15892 40514
18946 40514 -67694 -130866 -622901 129989 -319309 -85098 -11963 -58308 370894 27421 -416897
18934 -226202 -45496 226172 102897 62501 -118818 14186 -115482 125850 88363 23024
18923 74239 -114781 -82123 -373134 -312277 43162 6300 8435 -50619 -14014 -32608 -208131
18912 -208131 291431 6125 -166838 -81470 233287 581342 657967 410008 43328 884 144387
18901 144387 -165158 183234 -93045 -51537 -373269 -67522 115160 15703 -636171 11279
18890 20750 170468 -109741 -110417 -113994 -285496 -250372 163869 -75037 263542 -203506 -388448
18879 -388448 256496 -245471 25462 -8531 -186946 -69561 -188381 73101 94250 -122105 -141077
18868a41077j6228A88736f0674E4218J87300b89030A51199F508b84424l2136a44759
18856F02015a87459k678c5225I4673d9690j0619b3328B4043J78277c0305B92588
18844b50205J10703B2333M2887O4680a1768l67025d4857A02123b99332a13740
18833h3519A01184R7010c64520M6787J18478k05906N3671A23465M8529m0094b27590
18821a82571h6504k10939G5648a30780k0515b3388E01233e3942A86174J35075
18811C21249b73645A44091a50025G2667K935J47576b4599A6093e8807d759k37159
18800b41918b2813r2101A24481J455e5742l1938M1192k54380f8729k71949a22617
18788c72348e2606p2165j81508a16819k4420R102I1519l0496b91938A7133a26320
$$ plain form
18868 -141077 -157305 188736 -60674 54218 241518 -289030 151199 6508 -284424 -316560 -144759
18856 602015 -187459 -190137 -35225 94673 -49690 -60309 -23328 24043 202320 -30305 292588
18844 -250205 -139502 22333 65220 129900 -11768 -378793 -44857 102123 -299332 -113740
18833 -83519 101184 198194 -364520 -317733 -199255 -405161 -351490 123465 171994 131900 -227590
18821 -182571 -86504 -297443 75648 -130780 -151295 -23388 501233 -53942 186174 321249
18811 321249 -273645 144091 -150025 72667 75602 223178 -24599 16093 -58807 -4759 -241918
18800 -241918 -22813 -114914 124481 125936 -55742 -87680 -46488 -300868 -68729 -340678 -122617
18788 -372348 -52606 -124771 -306279 -116819 -141239 -132137 91519 61023 -291938 17133 -126320
18776b86072C7856a16343l84B38921a93365c2630D77020b04790i4456C9291b41180
18764d4572r2586E9370a01492k66118b591p1242B49506a0411B62645d73800C0834
18752a3183l41048H5068i028l7532C25879a71100O2786E8210a93962A01412m4192
18741E7220g7109j67127B21511D1683f1789B258a92509E6043a52955G6193b81224
18729A25040b77774Q4788A7366b26731o6437B3487K79241a61533A44265F2810
18718B1779L60838B9847a91202C06955i3814j44163q8329P7102H457a05946L8172
18707f7774n0029A09055L42603b49439Q0724n8669H127a51459a8277D6107b20591
18695F3949K64565b5374A2920c09606B05372q8080d01798J39024a5017B00787
$$ plain form
18776 -286072 37856 -116343 -116727 238921 -193365 -32630 477020 -204790 -94456 39291 -241180
18764 -44572 -137158 59370 -101492 -367610 -2591 -73833 249506 -10411 262645 -473800 30834
18752 -13183 -354231 85068 -9028 -46560 325879 -171100 -108314 58210 -193962 101412 57220
18741 57220 -77109 -244236 221511 41683 -61789 2258 -192509 56043 -152955 76193 -281224
18729 125040 -277774 -192986 17366 -226731 -293168 23487 302728 -161533 144265 62810
18718 21779 382617 29847 -191202 306955 -93814 -237977 -326306 -249204 8457 -105946 -67774
18707 -67774 -117803 109055 451658 -249439 -168715 -227384 8127 -151459 -18277 46107 -220591
18695 63949 328514 -25374 12920 -309606 205372 117292 -401798 -262774 -15017 200787
18684A03087c56838h3702j34013M3587f5143C6710a11370g012j4363q2201I5993
18672b4753C3758J13917L972C0722Q7644l5592c4699m5198C77847h0663D01172
18660c66179a37669d4067G9708J01508a84233B31919b47072N4298i5775G1065
18649a78302r8768A32399a20331j08458A54109a38985C6767a11423k65850a00496
18638a64403J5123j31755F26a00857G3262e6878B57468h8861A66896E8903d4696
18626d2071k0519A27842c89781B66928A18326j6795g6206B7167a45991A5840Q621
18615B4461b95342K4078f7812F3183a95571j98550R1684F1045a30452j20221f0103
18603C8038Q2392c5678H5807D987J0208M4925B9707c23503a6511j18974j51848
$$ plain form
18684 103087 -356838 -83702 -217715 -174128 -65143 36710 -111370 -7012 -21375 -103576 95993
18672 -24753 33758 147675 151647 30722 118366 82774 -34699 -79897 377847 -80663 401172
18660 -366179 -137669 -44067 79708 181216 -184233 231919 -247072 -192774 -95775 71065
18649 -178302 -277070 132399 -120331 -228789 154109 -138985 36767 -111423 -377273 -100496
18638 -164403 -149280 -281035 626 -100857 73262 -56878 257468 -88861 166896 58903 -44696
18626 -42071 -62590 127842 -389781 266928 118326 101531 -76206 27167 -145991 15840 24461
18615 24461 -295342 -271264 -67812 63183 -195571 -394121 -302437 61045 -130452 -250673 -60103
18603 38038 120430 -35678 85807 4987 15195 60120 29707 -323503 -16511 -135485 -287333
18592b87333R5163A6214h3301A7647a57540J3247A74407C3011N8200J08453r6570
18581A03094c37279J41219A07581a4131A30529a24905A53190A6907b51442a9335
18570B40884a38648b9534j40741m1753k6977P7706E4017a40574A76823b09202
18559a16091j4029j27240h4066j31017I5434i7672A92485B5421K59867A3341e9312
18547D2505b27913B91414E854O9780a18114A66352e32805g5670A35448E6188a4635
18535A28489B3946a19234j9372O7795p0339j3893I5582k9948b76095B54791c3369
18523A53195a60729A31219B6941J8602b2535A20711f3159p0973j34970q9976c9494
18511a61416A35634O2379a16297B7326e7020E9696a03188C5380c01420K7107f2096
$$ plain form
18592 -287333 -192170 16214 -83301 17647 -157540 -144293 174407 33011 91211 199664 103094
18581 103094 -337279 -196060 107581 -14131 130529 -124905 153190 16907 -251442 -19335
18570 240884 -138648 -29534 -170275 -212028 -239005 -161299 54017 -140574 176823 -209202
18559 -116091 -130120 -257360 -84066 -215083 95434 -97672 192485 25421 285288 13341 -59312
18547 42505 -227913 291414 5854 75634 -118114 166352 -532805 -75670 135448 56188 -14635
18535 128489 23946 -119234 -138606 -70811 -141150 -155043 95582 65634 -276095 254791 -33369
18523 153195 -160729 131219 26941 45543 -22535 120711 -63159 -134132 -269102 -359078 -39494
18511 -161416 135634 198013 -116297 27326 -57020 59696 -103188 35380 -301420 -274313 -62096
18499a00267C46203b30009J03411N2780A4231a70282K446H6174i7974Q324j53083
18488b42733L3070B51285H4971K18695H8544Q2451b59540A83513c14918B99274
18477b74824B6851Q673K1505a90918J479A24505O7345L6164n1878f3529m56685
18466e20214F3986b37402o5047f9394L1841k44123a1348B39966a49947k35167
18456c85114h8083k4923A27069M0059b2878j56448E1837J48032b1365A97843b12124
18444A64992b4705l41540A5458a3921j32080E696e1276D7589a1544j30805f2582
18432A0084k774Q1116m3277e16250d6952q0692C13831a37587B84741d25649a31979
18420a5270j27986A63035b15158n1621o8141j3846N0658I6189J2807o127b16694
$$ plain form
18499 -100267 346203 -230009 -126598 -73818 14231 -170282 -167836 86174 -97974 -89650 -242733
18488 -242733 -209663 251285 84971 303666 88544 170995 -259540 183513 -314918 299274
18477 -274824 26851 35524 57029 -190918 -189439 124505 191850 228014 176136 -63529 -520214
18466 -520214 63986 -237402 -302449 -69394 -37553 -281676 -11348 239966 -149947 -385114
18456 -385114 -88083 -113006 127069 167128 -22878 -179326 51837 199869 -21365 197843 -212124
18444 164992 -24705 -366245 15458 -13921 -146001 5696 -51276 47589 -11544 -142349 -62582
18432 10084 7310 88426 45149 -516250 -46952 -127644 313831 -137587 284741 -425649 -131979
18420 -15270 -143256 163035 -215158 -266779 -334920 -348766 -298108 96189 108996 102869 -216694
18408b5976A57788b51389D3309N1904a23502c4404p4253a8016B33462f8430B74459
18396A78511g810B547c166j37395c0781l9334A88943M3195a81884B4921b89735
18384b29100A24401d5554l01828c3597l9404E5572J76651b44870M5982H737J31229
18373A39966a72671b5065A64103a3035j13290B25673f406F0603a48723f6515r2847
18362a59362C71487A45838b13099B21816h30A27698L1683d3702H5121K92182a05282
18350A07044D5068K7209c0266m86153D7725r85a12850L2901A38862a57775k7029
18339a84804B8823J7078a83394e1647l92683D7901k0170J31113E9027b31046a04566
18327e1341j63655I7261b42856A30754N7204a18029M0629L6102p1402F2736a88538
$$ plain form
18408 -25976 157788 -251389 43309 95213 -123502 -34404 -108657 -18016 233462 -68430 274459
18396 178511 -7810 2547 -3166 -140561 -30781 -70115 188943 232138 -181884 24921 -289735
18384 -229100 124401 -45554 -347382 -33597 -73001 55572 232223 -244870 -198888 8737 139966
18373 139966 -172671 -25065 164103 -13035 -126325 225673 -6406 60603 -148723 -66515 -159362
18362 -159362 371487 145838 -213099 221816 -830 127698 159381 -43702 85121 377303 -105282
18350 107044 45068 72277 -30266 -516419 47725 46740 -112850 -79949 138862 -157775 -184804
18339 -184804 28823 45901 -183394 -51647 -444330 47901 27731 158844 59027 -231046 -104566
18327 -51341 -214996 97261 -242856 130754 187958 -118029 -77400 -41298 -112700 62736 -188538
18315e403C1000i8493j24050J03364F4925O1204J94139a94113m5620P1153J3886
18304a54694j13293e7496j07313B87384A5301a34494l4850p0775i677q7641j90257
18293b87575a11264g853j49818l0868A35588b27882p2277A05726G561a20115j48091
18282b68206k20685d726E6267e0687j04046B19222f7376A61167m6325b80256E897
18270C15390c91276Q3910a31809L0886A71272b4660k14255q0500B3712c70728
18259A28757d8066j2572A33925a36002A23698J84827d7670b718C23028c9480j8007
18248e7487B67053E7686i5011C3338R7956b43568R7861j92596f3111j02524B29263
18236H2324I862P4611a97340a0151A87933i2434o6981D2427M37284D7403M06806
$$ plain form
18315 -5403 31000 -98493 -222543 -119179 64925 126129 320268 -194113 -239733 -168580 -154694
18304 -154694 -267987 -57496 -164809 287384 15301 -134494 -169344 -240119 -9677 -97318 -287575
18293 -287575 -111264 -7853 -157671 -188539 135588 -227882 -300159 105726 7561 -120115 -268206
18282 -268206 -488891 -4726 56267 -50687 -154733 219222 -67376 161167 114842 -280256 5897
18270 315390 -391276 -307366 -131809 -100923 171272 -24660 -238915 -319415 23712 -370728
18259 128757 -48066 -60638 133925 -136002 123698 308525 -47670 -2718 323028 -39480 -57487
18248 -57487 267053 57686 -95011 33338 131294 -243568 -145707 -338303 -63111 -165635 229263
18236 82324 9862 84473 -197340 -10151 187933 -92434 -159415 42427 479711 47403 454209
18225D54209C1519J40748a62405I4828b0414A7613P8744a51377B46791I1188h6356
18213c0259j14119A856R9945O8139a52266A73615m4878i3220a5262j51461f4936
18201c45403d5718B85765c4948A09003b01453G2070j4632i5175j49962a21173
18190i8814B4195Q5467N6768a66253P8532A38770q892c49311a31958B93604b12990
18178G4445C3265e9166B68789D2874d06713h8070k3471o7451A31989i3748A88040
18166g2529A76730J09220i0308A74229f7105B0278J62732a007C8809a37453n2542
18155a89995p4930f1469B31148b04816A40175l108n8740a25868M1397A96972G8518
18143A79291b16896F3581c08428i6810m4945B28287p5347b3992j48026P740N1987
$$ plain form
18225 454209 31519 172267 -162405 94828 -20414 17613 96357 -151377 246791 91188 -86356
18213 -30259 -144378 1856 101801 169940 -152266 173615 128737 -93220 -15262 -166723 -64936
18201 -345403 -45718 285765 -34948 109003 -201453 72070 57438 -95175 -245137 -121173
18190 -98814 24195 109662 166430 -166253 -87721 138770 129878 -349311 -131958 293604 -212990
18178 74445 33265 -59166 268789 42874 -406713 -88070 -111541 -178992 131989 -93748 188040
18166 -72529 176730 285950 -90308 174229 -67105 20278 183010 -1007 38809 -137453 -189995
18155 -189995 -264925 -61469 231148 -204816 140175 137067 78327 -125868 -84471 196972 78518
18143 179291 -216896 63581 -308428 -96810 -141755 228287 152940 -23992 -172018 -164278 -112291
18132a12291d9587j93213a03466b3268j05684c9573D2121d1389j24961h562F666
18120D24351d67844a18458H0451O9552c95748C6607b08447q5966f3001a3368k71352
18109b84720h5424k3861E6837a45350A4187i8595D16792H875K43993H2525a05007
18097B07371a32806o9788C6893c1876l35100G771K28414a52493B30722b6144o2448
18086h8592J8566e579A25570h208p5312p5438L1972G1165i6334j24254E968J19930
18074A25898E5812b16893B23092E1177c1270H5466K92048a11264H9730a56539
18063i0827B21246g3325A86444N6622o0003a06352d1658A12375a18057j54901
18053b72958N5923d2166j82069B47378K48305a48977j0599D70667h6312B8903
$$ plain form
18132 -112291 -49587 -242800 -103466 -23268 -128952 -39573 42121 -41389 -166350 -8562 6666
18120 424351 -467844 -118458 80451 150003 -395748 36607 -208447 -294413 -63001 -13368 -284720
18109 -284720 -85424 -109285 56837 -145350 14187 -98595 416792 8875 252868 82525 -105007
18097 207371 -132806 -202594 36893 -31876 -366976 7771 236185 -152493 230722 -26144 -88592
18086 -88592 -70026 -5579 125570 -8208 -83520 -158958 -126986 71165 -96334 -220588 5968 125898
18074 125898 55812 -216893 223092 51177 -31270 85466 377514 -111264 89730 -156539
18063 -90827 221246 -73325 186444 243066 183063 -106352 -41658 112375 -118057 -272958
18053 -272958 -217035 -42166 -224235 247378 495683 -148977 -159576 470667 -86312 28903
18042B79330J81380A74708b74995A52584e06163c9137C11375A9975O5497K16855
18032C02327N15p6305j08559m5332J84764F5772M8275b54796B2754N5455d9492
18020i5001P391a1317E2016b08579a1560A00226c1695p6233j22084A0217L5117
18009D5334R8750b62285B61914L11831i9549G1056b58761B07023f6533A61095
17998a08808m62881K60455a21067B78118j15040C6784K15099a83449e1325C7236
17987F4018a3387A41342b44785k26191B49402i7124B68034m4095D2915a9020l42319
17976c61339A87174a04132C2809a76108B48650a79639D48942a06532A87861c33170
17965I9323j8395f1641K0653G0812a15108D2021b36246I3536a19950k09687Q7117
$$ plain form
18042 279330 460710 174708 -274995 152584 -506163 -39137 311375 19975 85472 302327
18032 302327 302842 226537 117978 72646 257410 65772 114047 -254796 22754 78209 -49492
18020 -95001 -87610 -11317 52016 -208579 -11560 100226 -31695 -107928 -230012 10217 45334
18009 45334 144084 -262285 261914 573745 -99549 71056 -258761 207023 -66533 161095
17998 -108808 -571689 -311234 -121067 278118 163078 36784 251883 -183449 -51325 37236
17987 64018 -13387 141342 -244785 -470976 249402 -97124 268034 223939 42915 -19020 -361339
17976 -361339 187174 -104132 32809 -176108 248650 -179639 448942 -106532 187861 -333170
17965 99323 80928 -61641 -40988 70812 -115108 42021 -236246 93536 -119950 -329637 -242520
17954b42520B11732c1739j74937B65214a91607b7110J580E9705j5630J49475f8053
17942b87370a41998H1261C2199d9294h735G7733b05421j01976a4763j92509i1052
17930B63860b9195G1497J7924J45544e9827k2548B48044I4787k549J41919J94298
17919D28455H8122C9738R2947q053J44293b1632B99320D2857N7455M2824C1460
17907a59671E3406P6918K43345B0229c9748j803k7111b1574j4838F099d8201A68908
17894c549A34922j7766C8575f9338k823A18580g3367l4147j8270A57071b286A36525
17881a35445A72682C2944b39801F9126a91139B58740A00304j635J51989a23951
17870b09295j21602E179e3175D853J07764M7572a86268A18906Q9679K6811B6610
$$ plain form
17954 -242520 211732 -31739 -206676 265214 -191607 -27110 -25530 59705 44075 193550 -68053
17942 -287370 -141998 81261 32199 -49294 -8735 77733 -205421 -307397 -14763 -207272 -91052
17930 263860 -29195 71497 89421 234965 -59827 -82375 248044 94787 92238 234157 428455
17919 428455 88122 39738 132685 124632 268925 -21632 299320 42857 100312 143136 31460
17907 -159671 53406 130324 373669 20229 -39748 -41551 -68662 -21574 -36412 6099 -48201 168908
17894 -3549 134922 117156 38575 -69338 -72161 118580 -73367 -107514 -125784 157071 -2286 136525
17881 -135445 172682 32944 -239801 69126 -191139 258740 100304 98669 250658 -123951
17870 -209295 -330897 5179 -53175 4853 112617 160189 -186268 118906 208585 235396 26610
17858a71150A20750B3984J66101Q3099A25419b6959j89397A61019A809b01519
17847d6123B08935a37175C5120b54918E0911o921L1625J24234K9301f7694A90821
17835C6969a09062C59632r213A72881J1031j5054e8005j50246d1938G7867b38038
17823h8165B1330b48698D72224A766J84367O1769n6004C0819J3064J40122h9992
17811a94994K185g7572b0457j01790j36971F7130a9870F7359N6926b39478C03403
17799G7729b01317G6850J62100D1636K12101O7727k3673j62j6846b737A1505a3279
17786A43768a50818k19729E876K24694d51515F8770B0904i0104j19950A36369
17775a42663A40477n3613B5733O4984C2133p013L91140k02668B2089b11983C00287
$$ plain form
17858 -171150 120750 23984 190085 273184 125419 -26959 -216356 161019 1809 -201519
17847 -46123 208935 -137175 35120 -254918 50911 43990 75615 199849 229150 -67694 190821
17835 36969 -109062 359632 350419 172881 183912 168858 -58005 -208251 -41938 77867 -238038
17823 -88165 21330 -248698 472224 1766 186133 247902 191898 30819 43883 184005 -89992
17811 -194994 -192809 -77572 -20457 -122247 -259218 67130 -19870 67359 124285 -239478 303403
17799 77729 -201317 76850 238950 41636 253737 321464 297791 297629 280783 -2737 11505 -13279
17786 143768 -150818 -370547 5876 230570 -451515 68770 20904 -90104 -210054 136369
17775 -142663 140477 86864 25733 90717 32133 25120 416260 213592 22089 -211983 300287
17763B42515a41844A721e2527n649e502j35137E0347A3764C031N1097e2150a8670
17750D01135e129k68399n2397A20825J0246J36044H6421d5788C55785A26855j340
17739A25515P0189e4440A6898J00225f1167B12382q0846b22032A50374a65052
17728C07223B5165f4372C91225A03917J43353E3062j5442a37416q563k7100A84256
17716A4428K25113C3635J4870K26107D3087A7013f6695A3199a09328C04934c4092
17704H4084K30974B2424r509a20107B75243h8550F2125P94Q1649g4983A67432
17692a37360B31586b56701C0265A687K34248O6027a21133A31902C6073K05018
17682B41091g3604D39967a06629B6679M17583A41501b01072b8151C06100B1702
$$ plain form
17763 242515 -141844 1721 -52527 -58176 -5502 -140639 50347 13764 3031 54128 -52150 -18670
17750 401135 -5129 -273528 -325925 120825 131071 267115 86421 -45788 355785 126855 125515
17739 125515 195704 -54440 16898 117123 -61167 212382 131536 -222032 150374 -165052
17728 307223 25165 -64372 391225 103917 247270 53062 37620 -137416 -145979 -173079 184256
17716 14428 239541 33635 48505 274612 43087 17013 -66695 13199 -109328 304934 -34092
17704 84084 315058 22424 12915 -120107 275243 -88550 62125 62919 144568 -74983 167432
17692 -137360 231586 -256701 30265 1687 235935 301962 -121133 131902 36073 241091
17682 241091 -73604 439967 -106629 26679 444262 141501 -201072 -28151 306100 21702
17671F4280J62061O5781A06478J14924d68523B19426i0951p0031d721k32C51303
17659A07128N3881f2402D08201j11904F2250d8824G648O1465i6356p8909c0777
17647A29205F3185h3927j08207C41465j64917J71572A03597J61386p3828Q4403
17637B75558P14k396J86190j82640e3058D46084h3728A04656J26620l2308b70954
17625b94428A35427o5868h1068C40915a88026B0746P3761h087G1235b26489D721
17613A13527i6030a9666B77809a67153A13947c6090A94709C8645J01719j8287
17603A22077J52696m9496C2455f8299B88974c3741A61867P1364A08200K87621
17593C95821c142A1661b31836B5641b15525C29255j20693M6240G2901c1103A60498
$$ plain form
17671 64280 226341 292122 106478 221402 -468523 219426 -90951 -160982 -4721 -4953 351303
17659 107128 161009 -62402 408201 296297 62250 -48824 7648 69113 -96356 -175265 -30777
17647 129205 63185 -83927 -192134 341465 176548 348120 103597 264983 191155 275558
17637 275558 276272 273876 460066 277426 -53058 446084 -83728 104656 231276 198968 -270954
17625 -294428 135427 69559 -81068 340915 -188026 20746 94507 -8087 71235 -226489 4721
17613 113527 -96030 -19666 277809 -167153 113947 -36090 194709 38645 140364 122077
17603 122077 274773 225277 32455 -68299 288974 -33741 161867 233231 108200 395821
17593 395821 -3142 11661 -231836 25641 -215525 329255 208562 254802 72901 -31103 160498
17581C02706a28722A46126N1932C8215J16561m3415l5407L32820d3758j32427
17571a76185k17954B64480A16063m6659J57495A5989M82664B18816b35015c8918
17560B33306n6953M9281Q7041L253O37K06039c2884k982A61345l9101J69539n6697
17548B35086r5119A1634K54266e9920H4133J13740J14533n3960j08864M19556
17538E69138A61245M27456j36231j43403j29268K11531K9230C1201K71693M0321
17528C43215p1896L40826C02319J86629L24057Q7191k47204j11078j16876r9828
17518C25210j34227m7601L00982j70442N1312A28286M13174K59748J51843j54995
17508G98056k09164J35385j74J36374B40564k7216L77202A78127q631J01907J08601
$$ plain form
17581 302706 -128722 146126 198058 38215 154776 111361 75954 408774 -43758 -176185
17571 -176185 -394139 264480 116063 69404 226899 15989 498653 218816 -235015 -38918
17560 233306 176353 225634 312675 315928 316565 522604 -32884 -35866 161345 122244 291783 235086
17548 235086 139967 11634 265900 -59920 84133 197873 312406 258446 149582 569138
17538 569138 161245 588701 452470 309067 179799 391330 420560 31201 302894 343215
17528 343215 271319 612145 302319 488948 813005 900196 652992 541914 425038 325210
17518 325210 190983 143382 444364 273922 325234 128286 541460 801208 953051 798056
17508 798056 588892 724277 724103 860477 240564 213348 590550 178127 169496 271403 380004
17497C80004A64802J34719q7556J13835N3656A27875N18029B48707m9612K69844
17487D68939L0519r7538j86244n6094c331B9255K15302a1680D87987B21045N79735
17476H00780C33519P3530a20382I7405L08833i5461E10866j19423j23738O0934
17466C28639j1730j01253J44115F5166f1823A2149M65602j83835K4384K04323
17456E22623C3155r859J6358M9308K80520j67382K26866n3736o0744J88506A1952
17444A083760l49484q4269j69877K65380j73828b9308C63996N0956j79133L79919
17434F15738n2695I1621O79961l37537p3685O42004l96435B65506J43491R0301
17424D99298k08255M09562E4303J81241Q5423J43542j91325J16591j76063J03599
$$ plain form
17497 380004 164802 299521 211965 325800 379456 127875 645904 248707 199095 468939
17487 468939 499458 401920 215676 159582 -3331 29255 244557 -11680 487987 221045 800780
17476 800780 333519 407049 -120382 97405 406238 -95461 510866 391443 267705 328639
17466 328639 316909 215656 359771 65166 -61823 12149 477751 293916 318300 522623
17456 522623 33155 23296 39654 88962 369482 202100 428966 375230 314486 502992 11952
17444 1083760 734276 650007 480130 745510 571682 -29308 363996 414952 235819 615738
17434 615738 563043 91621 771582 434045 360360 1002364 605929 265506 408997 499298
17424 499298 291043 700605 54303 235544 320967 464509 273184 389775 213712 317311
17414C17311K2694J2752M33539B36743N87296j61960C24299o512n3586b16160
17403B91127B2329L03324Q153o7486J28647j58572A12028K35215A19026N5743
17393A74769J22446p7147M8330K23736K18953B7569K03443K6837J48727a47599
17382A58421l1092L51583r9353A16909K04332j25761J00698O8350A2949K11387
17372B24336O8223i3665A39813Q6504K24815j35632F0519K87518J24209k23089
17362B49157j01900F5817j3222L33241n6546j25187B7023N12215j66769j76554
17352A95915J76406j1406q1305j21585K4707B1865K26528p997J2533F0819N69721
17341F30540B13504b1052j8253B50662K6839C9491h574D28936q6072N6607J35046
$$ plain form
17414 317311 340005 352757 786296 236743 824039 662079 324299 317787 264201 -216160
17403 291127 22329 325653 333806 266320 394967 236395 112028 347243 119026 174769
17393 174769 297215 220068 268398 492134 711087 27569 231012 257849 406576 -147599
17382 158421 127329 478912 379559 116909 321241 195480 296178 364528 12949 224336
17372 224336 292559 -93665 139813 226317 451132 315500 60519 348037 472246 249157
17362 249157 147257 65817 52595 385836 329290 204103 27023 539238 372469 195915
17352 195915 372321 360915 279610 158025 182732 21865 248393 240396 252929 60819 630540
17341 630540 213504 -21052 -39305 250662 277501 39491 -8574 428936 342864 399471 534517
17330E34517B05013j3586K18829A37245B1167M7090N23413k71457L3270H1169
17319B96051J95204j77140A50666R3025a21062E1699J68835M76J33128G9301K52038
17308C31339I2305J00048J86107q3388i2947D75708k30840j10526J02600F4084
17297D5151K63423O8527A4444L26431Q5159m4121G3252N72980A69883L16186A88221
17285A66744J23422J25260A43654N31811k31474O8866j03652i657A68079m8573
17275A19506J54936A08025L81476A92962J30467j8765K1028l1740q4081o3420
17265A46451F7854J77149J53701m7182j40962O3599K29697k01745L33241k40117
17255C95235L54500A59967K06301o2990J27183A20507N86169E5623K99605q1137
$$ plain form
17330 534517 205013 191427 410256 137245 21167 68257 591670 320213 353483 81169
17319 296051 491255 314115 150666 243691 -121062 51699 220534 221010 354138 79301 331339
17308 331339 92305 192353 378460 295072 -92947 475708 244868 134342 236942 64084
17297 45151 308574 377101 14444 340875 426034 381913 73252 646232 169883 486069 188221
17285 166744 290166 415426 143654 675465 443991 512857 409205 -9657 168079 119506
17275 119506 274442 108025 489501 192962 323429 304664 325692 293952 209871 146451
17265 146451 67854 245003 398704 351522 210560 274159 503856 302111 635352 395235
17255 395235 749735 159967 366268 303278 430461 120507 706676 55623 355228 274091
17245B74091K94533B03358L32090A78908K52734A34886L41052K2840a44777C75589
17234A91469K81094E3696N61823A78543k4453K08478m7593o3246J60925o4620
17224C48034Q7582Q7536p5420G2664N21294j13624J38561A65058K74672L6525
17214D76255A98729M79470k65085j12278C7428O60659B92377L22623j30511A55568
17203F15516k57108J58527j73228K8499j13877P171M3305K72267k15064J40783
17193E06791j06880r2089o406k1360b3873D39930M0254l6018j1557J88383m1395
17182E79597B46627L56401j55090N1927J58359B63956q5218K04676r902l4083
17172C39429K1500l6081N87567C37483M67980k96089j96484I8999K62439O2487
$$ plain form
17245 274091 568624 203358 535448 178908 431642 134886 475938 498778 -144777 375589
17234 191469 472563 53696 615519 178543 154090 362568 314975 251729 412654 348034
17224 348034 435616 523152 447732 72664 593958 480334 618895 165058 439730 476255
17214 476255 198729 678199 413114 300836 37428 698087 292377 615000 484489 155568
17203 615516 358408 516935 343707 372206 258329 265500 308805 581072 366008 506791
17193 506791 399911 307822 301416 280056 -23873 439930 480184 444166 432609 620992 579597
17182 579597 246627 603028 447938 499865 658224 263956 178738 383414 373512 339429
17172 339429 360929 324848 912415 337483 805463 509374 312890 98999 361438 423925
17162D23925n4386J25777j48421M16447k04758o4819j15433j05378M12384k32084
17152D53254l5004j59660M23748o6947k72234A21827N00623k51017K8639N9590
17142D59662m1784q3189o9732A01639N24737k37422J7845m2358J39162K74454
17132G78057j84562j76623K3427j65456P7476M1129k7641O6557J27121k979J05701
17121F62207Q2860k04177L27165j42441l60299J73742J04627k7083r514B53578
17110H48538m10930K80224L1704l52793O46727k00403p4215n6586l35244J9854
17100C96876J27481J59829L40459m52928N2260L2531q2729J41910m0367j93470
17090D81852j10842K53819R0015n8478j12682J9022r561J86011k41694L49265
$$ plain form
17162 423925 369539 495316 346895 763342 558584 493765 378332 272954 685338 453254
17152 453254 418250 258590 682338 615391 343157 121827 622450 371433 400072 459662
17142 459662 417878 334689 264957 101639 626376 388954 406799 364441 503603 778057
17132 778057 593495 416872 440299 274843 352319 393448 365807 432364 559485 556506 662207
17121 662207 745067 540890 868055 725614 365315 539057 643684 616601 607087 253578
17110 848538 437608 717832 749536 396743 1043470 843067 768852 712266 377022 396876
17100 396876 524357 684186 1024645 571717 623977 656508 573779 715689 675322 481852
17090 481852 371010 624829 714844 656366 543684 562706 553145 739156 497462 846727
17080H46727j00024o7466J11606j15680q5565K4177M4032K76897o9224j69441
17070F96039N6320k8031J82001k31650M72774l90863L12388k68668k88477M88871
17060A000704j66472j94729j31801k1099M05942k12770J95864j69196L55582r4670
17050I67355l57888J64406K8066R6491p8098P3491j42980K51341k76484K53983
17040I79683j12543N2112j02968K36802k28455K64314k44738K37811l17508K18565
17030I83075K8069j35914L57148l91266N18320o4057m98410j06529M57597l94569
17020G53464J36712Q4903P9215K4143m0841j67870J50181N9812j81295L08380
17010A206804j01164k59948n2460J13890j95472K60452K35237J85430j48003k79247
$$ plain form
17080 846727 746703 679237 790843 675163 589598 613775 657807 934704 865480 696039
17070 696039 752359 724328 906329 674679 1147453 756590 1068978 800310 511833 1000704
17060 1000704 834232 639503 507702 486603 892545 679775 875639 706443 1062025 967355
17050 967355 609467 773873 801939 898430 820332 893823 750843 1002184 725700 979683
17040 979683 867140 919252 816284 1053086 824631 1088945 844207 1082018 764510 983075
17030 983075 1011144 875230 1232378 841112 1359432 1295375 796965 690436 1148033 753464
17020 753464 890176 975079 1054294 1078437 1037596 869726 1019907 1079719 898424 1206804
17010 1206804 1105640 845692 793232 907122 711650 972102 1207339 1392769 1244766 965519
17000I65519J55233J13638k19010m7378J48397J10318k61422M24365j78583k64718
16990I46359N56806q7091j70356q1703L59029k72499k54796J29925L04072k11488
16980A218258J66579J53779j09270n02618K55651R0536K33506k1889k31019r5521
16970A157992J23711o0190K01165p2627K90848k89925K66578k89063J80777j65761
16960A343505L99384k27048Q5017N3617N4854J73043q3412m67237J79639K91037
16950A802399l7708O1183m23833K04967K52747m92492K60642J52787m646K12666
16940A988712l30956K4810L68538j97451J92312q4776j8394N8527J92052k96657
16930A896717L04494m76844L52381k60757K57793p6191j0061K27959j37346J54331
$$ plain form
17000 965519 1120752 1234390 1015380 968002 1116399 1226717 965295 1389660 1211077 946359
16990 946359 1503165 1416074 1245718 1164015 1523044 1250545 995749 1125674 1429746 1218258
16980 1218258 1384837 1538616 1429346 926728 1182379 1272915 1506421 1484532 1253513 1157992
16970 1157992 1281703 1221513 1422678 1350051 1640899 1350974 1617552 1328489 1509266 1343505
16960 1343505 1742889 1515841 1600858 1654475 1709329 1882372 1798960 1331723 1511362 1802399
16950 1802399 1764691 1825874 1402041 1607008 1859755 1367263 1627905 1780692 1776046 1988712
16940 1988712 1657756 1682566 2051104 1853653 2045965 1961189 1942795 2001322 2193374 1896717
16930 1896717 2201211 1724367 2076748 1815991 2073784 1997593 1987532 2215491 2078145 2232476
16920B232476j94778L70871m39278j99569N33279j58920K20421k25631L05145
16911B444016k67542K97183j58025Q782K14519J79638m72452J98908L00697k62608
16901B483116J75126J15252J77296m28694J86328j27087K77413q8025m284n68
16891B765873K30900N2669k01871J26311l13155K67629N8521K03004k96992L88629
16881C281518l05093K19928J66161Q579J17176k36743L56237O7369J9047J77192
16871C871371k77759K76007k42267K69827l0976l8089J07858J48889J0297O9788
16861D164946J42239k40761N2343J56027J56204L84459l43906o4374N65348m06739
16851D565786J21524L06615Q023J39206m02010L88259Q4581m8745L48882J56260
$$ plain form
16920 2232476 2037698 2408569 1969291 1769722 2303001 2144081 2364502 2138871 2444016
16911 2444016 2176474 2473657 2315632 2324414 2538933 2718571 2246119 2445027 2745724 2483116
16901 2483116 2658242 2773494 2950790 2522096 2708424 2581337 2858750 2770725 2766441 2765873
16891 2765873 2996773 3049442 2847571 2973882 2660727 2928356 2986877 3189881 2892889 3281518
16881 3281518 2976425 3196353 3362514 3371093 3488269 3251526 3607763 3675132 3694179 3871371
16871 3871371 3593612 3869619 3627352 3897179 3866203 3828114 3935972 4084861 4095158 4164946
16861 4164946 4307185 4066424 4118767 4274794 4430998 4815457 4471551 4407177 4972525 4565786
16851 4565786 4687310 4993925 5001948 5141154 4739144 5127403 5211984 5163239 5512121 5668381
16841E668381O4036J60825p3346J68647k17373J79012L38139J17589k48071J51846
16831F309685J56973j22701R9392L58859K29292K08626j56008L83433J79505J58670
16821G805726K40031P058j0335J39078Q4837K03834J00008K19706M48205K23023
16811I461171L1640K17515N0614J51250L14600j09065M11985K87763M62919m8921
16801A1231471K43516L8172M49182M37306J61334M94007J84176P1225O00762K08040
16791A4119191N45268P39832P0679J16241M25018N58451J57095P52380K12463
16782A7696618P32266J92818O51585O18874L43986R94742K81648O56965P40712
16773B2910214M06765M44475J350851P10752O64044P67043J136368P72478J329257
$$ plain form
16841 5668381 5732417 5893242 5819896 5988543 5771170 5950182 6288321 6405910 6157839 6309685
16831 6309685 6466658 6343957 6443349 6802208 7031500 7240126 7084118 7467551 7647056 7805726
16821 7805726 8045757 8052815 8042480 8181558 8266395 8470229 8570237 8789943 9238148 9461171
16811 9461171 9492811 9710326 9760940 9912190 10226790 10117725 10529710 10817473 11280392 11231471
16801 11231471 11474987 11513159 11962341 12399647 12560981 13054988 13239164 13310389 13911151 14119191
16791 14119191 14664459 15404291 15474970 15591211 16016229 16574680 16731775 17484155 17696618
16782 17696618 18428884 18621702 19273287 19892161 20236147 21230889 21512537 22169502 22910214
16773 22910214 23316979 23761454 25112305 25823057 26487101 27254144 28390512 29162990 30492247
16764C0492247N66580J278223J098279J212325J004899J350828J197990J619257
16756C9820628J309214J627829J591335J727197J692223J420443K155064J718987
16748E3062920K604863J620974K540971K526718K107736K712368K679358K456090
16740G2311998L251673K235729K941831L165710L112426K922360L168417K949123
16732I6059267K843438L198641K615795K968250K473048K615879J655885K605753
16724A17035956J653698J468581J282535M76240M45478J01195l19944o15611j000078
16715A20528050j732674j223919j923349k276067k225791k646942k810172k881402
16707A02807734k968088k919494k914766l556051k930231l399582k599671l275237
$$ plain form
16764 30492247 31058827 32337050 33435329 34647654 35652553 37003381 38201371 39820628
16756 39820628 41129842 42757671 44349006 46076203 47768426 49188869 51343933 53062920
16748 53062920 55667783 57288757 59829728 62356446 64464182 67176550 69855908 72311998
16740 72311998 75563671 77799400 80741231 83906941 87019367 89941727 93110144 96059267
16732 96059267 98902705 102101346 104717141 107685391 110158439 112774318 114430203 117035956
16724 117035956 118689654 120158235 121440770 121917010 122362488 122463683 122143739 121528128 120528050
16715 120528050 118795376 117571457 115648108 113372041 111146250 108499308 105689136 102807734
16707 102807734 99839646 96920152 94005386 90449335 87519104 84119522 81519851 78244614
16699G8244614k944306k510566k907978k709820k504373k630506k546809k215671
16691E7274585j976745k091874k204172j852320k065499j460464k053053j569784
16683D2000674j624279j549601j601485r79204j660008j025668q65162j840059
16675C0855208q17778p85127r22973j000648r24283n95570r21890q25042p32247
16666B3329650o10397p08509o05500p99896k67955p77814o76836o78071n10455
16657A7694217m25451m87752m67243K8212j010231n09648n14532l5544k08851
16648A4063177q05476M051k70287n05112j25592l92375l39282k37455k07462o70012
16638A0514175J30395p6682m85017m52761k26103k02272P3455k10503j24038k13392
$$ plain form
16699 78244614 75300308 72789742 69881764 67171944 64667571 62037065 59490256 57274585
16691 57274585 55297840 53205966 51001794 49149474 47083975 45623511 43570458 42000674
16683 42000674 40376395 38826794 37225309 36246105 34586097 33560429 32695267 30855208
16675 30855208 30037430 29252303 28329330 27328682 26404399 25808829 24886939 24061897 23329650
16666 23329650 22719253 22010744 21405244 20605348 20337393 19559579 18882743 18204672 17694217
16657 17694217 17268766 16781014 16313771 16341983 15331752 14822104 14307572 14272028 14063177
16648 14063177 13257701 13261752 12991465 12486353 12360761 11968386 11629104 11391649 11184187 10514175
16638 10514175 10644570 10567888 10082871 9630110 9404007 9201735 9275190 9064687 8940649 8727257
16628H727257j99586R773m53790l99664j29694j22952l4234J08029k18671k54497
16618G031971m5k53976K25334n59015K7454k65539N3005o01449K59185j45271
16608E771654k71994J23166N5282m39913K08554k90584R3831o4444m53296L28319
16598E060575k47110K08102k38785m032k50417k11289j96809n8704J32204k64581
16588C929154O6594O0750j3805o3942k04995L3386k03734l9083K46934m88413
16578C322846L28351j7036o9838l89114J38860j96427K21211J96931o16777j6408
16568B902599K41116m9032N0038n51949J68892L30867j82421N2402J04333l75954
16558B690891J51759k37528K7480j38420L5325M09311l09189m21817n1823j06753
$$ plain form
16628 8727257 8527671 8537444 8083654 7683990 7554296 7431344 7397110 7505139 7286468 7031971
16618 7031971 7031926 6777950 7003284 6444269 6471723 6206184 6259189 5657740 5916925 5771654
16608 5771654 5499660 5622826 5678108 5238195 5446749 5156165 5249996 5185552 4732256 5060575
16598 5060575 4813465 5021567 4782782 4778750 4528333 4317044 4120235 4061531 4193735 3929154
16588 3929154 3995748 4056498 4042693 3978751 3773756 3807142 3603408 3564325 3811259 3322846
16578 3322846 3651197 3634161 3564323 3175209 3314069 3117642 3338853 3535784 2919007 2902599
16568 2902599 3143715 3094683 3144721 2592772 2761664 3092531 2910110 2962512 3066845 2690891
16558 2690891 2842650 2605122 2632602 2494182 2529507 2938818 2629629 2207812 2155989 2049236
16548B049236K89161p2054M04381j98104k16650J94300j32570j58185j73268J38664
16538B124911m5355j32681J91974j09033K26517l07914r4408J9500L01371k47943
16528A926939k73742M53915m85612K42190n6055l95283P30153l60490Q9954m79335
16518A392634Q1984K17472J50267m38374p2182K47742j11121O6084j19459N0888
16508A465935J44857j89496J5890K08433m14565N68568m14813L5142J14273l67755
16498A166469o4397L14419j68185Q4566j12986L0075P2197m15570N03038m00169
16488A009457M65549l23806m680L09183j91460j86818J21646k50331K62555m2460
16478A168835l52964J13579J40937J52478J35358n45397K55777k40712L63463
$$ plain form
16548 2049236 2338397 2266343 2670724 2472620 2255970 2450270 2317700 2159515 1986247 2124911
16538 2124911 2079556 1946875 2138849 2029816 2256333 1948419 1854011 1873511 2174882 1926939
16528 1926939 1653197 2107112 1621500 1863690 1807635 1412352 2142505 1782015 1871969 1392634
16518 1392634 1474618 1692090 1842357 1403983 1331801 1579543 1468422 1534506 1415047 1465935
16508 1465935 1610792 1421296 1437186 1645619 1231054 1799622 1384809 1419951 1534224 1166469
16498 1166469 1102072 1416491 1248306 1332872 1219886 1249961 1322158 906588 1409626 1009457
16488 1009457 1475006 1151200 1146520 1455703 1264243 1077425 1199071 948740 1211295 1168835
16478 1168835 815871 929450 1070387 1222865 1358223 812826 1068603 827891 1191354
16469A191354j28320j69064O6268M193L42826n78455J95603j35373J71297J4382
16459I74711j83319K25684k86994J34758J65524m4726j1564J1624J14891k03587
16449H97002L87512l42348Q975j40870p0662L89239o9601k92845k56376K88572
16439G98598p1732K30652j04029C80252N08011D18058P31838l05352l95446M37882
16429H86980l76177m4764O81282m79629k41230K45930p9520K56581k87314n0768
16419E11371K34204k90260J93861r6974j08695N7016M78929k54737C18152K44250
16409E62402N370l4224R1305Q9806L227J9001k16237m2471L26409k46871k1694
16398E36023J33391j51065N0316N9260L0741j37054m8982j529O9673j52025J1141
$$ plain form
16469 1191354 1063034 893970 960238 964431 1307257 728802 924405 789032 960329 974711
16459 974711 791392 1017076 730082 864840 1030364 985638 974074 985698 1100589 897002
16449 897002 1284514 942166 951141 810271 739609 1128848 1059247 766402 510026 798598
16439 798598 726866 957518 853489 380252 888263 418058 1149896 844544 449098 886980
16429 886980 510803 466039 1147321 667692 426462 672392 592872 849453 562139 511371
16419 511371 745575 455315 649176 552202 443507 500523 979452 724715 318152 562402
16409 562402 567772 533548 624853 714659 717886 736887 520650 478179 804588 557717 536023
16398 536023 669414 518349 568665 627925 658666 521612 472630 471101 540774 388749 399890
16387C99890N57984D33559j31356J33505O2911p072Q3152K10438j29378k16389
16377D39370o1458K34419j75618A56899M66217j44678p6819L78691j26593J89689
16367H43406l55967A76071B7646Q20642C81868L57113m3584A48516K35442j45827
16357B38131K99785R9439k13013m6786I9205L81332j84432J03846L18326h5479
16346F02212l01105j29163J95531m6984M4069n8929J9968n4117P4959J72086A34351
16334c8412D57930c3948D85957R7300k57893j10287K66208F3354J79351N0034
16324B92739K87658k67315k4882R8841J2208H9471L45060j35542J10391P8076
16314D87456a8476C82363j52159J44195j7372K7449q3037K5847J64655n587F7790
$$ plain form
16387 399890 957874 433559 302203 435708 498619 491547 574699 785137 655759 439370
16377 439370 377912 612331 436713 156899 623116 478438 401619 780310 653717 843406
16367 843406 487439 176071 27646 848288 381868 738981 695397 148516 383958 238131
16357 238131 537916 637355 424342 377556 99205 480537 296105 399951 718277 -85479
16346 602212 301107 171944 367475 320491 364560 305631 325599 271482 346441 518527 134351
16334 -38412 457930 -33948 485957 583257 325364 215077 481285 63354 242705 292739
16324 292739 580397 313082 288200 387041 399249 89471 434531 298989 409380 487456
16314 487456 -18476 382363 230204 374399 357027 384476 301439 327286 491941 486354 67790
16302C39158K71994C04499A30205K47453A48643P2164i2945C96387A11057Q581
16292A19638k1340M32513k09523A57081K19120J75196B59361A13250K68850g5459
16281D64065c4669A55158i699C54876j45376N8396o6391O7926I3884A5507J29505
16270A45012K4820J44523m829J36385k03048J04239K7302A20690K78535A24352
16259C83862A85904a6980D60812F6535J89499A22639a93671C63884H8572J78533
16249B67105o5208k5439G6793k2473K01308r2100K03280n3833J25231A93992L0566
16238B24558F8998c6810E5444Q5832O9896o5349J42218a81026I5094R5960q3345
16227A07709J03279i185B43312A18289P2948k5282G8518B7819g8923B41800J46474
$$ plain form
16302 339158 611152 304499 130205 377658 148643 220807 -92945 396387 111057 119638
16292 119638 98298 530811 321288 157081 376201 551397 259361 113250 382100 -75459
16281 464065 -34669 155158 -9699 354876 209500 267896 201505 269431 93884 15507 145012
16270 145012 169832 314355 309526 445911 242863 347102 374404 120690 399225 124352
16259 383862 185904 -16980 460812 66535 256034 122639 -193671 363884 88572 267105
16249 267105 201897 176458 76793 54320 255628 163528 366808 312975 438206 193992 224558
16238 224558 68998 -36810 55444 141276 211172 145823 288041 -181026 95094 191054 107709
16227 107709 210988 -9185 243312 118289 191237 165955 78518 27819 -78923 241800 388274
16216C88274j75383M7601o7120k6102R905K02423b8102k4391n1281D24953A85245
16204A37641c4449C50455j67115K54236j61536Q841D3962j7054Q0353J48925b8696
16192A66410E6216J59046H3616K41945k7422A00554K08671a73515G5061J83336
16182B58397a6888B01966m0231L81064A45001J98748A29910J35553A8249J8993
16172C7242J09621J4949K9497a43245M2930L9930k2280A75021F2750b6822G9119
16160A01286h7444E0194a86369B91554C7392K04320N4317p4226j0049a27787A05700
16148A83483F4592a0991G4915J121a90763C00430J36712b02957A62742k954n8379
16137A01409c410A07454B9436N327c9873A1576P9046g3801j04774J7406G1621
$$ plain form
16216 388274 212891 260492 193372 167270 177175 379598 -28102 -52493 -103774 424953 185245
16204 137641 -34449 350455 183340 437576 276040 284881 43962 26908 107261 256186 -28696
16192 166410 56216 215262 83616 325561 298139 100554 309225 -173515 75061 258397
16182 258397 -16888 201966 161735 542799 145001 343749 129910 265463 18249 37242
16172 37242 146863 161812 191309 -143245 -100315 -60385 -82665 175021 62750 -26822 79119
16160 101286 -87444 50194 -186369 291554 37392 241712 296029 221803 211754 -127787 105700
16148 183483 64592 -10991 74915 76036 -190763 300430 437142 -202957 162742 159788 101409
16137 101409 -3410 107454 29436 34763 -39873 11576 90622 -73801 -178575 -161169 71621
16125H0768a99172a351j90643C32862d0699l24330J51416R3408A05277g000A74740
16113H7499B4829O2950R8851C7222i5496D68714D3462b3437m4149G0955L51728
16102D22683h053A83546Q3376a11823C06255j48668f8172A69640A8464J23639
16092A42103a9361B07962p491a93901f2069A23947n6779c25606f7809A83387c8285
16080c1265E9082a45563d5728B13871n8335o3148a5547j07961A88196q1452Q4936
16069A91680a05290B61837A26810c8381B85874l2784q2868b33563J03218O3924
16059f6421a9646A58173E5937K08233B2582K11660a05672L2192P053A18003j6486
16048A01517a05220e007A89961l6410d9781C22245a84270g2399I3466a33509B5100
$$ plain form
16125 80768 -199172 -1351 -191994 332862 -40699 -365029 -213613 -120205 105277 -7000 174740
16113 87499 24829 87779 186630 37222 -95496 468714 43462 -23437 -67586 70955 422683
16102 422683 -8053 183546 266922 -111823 306255 157587 -68172 169640 18464 142103
16092 142103 -19361 207962 200471 -193901 -62069 123947 67168 -325606 -67809 183387 -38285
16080 -31265 59082 -145563 -45728 213871 155536 92388 -15547 -123508 188196 106744 191680
16069 191680 -105290 261837 126810 -38381 285874 253090 170222 -233563 -130345 -66421
16059 -66421 -19646 158173 55937 264170 22582 234242 -105672 -73480 -66427 118003 101517
16048 101517 -105220 -5007 189961 153551 -49781 322245 -184270 -72399 93466 -133509 25100
16036a115m44q9870C01619j28601J79138a46173f7973C76626A67591q611a32744
16024e8231E6162J23719c11786D4268g0388A7784a8922H3728C5472P5844K054
16013A13370K31258a29397B3688g7765B8554K88210e3503C14202I1500b06130
16002A97984n0087K5639e1151a1700j4150A03678g603A81154d5729A81247b2895
15990B263L19041D2962L53344J12407k3796M15488N40296l15500k64921m07936
15980D52344A2550K44114a16054A13595J75237e5460G008a58155e4596a2985l7560
15969e0545j54682A74879L1597b2795A43361J82892b01821r378k42K8533A79813
15957f947q408j34810H0677k8754g1055I1240J4446b70550B2730d14663a16489
$$ plain form
16036 -1115 -1559 -91429 301619 173018 352156 -146173 -67973 376626 167591 158980 -132744
16024 -58231 56162 179881 -311786 44268 -70388 17784 -18922 83728 35472 111316 113370
16013 113370 344628 -129397 23688 -77765 28554 316764 -53503 314202 91500 -206130
16002 197984 147897 173536 -51151 -11700 -25850 103678 -7603 181154 -45729 181247 -22895
15990 2263 321304 42962 396306 508713 484917 900405 1440701 1125201 860280 452344
15980 452344 12550 256664 -116054 113595 288832 -55460 7008 -158155 -54596 -12985 -50545
15969 -50545 -205227 174879 206476 -22795 143361 326253 -201821 -211199 -211441 -182908 179813
15957 -6947 -15355 -150165 80677 51923 -71055 91240 105686 -270550 22730 -414663 -116489
15945B14429c33393a21844a7383A24466K5614E1217b24064n4641A7552a7374k80544
15934b97918E1208c05746b9043j26013H9887A946b90531C15201H987J49573o4956
15923I3604j3857a28319C35994a40879k02E0462l949J3874a79627A41383A1458
15911a05116p8682G4426c4279A73729d4040A77200G2958c77742g7973j08809b1499
15899B48508a20656k93208I6887a42676A96297J3193a3217l9700o1353L9435j6297
15888i1132I8667J0802L3932l9005L39987a40115q9678e5265C53505b09145n885
15877b15030F1965a28449D03206c75219c9689H8564c45725B7618K92107f224k07093
15866b13317A39226b30897A61591b43784K7871C5543f4049j40445A73285a85692
$$ plain form
15945 214429 -333393 -121844 -17383 124466 150080 51217 -224064 -278705 17552 -17374 -297918
15934 -297918 51208 -305746 -29043 -155056 89887 1946 -290531 315201 8987 158560 93604
15923 93604 79747 -128319 335994 -140879 -141081 50462 46513 60387 -179627 141383 11458
15911 -105116 -183798 74426 -34279 173729 -44040 177200 72958 -377742 -77973 -186782 -21499
15899 248508 -120656 -413864 96887 -142676 196297 209490 -13217 -52917 -114270 -74835 -91132
15888 -91132 98667 109469 143401 104396 444383 -140115 -229793 -55265 353505 -209145 -215030
15877 -215030 61965 -128449 403206 -375219 -39689 88564 -345725 27618 319725 -6224 -213317
15866 -213317 139226 -230897 161591 -243784 -215913 35543 -64049 -204494 173285 -185692
15855A42557a06637A08492l1110d6653j63257J0957F0362b89582a21892p3318
15845a95210Q5514j9418j36989M944A73667H5246c15245g7975j66191A66259M2083
15834B08342f9569j85129h4675c3435k8314G7819P5441a20620H8937l4280J1659
15823F6316J46944i2579H5095d54042a26553e3A38382C7294b22135C08750A11289
15811a15615c9072l83842F0823L51A5083a02618C3562j0082K42160h4719D8376
15799a29977F1333a11247j20324A50037b5986A04339L1533b71616A32199b04719
15788a74078G3676f3643j09401P2006A94045l1212B0911i687C2557a22117E2589
15776F162R2005a10849H9449J79041f3964l1824l50363a44316J5723A29119a37842
$$ plain form
15855 142557 -106637 108492 77382 -46653 -209910 -198953 60362 -289582 -121892 -195210
15845 -195210 -109696 -129114 -266103 -261159 173667 85246 -315245 -77975 -244166 166259 208342
15834 208342 -69569 -254698 -84675 -33435 -61749 77819 153260 -120620 88937 54657 66316
15823 66316 213260 -92579 85095 -454042 -126553 -53 138382 37294 -222135 308750 111289
15811 -115615 -39072 -422914 60823 61174 15083 -102618 33562 23480 265640 -84719 48376
15799 -129977 61333 -111247 -231571 150037 -25986 104339 135872 -271616 132199 -204719
15788 -174078 73676 -63643 -173044 -101038 194045 162833 20911 -9687 32557 -122117 52589
15776 6162 98167 -110849 89449 268490 -63964 -95788 -446151 -144316 -128593 129119 -137842
15764b88993B27009e9005G0081J35723l2098Q9779J03185a15404L6531A80264
15753A19612J61263n6899C1896q317J05174d6411j9709B02667e3495F0355J00220
15742A60575l071a40884c9151D9072c0512A38158J02108k8805a5932A01115H234
15730a3266k36911L2365K6932Q5449A76162D2554a13454j40555F6080N7694d00561
15718A25669b824k87709A43756h2961A40468c46989d7381k9825B8722c1634j97242
15707b28876I8347h909n9383A58799D2660K35346G6450c05160J40903j22410b764
15695a59516A91795H3011J15628D1841J0894F383i6697a8624N232F1019O6693
15684A27712C2358e1880j6437a1195k80734i1798A8579f3237l7630l8105m7481
$$ plain form
15764 -288993 227009 -59005 70081 205804 173706 263485 366670 -115404 -78873 180264
15753 119612 280875 223976 31896 23579 128753 -46411 -66120 202667 -53495 60355 160575
15742 160575 157504 -140884 -39151 49072 -30512 138158 240266 211461 -15932 101115 8234
15730 -13266 -250177 -217812 -190880 -105431 176162 42554 -113454 -254009 66080 123774 -400561
15718 125669 -2824 -290533 143756 -82961 140468 -346989 -47381 -77206 28722 -31634 -228876
15707 -228876 98347 -8909 -68292 158799 42660 278006 76450 -305160 -164257 -286667 -2764
15695 -159516 191795 83011 198639 41841 52735 6383 -96697 -18624 -13392 61019 127712
15684 127712 32358 -51880 -68317 -11195 -291929 -91798 18579 -63237 -100867 -138972 -186453
15673a86453B66907i1831G6266c75803a00457k04331D3144a85525A38870b77579
15662G5666K407K35088a48939m7922L4986M5343B80585b4557B60759A4550O3736
15651G8286a56557l8983j1618f4925K2493C5936J54417i997A70213B3861c0349
15639I7696B9033h0776K4848j26910A39220M0428b8008D9952Q4642k9797g9732
15627D8288a04710o0075B31950J30661m8751G1664b63744P2272L4742A2754K01154
15616B13908H5170j9701M8456D0792d2716a3135F1242e6253G3428J53319N7677
15605B84424b83961e6764q4312r1116B21021R6793a09760J7397k3009L1725A68506
15593H5241a04546A887c0505p9137j07360C6447b84821D3353a23672f956C93332
$$ plain form
15673 -186453 266907 -91831 76266 -375803 -100457 -304788 43144 -185525 138870 -277579
15662 75666 78073 313161 -148939 -196861 -161875 -116532 280585 -24557 260759 14550 78286
15651 78286 -156557 -195540 -207158 -64925 -42432 35936 190353 -9997 170213 23861 -30349
15639 97696 29033 -80776 -55928 -182838 139220 179648 -28008 49952 134594 104797 -79732
15627 48288 -104710 -164785 231950 362611 313860 71664 -263744 -191472 -156730 12754 213908
15616 213908 85170 65469 113925 40792 -42716 -13135 61242 -56253 73428 226747 284424
15605 284424 -283961 -56764 -141076 -232192 221021 317814 -109760 -92363 -115372 -83647 168506
15593 85241 -104546 1887 -30505 -109642 -217002 36447 -284821 43353 -123672 -6956 393332
15581C03749g6618B325b0845a0344j48456F3632f2725r4690e1264l04943a68580
15569a10199F3476J5613K4598a41066N6432l1118F2860a56859l54406H9641J84961
15558B74602b3125f897B5203J7463P6690J98731a32380a1393G7889C4777a25573
15546c88388a61235D2629K2091M9677K2595Q5752a2504n8978F6939P2636B4359
15534D3997J10152a29284r0964B579P1642J3947a11588g568j36149C2064d4721
15522a45587I5018a31607e1405o3190A35766c47510F11169G6387M57147A36533
15511B2113K5610P2894b693E0583A6249N492a29139B43286e6356G8438b14216
15499C11780b08371B76723p1778p2406F1499L21025A11041K73450A87628e517
$$ plain form
15581 303749 -76618 2325 -20845 -10344 -158800 63632 -62725 -157415 -51264 -356207 -168580
15569 -110199 63476 79089 103687 -141066 -84634 -115752 62860 -156859 -511265 89641 274602
15558 274602 -23125 -6897 25203 42666 119356 318087 -132380 -11393 77889 34777 -125573
15546 -388388 -161235 42629 64720 114397 136992 222744 -12504 -71482 66939 139575 24359
15534 43997 154149 -129284 -220248 2579 74221 88168 -111588 -7568 -143717 32064 -44721
15522 -145587 95018 -131607 -51405 -114595 135766 -347510 611169 76387 533534 136533
15511 22113 47723 120617 -2693 50583 16249 21741 -129139 243286 -56356 78438 -214216
15499 311780 -208371 276723 204945 132539 61499 382524 111041 384491 187628 -5517
15488C7684J02549L49750d9063j95737I8571J50a20337B19858a63028B24245J43546
15477C67791a62532J3790B33P88131k34843N5898K91404B87164L21258H6119b11949
15465c077j4892D8874g6943A45050a91716Q6938a7983A19687i4276B9190M2893
15454G2083M407J03179R684M1669E8785b3885A02820m7041J19525A5296a04132
15442C39460K32381q8792N33908M46499l19995n12744K14804B39557p2701d4371
15431a0888D9261A9917K41713c5697G6148c8657j47122m9245L9505E5859c88204
15419A54389o5106J21350G2558d3822a0431A19871K00496A7926M203d9121A00596
15407h6346r2929b6300f511p2501B9815d229j44853e1336A43226e1717A3321b11855
$$ plain form
15488 37684 140233 489983 -49063 -244800 98571 98721 -120337 219858 -163028 224245 367791
15477 367791 -162532 -148742 233 788364 553521 609419 900823 287164 608422 86119 -211949
15465 -3077 -17969 48874 -76943 145050 -191716 -104778 -17983 119687 -94276 29190 72083
15454 72083 76490 179669 189353 231022 58785 -23885 102820 55779 175304 15296 -104132
15442 339460 571841 483049 1016957 1463456 1143461 630717 845521 239557 166856 -44371
15431 -10888 49261 19917 261630 -35697 76148 -38657 -185779 -235024 -195519 55859 -388204
15419 154389 89283 210633 72558 -43822 -10431 119871 320367 17926 22129 -49121 100596
15407 -86346 -179275 -26300 -6511 -79012 29815 -4229 -149082 -51336 143226 -51717 13321 -211855
15394c9624D0121h6711B6088i0973d4781C3360J30451b67474E2873R9920a26362
15382b42273B22764a70330I4238g0725D87230a09228A1973L90697A89526j3220
15372A76306K05178m5605j37507b03066C95926j80040H0370M9121J62666b10423
15361B41582j01331i1662a0291m5752j15372C55431A22039c5719B55534A24781
15350a40370B0527L07845A36077D8542J93737p8370L3457K41836L0239B13749
15339A71479N4783M906L0077O059J67890i508A36589F8087J5976K41567q357A47118
15326B62516c4292A75117i5754C3803L60692r8341j38777C0632J20217a61722
15315A30176K3464g3908k9730C3514R1617e9301G1842J51229K21679a4322A15983
$$ plain form
15394 -39624 40121 -86711 26088 -90973 -44781 33360 163811 -267474 52873 152793 -126362
15382 -242273 222764 -170330 94238 -70725 487230 -109228 11973 402670 189526 176306
15372 176306 381484 335879 198372 -203066 395926 215886 80370 129491 292157 -210423
15361 241582 140251 -91662 -10291 -56043 -171415 355431 122039 -35719 255534 124781
15350 -140370 20527 328372 136077 48542 242279 163909 197366 439202 469441 213749
15339 171479 226262 231168 261245 267304 435194 -9508 136589 68087 84063 325630 317273 147118
15326 262516 -34292 175117 -95754 33803 394495 296154 157377 30632 150849 -161722
15315 130176 153640 -73908 -103638 33514 125131 -59301 71842 223071 444750 -14322 115983
15303D18253A11397a02357C7611a17481B08441a24632B58916I56J2250C453K01361
15292B04814A7528R3217d2210D5289L1953N3490j8081f5635F7941P5862K82349
15281D26152F887M18785f5045J3074j3356D45284a79839P5161A5160M0059J6618
15270G1837d1055H7466A3945a01873B80438a13743B23600a45018A1485a89313
15259d3530j45834A06176c7001C6881L61966h7711B88664b3807j75010A95501
15248b7932A12367A0533L4354J22996R0665N80941P16355K54148l48479L86117
15238A847630E15583B02061l3664a199B25996a34948A64131J28923e9981A74366
15227F8434a81790f0504l49386A11463b29424B76735A06807K2425a33932j55981
$$ plain form
15303 418253 111397 -102357 37611 -117481 208441 -124632 258916 956 13206 3453 204814
15292 204814 17528 110745 -42210 45289 77242 130732 112651 -65635 67941 143803 426152
15281 426152 6887 425672 -65045 -51971 -65327 445284 -179839 -104678 15160 55219 71837
15270 71837 -41055 87466 13945 -101873 280438 -113743 223600 -145018 11485 -189313
15259 -43530 -189364 106176 -37001 36881 398847 -87711 288664 -23807 -198817 195501
15248 -27932 112367 10533 44887 167883 258548 839489 1555844 1809992 1461513 1847630
15238 1847630 515583 202061 168397 -1199 225996 -134948 164131 293054 -59981 174366
15227 68434 -181790 -60504 -409890 111463 -229424 276735 106807 129232 -133932 -289913
15217b89913B22495c54A58821a83586R0638j52244B18364b03840B52076B9589
15206B55805d6345M63a9753C9162J66760c88807B50357e4354l44123G3687B7376
15194B9767a42876d4190C20465C5751B801L70182j56955A4444O9832K11306A8448
15182A47582M7232m0166e4580A88749d1480F2128K2092a02423B75033A8404K9279
15171D7683M8996a2815B2349c4098A93842b01152A43962n9364O6003A5727b81256
15159B39025E2129Q718B0868k022L25713n2417g617j18127B69595F9229J95658
15148B64887m1925a35875E4453J2573J36515N6135A03529l6588C1902R4154E2291
15136A78198b7295D04891A50161g382D7601K71794b3795E4696J0252O9789e0653
$$ plain form
15217 -289913 222495 -354 158821 -183586 -92948 -245192 218364 -203840 252076 29589
15206 255805 -46345 -45882 -19753 39162 205922 -388807 250357 -54354 -398477 73687 27376
15194 29767 -142876 -44190 320465 35751 2801 372983 216028 14444 84276 295582 18448
15182 147582 194814 154648 -54580 188749 -41480 62128 84220 -102423 275033 18404 47683
15171 47683 96679 -12815 22349 -34098 193842 -201152 143962 84598 150601 15727 -281256
15159 239025 52129 60847 20868 18846 344559 292142 -7617 -125744 269595 69229 264887
15148 264887 222962 -135875 54453 67026 203541 259676 103529 66941 31902 126056 52291
15136 178198 -27295 404891 150161 -7382 47601 319395 -23795 54696 64948 134737 -50653
15124f1230E4712M6110K34990a02179A09435K06699K3361q779q3925j4369D4715
15112E4149K60940b39796a9128B59490f5562E1460K08199f4435r211A53869J02271
15101B56140E1243J82468j6526I4900M30372b35366e2183B46545K4646d5366P209
15090c8157E0936K804a74127H158a23909A11573D2459b25231A36552K4880R5232
15079B56664O338p7088k9617J53589A45710n2023a4997B81025A3613a42008D8871
15067D61111A39576j3842N0619K04577j4300b7776A21009M5550Q5895J17365J06768
15056D76587B34471J79856j07805A04598K22619j47925N6784Q2288n6536j6599
15046B45229J05782B2399L16721i1431B56529J47941J27256J2328B40885Q2247
$$ plain form
15124 -61230 54712 100822 335812 -102179 109435 316134 339495 330716 246791 232422 44715
15112 54149 315089 -239796 -19128 259490 -65562 51460 259659 -64435 -73646 153869 256140
15101 256140 51243 233711 217185 94900 525272 -235366 -52183 246545 271191 -45366 -38157
15090 -38157 50936 53740 -174127 8158 -123909 111573 42459 -225231 136552 161432 256664
15079 256664 263002 185914 156297 309886 145710 93687 -14997 281025 13613 -142008 48871
15067 461111 139576 125734 176353 380930 366630 -27776 121009 166559 252454 369819 476587
15056 476587 234471 414327 306522 104598 327217 179292 236076 318364 261828 245229
15046 245229 351011 22399 339120 -91431 256529 404470 531726 544054 240885 323132
15036C23132K77853k60155K5418A64462P56393C63849J12572M7622L72213J21845
15026A018101m71792j2521L9674l6120m6311r0312K8712J52738J774k44223K14976
15015E54696j90861n0528j39185K32534K50566B20615M6198L69569A89076L66981
15005E56057k31757L5664A55566c0098C96143o9141H5254L81919j4864J01367
14995E53676j65671K27734A45216N89457j99641o6368L53154j86208B63402A17181
14984C69751L5950K51801q653n578L69049D02912K85890j19949M00561B90425
14973B37717F6297K97369J62743K9271J59827C42888b0108D20136A43352J17812
14963B61164J48399m0642j1079O0430Q899a10952E19763A95602J54154A607L84004
$$ plain form
15036 323132 600985 340830 366248 164462 920855 363849 476421 524043 896256 1018101
15026 1018101 546309 533788 573462 537342 491031 400719 429431 582169 583943 339720 554696
15015 554696 363835 313307 174122 406656 657222 220615 266813 636382 189076 556057
15005 556057 324300 359964 155566 -30098 396143 327002 85254 467173 452309 553676
14995 553676 388005 615739 145216 734673 535032 468664 821818 635610 263402 117181
14984 369751 405701 657502 648849 643271 1012320 402912 688802 568853 969414 290425
14973 237717 66297 363666 526409 555680 715507 342888 -20108 420136 143352 261164
14963 261164 409563 368921 357842 418272 427171 -110952 519763 195602 349756 1607 385611
14952C85611o9114K6705J77031R3319r2155L79839D20071P7300j48196R9787J24825
14941E73787n1549m202l3013h7418E41702j10999J64367n6518R5094k3092L11014
14930I21568o7712J74323j4608o87M21821J3839P1802K89231l66820R1750j25660
14919A408847k57605L75463M64237R2941m6586k88762k07137j41253k20860l69929
14909H09356Q0345E8682O32740j28458B56433L63124k69816R4968J08671k23868
14899C29512A22104J03078J92060A67631M31319P3467k51081a07939D45780j5114
14889D30666q8193M9686J39326o621l5988l6186L41395l15419K56758L9788J78645
14878I53857p4599L8772J6579C86981K84876C12411L9327m9648I4374M37963j45293
$$ plain form
14952 385611 316497 343202 520233 613552 521397 901236 420071 497371 349175 448962 573787
14941 573787 522238 518036 485023 -87418 541702 430703 595070 538552 633646 610554 921568
14930 921568 853856 1028179 1013571 1012884 1434705 1448544 1520346 1809577 1442757 1534507 1408847
14919 1408847 1151242 1526705 1990942 2083883 2037297 1748535 1541398 1400145 1179285 809356
14909 809356 889701 58682 691422 562964 256433 619557 349741 444709 553380 329512
14899 329512 122104 225182 417242 167631 598950 672417 421336 -107939 445780 430666
14889 430666 342473 392159 531485 524864 488876 452690 794085 478666 735424 775212 953857
14878 953857 879258 918030 934609 386981 671857 312411 351738 302090 94374 532337 387044
14867C87044J09157k8915J34540L76352j43393j7777l53878j98783Q8533J09177
14857D62057M9222m0493L8261M0869m2093J1157J8204m8193j07103O5763k2654
14846D24997R9991M5814K61438J16967J58427L14985k71627k96936L90079l76686
14836H67449l69807P7792j07887O2469M1865K11184C04291L12371r3321O076Q9235
14825F18652J6441k96765K37494k21044N39342k20084N0858M4063C80818M60412
14815H41230k9604R6536j80811l19772L76760j84310j59210n285K41741K78956
14805I56231j53410N879R9627k98547O4217N6334j56486k53637J15826K47418
14795F83452k5229l3659K9311J09039j58900J28215n7703k65527K91178C02117
$$ plain form
14867 387044 496201 467286 601826 978178 834785 817008 463130 264347 352880 462057
14857 462057 511279 470786 509047 549916 507823 518980 537184 488991 381888 447651 424997
14846 424997 524988 570802 832240 949207 1107634 1422619 1150992 854056 1244135 867449
14836 867449 497642 575434 467547 530016 571881 783065 304291 616662 523341 529417 618652
14825 618652 635093 338328 575822 354778 894120 674036 724894 768957 380818 841230
14815 841230 811626 908162 727351 407579 784339 600029 440819 435534 677275 956231
14805 956231 802821 808700 908327 609780 673997 730331 573845 320208 436034 683452
14795 683452 658223 624564 653875 762914 604014 732229 674526 408999 700177 302117
14784E00411m1566R6113q8941M7384O5547K88537K9222m07780K99448L040k8887
14773G62528R7529k22998j61532P9277j62080L15787l22327M0265K57670j36000
14763E48119A35431Q74110D57968K96066p1725j24842R1345K0589q1458K24016
14753H11959j08908j56577J07501n7666K6091j59094L59976B71857L59257j66658
14743D64456K04720N4890k96604K91108J36032j2806r7483M2350n4218N7397R5223
14732H85065l4516l24484M49210K43121K11060j4766J55385K30501m11267j2000
14722A377309j68045j32692K8547q5573D02220L40538M1686J97093m10278K56616
14712H27875o3199J69974j93500J4042K80897l33771K17058L06126j94511q8090
$$ plain form
14784 500411 458845 554958 466017 513401 578948 867485 896707 488927 788375 791415 762528
14773 762528 860057 637059 475527 554804 392724 708511 386184 426449 684119 548119
14763 548119 135431 1009541 457968 754034 682309 557467 648812 669401 587943 811959
14753 811959 703051 546474 653975 596309 622400 463306 823282 271857 631114 464456
14743 464456 669176 724066 427462 718570 854602 841796 744313 786663 732445 789842 885065
14732 885065 850549 526065 975275 1218396 1429456 1414690 1570075 1800576 1389309 1377309
14722 1377309 1209264 1076572 1105119 1019546 402220 742758 784444 981537 571259 827875
14712 827875 764676 934650 741150 755192 1036089 702318 919376 1225502 1030991 942901
14702I42901M66320K49666m6255L35216j75363l86882k46876p7682j68672l44650
14692E47723L4725L10248P1227J07869k49700l0379K40871q2169j98321L03908
14682A056002J08646j25787k31660K08915m37645K01461J0832j20593L04919J54878
14672A129968l88522L14375j79797j17688J43612p0786R0805j8680K56873n42487
14662F17673m9929M13155m9540K07339k29122K25241j57307J09389j54484j89099
14652G43316L94651K50926m45626J71041n0398J1718J29342l18208K94128j38728
14642A042162N2232L5264k7005o892K24601k41920N3901K14677m30990L11649
14632A227679L1130l20489K29832l1046j55648K49697n40836O11297l14766L97365
$$ plain form
14702 942901 1409221 1658887 1612632 1947848 1772485 1385603 1138727 1061045 892373 547723
14692 547723 582448 892696 963923 1071792 822092 791713 1032584 950415 752094 1056002
14682 1056002 1164648 1038861 807201 1016116 578471 779932 790764 670171 975090 1129968
14672 1129968 741446 1055821 876024 758336 901948 831162 921967 903287 1160160 617673
14662 617673 567744 980899 931359 1138698 909576 1134817 977510 1086899 932415 743316
14652 743316 1137967 1388893 943267 1114308 1063910 1075628 1204970 886762 1180890 1042162
14642 1042162 1094394 1129658 1102653 1095761 1320362 1078442 1132343 1347020 916030 1227679
14632 1227679 1258809 938320 1168152 1137106 981458 1231155 690319 1301616 986850 1384215
14622A384215m21308M40876j09903j39307J73213K44908l77242K83915k83800
14613A195567o5289N8684K466J76521M561o1837O3732J1460l8688r4130J08271
14602A361318J5608j1614K86556j62764j88662K04583R1000j50385j75458M66000
14592A736182o6248j29750r8831J62256o3275j69176j04385N23481k43072L8008
14582A585190L29824l13254O757o0629Q9769L66444q1458J33249l08574R9202
14572A846520j33748N58345l53223k21835J65895M35681k14489O2837J05333l949
14562B247367j7988J74737J05988l91763J81337L14296k0871L2548J19192O02407
14552C347250k17726Q21933J124460J376358L780247R614049J6298086R779763
$$ plain form
14622 1384215 962907 1403783 1293880 1154573 1327786 1572694 1195452 1479367 1195567
14613 1195567 1130278 1188962 1191428 1367949 1372510 1310673 1374405 1385865 1347177 1253047 1361318
14602 1361318 1376926 1365312 1651868 1489104 1300442 1505025 1596025 1445640 1270182 1736182
14592 1736182 1669934 1540184 1441353 1603609 1540334 1371158 1266773 1790254 1547182 1585190
14582 1585190 1915014 1601760 1608517 1547888 1637657 2004101 1922643 2055892 1747318 1846520
14572 1846520 1712772 2271117 1917894 1696059 1861954 2297635 2083146 2145983 2251316 2247367
14562 2247367 2229379 2404116 2510104 2118341 2299678 2613974 2593103 2625651 2744843 3347250
14552 3347250 3129524 3951457 5075917 6452275 10232522 19846571 36144657 45924420
14544D5924420B0828182G768582l860901j090009n09660K69442R16772R45922
14536D440148j318244j225174j94544N8183j77617M11991l98273L05456O08Q0538
14526A983072K28935j05452k46801M69969o8372l96884K46702m1515J37110p884
14516B198880o1408j40360M28453L19070j60448o04951N16720p9155L5419J29034
14506B581254J45535l92404K30772M0444q7415K28068j65326L67156j60947J68953
14496B956090p1097l594R7653n2771K97241l16983R1097K91841q4492J7243k65731
14485B956497K04288J70245P3184L61309k88261j09781O2261m0882L77484k9082
14475C737262k61625j1996K66633M616J04656m0582J11132M3738J91109j72938
$$ plain form
14544 45924420 20828182 7768582 3907681 2817672 2308012 2577454 3494226 4440148
14536 4440148 3121904 1896730 1702186 1760369 1582752 1994743 1596470 1901926 1902534 1983072
14526 1983072 2212007 2106555 1859754 2329723 2261351 1864467 2111169 2069654 2206764 2198880
14516 2198880 2137472 1997112 2425565 2744635 2584187 1979236 2495956 2416801 2452220 2581254
14506 2581254 2726789 2334385 2565157 2605601 2518186 2746254 2580928 2948084 2787137 2956090
14496 2956090 2884993 2881399 2979052 2926281 3223522 2906539 2997636 3289477 3204985 3222228 2956497
14485 2956497 3160785 3331030 3404214 3765523 3477262 3367481 3429742 3388860 3766344 3737262
14475 3737262 3475637 3463641 3730274 3734890 3839546 3798964 3910096 3953834 4144943 3972005
14465C972005J28005j87417L20165j10383L28781k1902n03934K28255M27673j74228
14455D407020M1327j70846J74110p9121r6817K92356j61005O79550K8496m67121
14445D647949N29430M9877n42482P87039k61192J77049j34286k33419O17844k42910
14435E394899J60812K35906Q3962J80044K88633k43389N86699m61833r3739L52067
14425F484061K07936K44344l03061L54592p6414M93833q5141K22124O2802L05544
14415G910620l39600k4891K86638j03670K44663L5595J32692J37382L59563O7943
14405H706935J38057M87486L70412l22177J24007j43998k8911L97629m1372J62859
14395I850927N2280L04952K54688J9577N78333K6636r0824J65152M40519K5479
$$ plain form
14465 3972005 4100010 3912593 4232758 4122375 4451156 4429254 3925320 4153575 4581248 4407020
14455 4407020 4448347 4277501 4451611 4372490 4275673 4568029 4407024 5086574 5115070 4647949
14445 4647949 5177379 5227256 4684774 5471813 5210621 5387670 5253384 5019965 5637809 5394899
14435 5394899 5555711 5791617 5875579 6055623 6344256 6100867 6687566 6225733 6131994 6484061
14425 6484061 6691997 6936341 6633280 6987872 6911458 7405291 7320150 7542274 7605076 7910620
14415 7910620 7571020 7546129 7832767 7729097 7973760 8009355 8142047 8279429 8638992 8706935
14405 8706935 8844992 9332478 9702890 9380713 9504720 9360722 9331811 9729440 9688068 9850927
14395 9850927 9903207 10208159 10462847 10482424 11060757 11087393 10996569 11161721 11602240 11627719
14385A1627719N92720j38877M35500J04696M40868J56803K56059K15587L13023
14376A4004098L2218N2001L76405J31406Q91574j05251j3441L64557L06432Q94908
14366A6934907n5399P56152L00790P5056L79223L91811M31399O08128K23796L64583
14356B0410446P58289J44333N90807K86989O65500N93634M80766M18975P82402
14347B5132141N58809R48939N60761R36124O26244P76918Q72056L50394J227677
14338C1990063P61836J080145M55701J396257J227342P22619J363899R37831J350412
14329D1286105J512751J289742J109554J431607K074422J641683J512974K318409
14321E4177247J767762K020891J871890K308170K104560K766874K700360K506791
$$ plain form
14385 11627719 12220439 12081562 12517062 12621758 13062626 13219429 13475488 13691075 14004098
14376 14004098 14036316 14088317 14464722 14596128 15487702 15382451 15369010 15733567 16039999 16934907
14366 16934907 16879508 17635660 17936450 18011506 18390729 18782540 19213939 19822067 20045863 20410446
14356 20410446 21168735 21313068 21903875 22190864 22856364 23449998 23930764 24349739 25132141
14347 25132141 25690950 26639889 27200650 28136774 28763018 29539936 30411992 30762386 31990063
14338 31990063 32751899 33832044 34287745 35684002 36911344 37633963 38997862 39935693 41286105
14329 41286105 42798856 44088598 45198152 46629759 48704181 50345864 51858838 54177247
14321 54177247 55945009 57965900 59837790 62145960 64250520 67017394 69717754 72224545
14313G2224545K463605L726898K716941L685325L649823L840395M404214M435871
14305A01147617M259463N072850N413799N754162N873861O308330O979668P012056
14297A47821806P876335P876486Q962058R293174J0209087J0512074J1492706
14290B14043726J2081214J2708679J3264460J4500765J4845317J5647395J6181590
14283C13273146J6810773J6847806J7316153J7559831J6886894J6272718J5140234
14276D30107555J4294746J2354156J0105408O747242J418087m252555j789329
14269D68985310J283852k260751m817782o329875j1091590j2270794j4090099
14262D19408271j6018716j6995916j7159193j7571484j7570570j6902448j6504287
$$ plain form
14313 72224545 74688150 78415048 81131989 84817314 88467137 92307532 96711746 101147617
14305 101147617 105407080 110479930 115893729 121647891 127521752 133830082 140809750 147821806
14297 147821806 155698141 163574627 172536685 181829859 192038946 202551020 214043726
14290 214043726 226124940 238833619 252098079 266598844 281444161 297091556 313273146
14283 313273146 330083919 346931725 364247878 381807709 398694603 414967321 430107555
14276 430107555 444402301 456756457 466861865 473609107 475027194 470774639 468985310
14269 468985310 470269162 468008411 463190629 456860754 445769164 433498370 419408271
14262 419408271 403389555 386393639 369234446 351662962 334092392 317189944 300685657
14255C00685657j6027145j5219866j4238183j3896834j3118702j2141562j1696348
14248B04347017r572118j0096179r841231r181741p929316q070455p291199o836786
14240A35527992o518784n969683n554344n375210n278630m613590m487752m387276
14232I3342723l626993l318925l893788l608350k679278l369294k855833k505427
14224F7484835k829400k249259j807258k379197j611137j829334k296486j756157
14216E0726607j769679j514658j249397j394057j377386j640164j369630j403668
14208C9007968n65915o83726r48566j406470j424978j026245j098107l98854l87342
14199C1067765j172275p98187j182341l83436r57013k80239m79119r38485o21963
$$ plain form
14255 300685657 284658512 269438646 255200463 241303629 228184927 216043365 204347017
14248 204347017 194774899 184678720 174837489 165655748 157726432 149655977 142364778 135527992
14240 135527992 129009208 123039525 117485181 112109971 106831341 102217751 97729999 93342723
14232 93342723 89715730 86396805 82503017 78894667 76215389 72846095 69990262 67484835
14224 67484835 64655435 62406176 60598918 58219721 56608584 54779250 52482764 50726607
14216 50726607 48956928 47442270 46192873 44798816 43421430 41781266 40411636 39007968
14208 39007968 38442053 37758327 36809761 35403291 33978313 32952068 31853961 31455107 31067765
14199 31067765 29895490 29097303 27914962 27531526 26574513 26294274 25815155 24876670 24254707
14190B4254707n72411o20440m13651k90897r82730j64280r26627k50437o32712
14181A9400522j27432l52831n92456p86259k59827k35350p5405m97973j47249
14172A6325740m71226k58793n41436l14572r3232l80128J15837o69073j09813
14163A3603304j07995k91363l35582j97317l42062k50866P926k58608l21602k59295
14153A1246540n4874l22059k42232K03555l23046q1835l81786j2349j98819O9092
14143I902187l14194j93681j83789k79457l01203J41753k45682j07687o5095j05183
14133H247969K7218k43475K26m70185r0265J96572Q6042j60837k53266j05085
14123G234914P7121l16525J68617n11088p9568n8437Q0211j95117J47174k56628
$$ plain form
14190 24254707 23682296 23061856 22648205 22357308 21374578 21210298 20283671 20033234 19400522
14181 19400522 19273090 18920259 18327803 17541544 17281717 17046367 16970962 16472989 16325740
14172 16325740 15854514 15595721 15054285 14739713 14646481 14266353 14382190 13713117 13603304
14163 13603304 13495309 13203946 12868364 12671047 12328985 12078119 12086045 11827437 11505835 11246540
14153 11246540 11191666 10869607 10627375 10830930 10507884 10426049 10044263 10031914 9833095 9902187
14143 9902187 9587993 9394312 9210523 8931066 8629863 8771616 8525934 8418247 8353152 8247969
14133 8247969 8275187 8031712 8031938 7561753 7471488 7668060 7754102 7593265 7339999 7234914
14123 7234914 7312035 6995510 7164127 6653039 6573471 6515034 6595245 6400128 6547302 6290674
14113F290674k8203r0578j19665j72029k64212J59983o9467r0883L42906m78809
14103E479717j26386L98328k46316k0730m03088j16002J25099k93968L57373k6619
14093E127408k69292J30530l62120L93873l02771p7470k66969J33185J50774j25356
14083D531792m84945n5918L98850j55801k27671J24289j65969N20101n88989K9035
14073C924774l54979L21472l09839M01977l08543J397J4339J6604K86715k64276
14063C729641k8813J26346p1641K7405o9474m6080k93597J14072j169p7913k55516
14052C153261L2854j15820J03454L927m82886M87305j56589P8688m70440J12605
14042B746359R5113K54392o43110R0063K47754J02101j28711l29021K71059o6779
$$ plain form
14113 6290674 6262471 6171893 6052228 5880199 5615987 5775970 5706503 5615620 5958526 5479717
14103 5479717 5353331 5751659 5505343 5484613 5081525 4965523 5090622 4796654 5154027 5127408
14093 5127408 4858116 4988646 4626526 5020399 4717628 4640158 4373189 4506374 4657148 4531792
14083 4531792 4046847 3990929 4389779 4233978 4006307 4130596 3964627 4484728 3895739 3924774
14073 3924774 3569795 3891267 3581428 3983405 3674862 3676259 3690598 3707202 3993917 3729641
14063 3729641 3700828 3827174 3755533 3782938 3713464 3667384 3373787 3487859 3486690 3408777 3153261
14052 3153261 3186115 3070295 3173749 3177676 2694790 3182095 3025506 3104194 2633754 2746359
14042 2746359 2841472 3095864 2452754 2542817 2790571 2892672 2763961 2434940 2705999 2639220
14032B639220j875O1167K07944o89176N91893k13127K05011l04436l9268j51984
14022B305369K73495l46541J16928J32780J2278m20329K48878K0644k8768l3924
14012B280810j5937j7916j3836l75591M2117l50485J84807J49396j87329K21678
14002A917714j94332K8722J15624l4934k89225K98152j76411m7895J07130k8900
13992A695645K12656J14119j33007O12904K127577Q378988J5820611J7892959
13984D6722452j8561349A3354980n973686k175683j241003m03321l87272k75100
13976B898915k8134k92374J47193m25935L5779J21591j89808j99230J87347m24054
13966A831290K75389m0974o1348k0513p3308l53917L84899j53062m1148j48737
$$ plain form
14032 2639220 2637345 2698512 2906456 2217280 2809173 2596046 2801057 2496621 2457353 2305369
14022 2305369 2578864 2232323 2349251 2482031 2494309 2073980 2322858 2343502 2314734 2280810
14012 2280810 2264873 2246957 2233121 1857530 1899647 1549162 1733969 1883365 1696036 1917714
14002 1917714 1723382 1752104 1867728 1832794 1543569 1841721 1665310 1617415 1724545 1695645
13992 1695645 1908301 2022420 1889413 2502317 4629894 13008882 28829493 46722452
13984 46722452 28161103 13354980 7381294 5205611 3964608 3561287 3174015 2898915
13976 2898915 2870781 2578407 2725600 2299665 2335444 2457035 2267227 2067997 2255344 1831290
13966 1831290 2106679 2065705 2004357 1983844 1910536 1556619 1941518 1788456 1747308 1598571
13956A598571M89891m67910Q4317P6595r4442j29780j196j03950M60021n92206
13946A319911M82771k24246k72210L29654n8162r1767j16143K69035n84262M16803
13936A471384j07475Q4499j30213L748K44587j23188j00299j36857N76591m11153
13926A371624j57659n4529K81663j75716j41396L61770J75228j75384J54877j27741
13916A512737k57115Q6108n8859l40463m3174M56787J62628m10413L5928K02725
13906A346889l55834L02015l66723K98049k84408R6448J07039M3393J79148j85267
13896A180749O2290j85142K7500J58956j45270L92629q8756m51035j54767K33502
13886A030656L0352L35235m42157J93435p0880J0787K70341k13809l48107J89457
$$ plain form
13956 1598571 2088462 1620552 1704869 1781464 1687022 1557242 1556046 1452096 1912117 1319911
13946 1319911 1802682 1578436 1306226 1635880 1577718 1485951 1369808 1638843 1054581 1471384
13936 1471384 1363909 1448408 1318195 1321943 1566530 1443342 1343043 1206186 1782777 1371624
13926 1371624 1213965 1159436 1441099 1265383 1123987 1485757 1660985 1485601 1640478 1512737
13916 1512737 1255622 1341730 1282871 942408 899234 1356021 1518649 1108236 1144164 1346889
13906 1346889 991055 1293070 926347 1224396 939988 1036436 1143475 1186868 1366016 1180749
13896 1180749 1243039 1057897 1085397 1244353 1099083 1491712 1402956 951921 797154 1030656
13886 1030656 1061008 1396243 954086 1147521 1076641 1087428 1357769 1143960 795853 985310
13876I85310j06487M05391l26455m38140N53757k76308O6694j11177K65703j62194
13866H56094J85431k52032P2846j29537K50265N4430o7837k97173K63869J40773
13856A077129m1062j340O833j84736m2162J79350m8439k05101J49729l66552K97552
13845H21201l9037J95059k95299K35510j75794O3522k37498M34104j15523j05636
13835G80609K50002l35778J9877J28676K40871m37569J06084o7980N8471P7348
13825H20611k09552j09557L04560o8526o1389J26052j53927L27591m33353K42776
13815G85286O4955j94872N4226L5127k00532K4090M01235m03913j27975N04802
13805I42429o4331n8663k01526K77543l96347K16252M6456k28942L2824O5132
$$ plain form
13876 985310 878823 1284214 957759 519619 1073376 797068 863762 752585 1018288 856094
13866 856094 1041525 789493 862339 732802 983067 1037497 969660 672487 936356 1077129
13856 1077129 1036067 1034727 1041560 856824 814662 994012 945573 740472 890201 523649 821201
13845 821201 782164 977223 681924 917434 741640 805162 567664 1001768 886245 780609
13835 780609 1030611 694833 714710 843386 1084257 646688 752772 684792 743263 820611
13825 820611 611059 501502 806062 737536 676147 802199 648272 975863 542510 785286
13815 785286 850241 655369 709595 744722 544190 568280 969515 565602 437627 942429
13805 942429 878098 819435 617909 895452 499105 715357 761813 532871 565695 630827
13795F30827k04718M62719k39862J90857A75926L55827L37322r0854q0221j33455
13785E64545L24323l76940J94673j2265B21615O96356j31374J0864P93r6387J55632
13774H57499k72354o0196N12505l62410j88442N7491L5562B11723L56374J1066
13764E79163J73162l56793K66998m055l24549M46376l89328L33294k76047l9409
13754D08812K4670L9217J84371K36927k34078j49495l8242m6085J5050r833J06098
13743E37412K18618C20232K13758R575j78419A47723L23744j51768L24923j10957
13733E33665n4794L0516k46759I6656O22173j86531r7416J89268J29q2277K89593
13722H31595a3341F66748B35922M96089k06226k8865M2355j60889j39135L13480
$$ plain form
13795 630827 426109 888828 648966 839823 175926 531753 869075 778221 698000 564545
13785 564545 888868 511928 706601 694336 221615 917971 786597 797461 798254 701867 857499
13774 857499 585145 524949 1037454 675044 486602 544093 579655 211723 568097 579163
13764 579163 752325 395532 662530 658475 333926 780302 390974 724268 448221 408812
13754 408812 433482 472699 657070 893997 659919 510424 472182 426097 441147 431314 537412
13743 537412 756030 320232 533990 543565 365146 147723 471467 319699 644622 533665
13733 533665 478871 509387 262628 96656 718829 532298 434882 624150 624279 542002 831595
13722 831595 -13341 666748 235922 732011 525785 496920 539275 378386 239251 552731
13712E52731B52511O9717n4089K2218M49221C17040J10908q6283O8141J07508
13702E17314j43065R7952G8267L83353k09491M23031G7869K72657J48609A25952
13691B90892E6499Q9683M41287B10811K90769A92568K22200K55195K8671j6304
13681F82330G5069L98603j65717J09910j75485J15767J37937f5424j9066D53363
13670E33018B49287L60197B16246M78849B60083N3280N004N1497A80586J46351
13660C26937J52420j09973j05238A08190L73193B02109d9456A72264K94299A68692
13649C92765D2056N24314c8759D10986j83558J69362G4642K93501A69129P19F6301
13637h7386C38413j41281e9063D00763A41378J95011J73143r8933n5335J72650
$$ plain form
13712 552731 252511 322228 268139 290357 739578 317040 427948 341665 409806 517314
13702 517314 374249 472201 78267 461620 252129 675160 77869 350526 499135 125952
13691 290892 56499 146182 587469 210811 501580 192568 414768 669963 698634 682330
13681 682330 75069 473672 307955 417865 242380 358147 496084 -65424 -84490 453363
13670 533018 249287 609484 216246 695095 260083 313363 318367 369864 180586 326937
13660 326937 479357 369384 264146 108190 481383 202109 -49456 172264 466563 168692
13649 392765 42056 566370 -38759 410986 227428 396790 74642 368143 169129 169848 66301
13637 -87386 338413 197132 -59063 400763 141378 336389 509532 410599 355264 527914
13627E27914m279B38498M1522n5127P093k9220L25635A57535Q1928E0616M78342
13616E28958j84033J80120j08674J44372k1915j43692p8818a74357D84067B39112
13605A01655a7410D82462k35172q4952e4682A17952J64832o6835Q3910E820L13467
13594C19287Q8192D7561K15432M1258p2778L3628L9979A27782L04897j4668O382
13583D24393A48647O6176Q4150J69195B15283Q8006J16128A10822P6873N9187
13573B46882m038K28084A84642K43193J06937A61002m4749J87278J79091j86243
13563B96379L3092j44110B1524J20109M29522B33147q46j02088N8126a7470D97542
13551D87693j17164j79016J22581j10865M2260J18456B5920L46912H3661P5988
$$ plain form
13627 527914 523635 238498 280020 224893 231986 202766 528401 157535 239463 50616 528958
13616 528958 344925 525045 416371 560743 538828 395136 316318 -174357 484067 239112
13605 101655 -17410 482462 247290 162338 -54682 117952 282784 215949 299859 5820 319287
13594 319287 407479 47561 262993 304251 231473 265101 305080 127782 432679 418011 424393
13583 424393 148647 214823 298973 468168 215283 303289 419417 110822 187695 246882
13573 246882 242844 470928 184642 427835 534772 161002 116253 303531 482622 296379
13563 296379 329471 185361 21524 141633 571155 233147 232301 130213 188339 -17470 497542
13551 487693 370529 191513 314094 203229 245489 363945 25920 372832 83661 159649
13541A59649F5767f7444A58228M4017p6678J11576J54724A9822K63741o0233r3082
13530A30248J73573C5564L29116F9258J52024H239J73295J03440j24358R7449
13520B58065j0127n3025d1105I2328F08K50994J64270p4145A20724J44988M498
13509B70210p6987H5865R0638P9737J41658j78824M1451a31055D51309j94009
13499B57300j7257j09553l8707C2016G325d8337n9402A5952J42432G3899K14874
13488B88773l6038j24353L581J73835n7743j10816e0768A87619R004J5614m9922
13477A62315k5903b3023D61585j98230R9533E4277P4405l0951J96087o7531K6004
13466B52291c25659C58451R7937A62433N5757I1939M7452J03758J86252C2698
$$ plain form
13541 159649 65767 -67444 158228 202245 125567 237143 391867 19822 283563 223330 130248
13530 130248 303821 35564 364680 69258 221282 8239 181534 284974 160616 258065
13520 258065 247938 194913 -41105 92328 608 251602 415872 341727 120724 265712 270210
13509 270210 193223 85865 176503 256240 397898 219074 260525 -131055 451309 257300
13499 257300 240043 130490 91783 32016 7325 -48337 -107739 15952 158384 73899 288773
13488 288773 252735 128382 131963 305798 248055 137239 -50768 187619 196623 212237 162315
13477 162315 136412 -23023 461585 263355 362888 54277 128682 97731 293818 226287 252291
13466 252291 -325659 358451 456388 162433 218190 91939 139391 243149 429401 32698
13455C20896k9046K31371h5694A56188p4699k411J65166j20194l5009J30949O7445
13444B87435E9410c5356H5833L2327J1791J30053J58942i6274A74026K373K56814
13433D33213A57459J74273R8513L6879H6776J24774p9057o5977a03422c369C10517
13421H8578a93883d2882H4726J49985F8891J74932a27284D70223j51371o5139
13411B53713J5697c08960A41562b0960A03566a95128H9844K04613r963c42582
13400A51739K38886A43444o4968a45514b8003F8964q27N39360B09814f2489A09057
13388a75109E6853K60183a01900j11960j15802B78416b3009B82555b25918A1654
13377C47925n831O9729A09291J67522B6447a4421D5820a12629B52593l6833O3112
$$ plain form
13455 320896 291850 523221 -85694 156188 81489 79078 244244 124050 89041 219990 287435
13444 287435 59410 -35356 85833 118160 129951 260004 418946 -96274 174026 176399 433213
13433 433213 157459 331732 430245 467124 86776 211550 132493 66516 -103422 -3369 310517
13421 88578 -193883 -42882 84726 234711 68891 243823 -127284 470223 318852 253713
13411 253713 269410 -308960 141562 -20960 103566 -195128 89844 294457 284494 -342582
13400 151739 390625 143444 78476 -145514 -28003 68964 68137 607497 209814 -62489 109057
13388 -175109 56853 317036 -101900 -213860 -329662 278416 -23009 282555 -225918 11654
13377 347925 342094 411823 109291 276813 26447 -14421 45820 -112629 252593 215760 278872
13366B78872l8343I2726m1814L5904M61845a35310A63216J02628G9751J77306
13356B57057l0905D6323J71398A8779K68091J20640A26898J54940G3172J24195
13346A97367P2750A29526J27139j18143J6323J10241K33741J04143B10598K29694
13336D40292L35696A04247J60862d1164C65575j55846l3925K44977j74502A7627
13325h0484A90905K26961j85361L4931A29537O4510K22466e2208E3801J0654k3448
13314D1007L89783j63310F3462b0582B08468p1466M6949F9778K48713h2114D02143
13302A9836L19593b4878k02174A99995G449L95589A97901C7610A1127L7643R3571
13291A42341D1819P8707k240b21162C91312q5967c72288A9154i2072A25253f593
$$ plain form
13366 278872 240529 92726 50912 86816 548661 -135310 163216 265844 79751 257057
13356 257057 226152 46323 217721 18779 286870 407510 126898 281838 73172 197367
13346 197367 270117 129526 256665 138522 154845 265086 498827 602970 210598 440292
13336 440292 775988 104247 265109 -41164 365575 209729 175804 420781 246279 17627
13325 -80484 190905 417866 232505 267436 129537 194047 416513 -52208 53801 64455 41007
13314 41007 430790 267480 63462 -20582 208468 137002 183951 69778 318491 -82114 402143
13302 19836 339429 -24878 -227052 199995 7449 403038 197901 37610 11127 48770 142341
13291 142341 41819 120526 118286 -221162 391312 305345 -372288 19154 -92072 125253 -6593
13279a979C2031j2028K80592a02078c5173B36253h9160B64287n2594C663J1640
13268A5303L08111c5688k37244C28470A53871c4356G5827l6608J85384j12198
13258A12405a32665C41638c7208J7950C49525a35907a2755r9123A46841F775i5019
13246A34967L7890E6564L54428b08081A14067a56288C54473P4163A71879A7726
13235a6355C01430I2795i2928o3075B43671H0934l5577K59289e11161J55273A82859
13223B61376c77618C37362a6475B37180a32870A70898c7321o9182E9440g5411
13212A3768J6632M1690i5693I8893c9748b729I5543N7577A4208K14891j10195
13201A18904C3605J0205J48460e3333D03754a72278A44168O9665B0015N4691a02552
$$ plain form
13279 -1979 32031 20003 300595 -102078 -35173 236253 -89160 264287 211693 3663 15303
13268 15303 323414 -35688 -272932 328470 153871 -34356 75827 39219 224603 112405
13258 112405 -132665 341638 -37208 -19258 349525 -135907 -12755 -111878 146841 6775 -95019
13246 134967 172857 56564 410992 -208081 114067 -156288 354473 428636 171879 17726
13235 -16355 301430 92795 -92928 -156003 243671 80934 45357 304646 -511161 -355888 182859
13223 261376 -377618 337362 -16475 237180 -132870 170898 -37321 -106503 59440 -75411
13212 13768 30400 72090 -95693 98893 -39748 -2729 95543 153120 14208 229099 118904
13201 118904 33605 43810 192270 -53333 403754 -172278 144168 213833 20015 74706 -102552
13189g3137A47846O7051n9561C1983c5521A11628m3090M0478P6561a52746d5031
13177b7388B26788h3277K5313j08175A88581A5570J10177J73165M5284a51934
13166F5562r922a74172E5624J73418f4648J01I3420g5335a4784m9001A93294d2853
13153C5925J11569l626e6913A21326K8413g2554A34541P1426l9441b3692B37070
13141c36178c1250A86373c2436A62799n4045C5280O6430c2555C23239E4209B2607
13129D9433R3596J10236j2129J85537A91447g5579A01058k5537a34688K2899J5874
13118i5915B6597a40546B3622O0408g5631A45315b4972A45426o8650N4097c070
13106H2310J34224a36368B9912K77234G9806K03063P8566G6145c7703k06445H5852
$$ plain form
13189 -73137 147846 214897 155336 31983 -35521 111628 68538 109016 185577 -152746 -45031
13177 -27388 226788 -83277 -57964 -166139 188581 15570 125747 298912 344196 -151934
13166 65562 55640 -174172 55624 229042 -64648 -64547 93420 -75335 -14784 -63785 193294 -42853
13153 35925 147494 143868 -56913 121326 149739 -72554 134541 205967 166526 -23692 237070
13141 -336178 -31250 186373 -32436 162799 108754 35280 101710 -32555 323239 54209 22607
13129 49433 143029 253265 241136 426673 191447 -75579 101058 75521 -134688 -111789 -95915
13118 -95915 26597 -140546 23622 84030 -75631 145315 -24972 145426 76776 130873 -3070
13106 82310 216534 -136368 29912 307146 79806 282869 361435 76145 -37703 -244148 85852
13094C44951d2581A47478M3714b31704e6659A38957k1104n7580a4892k77444A99879
13082A2138a12703C2307a60190A62183p8053A1819c2391B44388R3722b1398f965
13070B22177I7164J06007a15687b7495k29689G8713K50645c32833E3432O7154
13060A20586B4583K2204J36315E560d7300B57967a67994a6531A42731b70461B89770
13048I7059d4912k2721p3088A77007b8881j09338D7091M43015E952b02664B03194
13036a6850A34771j0720M5398m4302L7784c6470B45341e9470A36573l0108m5060
13025F1405K2632j2672R3224G1737d4864l0953D18337E9187Q0914J14659a0909
13013g4443A2068a00001K4130G7449J2382a13264E4605N8427J01730a97566J1918
$$ plain form
13094 344951 -42581 147478 191192 -231704 -56659 138957 117853 60273 -14892 -292336 199879
13082 12138 -112703 32307 -160190 162183 84130 11819 -32391 244388 338110 -21398 -6965
13070 222177 97164 203171 -115687 -27495 -257184 78713 329358 -332833 53432 120586
13060 120586 24583 46787 183102 5560 -47300 257967 -167994 -16531 142731 -270461 289770
13048 97059 -44912 -67633 -140721 177007 -28881 -138219 47091 490106 5952 -202664 203194
13036 -16850 134771 124051 169449 125147 162931 -36470 245341 -59470 136573 106465 61405
13025 61405 84037 71365 164589 71737 -44864 -75817 418337 59187 140101 254760 -10909
13013 -74443 12068 -100001 -75871 77449 89831 -113264 54605 113032 214762 -197566 -185648
13002a85648f7682o8965A19202J76084G2311J68869B2603K68134a75650A48653
12991a68794G2257b30890D0778J33514J03160o417h5705o4296B07028k6679E3121
12979a97911A75416m0019a84337g7840L7222A90280J17361m0606F1122M05775
12969D66897d954C01447m0682A28370J26252d0860A47901c19369B1112a89200
12958G832c21541d6155H3583k3275J76730I1780L49680B16221a69121L248C0238
12946b61137l1719A39673b69794p228G4111N2499J01072d3506B24130B8654L86852
12935D15506g4996B04581j0807H479K89049a10284A89189F7211R9122g4581J0568
12924f4013B29750I3466J06697H337K7559J36778D0979b06099C0154J53728C0475
$$ plain form
13002 -185648 -67682 -136647 119202 295286 72311 241180 22603 290737 -175650 148653
12991 -168794 72257 -230890 40778 174292 277452 271035 -85705 -150001 207028 180349 53121
12979 -197911 175416 135397 -184337 -77840 -40618 190280 307641 267035 61122 466897
12969 466897 -4954 301447 260765 128370 254622 -40860 147901 -319369 21112 -189200
12958 7832 -321541 -46155 83583 60308 237038 91780 441460 216221 -169121 -165873 30238
12946 -261137 -292856 139673 -269794 -277022 74111 126610 227682 -43506 224130 28654 415506
12935 415506 -74996 204581 193774 8479 297528 -110284 189189 67211 166333 -74581 -64013
12924 -64013 229750 93466 200163 8337 35896 172674 40979 -206099 30154 183882 30475
12912f9298j764n8473A0896N0834L7033a03208c7184m8483A6495a52108i133A89904
12899h6730A54212f4005k81514i2220H0693b6048Q168j02600B55185a19898A45600
12887A20539O834e2107A95513n2747b43117d1538r9396k8575E7565a03218M3976
12876e9242B62624i2268j93240g4545A9766J21993l9266a0628E1137e4558m2197
12865i6755C02417g0056K8086F4605b70188I7256p061B5487L75074A48852F5395
12853B53347b44641J09570o711e5120B28072e3802K0383m977o8264k6534e0544
12841G4336f5301k23478a28500A61234a12459a0737B2578c98393e3214B8850h6675
12829D9007b34343J10909j2365C12703E1466J10250b84827F5689f5275A70950
$$ plain form
12912 -69298 -71062 -129535 10896 61730 98763 -103208 -37184 -85667 16495 -152108 -9133 189904
12899 -86730 154212 -64005 -345519 -92220 80693 -26048 -17880 -120480 255185 -119898 145600
12887 120539 127373 -52107 195513 142766 -243117 -41538 -140934 -169509 57565 -103218 -59242
12876 -59242 262624 -92268 -285508 -74545 19766 141759 102493 -10628 51137 -54558 -96755
12865 -96755 302417 -70056 -41970 64605 -270188 97256 90195 25487 400561 148852 65395
12853 253347 -244641 -135071 -141782 -55120 228072 -53802 -33419 -38396 -106660 -133194 -50544
12841 74336 -65301 -288779 -128500 161234 -112459 -10737 22578 -398393 -53214 28850 -86675
12829 49007 -234343 -123434 -135799 312703 51466 161716 -284827 65689 -65275 170950
12818D434e101H6626a98175B8403b15310g2336l00910M0979F4661i342k3009j72243
12806b04594H1920R737a53082r9458O2186E7521d52359j04549b07779c3426j8966
12795e2392b2581l26641f2051j93612B17808A6331b22619g9623l6597k0269j47105
12784b83594k7810Q304a33529B28728J1967c09854c1901H1448c3145m43060b33
12772B08019A8234L37705A19263j8616h1354A04527B6032g2058A60556c34842
12761a19216a5234j42857A28826a0907I8179a48331A89718J48261f8068A44155
12750A79956f027j33878L1954M7960G7296g3425A98086J10569b44965L1892R7330
12739a15743E1496P3949O5357I1171j6493k6258J46877l6213b26875M1921E3083
$$ plain form
12818 4434 -5101 86626 -198175 28403 -215310 -72336 -373246 -332267 64661 -9342 -32351 -204594
12806 -204594 81920 91657 -153082 -252540 -190354 57521 -452359 -556908 -207779 -33426 -52392
12795 -52392 -22581 -349222 -62051 -255663 217808 16331 -222619 -79623 -116220 -136489 -283594
12784 -283594 -311404 -303100 -133529 228728 240695 -309854 -31901 81448 -33145 -476205 -233
12772 208019 18234 355939 119263 100647 -81354 104527 26032 -72058 160556 -334842
12761 -119216 -15234 -158091 128826 -10907 98179 -148331 189718 337979 -68068 144155
12750 179956 -6027 -139905 -107951 -59991 77296 -73425 198086 308655 -244965 -213073 -115743
12739 -115743 51496 125445 190802 91171 74678 48420 195297 159084 -226875 -184954 53083
12727B1674a20879j14361D01856E6848f4367A81070b3827B81372B4072h4214A22090
12715F0237K47253b42655l5165d191C01512a3259A82734L97981d75569A20716
12704F778O3042O8970l9493j1389C2510O724d1007k44509A69446F6403J94764
12693B61167j25665i501B44756F4204f4114K1698C38531b89010G8652d8561j89725
12682b38286c8431D1492a02535C88031J7808c35188B6649K4903K22040Q2177i6332
12670b49402B83454D969L04169E1506K26709d6394o4539D3190Q1215J36121A20268
12658B27501j09571J02934J3171p4268J24463B7536L10667F8422J57094n9779
12648A65737A1776J77468i0837B688a27784p4428j4710I4155A0964L48564m1485
$$ plain form
12727 21674 -120879 -235240 401856 56848 -64367 181070 -23827 281372 24072 -84214 122090
12715 60237 307490 -242655 -277820 -4191 301512 -13259 182734 580715 -475569 120716
12704 6778 69820 138790 99297 87908 32510 39234 -41007 -285516 169446 66403 261167
12693 261167 135502 -9501 244756 64204 -64114 -42416 338531 -289010 78652 -48561 -238286
12682 -238286 -38431 41492 -102535 388031 405839 -335188 26649 51552 273592 355769 -96332
12670 -249402 283454 4969 309138 51506 278215 -46394 -110933 43190 124405 260526 120268
12658 227501 117930 220864 234035 159767 284230 27536 338203 68422 225516 165737
12648 165737 11776 189244 -90837 2688 -127784 -202212 -216922 94155 10964 359528 318043
12637C18043A16344E1477J64212Q3267O6172A61719J44335c1076C39141Q3121
12627D22262k04903E0699b27024g4645A74440i5330B28013a21901A55622C3353
12616B24715H233g4352A45191a03414L7749c1849F5360c8012K995F2624c125A79245
12603B97310j34968a55469m8228F3326e6985B91181A12619c2961A44669b56646
12592A27389E2728d6387D7817J6014R4106K28074a86468B49454a65041j1207q4445
12581b60693k5954c5917A66562E8855b82297R0098N0107B32864b29154B88628
12570a90770j32188D6738c9568n734m7261A9059a06885I1358d0920n4787M137
12559i1570n4944A77381h956I4733l3563i6702k6987B29325a90704A67322h2359
$$ plain form
12637 318043 116344 51477 215689 298956 365128 161719 306054 -31076 339141 422262
12627 422262 217359 50699 -227024 -74645 174440 -95330 228013 -121901 155622 33353
12616 224715 8233 -74352 145191 -103414 -65665 -31849 65360 -38012 -35017 62624 -3125 179245
12603 297310 162342 -155469 -203697 63326 -56985 291181 112619 -32961 144669 -256646
12592 127389 52728 -46387 47817 63831 157937 386011 -186468 249454 -165041 -176248 -260693
12581 -260693 -286647 -35917 166562 58855 -282297 -192199 -142092 232864 -229154 288628
12570 -190770 -322958 46738 -39568 -45302 -92563 19059 -106885 91358 -40920 -95707 -91570
12559 -91570 -146514 177381 -8956 94733 61170 -96702 -123689 229325 -190704 167322 -82359
12547b6092B34062b02622A27939J65197d0494J1206C3563J14160C1304a34086
12536e5736J9082j31942L0902N2483m19566a0670j21467B84569a85931H3034h3942
12524A24388a33938C08078j42669a33600A6936a31888c8917A51078D9991a94151
12513G9565O8279l144N8579c7252M970A89772M7413H8872a09352A28837J68323
12502B97160j30099b24449g977j05418B7002b65117A76960B6564G79e6850R885
12491d6965C3611N1891b2543C77650q2484K79126F4896M907J35064G3830b8485
12479a3161C79812j82532c22989a48256D5912M8659J28580a99084c4391m05388
12469d39779a85879C72478A8435F831a07393n0773f2948I4814b44231C05817A27848
$$ plain form
12547 -26092 234062 -202622 127939 293136 -40494 -29288 33563 147723 31304 -134086
12536 -55736 -36654 -168596 -137694 -85211 -504777 -10670 -132137 284569 -185931 83034 -83942
12524 124388 -133938 308078 165409 -133600 16936 -131888 -38917 151078 49991 -194151
12513 79565 147844 144700 203279 -37252 -32282 189772 237185 88872 -109352 128837 297160
12502 297160 167061 -224449 -7977 -113395 27002 -265117 176960 26564 779 -56850 -46965
12491 -46965 33611 85502 -22543 377650 295166 574292 64896 69803 204867 73830 -28485
12479 -13161 379812 197280 -322989 -148256 45912 94571 223151 -199084 -34391 -439779
12469 -439779 -185879 372478 18435 6831 -107393 -158166 -62948 94814 -244231 305817 127848
12457D2874J22219M6867h5360C4840J5424e9450n4352K875j6595e7273j02879
12446a60152p8706M5623K1753e1047J2992e549l1496j71745D9201f3111B80360
12434C6373a83319P3537A14232m7772O4088J6917b2045m09610a94262A90803b16045
12422A31450b07852N0049M1790j11720f2542D3224A1459f7356p9786J0178A66183
12410A40103J07223C3437K2707n281K96115c65227J42474R9323I366e5044A43217
12398G3690b93978d692j86825k41229a82905A16389b53937D8910K0430a60978
12387C17882A39356K9139J57920k744b54470E3905A9574a9818B59241r6042p0409
12376I2790a15041q0526h0403A05645O4248b41577a4037B38711i4426j6425E180
$$ plain form
12457 42874 165093 211960 -85360 34840 50264 -59450 -113802 -110927 -127522 -57273 -160152
12446 -160152 -238858 -193235 -171482 -51047 -38055 -5549 -37045 -208790 49201 -63111 280360
12434 36373 -183319 -109782 114232 66460 130548 147465 -22045 -431655 -194262 190803 -216045
12422 131450 -207852 -157803 -116013 -227733 -62542 43224 11459 -67356 -147142 -136964 166183
12410 140103 247326 33437 56144 50863 346978 -365227 -222753 -123430 9366 -55044 143217
12398 73690 -293978 -4692 -191517 -432746 -182905 116389 -253937 48910 69340 -160978
12387 317882 139356 168495 326415 323671 -254470 53905 19574 -19818 259241 163199 92790
12376 92790 -115041 -195567 -80403 105645 169893 -241577 -14037 238711 -94426 -110851 5180
12364b46847L3451g2610A097J29516L2635e7384k19985A12895c46839J68213A86955
12352b825j0015A45167D0526J58557b14874H9206J15366b1876j06070A46980a67416
12340i8009H1937R8320a9946C09208R177A51767d9306C93969A08003K81027M0762
12329D29792a25892j98158B28109R607L7470j09869g0159I8637K25255a07204
12318G019J24924K32575A33420m2117C5608L8189C4599K8458a14599A78410q0270
12307I8140J20393r6531b6454p4573E4038b9981l1807E4678L5246g3795a5224
12295A62494b5430I5865L674m5597P1365i6584A4468O9081J60606m1688c724B55425
12282B00690Q1883D1115J53177b10518A92225J00321C8669K43968o1096G7871
$$ plain form
12364 -246847 -213396 -72610 1097 130613 163248 -57384 -277369 112895 -346839 -178626 186955
12352 -2825 -12840 145167 40526 199083 -214874 89206 204572 -21876 -127946 146980 -167416
12340 -98009 81937 180257 -19946 309208 318385 151767 -49306 393969 108003 389030 429792
12329 429792 -125892 -324050 228109 237716 275186 165317 -70159 98637 323892 -107204
12318 7019 131943 364518 133420 91303 35608 73797 34599 63057 -114599 178410 98140
12307 98140 218533 122002 -26454 -101027 54038 -29981 -61788 54678 89924 -73795 -15224
12295 162494 -25430 95865 99539 53942 125307 -96584 14468 83549 244155 202467 -3724 255425
12282 200690 282573 41115 194292 -210518 192225 292546 38669 282637 221541 77871
12271A97216P3478q3531N6498q3191p602L0887a39221A04924d9360H9477L4266
12260A23743M41640b7996A63448K5223a18569E3502a28327A13072Q712e7727A49690
12248h9275B33827q1803L04532k11796n4196H8362c95063c0435B04479R9110F3938
12236B25278K6595C785M91113j68206H2860i2531k8112B75427F3237h4284r19
12225h5203A31542F1961J37897J48840k8409L7959m8613j3386J75021q2287p1244
12214C17739l9996j17187L55295r2737A91646d4255G6674J28016q272a64255A37429
12202D4475L77752H4497J97315Q5258A2995J66429B5912L14934B4148L25344J1049
12191C60541K34777j2882B72140O4082j29792J95457j27706b22522E5852j1789
$$ plain form
12271 197216 270694 187163 243661 160470 152868 183755 -139221 104924 -49360 89477 123743
12260 123743 565383 -27996 163448 188671 -118569 53502 -128327 113072 121784 -57727 149690
12248 -89275 233827 152024 456556 244760 190564 88362 -395063 -30435 204479 303589 63938
12236 225278 251873 3785 494898 326692 82860 -92531 -120643 275427 63237 -84284 -85203
12225 -85203 131542 61961 199858 348698 320289 358248 309635 296249 471270 388983 317739
12214 317739 277743 160556 515851 423114 191646 -44255 76674 204690 196418 -164255 137429
12202 44475 422227 84497 281812 367070 12995 179424 25912 340846 24148 349492 360541
12191 360541 595318 582436 272140 336222 206430 401887 274181 -222522 55852 44063
12181D4063K18758F9242J8878R1390G4837a13523A97589q5723J33760l8428K25748
12170D32946G8281K11025K15175j99226K33879A66463n270J50122K747j2188A24992
12158a9300D02450b07768C71413j03393b7640C84219A80417a28706B91396h8956
12147I7073K40695D7358B2445b07466A83893J29558I7157b29316O8957j47030
12137c07389B34284a59138A88701L3911o0552J71531a13169B57372j02410D3881
12126A56892J39690l5554J73741A30432b53594I3056d7732J4943E18075c3775
12115B05699a68791B88030a572B01384r8029l0288Q3063B8314O1545b34357C20275
12103A57981E2582O5051c6057r6588D41631B3718a0145H039J92596I4983J3613
$$ plain form
12181 44063 262821 69242 88120 179510 74837 -113523 197589 111866 245626 207198 432946
12170 432946 78281 289306 504481 305255 539134 166463 161193 311315 314062 301874 124992
12158 -19300 402450 -207768 371413 268020 -27640 384219 180417 -128706 291396 -88956
12147 97073 337768 47358 22445 -207466 183893 313451 97157 -229316 -160359 -307389
12137 -307389 234284 -159138 188701 222612 162060 333591 -113169 257372 154962 43881
12126 156892 296582 261028 434769 130432 -253594 93056 -47732 -32789 518075 -33775
12115 205699 -168791 288030 -1572 201384 103355 73067 156130 28314 89859 -234357 320275
12103 157981 52582 117633 -36057 -132645 441631 23718 -10145 8039 200635 94983 108596
12092A08596M4606a44599B53905K0675F4288a64318f476A72148o7949a38470B55580
12080b94873i0343A26202B1126K42225J679G7492J18270a40667M3470B66213d63145
12068E7061N3784D4212K79925m5915a13965r6113j03898L5696d4291B05429R3876
12057B99305a18424I7444M8457c01863B3140a7441j8543n7644I3265a04494A89698
12045a67890h1637m7552L739c6463B90317F6351d572B60586a1442m23342a01979
12033a7120G8161A888f8112D3088a55554N2903L8275k01000J07257d2036j19741
12022a61777I0392c0419m15666A81497e146G5038C0091A1127K58048R4328E1361
12010c31761J06730J02181B0306K24669a30155A56419i7290a4229C43440C5421
$$ plain form
12092 108596 153202 -144599 253905 274580 64288 -164318 -6476 172148 104199 -138470 255580
12080 -294873 -90343 126202 21126 263351 265030 77492 195762 -140667 -97197 266213 -463145
12068 57061 110845 44212 324137 278222 -113965 -210078 -313976 -278280 -44291 205429 299305
12057 299305 -118424 97444 145901 -301863 23140 -17441 -35984 -93628 93265 -104494 189698
12045 -167890 -81637 -129189 -125450 -36463 290317 66351 -4572 260586 -11442 -434784 -101979
12033 -17120 78161 1888 -68112 43088 -155554 -102651 -64376 -265376 -158119 -42036 -161777
12022 -161777 90392 -30419 -446085 181497 -5146 75038 30091 11127 269175 363503 51361
12010 -331761 -225031 -122850 20306 244975 -130155 156419 -97290 -14229 343440 35421
11999G4126a60713M0810I4867d10720d387j1448B8265L43642c09694h2690E6986
11987e1634G751N1807a34442F8757K11637g2611K3694j04549D828K80476i4012
11975a13027A02540l3676b2061E2776j8385q920J81960d32667J29236D6008M9982
11964I5990g9489B24999K10638A4915a96859A80138p0229a4265A08129b68009
11953D0394c7261B09012a45576j35566A64868E9825a8498G982K55553a67802f3306
11941g4679L3166A35577a18486A31654K3541h4267j44446g7404Q929k18579i0632
11929B38798d4238F7725c48279A14793a73935D12567a21468l2799b9119p5536
11919a04655G3845K867a55892H4947a65521A96548a89016K0045A14206K93816
$$ plain form
11999 74126 -160713 -119903 94867 -410720 -4387 -15835 28265 371907 -309694 -82690 56986
11987 -51634 7751 59558 -134442 68757 280394 -72611 -48917 -153466 4828 285304 -94012
11975 -113027 102540 68864 -22061 52776 34391 25471 207431 -432667 -303431 46008 95990
11964 95990 -79489 224999 435637 14915 -196859 180138 109909 -14265 108129 -268009
11953 40394 -37261 209012 -145576 -281142 164868 59825 -18498 7982 263535 -167802 -63306
11941 -74679 -41513 135577 -118486 131654 155195 -84267 -228713 -77404 -68475 -287054 -90632
11929 238798 -44238 67725 -348279 114793 -173935 412567 -121468 -154267 -29119 -104655
11919 -104655 73845 76712 -155892 84947 -165521 196548 -189016 -168971 114206 408022
11909D08022h8250M1747l04666h7295A73504b33327B51243K7648A01747h8037
11898e6786a6515B17612a69656e81p1993p9362j67303h8785j13412A23a60705
11886D6833a897j00376H607J06353a85246K6385A47158a00384k2407j97014R1846
11875b27959q6187a01347k1060L2600o5675k20707O7717a32818d3790A71202c2027
11863A33541a29389C26106a84572h1722A2043a18331E6330b62364B76J0488M605
11852A5369J21746e7606k0165o5653M4470F1447b96329J36615r5702C8859n514
11841C3345o040a1271A9965c65293a61249H6841a35903m02260D13068i6852j03677
11830b00529I3627j5197b48024R3713K7175a0851j37715D9012a39748o994F4437
$$ plain form
11909 408022 -88250 -46503 -351169 -87295 173504 -233327 251243 278891 101747 -88037
11898 -56786 -16515 217612 -169656 -581 -72574 -151936 -319239 -88785 -202197 123 -160705
11886 46833 -1897 -102273 8607 114960 -185246 -158861 147158 -100384 -122791 -319805 -227959
11875 -227959 -314146 -101347 -122407 -89807 -155482 -376189 -308472 -132818 -43790 171202 -32027
11863 133541 -129389 326106 -184572 -81722 12043 -118331 56330 -262364 276 10764 15369
11852 15369 137115 -57606 -77771 -143424 -98954 61447 -296329 -159714 -255416 38859 33345
11841 33345 27305 -11271 19965 -365293 -161249 86841 -135903 -538163 413068 -96852 -200529
11830 -200529 93627 78430 -248024 -154311 -127136 -10851 -148566 49012 -139748 -146742 64437
11818b01678l6736e1220k93202B66454e1616Q898B71204A07755b32091C86754
11807b03726G9146b39099e8068k17842c8793q823j53972K0740F292g545p4576
11796h2121n6406B45447b72386R7452A29412a68095j5250l23398b10434b1377
11785b34460N9121N0348q3824Q013A0525a63014g7924k88240a5314k03245I3664
11773a16417N6516j68726B1329O4000N3153i1760A11637d9760A45620c1385q7268
11762a18653D5455M7925b19527A792i2374j40555M979G9261A4231b02259C1560
11750H2769a40336I7734k7892c50300I8999l7737R4068D3533R1086i3247A42482
11738a9966m1021A78706a2945p1785B19926h7099A75190H4209A5370L8920a27005
$$ plain form
11818 -201678 -238414 -51220 -344422 266454 -51616 -42718 271204 107755 -232091 386754
11807 -203726 79146 -239099 -58068 -275910 -38793 -47616 -201588 -180848 6292 -7545 -82121
11796 -82121 -138527 245447 -272386 -174934 129412 -168095 -183345 -506743 -210434 -21377
11785 -234460 -175339 -124991 -208815 -200802 10525 -163014 -77924 -366164 -15314 -218559 93664
11773 -116417 -59901 -228627 21329 85329 138482 -91760 111637 -49760 145620 -31385 -118653
11762 -118653 45455 93380 -219527 1792 -92374 -232929 -227950 79261 14231 -202259 31560
11750 82769 -140336 97734 69842 -350300 98999 61262 155330 43533 134619 -93247 142482
11738 -19966 -60987 178706 -12945 -84730 219926 -87099 175190 84209 15370 54290 -127005
11726d4797A31082m4861b78708a9664L685k65843D9837a87955j61839F1764K0516
11715H2280j2256N9930C3874J36945K19155C8395f3797H9338a35812B68186E3082
11703a14654B0808a74987G6625M2133c84418B3940Q511J71572a07630j80015D1773
11691a49765A86543O2151O4203j2834a57194l0193a18j38730l0751B5655c6306
11679a9364A01862O8634a62476o7183B5418J41563K61553a21093j63361D33367
11668B1243c3184A26801N3614d6539A39582N1050c5292E0497J40106a75390B23082
11656A13729B5330b94886J17487I8786A2201J24388D8267f2573n2440A4789a8371
11644a40345B95558H8880K63197r2795g5194j44190Q0537H8939a15484p3419R3769
$$ plain form
11726 -44797 131082 86221 -278708 -19664 -15979 -281822 49837 -187955 -349794 61764 82280
11715 82280 70024 129954 33874 170819 389974 38395 -63797 89338 -135812 268186 53082
11703 -114654 20808 -174987 76625 118758 -384418 23940 32451 204023 -107630 -287645 41773
11691 -149765 186543 248694 312897 300063 -157194 -187387 -118 -138848 -169599 25655 -36306
11679 -19364 101862 170496 -162476 -229659 25418 166981 428534 -121093 -284454 433367
11668 21243 -33184 126801 180415 -46539 139582 190632 -35292 50497 190603 -175390 223082
11656 113729 25330 -294886 -177399 98786 12201 136589 48267 -62573 -115013 14789 -18371
11644 -140345 295558 88880 352077 259282 -75194 -219384 -138847 88939 -115484 -188903 -95134
11633i5134k9836j45014b2215A29849N6828b97568a42430E7137a33641A1078R9250
11622A10328N8698J02015J8750A02088N9526e863H711P646c17923B38766J7166
11611B55932A04310A6582J96017G3475K46536j58105o8644J3259a90840A41990
11600A61129m4J68122d2027J7212M003E47012B33011i9936d4733b1703B19309
11588a77261L7411K4771C44993A41644P239a47727O6782j75906C46954j19581
11578B27373a25821H462P5380l2438a96129A6315Q3292R1755L6111j10057c24031
11566g2155E01793G7912a4137k68717g5870C03223E5788c91034E8540J40130M5945
11555B44615l0039j5765g021A05838j5560B3413c95673a7609A396M0530J41793
$$ plain form
11633 -95134 -124970 -269984 -22215 129849 186677 -297568 -142430 57137 -133641 11078 110328
11622 110328 169026 271041 289791 102088 161614 -5863 8711 16357 -317923 238766 255932
11611 255932 104310 16582 212599 73475 320011 161906 93262 106521 -190840 141990
11600 161129 161085 329207 -42027 -24815 -20812 547012 233011 -99936 -44733 -21703 219309
11588 -177261 -139850 -115079 344993 141644 148883 -147727 -80945 -256851 346954 227373
11578 227373 -125821 8462 83842 51404 -196129 16315 99607 191362 227473 117416 -324031
11566 -72155 501793 77912 -14137 -282854 -75870 303223 55788 -391034 58540 198670 244615
11555 244615 214576 198811 -7021 105838 90278 23413 -395673 -17609 1396 41926 183719
11544A83719K0976L7842j17198J43468a15932d1387j33524B25490q3018Q0427
11534B22899c5681B78996C8271J10365K27143l3989N235a8471j62850A35775b6348
11522b942j63460C9803J88977J6574e45n6818E5198L1297K55894a02376H0175
11510A54069i7211j56008i7328A29562J61041d1744D3695Q4344M61888a80017
11499C30894H1876j9476K63767A6617J43975m2366K05905F4328c1923F6181K75348
11488C41529j59899H489J11919m1756J99067j10749N2242e2019A32019L9335J87686
11477C59040B9871J24881J26695I7947J55314b376j749G0301K24132c6030D4081
11465C26464p8486C3473J87646h7740B67608J62633H8841K83119p1622D476J76752
$$ plain form
11544 183719 204695 242537 125339 268807 -115932 -41387 -174911 225490 142472 222899
11534 222899 -35681 278996 38271 148636 375779 341790 347025 -18471 -181321 135775 -26348
11522 -2942 -166402 39803 228780 245354 -545 -57363 55198 86495 342389 -102376 80175
11510 154069 -97211 -253219 -97328 129562 290603 -41744 43695 128039 589927 -180017
11499 330894 81876 62400 326167 16617 160592 118226 324131 64328 -31923 66181 341529
11488 341529 181630 8489 120408 78652 277719 166970 219212 -52019 132019 171354 359040
11477 359040 29871 154752 281447 97947 253261 -2376 -4125 70301 294433 -36030 44081
11465 326464 247978 33473 221119 -87740 267608 430241 88841 371960 300338 4476 181228
11454A81228b4636q8753M1059A02231O1953p6108J8182N2544a03543A9140K67462
11443B86602J12686j59947n7555O0258F0352j4368K3219J33026j568K31763F7708
11431B78526a79959B53168p7364b64138A10499K95323E5400c01501a18355E37153
11420A61103a45165l5026a9402G7328b15522C15219q6942n1837M949J20554a8288
11408C17421c7646l12003i8479B13515a31697B47733C7918Q8848h8419E815b08656
11396b7688N484j62458e5492A38701c05771j28836b05412J8687C9834N3318c09173
11384G7599g5739p6059G1552q67b55032E0923d33722g7490m2108A6136L23878
11373C40014a481l46162I7281j4268J52373e0860D755J34274h0487c7343C65142
$$ plain form
11454 181228 -24636 -113389 -72330 102231 164184 88076 106258 158802 -103543 19140 286602
11443 286602 399288 239341 181786 242044 60352 45984 69203 202229 200661 432424 67708
11431 278526 -179959 253168 175804 -264138 110499 405822 55400 -301501 -118355 537153
11420 161103 -145165 -180191 -19402 77328 -215522 315219 228277 176440 181389 301943 -18288
11408 317421 -37646 -349649 -98479 213515 -131697 247733 37918 126766 -88419 5815 -208656
11396 -27688 -22204 -184662 -55492 138701 -305771 -434607 -205412 -186725 39834 93152 -309173
11384 77599 -75739 -151798 71552 70685 -255032 50923 -433722 -77490 -119598 16136 340014
11373 340014 -1481 -347643 97281 83013 235386 -50860 4755 139029 -80487 -37343 365142
11361a89533k46754D413c85473A46573d1276B38562a49694b3920j58085J9001
11351a63004O0651b2403A029d72100r7758B51570a76299G7964f2910o3392p9973
11340b06275G2344a64058a1606A44544J27676l2212g8541B98778b61325J22197
11330a39128j61853A68622G1446f03C00340A02698J02920F9415b75387f5665l76428
11319d42093J14940B69118k2280j6805g9253B940K47973b45271F8901f6347q6889
11308a53236c9585A81250d75195a24044l4848D6214g12k70879J13692r0166H6525
11296b70018c3121J6110D92964A45785b39029J12209o8794j7748a03128j89689
11286b92817j245F6254a51230m8376e5222K5444n2197C76568A16131c2626j05781
$$ plain form
11361 -189533 -436287 4413 -385473 146573 -41276 238562 -149694 -23920 -182005 -163004
11351 -163004 -102353 -22403 1029 -472100 -569858 251570 -176299 77964 -62910 -126302 -206275
11340 -206275 72344 -164058 -11606 144544 272220 240008 -78541 298778 -261325 -139128
11330 -139128 -300981 168622 71446 -603 300340 102698 205618 69415 -275387 -65665 -442093
11319 -442093 -327153 269118 246838 230033 -79253 2940 250913 -245271 68901 -66347 -153236
11308 -153236 -39585 181250 -475195 -124044 -158892 46214 -712 -271591 -157899 -248065 86525
11296 -270018 -33121 -17011 492964 145785 -239029 -126820 -195614 -213362 -103128 -292817
11286 -292817 -294062 66254 -151230 -199606 -55222 -29778 -81975 376568 116131 -32626 -138407
11275a38407l52467A08839d57122B11868g1248C7165b77225a04575j075i428B75270
11263c8519J2817j5223C78527A75257b78976D06642b61733A01391L226N1534c62462
11251B95806H5589c62750J69805C47191a09586b5794j10994k9519H9360m152a49198
11239A45906b36465J12222B156b38019A24303J16870a06476k826K9710L7479k6123
11228f8236B5942c05750J44384L4549r9375B5847j2045J8035a49380d8970C77298
11216I8604a64336D0937e7852F2103c94926A20289e4253A48096K92299A51754
11205G0967b40581i7626l50360K22559e8912J1519j60584A44356b4350n4575l03097
11194c82022A43622g7780q8759B24671i222C97984c96933D2480K9336a67293a3444
$$ plain form
11275 -138407 -490874 108839 -457122 211868 -71248 37165 -277225 -104575 -105650 -9428 275270
11263 -38519 -25702 -40925 378527 175257 -278976 406642 -261733 101391 104617 156151 -362462
11251 295806 85589 -362750 -192945 347191 -109586 -25794 -136788 -166307 89360 85208 -149198
11239 145906 -236465 -124243 2156 -238019 124303 241173 -106476 -109302 -79592 -42113 -68236
11228 -68236 25942 -305750 -161366 -126817 -226192 25847 13802 31837 -149380 -48970 377298
11216 98604 -164336 40937 -57852 62103 -394926 120289 -54253 148096 440395 151754
11205 70967 -240581 -97626 -447986 -225427 -58912 -47393 -207977 144356 -24350 -78925 -382022
11194 -382022 143622 -77780 -166539 224671 -9222 397984 -396933 42480 71816 -167293 -13444
11182A35088B0463e5608k5911J2470A0028h7144D9031a30682c7147q2266A25493
11170B5465J09648i4816k52919A52356o2847d15160A46967a2821l74027J30626
11160b56222o591f6631j37069j03735k7306B7225a84692e0451r1016J94A1854
11148A10299g1711k6756H629a59553j33656a43572B85576A3391f1927K6726J0585
11137b4616l2755A16153c6238j7484A74437F8039c68117a7589j54337A87307c00734
11125B48360A06365k6408R5621j2068q1212B9999b4556j65193E52215k20143g4923
11113A41340J24549a2517n7370n4543k1577j95186c214A41106m1021A7540a22565
11101A78593J21021J71748H0303a28393C99734F6245K36181J81646n0180H4804
$$ plain form
11182 135088 20463 -55608 -81519 -69049 10028 -87144 49031 -130682 -37147 -119413 125493
11170 25465 135113 -94816 -347735 152356 89509 -415160 146967 -12821 -386848 -256222
11160 -256222 -262813 -66631 -203700 -307435 -334741 27225 -184692 -50451 -141467 -141273 11854
11148 110299 -71711 -98467 8629 -159553 -293209 -143572 285576 13391 -61927 -35201 -24616
11137 -24616 -57371 116153 -36238 -53722 174437 68039 -368117 -17589 -171926 187307 -300734
11125 248360 106365 79957 175578 163510 82298 29999 -24556 -189749 552215 332072 -74923
11113 141340 265889 -12517 -69887 -124430 -146007 -341193 -3214 141106 100085 17540 -122565
11101 178593 299614 471362 80303 -128393 399734 66245 302426 484072 433892 84804
11090B00849O9524j13186M87k4344O871N7628L99150B85062o1563I4120J45445
11079B39565j06487F0056J82078j2023M1570J08611A82613K11809J47207A92228
11068D37590R8511A68467l384N35046k34000N1331k54153L77242J16878j28528
11058F28899K3059J45322j31471M8802J21577J55336j58199L59981l1802j73570
11048I87934l0682k29112O04205k24864L86068k43523n0127j27046K51468k47167
11038A077154j18837K62493o3837P4483k74145K42483O9251J35362m95668N2006
11028I60745J69483j37798k68482K93798L5617O7859k71992L84527J11646o11850
11018G33553M06858k93337K5273l5980M0259j70400L92972j84541M0075m7342
$$ plain form
11090 200849 270373 157187 157674 133330 140201 197829 596979 285062 223499 94120 239565
11079 239565 133078 60056 242134 230111 271681 380292 182613 394422 541629 192228
11068 437590 536101 168467 165083 700129 466129 517460 263307 640549 757427 628899
11058 628899 651958 797280 665809 714611 836188 991524 833325 1193306 1161504 987934
11048 987934 957252 728140 1332345 1107481 1493549 1250026 1199899 1072853 1324321 1077154
11038 1077154 958317 1220810 1156973 1231456 957311 1199794 1269045 1404407 908739 960745
11028 960745 1130228 992430 723948 1017746 1053363 1121222 849230 1233757 1345403 733553
11018 733553 1140411 847074 872347 836367 876626 706226 1099198 914657 954732 907390
11008I07390L159n790q9854J29402j5866K38953j18469j72365p3645Q7401k07531
10997F82785J12302P8906J28627J05750O808k8275l48501M33376m13880K06329
10987I64227K77932n10654N5219O34546N2448m55453n8580M30124k43306M60007
10977A606510K82535k91292Q9896O48936L19840J17919J75176K18656N81348K05393
10967C954917P9610O50353O4291l30428k89554o52386n59042k61644k07331m26723
10957B022063o5598J50590j14193N9466j78590N3446k2740m24714k03997O5522
10947A341255O1161n83219D04747L52184l33665A04899L58250j46810J36557B1128
10936D45566J26122a56744F4970L21594H6783K57029a69079C64857d52722a22807
$$ plain form
11008 907390 910549 904759 814905 944307 928441 1167394 1048925 876560 802915 890316 682785
10997 682785 795087 873993 1002620 1108370 1115178 1086903 738402 1171778 757898 964227
10987 964227 1242159 731505 786724 1421270 1473718 1018265 959685 1389809 1146503 1606510
10977 1606510 1889045 1597753 1687649 2336585 2656425 2774344 2949520 3168176 3749524 3954917
10967 3954917 4034527 4684880 4749171 4418743 4129189 3476803 2917761 2656117 2448786 2022063
10957 2022063 1956465 2107055 1992862 2052328 1873738 1927184 1904444 1479730 1275733 1341255
10947 1341255 1402416 819197 404747 756931 423266 104899 463149 316339 452896 21128
10936 445566 571688 -156744 64970 386564 86783 343812 -169079 364857 -452722 -122807
10925B36298J45018f7788q6395F8378R804a49118a8693l0306a6936F0492A1092
10913A49974c1361E4346a52805d748j04746C21172D8614c30966B27518C027f5456
10901b00622B9384J53591a85952p7850A30779M5304q0264a15077K1055A29438
10890f7332n3653k3989K814c7948A24514J6465a73351I8505a20322a9403r8936
10879a18339o9932A65782J842J7648m8998b81436A72160c0197j32795O0541K6345
10868g6106k05130B6484a00892l773j81923G5846a14630p2734A98750d28137e096
10856a85919j03037e258D30991B07670i6937c3827C452f7345B05300a1675C0511
10844c67053A17756c12769B00423I5114P56h8054A56253F835b11148a0992j69950
$$ plain form
10925 236298 381316 -67788 -154183 68378 78182 -149118 -18693 -48999 -16936 60492 11092
10913 149974 -31361 54346 -152805 -4748 -109494 321172 48614 -330966 227518 3027 -65456
10901 -200622 29384 182975 -185952 -263802 130779 176083 95819 -115077 -94022 129438
10890 -67332 -120985 -144974 -142160 -37948 124514 140979 -173351 98505 -120322 -19403 -118339
10879 -118339 -188271 165782 167624 185272 136274 -281436 172160 -30197 -162992 -102451 -76106
10868 -76106 -281236 26484 -100892 -104665 -286588 75846 -114630 -187364 198750 -428137 -5096
10856 -185919 -288956 -5258 430991 207670 -96937 -33827 3452 -67345 205300 -11675 30511
10844 -367053 117756 -312769 200423 95114 95870 -88054 156253 6835 -211148 -10992 -180942
10833a80942D1782c51701d0656R667r9550A39137k4261B9539J20054k6171d4716
10821a94682c2822l90053B19194i1361j23847D4062b53628m124n6559g8209A83160
10809g5986a6936C31620a13087c8422n4466c279k029o2934j27488Q1030B5953
10797d066E8841J19475D6796c4983k7772K2059C520b82183k6171E2063a99432
10785a87423A5335h8420k73473B79751e9581j92618H9025J35085a1298A44970
10774B63852I6431a6880D1751j7989b39243B81660b5480j17176A82355A2963K81331
10763B94294c8084A46257R1774b6567r4082b0198h16A99257c54103i7397A0093
10751g40j77188j16621J19564G660J15703b04763A49883a17866K1483B41456j11269
$$ plain form
10833 -180942 41782 -351701 -40656 -30989 -130539 139137 114876 29539 149593 123422 -44716
10821 -194682 -32822 -422875 219194 -91361 -215208 44062 -253628 -257752 -314311 -78209 183160
10809 -75986 -16936 331620 -113087 -38422 -92888 -3279 -5308 -68242 -195730 -114700 25953
10797 -4066 58841 178316 46796 -34983 -62755 -40696 3520 -282183 -308354 52063 -199432
10785 -187423 15335 -88420 -361893 279751 -59581 -252199 89025 224110 -11298 144970
10774 263852 96431 -16880 41751 23762 -239243 281660 -25480 -142656 182355 12963 294294
10763 294294 -38084 146257 238031 -26567 -120649 -20198 -816 199257 -354103 -97397 10093
10751 -740 -177928 -294549 -174985 7660 123363 -204763 149883 -117866 -96383 241456 130187
10740A30187a31853r4749J11965M281a7654C1754d7249B45809a7195B31617A6908
10728c69604a34610J0486l7943m8510C59104a85320I4130J18164b028j44803E6205
10716A04598a6896q468l64232a28288O1266A43123D9911f2002a7667p9044A77156
10704B63918j13049a22714k13097J29180R7242c206j18206j03061c6192E6926
10693D0598j9213h7523J7214G6697b2409I8053a10272G197l445f4269k16296A03263
10680b34480h9318r7639A86959d41377b18929k85355E9157b04314k28224I5333
10669F1512h9508c5022j35069j80841a03862L2680B12901g848B9113G461a21869
10657b78359A8991L73603A10307b33839b1472j08371a0808l37534a41356K7684
$$ plain form
10740 130187 -131853 -226602 -114637 -110356 -17654 31754 -47249 245809 -17195 231617 16908
10728 -369604 -134610 -124124 -162067 -210577 359104 -185320 94130 212294 -2028 -146831 56205
10716 104598 -16896 -25364 -389596 -128288 -67022 143123 49911 -62002 -17667 -96711 177156
10704 263918 150869 -122714 -335811 -206631 -109389 -3206 -121412 -224473 -36192 56926
10693 40598 21385 -87523 -70309 76697 -22409 98053 -110272 7197 3752 -64269 -280565 103263
10680 -234480 -89318 -186957 186959 -441377 -218929 -504284 59157 -204314 -432538 95333
10669 61512 -89508 -35022 -170091 -350932 -103862 -71182 212901 -7848 29113 7461 -121869
10657 -278359 18991 392594 110307 -233839 -21472 -129843 -10808 -348342 -141356 -113672
10647a13672I1703a97607n8259d3858k14477D2512a88535B69949a28361j15725
10637b44086B71016F7430O9517L186b08486o0499A80984a76635B27736a98172
10626c05275a40003M7523A83190c35251P772A24655g7131j92395A87008C0609
10615A71724h0414A40466Q249h0619B00011b01415a1485j96711C5433J57044a7414
10603A03982c08765C0368K3214b74980f326l4622P817j29495B5327a00694j59614
10592b60308j53197A33148J11050j17301k1724a895k23458a07332m18074f3851
10581H9907A0372a86965B4057b52511k94862B3165b1161B79595H914a38515j58596
10570b97111R1007j2811G1786c77112a0264C01643j27732a72314e7431C8740e6961
$$ plain form
10647 -113672 91703 -197607 -255866 -43858 -258335 42512 -188535 269949 -128361 -244086
10637 -244086 271016 67430 136947 140133 -208486 -268985 180984 -176635 227736 -198172
10626 -305275 -140003 -92480 183190 -335251 -327479 124655 -77131 -269526 187008 30609
10615 171724 -80414 140466 148715 -80619 200011 -201415 -11485 -208196 35433 192477 -17414
10603 103982 -308765 30368 53582 -274980 -6326 -40948 -33131 -162626 25327 -100694 -260308
10592 -260308 -413505 133148 244198 126897 105173 -1895 -225353 -107332 -525406 -63851
10581 89907 10372 -186965 24057 -252511 -547373 23165 -21161 279595 8914 -138515 -297111
10570 -297111 -206104 -218915 71786 -377112 -10264 301643 173911 -172314 -57431 38740 -56961
10558h9268F3606a62003B37458i900n0199A82844d32693A36951F656a83742Q7713
10547i6029j7294M3191A25138c64542g6906G0200K13k7842K6546d9745B58148
10535b97401j68452I8657d23631A17401D6046J33306b67417r8797A75566j0990
10525A64576b78629B24539I2020J23853a0615H7382A5219l352b10170E7049f088
10513c20657H4463g5817r0209c6067B67658a09529n9810m5972R3264e2616k9871
10502h2487p9541q2556A1113O3330a03795F0210a5584r0166k092k8256A26074
10490B13680J0704c29728h5214j07843j52688i679j43912A08272j6408f515j1013
10479a7528G7031M88506B10865J07341J87949o4938j09315P1603o2699a05761
$$ plain form
10558 -89268 63606 -162003 237458 -9900 -60099 182844 -432693 136951 6656 -183742 -96029
10547 -96029 -113323 -70132 125138 -364542 -76906 70200 70413 42571 69117 -49745 258148
10535 -297401 -465853 98657 -423631 117401 46046 179352 -267417 -366214 175566 164576
10525 164576 -278629 224539 92020 215873 -10615 87382 15219 11867 -210170 57049 -6088
10513 -320657 84463 -75817 -166026 -36067 267658 -109529 -169339 -215311 -122047 -52616 -82487
10502 -82487 -162028 -244584 11113 74443 -103795 60210 -15584 -105750 -107842 -136098 126074
10490 213680 224384 -329728 -85214 -193057 -345745 -9679 -153591 108272 91864 -6515 -17528
10479 -17528 77031 565537 210865 318206 506155 441217 331902 403505 340806 -105761
10468a22768a9716C06653A11143O255m9527a50458o975A74032a44010A06946a93438
10456a10464j05143H4230Q4433a31342n027b2300A12033b60414J14458A2502K8196
10445D0698h2959r5846A9291a04020I3436a28602F4004K7426i8527j47459f3865
10433a72757I5716b4768H8307a04461J4720k40090J39228J3487B63145C9338J52239
10422A91577i121j76841H0306R5636b1220j77436M3803C0133b66217m0335J35751
10411a70801A41750f5774F4531a55669m6189J00181p0249F0991a08692A18875
10400c22742B3773K300D197Q7742J45169B2969L0339a33473D13693E0556K54550
10389C05106L9615J13932A68197d2305J683a7814C10257b90594A58052m9518A6654
$$ plain form
10468 -122768 -19716 306653 111143 117398 67871 -150458 -157433 174032 -144010 106946 -193438
10456 -110464 -215607 84230 168663 -131342 -136369 -22300 112033 -260414 -145956 12502 40698
10445 40698 -82959 -178805 19291 -104020 93436 -128602 64004 91430 -98527 -245986 -63865
10433 -172757 95716 -24768 88307 -104461 -89741 -329831 -190603 -177116 263145 39338 191577
10422 191577 -9121 -185962 80306 175942 -21220 -198656 -154853 30133 -266217 -306552 -170801
10411 -170801 141750 -65774 64531 -155669 -201858 -101677 -171926 60991 -108692 118875
10400 -322742 23773 26073 4197 91939 237108 22969 53308 -133473 413693 50556 305106
10389 305106 344721 458653 168197 -42305 -40622 -17814 310257 -290594 158052 108534 16654
10377G5314K05106K20860A78199M26620B35177J70736J9756J60072n0571j38130
10367C97040J02559K07154K80432m89288M39084m01655K24545C29890n8053O7325
10357C39162b4254A5832M28547j44136a84136C77596A78498K73839K98698K9826
10347G80861L0295J25591D06996C8580K15650j5896L39061k86794C2209K40535
10337B72744k8817K34211k38072K68149k12696P3340j01056D0759J36275j1038
10327A65996f01961a51843H6205P580K27023K6499j01319F7386L86002k25739
10317B27649j00579L0161l8387M3002J51884j28264a73074D8027J9088K79508
10307C46623a57147B13830a64965a3423j28138A56339F0798L6640c49449a07539
$$ plain form
10377 75314 280420 501280 178199 604819 235177 405913 425669 585741 535170 397040
10367 397040 499599 706753 987185 497897 936981 535326 759871 329890 271837 339162
10357 339162 -24254 15832 444379 300243 -184136 377596 178498 452337 751035 780861
10347 780861 811156 936747 406996 38580 254230 238334 577395 290601 32209 272744
10337 272744 243927 478138 240066 508215 295519 368859 267803 40759 177034 165996
10327 165996 -601961 -151843 86205 93785 320808 347307 245988 67386 453388 227649
10317 227649 127070 157231 118844 161846 313730 185466 -173074 48027 67115 346623
10307 346623 -157147 213830 -164965 -13423 -141561 156339 60798 97438 -349449 -107539
10296F6909c10671A52324a16679o7570E0087d8297p3080D9134F323b07093H2160
10284E2628j2130b31681J9931l5376C53843b75435k52512A922b09323m770j00578
10273c14671h5361p1944r493J1041E9734O9171a96948d6827l18136G5859q592
10262F7267J08045a82699k6701C8796b27674G7507c7306F5859K05596R2299M9982
10251D13736A22371L55325a71908B24630a11209B8232a78731H5530a16644J0963
10241a05681B24524a32067k22647A8200K41810j16499J13599F7126R853L4833
10231A11812p198b14826D4515i4192m78617I5790b01672A44134f0659q7095j83632
10220c31386h492A4078e3677j77041a5826j78301Q8213N291n2996H8778a01944
$$ plain form
10296 66909 -310671 152324 -116679 -184249 50087 -48297 -121377 49134 6323 -207093 82160
10284 52628 40498 -231681 -211750 -247126 353843 -275435 -527947 1922 -209323 -214093 -314671
10273 -314671 -85361 -157305 -166798 -155757 59734 128905 -196948 -46827 -364963 75859 67267
10262 67267 175312 -182699 -209400 38796 -227674 77507 -37306 65859 271455 363754 413736
10251 413736 122371 477696 -171908 224630 -111209 28232 -178731 85530 -116644 -105681
10241 -105681 224524 -132067 -354714 18200 260010 143511 257110 67126 76979 111812
10231 111812 104614 -214826 44515 -94192 -572809 95790 -201672 144134 -60659 -147754 -331386
10220 -331386 -8492 14078 -53677 -230718 -15826 -194127 -105914 -100623 -153619 88778 -101944
10208a0557C5656L67469A27358K02126a65907d80o1261I3670a36374D379b52048
10196A72267J61771c1506H5250A8297a19622H4182L17574A75397l0086a38566
10185b36192f9726C2801N3796i9200l8401c27B9661J09289c21588B40275e9653
10173a66427j2266b7080C5044b42858P0619N3094n5715G8017k1194j0687b61759
10161a21356H8516b25471J7603F3089c03879b6258A00787d73629K12940m5508
10151c06197L3698N3508E2526F599J27803d3088L324a2866j02361i617j11398
10140a21015N0799j42959R0573j60826N3778P746j2409K3037N4155A46759a77050
10128E3578a65932A07993L4476b31048l6851d9815k10935e2676a1215j90854P2004
$$ plain form
10208 -10557 35656 403125 127358 329484 -165907 -480 -61741 93670 -136374 4379 -252048
10196 172267 334038 -31506 85250 18297 -119622 84182 401756 175397 145311 -138566
10185 -236192 -69726 32801 86597 -99200 -137601 -327 29661 138950 -321588 240275 -59653
10173 -166427 -178693 -27080 35044 -242858 -172239 -119145 -174860 78017 56823 46136 -261759
10161 -121356 88516 -225471 -207868 63089 -303879 -26258 100787 -473629 -260689 -306197
10151 -306197 -272499 -218991 52526 6599 134402 -43088 -39764 -12866 -115227 -9617 -121015
10140 -121015 -70216 -213175 -122602 -283428 -229650 -221904 -234313 -211276 -157121 146759 -177050
10128 53578 -165932 107993 142469 -231048 -267899 -49815 -260750 -52676 -11215 -202069 -130065
10117a30065a3444k67990i7827k62151J74231l01997a08960P244q1164k44207
10107d27087b13345N5056J6975k27097J73242j01942h5445j49263O4699n6851
10097b26860F7556b40144B45333h7016A49063e32904a22875k15084a33494f1024
10086h21m60108R7618A08825b57597B41480a5617p6345D4723k161c81288H3083
10074e8563j27544B59320d5241n3646l2561a1143l92693E0399b700k43944C69439
10062b44864C7740R6083C2395a22291J6361A45717e8735A3322a5862G6144j9985
10051E6159a60955P1809j55997h7540m1999k34479J25867B68196j03788D060i6442
10039A29286D2571a9983p6936p2853A74822d0265B9715o575h3670o9740p0047
$$ plain form
10117 -130065 -13444 -281434 -97827 -359978 -185747 -487744 -108960 -101716 -182880 -427087
10107 -427087 -213345 -158289 -141314 -368411 -195169 -297111 -85445 -234708 -170009 -226860
10097 -226860 67556 -240144 245333 -87016 149063 -532904 -122875 -337959 -133494 -61024
10086 -821 -460929 -363311 108825 -257597 241480 -15617 -91962 44723 42562 -381288 83083
10074 -58563 -186107 259320 -45241 -98887 -131448 -11143 -403836 50399 -2700 -246644 369439
10062 -244864 37740 133823 32395 -122291 -105930 145717 -58735 13322 -15862 76144 56159
10051 56159 -160955 -89146 -245143 -87540 -129539 -364018 -238151 268196 164408 4060 -96442
10039 129286 42571 -19983 -96919 -169772 174822 -40265 29715 23140 -83670 -153410 -223457
10028b23457A01921r56a06310j19197i9659H0264b38667n5012a39781j07889i1573
10016E14213B191M83975c34887F9121d402B37103d1775p1086H48d12509A38542
10004c05016n8770A02230B7163b89862C7416d0556F4418a28441D2426J86092A3590
9992B49370b1372m3831C97233d52825c4761l0369B11046H3472i9714r5198j10113
9981c05025C57251D774a31815J7371A95947b6785G6462c43512j6748a25578I5862
9969A80983e2030p4497F710b29813L9522k26473a18978F9145J9362f1630C2430
9957a01058E0401P5154a14645G2648a85130l2057P0659o5908B38958G0422M224
9946G4646e553j47217r4983D3133J97411B9044b95606A47994A7520K13450b0493
$$ plain form
10028 -223457 101921 100965 -106310 -225507 -99659 80264 -238667 -293679 -139781 -247670 -91573
10016 514213 2191 486166 -334887 69121 -4402 237103 -41775 -112861 848 -412509 138542
10004 -305016 -363786 102230 27163 -289862 37416 -40556 64418 -128441 42426 228518 13590
9992 249370 -21372 -65203 397233 -452825 -34761 -65130 211046 83472 -99714 -194912 -305025
9981 -305025 357251 4774 -131815 -114444 195947 -26785 76462 -343512 -360260 -125578 95862
9969 180983 -52030 -126527 6710 -229813 -190291 -416764 -118978 69145 88507 -61630 32430
9957 -101058 50401 125555 -114645 72648 -185130 -217187 -146528 -212436 238958 70422 74646
9946 74646 -5553 -152770 -247753 43133 240544 29044 -295606 147994 17520 230970 -20493
9934g0657n418A93956F1571c44689f5632j51862A41241b51791G4608A0936e7773
9922D6343J05693c40674a41598C7951a26492e5289j37243q450F3286a24331C0130
9910b13638B18298b15757P8778o3092c2902j62510M4107f9759F3994c63290A94581
9898I1712b72894L5029k5994F0988c96163A08333g1799n48269H8750g6692J7521
9887e9171A8664b53653A92081c68800a28872k77281f6075F2756J58911d44622
9876a81163A41370b61739A6340b24537A7913a36444R925j44214D8925A3980P9934
9865I3914a11256J5587K8863p2051C0992b1533j7019o0531j40598a06759p3142
9854a79901j493h5409c9329m6900B28946i9407k8303C12613a23684o279m0385
$$ plain form
9934 -70657 -76075 193956 61571 -344689 -65632 -217494 141241 -251791 74608 10936 -57773
9922 46343 152036 -340674 -141598 37951 -126492 -55289 -192532 -200982 63286 -124331 30130
9910 -213638 218298 -215757 -136979 -200071 -32902 -195412 -151305 -69759 63994 -363290 194581
9898 91712 -272894 -237865 -263859 60988 -396163 108333 -71799 -620068 88750 -76692 -59171
9887 -59171 18664 -253653 192081 -368800 -128872 -406153 -66075 62756 221667 -444622
9876 -181163 141370 -261739 16340 -224537 17913 -136444 -126519 -270733 48925 13980 93914
9865 93914 -111256 -95669 -66806 -138857 30992 -21533 -38552 -99083 -239681 -106759 -179901
9854 -179901 -181394 -85409 -39329 -86229 228946 -99407 -127710 312613 -123684 -129963 -170348
9843a70348j04851P6369M2738q2447M8832A10412b31821A32911c64551B5827h4887
9831A2716J34136f6064j02322B53452b47450b2410r3798d2315o45460A63044b7297
9819D9000J46855r0683b12064a02269C4231j1562d10192d7304f455j4718B62107
9807e03352b11434a9216j98031O181g9098A26918a40319n1867G1446a91448R4538
9796i6910q2441O8959a4615k42819D2904P9566b31359h0354j68760Q346J16584
9785a24184m968j15402g3820r5277c396k0530h123A30858c3630F589b32747j03737
9773c36484E8064J64072b12593h3479c8009m7933B63367b08251k48449A07645
9762e377k95804b3786m24391b12935L9092B28348O627b07410L8389G2625c65343
$$ plain form
9843 -170348 -275199 -198830 -156092 -238539 -189707 110412 -231821 132911 -364551 25827 -84887
9831 12716 146852 -66064 -168386 253452 -247450 -22410 -116208 -42315 -687775 163044 -27297
9819 49000 195855 105172 -212064 -102269 34231 22669 -410192 -47304 -6455 -21173 262107
9807 -503352 -211434 -19216 -217247 -211066 -79098 126918 -140319 -192186 71446 -191448 -96910
9796 -96910 -179351 -110392 -14615 -257434 42904 122470 -231359 -80354 -249114 -240768 -124184
9785 -124184 -129152 -244554 -73820 -169097 -3396 -23926 -8123 130858 -33630 6589 -232747 -336484
9773 -336484 58064 222136 -212593 -83479 -38009 -85942 263367 -208251 -456700 107645
9762 -5377 -301181 -23786 -448177 -212935 -173843 228348 234975 -207410 -169021 72625 -365343
9750B15256b5415B66673b08407R0948j4853B35839c0761l58037G2390a27353n9689
9739a87042j70301a47681C8286o001f4915o9121H2851A6479a74315A9813c48750
9727b79909I1544k6978c05218F7913R0261h8377n33535b36541h8393j72872A3205
9715A59358k5089b77112B11604a93150k6772l565A46499n5367b08598f9350m94568
9704e63918B5639a45186M7078A22740c2339l0827j26643K0201g9419L0770A12932
9692A01390g7592G3112J3699f2796P295m3684k05608D8662R2656J54286a05967
9680C1655a39543C8293a00764A51853b77694H7526M6291a39805e2968j28719j66508
9669c48195Q0548J20830o4641A71041b05143e327l939o9356I7145i8273o6758
$$ plain form
9750 215256 -25415 266673 -208407 -117459 -132312 235839 -30761 -388798 72390 -127353 -187042
9739 -187042 -357343 -147681 38286 32285 -64915 -134036 82851 16479 -174315 19813 -348750
9727 -279909 91544 64566 -305218 67913 158174 -88377 -621912 -236541 -88393 -261265 13205
9715 159358 134269 -277112 211604 -193150 -219922 -223487 146499 91132 -208598 -69350 -563918
9704 -563918 25639 -145186 -98108 122740 -32339 -63166 -189809 -169608 -79419 -48649 112932
9692 101390 -77592 73112 86811 -62796 -55501 -99185 -304793 48662 141318 295604 -105967
9680 31655 -139543 38293 -100764 151853 -277694 87526 133817 -139805 -52968 -181687 -348195
9669 -348195 -267647 -146817 -211458 171041 -205143 -5327 -9266 -78622 97145 -98273 -165031
9658a65031j4930h5742F802g536A45534m3905a39924a5689D1615J31777b52512
9646a89337A44640a17168A04111N0716c61158a1181A22871l0996a12771j34670
9636b47441j600G1916J76792j11478A2001a00003h044F2579K22544C9420b44063
9624e1712J0363A1088b50266B2074c59093O3380J04217j92897G4613J28678c84427
9612c34303a14215D3353b88354H0022h2382n0400G9470L42673A24055H37a84129
9600d0406B40582A16803h0637j58827d8067A35537a18041I6384a51813C4111h0868
9588B78348I4736a17823r4870J05543A80223A1651N7461b13198e7402B84879E4922
9576c2641j34253j16960a06630l2013j94304A9411K63825l9061b71851M9405j97035
$$ plain form
9658 -165031 -179961 -85742 6802 -7536 145534 101629 -139924 -15689 41615 173392 -252512
9646 -189337 144640 -117168 104111 154827 -361158 -11181 122871 91875 -112771 -247441
9636 -247441 -249041 71916 248708 137230 12001 -100003 -8044 62579 285123 39420 -244063
9624 -51712 -41349 11088 -250266 22074 -359093 -295713 -191496 -384393 74613 203291 -384427
9612 -334303 -114215 43353 -288354 80022 -82382 -132782 79470 422143 124055 837 -184129
9600 -40406 240582 116803 -80637 -239464 -48067 135537 -118041 96384 -151813 34111 -80868
9588 278348 94736 -117823 -212693 -107150 180223 11651 69112 -213198 -57402 284879 54922
9576 -32641 -166894 -283854 -106630 -138643 -332947 19411 283236 244175 -271851 -222446 -419481
9565d19481b06071b7110k25717J22193j80733e2240o6131E899b4900k8509l5985
9554h9394a8049j40290A24908a02705o9453p3287J19265j02863B374L02866C4159
9542C06210a64025p169A10878b01135P2825A3631M6230J1087J19008J3441a27724
9530a60068l67757i1786G281b97048J02045a2225r4370A1663a44746B29117A02976
9518C7427L38494B6370b8987r293R211E1378a16795k72188J25996J07077A8258
9506i5750k65479g2291I0051b29478F4184j2966b22247j57400H3108e107j40291
9495a45398D1185A0745e11869A38761e2654q6584E8522b68754e3518E8800b06265
9483b13991f9387G7998g1803A02491f5939k7664k17191C3384b95348a00733B40646
$$ plain form
9565 -419481 -206071 -27110 -252827 -130634 -311367 -52240 -118371 5899 -24900 -53409 -89394
9554 -89394 -18049 -158339 124908 -102705 -172158 -245445 -126180 -229043 2374 305240 34159
9542 306210 -164025 -171194 110878 -201135 -128310 13631 59861 70948 189956 203397 -127724
9530 -160068 -527825 -91786 7281 -297048 -195003 -12225 -106595 11663 -144746 229117 102976
9518 37427 375921 26370 -28987 -38280 -29069 51378 -116795 -388983 -262987 -155910 18258
9506 -95750 -361229 -72291 90051 -229478 64184 51218 -222247 -379647 83108 -5107 -145398
9495 -145398 41185 10745 -511869 138761 -52654 -139238 58522 -268754 -53518 58800 -206265
9483 -213991 -69387 77998 -71803 102491 -65939 -93603 -310794 33384 -295348 -100733 240646
9471b55614A19226J34225a2037j76866i0095E594b0512G486a75413e1642A39579
9459A66658b78503N1353o9476B27713b88291a25000g830G9692b47559J13574j36086
9448b70071A33044J67542b76600Q6001A35919d14232B10722a43769d9247o2390
9438a11637I0331g0884J456A8984K08982d5273j97179B27036g7244J4295l1588
9427i4537a095k55440B55390M66237c7986k02669c0424I5038b5026A64469K01939
9416C66408b74840e1998k29222M8074q594k50272G310c04208D0220b46000m1572
9405b87572MJ28511j76194a61867j59925g9951E828g0396q5103E7853i7302n1982
9393a49284g1438j95562a3010m2706I633a39023A68830a37933H4713a84120D6148
$$ plain form
9471 -255614 119226 253451 -12037 -188903 -90095 5594 -20512 7486 -175413 -51642 139579
9459 166658 -278503 -227150 -296626 227713 -288291 -125000 -7830 79692 -247559 -133985 -270071
9448 -270071 133044 300586 -276600 -190599 135919 -414232 210722 -143769 -49247 -111637
9438 -111637 90331 -70884 -69428 18984 227966 -45273 -242452 227036 -77244 -62949 -94537
9427 -94537 -1095 -256535 255390 721627 -37986 -240655 -30424 95038 -25026 164469 366408
9416 366408 -274840 -51998 -281220 -233146 -241740 -492012 7310 -304208 40220 -246000 -287572
9405 -287572 -287568 -159057 -335251 -161867 -321792 -79951 5828 -70396 -155499 57853 -97302 -149284
9393 -149284 -71438 -267000 -13010 -55716 9633 -139023 168830 -137933 84713 -184120 46148
9381B04842c875j82737f7779m1474j00440M6405A23027k5410b38772d2459q9767
9370a32226j48733p5324i9185e413o8585B08845G1438A603a91631K5769c0032
9358b74598b8177m4469B25905a67292G0596K11475A019M6952i2803d0240A44047
9346D6497K79499G4450a82783o3803B83404A3668b13279A75006J75089b64552
9335A09102c2805E8440a34729j82281A31419G943N2980a71059D6793b64451e3786
9323i1725j16148j52213a48842M4245I9113a41484b82A6770a27470j45850B39069
9311a30790k5970c2817l3114m497l47723a28002j12677C86118b82685B22427J7351
9300B39778D9314f535A44500n7513f8123l3683A00919a42164A0403a23080a8249
$$ plain form
9381 204842 -3875 -186612 -67779 -109253 -209693 -163288 123027 97617 -238772 -42459 -132226
9370 -132226 -280959 -356283 -99185 -5413 -73998 208845 71438 1603 -191631 -165862 -30032
9358 -274598 -28177 -72646 225905 -167292 70596 282071 1019 47971 -92803 -40240 144047
9346 46497 325996 74450 -182783 -246586 283404 13668 -213279 175006 350095 -264552
9335 109102 -32805 58440 -134729 -317010 131419 7943 60923 -171059 46793 -264451 -53786
9323 -91725 -207873 -360086 -148842 -104597 99113 -141484 -282 16770 -127470 -273320 239069
9311 -130790 -156760 -32817 -65931 -70428 -418151 -128002 -240679 386118 -282685 222427 239778
9300 239778 49314 -6535 144500 86987 -68123 -101806 100919 -142164 10403 -123080 -18249
9288D2672a0577j62003A25908a70335m162H456Q1278a26157F1395e1395o2799
9277a14194j78020a677q3833E3466h1349j88235N3427A36300D6572c11500f0913
9265a33747A218R6549h8425A28089A7923L91186a83602r7366J052f718K1C03347
9252a22665k26286h9223A98751b88158P8882Q7733O262j34951P7526l95875g6707
9240b30631J6356m7455h6959q5066C1604M8441a07247C5105a36201B03189b94268
9228A96815J13493A33947A7560E543f3519p5617B5102b06934f1317j38238K7801
9217a71754I7670g8555l6603D3647A6708d8098j53434Q2018I7834J65418c43543
9205A50630b48663g1156q4658j967A71248b59472B33934c80431J73723A21770
$$ plain form
9288 42672 -10577 -172580 125908 -170335 -174497 8456 89734 -126157 61395 -51395 -114194
9277 -114194 -292214 -1677 -85510 53466 -81349 -269584 -216157 136300 46572 -311500 -60913
9265 -133747 1218 97767 -88425 128089 17923 409109 -183602 -280968 -279916 -6718 -6697 303347
9252 -122665 -348951 -89223 198751 -288158 -209276 -121543 -115281 -250232 -172706 -568581 -76707
9240 -230631 -214275 -261730 -86959 -172025 31604 80045 -107247 35105 -136201 203189 -294268
9228 196815 310308 133947 17560 5543 -63519 -139136 25102 -206934 -61317 -199555 -171754
9217 -171754 97670 -78555 -115158 43647 16708 -48098 -201532 -119514 97834 263252 -343543
9205 150630 -248663 -71156 -155814 -157781 171248 -259472 233934 -380431 -206708 121770
9194C8029A58L05571E2946j7885a20867o7928o4327d5232A5157M6549B7337a6415
9181B19965h1744D1837A4812Q8067J3388M4440C412b0053D78f2968o8607e9136
9168b65573g2393j15926O4388G0016k6439J72314a46358N1791A72371b87136B86439
9156b9013j3457m9623A06267O0407A0843R3605e61158C23756e8681j79794c4941
9144a29524M7515j04153Q7114p852A5790a37655o952J493A04411a4623C12310
9132a13550c2375I3815c7205B07103a41089d5609j12881O5529G7424A1542c23925
9120A56517a14456H6831a113j89392h8393n6768N3579C5693b38355O4125D9878
9108E3839a2089k62100J19850A09579K5989a42245j27590j44434F9040k537c36069
$$ plain form
9194 38029 158 305729 52946 35061 -120867 -188795 -253122 -45232 15157 61706 27337 -16415
9181 219965 -81744 41837 14812 102879 116267 160707 3412 -20053 478 -62968 -131575 -59136
9168 -265573 -72393 -188319 -123931 70016 43577 215891 -146358 -94567 172371 -287136 286439
9156 -29013 -42470 -92093 106267 166674 10843 104448 -561158 323756 -58681 -238475 -34941
9144 -129524 -82009 -186162 -99048 -106900 15790 -137655 -144607 -143114 104411 -14623 312310
9132 -113550 -32375 93815 -37205 207103 -141089 -45609 -158490 -92961 77424 11542 -323925
9120 156517 -114456 86831 -1113 -190505 -88393 -145161 -91582 35693 -238355 -174230 49878
9108 53839 -12089 -274189 -154339 109579 135568 -142245 -269835 -414269 69040 66503 -336069
9096a60940K7165d8453C66645d28883C6253m202b3918k23161c9132j93729B98217
9084G1667a28533j22364C5048P315a70051k2037G2464c679j51249N1128n0603
9073a54403J74m960I4137L0659L20040F7354A8386a13398H2647n440R0303B5906
9060a51613A94526e7687k5125o46593c1967m7570A3553h315j5254B60904c3505
9048b73491j80114b9778k98989J05723A3392m622h5542H9231a594k81469O1761
9037b21302A35691P2824D3051a57405J0518j32267j24002a18483K3802k48108
9027c42789J36641Q6222c5630C00988E8255b62111k58415B64297g0966A87491
9016C22326b064j6513B61299g4397k92008J55927a04294A31943b8517A90037K7153
$$ plain form
9096 -160940 -133775 -48453 366645 -428883 36253 32051 -23918 -247079 -39132 -232861 298217
9084 71667 -128533 -250897 35048 42363 -170051 -192088 72464 -3679 -154928 -103800 -154403
9073 -154403 -154229 -159189 94137 124796 444836 67354 18386 -113398 82647 77207 167510 25906
9060 -151613 194526 -57687 -82812 -729405 -31967 -79537 13553 -8315 -23569 260904 -33505
9048 -273491 -453605 -29778 -328767 -223044 13392 8770 -85542 89231 -1594 -283063 -221302
9037 -221302 135691 208515 43051 -157405 -146887 -279154 -403156 -118483 -94681 -342789
9027 -342789 -206148 -119926 -35630 300988 58255 -262111 -520526 264297 -70966 187491
9016 322326 -2064 -18577 261299 -74397 -366405 -210478 -104294 131943 -28517 190037 217190
9005B17190g7208l11467H9531a34768a6542j62022o755n8699k58047A64528c7125
8993b82105G2998d5602D59336a32773l2668N5159C9393o726p55b2908r7159A58790
8980a02238A44740c03561B06299h6499k29145A06897o930O3122b7583B8684b44206
8968B40514b9061a4424A30025b39805B15005a72339L1122j89787j7373A0018h5735
8956a23389A05753n0777k3119P4766c45763a32348J2420j01123L8306A91499a26419
8944B47070e0816A43953a10494N862B9972J37444d9053A73188a1051A78003H2950
8932A66526G7829a0555G0159R7035a10318o4802B11596q3759e1297D62268N16588
8921I78856J996620M183086M961130C524719A048623B98379J01643A24542k4556
$$ plain form
9005 217190 -77208 -388675 89531 -134768 -16542 -178564 -185319 -244018 -502065 164528 -37125
8993 -282105 72998 -45602 459336 -132773 -165441 -110282 39393 32667 31912 -22908 -120067 158790
8980 -102238 144740 -303561 206299 -86499 -315644 106897 99967 163089 -27583 28684 -244206
8968 240514 -29061 -14424 130025 -239805 215005 -172339 -141217 -331004 -348377 10018 -85735
8956 -123389 105753 54976 31857 106623 -345763 -132348 -119928 -221051 -182745 191499 -126419
8944 247070 -50816 143953 -110494 -104632 29972 167416 -49053 173188 -11051 178003 82950
8932 166526 77829 -10555 70159 167194 -110318 -175120 211596 127837 -51297 462268 978856
8921 978856 2975476 7158562 12119692 3524719 1048623 298379 400022 124542 99986
8912I9986h6337G094a01615B68683d119H9390K04161n5108a9926A05284J63852
8901B69136b12455C17471a01185j87260b41D1205k707d999C0934M56803A69048
8889d28623B16413c06726A25635h0136j34220P9787A07468b00596B8164b20157
8878d6619k78417F6918i4220c2486l6484B06720b67454R9003D3603i594E0386
8866I0042e07281J54916b7990F0263c33541a18254j09367J07970j0488c5987p94
$$ plain form
8912 99986 -86337 7094 -101615 268683 -4119 89390 293551 238443 -19926 105284 269136
8901 269136 -212455 317471 -101185 -288445 -241 41205 38498 -4999 30934 487737 169048
8889 -428623 216413 -306726 125635 -80136 -214356 -134569 107468 -200596 28164 -220157
8878 -46619 -325036 66918 -94220 -32486 -68970 206720 -267454 -168451 43603 -9594 50386
8866 90042 -507281 -352365 -27990 60263 -333541 -118254 -227621 -119651 -130139 -35987 -36781
$$ [...]
##END NTUPLES=NMR SPECTRUM
##END=
