
##TITLE=AC1208_HCOAH12050_7160530_pt4Y0gEDqu
##JCAMPDX= 6.0         $$ Bruker NMR JCAMP-DX V2.0
##DATA TYPE= NMR SPECTRUM
##DATA CLASS= NTUPLES
##ORIGIN= BRUKER
##OWNER= Administrator
$$ 1.72 TOPSPIN		Version 2.1
$$ 2012-11-30 22:35:24.395 -0500  Administrator@X
$$ Compression mode = diff/dup
##.OBSERVE FREQUENCY= 400.02188249412
##.OBSERVE NUCLEUS= ^1H
##.ACQUISITION MODE= SIMULTANEOUS (DQD)
##.ACQUISITION SCHEME= undefined
##.AVERAGES= 64
##.DIGITISER RES= 22
##SPECTROMETER/DATA SYSTEM= spect
##.PULSE SEQUENCE= noesygpps1d.comp
##.SOLVENT NAME= COFFEE_meoh
##.SHIFT REFERENCE= INTERNAL, COFFEE_meoh, 1, 14.9623
##AUDIT TRAIL= $$ (NUMBER, WHEN, WHO, WHERE, PROCESS, VERSION, WHAT)
$$ ##TITLE= Audit trail, TOPSPIN		Version 2.1
$$ ##JCAMPDX= 5.01
$$ ##ORIGIN= Bruker BioSpin GmbH
$$ ##OWNER= Administrator
$$ $$ E:\/data/COFFEE/nmr/AC1208_HCOAH12050_7160530_pt4Y0gEDqu/12/pdata/1/auditp.txt
$$ ##AUDIT TRAIL=  $$ (NUMBER, WHEN, WHO, WHERE, PROCESS, VERSION, WHAT)
(   1,<2012-11-30 22:35:15.295 -0500>,<Administrator>,<X>,<go>,<TOPSPIN 2.1>,
      <created by zg
	started at 2012-11-30 22:23:43.251 -0500,
	POWCHK enabled, PULCHK disabled,
       configuration hash MD5:
       86 BA 57 50 F2 9D 5C 9B 26 00 A9 28 5F 66 2E 89
       data hash MD5: 64K
       8D 10 97 39 88 28 2F 34 D9 14 40 08 9E EB 4F 19>)
(   2,<2012-11-30 22:35:19.966 -0500>,<Administrator>,<X>,<proc1d>,<TOPSPIN 2.1>,
      <Start of raw data processing
       efp LB = 0.3 FT_mod = 6 PKNL = 1 PHC0 = 0 PHC1 = 0 SI = 128K 
       data hash MD5: 128K
       16 CC C5 0C BC C8 DD 18 99 1D 5E F6 5D 58 2F 9F>)
(   3,<2012-11-30 22:35:21.560 -0500>,<Administrator>,<X>,<proc1d>,<TOPSPIN 2.1>,
      <pk PHC0 = -79.48059 PHC1 = 0 
       data hash MD5: 128K
       D3 66 F3 C6 9F 88 9C 8A D3 A8 0A BB E6 DD 93 FB>)
(   4,<2012-11-30 22:35:22.685 -0500>,<Administrator>,<X>,<proc1d>,<TOPSPIN 2.1>,
      <abs ABSG = 1 
       data hash MD5: 128K
       EF AF 0B 0F FB 55 DF 3E 5B 8A 15 59 9F EE 7B C4>)
(   5,<2012-11-30 22:35:22.989 -0500>,<Administrator>,<X>,<proc1d>,<TOPSPIN 2.1>,
      <abs ABSG = 2 
       data hash MD5: 128K
       3B 66 DF 0C 23 7B 1C EB 60 25 CA E8 2F FC AD 43>)
(   6,<2012-11-30 22:35:23.294 -0500>,<Administrator>,<X>,<proc1d>,<TOPSPIN 2.1>,
      <abs ABSG = 3 
       data hash MD5: 128K
       1F 74 51 D4 9F 5F D4 30 D8 35 FE D7 45 FA 62 69>)
(   7,<2012-11-30 22:35:23.575 -0500>,<Administrator>,<X>,<proc1d>,<TOPSPIN 2.1>,
      <abs ABSG = 4 
       data hash MD5: 128K
       2E D8 46 D3 AF 12 A5 86 61 A7 6A 82 26 DD 04 2D>)
(   8,<2012-11-30 22:35:23.833 -0500>,<Administrator>,<X>,<proc1d>,<TOPSPIN 2.1>,
      <abs ABSG = 5 
       data hash MD5: 128K
       EE 69 4D 38 5A B7 BD 61 97 CA 8D A6 AA D6 9B 9C>)
$$ ##END=
$$ 
$$ $$ hash MD5
$$ $$ 41 7A BC 85 4C 9F E3 DD 0D 1A 60 1E F6 4C DC 63
##$RELAX= 
##$RELAX= 
##$RELAX= 
##$RELAX= 
##$RELAX= 
##$RELAX= 
##$RELAX= 
##$RELAX= 
$$ Bruker specific parameters
$$ --------------------------
##$DU= <E:\>
##$EXPNO= 12
$$ [...]
150 150 150 150 150 150 150 150
##$TP07= 0
##$TPNAME0= <>
##$TPNAME1= <>
##$TPNAME2= <>
##$TPNAME3= <>
##$TPNAME4= <>
##$TPNAME5= <>
##$TPNAME6= <>
##$TPNAME7= <>
##$TPOAL= (0..7)
0.5 0.5 0.5 0.5 0.5 0.5 0.5 0.5
##$TPOFFS= (0..7)
0 0 0 0 0 0 0 0
##$TUNHIN= 0
##$TUNHOUT= 0
##$TUNXOUT= 0
##$USERA1= <user>
##$USERA2= <user>
##$USERA3= <user>
##$USERA4= <user>
##$USERA5= <user>
##$V9= 5
##$VALIST= <valist>
##$VCLIST= <CCCCCCCCCCCCCCC>
##$VD= 0
##$VDLIST= <DDDDDDDDDDDDDDD>
##$VPLIST= <PPPPPPPPPPPPPPP>
##$VTLIST= <TTTTTTTTTTTTTTT>
##$WBST= 1024
##$WBSW= 4
##$XGAIN= (0..3)
0 0 0 0
##$XL= 0
##$YL= 0
##$YMAX_a= 8868628
##$YMIN_a= -18568452
##$ZGOPTNS= <>
##$ZL1= 120
##$ZL2= 120
##$ZL3= 120
##$ZL4= 120
##$ABSF1= 14.9623
##$ABSF2= -5.595881
##$ABSG= 5
##$ABSL= 3
##$ALPHA= 0
##$AQORDER= 0
##$ASSFAC= 0
##$ASSFACI= 0
##$ASSFACX= 0
##$ASSWID= 0
##$AUNMP= <proc_prof1d_extract.lims>
##$AXLEFT= 0
##$AXNAME= <>
##$AXNUC= <1H>
##$AXRIGHT= 0
##$AXTYPE= 0
##$AXUNIT= <>
##$AZFE= 0.1
##$AZFW= 0.1
##$BCFW= 0
##$BC_mod= 0
##$BYTORDP= 0
##$COROFFS= 0
##$CY= 15
##$DATMOD= 1
##$DC= 0
##$DFILT= <>
##$DTYPP= 0
##$F1P= 0
##$F2P= 0
##$FCOR= 0.5
##$FTSIZE= 131072
##$FT_mod= 6
##$GAMMA= 0
##$GB= 0
##$INTBC= 1
##$INTSCL= 1
##$ISEN= 128
##$LB= 0.3
##$LEV0= 0
##$LPBIN= 0
##$MAXI= 10000
##$MC2= 0
##$MEAN= 0
##$ME_mod= 0
##$MI= 0
##$NCOEF= 0
##$NC_proc= -2
##$NLEV= 6
##$NOISF1= 0
##$NOISF2= 0
##$NSP= 0
##$NTH_PI= 0
##$NZP= 0
##$OFFSET= 14.9623
##$PC= 1
##$PHC0= -79.48059
##$PHC1= 0
##$PH_mod= 1
##$PKNL= yes
##$PPARMOD= 0
##$PPDIAG= 0
##$PPIPTYP= 0
##$PPMPNUM= 2147483647
##$PPRESOL= 1
##$PSCAL= 4
##$PSIGN= 0
##$PYNMP= <proc.py>
##$REVERSE= no
##$SF= 400.020009116664
##$SI= 131072
##$SIGF1= 0
##$SIGF2= 0
##$SINO= 400
##$SIOLD= 131072
##$SPECTYP= <>
##$SREGLST= <1H.CDCl3>
##$SSB= 0
##$STSI= 131072
##$STSR= 0
##$SW_p= 8223.68421052631
##$SYMM= 0
##$S_DEV= 0
##$TDeff= 65536
##$TDoff= 0
##$TI= <>
##$TILT= no
##$TM1= 0
##$TM2= 0
##$TOPLEV= 0
##$USERP1= <user>
##$USERP2= <user>
##$USERP3= <user>
##$USERP4= <user>
##$USERP5= <user>
##$WDW= 1
##$XDIM= 131072
##$YMAX_p= 434647226
##$YMIN_p= -95810
##$CURPLOT= <Network HP LaserJet P1505>
##$CURPRIN= <$Network HP LaserJet P1505>
##$DFORMAT= <normdp>
##$LAYOUT= <+/1D_H.xwp>
##$LFORMAT= <normlp>
##$PFORMAT= <normpl>
##$SURQMSG= 1
$$ End of Bruker specific parameters
$$ ---------------------------------
##NTUPLES= NMR SPECTRUM
##VAR_NAME=  FREQUENCY,     SPECTRUM/REAL,   SPECTRUM/IMAG
##SYMBOL=    X,             R,               I
##VAR_TYPE=  INDEPENDENT,   DEPENDENT,       DEPENDENT
##VAR_FORM=  AFFN,          ASDF,            ASDF
##VAR_DIM=   131072,        131072,          131072
##UNITS=     HZ,            ARBITRARY UNITS, ARBITRARY UNITS
##FACTOR=    0.0627417313425164, 1,          1
##FIRST=     8223.62146879497, -1942,        -73398
##LAST=      0,             1297,            -74271
##MIN=       0,             -95810,          0
##MAX=       8223.62146879497, 434647226,    0
$$ Real data points
##PAGE= N=1
##DATA TABLE= (X++(R..R)), XYDATA
$$ [...]
$$ plain form
63232 544901 565961 589267 614592 640947 667699 695096 723420 752183 780614 808542 836315
63221 836315 864041 891347 917780 943113 967362 990853 1014211 1037882 1061591 1084421 1105452
63210 1105452 1124110 1139877 1151948 1159343 1161255 1157177 1146831 1130132 1107231 1078613 1045309 1009053
63198 1009053 971893 935200 899080 863180 828196 796141 768859 746611 728468 713747 702459
63187 702459 694627 690020 688727 691243 697561 706745 717902 731124 746913 764986 784365 804491 825534
63174 825534 847533 869878 891942 913767 935778 958048 980102 1001281 1021013 1038890 1054691
63163 1054691 1068291 1079386 1087334 1091421 1091228 1086707 1077872 1064556 1046525 1023875 997229 967503
63151 967503 935468 901749 867294 833573 801974 773061 746602 722313 700244 680419 662503
$$ packed form
63232E44901K1060K3306K5325K6355K6752K7397K8324K8763K8431K7928K7773
63221H36315K7726K7306K6433K5333K4249K3491K3358K3671K3709K2830K1031
63210A105452J8658J5767J2071P395J912m078j0346j6699k2901k8618l3304l6256
63198A009053l7160l6693l6120l5900l4984l2055k7282k2248j8143j4721j1288
63187G02459p832m607j293K516O318R184J1157J3222J5789J8073J9379K0126K1043
63174H25534K1999K2345K2064K1825K2011K2270K2054K1179J9732J7877J5801
63163A054691J3600J1095P948M087j93m521q835j3316j8031k2650k6646k9726
63151I67503l2035l3719l4455l3721l1599k8913k6459k4289k2069j9825j7916
$$ plain form
63140 662503 646121 631410 618889 608700 600145 592228 584717 578476 574499 572638 571582 570178 568510
63127 568510 567486 567681 568922 570788 572994 575245 577222 578970 581095 584301 588748 593857 598678 602584
63113 602584 605823 609333 613733 618569 622910 626584 630290 634441 638598 642371 646216 650745 655701 660306
63099 660306 664424 668598 672993 676992 680031 682219 683910 685149 685831 685994 685632 684600 683034 681548 680716
63084 680716 680549 680776 681305 682102 682990 684030 685826 688991 693489 699036 705868 714453 724502 735082 745873
63069 745873 757593 770911 785597 801109 817443 834840 853092 871758 890858 910887 932379
63058 932379 955833 981811 1010553 1041695 1074864 1110395 1148917 1190374 1234106 1279852 1327971
63047 1327971 1378530 1430848 1484227 1538587 1593987 1649989 1705907 1761449 1816653 1871362 1925165
$$ packed form
63140F62503j6382j4711j2521j0189q555p917p511o241l977j861j056j404j668
63127E68510j024J95J241J866K206K251J977J748K125L206M447N109M821L906
63113F02584L239L510M400M836M341L674L706M151M157L773L845M529M956M605
63099F60306M118M174M395L999L039K188J691J239O82J63l62j032j566j486q32
63084F80716j67K27N29P97Q88J040J796L165M498N547O832Q585J0049J0580J0791
63069G45873J1720J3318J4686J5512J6334J7397J8252J8666J9100K0029K1492
63058I32379K3454K5978K8742L1142L3169L5531L8522M1457M3732M5746M8119
63047A327971N0559N2318N3379N4360N5400N6002N5918N5542N5204N4709N3803
$$ plain form
63036 1925165 1977827 2029528 2080746 2132055 2183930 2236412 2288870 2340153 2388935 2433887 2473560
63025 2473560 2506275 2530184 2543512 2544852 2533262 2508182 2469556 2418241 2356152 2285728 2209331
63014 2209331 2129396 2048845 1970692 1897024 1828697 1766068 1709593 1659703 1616672 1580948 1553197
63003 1553197 1533671 1521811 1516703 1517686 1524295 1536100 1552885 1574628 1600849 1630312 1661821 1695019
62991 1695019 1729895 1765797 1801564 1836605 1871188 1905496 1938862 1970160 1998673 2024307 2047048
62980 2047048 2066245 2080337 2087293 2085472 2074186 2053493 2023699 1985118 1938068 1882929 1820475 1752381
62968 1752381 1681127 1609026 1537437 1467107 1398938 1334010 1273085 1216555 1164727 1117707 1075068
62957 1075068 1036089 1000300 967518 937571 910482 886696 866485 849182 833688 819703 807688
$$ packed form
63036A925165N2662N1701N1218N1309N1875N2482N2458N1283M8782M4952L9673
63025B473560L2715K3909J3328J340j1590k5080l8626n1315o2089p0424p6397
63014B209331p9935q0551p8153p3668o8327o2629n6475m9890m3031l5724k7751
63003A553197j9526j1860n108R83O609J1805J6785K1743K6221K9463L1509L3198
62991A695019L4876L5902L5767L5041L4583L4308L3366L1298K8513K5634K2741
62980B047048J9197J4092O956j821j1286k0693k9794l8581m7050n5139o2454o8094
62968A752381p1254p2101p1589p0330o8169o4928o0925n6530n1828m7020m2639
62957A075068l8979l5789l2782k9947k7089k3786k0211j7303j5494j3985j2015
$$ plain form
62946 807688 797521 788060 778503 769356 761396 754165 746269 736992 726911 716931 707270 697626 687927 678567
62932 678567 669857 661422 652394 642438 632446 623855 617226 611839 606722 601514 596154 590399 584273 578621
62918 578621 574452 571816 569851 567931 566155 564660 563103 561105 558763 556316 553627 550455 547116 544425
62904 544425 542875 542132 541471 540570 539742 539454 539826 540636 541682 542879 544008 544642 544533 543956 543455 543234 543007
62887 543007 542450 541535 540310 538539 535860 532314 528522 525248 522832 521123 519887 519101 518784 518655 518261 517492
62871 517492 516758 516430 516287 515816 515049 514643 514963 515431 515159 514043 512781 511812 510664 508554 505369 501794 498715
62854 498715 496688 495791 495613 495385 494424 492517 489834 486561 482863 479096 475755 473088 470948 469043 467152
62839 467152 465092 462761 460334 458222 456714 455787 455285 454976 454376 452913 450587 448195 446601 445944 445840 446073
$$ packed form
62946H07688j0167r461r557r147p960p231p896r277j0081r980r661r644r699r360
62932F78567q710q435r028r956r992q591o629n387n117n208n360n755o126n652
62918E78621m169k636j965j920j776j495j557j998k342k447k689l172l339k691
62904E44425j550p43o61r01q28k88L72Q10J046J197J129O34j09n77n01k21k27
62887E43007n57r15j225j771k679l546l792l274k416j709j236p86l17j29l94p69
62871E17492p34l28j43m71p67m06L20M68k72j116j262r69j148k110l185l575l079
62854D98715k027q97j78k28r61j907k683l273l698l767l341k667k140j905j891
62839D67152k060k331k427k112j508r27n02l09o00j463k326k392j594o57j04K33
$$ plain form
62823 446073 446608 447059 446698 445205 443080 441145 439844 439141 438824 438740 438872 439358 440354 441815 443525 445393 447536
62806 447536 449960 452387 454567 456691 459356 463238 468879 476516 485775 495640 505205 514609 524897 536769
62792 536769 549821 563336 577480 593145 610673 629516 649363 670961 695272 722337 751709
62781 751709 783808 819979 861112 906888 956708 1010792 1069994 1135043 1206379 1284320 1368768
62770 1368768 1458881 1553424 1651326 1751493 1852256 1951360 2046416 2135028 2214598 2282433 2336142
62759 2336142 2373728 2393517 2394501 2376844 2341860 2291510 2228069 2153920 2071097 1981019 1885155 1785912
62747 1785912 1686306 1588562 1493473 1401322 1312958 1229643 1152234 1080925 1015605 956112 902228
62736 902228 853684 810167 771115 735647 702930 672701 645323 621266 600508 582380 566042
$$ packed form
62823D46073N35M51l61j493k125j935j301p03l17q4J32M86R96J461J710J868K143
62806D47536K424K427K180K124K665L882N641P637R259R865R565R404J0288J1872
62792E36769J3052J3515J4144J5665J7528J8843J9847K1598K4311K7065K9372
62781G51709L2099L6171M1133M5776M9820N4084N9202O5049P1336P7941Q4448
62770A368768R0113R4543R7902J00167J00763R9104R5056Q8612P9570O7835N3709
62759B336142L7586J9789R84j7657l4984n0350o3441p4149q2823r0078r5864r9243
62747A785912r9606r7744r5089r2151q8364q3315p7409p1309o5320n9493n3884
62736I02228m8544m3517l9052l5468l2717l0229k7378k4057k0758j8128j6338
$$ plain form
62725 566042 551155 538018 526912 517427 508724 500485 493234 487602 483494 480246 477457 475439 474868 476160
62711 476160 479191 483523 488864 495364 503502 513728 526208 540852 557536 576360 597722 622041
62699 622041 649378 679499 712388 748521 788547 832965 882249 936844 996651 1060773 1128233
62688 1128233 1198717 1272071 1347209 1422184 1495254 1565136 1630044 1687251 1734027 1768621 1790043
62677 1790043 1797516 1790731 1770313 1737532 1693662 1639983 1578208 1510481 1438925 1365308 1290899 1216451
62665 1216451 1142575 1070457 1001932 938463 880285 826918 778285 734777 696307 661901 630406
62654 630406 601265 574509 550235 528267 508144 489390 471927 456147 442352 430181 418877
62643 418877 408078 397980 388709 380007 371756 364444 358667 354281 350383 346141 341407 336534 331857 327486
$$ packed form
62725E66042j4887j3137j1106r485q703q239p251n632m108l248k789k018n71J292
62711D76160L031M332N341O500Q138J0226J2480J4644J6684J8824K1362K4319
62699F22041K7337L0121L2889L6133M0026M4418M9284N4595N9807O4122O7460
62688A128233P0484P3354P5138P4975P3070O9882O4908N7207M6776L4594K1422
62677A790043P473o785k0418l2781m3870n3679o1775o7727p1556p3617p4409p4448
62665A216451p3876p2118o8525o3469n8178n3367m8633m3508l8470l4406l1495
62654F30406k9141k6756k4274k1968k0123j8754j7463j5780j3795j2171j1304
62643D18877j0799j0098r271q702q251p312n777m386l898m242m734m873m677m371
$$ plain form
62629 327486 323399 319536 315829 312264 308943 306037 303704 302097 301339 301304 301513 301469 301172 301119 301745 303075 304979
62612 304979 307439 310330 313201 315660 317866 320405 323769 328263 334157 341465 349637 358019 366717 376590
62598 376590 388280 401709 416749 433854 453687 476452 502016 530502 562350 597846 636842
62587 636842 679000 724120 772229 823291 876652 930781 983828 1034512 1082074 1125236 1161623
62576 1161623 1188708 1205184 1211202 1207538 1194927 1174079 1145875 1111380 1071834 1028661 983355 937303
62564 937303 891652 847106 803875 762091 722404 685826 652792 622709 594806 569117 546278
62553 546278 526525 509319 493801 479231 465119 451390 438409 426521 415542 405013 394797
62542 394797 385052 375733 366715 358447 351946 347809 345526 343936 342136 339869 337450 335553 334830 335374 336713
$$ packed form
62629C27486m087l863l707l565l321k906k333j607p58l5K09m4k97n3O26J330J904
62612C04979K460K891K871K459K206K539L364M494N894P308Q172Q382Q698R873
62598C76590J1690J3429J5040J7105J9833K2765K5564K8486L1848L5496L8996
62587F36842M2158M5120M8109N1062N3361N4129N3047N0684M7562M3162L6387
62576A161623K7085J6476O018l664j2611k0848k8204l4495l9546m3173m5306m6052
62564I37303m5651m4546m3231m1784l9687l6578l3034l0083k7903k5689k2839
62553E46278j9753j7206j5518j4570j4112j3729j2981j1888j0979j0529j0216
62542C94797r745r319r018q268o501m137k283j590j800k267k419j897p23N44J339
$$ plain form
62527 336713 338507 341069 344940 350062 355741 361416 367241 373802 381453 390114 399675 410383 422743 437085
62513 437085 453437 471834 492634 516372 543387 573641 606861 642750 681137 721992 765168
62502 765168 809956 854869 898016 937689 972578 1001557 1023574 1037904 1044430 1043585 1035898 1021572
62490 1021572 1000481 972740 939348 902230 863490 824537 785900 747763 710596 675311 642897
62479 642897 613941 588488 566302 547098 530463 515728 502237 489765 478486 468603 460245 453651
62467 453651 448968 445784 443220 440777 438813 437998 438573 440314 442896 446004 449362 452975 457143 462014 467377
62452 467377 473203 480034 488357 497748 507125 515840 524081 532212 540132 547422 553823 559379 564121 567600
62438 567600 568743 566474 560665 552237 542109 530341 516649 501412 485623 469976 454646 439945
$$ packed form
62527C36713J794K562L871N122N679N675N825O561P651Q661R561J0708J2360J4342
62513D37085J6352J8397K0800K3738K7015L0254L3220L5889L8387M0855M3176
62502G65168M4788M4913M3147L9673L4889K8979K2017J4330O526q45p687j4326
62490A021572k1091k7741l3392l7118l8740l8953l8637l8137l7167l5285l2414
62479F42897k8956k5453k2186j9204j6635j4735j3491j2472j1279r883q358o594
62467D53651m683l184k564k443j964q15N75J741K582L108L358L613M168M871N363
62452D67377N826O831Q323R391R377Q715Q241Q131P920P290O401N556M742L479
62438E67600J143k269n809q428j0128j1768j3692j5237j5789j5647j5330j4701
$$ plain form
62426 439945 426606 415172 405441 396721 388441 380521 373431 367914 364371 362435 361397 360952 361284 362547
62412 362547 364703 367840 372186 377693 383954 390610 397498 404455 411431 418792 426991 435733 443979 451032
62398 451032 457195 463106 468848 474080 478586 482192 484352 484404 482307 478759 474482 469599 463778 456880 449373
62383 449373 442135 435895 430919 427234 424940 424058 424257 425153 426959 430505 436394 444410 453948 464897 477880
62368 477880 493658 512447 533808 557307 583253 612651 646242 683807 724665 768542 815464
62357 815464 864959 916013 967861 1020106 1071800 1120995 1165627 1204416 1236553 1261020 1276866
62346 1276866 1283958 1282942 1274563 1259449 1238493 1212980 1184179 1152977 1119819 1084825 1048050 1009923
62334 1009923 971435 933764 897782 864035 832961 804745 779058 755262 732942 712080 692733
$$ packed form
62426D39945j3339j1434r731q720q280p920p090n517l543j936j038m45L32J263
62412C62547K156L137M346N507O261O656O888O957O976P361Q199Q742Q246P053
62398D51032O163N911N742N232M506L606K160N2k097l548m277m883n821o898p507
62383D49373p238o240m976l685k294q82J99Q96J806L546N889Q016R538J0949J2983
62368D77880J5778J8789K1361K3499K5946K9398L3591L7565M0858M3877M6922
62357H15464M9495N1054N1848N2245N1694M9195M4632L8789L2137K4467J5846
62346A276866P092j016q379j5114k0956k5513k8801l1202l3158l4994l6775l8127
62334A009923l8488l7671l5982l3747l1074k8216k5687k3796k2320k0862j9347
$$ plain form
62323 692733 674776 657962 642072 627009 612938 600332 589720 581297 574823 569847 566015 563203
62311 563203 561493 560953 561350 562094 562495 562075 560662 558368 555452 552055 547996 543046 537397 531601 525947
62296 525947 520220 514204 508020 501752 495183 488403 482383 478335 476525 476198 476640 477777 479676 482088 484810
62281 484810 488126 492402 497449 502667 507765 513021 518863 525480 532926 541287 550577 560675 571600 583734
62267 583734 597523 612966 629679 647532 666971 688604 712828 740211 771897 809031 851681
62256 851681 898771 949245 1002866 1059625 1118692 1178266 1236143 1289902 1336732 1373766 1399067
62245 1399067 1412263 1414260 1406420 1389947 1365692 1334324 1296739 1254398 1209162 1162709 1116161 1070275
62233 1070275 1025875 983885 944978 909384 877159 848581 824050 803562 786485 771987 759557
$$ packed form
62323F92733j7957j6814j5890j5063j4071j2606j0612q423o474m976l832k812
62311E63203j710n40L97P44M01m20j413k294k916l397m059m950n649n796n654
62296E25947n727o016o184o268o569o780o020m048j810l27M42J137J899K412K722
62281D84810L316M276N047N218N098N256N842O617P446Q361R290J0098J0925J2134
62267E83734J3789J5443J6713J7853J9439K1633K4224K7383L1686L7134M2650
62256H51681M7090N0474N3621N6759N9067N9574N7877N3759M6830L7034K5301
62245A399067J3196J997p840j6473k4255l1368l7585m2341m5236m6453m6548m5886
62233A070275m4400m1990l8907l5594l2225k8578k4531k0488j7077j4498j2430
$$ plain form
62222 759557 748931 739689 731386 724166 718793 715702 714166 712778 710776 708628 707247 706902 707083 707262 707468
62207 707468 708064 709215 710818 712847 715509 719063 723714 729775 737673 747614 759457 773164 789184 808043
62193 808043 829657 853340 878428 904652 931997 960593 990749 1022674 1055927 1089365 1121688
62182 1121688 1151844 1178992 1202496 1222026 1237326 1247818 1252895 1252811 1248853 1242456 1234540 1226094 1218899
62169 1218899 1215058 1215820 1221246 1230913 1244568 1262134 1283430 1307995 1334968 1363046 1390685 1416353
62157 1416353 1438667 1456524 1469434 1477645 1481871 1482945 1481700 1478885 1474832 1469296 1461802 1452166 1440681
62144 1440681 1428053 1415314 1403598 1393726 1386062 1380804 1378050 1377439 1378096 1379323 1381099 1383632 1386762 1390300
62130 1390300 1394707 1400758 1408578 1417584 1427456 1438604 1451509 1466132 1482324 1500378 1520721 1543197
$$ packed form
62222G59557j0626r242q303p220n373l091j536j388k002k148j381l45J81J79K06
62207G07468N96J151J603K029K662L554M651O061P898R941J1843J3707J6020J8859
62193H08043K1614K3683K5088K6224K7345K8596L0156L1925L3253L3438L2323
62182A121688L0156K7148K3504J9530J5300J0492N077q4l958o397p916q446p195
62169A218899l841P62N426R667J3655J7566K1296K4565K6973K8078K7639K5668
62157A416353K2314J7857J2910Q211M226J074j245k815m053n536p494r636j1485
62144A440681j2628j2739j1716r872p664n258k754o11O57J227J776K533L130L538
62130A390300M407O051P820R006R872J1148J2905J4623J6192J8054K0343K2476
$$ plain form
62118 1543197 1567109 1591914 1617543 1644051 1671278 1699037 1727317 1755943 1784161 1811029 1836383
62107 1836383 1861100 1886125 1911493 1936701 1961771 1987330 2013657 2040396 2067511 2095955 2126861
62096 2126861 2160371 2195774 2232615 2271225 2312235 2355890 2401754 2448774 2495691 2541705 2586841
62085 2586841 2631720 2677249 2724600 2774909 2828513 2884648 2942201 3000389 3058302 3114318 3166939
62074 3166939 3216253 3263949 3311790 3360454 3409718 3459054 3507946 3556203 3604155 3651930 3698415
62063 3698415 3741498 3779719 3813195 3842721 3868515 3890255 3907795 3921179 3930125 3934111 3932965 3927078
62051 3927078 3917028 3903310 3886300 3866201 3842992 3816580 3787073 3754808 3720355 3684649 3648982
62040 3648982 3614524 3581811 3550916 3522088 3496005 3473281 3453858 3437082 3422409 3409934 3400050
$$ packed form
62118A543197K3912K4805K5629K6508K7227K7759K8280K8626K8218K6868K5354
62107A836383K4717K5025K5368K5208K5070K5559K6327K6739K7115K8444L0906
62096B126861L3510L5403L6841L8610M1010M3655M5864M7020M6917M6014M5136
62085B586841M4879M5529M7351N0309N3604N6135N7553N8188N7913N6016N2621
62074C166939M9314M7696M7841M8664M9264M9336M8892M8257M7952M7775M6485
62063C698415M3083L8221L3476K9526K5794K1740J7540J3384Q946L986j146n887
62051C927078j0050j3718j7010k0099k3209k6412k9507l2265l4453l5706l5667
62040C648982l4458l2713l0895k8828k6083k2724j9423j6776j4673j2475r884
$$ plain form
62029 3400050 3392706 3387207 3382834 3379326 3376546 3373956 3370904 3367325 3363738 3360512 3357518 3354530 3351519 3348465
62015 3348465 3345353 3342550 3340749 3340229 3340530 3341218 3342611 3345359 3349546 3354706 3360693 3368073 3377591 3389517
62001 3389517 3403511 3418858 3434607 3449554 3462102 3470259 3472015 3465912 3451146 3427088 3393101 3349148
61989 3349148 3296344 3236522 3171430 3102764 3032774 2964075 2898499 2836394 2777206 2720500 2666324
61978 2666324 2615025 2567109 2523095 2483155 2446869 2413518 2382555 2353701 2326757 2301544 2277930
61967 2277930 2255678 2234351 2213605 2193579 2174783 2157533 2141690 2127031 2113674 2102002 2092184
61956 2092184 2083821 2076094 2068428 2061182 2055630 2053051 2053882 2057921 2065137 2075815 2089929 2107074 2127334
61943 2127334 2151682 2180954 2214692 2251541 2290541 2331434 2373855 2416982 2460169 2503342 2546556
$$ packed form
62029C400050p344n499m373l508k780k590l052l579l587l226k994k988l011l054
62015C348465l112k803j801n20L01O88J393K748M187N160N987P380R518J1926
62001C389517J3994J5347J5749J4947J2548Q157J756o103j4766k4058l3987m3953
61989C349148n2804n9822o5092o8666o9990o8699o5576o2105n9188n6706n4176
61978B666324n1299m7916m4014l9940l6286l3351l0963k8854k6944k5213k3614
61967B277930k2252k1327k0746k0026j8796j7250j5843j4659j3357j1672r818
61956B092184q363p727p666p246n552k579Q31M039P216J0678J4114J7145K0260
61943B127334K4348K9272L3738L6849L9000M0893M2421M3127M3187M3173M3214
$$ plain form
61932 2546556 2589573 2632057 2673621 2713398 2750052 2782681 2811467 2837117 2860009 2880280 2898576
61921 2898576 2916408 2935985 2960058 2991680 3033589 3087765 3155720 3239085 3339738 3459609 3600582
61910 3600582 3764312 3951728 4163077 4398969 4661394 4953469 5278543 5640096 6042239
61901 6042239 6489392 6984980 7530380 8124414 8762458 9434826 10125259 10810067 11457845
61892 11457845 12030509 12487042 12789840 12911340 12838725 12576057 12143692 11574509 10907571
61883 10907571 10181690 9431324 8684963 7964635 7285650 6656873 6081977 5561364 5093890
61874 5093890 4677578 4309435 3985346 3700696 3451120 3232558 3041041 2873093 2726410
61865 2726410 2599604 2491100 2398747 2320712 2256298 2205525 2168133 2143346 2130432 2129136 2139465
$$ packed form
61932B546556M3017M2484M1564L9777L6654L2629K8786K5650K2892K0271J8296
61921B898576J7832J9577K4073L1622M1909N4176O7955Q3365J00653J19871J40973
61910C600582J63730J87416K11349K35892K62425K92075L25074L61553M02143
61901F042239M47153M95588N45400N94034O38044O72368O90433O84808O47778
61892A1457845N72664M56533L02798J21500p2615k62668m32365n69183o66938
61883A0907571p25881p50366p46361p20328o78985o28777n74896n20613m67474
61874E093890m16312l68143l24089k84650k49576k18562j91517j67948j46683
61865B726410j26806j08504r2353p8035o4414n0773l7392k4787j2914j296J0329
$$ plain form
61854 2139465 2161078 2192875 2233255 2280844 2334784 2394053 2456732 2520366 2582819 2642090 2695368
61843 2695368 2739241 2771444 2791947 2801958 2802359 2793670 2777120 2755115 2730752 2707309 2687938 2675125
61831 2675125 2670174 2673329 2684213 2701845 2724375 2749190 2773270 2793301 2805813 2807924 2798115 2776040
61819 2776040 2741710 2695364 2638260 2573078 2503141 2431208 2359012 2287755 2218826 2154027 2095133
61808 2095133 2043286 1998956 1962497 1934378 1914671 1902733 1897950 1900670 1911779 1931297 1958019 1990898
61796 1990898 2030253 2077131 2131830 2193721 2262461 2338675 2423239 2516512 2618850 2731637 2857135
61785 2857135 2997251 3152979 3325432 3517144 3732048 3974440 4248457 4558595 4910353
61776 4910353 5310209 5765250 6283021 6871573 7539377 8294894 9145658 10096682 11148520
$$ packed form
61854B139465K1613L1797M0380M7589N3940N9269O2679O3634O2453N9271N3278
61843B695368M3873L2203K0503J0011M01q689j6550k2005k4363k3443j9371j2813
61831B675125m951L155J0884J7632K2530K4815K4080K0031J2512K111r809k2075
61819B776040l4330m6346n7104o5182o9937p1933p2196p1257o8929o4799n8894
61808B095133n1847m4330l6459k8119j9707j1938m783K720J1109J9518K6722L2879
61796A990898L9355M6878N4699O1891O8740P6214Q4564R3273J02338J12787J25498
61785B857135J40116J55728J72453J91712K14904K42392K74017L10138L51758
61776D910353L99856M55041N17771N88552O67804P55517Q50764R51024J051838
$$ plain form
61767 11148520 12295655 13525398 14816585 16137454 17443378 18676261 19767402 20644377
61759 20644377 21240921 21507661 21421168 20988859 20247854 19257547 18088460 16811610 15491164
61750 15491164 14180146 12918052 11730670 10632614 9631020 8727867 7920596 7202927
61742 7202927 6566757 6003909 5506760 5068305 4682198 4342441 4042946 3778086 3543901
61733 3543901 3338031 3157928 2999783 2859881 2736422 2629024 2536572 2456377 2385353 2321106
61723 2321106 2261603 2204585 2147981 2090684 2032489 1973296 1912743 1850740 1788213 1727040 1669038
61712 1669038 1615024 1564985 1518940 1477142 1439441 1405067 1373438 1344734 1319255 1296597 1275997
61701 1275997 1257155 1240080 1224339 1209206 1194546 1180844 1168152 1155608 1142307 1128219 1113985
$$ packed form
61767A1148520J147135J229743J291187J320869J305924J232883J091141Q76975
61759B0644377N96544K66740q6493m32309p41005r90307j169087j276850j320446
61750A5491164j311018j262094j187382j098056j001594r03153q07271p17669
61742G202927o36170n62848m97149m38455l86107l39757k99495k64860k34185
61733C543901k05870j80103j58145j39902j23459j07398r2452q0195p1024o4247
61723B321106n9503n7018n6604n7297n8195n9193o0553o2003o2527o1173n8002
61712A669038n4014n0039m6045m1798l7701l4374l1629k8704k5479k2658k0600
61701A275997j8842j7075j5741j5133j4660j3702j2692j2544j3301j4088j4234
$$ plain form
61690 1113985 1100206 1087226 1075262 1064303 1053952 1043693 1033276 1022695 1011888 1000717 989268
61679 989268 978052 967781 958886 951158 943835 936184 928050 919867 912161 905166 898872 893233 888136 883266
61665 883266 878205 872824 867487 862702 858532 854516 850344 846411 843471 841886 841593 842721 845674 850392
61651 850392 856092 862175 869065 877634 887949 899045 909857 919942 929284 937852 945516 952157 957761
61638 957761 962560 967109 971990 977374 983029 988791 994936 1002175 1011401 1023312 1037948 1054473 1071469
61625 1071469 1087412 1100876 1110572 1115507 1115074 1108928 1097033 1080094 1059610 1037020 1012878 987252
61613 987252 960812 934950 910800 888634 868340 849918 833250 817843 803304 789843 777869
61602 777869 767201 757151 747478 738888 732263 727527 723558 719311 714826 710937 708218 706528 705502 705079
$$ packed form
61690A113985j3779j2980j1964j0959j0351j0259j0417j0581j0807j1171j1449
61679I89268j1216j0271q895p728p323p651q134q183p706o995o294n639n097m870
61665H83266n061n381n337m785m170m016m172l933k940j585k93J128K953M718
61651H50392N700O083O890Q569J0315J1096J0812J0085R342Q568P664O641N604
61638I57761M799M549M881N384N655N762O145P239R226J1911J4636J6525J6996
61625A071469J5943J3464R696M935m33o146j1895j6939k0484k2590k4142k5626
61613I87252k6440k5862k4150k2166k0294j8422j6668j5407j4539j3461j1974
61602G77869j0668j0050r673q590o625m736l969m247m485l889k719j690j026m23
$$ plain form
61588 705079 705385 706528 708790 712684 718387 725301 732544 739816 747430 755701 764760 774955 786890 800810
61574 800810 816294 832747 850041 868489 888368 909641 932095 955635 980398 1006584 1034230
61563 1034230 1063213 1093366 1124279 1154967 1184163 1211278 1236889 1262011 1287065 1311761 1335656
61552 1335656 1358390 1379676 1399558 1418586 1437194 1454893 1470471 1482946 1491915 1497090 1498089 1494802
61540 1494802 1487485 1476296 1461112 1442027 1419739 1395376 1370217 1345585 1322583 1301717 1282966
61529 1282966 1266255 1251666 1239318 1229453 1222618 1219367 1219727 1223364 1230292 1240979 1255817 1275025 1299138
61516 1299138 1328934 1364621 1405710 1452120 1505069 1566614 1638605 1722278 1818398 1927407 2049792
61505 2049792 2186662 2339672 2510032 2697796 2902343 3123113 3359271 3608550 3866308
$$ packed form
61588G05079L06J143K262L894N703O914P243P272P614Q271R059J0195J1935J3920
61574H00810J5484J6453J7294J8448J9879K1273K2454K3540K4763K6186K7646
61563A034230K8983L0153L0913L0688K9196K7115K5611K5122K5054K4696K3895
61552A335656K2734K1286J9882J9028J8608J7699J5578J2475Q969N175R99l287
61540A494802p317j1189j5184j9085k2288k4363k5159k4632k3002k0866j8751
61529A282966j6711j4589j2348r865o835l251L60L637O928J0687J4838J9208K4113
61516A299138K9796L5687M1089M6410N2949O1545P1991Q3673R6120J09009J22385
61505B049792J36870J53010J70360J87764K04547K20770K36158K49279K57758
$$ plain form
61496 3866308 4125331 4376251 4608627 4812258 4977917 5097548 5165222 5178977 5141737 5059909
61486 5059909 4941000 4792549 4622417 4438732 4248913 4058823 3872880 3694641 3527078
61477 3527078 3372452 3232094 3106520 2995962 2900784 2821151 2756336 2704844 2665489 2638038
61467 2638038 2622608 2618805 2625676 2642097 2666845 2698700 2736948 2781402 2831398 2885037 2940028 2995172
61455 2995172 3050461 3105854 3160543 3213441 3263937 3312161 3358980 3405768 3453759 3503473 3554901
61444 3554901 3607926 3662157 3716647 3770462 3823409 3875445 3925452 3971529 4012701 4049411 4081901
61433 4081901 4108977 4129147 4142257 4149073 4149620 4142951 4128554 4107016 4079062 4044768 4004222 3958511
61421 3958511 3909520 3859000 3808267 3758567 3711147 3666950 3626643 3591118 3561586 3538877 3522806
$$ packed form
61496C866308K59023K50920K32376K03631J65659J19631O7674J3755l7240q1828
61486E059909j18909j48451j70132j83685j89819j90090j85943j78239j67563
61477C527078j54626j40358j25574j10558r5178p9633o4815n1492l9355k7451
61467B638038j5430l803O871J6421K4748L1855L8248M4454M9996N3639N4991N5144
61455B995172N5289N5393N4689N2898N0496M8224M6819M6788M7991M9714N1428
61444C554901N3025N4231N4490N3815N2947N2036N0007M6077M1172L6710L2490
61433D081901K7076K0170J3110O816N47o669j4397k1538k7954l4294m0546m5711
61421C958511m8991n0520n0733m9700m7420m4197m0307l5525k9532k2709j6071
$$ plain form
61410 3522806 3512423 3506730 3504845 3505573 3507299 3508543 3508390 3506194 3501120 3492368 3479798 3463941 3445297
61397 3445297 3424000 3400515 3376502 3354671 3337739 3327749 3326358 3335356 3356548 3391301 3440598 3505653
61385 3505653 3588231 3690263 3813335 3958602 4126855 4318290 4532157 4766772 5019761 5287972
61375 5287972 5566973 5850606 6130902 6398327 6642417 6852868 7020773 7139542 7205488 7218245
61365 7218245 7180811 7098733 6978650 6827002 6649371 6450377 6234043 6004520 5766612 5525409
61355 5525409 5285297 5049448 4820225 4599812 4390375 4193806 4011346 3843240 3688754
61346 3688754 3546802 3416665 3298020 3190475 3093544 3007050 2930991 2864902 2807951 2759958
61336 2759958 2721696 2693710 2675342 2665555 2664324 2672378 2689636 2714647 2745675 2781683 2821933 2865219
$$ packed form
61410C522806j0383n693j885P28J726J244j53k196n074q752j2570j5857j8644
61397C445297k1297k3485k4013k1831j6932r990j391Q998K1192L4753M9297O5055
61385C505653Q2578J02032J23072J45267J68253J91435K13867K34615K52989K68211
61375E287972K79001K83633K80296K67425K44090K10451J67905J18769O5946J2757
61365G218245l7434q2078j20083j51648j77631j98994k16334k29523k37908k41203
61355E525409k40112k35849k29223k20413k09437j96569j82460j68106j54486
61346C688754j41952j30137j18645j07545r6931q6494p6059o6089n6951m7993
61336B759958l8262k7986j8368r787j231Q054J7258K5011L1028L6008M0250M3286
$$ plain form
61324 2865219 2910005 2955145 3000055 3044219 3086806 3126854 3163643 3196762 3225920 3250937 3272114
61313 3272114 3290467 3307297 3323346 3338558 3352641 3365574 3377333 3387321 3394301 3396745 3393173 3382601
61301 3382601 3365160 3342112 3314755 3283297 3247167 3206344 3161849 3114842 3065775 3014727 2962187
61290 2962187 2909125 2856497 2805093 2755775 2709508 2667070 2628973 2595736 2568011 2546209 2530047
61279 2530047 2518621 2510984 2506495 2504597 2504483 2505304 2506655 2508501 2510434 2511359 2510341 2507794 2505518 2505451 2508482
61264 2508482 2514505 2523292 2534912 2549219 2565263 2581680 2597830 2614315 2632260 2652439 2675650 2703776
61252 2703776 2739755 2786132 2843966 2913351 2994400 3086999 3189773 3299894 3413941 3528298
61242 3528298 3638392 3737963 3819601 3876228 3902249 3893979 3849882 3771028 3661314 3526900 3375033
$$ packed form
61324B865219M4786M5140M4910M4164M2587M0048L6789L3119K9158K5017K1177
61313C272114J8353J6830J6049J5212J4083J2933J1759R988O980K444l572j0572
61301C382601j7441k3048k7357l1458l6130m0823m4495m7007m9067n1048n2540
61290B962187n3062n2628n1404m9318m6267m2438l8097l3237k7725k1802j6162
61279B530047j1426p637m489j898j14Q21J351J846J933R25j018k547k276o7L031
61264B508482O023Q787J1620J4307J6044J6417J6150J6485J7945K0179K3211K8126
61252B703776L5979M6377N7834O9385Q1049R2599J02774J10121J14047J14357
61242C528298J10094R9571Q1638N6627K6021q270m4097p8854j09714j34414j51867
$$ plain form
61231 3375033 3212938 3047231 2883511 2725831 2576539 2436943 2308204 2191379 2086717
61222 2086717 1993466 1910586 1837371 1773170 1716972 1667647 1624448 1586978 1554857 1527686 1505070
61211 1505070 1486361 1470638 1457395 1447073 1440492 1437835 1438590 1442431 1449614 1460442 1474791 1492281
61199 1492281 1512546 1535068 1558952 1583091 1606443 1628085 1647206 1663173 1675605 1684399 1689791 1692277
61187 1692277 1692248 1689708 1684550 1677010 1667551 1656246 1642638 1626367 1607717 1587377 1565858 1543282 1519646
61174 1519646 1495043 1469552 1443009 1415047 1385455 1354439 1322460 1289808 1256610 1223218 1190317
61163 1190317 1158462 1127758 1098133 1069684 1042512 1016497 991595 968145 946557 926801 908530
61152 908530 891523 875609 860224 844474 827680 809629 790499 770906 751875 734225 717959
$$ packed form
61231C375033j62095j65707j63720j57680j49292j39596j28739j16825j04662
61222B086717r3251q2880p3215o4201n6198m9325m3199l7470l2121k7171k2616
61211A505070j8709j5723j3243j0322o581k657P55L841P183J0828J4349J7490
61199A492281K0265K2522K3884K4139K3352K1642J9121J5967J2432Q794N392K486
61187A692277k9k540n158p540r459j1305j3608j6271j8650k0340k1519k2576k3636
61174A519646k4603k5491k6543k7962k9592l1016l1979l2652l3198l3392l2901
61163A190317l1855l0704k9625k8449k7172k6015k4902k3450k1588j9756j8271
61152I08530j7007j5914j5385j5750j6794j8051j9130j9593j9031j7650j6266
$$ plain form
61141 717959 702689 688599 676480 666775 659195 653467 649850 648493 648714 649452 650397 652345 656433 663139
61127 663139 671934 681776 691959 702488 713614 725214 736899 748623 760791 773665 786969 800126
61115 800126 812621 824148 834787 845074 855491 865768 875067 882991 889957 896285 901329 903946 903670
61102 903670 901104 897256 892658 887115 880167 871885 863185 855179 848183 841627 834869 827645 819598 809982
61088 809982 798298 784958 770853 756363 741163 724993 708320 692188 677496 664387 652314
61077 652314 640812 630161 621060 613684 607477 601986 597446 594233 592153 590716 589824 589714 590353 591398
61063 591398 592751 594716 597467 600678 603855 606827 609811 613032 616407 619561 622186 624336 626253 627889
61049 627889 628833 628888 628611 629076 631040 634378 638312 642159 645952 650366 656089 663328 671980 681983 693187
$$ packed form
61141G17959j5270j4090j2119r705p580n728l617j357K21P38R45J948M088O706
61127F63139Q795R842J0183J0529J1126J1600J1685J1724J2168J2874J3304J3157
61115H00126J2495J1527J0639J0287J0417J0277R299P924O966O328N044K617k76
61102I03670k566l848m598n543o948q282q700q006o996o556o758p224q047r616
61088H09982j1684j3340j4105j4490j5200j6170j6673j6132j4692j3109j2073
61077F52314j1502j0651r101p376o207n491m540l213k080j437q92j10O39J045
61063E91398J353J965K751L211L177K972K984L221L375L154K625K150J917J636
61049F27889R44N5k77M65J964L338L934L847L793M414N723P239Q652J0003J1204
$$ plain form
61034 693187 705074 717105 729393 742530 756659 771158 785435 799571 813848 828071 841772
61023 841772 854824 867447 879697 891255 901658 910637 918384 925608 933081 941093 949692 959422 971197
61010 971197 985233 1000808 1017580 1036536 1059100 1085812 1116574 1151661 1191547 1235971 1283994
60999 1283994 1334962 1388769 1445502 1505807 1571698 1646120 1731472 1828980 1939390 2063375 2201344
60988 2201344 2353912 2523132 2713021 2929334 3180239 3477688 3837145 4275686 4811453
60979 4811453 5465110 6259792 7218081 8360501 9708925 11290184 13131708 15246692 17611005
60970 17611005 20134484 22637316 24859479 26530367 27483167 27744671 27530270 27143254 26850463
60961 26850463 26805448 27026566 27396011 27672538 27550928 26779488 25277661 23169826 20712280
$$ packed form
61034F93187J1887J2031J2288J3137J4129J4499J4277J4136J4277J4223J3701
61023H41772J3052J2623J2250J1558J0403Q979P747P224P473Q012Q599R730J1775
61010I71197J4036J5575J6772J8956K2564K6712L0762L5087L9886M4424M8023
60999A283994N0968N3807N6733O0305O5891P4422Q5352R7508J10410J23985J37969
60988B201344J52568J69220J89889K16313K50905K97449L59457M38541N35767
60979D811453O53657P94682R58289J142420J348424J581259J841524K114984K364313
60970A7611005K523479K502832K222163J670888R52800K61504k14401l87016k92791
60961B6850463m5015K21118L69445K76527j21610p71440j501827k107835k457546
$$ plain form
60952 20712280 18174843 15757823 13573018 11663337 10028349 8644442 7480512 6507452
60944 6507452 5699698 5033057 4484264 4032367 3659125 3348317 3085734 2859862 2661957
60935 2661957 2485583 2326419 2182040 2051083 1932392 1824920 1727818 1640142 1560743 1488693
60925 1488693 1423307 1363355 1306776 1251808 1198039 1145849 1095327 1046492 1000194 957773 919772
60914 919772 885725 855185 828213 804681 783831 764822 747257 731028 716187 703162 692550
60903 692550 684319 677611 671605 666224 661830 658612 656519 655329 654508 653449 652131 651202 651087 651516 652256
60888 652256 653741 656325 659307 661421 662147 661912 661138 659761 657610 654499 649838 642877 633752 623773 614240
60873 614240 605286 596273 587007 578118 570281 563527 557440 551828 546961 543253 540874 539816 540134 541816
$$ packed form
60952B0712280k537437k417020k184805j909681j634988j383907j163930r73060
60944F507452q07754o66641n48793m51897l73242l10808k62583k25872j97905
60935B661957j76374j59164j44379j30957j18691j07472r7102q7676p9399p2050
60925A488693o5386n9952n6579n4968n3769n2190n0522m8835m6298m2421l8001
60914I19772l4047l0540k6972k3532k0850j9009j7565j6229j4841j3025j0612
60903F92550q231o708o006n381m394l218k093j190q21j059j318r29j15M29P40
60888F52256J485K584K982K114P26k35p74j377k151l111m661o961r125r979r533
60873F14240q954r013r266q889p837o754o087n612m867l708k379j058L18J682
$$ plain form
60859 541816 544426 547275 550176 553730 558586 564708 571747 579771 589009 599085 609319 619974 632460
60846 632460 647924 666069 685708 705932 726260 746108 764857 782329 798578 813128 824914
60835 824914 833204 838261 841047 842575 843694 845068 846920 848824 849931 849488 847116 842768 836611 828978
60821 828978 820331 811221 802203 793603 785191 776183 765838 754164 741949 730101 719122 709193 700392
60808 700392 692560 685207 677950 671038 665071 660210 655967 651831 647782 644114 641201 639526 639485 640774 642397
60793 642397 643753 645509 648957 654675 662272 671249 681499 692891 704904 716948 728734 740163 751068
60780 751068 761236 770526 778888 786391 793212 799397 804758 809284 813538 818249 823488 828705 833719 839214
60766 839214 845959 853763 861473 867912 872673 876181 879155 881955 884329 885763 886000 885137 883426 881216 878909
$$ packed form
60859E41816K610K849K901L554M856O122P039Q024R238J0076J0234J0655J2486
60846F32460J5464J8145J9639K0224K0328J9848J8749J7472J6249J4550J1786
60835H24914Q290N057K786J528J119J374J852J904J107m43k372m348o157p633
60821H28978q647r110r018q600q412r008j0345j1674j2215j1848j0979r929q801
60808G00392p832p353p257o912n967m861m243m136m049l668k913j675m1J289J623
60793F42397J356J756L448N718P597Q977J0250J1392J2013J2044J1786J1429J0905
60780G51068J0168R290Q362P503O821O185N361M526M254M711N239N217N014N495
60766H39214O745P804P710O439M761L508K974K800K374J434K37q63j711k210k307
$$ plain form
60751 878909 876608 873888 870292 866083 862121 858979 856542 854408 852190 849348 845309 840005 833825 826891
60737 826891 818855 809767 800642 792758 786621 781880 777930 774313 770894 768017 766148 765016 763449 760511
60723 760511 756516 752474 748848 745394 741983 738953 736650 735148 734432 734402 734611 734505 734099 734137 735310 737495
60707 737495 739823 741369 741734 741088 739776 737904 735371 732212 728573 724277 718792 711962 704442 696938 689293
60692 689293 680911 671927 663210 655080 646716 637229 626820 616463 606833 598056 590223 583373 576983 570190
60678 570190 562886 556126 550947 547102 543480 539701 536628 535212 535390 536510 538358 541244 545295 550215
60664 550215 555687 561564 567710 574024 580599 587453 594140 600100 605388 610659 616335 622272 628269 634385
60650 634385 640564 646472 651987 657532 663661 670616 678384 686758 695179 702965 709993 716838 724083 731869
$$ packed form
60751H78909k301k720l596m209l962l142k437k134k218k842m039n304o180o934
60737H26891q036r088r125p884o137m741l950l617l419k877j869j132j567k938
60723G60511l995m042l626l454l411l030k303j502p16l0K09j06m06L8J173K185
60707G37495K328J546L65o46j312j872k533l159l639m296n485o830p520p504p645
60692F89293q382q984q717q130q364r487j0409j0357r630q777p833o850o390o793
60678E70190p304o760n179l845l622l779l073j416J78J120J848K886M051M920
60664E50215N472N877O146O314O575O854O687N960N288N271N676N937N997O116
60650F34385O179N908N515N545O129O955P768Q374Q421P786P028O845P245P786
$$ plain form
60636 731869 740229 749297 759007 769095 779628 790963 802868 814418 825132 835414 845286 853452
60624 853452 858486 860420 860276 858502 854838 849386 842694 834795 825205 813995 801978 789704 777139
60611 777139 764627 753309 744073 736644 730264 724867 721101 719428 719695 721546 724822 729368 734559 739341
60597 739341 742962 745553 747645 749063 748830 746387 742458 738348 734830 732185 730876 731497 734245 738960 745386
60582 745386 752896 760354 766997 773219 779675 785879 790493 792859 793379 792502 790381 787594 785130 783303 781441
60567 781441 778872 775413 770713 764177 756043 747628 739845 732209 723853 714848 705758 696587 687105 677954
60553 677954 670553 665927 664124 664590 666571 669260 672218 675750 680627 687432 696366 707495 720874 736605
60539 736605 755089 777101 803344 834073 869346 909340 953927 1001938 1051111 1098764 1142278
$$ packed form
60636G31869Q360R068R710J0088J0533J1335J1905J1550J0714J0282R872Q166
60624H53452N034J934j44j774l664n452o692p899r590j1210j2017j2274j2565
60611G77139j2512j1318r236p429o380n397l766j673K67J851L276M546N191M782
60597G39341L621K591K092J418k33k443l929m110l518k645j309O21K748M715O426
60582G45386P510P458O643O222O456O204M614K366N20q77k121k787k464j827j862
60567G81441k569l459m700o536q134q415p783p636q356r005r090r171r482r151
60553F77954p401m626j803M66J981K689K958L532M877O805Q934J1129J3379J5731
60539G36605J8484K2012K6243L0729L5273L9994M4587M8011M9173M7653M3514
$$ plain form
60528 1142278 1179020 1206206 1221328 1223059 1211994 1190413 1161098 1126425 1088754 1051236 1017351
60517 1017351 989350 967608 951649 941209 936012 935214 937737 942833 949846 957750 965555 973055 980713
60504 980713 989012 998381 1009592 1023577 1040807 1061299 1085383 1114168 1149232 1192153 1244260 1306399
60492 1306399 1378783 1461331 1554349 1658698 1775244 1904418 2046599 2202990 2376147 2569676
60482 2569676 2787393 3032553 3307485 3613153 3947820 4304814 4670672 5025108 5343212
60473 5343212 5599113 5769969 5839341 5799369 5651813 5408143 5088377 4718037 4323583 3927998
60463 3927998 3548253 3195035 2873883 2586684 2332852 2110127 1915395 1745663 1598588
60454 1598588 1472029 1363295 1269265 1187366 1116085 1054413 1001173 955141 915484 881666 852937
$$ packed form
60528A142278L6742K7186J5122J731j1065k1581k9315l4673l7671l7518l3885
60517A017351k8001k1742j5959j0440n197p98K523N096P013P904P805P500P658
60504I80713Q299R369J1211J3985J7230K0492K4084K8785L5064M2921N2107O2139
60492A306399P2384Q2548R3018J04349J16546J29174J42181J56391J73157J93529
60482B569676K17717K45160K74932L05668L34667L56994L65858L54436L18104
60473E343212K55901J70856O9372l9972j47556k43670l19766l70340l94454l95585
60463C927998l79745l53218l21152k87199k53832k22725j94732j69732j47075
60454A598588j26559j08734r4030q1899p1281o1672n3240m6032l9657l3818k8729
$$ plain form
60443 852937 828167 806138 785963 767328 750475 735771 723088 711616 700358 688776 677014
60432 677014 665650 655231 645867 637163 628630 620241 612497 605951 600726 596421 592404 588416 585036 583356
60418 583356 583878 585904 588287 590479 592467 594072 595032 595608 596319 597102 597525 597921 599393 602388 606040 609300
60402 609300 612015 614559 617167 620183 624225 629371 634701 639371 643724 648645 654209 659728 664886 669968
60388 669968 675080 679858 684045 687762 691122 693949 695916 696624 695672 693097 689662 686293 683240 680169 676986
60373 676986 674061 671650 669571 667613 665913 664781 664348 664502 665016 665735 666755 668352 670602 673178 675733
60358 675733 678321 681276 684832 689073 694057 699674 705539 711336 717165 723241 729451 735591 741953 749159
60344 749159 757317 765661 773268 779957 786309 792867 799371 804851 808469 810196 810515 809692 807701 804852 801931
$$ packed form
60443H52937k4770k2029k0175j8635j6853j4704j2683j1472j1258j1582j1762
60432F77014j1364j0419r364q704q533q389p744o546n225m305m017l988l380j680
60418E83356N22K026K383K192J988J605R60N76P11P83M23L96J472K995L652L260
60402F09300K715K544K608L016M042N146N330M670M353M921N564N519N158N082
60388F69968N112M778M187L717L360K827J967P08r52k575l435l369l053l071l183
60373F76986k925k411k079j958j700j132m33J54N14P19J020J597K250K576K555
60358F75733K588K955L556M241M984N617N865N797N829O076O210O140O362P206
60344G49159Q158Q344P607O689O352O558O504N480L618J727L19q23j991k849k921
$$ plain form
60329 801931 799495 797404 795390 793704 792888 793204 794664 797315 800971 804672 806853 806285 802942 798115 793555
60314 793555 790072 786813 782263 776078 769463 763667 758736 754136 749861 746294 743440 741010 738999 737574
60300 737574 736611 735938 735785 736465 737795 739445 741625 744811 748884 753160 757212 761105 764870 768265 771141
60285 771141 773671 776255 779437 783618 788476 792956 796379 799229 802318 805514 808076 809996 812100 814849
60271 814849 817862 820769 823834 827524 832061 837612 844443 852732 862662 874635 888921 905108 922535
60258 922535 941305 962245 985786 1011555 1039258 1069388 1102817 1140220 1182153 1229184 1281588
60247 1281588 1339259 1402150 1470608 1545253 1626807 1715960 1812876 1916721 2026050 2139685 2256785
60236 2256785 2376156 2495952 2613991 2727866 2834921 2932881 3020582 3097389 3161905 3212112
$$ packed form
60329H01931k436k091k014j686q16L16J460K651L656L701K181n68l343m827m560
60314G93555l483l259m550o185o615n796m931m600m275l567k854k430k011j425
60300G37574r63o73j53O80J330J650K180L186M073M276M052L893L765L395K876
60285G71141K530K584L182M181M858M480L423K850L089L196K562J920K104K749
60271H14849L013K907L065L690M537N551O831Q289R930J1973J4286J6187J7427
60258I22535J8770K0940K3541K5769K7703L0130L3429L7403M1933M7031N2404
60247A281588N7671O2891O8458P4645Q1554Q9153R6916J03845J09329J13635J17100
60236B256785J19371J19796J18039J13875J07055R7960Q7701P6807O4516N0207
$$ plain form
60226 3212112 3246954 3266929 3272879 3265075 3243953 3211037 3168591 3118979 3064849 3009226 2954768 2903287
60214 2903287 2856498 2816658 2785855 2765115 2754860 2755947 2769601 2796619 2837276 2891808 2960237
60203 2960237 3041738 3134799 3238079 3350617 3470970 3596470 3723480 3848243 3967448 4078222
60193 4078222 4177762 4263089 4331273 4379986 4407875 4414608 4400800 4367831 4317333 4250740 4169654
60182 4169654 4076682 3975637 3870804 3766264 3665781 3572640 3489285 3417453 3358903 3315554
60172 3315554 3288708 3278531 3284623 3306668 3344188 3396094 3460875 3536874 3621883 3712724 3805734
60161 3805734 3897592 3985368 4065994 4136217 4193078 4234340 4258673 4265923 4257261 4234877 4201491 4160130
60149 4160130 4113972 4066027 4019000 3975661 3939221 3913096 3900385 3903556 3924268 3963155 4020004
$$ packed form
60226C212112L4842J9975N950p804k1122l2916m2446m9612n4130n5623n4458n1481
60214B903287m6789l9840l0803k0740j0255J087J3654K7018M0657N4532O8429
60203B960237Q1501R3061J03280J12538J20353J25500J27010J24763J19205J10774
60193D078222R9540Q5327O8184M8713K7889O733j3808l2969n0498o6593q1086
60182D169654r2972j01045j04833j04540j00483r3141q3355p1832n8550m3349
60172C315554k6846j0177O092K2045L7520N1906O4781P5999Q5009R0841R3010
60161C805734R1858Q7776Q0626P0223N6861M1262K4333P250q662k2384l3386m1361
60149D160130m6158m7945m7027m3339l6440k6125j2711L171K0712L8887N6849
$$ plain form
60138 4020004 4094651 4187851 4301180 4436203 4593963 4775283 4981374 5213977 5474769 5764383
60128 5764383 6081762 6424269 6788243 7169328 7562449 7961671 8360034 8749499 9121511
60119 9121511 9468232 9783269 10061145 10296494 10484280 10620425 10701582 10724666 10687675 10590982
60109 10590982 10437000 10228801 9970459 9669016 9334739 8978610 8610430 8239683 7876568
60100 7876568 7530516 7208218 6914300 6653310 6429692 6246049 6102773 5999480 5935815 5910842
60090 5910842 5922684 5968926 6046499 6150879 6276117 6415789 6563288 6711211 6851505 6976776
60080 6976776 7081118 7159818 7209386 7228477 7218103 7180307 7116967 7030160 6922874 6798451 6659436
60069 6659436 6507528 6344519 6172768 5994810 5813134 5630500 5450130 5275192 5108141
$$ packed form
60138D020004P4647R3200J13329J35023J57760J81320K06091K32603K60792K89614
60128E764383L17379L42507L63974L81085L93121L99222L98363L89465L72012
60119I121511L46721L15037K77876K35349J87786J36145Q1157K3084l6991r6693
60109A0590982j53982k08199k58342l01443l34277l56129l68180l70747l63115
60100G876568l46052l22298k93918k60990k23618j83643j43276j03293o3665k4973
60090E910842J1842M6242P7573J04380J25238J39672J47499J47923J40294J25271
60080F976776J04342P8700M9568J9091j0374l7796o3340q6807j07286j24423j39015
60069F659436j51908j63009j71751j77958j81676j82634j80370j74938j67051
$$ plain form
60060 5108141 4950697 4804477 4671457 4553653 4452423 4368400 4302173 4254634 4226284 4216564
60050 4216564 4224503 4249943 4293500 4355221 4433879 4527759 4635369 4754796 4882742 5014792 5146415
60039 5146415 5273175 5390251 5492623 5576099 5637834 5675783 5688133 5673622 5632176 5564952 5473910
60028 5473910 5361631 5231385 5087109 4933273 4774772 4616609 4463210 4317953 4183440
60019 4183440 4061957 3955278 3864165 3788663 3729040 3686047 3660225 3651559 3660198 3687033 3733101
60008 3733101 3798743 3883796 3988285 4112249 4254901 4414446 4588679 4775206 4970853 5171013
59998 5171013 5369597 5559611 5734288 5888364 6018389 6121737 6195825 6238820 6250582 6231916
59988 6231916 6183086 6104179 5997180 5866719 5718381 5557029 5387195 5214205 5044028 4882194
$$ packed form
60060E108141j57444j46220j33020j17804j01230q4023o6227m7539k8350r720
60050D216564P939K5440M3557O1721P8658R3880J07610J19427J27946J32050J31623
60039E146415J26760J17076J02372Q3476O1735L7949J2350j4511m1446o7224r1042
60028E473910j12279j30246j44276j53836j58501j58163j53399j45257j34513
60019D183440j21483j06679r1113p5502n9623m2993k5822q666Q639K6835M6068
60008C733101O5642Q5053J04489J23964J42652J59545J74233J86527J95647K00160
59998E171013J98584J90014J74677J54076J30025J03348P4088M2995J1762j8666
59988F231916m8830p8907j06999j30461j48338j61352j69834j72990j70177j61834
$$ plain form
59978 4882194 4733130 4600055 4485088 4389789 4315917 4265218 4238256 4234100 4251542 4289905 4348105
59967 4348105 4423654 4513463 4615182 4726809 4845263 4966307 5085973 5201431 5310402 5410453
59957 5410453 5499084 5574208 5634577 5680120 5711846 5731093 5738893 5736398 5725713 5709893 5692264 5676280
59945 5676280 5666017 5666183 5681412 5715767 5772977 5856855 5971349 6120327 6307190 6534365 6802977
59934 6802977 7113033 7463689 7853042 8277416 8730563 9203049 9682213 10152980 10598924
59925 10598924 11002602 11345542 11609649 11780274 11848716 11812478 11674503 11443137 11132085 10758755
59915 10758755 10341541 9897965 9443963 8993267 8556813 8142975 7758285 7407598 7093955
59906 7093955 6819049 6583943 6389074 6233922 6117503 6039212 5998804 5995679 6028758 6096902
$$ packed form
59978D882194j49064j33075j14967r5299p3872n0699k6962m156J7442L8363N8200
59967D348105P5549Q9809J01719J11627J18454J21044J19666J15458J08971J00051
59957E410453Q8631P5124O0369M5543L1726J9247P800k495j0685j5820j7629j5984
59945E676280j0263J66J5229L4355N7210Q3878J14494J48978J86863K27175K68612
59934F802977L10056L50656L89353M24374M53147M72486M79164M70767M45944
59925A0598924M03678L42940K64107J70625O8442l6238j37975k31366l11052l73330
59915A0758755m17214m43576m54002m50696m36454m13838l84690l50687l13643
59906G093955k74906k35106j94869j55152j16419p8291m0408l125L3079O8144
$$ plain form
59896 6096902 6198731 6331975 6493327 6678724 6883098 7099887 7321248 7538550 7742141
59887 7742141 7921058 8064070 8161329 8204948 8188950 8110343 7970696 7775781 7533395 7252200
59877 7252200 6942311 6615168 6281461 5949352 5624835 5312888 5017667 4742311 4489282
59868 4489282 4260382 4056022 3875122 3716402 3579244 3462763 3364761 3282514 3214157 3158459
59858 3158459 3113520 3076568 3044865 3015979 2987368 2956769 2923341 2887830 2851452 2815260 2780734
59847 2780734 2750080 2725199 2706655 2694087 2687271 2686101 2689503 2694948 2699190 2699215 2692446 2676742 2651013
59834 2651013 2615906 2573515 2526265 2476302 2425864 2377590 2333879 2296038 2264331 2238729 2219369
59823 2219369 2206583 2200915 2203003 2212910 2229483 2250768 2275209 2302322 2332505 2366791 2406796 2454075
$$ packed form
59896F096902J01829J33244J61352J85397K04374K16789K21361K17302K03591
59887G742141J78917J43012R7259M3619j5998p8607j39647j94915k42386k81195
59877G252200l09889l27143l33707l32109l24517l11947k95221k75356k53029
59868D489282k28900k04360j80900j58720j37158j16481r8002q2247o8357n5698
59858C158459m4939l6952l1703k8886k8611l0599l3428l5511l6378l6192l4526
59847B780734l0654k4881j8544j2568o816j170L402N445M242K5o769j5704k5729
59834B651013l5107m2391m7250m9963n0438m8274m3711l7841l1707k5602j9360
59823B219369j2786n668K088R907J6573K1285K4441K7113L0183L4286M0005M7279
$$ plain form
59811 2454075 2508943 2570070 2635435 2703263 2771651 2837713 2897927 2949716 2992424 3026565 3052287
59800 3052287 3068943 3076178 3075035 3067659 3056150 3042253 3028159 3016801 3010833 3011682 3020108 3037310 3064930
59787 3064930 3104363 3156921 3224615 3310011 3415256 3542121 3693283 3872820 4084875 4332175
59777 4332175 4616035 4937005 5294508 5685469 6102864 6534492 6961956 7360752 7702458
59768 7702458 7958972 8107754 8136856 8048118 7856745 7587089 7266731 6921522 6572684 6235776
59758 6235776 5921066 5634705 5379813 5157175 4965975 4804740 4671807 4565072 4481965 4420193
59748 4420193 4378388 4355737 4351251 4363802 4392663 4437542 4498124 4574031 4665251 4772350 4896311
59737 4896311 5038494 5200628 5384333 5590518 5819682 6073133 6353632 6664672 7009314
$$ packed form
59811B454075N4868O1127O5365O7828O8388O6062O0214N1789M2708L4141K5722
59800C052287J6656P235j143p376j1509j3897j4094j1358n968Q49Q426J7202K7620
59787C064930L9433N2558O7694Q5396J05245J26865J51162J79537K12055K47300
59777D332175K83860L20970L57503L90961M17395M31628M27464L98796L41706
59768G702458K56514J48782K9102q8738j91373k69656l20358l45209l48838l36908
59758F235776l14710k86361k54892k22638j91200j61235j32933j06735q3107o1772
59748D420193m1805k2651m486J2551K8861M4879O0582P5907R1220J07099J23961
59737D896311J42183J62134J83705K06185K29164K53451K80499L11040L44642
$$ plain form
59728 7009314 7389876 7808212 8265615 8762295 9297296 9868826 10473962 11107442 11760807
59719 11760807 12422986 13081716 13724619 14340013 14918292 15453795 15946015 16399634 16823985
59710 16823985 17232112 17639064 18059683 18507009 18991516 19520182 20094996 20712062 21361902
59701 21361902 22029966 22696692 23338329 23929585 24446740 24869315 25180667 25369399 25431639
59692 25431639 25372351 25204580 24947381 24623538 24257479 23873607 23495277 23144053 22838918
59683 22838918 22595771 22427622 22345061 22356634 22469477 22690272 23025354 23479472 24054722 24750860
59673 24750860 25565509 26492315 27518100 28621616 29773769 30937201 32065220 33102818
59665 33102818 33991000 34672660 35098313 35231806 35055669 34574189 33812958 32815629 31638659
$$ packed form
59728G009314L80562M18336M57403M96680N35001N71530O05136O33480O53365
59719A1760807O62179O58730O42903O15394N78279N35503M92220M53619M24351
59710A6823985M08127M06952M20619M47326M84507N28666N74814O17066O49840
59701B1361902O68064O66726O41637N91256N17155M22575L11352J88732O2240
59692B5431639n9288j67771k57199l23843l66059l83872l78330l51224l05135
59683B2838918k43147j68149q2561J1573J12843K20795L35082M54118N75250O96138
59673B4750860Q14649R26806J025785J103516J152153J163432J128019J037598
59665C3102818Q88182O81660M25653J33493j76137m81480p61231r97329j176970
$$ plain form
59656 31638659 30344299 28993172 27639047 26326566 25090028 23951903 22922235 21999822
59648 21999822 21173817 20424424 19723844 19039499 18339455 17598332 16802177 15951072 15058184
59639 15058184 14145260 13236647 12354381 11515387 10730681 10006123 9343905 8743524 8202165
59630 8202165 7715500 7279101 6889254 6542448 6234616 5961292 5718399 5502755 5312124
59621 5312124 5144905 4999455 4873564 4764809 4671399 4592225 4525995 4470808 4424580 4385242
59611 4385242 4350257 4316568 4281415 4242774 4198801 4147505 4087464 4018447 3941008 3855984 3764796
59600 3764796 3669681 3572966 3476382 3381468 3290211 3204684 3126244 3055561 2993108 2939108 2893208
59589 2893208 2854849 2824042 2801393 2787319 2781402 2782480 2789240 2800849 2817119 2837869 2862034 2887710
$$ packed form
59656C1638659j294360j351127j354125j312481j236538j138125j029668r22413
59648B1999822q26005p49393p00580o84345p00044p41123p96155q51105q92888
59639A5058184r12924r08613q82266q38994p84706p24558o62218o00381n41359
59630H202165m86665m36399l89847l46806l07832k73324k42893k15644j90631
59621E312124j67219j45450j25891j08755r3410p9174o6230n5187m6228l9338
59611D385242l4985l3689l5153l8641m3973n1296o0041o9017p7439q5024r1188
59600C764796r5115r6715r6584r4914r1257q5527p8440p0683o2453n4000m5900
59589B893208l8359l0807k2649j4074n917J078O760J1609J6270K0750K4165K5676
$$ plain form
59577 2887710 2913260 2938062 2962082 2985081 3006515 3025954 3043372 3059330 3075078 3092264 3112390
59566 3112390 3136663 3166241 3202187 3245203 3295923 3355504 3425378 3506322 3598400 3701922 3817892
59555 3817892 3947534 4092161 4253540 4433349 4631863 4848088 5081596 5333119 5602666
59546 5602666 5888014 6185883 6493586 6808391 7125980 7440823 7747880 8043023 8322289
59537 8322289 8582071 8820246 9036304 9230179 9401333 9548680 9670842 9766994 9838680 9891087
59527 9891087 9931951 9969013 10008688 10056536 10117787 10196878 10296580 10417250 10556090 10706855 10860444
59516 10860444 11005750 11130144 11220305 11264068 11252083 11177929 11037603 10829986 10557723 10226906
59506 10226906 9845879 9424670 8974914 8508988 8038595 7574151 7124781 6697842 6298261
$$ packed form
59577B887710K5550K4802K4020K2999K1434J9439J7418J5958J5748J7186K0126
59566C112390K4273K9578L5946M3016N0720N9581O9874Q0944R2078J03522J15970
59555C817892J29642J44627J61379J79809J98514K16225K33508K51523K69547
59546E602666K85348K97869L07703L14805L17589L14843L07057K95143K79266
59537H322289K59782K38175K16058J93875J71154J47347J22162R6152P1686N2407
59527I891087M0864L7062L9675M7848O1251P9091R9702J20670J38840J50765J53589
59516A0860444J45306J24394R0161M3763j1985p4154j40326k07617k72263l30817
59506A0226906l81027m21209m49756m65926m70393m64444m49370m26939l99581
$$ plain form
59497 6298261 5928916 5591635 5287384 5015814 4775497 4564675 4381337 4222868 4086499
59488 4086499 3970166 3872520 3792400 3729045 3682523 3652942 3639310 3640099 3654999 3685174 3731643
59477 3731643 3794353 3873126 3968661 4082108 4214334 4366051 4538089 4731023 4944782 5178817
59467 5178817 5432051 5702072 5984448 6273013 6560630 6839571 7101398 7336839 7536040
59458 7536040 7689494 7789334 7830161 7809071 7725781 7583319 7388205 7149236 6876009 6578453
59448 6578453 6266522 5948928 5632146 5321279 5021456 4737327 4471406 4224141 3995713
59439 3995713 3786763 3597295 3426112 3271787 3133322 3009479 2898470 2798943 2710642 2633551
59429 2633551 2567003 2510049 2462078 2422464 2390087 2363780 2342992 2327655 2317660 2312875 2313382 2319382
$$ packed form
59497F298261l69345l37281l04251k71570k40317k10822j83338j58469j36369
59488D086499j16333r7646q0120o3355m6522k9581j3632P89J4900L0175M6469
59477C731643O2710P8773R5535J13447J32226J51717J72038J92934K13759K34035
59467E178817K53234K70021K82376K88565K87617K78941K61827K35441J99201
59458G536040J53454R9840M0827k1090q3290j42462j95114k38969k73227k97556
59448F578453l11931l17594l16782l10867k99823k84129k65921k47265k28428
59439C995713k08950j89468j71183j54325j38465j23843j11009r9527q8301p7091
59429B633551o6548n6954m7971l9614l2377k6307k0788j5337r995m785N07O000
$$ plain form
59417 2319382 2330841 2347204 2367300 2389712 2413780 2440174 2470010 2503466 2539702 2577629 2615696
59406 2615696 2651042 2680393 2702753 2720762 2739118 2762178 2793014 2833481 2884335 2945799 3018405
59395 3018405 3102484 3196436 3296804 3401370 3511911 3633217 3770092 3926315 4105811 4313101
59385 4313101 4552088 4825358 5135074 5483888 5874432 6308177 6784913 7302834 7858435
59376 7858435 8445954 9056712 9678990 10298954 10902420 11476488 12010408 12496082 12928739
59367 12928739 13307289 13633710 13911721 14145676 14339840 14497698 14621228 14710543 14764022 14778711
59357 14778711 14750878 14676728 14553115 14378260 14152605 13879717 13566685 13223490 12861463 12491380
59347 12491380 12121900 11758722 11404444 11058704 10718563 10379511 10036907 9687004 9327354
$$ packed form
59417B319382J1459J6363K0096K2412K4068K6394K9836L3456L6236L7927L8067
59406B615696L5346K9351K2360J8009J8356K3060L0836M0467N0854O1464P2606
59395C018405Q4079R3952J00368J04566J10541J21306J36875J56223J79496K07290
59385D313101K38987K73270L09716L48814L90544M33745M76736N17921N55601
59376G858435N87519O10758O22278O19964O03466N74068N33920M85674M32657
59367A2928739L78550L26421K78011K33955J94164J57858J23530Q9315N3479J4689
59357A4778711k7833p4150j23613j74855k25655k72888l13032l43195l62027l70083
59347A2491380l69480l63178l54278l45740l40141l39052l42604l49903l59650
$$ plain form
59338 9327354 8957383 8579304 8197960 7818872 7446468 7084525 6737587 6410603 6106978
59329 6106978 5827870 5573587 5344762 5141747 4963766 4809371 4677298 4566336 4474881 4401256
59319 4401256 4344320 4303301 4277164 4264499 4263932 4274311 4294459 4322920 4357935 4397683 4440586 4485201
59307 4485201 4529565 4570855 4606210 4633748 4652401 4660976 4658201 4643794 4618744 4584349 4541658 4492112
59295 4492112 4437997 4381816 4325717 4271802 4222351 4179292 4144020 4118164 4103861 4102691 4114927
59284 4114927 4140603 4180916 4237720 4311831 4402685 4509687 4633178 4773743 4931002 5103339
59274 5103339 5288470 5483879 5686589 5892593 6096555 6292030 6471781 6628006 6753076
59265 6753076 6841321 6890771 6903193 6882438 6832932 6759303 6666295 6558357 6439448 6313399 6183804
$$ packed form
59338I327354l69971l78079l81344l79088l72404l61943l46938l26984l03625
59329F106978k79108k54283k28825k03015j77981j54395j32073j10962r1455p3625
59319D401256n6936m1019k6137j2665n67J0379K0148K8461L5015L9748M2903M4615
59307D485201M4364M1290L5355K7538J8653Q575k775j4407k5050l4395m2691m9546
59295D492112n4115n6181n6099n3915m9451m3059l5272k5856j4303j170J2236
59284D114927K5676M0313N6804P4111R0854J07002J23491J40565J57259J72337
59274E103339J85131J95409K02710K06004K03962J95475J79751J56225J25070
59265F753076Q8245M9450J2422k0755m9506p3629r3008j07938j18909j26049j29595
$$ plain form
59254 6183804 6053162 5922432 5791829 5661777 5532875 5405453 5279689 5155972 5034902
59245 5034902 4917268 4804395 4698209 4600549 4512644 4435598 4371068 4320998 4286906 4269980 4271804
59234 4271804 4294522 4340312 4411083 4508773 4635595 4793887 4985887 5213694 5479117 5783142
59224 5783142 6125200 6502641 6910584 7341839 7786596 8232095 8663037 9062870 9415119
59215 9415119 9704105 9915692 10038691 10066135 9995451 9828103 9569926 9231635 8828013 8375953
59205 8375953 7892939 7396298 6901970 6422699 5967274 5541444 5149057 4792265 4471446
59196 4471446 4185556 3932566 3709683 3513873 3342546 3193493 3064125 2951324 2852254 2764875
59186 2764875 2687581 2618882 2557719 2503576 2455998 2414343 2378217 2347712 2322976 2303828 2289922
$$ packed form
59254F183804j30642j30730j30603j30052j28902j27422j25764j23717j21070
59245E034902j17634j12873j06186r7660q7905p7046o4530n0070l4092j6926J824
59234D271804K2718M5790P0771R7690J26822J58292J92000K27807K65423L04025
59224E783142L42058L77441M07943M31255M44757M45499M30942L99833L52249
59215I415119K88986K11587J22999K7444p0684j67348k58177l38291m03622m52060
59205H375953m83014m96641m94328m79271m55425m25830l92387l56792l20819
59196D471446k85890k52990k22883j95810j71327j49053j29368j12801r9070q7379
59186B764875p7294o8699o1163n4143m7578m1655l6126l0505k4736j9148j3906
$$ plain form
59175 2289922 2280908 2276352 2275895 2279548 2287487 2299578 2315526 2335366 2359374 2387715 2420793 2459554
59163 2459554 2504526 2554726 2608639 2666203 2728693 2796628 2869103 2945272 3024936 3107102 3189405
59152 3189405 3269800 3347585 3421874 3490263 3550087 3600068 3639695 3667998 3684153 3688519 3681819 3664014
59140 3664014 3635342 3597989 3555287 3509403 3460972 3410908 3361367 3314779 3272927 3237178 3208913
59129 3208913 3189445 3179871 3181002 3193120 3216072 3250053 3295993 3354787 3426552 3511138 3608915 3720473
59117 3720473 3846087 3986253 4142259 4315314 4505320 4711278 4932724 5170033 5423441
59108 5423441 5692380 5975467 6270116 6571843 6874130 7168795 7446221 7695810 7907029
59099 7907029 8070297 8177180 8221043 8198774 8111885 7965481 7766543 7523423 7245753 6943243
$$ packed form
59175B289922r014m556m57L653P939J2091J5948J9840K4008K8341L3078L8761
59163B459554M4972N0200N3913N7564O2490O7935P2475P6169P9664Q2166Q2303
59152C189405Q0395P7785P4289O8389N9824M9981L9627K8303J6155M366o700j7805
59140C664014k8672l7353m2702m5884m8431n0064m9541m6588m1852l5749k8265
59129C208913j9468r574J131J2118K2952L3981M5940N8794P1765Q4586R7777J11558
59117C720473J25614J40166J56006J73055J90006K05958K21446K37309K53408
59108E423441K68939K83087K94649L01727L02287K94665K77426K49589K11219
59099G907029J63268J06883M3863k2269q6889j46404j98938k43120k77670l02510
$$ plain form
59089 6943243 6624321 6296335 5966210 5639762 5320684 5011430 4715015 4434927 4173327
59080 4173327 3930364 3705361 3497854 3307392 3133225 2974450 2829884 2697717 2575917
59071 2575917 2463184 2359108 2263472 2175827 2095674 2022587 1956237 1896534 1843456 1796385 1754120
59060 1754120 1716123 1683236 1656465 1635404 1618569 1604763 1593343 1583553 1574618 1566211 1557947 1548659
59048 1548659 1537157 1523487 1508565 1492806 1476131 1459138 1443167 1429180 1417512 1408759 1403833 1402973
59036 1402973 1405408 1410058 1415736 1420716 1423254 1423039 1421593 1421018 1422801 1427762 1436408 1449032 1465731 1486219
59022 1486219 1509295 1532832 1554798 1574007 1589438 1599663 1603932 1603396 1600123 1595288 1589422 1583967 1581052
59009 1581052 1581672 1585386 1591877 1601511 1614076 1628220 1642553 1656336 1668694 1678093 1683063 1682886 1677461
$$ packed form
59089F943243l18922l27986l30125l26448l19078l09254k96415k80088k61600
59080D173327k42963k25003k07507j90462j74167j58775j44566j32167j21800
59071B575917j12733j04076r5636q7645q0153p3087o6350n9703n3078m7071m2265
59060A754120l7997l2887k6771k1061j6835j3806j1420r790q935q407q264r288
59048A548659j1502j3670j4922j5759j6675j6993j5971j3987j1668q753m926q60
59036A402973K435M650N678M980K538k15j446n75J783M961Q646J2624J6699K0488
59022A486219K3076K3537K1966J9209J5431J0225M269n36l273m835n866n455k915
59009A581052O20L714O491R634J2565J4144J4333J3783J2358R399M970j77n425
$$ plain form
58996 1677461 1667208 1653097 1635939 1615722 1592629 1568506 1545999 1526096 1507837 1490757 1476272
58985 1476272 1466007 1459950 1456976 1456233 1457280 1459687 1463332 1468594 1475715 1484445 1494665 1506764 1521055
58972 1521055 1537464 1556122 1577582 1602087 1629176 1658293 1689130 1721146 1753568 1786157 1819267
58961 1819267 1852883 1886467 1920087 1954703 1990702 2026883 2061652 2094681 2126934 2159545 2193189
58950 2193189 2228086 2264153 2301465 2340826 2383451 2429910 2480044 2534194 2593885 2660871 2735986
58939 2735986 2819215 2910361 3009375 3116499 3232404 3357797 3492861 3637610 3792847 3960204
58929 3960204 4141285 4337583 4551383 4785884 5044238 5329173 5643675 5991102 6374356
58920 6374356 6795781 7258113 7764603 8317822 8919133 9569387 10268788 11015140 11802787
$$ packed form
58996A677461j0253j4111j7158k0217k3093k4123k2507j9903j8259j7080j4485
58985A476272j0265o057k974p43J047K407L645N262P121Q730J0220J2099J4291
58972A521055J6409J8658K1460K4505K7089K9117L0837L2016L2422L2589L3110
58961A819267L3616L3584L3620L4616L5999L6181L4769L3029L2253L2611L3644
58950B193189L4897L6067L7312L9361M2625M6459N0134N4150N9691O6986P5115
58939B735986Q3229R1146R9014J07124J15905J25393J35064J44749J55237J67357
58929C960204J81081J96298K13800K34501K58354K84935L14502L47427L83254
58920F374356M21425M62332N06490N53219O01311O50254O99401P46352P87647
$$ plain form
58911 11802787 12623276 13465627 14314876 15151040 15950384 16687411 17335732 17868970 18263335
58902 18263335 18500727 18570491 18470106 18205752 17792035 17249938 16603995 15880096 15103818
58893 15103818 14298889 13486279 12683928 11906106 11162611 10459466 9800988 9190745 8630434
58884 8630434 8118952 7653433 7230705 6847498 6500237 6185487 5900062 5640168 5401194
58875 5401194 5179046 4971232 4776195 4592433 4419053 4256481 4105602 3966430 3838230
58866 3838230 3720422 3612521 3513414 3421412 3335030 3253452 3176569 3104942 3039403 2980274 2927236
58855 2927236 2880062 2838961 2803961 2774637 2750800 2732894 2721334 2715993 2716648 2723277 2735585 2753029
58843 2753029 2775821 2805203 2842106 2886105 2936256 2992426 3055214 3125080 3202163 3286583 3378513
$$ packed form
58911A1802787Q20489Q42351Q49249Q36164P99344P37027O48321N33238L94365
58902A8263335K37392O9764j00385k64354m13717n42097o45943p23899p76278
58893A5103818q04929q12610q02351p77822p43495p03145o58478o10243n60311
58884H630434n11482m65519m22728l83207l47261l14750k85425k59894k38974
58875E401194k22148k07814j95037j83762j73380j62572j50879j39172j28200
58866C838230j17808j07901r9107r2002q6382q1578p6883p1627o5539n9129n3038
58855B927236m7174m1101l5000k9324k3837j7906j1560n341O55O629J2308J7444
58843B753029K2792K9382L6903M3999N0151N6170O2788O9866P7083Q4420R1930
$$ plain form
58832 3378513 3478313 3586884 3705444 3834685 3974761 4126311 4290817 4469686 4663857 4874711
58822 4874711 5104555 5355756 5630329 5931015 6261991 6627775 7031994 7477612 7967532
58813 7967532 8504186 9089009 9722588 10404287 11130811 11895438 12688660 13498218 14307625
58804 14307625 15095581 15837890 16509601 17085370 17539984 17851328 18004007 17990752 17812127
58795 17812127 17476605 17000491 16406135 15719186 14966444 14173940 13364616 12557025 11766092
58786 11766092 11004002 10279446 9596821 8957522 8361991 7810182 7300949 6832347 6402447
58777 6402447 6009158 5649695 5320985 5020397 4745469 4493329 4260978 4045802 3845449
58768 3845449 3657915 3482252 3318512 3166464 3025157 2894122 2773802 2663963 2562840
$$ packed form
58832C378513R9800J08571J18560J29241J40076J51550J64506J78869J94171K10854
58822D874711K29844K51201K74573L00686L30976L65784M04219M45618M89920
58813G967532N36654N84823O33579O81699P26524P64627P93222Q09558Q09407
58804A4307625P87956P42309O71711N75769M54614L11344J52679j3255j78625
58795A7812127l35522m76114n94356o86949p52742p92504q09324q07591p90933
58786A1766092p62090p24556o82625o39299n95531n51809n09233m68602m29900
58777F402447l93289l59463l28710l00588k74928k52140k32351k15176k00353
58768C845449j87534j75663j63740j52048j41307j31035j20320j09839j01123
$$ plain form
58759 2562840 2468975 2382919 2305829 2237295 2175865 2120967 2072867 2031343 1995868 1966684 1944272
58748 1944272 1928057 1916902 1910570 1909394 1912809 1919622 1929550 1943016 1959261 1975859 1990216 2000497
58736 2000497 2005022 2001921 1989906 1968911 1940026 1905372 1867824 1829876 1792557 1755830 1719711 1684356
58724 1684356 1649424 1614296 1578826 1543239 1507468 1471202 1434315 1396681 1357994 1318483 1279459
58713 1279459 1242371 1207623 1174940 1144417 1116430 1090904 1067403 1045542 1024777 1004446 984763
58702 984763 967090 952362 939935 928767 918891 910605 903074 895160 887132 880172 874577 869677 865196
58689 865196 861437 858398 855876 854114 853163 851935 849108 844735 839813 834602 828620 822020 815719 810349
58675 810349 806239 804196 805084 808771 814565 822380 832348 843651 855054 866301 877673 888417 897129
$$ packed form
58759B562840r3865q6056p7090o8534o1430n4898m8100m1524l5475k9184k2412
58748A944272j6215j1155o332j176L415O813R928J3466J6245J6598J4357J0281
58736B000497M525l101j2015k0995k8885l4654l7548l7948l7319l6727l6119l5355
58724A684356l4932l5128l5470l5587l5771l6266l6887l7634l8687l9511l9024
58713A279459l7088l4748l2683l0523k7987k5526k3501k1861k0765k0331j9683
58702I84763j7673j4728j2427j1168r876q286p531p914q028o960n595m900m481
58689H65196l759l039k522j762r51j228k827m373m922n211n982o600o301n370
58675H10349m110k043Q88L687N794P815R968J1303J1403J1247J1372J0744Q712
$$ plain form
58662 897129 903616 909026 914106 918484 921523 922577 920520 914459 905043 893921 882046 869728 858094
58649 858094 848852 842518 838295 835946 836364 840029 846187 853982 863330 874433 887460 902956 921572
58636 921572 943169 967048 993095 1021849 1053662 1088791 1128136 1172542 1221461 1273606 1329087
58625 1329087 1389687 1456908 1531022 1612240 1701704 1801055 1912016 2036621 2176893 2334057
58615 2334057 2508726 2701582 2912796 3140790 3382350 3633534 3889220 4141876 4381935
58606 4381935 4599274 4783525 4923899 5010980 5039470 5008695 4921240 4782776 4602807 4393277
58596 4393277 4165491 3928879 3691862 3461669 3242864 3037615 2847703 2674922 2519474
58587 2519474 2379798 2254514 2143300 2045699 1960593 1887227 1825398 1774348 1732737 1699875 1675607
$$ packed form
58662H97129O487N410N080M378L039J054k057o061r416j1122j1875j2318j1634
58649H58094r242o334m223k349M18L665O158P795R348J1103J3027J5496J8616
58636I21572K1597K3879K6047K8754L1813L5129L9345M4406M8919N2145N5481
58625A329087O0600O7221P4114Q1218Q9464R9351J10961J24605J40272J57164
58615B334057J74669J92856K11214K27994K41560K51184K55686K52656K40059
58606D381935K17339J84251J40374Q7081K8490l0775q7455j38464j79969k09530
58596D393277k27786k36612k37017k30193k18805k05249j89912j72781j55448
58587B519474j39676j25284j11214r7601q5106p3366o1829n1050m1611l2862k4268
$$ plain form
58576 1675607 1658877 1647858 1641613 1640064 1642178 1645855 1650030 1655378 1662662 1671995 1684030 1700137 1720659
58563 1720659 1744225 1768988 1792936 1812551 1822902 1820021 1802246 1769212 1721349 1661069 1593009
58552 1593009 1522043 1451697 1384358 1321556 1263602 1210261 1162040 1119690 1082504 1048780 1018002
58541 1018002 990808 966723 943972 921979 902081 885115 870133 856214 843759 833210 824100
58530 824100 816037 809127 802838 796072 788832 782080 775524 767496 757612 747508 738190 728760 718704 709323
58516 709323 701662 694983 688639 683663 681092 680255 680112 680900 683123 686287 689874 694415 700516 708050 717184
58501 717184 728802 742929 758172 773746 790688 810077 831457 853965 877579 902253 927318
58490 927318 952736 979350 1006759 1032447 1054089 1071300 1084131 1091590 1092997 1089251 1081349 1068881
$$ packed form
58576A675607j6730j1019o245j549K114L677M175N348P284R333J2035J6107K0522
58563A720659K3566K4763K3948J9615J0351k881j7775l3034m7863o0280o8060
58552A593009p0966p0346o7339o2802n7954n3341m8221m2350l7186l3724l0778
58541A018002k7194k4085k2751k1993j9898j6966j4982j3919j2455j0549r110
58530H24100q063o910o289o766p240o752o556q028r884j0104r318r430j0056r381
58516G09323p661o679o344m976k571q37j43P88K223L164L587M541O101P534R134
58501G17184J1618J4127J5243J5574J6942J9389K1380K2508K3614K4674K5065
58490I27318K5418K6614K7409K5688K1642J7211J2831P459J407l746p902j2468
$$ plain form
58478 1068881 1051207 1028861 1002695 973030 940852 908488 877851 849119 822011 796974 774256
58467 774256 753371 734494 718781 706322 695417 684922 675605 668129 661658 655674 651247 649025 647827
58454 647827 646686 646422 647610 648934 649421 650553 654199 659926 666231 673065 681345 691355 703348 718394
58440 718394 736850 757273 778475 801317 826830 853996 880971 906904 930692 949412 960154
58429 960154 962411 957117 944738 926069 903516 879566 855042 830446 807600 788130 771631 757153
58417 757153 745215 736644 730888 727318 726833 730206 736309 743985 754331 769009 787528 808225 830710
58404 830710 855111 879992 903047 923024 939165 949895 953966 951855 944432 931546 913617 893094
58392 893094 872324 851396 830001 809838 792945 779011 766589 755681 746966 739892 733785 729571
$$ packed form
58478A068881j7674k2346k6166k9665l2178l2364l0637k8732k7108k5037k2718
58467G74256k0885j8877j5713j2459j0905j0495r317p476o471n984m427k222j198
58454F47827j141k64J188J324M87J132L646N727O305O834Q280J0010J1993J5046
58440G18394J8456K0423K1202K2842K5513K7166K6975K5933K3788J8720J0742
58429I60154K257n294j2379j8669k2553k3950k4524k4596k2846j9470j6499j4478
58417G57153j1938q571n756l570m85L373O103P676J0346J4678J8519K0697K2485
58404H30710K4401K4881K3055J9977J6141J0730M071k111p423j2886j7929k0523
58392H93094k0770k0928k1395k0163j6893j3934j2422j0908q715p074o107m214
$$ plain form
58380 729571 728092 728006 727642 727788 730348 735396 741666 748695 756292 763265 768989 775090 783367 793257 803334
58365 803334 813763 825075 836145 845847 855245 865792 876914 887732 899516 913887 930269 947633
58353 947633 966964 989234 1012753 1035402 1057681 1080431 1101301 1116773 1126195 1130622 1129389 1121365
58341 1121365 1108285 1093259 1077092 1059340 1041687 1026830 1015120 1005596 999059 996759 997418 999090
58329 999090 1002663 1009947 1019642 1029010 1038347 1049967 1063864 1078328 1093876 1112569 1134150 1156590
58317 1156590 1179700 1204607 1230652 1256514 1283313 1312678 1342738 1369887 1393423 1414414 1431230
58306 1431230 1440650 1442742 1440456 1435161 1426657 1416603 1407604 1399677 1391868 1386294 1386109 1390396 1395689 1401734
58292 1401734 1411081 1423812 1437534 1452031 1469204 1488923 1509579 1532097 1558837 1589315 1621659
$$ packed form
58380G29571j479q6l64J46K560N048O270P029P597O973N724O101Q277R890J0077
58365H03334J0429J1312J1070R702R398J0547J1122J0818J1784J4371J6382J7364
58353I47633J9331K2270K3519K2649K2279K2750K0870J5472R422M427j233q024
58341A121365j3080j5026j6167j7752j7653j4857j1710r524o537k300O59J672
58329I99090L573P284R695R368R337J1620J3897J4464J5548J8693K1581K2440
58317A156590K3110K4907K6045K5862K6799K9365L0060K7149K3536K0991J6816
58306A431230R420K092k286n295q504j0054q999p927p809n574j85M287N293O045
58292A401734R347J2731J3722J4497J7173J9719K0656K2518K6740L0478L2344
$$ plain form
58281 1621659 1657217 1698787 1745356 1793819 1844895 1901947 1964915 2030893 2099620 2172448 2246628
58270 2246628 2316422 2379247 2435008 2480643 2511939 2530171 2540558 2544816 2541842 2534914 2530949 2532671
58258 2532671 2538306 2548671 2567383 2594174 2625346 2660942 2704323 2754846 2808431 2865249 2929145
58247 2929145 2999532 3071796 3145779 3225744 3312006 3400995 3493547 3594213 3702239 3812424 3925254
58236 3925254 4046780 4178082 4314643 4456602 4609405 4773677 4945099 5125271 5321693
58227 5321693 5535810 5762393 6002109 6262965 6547775 6852334 7177791 7532248 7918238
58218 7918238 8331733 8775746 9261454 9793783 10370359 10997349 11691504 12464038 13318438
58209 13318438 14267122 15333691 16536314 17888051 19418583 21178051 23218020 25592265
$$ packed form
58281A621659L5558M1570M6569M8463N1076N7052O2968O5978O8727P2828P4180
58270B246628O9794O2825N5761M5635L1296J8232J0387M258k974o928l965J722
58258B532671N635J0365J8712K6791L1172L5596M3381N0523N3585N6818O3896
58247B929145P0387P2264P3983P9965Q6262Q8989R2552J00666J08026J10185J12830
58236C925254J21526J31302J36561J41959J52803J64272J71422J80172J96422
58227E321693K14117K26583K39716K60856K84810L04559L25457L54457L85990
58218G918238M13495M44013M85708N32329N76576O26990O94155P72534Q54400
58209A3318438R48684J066569J202623J351737J530532J759468K039969K374245
$$ plain form
58201 25592265 28383658 31711652 35714769 40559453 46480413 53790435 62845622 74028383
58193 74028383 87761297 104485233 124601019 148474787 176516987 209165784 246618070
58186 246618070 288320225 332328214 374760152 409868190 431336219 434647226 419178450
58179 419178450 388477547 348508460 305225033 263009176 224384392 190432168 161311991
58172 161311991 136695351 116088313 98989645 84908028 73360854 63913429 56206654
58165 56206654 49943227 44875882 40819397 37651254 35286521 33658200 32717449 32434441
58157 32434441 32794171 33797195 35451109 37726727 40485145 43409124 45978157 47544132
58149 47544132 47547061 45785644 42534676 38388288 33960245 29683726 25794487 22392396
$$ packed form
58201B5592265K791393L327994M003117M844684N920960P310022R055187J1182761
58193G4028383J3732914J6723936K0115786K3873768K8042200L2648797L7452286
58186B46618070M1702155M4007989M2431938L5108038K1468029L311007j5468776
58179D19178450l0700903l9969087m3283427m2215857l8624784l3952224k9120177
58172A61311991k4616640k0607038j7098668j4081617j1547174r447425p706775
58165E6206654o263427n067345m056485l168143k364733j628321r40751k83008
58157C2434441L59730J003024J653914K275618K758418K923979K569033J565975
58149D7544132K929j761417l250968m146388m428043m276519l889239l402091
$$ plain form
58141 22392396 19485024 17022930 14946096 13208276 11764037 10558755 9544778 8692582
58133 8692582 7977303 7369070 6844706 6394624 6009102 5669528 5360424 5078193 4820568
58124 4820568 4578406 4345072 4123673 3917888 3724748 3542424 3375826 3228090 3094958
58115 3094958 2973298 2866786 2777322 2698704 2624415 2554194 2487703 2419397 2345510 2269659 2196384
58104 2196384 2125354 2056462 1993876 1939992 1891426 1845735 1806329 1776293 1753021 1733207 1717286
58093 1717286 1704542 1689499 1667856 1641040 1610941 1575417 1533242 1488255 1444183 1400016 1354556
58082 1354556 1310770 1271358 1234428 1197631 1162414 1130317 1099305 1067692 1037754 1011730 988070
58071 988070 965126 944598 927792 912333 896137 880961 868680 857780 846865 837751 831671 826130
$$ packed form
58141B2392396k907372k462094k076834j737820j444239j205282j013977q52196
58133H692582p15279o08233n24364m50082l85522l39574l09104k82231k57625
58124D820568k42162k33334k21399k05785j93140j82324j66598j47736j33132
58115C094958j21660j06512q9464p8618p4289p0221o6491o8306p3887p5851p3275
58104B196384p1030o8892o2586n3884m8566m5691l9406l0036k3272j9814j5921
58093A717286j2744j5043k1643k6816l0099l5524m2175m4987m4072m4167m5460
58082A354556m3786l9412l6930l6797l5217l2097l1012l1613k9938k6024k3660
58071I88070k2944k0528j6806j5459j6196j5176j2281j0900j0915r114o080n541
$$ plain form
58059 826130 818922 811615 805675 798870 789050 777934 767593 756691 743778 730939 720451 710992 700700
58046 700700 690917 683302 676354 668462 661439 657335 654514 650561 646472 644295 643100 640951 638552 637409
58032 637409 636574 634696 633178 633858 635455 635576 634363 633132 631413 628481 625897 625421 626220 627040 629194 634374
58016 634374 641380 648024 654521 662084 670022 677211 684669 693677 702987 710852 718192 726806 736062 744352
58002 744352 752296 761574 771931 782101 792215 802424 810564 814103 813225 809380 802283 791164 777547
57989 777547 763690 749381 733121 715451 698230 681589 664429 647215 631701 618523 607385
57978 607385 598694 592631 587580 581927 576608 573629 572994 573300 574271 576302 578620 580390 582699 586928 592017
57963 592017 595813 598310 601120 604533 607588 610382 613728 616983 618573 618364 617430 615915 613106 609102 604569
$$ packed form
58059H26130p208p307n940o805r820j1116j0341j0902j2913j2839j0488r459j0292
58046G00700r783p615o948p892p023m104k821l953m089k177j195k149k399j143
58032F37409q35j878j518O80J597J21j213j231j719k932k584m76P99Q20K154N180
58016F34374P006O644O497P563P938P189P458R008R310P865P340Q614R256Q290
58002G44352P944R278J0357J0170J0114J0209Q140L539q78l845p097j1119j3617
57989G77547j3857j4309j6260j7670j7221j6641j7160j7214j5514j3178j1138
57978F07385q691o063n051n653n319k979o35L06R71K031K318J770K309M229N089
57963E92017L796K497K810L413L055K794L346L255J590k09r34j515k809m004m533
$$ plain form
57948 604569 599508 594084 589775 587678 586554 584582 582142 580705 579902 578065 574961 571621 567992 563032
57934 563032 556794 550303 543773 536773 529622 522691 514948 505136 493825 482430 470989 458924 447178
57921 447178 437371 429431 422220 415891 411454 408590 406104 404137 403833 405227 407486 410664 415253 420585
57907 420585 425809 431799 439869 449203 457823 465536 473488 481320 487400 491723 495955 500620 504649 507804
57893 507804 511163 514919 517901 519624 520860 521926 522267 521885 521312 520142 517469 513857 511006 509364 507887
57878 507887 506151 504731 503426 501161 497955 495151 493353 491847 490329 489490 489584 489987 490448 491391 492816 494245
57862 494245 495696 497306 498239 497522 495737 494207 492806 490407 487177 484361 481877 478353 473805 470191 468867
57847 468867 469271 470489 472407 474974 477950 481691 486689 492226 496997 501039 505355 509742 512824 514250
$$ packed form
57948F04569n061n424m309k097j124j972k440j437q03j837l104l340l629m960
57934E63032o238o491o530p000p151o931p743r812j1311j1395j1441j2065j1746
57921D47178r807p940p211o329m437k864k486j967l04J394K259L178M589N332
57907D20585N224N990Q070R334Q620P713P952P832O080M323M232M665M029L155
57893E07804L359L756K982J723J236J066L41l82n73j170k673l612k851j642j477
57878E07887j736j420j305k265l206k804j798j506j518q39R4M03M61R43J425J429
57862D94245J451J610R33p17j785j530j401k399l230k816k484l524m548l614j324
57847D68867M04J218J918K567K976L741M998N537M771M042M316M387L082J426
$$ plain form
57833 514250 514900 514881 513367 510562 507674 504579 499629 492246 483682 474735 464820 453958 443488 433950
57819 433950 424207 413691 403782 395843 389443 383509 377873 372754 367942 363365 359357 355826 352315 349306
57805 349306 348059 348724 350077 351545 353845 357119 360220 362719 366012 371504 379048 387983 398196 409179
57791 409179 419361 427428 433319 437268 439081 439069 438444 437974 437327 436248 435054 433367 429873 424245 417991
57776 417991 412538 407694 402763 397785 392817 387360 381506 376417 372614 369051 364913 361095 358784 357758
57762 357758 357321 357824 359900 363036 366261 369539 373267 376935 379498 380684 380980 380696 379832 378406 376231
57747 376231 372880 368542 364367 361392 359728 359341 360794 364372 369136 373799 378148 382900 388474 394488
57733 394488 400197 405027 409017 412944 417579 422692 427455 431840 436780 442827 449536 456383 463341 470406
$$ packed form
57833E14250O50j9j514k805k888l095m950p383q564q947r915j0862j0470r538
57819D33950r743j0516r909p939o400n934n636n119m812m577m008l531l511l009
57805C49306j247O65J353J468K300L274L101K499L293N492P544Q935J0213J0983
57791D09179J0182Q067N891L949J813j2o25m70o47j079j194j687l494n628o254
57776D17991n453m844m931m978m968n457n854n089l803l563m138l818k311j026
57762C57758m37N03K076L136L225L278L728L668K563J186K96k84q64j426k175
57747C76231l351m338m175k975j664l87J453L578M764M663M349M752N574O014
57733C94488N709M830L990L927M635N113M763M385M940O047O709O847O958P065
$$ plain form
57719 470406 477656 485911 496081 507525 518420 528218 538354 550016 562702 575847 590308 607079
57707 607079 625705 645229 665827 688331 712933 739420 768055 799179 832626 868538 908239
57696 908239 953407 1004867 1062944 1128511 1202962 1287648 1383938 1493294 1616796 1755254 1910175
57685 1910175 2083758 2277323 2490498 2722294 2971700 3236254 3510812 3788360 4060997
57676 4060997 4319273 4551877 4747845 4899504 5003549 5060835 5076470 5059227 5018903 4962944
57666 4962944 4894086 4808729 4696614 4544444 4343582 4096313 3815524 3519291 3225447 2948269
57656 2948269 2696627 2473842 2279691 2112657 1970483 1850058 1748257 1662796 1591741 1532911
57646 1532911 1484585 1446059 1416612 1394569 1378364 1367882 1363759 1365882 1373616 1387117 1407403 1435358
$$ packed form
57719D70406P250Q255J0170J1444J0895R798J0136J1662J2686J3145J4461J6771
57707F07079J8626J9524K0598K2504K4602K6487K8635L1124L3447L5912L9701
57696I08239M5168N1460N8077O5567P4451Q4686R6290J09356J23502J38458J54921
57685A910175J73583J93565K13175K31796K49406K64554K74558K77548K72637
57676D060997K58276K32604J95968J51659J04045N7286J5635j7243m0324n5959
57666D962944o8858q5357j12115j52170k00862k47269k80789k96233k93844k77178
57656B948269k51642k22785j94151j67034j42174j20425j01801q5461p1055n8830
57646A532911m8326l8526k9447k2043j6205j0482m123K123P734J3501K0286K7955
$$ plain form
57634 1435358 1471343 1515406 1567307 1626976 1695622 1775713 1869127 1976024 2096304 2231215 2382401
57623 2382401 2550079 2733135 2930288 3139656 3357382 3577560 3793043 3995312 4174079
57614 4174079 4318371 4418498 4467207 4460476 4398739 4287088 4133391 3946437 3736013 3512899
57604 3512899 3286594 3063173 2846419 2640233 2448365 2272233 2110857 1963103 1828785
57595 1828785 1707669 1598811 1501085 1413385 1334353 1262919 1199056 1142988 1093773 1049602 1009326
57584 1009326 972586 938667 906515 875995 847985 823035 800844 781081 763737 748506 734793
57573 734793 722447 711629 701886 692294 682706 674046 667144 662057 658632 656879 656493 656681 656883 657330 658790
57558 658790 662038 667457 674731 682998 691628 700662 710240 720199 730745 742920 757545 774194 792114
$$ packed form
57634A435358L5985M4063N1901N9669O8646Q0091R3414J06897J20280J34911J51186
57623B382401J67678J83056J97153K09368K17726K20178K15483K02269J78767
57614D174079J44292J00127M8709o731o1737j11651j53697j86954k10424k23114
57604C512899k26305k23421k16754k06186j91868j76132j61376j47754j34318
57595A828785j21116j08858r7726q7700p9032p1434o3863n6068m9215m4171m0276
57584A009326l6740l3919l2152l0520k8010k4950k2191j9763j7344j5231j3713
57573G34793j2346j0818r743r592r588q660o902n087l425j753l86J88K02M47J460
57558F58790L248N419P274Q267Q630R034R578R959J0546J2175J4625J6649J7920
$$ plain form
57545 792114 811846 834971 862472 894213 929857 969396 1012940 1060923 1114528 1175191 1243781
57534 1243781 1320867 1407488 1504820 1613265 1732764 1863753 2006917 2161938 2327185 2500358
57524 2500358 2678482 2857104 3030098 3190213 3329393 3439123 3511675 3541623 3526454 3466818
57514 3466818 3367202 3235749 3082061 2914729 2740895 2566919 2397955 2237135 2086271 1947127
57504 1947127 1820996 1707525 1605311 1513558 1432124 1360279 1296773 1241072 1193260 1152684 1117893
57493 1117893 1088031 1063237 1043581 1028653 1018174 1012004 1009492 1009841 1013114 1019951 1030442 1044374
57481 1044374 1062427 1085856 1114960 1149073 1188099 1232896 1284120 1342072 1407900 1483681 1570905
57470 1570905 1669851 1780582 1903460 2038390 2184548 2340869 2505531 2674631 2842319 3002261
$$ packed form
57545G92114J9732K3125K7501L1741L5644L9539M3544M7983N3605O0663O8590
57534A243781P7086Q6621R7332J08445J19499J30989J43164J55021J65247J73173
57524B500358J78124J78622J72994J60115J39180J09730P2552K9948j5169n9636
57514C466818r9616j31453j53688j67332j73834j73976j68964j60820j50864j39144
57504A947127j26131j13471j02214r1753q1434p1845o3506n5701m7812m0576l4791
57493A117893k9862k4794j9656j4928j0479o170k512L49L273O837J0491J3932
57481A044374J8053K3429K9104L4113L9026M4797N1224N7952O5828P5781Q7224
57470A570905R8946J10731J22878J34930J46158J56321J64662J69100J67688J59942
$$ plain form
57460 3002261 3147755 3270537 3361275 3412255 3419122 3380496 3297893 3176803 3026226 2855869
57450 2855869 2673983 2487610 2303010 2124748 1955291 1796262 1649311 1515360 1394173
57441 1394173 1285359 1188809 1103593 1027629 959269 898286 844525 796664 753252 714037 679247
57430 679247 648262 620030 594231 571096 550456 531770 514696 499011 484331 470514 457930
57419 457930 446827 436823 427439 418626 410333 402130 393807 385853 378828 372673 367074 362025 357563 353414
57405 353414 349317 345356 341674 338289 335454 333689 333100 333103 333048 332738 332215 331598 331206 331258 331386 331115 330790 331210
57387 331210 332283 333027 332976 332561 331873 330271 327655 325021 323199 321979 320956 320189 319453 318003 315870 314408
57371 314408 314620 315731 316279 315964 315567 315677 316335 317417 318600 319276 319153 318620 318178 317967 318151 318984 320111
$$ packed form
57460C002261J45494J22782R0738N0980O867l8626q2603j21090j50577j70357
57450B855869j81886j86373j84600j78262j69457j59029j46951j33951j21187
57441A394173j08814r6550q5216p5964o8360o0983n3761m7861m3412l9215l4790
57430F79247l0985k8232k5799k3135k0640j8686j7074j5685j4680j3817j2584
57419D57930j1103j0004r384q813q293q203q323p954p025o155n599n049m462m149
57405C53414m097l961l682l385k835j765n89Ln5l10n23o17l92N2J28k71l25M20
57387C31210J073P44n1m15o88j602k616k634j822j220j023p67p36j450k133j462
57371C14408K12J111N48l15l97J10O58J082J183O76j23n33m42k11J84Q33J127
$$ plain form
57354 320111 320596 320202 319875 320412 321425 322228 322946 324007 325178 325888 326006 325751 325323 325097 325539 326554 327588
57337 327588 328732 330820 334016 337348 340239 343380 347296 351128 353834 355652 357264 358371 358348 357707 357657
57322 357657 358595 360040 361708 363632 365549 367118 368620 370680 373470 376765 380465 384518 388723 393145
57308 393145 398242 404077 409957 415410 420917 427100 433802 440580 447425 454396 461261 468178 476013 485276
57294 485276 495448 506010 517279 529574 542500 555939 570777 587648 605874 624774 645089
57283 645089 667875 692762 718640 745345 773229 801590 829010 854975 879868 903474 924495
57272 924495 941253 952040 955368 951053 940678 925888 906764 882960 855684 827039 797799 767461
57260 767461 736392 706438 679273 655295 634207 615565 598704 583060 568741 556087 544945
$$ packed form
57354C20111M85l94l27N37J013Q03P18J061J171P10J18k55m28k26M42J015J034
57337C27588J144K088L196L332K891L141L916L832K706J818J612J107k3o41n0
57322C57657R38J445J668J924J917J569J502K060K790L295L700M053M205M422
57308C93145N097N835N880N453N507O183O702O778O845O971O865O917P835R263
57294D85276J0172J0562J1269J2295J2926J3439J4838J6871J8226J8900K0315
57283F45089K2786K4887K5878K6705K7884K8361K7420K5965K4893K3606K1021
57272I24495J6758J0787L328m315j0375j4790j9124k3804k7276k8645k9240l0338
57260G67461l1069k9954k7165k3978k1088j8642j6861j5644j4319j2654j1142
$$ plain form
57249 544945 535162 527251 521542 517027 512250 507077 502498 498957 496024 493414 491104 488698 485987 483923
57235 483923 483651 484604 484909 483836 482632 482752 484333 486614 488852 490608 491937 493451 495649 498269 500910
57220 500910 503825 507305 510776 513539 516011 519156 523115 527460 532312 537945 543755 549005 554227 560460
57206 560460 567411 573873 579739 586059 593199 600479 607582 614783 621741 627620 632557 637626 643216 648735
57192 648735 653933 659166 664379 669279 674436 680701 687509 693382 698201 703390 709702 716497 723388 730901
57178 730901 739180 747689 756624 766951 778517 789737 799768 809612 820530 832699 845953 860455
57166 860455 876038 892120 908687 926115 943753 960126 974999 989848 1005804 1022517 1039496
57155 1039496 1057167 1076047 1096085 1117263 1139704 1163011 1186700 1211394 1238181 1266865 1296496
$$ packed form
57249E44945r783p911n709m515m777n173m579l541k933k610k310k406k711k064
57235D83923k72R53L05j073j204J20J581K281K238J756J329J514K198K620K641
57220E00910K915L480L471K763K472L145L959M345M852N633N810N250N222O233
57206E60460O951O462N866O320P140P280P103P201O958N879M937N069N590N519
57192F48735N198N233N213M900N157O265O808N873M819N189O312O795O891P513
57178G30901Q279Q509Q935J0327J1566J1220J0031R844J0918J2169J3254J4502
57166H60455J5583J6082J6567J7428J7638J6373J4873J4849J5956J6713J6979
57155A039496J7671J8880K0038K1178K2441K3307K3689K4694K6787K8684K9631
$$ plain form
57144 1296496 1327609 1362061 1400456 1441587 1484579 1529511 1575688 1621537 1666806 1712999 1761206
57133 1761206 1811595 1865199 1923705 1986816 2052282 2119230 2189083 2262516 2338253 2415784 2496477
57122 2496477 2580842 2667493 2756301 2849951 2950800 3058556 3172344 3292454 3418608 3549206
57112 3549206 3683940 3824755 3973051 4128944 4294812 4476666 4680853 4913013 5181609
57103 5181609 5498048 5871121 6305967 6811788 7407402 8118158 8973802 10012727 11281288
57094 11281288 12822507 14668596 16845473 19373039 22251538 25454289 28939323 32650488
57086 32650488 36484828 40270114 43816191 47017739 49905350 52590083 55163867 57646688
57078 57646688 59992142 62103180 63837319 65022562 65493757 65130080 63878682 61766446
$$ packed form
57144A296496L1113L4452L8395M1131M2992M4932M6177M5849M5269M6193M8207
57133A761206N0389N3604N8506O3111O5466O6948O9853P3433P5737P7531Q0693
57122B496477Q4365Q6651Q8808R3650J00849J07756J13788J20110J26154J30598
57112C549206J34734J40815J48296J55893J65868J81854K04187K32160K68596
57103E181609L16439L73073M34846N05821N95614P10756Q55644J038925J268561
57094A1281288J541219J846089K176877K527566K878499L202751L485034L711165
57086C2650488L834340L785286L546077L201548K887611K684733K573784K482821
57078E7646688K345454K111038J734139J185243M71195l63677j251398k112236
$$ plain form
57070 61766446 58896810 55422969 51508301 47301950 42939557 38550852 34257587 30166053
57062 30166053 26362571 22909457 19839222 17154093 14834795 12850438 11162180 9725271
57054 9725271 8495615 7437061 6522834 5732571 5050138 4462501 3957614 3523078 3147543
57045 3147543 2822371 2540705 2295893 2082027 1894992 1731515 1587768 1460007 1345967
57036 1345967 1244468 1154049 1072894 999582 932899 871243 813072 757802 705643 656793 611275
57025 611275 569229 530759 495702 463807 434824 408165 383063 359499 338370 320213 304363
57014 304363 289961 277279 267346 260784 257857 259394 266754 280987 302780 333166 373581 425553
57002 425553 491617 576801 687467 826584 988920 1160065 1319204 1443301 1511955 1513371
$$ packed form
57070F1766446k869636l473841l914668m206351m362393m388705m293265m091534
57062C0166053l803482l453114l070235k685129k319298j984357j688258j436909
57054I725271j229656j058554r14227p90263o82433n87637n04887m34536l75535
57045C147543l25172k81666k44812k13866j87035j63477j43747j27761j14040
57036A345967j01499r0419q1155p3312o6683o1656n8171n5270n2159m8850m5518
57025F11275m2046l8470l5057l1895k8983k6659k5102k3564k1129j8157j5850
57014C04363j4402j2682r933o562k927J537P360J4233K1793L0386M0415N1972
57002D25553O6064Q5184J10666J39117J62336J71145J59139J24097O8654J416
$$ plain form
56992 1513371 1449324 1334919 1192088 1041222 896384 765257 651159 554874 475875 412946
56982 412946 363994 325674 293837 264543 234531 201257 163597 122842 82244 44887 12072
56970 -16284 -40454 -60491 -76404 -87981 -94619 -95810 -91589 -82170 -67484 -47557 -23072 5022 36291
56957 36291 70625 107318 144531 179377 208070 226495 231872 224499 207616 185337 160862 136366
56945 136366 113614 93921 77700 64624 54401 47334 44217 45813 52398 63622 78850 97788
56933 97788 120920 149313 183799 223939 267301 309390 344376 366554 372157 360749 335287 300714
56921 300714 262053 223232 186867 154394 126263 102347 82421 66262 53368 42920 34124 26508
56909 26508 19871 14145 9320 5321 1997 -637 -2280 -2742 -2288 -1076 1588 6787 14663 24201 34538
$$ packed form
56992A513371o4047j14405j42831j50866j44838j31127j14098r6285p8999o2929
56982D12946m8952l8320l1837k9294l0012l3274l7660m0755m0598l7357A2072
56970a6284k4170k0037j5913j1577o638j191M221R419J4686J9927b3072E022L1269
56957C6291L4334L6693L7213L4846K8693J8425N377p373j6883k2279k4475k4496
56945A36366k2752j9693j6221j3076j0223p067l117J596O585J1224J5228J8938
56933I7788K3132K8393L4486M0140M3362M2089L4986K2178N603j1408k5462l4573
56921C00714l8661l8821l6365l2473k8131k3916j9926j6159j2894j0448q796p616
56909B6508o637n726m825l999A997f37j643m62M54a076A588N199P876R538J0337
$$ plain form
56894 34538 45887 58901 73850 90988 111091 134845 161989 191780 224071 259031 295611 330860
56882 330860 360913 382284 392473 390428 377268 356295 331635 306552 282959 262057 244903 232304
56870 232304 224610 221925 224541 233023 247961 269792 298910 335876 381530 436849 502334 576784
56858 576784 656052 732897 798318 843599 862297 852071 815909 761456 698046 633501 573038
56847 573038 520035 476608 443498 420547 407900 406406 416729 438782 472376 517922 576166 647806
56835 647806 733763 835046 951153 1078012 1206849 1324228 1413438 1458434 1450021 1390432 1292348
56824 1292348 1173045 1048286 929232 822202 729784 652479 590095 542150 507719 485846
56814 485846 476323 479563 495574 523626 563244 614994 679807 757539 845922 939586 1028954 1100554
$$ packed form
56894C4538J1349J3014J4949J7138K0103K3754K7144K9791L2291L4960L6580L5249
56882C30860L0053K1371J0189k045j3160k0973k4660k5083k3593k0902j7154j2599
56870B32304p694k685K616Q482J4938K1831K9118L6966M5654N5319O5485P4450
56858E76784P9268P6845O5421M5281J8698j0226l6162n4453o3410o4545o0463
56847E73038n3003m3427l3110k2951j2647j494J0323K2053L3594M5546N8244P1640
56835F47806Q5957J01283J16107J26859J28837J17379Q9210M4996q413n9589r8084
56824A292348j19303j24759j19054j07030r2418p7305o2384m7945l4431k1873
56814D85846r523L240J6011K8052L9618N1750O4813P7732Q8383R3664Q9368P1600
$$ plain form
56802 1100554 1140546 1140262 1099921 1027865 936459 837811 741287 652798 575082 508667 453160 408186
56790 408186 373586 349116 334316 328686 331806 343208 362193 387981 420108 458643 503534 553006
56778 553006 602096 642954 667358 669932 649901 610746 558605 500447 442350 388243 339673 296679
56766 296679 259009 226698 199801 177865 159938 145187 133356 124357 117515 111659 106142 101349
56754 101349 97885 95568 93588 91356 88797 86044 83363 81223 79905 79044 77995 76625 75392 74672 74442
56739 74442 74529 74657 74335 73207 71513 69724 67797 65384 62744 60676 59460 58565 57690 57320 57836 58651 58789
56722 58789 57946 56546 55041 53571 52100 50608 49281 48593 48890 49780 50326 50011 49162 48314 47647 47206 47155
56705 47155 47539 48227 49280 50856 52577 53665 54042 54632 56085 57877 59249 60475 62429 65263 68227
$$ packed form
56802A100554L9992k84m0341p2056r1406r8648r6524q8489p7716o6415n5507m4974
56790D08186l4600k4470j4800n630L120J1402J8985K5788L2127L8535M4891M9472
56778E53006M9090M0858K4404K574k0031l9155n2141n8158n8097n4107m8570m2994
56766B96679l7670l2311k6897k1936j7927j4751j1831q999o842n856n517m793
56754A01349l464k317j980k232k559k753k681k140j318q61j049j370j233p20k30
56739G4442Q7J28l22j128j694j789j927k413k640k068j216q95q75l70N16Q15J38
56722E8789q43j400j505j470j471j492j327o88K97Q90N46l15q49q48o67m41n1
56705D7155L84O88J053J576J721J088L77N90J453J792J372J226J954K834K964
$$ plain form
56690 68227 70602 72179 73097 73820 75190 77862 81690 86000 90266 94095 96907 98328 98880 99657 101185
56675 101185 102944 104085 104314 104033 103865 104091 104470 104749 105263 106596 108458 109472 108589 106353 104201 102835
56659 102835 101811 100524 98856 96905 94676 92186 89428 86176 82148 77407 72278 66929 61320 55569
56645 55569 50036 45048 40756 37229 34381 31835 29166 26329 23776 22108 21720 22561 24119 25792 27440
56630 27440 29398 31849 34460 36805 38852 40762 42461 43735 44588 45246 45974 47028 48537 50240 51593
56615 51593 52336 52762 53306 54167 55374 56760 57805 58077 58048 58773 60445 61959 62422 62429 63160 64809 66653 68237
56597 68237 69647 70852 71659 72238 73047 74217 75500 76786 78247 80035 82167 84528 86693 88148 88964
56582 88964 89830 90948 91531 91018 90236 90471 91761 93050 93811 94608 96090 98287 100968 103998 107237 110712
$$ packed form
56690F8227K375J577R18P23J370K672L828M310M266L829K812J421N52P77J528
56675A01185J759J141K29k81j68K26L79K79N14J333J862J014q83k236k152j366
56659A02835j024j287j668j951k229k490k758l252m028m741n129n349n609n751
56645E5569n533m988m292l527k848k546k669k837k553j668l88Q41J558J673J648
56630B7440J958K451K611K345K047J910J699J274Q53O58P28J054J509J703J353
56615E1593P43M26N44Q61J207J386J045K72k9P25J672J514M63PP31J649J844J584
56597F8237J410J205Q07N79Q09J170J283J286J461J788K132K361K165J455Q16
56582H8964Q66J118N83n13p82K35J290J289P61P97J482K197K681L030L239L475
$$ plain form
56566 110712 114900 120297 126700 133431 140185 147151 154427 161904 169624 177621 185481 192683 199309 205859
56552 205859 212473 218876 224967 230761 235799 239297 240931 241027 240056 238439 236647 234800 232256 228259 222906
56537 222906 216899 210510 203547 196192 189148 182924 177597 173189 169630 166472 163366 160655 158746 157111
56523 157111 154832 152007 149589 147864 146158 144131 142263 140695 138648 135497 131658 127948 124736 122081
56509 122081 120042 118415 116744 114925 113321 112056 110820 109532 108513 107712 106474 104499 102452 101197
56495 101197 100857 100969 101113 101110 100995 101062 101615 102508 103315 103925 104579 105394 106473 108344 111484 115394 119001 122102
56477 122102 125508 129558 133452 136528 139299 142636 146613 150761 154921 159264 163871 168736 173817 178754
56463 178754 182968 186360 189472 192673 195693 198235 200460 202551 204349 205825 207306 208759 209340 208239
$$ packed form
56566A10712M188N397O403O731O754O966P276P477P720P997P860P202O626O550
56552B05859O614O403O091N794N038L498J634R6r71j617j792j847k544l997n353
56537B22906o007o389o963p355p044o224n327m408l559l158l106k711j909j635
56523A57111k279k825k418j725j706k027j868j568k047l151l839l710l212k655
56509A22081k039j627j671j819j604j265j236j288j019q01j238j975k047j255
56495A01197l40J12J44lj15O7N53Q93Q07O10O54Q15J079J871L140L910L607L101
56477A22102L406M050L894L076K771L337L977M148M160M343M607M865N081M937
56463A78754M214L392L112L201L020K542K225K091J798J476J481J453N81j101
$$ plain form
56449 208239 205656 202531 199590 197027 194881 193316 192710 193563 196003 199211 201793 203053 203589 204374 205577
56434 205577 206541 206577 205520 203679 201396 198652 195169 191142 187531 185174 183760 182205 179900 176989 173659
56419 173659 169991 166538 164122 162795 161639 159818 157355 154816 152860 152024 152249 152632 152364 151854 152075 152913
56403 152913 153239 152730 152420 153099 154224 154895 155020 155045 155375 156504 158936 162511 166493 170639 175382 180734
56387 180734 185970 190739 195481 200219 203880 205378 204517 201374 195757 187994 179438 171556 165119 160661
56373 160661 158686 158829 159722 160461 161433 163260 165823 168906 172666 176700 179737 181237 182354 184224 186189
56358 186189 186885 186409 186141 186922 188563 190759 193298 195585 197067 198075 199508 201754 204546 207545 210386
56343 210386 212406 213143 213036 213084 213905 215516 217748 220447 223520 227148 231689 237160 243228 249771 256842
$$ packed form
56449B08239k583l125k941k563k146j565o06Q53K440L208K582J260N36P85J203
56434B05577R64L6j057j841k283k744l483m027l611k357j414j555k305k911l330
56419A73659l668l453k416j327j156j821k463k539j956q36K25L83k68n10K21Q38
56403A52913L26n09l10O79J125O71J25K5L30J129K432L575L982M146M743N352
56387A80734N236M769M742M738L661J498q61l143n617p763q556p882o437m458
56373A60661j975J43Q93P39R72J827K563L083L760M034L037J500J117J870J965
56358A86189O96m76k68P81J641K196K539K287J482J008J433K246K792K999K841
56343B10386K020P37j07M8Q21J611K232K699L073L628M541N471O068O543P071
$$ plain form
56328 256842 263953 270264 275749 281299 287364 293496 299637 306679 315052 323929 332558 341317 350529 359391
56314 359391 367181 374498 382078 389240 394856 399132 403057 406551 408471 408219 406261 403342 400127 397306
56300 397306 395129 393129 391035 389499 389184 389758 390623 391999 394363 397515 401204 405945 412090 418782 425111
56285 425111 431780 440286 450917 462847 475913 490873 508038 526905 547150 568929 592251 617059
56273 617059 643865 673478 706198 742099 781848 826427 876319 931760 993444 1062207 1138492
56262 1138492 1223067 1317689 1423962 1541853 1670425 1809560 1959811 2120843 2291240 2469564
56252 2469564 2654311 2842746 3030816 3214243 3388928 3550454 3694258 3816420 3913885 3984334
56242 3984334 4026737 4041817 4031321 3997236 3942229 3870095 3784689 3688930 3585578 3478095 3369514
$$ packed form
56328B56842P111O311N485N550O065O132O141P042Q373Q877Q629Q759R212Q862
56314C59391P790P317P580P162N616M276L925L494J920k52j958k919l215k821
56300C97306k177k000k094j536l15N74Q65J376K364L152L689M741O145O692O329
56285D25111O669Q506J0631J1930J3066J4960J7165J8867K0245K1779K3322K4808
56273F17059K6806K9613L2720L5901L9749M4579M9892N5441O1684O8763P6285
56262A138492Q4575R4622J06273J17891J28572J39135J50251J61032J70397J78324
56252B469564J84747J88435J88070J83427J74685J61526J43804J22162R7465P0449
56242C984334M2403J5080j0496l4085n5007p2134q5406r5759j03352j07483j08581
$$ plain form
56231 3369514 3261025 3152878 3045995 2941371 2838488 2735822 2632668 2529183 2425063
56222 2425063 2319607 2212952 2106043 1999590 1894129 1790718 1690377 1593267 1499544 1410466
56212 1410466 1327307 1249700 1176533 1107998 1045288 988670 937405 891201 850126 813421 780069
56201 780069 750279 724726 702533 681777 661838 643494 626791 610799 595640 582794 572873 564776
56189 564776 557526 551349 546378 541799 537094 532980 530474 529825 530765 532938 535830 539158 543468 549573 557279
56174 557279 565574 574006 583082 593398 605225 618614 632990 646969 659559 671140 682303 692359
56162 692359 700247 706272 711492 715884 718646 719897 720543 720894 720955 721632 724025 727921 732591 738636 747372
56147 747372 758962 773043 790764 814241 844329 880934 925164 979182 1044219 1120772 1210303
$$ packed form
56231C369514j08489j08147j06883j04624j02883j02666j03154j03485j04120
56222B425063j05456j06655j06909j06453j05461j03411j00341r7110r3723q9078
56212A410466q3159p7607p3167o8535o2710n6618n1265m6204m1075l6705l3352
56201G80069k9790k5553k2193k0756j9939j8344j6703j5992j5159j2846r921q097
56189E64776p250o177m971m579m705m114k506o49R40K173K892L328M310O105P706
56174E57279Q295Q432R076J0316J1827J3389J4376J3979J2590J1581J1163J0056
56162F92359P888O025N220M392K762J251O46L51O1O77K393L896M670O045Q736
56147G47372J1590J4081J7721K3477L0088L6605M4230N4018O5037P6553Q9531
$$ plain form
56136 1210303 1314264 1431387 1557841 1689617 1822369 1949468 2063594 2161252 2243785 2313868
56126 2313868 2373330 2424431 2470091 2511443 2546723 2573088 2588012 2589292 2576402 2552363 2521943
56115 2521943 2487358 2447419 2400450 2345183 2278745 2197255 2100007 1991002 1875725 1758734 1644786
56104 1644786 1539163 1445136 1362982 1292376 1233617 1185841 1146496 1113789 1087613 1067173 1049926
56093 1049926 1033884 1018871 1004633 989920 974403 959375 945565 932285 919527 908735 900543
56082 900543 893832 887807 882893 878996 875242 872196 871864 874616 878441 882088 886486 892160 897865 902934
56068 902934 908583 915812 924159 933371 943978 955477 966328 976503 987533 999528 1010835 1021220
56056 1021220 1032408 1044845 1056940 1068292 1080433 1093641 1106390 1118851 1133465 1150993 1169480
$$ packed form
56136A210303J03961J17123J26454J31776J32752J27099J14126R7658Q2533P0083
56126B313868N9462N1101M5660M1352L5280K6365J4924J280j2890k4039l0420
56115B521943l4585l9939m6969n5267o6438q1490r7248j09005j15277j16991j13948
56104A644786j05623r4027q2154p0606n8759m7776l9345l2707k6176k0440j7247
56093A049926j6042j5013j4238j4713j5517j5028j3810j3280j2758j0792q192
56082I00543o711o025m914l897l754l046l32K752L825L647M398N674N705N069
56068I02934N649P229Q347R212J0607J1499J0851J0175J1030J1995J1307J0385
56056A021220J1188J2437J2095J1352J2141J3208J2749J2461J4614J7528J8487
$$ plain form
56045 1169480 1188076 1208105 1229266 1248880 1266422 1284834 1305637 1326766 1346923 1367974 1391031
56034 1391031 1414458 1438005 1464716 1496166 1529712 1563053 1597628 1634842 1672825 1709854 1747448
56023 1747448 1787377 1829041 1872254 1918869 1969104 2019995 2069967 2121125 2174723 2228682 2282194
56012 2282194 2338290 2398961 2462002 2525519 2591064 2659560 2729002 2799327 2874572 2956845 3043132
56001 3043132 3131385 3224565 3325126 3430943 3540556 3656920 3781969 3913114 4049263 4194516
55991 4194516 4351608 4517787 4691642 4877612 5078932 5292821 5517938 5759813 6023318
55982 6023318 6306621 6608182 6932566 7283611 7659655 8061881 8499333 8979201 9500936
55973 9500936 10067218 10691500 11387142 12159313 13016345 13978682 15067476 16296353 17686138
$$ packed form
56045A169480J8596K0029K1161J9614J7542J8412K0803K1129K0157K1051K3057
56034A391031K3427K3547K6711L1450L3546L3341L4575L7214L7983L7029L7594
56023A747448L9929M1664M3213M6615N0235N0891M9972N1158N3598N3959N3512
56012B282194N6096O0671O3041O3517O5545O8496O9442P0325P5245Q2273Q6287
56001C043132Q8253R3180J00561J05817J09613J16364J25049J31145J36149J45253
55991D194516J57092J66179J73855J85970K01320K13889K25117K41875K63505
55982F023318K83303L01561L24384L51045L76044M02226M37452M79868N21735
55973I500936N66282O24282O95642P72171Q57032R62337J088794J228877J389785
$$ plain form
55964 17686138 19277512 21119803 23262528 25773501 28755051 32333354 36654208 41913879
55956 41913879 48385195 56399404 66320865 78554510 93542234 111705657 133403038
55949 133403038 158977609 188815326 223224948 262041711 304004522 346103764 383354806
55942 383354806 409621452 419639133 411297568 386628911 350753780 309619904 268096175
55935 268096175 229264921 194636659 164647437 139115393 117601666 99626172 84718748
55928 84718748 72407170 62243273 53843004 46882680 41077839 36192343 32053519 28533364
55920 28533364 25520550 22921901 20673425 18727376 17033885 15547258 14239011 13089136
55912 13089136 12071649 11161065 10344993 9617573 8966665 8378194 7846280 7368053 6934149
$$ packed form
55964A7686138J591374J842291K142725K510973K981550L578303M320854N259671
55956D1913879O471316Q014209R921461J2233645J4987724J8163423K1697381
55949A33403038K5574571K9837717L4409622L8816763M1962811M2099242L7251042
55942C83354806K6266646J0017681q341565k4668657l5875131m1133876m1523729
55935B68096175l8831254l4628262k9989222k5532044k1513727j7975494j4907424
55928H4718748j2311578j0163897q400269o960324n804841m885496m138824l520155
55920B8533364l012814k598649k248476j946049j693491j486627j308247j149875
55912A3089136j017487r10584q16072p27420o50908n88471n31914m78227m33904
$$ plain form
55903 6934149 6534218 6166340 5831628 5524712 5238343 4972154 4728067 4501752 4287083
55894 4287083 4084698 3898086 3725149 3561261 3406870 3264648 3132556 3006766 2888126
55885 2888126 2779071 2677282 2578919 2485128 2399162 2319824 2243611 2170633 2102843 2039217 1978079
55874 1978079 1921360 1871149 1824721 1778225 1732687 1691251 1653226 1615951 1579923 1546811 1514822
55863 1514822 1481243 1447473 1416650 1388362 1360560 1334616 1313630 1297505 1284197 1273844 1266919
55852 1266919 1260045 1248341 1230674 1208752 1182964 1153458 1123402 1096480 1072439 1049239 1028041
55841 1028041 1011709 999860 989759 980923 974515 969247 962164 952764 942443 930735 915925 898555
55829 898555 880503 861391 839615 816199 793899 773098 752172 731310 712329 695032 677185
$$ packed form
55903F934149l99931l67878l34712l06916k86369k66189k44087k26315k14669
55894D287083k02385j86612j72937j63888j54391j42222j32092j25790j18640
55885B888126j09055j01789r8363r3791q5966p9338p6213p2978o7790o3626o1138
55874A978079n6719n0211m6428m6496m5538m1436l8025l7275l6028l3112l1989
55863A514822l3579l3770l0823k8288k7802k5944k0986j6125j3308j0353o925
55852A266919o874j1704j7667k1922k5788k9506l0056k6922k4041k3200k1198
55841A028041j6332j1849j0101q836o408n268p083r400j0321j1708j4810j7370
55829H98555j8052j9112k1776k3416k2300k0801k0926k0862j8981j7297j7847
$$ plain form
55818 677185 657999 638716 620142 602443 586803 574354 564009 554024 545045 538898 535310 532716
55806 532716 531419 532951 537068 542331 548867 557527 567000 574782 580463 585190 588610 589257 587178 583185
55792 583185 576238 564824 550369 536067 522761 509048 495008 482465 471742 461475 451682 443950
55780 443950 438411 433503 428986 426395 426157 426741 426751 425424 421159 412268 399471 385339 371275 357264
55766 357264 344201 333618 325187 317269 310027 305265 302987 300942 297962 295090 292872 290195 286479 282714
55752 282714 279597 276765 274372 273278 273061 271854 268684 264234 259043 252952 246543 241004 236180 230774
55738 230774 224804 219778 216155 212801 209434 207370 207134 207395 207093 206792 207095 207325 206555 204530 201015 195731
55722 195731 189455 183804 179390 175441 171478 167966 165113 162531 160354 159237 159030 158906 159024 160514 163639
$$ packed form
55818F77185j9186j9283j8574j7699j5640j2449j0345r985q979o147l588k594
55806E32716j297J532M117N263O536Q660R473P782N681M727L420O47k079l993
55792E83185o947j1414j4455j4302j3306j3713j4040j2543j0723j0267r793p732
55780D43950n539m908m517k591k38N84J0j327m265q891j2797j4132j4064j4011
55766C57264j3063j0583q431p918p242m762k278k045k980k872k218k677l716l765
55752B82714l117k832k393j094k17j207l170m450n191o091o409n539m824n406
55738B30774n970n026l623l354l367k064k36K61l02l01L03K30p70k025l515n284
55722A95731o276n651m414l949l963l512k853k582k177j117k07j24J18J490L125
$$ plain form
55707 163639 167388 171041 174736 178524 182433 187441 194534 202668 209366 213554 216189 218080 218939 218843 218744
55692 218744 219118 219810 221419 225083 230521 235995 240561 244665 248320 250560 251123 250822 249843 247494 244158
55677 244158 241606 240721 240579 240302 240085 239899 239042 237664 236951 237056 236597 234970 233414 232973 233091 233182 233848 235541
55659 235541 237525 239231 241250 243957 246438 247794 248331 248624 248648 248632 249397 250860 251397 249644 245825 240537
55643 240537 233517 224625 214911 205597 196823 188230 179885 171927 164224 157008 150826 145289 139047 131680
55629 131680 124405 118174 112387 106377 100902 97016 94487 92434 90662 89313 87980 86205 84235 82421
55615 82421 80514 78344 76536 75728 75662 75725 75848 76268 77003 78091 79691 81440 82375 82018 80864 79453 77669
55598 77669 75416 73156 71338 69950 68959 68413 67875 66697 65163 64418 64937 66027 67012 67764 67788 66163 62986
$$ packed form
55707A63639L749L653L695L788L909N008P093Q134O698M188K635J891Q59r6r9
55692B18744L74O92J609L664N438N474M566M104L655K240N63l01r79k349l336
55677B44158k552q85j42k77k17j86q57j378p13J05m59j627j556m41J18R1O66J693
55659B35541J984J706K019K707K481J356N37K93K4j6P65J463N37j753l819n288
55643B40537p020q892r714r314q774q593q345p958p703p216o182n537o242p367
55629A31680p275o231n787o010n475l886k529k053j772j349j333j775j970j814
55615H2421j907k170j808q08o6O3J23M20P35J088J600J749R35l57j154j411j784
55598G7669k253k260j818j388r91n46n38j178j534p45N19J090R85P52K4j625l177
$$ plain form
55581 62986 59712 57425 55830 54385 53166 52048 50379 48250 46826 46597 46500 45642 44700 44646 45182 45466 45395
55564 45395 45219 44790 44143 43957 44537 45247 45777 46913 49069 51103 51705 51097 50288 49531 48714 48405 49186 50534
55546 50534 51604 52612 54320 56654 58970 61328 64297 67730 70760 73005 74983 77419 80681 84674
55532 84674 88767 92181 94895 97782 101405 105180 108214 110370 112010 113315 114424 115649 116912 117519 116982
55517 116982 115475 113056 109179 103609 97088 90517 84150 78085 72635 67542 61653 54267 46122 38375
55503 38375 31367 25134 20281 17357 15907 14996 14228 13646 13253 13275 14218 15990 17598 18311 18413 18275 17627
55486 17627 16434 15468 15182 15000 14620 14937 16560 18388 18956 18433 18024 18078 18062 17799 17441 16716 15469 14512
55468 14512 14741 15774 16531 16690 16414 15219 12556 9237 6915 6225 6536 7298 8433 9497 9725 9028 8017
$$ packed form
55581F2986l274k287j595j445j219j118j669k129j424k29r7q58r42n4N36K84p1
55564D5395j76m29o47j86N80P10N30J136K156K034O02o08q09p57q17l09P81J348
55546E0534J070J008J708K334K316K358K969L433L030K245J978K436L262L993
55532H4674M093L414K714K887L623L775L034K156J640J305J109J225J263O07n37
55517A16982j507k419l877n570o521o571o367o065n450n093n889p386q145p747
55503C8375p008o233m853k924j450r11p68n82l93K2R43J772J608P13J02j38o48
55486A7627j193r66k86j82l80L17J623J828N68n23m09N4j6k63l58p25j247r57
55468A4512K29J033P57J59k76j195k663l319k322o90L11P62J135J064K28o97j011
$$ plain form
55451 8017 7052 6070 5209 4620 3825 2275 496 -287 271 1309 1998 2361 2783 3448 4293 5048 5427 5752 6966
55432 6966 9410 12011 13441 13683 13677 13848 13942 13966 14264 14803 15300 15916 16943 17931 17991 16916 15335 13933 13173
55413 13173 13444 14637 15761 15815 14895 13792 12875 12163 12096 13196 15132 16945 18098 18581 18348 17483 16551
55396 16551 15944 15224 14013 13034 13176 13970 14195 13694 13273 13086 12507 11602 11288 11838 12473 12698 12889 13302 13578
55377 13578 13562 13594 13630 13087 11960 11159 11270 11716 11614 10858 9945 9283 8997 8995 9017 8960 9131 9768 10443 10513 10011
55356 10011 9469 9072 8767 9034 10525 12856 14598 14703 13361 11443 9806 9058 9219 9538 9310 8846 8982
55339 8982 9771 10501 10823 10971 10973 10667 10492 11184 12557 13611 14042 14605 15718 16728 16928 16396 15462 14194
55321 14194 12898 12280 12528 12842 12356 11111 9823 9148 9371 10292 11241 11705 12000 12754 13805 14358 14235 14055
$$ packed form
55451H017r65r82q61n89p95j550D96b87B71J038O89L63M22O65Q45P55L79L25J214
55432F966K444K601J430K42oJ71R4K4K98N39M97O16J027R88O0j075j581j402p60
55413A3173K71J193J124N4r20j103r17p12o7J100J936J813J153M83k33q65r32
55396A6551o07p20j211r79J42P94K25n01m21j87n79r05l14N50O35K25J91M13K76
55377A3578j6L2L6n43j127q01J11M46j02p56r13o62k86kK2n7J71O37O75P0n02
55356A0011n42l97l05K67J491K331J742J05j342j918j637p48J61L19k28m64J36
55339H982P89P30L22J48Kl06j75O92J373J054M31N63J113J010K00n32r34j268
55321A4194j296o18K48L14m86j245j288o75K23R21R49M64K95P54J051N53j23j80
$$ plain form
55303 14055 14040 13662 12785 12230 12650 13610 14326 14683 14971 15224 15369 15618 16160 16724 16872 16479 15690 14632 13433
55284 13433 12328 11556 11261 11423 11754 11865 11849 12393 13874 15669 16879 17363 17434 16945 15545 13573 11769
55267 11769 10267 8793 7667 7579 8445 9566 10828 12598 14398 15029 14273 13322 13111 13302 13293 13178 13267 13598
55249 13598 14328 15682 17113 17561 16957 16518 17064 18015 18541 18673 18668 18299 17431 16527 15872 15206 14671 15091 16578
55230 16578 17811 17664 16773 16528 17229 18200 19110 20098 21019 21592 22054 22825 23703 24089 23820 23215 22533 21952 21748
55211 21748 21987 22332 22587 22966 23375 23002 21344 19173 17765 17519 17969 18728 19618 20225 20184 19843 19938 20638 21448
55192 21448 21963 22237 22484 22813 23107 22892 21659 19747 18502 18984 20686 22020 21899 20458 18567 17169
55176 17169 16877 17600 18598 19232 19616 20251 21272 22277 22613 21622 19016 15461 12384 10772 10376 10368 10314 10142
$$ packed form
55303A4055j5l78q77n55M20R60P16L57K88K53J45K49N42N64J48l93p89j058j199
55284A3433j105p72k95J62L31J11j6N44J481J795J210M84P1m89j400j972j804
55267A1769j502j474j126q8Q66J121J262J770J800O31p56r51k11J91rj15Q9L31
55249A3598P30J354J431M48o04m39N46R51N26J32nl69q68r04o55o66n35M20J487
55230A6578J233j47q91k45P01R71R10R88R21N73M62P71Q78L86k69o05o82n81k04
55211B1748K39L45K55L79M09l73j658k171j408k46M50P59Q90O07m1l41R5P00Q10
55192B1448N15K74K47L29K94k15j233j912j245M82J702J334j21j441j891j398
55176A7169k92P23R98O34L84O35J021J005L36r91k606l555l077j612l96qn4j72
$$ plain form
55158 10142 9683 8866 8042 7547 7214 6828 6732 7401 8647 9811 10568 11074 11490 11798 11935 11747 11093 10399 10691
55139 10691 12569 15372 17845 19392 20223 20740 21368 22647 24690 26713 27774 27904 27904 28222 28781 29816 31970
55122 31970 35235 38487 40463 40873 40285 39262 37944 36280 34393 32685 31611 31279 31337 31347 31227 31259 31723
55105 31723 32570 33340 33479 32948 32534 33212 35082 37266 38903 39838 40234 40112 39588 39117 39024 39159 39387 40075
55087 40075 41579 43527 45087 45826 45972 45980 46138 46457 46736 46869 47127 47834 48746 49294 49522 50100 51168 51920
55069 51920 51810 51381 51287 51282 50960 50771 51298 52028 51940 51036 50161 49540 48679 47676 47380 47961 48422 48028 47322 47134
55049 47134 47330 47217 46587 45715 44707 43591 42819 42981 43960 44916 45259 45251 45464 45965 46322 46270 46028 45886 45759
55030 45759 45362 44727 44333 44679 45806 47158 47829 47178 45531 44174 44247 45623 47171 48094 48589 49179 49956
$$ packed form
55158A0142m59q17q24m95l33l86r6O69J246J164P57N06M16L08J37j88o54o94K92
55139A0691J878K803K473J547Q31N17O28J279K043K023J061J30%L18N59J035K154
55122C1970L265L252J976M10n88j023j318j664j887j708j074l32N8J0j20L2M64
55105C1723Q47P70J39n31m14O78J870K184J637R35L96j22n24m71r3J35K28O88
55087D0075J504J948J560P39J46QJ58L19K79J33K58P07R12N48K28N78J068P52
55069E1920j10m29r4nl22j89N27P30q8r04q75o21q61j003k96N81M61l94p06j88
55049D7134J96j13o30q72j008j116p72J62R79R56L43qK13N01L57n2k42j42j27
55030D5759l97o35l94L46J127J352O71o51j647j357P3J376J548R23M95N90P77
$$ plain form
55013 49956 50739 51511 52268 52752 52704 52323 52156 52551 53311 53879 53854 53402 53045 52894 52366 50969 49095 47500 46250
54994 46250 44918 43702 43438 44394 45807 46869 47442 47656 47636 47854 48891 50434 51379 51382 51424 52292 53339 53517
54976 53517 52873 52226 51960 51949 52165 52554 52757 52653 52809 53722 55051 56208 57229 58420 59651 60725 61959
54959 61959 63715 65895 68507 72095 76782 81660 86121 91153 98092 106704 115794 125331 136475 149570
54945 149570 163538 177318 190566 202621 212082 217990 220514 220003 216134 208551 197773 185034 171582
54932 171582 158288 145534 133319 121809 111677 103506 97066 91778 87624 84828 82821 80493 77549
54919 77549 74776 72852 71702 71175 71484 72619 74047 75441 77263 80296 84969 91222 98655 106699 115102
54904 115102 124294 134912 146928 159587 172034 183549 193385 200919 205773 207273 204224 196129 184445
$$ packed form
55013D9956P83P72P57M84m8l81j67L95P60N68k5m52l57j51n28j397j874j595j250
54994D6250j332j216k64R56J413J062N73K14k0K18J037J543R45LM2Q68J047J78
54976E3517o44o47k66j1K16L89K03j04J56R13J329J157J021J191J231J074J234
54959F1959J756K180K612L588M687M878M461N032O939Q612R090R537J1144J3095
54945A49570J3968J3780J3248J2055R461N908K524n11l869p583j0778j2739j3452
54932A71582j3294j2754j2215j1510j0132q171o440n288m154k796k007k328k944
54919G7549k773j924j150n27L09J135J428J394J822L033M673O253P433Q044Q403
54904A15102R192J0618J2016J2659J2447J1515R836P534M854J500l049q095j1684
$$ plain form
54891 184445 171698 159399 147590 136170 125496 115620 106158 97267 89795 84095 79495 75260 71345
54878 71345 67926 65025 62880 61840 61492 60689 58874 56735 55194 54423 54181 54355 54745 54948 54859 54730 54472
54861 54472 53619 52263 51183 50644 49848 48165 46117 44542 43448 42429 41662 41700 42578 43786 44925 45802
54845 45802 46096 45472 43991 42102 40320 38998 38195 37654 37211 37207 38056 39404 40359 40660 40942 41669 42525 43201
54827 43201 43987 45130 46227 46857 47274 47964 48935 49888 50665 51169 51264 51188 51589 52729 54088 55148 56077 57222
54809 57222 58428 59386 60273 61575 63598 66451 70083 73969 77393 80472 84409 90200 97572 105731 114612
54794 114612 124729 136218 148722 161980 175873 189968 203516 215725 225770 232845 236611 237241
54782 237241 234764 228906 220036 209584 198843 187867 176339 165075 155635 148548 142813 137298 131978
$$ packed form
54891A84445j2747j2299j1809j1420j0674r876r462q891p472n700m600m235l915
54878G1345l419k901k145j040l48q03j815k139j541p71k42J74L90K03q9j29k58
54861E4472q53j356j080n39p96j683k048j575j094j019p67L8Q78J208J139Q77
54845D5802K94o24j481j889j782j322q03n41m43mQ49J348R55L01K82P27Q56O76
54827D3201P86J143J097O30M17O90R71R53P77N04R5p6M01J140J359J060R29J145
54809E7222J206R58Q87J302K023K853L632L886L424L079L937N791P372Q159Q881
54794A14612J0117J1489J2504J3258J3893J4095J3548J2209J0045P075L766O30
54782B37241k477n858q870j0452j0741j0976j1528j1264r440p087n735n515n320
$$ plain form
54769 131978 127693 125185 124545 125219 126476 128095 130495 134081 138771 144473 151580 160448 170646 181272
54755 181272 191938 202966 214885 228155 243114 259510 276156 291645 305373 317393 327393
54744 327393 334428 337663 336804 331760 322502 309493 293845 276766 259059 241200 223641 206892 191529
54731 191529 178145 166985 157565 148860 140118 131462 123608 117030 111425 106140 101118 97169 95025 94289
54717 94289 93811 92984 92111 91488 90880 90249 90188 91002 91872 91648 90259 88720 87888 87730 87754 87642 87397 87219 87305
54698 87305 87679 88267 89140 90345 91439 91720 91182 90680 90795 91031 90638 89680 88687 87680 86369 85071 84606
54681 84606 85267 86509 87727 88882 90285 92139 94361 96650 98855 101402 104997 109604 114157 117794 120959
54666 120959 124660 128961 132985 136241 139224 142600 146459 150449 154178 157454 160574 164345 169394 175503
$$ packed form
54769A31978m285k508o40O74J257J619K400L586M690N702P107Q868J0198J0626
54755A81272J0666J1028J1919J3270J4959J6396J6646J5489J3728J2020J0000
54744C27393P035L235q59n044r258j3009j5648j7079j7707j7859j7559j6749j5363
54731A91529j3384j1160r420q705q742q656p854o578n605n285n022l949k144p36
54717I4289m78q27q73o23o08o31o1Q14Q70k24j389j539q32j58K4j12k45j78Q6
54698H7305L74N88Q73J205J094K81n38n02J15K36l93r58r93j007j311j298m65
54681H4606O61J242J218J155J403J854K222K289K205K547L595M607M553L637L165
54666A20959L701M301M024L256K983L376L859L990L729L276L120L771N049O109
$$ plain form
54652 175503 182089 189184 197399 206956 217396 228357 240120 253231 267984 284293 301625 318921
54640 318921 334906 348574 359156 365766 367564 364331 356489 344554 328949 310405 290158 269576
54628 269576 249765 231465 215006 200347 187355 176000 166118 157231 149019 141798 136137 132052 129001
54615 129001 126578 124840 123978 123987 124596 125326 125770 126071 126802 128107 129271 129577 129143 128446 127527 126310 125239
54598 125239 124639 123756 121415 117575 113309 109284 105264 101168 97573 94835 92592 90510 88768 87395 85828
54583 85828 83613 80998 78492 76295 74427 72888 71430 69724 68013 66953 66553 66010 65018 64457 65157 66591
54567 66591 67533 67587 67328 67235 67257 67303 67491 67866 68280 68573 68652 68545 68641 69578 71471 73512 74833 75664 77100 79758
54547 79758 83098 86134 88440 90351 92534 95495 99234 103262 107104 110908 115425 121312 128533 136490
$$ packed form
54652A75503O586P095Q215R557J0440J0961J1763J3111J4753J6309J7332J7296
54640C18921J5985J3668J0582O610J798l233p842j1935j5605j8544k0247k0582
54628B69576j9811j8300j6459j4659j2992j1355r882q887q212p221n661m085l051
54615A29001k423j738q62RO09P30M44L01P31J305J164L06m34o97r19j217j071
54598A25239o00q83k341l840m266m025m020m096l595k738k243k082j742j373j567
54583H5828k215k615k506k197j868j539j458j706j711j060m00n43r92n61P00J434
54567F6591R42N4k59r3K2M6J88L75M14K93P9j07R6R37J893K041J321Q31J436K658
54547G9758L340L036K306J911K183K961L739M028L842L804M517N887P221P957
$$ plain form
54533 136490 144642 152851 161113 169048 175876 180968 184263 185949 185807 183227 177939 170495 161948 153211
54519 153211 144839 137108 130063 123589 117602 112197 107515 103565 100182 97106 94019 90684 87179 83948
54505 83948 81518 80061 79261 78615 77958 77651 78092 79075 79907 80279 80638 81432 82365 82890 83183 83969 85358 86555
54487 86555 86979 87129 87901 89391 90870 91827 92557 93609 94977 96049 96295 95760 94819 93683 92404 91266
54471 91266 90731 90825 90967 90667 90138 89919 90162 90661 91255 91687 91343 89831 87852 86830 87407 88737 89470 89084
54453 89084 88079 87237 86967 87079 86974 86219 85063 84213 83976 83835 83055 81524 79867 78782 78429 78429 78340 77995
54435 77995 77322 76066 74102 72012 70835 70948 71609 71968 72036 72161 72027 71039 69533 68802 69746 72040 74671
54418 74671 76785 78009 78532 78977 79758 80517 80649 80269 80149 80736 81854 83274 84914 86487 87774 89309
$$ packed form
54533A36490Q152Q209Q262P935O828N092L295J686j42k580n288p444q547q737
54519A53211q372p731p045o474n987n405m682l950l383l076l087l335l505l231
54505H3948k430j457q00o46o57l07M41R83Q32L72L59P94R33N25K93P86J389J197
54487H6555M24J50P72J490J479R57P30J052J368J072K46n35r41j136j279j138
54471I1266n35R4J42l00n29k19K43M99N94M32l44j512j979j022N77J330P33l86
54453H9084j005q42k70J12j05p55j156q50k37j41p80j531j657j085l53%q9l45
54435G7995o73j256j964k090j177J13O61L59O8J25j34r88j506p31R44K294K631
54418G4671K114J224N23M45P81P59J32l80j20N87J118J420J640J573J287J535
$$ plain form
54402 89309 91942 95540 98963 101670 104483 108281 112724 116863 120330 123282 125733 127720 129750 132334
54388 132334 135174 137338 138168 137671 136215 134225 132010 129594 126774 123480 119893 116207 112655 109794 108118
54373 108118 107215 105959 103810 101246 98645 95623 92138 89362 88505 89211 90118 90648 91255 92207 93201 94223
54357 94223 95725 97654 99145 99627 99605 99955 100908 102185 103733 105763 108168 110385 112008 113377 115344 118404
54341 118404 122132 125606 128349 130673 133076 135621 138013 139979 141363 142086 142247 142061 141422 139733 136538
54326 136538 132164 127476 123079 119061 115411 112278 109710 107386 104815 101833 98812 96201 93851 91065
54312 91065 87568 84099 81558 79752 77708 75181 72988 71639 70546 69136 67930 67665 67869 67283 65541
54297 65541 63655 62771 63089 64039 64934 65244 64610 62873 60119 56809 53902 52440 52654 53710 54617 55107 55378
$$ packed form
54402H9309K633L598L423K707K813L798M443M139L467K952K451J987K030K584
54388A32334K840K164Q30m97j456j990k215k416k820l294l587l686l552k861j676
54373A08118r03j256k149k564k601l022l485k776q57P06R07N30O07R52R94J022
54357I4223J502J929J491M82k2L50R53J277J548K030K405K217J623J369J967L060
54341A18404L728L474K743K324K403K545K392J966J384P23J61j86o39j689l195
54326A36538m374m688m397m018l650l133k568k324k571k982l021k611k350k786
54312I1065l497l469k541j806k044k527k193j349j093j410j206k65K04n86j742
54297F5541j886q84L18R50Q95L10o34j737k754l310k907j462K14J056R07M90K71
$$ plain form
54280 55378 55444 55287 55289 55822 56574 56878 56657 56471 56691 57167 57665 58142 58567 58909 59318 59926 60586 61206 62181 63923
54260 63923 65989 67334 67559 67387 67715 68643 69612 70187 70433 70673 70969 70827 69685 67923 67020 68142 70711
54243 70711 72919 73585 72960 71833 70645 69661 69307 69933 71470 73521 75469 76545 76342 75347 74468 73862 72810
54226 72810 70955 69039 67979 67738 67576 67111 66574 66190 65812 65212 64457 63893 63846 64284 64824 65232 65835 67140
54208 67140 68967 70429 70883 70564 70070 69603 69012 68252 67405 66496 65601 64936 64463 63663 62114 60221 58903
54191 58903 58570 58761 58846 58711 58543 58322 57854 57244 57031 57699 59133 60577 61145 60372 58451 56176 54675 54833
54173 54833 56564 58692 59904 59989 59875 60296 60807 60460 59248 58262 58335 59014 59234 58672 58022 58060 58923 60293
54155 60293 61744 62709 62661 61813 61328 62219 64094 65505 65593 64900 64497 64807 65537 66260 66624 66343 65385 64116
$$ packed form
54280E5378O6j57KN33P52L04k21j86K20M76M98M77M25L42M09O08O60O20R75J742
54260F3923K066J345K25j72L28R28R69N75K46K40K96j42j142j762r03J122K569
54243G0711K208O66o25j127j188r84l54O26J537K051J948J076k03r95q79o06j052
54226G2810j855j916j060k41j62m65n37l84l78o00p55n64m7M38N40M08O03J305
54208F7140J827J462M54l19m94m67n91p60q47r09q95o65m73q00j549j893j318
54191E8903l33J91Q5j35j68k21m68o10k13O68J434J444N68p73j921k275j501J58
54173E4833J731K128J212Q5j14M21N11l47j212r86P3O79K20n62o50L8Q63J370
54155F0293J451R65m8q48m85Q91J875J411Q8o93m03L10P30P23L64k81r58j269
$$ plain form
54137 64116 62972 62076 61342 60713 60083 59198 57988 56894 56577 57265 58530 59568 59633 58485 56639 54972 53867
54120 53867 52937 51806 50795 50451 50668 50783 50457 49979 49699 49611 49573 49645 50042 50893 52059 53132 53688 53700 53585
54101 53585 53736 54131 54532 54818 54941 54833 54617 54617 54844 54760 53920 52647 51718 51581 52207 53417 54897 56111 56680
54082 56680 56720 56465 55796 54685 53810 54043 55380 56909 57848 58091 57897 57653 57935 59077 60592 61593 61929
54065 61929 62336 63348 64654 65675 66201 66211 65626 64626 63859 63955 65042 66852 69074 71436 73699 75744
54049 75744 77533 79082 80666 82811 85629 88304 89862 90471 91408 93721 97418 101920 106590 110713 113771
54034 113771 116099 118758 122464 127121 132500 138680 145449 151985 157601 162299 166230 169221 171411 173768
54020 173768 177183 181216 184380 185677 185507 185198 185930 187947 190456 192324 193027 192844 192129 190824 188809 186307
$$ packed form
54137F4116j144q96p34o29o30q85j210j094l17O88J265J038O5j148j846j667j105
54120E3867r30j131j011l44K17J15l26m78k80q8l8P2L97Q51J166J073N56J2j15
54101E3585J51L95M01K86J23j08k16%K27q4q40j273r29j37O26J210J480J214N69
54082E6680M0k55o69j111q75K33J337J529R39K43j94k44K82J142J515J001L36
54065F1929M07J012J306J021N26J0n85j000p67R6J087J810K222K362K263K045
54049G5744J789J549J584K145K818K675J558O09R37K313L697M502M670M123L058
54034A13771K328K659L706M657N379O180O769O536N616M698L931K991K190K357
54020A73768L415M033L164J297j70l09P32K017K509J868P03j83p15j305k015k502
$$ plain form
54004 186307 183619 180788 177758 174527 170984 167006 162997 159856 158002 156813 155345 153265 150776 148071
53990 148071 145302 142760 140672 139035 137895 137366 137083 136185 134358 132410 131280 130855 130316 129261 127862
53975 127862 126299 124762 123718 123470 123611 123595 123611 124161 124915 124934 124014 122921 122110 121066 119284 117216 115710
53958 115710 115030 114903 115194 116006 117288 118769 120214 121468 122341 122752 123000 123682 125211 127496 130197 133279
53942 133279 137190 142344 148440 154552 159964 164728 169237 173444 176770 178704 179306 179119 178686 178120 177133
53927 177133 175572 173853 172592 171894 171404 171118 171572 173040 175137 177602 180912 185545 191065 196589 201879
53912 201879 207280 212819 218132 223254 228696 234659 240808 247008 253652 260949 268345 274921 280059 283508
53898 283508 285192 285302 284335 282795 280864 278410 275174 271027 266291 261753 258023 254831 251286 246863 241787
$$ packed form
54004A86307k688k831l030l231l543l978m009l141j854j189j468k080k489k705
53990A48071k769k542k088j637j140n29k83q98j827j948j130m25n39j055j399
53975A27862j563j537j044k48J41j6J6N50P54J9r20j093q11j044j782k068j506
53958A15710o80j27K91Q12J282J481J445J254Q73M11K48O82J529K285K701L082
53942A33279L911N154O096O112N412M764M509M207L326J934O02j87m33n66r87
53927A77133j561j719j261o98m90k86M54J468K097K465L310M633N520N524N290
53912B01879N401N539N313N122N442N963O149O200O644P297P396O576N138L449
53898B83508J684J10r67j540j931k454l236m147m736m538l730l192l545m423n076
$$ plain form
53883 241787 236446 230830 224728 218118 211152 204051 197181 190985 185621 180788 176052 171264 166614 162470
53869 162470 159104 156377 153681 150452 146753 143106 139808 136766 133944 131482 129258 126834 124132 121699
53855 121699 119992 118736 117341 115689 114124 112871 111858 110962 110022 108729 106892 104909 103602 103461 104189
53840 104189 104984 105104 104228 102576 100768 99317 98174 96939 95635 94946 95435 96718 97847 98464 99121 100286
53824 100286 101476 101869 101471 101115 101288 101600 101638 101747 102443 103424 103857 103571 103392 104162 105896 108038 110128 111938
53806 111938 113346 114516 116058 118594 122087 125823 129131 132004 134969 138566 143072 148598 155155 162511
53792 162511 170172 177622 184522 190603 195541 199214 202007 204554 207075 209210 210582 211292 211742 212216 212761
53777 212761 213236 213280 212443 210587 208059 205349 202695 200155 197741 195278 192376 188884 185215 181995 179532
$$ packed form
53883B41787n341n616o102o610o966p101o870o196n364m833m736m788m650m144
53869A62470l366k727k696l229l699l647l298l042k822k462k224k424k702k433
53855A21699j707j256j395j652j565j253j013q96r40j293j837j983j307j41P28
53840A04189P95J20q76j652j808j451j143j235j304o89M89J283J129O17O57J165
53824A00286J190L93l98l56J73L12L8J09O96R81M33k86j79P70J734K142K090J810
53806A11938J408J170J542K536L493L736L308K873K965L597M506N526O557P356
53792A62511P661P450O900O081M938L673K793K547K521K135J372P10M50M74N45
53777B12761M75M4q37j856k528k710k654k540k414k463k902l492l669l220k463
$$ plain form
53762 179532 177821 176773 176115 175271 173785 171787 169765 168014 166600 165599 164928 164051 162329 159682 156557
53747 156557 153348 150287 147766 146185 145346 144460 142938 140882 138707 136648 134805 133340 132510 132574 133644
53732 133644 135348 136755 137021 136131 134711 133272 132100 131685 132553 134536 136827 138978 141296 144040 146924
53717 146924 149767 152989 156828 160492 162843 163812 164571 166203 168653 171099 173114 175249 178448 182908 187664
53702 187664 191433 193796 195297 196570 197882 199511 201901 205101 208574 211938 215500 219635 223954 227634
53688 227634 230343 232456 234505 236851 239701 243020 246466 249729 252860 256034 259216 262375 265775 269571
53674 269571 273374 276696 279713 282979 286462 289525 291880 293927 295855 297067 296941 295796 294599 293894 293365
53659 293365 292438 291010 289560 288662 288369 288032 286891 284940 283024 281972 281791 281814 281426 280391 278733 276670
$$ packed form
53762A79532j711j048o58q44j486j998k022j751j414j001o71q77j722k647l125
53747A56557l209l061k521j581q39q86j522k056k175k059j843j465q30O4J070
53732A33644J704J407K66q90j420j439j172m15Q68J983K291K151K318K744K884
53717A46924K843L222L839L664K351R69P59J632K450K446K015K135L199M460M756
53702A87664L769K363J501J273J312J629K390L200L473L364L562M135M319L680
53688B27634K709K113K049K346K850L319L446L263L131L174L182L159L400L796
53674B69571L803L322L017L266L483L063K355K047J928J212j26j145j197p05n29
53659B93365r27j428j450q98k93l37j141j951j916j052j81K3l88j035j658k063
$$ plain form
53643 276670 274646 273036 271745 270299 268460 266480 264687 263103 261727 260916 261077 262004 262944 263417 263664 264147
53627 264147 264971 266118 267980 271116 275457 280054 283835 286417 288180 289782 291713 294133 296957 300117
53613 300117 303816 308376 313796 319570 325106 330232 335277 340742 346929 353744 360793 367794 374917 382548
53599 382548 390628 398521 405683 412324 419143 426548 434364 442265 450181 458218 466387 474499 482257 489385
53585 489385 495824 501895 508190 515083 522273 528904 534269 538415 541992 545487 548797 551601 553879 555799
53571 555799 557222 557742 557322 556576 556197 556308 556459 556129 555007 552927 549824 545871 541612 537886 535409 534201
53555 534201 533382 531852 529267 526182 523141 519989 516320 512287 508521 505355 502607 500107 497994 496284
53541 496284 494638 492922 491717 491741 492752 493562 493433 493110 494052 496725 500170 503306 506165 509510 513702 518497
$$ packed form
53643B76670k024j610j291j446j839j980j793j584j376q11J61R27R40M73K47M83
53627B64147Q24J147J862L136M341M597L781K582J763J602J931K420K824L160
53613C00117L699M560N420N774N536N126N045N465O187O815P049P001P123P631
53599C82548Q080P893P162O641O819P405P816P901P916Q037Q169Q112P758P128
53585D89385O439O071O295O893P190O631N365M146L577L495L310K804K278J920
53571E55799J423N20m20p46l79J11J51l30j122k080l103l953m259l726k477j208
53555E34201q19j530k585l085l041l152l669m033l766l166k748k500k113j710
53541D96284j646j716j205K4J011Q10j29l23R42K673L445L136K859L345M192M795
$$ plain form
53525 518497 523815 530040 537384 545460 553789 562447 571892 582381 593873 606319 619760 634131 649242
53512 649242 664989 681420 698635 716766 736013 756588 778583 802044 827163 854239 883330
53501 883330 913955 945263 976674 1008372 1041043 1075053 1110097 1145842 1182597 1220876 1260360
53490 1260360 1299875 1338550 1376634 1414997 1454282 1494691 1536080 1577893 1619472 1660890 1703171
53479 1703171 1747187 1792673 1838782 1885143 1931595 1977128 2020111 2059695 2096204 2130016 2160938
53468 2160938 2189080 2215456 2241029 2265695 2288978 2311305 2333786 2356818 2379683 2401594 2422503
53457 2422503 2442659 2461770 2478793 2492281 2500982 2504541 2503760 2499762 2492729 2481789 2466285 2446693
53445 2446693 2424055 2398943 2371382 2341391 2309076 2274393 2237358 2198405 2158036 2116192 2072504
$$ packed form
53525E18497N318O225P344Q076Q329Q658R445J0489J1492J2446J3441J4371J5111
53512F49242J5747J6431J7215J8131J9247K0575K1995K3461K5119K7076K9091
53501H83330L0625L1308L1411L1698L2671L4010L5044L5745L6755L8279L9484
53490A260360L9515L8675L8084L8363L9285M0409M1389M1813M1579M1418M2281
53479A703171M4016M5486M6109M6361M6452M5533M2983L9584L6509L3812L0922
53468B160938K8142K6376K5573K4666K3283K2327K2481K3032K2865K1911K0909
53457B422503K0156J9111J7023J3488Q701L559p81l998p033j0940j5504j9592
53445B446693k2638k5112k7561k9991l2315l4683l7035l8953m0369m1844m3688
$$ plain form
53434 2072504 2027240 1981455 1936058 1891184 1846692 1802760 1759680 1717485 1676254 1636505 1598863
53423 1598863 1563503 1530289 1499307 1470854 1445013 1421646 1400827 1382966 1368522 1357798 1350932
53412 1350932 1347774 1347856 1350785 1356665 1365880 1378634 1394922 1414767 1438014 1464026 1492104 1522119 1554280
53399 1554280 1588406 1624039 1661243 1700546 1742010 1785141 1829961 1877365 1928048 1981898 2038987
53388 2038987 2100268 2166397 2236469 2309019 2384031 2462960 2546873 2635515 2728170 2824341 2923307
53377 2923307 3023946 3125594 3228456 3332651 3437408 3541721 3645227 3747765 3848450
53368 3848450 3945931 4039415 4128740 4213499 4292856 4366502 4435264 4500456 4562917 4622845 4680071
53357 4680071 4734040 4783684 4827741 4865216 4895407 4917654 4931324 4935868 4930446 4913480 4882973 4837420
$$ packed form
53434B072504m5264m5785m5397m4874m4492m3932m3080m2195m1231l9749l7642
53423A598863l5360l3214l0982k8453k5841k3367k0819j7861j4444j0724o866
53412A350932l158Q2K929N880R215J2754J6288J9845K3247K6012K8078L0015L2161
53399A554280L4126L5633L7204L9303M1464M3131M4820M7404N0683N3850N7089
53388B038987O1281O6129P0072P2550P5012P8929Q3913Q8642R2655R6171R8966
53377B923307J00639J01648J02862J04195J04757J04313J03506J02538J00685
53368C848450R7481R3484Q9325Q4759P9357P3646O8762O5192O2461N9928N7226
53357D680071N3969M9644M4057L7475L0191K2247J3670M544n422j6966l0507m5553
$$ plain form
53345 4837420 4776349 4700255 4610753 4510988 4405141 4296765 4187621 4078308 3969544 3862134
53335 3862134 3756023 3650390 3544979 3440663 3338329 3237733 3137967 3038690 2940405 2843731
53325 2843731 2748939 2656268 2566302 2479899 2397877 2320749 2248597 2181261 2118774 2061514 2009712
53314 2009712 1962862 1919881 1879888 1842681 1808431 1777142 1748535 1722427 1699016 1678697 1661541
53303 1661541 1647113 1634885 1624715 1616725 1610814 1606557 1603589 1601748 1600735 1600035 1599535 1600027 1602791 1608582
53289 1608582 1617169 1627845 1640341 1655289 1673873 1696944 1724472 1755884 1790829 1829349 1871306
53278 1871306 1915949 1962166 2008978 2055740 2102135 2148203 2194210 2240399 2286857 2333466 2379707
53267 2379707 2424624 2467464 2508350 2547905 2586313 2623322 2659139 2694347 2728533 2759820 2786367
$$ packed form
53345D837420o1071p6094q9502r9765j05847j08376j09144j09313j08764j07410
53335C862134j06111j05633j05411j04316j02334j00596r9766r9277r8285r6674
53325B843731r4792r2671q9966q6403q2022p7128p2152o7336o2487n7260n1802
53314B009712m6850m2981l9993l7207l4250l1289k8607k6108k3411k0319j7156
53303A661541j4428j2228j0170p990n911m257k968j841j013p00n00M92K764N791
53289A608582Q587J0676J2496J4948J8584K3071K7528L1412L4945L8520M1957
53278A871306M4643M6217M6812M6762M6395M6068M6007M6189M6458M6609M6241
53267B379707M4917M2840M0886L9555L8408L7009L5817L5208L4186L1287K6547
$$ plain form
53256 2786367 2807754 2824277 2835607 2841067 2840668 2834779 2822914 2803907 2777351 2744017 2704795 2660092
53244 2660092 2610476 2557107 2501146 2443276 2384024 2323915 2263060 2201275 2139037 2077827 2019042
53233 2019042 1962917 1908864 1856418 1805376 1755317 1705553 1655564 1605179 1554429 1503454 1452480
53222 1452480 1401697 1351256 1301406 1252461 1204623 1158190 1114033 1073471 1037334 1005362 976713
53211 976713 950720 926900 904629 883329 862850 843193 823901 804135 783452 762215 741183
53200 741183 720971 701916 684150 667516 651578 636007 620964 606933 594065 581811 569350
53189 569350 556337 543023 529660 516086 502040 487598 472977 458154 443163 428688 415826
53178 415826 404935 395120 385157 374753 364607 355390 347030 339021 331150 323711 317120 311442 306338
$$ packed form
53256B786367K1387J6523J1330N460l99n889j1865j9007k6556l3334l9222m4703
53244B660092m9616n3369n5961n7870n9252o0109o0855o1785o2238o1210n8785
53233B019042n6125n4053n2446n1042n0059m9764m9989n0385n0750n0975n0974
53222A452480n0783n0441m9850m8945m7838m6433m4157m0562l6137l1972k8649
53211I76713k5993k3820k2271k1300k0479j9657j9292j9766k0683k1237k1032
53200G41183k0212j9055j7766j6634j5938j5571j5043j4031j2868j2254j2461
53189E69350j3013j3314j3363j3574j4046j4442j4621j4823j4991j4475j2862
53178D15826j0891r815r963j0404j0146r217q360q009p871p439o591n678n104
$$ plain form
53165 306338 301346 296135 290647 285255 280738 277730 275961 274271 271596 267762 263214 258394 253767 250059
53151 250059 247760 246440 245116 243357 241561 240058 238509 236397 233734 231071 229060 228056 227794 227440 226431
53136 226431 225279 225041 225869 226742 226817 226392 226142 226087 225885 225603 225484 225376 225131 225346 226838 229399 231782 233153
53118 233153 234049 235703 238826 243137 247747 251764 254812 257147 259207 261048 262416 263201 263470 263081 261747
53103 261747 259639 257450 255559 253448 250275 245875 240856 235780 230621 225122 219441 214203 209906 206406
53089 206406 203067 199408 195527 191855 188595 185563 182529 179556 176900 174723 173015 171723 170826 170195 169597
53074 169597 168907 168245 167751 167251 166355 164946 163391 162161 161365 160797 160293 159838 159355 158678 157867 157424 157996 159726
53056 159726 161858 163156 162925 161672 160555 160180 160208 160106 159837 159583 159349 159177 159253 159260 158157 155418 152156 150061
$$ packed form
53165C06338m992n211n488n392m517l008j769j690k675l834m548m820m627l708
53151B50059k299j320j324j759j796j503j549k112k663k663k011j004k62l54j009
53136B26431j152k38Q28Q73P5m25k50n5k02k82j19j08k45K15J492K561K383J371
53118B33153Q96J654L123M311M610M017L048K335K060J841J368P85K69l89j334
53103B61747k108k189j891k111l173m400n019n076n159n499n681n238m297l500
53089B06406l339l659l881l672l260l032l034k973k656k177j708j292q97o31n98
53074A69597o90o62m94n00q96j409j555j230p96n68n04m55m83o77q11m43N72J730
53056A59726K132J298k31j253j117l75K8j02k69k54k34j72P6Pj103k739l262k095
$$ plain form
53038 150061 149364 148830 147694 146422 145256 143367 140219 136824 134620 133723 133318 133209 133847 134992 135579 135126
53022 135126 134344 133994 133806 133014 131423 129560 127995 126908 126192 125731 125554 125727 126090 126217 125783 124899 123897
53005 123897 122961 122194 121837 122033 122465 122609 122353 122081 122146 122637 123590 124997 126497 127457 127630 127556 128069 129556
52987 129556 131729 133951 135672 136690 137164 137402 137673 138220 139287 140969 143120 145584 148377 151447 154422
52972 154422 156893 158893 160866 163237 166245 170012 174381 178744 182423 185306 187769 190043 191987 193484
52958 193484 194650 195525 195950 195898 195570 195055 194217 193026 191645 190083 188183 186119 184396 183099 181603 179473
52942 179473 177239 175748 175005 174275 173155 171921 170742 169252 167152 164759 162602 160827 159388 158538 158616
52927 158616 159471 160498 161279 161817 162203 162477 162921 163990 165626 167076 167774 168123 168858 169791 169837 168459 166517
$$ packed form
53038A50061o97n34j136j272j166j889l148l395k204q97m05j09O38J145N87m53
53022A35126p82l50j88p92j591j863j565j087p16m61j77J73L63J27m34q84j002
53005A23897r36p67l57J96M32J44k56k72O5M91R53J407J500R60J73p4N13J487
52987A29556K173K222J721J018M74K38K71N47J067J682K151K464K793L070K975
52972A54422K471K000J973K371L008L767M369M363L679K883K463K274J944J497
52958A93484J166Q75M25n2l28n15q38j191j381j562j900k064j723j297j496k130
52942A79473k234j491p43p30j120j234j179j490k100k393k157j775j439q50P8
52927A58616Q55J027P81N38L86K74M44J069J636J450O98L49P35R33M6j378j942
$$ plain form
52910 166517 165440 165797 166943 167828 167955 167740 168117 169593 171621 173071 173377 172948 172425 171986 171568 171327 171528
52893 171528 172245 173491 175286 177293 178771 179290 179240 179233 179388 179627 180278 181673 183323 184253 184156 183674 183541 183993
52875 183993 184999 186429 187885 188894 189346 189386 188972 188106 187428 187779 189064 190269 190825 191212 191948 192669 192766
52858 192766 192342 191986 192029 192477 193318 194463 195694 197084 199083 201790 204588 206989 209400 212487 216147 219754
52842 219754 223164 226732 230514 234130 237420 240488 243031 244276 243824 242099 239748 237031 233986 230840
52828 230840 227949 225551 223684 222052 219919 216488 211698 206416 201652 197726 194386 191436 188969 187068
52814 187068 185576 184188 182613 180639 178191 175398 172553 169923 167549 165256 162923 160742 159111 158219
52800 158219 157817 157468 156918 156112 154987 153484 151783 150294 149294 148602 147673 146081 143941 141870 140435 139625
$$ packed form
52910A66517j077L57J146Q85J27k15L77J476K028J450L06m29n23m39m18k41K01
52893A71528P17J246J795K007J478N19n0pJ55K39O51J395J650R30r7m82j33M52
52875A83993J006J430J456J009M52M0m14q66o78L51J285J205N56L87P36P21R7
52858A92766m24l56M3M48Q41J145J231J390J999K707K798K401K411L087L660L607
52842B19754L410L568L782L616L290L068K543J245m52j725k351k717l045l146
52828B30840k891k398j867j632k133l431m790n282m764l926l340k950k467j901
52814A87068j492j388j575j974k448k793k845k630k374k293k333k181j631q92
52800A58219m02l49n50q06j125j503j701j489j000o92r29j592k140k071j435q10
$$ plain form
52784 139625 138943 138020 136915 135869 135048 134652 134847 135283 135001 133317 130673 128208 126513 125243 123897 122435
52768 122435 121037 119743 118647 118046 118014 118050 117473 116082 114167 112034 109808 107662 105916 104745 103898 102800
52752 102800 100979 98485 95931 94012 92904 92166 91249 90041 88911 88337 88502 89074 89326 88710 87428 86263
52736 86263 85658 85206 84328 83238 82772 83279 84122 84475 84262 84099 84526 85545 86778 87757 88168 88084 87933 88002 87931
52717 87931 86996 85003 82708 81160 80782 81253 82133 83273 84642 85991 86913 87148 86826 86462 86730 88074 90448
52700 90448 93434 96608 99714 102524 104788 106435 107660 108716 109704 110697 111862 113242 114509 115206 115164 114480
52684 114480 113196 111320 109181 107331 105968 104754 103342 101800 100267 98551 96412 94011 91706 89551
52670 89551 87425 85495 84083 83071 81930 80404 78737 77197 75885 75131 75487 76922 78541 79503 79816
$$ packed form
52784A39625o82r23j105j046q21l96J95M36k82j684k644k465j695j270j346j462
52768A22435j398j294j096o01l2L6n77j391j915k133k226k146j746j171q47j098
52752A02800j821k494k554j919j108p38r17j208j130n74J65N72K52o16j282j165
52736H6263o05m52q78j090m66N07Q43L53k13j63M27J019J233R79M11q4j51O9p1
52717H7931r35j993k295j548l78M71Q80J140J369J349R22K35l22l64K68J344K374
52700I0448K986L174L106K810K264J647J225J056R88R93J165J380J267O97m2o84
52684A14480j284j876k139j850j363j214j412j542j533j716k139k401k305k155
52670H9551k126j930j412j012j141j526j667j540j312p54L56J435J619R62L13
$$ plain form
52655 79816 79748 78982 77080 74510 72376 71165 70484 70096 70423 71767 73670 75388 76543 77010 76689 75817 75088
52638 75088 75064 75720 76874 78623 80923 83100 84372 84692 84683 84955 85849 87500 89526 90874 90674 89277 87922
52621 87922 87363 87344 87307 87006 86381 85515 84931 85264 86332 87065 86780 86034 85784 86163 86655 87163 88142 89678 91045
52602 91045 91448 90917 90244 90190 90905 92049 93336 94861 96843 99160 101358 103124 104576 105986 107439 108907
52586 108907 110451 112130 113820 115313 116566 117718 118888 120105 121343 122508 123435 124092 124759 125827 127364
52571 127364 128969 130119 130662 130930 131376 132143 133068 134065 135344 137123 139277 141412 143166 144288 144652 144489
52555 144489 144390 144648 144749 144092 143198 143463 145368 147588 148383 147496 146098 145199 144777 144429 144128 144055 144127 144051 143715
52536 143715 143259 142837 142463 142114 141886 141925 142147 142157 141655 140901 140544 140915 141711 142471 143133 143950 145079 146463 147883
$$ packed form
52655G9816o8p66j902k570k134j211o81l88L27J344J903J718J155M67l21q72p29
52638G5088k4O56J154J749K300K177J272L20rK72Q94J651K026J348k00j397j355
52621H7922n59j9l7l01o25q66n84L33J068P33k85p46k50L79M92N08R79J536J367
52602I1045M03n31o73n4P15J144J287J525J982K317K198J766J452J410J453J468
52586A08907J544J679J690J493J253J152J170J217J238J165R27O57O67J068J537
52571A27364J605J150N43K68M46P67R25R97J279J779K154K135J754J122L64j63
52555A44489r9K58J01o57q94K65J905K220P95q87j398q99m22l48l01p3P2p6l36
52536A43715m56m22l74l49k28L9K22J0n02p54l57L71P96P60O62Q17J129J384J420
$$ plain form
52517 147883 148948 149295 149049 148863 149206 149848 150359 150826 151603 152568 153221 153537 154140 155448 157097 158434 159221
52500 159221 159625 159828 159911 159943 159932 159751 159308 158685 158047 157555 157431 157916 158938 159944 160297 159889 159262 159158 159974
52481 159974 161561 163400 164931 165844 166211 166494 167334 169097 171419 173314 173986 173610 173147 173351 174066 174557 174405
52464 174405 173932 173756 174006 174097 173375 171907 170450 169543 168883 167749 165868 163578 161294 159164 157269 155806
52448 155806 154919 154492 154288 154173 154192 154522 155334 156551 157702 158175 157699 156561 155366 154610 154437 154663 155029 155442
52430 155442 155873 156038 155513 154391 153514 153642 154576 155514 156157 156873 157814 158507 158543 158148 157783 157626 157752 158381 159512
52411 159512 160683 161550 162477 164090 166396 168780 170708 172048 172802 173057 173157 173500 174130 174818 175563 176611
52395 176611 178023 179643 181490 183763 186380 189009 191640 194633 197966 200979 203239 205180 207409 209699
$$ packed form
52517A47883J065L47k46j86L43O42N11M67P77R65O53L16O03J308J649J337P87
52500A59221M04K03Q3L2j1j81m43o23o38m92j24M85J022J006L53m08o27j04Q16
52481A59974J587J839J531R13L67K83Q40J763K322J895O72l76m63K04P15M91j52
52464A74405m73j76K50R1p22j468j457r07o60j134j881k290k284k130j895j463
52448A55806q87m27k04j15J9L30Q12J217J151M73m76j138j195p56j73K26L66M13
52430A55442M31J65n25j122q77J28R34R38O43P16R41O93L6l95l65j57J26O29J131
52411A59512J171Q67R27J613K306K384J928J340P54K55J00L43O30O88P45J048
52395A76611J412J620J847K273K617K629K631K993L333L013K260J941K229K290
$$ plain form
52381 209699 211245 211790 211946 212411 213317 214420 215508 216496 217393 218318 219357 220431 221533 223019 225300 228150
52365 228150 230721 232468 233772 235426 237727 240287 242554 244294 245649 246962 248503 250280 252164 254215
52351 254215 256677 259568 262515 265190 267694 270327 273095 275683 277784 279389 280848 282812 285786 289547
52337 289547 293187 295995 298055 299764 301101 301814 302050 302332 303049 304477 307092 311157 316019 320494 324141
52322 324141 327629 331680 336190 340646 344855 348927 353021 357555 363286 370663 379253 388172 396965 405769
52308 405769 414844 424231 433802 443408 453086 463256 474480 486830 499784 512925 526511 541079
52296 541079 556721 573067 589815 606962 624632 642849 661398 679831 697909 716080 735118
52285 735118 755063 774988 794079 812410 830304 847525 863720 879170 894265 908542 920995
$$ packed form
52381B09699J546N45J56M65R06J103J088R88Q97R25J039J074J102J486K281K850
52365B28150K571J747J304J654K301K560K267J740J355J313J541J777J884K051
52351B54215K462K891K947K675K504K633K768K588K101J605J459J964K974L761
52337B89547L640K808K060J709J337P13K36K82P17J428K615M065M862M475L647
52322C24141L488M051M510M456M209M072M094M534N731P377Q590Q919Q793Q804
52308D05769R075R387R571R606R678J0170J1224J2350J2954J3141J3586J4568
52296E41079J5642J6346J6748J7147J7670J8217J8549J8433J8078J8171J9038
52285G35118J9945J9925J9091J8331J7894J7221J6195J5450J5095J4277J2453
$$ plain form
52274 920995 931215 939533 946114 950751 953561 955169 956048 956226 955678 954378 951942 948003 943096 938407 934317
52259 934317 929902 924288 917885 911783 906413 901475 896899 893242 891069 890285 890191 890234 890840 893448 899342 908431
52243 908431 919489 931474 944067 956954 969522 981692 994347 1008295 1023297 1038626 1054099
52232 1054099 1069892 1085719 1100983 1115516 1129454 1142467 1153820 1163232 1171096 1177796 1183353 1187685
52220 1187685 1190683 1191975 1191238 1188844 1185618 1181737 1176451 1169153 1160249 1150599 1140584 1130122 1119234
52207 1119234 1108007 1096269 1083838 1071079 1058777 1047423 1036901 1026852 1017092 1007730 999208 992157
52195 992157 986835 982662 978704 974686 971125 968373 966033 963645 961457 959964 958990 957856 956392 955140
52181 955140 954454 953947 953049 951669 950033 948294 946612 945255 944204 942947 941072 938840 936706 934512 931671
$$ packed form
52274I20995J0220Q318O581M637K810J608Q79J78n48j300k436l939m907m689m090
52259I34317m415n614o403o102n370m938m576l657k173p84r4M3O06K608N894R089
52243I08431J1058J1985J2593J2887J2568J2170J2655J3948J5002J5329J5473
52232A054099J5793J5827J5264J4533J3938J3013J1353R412P864O700N557M332
52220A187685K998J292p37k394l226l881n286p298q904r650j0015j0462j0888
52207A119234j1227j1738j2431j2759j2302j1354j0522j0049r760r362q522p051
52195I92157n322m173l958m018l561k752k340k388k188j493r74j134j464j252
52181I55140o86n07q98j380j636j739j682j357j051j257j875k232k134k194k841
$$ plain form
52166 931671 928113 924493 921362 918580 915689 912488 908975 905059 900652 896005 891707 888239 885486 882665
52152 882665 878895 873977 868566 863425 858673 853954 849073 844134 839183 834211 829480 825374 821788 818043
52138 818043 813563 808390 802914 797446 792203 787453 783398 780014 777013 773923 770322 766278 762422 759233
52124 759233 756307 752771 748440 744124 740726 738465 737073 736320 736123 736484 737529 739345 741799 744811 748781
52109 748781 754198 760892 768214 776006 784716 794499 805003 816304 829185 844083 860575 878416 898154
52096 898154 920012 942976 966017 989564 1014608 1040810 1066761 1091944 1117172 1142957 1168574
52085 1168574 1193090 1216321 1238304 1258551 1276418 1291771 1304858 1315905 1325156 1332929 1339347 1344191
52073 1344191 1347199 1348200 1346998 1343597 1338628 1332966 1326713 1319079 1309594 1298911 1288033 1277217 1266185
$$ packed form
52166I31671l558l620l131k782k891l201l513l916m407m647m298l468k753k821
52152H82665l770m918n411n141m752m719m881m939m951m972m731m106l586l745
52138H18043m480n173n476n468n243m750m055l384l001l090l601m044l856l189
52124G59233k926l536m331m316l398k261j392p53j97L61J045J816K454L012L970
52109G48781N417O694P322P792Q710R783J0504J1301J2881J4898J6492J7841J9738
52096H98154K1858K2964K3041K3547K5044K6202K5951K5183K5228K5785K5617
52085A168574K4516K3231K1983K0247J7867J5353J3087J1047R251P773O418M844
52073A344191L008J001j202l401m969n662o253p634r485j0683j0878j0816j1032
$$ [...]
##END NTUPLES=NMR SPECTRUM
##END=
