
##TITLE=AC1209_CiNAH12061_5973471_h6vHsrSuuo
##JCAMPDX= 6.0         $$ Bruker NMR JCAMP-DX V2.0
##DATA TYPE= NMR SPECTRUM
##DATA CLASS= NTUPLES
##ORIGIN= BRUKER
##OWNER= Administrator
$$ 1.72 TOPSPIN		Version 2.1
$$ 2012-04-14 19:15:04.375 -0500  Administrator@TOPSPIN
$$ Compression mode = diff/dup
##.OBSERVE FREQUENCY= 400.13188235
##.OBSERVE NUCLEUS= ^1H
##.ACQUISITION MODE= SIMULTANEOUS (DQD)
##.ACQUISITION SCHEME= undefined
##.AVERAGES= 8
##.DIGITISER RES= 22
##SPECTROMETER/DATA SYSTEM= spect
##.PULSE SEQUENCE= zg30
##.SOLVENT NAME= COFFEE_meoh
##.SHIFT REFERENCE= INTERNAL, COFFEE_meoh, 1, 14.98061
##AUDIT TRAIL= $$ (NUMBER, WHEN, WHO, WHERE, PROCESS, VERSION, WHAT)
$$ ##TITLE= Audit trail, TOPSPIN		Version 2.1
$$ ##JCAMPDX= 5.01
$$ ##ORIGIN= Bruker BioSpin GmbH
$$ ##OWNER= Administrator
$$ $$ C:\Bruker\TOPSPIN/data/COFFEE/nmr/AC1209_CiNAH12061_5973471_h6vHsrSuuo/10/pdata/1/auditp.txt
$$ ##AUDIT TRAIL=  $$ (NUMBER, WHEN, WHO, WHERE, PROCESS, VERSION, WHAT)
(   1,<2012-04-14 19:14:55.046 -0500>,<Administrator>,<TOPSPIN>,<go>,<TOPSPIN 2.1>,
      <created by zg
	started at 2012-04-14 19:13:47.359 -0500,
	POWCHK enabled, PULCHK disabled,
       configuration hash MD5:
       1A 1E CE 29 27 FD 77 03 67 4E F0 E3 C4 B2 CB 90
       data hash MD5: 64K
       5A 95 7C B0 E4 A4 FE CD 48 84 9B 00 F5 27 CF 65>)
(   2,<2012-04-14 19:14:58.281 -0500>,<Administrator>,<TOPSPIN>,<proc1d>,<TOPSPIN 2.1>,
      <Start of raw data processing
       efp LB = 0 FT_mod = 6 PKNL = 1 PHC0 = 0 PHC1 = 0 SI = 32K 
       data hash MD5: 32K
       C0 C8 31 36 2B ED 96 97 58 5E B6 C9 8A 4A CD 19>)
(   3,<2012-04-14 19:14:58.921 -0500>,<Administrator>,<TOPSPIN>,<proc1d>,<TOPSPIN 2.1>,
      <pk PHC0 = 213.5632 PHC1 = 0 
       data hash MD5: 32K
       0D 14 E2 A8 56 90 67 5F B1 6F 07 DA 92 4C 9F 30>)
(   4,<2012-04-14 19:14:59.171 -0500>,<Administrator>,<TOPSPIN>,<proc1d>,<TOPSPIN 2.1>,
      <abs ABSG = 1 
       data hash MD5: 32K
       A9 F4 3C BC 2D A9 B8 8E B1 18 C4 1A C9 74 38 63>)
(   5,<2012-04-14 19:14:59.218 -0500>,<Administrator>,<TOPSPIN>,<proc1d>,<TOPSPIN 2.1>,
      <abs ABSG = 2 
       data hash MD5: 32K
       98 45 B1 C5 50 FB 3C 15 ED 64 AA 0A C8 83 3D 87>)
(   6,<2012-04-14 19:14:59.250 -0500>,<Administrator>,<TOPSPIN>,<proc1d>,<TOPSPIN 2.1>,
      <abs ABSG = 3 
       data hash MD5: 32K
       DC 99 F4 7F 5E D6 D6 D1 1F 7C B5 BF D1 84 ED 18>)
(   7,<2012-04-14 19:14:59.296 -0500>,<Administrator>,<TOPSPIN>,<proc1d>,<TOPSPIN 2.1>,
      <abs ABSG = 4 
       data hash MD5: 32K
       02 D3 9E B4 D5 FB 1B C8 C5 76 C1 01 4C 18 2F 94>)
(   8,<2012-04-14 19:14:59.343 -0500>,<Administrator>,<TOPSPIN>,<proc1d>,<TOPSPIN 2.1>,
      <abs ABSG = 5 
       data hash MD5: 32K
       09 54 DA 41 9B 4D 3D E6 AA C0 FC 4B CB F5 9A D5>)
$$ ##END=
$$ 
$$ $$ hash MD5
$$ $$ 49 9A 75 17 09 AD 6F C2 57 C1 DE 2A B0 EE F4 50
##$RELAX= 
##$RELAX= 
##$RELAX= 
##$RELAX= 
##$RELAX= 
##$RELAX= 
##$RELAX= 
$$ Bruker specific parameters
$$ --------------------------
$$ [...]
##$TP= (0..7)
150 150 150 150 150 150 150 150
##$TP07= 0
##$TPNAME0= <>
##$TPNAME1= <>
##$TPNAME2= <>
##$TPNAME3= <>
##$TPNAME4= <>
##$TPNAME5= <>
##$TPNAME6= <>
##$TPNAME7= <>
##$TPOAL= (0..7)
0.5 0.5 0.5 0.5 0.5 0.5 0.5 0.5
##$TPOFFS= (0..7)
0 0 0 0 0 0 0 0
##$TUNHIN= 0
##$TUNHOUT= 0
##$TUNXOUT= 0
##$USERA1= <user>
##$USERA2= <user>
##$USERA3= <user>
##$USERA4= <user>
##$USERA5= <user>
##$V9= 5
##$VALIST= <valist>
##$VCLIST= <CCCCCCCCCCCCCCC>
##$VD= 0
##$VDLIST= <DDDDDDDDDDDDDDD>
##$VPLIST= <PPPPPPPPPPPPPPP>
##$VTLIST= <TTTTTTTTTTTTTTT>
##$WBST= 1024
##$WBSW= 4
##$XGAIN= (0..3)
0 0 0 0
##$XL= 0
##$YL= 0
##$YMAX_a= 491539
##$YMIN_a= -594669
##$ZGOPTNS= <>
##$ZL1= 120
##$ZL2= 120
##$ZL3= 120
##$ZL4= 120
##$ABSF1= 14.98061
##$ABSF2= -5.57192
##$ABSG= 5
##$ABSL= 3
##$ALPHA= 0
##$AQORDER= 0
##$ASSFAC= 0
##$ASSFACI= 0
##$ASSFACX= 0
##$ASSWID= 0
##$AUNMP= <proc_prof1d_extract_pilot.lims>
##$AXLEFT= 0
##$AXNAME= <>
##$AXNUC= <1H>
##$AXRIGHT= 0
##$AXTYPE= 0
##$AXUNIT= <>
##$AZFE= 0.1
##$AZFW= 0.1
##$BCFW= 0
##$BC_mod= 0
##$BYTORDP= 0
##$COROFFS= 0
##$CY= 15
##$DATMOD= 1
##$DC= 0
##$DFILT= <>
##$DTYPP= 0
##$F1P= 0
##$F2P= 0
##$FCOR= 0.5
##$FTSIZE= 32768
##$FT_mod= 6
##$GAMMA= 0
##$GB= 0
##$INTBC= 1
##$INTSCL= 1
##$ISEN= 128
##$LB= 0
##$LEV0= 0
##$LPBIN= 0
##$MAXI= 10000
##$MC2= 0
##$MEAN= 0
##$ME_mod= 0
##$MI= 0
##$NCOEF= 0
##$NC_proc= -8
##$NLEV= 6
##$NOISF1= 0
##$NOISF2= 0
##$NSP= 0
##$NTH_PI= 0
##$NZP= 0
##$OFFSET= 14.98061
##$PC= 1
##$PHC0= 213.5632
##$PHC1= 0
##$PH_mod= 1
##$PKNL= yes
##$PPARMOD= 0
##$PPDIAG= 0
##$PPIPTYP= 0
##$PPMPNUM= 2147483647
##$PPRESOL= 1
##$PSCAL= 4
##$PSIGN= 0
##$PYNMP= <proc.py>
##$REVERSE= no
##$SF= 400.13
##$SI= 32768
##$SIGF1= 0
##$SIGF2= 0
##$SINO= 400
##$SIOLD= 32768
##$SPECTYP= <>
##$SREGLST= <1H.CDCl3>
##$SSB= 0
##$STSI= 32768
##$STSR= 0
##$SW_p= 8223.68421052632
##$SYMM= 0
##$S_DEV= 0
##$TDeff= 65536
##$TDoff= 0
##$TI= <>
##$TILT= no
##$TM1= 0
##$TM2= 0
##$TOPLEV= 0
##$USERP1= <user>
##$USERP2= <user>
##$USERP3= <user>
##$USERP4= <user>
##$USERP5= <user>
##$WDW= 1
##$XDIM= 32768
##$YMAX_p= 462488338
##$YMIN_p= -685511
##$CURPLOT= <Network HP LaserJet P1505>
##$CURPRIN= <$Network HP LaserJet P1505>
##$DFORMAT= <normdp>
##$LAYOUT= <+/1D_H.xwp>
##$LFORMAT= <normlp>
##$PFORMAT= <normpl>
##$SURQMSG= 1
$$ End of Bruker specific parameters
$$ ---------------------------------
##NTUPLES= NMR SPECTRUM
##VAR_NAME=  FREQUENCY,     SPECTRUM/REAL,   SPECTRUM/IMAG
##SYMBOL=    X,             R,               I
##VAR_TYPE=  INDEPENDENT,   DEPENDENT,       DEPENDENT
##VAR_FORM=  AFFN,          ASDF,            ASDF
##VAR_DIM=   32768,         32768,           32768
##UNITS=     HZ,            ARBITRARY UNITS, ARBITRARY UNITS
##FACTOR=    0.250966925370066, 1,           1
##FIRST=     8223.43324360095, -37782,       -57532
##LAST=      0,             -239591,         20194
##MIN=       0,             -685511,         0
##MAX=       8223.43324360095, 462488338,    0
$$ Real data points
##PAGE= N=1
##DATA TABLE= (X++(R..R)), XYDATA
$$ [...]
$$ plain form
19491 117443 -281880 -150115 -38063 -60355 -124117 64194 24751 -148418 -112001 56102 -268424
19479 -110073 110481 -188514 -140375 -130718 20746 -155598 -185977 -215262 156615 194600 -41369
19467 52263 -211358 -151140 -108027 -235957 -13711 38630 -357221 -232057 -35519 -79584 -48933
19456 -48933 50937 -156891 -105242 -60542 -210370 -235017 -129143 163605 -113086 141133
19445 -32016 34407 -177333 -541938 -292821 -22973 51283 192282 -237011 18670 -120331
19434 -112276 -8774 -117776 38825 173932 61745 -9407 -140049 -218894 -8173 -16131 -119617
19423 -119617 -353899 -56040 -458 188646 -273124 -62796 -55441 -341073 -84073 16519 -82231
19411 -423054 21378 -97723 221810 -29497 -114748 -85192 165177 -153674 -51338 37809 -134802
$$ packed form
19491A17443b81880J31765c8063k2292o3762F4194B4751a48418L6417E6102b68424
19479a10073A10481a88514M8139R657B0746a55598l0379k9285A56615L7985d1369
19467E2263b11358O0218M3113j27930a3711C8630c57221J25164c5519m4065L0651
19456d8933E0937a56891N1649M4700j49828k4647J05874A63605a13086A41133
19445c2016C4407a77333l64605K49117b2973E1283J40999b37011A8670a20331
19434a12276h774j09002C8825J35107F1745i407j30642p8845h173p958j03486
19423a19617k34282e6040d58A88646b73124f2796P355k85632h4073A6519h2231
19411d23054B1378i7723B21810b9497q5251K9556A65177a53674e1338C7809a34802
$$ plain form
19399 42836 -21134 -140874 -95920 66987 23629 45424 39529 -225024 -227911 -5712 -100432 -161239
19387 -161239 -300234 37284 5439 -252434 -104019 33633 -206505 -83111 -200069 -89392 175940
19375 -152258 -192677 -45917 -126533 162411 -82518 14517 -254732 46813 -538548 -217372 256566
19363 -176487 59150 -7439 -203082 -215439 -383836 51278 -21160 76877 -332472 41311 209762
19352 209762 -159879 -479460 -28260 208852 -97196 -65758 -171844 219340 230679 -433428
19341 -154035 -100853 223092 53432 218667 -111424 167229 3811 -167132 -476779 -121867
19330 2895 129820 155082 -155739 37319 344 102134 -414992 -35661 69003 128692 -105604
19318 -30931 -92772 -21895 -357479 -89649 137319 -11833 -350858 -76422 31529 -14550 135170
$$ packed form
19399D2836b1134j19740M4954F6987B3629K1795n895b25024k887e712r4720o0807
19387a61239j38995C7284E439b52434a04019C3633b06505h3111j16958h9392A75940
19375a52258m0419d5917q0616A62411h2518A4517b54732D6813e38548b17372B56566
19363a76487E9150g439j95643j2357j68397E1278b1160G6877c32472D1311J68451
19352B09762a59879l19581b8260B08852i7196L1438j06086B19340J1339d33428
19341a54035N3182B23092E3432J65235a11424A67229C811a67132l09647a21867
19330B895J26925K5262a55739C7319C44J01790d14992c5661F9003N9689a05604
19318c0931o1841b1895l35584h9649A37319a1833l39025g6422C1529a4550A35170
$$ plain form
19306 -210281 -154404 59642 -118077 -488360 86481 -111569 -834 -52621 98861 68750 267226
19295 267226 22525 147730 108165 24007 16460 -176013 80623 185073 -46396 -150040 205932
19283 -45088 18420 -154703 -92716 -357310 -255996 -154395 -206871 357293 -104648 -138861
19273 -138861 -69493 -373012 -45740 -72503 -80693 194142 -7479 -22471 -89719 -68021 186694
19261 213839 128233 -222864 131539 -38261 44236 150283 116935 -286559 224408 -51199
19250 -135642 280502 -188052 83353 -68399 222724 47429 300743 -53985 -36765 -276719
19240 -276719 -192830 -316349 -10147 -4242 151834 -374468 -347709 -101399 -120270 -136197 -14167
19228 56892 -187359 -51865 145452 -64814 -162089 -401837 149815 -3289 189651 69244 -242640
$$ packed form
19306b10281N5877E9642a18077l70283H6481a11569h34n1787I8861l0111J98476
19295B67226B2525J25205l9565B4007p547a76013H0623J04450d6396j03644B05932
19283d5088A8420a54703O1987k64594J01314J01601n2476C57293a04648l4213
19273a38861O9368l03519d5740k6763q190A94142g479j4992o7248K1698A86694
19261B13839q5606b22864A31539c8261D4236J06047l3348b86559B24408e1199
19250a35642B80502a88052H3353f8399B22724D7429K53314e3985J7220k39954
19240b76719Q3889j23519a0147d242A51834c74468K6759a01399j8871j5927a4167
19228E6892a87359e1865A45452f4814r7275k39748A49815c289A89651F9244b42640
$$ plain form
19216 355313 17056 91470 -281252 -22715 -54148 -116605 -173227 -136681 -368249 103645 16102
19204 74831 -151590 228452 -134356 177410 92048 -461528 -277548 -150224 -77737 -2645
19193 -217872 163102 -102433 -51324 -50828 51402 172106 10696 -84519 -55450 -70996 -50519
19182 -50519 15286 -105239 -231261 102454 131509 -389137 -273269 -270261 35308 13710 194432
19171 194432 -49030 -114486 95420 -514702 -263529 219878 -114966 269842 -180650 -98705
19161 -98705 -292253 -89177 -220966 -261527 -192867 -278729 204620 -264686 -124293 133198
19150 83959 -72928 236079 -223936 -357216 124204 86192 935 159337 7663 -355937 -353890
19139 -353890 -8464 -70481 -70659 -80969 -180987 -56622 -85570 279860 78170 -130937 -294987
$$ packed form
19216C55313A7056P4414b81252b2715l1433o2457n6622L6546k31568A03645A6102
19204G4831a51590B28452a34356A77410q5362d61528J83980J27324P2487b645
19193b17872A63102a02433N1109M96E1402J20704A0696h4519K9069j5546K0477
19182e0519A5286a05239j26022A02454K9055c89137J15868L008C5308A3710J80722
19171A94432d9030o5456I5420e14702K51173B19878a14966B69842a80650Q1945
19161i8705j93548h9177j31789m0561O8660q5862B04620b64686a24293A33198
19150H3959g2928B36079b23936j33280A24204l8012I35J58402G663c55937K047
19139c53890h464o2017j78j0310j00018e6622k8948B79860G8170a30937j64050
$$ plain form
19128 -294987 -134014 96632 -18462 142476 -14622 49202 87283 -219263 135969 102229 -17876
19116 -116795 -531292 -147807 56130 -296095 -250239 132217 -4986 108575 -118931 231535
19105 147570 -34583 -155815 -351029 212251 -273686 166678 -137118 154151 -333495 10303
19094 147148 -54441 186181 137058 -192244 216996 212533 51668 236471 212058 -234297 -45263
19082 -91255 46138 -178882 113451 -95708 -109851 -130988 -139361 83700 -112349 -110796 80217
19070 -159498 -166894 209907 -24212 5435 43821 97808 -67420 -54028 -401207 210280 -296053
19058 78680 -98783 169999 -178768 220080 -134834 200061 191225 54249 -205811 -39828 63409
19046 -86398 -106119 105173 -233044 106160 -132265 -6233 146691 -143445 268923 119689
$$ packed form
19128b94987a34014I6632a8462A42476a4622D9202L8081b19263A35969l3740a7876
19116a16795m14497a47807E6130b96095M5856A32217d986A08575a18931B31535
19105A47570c4583j21232j95214B12251b73686A66678a37118A54151c33495A0303
19094A47148e4441A86181m9123a92244B16996m463E1668J84803k4413b34297d5263
19082i1255D6138a78882A13451i5708j4143k1137q373H3700a12349J553H0217
19070a59498p396B09907b4212E435L8386N3987f7420J3392l47179B10280b96053
19058G8680i8783A69999a78768B20080a34834B00061q836E4249b05811c9828F3409
19046h6398j9721A05173b33044A06160a32265f233A46691a43445B68923A19689
$$ plain form
19035 -12629 396909 -90643 110980 97854 -279544 -202752 -122778 -104917 -209501 291400 -111722
19023 217112 86962 -183036 -161954 -218111 -14830 -95516 -151709 240900 92231 195841 -33408
19011 -226151 85388 3646 -24612 49873 -160553 182783 -240119 28725 112883 107454 -13090
18999 76533 120155 -37547 81416 234079 102058 -39983 23142 -41290 73668 139678 -256138
18987 -131450 31740 348151 238974 -298301 -12820 -225509 -227877 -187967 -15356 266071 95345
18975 -346820 -163787 -125877 -48018 -37224 -197038 -82070 243313 -223281 -59047 65697 84424
18964 84424 197856 -68843 471348 -154990 238204 91183 409958 407853 466892 74590 48603
18953 48603 73859 104207 -122666 49672 -329392 -100705 -92011 -337605 205604 394231 38553
$$ packed form
19035a2629C96909i0643A10980j3126b79544P6792P9974J7861j04584B91400a11722
19023B17112H6962a83036K1082n6157a4830q0686n6193B40900I2231J03610c3408
19011b26151H5388C646b4612D9873a60553A82783b40119B8725Q4158n429a3090
18999G6533M3622c7547H1416J52663A02058c9983B3142d1290G3668O6010b56138
18987a31450C1740L16411j09177b98301a2820k12689k368L9910a5356B66071I5345
18975c46820a63787L7910d8018J0794j59814h2070B43313b23281e9047F5697J8727
18964H4424J13432f8843D71348a54990B38204I1183L18775k105N9039G4590k5987
18953D8603K5256L0348a22666D9672c29392a00705Q694k45594B05604J88627C8553
$$ plain form
18941 -80222 -292212 -309293 -421044 -176505 -177384 -53491 -228184 -154369 -177109 -174000 -32502
18929 -9566 -17687 -199942 -59960 -137129 153021 -41902 188063 -134744 155735 -105286 269360
18917 12922 -25008 -105596 -57867 -107067 25030 -101613 -8495 -207819 81983 12647 52753
18906 52753 -120151 -85457 -233406 40231 90191 69315 -148410 -100322 248358 72501 363354
18895 363354 301271 136346 102111 310061 100922 -32343 120664 -2593 28070 -16886 -10413
18884 -10413 -173619 -48444 173034 -341392 -87855 -111808 -72739 -78800 -23245 69092 -38951
18872 22374 -63361 165638 -282431 -461928 113146 -6742 21589 -96496 8075 298265 -282529
18860 120525 -64171 44468 113672 -181808 -137883 -67847 -25728 -31190 -228866 -154968 -226891
$$ packed form
18941h0222k11990j7081j11751a76505q79e3491j74693P3815k2740L109c2502
18929i566q121j82255e9960p7169A53021d1902A88063a34744A55735a05286B69360
18917A2922b5008q0588M7729m9200B5030a01613h495j99324H1983A2647M0106
18906E2753a20151L4694j47949D0231M9960k0876a48410M8088B48358G2501K90853
18895C63354o2083A36346l4235K07950A00922c2343A20664b593B8070a6886O473
18884a0413j63206d8444A73034c41392h7855k3953L9069o061b3245F9092c8951
18872B2374f3361A65638b82431j79497A13146f742B1589i6496H075K90190b82529
18860A20525f4171D4468O9204a81808M3925f7847b5728n462j97676P3898p1923
$$ plain form
18849 -226891 201657 -9832 -44817 -112123 14200 -52203 121240 -2779 -242485 -91668 -59278
18838 -59278 207638 125157 -230042 -297181 -458232 -83948 150670 74655 33186 -59581 46288
18826 -285945 -189706 -39360 91419 227595 -141057 -74052 -163328 43893 233511 172591 -174059
18814 -16409 -39151 134825 -72793 -55305 -264733 -268289 -5427 -133641 -29678 -34853 208775
18802 -404562 -89132 356916 203201 93698 -45547 166446 192749 177835 387837 278751
18792 278751 -106079 -5586 -15219 -36254 14953 43025 67274 -163171 199957 -8120 -66528
18781 -66528 -258886 216377 -222627 169093 226466 -131233 89401 -161084 -20386 -22579 -199851
18770 -199851 -85950 130420 -105436 49373 -65472 -62752 -214810 32837 79041 -37732 -51752
$$ packed form
18849b26891B01657i832l4985o7306A4200e2203A21240b779k39706i1668L2390
18838e9278B07638q2481b30042o7139j61051h3948A50670G4655C3186e9581D6288
18826b85945R6239c9360I1419J36176a41057O7005q9276D3893J89618o0920a74059
18814a6409k2742A34825g2793J7488k09428l556e427j28214b9678n175B08775
18802d04562h9132C56916j53715I3698d5547A66446K6303j4914K10002j09086
18792B78751a06079e586r633k1035A4953K8072K4249a63171A99957h120n8408
18781f6528j92358B16377b22627A69093N7373a31233H9401a61084b0386k193j77272
18770a99851h5950A30420a05436D9373f5472K720j52058C2837M6204c7732j4020
$$ plain form
18759 -51752 70086 -65177 -209885 -71866 86318 -51549 56463 -272179 -310635 -132977 169792
18747 15239 -273262 -298756 -61163 -58746 -264222 149620 -44667 -68176 -85737 500 137534
18736 137534 -85026 -200874 -159930 183846 -295200 355974 -152687 -28637 -27076 -35031 144750
18724 23434 -192337 -277112 79545 7232 -12973 16482 -309388 -135725 174848 3396 78079
18713 78079 -394373 -91483 50172 -280559 70936 72516 -148690 15482 -119653 -67925 -48768
18702 -48768 -243167 -183177 -423041 -34277 -216887 -225363 -84370 -376837 -206537 75776 -136850
18690 29297 -201963 -86589 -111610 -88456 -4044 -266053 46720 -413678 196384 185453 -79971
18678 -273026 -185838 -267020 166161 176283 -8874 -234516 -295303 381 105643 3317 105777
$$ packed form
18759e1752G0086f5177j44708g1866H6318e1549E6463b72179l8456a32977A69792
18747A5239b73262k5494f1163K417k05476A49620d4667k3509j7561E00J37034
18736A37534h5026j15848M0944A83846b95200C55974a52687b8637J561p955A44750
18724B3434a92337q4775G9545G232a2973A6482c09388a35725A74848C396P4683
18713G8079c94373i1483E0172b80559G0936J580a48690A5482a19653N1728J9157
18702d8768j94399N9990k39864c4277j82610q476h4370k92467J70300G5776a36850
18690B9297b01963h6589k5021K3154d044k62009D6720d13678A96384j0931g9971
18678b73026Q7188q1182A66161J0122h874k25642o0787C81J05262C317J02460
$$ plain form
18667 105777 88979 -238904 122010 91065 83770 -1575 -96382 58078 58558 22174 393172 130810
18654 -109362 -49638 147001 -218638 20586 -76637 -157803 58809 -61384 90446 87503 -143276
18642 163244 -169145 -147412 -408111 -42408 -510399 -165530 -174798 -39488 374512 211726
18632 211726 -62947 -210871 -208266 -317389 -57918 -139248 -477750 -194350 -124383 -123351 -94080
18621 -94080 195507 29029 -224840 -570566 198495 -226958 137693 -218118 108682 -116368
18610 -89997 -258338 -135465 -207414 53851 -61503 238579 -121506 -403754 236509 -31141
18599 -170602 -14992 -35638 62405 -251527 -116863 -355826 46390 -260057 95589 -14482 242974
18587 -185087 -170292 -108159 -78329 -228299 54768 -57208 -174278 -184700 -64043 -85039 -14611
$$ packed form
18667A05777j6798b38904A22010l0945p295a575r4807E8078M80B2174L70998A30810
18654a09362d9638A47001b18638B0586g6637q1166E8809f1384I0446k943a43276
18642A63244a69145K1733k60699d2408m67991a65530r268c9488C74512j62786
18632B11726f2947j47924K605j09123e7918q1330l38502a94350O9967J032K9271
18621i4080A95507B9029b24840l45726A98495b26958A37693b18118A08682a16368
18610h9997j68341J22873p1949E3851f1503B38579a21506k82248B36509c1141
18599a70602a4992k0646F2405b51527a16863k38963D6390b60057I5589a4482B42974
18587a85087J4795O2133K9830j49970E4768e7208j17070j0422f4043k0996a4611
$$ plain form
18575 106685 -64181 -51281 -40146 -9792 -44083 -97504 -283563 -135784 951 61988 -181896
18563 145810 -93173 -48805 -243456 71670 -150271 28880 -199097 -116871 67152 -373090 122141
18551 -122193 -1177 231601 -47201 -85790 -256809 -102919 30922 97892 -182473 -178101 -121601
18540 -121601 -39547 92358 -199957 -145000 -15608 1432 -106595 409051 -342509 -144454 -94134
18529 -94134 17758 261618 -511614 224192 170701 -185195 244589 36327 292552 180410
18519 180410 -185281 -67118 -144125 8553 -245441 58798 -106472 -134483 149539 -3275 -186558
18508 -186558 -74612 301147 -85067 -284121 -83894 -101325 -110080 -109804 -108783 -51049 251341 -146993
18495 14507 66642 -30417 26477 93577 65273 24317 -261886 -268750 77976 -311313 -279673
$$ packed form
18575A06685f4181J2900J1135i792l4291n3421j86059a35784I51O1037a81896
18563A45810i3173M4368j94651G1670a50271B8880a99097Q2226F7152c73090A22141
18551a22193a177B31601d7201l8589j71019a02919C0922O6970a82473M372N6500
18540a21601c9547I2358a99957N4957a5608A432a06595D09051c42509a44454N0320
18529i4134A7758K43860e11614B24192n3491a85195B44589C6327K56225j12142
18519A80410a85281f7118p7007H553b45441E8798a06472k8011A49539c275j83283
18508a86558g4612C01147h5067j99054h3894j7431q755K76J021e1049B51341a46993
18495A4507N2135c0417B6477O7100k8304B4317b61886o864G7976c11313L1640
$$ plain form
18484 -279673 -322139 -245320 68655 138642 -148775 23603 2676 148272 154304 183464 48092
18472 -31838 61944 287547 -22969 289849 -215820 1646 -63545 -25149 -61071 40616 36649
18461 36649 15221 -344945 -8352 -84464 -206790 128804 117296 -173433 -213672 249127 -228384
18449 -150843 101003 82101 -68395 -52763 -139323 16035 -107485 -274530 -108051 310212
18438 52620 155011 -511191 -250828 -71694 -109653 45862 53844 -214855 119899 191417 73287
18426 40711 -132272 -82695 117530 72102 -290803 31369 -347207 -88436 -168271 93534 380690
18415 380690 43245 -134338 127211 -65395 -326459 -142948 -30347 -329439 -135670 -281542
18405 -281542 -195851 -36237 -80379 -26530 28515 202025 -1466 -171328 31727 -16338 104163
$$ packed form
18484b79673m2466P6819F8655O9987a48775B3603B676J45596O032K9160D8092
18472c1838F1944K25603b2969B89849b15820A646f3545b5149l5922D0616l967
18461C6649A5221c44945h352p6112j22326A28804j1508a73433m0239B49127b28384
18449a50843A01003j8902f8395J5632q6560A6035a07485j67045a08051C10212
18438E2620J02391e11191b50828g1694l7959D5862P982b14855A19899P1518G3287
18426D0711a32272M9577A17530m5428b90803C1369c47207h8436p9835I3534K87156
18415C80690D3245a34338A27211f5395k61064a42948c0347k99092a35670j45872
18405b81542Q5691c6237m4142b6530B8515J73510a466j69862C1727a6338A04163
$$ plain form
18393 -43509 103835 280487 -201472 179329 -284128 -240700 -27262 -228735 -124279 327031
18382 83468 134402 74436 10666 -244610 -175253 -317119 -186620 90840 188594 17051 166014
18371 166014 -167801 -166116 51773 -41708 112654 22009 -150587 4272 -188962 -210334 72037
18359 -267782 -251787 273826 -356817 158731 -359642 42407 24748 78718 -13531 -102197 -215169
18348 -215169 -198897 65457 96790 235521 -291262 -222726 78804 -24526 -329412 -13299 -274796
18337 -274796 -15163 -42839 38702 94148 -240096 -28483 258136 -254527 127874 75603 57720
18326 57720 -249919 95898 -17448 -203728 189759 340670 81564 -111669 -94982 13019 -76369
18314 72121 -149211 -242219 -280673 -134623 -233539 -168858 -73637 -23638 240860 -117898 -263128
$$ packed form
18393d3509A03835J76652b01472A79329b84128M3428b7262k01473J04456C27031
18382H3468N0934n9966A0666b44610O9357j41866J30499I0840R7754A7051J48963
18371A66014a67801J685E1773d1708A12654B2009a50587D272a88962k1372G2037
18359b67782J5995B73826c56817A58731c59642D2407j7659N3970a3531q8666j12972
18348b15169J6272F5457L1333J38731b91262O8536G8804b4526l04886a3299k61497
18337b74796a5163k7676C8702N5446b40096b8483B58136b54527A27874n2271j7883
18326E7720b49919I5898a7448j86280A89759J50911H1564a11669J6687A3019g6369
18314G2121a49211r3008l8454a34623r8916O4681g3637b3638B40860a17898j45230
$$ plain form
18303 -263128 -299787 -384977 208999 -310557 -144386 51661 -408382 -191859 46019 30209
18293 30209 84372 127579 172713 -339504 257437 -100329 -103937 -170368 -128094 -150540 207043
18281 25836 -146953 -110420 -186479 14699 -218682 227636 227529 288321 103607 654226 376828
18270 376828 -35747 -309717 -108349 -51723 83230 -181733 348203 -190673 157483 68747
18259 -220201 -77189 249660 -147847 -81678 -105269 82377 12254 136122 186195 -271928 113357
18247 -42829 32828 147997 26162 181492 -313717 227213 -50618 224230 -300653 61345
18236 -221285 -102021 -56758 -78589 171361 34180 -47716 -74655 -4713 -82641 -75384 -64668
18225 -64668 239184 75912 41129 7635 -106921 -64644 -327496 -408361 -99402 106594 -70956
$$ packed form
18303b63128l6659q5190B08999c10557a44386E1661d08382a91859D6019j5810
18293C0209N4163M3207M5134c39504B57437a00329l608o6431M2274k2446B07043
18281B5836a46953L6533p6059A4699b18682B27636j07O0792A03607N50619k77398
18270C76828c5747k73970a08349e1723H3230a81733C48203a90673A57483F8747
18259b20201g7189B49660a47847O6169k3591H2377A2254J23868N0073b71928A13357
18247d2829C2828J15169B6162J55330c13717B27213e0618B24230c00653F1345
18236b21285a02021M5263k1831A71361C4180d7716k6939d713p7928P257J0716
18225f4668B39184G5912l4783G635a06921M2277k62852q0865i9402A06594g0956
$$ plain form
18213 -158066 127577 -157410 -403663 158174 62761 152279 -240954 -197878 -19301 257511
18202 108140 -357930 -253969 -17175 26353 -133908 -363206 -28141 -92869 -108112 162001
18191 99842 104959 -152023 -81262 2922 -132588 -345643 -265120 -152430 -67889 7012 127939
18180 127939 -143719 -10653 -125906 -58130 -137219 150543 -13769 245338 29416 108599 -14125
18168 89769 50687 -330816 -286694 14534 187741 -49797 -115203 -64145 61996 146218 91888
18157 91888 -70207 38381 -9290 121828 -139448 -103700 253149 -98807 -97095 55630 14969
18145 -130868 51967 -149919 14754 176502 -123662 3576 57921 -215082 31554 -109029 -228105
18134 -228105 -40071 -242126 9079 -17566 -16326 -281573 -34930 -121840 -257626 33340 86035
$$ packed form
18213a58066A27577a57410k46253A58174F2761Q9518b40954M3076a9301B57511
18202A08140c57930J03961a7175B6353a33908k29298b8141o4728j5243A62001
18191I9842N117a52023P0761B922a32588k13055Q0523J12690f7889G012J20927
18180A27939a43719a0653j15253e8130p9089A50543a3769B45338B9416P9183a4125
18168H9769l9082c30816M4122A4534J73207d9797o5406N1058F1996Q4222n4330
18157I1888g0207C8381i290A21828a39448L5748B53149i8807J712E5630A4969
18145a30868E1967a49919A4754J61748a23662C576N4345b15082C1554a09029j19076
18134b28105d0071k02055I079a7566J240k65247c4930q6910j35786C3340N2695
$$ plain form
18123 86035 98598 137650 24588 -136053 137543 -89459 34810 128512 -202096 -201283 -59904
18111 185558 -76212 90629 118150 -175599 -56181 127648 38892 -311014 58547 -4205 -58469
18100 -58469 87973 397774 -47733 7783 -20815 41337 -158160 240192 -33161 -259847 31514
18088 193116 -206857 309207 104245 66392 -196300 199070 -270053 65637 103185 146412
18078 146412 38337 -1806 248441 123396 -77141 314059 106153 -88659 -102410 -13410 235726
18066 -149160 -113640 -97078 -68159 -194468 -162747 18953 17294 -90388 -137136 -43369 -327 -110933
18054 -110933 -22947 -113868 258774 128014 187891 -91818 229779 -293811 -191238 105057
18043 -233828 77781 130641 25338 -58493 -111759 -365544 -41300 123299 -76886 -162440 43953
$$ packed form
18123H6035J2563L9052B4588a36053A37543h9459C4810R3702b02096Q13e9904
18111A85558g6212I0629K7521a75599e6181A27648C8892c11014E8547d205n4264
18100e8469H7973L09801d7733G783b0815D1337a58160B40192c3161k26686C1514
18088A93116b06857C09207A04245l7853a96300A99070b70053F5637L7548M3227
18078A46412C8337a806B48441A23396g7141C14059A06153h8659j3751a3410B35726
18066a49160L5520J6562K8919j26309L1721A8953j659i0388m6748d3369c27j10606
18054a10933b2947r0921B58774A28014N9877i1818B29779b93811J02573A05057
18043b33828G7781N2860B5338e8493n3266k53785d1300A23299g6886q5554D3953
$$ plain form
18031 330937 87975 145343 -128087 -98920 106800 -187036 -17487 -453644 -102998 57621
18020 -108904 42026 -81335 5910 -82697 -208705 236649 -28120 270353 -53409 65274 -195602
18008 81888 -167897 -30579 101688 32803 -206058 -100075 272755 -361505 -101218 -91973
17998 -91973 83187 5802 -135397 -139600 -205787 179832 -407553 -198823 334698 231419 -132982
17986 -202259 -23552 -52351 4850 350427 -142418 9911 -283418 -139772 84656 65056 90616
17975 90616 -231587 319791 281990 -72970 11505 134351 -151054 -107098 -108614 80494 -7075
17963 24140 -84227 -76325 74788 133468 -119103 -20338 -138015 253626 46023 117386 46119
17951 -167699 -3472 136852 36049 -62150 150360 -77437 -86602 101814 103517 -316010 -7911
$$ packed form
18031C30937H7975N7368a28087K9167A06800a87036a7487m36157a02998E7621
18020a08904D2026h1335E910h2697j26008B36649b8120B70353e3409F5274a95602
18008H1888a67897c0579A01688C2803b06058a00075B72755c61505a01218R245
17998i1973H3187E802a35397m203o6187A79832d07553a98823C34698j03279a32982
17986b02259b3552k8799D850L45577a42418I911b83418a39772H4656j9600K5560
17975I0616b31587C19791l7801g2970A1505J22846a51054M3956j516H0494g075
17963B4140h4227P902G4788N8680a19103b0338j17677B53626D6023P1363D6119
17951a67699c472A36852C6049f2150A50360g7437r165A01814J703c16010g911
$$ plain form
17939 240158 206207 60449 305754 -84205 323225 -114794 115016 -241190 128493 183220
17929 183220 -292474 47757 53913 59384 -169949 13763 102727 -301654 -45533 -137508 107144
17917 -23994 3545 104721 113812 244684 50820 -116585 -76057 -54876 -174627 -166799 138977
17905 194329 109685 71237 -79181 -75372 -79780 141207 84059 -170658 -475772 -36939 30211
17893 77159 379231 -85061 32926 -28314 -37250 -227832 -281142 -260607 236112 -119951 -218880
17882 -218880 128149 31814 99439 72891 541411 195182 76814 -236192 454333 -152631
17871 -33715 -11129 -154362 -86065 377559 70019 55684 300440 96640 21693 19411 91683
17860 91683 26184 -91411 23022 -261263 -197421 5156 -92396 101701 -175701 134035 -82123
$$ packed form
17939B40158l3951F0449K45305h4205C23225a14794A15016b41190A28493N4727
17929A83220b92474D7757O156N471a69949A3763Q8964c01654d5533r1975A07144
17917b3994C545J01176R091J30872E0820a16585M0528K1181j19751P828A38977
17905A94329q4644l8448g9181L809m408A41207n7148a70658l05114c6939C0211
17893G7159L02072h5061C2926b8314q936j90582n3310K0535B36112a19951r8929
17882b18880A28149C1814O7625k6548M68520A95182G6814b36192D54333a52631
17871c3715a1129j43233O8297C77559G0019j4335K44756I6640B1693k282P2272
17860I1683B6184i1411B3022b61263O3842E156i2396A01701a75701A34035h2123
$$ plain form
17848 606735 -253854 309737 15994 283378 262641 -210493 209632 -87590 -98242 -156911
17838 -156911 28284 83073 23560 -90842 78268 -30528 -113627 153929 159587 106384 156601
17827 156601 -139620 307920 183260 399705 134108 69079 65963 231227 42036 -136288
17816 -133811 245954 -55297 -333342 -3149 20374 10776 29811 -28230 26916 48413 -60619
17804 136988 91150 -247851 -174494 207498 15725 35201 351296 -75679 -240407 -71649 -226965
17793 -226965 -43487 70658 -190227 165695 188728 229281 -167925 -19294 -79606 14785 -66637
17781 91294 104596 2990 162055 -31461 -77290 -87111 -197890 -63685 -154952 -35187 316427
17769 158047 116350 254356 204438 4087 -14196 -54304 54378 -112780 158354 21100 65433
$$ packed form
17848F06735b53854C09737A5994K67384k0737b10493B09632h7590j0652n8669
17838a56911B8284N4789B3560i0842G8268c0528q3099A53929N658n3203N0217
17827A56601a39620C07920j24660K16445A34108o5029l116J65264D2036a36288
17816a33811B45954e5297k78045c149B0374r598J9035b8230B6916K1497f0619
17804A36988m5838b47851P3357B07498A5725J9476L16095g5679j64728g1649j55316
17793b26965d3487G0658a90227A65695K3033M0553a67925a9294o0312A4785f6637
17781I1294J3302B990J59065c1461m5829r821j10779f3685r1267c5187C16427
17769A58047m1697J38006m9918D087a4196m0108E4378a12780A58354B1100M4333
$$ plain form
17758 65433 13165 151672 36762 -60324 123511 81100 -116843 295665 -123198 34968 -334811
17746 172503 -179899 -304369 240669 -67099 -118470 196824 143995 -149705 80469 -140250
17735 37316 -53657 302506 93726 32776 222157 -344346 -108486 -55749 213064 -3788 69805
17723 -11055 -30500 333183 211505 218000 -119702 148143 407522 134791 141009 -388273 245355
17711 -77804 383417 -100762 383477 -195668 -150459 201066 198302 237453 -112281 82573 92443
17700 92443 243215 118798 255212 -280263 -23788 -230960 58037 194948 219374 60946
17689 284259 215928 11989 -7937 -136801 -6708 84694 36514 -34063 376398 -187848 -141100
17678 -141100 -6877 112023 -87581 -71712 9006 421773 -34009 15571 486795 325758 97129
$$ packed form
17758F5433A3165J38507C6762f0324A23511m2411a16843B95665a23198C4968c34811
17746A72503a79899j24470B40669f7099n1371A96824n2829a49705H0469a40250
17735C7316e3657C02506I3726C2776J89381c44346a08486N2737B13064c788F9805
17723a1055j9445C33183j21678O495a19702A48143K59379A34791O218c88273B45355
17711g7804C83417a00762C83477a95668M5209B01066k764L9151a12281H2573R870
17700I2443J50772A18798J36414b80263b3788k07172E8037J36911K4426F0946
17689B84259o8331A1989g937j28864f708H4694C6514c4063C76398a87848M6748
17678a41100f877A12023h7581J5869I006M12767c4009A5571M71224j61037I7129
$$ plain form
17666 205727 -152504 261850 212086 -153961 354385 365115 186699 38797 339275 146826
17655 110180 226771 -29356 219043 -80566 67750 71855 -141417 -214569 280342 75756 -105540
17643 -110175 41920 32855 188389 182845 135634 -212355 -52630 133306 226436 213778 -251273
17631 166118 -53206 204540 109314 -133257 -24006 259542 160542 79485 128423 -146591 3331
17619 280182 -45735 -15194 175104 124437 48682 190895 184861 453802 79260 112338 76804
17608 76804 283249 -176282 -126801 74825 218683 153793 -13367 79067 -138286 91316 -52728
17596 379100 28540 -85689 11363 152693 350091 521849 137252 77269 400367 122554
17585 81229 276857 268325 -29899 155571 13135 310525 166183 -417603 145324 -165976
$$ packed form
17666B05727a52504B61850m9764a53961C54385J0730j78416C8797L00478A46826
17655A10180J16591b9356B19043h0566F7750M105a41417p3152B80342G5756a05540
17643a10175D1920r065J55534n544m7211b12355e2630A33306R3130j2658b51273
17631A66118e3206B04540r5226a33257b4006B59542r9000G9485M8938a46591C331
17619B80182d5735a5194A75104n0667D8682J42213o034K68941G9260L3078l5534
17608G6804K06445a76282M9481G4825J43858o4890a3367G9067a38286I1316e2728
17596C79100B8540h5689A1363J41330J97398J71758A37252n9983L23098A22554
17585H1229J95628q532b9899A55571A3135K97390j44342d17603A45324a65976
$$ plain form
17574 55392 504452 322108 -16002 378743 228453 89089 140295 76456 92236 -190830 74377
17562 89384 262758 -200276 170794 124796 180588 249892 90072 237382 325348 -36629 -152565
17551 -152565 321949 425148 -217915 336801 85888 -278158 199450 113181 14394 14188 319722
17540 319722 193186 175583 -143553 104010 -14603 160253 -141823 365214 -28132 414472
17529 276570 263330 125390 296673 -239047 263356 151131 176749 90907 310851 53877
17518 133809 -172420 470322 378618 135395 293796 185818 841172 759875 841184 623895
17508 623895 1170033 843470 898337 276586 71244 249939 174080 403548 594646 696632
17498 696632 259598 622425 612432 930099 867362 986607 926884 797691 577638 275368
$$ packed form
17574E5392M49060j82344a6002C78743j50290H9089N1206o3839J5780a90830G4377
17562H9384J73374b00276A70794m5998N5792O9304I0072J47310Q7966c6629j15936
17551a52565C21949J03199b17915C36801H5888b78158A99450q6269A4394k06L05534
17540C19722j26536j7603a43553A04010a4603A60253a41823C65214b8132D14472
17529B76570j3240A25390J71283b39047B63356j12225K5618q5842K19944E3877
17518A33809a72420D70322r1704A35395J58401j07978O55354q1297Q1309k17289
17508F23895N46138l26563N4867B76586G1244J78695p5859K29468J91098J01986
17498F96632B59598L62827r993L17667o2737J19245n9723j29193k20053B75368
$$ plain form
17487 696975 455232 503610 532292 456809 257340 192406 -49345 423790 334051 370141 294044
17476 294044 181546 587401 302767 241387 481898 165041 176683 111040 134198 238092
17466 238092 19148 281593 268419 165393 184090 486440 338183 165641 92126 198059
17456 198059 161565 100155 136295 272699 60842 261114 44763 464741 -110704 39576 245245
17445 245245 363312 263304 261085 220770 100652 219098 108757 176894 904160 16474
17434 427328 292719 568580 379116 163797 251028 661278 82618 479772 394800 190457
17423 743652 249555 97671 157695 207391 578668 419804 265250 300044 232672 193213 322385
17412 322385 365631 39861 125246 420467 316172 -2855 208362 -164307 98426 369821 227929
$$ packed form
17487F96975k41743M8378K8682p5483j99469o4934d9345D23790q9739L6090p6097
17476B94044j12498M05855k84634o1380K40511A65041J1642o5643K3158J03894
17466B38092A9148K62445j3174j03026J8697L02350j48257A65641p3515J05933
17456A98059l6494o1410L6140J36404F0842K00272D4763M19978a10704C9576K05669
17445B45245J18067j00008k219m0315A00652J18446A08757O8137P27266A6474
17434D27328j34609K75861j89464A63797Q7231M10250H2618L97154q4972A90457
17423G43652B49555I7671O0024M9696L71277j58864j54554L4794o7372l9459J29172
17412C22385M3246C9861Q5385K95221j04295b855B08362a64307I8426K71395j41892
$$ plain form
17401 227929 -22215 328786 425377 83144 367198 49664 259148 556461 312772 -7187 254092
17389 -20677 -18006 84389 468591 63374 316562 188189 -57865 58233 107555 539111 -60295
17377 363105 154657 477493 329809 80811 505769 190121 57340 293795 462169 374364
17367 374364 -119931 154844 562447 127360 241441 395666 225986 407135 255216 34274
17356 -29491 83328 261483 257018 -63555 406224 15554 353962 547370 368432 -125490 164101
17344 361692 392511 -15156 -55890 295450 207459 127819 84410 332798 148399 202783 320064
17333 320064 169271 232342 159062 352265 192996 320770 452414 408347 660418 55909
17322 567146 137932 127965 181746 123312 31257 -95263 -28521 100435 245902 104965 44846
$$ packed form
17401B27929b2215C28786R6591H3144K84054D9664K09484K97313k43689g187B54092
17389b0677K671H4389L84202F3374K53188j28373e7865E8233M9322M31556f0295
17377C63105A54657L22836j47684H0811M24958A90121E7340K36455J68374q7805
17367C74364a19931A54844M07603A27360J14081J54225j69680J81149j51919C4274
17356b9491H3328J78155m465f3555D06224A5554L38408J93408j78938a25490A64101
17344C61692L0819a5156m0734B95450q7991p9640m3409K48388A48399N4384J17281
17333C20064j50793O3071p3280J93203j59269J27774J31644m4067K52071E5909
17322E67146A37932r967N3781n8434C1257i5263b8521A00435J45467A04965D4846
$$ plain form
17310 233839 254174 271986 223176 54314 164166 113928 232247 262245 220902 607975 -38768
17298 -159944 21136 312895 358296 197733 311555 316835 395332 441634 54843 -91347 240341
17286 281977 215227 541752 209725 -228610 315308 147717 300090 494706 -49832 527198
17275 142568 436972 128461 204655 136697 312409 481075 139259 287863 441549 291307
17265 291307 315230 384313 194233 221705 179081 190294 415904 443280 183936 366756 495222
17254 495222 590850 232792 186889 267132 137862 583938 458473 303925 539622 7965
17243 308949 14087 505324 573160 154827 144528 188811 192391 259967 112567 392880 210616
17232 210616 292554 331634 344831 401708 361286 648143 312748 239135 450668 503268 369261
$$ packed form
17310B33839K0335J7812m8810E4314J09852n0238J18319K9998m1343L87073c8768
17298a59944B1136K91759M5401j60563J13822N280P8497M6302E4843i1347B40341
17286B81977o6750L26525B09725b28610C15308A47717J52373J94616d9832E27198
17275A42568K94404A28461P6194o7958J75712J68666A39259J48604J53686j50242
17265B91307K3923O9083j90080K7472m2624J1213K25610K7376A83936J82820J28466
17254D95222R5628B32792m5903Q0243j29270M46076j25465j54548K35697G965
17243C08949A4087M91237O7836A54827j0299M4283L580O7576A12567K80313j82264
17232B10616Q1938L9080J3197N6877m0422K86857C12748p3613K11533N2600j34007
$$ plain form
17221 369261 162514 607484 300930 152239 287529 261024 472596 409112 241586 54561
17210 777646 314992 229553 265838 298518 510296 786981 711111 110657 258669 412047
17200 412047 149977 211935 207887 343240 375136 253540 234187 371244 337850 365449 616337
17189 616337 226031 342611 635432 223727 343601 460495 351709 276058 416576 462976
17179 462976 450485 523981 519364 393362 396184 156079 326667 414031 235216 413196 444302
17168 444302 384832 199476 268775 291004 75618 157242 603987 665662 255109 353081 657192
17157 657192 393903 485922 319812 177371 262458 467003 386006 369592 336566 473106
17147 473106 802394 428153 387805 349463 361981 306357 217697 845647 490068 598410
$$ packed form
17221C69261A62514M44970C00930j48691J35290k6505K11572o3484j67526E4561
17210G77646C14992q5439L6285L2680K11778K76685p5870A10657J48012J53378
17200D12047A49977O1958m048J35353L1896j21596j9353J37057l3394K7599K50888
17189F16337B26031J16580K92821B23727J19874J16894j08786p5651J40518M6400
17179D62976j2491P3496m617j26002K822A56079J70588Q7364j78815J77980L1106
17168D44302n9470j85356O9299K2229G5618Q1624M46745O1675B55109R7972L04111
17157F57192k63289R2019j66110j42441Q5087K04545q0997j6414l3026J36540
17147D73106L29288l74241m0348l8342J2518n5624q8660O27950l55579J08342
$$ plain form
17137 598410 525757 367220 642185 347780 367947 488845 175269 266787 647008 385953
17127 385953 386981 341889 625837 556546 148961 509777 175924 686916 110996 494661
17117 494661 632765 525828 649534 628551 640863 855344 819976 661080 614478 372607
17107 372607 630693 336054 601839 612657 452165 399721 356649 655931 926123 578402
17097 578402 671948 659715 496063 530450 824778 706425 558554 629984 802113 553790
17087 553790 417897 449800 885041 590547 684514 656276 655702 946863 563342 961546 817723
17076 817723 758464 785958 682989 768505 641962 578334 608631 741596 670513 652282 671644
17065 671644 442606 564602 941777 412502 673999 961362 763354 653445 604172 519661
$$ packed form
17137E98410p2653j58537K74965k94405K0167J20898A75269R1518L80221k61055
17127C85953J028m5092K83948o9291A48961L60816A75924N10992A10996L83665
17117D94661J38104j06937J23706k0983J2312K14481l5368j58896m6602k41871
17107C72607K58086k94639K65785J0818j60492n2444m3072K99282K70192l47721
17097E78402R3546j2233j63652L4387K94328j18353j47871P1430J72129k48323
17087E53790j35893L1903M35241k94494R3967k8238n74K91161l83521L98204j43823
17076H17723n9259K7494j02969Q5516j26543o3628L0297J32965p1083j8231J9362
17065F71644k29038J21996L77175D12502K61497K87363j98008j09909m9273q4511
$$ plain form
17055 519661 952470 740683 393681 687192 818936 486354 780401 716275 863654 789414
17045 789414 663663 447079 650680 711768 796170 738111 980553 875559 827222 854224
17035 854224 792559 748106 603776 747816 830107 704681 655698 793664 1103359 420394
17024 734531 894114 305229 746682 1024790 852001 876299 1301700 1072080 746746 759591
17014 759591 1213263 1021550 932253 1273903 858837 1069439 594714 1108763 721013 1122026
17004 1122026 951244 918248 984652 924124 1002383 711943 1263395 1024851 1218644 1054148
16994 1054148 1003384 1092951 1005440 906803 1117616 836910 1259177 964244 1046242 1284889
16984 1284889 927766 1023973 1253338 1377292 1069852 978552 986075 1033912 1457273 925891
$$ packed form
17055E19661M32809k11787l47002K93511J31744l32582K94047o4126J47379p4240
17045G89414j25751k16584K03601O1088Q4402n8059K42442j04994m8337K7002
17035H54224o1665m4453j44330J44040Q2291j25426m8983J37966L09695D20394
17024G34531J59583C05229M41453K78108j72789K4298M25401k29620l25334J2845
17014G59591M53672j91713q9297L41650m15066K10602m74725N14049l87750M01013
17004A122026j70782l2996O6404o0528P8259k90440N51452k38544J93793j64496
16994A054148n0764Q9567q7511r8637K10813k80706M22267k94933Q1998K38647
16984A284889l57123R6207K29365J23954l07440r1300P523M7837M23361n31382
$$ plain form
16974 925891 1242264 1119734 1252342 1055283 1120060 1056315 1241293 1153769 1439619 1349600
16964 1349600 1690340 1202730 1103013 1187674 1471224 1207560 1430616 1098639 1484805 1422178
16954 1422178 1627099 1599721 1345905 1332580 1584248 1443607 1032692 1446864 1549785 2013608
16944 2013608 1305664 1694841 1518138 1582026 1614088 1641664 1446282 1404046 1506078 1518201
16934 1518201 1550518 1210406 1500307 1735123 1926873 1747292 1851261 1971276 1809780 1957429
16924 1957429 1777268 1882921 1675249 1891832 1941245 1594378 1861358 1903899 1661451 2150266
16914 2150266 1845627 1773491 1836191 2018573 2172746 2218973 1978201 1582033 1872237 2215417
16904 2215417 2103136 2146366 2074323 2497422 1912705 2446424 2117245 2274824 2194542 2458955
$$ packed form
16974I25891L16373j22530J32608j97059O4777o3745J84978q7524K85850r0019
16964A349600L40740m87610r9717Q4661K83550k63664K23056l31977L86166o2627
16954A422178K04921k7378k53816j3325K51668j40641m10915M14172J02921M63823
16944B013608p07944L89177j76703O3888L2062K7576j95382m2236J02032J2123
16934A518201L2317l40112K89901K34816J91750j79581J03969J20015j61496J47649
16924A957429j80161J05653k07672K16583M9413l46867K66980M2541k42448M88815
16914B150266l04639p2136O2700J82382J54173M6227k40772l96168K90204L43180
16904B215417j12281M3230p2043M23099n84717N33719l29179J57579q0282K64413
$$ plain form
16894 2458955 2431976 2666998 2470438 2515078 2612554 2679174 2697454 2672137 2757701 2584751 2296573
16883 2296573 2581805 2859300 2711121 2649297 2721373 2745174 2780320 3009490 2975521 3059723
16873 3059723 2830637 3351094 3167123 3130421 3312130 3116836 2836180 3407595 3692456 3379430
16863 3379430 3559160 3410253 3409880 3633536 3498512 3905599 3936912 3420289 3712427 3866211
16853 3866211 3579896 4110878 4015985 4017413 4068396 4033403 4116582 4345616 4328051 4264268 4255889
16842 4255889 4597239 4576798 5109424 4806167 4875516 4633314 5200376 5019877 4884700 5493584
16832 5493584 5306480 5378604 5616999 5879449 5647094 5606910 5520758 6071677 6089991 5834250
16822 5834250 6123155 6330617 6972671 6605306 6306950 6941085 6542293 7117585 7249872
$$ packed form
16894B458955k6979K35022j96560M4640R7476O6620J8280k5317Q5564j72950k88178
16883B296573K85232K77495j48179o1824P2076K3801L5146K29170l3969Q4202
16873C059723k29086N20457j83971l6702J81709j95294k80656N71415K84861l13026
16863C379430J79730j48907l73K23656j35024M07087L1313n16623K92138J53784
16853C866211k86315N30982r4893J428N0983l4993Q3179K29034j7565o3783q379
16842D255889L41350k0441N32626l03257O9349k42202N67062j80499j35177O08884
16832E493584j87104P2124K38395K62450k32355m0184q6152N50919J8314k55741
16822E834250K88905K07462O42054l67365k98356O34135l98792N75292J32287
$$ plain form
16813 7249872 7367168 7385013 7676201 7729964 7700415 7870431 7997829 8354279 8404869 8515966
16803 8515966 8882778 8908889 9168743 9232293 9538408 9478391 9805645 9671261 10290317 10642104
16793 10642104 10520435 10842296 11175986 11430580 11705501 12320212 12142359 12941860 12706121
16784 12706121 13289046 13611654 13893115 13829814 14411430 14821507 15209591 15546935 16047469
16775 16047469 16215555 16577095 17005830 17786691 18255195 18660408 19149915 19723208 19983840
16766 19983840 21013855 21446205 22085950 22895642 23459021 24116569 25182950 26092079 26370922
16757 26370922 27252862 28359935 29420269 30092798 31292730 32112886 33699689 34631011 35926047
16748 35926047 37018008 38501934 39966179 40960989 42460649 44336235 45852625 47508563
$$ packed form
16813G249872J17296J7845K91188N3763k9549J70016J27398L56450N0590J11097
16803H515966L66812K6111K59854O3550L06115o0017L27254j34384O19056L51787
16793A0642104j21669L21861L33690K54594K74921O14711j77853P99501k35739
16784A2706121N82925L22608K81461o3301N81616M10077L88084L37344N00534
16775A6047469J68086L61540M28735P80861M68504M05213M89507N73293K60632
16766A9983840J030015M32350O39745Q09692N63379O57548J066381R09129K78843
16757B6370922Q81940J107073J060334O72529J199932Q20156J586803R31322J295036
16748C5926047J091961J483926J464245R94810J499660J875586J516390J655938
$$ plain form
16740 47508563 49422565 51172174 52964840 55141195 57128861 59106174 61593428 63730630
16732 63730630 66416194 68588386 71000430 73981544 76495171 79533513 82175970 84819463
16724 84819463 87495344 90265070 92982419 95902709 98013811 101183283 103389134 105791178
16716 105791178 107776939 110151664 111958087 113301897 114549312 115939066 116194960 117003315
16708 117003315 116806651 117136010 116517923 115734640 114892241 113211394 111534094 109646354 107932681
16699 107932681 105681454 103458654 100882526 97863700 95389375 92971522 90040817 86952573
16691 86952573 84263840 81116550 78577577 75964608 73364262 70751088 68147464 65614145
16683 65614145 63544326 60867791 58739529 56510927 54839400 52580547 50569353 48702127
$$ packed form
16740D7508563J914002J749609J792666K176355J987666J977313K487254K137202
16732F3730630K685564K172192K412044K981114K513627L038342K642457K643493
16724H4819463K675881K769726K717349K920290K111102L169472K205851K402044
16716A05791178J985761K374725J806423J343810J247415J389754K55894Q08355
16708A17003315j96664L29359o18087p83283q42399j680847j677300j887740j713673
16699A07932681k251227k222800k576128l018826k474325k417853k930705l088244
16691H6952573k688733l147290k538973k612969k600346k613174k603624k533319
16683F5614145k069819k676535k128262k228602j671527k258853k011194j867226
$$ plain form
16675 48702127 47161116 45313241 43735544 42302260 40540222 39133326 38210882 36534967
16667 36534967 34994450 33929651 32979072 31747107 30820951 29275812 28823168 27660314
16659 27660314 26972745 26242430 25410011 24699575 23657843 23047279 22325959 21490301 21443843
16650 21443843 20914541 19940758 19404528 18682884 18283102 17780409 17273202 17054846 16471288
16641 16471288 15929507 15934152 15573280 14656931 14313566 14073102 13898872 13565537 12762195 12603090
16631 12603090 12558090 12224047 12240604 11740612 11222068 11337634 11098563 10790806 10254630 10363083
16621 10363083 10351649 9828616 9466205 9345639 9305525 9105154 9153968 8894782 8417504 8618680
16611 8618680 8223684 7840124 8070854 7770339 7663877 7338932 7431410 7364564 7301385 7225395
$$ packed form
16675D8702127j541011j847875j577697j433284j762038j406896r22444j675915
16667C6534967j540517j064799r50579j231965r26156j545139m52644j162854
16659B7660314o87569p30315q32419p10436j041732o10564p21320q35658m6458
16650B1443843n29302r73783n36230p21644l99782n02693n07207k18356n83558
16641A6471288n41781M645l60872r16349l43365k40464j74230l33335q03342j59105
16631A2603090m5000l34043J6557m99992n18544J15566k39071l07757n36176J08453
16621A0363083j1434n23033l62411j20566m0114k00371M8814k59186m77278K01176
16611H618680l94996l83560K30730l00515j06462l24945R2478o6846o3179p5990
$$ plain form
16601 7225395 6815230 6633757 6613553 6374281 6454155 6399023 6289637 6001036 5915732 5607256
16591 5607256 5596803 5907369 5435463 5454204 5439936 5560975 5438821 5388582 5377732 5239185
16581 5239185 4733057 4887483 4629127 4877789 4633168 4414277 4580370 4915057 4389919
16572 4389919 4119107 4481820 4286349 4308570 4108731 3976185 3984929 4251112 3962344 3624101
16562 3624101 3550621 3670498 3900313 3794824 3665656 3395727 3177344 3536326 3502756 3202235
16552 3202235 3502819 3105928 3263802 3006929 3303596 3417387 2972464 2868374 2797107 3035017
16542 3035017 3078043 2756879 2891339 2817910 2700000 2764979 2594434 3179333 3023859 2455240
16532 2455240 2751533 2683009 2595818 2490892 2469991 2019818 2368625 2529200 2551535 2479691
$$ packed form
16601G225395m10165j81473k0204k39272P9874n5132j09386k88601q5304l08476
16591E607256j0453L10566m71906J8741j4268J21039j22154n0239j0850j38547
16581E239185n06128J54426k58356K48662k44621k18891J66093L34687n25138
16572D389919k70812L62713j95471K2221j99839j32546Q744K66183k88768l38243
16562C624101p3480J19877K29815j05489j29168k69929k18383L58982l3570l00521
16552C202235L00584l96891J57874k56873K96667J13791m44923j04090p1267K37910
16542C035017M3026l21164J34460p3429j17910O4979j70545N84899j55474n68619
16532B455240K96293o8524q7191j04926k0901m50173L48807J60575K2335p1844
$$ plain form
16522 2479691 2447609 2321458 2340569 2471023 2325605 2416912 2375903 2105542 2072915 2257534
16512 2257534 2328863 1944659 2276160 2247585 1893310 2060764 2099510 2138529 1872813 2136632
16502 2136632 2096797 1830690 2069549 1704994 1874128 1890002 1523780 1694728 1772476 2075822
16492 2075822 1830172 1800266 1825880 1722285 1665480 1855648 1678277 1663584 1855224 1912912
16482 1912912 1856862 1922824 1474791 1503970 1311200 1175007 1705215 1538969 1691390 1462352
16472 1462352 1688763 1557413 1261447 1620022 1331906 1527795 1364622 1491313 1431305 1184170
16462 1184170 1331856 1235789 1470588 1399829 1493105 1531259 1292752 1394771 1214486 1259143
16452 1259143 1453418 1290454 1169799 1447536 1586149 1226741 1294726 1082930 1299652 845140
$$ packed form
16522B479691l2082j26151J9111J30454j45418R1307m1009k70361l2627J84619
16512B257534P1329l84204L31501k8575l54275J67454L8746L9019k65716K63819
16502B136632l9835k66107K38859l64555J69134J5874l66222J70948P7748L03346
16492B075822k45650k9906K5614j03595n6805J90168j77371j4693J91640N7688
16482A912912n6050O5962m48033K9179j92770j36193N30208j66246J52421k29038
16472A462352K26411j31350k95966L58575k88116J95889j63173J26691o0008k47135
16462A184170J47686r6067K34799p0759R3276L8154k38507J02019j80285M4657
16452A259143J94275j62964j20655K77737J38613l59408O7985k11796K16722m54512
$$ plain form
16442 845140 1566026 1166836 928710 1252548 1375242 1210699 1235535 1188531 1288214 1286012
16432 1286012 1051975 1009480 1189817 1494363 912082 931835 1267701 1010458 1009618 1488474
16422 1488474 845602 944698 1300807 1125226 922437 1050735 1353054 1102248 930722 668938
16412 668938 962838 1049477 799705 1215356 827448 933808 1188879 630636 1003552 1018318
16402 1018318 1153347 843000 750584 870176 1143635 931449 825520 1034471 1064378 790050
16392 790050 1050385 811214 526743 1187099 962559 667509 1015748 944687 901344 1139359
16382 1139359 998466 947051 790591 851848 1079568 905168 902166 648144 1144636 690357
16372 690357 1082673 494264 878234 858690 900108 648813 757804 1066465 728236 624892
$$ packed form
16442H45140P20886l99190k38126L23838J22694j64543K4836m7004R9683k202
16432A286012k34037m2495J80337L04546n82281J9753L35866k57243q40M78856
16422A488474o42872R9096L56109j75581k02789J28298L02319k50806j71526k61784
16412F68938K93900Q6639k49772M15651l87908J06360K55071n58243L72916J4766
16402A018318J35029l10347r2416J19592K73459k12186j05929K08951K9907k74328
16392G90050K60335k39171k84471O60356k24540k95050L48239p1061m3343K38015
16382A139359j40893n1415j56460O1257K27720j74400l002k54022M96492m54279
16372F90357L92316D94264L83970j9544M1418k51295J08991L08661l38229j03344
$$ plain form
16362 624892 917077 551527 1103321 849677 662611 475461 593672 970815 922514 581509
16352 581509 792652 384094 563701 727452 886238 600304 771814 812335 804872 976761
16342 976761 814435 872271 641721 649229 844358 662746 559012 356438 679217 632164
16332 632164 565807 578457 611943 610241 588755 944583 877547 860952 515723 656044 541775
16321 541775 327014 577109 687333 834626 444016 479011 607837 835117 886843 690516
16311 690516 872798 297701 285472 520901 356577 1017355 366889 362362 651391 446188
16301 446188 695207 610915 503012 607372 423379 421776 590664 809377 207959 445590
16291 445590 398907 404838 570167 470873 419918 636227 329038 713688 593089 400429
$$ packed form
16362F24892K92185l65550N51794k53644j87066j87150J18211L77143m8301l41005
16352E81509K11143C84094J79607J63751J58786k85934J71510M0521p463J71889
16342I76761j62326N7836k30550P508J95129j81612j03734k02574L22779m7053
16332F32164o6357J2650L3486j702k1486L55828o7036j6595l45229J40321j14269
16321E41775k14761K50095J10224J47293l90610L4995J28826K27280N1726j96327
16311F90516J82282B97701j2229K35429j64324O60778C66889m527K89029k05203
16301D46188K49019q4292j07903J04360j83993j603J68888K18713B07959K37631
16291D45590m6683N931J65329r9294n0955K16309l07189L84650j20599j92660
$$ plain form
16281 400429 636730 369877 676740 531646 425107 317457 137544 545172 555276 486640
16271 486640 326268 203175 102248 530090 424082 450094 284002 770649 521773 89239
16260 329320 661821 409411 384641 495068 498030 398223 697845 498983 602218 429643
16250 429643 330529 568447 535744 360205 561807 655452 496799 477235 328770 405457
16240 405457 375490 331553 277009 593683 498382 420476 419416 217084 371490 445343 576362
16229 576362 381315 304056 324122 376951 398069 192360 368513 328999 358852 190140 -50766
16217 337263 316930 226694 440519 208496 492045 287157 486321 685060 149833 147821
16207 147821 571427 176928 340310 224709 362849 524687 -45448 314618 289658 50071
$$ packed form
16281D00429K36301k66853L06863j45094j06539j07650A37544M07628J0104o8636
16271D86640j60372j23093j00927M27842j06008K6012j66092M86647k48876H9239
16260C29320L32501k52410k4770J10427K962r9807K99622j98862J03235j72575
16250D29643r9114K37918l2703j75539K01602R3645j58653j9564j48465P6687
16240D05457k9967m3937n4544L16674r5301p7906j060k02332J54406P3853J31019
16229E76362j95047p7259K0066N2829K1118A92360J76153l9514K9853j68712e0766
16217C37263k0333r0236K13825B08496K83549k04888J99164J98739A49833k012
16207A47821M23606A76928J63382j15601J38140J61838d5448C14618k4960E0071
$$ plain form
16196 255499 44513 -52623 733484 480333 554911 340258 370140 118949 81317 430633
16186 430633 266893 691037 73660 475001 434109 257971 16023 290166 342730 306427
16176 306427 313827 402333 191540 223937 -32713 74454 121623 -16928 133181 61629 586467
16165 586467 24350 446647 338877 238668 312896 155502 88347 243932 116983 555519
16155 555519 382248 230516 171737 308269 -126450 427263 468957 267268 161609 301274
16145 301274 101955 436006 3081 230125 224063 287460 303083 89188 233746 291983 267432
16134 267432 348527 181179 377727 220499 259390 458088 115965 217404 -66494 -157527
16124 -157527 -1522 302055 464961 33470 234546 61709 18795 181150 42612 214450 262088
$$ packed form
16196B55499D4513e2623G33484k53151P4578k14653K9882A18949l7632L49316
16186D30633j63740M24144G3660M01341m0892j76138A6023K74143N2564l6303
16176C06427P400Q8506A91540L2397c2713G4454M7169a6928A33181F1629N24838
16165E86467B4350M22297j07770j00209P4228A55502o7155J55585A16983M38536
16155E55519j73271j51732n8779J36532a26450D27263M1694k01689j05659J39665
16145C01274A01955L34051C081K27044o062O3397J5623H9188J44558N8237k4551
16134B67432Q1095j67348J96548j57228L8891J98698A15965J01439f6494r1033
16124a57527a522C02055J62906C3470K01076F1709A8795J62355D2612J71838M7638
$$ plain form
16113 262088 142988 136155 398598 -50825 -86606 -74828 -2559 245536 4810 -142609 362912
16101 195094 -85565 70814 80928 153681 -74166 233137 54805 -110301 -15818 416828 363336
16090 363336 143352 327117 5660 45651 -32852 184707 -42766 61133 126488 340069 -93635
16078 414167 135396 -136901 245089 396053 311144 253528 39343 162634 121973 280740
16068 280740 -38825 311692 183238 129394 293716 445050 241775 336185 259961 30347
16057 129896 337342 135637 224014 41804 48614 -74387 174308 -154679 149730 306693
16047 306693 17275 -12420 -73187 -158289 326374 137018 713 593501 282755 167542 -23191
16035 -281917 191437 -131859 103381 192565 -62822 -20850 158885 2410 -51964 261895 398181
$$ packed form
16113B62088j19100o833K62443e0825l5781J1778b559B45536D810a42609C62912
16101A95094h5565G0814J0114P2753g4166B33137E4805a10301a5818D16828n3492
16090C63336A43352J83765E660L9991c2852A84707d2766F1133O5355K13581i3635
16078D14167A35396a36901B45089J50964q4909n7616C9343J23291m0661J58767
16068B80740c8825C11692j28454n3844J64322J51334k03275R4410p6224C0347
16057A29896K07446A35637Q8377D1804O810g4387A74308a54679A49730J56963
16047C06693A7275a2420o0767q5102C26374A37018G13N92788B82755j15213b3191
16035b81917A91437a31859A03381Q9184f2822b0850A58885B410e1964B61895J36286
$$ plain form
16024 398181 -109575 263293 -131830 82778 84621 211273 121269 207496 -197487 99394 131266
16013 131266 7690 -99742 -129696 363488 -22176 5247 77448 136842 159602 -98152 160141
16001 120395 -217840 -342714 523453 23297 253013 -38221 41975 -228213 93272 -828 221266
15989 369510 -35874 176697 -64107 71518 -32779 52455 214748 70238 -52702 -136490 295528
15977 253258 81422 322355 274892 435410 302060 659541 677829 752445 951250 1072792
15967 1072792 758002 567389 468805 76004 112324 269649 452652 36862 -482072 79029
15956 -153005 -239559 102605 11471 -184408 -37020 -83354 179292 70643 -202165 340848
15945 85329 -122685 -159576 42613 -117714 7347 -11129 -90428 305483 175208 150048 -1243
$$ packed form
16024C98181a09575B63293a31830H2778J843J26652r0004Q6227a97487I9394L1872
16013A31266G690i9742k9954C63488b2176E247P2201N9394K2760i8152A60141
16001A20395b17840j24874E23453B3297K29716c8221D1975b28213I3272h28B21266
15989C69510c5874A76697f4107G1518c2779E2455J62293G0238e2702q3788B95528
15977B53258H1422K40933m7463J60518j33350L57481J8288P4616J98805J21542
15967A072792l14790j90613r8584G6004L6320J57325J83003C6862d82072G9029
15956a53005q6554A02605A1471a84408c7020m6334A79292G0643b02165C40848
15945H5329a22685l6891D2613a17714G347a1129p9299C05483j30275k5160a243
$$ plain form
15933 -126532 195765 -95973 209722 -298277 1893 152745 -20447 317461 28928 12729 -277412
15921 -68253 -304789 -239505 -103169 244053 330709 -215253 -175766 -123681 180425 150986 -236753
15909 -35962 58640 212625 195172 159901 307904 -239216 9415 -147448 -67297 200287 81716
15897 300562 129133 -182002 -133124 118893 221541 -194423 -103982 205781 -140709 129601
15886 36481 79333 378294 -257677 96457 43991 -174161 65975 -146567 -100813 -36618 125214
15874 -136144 104178 157402 -234266 -1940 171298 -128895 111167 94142 -173321 179786
15863 -243382 198562 238791 -226806 -60626 -82889 158031 48275 87940 117326 -167693 -33660
15851 -126748 -126885 -199457 -95829 -165621 -35056 276078 -285478 88735 -308621 -201165 -84214
$$ packed form
15933a26532A95765i5973B09722b98277A893J50852b0447C17461B8928A2729b77412
15921f8253k36536O5284a03169B44053Q6656b15253L9487N2085A80425k9439b36753
15909c5962E8640J53985j7453l5271J48003b39216I415a47448f7297B00287H1716
15897C00562A29133a82002M8878A18893J02648a94423R0441B05781a40709A29601
15886C6481M2852K98961b57677I6457D3991a74161F5975a46567M5754c6618A25214
15874a36144A04178N3224b34266a940A71298a28895A11167j7025a73321A79786
15863b43382A98562M0229b26806f0626k2263A58031D8275L9665K9386a67693c3660
15851a26748j37p2572i5829o9792c5056B76078b85478H8735c08621J07456h4214
$$ plain form
15839 70616 -182958 252725 -26805 -47964 277741 -137313 -56259 209339 -384318 -17150
15828 -94486 -44429 110509 -92271 -203720 -4553 116623 23628 285542 -181329 19380 -244263
15816 -117025 238348 -288687 -106209 145697 -58499 -94183 -406862 81327 101171 317193
15806 317193 -23098 -187536 -103700 -145375 -151428 -38892 -150647 52887 -27145 -172829 62261
15794 -138032 -57912 2242 16034 193208 -131262 45350 -70219 84804 69862 153056 72853
15782 -10893 167443 134220 -1059 27494 -28120 -177094 7995 41609 -193826 -96079 269270
15770 -76594 -4823 27862 -288365 -138577 -276220 -78483 142107 39907 -372727 307961 82721
15758 229895 58126 -86300 -179757 43323 116370 -2214 -122912 51435 332350 -104341 -211454
$$ packed form
15839G0616a82958B52725b6805k1159B77741a37313e6259B09339c84318a7150
15828i4486d4429A10509i2271j11449d553A16623B3628K61914a81329A9380b44263
15816a17025B38348b88687a06209A45697e8499l5684l12679H1327J9844K16022
15806C17193b3098j64438Q3836m1675o053c8892j11755E2887b7145j45684F2261
15794a38032e7912B242J3792J77174a31262D5350g0219H4804j4942Q3194G2853
15782a0893A67443l3223a059B7494b8120j48974G995L3614a93826i6079B69270
15770g6594d823B7862b88365a38577j37643g8483A42107C9907c72727C07961H2721
15758B29895E8126h6300r3457D3323P3047b214j20698E1435K80915a04341j07113
$$ plain form
15747 -211454 -20912 215720 -129322 52350 -118297 227193 61644 90669 155564 -61123 632
15735 -224277 75048 296674 -43492 -109518 -60627 -165802 216057 88947 253337 166743 -365502
15723 108629 971 80266 -64702 10265 241592 -29763 -84723 29755 64835 191201 188252 -297290
15710 -129240 90561 -46443 100925 -212506 -56473 -184557 -114818 57583 -57479 -167220 -287284
15699 -287284 -99773 -75970 -109124 -9585 23493 73211 -242116 459133 -92306 -25532 -306667
15688 -306667 -143975 3445 -536 -164993 -282806 11931 282835 -103382 343124 21046 144489
15677 144489 -149007 45151 181990 8348 194260 311675 229967 -54006 -150525 126412 -157614
15665 -88261 -84336 19071 -127195 57424 -359699 -116037 -415426 -123939 -378070 -992 -88784
$$ packed form
15747b11454b0912B15720a29322E2350a18297B27193F1644K9025O4895f1123F32
15735b24277G5048K21626d3492o6026M8891j05175B16057H8947J64390q6594c65502
15723A08629I71P9295f4702A0265K31327b9763n4960B9755L5080J26366k949b97290
15710a29240I0561d6443A00925b12506e6473j28084O9739E7583e7479j09741j20064
15699b87284i9773K3803l3154i585B3493M9718b42116D59133i2306b5532k81135
15688c06667a43975C445e36j64457j17813A1931K70904a03382C43124B1046J23443
15677A44489a49007D5151J36839H348J85912J17415q1708e4006r6519A26412a57614
15665h8261L925A9071a27195E7424c59699a16037k99389a23939k54131i92q7792
$$ plain form
15654 -88784 79682 -34720 51175 85519 -142224 361799 -79875 -161813 -58484 -5791 92453
15642 -284738 212731 -12231 243813 -17798 -80318 37931 34750 -443634 187036 -57939 274440
15630 -334454 11063 121116 76595 -4953 -125327 -63189 -198282 -283916 -368391 -282375 121931
15618 1869 -27395 -148429 -77076 -216124 2682 -251866 45516 29983 18856 -321696 -172559
15607 -172559 -12514 -3565 35634 -102484 228246 -192037 -83393 -124430 -55798 96493 237653
15596 237653 200842 70509 -242110 -198997 -233786 -57140 -187449 -92851 199622 -236613 -72834
15584 -425 -138851 -170851 -344869 -42014 -259397 -125296 61335 -55663 -138823 -30912 -22203
15573 -22203 -202902 -318108 142465 -90036 -85265 -194367 -74925 281529 172789 143889 -368514
$$ packed form
15654h8784G9682c4720E1175L4344a42224C61799g9875q1938e8484e791I2453
15642b84738B12731a2231B43813a7798o2520C7931l181d43634A87036e7939B74440
15630c34454A1063J10053m4521d953j20374O2138j35093q5634q4475Q6016A21931
15618A869b7395j21034P1353j39048B682b51866D5516j5533j1127c21696J49137
15607a72559a2514c565C5634a02484B28246a92037h3393m1037e5798I6493J41160
15596B37653l6811G0509b42110M3113l4789e7140j30309i2851A99622b36613g2834
15584d25j38426l2000j74018d2014k17383a25296F1335e5663q3160c0912Q709
15573b2203j80699j15206A42465i0036M771j09102g4925B81529j08740k8900c68514
$$ plain form
15561 -77662 31621 -169173 22750 -94005 97134 -32061 -239973 -274 83006 77990 -158258 -77977
15548 150326 -29918 151421 -285485 41403 158793 131008 34073 44207 -234748 58636 -34625
15536 178372 317850 60215 -18360 -100162 -39280 -187219 -125416 -127163 -405783 -112121 -232262
15525 -232262 70286 -46104 457211 76023 -190110 -16785 -178457 33763 -291264 18356 -121926
15513 -171231 245847 105221 -3177 116534 -25165 19629 202383 100841 44988 344331
15503 344331 67586 250271 82243 275752 72172 153532 66715 -147847 219748 177034 -220579
15491 1951 66572 206859 237650 167768 386856 81499 403818 9747 237606 67933 284864
15480 284864 178852 61993 339847 392674 86411 -48361 75510 168543 65932 165167 57099
$$ packed form
15561g7662C1621a69173B2750i4005I7134c2061k07912b74H3006n016a58258g7977
15548A50326b9918A51421b85485D1403J17390k7785C4073J0134b34748E8636c4625
15536A78372J39478F0215a8360q1802c9280j47939O1803j747k78620a12121j20141
15525b32262G0286d6104D57211G6023a90110a6785j61672C3763b91264A8356a21926
15513a71231B45847A05221c177A16534b5165A9629J82754A00841D4988K99343
15503C44331F7586J82685H2243J93509G2172Q1360F6715a47847B19748m2714b20579
15491A951O4621J40287L0791o9882K19088H1499L22319I747K27859F7933K16931
15480B84864j06012F1993K77854N2827H6411d8361G5510R3033F5932R9235E7099
$$ plain form
15468 83942 225141 26796 37558 329371 288335 752 137918 173953 80649 314767 560203
15457 560203 319313 317957 127341 489788 -79254 63328 -188306 -117350 -77434 -70120 55302
15445 169929 372076 20529 128976 98665 -166320 -37223 216878 100042 124749 45805
15434 76534 58874 329357 19301 223124 243558 252355 544831 571431 659544 924299 928592
15423 928592 675381 229947 343112 -46000 462970 243366 496355 15770 -35790 153135
15412 -190911 358068 -205128 -44260 -66676 42949 183195 88232 -36644 -30602 216581 304763
15401 304763 68993 -85772 -140723 264711 342456 346111 177790 90088 124275 7716 -192719
15389 -229540 -113297 110871 229925 28757 134443 -100879 46795 1635 31029 -207449
$$ packed form
15468H3942J41199B6796J0762K91813m1036G52J37166L6035H0649K34118K45436
15457E60203k40890j356A27341L62447g9254F3328a88306P0956L9916P314E5302
15445A69929K02147B0529J08447l0311a66320c7223B16878A00042K4707D5805
15434G6534j7660K70483A9301K03823K0434Q797K92476K6600Q8113K64755M293
15423I28592k53211B29947J13165d6000D62970k19604K52989A5770c5790A53135
15412a90911C58068b05128d4260k2416D2949J40246H8232c6644O042B16581Q8182
15401C04763F8993h5772n4951B64711P7745L655j68321q7702L4187G716a92719
15389b29540a13297A10871J19054B8757J05686a00879D6795A635K9394b07449
$$ plain form
15378 -10566 218269 -13279 69388 205964 -92865 -47331 192289 73933 52752 102158 85673
15367 85673 -268555 275799 -245820 139405 43292 124528 299381 -4308 205411 -1572 94242
15355 32017 169162 118095 -136383 401564 -69797 337953 151968 277377 -13681 155782
15344 8851 194425 561347 299758 -60846 91495 -72707 -168943 -14710 38382 400443 293415
15333 293415 39572 283352 225130 506735 -141494 361788 103978 366340 166240 35688
15322 252027 360815 195344 24279 238045 193311 236941 39768 107049 -91070 75534 97198
15311 97198 347566 82909 -213687 295811 17585 79742 -65193 -64191 90698 264043 117403
15299 120709 329911 -52265 136525 312502 335347 347983 221472 342611 65799 421851
$$ packed form
15378a0566B18269a3279F9388J36576i2865M5534A92289G3933k1181M9406j6485
15367H5673b68555B75799b45820A39405D3292Q1236J74853d308B05411a572I4242
15355C2017J37145n1067a36383D01564f9797C37953A51968J25409a3681A55782
15344H851J85574L66922k61589f0846I1495g2707r6236a4710C8382L62061j07028
15333B93415C9572K43780n8222K81605a41494C61788A03978K62362A66240C5688
15322B52027J08788j65471B4279K13766m4734M3630C9768O7281i1070G5534K1664
15311I7198K50368H2909b13687B95811A7585O2157f5193J002I0698J73345A17403
15299A20709K09202e2265A36525J75977K2845J2636j26511J21139F5799L56052
$$ plain form
15289 421851 306030 31347 -319043 87373 -149760 16533 -6348 153403 -17698 179983 172726
15278 172726 354383 209434 537132 -31884 113367 54416 220659 298098 17537 84159
15268 84159 92630 -125824 405955 279470 -149141 93340 298274 -259058 207660 49391
15257 179529 -5598 -23755 44352 -37652 168661 -53726 119838 89634 -70986 -54467 -326468
15246 -326468 150031 72280 -201393 -192041 -97231 63285 76238 -198766 -79587 -71141 150923
15234 402862 26886 41945 261099 583466 188253 646915 1437623 1189046 1200970 1201810 1180226
15223 1180226 789960 278688 -57749 288347 381722 355716 88706 204061 -114969 150292
15212 129354 215192 -2654 -287357 -29877 -54391 134099 438312 97039 34653 -92537 -85695
$$ packed form
15289D21851j15821C1347c19043H7373a49760A6533f348A53403a7698A79983p257
15278A72726J81657j44949L27698c1884A13367E4416J66243P7439A7537O6622
15268H4159Q471a25824D05955j26485a49141I3340K04934b59058B07660D9391
15257A79529e598j8157D4352c7652A68661e3726A19838l0204g0986J6519k72001
15246c26468A50031G2280b01393R352R4810F3285J2953a98766g9587Q446A50923
15234D02862B6886J5059K19154L22367A88253M58662P90708k48577J1924Q40k1584
15223A180226l90266B78688e7749B88347R3375k6006H8706J15355a14969A50292
15212A29354Q5838b654k84703b9877k4514A34099L04213I7039C4653i2537O842
$$ plain form
15201 -85695 -61000 -66024 113172 219227 310693 -27868 -167292 47307 -68576 63619 75246
15190 75246 -43445 230446 277586 150109 -38881 120714 -47279 132625 343026 292339 -128047
15178 122998 -226913 47182 218708 -145490 288949 -28924 394496 -136254 -40733 232215
15167 -78249 -81389 250382 134490 368190 -114424 -80294 231642 143514 -71371 -40596 -6032
15155 222845 -15912 31977 228294 181665 17019 204941 65220 83547 -75955 19330 198190
15144 198190 259407 -70799 31958 137784 329706 -243075 155277 198443 71617 43474 112227
15133 112227 300202 -26071 136043 -10429 277849 -67715 -131378 -117911 -40828 -253929 110245
15121 382375 223762 312801 62786 23559 42321 168427 209065 219936 130679 -119621 111008
$$ packed form
15201h5695K4695n024A13172J06055R1466b7868j39424D7307f8576F3619J1627
15190G5246d3445B30446M7140j27477c8881A20714d7279A32625K10401n0687a28047
15178A22998b26913D7182J71526a45490B88949b8924C94496a36254d0733B32215
15167g8249l140B50382j15892K33700a14424L4130B31642q8128g1371L0775f032
15155B22845a5912C1977J96317m6629A7019J87922F5220J8327g5955A9330J78860
15144A98190O1217g0799C1958J05826J91922b43075A55277M3166G1617k8143O8753
15133A12227J87975b6071A36043a0429B77849f7715o3663J3467d0828k13101A10245
15121C82375j58613Q9039F2786B3559J8762J26106M0638J0871q9257a19621A11008
$$ plain form
15109 69651 -39511 179885 403341 59698 229457 326606 72861 198630 155528 237023 364664
15098 364664 78345 -244290 5228 315175 4679 90538 190837 35318 -188360 223596 26876
15086 96111 180880 -95656 60475 214963 25277 -141400 -31107 140639 106547 120011 -23382
15074 84992 10471 179868 58644 88763 268912 19081 -57425 315708 217320 285159 -161147
15062 -111029 261023 324450 -75327 144324 207748 363808 33418 386724 134512 -221868
15051 283933 258468 246208 -193522 -22178 215896 86929 335816 -28540 166350 26721 174781
15040 174781 34746 414060 254409 -126738 44911 126051 482730 443682 225302 178209
15030 178209 256056 434566 360613 479154 356949 614763 505732 577520 501985 120578
$$ packed form
15109F9651c9511A79885K23456E9698J69759R7149G2861J25769m3102Q1495J27641
15098C64664G8345b44290E228L09947D679Q5859J00299C5318a88360B23596B6876
15086I6111Q4769i5656F0475J54488B5277a41400c1107A40639l4092J3464b3382
15074H4992A0471J69397E8644L0119J80149A9081e7425C15708r8388O7839a61147
15062a11029B61023O3427g5327A44324O3424J56060C3418L53306A34512b21868
15051B83933k5465j2260a93522b2178B15896H6929K48887b8540A66350B6721J48060
15040A74781C4746L79314j59651a26738D4911Q1140L56679l9048k18380m7093
15030A78209P7847J78510p3953J18541j22205K57814j09031P1788p5535A20578
$$ plain form
15019 121481 185689 383396 763840 260601 784013 585377 718167 459486 570552 432227
15009 432227 269635 499594 455625 127212 688364 677116 733877 248988 87176 727991
14999 727991 142253 535456 478259 101796 377574 416605 397397 278749 343834 427093
14989 427093 141458 192028 565249 764989 182050 280426 553431 529766 253459 409105
14979 409105 462515 115020 -35639 -20827 473916 475887 219848 614779 526815 602978 506332
14968 506332 470029 626332 608481 840519 906859 530138 639640 660864 609467 719917
14958 719917 721903 498509 620591 635035 684856 607627 103361 261315 107315 750819
14948 750819 404553 190148 303260 551173 235344 80773 86445 253890 94750 149584
$$ packed form
15019A21481O4208J97707L80444B60601N23412j98636J32790k58681J11066j38325
15009D32227j62592K29959m3969A27212N61152j1248N6761B48988H7176O40815
14999G27991A42253L93203n7197A01796K75778L9031j9208j18648O5085Q3259
14989D27093A41458N0570L73221J99740A82050R8376K73005k3665B53459J55646
14979D09105N3410A15020c5639J4812D73916J971B19848L94931q7964P6163r6646
14968E06332l6303J56303j7851K32038O6340l76721J09502K1224n1397J10450
14958G19917J986k23394J22082J4444M9821p7229A03361J57954A07315O43504
14948G50819l46266A90148J13112K47913B35344H0773N672J67445I4750N4834
$$ plain form
14938 149584 141128 238397 138398 337581 196601 457314 186930 328256 354419 129829
14927 621860 840268 363542 480888 765132 610001 479738 -39528 342988 562580 657138
14917 657138 356073 963773 668116 1392695 1362878 1058261 860550 1496227 1748959 1641115
14907 1641115 1415886 1418438 1739981 1639012 1325919 1761006 1831492 1949308 1760081 1685341
14897 1685341 1086682 1194239 930269 816231 764517 385536 45181 458818 498250 473178
14887 473178 400435 564737 448242 544260 164285 212174 145822 547509 442652 382845
14877 382845 552604 283241 309996 399436 756390 933485 594977 461740 377724 735428
14867 735428 723480 868523 768973 774157 1036817 557639 436194 471675 511956 346732 221308
$$ packed form
14938A49584q456R7269r9999J99183j40980K60713A86930J41326K6163A29829
14927F21860K18408C63542J17346K84244j55131j30263c9528C42988K19592R4558
14917F57138l01065O07700k95657P24579k9817l04617j97711O35677K52732j07844
14907A641115k25229K552L21543j00969l13093M35087P0486J17816j89227p4740
14897A685341n98659J07557k63970j14038n1714l78981D5181M13637L9432k5072
14887D73178p2743J64302j16495R6018A64285M7889o6352M01687j04857n9807
14877C82845J69759k69363K6755Q9440L56954J77095l38508j33237q4016L57704
14867G35428j1948J45043r9550N184K62660m79178j21445L5481M0281j65224j25424
$$ plain form
14856 221308 644628 603039 305023 564981 507713 610605 736698 430174 575993 413005
14846 413005 647471 318138 662576 388994 194043 799430 649671 110739 524381 586898
14836 586898 517910 535836 512739 270411 649768 646894 355153 714350 838478 708505
14826 708505 698549 888210 1110888 796561 716121 965084 1003179 747491 465512 344785
14816 344785 751352 431808 531935 700370 472044 300475 587307 541072 710871 631294
14806 631294 521792 461763 643397 671010 589868 957815 605507 823171 669581 657798
14796 657798 519390 574468 577053 638455 605354 513759 948076 670402 600242 814817 651948
14785 651948 477337 886002 524959 606521 490083 308066 354308 492414 372848 398424
$$ packed form
14856B21308M23320m1589k98016K59958n7268J02892J26093l06524J45819j62988
14846D13005K34466C18138L44438k73582A94043O05387j49759A10739M13642O2517
14836E86898o8988J7926k3097k42328L79357k874k91741L59197J24128j29973
14826G08505r956J89661K22678l14327q0440K48963L8095k55688k81979j20727
14816C44785M06567l19544J00127J68435k28326j71569K86832m6235J69799p9577
14806F31294j09502o0029J81634K7613q1142L67947l52308K17664j53590j1783
14796F57798j38408N5078K585O1402l3101r1595M34317k77674p0160K14575j62869
14785F51948j74611M08665l61043Q1562j16438j82017M6242J38106j19566K5576
$$ plain form
14775 398424 559448 463823 490808 513016 316519 707227 655287 659960 642783 432986 708682
14764 708682 483322 701593 1021540 1006664 764978 617196 818910 718367 592974 585937
14754 585937 641165 859358 557704 530767 461809 723045 474979 511953 444952 471659 206330
14742 602441 472946 599212 457481 368683 741014 682572 860865 507184 700260 417107
14732 417107 407458 454694 816043 730699 535226 671406 732983 889177 831496 491507 853343
14721 853343 415661 768148 769190 996685 783308 914743 923673 1025504 1284527 1325673
14711 1325673 1572438 1664670 1567646 1510166 1259993 796077 1076465 940861 990086 661143
14701 661143 1220082 530221 942424 909026 563992 749596 815710 760225 957161 928576
$$ packed form
14775C98424J61024r5625K6985K2208j96497L90708n1940M673j7177k09797K75696
14764G08682k25360K18271L19947j4876k41686j47782K01714j00543j25393p037
14754E85937N5228K18193l01654k6937o8958K61236k48066L6974o7001K6707B06330
14742F02441j29495J26266j41731q8798L72331n8442J78293l53681J93076k83153
14732D17107r649M7236L61349q5344j95473J36180O1577J56194n7681l39989L61836
14721H53343D15661L52487J042K27495k13377J31435Q930J01831K59023M1146
14711A325673K46765R2232r7024n7480k50173m63916K80388j35604M9225l28943
14701F61143N58939E30221M12203l3398l45034J85604O6114n5485J96936k8585
$$ plain form
14691 928576 858811 867395 1207911 1084168 1374123 1623775 1541304 1755400 1732826 1427244
14681 1427244 1369178 1288416 780417 711434 707639 937417 990274 773237 617270 835077
14671 835077 779867 742510 635537 868148 684755 825058 985793 712218 780119 520478
14661 520478 850277 909187 668136 1294019 967803 655903 925672 931983 1002309 923956
14651 923956 845870 895507 1239277 865756 715188 702335 790255 964151 1042105 1127980 1227896
14640 1227896 738114 547021 1071717 1177175 1210196 1131365 1010983 1072994 936715 903298
14630 903298 1125252 1282815 1173232 1352197 1043301 1077801 974383 1234425 770833 881527
14620 881527 926702 1492869 971569 1110473 1077788 917909 1384348 1124386 1283869 1202145
$$ packed form
14691I28576o9765Q584L40516j23743K89955K49652q2471K14096k2574l05582
14681A427244n8066q0762n07999o8983l795K29778N2857k17037j55967K17807
14671H35077n5210l7357j06973K32611j83393J40303J60735k73575O7901k59641
14661E20478L29799N8910k41051O25883l26216l11900K69769O311P0326p8353
14651I23956p8086M9637L43770l73521j50568j2853Q7920J73896P7954Q5875R9916
14640A227896m89782j91093N24696J05458L3021p8831j20382O2011j36279l3417
14630I03298K21954J57563j09583J78965l08896L4500j03418K60042m63592J10694
14620H81527M5175N66167n21300J38904l2685j59879M66439k59962J59483q1724
$$ plain form
14610 1202145 699011 1396356 1197075 1293526 1034897 1603249 1054762 1263017 1257455 1099829
14600 1099829 1510427 988377 1473997 1455519 1140810 1135982 1290479 1029552 1396747 1437536
14590 1437536 1494412 1102443 1393106 1793496 1482873 1169889 1482627 1532753 1189343 1555131
14580 1555131 1611178 1325068 1279954 1455182 1701242 1274815 1440177 2011595 1328578 1547816
14570 1547816 1561372 1534634 2138444 1848462 1820655 1602839 1549045 1358700 1750454 1471785
14560 1471785 1649355 1719864 1862140 1529319 1994517 1941880 1832871 2049087 2215700 2366173
14550 2366173 2148319 1929924 2115302 2433132 2440967 2601031 2557511 2737107 2769674 3274550
14540 3274550 3329089 3488443 3747818 4555851 5425359 6566514 8836738 12568321 18265318
$$ packed form
14610A202145n03134O97345j99281R6451k58629N68352n48487K08255n562j57626
14600A099829M10598n22050M85620j8478l14709m828J54497k60927L67195M0789
14590A437536N6876l91969K90663M00390l10623l12984L12738N0126l43410L65788
14580A555131N6047k86110m5114J75228K46060m26427J65362N71418o83017K19238
14570A547816J3556k6738O03810k89982k7807k17816n3794j90345L91754k78669
14560A471785J77570P0509J42276l32821M65198n2637j09009K16216J66613J50473
14550B366173k17854k18395J85378L17830P835J60064m3520J79596L2567N04876
14540C274550N4539J59354K59375Q08033Q69508J141155K270224L731583N696997
$$ plain form
14531 18265318 28436615 31196308 18505950 10285371 6355805 4492329 3662802 4281141
14523 4281141 4022561 4054951 3016300 2124271 1750634 2192000 2295234 2189652 1819896
14514 1819896 2237650 2140020 2095334 2123223 1861311 1979342 2121846 2148052 2189893 2190329 2366731
14503 2366731 2088275 2210760 2272636 2181471 2178357 2437709 2483435 2271032 2343745 2590771
14493 2590771 2397278 2555372 2609108 2556302 2719283 2796318 2471264 2676861 2575412 2564781
14483 2564781 2735752 3053986 3023704 2629613 2652995 2958225 2785475 3132585 3063789 3088022
14473 3088022 3020149 3242573 3081163 3568343 3231201 3182259 3343362 3484969 3437104 3086000
14463 3086000 3099692 3482962 3611358 3563712 3220244 3640935 3621612 3792883 3498076 3668063
$$ packed form
14531A8265318J0171297K759693j2690358q220579l929566j863476q29527O18339
14523D281141k58580L2390j038651q92029l73637M41366J03234j05582l69756
14514A819896M17754r7630m4686K7889k61912J18031J42504K6206M1841M36J76402
14503B366731k78456J22485O1876r1165l114K59352M5726k12403P2713K47026
14493B590771j93493J58094N3736n2806J62981P7035l25054K05597j01449j0631
14483B564781J70971L18234l0282l94091K3382L05230j72750L47110o8796K4233
14473C088022o7873K22424j61410M87180l37142m8942J61103J41607m7865l51104
14463C086000J3692L83270J28396m7646l43468M20691j9323J71271k94807J69987
$$ plain form
14453 3668063 3778441 3872671 3862456 3706184 3952316 3981835 4042667 4211682 3919683 4229436
14443 4229436 4329242 4546705 3965915 4624789 4372782 4569305 4748620 4607888 4805956 4567859
14433 4567859 4623502 5105131 4973450 4975545 5269282 5003504 5052634 5276057 5157219 5353857
14423 5353857 5821923 5529123 5622221 5592044 5756086 5464263 5903521 6064436 5842674 6220131
14413 6220131 6356897 6190850 6326734 6336424 6538312 6380898 6863007 7167036 6990805 7282318
14403 7282318 7675083 7794092 7870821 7868598 7576697 7833057 7889548 8026745 8120851 7934104
14393 7934104 8230778 8718938 8841335 8788028 8897407 9270557 9350066 9233964 9471943 9561381
14383 9561381 9865560 9690486 9711407 10249159 10021765 10857120 10158370 10776235 10829892 10981249
$$ packed form
14453C668063J10378R4230j0215j56272K46132K9519O0832J69015k91999L09753
14443D229436R9806K17463n80790O58874k52007J96523J79315j40732J98068k38097
14433D567859N5643M81629j31681K095K93737k65778M9130K23423j18838J96638
14423E353857M68066k92800R3098l0177J64042k91823M39258J60915k21762L77457
14413F220131J36766j66047J35884R690K01888j57414M82109L04029j76231K91513
14403G282318L92765J19009P6729k223k91901K56360N6491J37197R4106j86747
14393G934104K96674M88160J22397n3307J09379L73150P9509j16102K37979Q9438
14383I561381L04179j75074K0921N37752k27394Q35355o98750O17865N3657J51357
$$ plain form
14373 10981249 11217419 11376671 11785142 11717195 12579324 12181000 12739121 12753064 12971899 13437818
14363 13437818 13612455 13666198 13820008 14104986 14802369 14633761 14984401 15234066 15884354
14354 15884354 16040650 16235524 16601889 17296105 17541007 18072861 18607069 18785700 19158599
14345 19158599 19352823 19752836 20220961 20912563 21301007 21761587 22000965 22595828 23370055
14336 23370055 23456415 24617726 25017193 25949789 26461706 26897816 27567749 28677817 29374349
14327 29374349 30344003 30862366 31997271 32822374 33450518 34718874 35274388 36295758 37801957
14318 37801957 38634292 39972120 41530828 42543102 43919120 45326695 46671724 48305184
14310 48305184 50123718 52141687 53541563 55745136 57839928 60099964 61684084 64116635
$$ packed form
14373A0981249K36170J59252M08471o7947Q62129l98324N58121J3943K18835M65919
14363A3437818J74637N3743J53810K84978O97383j68608L50640K49665O50288
14354A5884354J56296J94874L66365O94216K44902N31854N34208J78631L72899
14345A9158599J94224M00013M68125O91602L88444M60580K39378N94863P74227
14336B3370055Q6360J161311L99467R32596N11917M36110O69933J110068O96532
14327B9374349R69654N18363J134905Q25103O28144J268356N55514J021370J506199
14318C7801957Q32335J337828J558708J012274J376018J407575J345029J633460
14310D8305184J818534K017969J399876K203573K094792K260036J584120K432551
$$ plain form
14302 64116635 66667161 69467789 71958560 75102719 78102322 81541759 85169273 88845525
14294 88845525 92808572 96805170 101389243 106401497 111646030 116886301 123005924 128906188
14286 128906188 135696934 142479710 150103733 157924055 166768338 175267923 184989503 194985747
14278 194985747 205850442 217404566 229266248 242377351 255432783 269506181 283724310
14271 283724310 297990806 313087500 328154254 343532551 358731919 374165942 387943686
14264 387943686 400754794 413279110 424478445 434889337 444764312 452923039 456820364
14257 456820364 459141014 460595804 462488338 460527607 454175245 448323982 440678661 429895950
14249 429895950 415972765 401921115 386939442 371866459 356563015 341415147 326250078
$$ packed form
14302F4116635K550526K800628K490771L144159K999603L439437L627514L676252
14294H8845525L963047L996598M584073N012254N244533N240271O119623N900264
14286A28906188O790746O782776P624023P820322Q844283Q499585R721580R996244
14278A94985747J0864695J1554124J1861682J3111103J3055432J4073398J4218129
14271B83724310J4266496J5096694J5066754J5378297J5199368J5434023J3777744
14264C87943686J2811108J2524316J1199335J0410892R874975Q158727L897325
14257D56820364K320650J454790J892534j960731o352362n851263p645321j0782711
14249D29895950j3923185j4051650j4981673j5072983j5303444j5147868j5165069
$$ plain form
14242 326250078 311211769 296750041 282343358 268630071 255512035 242622424 229840519
14235 229840519 217317581 205425694 194978814 184423640 174615843 165594067 157006547
14228 157006547 148782492 141738420 134942187 128164857 122017260 116297684 111505898 106012073
14220 106012073 101276377 97079948 92655930 89043906 85073229 81608437 78298402 75024666
14212 75024666 72186269 69383263 66768844 64397715 61974316 59529428 57589026 55590676
14204 55590676 53749305 51649699 50249964 48147913 46664542 45742997 44294570 42688282
14196 42688282 41478190 40154777 38821709 37668313 36993416 35864216 34997409 33892220
14188 33892220 33020410 31657938 31055942 31001258 29973996 28418411 27484937 27089296 26970885
$$ packed form
14242C26250078j5038309j4461728j4406683j3713287j3118036j2889611j2781905
14235B29840519j2522938j1891887j0446880j0555174r807797r021776q587520
14228A57006547q224055p044072o796233o777330o147597n719576m791786n493825
14220A06012073m735696m196429m424018l612024l970677l464792l310035l273736
14212G5024666k838397k803006k614419k371129k423399k444888j940402j998350
14204E5590676j841371k099606j399735k102051j483371r21545j448427j606288
14196D2688282j210092j323413j333068j153396o74897j129200q66807j105189
14188C3892220q71810j362472o01996n4684j027262j555585r33474l95641j18411
$$ plain form
14179 26970885 26174915 25332124 24453525 23924029 23396889 22746814 22586189 21811851 21042748
14170 21042748 20836160 20574132 20299453 19554596 19065173 18466320 18132986 18035749 17885363
14161 17885363 17076205 16478174 16635581 16099480 16034202 15509426 15383008 15025109 14646352
14152 14646352 14500350 14219156 13960894 13192208 13374806 13158940 12909842 12526772 12598362
14143 12598362 11863388 11844976 11932046 11613632 11381095 11266926 11003749 11187802 10325995 10614981
14133 10614981 10360639 10392720 9908221 9783229 9633227 9634412 9009674 9142802 9035533 9252609
14123 9252609 8952142 8953104 8562581 8802483 8311273 8124841 8260133 7786780 7825857 7813615
14113 7813615 7598202 7695182 7545850 7239243 7038584 7096761 7020371 7081048 6600624 7106099
$$ packed form
14179B6970885p95970q42791q78599n29496n27140o50075j60625p74338p69103
14170B1042748k06588k62028k74679p44857m89423n98853l33334r7237j50386
14161A7885363q09158n98031J57407n36101o5278n24776j26418l57899l78757
14152A4646352j46002k81194k58262p68686J82598k15866k49098l83070P1590
14143A2598362p34974j8412Q7070l18414k32537j14169k63177J84053q61807K88986
14133A0614981k54342L2081m84499j24992j50002J185o24738J33128j07269K17076
14123I252609l00467R62l90523K39902m91210j86432J35292m73353L9077j2242
14113G813615k15413R6980j49332l06607k00659N8177p6390O0677m80424N05475
$$ plain form
14103 7106099 6940032 6576160 6607753 6602147 6392730 6374814 6690309 6201924 6213154 6216445 6029175
14092 6029175 5604987 5813298 5662008 5891191 5634155 5602708 5183676 5554001 5514184 5005042
14082 5005042 5087152 5212113 5370399 5169869 4652859 4891021 4781460 5068523 4814858 4798627
14072 4798627 4733470 4356331 4476534 4434648 4211007 4388421 4891756 4393923 4179912 3959834
14062 3959834 3925808 4053300 3793030 3813479 4322769 4024538 3918275 4126765 3721056 3744332
14052 3744332 3790105 3663629 3953133 3438685 3440804 3767411 4052687 3862608 3863229 3628399
14042 3628399 3625804 3500620 3331729 3429077 3383426 3309154 3128378 3279573 3124200 3353513
14032 3353513 3008864 3127047 3129517 2880959 3002785 2919517 2782324 2836773 3022380 2689814
$$ packed form
14103G106099j66067l63872L1593n606k09417j7916L15495m88385J1230L291j87270
14092F029175m24188K08311j51290K29183k57036l1447m19032L70325l9817n09142
14082E005042Q2110J24961J58286k00530n17010K38162j09561K87063k53665j6231
14072D798627o5157l77139J20203m1886k23641J77414N03335m97833k14011k20078
14062C959834l4026J27492k60270K0449N09290k98231j06263K08490m05709K3276
14052C744332M5773j26476K89504n14448K119L26607K85276j90079O21k34830
14042C628399k595j25184j68891R7348m5651p4272j80776J51195j55373K29313
14032C353513l44649J18183K470k48558J21826q3268j37193N4449J85607l32566
$$ plain form
14022 2689814 2966891 2465543 3139753 3078143 2421364 2780744 2838633 2621713 2807165 2591261
14012 2591261 3050739 2700557 2428776 2723456 2504024 2371107 2440393 2293826 2387611 2138694
14002 2138694 2108491 2296096 2169018 2313284 2409445 2160427 2024201 2391567 2476170 2150425
13992 2150425 2332344 1887357 2124909 2320321 2050972 2157274 2021349 2141904 1934455
13983 1934455 2162108 2199286 2108207 2344402 2259367 2720268 2794768 3529232 4059698 5874540
13973 5874540 8670350 13554570 23344760 32259470 22776886 14223384 9090879 6476783
13965 6476783 5371233 4419791 3786086 3520293 3046624 3073152 3197074 2402680 2345729 2689356
13955 2689356 2364518 2293483 2195798 2224520 1994091 2073486 1764210 2220093 1705156 1786661
$$ packed form
14022B689814K77077n01348O74210o1610o56779L59380N7889k16920J85452k15904
14012B591261M59478l50182k71781K94680k19432j32917O9286j46567R3785k48917
14002B138694l0203J87605j27078J44266R6161k49018j36226L67366Q4603l25745
13992B150425J81919m44987K37552J95412k69349J06302j35925J20555k07449
13983A934455K27653L7178r1079K36195q5035M60901P4500P34464N30466J814842
13973E874540K795810M884220R790190Q914710r482584q553502n132505k614096
13965F476783j105550r51442o33705k65793m73669K6528J23922p94394n6951L43627
13955B689356l24838p1035r7685K8722k30429P9395l09276M55883n14937Q1505
$$ plain form
13945 1786661 2150770 2122181 1696729 1890100 1620586 1576049 1640349 1792629 1906577 1556568
13935 1556568 1914466 1897170 1711675 1648424 1656642 1553422 1536114 1490987 1838530 1624520
13925 1624520 1739810 1340360 1524067 1675313 1511654 1481932 1135287 1620591 1476699 1422176
13915 1422176 1327488 1274565 957863 1506094 1490116 1178372 1311449 1159984 1535216 1566629
13905 1566629 1084740 1379609 1270096 1304672 1059288 1273286 1233407 1008389 1367508 1620234
13895 1620234 1194501 1742656 1244206 1338090 949172 959369 930688 1115106 879207 1167493
13885 1167493 1240524 1239551 1174757 883207 866901 1106323 1210316 1188923 1054425 1056567 955785
13874 955785 1117821 1304315 1316193 909950 1095430 1096430 1476318 1169663 884904 1085567
$$ packed form
13945A786661L64109k8589m25452J93371k69514m4537O4300J52280J13948l50009
13935A556568L57898j7296j85495o3251Q218j03220j7308m5127L47543k14010
13925A624520J15290l99450J83707J51246j63659k9722l46645M85304j43892n4523
13915A422176r4688n2923l16702N48231j5978l11744J33077j51465L75232L1413
13905A566629m81889K94869j09513L4576k45384K13998l9879k25018L59119K52726
13895A620234m25733N48155m98450R3884l88918J0197k8681J84418k35899K88286
13885A167493P3031r73o4794k91550j6306K39422J03993k1393j34498K142j00782
13874I55785J62036J86494J1878m06243J85480J000L79888l06655k84759K00663
$$ plain form
13864 1085567 1169786 1122312 817579 689812 1071558 927665 1260395 971841 892916 869651
13854 869651 1097707 1106871 1135984 1305948 1139191 772996 904142 1165639 861579 1039737
13844 1039737 972625 921848 876174 1156025 939505 991520 920736 736009 1051989 712852
13834 712852 909308 1003803 1182835 770764 794481 762283 688784 1060605 752771 805121
13824 805121 1277097 633811 1151031 1044430 673757 1051902 582180 904532 869700 603665
13814 603665 824942 982042 714495 722029 880211 713459 1027853 909112 710483 797098
13804 797098 764295 602122 611242 827666 435076 673615 780877 904977 593128 767657
13794 767657 705702 866206 458077 917795 665673 641716 626075 656788 916378 727802
$$ packed form
13864A085567Q4219m7474l04733j27767L81746j43893L32730k88554p8925k3265
13854H69651K28056R164K9113J69964j66757l66195J31146K61497l04060J78158
13844A039737o7112n0777m5674K79851k16520N2015p0784j84727L15980l39137
13834G12852J96456R4495J79032m12071K3717l2198p3499L71821l07834N2350
13824H05121M71976F33811N17220j06601l70673L78145m69722L22352l4832k66035
13814F03665K21277J57100k67547P534J58182j66752L14394j18741j98629Q6615
13804G97098l2803j62173R120K16424l92590K38539J07262J24100l11849J74529
13794G67657o1955J60504m08129M59718k52122k3957j5641L0713K59590j88576
$$ plain form
13784 727802 732147 530784 771972 863639 527995 529207 631119 311001 522435 360426
13774 360426 545225 654269 429425 629291 497507 755330 710517 480781 536606 923690
13764 923690 606375 762004 492981 697957 536254 411472 618695 514721 397049 646719
13754 646719 463076 353430 458741 489042 749480 771051 612174 538800 367413 713961
13744 713961 606876 609240 559527 580261 402599 439853 914970 565758 689357 508988
13734 508988 593506 383132 483661 757405 593249 783144 581896 413679 648310 670216
13724 670216 394912 776739 903919 423463 583767 589735 590014 633743 720109 430746 439112
13713 439112 631073 485737 477104 549030 267640 541928 611294 613816 434987 328371 519891
$$ packed form
13784G27802M345k01363K41188R1667l35644J212J01912C11001K11434j62009
13774C60426J84799J09044k24844J99866j31784K57823m4813k29736N5825L87084
13764I23690l17315J55629k69023K04976j61703j24782K07223j03974j17672K49670
13754F46719j83643j09646J05311L0301K60438K1571j58877p3374j71387L46548
13744G13961j07085K364m9713K0734j77662L7254M75117l49212J23599j80369
13734E08988Q4518k10374J00529K73744j64156J89895k01248j68217K34631K1906
13724F70216k75304L81827J27180D23463J60304N968K79M3729Q6366k89363Q366
13713D39112J91961j45336q633P1926B67640K74288O9366K522j78829j06616J91520
$$ plain form
13702 519891 372593 269647 311331 636331 297895 299379 546358 419046 560314 586811
13692 586811 486046 772077 852266 345475 416256 488011 332953 370353 482237 583206
13682 583206 435211 327992 627196 209604 408125 579504 437589 490089 192086 454665
13672 454665 358179 615980 281357 416065 136752 398474 536880 358480 421610 385107
13662 385107 617925 581935 676317 521259 199116 512130 611597 484653 480446 564994 740591
13651 740591 274020 12946 228632 458814 264641 529781 667578 191985 482832 259285
13641 259285 279054 510391 364265 547139 448374 674518 600922 545546 424689 390941
13631 390941 244792 588943 384978 217882 176363 321668 176604 98877 602431 87184
$$ packed form
13702E19891j47298j02946M1684L25000B97895J484K46979j27312J41268K6497
13692E86811j00765K86031Q0189C45475P0781P1755j55058L7400J11884J00969
13682E83206j47995j07219K99204B09604J98521J71379j41915N2500A92086K62579
13672D54665r6486K57801B81357J34708A36752K61722J38406j78400O3130l6503
13662C85107K32818l5990R4382j55058A99116L13014R9467j26944m207Q4548J75597
13651G40591B74020A2946K15686K30182j94173K65140J37797A91985K90847k23547
13641B59285J9769K31337j46126J82874r8765K26144p3596n5376j20857l3748
13631C90941j46149L44151k03965j67096m1519J45305j45064p7727N03554H7184
$$ plain form
13620 66869 304063 508532 403461 396753 384905 534295 269723 64467 68581 483447 279483
13609 279483 410526 469502 405452 394166 338829 265376 106295 479003 717274 504245
13599 504245 322361 476865 176711 317249 103128 488999 389423 -26409 427749 216603
13589 216603 427306 209118 369775 243573 99340 506073 371583 263622 127231 200889
13579 200889 344744 252791 380796 189690 187402 195392 594993 201847 180366 524842 428005
13568 428005 455995 619589 389767 346166 229153 26452 354491 126885 135832 428092
13558 428092 487529 490563 547751 462731 198393 237820 130457 385859 215633 268085 396621
13547 396621 305260 368705 328999 -46500 372283 257370 189849 113343 311192 200585 225299
$$ packed form
13620F6869K37194K04469j05071o708j1848J49390k64572F4467M114M14866k03964
13609B79483J31043N8976o4050j1286n5337p3453A06295L72708K38271k13029
13599E04245j81884J54504A76711J40538A03128L85871r9576b6409D27749k11146
13589B16603K10703B09118J60657j26202I9340M06733j34490j07961A27231P3658
13579B00889J43855r1953J28005A89690k288P990L99601B01847k1481L44476r6837
13568D28005K7990J63594k29822m3601j17013B6452L28039A26885Q947K92260
13558D28092N9437L034N7188q5020A98393L9427j07363K55402j70226N2452J28536
13547C96621r1361O3445l9706d6500C72283j14913o7521p6506J97849j10607K4714
$$ plain form
13536 225299 389424 68581 210085 383723 615466 298622 59184 178883 213394 104233
13525 208064 145613 192169 218099 174916 284139 102152 285116 62429 11920 393526 49460
13513 -20231 302611 267481 221367 213030 18414 567085 43961 144204 197364 522858 88299
13501 7602 369202 195997 282940 233982 404108 220574 205847 170990 247536 253466 249419
13490 249419 193107 350165 302108 160696 145952 142570 467549 303714 -26749 107398 -42489
13478 148748 223187 352484 661364 189463 230222 184319 57465 391334 -77246 278098
13467 389197 211353 426180 74565 521095 454263 508030 21844 -131572 348905 220240
13457 220240 24650 238395 237915 -30282 211185 145518 176089 396778 -108201 167173 188159
$$ packed form
13536B25299J64125F8581J41504J73638K31743B98622E9184J19699L4511A04233
13525B08064o2451M6556K5930m3183J09223A02152J82964F2429A1920L81606D9460
13513b0231C02611l5130m6114q337A8414N48671D3961J00243N3160L25494H8299
13501G602L61600j73205Q6943m8958J70126j83534j4727l4857P6546N930m047
13490B49419n6312J57058m8057j41412j4744l382L24979j63835b6749A07398d2489
13478A48748P4439J29297L08880A89463M0759m5903E7465L33869g7246B78098
13467C89197j77844K14827G4565M46530o6832N3767B1844a31572C48905j28665
13457B20240B4650K13745m80c0282B11185o5667L0571K20689a08201A67173K0986
$$ plain form
13446 188159 174504 247620 30675 24340 168547 132555 60245 336120 336499 158623 372231
13435 372231 -71988 311735 575150 279069 262764 428293 113408 260502 99708 247234
13425 247234 328457 463918 127801 193196 430596 214987 451779 230108 -117907 218191
13414 243978 30417 310130 448858 118141 83720 172850 80733 87329 2589 -53498 267060
13402 385251 270462 52029 230773 -58606 286946 4086 163594 264951 -42295 103361
13391 217050 24402 51889 160351 217444 -40329 -37606 290386 20117 354325 79256 -55849
13379 118159 -84042 88501 29290 366730 258233 446978 510602 111979 84359 31165 57623
13368 57623 -101446 -64704 344392 -313230 145111 360935 251527 268400 46115 46193 271755
$$ packed form
13446A88159j3655P3116C0675o335J44207l5992F0245K75875L79A58623K13608
13435C72231g1988C11735K63415B79069j6305J65529A13408J47094I9708J47526
13425B47234Q1223J35461A27801O5395K37400B14987K36792k21671a17907B18191
13414B43978C0417K79713J38728A18141l4421Q9130H0733O596B589e3498B67060
13402C85251j14789E2029J78744e8606B86946D086J59508J01357d2295A03361
13391B17050B4402K7487J08462N7093d0329K723B90386B0117L34208G9256e5849
13379A18159h4042H8501B9290L37440j08497J88745O3624A11979k7620C1165K6458
13368E7623a01446L6742C44392c13230A45111K15824j09408J6873D6115P8K25562
$$ plain form
13357 271755 311955 243239 -109688 -155891 238542 16644 356601 68972 65040 443030 58908
13345 143249 228578 -44850 136525 116049 -29045 270267 243493 82473 424407 201296 78649
13333 176155 85708 520728 390238 -107877 -236895 349093 193778 432345 208890 -71449
13322 113672 204112 220569 324568 118901 287366 314589 -233328 295002 178828 215813
13312 215813 574920 270628 187231 -34947 161789 304339 84377 222698 427519 -66958
13301 -92940 135058 144348 -47447 253728 3437 -193331 289308 12803 -26315 197787 -19291
13289 146815 144319 -25105 25613 154801 59504 169200 338302 202512 -50234 -244314 -185324
13278 -185324 74246 303616 -286371 223910 9037 180600 231425 16026 142123 100873 266721
$$ packed form
13357B71755M0200o8716a09688m6203B38542A6644L39957F8972l932L77990E8908
13345A43249Q5329d4850A36525k0476b9045B70267k6774H2473L41934B01296G8649
13333A76155H5708M35020j30490a07877j29018C49093j55315K38567B08890g1449
13322A13672R0440J6457J03999A18901J68465K7223b33328B95002j16174L6985
13312B15813L59107B70628q3397c4947A61789J42550H4377J38321K04821f6958
13301i2940A35058R290d7447B53728C437a93331B89308A2803b6315A97787a9291
13289A46815k496b5105B5613J29188E9504J09696J69102j35790e0234j94080N8990
13278a85324G4246K29370b86371B23910I037J71563N0825A6026J26097m1250J65848
$$ plain form
13267 266721 204270 178602 -50382 216737 52877 -219652 -48822 -28766 -121548 49295 -23123
13255 121968 176427 301638 -2484 80269 19961 115159 238986 55461 -37589 187834 137161
13244 137161 -109424 342882 372716 128289 -85922 -211435 295071 535634 171908 293464
13234 293464 20147 298087 -216266 79343 136620 288825 199064 92310 -6122 -134780 296933
13222 154874 -89385 171539 263615 193716 133548 307447 85528 297094 -142697 -13002 -6410
13210 108125 214838 125844 67213 179011 487933 -39977 456982 361370 37075 182051
13200 182051 199022 154039 104326 372173 88805 -50374 -13595 507045 195522 324010 106214
13188 93661 263410 138079 351569 -212134 -74532 272996 208753 181360 -190045 70562
$$ packed form
13267B66721o2451k5668e0382B16737E2877b19652d8822K0056r2782D9295b3123
13255A21968N4459J25211b484H0269A9961R5198J23827E5461c7589A87834n0673
13244A37161a09424C42882K9834A28289h5922j25513B95071K40563A71908J21556
13234B93464B0147K77940b16266G9343N7277J52205q9761I2310f122j28658B96933
13222A54874h9385A71539R2076o9899o0168J73899H5528K11566a42697a3002f410
13210A08125J06713q8994n8631J11798L08922c9977D56982r5612C7075J44976
13200A82051J6971m4983m9713K67847H8805e0374a3595E07045A95522J28488A06214
13188I3661J69749j25331K13490b12134g4532B72996o4243k7393a90045G0562
$$ plain form
13177 280473 435000 121210 140216 17590 89950 -152544 274467 455322 173122 104652
13167 104652 135981 146902 -82418 70167 265865 115618 41356 66800 74723 -18897 360570
13155 67126 15783 114603 -54265 -88140 65321 264343 -150379 -68295 -149043 143760 357862
13144 357862 171930 -48717 -44934 -33595 -283108 -76782 -64796 -197730 -140800 274958 -320830
13132 -186760 -131604 -46225 -47157 -84828 -25877 -152600 215139 -260331 128615 106036 -89233
13120 -41209 108614 79227 42097 -227170 -59563 96431 286049 200613 306238 -122762 287754
13108 -125507 -155537 142157 -97040 -349229 126278 385241 244404 115003 -116162 -249430
13098 -249430 91365 161437 354483 244924 25021 973 2838 148437 -3742 24537 -318001
$$ packed form
13177B80473J54527A21210J9006A7590P2360a52544B74467J80855A73122o8470
13167A04652L1329J0921h2418G0167J95698A15618D1356K5444P923a8897C60570
13155F7126A5783R8820e4265l3875F5321J99022a50379f8295q0748A43760K14102
13144C57862A71930d8717L783J1339k49513g6782J1986j32934N6930B74958c20830
13132a86760N5156d6225r32l7671b5877j26723B15139b60331A28615k2579h9233
13120d1209A08614k9387l7130b27170e9563I6431J89618q5436J05625a22762B87754
13108a25507l0030A42157i7040k52189A26278K58963j40837A15003a16162j33268
13098b49430I1365P0072J93046j09559B5021I73J865J45599c742B4537c18001
$$ plain form
13086 95086 57331 -247758 -60505 -243689 264882 171844 100840 240955 318427 -100830 -48008
13074 77374 -149864 -83020 193227 9055 -143981 -475373 8381 131880 -92422 -152102 3276
13062 187488 -212135 -211771 97121 -116208 -183458 -127982 228308 376273 162860 136915 85522
13051 85522 -179248 72278 -34526 -185038 -38007 67903 -97544 261646 270770 414386 363133
13040 363133 27884 66276 255803 122556 247418 -174361 339371 -57892 67389 -26641
13029 228025 211353 145759 207057 -44838 1379 141263 84056 75989 324711 132204 44906
13017 344043 -29445 -290625 -113037 -117049 73313 386444 299842 219954 -203609 300590 71873
13005 147796 185406 103570 -260454 31866 95180 16458 207431 420214 -52971 112369 -30378
$$ packed form
13086I5086l7755b47758f0505j83184B64882r3038p1004J40115P7472a00830d8008
13074G7374a49864O6844A93227I055a43981l31392H381J23499i2422n9680C276
13062A87488b12135L64I7121a16208o7250N5476B28308J47965A62860k5945n1393
13051H5522a79248G2278c4526j50512c8007F7903i7544B61646R124J43616n1253
13040C63133B7884L8392J89527A22556J24862a74361C39371e7892F7389b6641
13029B28025j6672o5594O1298d4838A379J39884n7207q067K48722A32204D4906
13017C44043b9445k61180a13037m012G3313L13131q6602p9888b03609C00590G1873
13005A47796L7610q1836b60454C1866O3314A6458J90973K12783e2971A12369c0378
$$ plain form
12993 -136099 314751 -71698 196364 -142877 95813 122384 -254326 109103 29810 211236
12983 211236 14608 47930 -63634 36220 -109236 -40310 -42239 -177546 -54412 -91286 143908
12971 55313 -65755 301925 26182 -36424 58217 -72179 94965 -104759 -80059 -191981 -77659
12959 -196975 -164611 -214975 114466 -229148 -256098 -64463 -244394 -7192 -140829 222912 -34593
12947 296754 -16010 -195409 23068 82062 -160593 -112134 -29373 -196592 240523 282239 -73131
12935 -138671 477 136689 177288 125953 6691 72449 -602995 -105261 143470 421913 91076
12923 -285185 -150999 202807 61045 135383 100752 85586 -111762 -67495 182947 77992 -5027
12911 128442 -150747 135375 392181 -63191 30080 69105 -401621 282598 119633 42933
$$ packed form
12993a36099C14751g1698A96364a42877I5813K6571b54326A09103B9810J81426
12983B11236A4608L3322f3634C6220a09236d0310j929j35307e4412l6874A43908
12971E5313f5755C01925B6182c6424E8217g2179I4965a04759K4700j11922g7659
12959a96975L2364n0364A14466b29148k6950f4463j79931g192j33637B22912c4593
12947B96754a6010j79399B3068N8994a60593M8459b9373j67219B40523M1716g3131
12935a38671D77J36212M0599n1335F691O5758f02995a05261A43470K78443I1076
12923b85185J34186B02807F1045P4338l4631j5166a11762M4267A82947G7992e027
12911A28442a50747A35375K56806f3191C0080L9025d01621B82598A19633D2933
$$ plain form
12900 32954 97024 42356 -56312 -291115 38157 -24068 52006 -149774 292575 101156 13569
12888 -142329 -28512 80331 154005 205357 -115109 374180 110154 -56987 63251 1970 -72256
12876 -38404 -130432 170844 -280621 -65365 63534 189329 148665 -7429 -310966 120657 10591
12864 106933 69429 -7531 -18154 -87359 63192 -6659 168797 80156 -203635 97789 115204
12853 115204 -17535 168755 -127626 -99502 -130127 114824 -265401 232402 231964 -220035 -159082
12842 -159082 -29224 -166247 37046 113557 40480 4688 -73696 277472 328456 -262151 -56163
12830 -73255 47437 202332 24529 155427 -30004 19417 -85612 78547 125572 -58205 115768
12818 -60925 22521 -147293 86485 -79976 124806 -87120 233928 -152031 207517 27473 23843
$$ packed form
12900C2954O4070D2356e6312k34803C8157b4068E2006a49774B92575A01156A3569
12888a42329b8512H0331P3674N1352a15109C74180A10154e6987F3251A970g2256
12876c8404r2028A70844b80621f5365F3534J25795m0664g429l03537A20657A0591
12864A06933l7504g531j0623o9205F3192f659A68797H0156b03635I7789J7415
12853A15204a7535A68755a27626K8124l0625A14824b65401B32402m38b20035O0953
12842a59082b9224j37023C7046P6511D0480D688g3696B77472N0984b62151e6163
12830g3255D7437J54895B4529J30898c0004A9417h5612G8547M7025e8205A15768
12818f0925B2521a47293H6485g9976A24806h7120B33928a52031B07517B7473l630
$$ plain form
12807 23843 145118 -137320 -100566 155776 -112535 -217542 162934 -2450 -8949 -4006 -46855
12796 -46855 221320 478193 -335245 -66965 -16059 -129170 65336 22532 -113418 -60261 67025
12784 -55681 -111980 76463 -62928 -209019 -11533 -126697 290628 331473 45876 42442 94243
12773 94243 381471 77469 -216833 30081 -134772 -314153 81662 228499 -69941 165516
12762 98289 -269519 -66029 -63452 104803 502628 178848 -97391 -119027 6969 100963 -57753
12750 -42494 -11492 -82035 88236 -93409 1320 -140476 -60519 52679 -239573 -29695 142768
12738 -243823 -263466 -175423 -154519 73458 -130089 -230788 -490833 -141909 22646 -88289 113400
12726 -68567 -183163 -268030 -128814 -15824 -145169 173270 181591 -102327 -338475 25250 -140611
$$ packed form
12807B3843J21275a37320L6754A55776a12535j05007A62934b450o499d006m2849
12796d6855B21320K56873c35245f6965a6059j13111F5336B2532a13418N3157F7025
12784e5681n6299G6463f2928j46091a1533j15164B90628M0845D5876l434N1801
12773I4243K87228G7469b16833C0081a34772j79381H1662J46837f9941A65516
12762I8289b69519f6029K577A04803L97825A78848i7391k1636F969R3994e7753
12750d2494a1492p0543H8236i3409A320a40476f0519E2679b39573b9695A42768
12738b43823j9643Q8043K0904G3458a30089j00699k60045a41909B2646h8289A13400
12726f8567j14596q4867a28814a5824j29345A73270Q321a02327k36148B5250a40611
$$ plain form
12714 211716 65008 49183 15465 148173 -168159 4160 -66501 -226326 33546 67340 88807
12703 88807 -41992 -197176 34090 329023 88910 -41492 292358 75533 164477 141166 99589
12692 99589 234573 232068 64021 88507 190798 231472 -78549 248389 143367 106831 -125472
12680 -138250 199337 68469 -390766 232969 -187741 -87296 46263 163731 -60218 -33846
12670 -33846 -213285 -85525 -20149 401250 -169078 207782 -130353 -11749 14241 -54844 59324
12658 370175 110799 72866 159443 -99389 64413 96457 239459 -146774 -40954 -304442 9742
12646 -27337 -379090 86968 201738 14772 -46611 3257 -79077 65245 275385 -93915 187616
12634 61992 348426 -81741 -199061 154239 -61 -25028 381940 -85816 80338 -69206 -185953
$$ packed form
12714B11716F5008j5825A5465J32708a68159D160f6501j59825C3546L3794K1467
12703H8807d1992j55184C4090K94933H8910d1492B92358G5533Q8944k3311m1577
12692I9589J34984k505F4021K4486J02291M0674g8549B48389j05022l6536a25472
12680a38250A99337F8469c90766B32969a87741h7296D6263J17468f0218K6372
12670c3846j79439h5525b0149D01250a69078B07782a30353a1749A4241e4844E9324
12658C70175A10799l7933Q6577i9389F4413L2044J43002a46774d0954k63488I742
12646b7337l51753H6968J14770A4772d6611C257g9077F5245K10140i3915A87616
12634F1992K86434h1741j17320A54239f1k4967C81940h5816H0338f9206j16747
$$ plain form
12623 -185953 -320114 -96249 -187889 336957 47716 -93710 -73399 -87966 14965 187782 396948
12612 396948 -109199 392416 4661 -33389 -196355 161213 -95653 52322 304294 174447
12602 174447 527933 390097 151961 -12993 140163 100711 -101856 54419 116091 220204
12592 220204 179759 506940 -131174 -325813 1899 -52048 129052 64753 123054 339982 165462
12580 135785 73916 302696 -97677 61941 84834 -35339 -86249 4606 45751 25784 80185
12569 80185 108642 61633 115920 13347 -78576 -172810 -46725 18225 6582 -96640 -117148 74918
12556 261406 70805 221713 36069 -112624 1003 11519 -149688 368014 -83555 -114861 -31426
12544 -208072 84624 -323272 428876 115840 -186318 140897 120476 165594 -93516 207973
$$ packed form
12623a85953j34161i6249r1640C36957D7716i3710K0311j4567A4965J72817K09166
12612C96948a09199C92416D661c3389j62966A61213i5653E2322K51972j29847
12602A74447L53486j37836A51961a2993A40163l9452a01856E4419O1672J04113
12592B20204m0445L27181a31174j94639A899e2048A29052o4299N8301K16928A65462
12580A35785o1869K28780i7677F1941K2893c5339n0910D606M1145j9967N4401
12569H0185K8457m7009N4287A3347g8576r4234d6725A8225F582i6640k0508G4918
12556B61406G0805J50908C6069a12624A003J0516a49688C68014h3555l1306c1426
12544b08072H4624c23272D28876A15840a86318A40897k0421M5118i3516B07973
$$ plain form
12533 -5092 -24659 -223546 78586 59534 -131280 -123465 51806 -154791 -114565 220834 356280
12522 356280 -111485 -209525 -351877 6293 -483 -75095 -95589 174072 93266 78637 93568
12511 93568 7239 -225666 -43585 28192 10029 -51509 235779 -34899 -369379 -97135 136665
12499 -360578 42423 -106091 -142529 145164 -4272 -38966 -138507 -97152 -227515 235330 127234
12488 127234 40392 -122096 -74886 -67711 -1420 -116821 187038 -6592 -73099 73358 181826
12477 181826 -145652 -167110 -84094 123097 -8772 49606 180545 -126213 131538 -393496
12466 -179951 324422 13431 126193 -29489 26926 326159 326088 281804 177943 109019 -22390
12454 143206 68584 -159861 -123387 330396 333932 -239005 80069 -50352 -77814 191974 57191
$$ packed form
12533e092j9567j98887G8586j9052a31280P815E1806a54791M0226B20834J35446
12522C56280a11485r8040j42352F293d83p4612k0494A74072q0806j4629J4931
12511I3568G239b25666d3585B8192A0029e1509B35779c4899l34480i7135A36665
12499c60578D2423a06091l6438A45164d272l4694r9541M1355j30363B35330j08096
12488A27234D0392a22096M7210P175a420j15401A87038f592o6507G3358J08468
12477A81826a45652k1458Q3016A23097h772D9606J30939a26213A31538c93496
12466a79951C24422A3431J12762b9489B6926K99233p1m4284j03861o8924b2390
12454A43206F8584a59861L6474C30396L536b39005H0069e0352k7462A91974E7191
$$ plain form
12442 -56808 41638 -250042 -288655 370550 195007 38254 97842 -42530 -269672 178624 -202388
12430 265292 81492 -278838 139031 3333 -281324 254911 -69777 -146093 157621 -34141 -120989
12419 -120989 -194745 -261122 235916 65314 176550 -130181 407144 25228 339522 -108009
12408 -267887 -280559 414521 21616 -226268 60124 -45466 -103800 -120858 -63544 -56699 9261
12396 180921 178332 -177918 -192023 -20765 -82094 -33914 -58642 -41944 36199 70473 44552
12385 44552 -12840 109909 -455867 115988 -196061 14302 -471269 -364217 -197132 -88425
12374 -583 281411 190255 -70914 325289 -78102 124294 7421 280824 -155809 -17129 -98587
12363 -98587 403225 15434 92824 139171 30698 91702 241520 213850 131656 151313 126237
$$ packed form
12442e6808D1638b50042l8613C70550j75543C8254N9588d2530k27142A78624b02388
12430B65292H1492b78838A39031C333b81324B54911f9777p6316A57621c4141q6848
12419a20989p3756o6377B35916F5314J11236a30181D07144B5228L14294a08009
12408b67887j2672D14521B1616b26268F0124d5466n8334j7058N7314O845I261
12396A80921k589a77918j4105b0765o1329c3914k4728J6698C6199L4274k5921
12385D4552a2840A09909d55867A15988a96061A4302d71269J07052J67085h8425
12374e83B81411r1156g0914C25289g8102A24294G421K73403a55809a7129q1458
12363i8587D03225A5434P7390M6347C0698O1004J49818k7670q2194J9657k5076
$$ plain form
12352 126237 63370 -54991 -196472 100883 242040 125454 478963 -9246 -246453 98837
12341 -92367 -160670 -120163 112608 33870 -159489 150914 -44082 -174320 -596 -58054 -131292
12330 -131292 171195 35585 88875 -420179 57362 172965 177912 -364944 -131028 -148756 -50747
12318 176980 -30314 -97101 -30581 -80037 305013 251775 -95853 306324 151231 -108697 39389
12306 -353325 -94230 218503 -76438 3191 57507 89854 495019 248187 202727 181544 148158
12295 148158 309111 -32553 112287 -26605 -167673 233683 -2262 195327 62720 -10119 -92760
12284 -92760 -228483 -139328 85871 -288523 -521 111213 -63868 429485 54463 191734 349724
12273 349724 63326 -14259 337098 63106 -47893 131992 152248 99677 18128 78415 182811
$$ packed form
12352A26237o2867e4991j41481A00883J41157j16586L53509i246k37207I8837
12341i2367o8303M0507A12608C3870a59489A50914d4082j30238e96n7458p3238
12330a31292A71195C5585N3290d20179E7362J15603M947c64944a31028j7728e0747
12318A76980c0314o6787c0581m9456C05013n3238i5853C06324A51231a08697C9389
12306c53325i4230B18503g6438C191N4316L2347M05165k46832m5460k1183l3386
12295A48158J60953c2553A12287b6605j41068B33683b262A95327F2720a0119q2641
12284i2760j35723Q9155H5871b88523e21A11213f3868D29485E4463J37271J57990
12273C49724F3326a4259C37098F3106d7893A31992K0256n2571A8128O0287J04396
$$ plain form
12262 182811 345577 114823 181428 126505 87931 57723 298920 374979 -91128 -165515 3274
12250 554020 -38916 -130648 121662 155559 192553 305968 327603 335145 57085 -142764 -81294
12239 -81294 -287908 250863 102857 22996 379156 59103 191108 650936 72648 -70029
12228 23286 80057 -517 256574 -27913 -22662 40945 -43145 95199 101901 294534 -113689 -46683
12215 106709 189102 437065 -136129 417892 221512 89414 -53870 -109713 96004 -160865
12204 129613 189771 170269 130697 227879 230095 449362 176340 256784 77640 -4902 102812
12192 249922 -217772 150392 -174543 50221 -9546 144282 -93625 89299 84422 -12519 -90820
12181 -90820 303545 143830 122301 152923 20320 87768 182910 -207979 -17280 230237 -260983
$$ packed form
12262A82811J62766A14823O6605n4923l8574l0208K41197P6059i1128p4387C274
12250E54020c8916r1732A21662L3897L6994J13415K1635P542E7085a42764O1470
12239h1294k06614B50863A02857B2996L56160E9103J32005M59828G2648g0029
12228B3286N6771e17B56574b7913N251D0945d3145I5199O702J92633a13689d6683
12215A06709Q2393K47963a36129D17892j96380H9414e3870n5843I6004a60865
12204A29613O0158j9502l9572R7182K216K19267A76340Q0444G7640d902A02812
12192B49922b17772A50392a74543E0221i546A44282i3625H9299m877a2519p8301
12181i0820C03545A43830k1529L0622B0320O7448R5142b07979a7280B30237b60983
$$ plain form
12169 3380 134021 -7383 28823 71549 -98330 -58231 64068 119914 -60682 178836 239338 -91807
12156 -194640 20399 299256 342094 138207 311636 -36914 -14288 34563 244817 395737
12146 395737 193451 320847 -103014 167367 121722 206531 -325969 386647 397976 -37601
12135 -19642 -102324 59375 -58031 76755 -30642 -139602 -289658 63935 -162927 120796 -131059
12123 -106523 -241430 184907 195056 280205 90986 126867 51470 34179 -34143 215563 -119931
12111 201120 36214 -115253 -230701 -210146 -37237 525201 -15200 97896 56728 156621 262159
12100 262159 -115674 -132814 -103866 272719 -60556 189405 447610 85174 124984 84050 68906
12089 68906 172736 151444 198702 -252809 217000 26176 55522 222850 228319 -43686 172428
$$ packed form
12169C380J30641g383B8823M2726i8330M0099F4068N5846f0682A78836O0502i1807
12156a94640B0399K78857M2838A38207J73429c6914a4288C4563K10254J50920
12146C95737A93451J27396a03014A67367m5645Q4809c25969C86647J1329c7601
12135a9642q2682E9375e8031G6755c0642j08960j50056F3935a62927A20796a31059
12123a06523j34907A84907J0149Q5149I0986L5881E1470j7291c4143B15563a19931
12111B01120C6214a15253j15448K0555c7237E25201a5200I7896m1168R9893J05538
12100B62159a15674j7140K8948B72719f0556A89405K58205H5174L9810m0934j5144
12089F8906J03830k1292M7258b52809B17000B6176K9346J67328N469d3686A72428
$$ plain form
12077 187887 253082 -283080 30614 107885 -96284 227219 123029 58287 241904 354961
12067 354961 60428 193900 144038 -28023 245942 296279 254087 217371 -83601 108827 -9675
12055 71028 -99410 144889 -146484 369910 347790 -19516 49906 -34321 -149430 -137984 -151744
12044 -151744 142461 -163322 -373419 264937 53203 -209495 20569 283530 -166712 207169
12033 -139753 299133 -168767 -278581 33909 196837 -233385 -167077 -418060 -195400 52168
12022 -169630 91830 -2050 390106 100285 -105509 -228002 181953 -78130 -21077 -72382 -59626
12011 -59626 218651 -189896 -65979 7520 95553 -20417 -262810 -22502 87444 -15812 -135320
12000 -135320 136311 28582 -95184 163262 -306111 -109778 172579 294523 239890 -333713
$$ packed form
12077A87887O5195b83080C0614P7271i6284B27219j04190E8287J83617J13057
12067C54961F0428J33472m9862b8023B45942N0337m2192l6716h3601A08827i675
12055G1028i9410A44889a46484C69910k2120a9516D9906c4321j15109J1446j3760
12044a51744A42461a63322k10097B64937E3203b09495B0569K62961a66712B07169
12033a39753B99133a68767j09814C3909J62928b33385O6308k50983a95400E2168
12022a69630I1830b050C90106A00285a05509j22493A81953g8130b1077n1305J2756
12011e9626B18651a89896f5979G520Q8033b0417k42393b2502H7444a5812j19508
12000a35320A36311B8582i5184A63262c06111a09778A72579J21944n4633c33713
$$ plain form
11989 -19345 212374 -69801 -45000 153001 4258 -72354 138923 282901 -101312 -102998 -2636
11977 115772 -40602 100502 -121447 -145751 172042 156314 69209 318 -198260 -68041 -72800
11966 -72800 99454 251805 -126007 -291665 181770 -167970 -162677 -99317 -287957 -135971
11955 -232549 -90601 268313 292339 50818 -33726 19085 -2389 -116210 -4312 68582 -296171
11943 149312 -244934 -172133 -289161 -357619 94872 175671 -218737 -79862 -9572 57350 -223303
11931 -127189 -186089 67024 -84934 17215 -206345 -166936 205951 260004 -45345 82552 53603
11920 53603 -4382 116917 74920 6654 -64610 173013 -112114 83199 79309 -57105 -143057 42193
11907 -85489 -243110 122749 -140172 59967 179735 -142694 -123131 5877 -72903 12385 7241
$$ packed form
11989a9345B12374f9801K4801A53001D258g2354A38923J43978a01312j686b636
11977A15772d0602A00502a21447k4304A72042j5728F9209C18a98260f8041m759
11966g2800I9454J52351a26007j65658A81770a67970N293O3360j88640a35971
11955b32549i0601B68313K4026E0818c3726A9085b389j13821d312F8582b96171
11943A49312b44934P2801j17028o8458I4872Q0799b18737g9862i572E7350b23303
11931a27189n8900F7024h4934A7215b06345L9409B05951N4053d5345H2552k8949
11920E3603d382A16917m1997F654f4610A73013a12114H3199l890e7105q5952D2193
11907h5489j57621A22749a40172E9967J19768a42694J9563E877g2903A2385n144
$$ plain form
11896 7241 -229693 -35329 197318 89855 127068 -251239 -274368 -803 -216638 40822 -585 -115393
11884 -115393 360794 -79482 -155290 -100585 246094 210360 -207635 39762 25509 16506 194585
11873 194585 301069 -163766 -131182 151051 -92112 -237069 -110810 73191 15516 26196
11863 26196 -299987 1794 -25902 -326401 -266896 -72169 17487 211677 -337855 141972 82699
11852 82699 85199 67151 -74694 -271314 -253095 -216401 -172769 274707 -72193 -106296 -95705
11841 -95705 94582 -73288 -64787 109398 70989 -349862 105768 -30149 -103600 -88759 343755
11829 36634 28515 -200251 -93551 -69564 161966 -459994 -195559 165356 467870 -137684
11818 306086 47222 67718 -85798 -140320 -269795 428220 -196389 -101110 -159050 -15788 226199
$$ packed form
11896G241b29693c5329A97318H9855L7213b51239k3129h03k15835D0822e85j14808
11884a15393C60794g9482p5808N4705B46094l5734b07635C9762j4253r003J78079
11873A94585J06484a63766L2584A51051i2112j44957a10810G3191A5516J0680
11863B6196b99987A794b5902l00499N9505g2169A7487J94190c37855A41972n9273
11852H2699K500j8048g4694j96620J8219L6694M3632B74707g2193l4103J0591
11841i5705I4582g3288Q501A09398l8409c49862A05768c0149p3451J4841C43755
11829C6634q119b00251i3551K3987A61966d59994a95559A65356L02514a37684
11818C06086D7222K0496h5798n4522j29475D28220a96389R5279n7940a5788B26199
$$ plain form
11806 -128116 -13268 -252516 -118358 -156 218791 47277 84114 -44605 -73792 159869 -51414
11794 135444 -83977 48402 -2993 -192 -74312 44104 58321 8018 49887 -108725 219815 -173663
11781 -51849 -97075 431162 181826 -269113 -228108 69553 218141 55600 -212243 -67261 124800
11769 58023 4506 57670 -78322 -10606 -102610 225996 12016 109416 -33426 -40932 -65285 63481
11756 -105471 -110343 110926 -282188 207928 283711 -128459 -138640 286738 -47445 297615
11745 362589 -178352 -297171 -461172 10484 167677 446877 -93506 -195542 -15056 87100
11734 64155 -561782 132344 -7358 198496 -25063 109268 -14710 74884 -71528 85295 -26 -120878
11722 -120878 225849 350562 -192076 -138600 12122 -221941 152251 -164140 108256 113645
$$ packed form
11806a28116a3268k39248a18358a56B18791D7277L6837d4605k9187A59869e1414
11794A35444h3977D8402b993a92p4120D4104J4217H018M1869a08725B19815a73663
11781e1849m5226D31162A81826b69113M1005F9553J48588E5600b12243f7261A24800
11769E8023D506N3164g8322a0606r2004B25996A2016R7400c3426p506k4353F3481
11756a05471m872A10926b82188B07928P5783a28459j0181B86738d7445B97615
11745C62589a78352j18819j64001A0484J57193K79200i3506j02036a5056H7100
11734F4155e61782A32344g358A98496b5063A09268a4710G4884g1528H5295b6j20852
11722a20878B25849J24713a92076N3476A2122b21941A52251a64140A08256N389
$$ plain form
11712 113645 -220996 -200303 19113 -32816 -84876 -132035 -142854 65274 -277248 157407 -34190
11700 54841 45934 -275782 392908 210923 66943 14161 92682 -345992 -134775 59745 -266665
11688 -198423 27191 350736 46244 124835 -54393 -183639 -33144 -412632 72173 -92321 134135
11676 66630 43240 97862 208342 -127765 493717 189966 121632 180425 -233624 2096 228646
11665 228646 59273 -177964 -2237 -93180 -48196 -24698 -273304 71878 -119414 -96381 242843
11653 2551 -34650 7484 20719 -27829 -236369 -256475 196679 173693 -311772 56248 131055
11642 131055 121988 -30012 60330 77927 -28993 -82565 20618 252090 -29164 437690 -437793
11630 52527 -173785 -63802 -250624 163192 -156212 29357 56204 180212 131049 -5201 -28211
$$ packed form
11712A13645b20996K0693A9113c2816n2060m7159j0819F5274b77248A57407c4190
11700E4841q907b75782C92908j81985F6943A4161P8521c45992a34775E9745b66665
11688a98423B7191L23545D6244P8591e4393j29246c3144l79488G2173i2321A34135
11676F6630k3390N4622J10480a27765D93717A89966o8334N8793b33624B096K26550
11665B28646E9273a77964b237r0943M4984K3498k48606G1878a19414K3033B42843
11653B551c4650G484J3235b7829k08540k0106A96679k2986c11772E6248P4807
11642A31055r067c0012F0330J7597b8993n3572B0618K31472b9164D37690d37793
11630E2527a73785f3802j86822A63192a56212B9357K6847J24008m9163e201k3010
$$ plain form
11619 -28211 40573 -124272 189987 -89551 82696 148377 28078 226846 -50011 409225 85335
11607 303121 -20268 272821 -67702 -126283 -27747 43744 -200133 -10484 102088 -212363 -99331
11595 -64613 371907 145552 190419 319177 84248 -206819 36861 86469 60166 -168163 -192232
11584 -192232 -344491 -139904 -33634 100254 -102040 180835 -99203 -788 -295384 46765 -10401
11572 82343 39105 -144947 -108633 25898 30852 17271 44667 161234 296232 91607 -4715
11560 103007 -284446 -197894 255641 56607 219592 295825 -18913 53050 80852 93947 -180389
11548 238158 1164 104778 -71150 -326891 104296 247667 35502 33815 81066 136471 270762
11537 270762 39911 112651 30723 -108770 5215 -182144 -42117 -28107 56768 -29274 -228934
$$ packed form
11619b8211D0573a24272A89987h9551H2696O5681B8078J98768e0011D09225H5335
11607C03121b0268B72821f7702n8581b7747D3744b00133a0484A02088b12363i9331
11595f4613C71907A45552M4867J28758H4248b06819C6861M9608k6303a68163k4069
11584a92232j52259a39904c3634A00254a02040A80835i9203g88k94596D6765a0401
11572H2343C9105a44947L6314B5898M954j3581K7396J16567J34998I1607d715
11560A03007b84446Q6552B55641E6607J62985P6233a8913E3050K7802J3095a80389
11548B38158A164J03614g1150k55741A04296J43371C5502j687M7251N5405J34291
11537B70762C9911P2740C0723a08770E215a82144d2117J4010E6768b9274j99660
$$ plain form
11526 -228934 -10396 272933 -378115 -95474 72619 63 -216269 126145 100207 43597 59943
11515 59943 -22390 -245379 -1578 238221 -146871 249568 258077 -133544 -27710 -24096 -97278
11504 -97278 265823 97172 -211961 121259 -190564 -19045 57471 116705 95485 -20325 142076
11492 -113981 -45465 -92326 288255 441938 64097 3573 -83180 42633 208397 -24692 -189173
11481 -189173 95840 -153164 -66678 210728 -71487 11002 186115 -36357 -14759 -94134 200203
11469 -115731 151203 335518 27455 110951 181045 47203 -131779 88738 196528 6147 251660
11458 251660 7700 -136367 472018 -150297 67827 220762 130429 163077 135955 79668 30014
11446 -65410 -19578 257924 170726 120478 192151 207712 97113 302101 352243 248556 -74467
$$ packed form
11526b28934a0396B72933c78115i5474G2619F3b16269A26145k5938D3597J6346
11515E9943b2390k22989a578B38221a46871B49568Q509a33544b7710L614p3182
11504i7278B65823I7172b11961A21259a90564a9045E7471N9234k1220b0325A42076
11492a13981d5465m6861B88255J53683F4097C573h3180D2633J65764b4692j64481
11481a89173I5840a53164f6678B10728g1487A1002J75113c6357a4759p9375B00203
11469a15731A51203J84315B7455Q3496P0094D7203a31779H8738J07790F147K45513
11458B51660G700a36367D72018a50297F7827J52935r0333L2648k7122n6287C0014
11446f5410a9578B57924q7198n0248P1673J5561I7113K04988N0142j03687g4467
$$ plain form
11434 -41911 91346 -58934 220148 22267 221490 -226202 220268 224331 203226 200275 -43013
11422 -127362 268790 174409 -192347 -34209 -220502 203661 -133458 235337 371654 -106452
11411 116682 25897 186380 58136 100167 60671 99308 209942 49741 -6027 -260453 116943
11399 82725 16147 -40211 -246106 -9233 223564 135677 52980 51407 -337764 -108397 -302018
11388 -302018 53559 -26146 22777 189233 358443 -15543 322653 -153625 -227925 -49029 -150232
11377 -150232 88684 81060 -37646 -43511 1922 -361759 12155 61647 -453906 -206881 95190
11365 -229784 -71891 -369432 -215343 -55778 41220 -72061 -95633 -39100 -6533 272707 312888
11354 312888 -253099 -51240 47437 137076 -382655 121438 318135 -392794 -69688 -312714
$$ packed form
11434d1911I1346e8934B20148B2267J99223b26202B20268M063k1105k951d3013
11422a27362B68790r4381a92347c4209j86293B03661a33458B35337J36317a06452
11411A16682B5897J60483E8136M2031l9496L8637J10634D9741f027k54426A16943
11399H2725A6147d0211k05895i233B23564q7887E2980j573c37764a08397j93621
11388c02018E3559b6146B2777J66456J69210a5543C22653a53625p4300d9029j01203
11377a50232H8684p624c7646n865A922c61759A2155M9492d53906b06881I5190
11365b29784g1891k97541J54089e5778D1220g2061k3572c9100f533B72707M0181
11354C12888b53099e1240D7437Q9639c82655A21438J96697c92794f9688k43026
$$ plain form
11344 -312714 30444 -80526 208613 97207 -114422 -69351 -124868 -310926 -28953 -176812 36280
11332 116684 -211416 257693 67795 163263 -105853 217897 -143671 48418 300501 220512
11322 220512 5693 -128089 -33686 -192270 185305 72986 143032 -91685 243639 72732 128865
11311 128865 62702 273580 -22292 -256491 -83713 3428 -231123 -72092 -61625 -112525 -69932
11300 -69932 -150699 127585 76831 -80489 67295 -76359 -174502 -39716 -228865 -307714 -202414
11289 -202414 -467239 -155752 -308989 -72651 -302926 28479 63549 249054 -501842 39688
11278 -25849 57858 -51125 -222010 49032 1566 76654 -24962 -238328 33386 95811 17721
11266 106953 -233439 185009 -11704 19798 -65033 -171358 -18671 -110980 -195663 -220746 304938
$$ packed form
11344c12714C0444h0526B08613I7207a14422M5071n5517j86058b8953j47859C6280
11332A16684b11416B57693F7795R5468a05853B17897a43671D8418K52083p9989
11322B20512E693a28089c3686j58584A85305G2986P0046i1685B43639G2732N6133
11311A28865F2702K10878b2292k34199h3713C428b31123g2092J0467n0900M2593
11300f9932q0767A27585n0754h0489F7295g6359r8143c9716j89149p8849J05300
11289b02414k64825a55752j53237g2651k30275B8479L5070J85505e01842C9688
11278b5849E7858e1125j70885D9032A566P5088b4962k13366C3386O2425A7721
11266A06953b33439A85009a1704A9798f5033j06325a8671r2309q4683k5083C04938
$$ plain form
11254 -3954 -68107 38249 -266483 39406 4833 124986 -50287 -172755 192975 -109527 263068
11242 22698 -41598 -197516 158046 -175992 -44790 -141548 -19449 -99397 -461414 -106809 109125
11230 -142422 -269814 56933 -80742 111453 -74276 195720 82211 -156504 -188527 -135348 -172076
11219 -172076 89040 -236664 -72191 218756 -51838 -206736 174884 -211951 784 -497130 -387993
11208 -387993 -143421 99297 -296307 -418774 -242842 29240 -265760 -35142 -6133 304388
11197 -192799 -5955 -5677 -176103 -47110 -237007 70122 37628 -205297 -87798 -52829 -189227
11186 -189227 121310 -240106 123263 -42422 -37289 49443 -65311 -42791 126623 44437 85133
11175 85133 -113534 -160775 186831 -167382 108750 136152 40335 300438 -239862 -142202
$$ packed form
11254c954o4153C8249b66483C9406D833J20153e0287j22468A92975a09527B63068
11242B2698d1598j55918A58046a75992d4790r6758a9449p9948l62017a06809A09125
11230a42422j27392E6933h0742A11453g4276A95720H2211a56504l2023N3179l6728
11219a72076H9040b36664g2191B18756e1838j54898A74884b11951G84d97130J09137
11208c87993a43421I9297b96307j22467J75932B9240b65760c5142f133C04388
11197a92799e955K78j70426d7110j89897G0122l2494b05297h7798L4969j36398
11186a89227A21310b40106A23263d2422N133D9443f5311K2520A26623D4437M0696
11175H5133a13534m7241A86831a67382A08750K7402D0335K60103b39862R7660
$$ plain form
11165 -142202 -18159 -349810 -59978 -247336 137440 -87110 -345331 -245868 -130192 -123648 -54525
11153 -10283 450871 267847 83725 -71835 -72286 261134 -99967 -404822 5315 176005 -218363
11141 13107 86929 -152824 -85399 114976 972 18345 23769 87796 172350 -103483 -215332
11130 -215332 -32510 122326 -135234 -25892 -28815 306465 -144372 -149858 -232724 73651 38547
11119 38547 -38343 -260964 -253283 -102727 -146870 -58190 277261 65994 134398 25696 104266
11108 104266 -6388 -95129 -15172 132007 113084 -267907 24549 81084 279122 -37570 -11690
11096 112203 228773 -91300 -179317 15990 221589 -180173 221748 154689 35464 -256240
11085 238151 -2016 68150 114366 25228 37475 -85879 18550 137176 291473 44584 162943
$$ packed form
11165a42202a8159l31651e9978j87358A37440h7110k58221R9463J15676O544e4525
11153a0283D50871j83024H3725g1835m51B61134i9967l04855E315J70690b18363
11141A3107P3822a52824O7425A14976I72J7373N424O4027Q4554a03483j11849
11130b15332c2510A22326a35234b5892k923C06465a44372n486q2866G3651l5104
11119C8547c8343k22621P681a02727m4143e8190B77261F5994O8404B5696P8570
11108A04266f388q8741a5172A32007j8923b67907B4549N6535J98038c7570a1690
11096A12203J16570i1300q8017A5990K05599a80173B21748o7059C5464b56240
11085B38151b016F8150M6216B5228J2247h5879A8550J18626J54297D4584J18359
$$ plain form
11074 162943 -66726 98076 107670 -123871 104736 59274 175086 313042 9647 132872 233528
11063 233528 2994 38714 293748 39010 105841 442965 230688 37776 54880 89301 282705
11052 282705 -67098 -3061 186508 163857 525069 20889 167707 218049 142244 546368 659027
11041 659027 292170 129199 513687 511355 544072 317166 140529 496870 414184 365695
11031 365695 417346 557583 626047 595147 385947 853469 400344 492104 661500 611732
11021 611732 421797 336100 555202 297960 278984 386439 319393 497051 517629 332617
11011 332617 452299 299269 494578 452176 373767 346346 738696 605978 380236 461776
11001 461776 547787 320075 379943 605263 340865 158374 507007 371009 525538 281594
$$ packed form
11074A62943f6726I8076R594a23871A04736m5462J15812J37956I647J23225J00656
11063B33528B994L5720K55034C9010O6831L37124k12277C7776J7104L4421J93404
11052B82705f7098c061A86508k2651L61212B0889J46818N0342p5805M04124J12659
11041F59027B92170A29199L84488k332L2717k26906A40529L56341q2686m8489
11031C65695N1651J40237O8464l0900k09200M67522D00344R1760J69396m9768
11021F11732j89935q5697K19102k57242j8976J07455o7046J77658K0578j85012
11011C32617J19682j53030J95309m2402p8409k7421L92350j32718k25742Q1540
11001D61776Q6011k27712N9868K25320k64398A58374L48633j35998J54529k43944
$$ plain form
10991 281594 427134 453474 527166 721696 69403 406317 719710 598439 576481 611477
10981 611477 337988 575051 428960 594479 331889 243205 662827 612862 575553 380203
10971 380203 391473 588912 351509 550448 644276 873890 724647 634531 663990 972631
10961 972631 819047 821869 609657 867132 1029814 1117986 1258959 1227431 1693628 1826555
10951 1826555 1857995 1814849 1896640 1565851 1406112 1369379 1357261 1044278 1204891 1109386
10941 1109386 1271182 1506312 1668572 1614342 1561975 1549922 1164298 1316208 1336267 843333
10931 843333 1053791 949580 441828 692789 98308 513484 441261 307227 89286 334302
10921 334302 144494 -24546 125995 86471 503646 210592 -162044 247402 -11349 134065
$$ packed form
10991B81594J45540K6340P3692J94530F9403L36914L13393j21271k1958L4996
10981F11477k73489K37063j46091J65519k62590q8684M19622m9965l7309j95350
10971C80203J1270J97439k37403J98939R3828K29614j49243r0116K9459L08641
10961I72631j53584K822k12212K57475J62682Q8172J40973l1528M66197J32927
10951A826555L1440m3146Q1791l30789j59739l6733j2118l12983J60613r5505
10941A109386J61796K35130J62260n4230n2367j2053l85624J51910K0059m92934
10931H43333K10458j04211D41828K50961I8308M15176p2223j34034H9286K45016
10921C34302A44494b4546A25995l9524M17175B10592a62044B47402a1349A34065
$$ plain form
10910 152252 -178708 57405 91805 -110851 223707 341386 -115677 199837 227463 209187
10900 209187 -71050 -291958 168478 20906 110938 -323494 -214062 1224 -177979 -278069
10890 -278069 55800 -252258 -44985 73113 115535 74195 -125735 74598 -43211 -108115 -205055
10879 -205055 -180348 96681 110227 -364532 261920 27899 -14101 5583 94696 -109717 -349541
10868 -349541 2968 -252259 156907 -130440 -218567 -19133 -79800 53087 92245 -170509 -55066
10856 268416 -238145 -97725 -115688 68157 97632 111211 -237609 -397482 102226 -163893
10845 254454 377157 95374 -258961 77346 92597 379446 116372 -18151 -174827 -178746 -56904
10833 -50293 109056 -153085 -127264 233974 297807 2626 -67920 -100051 -107375 -58186 -144790
$$ packed form
10910A52252a78708E7405L4400a10851B23707J17679a15677A99837K7626j8276
10900B09187g1050k20908A68478B0906R0032c23494J09432A224a77979j00090
10890b78069E5800b52258d4985G3113M2422m1340a25735G4598d3211o4904r6940
10879b05055K4707I6681J3546c64532B61920B7899a4101E583Q9113a09717k39824
10868c49541B968b52259A56907a30440q8127a9133o0667E3087L9158a70509e5066
10856B68416b38145i7725j7963F8157K9475J3579b37609j59873A02226a63893
10845B54454J22703I5374b58961G7346J5251K86849A16372a8151j56676l919e6904
10833e0293A09056a53085K5821B33974O3833B626f7920l2131p324M9189q6604
$$ plain form
10822 -144790 -188800 54755 321907 310269 421925 -115936 72299 314831 -73218 -232617
10812 -232617 -202173 -115172 -164551 98044 82336 -216696 -1781 -116936 -58736 -137554 38159
10800 -96917 26302 -16722 -23247 -121630 -173752 218477 -276606 -152006 -22509 213225 -115206
10788 121596 59340 302324 133555 -232804 247301 100144 -170420 11321 -72022 60268
10777 -342538 259955 -189253 -253146 11119 50637 -422953 124479 -75046 -1866 176673 -39384
10765 -97801 -259938 184958 114954 93069 -124146 -9087 143318 -2154 -513014 9522 163969
10754 163969 -301373 351762 -171576 210439 380497 -131976 -146000 154309 -205202 -297116
10744 -297116 -31906 -2138 -403376 -134189 -158753 -172017 -391223 -254917 -101593 -291922
$$ packed form
10822a44790m4010E4755K67152j1638J11656a15936G2299K42532g3218j59399
10812b32617L0444Q7001m9379I8044j5708b16696a781j15155N8200p8818C8159
10800i6917B6302a6722o525r8383n2122B18477b76606J24600b2509B13225a15206
10788A21596E9340K42984A33555b32804B47301A00144a70420A1321g2022F0268
10777c42538B59955a89253o3893A1119L9518d22953A24479g5046a866A76673c9384
10765i7801j62137A84958p0004k1885a24146i087A43318b154n10860I522J54447
10754A63969c01373C51762a71576B10439J70058a31976j4024A54309b05202r1914
10744b97116c1906b138m01238a34189k4564j3264k19206J36306a01593j90329
$$ plain form
10734 -291922 -257512 215567 -63710 103067 -136663 -158390 307239 -280121 -152190 -218782
10724 -218782 -112113 -298955 -200735 118728 -174227 109949 -117998 305001 190769 -364532
10713 -86157 -310765 -55789 258815 -213039 -157460 -2658 -214257 -109678 165172 -198007
10702 -24937 17989 7782 -62437 -54606 74356 -299345 -173504 79833 48856 43173 -79759 323608
10689 -371057 -43971 -61394 -15193 100414 -155273 146849 167372 78656 73096 -52441 -160726
10678 -160726 -40802 -50237 371994 -141450 221337 62474 91877 165215 -54478 -88590 -246897
10667 -246897 -80597 186405 88510 -91999 -246596 262055 -111044 89672 -110693 -19652
10656 -229572 1803 -24840 185595 57079 -444552 -302288 -82700 -25909 112627 17377 -115514
$$ packed form
10734b91922L4410B15567f3710A03067a36663k1727C07239b80121J27931o6592
10724b18782J06669j86842R8220A18728a74227A09949a17998C05001j14232c64532
10713h6157k24608e5789B58815b13039N5579b658k11599J04579A65172a98007
10702b4937A7989G782f2437P831G4356b99345J25841G9833l0977n683g9759C23608
10689c71057d3971j7423a5193A00414a55273A46849K0523G8656n560e2441j08285
10678a60726d0802r435C71994a41450B21337F2474K9403P3338e4478l4112j58307
10667b46897h0597A86405H8510i1999j54597B62055a11044H9672a10693a9652
10656b29572A803b4840A85595E7079d44552J42264h2700b5909A12627A7377a15514
$$ plain form
10644 109949 -173065 -21131 -181029 -35833 36554 -46690 226491 -133025 -98142 213936
10633 -424817 -83069 -263459 76824 78064 -348675 -162964 202100 -88897 -188228 159404 -186646
10621 82219 -382411 -140313 179963 -36762 -96091 -387060 -277110 -200571 -111700 114643
10610 136618 -64813 1828 -27228 153203 -256746 -229032 -267645 -164684 273110 -28879 -67060
10599 -67060 -143250 -63290 -249714 95070 86940 103614 -95570 22948 -155061 21568 -140495
10587 209871 -8440 40683 -423216 -3595 74707 -32322 -43247 -76939 -10317 157282 35948
10575 -197377 163169 119334 -57344 410021 -19001 -78321 211880 -233790 -154368 291244
10564 -104556 62191 -118877 2700 -132389 -336218 -201958 240607 -150763 59735 137255
$$ packed form
10644A09949a73065b1131j59898c5833C6554d6690B26491a33025L4883B13936
10633d24817h3069j80390G6824J240c48675a62964B02100h8897r9331A59404a86646
10621H2219c82411a40313A79963c6762n9329k90969J09950P6539Q8871A14643
10610A36618f4813A828b7228A53203b56746K7714l8613J02961B73110b8879l8181
10599f7060p6190f3290j86424I5070q130J6674i5570B2948a55061B1568a40495
10587B09871h440D0683d23216c595G4707c2322j0925l3692a0317A57282C5948
10575a97377A63169m3835e7344D10021a9001n9320B11880b33790P9422B91244
10564a04556F2191a18877B700a32389k03829J34260B40607a50763E9735P7520
$$ plain form
10554 137255 44999 258682 251891 143676 -105815 -224408 -131240 203124 -25884 -85974 -53907
10543 -53907 104345 -22187 -1945 -59147 -106921 216470 108068 9247 -17130 -89861 16061
10531 -67214 99882 -88384 42229 -226344 160087 31587 -217508 261533 233451 40609 -408106
10519 5070 74994 -118317 109871 -103456 11924 -282503 -130857 -375107 -32832 -179089
10509 -179089 -91152 -220430 -238033 276469 -173750 75820 23921 -47783 -120040 -205733 171001
10497 202883 57802 82485 54770 58241 48823 -59852 183283 -154424 -265073 11413 -54066
10485 68733 -204200 -178608 -202617 100297 204346 -218936 -127952 -129504 241144 -72567 -71966
10474 -71966 27173 -110534 -109206 47344 -135588 -155255 -7726 74617 176546 -117610 199946
$$ packed form
10554A37255D4999K13683o791j08215a05815j18593R3168B03124b5884o0090L2067
10543e3907A04345b2187a945n7202m7774B16470A08068I247a7130p2731A6061
10531f7214I9882h8384D2229b26344A60087C1587b17508B61533k8082D0609d08106
10519E070O9924a18317A09871a03456A1924b82503a30857k44250c2832j46257
10509a79089Q7937j29278j7603B76469a73750G5820B3921d7783p2257q5693A71001
10497B02883E7802K4683k7715L471r418e9852A83283a54424j10649A1413e4066
10485F8733b04200K5592k4009A00297J04049b18936R0984j552B41144g2567O01
10474g1966B7173a10534J328D7344a35588j9667g726G4617J01929a17610A99946
$$ plain form
10462 -19632 188057 -126665 235479 424316 296272 165751 262622 -209882 360566 -61744
10451 -181857 232917 282848 -360839 -178330 -123689 -65580 15474 -25746 -316608 -91004 -327829
10440 -327829 -51036 44547 -137552 111086 124426 -69943 45582 -135084 83397 -31975 128850
10428 -104740 -332517 240439 -407183 5160 135155 114779 32724 -69844 274338 -59518 194315
10416 -94516 145908 -11948 36538 -203419 193104 -121428 -157170 -275787 106706 -154197
10405 62253 384958 -185586 -44122 82412 1951 -196943 -179438 -99987 69808 38973 -176588
10393 -47496 374595 24043 4654 -5621 -215352 -146816 305067 26699 -283135 14007 81121
10382 81121 23344 -120051 -179422 91983 104950 -220840 -44401 32331 -7435 226429 -148231
$$ packed form
10462a9632A88057a26665B35479J88837j28044j30521R6871b09882C60566f1744
10451a81857B32917M9931c60839a78330N4641N8109A5474b5746k90862i1004k36825
10440c27829e1036D4547a37552A11086J3340f9943D5582a35084H3397c1975A28850
10428a04740k27777B40439d07183E160J29995k0376C2724f9844B74338e9518A94315
10416i4516A45908a1948C6538b03419A93104a21428l5742j18617A06706a54197
10405F2253L22705a85586d4122H2412A951a96943J7505P9451F9808l0835a76588
10393d7496C74595B4043D654e621k09731O8536C05067B6699b83135A4007O7114
10382H1121B3344a20051n9371I1983J2967b20840d4401C2331g435B26429a48231
$$ plain form
10370 184601 313894 18890 380257 -15924 157169 71482 39117 263024 120812 55828
10359 23819 73745 -282652 294493 354837 229476 -250722 106305 -43230 55752 217181
10349 217181 426552 341653 227971 156575 305296 193250 196632 327104 147188 322629
10339 322629 116722 90873 70180 125710 198694 150907 216040 407424 156275 -252765 -19012
10327 165280 569788 145008 357352 466914 82024 -1970 -37448 213725 51485 262520
10317 262520 122586 218949 75812 -170815 -206841 44827 147080 -163136 38019 -222857
10306 14 -18459 -26839 275562 344380 356955 9606 312200 -83723 109520 28583 -235893 280905
10293 98301 44783 119337 21349 -15350 321886 -142317 175809 -62848 -3877 -185987 70706
$$ packed form
10370A84601J29293A8890L61367a5924A57169G1482l2365K23907A20812E5828
10359B3819M9926b82652B94493O0344j25361b50722A06305d3230E5752J61429
10349B17181K09371q4899j13682p1396J48721j12046L382J30472A47188J75441
10339C22629A16722k5849k0693N5530P2984m7787O5133J91384A56275b52765a9012
10327A65280M04508A45008K12344J09562H2024a970l5478B13725E1485K11035
10317B62520A22586R6363G5812a70815l6026D4827J02253a63136C8019b22857
10306A4a8459q380B75562O8818J2575I606L02594h3723A09520B8583b35893B80905
10293I8301D4783P4554B1349a5350C21886a42317A75809f2848c877j82110G0706
$$ plain form
10281 15785 -197713 -123254 -148083 48750 -70192 -46912 39412 206379 -46497 -112915 107010
10269 -149490 70284 102978 -75004 -300601 -241972 57276 -42869 99763 17987 -49553 111224
10257 125407 -96937 97273 286250 74230 -116879 -212473 -44504 -108916 82167 -59933 -30735
10246 -30735 282576 -379953 -89243 530678 -108635 137141 10133 201391 -101502 190706
10235 665809 209414 -64630 -76638 99952 114462 408710 -25939 43419 227361 205456 -70924
10223 -93848 73990 234276 -94226 -242275 -154795 120681 33835 -29857 113934 -284885 152960
10211 -190269 -285164 -225098 -431514 -131228 191288 -32743 -73050 -64331 -35995 87145 -104887
10199 -335608 -254152 35590 -277444 -517889 73969 -49607 -210477 138727 -141603 -268542
$$ packed form
10281A5785a97713P4459k4829D8750g0192K3280C9412J66967d6497o6418A07010
10269a49490G0284L2694g5004k25597N8629E7276d2869I9763A7987d9553A11224
10257A25407i6937I7273J88977G4230a16879r5594d4504o4412H2167e9933K9198
10246c0735B82576c79953h9243E30678a08635A37141A0133J91258a01502A90706
10235F65809B09414f4630j2008I9952J4510K94248b5939D3419J83942k1905g0924
10223i3848G3990J60286i4226j48049Q7480A20681C3835b9857A13934b84885A52960
10211a90269r4895O0066k06416a31228A91288c2743m0307Q719K8336H7145a04887
10199c35608Q1456C5590b77444k40445G3969d9607j60870A38727a41603j26939
$$ plain form
10189 -268542 -73737 -158310 -208964 235867 -39672 -128599 370691 200462 -166780 49308 -36313
10177 32203 -146488 -302320 133401 184145 -156335 126737 -163191 -134044 86349 -280396
10166 6051 -6650 122924 -136620 140191 -62472 -82045 16283 126528 61428 254484 -89623
10154 61977 -33906 182945 83496 -14499 -214173 -355660 -140929 63423 213886 92911 225827
10143 225827 -53257 -242045 -16043 -130844 -194081 -581972 226131 -354573 -4939 15677 -4108
10131 -140165 -138282 -62363 -104515 33829 -193857 278081 -154640 -143756 56183 73810 -392851
10119 -77504 -127729 -29973 141439 -57052 -274948 -120957 -203467 -156831 173991 -80329 -65773
10108 -65773 -341077 157152 -279916 176042 -58818 -2813 272808 -270384 -36272 -162507
$$ packed form
10189b68542g3737q4573n0654B35867c9672q8927C70691j70229a66780D9308c6313
10177C2203a46488j55832A33401N0744a56335A26737a63191K9147H6349b80396
10166F051f650A22924a36620A40191f2472j9573A6283J10245F1428J93056h9623
10154F1977c3906A82945H3496a4499j99674j41487a40929F3423J50463I2911J32916
10143B25827e3257j88788a6043j14801o3237l87891B26131c54573d939A5677d108
10131a40165J883f2363m2152C3829a93857B78081a54640J0884E6183J7627c92851
10119g7504n0225b9973A41439e7052k17896a20957q2510M6636A73991h0329J4556
10108f5773k75304A57152b79916A76042e8818b813B72808b70384c6272j26235
$$ plain form
10098 -162507 -140609 -124108 461113 -104275 -221064 -217496 188751 -30892 146995 -80202 -109495
10087 -109495 -95795 150665 -215965 -13858 -270163 -109394 -221839 -259266 -201191 -21079
10076 -217866 -172727 -65100 -72833 71213 109465 -133908 -347704 -163894 -130801 45341 -16832
10064 257598 90807 24167 -49888 -50996 -289745 98402 -136387 -17988 -89670 -144342 -260351
10053 -260351 184585 -64459 -53371 20820 -46655 -146789 -335964 -120103 57738 -174418
10042 124380 -81823 171888 -6110 -123024 72400 -57404 -205094 -83068 -184090 -172215 -77197
10030 111884 190515 53611 -291815 -142422 -393303 -248314 -210587 301854 -199709 -188006
10020 -188006 -4912 61434 -42200 -78036 -13053 135585 -70912 -195464 -133583 -87551 -1672
$$ packed form
10098a62507K1898J6501D61113a04275j16789L568A88751c0892A46995h0202k9293
10087a09495J3700A50665b15965a3858k56305a09394j12445l7427N8075b1079
10076b17866M5139f5100p733G1213L8252a33908k13796a63894L3093D5341a6832
10064B57598I0807B4167d9888j108k38749I8402a36387a7988p1682n4672j16009
10053b60351A84585f4459J1088B0820d6655j00134j89175a20103E7738a74418
10042A24380h1823A71888f110j16914G2400e7404j47690h3068j01022J1875g7197
10030A11884P8631E3611b91815a42422k50881J44989L7727C01854a99709J1703
10020a88006d912F1434d2200l5836a3053A35585g0912j24552O1881M6032a672
$$ plain form
10008 14983 -299374 -131512 58121 -35609 320934 56419 -196521 -210531 123499 -244228
9997 4934 80284 55275 -222421 -19920 -260587 6490 -11159 315715 128750 -114548 -273460
9986 -273460 -115559 -71658 -176442 49011 -247070 -197409 -75533 -388530 -13904 -210658 41423
9974 -214198 340789 -20206 -31567 204308 90287 -202945 -6395 164435 4285 -273830 196485
9962 -129593 127192 60429 -130903 -175678 339252 -355330 -78799 -503035 221758 -81855
9951 -145300 16028 -283278 159880 -252411 -203032 8122 -122274 83556 -53294 -47659 -127464
9940 -127464 -127663 67248 -160221 -77470 99458 -113928 152411 -56072 -242174 -29919 -433754
9929 -433754 90344 -23381 -270527 -54147 -108269 79065 -62537 -28636 -119531 2191 -360785
$$ packed form
10008A4983b99374a31512E8121c5609C20934E6419a96521j4010A23499b44228
9997D934P5350k5009b22421a9920k40667F490a1159C15715A28750a14548j58912
9986b73460a15559M3901j04784D9011b47070M9661g5533l12997a3904j96754D1423
9974b14198C40789b0206j1361B04308I0287b02945f395A64435D285b73830A96485
9962a29593A27192F0429a30903m4775C39252c55330g8799m24236B21758h1855
9951a45300A6028b83278A59880b52411M9379H122a22274H3556e3294N635p9805
9940a27464j99F7248a60221g7470I9458a13928A52411e6072j86102b9919m03835
9929d33754I0344b3381k47146e4147n4122G9065f2537b8636r0895B191c60785
$$ plain form
9917 71631 -217286 -290700 -69560 115455 35095 31019 55059 -164617 17730 -201412 -79791
9905 -59247 -273223 -78459 91406 116139 228085 -132707 -104753 110970 72535 -52760 -371317
9894 -371317 -26809 84924 -378758 -8455 -117551 257168 -14655 312827 55901 391940 67615
9882 27988 -87739 -11116 254559 -227671 66982 -149606 -353650 -218320 180732 -51525 -176743
9871 -176743 21864 -209303 23453 65882 1787 -126107 -97446 -268351 -19054 -68298 -253709
9860 -253709 -279548 -260251 -510609 -10941 -134832 -29565 -330810 41396 161978 -289179 -126391
9848 -156439 4526 -160158 -196548 -365767 183557 -341993 -53463 -19748 -129480 -140042 -32322
9836 23213 -224610 112948 14533 -282822 162221 -136607 -34789 -268684 -31270 -339144
$$ packed form
9917G1631b17286p3414f9560A15455C5095m076K4040a64617A7730b01412g9791
9905e9247k13976g8459I1406K4733J11946a32707K7954A10970l8435e2760l18557
9894c71317b6809H4924c78758h455j09096B57168a4655C12827E5901L36039F7615
9882B7988h7739a1116B54559b27671F6982a49606k04044J35330A80732e1525j25218
9871a76743B1864b09303B3453M2429A787a26107K8661j70905a9054m9244j85411
9860b53709k5839J9297k50358a0941j23891b9565l01245D1396J20582b89179a26391
9848a56439D526a60158l6390j69219A83557c41993e3463a9748j09732j0562c2322
9836B3213b24610A12948A4533b82822A62221a36607c4789k33895c1270l07874
$$ plain form
9826 -339144 2286 99969 -55097 143735 133205 161503 -239203 40088 189006 -143738 216453
9814 -212782 -193197 -209943 422203 28993 -281816 444562 132388 147941 -281386 -35563 -148024
9803 -148024 -19661 -6744 -49666 -19396 -115137 -352835 11256 137462 65861 -228301 -2431
9791 -77153 -89880 -216053 -38607 -172920 -19219 -255628 -78266 195388 -306233 74590 -240629
9779 185260 -56520 84538 -90233 -275343 163989 -103492 -89846 -321882 -12259 -226650 -6020
9767 -54494 -178321 -87180 192425 -265861 43582 -222046 -181775 -109195 20087 -254501 127229
9755 -276868 -192994 -238499 -284 -347363 -61505 -290006 85073 208188 -156919 65205 -152779
9743 219785 89490 -117923 -321279 -183584 59328 -356257 144681 53838 -258364 -51082
$$ packed form
9826c39144B286R7683e5097A43735j0530K8298b39203D0088J48918a43738B16453
9814b12782J9585j6746D22203B8993b81816D44562A32388J5553b81386c5563j12461
9803a48024a9661f744m2922a9396r5741k37698A1256J26206F5861b28301b431
9791g7153j2727j26173c8607j34313a9219k36409g8266A95388c06233G4590b40629
9779A85260e6520H4538i0233j85110A63989a03492J3646k32036a2259k14391f020
9767e4494j23827h7180A92425b65861D3582b22046M0271P2580B0087b54501A27229
9755b76868Q3874m5505b84l47079f1505k28501H5073J23115a56919F5205a52779
9743B19785H9490a17923k03356J37695E9328c56257A44681E3838b58364e1082
$$ plain form
9732 86671 90017 -18773 -79889 -51584 49641 -249890 -159342 -175616 41704 -123708 -38453 -354616
9720 -354616 -197527 108786 -143324 -159319 -144397 86643 -148804 -278266 -70155 -130205 -547207
9709 -547207 -63791 -129479 -335421 133617 -170398 -376067 -15444 304438 -308083 -242031
9699 -242031 56037 -486484 -135995 100160 -54966 -79778 -84639 10728 -8963 215342 -55110
9687 77073 4087 33740 776 -28134 -92357 -80472 -186487 -166463 219620 128143 -176175 -124473
9675 -124473 40257 -331051 83518 -121545 -340966 231905 -155077 -178712 -87256 -282276
9665 -282276 -28081 25558 6822 38109 -62068 107965 16239 -146956 -70896 -153916 -129027
9654 -129027 -60493 -128663 90338 48013 -377052 -130738 -209487 251691 31402 -14261 -73772
$$ packed form
9732H6671L346a8773o1116K8305D9641b49890R0548j6274D1704a23708c8453l16163
9720c54616J57089A08786a43324j5995J4922H6643a48804j29462g0155o0050m17002
9709e47207f3791o5688k05942A33617a70398k05669a5444C04438c08083O6052
9699b42031E6037d86484a35995A00160e4966k4812m861A0728h963B15342e5110
9687G7073D087K9653G76b8134o4223J1885j06015K0024B19620r1477a76175N1702
9675a24473D0257c31051H3518a21545k19421B31905a55077k3635h7256j95020
9665b82276b8081B5558F822L1287f2068A07965A6239a46956g0896q3020K4889
9654a29027f0493o8170I0338m2325c77052a30738p8749B51691C1402a4261n9511
$$ plain form
9643 -73772 185044 -286713 -256524 5134 -234169 78780 174891 35 -73707 -66814 -23080 -85591
9631 -85591 -223511 -186094 -133223 -107820 -233787 58974 34003 245521 -211110 65352 90887
9620 90887 -164734 -310837 -47514 -148360 -278770 -194930 -98570 -72607 -22425 110947 -83646
9608 184340 -284305 -14421 27404 -168896 20729 -148203 107565 -503425 -285033 -21706
9597 -330982 -274504 42596 39705 -67397 100697 -109225 -111498 170797 -93309 -130207 161556
9585 -91619 219240 61192 270428 -70549 -71784 74097 27170 54514 -183375 -120932 61060
9573 -32096 93019 214557 -136484 -133406 33234 -32293 144126 -60692 73600 6636 -190449
9561 212656 35548 -74626 90680 -211972 -161075 -203439 -470075 165990 -231395 -173060 -147312
$$ packed form
9643g3772A85044b86713L0189E134b34169G8780R6111C5g3707O893b3080o2511
9631h5591j37920L7417N2871K5403j25967E8974k4971K11518b11110F5352K5535
9620I0887a64734j46103d7514j00846j30410Q3840R6360K5963b2425A10947h3646
9608A84340b84305a4421B7404a68896B0729a48203A07565e03425K18392b1706
9597c30982N6478D2596k891f7397A00697a09225k273A70797i3309l6898A61556
9585i1619B19240F1192K09236g0549j235G4097B7170K7344a83375O2443F1060
9573c2096I3019J21538a36484L078C3234c2293A44126f0692G3600F636a90449
9561B12656C5548g4626I0680b11972N0897m2364k66636A65990b31395N8335K5748
$$ plain form
9550 -147312 -190656 23033 -78269 44685 12344 -154075 -408791 60466 322463 42374 -290334
9538 -49507 159215 -226875 -124193 202405 -31291 203117 -392237 197399 41988 -235751
9527 50117 196399 -151698 187992 -139733 686 345053 -419602 -94274 -234411 -237377 24308
9515 -222746 -194362 56675 -334523 -344340 -257482 76281 156019 -156966 186657 151230 4541
9503 -157706 -42585 -269822 65248 79227 184548 -146069 -344688 -286551 101132 -71883 -187647
9492 -187647 3143 -288323 -87551 -110416 26387 -224752 8086 83034 -87945 -200070 -117994
9481 -117994 -283364 -267328 -352367 -170668 -287560 -36406 32034 -149540 59724 35367 50573
9470 50573 -49757 -86147 -104481 -193188 -63321 -204371 -135609 68871 -215162 37364 83559
$$ packed form
9550a47312m3344B3033g8269D4685A2344a54075k54716F0466K61997D2374b90334
9538d9507A59215b26875J02682B02405c1291B03117c92237A97399D1988b35751
9527E0117J46282a51698A87992a39733F86L44367d19602i4274j40137k966B4308
9515b22746K8384E6675c34523r817Q6858G6281P9738a56966A86657l5427D541
9503a57706d2585k27237F5248J3979J05321a46069j98619N8137A01132g1883j15764
9492a87647C143b88323h7551k2865B6387b24752H086P4948h7945j12125Q2076
9481a17994j65370J6036q5039a70668j16892c6406C2034a49540E9724k4357J5206
9470E0573d9757l6390j8334q8707f3321j41050O8762F8871b15162C7364M6195
$$ plain form
9459 83559 121919 -3017 -247918 -183391 -262174 224200 -137698 -114536 -226737 -256581 -240389
9448 -240389 -111670 146930 -225334 -56709 -62634 -50625 -62932 -329543 63711 -42063 225606
9436 -66138 -101270 -194213 -132943 -131850 -74085 -221272 -114129 175769 -96346 -297520 -153654
9425 -153654 -170549 -223553 60901 246261 84598 35094 -376927 333141 -207433 -38053 -226399
9414 -226399 -240769 -24118 -42259 201342 -218222 -41280 -113574 47003 151036 -27237 55281
9402 -58459 152910 -364207 13610 -284009 44337 -117308 260427 -103755 -317498 -155602
9391 181784 -130779 -125662 11361 1638 59885 -461729 109300 130814 -30391 242568 -146940
9379 96631 31346 242308 -66401 -65557 390772 -179077 -3693 -225167 -19660 -241924 208910
$$ packed form
9459H3559L8360c017k44901O4527p8783B24200a37698K3162j12201k9844J6192
9448b40389a11670A46930b25334e6709n925J2009j2307k66611F3711d2063B25606
9436f6138l5132r2943O1270J093N7765j47187J07143A75769i6346k01174J43866
9425a53654j6895n3004F0901J85360H4598C5094c76927C33141b07433c8053j88346
9414b26399j4370b4118j8141B01342b18222d1280p2294D7003J04033b7237E5281
9402e8459A52910c64207A3610b84009D4337a17308B60427a03755k13743a55602
9391A81784a30779N117A1361A638N8247d61729A09300K1514c0391B42568a46940
9379I6631C1346K10962f6401Q44C90772a79077c693k21474a9660k22264B08910
$$ plain form
9367 -335089 -118432 293626 -218464 -85361 -58991 -202556 -263645 312221 -55155 71321 -72758
9355 -30404 112551 -187426 -24511 97005 -76696 -78823 -51952 -230514 25306 -93942 30902
9343 145522 -42022 -45912 -100925 -69461 -235878 -263109 -47852 -50679 333889 193970 -124473
9331 -104611 -106402 -221791 -361525 60379 -147457 -348103 -211397 -228967 -198282 -23654 -191394
9320 -191394 -227090 201693 -362867 358088 796 -42360 -31678 -85463 -203281 -141372 53536
9308 138261 -40795 130997 8069 -46120 7003 -15356 16347 -368394 -147689 61129 251976
9297 251976 -348600 -192307 -51276 201925 17652 -181157 -297776 -47598 -172082 -434976
9287 -434976 -181778 -234477 14393 -34805 -5854 -66822 -51855 -66961 -143231 16823 224642
$$ packed form
9367c35089a18432B93626b18464h5361K6370j43565o1089C12221e5155G1321g2758
9355c0404A12551a87426b4511I7005g6696k127K6871j78562B5306i3942C0902
9343A45522d2022l890n5013L1464j66417k7231d7852k827C33889j39919a24473
9331a04611j791j15389j39734F0379a47457k00646J36706j7570L0685b3654j67740
9320a91394l5696B01693c62867C58088G96d2360J0682n3785j17818O1909E3536
9308A38261d0795A30997H069d6120G003a5356A6347c68394a47689F1129J90847
9297B51976c48600J56293e1276B01925A7652a81157j16619d7598j24484k62894
9287d34976a81778n2699A4393c4805e854o0968J4967j5106p6270A6823K07819
$$ plain form
9276 224642 68197 -210894 117259 68696 76086 39596 7106 -15592 -121116 100782 60968
9265 60968 -58783 -125084 -227873 21175 30554 21294 162415 -346232 -63503 -154711 -59263 -177396
9253 -177396 241856 -261091 -28854 28267 56209 -152840 -115395 -11151 128129 289802 -209811
9241 -27609 -84640 -101279 303932 -250444 -56770 -206944 122031 36488 -187032 -106188 -314567
9230 -314567 -103126 -47069 -88506 -264536 -211729 -135275 -231204 -61523 -973 82694 -227564
9218 -84520 -169693 128240 353022 121243 -307251 -164546 141106 -187618 -81096 121623
9207 -383207 -28020 223023 29620 -121064 36587 40285 343447 40268 -188651 -309516 -199394
9196 -199394 -174754 78670 306388 169257 -195505 -142919 -253430 -116999 -144589 -70061 79636
$$ packed form
9276B24642F8197b10894A17259m8563P390l6490G106a5592j05524A00782l9814
9265F0968e8783o6301j02789B1175R379r260J41121c46232f3503r1208e9263j18133
9253a77396B41856b61091b8854B8267K7942a52840L7445a1151A28129J61673b09811
9241b7609n7031j6639C03932b50444e6770j50174A22031C6488a87032Q0844k08379
9230c14567a03126d7069m1437j76030N2807P6454r5929f1523i73H2694b27564
9218h4520q5173A28240K24782A21243c07251J42705A41106a87618h1096A21623
9207c83207b8020B23023B9620a21064C6587L698L03162D0268a88651j20865J10122
9196a99394K4640G8670K27718j37131a95505N2586j10511a16999k7590g0061G9636
$$ plain form
9184 -376432 -117657 193305 -4855 -146601 304097 89949 -120417 119048 -110868 -304557
9174 -304557 -104171 -168517 54035 -182679 518241 14922 115030 4567 -47095 -437835 -200758
9162 -328394 -237009 -33242 -11867 -327224 36801 162482 -157429 -362150 288695 -198573
9151 -17394 -81308 -147100 104295 -175565 -287365 125273 -124450 36371 16585 148998 -32272
9139 255197 352329 -71674 145110 -20620 203838 157676 -307810 339354 -82421 43565 71495
9128 71495 -3292 -156378 99571 -136738 36947 -182986 -16012 247844 -87729 -215989 -197238
9117 -197238 -3584 150255 -45693 224897 -297314 -390943 162978 183671 -273115 74258 159315
9106 159315 -248285 -1631 -497647 95586 62943 -52446 -346300 -49528 48351 -43531 8156
$$ packed form
9184c76432a17657A93305d855j41746C04097H9949a20417A19048a10868j93689
9174c04557a04171o4346E4035a82679E18241A4922J00108D567d7095l90740b00758
9162c28394R1385c3242a1867l15357C6801J25681a57429k04721B88695a98573
9151a7394o3914o5792A04295a75565j11800A25273a24450C6371A6585J32413c2272
9139B55197R7132g1674A45110b0620B03838m6162c07810C39354h2421D3565K7930
9128G1495c292j53086I9571a36738C6947a82986a6012B47844h7729j28260J8751
9117a97238c584A50255d5693B24897b97314r3629A62978K0693b73115G4258Q5057
9106A59315b48285a631m96016I5586l2643e2446k93854d9528D8351d3531H156
$$ plain form
9094 -49239 -115665 -416560 -49106 -40946 -161550 189741 262384 -100374 57535 -208979 -25006
9082 -83892 244133 128662 38797 -58074 376649 -99497 255688 -217633 183870 -33143 -72288
9071 -72288 -598895 -173236 -32363 -153401 -84988 55035 -139489 -169037 -471539 3267 26683
9060 26683 310594 -119371 29087 97614 -182925 -136315 -173945 190823 126196 -25163 143566
9048 -43207 59776 68629 160634 -215643 -359350 -77787 32253 -241243 100777 196176 -276460
9036 33661 234222 160438 -2263 -109342 -222772 -7134 -332244 -253488 -119370 33278 -144198
9024 -192676 -52365 -121379 41 -134654 -230475 -145192 237971 172223 -215784 -38220 -38556 -277874
9012 -277874 -140703 93379 323305 -142846 -197804 196109 26710 -111663 135184 -298453
$$ packed form
9094d9239o6426l00895d9106Q160j20604A89741P2643a00374E7535b08979b5006
9082h3892B44133j15471C8797e8074C76649i9497B55688b17633A83870c3143l9145
9071g2288n26607a73236c2363j21038O8413E5035a39489k9548l02502C267K3416
9060B6683K83911a19371B9087O8527a82925M6610l7630A90823o4627b5163A43566
9048d3207E9776Q853R2005b15643j43707g7787C2253b41243A00777R5399b76460
9036C3661K00561p3784b263j07079j13430g134l25110P8756a19370C3278a44198
9024a92676e2365o9014D1a34654r5821Q5283B37971o5748b15784c8220l36k39318
9012b77874J37171I3379K29926a42846n4958A96109B6710a11663A35184b98453
$$ plain form
9001 -68676 -118660 163181 -27396 144041 -105772 120330 -62937 57271 -80510 -125073 -145092
8990 -145092 256285 108257 -22591 140871 398705 77285 -31264 -557312 -8542 173762 46785
8978 755 -82661 62601 -219767 56751 -52828 -193782 15561 103505 -158698 14473 -75841 27062
8965 -75531 142328 -20129 -106558 -98183 -216915 -95524 65172 311539 -116972 168932 -159768
8953 -283545 288980 176610 285736 288326 -393634 61787 -324279 -81480 -385557 53749 37436
8942 37436 -151205 -379190 136928 212171 89006 -195001 -240868 -224057 -117989 -98348 37252
8930 162724 262799 9045 -163805 -337554 -315567 -143926 -297515 -336237 -140908 283206
8919 -332548 139697 -140920 -303437 -208689 73084 114594 55443 96695 179997 238572 138385
$$ packed form
9001f8676m9984A63181b7396A44041a05772A20330f2937E7271h0510m4563k0019
8990a45092B56285A08257b2591A40871K57834G7285c1264n26048h542A73762D6785
8978G55h2661F2601b19767E6751e2828j40954A5561Q7944a58698A4473g5841B7062
8965g5531A42328b0129q6429Q375j18732i5524F5172K46367a16972A68932a59768
8953b83545B88980j12370J09126K590c93634F1787c24279h1480l04077E3749j6313
8942C7436a51205k27985A36928P5243H9006a95001m5867J6811J06068J9641C7252
8930A62724J00075I045a63805j73749K1987a43926j53589l8722a40908B83206
8919c32548A39697a40920j62517R4748G3084M1510E5443M1252Q3302N8575j00187
$$ plain form
8908 138385 326238 557312 724179 1025520 2182755 4185268 5036549 2403908 1108223
8898 700227 554563 378834 99269 -133054 219193 48901 -117358 35518 -153124 -32867
8887 145645 196451 -165206 4578 47339 -33431 5442 -230793 1536 75655 34340 -1597 52649
8874 183160 -232974 -100198 -394045 269550 64077 51010 81647 -290595 -88458 -192196
8864 -192196 -14459 106587 -89428 7411 5539 181856 45243 -219072 -87719 -32175 110165
8852 -57816 -21568 -320739 -197889 -254591 32055 -141660 -82789 -189480 -230610 30738 -96618
$$ packed form
8908A38385J87853K31074J66867L01341J157235K002513Q51281B403908A108223
8898G00227j45664j75729I9269a33054B19193D8901a17358C5518a53124c2867
8887A45645N0806a65206D578M2761c3431E442b30793A536P4119C4340a597E2649
8874A83160b32974a00198k93847B69550F4077j3067L0637b90595h8458j03738
8864a92196a4459A06587h9428G411j872J76317D5243b19072h7719c2175A10165
8852e7816b1568k99171J22850n6702C2055a41660N8871j06691m1130C0738i6618
$$ [...]
##END NTUPLES=NMR SPECTRUM
##END=
