
##TITLE=AC1209_CiNAH12061_5973471_h6vHsrSuuo
##JCAMPDX= 6.0         $$ Bruker NMR JCAMP-DX V2.0
##DATA TYPE= NMR SPECTRUM
##DATA CLASS= NTUPLES
##ORIGIN= BRUKER
##OWNER= Administrator
$$ 1.72 TOPSPIN		Version 2.1
$$ 2012-04-14 19:28:50.687 -0500  Administrator@TOPSPIN
$$ Compression mode = diff/dup
##.OBSERVE FREQUENCY= 400.13188235
##.OBSERVE NUCLEUS= ^1H
##.ACQUISITION MODE= SIMULTANEOUS (DQD)
##.ACQUISITION SCHEME= undefined
##.AVERAGES= 64
##.DIGITISER RES= 22
##SPECTROMETER/DATA SYSTEM= spect
##.PULSE SEQUENCE= noesygpps1d.comp
##.SOLVENT NAME= COFFEE_meoh
##.SHIFT REFERENCE= INTERNAL, COFFEE_meoh, 1, 14.96873
##AUDIT TRAIL= $$ (NUMBER, WHEN, WHO, WHERE, PROCESS, VERSION, WHAT)
$$ ##TITLE= Audit trail, TOPSPIN		Version 2.1
$$ ##JCAMPDX= 5.01
$$ ##ORIGIN= Bruker BioSpin GmbH
$$ ##OWNER= Administrator
$$ $$ C:\Bruker\TOPSPIN/data/COFFEE/nmr/AC1209_CiNAH12061_5973471_h6vHsrSuuo/12/pdata/1/auditp.txt
$$ ##AUDIT TRAIL=  $$ (NUMBER, WHEN, WHO, WHERE, PROCESS, VERSION, WHAT)
(   1,<2012-04-14 19:28:43.203 -0500>,<Administrator>,<TOPSPIN>,<go>,<TOPSPIN 2.1>,
      <created by zg
	started at 2012-04-14 19:17:10.421 -0500,
	POWCHK enabled, PULCHK disabled,
       configuration hash MD5:
       1A 1E CE 29 27 FD 77 03 67 4E F0 E3 C4 B2 CB 90
       data hash MD5: 64K
       ED C9 D2 E3 2C BB A8 23 18 3B E5 50 87 58 D6 91>)
(   2,<2012-04-14 19:28:47.125 -0500>,<Administrator>,<TOPSPIN>,<proc1d>,<TOPSPIN 2.1>,
      <Start of raw data processing
       efp LB = 0.3 FT_mod = 6 PKNL = 1 PHC0 = 0 PHC1 = 0 SI = 128K 
       data hash MD5: 128K
       42 15 A2 E1 B9 AF DA 59 16 38 13 5E ED AC 49 E1>)
(   3,<2012-04-14 19:28:48.968 -0500>,<Administrator>,<TOPSPIN>,<proc1d>,<TOPSPIN 2.1>,
      <pk PHC0 = 34.68384 PHC1 = 0 
       data hash MD5: 128K
       C5 36 D6 79 AB 1A CB B0 88 88 57 4E 4D 12 2C 2A>)
(   4,<2012-04-14 19:28:49.312 -0500>,<Administrator>,<TOPSPIN>,<proc1d>,<TOPSPIN 2.1>,
      <abs ABSG = 1 
       data hash MD5: 128K
       FC ED 5E 87 89 CB C4 37 49 23 1E 49 BC B1 B1 E5>)
(   5,<2012-04-14 19:28:49.484 -0500>,<Administrator>,<TOPSPIN>,<proc1d>,<TOPSPIN 2.1>,
      <abs ABSG = 2 
       data hash MD5: 128K
       9F 32 94 52 67 DA EF EE 29 AA E2 DC 8C 5C 0A 7B>)
(   6,<2012-04-14 19:28:49.859 -0500>,<Administrator>,<TOPSPIN>,<proc1d>,<TOPSPIN 2.1>,
      <abs ABSG = 3 
       data hash MD5: 128K
       8D 1B 7B 56 39 3B 46 DA 78 E9 01 43 EE 10 DB 87>)
(   7,<2012-04-14 19:28:50.296 -0500>,<Administrator>,<TOPSPIN>,<proc1d>,<TOPSPIN 2.1>,
      <abs ABSG = 4 
       data hash MD5: 128K
       64 E8 6F 7B CA BB 49 76 6D DE 73 96 2C BE F9 C0>)
(   8,<2012-04-14 19:28:50.500 -0500>,<Administrator>,<TOPSPIN>,<proc1d>,<TOPSPIN 2.1>,
      <abs ABSG = 5 
       data hash MD5: 128K
       0D ED F9 D7 93 B3 0F 64 95 1A 4B 3F 55 72 D7 B3>)
$$ ##END=
$$ 
$$ $$ hash MD5
$$ $$ 02 D4 65 90 54 AB 7B C1 BB FF 4A 8D 93 92 BF BC
##$RELAX= 
##$RELAX= 
##$RELAX= 
##$RELAX= 
##$RELAX= 
##$RELAX= 
##$RELAX= 
##$RELAX= 
$$ Bruker specific parameters
$$ [...]
##$TP07= 0
##$TPNAME0= <>
##$TPNAME1= <>
##$TPNAME2= <>
##$TPNAME3= <>
##$TPNAME4= <>
##$TPNAME5= <>
##$TPNAME6= <>
##$TPNAME7= <>
##$TPOAL= (0..7)
0.5 0.5 0.5 0.5 0.5 0.5 0.5 0.5
##$TPOFFS= (0..7)
0 0 0 0 0 0 0 0
##$TUNHIN= 0
##$TUNHOUT= 0
##$TUNXOUT= 0
##$USERA1= <user>
##$USERA2= <user>
##$USERA3= <user>
##$USERA4= <user>
##$USERA5= <user>
##$V9= 5
##$VALIST= <valist>
##$VCLIST= <CCCCCCCCCCCCCCC>
##$VD= 0
##$VDLIST= <DDDDDDDDDDDDDDD>
##$VPLIST= <PPPPPPPPPPPPPPP>
##$VTLIST= <TTTTTTTTTTTTTTT>
##$WBST= 1024
##$WBSW= 4
##$XGAIN= (0..3)
0 0 0 0
##$XL= 0
##$YL= 0
##$YMAX_a= 11613756
##$YMIN_a= -6454518
##$ZGOPTNS= <>
##$ZL1= 120
##$ZL2= 120
##$ZL3= 120
##$ZL4= 120
##$ABSF1= 14.96873
##$ABSF2= -5.5838
##$ABSG= 5
##$ABSL= 3
##$ALPHA= 0
##$AQORDER= 0
##$ASSFAC= 0
##$ASSFACI= 0
##$ASSFACX= 0
##$ASSWID= 0
##$AUNMP= <proc_prof1d_extract.lims>
##$AXLEFT= 0
##$AXNAME= <>
##$AXNUC= <1H>
##$AXRIGHT= 0
##$AXTYPE= 0
##$AXUNIT= <>
##$AZFE= 0.1
##$AZFW= 0.1
##$BCFW= 0
##$BC_mod= 0
##$BYTORDP= 0
##$COROFFS= 0
##$CY= 15
##$DATMOD= 1
##$DC= 0
##$DFILT= <>
##$DTYPP= 0
##$F1P= 0
##$F2P= 0
##$FCOR= 0.5
##$FTSIZE= 131072
##$FT_mod= 6
##$GAMMA= 0
##$GB= 0
##$INTBC= 1
##$INTSCL= 1
##$ISEN= 128
##$LB= 0.3
##$LEV0= 0
##$LPBIN= 0
##$MAXI= 10000
##$MC2= 0
##$MEAN= 0
##$ME_mod= 0
##$MI= 0
##$NCOEF= 0
##$NC_proc= -2
##$NLEV= 6
##$NOISF1= 0
##$NOISF2= 0
##$NSP= 0
##$NTH_PI= 0
##$NZP= 0
##$OFFSET= 14.96873
##$PC= 1
##$PHC0= 34.68384
##$PHC1= 0
##$PH_mod= 1
##$PKNL= yes
##$PPARMOD= 0
##$PPDIAG= 0
##$PPIPTYP= 0
##$PPMPNUM= 2147483647
##$PPRESOL= 1
##$PSCAL= 4
##$PSIGN= 0
##$PYNMP= <proc.py>
##$REVERSE= no
##$SF= 400.130004754277
##$SI= 131072
##$SIGF1= 0
##$SIGF2= 0
##$SINO= 400
##$SIOLD= 131072
##$SPECTYP= <>
##$SREGLST= <1H.CDCl3>
##$SSB= 0
##$STSI= 131072
##$STSR= 0
##$SW_p= 8223.68421052632
##$SYMM= 0
##$S_DEV= 0
##$TDeff= 65536
##$TDoff= 0
##$TI= <>
##$TILT= no
##$TM1= 0
##$TM2= 0
##$TOPLEV= 0
##$USERP1= <user>
##$USERP2= <user>
##$USERP3= <user>
##$USERP4= <user>
##$USERP5= <user>
##$WDW= 1
##$XDIM= 131072
##$YMAX_p= 250426628
##$YMIN_p= -312869455
##$CURPLOT= <Network HP LaserJet P1505>
##$CURPRIN= <$Network HP LaserJet P1505>
##$DFORMAT= <normdp>
##$LAYOUT= <+/1D_H.xwp>
##$LFORMAT= <normlp>
##$PFORMAT= <normpl>
##$SURQMSG= 1
$$ End of Bruker specific parameters
$$ ---------------------------------
##NTUPLES= NMR SPECTRUM
##VAR_NAME=  FREQUENCY,     SPECTRUM/REAL,   SPECTRUM/IMAG
##SYMBOL=    X,             R,               I
##VAR_TYPE=  INDEPENDENT,   DEPENDENT,       DEPENDENT
##VAR_FORM=  AFFN,          ASDF,            ASDF
##VAR_DIM=   131072,        131072,          131072
##UNITS=     HZ,            ARBITRARY UNITS, ARBITRARY UNITS
##FACTOR=    0.0627417313425165, 1,          1
##FIRST=     8223.62146879498, 5316,         -38902
##LAST=      0,             5605,            -39059
##MIN=       0,             -312869455,      0
##MAX=       8223.62146879498, 250426628,    0
$$ Real data points
##PAGE= N=1
##DATA TABLE= (X++(R..R)), XYDATA
$$ [...]
62009B157422L2605L4213L5367L6196L6896L7277L7224L7018L6710L5707L3557
$$ 2157422 2190027 2224240 2259607 2295803 2332699 2369976 2407200 2444218 2480928 2516635 2550192
61998B550192L0783K8350K6555K4959K3261K1598K0064J8519J6916J5381J3901
$$ 2550192 2580975 2609325 2635880 2660839 2684100 2705698 2725762 2744281 2761197 2776578 2790479
61987B790479J2345J0875R947R748R998J0332J0596J0689J0552J0414J0659J1250
$$ 2790479 2802824 2813699 2823646 2833394 2843392 2853724 2864320 2875009 2885561 2895975 2906634 2917884
61975B917884J1622J1382J0761J0184R661Q909P845O683N663M797L814K322K81
$$ 2917884 2929506 2940888 2951649 2961833 2971494 2980403 2988248 2994931 3000594 3005391 3009205 3011527 3011808
61962C011808j666k740l002l374m476n833o558o359n578m593l773l559m049m672
$$ 3011808 3010142 3007402 3004400 3001026 2996550 2990717 2984159 2977800 2972222 2967629 2963856 2960297 2956248 2951576
61948B951576m799m556m438m347l717k532j516j085p95r4Q96J711K172K338K127
$$ 2951576 2946777 2942221 2937783 2933436 2929719 2927187 2925671 2924586 2923791 2923697 2924593 2926304 2928476 2930814 2932941
61933B932941J477O57R1j25k89p68j727l061m461n664o760q019r355j0325j0808
$$ 2932941 2934418 2935075 2935166 2935041 2934752 2933984 2932257 2929196 2924735 2919071 2912311 2904292 2894937 2884612 2873804
61918B873804j1363j2524j4001j5056j5521j5981j6914j8132j9228k0158k1093
$$ 2873804 2862441 2849917 2835916 2820860 2805339 2789358 2772444 2754312 2735084 2714926 2693833
61907B693833k1921k2266k1980k1367k0822k0450k0103j9651j9099j8516j7934
$$ 2693833 2671912 2649646 2627666 2606299 2585477 2565027 2544924 2525273 2506174 2487658 2469724
61896B469724j7383j6924j6537j6079j5372j4361j3186j1985j0717r230p565o068
$$ 2469724 2452341 2435417 2418880 2402801 2387429 2373068 2359882 2347897 2337180 2327950 2320385 2314317
61884B314317n071m372l285j445N98J978K731L963O534R942J2967J5186J7268
$$ 2314317 2309246 2304874 2301589 2300144 2300742 2302720 2305451 2309414 2315948 2325890 2338857 2354043 2371311
61871B371311J9791K2406K4521K6368K8844L2446L6764M1110M5333M9900N5317
$$ 2371311 2391102 2413508 2438029 2464397 2493241 2525687 2562451 2603561 2648894 2698794 2754111
61860B754111O1648O8506P5467Q2557R0428R9977J11696J25366J40387J56361
$$ 2754111 2815759 2884265 2959732 3042289 3132717 3232694 3344390 3469756 3610143 3766504
61850C766504J73302J91409K10924K32263K55920K81988L09799L38265L66484
$$ 3766504 3939806 4131215 4342139 4574402 4830322 5112310 5422109 5760374 6126858
61841F126858L93683M18607M39142M52444M55079M42988M12081L59621K85484
$$ 6126858 6520541 6939148 7378290 7830734 8285813 8728801 9140882 9500503 9785987
61832I785987J92400Q5664k7252j37602k37267l20683l85430m31479m60220m73864
$$ 9785987 9978387 10064051 10036799 9899197 9661930 9341247 8955817 8524338 8064118 7590254
61822G590254m74969m66013m49339m27211m01571l73758l44805l15929k88363
$$ 7590254 7115285 6649272 6199933 5772722 5371151 4997393 4652588 4336659 4048296
61813D048296k62746k39053k17199j97308j79359j62990j47846j33905j21310
$$ 4048296 3785550 3546497 3329298 3131990 2952631 2789641 2641795 2507890 2386580
61804B386580j10142j00406r1966q4402p7275p0535o4452n9107n4307m9985m6143
$$ 2386580 2276438 2176032 2084066 1999664 1922389 1851854 1787402 1728295 1673988 1624003 1577860
61793A577860m2366l7994l3077k8605k5460k3495k1932k0228j8202j5863j3536
$$ 1577860 1535494 1497500 1464423 1435818 1410358 1386863 1364931 1344703 1326501 1310638 1297102
61782A297102j1757j0517r039o874m778l747l521k898j398K83J494K353L102L542
$$ 1297102 1285345 1274828 1265789 1258915 1254137 1250390 1246869 1243971 1242573 1242856 1244350 1246703 1249805 1253347
61768A253347L619L850M687N902P039Q114R373J0760J2118J3669J5765J8276K0683
$$ 1253347 1256966 1260816 1265503 1271405 1278444 1286558 1295931 1306691 1318809 1332478 1348243 1366519 1387202
61755A387202K2729K4643K6796K9366L2334L5449L8294M0711M3114M6135M9892
$$ 1387202 1409931 1434574 1461370 1490736 1523070 1558519 1596813 1637524 1680638 1726773 1776665
61744A776665N3916N7817O1736O6031P0764P5683Q0620Q5832R1863R9046J07089
$$ 1776665 1830581 1888398 1950134 2016165 2086929 2162612 2243232 2329064 2420927 2519973 2627062
61733B627062J15300J23359J31747J41174J51828J63443J76081J90375K06921
$$ 2627062 2742362 2865721 2997468 3138642 3290470 3453913 3629994 3820369 4027290
61724D027290K25777K46673K69459K94179L21037L50529L83345M19777M59374
$$ 4027290 4253067 4499740 4769199 5063378 5384415 5734944 6118289 6538066 6997440
61715F997440N01407N45537N91657O39163O86671P32263P73484Q06770Q27092
$$ 6997440 7498847 8044384 8636041 9275204 9961875 10694138 11467622 12274392 13101484
61706A3101484Q28260Q03605P46755O52940N20947L54873J64403l6721k33514
$$ 13101484 13929744 14733349 15480104 16133044 16653991 17008864 17173267 17136546 16903032
61697A6903032m12746n64928o84763p70573q23705q48074q49085q32086q01457
$$ 16903032 16490286 15925358 15240595 14470022 13646317 12798243 11949158 11117072 10315615
61688A0315615p60970p14352o64938o14927n65404n17070m70688m27024l86749
$$ 10315615 9554645 8840293 8175355 7560428 6995024 6477954 6007266 5580242 5193493
61679E193493l50407l18070k89043k62391k37848k15812j96399j78998j62981
$$ 5193493 4843086 4525016 4235973 3973582 3735734 3519922 3323523 3144525 2981544
61670B981544j48376j35439j23936j13328j03475r4634q6811p9646p2952o6966
$$ 2981544 2833168 2697729 2573793 2460465 2356990 2262356 2175545 2095899 2022947 1955981
61660A955981o1899n7504n3295m9055m4901m1028l7529l4456l1894k9906k8401
$$ 1955981 1894082 1836578 1783283 1734228 1689327 1648299 1610770 1576314 1544420 1514514 1486113
61649A486113k7108k5702k4088k2572k1651k1565k2033k2397k2105k1115j9936
$$ 1486113 1459005 1433303 1409215 1386643 1364992 1343427 1321394 1298997 1276892 1255777 1235841
61638A235841j9175j9015j9084j8865j8181j7255j6505j6280j6626j7116j7052
$$ 1235841 1216666 1197651 1178567 1159702 1141521 1124266 1107761 1091481 1074855 1057739 1040687
61627A040687j6097j4655j3401j2527j1717j0789r998r575r313q855q162p409
$$ 1040687 1024590 1009935 996534 984007 972290 961501 951503 941928 932615 923760 915598 908189
61615I08189o600n598m474l531k941k584k322k196k282k549k943l392l652l425
$$ 908189 901589 895991 891517 887986 885045 882461 880139 877943 875661 873112 870169 866777 863125 859700
61601H59700k839k531k843l185k740j813j706k951m309m214k820j735j867k487
$$ 859700 856861 854330 851487 848302 845562 843749 842043 839092 834783 830569 827749 826014 824147 821660
61587H21660k653k596l008l696l848l264k448j619n84L73M74l13r32o31O8M50
$$ 821660 819007 816411 813403 809707 805859 802595 800147 798528 797944 798317 798791 798478 797546 796915 796983 797433
61571G97433Q76K021L336L541K536J688J956K755L131L126L298L582L478K985
$$ 797433 798309 800330 803666 807207 809743 811431 813387 816142 819273 822399 825697 829279 832757 835742
61557H35742K522K114J398M49j72k65l43r43j986l050l885m501m950n266n447
$$ 835742 838264 840378 841776 842225 842053 841788 841445 840502 838516 835466 831581 827080 822130 816864 811417
61542H11417n486n497n690n990n917n222m438m277m548m446l808l255k877j784
$$ 811417 805931 800434 794744 788754 782837 777615 773177 768900 764352 759906 756098 752843 749966 748182
61528G48182M19K582L352L009L022M050N436O537P529Q665R701J0443J1266J2543
$$ 748182 748601 751183 754535 757544 760566 764616 770052 776589 784118 792783 802484 812927 824193 836736
61514H36736J4096J5554J6924J8353J9708K0818K1864K3076K4239K4888K4936
$$ 836736 850832 866386 883310 901663 921371 942189 964053 987129 1011368 1036256 1061192
61503A061192K4713K4465K4175K3834K3530K3199K2595K1617K0451J9287J8106
$$ 1061192 1085905 1110370 1134545 1158379 1181909 1205108 1227703 1249320 1269771 1289058 1307164
61492A307164J6850J5647J4655J3748J2578J0912Q790O341L641Q96j484l170m296
$$ 1307164 1324014 1339661 1354316 1368064 1380642 1391554 1400344 1406685 1410326 1411222 1409738 1406568 1402272
61479A402272n303o430p502q268q674q712q284p353o114m739l156j233Q66K760
$$ 1402272 1396969 1390539 1383037 1374769 1366095 1357383 1349099 1341746 1335632 1330893 1327737 1326504 1327370 1330130
61465A330130M244N519P125R624J3099J6910K0358K3660K7775L2960L8181M2534
$$ 1330130 1334374 1339893 1347018 1356642 1369741 1386651 1407009 1430669 1458444 1491404 1529585 1572119
61453A572119M6687N1973N8444O4961P1124P7958Q6309R5671J05139J14619J24395
$$ 1572119 1618806 1670779 1729223 1794184 1865308 1943266 2029575 2125246 2230385 2345004 2469399
61442B469399J34186J43431J52043J60120J67174J72267J74533J72988J66285
$$ 2469399 2603585 2747016 2899059 3059179 3226353 3398620 3573153 3746141 3912426
61433C912426J53452J34742J11173Q3597N2987K1361q774l5977o0157q1176r8123
$$ 3912426 4065878 4200620 4311793 4395390 4448377 4469738 4460964 4424987 4364830 4283654 4185531
61422D185531j10261j17849j21600j22011j19640j15406j09914j02960r4342q4756
$$ 4185531 4075270 3957421 3835821 3713810 3594170 3478764 3368850 3265890 3171548 3086792
61412C086792p5227o5925n6317m6396l6989k8695k1083j3285n035L162J0619J6965
$$ 3086792 3011565 2945640 2889323 2842927 2805938 2777243 2756160 2742875 2737840 2741002 2751621 2768586
61400B768586K2261K6842L1006L4715L7622L9494M0473M0831M0605L9722L8477
$$ 2768586 2790847 2817689 2848695 2883410 2921032 2960526 3000999 3041830 3082435 3122157 3160634
61389C160634L7538L7343L7526L7247L6116L4707L4037L4536L5617L6247L5858
$$ 3160634 3198172 3235515 3273041 3310288 3346404 3381111 3415148 3449684 3485301 3521548 3557406
61378C557406L4657L3154L1556K9632K7066K3806K0072J6121J2057P795L204j640
$$ 3557406 3592063 3625217 3656773 3686405 3713471 3737277 3757349 3773470 3785527 3793322 3796526 3794886
61366C794886o358j0521j4064j7280k0333k2947k4776k5876k6443k6199k4511
$$ 3794886 3788528 3778007 3763943 3746663 3726330 3703383 3678607 3652731 3626288 3600089 3575578
61355C575578k1391j7957j5489j4130j2922j1009q447n755l155o48J369K077J086
$$ 3575578 3554187 3536230 3520741 3506611 3493689 3482680 3474233 3468478 3465323 3464675 3466044 3468121 3469207
61342C469207r20k722l737m373n191o054o329n666m118j576K429Q218J5598K4139
$$ 3469207 3468287 3465565 3461828 3457455 3452264 3446210 3439881 3434215 3430097 3428521 3430950 3439168 3454766 3478905
61328C478905L3557M3635N4040O4593P5561Q7355J00053J13373J26932J40263
$$ 3478905 3512462 3556097 3610137 3674730 3750291 3837646 3937699 4051072 4178004 4318267
61318D318267J52677J63550J72717J80190J85298J86434J81972J71332J55048
$$ 4318267 4470944 4634494 4807211 4987401 5172699 5359133 5541105 5712437 5867485
61309E867485J33873J08213P8550M6153J3000j9108m9149p6564j00733j21268
$$ 5867485 6001358 6109571 6188121 6234274 6247274 6228166 6179017 6102453 6001720 5880452
61299E880452j38616j53759j67030j77618j84532j87799j88342j86903j83516
$$ 5880452 5741836 5588077 5421047 5243429 5058897 4871098 4682756 4495853 4312337
61290D312337j78026j70704j62200j53052j43358j32873j21527j09840r8671q8415
$$ 4312337 4134311 3963607 3801407 3648355 3504997 3372124 3250597 3140757 3042086 2953671
61280B953671p8656o8826n8993m9659m0968l2532k4088j5854q141r37N895J2232
$$ 2953671 2875015 2806189 2747196 2697537 2656569 2624037 2599949 2584095 2575954 2575017 2580912 2593144
61268B593144J7696K2061K5517K8587L1684L4683L6924L7862L7613L6711L5387
$$ 2593144 2610840 2632901 2658418 2687005 2718689 2753372 2790296 2828158 2865771 2902482 2937869
61257B937869L3502L1180K9029K7384K5713K3237K0057J7122J4957J2896R893
$$ 2937869 2971371 3002551 3031580 3058964 3084677 3107914 3127971 3145093 3160050 3172946 3182839
61246C182839N860J689j978n536r645j4170j8360k1947k5429k9065l2194l4035
$$ 3182839 3188699 3190388 3188410 3182874 3173229 3159059 3140699 3118752 3093323 3064258 3032064 2998029
61234B998029l4913l6098l8293m0777m2224m2203m1486m0939m0445l9150l6523
$$ 2998029 2963116 2927018 2888725 2847948 2805724 2763521 2722035 2681096 2640651 2601501 2564978
61223B564978l2876k8831k4803k1195j8600j7201j6212j4632j2568j1178j1134
$$ 2564978 2532102 2503271 2478468 2457273 2438673 2421472 2405260 2390628 2378060 2366882 2355748
61212B355748j1838j2391j2672j2929j2993j2549j1821j1229j0605r454p821o219
$$ 2355748 2343910 2331519 2318847 2305918 2292925 2280376 2268555 2257326 2246721 2237267 2229446 2223227
61200B223227m692k600N57M728R767J5735K2519K9679L6869M4044N1076N7644
$$ 2223227 2218535 2215935 2216492 2221220 2230987 2246722 2269241 2298920 2335789 2379833 2430909 2488553
61188B488553O3645O9348P4763P9253Q1979Q2419Q0159P4560O5103N1963L5888
$$ 2488553 2552198 2621546 2696309 2775562 2857541 2939960 3020119 3094679 3159782 3211745 3247633
61177C247633J7593k441k3486m4249o3119p8815r0810r9226j04461j06910j06974
$$ 3247633 3265226 3262785 3239299 3195050 3131931 3053116 2962306 2863080 2758619 2651709 2544735
61166B544735j05104j01677r6943r1201q4939p8625p2485o6596o0997n5618n0342
$$ 2544735 2439631 2337954 2241011 2149810 2064871 1986246 1913761 1847165 1786168 1730550 1680208
61155A680208m5320m0934l7142l3281k8978k4854k1650j8953j5619j1412p308
$$ 1680208 1634888 1593954 1556812 1523531 1494553 1469699 1448049 1429096 1413477 1402065 1394757
61144A394757m005j085J937M551N983O475P019P992Q675Q141O206L448P11j409
$$ 1394757 1390752 1389667 1391604 1396155 1402138 1408613 1415632 1423624 1432299 1440440 1446646 1450094 1450805 1449396
61130A449396k838l970n289o972q835j0575j2034j3339j4750j6279j7552j8226
$$ 1449396 1446558 1442588 1437299 1430327 1421492 1410917 1398883 1385544 1370794 1354515 1336963 1318737
61118A318737j8397j8420j8431j8380j8342j8386j8308j7955j7702j7971j8388
$$ 1318737 1300340 1281920 1263489 1245109 1226767 1208381 1190073 1172118 1154416 1136445 1118057
61107A118057j8196j7541j7447j8275j9109j9166j8929j9197j9764j9897j9602
$$ 1118057 1099861 1082320 1064873 1046598 1027489 1008323 989394 970197 950433 930536 910934
61096I10934j9438j9386j8880j7909j7208j7295j7927j8631j9105j9073j8292
$$ 910934 891496 872110 853230 835321 818113 800818 782891 764260 745155 726082 707790
61085G07790j6965j5667j4664j3683j2452j1128j0007r098q183p109n953m916
$$ 707790 690825 675158 660494 646811 634359 623231 613224 604126 595943 588834 582881 577965
61073E77965m065l126j730n0J186J651K012L078M645N820O375O919P740Q310Q275
$$ 577965 573900 570774 569044 568994 570180 571831 573843 576921 581566 587386 593761 600680 608420 616730 625005
61058F25005Q165Q562R128R069Q301P490P111O999O832O518O016N198M139L248
$$ 625005 633170 641732 650860 659929 668230 675720 682831 689830 696662 703180 709196 714394 718533 721781
61044G21781K836K610J859K29j754l097l279k761k474k854l554m045m297m617
$$ 721781 724617 727227 729086 729315 727561 724464 721185 718424 715950 713096 709542 705497 701200 696583
61030F96583n066n335n252n060n037n156n375o030p343q684q914p749o213n372
$$ 696583 691517 686182 680930 675870 670833 665677 660302 654272 646929 638245 629331 621582 615369 609997
61016F09997n128m810m412m372m419l760k518j868k318k852k453j607j371j620
$$ 609997 604869 600059 595647 591275 586856 583096 580578 578710 576392 573540 571087 569480 568109 566489
61002E66489j365m52L05O72J425K887M110M128L320K769K780K819K649K696L255
$$ 566489 565124 564672 564977 565649 567074 569961 574071 578199 581519 584288 587068 589887 592536 595232 598487
60987E98487L995M508M926N601O435O908O758O407O554P476Q857J0243J1540J2931
$$ 598487 602482 606990 611916 617517 623952 630860 637618 644025 650579 658055 666912 677155 688695 701626
60973G01626J4374J5436J5705J5376J5147J5534J6432J7529J8943K0969K3276
$$ 701626 716000 731436 747141 762517 777664 793198 809630 827159 846102 867071 890347
60962H90347K4854K5166K4989K5663K7707L0510L3254L5635L7731L9771M2168
$$ 890347 915201 940367 965356 991019 1018726 1049236 1082490 1118125 1155856 1195627 1237795
60951A237795M5334M9240N3427N7528O1563O5740P0275P5317Q0674Q5786R0453
$$ 1237795 1283129 1332369 1385796 1443324 1504887 1570627 1640902 1716219 1796893 1882679 1973132
60940A973132R5470J01836J09538J17888J27010J37912J50918J65241J80601J98165
$$ 1973132 2068602 2170438 2279976 2397864 2524874 2662786 2813704 2978945 3159546 3357711
60930C357711K19160K43658K71523L03535L40563L82675M30296M85386N50141
$$ 3357711 3576871 3820529 4092052 4395587 4736150 5118825 5549121 6034507 6584648
60921F584648O25508P12461Q13560R31349J066111J216707J378460J530067J619630
$$ 6584648 7210156 7922617 8736177 9667526 10733637 11950344 13328804 14858871 16478501
60912A6478501J576207J355244R84415N62777K06716j1045q0632l3271Q0957J93061
$$ 16478501 18054708 19409952 20394367 20957144 21163860 21152815 21072183 21038912 21119869 21312930
60902B1312930K15647P4610k40573o57379j058859j350167j498183j522884j464964
$$ 21312930 21528577 21603187 21362614 20705235 19646376 18296209 16798026 15275142 13810178
60893A3810178j362233j242580j123344j011426r06497q06925p13052o25988n45903
$$ 13810178 12447945 11205365 10082021 9070595 8164098 7357173 6644121 6018133 5472230
60884E472230m72762m07623l52032l06449k69751k40072k15631j95085j77436
$$ 5472230 4999468 4591845 4239813 3933364 3663613 3423541 3207910 3012825 2835389
60875B835389j61937j48145j36026j25656j16677j08279j00031r2426q6255q1687
$$ 2835389 2673452 2525307 2389281 2263625 2146948 2038669 1938638 1846212 1759957 1678270
60865A678270p8263p5461p2827o9758o5795o1234n6861n3036m9340m5362m1447
$$ 1678270 1600007 1524546 1451719 1381961 1316166 1254932 1198071 1145035 1095695 1050333 1008886
60854A008886l8378l6405l4809l2623k9686k6813k4789k3423k1912j9971j8095
$$ 1008886 970508 934103 899294 866671 836985 810172 785383 761960 740048 720077 701982
60843G01982j6687j5553j4491j3741j3423j3031j2050j0768r843r349q792p934
$$ 701982 685295 669742 655251 641510 628087 615056 603006 592238 582395 573046 564254 556320
60831E56320o962n923m658l325k393j923j377l16J046K225K966L290L313L296
$$ 556320 549358 543435 538777 535452 533059 531136 529759 529443 530489 532714 535680 538970 542283 545579
60817E45579L561M060M309L948L292K951L079L245L056K639K352K220J958J485
$$ 545579 549140 553200 557509 561457 564749 567700 570779 574024 577080 579719 582071 584291 586249 587734
60803E87734J131J084R22J27j025j650j438j124j423j973j918j195n06j66L28
$$ 587734 588865 589949 590871 590998 589973 588323 586885 585761 584338 582365 580447 579252 578746 578580 578908
60788E78908J353K544L380L943M670N663O691P542Q071Q030P338O427N932N995
$$ 578908 580261 582805 586185 590128 594798 600461 607152 614694 622765 630795 638133 644560 650492 656487
60774F56487O152N953N477N112N071N227N332N299N303N597O160O588O501O010
$$ 656487 662639 668592 674069 679181 684252 689479 694811 700110 705413 711010 717170 723758 730259 736269
60760G36269N606N577N755N833N601M862L507J934J011J172J791J858J136J81
$$ 736269 741875 747452 753207 759040 764641 769503 773010 774944 775955 777127 778918 780776 781912 782093
60746G82093o04j355k233l169m272n769p308p961p463o866p337q665r584r338
$$ 782093 781489 780134 777901 774732 770460 764691 757383 749422 741959 735093 727756 719091 709507 700169
60732G00169q300p205o439o001n576m629k968j195p6N42J469K868L928M078L908
$$ 700169 691869 684664 678225 672224 666648 662019 659051 657856 657780 658322 659791 662659 666587 670665 674573
60717F74573M406N829P640R235J0302J0777J0866J0996J1478J2246J2947J3130
$$ 674573 678979 684808 692448 701683 711985 722762 733628 744624 756102 768348 781295 794425
60705G94425J2414J0872R265Q401Q162P598O211M620L717L620L779L652K989J865
$$ 794425 806839 817711 826976 835377 843539 851137 857348 861968 865685 869305 873084 876736 879725 881590
60691H81590Q56P38J622K710L274L478L754L860L223K007J063P55M99l68j624
$$ 881590 882446 883184 884806 887516 890790 894268 898022 901882 905105 907112 908175 908930 909429 909061 907437
60676I07437k372k095j317j120j942l030l419l262l589m687n543n310m542m335
$$ 907437 905065 902970 901653 900533 898591 895561 892142 888880 885291 880604 875061 869751 865209 860874
60662H60874m800n183n073m631l954l058k334k150k066j359k97j8r88k445l579
$$ 860874 856074 850891 845818 841187 837233 834175 831841 829691 827625 826266 825969 825951 824963 822518 818939
60647H18939m341m768m505l636l213m057n547o363o141n587n176m628l703k727
$$ 818939 814598 809830 805325 801689 798476 794419 788872 782509 776368 770781 765605 760977 757274 754547
60633G54547j992j283m05K74K57k84o96p64r86j833l126m342n240n896o326o550
$$ 754547 752555 751272 750867 751141 751398 751114 750418 749654 748668 746835 743709 739367 734127 728231 721905 715355
60617G15355o847p548q482r055r059q996r304r622r207p921o403n250m473l805
$$ 715355 708508 700960 692478 683423 674364 665368 656064 646442 637235 629314 622911 617661 613188 609383
60603F09383l188k766k514k171j575r30o03p02r55j117j160j027m75M99J387J758
$$ 609383 606195 603429 600915 598744 597169 596239 595636 594934 593979 592862 591702 590675 590200 590699 592086 593844
60587E93844J966K574L236K953J555J43l48j87k4K40R84J891K261K061J855J938
$$ 593844 595810 598384 601620 604573 606128 606271 605923 605736 605712 605952 606936 608827 611088 613149 615004 616942
60571F16942K270L029M461O125P127P218P128P727R247J1339J3421J4946J5736
$$ 616942 619212 622241 626702 632827 639954 647172 654300 662027 671274 682613 696034 710980 726716
60558G26716J6123J6432J6590J6559J6800J7647J8454J8196J6863J5441J4548
$$ 726716 742839 759271 775861 792420 809220 826867 845321 863517 880380 895821 910369
60547I10369J3836J2830J1492R746P266M053O16k724o059r243j1751j3522j5188
$$ 910369 924205 937035 948527 958273 965539 969592 970208 967484 961425 952182 940431 926909 911721
60534I11721j6949j7995j7559j6038j4427j3179j2196j1422j0737r634p769n696
$$ 911721 894772 876777 859218 843180 828753 815574 803378 791956 781219 771585 763816 758120
60522G58120m358l942l808l485l128k993k995k983l018l180l346l297k887k096
$$ 758120 753762 749820 746012 742527 739399 736406 733411 730428 727410 724230 720884 717587 714700 712604
60508G12604j000K67J543K634L339L662M002M739N625N995N779N807O728P993
$$ 712604 711604 711871 713414 716048 719387 723049 727051 731790 737415 743410 749189 754996 761724 769717
60494G69717Q501Q033P494P720Q550R213R320R209R449J0111J0669J0721J0803
$$ 769717 778218 786251 793745 801465 810015 819228 828548 837757 847206 857317 867986 878707 889510
60481H89510J2026J4767J8003K0372K1565K2257K2815K2726K1281J8334J4157
$$ 889510 901536 916303 934306 954678 976243 998500 1021315 1044041 1065322 1083656 1097813
60470A097813R088L609j579n965r566j2522j4524j5105j4340j2857j0976q363
$$ 1097813 1106901 1110510 1108931 1102966 1093400 1080878 1066354 1051249 1036909 1024052 1013076 1004713
60458A004713m758o88K979O000Q726J1258J3276J4775J6274J8008J9502K0414
$$ 1004713 999955 999267 1002246 1008246 1016972 1028230 1041506 1056281 1072555 1090563 1110065 1130479
60446A130479K1283K2833K5011K7362L0155L4274M0031M6857N4215O2138P0764
$$ 1130479 1151762 1174595 1199606 1226968 1257123 1291397 1331428 1378285 1432500 1494638 1565402
60435A565402P9977Q9771J00354J11659J23285J35120J47485J60510J73889J87543
$$ 1565402 1645379 1735150 1835504 1947163 2070448 2205568 2353053 2513563 2687452 2874995
60425B874995K01806K16464K29817K38828K39785K28870K03192J62239J08220
$$ 2874995 3076801 3293265 3523082 3761910 4001695 4230565 4433757 4595996 4704216
60416D704216M4924k3141r0401j50438j98097k31497k51551k60032k58792k50176
$$ 4704216 4749140 4725999 4635598 4485160 4287063 4055566 3804015 3543983 3285191 3035015
60406C035015k36830k20768k03206j85244j67930j51689j36385j22043j08967
$$ 3035015 2798185 2577417 2374211 2188967 2021037 1869348 1732963 1610920 1501953
60397A501953r7156q6225p6059o6919n8895n1774m5547m0487l6581l3438l0763
$$ 1501953 1404797 1318572 1242513 1175594 1116699 1064925 1019378 978891 942310 908872 878109
60386H78109k8469k6281k3863k1456j9722j8783j8042j7092j6166j5434j4609
$$ 878109 849640 823359 799496 778040 758318 739535 721493 704401 688235 672801 658192
60375F58192j3598j2817j2359j1550r947q182p095o557n959n377n256n197m247
$$ 658192 644594 631777 619418 607868 597921 589739 582644 576087 570128 564751 559495 554298 550051
60362E50051k440j048r05j361j398r48n73m03j60J76M00O58J268K126K816L244
$$ 550051 547611 546563 545658 544297 542899 541951 541378 540975 540815 540991 541391 542049 543317 545443 548259 551503
60346E51503L578L576K804J621J210K119L384L669K930K263K433L241M252N309
$$ 551503 555081 558657 561461 563082 564292 566411 569795 573464 576394 578657 581090 584331 588583 593892
60332E93892O157O261N464M420L904L906L787L168K321J719J520J494J259N68
$$ 593892 600049 606310 611774 616194 620098 624004 627791 630959 633280 634999 636519 638013 639272 639840
60318F39840m15j163j273r36p44r54j199j028n82m35p94j148q96j17N57P90Q82
$$ 639840 639425 638262 636989 636053 635309 634355 633156 632128 631546 631111 630317 629169 628273 628156 628713 629503 630385
60301F30385J273J965K648L056L014K401J434P60R09J779K931M147N357O244O533
$$ 630385 631658 633623 636271 639327 642341 644742 646176 646936 647845 649624 652555 656702 662059 668303 674836
60286F74836O443O361O179N598M941M814M938M245K482P62L4j07m60p70k75Q32
$$ 674836 681279 687640 693819 699417 704358 709172 714110 718355 720837 721599 721633 721526 721066 720296 720021 720853
60270G20853J528J390J032J116J703K643L811M741M688L465J758L81n64j489k626
$$ 720853 722381 723771 724803 725919 727622 730265 734076 738817 743505 746970 748728 749109 748545 747056 744430
60255G44430l757m502m639m212l468k699k197k193k615k833k030j92J579K168
$$ 744430 740673 736171 731532 727320 723852 721153 718956 716763 714148 711315 709285 709093 710672 712840
60241G12840J686J202J363J787J903J807K107L109M387N062M506L002J607J178
$$ 712840 714526 715728 717091 718878 720781 722588 724695 727804 732191 737253 741759 744761 746368 747546
60227G47546J622K270K762L138L327L159K865K923L281L269K610J959K099K995
$$ 747546 749168 751438 754200 757338 760665 763824 766689 769612 772893 776162 778772 780731 782830 785825
60213G85825M017M808N480O184O954P837Q842R770J0450J1144J2363J4192J6078
$$ 785825 789842 794650 800130 806314 813268 821105 829947 839717 850167 861311 873674 887866 903944
60200I03944J7509J8650K0098K2076K4198K6101K7999L0388L3388L6653L9867
$$ 903944 921453 940103 960201 982277 1006475 1032576 1060575 1090963 1124351 1161004 1200871
60189A200871M3014M6123M9151N2313N6179O1010O6230P0888P4666P8112Q1917
$$ 1200871 1243885 1290008 1339159 1391472 1447651 1508661 1574891 1645779 1720445 1798557 1880474
60178A880474Q6191R0426R3821R5563R5148R2680Q8770Q3984P8373P1593O3442
$$ 1880474 1966665 2057091 2150912 2246475 2341623 2434303 2523073 2607057 2685430 2757023 2820465
60167B820465N4250M4743L5449K6354J7218Q216L3o749j2129j6404j9691k1798
$$ 2820465 2874715 2919458 2954907 2981261 2998479 3006695 3006728 2999979 2987850 2971446 2951755 2929957
60155B929957k2479k1583j9122j5335j0496m645K268R902J7611K5169L3001M1421
$$ 2929957 2907478 2885895 2866773 2851438 2840942 2836297 2838565 2848467 2866078 2891247 2924248 2965669
60143B965669N0160N8856O7436P5484Q1810Q5470Q6816Q6756Q5295Q1760P6207
$$ 2965669 3015829 3074685 3142121 3217605 3299415 3384885 3471701 3558457 3643752 3725512 3801719
60132C801719O9440O1567N1705L9510K6082J2763j78j3009k5357l6287m5315n2579
$$ 3801719 3871159 3932726 3984431 4023941 4050023 4062786 4062608 4049599 4024242 3987955 3942640 3890061
60120C890061n8186o1872o3301o2358n9185n4154m7661l9818l0572k0216r451
$$ 3890061 3831875 3770003 3706702 3644344 3585159 3531005 3483344 3443526 3412954 3392738 3383287
60109C383287J254J1970K2667L2723M1483M8996N5570O0769O3519O3240O0409
$$ 3383287 3384541 3396511 3419178 3451901 3493384 3542380 3597950 3658719 3722238 3785478 3845887
60098C845887N5825M9813M2415L4037K5495J7451J0158L767j393n034p118p556
$$ 3845887 3901712 3951525 3993940 4027977 4053472 4070923 4081081 4084848 4083455 4078421 4071303 4063747
60086D063747n885j703M594J2077K0451L0369M2219N5228O8398Q1820R6247J11747
$$ 4063747 4057862 4056159 4060753 4072830 4093281 4123650 4165869 4221097 4289495 4371315 4467562 4579309
60074D579309J27737J44186J61593J79689J97259K13654K29372K44642K58401
$$ 4579309 4707046 4851232 5012825 5192514 5389773 5603427 5832799 6077441 6335842
60065F335842K69500K77887K83684K85786K82661K74162K61323K44539K23091
$$ 6335842 6605342 6883229 7166913 7452699 7735360 8009522 8270845 8515384 8738475
60056H738475J96726J66590J34170J00004O3954K6206j2475n1144q8885j24707
$$ 8738475 8935201 9101791 9235961 9335965 9399919 9426125 9413650 9362506 9273621 9148914
60046I148914j57517j86118k09350k26421k37220k42061k41222k34983k24026
$$ 9148914 8991397 8805279 8595929 8369508 8132288 7890227 7649005 7414022 7189996
60037G189996k09303j91420j70624j47583j23651r9931p6543n3252l0528r426
$$ 7189996 6980693 6789273 6618649 6471066 6347415 6247484 6170941 6117689 6087161 6077735
60027F077735R497K6384M1053N2334N8946O0791N8882N4008M6049L4784K0908
$$ 6077735 6087232 6113616 6154669 6207003 6265949 6326740 6385622 6439630 6485679 6520463 6541371
60016F541371N786r649k5219m0810n5884o9939q2986r5221j06494j16420j24849
$$ 6541371 6547157 6537508 6512289 6471479 6415595 6345656 6262670 6167449 6060955 5944535 5819686
60005E819686j31735j36674j39018j38574j35857j31487j25620j18050j08668
$$ 5819686 5687951 5551277 5412259 5273685 5137828 5006341 4880721 4762671 4654003
59996D654003r7644q5360p2287n8846m5207l1319j7221l170J0649K4282L7686
$$ 4654003 4556359 4470999 4398712 4339866 4294659 4263340 4246119 4242949 4253598 4277880 4315566
59985D315566N0346O1568P1038P8746Q4324Q6953Q6168Q2370P6164O7485N5960
$$ 4315566 4365912 4427480 4498518 4577264 4661588 4748541 4834709 4917079 4993243 5060728 5116688
59974E116688M2000K6839J1289m928k2192l9765n6141p0341q2307r2156r9609
$$ 5116688 5158688 5185527 5196816 5191888 5169696 5129931 5073790 5003449 4921142 4828986 4729377
59963D729377j04297j06134j05175j01522r5548q7919p9082o8920n7190m4228
$$ 4729377 4625080 4518946 4413771 4312249 4216701 4128782 4049700 3980780 3923590 3879362
59953C879362l0956j8204o123N769J8044L0974M4504N8442P2418Q5826R8080J09071
$$ 3879362 3848406 3830202 3824079 3829848 3847892 3878866 3923370 3981812 4054230 4140056 4238136 4347207
59941D347207J18946J27271J32788J34398J32110J26556J17921J05947R0940P3972
$$ 4347207 4466153 4593424 4726212 4860610 4992720 5119276 5237197 5343144 5434084 5508056
59931E508056N5936L6987J7107l246k3335m2488o0133p5803q9286j00259j07751
$$ 5508056 5563992 5600979 5618086 5614840 5591505 5549017 5488884 5413081 5323795 5223536 5115785
59920E115785j10616j08899j04037r7326q8705p7595o4321m9980l5251k0249n346
$$ 5115785 5005169 4896270 4792233 4694907 4606202 4528607 4464286 4414306 4379055 4358806 4353460
59909D353460Q721K1655L3893M5789N7002O6864P4948Q1113Q5314Q7613Q8197
$$ 4353460 4362181 4383836 4417729 4463518 4520520 4587384 4662332 4743445 4828759 4916372 5004569
59898E004569Q7149Q4370P9850P3904O7057N9797N2504M5587L9496L4530L0716
$$ 5004569 5091718 5176088 5255938 5329842 5396899 5456696 5509200 5554787 5594283 5628813 5659529
59887E659529K8036K6924K8303L2798M0061M9272O0309P3928R0675J10153J31498
$$ 5659529 5687565 5714489 5742792 5775590 5815651 5864923 5925232 5999160 6089835 6199988 6331486
59876F331486J54037J77099J99764K21326K41646K60504K76910K89480K97059
$$ 6331486 6485523 6662622 6862386 7083712 7325358 7585862 7862772 8152252 8449311
59867H449311K98372K91571K75059K48640K13185J69370J17806O0424O53n8130
$$ 8449311 8747683 9039254 9314313 9562953 9776138 9945508 10063314 10123738 10124391 10066261
59857A0066261j13646j63955k06842k40676k65297k81317k89040k88798k81879
$$ 10066261 9952615 9788660 9581818 9341142 9075845 8794528 8505488 8216690 7934811
59848G934811k70151k54693k35517k12696j87252j60778j34527j08984q3935n8897
$$ 7934811 7664660 7409967 7174450 6961754 6774502 6613724 6479197 6370213 6286278 6227381
59838F227381l3755r156J3939L4981N3955P0862Q5436R7220J05489J09077J06882
$$ 6227381 6193626 6184470 6198409 6233390 6287345 6358207 6443643 6540863 6646352 6755429 6862311
59827F862311R8636Q4805O5711M1373J2425j9551n2976q6933j20288j50862j76439
$$ 6862311 6960947 7045752 7111463 7152836 7165261 7145710 7092734 7005801 6885513 6734651 6558212
59816F558212j96316k11101k21120k26092k26293k22916k16930k08403j97322
$$ 6558212 6361896 6150795 5929675 5703583 5477290 5254374 5037444 4829041 4631719
59807D631719j84296j69991j54794j39491j25437j13206j01845r0359p9296o9867
$$ 4631719 4447423 4277432 4122638 3983147 3857710 3744504 3642659 3552300 3473004 3403137
59797C403137o2196n5654n0513m7695m6832m6031m4042m1471l9323l7340l4492
$$ 3403137 3340941 3285287 3234774 3187079 3140247 3094216 3050174 3008703 2969380 2932040 2897548
59786B897548l0474k5913k1573j7925j5232j3649j3452j5156j8940k3846k8220
$$ 2897548 2867074 2841161 2819588 2801663 2786431 2772782 2759330 2744174 2725234 2701388 2673168
59775B673168l1191l3125l4446l4807l3850l1954k9624k6784k3275j9387j5343
$$ 2673168 2641977 2608852 2574406 2539599 2505749 2473795 2444171 2417387 2394112 2374725 2359382
59764B359382j0863n880j168K593N841R428J3361J7078K0671K4811K9627L4437
$$ 2359382 2348519 2342639 2341471 2344064 2349905 2359333 2372694 2389772 2410443 2435254 2464881 2499318
59752B499318L8615M1995M4418M5639M5798M5408M4757M3673M1838L9007L5082
$$ 2499318 2537933 2579928 2624346 2669985 2715783 2761191 2805948 2849621 2891459 2930466 2965548
59741B965548L0460K6108K2763K0210J7857J5856J5083J6115J8808K2796K7896
$$ 2965548 2996008 3022116 3044879 3065089 3082946 3098802 3113885 3130000 3148808 3171604 3199500
59730C199500L4031M1235M9703N9501P0387Q2275R5493J10163J25670J41448J57804
$$ 3199500 3233531 3274766 3324469 3383970 3454357 3536632 3632125 3742288 3867958 4009406 4167210
59719D167210J75281J93565K11844K29849K47324K62466K71848K71896K59660
$$ 4167210 4342491 4536056 4747900 4977749 5225073 5487539 5759387 6031283 6290943
59710F290943K32608J89554J32734O8109K914n6852j06944j44670j69389j82601
$$ 6290943 6523551 6713105 6845839 6913948 6916862 6860010 6753066 6608396 6439007 6256406
59700F256406j86577j83063j73503j59699j43378j25421j06190q6361o6877m8215
$$ 6256406 6069829 5886766 5713263 5553564 5410186 5284765 5178575 5092214 5025337 4977122
59690D977122l0241j2697M478K1196L7329N2846O8030Q3293R8733J14129J29535
$$ 4977122 4946881 4934184 4938662 4959858 4997187 5050033 5118063 5201356 5300089 5414218 5543753
59679E543753J45461J62235J79616J97321K15583K34875K55355K76905K99561
$$ 5543753 5689214 5851449 6031065 6228386 6443969 6678844 6934199 7211104 7510665
59670G510665L23519L48816L75163M02003M28710M54882M80391N04836N26897
$$ 7510665 7834184 8183000 8558163 8960166 9388876 9843758 10324149 10828985 11355882
59661A1355882N44633N56472N61678N60050N51764N37730N19558M99013M77831
$$ 11355882 11900515 12456987 13018665 13578715 14130479 14668209 15187767 15686780 16164611
59652A6164611M58070M41984M31231M26507M27778M34164M43500M52924M60201
$$ 16164611 16622681 17064665 17495896 17922403 18350181 18784345 19227845 19680769 20140970
59643B0140970M63841M61708M50608M28093L94034L49803K96704K36178J71010
$$ 20140970 20604811 21066519 21517127 21945220 22339254 22689057 22985761 23221939 23392949
59634B3392949J05112M2156j4925o3353j00613j25432j37966j38698j27671j05079
$$ 23392949 23498061 23540217 23525292 23461939 23361326 23235894 23097928 22959230 22831559 22726480
59624B2726480p2123l0876J6646O9174J26084J86813K50349L15301L80355M44313
$$ 22726480 22654357 22623481 22640127 22709301 22835385 23022198 23272547 23587848 23968203 24412516
59614B4412516N05408N60749O06594O39068O54482O49245O19860N63172M76955
$$ 24412516 24917924 25478673 26085267 26724335 27378817 28028062 28647922 29211094 29688049
59605B9688049L61039K18589N6370j16462k90023m54707o01732p24054q17441
$$ 29688049 30049088 30267677 30324047 30207585 29917562 29462855 28861123 28137069 27319628
59596B7319628q80904r16254r27150r17948q92822q55772q11351p65000p22459
$$ 27319628 26438724 25522470 24595320 23677372 22784550 21928778 21117427 20352427 19629968
59587A9629968o88977o68697o63686o72520o89987p08961p23171p28784p24319
$$ 19629968 18940991 18272294 17608608 16936088 16246101 15537140 14813969 14085185 13360866
59578A3360866p09958o86974o57178o22525n84991n46366n07838m69885m32750
$$ 13360866 12650908 11963934 11306756 10684231 10099240 9552874 9045036 8575151 8142401
59569H142401l96866l62713l30577l00660k73132k47914k24637k03088j83335
$$ 8142401 7745535 7382822 7052245 6751585 6478453 6230539 6005902 5802814 5619479
59560E619479j65328j48752j33572j20130j08419r7779q7845p9296p3037o9023
$$ 5619479 5454151 5305399 5171827 5051697 4943278 4845499 4757654 4678358 4605321 4536298
59550D536298o6555o5396o5865o7891p0760p3796p6740p9385q1366q2433q2597
$$ 4536298 4469743 4404347 4338482 4270591 4199831 4126035 4049295 3969910 3888544 3806111 3723514
59539C723514q1871q0159p7358p3431o8548o3294n8376n3750m8497m2020l5015
$$ 3723514 3641643 3561484 3484126 3410695 3342147 3278853 3220477 3166727 3118230 3076210 3041195
59528C041195k8574k2769j6893j0863n393p37L720Q411J2873J6530J9524K2386
$$ 3041195 3012621 2989852 2972959 2962096 2956703 2955966 2959686 2968097 2980970 2997500 3017024 3039410
59516C039410K5262K7923L0175L1950L3310L4600L6432L9247M3063M7698N2975
$$ 3039410 3064672 3092595 3122770 3154720 3188030 3222630 3259062 3298309 3341372 3389070 3442045
59505C442045N8678O4672P1146P8418Q6384R4538J02718J11338J20693J30467
$$ 3442045 3500723 3565395 3636541 3714959 3801343 3895881 3998599 4109937 4230630 4361097
59495D361097J40343J50700J62099J74249J86023J96603K06113K14976K22953
$$ 4361097 4501440 4652140 4814239 4988488 5174511 5371114 5577227 5792203 6015156
59486F015156K29203K33082K34587K33846K30541K24088K14368K02132J88545
$$ 6015156 6244359 6477441 6712028 6945874 7176415 7400503 7614871 7817003 8005548
59477H005548J74423J59670J43463J25171J05465Q6417P0126N7168M6772L8347
$$ 8005548 8179971 8339641 8483104 8608275 8713740 8800157 8870283 8927451 8974223 9012570
59467I012570L2339K9489K9877L3022L8328M5095N2405N9381O5168O8320O6696
$$ 9012570 9044909 9074398 9104275 9137297 9175625 9220720 9273125 9332506 9397674 9465994 9532690
59456I532690N8478M3146K1234o346l8372p3269j09723j46984j84017k18803k49167
$$ 9532690 9591168 9634314 9655548 9649202 9610830 9537561 9427838 9280854 9096837 8878034 8628867
59445H628867k74036k93251l06565l13573l14453l09895l00526k87063k70762
$$ 8628867 8354831 8061580 7755015 7441442 7126989 6817094 6516568 6229505 5958743
59436E958743k52845k33679k13317j92592j72656j53551j34454j15357r7271q0599
$$ 5958743 5705898 5472219 5258902 5066310 4893654 4740103 4605649 4490292 4393021 4312422
59426D312422o4539m8506l2987j8441m494R141K2022L4111M6561O0316P4623Q7984
$$ 4312422 4247883 4199377 4166390 4147949 4143455 4152596 4174618 4208729 4255290 4315606 4390229 4478213
59414D478213J00133J12061J24346J36471J47609J57224J64842J69934J72072
$$ 4478213 4578346 4690407 4814753 4951224 5098833 5256057 5420899 5590833 5762905
59405E762905J70761J65217J54791J39426J19296R4287O4478L0948m466m0186
$$ 5762905 5933666 6098883 6253674 6393100 6512396 6606683 6671161 6702109 6697643 6657457
59395F657457p5163j08274j38160j63695j84229j99439k09492k15247k17674k16986
$$ 6657457 6582294 6474020 6335860 6172165 5987936 5788497 5579005 5363758 5146084 4929098
59385D929098k12886k05694j96654j86895j76583j65381j53328j41044j29295
$$ 4929098 4716212 4510518 4313864 4126969 3950386 3785005 3631677 3490633 3361338
59376C361338j18528j08582r8812q8759p8789o9693o1634n3977m6315l9098l2843
$$ 3361338 3242810 3134228 3035416 2946657 2867868 2798175 2736541 2682564 2636249 2597151 2564308
59365B564308k7199k1379j5269r487m369M23N110R235J2287J4580J7009K0081
$$ 2564308 2537109 2515730 2500461 2490974 2486605 2487028 2492138 2501373 2513660 2528240 2545249 2565330
59353B565330K3730K7875L2433L6540L8553L7588L4839L2673L2553L4433L8014
$$ 2565330 2589060 2616935 2649368 2685908 2724461 2762049 2796888 2829561 2862114 2896547 2934561
59342B934561M3591N1336O0578P0361Q0127Q9310R6859J02140J06200J11340J19335
$$ 2934561 2978152 3029488 3090066 3160427 3240554 3329864 3426723 3528863 3635063 3746403 3865738
59331C865738J30456J44067J59523J76425J94632K14209K34990K56374K78028
$$ 3865738 3996194 4140261 4299784 4476209 4670841 4885050 5120040 5376414 5654442
59322E654442L00630L24950L50219L74297L95732M14514M30252M40789M43822
$$ 5654442 5955072 6280022 6630241 7004538 7400270 7814784 8245036 8685825 9129647
59313I129647M39154M28145M11353L88254L59300L26774K93088K59254K25535
$$ 9129647 9568801 9996946 10408299 10796553 11155853 11482627 11775715 12034969 12260504
59304A2260504J92656J61346J31364J01737P1770M1187R672k3022n6722r1071
$$ 12260504 12453160 12614506 12745870 12847607 12919377 12960564 12970236 12947214 12890492 12799421
59294A2799421j25868j60541j93568k23146k48392k69362k86161k98855l08210
$$ 12799421 12673553 12513012 12319444 12096298 11847906 11578544 11292383 10993528 10685318
59285A0685318l15603l21975l27495l32324l36913l41126l43838l43952l41298
$$ 10685318 10369715 10047740 9720245 9387921 9051008 8709882 8366044 8022092 7680794
59276G680794l36168l28490l18124l05503k91374k76102k59757k42629k25153
$$ 7680794 7344626 7016136 6698012 6392509 6101135 5825033 5565276 5322647 5097494
59267E097494k07515j89798j72440j56009j40618j26023j12172r9284q7420p6429
$$ 5097494 4889979 4700181 4527741 4371732 4231114 4105091 3992919 3893635 3806215 3729786
59257C729786o6249n6835m7786l8545k9119k0229j2590o231n98M905J0549J6240
$$ 3729786 3663537 3606702 3558916 3520371 3491252 3471023 3458433 3452202 3451604 3456509 3467058 3483298
59245C483298K1816K7397L3399L9961M6510N2143N6504N9997O3187O6181O8612
$$ 3483298 3505114 3532511 3565910 3605871 3652381 3704524 3761028 3821025 3884212 3950393 4019005
59234D019005P0069P0473P0137O9402O8317O6741O4781O2758O0749N8614N6605
$$ 4019005 4089074 4159547 4229684 4299086 4367403 4434144 4498925 4561683 4622432 4681046 4737651
59223D737651N5510N5817N7184N9102O1594O4734O7968P0605P2676P4499P5507
$$ 4737651 4793161 4848978 4906162 4965264 5026858 5091592 5159560 5230165 5302841 5377340 5452847
59212E452847P4267O9657O1465M9926L5436J8786R99j7189l5120n1544o4931p4693
$$ 5452847 5527114 5596771 5658236 5708162 5743598 5762384 5763383 5746194 5711074 5659530 5594599 5519906
59200E519906q1451q5884q7952q7430q4539p9631p2869o4538n5268m5545l5425
$$ 5519906 5438455 5352571 5264619 5177189 5092650 5013019 4940150 4875612 4820344 4774799 4739374
59189D739374k5044j4906n342L883J3022K1760K9563L6308M2189M7359N1893N5889
$$ 4739374 4714330 4699424 4694082 4697965 4710987 4732747 4762310 4798618 4840807 4888166 4940059 4995948
59177D995948N9355O2446O5937P1028P8263Q7128R6997J07985J20441J34198J48855
$$ 4995948 5055303 5117749 5183686 5254714 5332977 5420105 5517102 5625087 5745528 5879726 6028581
59166F028581J64314J80308J95763K09301K20055K27216K29132K23858K10612
$$ 6028581 6192895 6373203 6568966 6778267 6998322 7225538 7454670 7678528 7889140
59157G889140J89790J61509J25153Q0802L0273k3747p8967j33354j84413k29624
$$ 7889140 8078930 8240439 8365592 8446394 8476667 8452920 8373953 8240599 8056186 7826562
59147G826562k67472k97441l19212l32578l38118l37114l30528l18782l02796
$$ 7826562 7559090 7261649 6942437 6609859 6271741 5934627 5604099 5285317 4982521
59138D982521k84505k65702k46842k27647k08493j90396j73799j58338j43801
$$ 4982521 4698016 4432314 4185472 3957825 3749332 3558936 3385137 3226799 3082998
59129C082998j30489j18391j06964r6132q6694p9129p2718o6526o0629n5529n0922
$$ 3082998 2952509 2834118 2727154 2631022 2544328 2465199 2392481 2325955 2265326 2209797 2158875
59118B158875m6063m1055l6656l2954k9264k5423k2110j9587j7063j3751r842
$$ 2158875 2112812 2071757 2035101 2002147 1972883 1947460 1925350 1905763 1888700 1874949 1865107
59107A865107o009k505P95L987P148J0363J3489J6279J8957K2090K5680K8960
$$ 1865107 1859098 1856593 1857388 1861375 1868523 1878886 1892375 1908654 1927611 1949701 1975381 2004341
59095B004341L1483L3787L6486L9310M1678M3822M6532M9895N3061N5350N7162
$$ 2004341 2035824 2069611 2106097 2145407 2187085 2230907 2277439 2327334 2380395 2435745 2492907
59084B492907N9433O2457O5422O7252O7762O7794O7999O7812O6091O2631N8448
$$ 2492907 2552340 2614797 2680219 2747471 2815233 2883027 2951026 3018838 3084929 3147560 3206008
59073C206008N4443N0445M5811M0422L4717K9181K4307K0674J8606J7851J7983
$$ 3206008 3260451 3310896 3356707 3397129 3431846 3461027 3485334 3506008 3524614 3542465 3560448
59062C560448J9064K1564K5764L1341L7600M4020N0731N8369O7269P6896Q6338
$$ 3560448 3579512 3601076 3626840 3658181 3695781 3739801 3790532 3848901 3916170 3993066 4079404
59051D079404R5295J04132J13014J21531J29178J35633J40368J42541J41533J37017
$$ 4079404 4174699 4278831 4391845 4513376 4642554 4778187 4918555 5061096 5202629 5339646
59041E339646J28425J14917R6318P3573M8047K0746p360l4828o0027q1833r9793
$$ 5339646 5468071 5582988 5679306 5752879 5800926 5821672 5814312 5779484 5719457 5637624 5537831
59030E537831j13868j24270j31314j35297j36662j36171j34542j31981j28562
$$ 5537831 5423963 5299693 5168379 5033082 4896420 4760249 4625707 4493726 4365164
59021D365164j24941j22056j20169j18878j17980j17557j17251j16530j15662
$$ 4365164 4240223 4118167 3997998 3879120 3761140 3643583 3526332 3409802 3294140
59012C294140j15323j15021j13219j09443j05106j01534r8374r4666r0383q5951
$$ 3294140 3178817 3063796 2950577 2841134 2736028 2634494 2536120 2441454 2351071 2265120
59002B265120q1301p6469p2219o8953o5689o1295n6135n1396m7455m3955m0997
$$ 2265120 2183819 2107350 2035131 1966178 1900489 1839194 1783059 1731663 1684208 1640253 1599256
58991A599256l8882l7148l5076l2925l1542l0952l0363k9490k8776k8425k8057
$$ 1599256 1560374 1523226 1488150 1455225 1423683 1392731 1362368 1332878 1304102 1275677 1247620
58980A247620k7318k6049k4083k1574j9268j7707j6488j5028j3504j2214j0687
$$ 1247620 1220302 1194253 1170170 1148596 1129328 1111621 1095133 1080105 1066601 1054387 1043700
58969A043700q551o623n764n231l633j284J00l2m42j64L60N80Q15J377J857J834
$$ 1043700 1035149 1028526 1022762 1017531 1013898 1012614 1012714 1012682 1012240 1012076 1012436 1013016 1013831 1015208 1017065 1018899
58953A018899J385O45k02l73R24L093M528M686M666N407O535P490Q421R362R720
$$ 1018899 1020284 1020929 1020727 1020354 1021278 1024371 1028899 1033585 1038251 1043658 1050193 1057683 1066104 1075466 1085186
58938A085186R377R258R960J0769J0885J0779J1386J2654J3772J4331J4488J4422
$$ 1085186 1094563 1103821 1113781 1124550 1135435 1146214 1157600 1170254 1184026 1198357 1212845 1227267
58926A227267J4309J4435J4741J4735J4295J4051J4485J5179J5532J5650J5964
$$ 1227267 1241576 1256011 1270752 1285487 1299782 1313833 1328318 1343497 1359029 1374679 1390643
58915A390643J6522J7210J8155J9403K0620K1643K2798K4263K5633K6699K7986
$$ 1390643 1407165 1424375 1442530 1461933 1482553 1504196 1526994 1551257 1576890 1603589 1631575
58904A631575K9900L1926L3407L4593L6188L8188L9951M1144M1951M2565M3114
$$ 1631575 1661475 1693401 1726808 1761401 1797589 1835777 1875728 1916872 1958823 2001388 2044502
58893B044502M3970M5529M7740N0232N2815N5577N8704O2400O6694P1200P5474
$$ 2044502 2088472 2134001 2181741 2231973 2284788 2340365 2399069 2461469 2528163 2599363 2674837
58882B674837P9793Q4953R1083R7400J03511J10218J18323J27394J36493J45569
$$ 2674837 2754630 2839583 2930666 3028066 3131577 3241795 3360118 3487512 3624005 3769574
58872C769574J55317J66065J77700J90347K04280K19349K35237K52118K70370
$$ 3769574 3924891 4090956 4268656 4459003 4663283 4882632 5117869 5369987 5640357
58863E640357K89879L10363L32075L55360L79683M04030M28197M52724M77406
$$ 5640357 5930236 6240599 6572674 6928034 7307717 7711747 8139944 8592668 9070074
58854I070074N00784N21367N38472N51363N58267N56829N45218N22241M86783
$$ 9070074 9570858 10092225 10630697 11182060 11740327 12297156 12842374 13364615 13851398
58845A3851398M37775L74873K98960K12110J17329J8276q1138j77133k66207l45254
$$ 13851398 14289173 14664046 14963006 15175116 15292445 15310721 15229583 15052450 14786243 14440989
58835A4440989m11945m65325n05810n34320n51375n57279n53177n41357n24200
$$ 14440989 14029044 13563719 13057909 12523589 11972214 11414935 10861758 10320401 9796201
58826I796201n03041m78468m51393m23222l95153l67821l41608l16742k93147
$$ 9796201 9293160 8814692 8363299 7940077 7544924 7177103 6835495 6518753 6225606
58817F225606k70805k50252k32121k16218k01757j88482j76732j66222j55791
$$ 6225606 5954801 5704549 5472428 5256210 5054453 4865971 4689239 4523017 4367226
58808D367226j44734j33637j23335j13796j04556r5608q7223p9426p2177o5548
$$ 4367226 4222492 4088855 3965520 3851724 3747168 3651560 3564337 3484911 3412734 3347186
58798C347186n9251n2628m5617l9052l3383k7816k1483j4862r048m109Q53O401
$$ 3347186 3287935 3235307 3189690 3150638 3117255 3089439 3067956 3053094 3044046 3039937 3040790 3047191
58786C047191J2399J8719K5322L1831L7935M4009N0505N6950O2592O7977P4677
$$ 3047191 3059590 3078309 3103631 3135462 3173397 3217406 3267911 3324861 3387453 3455430 3530107
58775C530107Q3219R2304J00459J07678J14960J23067J32308J42888J54744J67301
$$ 3530107 3613326 3705630 3806089 3913767 4028727 4151794 4284102 4426990 4581734 4749035
58765D749035J79999J92948K06784K21978K38625K56692K76128K96767L18415
$$ 4749035 4929034 5121982 5328766 5550744 5789369 6046061 6322189 6618956 6937371
58756F937371L41079L64919L89889M15472M40802M64993M87162N06157N20443
$$ 6937371 7278450 7643369 8033258 8448730 8889532 9354525 9841687 10347844 10868287
58747A0868287N28465N28913N20360N00829M68305M21768L61457K88218K03395
$$ 10868287 11396752 11925665 12446025 12946854 13415159 13836927 14198384 14486602 14689997
58738A4689997J09641J1096q7783j83330k72395l51719m18497m71483n11148n38754
$$ 14689997 14799638 14810734 14722951 14539621 14267226 13915507 13497010 13025527 12514379 11975625
58728A1975625n55533n62423n60217n50001n33619n13227m90194m64912m37959
$$ 11975625 11420092 10857669 10297452 9747451 9213832 8700605 8210411 7745499 7307540
58719G307540m10734l84451l59154l34445l10692k88653k68427k49675k32580
$$ 7307540 6896806 6512355 6153201 5818756 5508064 5219411 4950984 4701309 4468729
58710D468729k17595k04358j91829j79487j67605j56421j45847j36034j27304
$$ 4468729 4251134 4046776 3854947 3675460 3507855 3351434 3205587 3069553 2942249
58701B942249j19352j11410j03298r5641q8779q2343p6091p0407o5457o0668n5534
$$ 2942249 2822897 2711487 2608189 2512548 2423769 2341426 2265335 2194928 2129471 2068803 2013269
58690B013269n0436m6045m2432l9270l6544l4424l2658l0740k8652k6920k5842
$$ 2013269 1962833 1916788 1874356 1835086 1798542 1764118 1731460 1700720 1672068 1645148 1619306
58679A619306k5016k3880k2492k1465k1175k1230k0957k0264j9756j9905k0446
$$ 1619306 1594290 1570410 1547918 1526453 1505278 1484048 1463091 1442827 1423071 1403166 1382720
58668A382720k0742k0558k0171j9961k0109k0603k1262k1855k2342k2781k3002
$$ 1382720 1361978 1341420 1321249 1301288 1281179 1260576 1239314 1217459 1195117 1172336 1149334
58657A149334k2668k1901k1387k1498k1719k1370k0482j9456j8305j6900j5673
$$ 1149334 1126666 1104765 1083378 1061880 1040161 1018791 998309 978853 960548 943648 927975
58646I27975j5179j5077j4397j2986j1896j2058j3068j3626j2863j1027r143q135
$$ 927975 912796 897719 883322 870336 858440 846382 833314 819688 806825 795798 786655 778520
58634G78520q058q153p798p211o902o760o256n436m947m996m901l979k408r67
$$ 778520 770462 762309 754511 747300 740398 733638 727382 721946 716999 712003 707102 703123 700715 699748
58620F99748k14j89o01j039j237j286j493j921k266k219j833j430j358j696k112
$$ 699748 699534 699345 698744 697705 696468 695182 693689 691768 689502 687283 685450 684020 682662 680966 678854
58605F78854k027j129K81J537K093J794R86M52P53J469J618J154J355L111N506
$$ 678854 676827 675698 675979 677516 679609 681403 682389 682841 683594 685063 686681 687835 689190 692301 697807
58590F97807O960P397Q146R928J2034J3595J4655J5605J6417J6954J7538J8758
$$ 697807 704767 712164 720310 730238 742272 755867 770522 786127 802544 819498 837036 855794
58578H55794K0874K3565K6089K7795K8855L0338L3030L6377L9216M1417M4056
$$ 855794 876668 900233 926322 954117 982972 1013310 1046340 1082717 1121933 1163350 1207406
58567A207406M7939N2766N7979O3574O9756P6365Q3009Q9453R5728J02328J10189
$$ 1207406 1255345 1308111 1366090 1429664 1499420 1575785 1658794 1748247 1843975 1946303 2056492
58556B056492J19814J30317J40039J48208J55163J60745J63520J62120J56509
$$ 2056492 2176306 2306623 2446662 2594870 2750033 2910778 3074298 3236418 3392927
58547C392927J47101J33332J14038Q9029N9544K7384n722l7971o7508r2987j13912
$$ 3392927 3540028 3673360 3787398 3876427 3935971 3963355 3957633 3919662 3852154 3759167 3645255
58536C645255j30285j42150j49495j52500j51740j48131j42548j35537j27451
$$ 3645255 3514970 3372820 3223325 3070825 2919085 2770954 2628406 2492869 2365418
58527B365418j18733j09862j01070r2411q3983p5894o8075o0500n3448m7184m1536
$$ 2365418 2246685 2136823 2035753 1943342 1859359 1783465 1715390 1654890 1601442 1554258 1512722
58516A512722l6262l1711k8501k6494k4807k2972k1455k0715k0379j9803j9020
$$ 1512722 1476460 1444749 1416248 1389754 1364947 1341975 1320520 1299805 1279426 1259623 1240603
58505A240603j8595j8847j9627k0673k1759k2572k2858k2763k2782k3237k3850
$$ 1240603 1222008 1203161 1183534 1162861 1141102 1118530 1095672 1072909 1050127 1026890 1003040
58494A003040k3989k3358k2330k1471k0808j9822j8240j6388j4713j3279j2017
$$ 1003040 979051 955693 933363 911892 891084 871262 853022 836634 821921 808642 796625
58483G96625j1019j0279r574q927q720q917q775p885o905o580o532n956m984m377
$$ 796625 785606 775327 765753 756826 748106 739189 730414 722529 715624 709044 702512 696556 691572 687195
58469F87195m232m095m094m740n675n875n136m209l370k163q03m72j597l028l581
$$ 687195 682963 678868 674774 670034 664359 658484 653348 649139 645769 643606 642803 642331 640734 637706 634125
58454F34125l477l567l990m395m685m852m687m273m226m789n278n006m270l829
$$ 634125 630648 627081 623091 618696 614011 609159 604472 600199 595973 591184 585906 580900 576630 572801
58440E72801l949m410m995n404n178m321l552l478l886m236m334m130l433k408
$$ 572801 568852 564442 559447 554043 548865 544544 540992 537514 533628 529392 525058 520928 517495 515087
58426E15087j774j878k093j733j135j121j780k504k950l233l298k877k071j396
$$ 515087 513313 511435 509342 507609 506474 505353 503573 501069 498119 494886 491588 488711 486640 485244
58412D85244j224j464j854k172k208j793r81j65N4p59k301l440l176j732k72N32
$$ 485244 484020 482556 480702 478530 476322 474529 473548 473383 473437 472678 470377 466937 463761 462029 461757 462289
58396D62289J105J995L030L749M156M521M800M743M383M070M044M109L695K345
$$ 462289 463394 465389 468419 472168 476324 480845 485645 490388 494771 498841 502885 506994 510689 513034
58382E13034L80j179j723j807k308l138l615l807m424n395n755n253m874n255
$$ 513034 513414 512235 510512 508705 506397 503259 499644 495837 491413 486018 480263 475010 470136 464881
58368D64881n603m923l471k273j716j402r42k97M04R42J120J050J007J015J023
$$ 464881 459278 454355 450884 448611 446895 445493 444551 444254 444658 445600 446720 447770 448777 449792 450815
58353D50815J424K628M118M766M314L622L358L355L474L998M820N226N051N011
$$ 450815 452239 454867 458985 463751 468065 471687 475045 478400 481874 485872 490692 495918 500969 505980
58339E05980N449N770N661N733O293O542N841M807M314M269M200M224M469M292
$$ 505980 511429 517199 522860 528593 534886 541428 547269 552076 556390 560659 564859 569083 573552 577844
58325E77844L107J359j18j149j885k077j583r92r07j092r83o00k25K40R43J665
$$ 577844 580951 582310 582192 581043 579158 577081 575498 574506 573599 572507 571524 570924 570699 570939 571882 573547
58309E73547K247K894L555L741L414L226L371L160K365J892K379L127L238K867
$$ 573547 575794 578688 582243 585984 589398 592624 595995 599155 601520 603412 605791 608918 612156 615023
58295F15023K458J785O75k06l39k00k54l3Q21J593J661J575J921K166J806J577
$$ 615023 617481 619266 619941 619735 619396 619196 618942 618909 619730 621323 622984 624559 626480 628646 630452 632029
58279F32029K251L223L682M151N380O632O698N913N592O058O702P296P806P635
$$ 632029 634280 637503 641185 645336 650716 657348 664046 669959 675551 681609 688311 695607 703413 711048
58265G11048O636O164P468R592J0578J0203R807R872R643Q927Q495Q632Q809Q862
$$ 711048 717684 723848 731316 740908 751486 761689 771496 781368 791011 799938 808433 817065 825874 834736
58251H34736R143R602R941J0446J1415J2141J1725J0682J0329J0902J1577J2079
$$ 834736 843879 853481 863422 873868 885283 897424 909149 919831 930160 941062 952639 964718
58239I64718J2864J3986J5061J6146J7426J8437J8809J9304K0755K2497K3252
$$ 964718 977582 991568 1006629 1022775 1040201 1058638 1077447 1096751 1117506 1140003 1163255
58228A163255K3153K3423K4436K5577K6628K7812K8836K9317K9820L1163L3062
$$ 1163255 1186408 1209831 1234267 1259844 1286472 1314284 1343120 1372437 1402257 1433420 1466482
58217A466482L4739L6306L8182L9855M0645M1113M2198M3667M4895M6400M8927
$$ 1466482 1501221 1537527 1575709 1615564 1656209 1697322 1739520 1783187 1828082 1874482 1923409
58206A923409N1870N4298N6744O0206O4127O7263O9709P2258P4593P6064P7483
$$ 1923409 1975279 2029577 2086321 2146527 2210654 2277917 2347626 2419884 2494477 2570541 2648024
58195B648024Q0140Q3855Q7859R2529R8290J03991J08620J13339J19534J26192
$$ 2648024 2728164 2812019 2899878 2992407 3090697 3194688 3303308 3416647 3536181 3662373
58185C662373J31804J37397J44860J53620J61990J70499J80702J92016K03079
$$ 3662373 3794177 3931574 4076434 4230054 4392044 4562543 4743245 4935261 5138340
58176E138340K15006K29744K46395K62983K80614L01844L25902L49772L73066
$$ 5138340 5353346 5583090 5829485 6092468 6373082 6674926 7000828 7350600 7723666
58167G723666L97529M22618M46286M69492M95308N24100N54063N85786O21440
$$ 7723666 8121195 8543813 8990099 9459591 9954899 10478999 11033062 11618848 12240288
58158A2240288O60436P01068P45608P98208Q58701R24204R95700J076597J166026
$$ 12240288 12900724 13601792 14347400 15145608 16004309 16928513 17924213 19000810 20166836
58149B0166836J260801J363264J479966J614215J768732J954238K184624K462936
$$ 20166836 21427637 22790901 24270867 25885082 27653814 29608052 31792676 34255612
58141C4255612K782052L139770L543580M003034M531594N154612N895861O749476
$$ 34255612 37037664 40177434 43721014 47724048 52255642 57410254 63306115 70055591
58133G0055591P678194Q642689R627730J0667218J1889157J3500143J5567270
$$ 70055591 77733785 86376474 96004204 106671422 118560579 132060722 147627992
58126A47627992J7662838J8747649J7607319J3632568P312872K4703o679194j1720958
$$ 147627992 165290830 184038479 201645798 215278366 222591238 222615941 215936747 204215789
58118B04215789j4735223j5940256j5863293j5076336j4012289j2898703j1802391
$$ 204215789 189480566 173540310 157677017 142600681 128588392 115689689 103887298
58111A03887298j0719325r638992q565202p515311o514450n585733m740648l978471
$$ 103887298 93167973 83528981 74963779 67448468 60934018 55348285 50607637 46629166
58103D6629166l293194k677388k121495j618172j170013p81908m36874r5394K48833
$$ 46629166 43335972 40658584 38537089 36918917 35748904 34966996 34530122 34434728 34683561
58094C4683561N03770N03151J38235n23934j267332j875042k247234k396630k377485
$$ 34683561 35187331 35690482 35828717 35304783 34037451 32162409 29915175 27518545 25141060
58085B5141060k243777k048750j841518j650660j481524j331164j197435j076045
$$ 25141060 22897283 20848533 19007015 17356355 15874831 14543667 13346232 12270187
58077A2270187r61256q52803p55355o70517n95681n30390m76974m34466l98132
$$ 12270187 11308931 10456128 9700773 9030256 8434575 7904185 7427211 6992745 6594613
58068F594613l65717l38658l16742k96906k77837k60800k45466k29705k13871
$$ 6594613 6228896 5890238 5573496 5276590 4998753 4737953 4492487 4262782 4048911
58059D048911k00541j89578j78063j65713j55671j49053j43215j36533j30664
$$ 4048911 3848370 3658792 3480729 3315016 3159345 3010292 2867077 2730544 2599880
58050B599880j26587j22314j16190j09255j02650r5678q7855q0376p4249o9132
$$ 2599880 2473293 2350979 2234789 2125534 2022884 1927206 1839351 1758975 1684726 1615594
58040A615594o4860o1877n9529n6250n1935m7993m4717m1098l7439l5375l4779
$$ 1615594 1550734 1488857 1429328 1373078 1321143 1273150 1228433 1187335 1149896 1114521 1079742
58029A079742l3408l0355k7299k5511k4178k2568k1437k1250k1124k0512k0031
$$ 1079742 1046334 1015979 988680 963169 938991 916423 894986 873736 852612 832100 812069
58018H12069j9849j9094j7575j6230j5359j4282j3133j2923j3386j2930j1275
$$ 812069 792220 773126 755551 739321 723962 709680 696547 683624 670238 657308 646033
58007F46033r978r770r573q842q528q968q992q130p528p694p501o439n773o162
$$ 646033 636055 626285 616712 607870 599342 590374 581382 573252 565724 558030 550529 544090 538317 532155
57993E32155o260m991l434k959l135k911k386k044j630j016r14j549j913j406
$$ 532155 525895 520904 517470 514511 511376 508465 506079 504035 502405 501389 500475 498926 497013 495607
57979D95607r06j109j292q99q29j734k453j715k36M81L93L69K60p33k347l484
$$ 495607 494701 493592 492300 491401 490572 488838 486385 484670 484434 484915 485308 485677 485937 485204 482857 479373
57963D79373l879m137m411m295l876l769m149m676n243n933o385n937m642l426
$$ 479373 475494 471357 466946 462651 458775 455006 450857 446181 440938 435005 428620 422683 418041 414615
57949D14615l104l459l539k826j997k233l549m413l641k060j304j469j275l23
$$ 414615 411511 408052 404513 401687 399690 397457 393908 389495 385854 383794 382490 381021 379746 379423
57935C79423L93L51K49M98M30l35j042j091j029j481k114k341k107j427j34J276
$$ 379423 379816 380167 380416 380914 381344 381009 379967 378876 377847 376366 374252 371911 369804 368377 368243 369519
57919C69519J636O16o97j327j488j646j706j815k662m095m646l598k333k479l660
$$ 369519 371155 371771 371074 369747 368259 366613 364907 363092 360430 356335 351689 348091 345758 343279 339619
57904C39619m341m096l636l315k906k515k474k538k223j707j523j619j571j469
$$ 339619 335278 331182 327546 324231 321325 318810 316336 313798 311575 309868 308345 306726 305155 303686
57890C03686j735k253k403j930j187o00k92l1O12J731K626K422J345N81O25P27
$$ 303686 301951 299698 297295 295365 294178 293578 293286 293255 293867 295598 298224 300646 301991 302572 303197 303924
57874C03924K80k58m76q91j924k911l067k753k741k990k955k584k119j493p37
$$ 303924 304204 303946 303470 302579 300655 297744 294677 291924 289183 286193 283238 280654 278535 277042 276305
57859B76305l91o45p39J2J123J749J913K108K319K351K478K868L004K668K694
$$ 276305 275914 275269 274530 274542 275665 277414 279327 281435 283754 286105 288583 291451 294455 297123 299817
57844B99817L666M600M199K875K121K230K094J090k04j191j959k659l190l671
$$ 299817 303483 308083 312282 315157 317278 319508 321602 322692 322488 321297 319338 316679 313489 309818
57830C09818m386n183n636n720n750n744n606n543n578n044l495j732q76p67l72
$$ 309818 305432 300249 294613 288893 283143 277399 271793 266250 260672 255628 252133 250401 249525 248758 248386
57815B48386M23P56M47M36J298K457L186L537L930M550N371O127O159N070L547
$$ 248386 248809 249565 250012 250448 251746 254203 257389 260926 264856 269406 274777 280904 287063 292133 295680
57800B95680K728K688K352J037o99j970k568k858l301m190n298n759n001l700
$$ 295680 298408 301096 303448 304485 303786 301816 299248 296390 293089 288899 283601 277842 272841 269141
57786B69141l111l486m060m485n211o240o634n818m505l758l758m002m123m057
$$ 269141 266030 262544 258484 253999 248788 242548 235914 230096 225591 221833 218075 214073 209950 205893
57772B05893l803l487l392l586l835m009m213m386m257l813l386l133k915k813
$$ 205893 202090 198603 195211 191625 187790 183781 179568 175182 170925 167112 163726 160593 157678 154865
57758A54865l191m052m754m720m028l156k438j956j667j443j178r05o41k88Q2
$$ 154865 151674 147622 142868 138148 134120 130964 128526 126570 124903 123460 122282 121377 120736 120448 120530
57743A20530J36q6J98J556L264L991L558L127L516M186M200L484K670K231K145
$$ 120530 120666 120580 120778 122334 125598 129589 133147 136274 139790 143976 148176 151660 154330 156561 158706
57728A58706K140J891J273N90L40O71J266J696J611Q45k79r59q67p73j629l145
$$ 158706 160846 162737 164010 164600 164940 165611 166877 168573 170184 171029 170750 169791 168924 168151 166522 163377
57712A63377m079l788k756j619o09L0qm63o66m87m01m81j91N97J272J463J535
$$ 163377 159298 155510 152754 151135 150526 150556 150548 150085 149419 148932 148531 148050 147859 148456 149728 151191 152726
57695A52726J791K043K271K847L645L835L137K424K465K820K705K251K104K324
$$ 152726 154517 156560 158831 161678 165323 169158 172295 174719 177184 180004 182709 184960 187064 189388
57681A89388K511K667L107L810M392M636M528M071L500L371L928M673M952M775
$$ 189388 191899 194566 197673 201483 205875 210511 215039 219110 222610 225981 229909 234582 239534 244309
57667B44309M647M928N706O974Q475R683J0333J0707J1119J1431J1469J1569J2250
$$ 244309 248956 253884 259590 266564 275039 284722 295055 305762 316881 328312 339781 351350 363600
57654C63600J3470J4587J5020J4854J4886J5983J8050J9925K0755K1253K2678
$$ 363600 377070 391657 406677 421531 436417 452400 470450 490375 511130 532383 555061
57643E55061K4895K6619K7658K9437L2754L6481L9360M1867M5136M9141N3195
$$ 555061 579956 606575 634233 663670 696424 732905 772265 814132 859268 908409 961604
57632I61604N7490O2787O9082P5842Q3043R0778R8332J04959J11247J18355J26044
$$ 961604 1019094 1081881 1150963 1226805 1309848 1400626 1498958 1603917 1715164 1833519 1959563
57621A959563J32797J37702J40719J41173J37505J29016J16494J00835Q2315O1781
$$ 1959563 2092360 2230062 2370781 2511954 2649459 2778475 2894969 2995804 3078119 3139900
57611C139900M1259K2559O169p952j9748l0292m2596n9561q0905j02926j21310
$$ 3139900 3181159 3203718 3209887 3201935 3182187 3151895 3109299 3049738 2968833 2865907 2744597
57600B744597j33770j40308j41855j39147j32652j23195j12275j01412r1164q1216
$$ 2744597 2610827 2470519 2328664 2189517 2056865 1933670 1821395 1719983 1628819 1547603
57590A547603p1410o2231n4052m6475l8884l1359k4595j9053j4449j0056n301
$$ 1547603 1476193 1413962 1359910 1313435 1274551 1243192 1218597 1199544 1185095 1175039 1169738
57579A169738j89M735R036J2966J7204K2027K7136L2333L7852M3804M9826N5662
$$ 1169738 1169549 1174284 1183320 1196286 1213490 1235517 1262653 1294986 1332838 1376642 1426468 1482130
57567A482130O1682O8445P5889Q3299Q9875R5050R8561J00511J01163J00286R6950
$$ 1482130 1543812 1612257 1688146 1771445 1861320 1956370 2054931 2155442 2256605 2356891 2453841
57556B453841R0303Q0269O7019N0127K9029M548k0764m4193o4500q1746r5986
$$ 2453841 2544144 2624413 2691432 2741559 2770588 2775136 2754372 2710179 2645679 2563933 2467947
57545B467947j06718j13530j16752j17190j15550j12283j07741j02247r6132q9930
$$ 2467947 2361229 2247699 2130947 2013757 1898207 1785924 1678183 1575936 1479804 1389874
57535A389874q4293p9402p4574o9006o2894n7280n2651m8306m3539l8864l5341
$$ 1389874 1305581 1226179 1151605 1082599 1019705 962425 909774 861468 817929 779065 743724
57524G43724l2973l0603k7497k4240k1859k0575j9799j8933j7715j6113j4312
$$ 743724 710751 680148 652651 628411 606552 585977 566178 547245 529530 513417 499105
57513D99105j2743j1687j0909r904q507p051n871m960m149l416k850k346j564
$$ 499105 486362 474675 463766 453862 445355 438304 432433 427473 423324 419908 417058 414712 413148
57500D13148k54J386K837L744M312N102O441Q078R450J0321J1015J2055J3618
$$ 413148 412894 414280 417117 420861 425173 430275 436716 444794 454244 464565 475580 487635 501253
57487E01253J5465J7314J9072K0728K2292K4005K6299K9262L2353L5037L7516
$$ 501253 516718 534032 553104 573832 596124 620129 646428 675690 708043 743080 780596
57476G80596M0418M3887M7551N1314N5523O0147O4518O8220P1664P5286P8588
$$ 780596 821014 864901 912452 963766 1019289 1079436 1143954 1212174 1283838 1359124 1437712
57465A437712Q0562Q0752P9246P5844O9823O0617M8343L3571J7005n98j8368l5208
$$ 1437712 1518274 1599026 1678272 1754116 1823939 1884556 1932899 1966470 1983475 1982877 1964509 1929301
57453A929301m9781o0998o8807p4186p7973p9999p9775p7623p4525p0998o6742
$$ 1929301 1879520 1818522 1749715 1675529 1597556 1517557 1437782 1360159 1285634 1214636 1147894
57442A147894o1437n5349m9189m3703l9344l5888l2447k8331k3873j9942j6783
$$ 1147894 1086457 1031108 981919 938216 898872 862984 830537 802206 778333 758391 741608
57431G41608j3844j0685p435m350j495J035L134N089P465J0370J3324J5974J8552
$$ 741608 727764 717079 709644 705294 703799 704834 707968 713057 720522 730892 744216 760190 778742
57418G78742K1436K4726K8401L2458L6627M0414M3691M7005N0956N5475N9946
$$ 778742 800178 824904 853305 885763 922390 962804 1006495 1053500 1104456 1159931 1219877
57407A219877O3828O6972O9377P0807P0673O8353O3616N6557M7005L4422J8724
$$ 1219877 1283705 1350677 1420054 1490861 1561534 1629887 1693503 1750060 1797065 1831487 1850211
57396A850211R97j7109l4427n0364o4277p5450q3713q9404r2751r3772r2728r0110
$$ 1850211 1851208 1834099 1799672 1749308 1685031 1609581 1525868 1436464 1343713 1249941 1157213 1067103
57384A067103q6184q1187p5826p0914o6490o1993n7307n2892m8841m4715m0469
$$ 1067103 980919 899732 823906 752992 686502 624509 567202 514310 465469 420754 380285
57373C80285l6708l3701l0952k8102k5503k3463k1625j9595j7566j5843j4253
$$ 380285 343577 309876 278924 250822 225319 201856 180231 160636 143070 127227 112974
57362A12974j2621j1341j0951j1400j2055j2221j1540j0204q978C183e225q058
$$ 112974 100353 89012 78061 66661 54606 42385 30845 20641 11663 3183 -5225 -13283
57350a3283p473p368p762p688o669n462m922m936n027n076m928m151k925k305
$$ -13283 -20756 -28124 -35886 -43574 -50243 -55705 -60627 -65563 -70590 -75666 -80594 -84745 -87670 -89975
57336h9975k845l700l885l670l827m259m371m147l896l441k601j944k078k596
$$ -89975 -92820 -96520 -100405 -104075 -107902 -112161 -116532 -120679 -124575 -128016 -130617 -132561 -134639 -137235
57322a37235k725k573k661k734k157j226q65j218j689k144k905l632l499k510
$$ -137235 -139960 -142533 -145194 -147928 -150085 -151311 -152176 -153394 -155083 -157227 -160132 -163764 -167263 -169773
57308a69773j612j313j278j299j524j643j027O0N05m6o59o40n22r76j662j901
$$ -169773 -171385 -172698 -173976 -175275 -176799 -178442 -179469 -179409 -178904 -178950 -179609 -180249 -180771 -181747 -183409 -185310
57292a85310j778j862k276k646k642k162j373q20j128k193l138l347l130l111
$$ -185310 -187088 -188950 -191226 -193872 -196514 -198676 -200049 -200869 -201997 -204190 -207328 -210675 -213805 -216916
57278b16916l333l353k837j840p75k75p04j629k164j956j530j486j821k177k330
$$ -216916 -220249 -223602 -226439 -228279 -229054 -229329 -230033 -231662 -233826 -235782 -237312 -238798 -240619 -242796 -245126
57263b45126k237j990j873k100k379k148j366o40m39n94o97n82k26L42Q37Q92
$$ -245126 -247363 -249353 -251226 -253326 -255705 -257853 -259219 -259859 -260298 -260892 -261589 -262171 -262397 -262055 -261218 -260326
57247b60326O30O89J369K179K482K311K277K770L508L827L438K916L233M600O099
$$ -260326 -259696 -259007 -257638 -255459 -252977 -250666 -248389 -245619 -242111 -238284 -234846 -231930 -228697 -224097 -217998
57232b17998O839P075P625Q543R147R283R654J0773J2294J3674J4858J6026J7121
$$ -217998 -211159 -204084 -196459 -187916 -178769 -169486 -159832 -149059 -136765 -123091 -108233 -92207 -75086
57219g5086J7816J7683J6434h869C143J0129Q083M988Q94l221o749G349e664j5847
$$ -75086 -57270 -39587 -23153 -8869 3143 13272 21355 26343 27237 24016 17267 7349 -5664 -21511
57205b1511j8134j9797k0786k1160k1319k1523k1315k0147j8465j7293j6797j6186
$$ -21511 -39645 -59442 -80228 -101388 -122707 -144230 -165545 -185692 -204157 -221450 -238247 -254433
57193b54433j5024j3566j1808r437o946n585n718o318o525o626o948o920o031
$$ -254433 -269457 -283023 -294831 -304268 -311214 -316799 -322517 -328835 -335360 -341986 -348934 -355854 -361885
57180c61885m789l855l017j870q53p00j253j574r89M37K142L436M034M456N402
$$ -361885 -366674 -370529 -373546 -375416 -376269 -376969 -378222 -379796 -380785 -380348 -378206 -374770 -370736 -366280 -360878
57165c60878O632P169O814O569P219Q397R528J0745J2285J3828J5047J6133J7205
$$ -360878 -354246 -347077 -340263 -333694 -326475 -318078 -308550 -297805 -285520 -271692 -256645 -240512 -223307
57152b23307J7925J8219J8612J9307J9806J9990K0674K2312K4068a7432G726K5360
$$ -223307 -205382 -187163 -168551 -149244 -129438 -109448 -88774 -66462 -42394 -17432 7726 33086
57140C3086K5569K5435K5011K4431K3445K2120K1236K1151K0928J9500J7236J5332
$$ 33086 58655 84090 109101 133532 156977 179097 200333 221484 242412 261912 279148 294480
57128B94480J4222J3364J2394J1476J0797J0282R719Q779P339N944N318N206M557
$$ 294480 308702 322066 334460 345936 356733 367015 376734 385513 392852 398796 404114 409320 413877
57115D13877L270K660L648N482O937P832Q587R294R996J1032J2278J3000J3021
$$ 413877 417147 419807 423455 428937 435874 443706 452293 461587 471583 482615 494893 507893 520914
57102E20914J3053J3168J2272R889P142M877K233j814o733j1699j7209k3948l1164
$$ 520914 533967 547135 559407 569296 576438 581315 583548 581734 575001 563302 546093 522145 490981
57089D90981l7772m4154n1292n9040o6722p4620G4001a8794j02575j13274j25212
$$ 490981 453209 409055 357763 298723 232001 157381 74001 -18794 -121369 -234643 -359855
57078c59855j37379j49000j61086j74877j89787k04535k19241k34757k51110k68237
$$ -359855 -497234 -646234 -807320 -982197 -1171984 -1376519 -1595760 -1830517 -2081627 -2349864
57068b349864k87092l08257l30724l53896l79513m09647m44077m81665n22823
$$ -2349864 -2636956 -2945213 -3275937 -3629833 -4009346 -4418993 -4863070 -5344735 -5867558
57059e867558n68519o18406o72269p31825p98718q72402r52561j041779j143075
$$ -5867558 -6436077 -7054483 -7726752 -8458577 -9257295 -10129697 -11082258 -12124037 -13267112
57050a3267112j256870j383501j526646j690732j876932k085514k320115k585883
$$ -13267112 -14523982 -15907483 -17434129 -19124861 -21001793 -23087307 -25407422 -27993305
57042b7993305k885900l224231l610552m057371m575185n175206n872802o679855
$$ -27993305 -30879205 -34103436 -37713988 -41771359 -46346544 -51521750 -57394552 -64074407
57034f4074407p593448q596059r663516j0768363j1882574j2983864j4047263
$$ -64074407 -71667855 -80263914 -89927430 -100695793 -112578367 -125562231 -139609494
57027a39609494j5017845j5814764j6405133j6872865j7350075j7816297j7962360
$$ -139609494 -154627339 -170442103 -186847236 -203720101 -221070176 -238886473 -256848833
57020b56848833j7293293j5405602j2210266p962750l148711J668160N990185
$$ -256848833 -274142126 -289547728 -301757994 -309720744 -312869455 -311201295 -305211110
57013c05211110R505134J2139305J4014449J5341624J6316171J7050916J7556459
$$ -305211110 -295705976 -283566671 -269552222 -254210598 -237894427 -220843511 -203287052
57006b03287052J7772599J7636882J7143707J6351762J5347694J4208896J2991402
$$ -203287052 -185514453 -167877571 -150733864 -134382102 -119034408 -104825512 -91834110
56999i1834110J1735968J0477370R250506Q090342P025283O070810N230435M500809
$$ -91834110 -80098142 -69620772 -60370266 -52279924 -45254641 -39183831 -33953396 -29452587
56991b9452587L874078L338471K881498K493374K165802J889163J653600J451980
$$ -29452587 -25578509 -22240038 -19358540 -16865166 -14699364 -12810201 -11156601 -9704621
56983i704621J279319J130304R99791Q84907P84324O96070O17991N49424M90222
$$ -9704621 -8425302 -7294998 -6295207 -5410300 -4625976 -3929906 -3311915 -2762491 -2272269
56974b272269M38811L93065L52366L16988K86295b25408A0810K16975J99828J82724
$$ -2272269 -1833458 -1440393 -1088027 -771039 -484744 -225408 10810 227785 427613 610337
56964F10337J65790J50402J36507J22840J09176R6310Q4142P1813N9497M8247
$$ 610337 776127 926529 1063036 1185876 1295052 1391362 1475504 1547317 1606814 1655061
56954A655061L8106K8017J7467O665m792j7682l1212m2703m9570n1024m7815m1128
$$ 1655061 1693167 1721184 1738651 1745316 1740524 1722842 1691630 1648927 1599357 1548333 1500518 1459390
56942A459390l1524j8490j754J5828K7408K5911R371j7458m6097o8703q1147q4004
$$ 1459390 1427866 1409376 1407622 1423450 1450858 1476769 1486140 1468682 1422585 1353882 1272735 1188731
56930A188731q0953p5530o9412o3575n9273n6767n4376n0525m5923m2354m0187
$$ 1188731 1107778 1032248 962836 899261 839988 783221 728845 678320 632397 590043 549856
56919E49856l8734l8110l8748l9598l8893l6539l3958l1617k8562k4550k0759
$$ 549856 511122 473012 434264 394666 355773 319234 285276 253659 225097 200547 179788
56908A79788j7924j5260j1819p724l592K48L566O105Q031R770J1306J2301J2823
$$ 179788 161864 146604 134785 127061 123469 123717 127283 133388 141419 151189 162495 174796 187619
56895A87619J3098J2733J1107Q447N550K585p98m209o548p325p059o337n451m785
$$ 187619 200717 213450 224557 233004 238554 241139 240341 236132 229584 222259 215200 208863 203412 198627
56881A98627m536m095k737q53N33J327K344L863N542P593J0578J3898J5876J5590
$$ 198627 194091 189996 187259 186406 186939 188266 190610 194473 200015 207608 218186 232084 247960 263550
56867B63550J3367R401L503l333q742j1272j1768j1783j1694j1051r761q057o159
$$ 263550 276917 286318 289821 286488 277746 266474 254706 242923 231229 220178 210417 202360 196201
56854A96201m464l361k346m10K231L920L809L127L334M096M247L791L656L950
$$ 196201 191737 188376 186030 185620 187851 191771 195580 198707 202041 206137 210384 214175 217831 221781
56840B21781L909L312K773K609K404J766Q76J17k99l22j09K5l1LL53Q01R59O27
$$ 221781 225690 229002 231775 234384 236788 238554 239430 239547 239248 238926 238817 238842 238811 238814 239167 239968 240927 241554
56822B41554l98k385n077p416q397q004o985n907m804l431j562P87L140M951O320
$$ 241554 241156 238771 233694 226278 217881 209877 202892 196985 192181 188750 187188 187975 191115 196066 202386
56807B02386P926R979J1921J3440J5105J7411J9836K1620K2834K3752K3531K0698
$$ 202386 210312 220291 232212 245652 260757 278168 298004 319624 342458 366210 389741 410439
56795D10439J5003P953J423l594o837q376q691q556q295p450n509k665L72L088
$$ 410439 425442 433395 434818 431224 424387 416011 407320 398764 390469 383019 377510 374845 375217 378305
56781C78305N413P515R684J2289J5550J9260K2918K6199K9037L1027L0917K7266
$$ 378305 383718 391233 400917 413206 428756 448016 470934 497133 526170 557197 588114 615380
56769F15380J9887J0353P29p890j5277k0947k4083k4646k3710k2371k0832j8837
$$ 615380 635267 645620 646349 638459 623182 602235 578152 553506 529796 507425 486593 467756
56757D67756j6303j3132r102m508l86K620N133Q089J1377J4248J6721J9394K1750
$$ 467756 451453 438321 429219 424711 424325 426945 432078 440167 451544 465792 482513 501907 523657
56744E23657K1802J7954J0702K074o011j2541j7195k0117k1819k2804k3085k2283
$$ 523657 545459 563413 574115 576189 570178 557637 540442 520325 498506 475702 452617 430334
56732D30334k0137j6846j3000r323o329m050k140l22J338K761M298O499R303J1658
$$ 430334 410197 393351 380351 371028 364699 360649 358509 358187 359525 362286 366584 373083 382386 394044
56718C94044J2183J0228O310J478l476q135j2054j4663j5751j5794j5534j5294
$$ 394044 406227 416455 422765 424243 420767 412632 400578 385915 370164 354370 338836 323542
56706C23542j4831j3848j2466j1093r943q814p444n999m957m458m046l260k273
$$ 323542 308711 294863 282397 271304 261361 252547 245103 239104 234147 229689 225643 222383 220110
56693B20110j609j379j284j250j545k058k140j470o83o22j270j883j984j758j495
$$ 220110 218501 217122 215838 214588 213043 210985 208845 207375 206692 206070 204800 202917 200933 199175 197680
56678A97680j234r89r29j156j600k184k905l594l886l521k648j708j179j360k182
$$ 197680 196446 195457 194528 193372 191772 189588 186683 183089 179203 175682 173034 171326 170147 168787 166605
56663A66605l098l388k801j847j241j108r35l70K05J58m13o06J56J251J455L95
$$ 166605 163507 160119 157318 155471 154230 153122 152187 151817 152022 152180 151767 151161 151317 152568 154023 154418
56647A54418j037j714j343m34L53N99K43k75k79L89J043R92N27N74J432K419K892
$$ 154418 153381 151667 150324 149890 150243 150842 151085 150810 150531 150920 151963 152955 153482 154056 155488 157907 160799
56630A60799L086L580M321M690M378L780L405L300L198L075L151L440L576L242
$$ 160799 163885 167465 171786 176476 180854 184634 188039 191339 194537 197612 200763 204203 207779 211021
56616B11021K557J889J447J282J490K062K554K352J429M68J9j25n14j200j724
$$ 211021 213578 215467 216914 218196 219686 221748 224302 226654 228083 228551 228570 228445 227931 226731 225007
56601B25007j733j296p40m59p46j462j932j635r16o13r54j312j191r42j159j743
$$ 225007 223274 221978 221238 220779 220033 218571 216639 215004 214088 213475 212521 211209 210018 209076 207917 206174
56585B06174k044j740j151p40n74m23j22K63O14R23J274J646J815J622J272J154
$$ 206174 204130 202390 201239 200499 199925 199502 199380 199643 200257 201180 202454 204100 205915 207537 208809 209963
56569B09963J285J179M71m95j028r13o53q00j328j754j721j342j041j141j579
$$ 209963 211248 212427 212898 212403 211375 210462 209809 209009 207681 205927 204206 202864 201823 200682 199103
56554A99103j969k019j863j870k126k256j938j379j097j299j698j965k029j861
$$ 199103 197134 195115 193252 191382 189256 187000 185062 183683 182586 181287 179589 177624 175595 173734
56540A73734j242j22J015J474J100M00p2j10L32J260K204K244J043l73n69N80
$$ 173734 172492 172370 173385 174859 175959 176359 176287 176177 176509 177769 179973 182217 183260 182887 182318 182898
56524A82898J758J929J430J081Q93M08j65l4R65J989K172J549Q52P81J584K869
$$ 182898 184656 186585 188015 189096 189989 190397 190232 190198 191163 193152 195324 196873 197725 198506 200090 202959
56508B02959L707L366K157J193J126J542J798J899K176K583K851L003L179L188
$$ 202959 206666 210032 212189 213382 214508 216050 217848 219747 221923 224506 227357 230360 233539 236727
56494B36727K820K326K064J839J219M01K8J95L49K47L32Q88J504J645J222L37
$$ 236727 239547 241873 243937 245776 246995 247396 247424 247619 247968 248215 248547 249435 250939 252584 253806 254143
56478B54143r18k095k466j956j485j827k598k897k568k198k122k111j894j397
$$ 254143 253225 251130 248664 246708 245223 243396 240798 237901 235333 233135 231013 228902 227008 225611
56464B25611o72k6r3j062k072k015r82k03m87j395k086k278k124j743j357j330
$$ 225611 224939 224913 224820 223758 221686 219671 218689 218486 217999 216604 214518 212240 210116 208373 207016 205686
56448B05686j687j849j304l37K94K35k25o31p61o28m42n00r23j368j235k55J101
$$ 205686 203999 202150 200846 200509 200803 201038 200813 200182 199421 198793 198351 197851 196928 195560 194325 194070 195171
56431A95171J929J707Q60L78P45J434J637J291J061J375J986K523L018L670M323
$$ 195171 197100 198807 199667 200045 200790 202224 203861 205152 206213 207588 209574 212097 215115 218785 223108
56416B23108M499L888K679J475Q85J052J615K160K599K929K912K459K061K232
$$ 223108 227607 231495 234174 235649 236534 237586 239201 241361 243960 246889 249801 252260 254321 256553
56402B56553K639K506J935J995L168M513M873M368L989M188M549M575M183L507
$$ 256553 259192 261698 263633 265628 268796 273309 278182 282550 286539 290727 295276 299851 304034 307541
56388C07541K844K581K749K776K262J752K064K984L411K826J842J067K47j012
$$ 307541 310385 312966 315715 318491 320753 322505 324569 327553 330964 333790 335632 336699 336946 335934
56374C35934k323l025l190l477m108m594m556m281m216m316m159l627l154l221
$$ 335934 333611 330586 327396 323919 319811 315217 310661 306380 302164 297848 293689 290062 286908 283687
56360B83687l830m529m881m725m076l064k034j458j474j679j584j180q07o18n00
$$ 283687 279857 275328 270447 265722 261646 258582 256548 255090 253616 251937 250353 249173 248366 247748 247248
56345B47248m59o72j055j163p21q3J64j04m40l97l7K15J23p6K2L95N44J45m14
$$ 247248 246789 246117 245062 243899 243178 243095 243259 243155 242715 242318 242281 242496 242619 242543 242565 242960 243504 243649 243235
56326B43235m21L14J255J773J782J654J789K246K641K417J431L25o3L45Q34Q65
$$ 243235 242814 243128 244383 246156 247938 249592 251381 253627 256268 258685 260116 260441 260378 260723 261557 262422
56310B62422O61O34P51Q50J142J876K707K971K508J772J167P30M18L02L33L14
$$ 262422 263083 263717 264468 265318 266460 268336 271043 274014 276522 278294 279461 280191 280609 280911 281244 281558
56294B81558K64M29Q67J319J640K037K627L071K855J915P81J31K61Q69J415J720
$$ 281558 281822 282251 283118 284437 286077 288114 290741 293812 296667 298582 299363 299494 299755 300624 302039 303759
56278C03759K130K918L798M368M761N373O025O121N649N315N451N612N542N775
$$ 303759 305889 308807 312605 316973 321734 327107 333132 339253 344902 350217 355668 361280 366822 372597
56264C72597O653P501P550P060O774O661O253N826O103O825O850N893N097N346
$$ 372597 379250 386751 394301 401361 408135 414796 421049 426875 432978 439803 446653 452546 457643 462989
56250D62989N932N598M337L311L262L748L894L483L064L239L968M634M736M361
$$ 462989 468921 474519 478856 482167 485429 489177 493071 496554 499618 502857 506825 511459 516195 520556
56236E20556L924L719M029N181P067Q866R840J0270J0934J1933J2781J3542J4805
$$ 520556 524480 528199 532228 537409 544476 553342 563182 573452 584386 596319 609100 622642 637447
56223F37447J6505J7842J8643J9760K1660K3608K4889K5957K7635K9940L2470
$$ 637447 653952 671794 690437 710197 731857 755465 780354 806311 833946 863886 896356
56212H96356L5299L8613M2079M5375M8892N3066N7525O1746O6132P1569P8181
$$ 896356 931655 970268 1012347 1057722 1106614 1159680 1217205 1278951 1345083 1416652 1494833
56201A494833Q5387R2865J00598J08274J15526J22583J29821J36787J42578J46942
$$ 1494833 1580220 1673085 1773683 1881957 1997483 2120066 2249887 2386674 2529252 2676194
56191B676194J50130J51708J50523J45929J38253J27986J15219R9940Q2261O2417
$$ 2676194 2826324 2978032 3128555 3274484 3412737 3540723 3655942 3755882 3838143 3900560
56181C900560M1175K0036K74j8035l5212n0591o3054p2693q0620q7117r1454r3722
$$ 3900560 3941735 3961771 3962045 3944010 3908798 3858207 3795153 3722460 3641840 3554723 3463269 3369547
56169C369547r5400r7455r9165r9602r9234r9182r9769j00573j01257j01538j00991
$$ 3369547 3274147 3176692 3077527 2977925 2878691 2779509 2679740 2579167 2477910 2376372 2275381
56158B275381r9624r8085r6666r4641r1368q7390q3693q0287p6378p1643o6539
$$ 2275381 2175757 2077672 1981006 1886365 1794997 1707607 1623914 1543627 1467249 1395606 1329067
56147A329067o1565n6863n2416m8094m3658l9183l5245l2332l0168k8035k5524
$$ 1329067 1267502 1210639 1158223 1110129 1066471 1027288 992043 959711 929543 901508 875984
56136H75984k2709j9926j7677j6363j5725j4928j3536j1975j0680r368p705o078
$$ 875984 853275 833349 815672 799309 783584 768656 755120 743145 732465 723097 715392 709314
56124G09314n012m293l330k121j039k0J275K619L418L733M357N759P538R101J0296
$$ 709314 704302 700009 696679 694558 693519 693499 694774 697393 700811 704544 708901 714660 722198 731299 741595
56109G41595J1231J1879J2116J1908J1350J0670J0086R501Q487O873N152L977
$$ 741595 752826 764705 776821 788729 800079 810749 820835 830336 838823 845696 850848 854825
56097H54825L460L297L347L542L533L075K787L727O024Q524J0194J1387J3270
$$ 854825 858285 861582 864929 868471 872004 875079 877866 881593 887617 896141 906335 917722 930992
56084I30992J6262J9668K2866K6210L0490L5772M1373M6872N2680N9358O6644
$$ 930992 947254 966922 989788 1015998 1046488 1082260 1123633 1170505 1223185 1282543 1349187
56073A349187P3426P8420Q0684P9817P6120P0496O3879N6941N0458M5415M1947
$$ 1349187 1422613 1501033 1581717 1661534 1737654 1808150 1872029 1928970 1979428 2024843 2066790
56062B066790L8545L3195K5330J6019O393l132j2007j9160k4093k7711l1507l6413
$$ 2066790 2105335 2138530 2163860 2179879 2186272 2183140 2171133 2151973 2127880 2100169 2068662 2032249
56050B032249m2701n0249n8293o5429p0488p3148p3441p1223o6594o0401n3785
$$ 2032249 1989548 1939299 1881006 1815577 1745089 1671941 1598500 1527277 1460683 1400282 1346497
56039A346497m7437m1627l6518l2152k8332k4922k1999j9594j7613j6070j4976
$$ 1346497 1299060 1257433 1220915 1188763 1160431 1135509 1113510 1093916 1076303 1060233 1045257
56028A045257j3925j2420j0698r498q919q178o836n393m333l326j958m60P94J933
$$ 1045257 1031332 1018912 1008214 998716 989797 981619 974783 969390 965057 961731 959773 959313 960107 962040
56014I62040L158M309N269O296P444Q194Q206P893P862Q272Q988R844J0445J0464
$$ 962040 965198 969507 974776 981072 988516 996710 1004916 1012809 1020671 1028943 1037931 1047775 1058220 1068684
56000A068684J0326J0929J2390J3924J5152J6546J8299J9857K0989K2143K3294
$$ 1068684 1079010 1089939 1102329 1116253 1131405 1147951 1166250 1186107 1207096 1229239 1252533
55989A252533K3655K3205K3183K4325K5841K6980K8305L0411L2555L3773L4318
$$ 1252533 1276188 1299393 1322576 1346901 1372742 1399722 1428027 1458438 1490993 1524766 1559084
55978A559084L4929L5653L6428L7788L9876M1775M2946M4236M6396M8732N0510
$$ 1559084 1594013 1629666 1666094 1703882 1743758 1785533 1828479 1872715 1919111 1967843 2018353
55967B018353N2464N5490N8888O1415O3256O5489O8382P1465P4460P7034P8672
$$ 2018353 2070817 2126307 2185195 2246610 2309866 2375355 2443737 2515202 2589662 2666696 2745368
55956B745368P9969Q2795Q7827R3268R7378J00847J05102J09866J14352J19319
$$ 2745368 2825337 2908132 2995959 3089227 3186605 3287452 3392554 3502420 3616772 3736091
55946C736091J25803J33048J39843J46736J54845J63760J72845J83174J95786
$$ 3736091 3861894 3994942 4134785 4281521 4436366 4600126 4772971 4956145 5151931
55937E151931K09309K21992K34829K50005K67417K85680L05350L27957L52704
$$ 5151931 5361240 5583232 5818061 6068066 6335483 6621163 6926513 7254470 7607174
55928G607174L77303M01455M26528M52442M78052N04016N32301N63325N96435
$$ 7607174 7984477 8385932 8812460 9264902 9742954 10246970 10779271 11342596 11939031
55919A1939031O32414O72636P16836P64703Q18504Q81020R52211J030999J118320
$$ 11939031 12571445 13244081 13960917 14725620 15544124 16425144 17377355 18408354 19526674
55910A9526674J214969J319072J430238J553957J697613J865749K064761K307814
$$ 19526674 20741643 22060715 23490953 25044910 26742523 28608272 30673033 32980847
55902C2980847K606460K959384L357288L797014M284191M828018N445873O169971
$$ 32980847 35587307 38546691 41903979 45700993 49985184 54813202 60259075 66429046
55894F6429046P035195Q059999R249086J0608739J2144955J3855757J5735885
$$ 66429046 73464241 81524240 90773326 101382065 113527020 127382777 143118662
55887A43118662J7729742J9557893K0537759J9698178J6300013J0418599L065782
$$ 143118662 160848404 180406297 200944056 220642234 236942247 247360846 250426628
55880B50426628m288161j0400696j4658968j7057989j7953674j7815463j7061230
$$ 250426628 246138467 235737771 221078803 204020814 186067140 168251677 151190447
55873A51190447j5977908j4723754j3383573j2019975j0688107r429061q266863
$$ 151190447 135212539 120488785 107105212 95085237 84397130 74968069 66701206
55866F6701206p212263o267673n432564m706761m087133l562550l116642k735641
$$ 66701206 59488943 53221270 47788706 43081945 38994812 35432262 32315620 29579979
55858B9579979k410418k132443j893022j686647j510748j361470j233125j121870
$$ 29579979 27169561 25037118 23144096 21457449 19946701 18585231 17352106 16230236
55850A6230236j026281r43989q70925q04367p43820o88619o37332n89711n46667
$$ 16230236 15203955 14259966 13389041 12584674 11840854 11152235 10514903 9925192 9378525
55841I378525n07978m72268m39302m09955l83923l59694l36795l15934k96919
$$ 9378525 8870547 8398279 7958977 7549022 7165099 6805405 6468610 6152676 5855757
55832E855757k78675k61312k46033k32914k20709k08954j98257j88509j78764
$$ 5855757 5577082 5315770 5069737 4836823 4616114 4407160 4208903 4020394 3841630
55823C841630j69013j60257j52604j45129j37723j31402j26516j22267j18215
$$ 3841630 3672617 3512360 3359756 3214627 3076904 2945502 2818986 2696719 2578504
55814B578504j14761j11901j08822j04858r9726r3047q4986p7117p1068o6427
$$ 2578504 2463743 2351842 2243020 2138162 2038436 1945389 1860403 1783286 1712218 1645791
55804A645791o1452n5648n0140m5605m1577l7805l4588l1676k8454k5464k4103
$$ 1645791 1584339 1528691 1478551 1432946 1391369 1353564 1318976 1287300 1258846 1233382 1209279
55793A209279k4563k5531k6168k6827k7513k7269k5673k3567k1683j9752j7528
$$ 1209279 1184716 1159185 1133017 1106190 1078677 1051408 1025735 1002168 980485 960733 943205
55782I43205j5505j3982j2536j0963r740r083q483p727p443q060r061r824j0463
$$ 943205 927700 913718 901182 890219 880479 871396 862913 855186 847743 839683 830622 820798 810335
55769H10335j1289j2116j2608j2833j3070j3412j3789j4081j4149j4158j4613
$$ 810335 799046 786930 774322 761489 748419 735007 721218 707137 692988 678830 664217
55758F64217j5572j6107j5407j3990j2901j1979j0257p842o057n459n137m343
$$ 664217 648645 632538 617131 603141 590240 578261 568004 560162 554105 548646 543509 539166
55746E39166l445k821k077j050m16n19o42k44N0m15j144j484j994l558n649o812
$$ 539166 535721 532900 530823 529773 529357 528838 528196 527952 528002 527587 526443 524959 522965 519407 513758 506946
55730E06946o788o842p782q710q362o921n739n535n695n465n133n455o286o609
$$ 506946 500158 493316 485534 476824 468462 461541 455802 450267 444572 439107 433974 428519 422233 415624
55716D15624o109n856o888q623r513r021q138p946q430q915r044q943q697q088
$$ 415624 409515 403659 396771 388148 378635 369614 361476 353530 345100 336185 327141 318198 309501 301413
55702C01413o925n533m719m841n079m199k294r27j106j984k282k144k471l095
$$ 301413 294488 288955 284236 279395 274316 270117 267823 266896 265790 263806 261524 259380 256909 253814
55688B53814l076k524k596l612m512m509m048l755l545l231l095l249l288k996
$$ 253814 250738 248214 245618 242006 237494 232985 228937 225182 221637 218406 215311 212062 208774 205778
55674B05778k645k235j342j41L51l31j331j729j753j989k250k093j875k231k883
$$ 205778 203133 200898 199556 199415 199766 199435 198104 196375 194622 192633 190383 188290 186415 184184 181301
55659A81301k963k270j457j034r80j175j586j969j973j643j312j055o00K17J226
$$ 181301 178338 176068 174611 173577 172597 171422 169836 167867 165894 164251 162939 161884 161284 161501 162727
55644A62727K164K791K918K558K008J554J206R43R58J360J912K309K581K814K809
$$ 162727 164891 167682 170600 173158 175166 176720 177926 178869 179827 181187 183099 185408 187989 190803 193612
55629A93612K449K238K819L970M666M296L299K406J737J005L01Q6M21P46O20L45
$$ 193612 196061 198299 201118 205088 209754 214050 217349 219755 221492 222497 222798 222884 223305 224051 224671 225016
55613B25016N01J074J481J463J459J851K327K332J900J557J508J434J093P09N84
$$ 225016 225517 226591 228072 229535 230994 232845 235172 237504 239404 240961 242469 243903 244996 245705 246289
55598B46289P02P79N61K2n30o07q3M92M39k72j126j830k494l128l529l777m243
$$ 246289 246991 247770 248331 248353 247823 247216 247133 247625 248064 247792 246666 244836 242342 239214 235685 231908 227665
55581B27665m947n440n542n698o228o741o716o284n941n806n619n338n193n211
$$ 227665 222718 217278 211736 206038 199810 193069 186353 180069 174128 168322 162703 157365 152172 146961
55567A46961n078m546l738l045k801l092l644l973l746l020k118j380j036j146
$$ 146961 141883 137337 133599 130554 127753 124661 121017 117044 113298 110278 108160 106780 105744 104598
55553A04598j508j844k063k180j996j257k79N6o40j587j642o96K47L65j23n16
$$ 104598 103090 101246 99183 97003 95007 93750 93471 93527 92887 91300 89658 88962 89209 89574 89451 88935
55537H8935n99o85r82j309j417j276r47m90m2J55M8j20j62k74p05j213j233n91
$$ 88935 88336 87651 86669 85360 83943 82667 81720 81230 81188 81343 81391 81271 81109 80835 80130 78917 77684 77093
55519G7093K50O96M85l34j465k284k245j577j154j336j462q91l5K29j66m90l50
$$ 77093 77343 78039 78524 78190 76725 74441 72196 70619 69465 68129 66667 65776 65741 65970 65804 65314 64964
55502F4964r7j75n69j013j216r23j25P83J422J838K161K088J349M25J14M28O21
$$ 64964 64867 64692 64123 63110 61894 60971 60846 61629 63051 64889 67050 69138 70487 70912 71026 71454 72075
55485G2075L94L31R54J957K662K712K142J225M97M87J150J884K207K129J906J843
$$ 72075 72469 72800 73754 75711 78373 81085 83227 84452 84949 85436 86586 88470 90677 92806 94712 96555
55469I6555K291L227L917L581K470J580J311J141P35M40M20J67n88j295j429j296
$$ 96555 98846 102073 105990 109571 112041 113621 114932 116073 116808 117248 117668 117835 117247 115952 114523 113227
55453A13227j428j756j985k213k574k774k638k657l272m012m049l380k768k667
$$ 113227 111799 110043 108058 105845 103271 100497 97859 95202 91930 87918 83869 80489 77721 75054
55439G5054k833k882k687k241j608j054q68j128j691k302k530k080j350j167j635
$$ 75054 72221 69339 66652 64411 62803 61749 60881 59753 58062 55760 53230 51150 49800 48633 46998
55424D6998j789q97M32J068Q04K79j13m42o69o78p27j058j212n43O46J259Q14
$$ 46998 45209 44312 44744 45812 46616 46895 46782 46340 45671 44993 44266 43208 41996 41453 42099 43358 44172
55407D4172j40j003j745k356k448j873j107o68n15l56j12J83N77R94J135Q64M77
$$ 44172 44032 43029 41284 38928 36480 34607 33500 32832 32317 31961 31849 32032 32609 33603 34738 35602 36079
55390C6079L15L22J98k22q45j350j252k52J225K139J783N09o30q90m49j04m70
$$ 36079 36394 36716 36914 36692 35847 34497 33245 32993 34218 36357 38140 38649 38019 37129 36680 36576 36106
55373C6106j385k032j757p31L15Q34P56J99n76r85m74P42J692J697J056M23r9
$$ 36106 34721 32689 30932 30201 30516 31350 32106 32305 31729 30744 30270 31012 32704 34401 35457 35880 35781
55356C5781p49j344j312n29M00Q34P24L95Q2j04m4K17K92j32p63r67o19l13n15
$$ 35781 35032 33688 32376 31847 32247 33081 33805 34200 34282 34178 34134 34351 34643 34511 33748 32781 32162 31849 31334
55337C1334r27j032r04j019j364j349n88O23J715K289K086J109j5l75J54N56j03
$$ 31334 30407 29375 28471 27452 26088 24739 24151 24774 26489 28778 30864 31973 31958 31583 31737 32293 32190
55320C2190j384j997j384k22N69Q12R14J184J451J231K25j197k060j685m71M76
$$ 32190 30806 28809 27425 27203 27772 28584 29498 30682 32133 33364 33589 32392 30332 28647 28176 28652
55304B8652N34J26L9N28J216J610J431O58m34j286j348o46J25J92m90j236j473
$$ 28652 29186 29312 29351 29879 31095 32705 34136 34794 34360 33074 31726 31080 31205 31397 30907 29671 28198
55287B8198j313j122q26j85N06N76Rm04j39M51Q48J153J549J626R39r7o73p12
$$ 28198 26885 25763 24937 24752 25258 25834 25843 25439 25300 25751 26599 27752 29301 30927 31866 31769 31096 30384
55269C0384p49q30m39L76P07P9p13n46N81J572J456K86j010j395n39Q56J634J318
$$ 30384 29635 28805 28366 28742 29449 29528 28815 28269 28850 30422 31878 32164 31154 29759 29220 30076 31710 33028
55251C3028M95Km5j24n09r35j035p92m68k67j35J40O44J113J069L08p76j464j320
$$ 33028 33523 33525 33480 33356 32847 31912 30877 30085 29617 29350 29215 29355 29999 31112 32181 32489 31713 30249 28929
55232B8929n69J36K94l7l52j95L85Q80Q09J77n03o63j84N20R77J078R53N57k40
$$ 28929 28360 28496 28790 28753 28401 28206 28591 29471 30280 30457 29954 29291 29107 29627 30604 31682 32635 33192 32952
55213C2952j153j490q92J90J036J404J501J414J009L15l76p73p34k85K93N06J15
$$ 32952 31799 30309 29417 29607 30643 32047 33548 34962 35971 36286 35910 35137 34403 34118 34411 34917 35032
55196C5032n00p61n73k15K28Q43J348J262O78K98L75K60n62j542j703r59j22K50
$$ 35032 34532 33771 33198 32983 33211 34054 35402 36664 37342 37640 38015 38275 37713 36171 34468 33509 33387 33637
55178C3637L94O61Q31M49m75j354j578j036k15J89r2n84n25K84J217J475R02K0
$$ 33637 34031 34692 35523 35972 35497 34143 32565 31529 31314 31503 31411 30827 30302 30586 31803 33278 34180 34200
55160C4200n67o15k71J35L13K29J62L46O46P61P19Q75J324J668J538J069O40L68
$$ 34200 33633 33018 32747 32882 33195 33424 33586 33932 34578 35339 36058 36933 38257 39925 41463 42532 43172 43540
55142D3540J44k8m5K3K9k1m2p8j36kN01J137J514J504J100J33j292k341k148r64
$$ 43540 43684 43656 43611 43634 43663 43642 43600 43522 43386 43384 43885 45022 46536 48040 49140 49273 47981 45640 43492 42528
55122D2528J29N84P24P16K28o34j073p97n70r29j243p78j5Q1m67q50p95o60n00
$$ 42528 42657 43241 43965 44681 44909 44275 43202 42405 41835 40906 39663 38885 38870 38951 38484 37634 36839 36179 35679
55103C5679j1N99O70N7o81j065j103q87n24l88p56j184r57j14O04Q69J069J419
$$ 35679 35668 36267 36937 36994 36313 35248 34145 33258 32734 32346 31590 30406 29449 29335 29939 30808 31877 33296
55085C3296J584J298P35N6p14j278j192n80m1K89Q14J469J490N77n19r57p77m31
$$ 33296 34880 36178 36913 36969 36255 34977 33785 33205 33164 33453 34267 35736 37226 37803 37284 36327 35550 35119
55067C5119j07J06L6q4L52J269J627Q54j51k74K59M53K06K56P58J063R02P78R40
$$ 35119 35012 35118 35154 35070 35422 36691 38318 39172 39021 38747 39006 39459 39665 39921 40679 41742 42644 43422 44362
55048D4362R34M73M9J76O51R59R76R12Q34O55M47L86N52R29J400J673J377N61
$$ 44362 45296 45769 45818 45994 46645 47604 48580 49492 50326 50981 51428 51814 52366 53295 54695 56368 57745 58306
55030E8306r7J23J141K053J985R05m38j291j476j288r41l67M57J215J531J436
$$ 58306 58209 58332 59473 61526 63511 64416 63978 62687 61211 59923 58982 58615 59072 60287 61818 63254
55014F3254J298J284J154P25K70J38J50k44j045j422p26M95J030N73J05M73J186
$$ 63254 64552 65836 66990 67715 67985 68123 68273 68029 66984 65562 64836 65331 66361 66934 67039 67512 68698
54997F8698J147J93p99j183j223j414j739j917j911j874j814j622j231o71r1J88
$$ 68698 69845 70038 69239 68056 66833 65419 63680 61763 59852 57978 56164 54542 53311 52640 52549 52737
54981E2737o1n68p25l35J28J90k4o3K10N68P66O52J21o96j271j101k88M82O46
$$ 52737 52676 52108 51383 51048 51176 51366 51342 51279 51489 52057 52823 53475 53596 52900 51629 50528 50240 50722 51368
54962E1368K66j09m0M39R74J305J428J325Q63J73j34L95J279J515Q88K64L88Q90
$$ 51368 51634 51525 51485 51924 52898 54203 55631 56956 57819 57992 57858 58253 59532 61047 61935 62199 62587 63477
54944F3477R47M33o6k10k21l13l61k00M3J41J27J82L43L98J74j39j62J72M41K77
$$ 63477 64424 64857 64791 64581 64360 64047 63686 63486 63529 63670 63797 63979 64322 64720 64894 64755 64593 64765 65206 65483
54924F5483j23l11k27j29m2J89L59O6m54l97M67J336J513J398J691K184K038J078
$$ 65483 65360 65049 64822 64693 64651 64840 65199 65265 64811 64414 64881 66217 67730 69128 70819 73003 75041 76119
54906G6119N8l10K3P21J487K147K677L180L622L727L450L263L562M065M306M503
$$ 76119 76177 75867 75890 76611 78098 80245 82922 86102 89724 93451 96901 100164 103726 107791 112097 116600
54890A16600N252O518P644Q383R099R773R678Q463O836N600M485K627o3k739m756
$$ 116600 121852 128370 136014 144397 153496 163269 172947 181410 188246 193846 198331 200958 200895 198156 193400
54875A93400o274p599q494q508p690o673o051n933o043o055n796n240m470l626
$$ 193400 187126 179527 171033 162525 154835 148162 142111 136178 130135 124080 118284 113044 108574 104948
54861A04948k853k231j721j160l87N35J241J416J300J548K477L596M218M356M645
$$ 104948 102095 99864 98143 96983 96596 97131 98372 99788 101088 102636 105113 108709 112927 117283 121928
54846A21928N397O170O469O431O575P056P446P150N887L873J676k76k072m041
$$ 121928 127325 133495 139964 146395 152970 160026 167472 174622 180509 184382 186058 185782 183710 179669
54832A79669o071p509p938p727p570p688p797p627p162o554o039n789n652n141
$$ 179669 173598 166089 158151 150424 142854 135166 127369 119742 112580 106026 99987 94198 88546 83405
54818H3405m015k664j670j167r52r68j219j366r48q5N00L36k41n79m65k27k12
$$ 83405 79390 76726 75056 73889 72937 71969 70750 69384 68436 68351 68851 69187 68946 68367 67902 67675 67463
54801F7463m04n43n47p01j250j871j821q29L60P03j5r95j378j079o39n16o38o07
$$ 67463 67059 66516 65969 65268 64018 62147 60326 59497 59857 60560 60545 59550 58172 57093 56454 55938 55300 54693
54783E4693k55M5j91q76j323j045l46J45J90j6k86m84l34L49J196J542J222P90
$$ 54693 54438 54483 54292 53416 52093 51048 50702 50847 51037 51021 50735 50251 49917 50266 51462 53004 54226 55016
54765E5016Q19J268J675J725J460J050N96J72m6J16N19O54K44j52L87J888L186
$$ 55016 55835 57103 58778 60503 61963 63013 63609 63781 63735 63851 64370 65024 65268 65116 65503 67391 70577
54748G0577L304K701K549L149L732L735L506L561L824L989M108M487N197O072
$$ 70577 73881 76582 79131 82280 86012 89747 93253 96814 100638 104627 108735 113222 118419 124491
54734A24491P006P989Q936R663J0001R801Q928P404N477L479J604j57j866l469
$$ 124491 131497 139486 148422 158085 168086 177887 186815 194219 199696 203175 204779 204622 202756 199287
54720A99287m779n677o260o629o631o029m950l850k997k337k002k394l396m024
$$ 199287 194508 188831 182571 175942 169311 163282 158332 154482 151485 149148 147146 144752 141356 137332
54706A37332l413j897n70jO9Qj4L15J328K758L884M469N023N986P128Q019Q608
$$ 137332 133919 132022 131452 131451 131520 131528 131514 131829 133157 135915 139799 144268 149291 155277 162405 170424 179032
54689A79032R041R280R259R080Q847Q482P909P141O037M303J975l22j953k916
$$ 179032 188073 197353 206612 215692 224539 233021 240930 248071 254108 258411 260386 260064 258111 255195
54675B55195l781n003o442p560q037q220q765r778j0517j0312r371q326p296o065
$$ 255195 251414 246411 239969 232409 224372 216152 207387 197609 187092 176780 167409 159083 151787 145722
54661A45722m969m690n132n292m564l419k523j933j584j796k711l717m058l645
$$ 145722 140753 136063 130931 125639 121075 117656 115133 113200 111616 109820 107109 103392 99334 95689
54647I5689k772j553k54L76r8r22r55j64M92N36M73O79P73M33P9K19N60M25k71
$$ 95689 92917 91364 91110 91486 91388 90466 89511 89347 89839 90375 90848 91527 92300 92733 92812 93031 93591 94016 93745
54628I3745r33j081p79l02K32P79J207J378J290J031O82L75K95N42R54J203J174
$$ 93745 92812 91731 90952 90650 90882 91661 92868 94246 95536 96567 97249 97624 97919 98461 99415 100618 101792
54611A01792J084J126J179J029Q05Q78J336J822K061K251K740L473L939L679K740
$$ 101792 102876 104002 105181 106210 107015 107893 109229 111051 113112 115363 118103 121576 125515 129194 131934
54596A31934J726J394J999K927L149K294J093O08J168K181K889L031K878K914
$$ 131934 133660 135054 137053 139980 143129 145423 146516 147124 148292 150473 153362 156393 159271 162185
54582A62185L460M380N112N203M864M819N561O855Q038Q665Q771Q666Q631Q727
$$ 162185 165645 170025 175137 180340 185204 190023 195584 202439 210477 219142 227913 236579 245210 253937
54568B53937Q757Q391P407N838L861J605q73l458n956q196j0024j1225j1602j1238
$$ 253937 262694 271085 278492 284330 288191 289796 288923 285465 279509 271313 261289 250064 238462 227224
54554B27224j0501r694q808p783o828o214n885n568n194m788m132l025j910j577
$$ 227224 216723 207029 198221 190438 183610 177396 171511 165943 160749 155961 151829 148804 146894 145317
54540A45317j969j995r77K80M82n16j691k220k130j759j359j273j803k693l260
$$ 145317 143348 141353 140376 140656 141138 140622 138931 136711 134581 132822 131463 130190 128387 125694 122434
54525A22434l225l012l075l400l707l744l319k462j716j725k355k711k225j271
$$ 122434 119209 116197 113122 109722 106015 102271 98952 96490 94774 93049 90694 87983 85758 84487
54511H4487n35k58l73q40j408j451o06N96J151O29m33j052o26N90J652J732Q74
$$ 84487 83952 83694 83321 82481 81073 79622 79016 79612 80763 81392 80959 79907 79281 79871 81523 83255 84129
54494H4129k05r83j430j569j256o12j01J36N04J158J480Q72k61q99o12J49Q15
$$ 84129 83924 82941 81511 79942 78686 78074 77973 78109 78613 79771 81251 82123 81862 80963 80351 80500 81315
54477H1315J273J666K018K193K089J853J901K524L397L821L559L138L117L466
$$ 81315 82588 84254 86272 88465 90554 92407 94308 96832 100229 104050 107609 110747 113864 117330
54463A17330L919M493N182N495M931L812L034K964K992K275O73j228k781l811
$$ 117330 121249 125742 130924 136419 141350 145162 148196 151160 154152 156427 157100 155872 153091 149280
54449A49280m535n070n193m748m104l851m052m220m093l898l729l223k257j427
$$ 149280 144745 139675 134482 129734 125630 121779 117727 113507 109414 105516 101787 98564 96307 94880
54435I4880j308j599j517p98J01O24N02k30j143j576j288p98p06q81p43j00P53
$$ 94880 93572 91973 90456 89658 89759 90383 90885 90655 89512 87936 86648 85850 85144 84263 83520 83420 84173
54418H4173J585K363K965L192L026K541J774J038R85J838K806K894K104J216O09
$$ 84173 85758 88121 91086 94278 97304 99845 101619 102657 103642 105480 108286 111180 113284 114500 115109
54403A15109M4n03o35k89Qo0j69L6L74M29P0n84j357k040k475k755k999k976k332
$$ 115109 115153 114650 114015 113726 113734 113674 113505 113541 113915 114344 114414 113830 112473 110433 107958 105203 102204 99228 96896
54384I6896j244l70p2j70n15j225k150k609k144j174n08m11m69k49K35O36O42
$$ 96896 95652 95282 95210 95040 94525 93300 91150 88541 86397 85223 84715 84304 83835 83586 83821 84457 85099
54367H5099K48k37n26n97n47l59j2L35N71Q56J248J261M13q89j605j301n23J81
$$ 85099 85347 85110 84584 83987 83440 83081 83069 83404 83975 84831 86079 87340 87753 86864 85259 83958 83435 83616
54349H3616R00J704K110J804J350J507K149K464K075J403J009J083J554K186K550
$$ 83616 84516 86220 88330 90134 91484 92991 95140 97604 99679 101082 102091 103174 104728 106914 109464
54334A09464K329J741J318J181R62M86J45K84O65Q20P35P36Q14N77j01p97j139
$$ 109464 111793 113534 114852 116033 116995 117481 117626 117910 118575 119395 120130 120866 121680 122257 122156 121359 120220
54317A20220j295j555j757j589j257j299j705j867j518j182j339j651j583j284
$$ 120220 118925 117370 115613 114024 112767 111468 109763 107896 106378 105196 103857 102206 100623 99339
54303I9339j320j643j641j177q92j244j759j648q74j45K6j11k2L64O55N85L21
$$ 99339 98019 96376 94735 93558 92666 91422 89663 88015 87141 86996 87022 86911 86889 87253 87908 88493 88814
54286H8814R0j40l42j54O53J553J767J365J269J916K659K776K429K171K114K127
$$ 88814 88904 88764 88422 88268 88921 90474 92241 93606 94875 96791 99450 102226 104655 106826 108940 111067
54270A11067K310K561K204Q25q84j936k329k712l026k602j523q38j170k003k588
$$ 111067 113377 115938 118142 118967 118083 116147 113818 111106 108080 105478 103955 103117 101947 99944 97356
54255I7356k788k736k378j777j275j059r78r76j262j825k295k421k308k073j744
$$ 97356 94568 91832 89454 87677 86402 85343 84365 83389 82127 80302 78007 75586 73278 71205 69461
54240F9461j469j330j036m16l3n44j479j665r09j87k3J07M21K01p80j402q03K47
$$ 69461 67992 66662 65626 65210 65177 64633 63154 61489 60580 60393 60370 60477 60898 61099 60319 58917 58114 58361
54222E8361N80M33P49J327J034l51j724k124j667r61l59J25P04J622K645L013
$$ 58361 58941 59374 60123 61450 62484 62133 60409 58285 56618 55657 55298 55423 56127 57749 60394 63407
54206F3407K410J587J419J671J528R32N90P28Q56O61L60J21r2j33J42L28q1p49
$$ 63407 65817 67404 68823 70494 72022 72954 73544 74272 75128 75789 76149 76270 76178 76045 76187 76515 76434 75685
54188G5685q56m28l11p36r17m47j3j93m88k66R5j05o51p31k18K04J40o3LK56L99
$$ 75685 74829 74401 74090 73354 72437 71990 71977 71784 71296 71030 71125 71020 70369 69638 69420 69624 69764 69701 69704 69960 70359
54167G0359L70K35k2m67r80j221q17K58J466J987J466L98l01j47M80P98M55o6
$$ 70359 70729 70964 70942 70475 69495 68274 67457 67715 69181 71168 72634 73032 72731 72584 73064 73862 74317 74251
54149G4251q3L41L97k93r21m75P95J622J408Q52O25L34n86j625j680o08N62R26
$$ 74251 74168 74509 74906 74613 73692 73217 74012 75634 77042 77894 78519 78853 78267 76642 74962 74354 74916 75842
54131G5842N73K5m77q94j096j108j254j657j806j118J31R06N97k75p36m90l8J13
$$ 75842 76415 76440 75963 75069 73973 72865 71611 69954 68148 67030 67161 68067 68664 68389 67653 67163 67125 67238
54113F7238k3k33n13q86j131j018p11o06p96r05n82J16Q42J269J209O52j12o12
$$ 67238 67215 66982 66469 65583 64452 63434 62723 62117 61321 60416 59834 59950 60792 62061 63270 63922 63810 63198
54095F3198o09l43k14k73k22J53O67R24O10k66j305j843j435l50N72P41L48o3
$$ 63198 62589 62246 62032 61759 61537 61690 62357 63281 63891 63625 62320 60477 59042 58692 59264 60005 60353 60290
54077F0290l29o53r77r11l52K50M54L63K81K26R0j8Oj30p19j453j673j253o95
$$ 60290 59961 59308 58331 57420 57068 57318 57772 58135 58416 58642 58732 58714 58720 58590 57871 56418 54745 53492 52797
54058E2797l37K1N60J045J171R12L83l05q61r30n52j60%O2L0k84o13k72P39J369
$$ 52797 52460 52481 53041 54086 55257 56169 56552 56247 55386 54456 53904 53744 53744 53806 53836 53552 52939 52667 53406 54775
54038E4775R11J41K41J078J506J087N00K29o3o41j072j009q74j232j861j957j078
$$ 54775 55686 55827 56068 57146 58652 59739 60239 60468 60405 59764 58692 57683 56809 55577 53716 51759 50681
54021E0681M20J719K115J515N91K07N51J016R84M87q5n12p57p28l14M26J266J893
$$ 50681 51101 52820 54935 56450 57041 57248 57799 58815 59799 60286 60201 59689 58932 58204 57890 58316 59582 61475
54003F1475J949J273K06o00q29p64p10n22Q1J015J959K735L216L097K248J206
$$ 61475 63424 64697 64903 64303 63474 62710 62000 61478 61559 62574 64533 67268 70484 73581 75829 77035
53987G7035P91J121J484J316R13Q98J362J888K232K474K633K552K286K189K400
$$ 77035 77826 78947 80431 81747 82660 83558 84920 86808 89040 91514 94147 96699 98985 101174 103574
53972A03574K612K559K450K629L073L551M061M630M926M615M062M022M524M701
$$ 103574 106186 108745 111195 113824 116897 120448 124509 129139 134065 138680 142742 146764 151288 155989
53958A55989L972K863K228K137K013J554J017O81N02K51k36q59j167p55L6K26
$$ 155989 159961 162824 165052 167189 169202 170756 171773 172454 172956 173207 172971 172112 170945 170190 170226 170452
53942A70452o86k079l013l307l312l069k373j488j042j257j838k507l077l215
$$ 170452 169766 167687 164674 161367 158055 154986 152613 151125 150083 148826 146988 144481 141404 138189
53928A38189k743k119j899j794j126j44J00o74j520j723j719j972j959j126j60
$$ 138189 135446 133327 131428 129634 128508 128364 128464 127790 126270 124547 122828 120856 118897 117771 117611
53913A17611j70r90j353o90J57J99m52r26o92NN21M09j65n51l13K31L97L0l21
$$ 117611 117441 116451 115098 114408 114565 114764 114312 113386 112694 112699 113220 113629 113464 112913 112600 112831 113228 113258 112937
53894A12937k05J50K61J37K68Q73J546J818J844K195K979L545L278K429J750J558
$$ 112937 112732 112882 113143 113280 113548 114421 115967 117785 119629 121824 124803 128348 131626 134055 135805 137363
53878A37363J606J822K560L864N048N487N473N753O404O645N875M466L304K837
$$ 137363 138969 140791 143351 147215 152263 157750 163223 168976 175380 182025 187900 192366 195670 198507
53864A98507K696K246J284K01m82o22m39j14M02J098J712J964J914J914K198K663
$$ 198507 201203 203449 204733 204934 204452 203830 203391 203277 203679 204777 206489 208453 210367 212281 214479 217142
53848B17142L022L130L084L078L172L251L247L232L213K941K194J190M59K22R4
$$ 217142 220164 223294 226378 229456 232628 235879 239126 242358 245571 248512 250706 251896 252355 252577 252671
53833B52671m59j540k726l478l560l217l009l347m108m736m731m041l101k605
$$ 252671 252212 250672 247946 244468 240908 237691 234682 231335 227227 222491 217760 213719 210618 208013
53819B08013l055m249n311n555n219n018n104m973m414l958m075m412m281l592
$$ 208013 204958 200709 195398 189843 184624 179606 174502 169529 165115 161157 157082 152670 148389 144797
53805A44797k894k590k506k246j742j356j496k115k692k816k645k537k385j814
$$ 144797 141903 139313 136807 134561 132819 131463 129967 127852 125160 122344 119699 117162 114777 112963
53791A12963j055r50j775k628k465j414n01l34o25r20j212j677k170k266j702
$$ 112963 111908 110958 109183 106555 104090 102676 102175 101841 101216 100296 99084 97407 95237 92971 91269
53776I1269p20Q6K60r8n42q16j007j110q46j59M46M48Ok21R8O50R48Q37M82Q6
$$ 91269 90549 90635 90895 90797 90255 89439 88432 87322 86476 86317 86763 87211 87217 86996 87094 87744 88692 89529 90011 90097
53756I0097k64n15m92M8J024J826J856J374J301K037K811K599J378J52j33O80
$$ 90097 89833 89318 88826 88874 89898 91724 93580 94954 96255 98292 101103 103702 105080 105232 105099 105779
53740A05779K012L027L201K758K449K661L031L143L226L626L972L641K828K469
$$ 105779 107791 110818 114019 116777 119226 121887 124918 128061 131287 134913 138885 142526 145354 147823
53726A47823K902L344K967J903R35N62P08J011J072O44j29q02j127j295j513j616
$$ 147823 150725 154069 157036 158939 159874 160436 161144 162155 163227 163871 163742 162940 161813 160518 159005 157389
53710A57389j360r77j094k041l373m196l973l076k406k411k620k304j519j083
$$ 157389 156029 155052 153958 151917 148544 144348 140375 137299 134893 132482 129862 127558 126039 124956
53696A24956j477k121k017r07M41J008M42p35j656j835j472j095r28p94n27l26
$$ 124956 123479 121358 119341 118434 118875 119883 120325 119590 117934 116099 114627 113532 112604 111810 111283 110957
53680A10957m47p56q05m23QL3k96m78k35J43K30M1n3J37M38O78Q73J008R33O63
$$ 110957 110510 109754 108949 108526 108534 108567 108271 107793 107558 107701 107931 107972 107919 108056 108494 109172 110045 111053 111986 112649
53660A12649N17P21J088J253J145R54Q51R10J123J331J294R94O50K45n25j520
$$ 112649 113166 113887 114975 116228 117373 118327 119178 120088 121211 122542 123836 124830 125480 125725 125200 123680
53644A23680j837q54O61J286O97m0n6L03L05K9NK51L18J21J15O33J479K201K407
$$ 123680 121843 120989 121650 122936 123633 123593 123537 123840 124145 124174 124179 124430 124748 124869 124984 125617 127096 129297 131704
53625A31704J902R13P8q8K15M32M56O93J236J583J417J095J039J022O96L83O63
$$ 131704 133606 134519 134597 134509 134724 135156 135612 136305 137541 139124 140541 141636 142675 143697 144393 144776 145439
53608A45439J279J304N60N7N96J598J928J449R99J058J246J066N14k29j016j473
$$ 145439 146718 148022 148582 148639 149235 150833 152761 154210 155209 156267 157513 158579 159093 158864 157848 156375
53592A56375j087NQ09N02n57j276j132o20m86q59j238j139o36k08j14r5J69N08
$$ 156375 155288 155293 156102 156604 156047 154771 153639 153019 152533 151674 150436 149297 148661 148453 148339 148244 148413 148921
53574A48921N42L44L68O63P27L20r6m5L50P56J221J887K506K700K488K137J709
$$ 148921 149463 149807 150175 150838 151565 151885 151789 151744 152094 152850 154071 155958 158464 161164 163652 165789 167498
53557A67498J195Q58R80J365J556J408J159J021J070J341J671J649J142O63Q29
$$ 167498 168693 169551 170531 171896 173452 174860 176019 177040 178110 179451 181122 182771 183913 184576 185405
53542A85405J559K293K755L000K928K414J849J852K349K547K029J328J174J600
$$ 185405 186964 189257 192012 195012 197940 200354 202203 204055 206404 208951 210980 212308 213482 215082
53528B15082K109K349K380K354K319K201J986J803J734J534Q74Ok74L36J056J024
$$ 215082 217191 219540 221920 224274 226593 228794 230780 232583 234317 235851 236725 236731 236457 236793 237849 238873
53512B38873M60K21M71O49N48N61Q00Q78P42Q76J414J790J595J195J111J316J501
$$ 238873 239333 239554 240025 240674 241222 241783 242583 243461 244203 245079 246493 248283 249878 251073 252184 253500 255001
53495B55001J529J339R59P83J289K210K635K294K006K407K957K852K318K152K422
$$ 255001 256530 257869 258828 259611 260900 263110 265745 268039 270045 272452 275409 278261 280579 282731 285153
53480B85153K482K148J969K307K824L103L240L606M215M684M694M447M526N173
$$ 285153 287635 289783 291752 294059 296883 299986 303226 306832 311047 315731 320425 324872 329398 334571
53466C34571N871N912N388N128N559O152O244N900N629N671O039O779P750Q423
$$ 334571 340442 346354 351742 356870 362429 368581 374825 380725 386354 392025 398064 404843 412593 421016
53452D21016Q448Q215Q354Q913R435R664R680R585R541R992J1227J2852J4160
$$ 421016 429464 437679 446033 454946 464381 474045 483725 493310 502851 512843 524070 536922 551082
53439E51082J5015J5835J6724J7237J7039J6391J5780J5488J5627J6214J7011
$$ 551082 566097 581932 598656 615893 632932 649323 665103 680591 696218 712432 729443
53428G29443J7575J7585J7045J6157J5255J4809J5118J5844J6213J5860J5239
$$ 729443 747018 764603 781648 797805 813060 827869 842987 858831 875044 890904 906143
53417I06143J5021J5267J5451J5226J4807J4556J4382J3887J3077J2539J2678
$$ 906143 921164 936431 951882 967108 981915 996471 1010853 1024740 1037817 1050356 1063034
53406A063034J3014J2698J1626J0559J0044R727Q956P646O157M716L308J975Q20
$$ 1063034 1076048 1088746 1100372 1110931 1120975 1130702 1139658 1147304 1153461 1158177 1161485 1163460 1164280
53393A164280j71j102k070l245m814o611q110q992r434r634r480r063r039r880
$$ 1164280 1164109 1163007 1160937 1157692 1152878 1146267 1138157 1129165 1119731 1110097 1100617 1091554 1082515 1072635
53379A072635j1108j1825j1884j1909j2324j2946j3511j3967j4128j3623j2402
$$ 1072635 1061527 1049702 1037818 1025909 1013585 1000639 987128 973161 959033 945410 933008
53368I33008j0958r841r196q854q617q314p779o880n547l865k214j140q60j069
$$ 933008 922050 912209 903013 894159 885542 877228 869449 862569 857022 853157 850943 849803 848943 847874
53354H47874j360j580j533p61Q96K747L841M050M113M692N737O793P538Q001Q596
$$ 847874 846514 844934 843401 842640 843536 846283 850124 854174 858287 862979 868716 875509 883047 891048 899644
53339H99644R849J1799J3803J5224J6103J6896J7818J8889K0175K1516K2317K2303
$$ 899644 909493 921292 935095 950319 966422 983318 1001136 1020025 1040200 1061716 1084033 1106336
53327A106336K2221K3048K4667K6130K7048K7855K8706K9106K8891K8699K9150
$$ 1106336 1128557 1151605 1176272 1202402 1229450 1257305 1286011 1315117 1344008 1372707 1401857
53316A401857L0063L0829L1028L0516K9412K8170K7167K6180K4769K3173K2061
$$ 1401857 1431920 1462749 1493777 1524293 1553705 1581875 1609042 1635222 1659991 1683164 1705225
53305A705225K1380K0324J8526J6437J4261J1548Q217N045K537J80k545n219p334
$$ 1705225 1726605 1746929 1765455 1781892 1796153 1807701 1815918 1820963 1823500 1823680 1821135 1815916 1808582
53292A808582r305j1844j4806j7438j9411k0823k1682k2110k2714k3949k5387
$$ 1808582 1799277 1787433 1772627 1755189 1735778 1714955 1693273 1671163 1648449 1624500 1599113
53281A599113k6249k6419k6320k6059k5426k4522k3697k3045k2442k1948k1636
$$ 1599113 1572864 1546445 1520125 1494066 1468640 1444118 1420421 1397376 1374934 1352986 1331350
53270A331350k1336k0972k0806k0841k0491j9461j8445j8142j8097j7434j6224
$$ 1331350 1310014 1289042 1268236 1247395 1226904 1207443 1188998 1170856 1152759 1135325 1119101
53259A119101j5152j4221j2945j1601j0925j0663r773q245p380p913r002r534
$$ 1119101 1103949 1089728 1076783 1065182 1054257 1043594 1033821 1025576 1018196 1010283 1001281 991747
53247I91747r377q901q275p815q021q623q469p085n443m554m102l328k396j814
$$ 991747 982370 973469 965194 957379 949358 940735 932266 925181 919738 915184 911082 907754 905358 903544
53233I03544j226N3J700K757L108L571M525N482O109O765P821R143J0460J1713
$$ 903544 902318 902371 904071 906828 909936 913507 918032 923514 929623 936388 944209 953352 963812 975525
53219I75525J2816J3602J4084J4361J4251J3527J2572J2138J2369J2536J1994
$$ 975525 988341 1001943 1016027 1030388 1044639 1058166 1070738 1082876 1095245 1107781 1119775
53208A119775J0884R756Q839Q006P059N865M480L238K442J822O94j253l566n558
$$ 1119775 1130659 1140415 1149254 1157260 1164319 1170184 1174664 1177902 1180344 1182166 1182860 1181607 1178041 1172483
53194A172483o850p435p619q091r463j1415j2792j2918j2482j2649j3620j4556
$$ 1172483 1165633 1158198 1150579 1142488 1133025 1121610 1108818 1095900 1083418 1070769 1057149 1042593
53182A042593j4742j4299j3791j3532j3367j2878j1800j0436r503r415r830j0115
$$ 1042593 1027851 1013552 999761 986229 972862 959984 948184 937748 928245 918830 909000 898885
53170H98885j0053r845r670r583r732j0116j0258r639q486p658p620p958p996
$$ 898885 888832 878987 869317 859734 850002 839886 829628 819989 811503 803845 796225 788267 780271
53157G80271p515o651n576m526l824l528l320k970k695k762l077l459m014m859
$$ 780271 772756 766105 760529 756003 752179 748651 745331 742361 739666 736904 733827 730368 726354 721495
53143G21495n766o566p592r119j0476j0467q879o915n900o010o601p225p743p889
$$ 721495 715729 709163 701571 692452 681976 671509 662630 655715 649815 643805 637204 629979 622236 614347
53129F14347p476o917o943p642q320q540q729r455j0430j0781j0204r349r001
$$ 614347 606871 599954 593011 585369 577049 568509 559780 550325 539895 529114 518910 509561 500560
53116E00560r196r392r231q847q527q322q113p813p452p094o778o530o358o327
$$ 500560 491364 481972 472741 463894 455367 447045 438932 431119 423667 416573 409795 403265 396907 390580
53102C90580o502o806o950o671o109n701n671n768n700n561n636n882n976n811
$$ 390580 384078 377272 370322 363651 357542 351841 346170 340402 334702 329141 323505 317623 311647 305836
53088C05836n608n469n177m588l939l550l396l224k921k605k445k586l125l880
$$ 305836 300228 294759 289582 284994 281055 277505 274109 270885 267964 265359 262914 260328 257203 253323
53074B53323m321m016l125k277j925k056k422k722k609j886q73k42l18p59j151
$$ 253323 249002 244986 241861 239584 237659 235603 233181 230459 227850 225964 225091 224849 224531 223772 222621
53059B22621j533k073k484k312j714j353j430j285l84P17R21J5r98j094l28M63
$$ 222621 221088 219015 216531 214219 212505 211152 209722 208437 208053 208770 209691 209706 208708 207614 207286 207749
53043B07749P10M31j67r03j414j318p66m51p54j236j336j288j812k972l952m106
$$ 207749 208459 208890 208723 207820 206406 205088 204322 203871 203117 201881 200545 199257 197445 194473 190521 186415
53027A86415l694l278k886k202j348r19j198j825k313k581k755k814k695k572
$$ 186415 182721 179443 176557 174355 173007 172088 170890 169065 166752 164171 161416 158602 155907 153335
53013A53335k696k973l018k660k153j754j351p69k76l77j058j629j495q89m52
$$ 153335 150639 147666 144648 141988 139835 138081 136730 135961 135685 135308 134250 132621 131126 130237 129785
52998A29785l52k31J3m4o04j118r38k39K20J30j46l48p20j337j623j069j47J15
$$ 129785 129433 129202 129215 129171 128567 127449 126511 126272 126492 126622 126476 126128 125408 124071 122448 121379 121232 121347
52980A21347n35j259j242o86l09k90j98J59L59Lp07j207j207q57m29j64k32n93
$$ 121347 120812 119553 118311 117625 117316 117026 116828 116987 117346 117349 116642 115435 114228 113371 112942 112778 112546 111953
52962A11953q66p23l57l28p87j162q23J46J054J366J105O08J23k90o29p74m91
$$ 111953 111087 110364 110007 109679 108892 107730 106907 107053 108107 109473 110578 111186 111309 111019 110390 109616 109125
52945A09125K65J086J376J045N86L41L9n44r00m47L62M48l36q63l56N09O89K68
$$ 109125 109390 110476 111852 112897 113483 113824 113863 113319 112419 111972 112334 112782 112446 111583 111227 111736 112425 112693
52927A12693O2J72r4r03j444j077j89M59P45J045J464J765J892K104K495K706
$$ 112693 112755 112927 112833 111930 110486 109409 109220 109679 110424 111469 112933 114698 116590 118694 121189 123895
52911A23895K295J302K91j43J84J047K138L194L885L852L065K037J442J519J986
$$ 123895 126190 127492 127783 127640 127824 128871 131009 134203 138088 141940 145005 147042 148484 150003 151989
52896A51989K426K585K379J915J505J445J706J988K045J800J221L19o85j427j729
$$ 151989 154415 157000 159379 161294 162799 164244 165950 167938 169983 171783 173004 173323 172638 171211 169482
52881A69482j699j507j267j082j006r67r23j073j605k228k311j601n63J05J04
$$ 169482 167783 166276 165009 163927 162921 161954 161031 159958 158353 156125 153814 152213 151650 151755 151859
52866A51859l62q37r17n19J2K86L30M53O81P22M94K56J56N0j22j50M9L05N12O96
$$ 151859 151497 150660 149743 149224 149236 149522 149852 150305 150986 151708 152202 152458 152614 152664 152542 152392 152441 152746 153258 153954
52846A53954O76J83n07p50m70k92m21k21N78J116O53j66k13M70R92J175J553K083
$$ 153954 154630 154813 154306 153556 153086 152794 152373 152152 152730 153846 154499 154333 154120 154590 155582 156757 158310 160393
52828A60393K055J393Q93R34R99Q02Q18J258J447Q91J64N4M17N67L08n7l19l55
$$ 160393 162448 163841 164734 165668 166667 167469 168287 169545 170992 171883 172047 172101 172518 173085 173393 173336 173017 172662
52810A72662O9Q88J435J185N50L17N65P20M84Q1l14p05q67m62L15P83O44L79N32
$$ 172662 172731 173619 175054 176239 176789 177106 177671 178391 178875 178956 178642 177937 177070 176608 176923 177706 178350 178729 179261
52791A79261J032J404J421J239J098J034Q91N16J5k39K2P33J689K776L793M250
$$ 179261 180293 181697 183118 184357 185455 186489 187380 187896 187911 187672 187694 188427 190116 192892 196685 200935
52775B00935L789K718J786J399J364J342J178P81J12n67q99j007j440k322l014
$$ 200935 204724 207442 209228 210627 211991 213333 214511 215292 215404 214837 213938 212931 211491 209169 206155
52760B06155k967k543k430k588k352j556r00j052j794k381k388j994j661j751
$$ 206155 203188 200645 198215 195627 193275 191719 190819 189767 187973 185592 183204 181210 179549 177798
52746A77798k275k770k640j851j135j176j776k173k023j701j583j611j586j527
$$ 177798 175523 172753 170113 168262 167127 165951 164175 162002 159979 158278 156695 155084 153498 151971
52732A51971j462j235q51o74r83j562j994k222k449k671k691k459k090j608r78
$$ 151971 150509 149274 148423 147749 146766 145204 143210 140988 138539 135868 133177 130718 128628 127020 126042
52717A26042l35J16L06K02k61q60r74l32L33P8r66j771j881j828k018k055j630
$$ 126042 125707 125823 126129 126331 126070 125210 124236 123904 124237 124315 123349 121578 119697 117869 115851 113796 112166
52700A12166j184j124j049n12l9m83j684k565k545k044j624j341j050p89n74l26
$$ 112166 110982 109858 108809 108297 108258 107775 106091 103526 100981 98937 97313 95972 94922 94133 93559 93233
52684I3233j95n04j238j899k102k002j884j751j502j275j225j181q41k39K69M81
$$ 93233 93038 92534 91296 89397 87295 85293 83409 81658 80156 78881 77656 76475 75634 75395 75664 76145
52668G6145N53O81Q02P33M81K31N3k13n77o67j26P20R98L15o79j061p83n54p57
$$ 76145 76698 77379 78181 78914 79395 79626 79679 79466 78889 78222 78096 78816 79814 80129 79450 78389 77606 77052 76295
52649G6295j029j007r22j065j126o17K65P97P45O59R75J394J485J463J791K283
$$ 76295 75266 74259 73337 72272 71146 70529 70794 71591 72336 72995 73970 75364 76849 78312 80103 82386
52633H2386K312J802J349J245J134R22J133J925K394J753O09J60L96K64n57j161
$$ 82386 84698 86500 87849 89094 90228 91150 92283 94208 96602 98355 98964 99124 99520 99784 99227 98066
52617I8066r56n52o44r80j035r39j039j198j233j487k177k685k306j341o65n37
$$ 98066 97110 96558 95914 94934 93899 92960 91921 90723 89490 88003 85826 83141 80835 79494 78829 78292
52601G8292o09q21j335j771j479n94L8P4K2K22L74K65J90K94J77l13n72n2P94
$$ 78292 77683 76862 75527 73756 72277 71683 71721 71795 71817 72039 72413 72678 72868 73162 73339 73026 72454 72402 73196
52582G3196J023M04l45m97j34J2n66j441j557m77R15J352P12Q2K25P17P43J54
$$ 73196 74219 74623 74278 73781 73647 73659 73093 71652 70095 69618 70533 71885 72597 72679 72904 73621 74364 74518
52564G4518o18j142j185p65l64n85j260j418n72N14Q33M03p5l66o69p77k45O28
$$ 74518 73900 72758 71573 70808 70444 69859 68599 67181 66609 67123 67956 68359 68284 67918 67249 66472 66227 66855
52546F6855R18L27l98o18o26r49j394j344o37L61J274J858J804J035J32n9N63
$$ 66855 67773 68100 67702 67084 66458 65509 64115 62771 62134 62495 63769 65627 67431 68466 68598 68539 69102
52529F9102J203J186P53M68K88k54j021j180l05Q98J420J148Q08R18J312J645
$$ 69102 70305 71491 72244 72712 73000 72746 71725 70545 70240 71138 72558 73706 74514 75432 76744 78389
52513G8389J833J833J471P57J34L3L67P35R94J350J854K153J892J186N06J48M
$$ 78389 80222 82055 83526 84283 84417 84450 84817 85552 86546 87896 89750 91903 93795 94981 95487 95635 95639
52496I5639j09q1K55P06Q53O81O63J009J226Q22J68O8O50J238J360J302J414J462
$$ 95639 95530 95449 95704 96410 97263 97944 98607 99616 100842 101664 101832 101900 102550 103788 105148 106450 107864 109326
52478A09326J067M75L71R87J802K182K106K111K517K935K668J651O18K67M65O70
$$ 109326 110393 110868 111239 112226 114028 116210 118316 120427 122944 125879 128547 130198 130816 131083 131548 132218
52462A32218P85J130J664J934J788J552J303O92k87r59q15k37J48L29O34R72J038
$$ 132218 133003 134133 135797 137731 139519 141071 142374 143066 142779 141820 141005 140768 140916 141245 141879 142851 143889
52445A43889R18Q56O45o3q91r94k62M23L55j54m75n86q76j311j408j000m49j27
$$ 143889 144807 145663 146308 146245 145354 144360 144098 144521 144876 144722 144247 143661 142785 141474 140066 139066 138617 138490
52427A38490M4L12O74R00R19Q48P59N32J33j85j12L21P19P91O66O53P58O42J53
$$ 138490 138534 138846 139520 140420 141339 142187 142946 143478 143611 143426 143314 143635 144354 145145 145811 146464 147222 147864 148017
52408A48017k71k1P91J187L74j182k175j916q92J81J153J999K256J597N72or2
$$ 148017 147746 147725 148516 149703 150077 148895 146720 144804 143912 144093 145246 147245 149501 151098 151670 151664 151572
52391A51572j32QQ27J982K355J598O56L96N42M66K23J93L20L97O22J188J723J770
$$ 151572 151440 151448 152275 154257 156612 158210 158866 159262 159804 160270 160493 160686 161006 161403 162025 163213 164936 166706
52373A66706J442J076O58J32j28J57N11L10k64n85n61n59n77l56r8k53o15n24
$$ 166706 168148 169224 169882 170014 169886 170043 170554 170864 170600 170015 169454 168895 168318 167962 167864 167611 166996 166472
52355A66472L1L48J44q6o4k32q47j309q84L16J510K037J698O96m34j117j246j158
$$ 166472 166503 166851 166995 166909 166845 166613 165766 164457 163573 163889 165399 167436 169134 169830 169396 168279 167033 165875
52337A65875j025o30J34R46J440J569J379Q18J3n60n47j24K50L42K14N7R2M58
$$ 165875 164850 164220 164354 165300 166740 168309 169688 170506 170519 169959 169412 169288 169538 169880 170094 170151 170243 170701
52319A70701J006J382J413J249J027O89K01l41q85j434j796j616q32J39Q10J060
$$ 170701 171707 173089 174502 175751 176778 177467 177668 177327 176442 175008 173212 171596 170764 170903 171713 172773
52303A72773J152J429J960K283J775N93m8Q52K654L685L201K046J263R25P17P29
$$ 172773 173925 175354 177314 179597 181372 181965 181917 182769 185423 189108 192309 194355 195618 196543 197260 197989
52287A97989J128J618J862K026K342K560K412K234K516L027L025K228J194P51
$$ 197989 199117 200735 202597 204623 206965 209525 211937 214171 216687 219714 222739 224967 226161 226912
52273B26912J310K550L574L702L265L246L913M404M041L344L165L431L556L518
$$ 226912 228222 230772 234346 238048 241313 244559 248472 252876 256917 260261 263426 266857 270413 273931
52259B73931L697L899L644L201L371M252N140N719O348P037P152O534O058O502
$$ 273931 277628 281527 285171 288372 291743 295995 301135 306854 313202 320239 327391 333925 339983 346485
52245C46485P497Q117Q055P751P712Q184R094J0056J0606J0744J0931J1403J1913
$$ 346485 353982 362099 370154 377905 385617 393801 402895 412951 423557 434301 445232 456635 468548
52232D68548J2301J2824J3554J4010J3847J3475J3453J3612J3362J2722J2354
$$ 468548 480849 493673 507227 521237 535084 548559 562012 575624 588986 601708 614062
52221F14062J2602J3026J3032J2612J2295J2480J2922J2832J1614R614P908P198
$$ 614062 626664 639690 652722 665334 677629 690109 703031 715863 727477 737091 744999 752197
52209G52197P158P077O728O276N639M555L177K075J487J101P04O20J216K210K792
$$ 752197 759355 766432 773160 779436 785075 789630 792807 794882 796369 797470 798174 798794 800010 802220 805012
52194H05012K466J590J049J290J835J846J219P63J161K148L025L681M536N660
$$ 805012 807478 809068 810117 811407 813242 815088 816307 817070 818231 820379 823404 827085 831621 837281
52180H37281O570O973P155P440P802Q163Q686R420J0062J0317J0258J0068R716
$$ 837281 843851 850824 857979 865419 873221 881384 890070 899490 909552 919869 930127 940195 949911
52167I49911R156Q649Q496Q595Q486P787O449M796L403K672K301J495n6j722k763
$$ 949911 959067 967716 976212 984807 993293 1001080 1007529 1012325 1015728 1018400 1020701 1022196 1022140 1020418 1017655
52152A017655l310m028n074n997o580p184q065q937r426r620r909j0428j0889
$$ 1017655 1014345 1010317 1005243 999246 992666 985482 977417 968480 959054 949434 939525 929097 918208
52139I18208j0856j0159r074q085p346o590n788n459n891o319n652m020k739k604
$$ 918208 907352 897193 888119 880034 872688 866098 860310 854851 848960 842641 836989 832969 830230 827626
52125H27626l018l122k944k878k812k582k694l585m512m276k998k114k432l146
$$ 827626 824608 821486 818542 815664 812852 810270 807576 803991 799479 795203 792205 790091 787659 784513
52111G84513l228k886k969l521l773l326k634k306k489l006l631m107m187l904
$$ 784513 781285 778399 775430 771909 768136 764810 762176 759870 757381 754375 750744 746637 742450 738546
52097G38546l555l305l009k589k313k453k771k706k141j633j716k191k442k306
$$ 738546 734991 731686 728677 726088 723775 721322 718551 715845 713704 712071 710355 708164 705722 703416
52083G03416k258k703l408l818l706l285k857k567k416k287k069j805j683j727
$$ 703416 701158 698455 695047 691229 687523 684238 681381 678814 676398 674111 672042 670237 668554 666827
52069F66827j725j575j446j435j345j069q77r25q16j94N00N57J91L22J095J536
$$ 666827 665102 663527 662081 660646 659301 658232 657355 656430 655614 655420 655920 656477 656668 656990 658085 659621
52053F59621J082N69R80J945K395K267K503L399M121M161M327N613P736R511J0390
$$ 659621 660703 661272 662252 664197 666592 668859 671362 674761 678882 683043 687370 692983 700719 710230 720620
52038G20620J0928J1736J2698J3386J3767J4209J5011J6151J7341J8174J8417
$$ 720620 731548 743284 755982 769368 783135 797344 812355 828506 845847 864021 882438
52027H82438J8238J8039J7906J7472J6517J5399J4605J4062J3368J2482J1726
$$ 882438 900676 918715 936621 954093 970610 986009 1000614 1014676 1028044 1040526 1052252
52016A052252J1069J0018Q453O997O201N745M877L382J661Q0j257k235k769l115
$$ 1052252 1063321 1073339 1081792 1088789 1094990 1100735 1105612 1108994 1110655 1110735 1109478 1107243 1104474 1101359
52002A101359l695m519n215n695o328p266p968p799o825n751n066m628m032l246
$$ 1101359 1097664 1093145 1087930 1082235 1075907 1068641 1060673 1052874 1046049 1040298 1035232 1030604 1026572 1023326
51988A023326k710k755l085l019k307j382o78J3J100K358L118L214L210L514L847
$$ 1023326 1020616 1017861 1014776 1011757 1009450 1008068 1007390 1007403 1008503 1010861 1013979 1017193 1020403 1023917 1027764
51973A027764L740L191K525J976J714J905K420K689K238J262L24l06p46j136j544
$$ 1027764 1031504 1034695 1037220 1039196 1040910 1042815 1045235 1047924 1050162 1051424 1051748 1051442 1050696 1049560 1048016
51958A048016k223l441n015o330o978p228p666q561r696j0715j1459j1938j2163
$$ 1048016 1045793 1042352 1037337 1031007 1024029 1016801 1009135 1000574 990878 980163 968704 956766 944603
51945I44603j2188j2302j2932j4215j5724j6876j7578j8218j8985j9457j9136
$$ 944603 932415 920113 907181 892966 877242 860366 842788 824570 805585 786128 766992
51934G66992j8258j7738j8176j9126j9625j9352j8948j9019j9167j8553j7215
$$ 766992 748734 730996 712820 693694 674069 654717 635769 616750 597583 579030 561815
51923E61815j6215j6232j6655j6507j5747j5047j4610j4034j3189j2503j2194
$$ 561815 545600 529368 512713 496206 480459 465412 450802 436768 423579 411076 398882
51912C98882j1919j1373j0717j0213r819r402q958q461p838p178o645o164n569
$$ 398882 386963 375590 364873 354660 344841 335439 326481 318020 310182 303004 296359 290195 284626
51899B84626n076n045n288n178m579l997l699l421l158l362l973m084l251k299
$$ 284626 279550 274505 269217 264039 259460 255463 251764 248343 245185 241823 237850 233766 230515 228216
51885B28216k122k372k189j724j840k616l198l130k895l009l298l299k862k194
$$ 228216 226094 223722 221533 219809 217969 215353 212155 209025 206130 203121 199823 196524 193662 191468
51871A91468j657j535j686j610j125p72j070j656j768j311q28n49k37J72M24M65
$$ 191468 189811 188276 186590 184980 183855 183083 182013 180357 178589 177278 176450 175901 175664 175836 176260 176725
51855A76725M03R4o25j363j603j547j761k051j701q74o46j338j912j593j029j101
$$ 176725 177128 177222 176597 175234 173631 172084 170323 168272 166571 165697 165051 163713 161801 160208 159179 158078
51839A58078j481j301o32k92n41r95j538k420l390l649k886j765j148j188j337
$$ 158078 156597 155296 154664 154372 153831 152836 151298 148878 145488 141839 138953 137188 136040 134852 133515
51824A33515r39J49J272J406K60j131j448o83r1m73j123r38Q7R83J139P67J84
$$ 133515 132576 132725 133997 135403 135663 134532 133084 132401 132310 131837 130714 129776 129863 130846 131985 132752 132936
51807A32936o02j428j710j129j55N10P07O57L80j01k58M66J661K214J740R89N65
$$ 132936 132334 130906 129196 128067 127912 128422 129129 129786 130166 130065 129807 130273 131934 134148 135888 136877 137442
51790A37442J23n93q01K70J960K768K252J332Q47P32P38J037J720K352K432J891
$$ 137442 137565 136972 136171 136441 138401 141169 143421 144753 145600 146332 147070 148107 149827 152179 154611 156502
51774A56502J010J95p1M00J064J075L73j85j6M23L37l96j221j560j234n18M9J22
$$ 156502 157512 157707 157636 158036 159100 160175 160548 160363 160347 160770 161107 160711 159490 157930 156696 156178 156227 156349
51756A56349l6M9L18K72k30q13j306j865k321k090j141k73q2k71l68m56o75o09
$$ 156349 156313 156362 156680 156952 156722 155909 154603 152738 150417 148327 147186 146913 146831 146560 146192 145736 145061 144452
51738A44452J05J048J492J345R98O39K39NK07P70J306J483J068M1j013j253o49
$$ 144452 144557 145605 147097 148442 149440 150079 150318 150323 150530 151300 152606 154089 155157 155198 154185 152932 152283
51721A52283j85m76q66n64K1K4l68k60L96O90K06m88q44r14p85k73O00J452J959
$$ 152283 152098 151622 150756 150192 150213 150237 149869 149609 150005 150695 150901 150413 149569 148655 147870 147597 148197 149649 151608
51702A51608J983J329J14p90m89O86J541J654J693J983J939J258O36O74R65J003
$$ 151608 153591 154920 155034 154244 153755 154441 155982 157636 159329 161312 163251 164509 165145 165819 166784 167787
51686A67787J126J766K389K260J679J605K265L018L455L725L834L492K807K406
$$ 167787 168913 170679 173068 175328 177007 178612 180877 183895 187350 191075 194909 198401 201208 203614
51672B03614K624L129L556L954M400M630M477M316M630N319N869O120O482P313
$$ 203614 206238 209367 212923 216877 221277 225907 230384 234700 239330 244649 250518 256638 263120 270433
51658B70433Q353Q997R013Q701Q350P779O586M716K617Q34l56j011j364j707k199
$$ 270433 278786 287783 296796 305497 313847 321626 328212 332928 335545 336379 336023 335012 333648 331941 329742
51643C29742k719l046l186l364l658l831l631l043k194j180j60N66Q53R39J197
$$ 329742 327023 323977 320791 317427 313769 309938 306307 303264 301070 299890 299730 300296 301149 302088 303285
51628C03285J647J982K131K559L758N512O872P138O717O735P654Q508P785N006
$$ 303285 304932 306914 309045 311604 315362 320874 327746 334884 341601 348336 355990 364498 372283 377289
51614C77289J171k318m825o543p683q022p311n825m280l183k503k139k319l105
$$ 377289 378460 376142 371317 364774 357091 349069 341758 335933 331653 328470 325967 323828 321509 318404
51600C18404l726l120j329L59J058J356K103K861K608J586J187J870K457J917
$$ 318404 314678 311558 310229 310588 311646 313002 315105 317966 320574 322160 323347 325217 327674 329591
51586C29591Q30L65O48R25Q11M78p2j064k366l454m033m212m165m073m227m759
$$ 329591 330421 330786 331434 332359 333170 333648 333576 332512 330146 326692 322659 318447 314282 310209 305982 301223
51570C01223n305n396n113m888m795m503l907l354l159l319l717m190m390m010
$$ 301223 295918 290522 285409 280521 275726 271223 267316 263962 260803 257484 253767 249577 245187 241177
51556B41177l247k630k356k213k189k601l431m019l760k788j737j095j025j433
$$ 241177 237930 235300 232944 230731 228542 225941 222510 218491 214731 211943 210206 209111 208086 206653
51542B06653j927j968j408p03m05o01j039j511j824j746j281p73m61j45L55P40
$$ 206653 204726 202758 201350 200647 200242 199641 198602 197091 195267 193521 192240 191467 191006 190861 191216 191956
51526A91956O79M66O43J093J185Q21O43R71J204Q13L42Q22K341L842M360M023
$$ 191956 192635 193101 193744 194837 196022 196843 197486 198457 199661 200474 200816 201638 203979 207821 212181 216204
51510B16204L645L647L709L348K631K166K432L188L678L457K806K238J754Q91
$$ 216204 219849 223496 227205 230553 233184 235350 237782 240970 244648 248105 250911 253149 254903 255794
51496B55794m86j795k364k242k123k405k691k396j642j150j261j490j300r07q63
$$ 255794 255308 253513 251149 248907 246784 244379 241688 239292 237650 236500 235239 233749 232449 231542 230679
51481B30679j056p28L94J561J899J471J056J096J300J254J038J189K164L889N676
$$ 230679 229623 228895 229289 230850 232749 234220 235276 236372 237672 238926 239964 241153 243317 247206 252882
51466B52882O710O704O031N173M240L168K028Q62m38j753k468k108j105l65k38
$$ 252882 259592 266296 272327 277500 281740 284908 286936 287798 287360 285607 283139 281031 279926 279561 279323
51451B79323l89p23j532k640l105k338r54l5J18l1j25k10k64m8M63R30J070R44
$$ 279323 278934 278211 276679 274039 270934 268596 267642 267607 267725 267694 267569 267359 267095 267047 267510 268440 269510 270454
51433B70454P47N39L25J79J36rn86j623k602k879k488k261k807l582l519k457
$$ 270454 271201 271740 272065 272244 272380 272371 271785 270162 267560 264681 262193 259932 257125 253543 250024 247567
51417B47567j353r04p33l07O8k00q85j186q04j23N37J090J301R70N89R84K040
$$ 247567 246214 245310 244577 244270 244338 244138 243253 242067 241263 241140 241677 242767 244068 245038 245627 246611 248651
51400B48651K588J962J070J256K530L601L568K887K618L187M210N163N834O219
$$ 248651 251239 253201 254271 255527 258057 261658 265226 268113 270731 273918 278128 283291 289125 295344
51386B95344O248N868N193M491M044M028M380M667M331L347K407K133K163J578
$$ 295344 301592 307460 312653 317144 321188 325216 329596 334263 338594 341941 344348 346481 348644 350222
51372C50222K50q57r70m72j48m0L36R36J107M86n39j302j384p34L52J443K370
$$ 350222 350472 349615 348645 348173 348025 347985 348321 349257 350364 350850 350311 349009 347625 346891 347243 348686 351056
51355C51056L281M044M032K996J732J167J093O37k72q40q60j095j993k942l313
$$ 351056 354337 358381 362413 365409 367141 368308 369401 370038 369766 368926 368066 366971 364978 362036 358723
51340C58723l443m019n048n941o250n858m885l790l155l031k866k368j922j891
$$ 358723 355280 351261 346213 340272 334022 328164 323279 319489 316334 313303 310437 308069 306147 304256
51326C04256k043k087k177k436k521k248k089k377k512j740m22L61K98J23M41
$$ 304256 302213 300126 297949 295513 292992 290744 288655 286278 283766 282026 281604 281965 282263 282386 282827
51311B82827J036J470J661J660J364P53Q6m04p84j336k290l567m621m776m047
$$ 282827 283863 285333 286994 288654 290018 290771 290857 290453 289669 288333 286043 282476 277855 273079 269032
51296B69032l417l860n233o548p180p237o925o272n522n121n016m589l624k812
$$ 269032 265615 261755 256522 249974 242794 235557 228632 222360 216838 211717 206701 202112 198488 195676
51282A95676k836l367l490k927k296k221k633l047l150k928k495k052j866j990
$$ 195676 192840 189473 185983 183056 180760 178539 175906 172859 169709 166781 164286 162234 160368 158378
51268A58378k069j679r19m07m72p02n24n3J29j20l85m36m95n64j86P17J337Q93
$$ 158378 156309 154630 153711 153304 152832 152130 151606 151553 151682 151562 151177 150741 150246 149682 149496 150213 151550 152443
51250A52443k34q89m67O26J664K249K315K044J851K040K399K437J999J441J209
$$ 152443 152209 151320 150853 151479 153143 155392 157707 159751 161602 163642 166041 168478 170477 171918 173127
51235A73127J498K218K970L236K928K656L082M028M667M469L609K468J229P9p18
$$ 173127 174625 176843 179813 183049 185977 188633 191715 195743 200410 204879 208488 210956 212185 212264 211546
51220B11546j113j401j931k756l628m149m075l702l699m309m923m886m398m069
$$ 211546 210433 209032 207101 204345 200717 196568 192493 188791 185092 180783 175860 170974 166576 162507
51206A62507l868l240k202j506j556j858j848j595j446j438j520j801k240k448
$$ 162507 158639 155399 153197 151691 150135 148277 146429 144834 143388 141950 140430 138629 136389 133941
51192A33941k163j585j027n50k47l79r72j537j612j294r69q04p35o54l99J51P38
$$ 133941 131778 130193 129166 128616 128369 127990 127018 125481 123869 122575 121606 120802 120067 119413 119014 119165 119903
51175A19903R02O70O50J138J658J723J585J728K056K172K083K036J933J529R92
$$ 119903 120805 121475 122125 123263 124921 126644 128229 129957 132013 134185 136268 138304 140237 141766 142758
51160A42758O76M74O8l47k54L00O72N04O4l68q02j138j123r08j044j616j899j282
$$ 142758 143434 143908 143976 143629 143375 143675 144347 144851 144915 144547 143745 142607 141484 140576 139532 137916 136017 134735
51142A34735j10P93J079R35N35q3p24j128j319j526j791j946j910j749j433q92
$$ 134735 134625 135418 136497 137432 137967 137884 137160 136032 134713 133187 131396 129450 127540 125791 124358 123466
51126A23466k72J12J71J26J25K7k41l84r3M12N09j08j077j782j982j864j653j409
$$ 123466 123194 123306 123477 123603 123728 123755 123514 123130 123037 123449 123958 123850 122773 120991 119009 117145 115492 114083
51108A14083j180j113j276j526j587j287o35K16J003J413J260O39j38p04q27m97
$$ 114083 112903 111790 110514 108988 107401 106114 105479 105695 106698 108111 109371 110010 109872 109168 108341 107844
51092A07844O0N53Q81J137J290J063K84o44r73m67K21K69l03o95m17N4j4n35p26
$$ 107844 107904 108457 109338 110475 111765 112828 113112 112468 111495 111028 111249 111518 111215 110520 110103 110157 110143 109608 108882
51073A08882k39L53L90J2j63QMn32j213j332p00J54N65M34K17K05Q3m67r43m18
$$ 108882 108643 108996 109386 109398 109235 109243 109247 108715 107502 106170 105470 105624 106189 106623 106840 107045 107128 106661 105718 105300
51053A05300J004J852J038n53j092j11J160J745K068K738L254K795J665R81J167
$$ 105300 106304 108156 109194 108641 107549 107438 108598 110343 112411 115149 118403 121198 122863 123844 125011
51038A25011J581J597J320J090R70R50J194J725K150K064J553J018N70o8r61j506
$$ 125011 126592 128189 129509 130599 131569 132519 133713 135438 137588 139652 141205 142223 142793 142725 141764 140258
51022A40258r58N09J653J413R2j094j561j767k048j851o95P25J223O71P5J11L45
$$ 140258 139300 139809 141462 142875 142967 141873 140312 138545 136497 134646 133951 134676 135899 136570 136645 136756 137101
51005A37101J67j66N8Q92J562J391N67j91n11o99j120j528j390p73l94o00q58
$$ 137101 137268 137102 137160 138052 139614 141005 141572 141381 140870 140171 139051 137523 136133 135360 134966 134366 133508
50988A33508o44l16m56p38l54N92J057O60L07P92J588J723J282J154J594J949
$$ 133508 132864 132548 132092 131354 131000 131592 132649 133309 133616 134408 135996 137719 139001 140155 141749 143698
50972A43698J797J563J712J989J855J339R43R69J298J733K172K440K315J842J449
$$ 143698 145495 147058 148770 150759 152614 153953 154896 155865 157163 158896 161068 163508 165823 167665 169114
50957A69114J461J747J935J920J923K084K239K138J737J226R17J096J757K476
$$ 169114 170575 172322 174257 176177 178100 180184 182423 184561 186298 187524 188441 189537 191294 193770
50943A93770K767K657K709L239L870M019L649L230L187L678M741O202P467P916
$$ 193770 196537 199194 201903 205142 209012 213031 216680 219910 223097 226775 231516 237718 245185 253101
50929B53101P614P302P580Q304Q898R068R031R231R910J0924J1959J2954J4199
$$ 253101 260715 268017 275597 283901 292799 301867 310898 320129 330039 340963 352922 365876 380075
50916C80075J5871J7677J9264K0792K2721K5041K7244K9068L0803L2760L4866
$$ 380075 395946 413623 432887 453679 476400 501441 528685 557753 588556 621316 656182
50905F56182L7023L9317M1630M3530M4898M6252M7986M9615N0295M9870M8800
$$ 656182 693205 732522 774152 817682 862580 908832 956818 1006433 1056728 1106598 1155398
50894A155398M7251M4866M1469L7414L3079K8424K3368J8254J3612R634O019K352
$$ 1155398 1202649 1247515 1288984 1326398 1359477 1387901 1411269 1429523 1443135 1452769 1458788 1461140
50882A461140j486n059p627q770q907q946r381r898j0025r866j0011j0903j2517
$$ 1461140 1459654 1454595 1446968 1438198 1429291 1420345 1410964 1401066 1391041 1381175 1371164 1360261 1347744
50869A347744j4679j7367k0575k4070k7387l0192l2561l4930l7654m0583m3075
$$ 1347744 1333065 1315698 1295123 1271053 1243666 1213474 1180913 1145983 1108329 1067746 1024671
50858A024671m4434m4442m3478m2146m0710l8914l6435l3572l1205k9839k8832
$$ 1024671 980237 935795 892317 850171 809461 770547 734112 700540 669335 639496 610664
50847F10664k6940k3793k0425j8040j6584j4993j2758j0644r527r035p950n830
$$ 610664 583724 559931 539506 521466 504882 489889 477131 466487 456960 447925 439975 434145
50835D34145l626k487k442k588k250j516p37L0R35K028L157M107M752N153N474
$$ 434145 430519 428032 425590 423002 420752 419236 418499 418529 419464 421492 424649 428756 433508 438661 444135
50820D44135N757N901O030O593P797R082R691R723J0098J1348J2994J4386J5597
$$ 444135 449892 455793 461823 468416 476213 485295 494986 504709 514807 526155 539149 553535 569132
50807E69132J7057J8769K0403K1866K3291K4639K5928K7625L0251L3625L7025
$$ 569132 586189 604958 625361 647227 670518 695157 721085 748710 778961 812586 849611
50796H49611M0133M3334M7079N1469N6500O2133O7965P3385P8313Q3344Q8917
$$ 849611 889744 933078 980157 1031626 1088126 1150259 1218224 1291609 1369922 1453266 1542183
50785A542183R4667R9892J04194J07489J09687J10706J10486J08714J04864R8713
$$ 1542183 1636850 1736742 1840936 1948425 2058112 2168818 2279304 2388018 2492882 2591595
50775B591595R0546Q0681O9261N6707M3838L1170J8628O458m161j2106j7580k1661
$$ 2591595 2682141 2762822 2832083 2888790 2932628 2963798 2982426 2988884 2984723 2972617 2955037 2933376
50763B933376k4899k6998k7552k6330k3228j8955j5538j4959j7130k0320k3750
$$ 2933376 2908477 2881479 2853927 2827597 2804369 2785414 2769876 2754917 2737787 2717467 2693717
50752B693717k8489l5459m3813n2194o0509o9282p8002q5347r0772r4774r7738
$$ 2693717 2665228 2629769 2585956 2533762 2473253 2403971 2325969 2240622 2149850 2055076 1957338
50741A957338r9418r9617r8423r5797r1685q6668q1678p6913p1676o5560n9175
$$ 1957338 1857920 1758303 1659880 1564083 1472398 1385730 1304052 1227139 1155463 1089903 1030728
50730A030728n3452m8726m4724m1011l7123l2786k8295k4415k1589j9519j7651
$$ 1030728 977276 928550 883826 842815 805692 772906 744611 720196 698607 679088 661437
50719F61437j5780j3969j2323j0998j0110r403q356o873n575n043n049m862m127
$$ 661437 645657 631688 619365 608367 598257 588854 580498 573625 568050 563007 557958 553096 548969
50706E48969l151k395j984j630r68P6J160J945K505L110L789M495N565P403R592
$$ 548969 545818 543423 541439 539809 538841 538917 540077 542022 544527 547637 551426 555921 561486 568889 578481
50691E78481J1103J1623J2054J3215J4757J5951J6963J8452K0349K1963K3280
$$ 578481 589584 601207 613261 626476 641233 657184 674147 692599 712948 734911 758191
50680G58191K5160K8056L1333L4211L6762L9502M2441M5152M7601N0411N4079
$$ 758191 783351 811407 842740 876951 913713 953215 995656 1040808 1088409 1138820 1192899
50669A192899N8305O2256O5416O7802O9391O9756O8663O6663O4475O1757N7283
$$ 1192899 1251204 1313460 1378876 1446678 1516069 1585825 1654488 1721151 1785626 1847383 1904666
50658A904666N0554M2495L4163K5495J6033O275k668j0396j7233k3040k7049k9079
$$ 1904666 1955220 1997715 2031878 2057373 2073406 2079681 2077013 2066617 2049384 2026344 1999295 1970216
$$ [...]
##END NTUPLES=NMR SPECTRUM
##END=
