
##TITLE=AC1210_ECURS12047_5946853_RW26vjYn89
##JCAMPDX= 6.0         $$ Bruker NMR JCAMP-DX V2.0
##DATA TYPE= NMR SPECTRUM
##DATA CLASS= NTUPLES
##ORIGIN= BRUKER
##OWNER= Administrator
$$ 1.72 TOPSPIN		Version 2.1
$$ 2012-04-11 05:40:05.765 -0500  Administrator@TOPSPIN
$$ Compression mode = diff/dup
##.OBSERVE FREQUENCY= 400.13188235
##.OBSERVE NUCLEUS= ^1H
##.ACQUISITION MODE= SIMULTANEOUS (DQD)
##.ACQUISITION SCHEME= undefined
##.AVERAGES= 8
##.DIGITISER RES= 22
##SPECTROMETER/DATA SYSTEM= spect
##.PULSE SEQUENCE= zg30
##.SOLVENT NAME= COFFEE_meoh
##.SHIFT REFERENCE= INTERNAL, COFFEE_meoh, 1, 14.98061
##AUDIT TRAIL= $$ (NUMBER, WHEN, WHO, WHERE, PROCESS, VERSION, WHAT)
$$ ##TITLE= Audit trail, TOPSPIN		Version 2.1
$$ ##JCAMPDX= 5.01
$$ ##ORIGIN= Bruker BioSpin GmbH
$$ ##OWNER= Administrator
$$ $$ C:\Bruker\TOPSPIN/data/COFFEE/nmr/AC1210_ECURS12047_5946853_RW26vjYn89/10/pdata/1/auditp.txt
$$ ##AUDIT TRAIL=  $$ (NUMBER, WHEN, WHO, WHERE, PROCESS, VERSION, WHAT)
(   1,<2012-04-11 05:39:59.109 -0500>,<Administrator>,<TOPSPIN>,<go>,<TOPSPIN 2.1>,
      <created by zg
	started at 2012-04-11 05:38:51.968 -0500,
	POWCHK enabled, PULCHK disabled,
       configuration hash MD5:
       1A 1E CE 29 27 FD 77 03 67 4E F0 E3 C4 B2 CB 90
       data hash MD5: 64K
       63 F0 80 EE 4E 5D DC E9 2C 55 75 DA 5E FB 3D 9D>)
(   2,<2012-04-11 05:40:01.640 -0500>,<Administrator>,<TOPSPIN>,<proc1d>,<TOPSPIN 2.1>,
      <Start of raw data processing
       efp LB = 0 FT_mod = 6 PKNL = 1 PHC0 = 0 PHC1 = 0 SI = 32K 
       data hash MD5: 32K
       1F FF 06 C8 8E F7 8C F1 5D DF 78 98 A8 76 D4 88>)
(   3,<2012-04-11 05:40:02.046 -0500>,<Administrator>,<TOPSPIN>,<proc1d>,<TOPSPIN 2.1>,
      <pk PHC0 = 212.6843 PHC1 = 0 
       data hash MD5: 32K
       81 9D 0A 3F 2A DA 99 48 F3 1D B2 93 25 B7 D5 EC>)
(   4,<2012-04-11 05:40:02.156 -0500>,<Administrator>,<TOPSPIN>,<proc1d>,<TOPSPIN 2.1>,
      <abs ABSG = 1 
       data hash MD5: 32K
       40 3E 25 06 B2 89 D8 A9 1F FA 50 43 DC BA B2 7E>)
(   5,<2012-04-11 05:40:02.187 -0500>,<Administrator>,<TOPSPIN>,<proc1d>,<TOPSPIN 2.1>,
      <abs ABSG = 2 
       data hash MD5: 32K
       E1 2B BE 98 FE 26 ED 79 2A B9 12 85 93 75 32 22>)
(   6,<2012-04-11 05:40:02.218 -0500>,<Administrator>,<TOPSPIN>,<proc1d>,<TOPSPIN 2.1>,
      <abs ABSG = 3 
       data hash MD5: 32K
       F4 54 7F 6A 72 0E 21 8C D4 A1 61 9A 3A 95 94 39>)
(   7,<2012-04-11 05:40:02.250 -0500>,<Administrator>,<TOPSPIN>,<proc1d>,<TOPSPIN 2.1>,
      <abs ABSG = 4 
       data hash MD5: 32K
       DA 10 BB 76 1E FF C8 62 5B C7 02 A2 C9 10 E8 33>)
(   8,<2012-04-11 05:40:02.281 -0500>,<Administrator>,<TOPSPIN>,<proc1d>,<TOPSPIN 2.1>,
      <abs ABSG = 5 
       data hash MD5: 32K
       EF A9 55 AC D1 A0 2A 36 BA D5 8F 16 19 A2 BE C9>)
$$ ##END=
$$ 
$$ $$ hash MD5
$$ $$ 03 90 DA A5 8E 18 4E C2 90 DA 63 83 4C 3B 57 7E
##$RELAX= 
##$RELAX= 
##$RELAX= 
##$RELAX= 
##$RELAX= 
##$RELAX= 
##$RELAX= 
$$ Bruker specific parameters
$$ --------------------------
$$ [...]
##$TP= (0..7)
150 150 150 150 150 150 150 150
##$TP07= 0
##$TPNAME0= <>
##$TPNAME1= <>
##$TPNAME2= <>
##$TPNAME3= <>
##$TPNAME4= <>
##$TPNAME5= <>
##$TPNAME6= <>
##$TPNAME7= <>
##$TPOAL= (0..7)
0.5 0.5 0.5 0.5 0.5 0.5 0.5 0.5
##$TPOFFS= (0..7)
0 0 0 0 0 0 0 0
##$TUNHIN= 0
##$TUNHOUT= 0
##$TUNXOUT= 0
##$USERA1= <user>
##$USERA2= <user>
##$USERA3= <user>
##$USERA4= <user>
##$USERA5= <user>
##$V9= 5
##$VALIST= <valist>
##$VCLIST= <CCCCCCCCCCCCCCC>
##$VD= 0
##$VDLIST= <DDDDDDDDDDDDDDD>
##$VPLIST= <PPPPPPPPPPPPPPP>
##$VTLIST= <TTTTTTTTTTTTTTT>
##$WBST= 1024
##$WBSW= 4
##$XGAIN= (0..3)
0 0 0 0
##$XL= 0
##$YL= 0
##$YMAX_a= 523507
##$YMIN_a= -639431
##$ZGOPTNS= <>
##$ZL1= 120
##$ZL2= 120
##$ZL3= 120
##$ZL4= 120
##$ABSF1= 14.98061
##$ABSF2= -5.57192
##$ABSG= 5
##$ABSL= 3
##$ALPHA= 0
##$AQORDER= 0
##$ASSFAC= 0
##$ASSFACI= 0
##$ASSFACX= 0
##$ASSWID= 0
##$AUNMP= <proc_prof1d_extract_pilot.lims>
##$AXLEFT= 0
##$AXNAME= <>
##$AXNUC= <1H>
##$AXRIGHT= 0
##$AXTYPE= 0
##$AXUNIT= <>
##$AZFE= 0.1
##$AZFW= 0.1
##$BCFW= 0
##$BC_mod= 0
##$BYTORDP= 0
##$COROFFS= 0
##$CY= 15
##$DATMOD= 1
##$DC= 0
##$DFILT= <>
##$DTYPP= 0
##$F1P= 0
##$F2P= 0
##$FCOR= 0.5
##$FTSIZE= 32768
##$FT_mod= 6
##$GAMMA= 0
##$GB= 0
##$INTBC= 1
##$INTSCL= 1
##$ISEN= 128
##$LB= 0
##$LEV0= 0
##$LPBIN= 0
##$MAXI= 10000
##$MC2= 0
##$MEAN= 0
##$ME_mod= 0
##$MI= 0
##$NCOEF= 0
##$NC_proc= -8
##$NLEV= 6
##$NOISF1= 0
##$NOISF2= 0
##$NSP= 0
##$NTH_PI= 0
##$NZP= 0
##$OFFSET= 14.98061
##$PC= 1
##$PHC0= 212.6843
##$PHC1= 0
##$PH_mod= 1
##$PKNL= yes
##$PPARMOD= 0
##$PPDIAG= 0
##$PPIPTYP= 0
##$PPMPNUM= 2147483647
##$PPRESOL= 1
##$PSCAL= 4
##$PSIGN= 0
##$PYNMP= <proc.py>
##$REVERSE= no
##$SF= 400.13
##$SI= 32768
##$SIGF1= 0
##$SIGF2= 0
##$SINO= 400
##$SIOLD= 32768
##$SPECTYP= <>
##$SREGLST= <1H.CDCl3>
##$SSB= 0
##$STSI= 32768
##$STSR= 0
##$SW_p= 8223.68421052632
##$SYMM= 0
##$S_DEV= 0
##$TDeff= 65536
##$TDoff= 0
##$TI= <>
##$TILT= no
##$TM1= 0
##$TM2= 0
##$TOPLEV= 0
##$USERP1= <user>
##$USERP2= <user>
##$USERP3= <user>
##$USERP4= <user>
##$USERP5= <user>
##$WDW= 1
##$XDIM= 32768
##$YMAX_p= 460278830
##$YMIN_p= -665327
##$CURPLOT= <Network HP LaserJet P1505>
##$CURPRIN= <$Network HP LaserJet P1505>
##$DFORMAT= <normdp>
##$LAYOUT= <+/1D_H.xwp>
##$LFORMAT= <normlp>
##$PFORMAT= <normpl>
##$SURQMSG= 1
$$ End of Bruker specific parameters
$$ ---------------------------------
##NTUPLES= NMR SPECTRUM
##VAR_NAME=  FREQUENCY,     SPECTRUM/REAL,   SPECTRUM/IMAG
##SYMBOL=    X,             R,               I
##VAR_TYPE=  INDEPENDENT,   DEPENDENT,       DEPENDENT
##VAR_FORM=  AFFN,          ASDF,            ASDF
##VAR_DIM=   32768,         32768,           32768
##UNITS=     HZ,            ARBITRARY UNITS, ARBITRARY UNITS
##FACTOR=    0.250966925370066, 1,           1
##FIRST=     8223.43324360095, 74677,        -110062
##LAST=      0,             12378,           68360
##MIN=       0,             -665327,         0
##MAX=       8223.43324360095, 460278830,    0
$$ Real data points
##PAGE= N=1
##DATA TABLE= (X++(R..R)), XYDATA
$$ [...]
$$ plain form
19479 -161832 61824 -94568 -193850 -77567 -175757 -289190 -183067 -142423 332868 -307008 -167298
19468 -167298 -273122 1846 -67992 -57781 -503833 -337822 -56745 -86648 -190282 115674 -469875
19456 -248456 179767 -39618 -13111 71777 158686 -104143 -247250 298411 -71014 -82186 131599
19444 55591 145723 -61860 73728 105537 34367 -53646 98859 192790 65485 -22632 141996
19432 -274415 -407600 177110 -50774 79826 6963 188599 -89315 21279 -275595 -176699 -309031
19421 -309031 -205906 31693 -42256 -46033 65605 114881 86385 26607 -122760 -99414 127994
19409 -87142 -279452 -80735 -158738 -233722 -229752 -123774 -330916 -390985 -14077 109577 -276112
19397 175306 -137383 119648 19452 -125673 -182803 -192405 -140419 -282719 197618 -180169
$$ packed form
19479a61832F1824i4568r9282g7567r8190j13433J06123M0644C32868c07008J39710
19468a67298j05824A846f7992J0211m46052J66011e6745k9903j03634A15674d69875
19456b48456A79767c9618a3111G1777Q6909a04143j43107B98411g1014j1172A31599
19444E5591R0132f1860G3728L1809C4367e3646I8859R3931F5485b2632A41996
19432b74415j33185A77110e0774G9826F963J81636h9315B1279b75595R8896j32332
19421c09031J03125C1693d2256l777F5605M9276k8496B6607a22760K3346A27994
19409h7142j92310h0735p8003p4984L970J05978k07142o0069a4077A09577b76112
19397A75306a37383A19648A9452a25673n7130r602N1986j42300A97618a80169
$$ plain form
19386 -90384 -366887 199634 -2693 -54338 -76358 -215611 -41948 -29616 17523 -146670 115807
19374 -38967 3304 -111902 -162994 -516572 -251957 -266478 -23860 -5482 -29640 -43330 -161298
19363 -161298 130597 -191188 -45188 89311 -191635 -265771 -52458 53070 -260921 -211785 90758
19351 86298 72604 126129 252148 212280 -144685 72258 -309802 -341108 -227220 48344 -188103
19339 90020 -190871 -265715 42824 -181796 -741 -169264 -27379 53506 30604 122393 -116536
19327 -157758 -139991 -397602 37694 12439 -174998 -249625 -93365 -248962 -182020 96314 -121641
19315 -35040 37189 124361 5499 17719 115927 190352 -213943 -25333 237945 -190670 12535
19303 -142452 -79517 -44900 11628 -58056 -127378 -273405 -292261 -75474 163731 -108818 164694
$$ packed form
19386i0384k76503A99634b693n1645k2020j39253d1948J2332A7523a46670A15807
19374c8967C304a11902n1092l53578b51957j4521b3860e482k4158j3690j17968
19363a61298A30597a91188d5188H9311a91635p4136e2458E3070b60921M9136I0758
19351H6298j3694N3525J26019l9868a44685G2258c09802l1306J13888D8344a88103
19339I0020a90871p4844D2824a81796g41j68523b7379E3506k2902R1789a16536
19327a57758J7767k57611C7694A2439a74998p4627i3365j55597O6942I6314a21641
19315c5040C7189Q7172E499J2220R8208P4425b13943b5333B37945a90670A2535
19303a42452O2935L4617A1628e8056o9322j46027j8856g5474A63731a08818A64694
$$ plain form
19291 -218524 -302917 82895 -84284 113385 51794 -59296 -81031 70391 -91944 -65502 -49072
19280 -49072 -299089 -220512 251104 -117319 -384477 320444 80205 -168522 157706 -189403
19269 -263288 214395 -144313 -283084 -83924 -265033 -134488 -152117 66765 300229 17765
19258 -205027 88622 89448 -26065 -70381 -137863 96268 -92776 -11367 166830 287333 65758
19246 91944 -251658 288184 45612 182325 -89768 -11931 98807 -76069 -129930 59220 63118
19235 63118 43849 195556 -175419 126488 -70675 -389982 -83345 -294204 -213760 -37480 -165219
19224 -165219 -143624 -91453 -157654 -251023 -139077 -69594 -309754 -16607 -201516 280576 53360
19212 207266 -171603 -360067 -13229 98980 -189549 -348963 -49306 -360364 -123211 -321493
$$ packed form
19291b18524q4393H2895h4284A13385E1794e9296k1735G0391i1944K6442J6430
19280d9072k50017P8577B51104a17319k67158C20444H0205a68522A57706a89403
19269b63288B14395a44313j38771h3924j81109J30545j7629F6765K33464A7765
19258b05027H8622Q26b6065m4316o7482I6268i2776a1367A66830J20503F5758
19246I1944b51658B88184D5612J36713h9768a1931I8807g6069n3861E9220L898
19235F3118j9269J51707a75419A26488g0675l19307h3345k10859Q0444c7480j27739
19224a65219K1595N2171o6201r3369J11946O9483k40160a6607j84909B80576E3360
19212B07266a71603j88464a3229I8980a89549j59414d9306l11058a23211j98282
$$ plain form
19202 -321493 -140646 55826 -169064 -79695 -225860 -50873 -339753 -190088 -171474 -123417
19192 -123417 -49181 -43656 63156 208584 90620 -77267 -145166 -471542 15757 101764 126561
19181 126561 16035 103482 -331407 5877 -183455 -85968 250695 -129349 -135923 -346635 -304281
19170 -304281 -20282 -53049 -5278 64054 -70180 -213640 -103357 -144883 -387482 -166091 19625
19158 -8289 -4917 151077 -288013 -39036 -212032 -133040 -174823 -44105 -20512 134317 -562705
19146 -212982 1242 249015 -53841 -143211 301314 -115563 -147996 -181658 -242710 -373480 180297
19134 20546 139042 -95105 -138402 76725 32369 197542 59910 -112682 -33258 -171702 -429464
19123 -429464 -101541 -302305 20531 -57416 -474228 -312182 -165159 107380 89216 152207
$$ packed form
19202c21493a40646E5826a69064g9695j46165e0873k88880J49665J8614M8057
19192a23417d9181N525F3156J45428I0620g7267o7899l26376A5757Q6007K4797
19181A26561A6035Q7447c31407E877a83455h5968B50695a29349o574k10712M2354
19170c04281b0282l2767e278F4054g0180j43460a03357m1526k42599a66091A9625
19158h289L372A51077b88013c9036j72996P8992m1783d4105b0512A34317e62705
19146b12982A242K47773e3841q9370C01314a15563l2433l3662o1052j30770A80297
19134B0546J18496i5105m3297G6725C2369J65173E9910a12682c3258j38444k57762
19123d29464a01541k00764B0531e7416m16812J62046J47023A07380j8164O2991
$$ plain form
19113 152207 -104215 189483 102429 99575 -374434 369727 -125922 76381 -161314 86293
19102 -242895 -277207 -51540 -45874 -58585 354786 95889 -209803 -66487 288527 -31865 -193593
19091 -193593 -14312 -58045 -184318 29255 -95987 37910 -46603 -326213 -268988 -248716 310490
19079 142353 180310 -153928 85368 116150 357784 102134 291136 4550 -28551 -49447 -58104
19068 -58104 104765 98794 124082 22616 99504 -232943 -423138 3596 -67257 -146527 -194436
19057 -194436 -184529 -36632 -212391 -98087 43040 -42573 -4767 -395826 54632 297809 -290477
19045 -10602 -86381 65931 -283843 -284653 36982 -587641 -133092 95856 128985 84833 -31111
19033 51359 -58512 -108107 100041 -159752 -192712 -95757 288387 92309 -79916 101423 -191661
$$ packed form
19113A52207a04215A89483q7054k854c74434C69727a25922G6381a61314H6293
19102b42895l4312e1540N666j2711C54786I5889b09803f6487B88527c1865j61728
19091a93593a4312m3733j26273B9255i5987C7910d6603k79610N7225K0272C10490
19079A42353L7957a53928H5368L0782K41634A02134J89002D550b8551k0896q657
19068e8104A04765n971K5288B2616P6888b32943j90195C596f7257p9270m7909
19057a94436R907c6632j75759i8087D3040d2573d767l91059E4632K43177b90477
19045a0602p5779F5931b83843q10C6982e87641a33092I5856L3129m4152c1111
19033E1359e8512m9595A00041a59752l2960i5757B88387I2309g9916A01423a91661
$$ plain form
19021 -486 82018 -17333 -309834 145866 -102372 -230076 -424953 80202 -183109 158165 160273
19010 160273 -197508 -95119 -267081 -42670 101505 -84855 -347047 -5553 -460574 -185235
18999 26589 -214566 -212447 -452844 -122965 56684 -334088 -129654 -34442 305795 -163976
18988 -67587 280707 104859 305817 -166719 -240321 -59922 268315 127015 41081 -196024
18977 -99617 117045 -103586 16169 -12096 -11651 -21768 -118940 -28591 -117518 162277 101740
18966 101740 -132369 -27531 63930 -401755 -535516 -145476 -105580 -6514 88656 -140489 75617
18954 -64381 162543 -41821 -210503 -157333 78165 191892 255260 91192 297098 -133345 455889
18942 347692 -163816 -111226 -65195 24592 -254367 -205557 203267 -11465 -155319 36939 43316
$$ packed form
19021d86H2018a7333k92501A45866a02372j27704j94877H0202a83109A58165K108
19010A60273a97508i5119j71962d2670A01505h4855k62192e553m55021a85235
18999B6589b14566K119k40397a22965E6684c34088a29654c4442C05795a63976
18988f7587B80707A04859K00958a66719p3602e9922B68315A27015D1081a96024
18977i9617A17045a03586A6169a2096M45j0117r7172b8591q8927A62277o0537
18966A01740a32369b7531F3930d01755j33761a45476L9896f514H8656a40489G5617
18954f4381A62543d1821j68682N3170G8165J13727O3368I1192K05906a33345D55889
18942C47692a63816N2590M6031B4592b54367M8810B03267a1465j43854C6939O377
$$ plain form
18931 43316 166742 93276 -69095 -276156 -270310 105948 -478690 27611 -128964 -50163 42286
18919 212431 -189383 119998 131027 6777 -105455 -169642 75126 123349 -128181 56948 -171815
18907 -41738 53659 105185 -248578 -80595 239938 25053 120810 -5382 202640 91377 242279
18896 242279 198656 -23306 -208835 -8967 -50787 -172023 79361 -133078 -172160 -130887 103378
18884 175796 407357 402181 654323 481173 101608 153383 83528 -247452 61151 -33576 -194228
18873 -194228 -53747 -174944 -269377 401005 259314 100366 336405 155099 115485 -108523
18862 239330 -455251 -203322 -202360 129184 193128 -296569 -47087 -128021 -47622 -80173 -117133
18851 -117133 -105565 -297870 -441279 103217 -78835 161181 -15946 -203283 -324757 142413
$$ packed form
18931D3316J23426p3466f9095k07061N846A05948d78690B7611a28964e0163D2286
18919B12431a89383A19998J1029F777a05455o4187G5126M8223a28181E6948a71815
18907d1738E3659N1526b48578h0595B39938B5053R5757e382B02640I1377J50902
18896B42279m3623b3306j85529h967m1820j21236G9361a33078l9082M1273A03378
18884A75796K31561n176K52142j73150A01608N1775o9855b47452F1151c3576j60652
18873a94228e3747j21197r4433D01005j41691A00366K36039A55099l9614a08523
18862B39330d55251b03322R62A29184O3944b96569d7087q0934d7622l2551l6960
18851a17133J1568j92305j43409A03217g8835A61181a5946j87337j21474A42413
$$ plain form
18840 329971 -350636 -351238 -206448 -171377 -212794 -154021 -393627 -227047 -282114 -265530 -25819
18828 18890 60348 140654 -169304 -122445 -99796 -96675 -167726 -142529 -109905 -101741 50166 -213957
18815 -172936 33641 -192769 214883 -120985 -136611 229973 -75998 -50913 183682 -198405
18804 -180779 4007 44967 -77524 -12198 -98722 -236817 27381 -34726 -209534 -39443 204766
18792 -260105 123209 172224 -223598 -237221 -29366 -128054 483030 260345 -69242 58659 196116
18781 196116 144079 45426 176382 -110913 -376691 -158353 346780 -81391 -319139 43641
18770 69482 -99186 -66607 130277 -42142 -121647 97523 27324 -15034 -10762 -136672 78153
18758 90800 -30091 -66260 -198367 5380 46828 -149692 -145652 -8957 245332 17126 -52235 -66081
$$ packed form
18840C29971c50636o02J44790L5071m1417N8773k39606J66580n5067J6584b5819
18828A8890M1458Q0306a69304M6859K2649L121p1051K5197L2624Q164E0166b13957
18815a72936C3641a92769B14883a20985j5626B29973g5998K5085A83682a98405
18804a80779D007M0960g7524a2198q6524j38095B7381c4726j74808c9443B04766
18792b60105A23209M9015b23598j3623b9366r8688D83030k22685f9242E8659J37457
18781A96116n2037D5426J30956a10913k65778a58353C46780h1391k37748D3641
18770F9482i9186L2579A30277d2142p9505I7523B7324a5034M272j25910G8153
18758I0800c0091l6169j32107E380M1448a49692M040h957B45332A7126e2235j3846
$$ plain form
18746 -66081 207786 30077 -190603 359087 -406778 163967 123500 -165952 -246336 -118297
18735 134656 -119777 -56795 -159376 69303 170399 98069 46378 61626 -20810 -274068 -309143
18724 -309143 -427631 223712 -82155 57165 101737 -78762 120087 -101502 181232 -63667
18713 18906 -293677 -163813 -23124 73151 28858 172137 -271390 -75123 -59714 -591693 -15440
18701 -190445 -329356 -274437 -107003 166180 -5430 419506 -16890 89103 -175698 -162540 -47893
18689 -25332 151122 -284205 -70987 244088 177407 -98986 3179 -295013 -119869 70362 -31481
18677 -67184 -202338 -268595 101922 -55137 153715 20679 40513 159885 123275 209196 -15547
18665 -13948 156451 -149168 49582 -119939 157609 264930 -214188 103887 -176346 35280
$$ packed form
18746f6081B07786C0077a90603C59087d06778A63967m0467a65952q0384a18297
18735A34656a19777e6795j02581F9303J01096p2330D6378J5248b0810k53258l5075
18724c09143j18488B23712h2155E7165M4572g8762A20087a01502A81232f3667
18713A8906b93677J29864b3124G3151B8858J43279b71390g5123J5409n31979a5440
18701a90445j38911N4919a07003A66180e430D19506a6890H9103a75698J3158d7893
18689b5332A51122b84205g0987B44088o6681i8986C179b95013a19869G0362c1481
18677f7184j35154o6257A01922e5137A53715B0679J9834J19372l6610Q5921a5547
18665a3948A56451a49168D9582a19939A57609J07321b14188A03887a76346C5280
$$ plain form
18654 203810 12181 -44149 -216460 -215364 59893 150961 -144403 10181 -232581 -178707 103092
18642 -88462 -278888 11123 -353803 -85586 176039 -152096 -179363 -234731 -48540 -312914 -264498
18631 -264498 -112971 -108804 -70003 288606 -339698 -113357 14669 104919 -198892 -121322 -93117
18620 -93117 116876 -90792 114009 -115444 133102 -44949 -78897 -270996 7198 137554 -163855
18608 -66662 287697 -350646 254187 -75033 -27477 -104198 -68223 292291 -53514 -250642 91202
18596 112775 -36419 -275903 154168 -90339 -95884 -99687 -162953 -78301 251182 -211076 35246
18584 -189120 73749 -326608 160103 -31732 -254366 -120211 156373 112994 -302930 -443283
18574 -443283 408120 67588 -72636 -28676 -4495 -209130 -115125 9740 215140 -155794 -268165
$$ packed form
18654B03810A2181d4149j72311J096E9893R1068a44403A0181b32581N3874A03092
18642h8462j90426A1123c53803h5586A76039a52096k7267n5368d8540k64374M8416
18631b64498a12971M167L8801B88606c39698a13357A4669R0250a98892P7570K8205
18620i3117A16876i0792A14009a15444A33102d4949l3948j92099G198J30356a63855
18608f6662B87697c50646B54187g5033b7477p6721L5975B92291e3514j97128I1202
18596A12775c6419k39484A54168i0339n545l803o3266g8301B51182b11076C5246
18584a89120G3749c26608A60103c1732k22634a20211A56373m3379c02930j40353
18574d43283D08120F7588g2636b8676d495k04635R4005I740K05400a55794j12371
$$ plain form
18563 -268165 5611 -239281 72706 46644 8551 -298454 -109855 255519 -139709 232297 -79564
18551 -91701 -39814 77196 261201 82860 274552 -122636 -56825 20120 -224066 -106715 -449812
18540 -449812 -100714 -164905 -117218 -145304 -260673 -210715 -301331 5551 -17007 223325 40236
18528 -128049 241760 14148 -410507 2644 46245 -326685 -21250 -291176 -15345 -154298 -49562
18516 -54192 108281 141033 308979 -256626 -29190 -36914 -50459 -203604 -244301 -201297 -161121
18505 -161121 157344 -162731 -262202 208006 84729 102920 -54260 188346 169301 23253 68662
18494 68662 102124 154251 -134456 -94699 -279958 -183218 -51609 61833 -47022 86804 -33283
18482 -256776 -2138 -232113 292557 -55903 298266 -168737 246799 15695 -15170 -6465 -308549
$$ packed form
18563b68165E611b39281G2706k6062H551b98454a09855B55519a39709B32297g9564
18551i1701c9814G7196J84005H2860J91692a22636e6825B0120b24066a06715l43097
18540d49812a00714o4191M7687k8086j15369M9958r0616E551a7007B23325D0236
18528a28049B41760A4148d10507B644M3601c26685b1250k69926a5345j38953d9562
18516e4192A08281L2752J67946b56626b9190p724j3545j53145m0697M3004M0176
18505a61121A57344a62731r9471B08006H4729J8191e4260A88346j9045B3253M5409
18494F8662L3462N2127a34456L9757j85259R6740e1609F1833d7022H6804c3283
18482b56776b138k29975B92557e5903B98266a68737B46799A5695a5170f465l02084
$$ plain form
18471 -308549 -64802 -253341 -181515 -405271 -8502 138451 -94397 -98161 -49427 -113000 -180800
18460 -180800 -436414 -146302 -322174 76242 452842 -293834 -150323 182928 -40084 -146628
18450 -146628 -271036 150447 -14172 98453 -151597 35842 -525978 4606 318504 -86745 -67445
18439 -67445 -107476 -105095 -10432 168860 97023 -212221 70624 -154414 -410030 48680 -45607
18427 -282092 -243267 -164280 98061 -675 54432 -211555 124904 1659 -120976 -439326 -33908
18415 306323 -107329 -80689 -23587 -121677 120700 44213 -153100 53418 176091 -91441 -104056
18404 -104056 -245084 969 -351460 44681 -108779 -353695 -307893 -17537 134161 -225410 -160935
18393 -160935 -103337 -142361 -77215 -65470 -212659 -60865 -132164 34331 -228703 -243655 -5635
$$ packed form
18471c08549f4802j88539P1826k23756h502A38451i4397l764M8734o3573o7800
18460a80800k55614a46302j75872G6242L76600b93834J43511A82928d0084j06544
18450a46628j24408A50447a4172I8453a51597C5842e25978D606L13898h6745J9300
18439f7445m0031K381a0432A68860p1837b12221G0624a54414k55616D8680d5607
18427b82092L8825P8987I8061f75E4432b11555A24904A659a20976l18350c3908
18415C06323a07329K6640b3587r8090A20700D4213a53100E3418J22673i1441j2615
18404a04056j41028I69c51460D4681a08779k44916M5802a7537A34161b25410O4475
18393a60935N7598l9024O5146J1745j47189f0865p1299C4331b28703j4952e635
$$ plain form
18381 -114816 113123 99928 103327 25995 132814 32209 48193 -110302 -129817 62208 147929
18370 147929 469546 -88390 -410945 16337 -293677 22469 -110240 -258966 -109599 -157386
18360 -157386 -9166 112445 -281968 -126470 78645 -172833 -1075 -35068 -42904 -117072 165565
18348 86927 -77358 -8595 162812 -98318 -169817 44161 -124908 56119 -56900 -256600 -121540
18336 -28448 -165895 92010 -82866 247945 -222121 -163209 75275 125283 -104063 -154725 72031
18324 4236 76667 135476 -124504 65034 -213666 -150694 -10370 87629 358679 111720 -15516
18312 -291085 1551 -18273 270754 53332 -110240 24343 -280595 -175340 -80242 -338583 187734
18300 -154898 -486497 -227045 -244877 211907 37130 191022 192052 -216448 136024 306261
$$ packed form
18381a14816A13123j3195L399B5995J06819C2209J5984a10302j9515F2208Q5721
18370A47929L21617h8390l22555A6337b93677B2469a10240j48726a09599m7787
18360a57386i166A12445b81968a26470G8645a72833a075l3993p836p4168A65565
18348H6927g7358h595A62812i8318p1499D4161a24908E6119e6900j99700a21540
18336b8448j37447I2010h2866B47945b22121N8912G5275N0008a04063n0662G2031
18324D236P2431N8809a24504F5034b13666O2972a0370H7629K71050A11720a5516
18312b91085A551a8273B70754E3332a10240B4343b80595J05255h0242k58341A87734
18300a54898l31599b27045j7832B11907C7130J53892J030b16448A36024J70237
$$ plain form
18290 306261 -197410 132648 132453 14510 -85777 11061 104857 98004 -258771 87232 -56209
18278 27028 -205811 -150067 109918 49001 11235 -337 54968 6938 -101623 -71593 233360
18266 -120812 99477 -163470 -38133 -49115 -344529 -103513 -196175 40327 -36452 8028 -102469
18254 35742 -33104 153330 -107493 -204531 -71057 -89111 101754 -177865 -107057 129771 -96182
18242 -231686 -173718 182454 424512 71739 233705 -259002 -137100 -200047 -220382 155303
18231 -199418 -131753 -114911 100402 65159 122840 -158570 -134849 196144 244507 -134562 129329
18219 -286834 182489 -17752 88542 189071 15954 79599 19102 71049 -102942 85399 221718
18208 221718 -118371 -195095 116166 -262811 331339 -93406 -37888 -124866 -115299 24192 -3496
$$ packed form
18290C06261a97410A32648j95A4510h5777A1061R3796o853b58771H7232e6209
18278B7028b05811N5744A09918D9001A1235c37E4968F938a01623L0030B33360
18266a20812I9477a63470c8133j0982k95414a03513r2662D0327c6452H028a02469
18254C5742c3104A53330a07493r7038g1057j8054A01754a77865P0808A29771i6182
18242b31686N7968A82454K42058G1739J61966b59002J21902o2947k0335A55303
18231a99418O7665J6842A00402l5243N7681a58570K3721A96144M8363a34562A29329
18219b86834A82489a7752H8542J00529A5954O3645A9102N1947a02942H5399J36319
18208B21718a18371p6724A16166b62811C31339i3406c7888q6978R567B4192c496
$$ plain form
18196 113429 -245686 -186682 37020 -100068 -164474 -4738 -116444 -417815 -59001 12064 -97547
18184 -72926 -168610 -206953 103399 -83063 22167 -324645 -55983 197238 -124464 58830 -79382
18172 -100627 251123 -89847 62605 -6659 -111517 75209 -280052 -293863 -52890 -325192 -89771
18160 -55190 -96441 -197146 17169 240168 14748 42122 45940 -130706 -122595 -68596 145536
18148 282410 227232 -74276 -416332 -152869 -43960 -3412 30534 71442 -307760 -411783 -196615
18136 -182040 -129986 49446 -149481 21126 -305631 -47608 136238 -202952 155031 -163951
18125 -201608 55321 98082 -258828 -158286 -78263 204246 -304506 -248481 -175547 17049 60749
18114 60749 296973 -85166 132758 -69249 13828 -118347 28728 493628 -87452 348839 -221340
$$ packed form
18196A13429b45686N9004C7020a00068o4406d738j11706l01371e9001A2064i7547
18184g2926r5684l8343A03399h3063B2167c24645e5983A97238a24464E8830g9382
18172a00627B51123h9847F2605f659j04858G5209b80052j3811e2890k72302h9771
18160e5190m1251j00705A7169K22999A4748K7374L818a30706Q111N3999A45536
18148B82410n5178g4276l42056a52869d3960c412C0534M0908c07760j04023a96615
18136a82040N2054D9446a49481B1126c05631d7608A36238b02952A55031a63951
18125b01608E5321M2761b58828J00542g8263B04246c04506N6025P2934A7049M3700
18114F0749K36224h5166A32758f9249A3828a18347B8728M64900h7452C48839b21340
$$ plain form
18102 6912 -101976 205724 -68318 13989 126564 2526 17268 1755 -233735 257453 171758
18091 171758 -155389 200969 16309 -128192 -99389 79401 18391 -9855 222339 -164136 -182259
18080 -182259 165692 105302 -132481 159213 -185664 281153 -31618 -67242 -33457 -43813
18070 -43813 -243470 -252930 -278656 -343250 23248 205224 17791 222559 57926 99040 -56859
18058 -24210 -250240 -135871 111242 -277975 220808 -53949 -201646 -28754 -264463 -298754
18048 -298754 84519 -28524 153648 -133714 -216133 -53948 152153 -90832 -268717 -144435
18038 -144435 -278562 -100096 180290 74185 -233228 112957 -67395 -58447 -8035 348415 -127227
18026 -15307 -45206 138555 -162507 -126483 119385 -492164 -66142 -60900 4232 212442 90370
$$ packed form
18102F912a01976B05724f8318A3989J12575B526J4742A755b33735B57453q5695
18091A71758a55389B00969A6309a28192K8803G9401A8391i855B22339a64136j8123
18080a82259A65692o0390a32481A59213a85664B81153c1618l5624c3457j0356
18070d3813j99657r460k5726o4594B3248J81976A7791K04768E7926M1114e6859
18058b4210k26030J14369A11242b77975B20808e3949j47697b8754k35709l4291
18048b98754H4519b8524A53648a33714q2419e3948A52153i0832j77885J24282
18038a44435j34127a00096A80290G4185b33228A12957f7395Q948h035C48415a27227
18026a5307k9899A38555a62507L6024A19385d92164f6142N242D232K08210I0370
$$ plain form
18014 -410679 -143876 79363 26219 -56457 303442 162703 186426 230785 167124 -104442 -137173
18003 -137173 1323 6736 325389 -191744 46591 -177301 -56837 83527 85140 -85526 221763
17991 -91999 59892 -260761 21782 -145117 181465 -88965 -48903 -278805 -338695 119849 117778
17980 117778 139707 -187689 -35474 356506 -118280 -177230 187116 -112545 109120 -217781
17969 150353 305125 -224266 -47195 -395655 -105796 -219613 -200592 -124488 396198 120579
17958 272877 -74285 60527 -324250 -369697 17279 -60388 192335 -280303 -135550 -168133 270892
17946 -34043 82798 15033 -76084 15588 -19603 261158 -29047 -129144 16044 -100555 120214
17934 257731 130451 -108783 87836 -134584 -486200 116249 -408240 -203155 371129 220937
$$ packed form
18014d10679a43876G9363B6219e6457C03442j40739K3723M4359o3661a04442l2731
18003a37173A323N413L18653a91744D6591a77301e6837H3527J613h5526B21763
17991i1999E9892b60761B1782a45117A81465h8965M0062k29902n9890A19849k071
17980A17778K1929a87689c5474C56506a18280n8950A87116a12545A09120b17781
17969A50353J54772b24266d7195l48460a05796j13817J9021P6104C96198A20579
17958B72877g4285F0527c24250m5447A7279f0388A92335b80303a35550l2583B70892
17946c4043H2798A5033g6084A5588a9603B61158b9047j00097A6044a00555A20214
17934B57731j27280a08783H7836a34584l51616A16249d08240b03155C71129j50192
$$ plain form
17924 220937 -210746 73256 163871 -96675 206533 204162 226943 7816 71120 -85093 28714
17912 259973 280380 23373 -2761 -127904 -159969 -56874 -334249 245601 -30375 -12767 -141824
17901 -141824 -70566 4114 84678 303294 -188587 -45252 9474 56554 11934 300198 -40478
17889 179313 63849 51606 -152991 -237518 60974 -244872 192786 -23172 67339 243988 -8266
17877 -120592 488296 9607 15007 -117177 132031 -36544 134498 225155 111266 -107068 87074
17865 187622 121468 52347 -143161 109321 -269354 -208548 -79711 199601 -108920 -144118
17855 -144118 245155 -290948 481632 -82692 -21275 -47867 21064 375414 24930 12562 -85474
17843 68479 31771 197422 -47448 134317 277384 -84869 134414 315339 -182630 38535
$$ packed form
17924B20937b10746G3256R0615i6675B06533k371K2781G816O3304h5093B8714
17912B59973K0407B3373b761j25143l2065e6874k77375B45601c0375a2767j29057
17901a41824g0566D114Q0564K18616a88587d5252I474M7080A1934K88264d0478
17889A79313F3849j2243a52991q4527F0974b44872A92786b3172F7339J76649h266
17877a20592D88296I607N400a17177A32031c6544A34498R0657A11266a07068H7074
17865A87622o6154E2347a43161A09321b69354O0806g9711A99601a08920l5198
17855a44118B45155b90948D81632h2692b1275k6592B1064L54350B4930j2368h5474
17843F8479C1771J65651d7448A34317J43067h4869A34414J80925a82630C8535
$$ plain form
17832 114181 -166441 10738 -106233 -62863 -99950 -6205 -347768 -127122 -263282 118791
17821 -163779 -80005 93095 -133757 11807 378375 126732 22304 -67108 327227 -72134 -77746
17810 -77746 -11757 376947 56629 -34138 206008 -37228 -53149 4623 225710 209859 -235967
17798 -41926 127894 125607 99809 -240605 305210 19053 -290584 250088 201198 203855 213377
17787 213377 -11587 121800 43088 193507 149527 -70428 209740 -92848 140533 -152583
17776 110840 41056 144326 -224268 123074 -98730 -149581 -45196 -3680 264990 36323 443960
17765 443960 -136817 -32346 474074 -77382 -78334 48360 -225099 -53892 381881 33755 -112466
17753 -100318 -195479 -62771 33039 271374 254978 -35983 -99913 70878 34055 129390 -11457
$$ packed form
17832A14181a66441A0738a06233M3370l7087f205l41563a27122j36160A18791
17821a63779h0005I3095a33757A1807L66568A26732B2304f7108C27227g2134n612
17810g7746a1757C76947E6629c4138B06008c7228j5921D623K21087j5851b35967
17798d1926A27894k287k5798b40605C05210A9053b90584B50088m8890K657R522
17787B13377a1587A21800D3088J50419m3980g0428B09740i2848A40533a52583
17776A10840D1056J03270b24268A23074i8730n0851d5196c680B64990C6323M07637
17765D43960a36817c2346D74074g7382r52D8360b25099e3892C81881C3755a12466
17753a00318r5161f2771C3039K38335j6396c5983o3930G0878C4055R5335a1457
$$ plain form
17741 78687 221177 -52810 221983 -67757 -89746 37222 -44067 -7142 -306943 -143435 85432
17729 201990 160928 -211740 -21038 5013 -127982 215789 95386 70871 302971 127673 -26250
17717 -166262 -5398 -160541 -276001 -108789 -35372 190324 85134 -267143 -368948 -39513
17706 -72236 -173766 -209737 59979 80765 358485 211826 -268263 335547 -337077 -130927
17695 178866 -155681 -108865 -119901 269578 89790 105150 498462 327841 64444 101022 227319
17684 227319 -10308 147077 31441 -43829 -35737 -140356 297357 186699 140369 106292 -112557
17672 -116314 190706 102999 -150457 267578 170047 73560 -28868 122814 -163215 14395
17661 24128 -39279 293780 -5916 -87383 184931 -78563 -84588 57963 -195669 50744 221666
$$ packed form
17741G8687J42490e2810B21983f7757k1989C7222d4067g142k99801a43435H5432
17729B01990m1062b11740b1038E013a27982B15789I5386k4515K32100A27673b6250
17717a66262e398j55143j15460a08789c5372A90324H5134b67143j01805c9513
17706g2236j01530l5971E9979K0786K77720j46659b68263C35547c37077a30927
17695A78866a55681M6816j1036B69578H9790J5360L93312j70621F4444L6578J26297
17684B27319a0308A47077C1441d3829Q092j04619B97357j10658m6330l4077a12557
17672a16314A90706q7707a50457B67578r7531G3560b8868A22814a63215A4395
17661B4128c9279B93780e916q1467A84931g8563o025E7963a95669E0744J70922
$$ plain form
17650 221666 456320 217441 9872 -287791 -175173 -77434 -190848 91926 102313 -151852
17639 -143334 -37460 55698 -287798 59522 67286 -79029 -228027 330269 374271 236286 -162383
17627 270666 -1218 342664 30693 -194350 251337 117584 8219 -200883 294198 194840 -116613
17615 329763 -47663 -131798 -110701 -99843 54143 154589 149321 -187002 165521 199984 217102
17604 217102 32151 81117 25997 100470 -333621 18849 -345072 1607 158961 82333 90647
17593 90647 50687 119615 -220053 190218 43132 248194 60403 106943 104885 -17311 -15504
17582 -15504 -12516 276019 90215 229384 -129867 51755 -96078 138387 -145700 37758 -330059
17570 -30173 -32320 115934 99758 -154155 276041 25937 -32039 -34285 293001 9223 32656
$$ packed form
17650B21666K34654B17441I872b87791J12618g7434j13414I1926J0387a51852
17639a43334c7460E5698b87798E9522P764g9029j48998C30269M4002j37985a62383
17627B70666a218C42664C0693a94350B51337A17584H219b00883B94198r9358a16613
17615C29763d7663q4135K1097J0858E4143J00446n268a87002A65521L4463J7118
17604B17102C2151M8966B5997P4473c33621A8849c45072A607J57354p6628Q314
17593I0647l9960O8928b20053A90218D3132K05062F0403M6540k058a7311J807
17582a5504K988B76019I0215J39169a29867E1755i6078A38387a45700C7758c30059
17570c0173k147A15934j6176a54155B76041B5937c2039k246B93001I223K3433
$$ plain form
17559 32656 -199283 7420 1116 336536 163896 718 -68091 237187 199653 115589 71480 12763
17546 18906 68685 431772 289327 -49773 243858 324707 226721 76586 94816 131972 204259
17535 204259 -35087 363268 -91728 120960 214115 214377 -3320 168136 113643 143761 289177
17524 289177 624334 367631 119689 388286 124439 261678 11370 212649 -37235 306642
17513 95561 320219 139265 330929 585091 556896 417586 519566 664601 172086 267026
17503 267026 -6939 402580 210112 278799 366378 337294 344598 462071 64642 61496 453587
17492 453587 648192 370198 353902 30978 380323 523993 206635 359766 119109 -10710
17481 181836 76007 138162 428512 420260 26676 527536 485373 359109 96470 382064 351301
$$ packed form
17559C2656a99283G420A116L35420A63896G18f8091B37187l7534q4064m4109A2763
17546A8906M9779L63087j42445d9773B43858Q0849r7986G6586J8230L7156P2287
17535B04259c5087C63268i1728A20960R3155K62c320A68136n4493L0118J45416
17524B89177L35157k56703A19689K68597A24439J37239A1370K01279c7235C06642
17513I5561K24658A39265J91664K54162k8195j39310J01980J45035A72086R4940
17503B67026f939D02580j92468O8687Q7579k9084P304J17473F4642l146L92091
17492D53587J94605k77994j6296C0978L49345J43670B06635J53131A19109a0710
17481A81836G6007O2155K90350q252B6676N00860m2163j26264I6470K85594l0763
$$ plain form
17470 351301 420807 312799 263160 392140 197697 339794 270989 246686 551222 269263
17459 326192 153909 284678 13495 282547 125858 169166 187377 222589 68886 347032
17449 347032 142107 395954 27155 -5593 504139 30648 -25861 195317 352531 358747 290319
17438 290319 253030 256205 464827 516931 157026 691828 257896 553612 326242 170498
17428 170498 288538 327568 188407 370014 183375 263021 260000 489266 499122 -39635 -24511
17417 -24511 393788 572379 35330 -47447 280400 307240 447732 331750 482285 285436
17407 285436 485524 433016 332792 462201 429953 591256 125582 139859 503518 159475
17396 313247 420798 642594 158444 39512 239719 348753 406905 -2724 261884 71211
$$ packed form
17470C51301O9506j08008m9639J28980j94443J42097o8805k4303L04536B69263
17459C26192A53909J30769A3495K69052A25858M3308J8211L5212F8886K78146
17449C47032A42107K53847B7155e593E04139C0648b5861A95317J57214O216o8428
17438B90319l7289L175K08622N2104A57026N34802B57896K95716k27370j55744
17428A70498J18040L9030j39161J81607A83375P9646l021K29266R856c9635J5124
17417b4511C93788J78591C5330d7447B80400K6840J40492j15982J50535j96849
17407B85436K00088n2508j00224J29409l2248J61303A25582J4277L63659A59475
17396C13247J07551K21796A58444C9512K00207J09034N8152b724B61884G1211
$$ plain form
17385 -120210 77560 257937 309611 -132017 139084 228762 -9840 273847 74927 316846 426933
17374 426933 -59227 247110 -20074 228491 58403 -101744 183748 132349 351237 361806
17364 361806 355652 185246 395953 373072 426251 252936 21753 269393 235133 326943 143199
17352 197844 110196 87179 244151 4438 325744 305801 127855 327704 208036 22436 171566
17341 171566 -3127 77170 254766 74521 153062 -44800 111212 52359 280659 117800 100144
17330 100144 154526 114250 173258 31801 -37209 126262 69254 -21370 456315 214193 548397
17319 548397 184044 143851 293470 137919 381750 -3140 316900 -111739 574364 280238
17308 157624 389969 133129 77393 103417 423268 595061 562153 405471 506495 95224
$$ packed form
17385a20210G7560J80377N1674a32017A39084Q9678i840B73847G4927K41919J10087
17374D26933e9227B47110b0074B28491E8403a01744A83748n1399K18888J0569
17364C61806o154j70406K10707k2881N3179j73315B1753K47640l4260R1810A43199
17352A97844q7648k3017J56972D438L21306j9943A27855J99849j19668B2436J49130
17341A71566c127G7170J77596G4521P8541d4800A11212E2359K28300A17800j7656
17330A00144N4382m0276N9008C1801c7209A26262n7008b1370D56315B14193L34204
17319E48397A84044m0193J49619A37919K43831c140C16900a11739E74364B80238
17308A57624K32345A33129n5736K6024L19851J71793l2908j56682J01024I5224
$$ plain form
17297 302961 -38395 -129035 575160 366258 205162 242941 197788 296608 469663 137198
17286 209211 -104585 74568 221294 82734 402281 257513 69104 477038 -184484 411613
17275 -137586 123766 561125 485787 348717 358107 204953 410432 -247906 158671 424260
17265 424260 121332 388664 248722 356418 488092 495571 493993 340978 257603 476451
17255 476451 211684 263506 198443 287167 411086 39934 -197398 740708 -6715 124273 431124
17244 431124 545956 192037 262760 330348 335588 139737 -8952 552483 -49587 193193 276214
17233 276214 -123000 409773 55055 520129 263219 -58809 266741 437724 299946 466406
17223 466406 152050 -6468 182514 90294 593814 285286 33725 21495 486418 373352
$$ packed form
17297C02961c8395r0640E75160k08902j61096L7779m5153R8820J73055A37198
17286B09211a04585G4568J46726H2734L19547j44768F9104M07934a84484D11613
17275a37586A23766M37359p5338j37070R390j53154K05479b47906A58671K65589
17265D24260A21332K67332j39942J07696J31674P479j578j53015q3375K18848
17255D76451B11684N1822o5063Q8724J23919C9934a97398G40708f715A24273L06851
17244D31124J14832A92037P0723O7588N240A39737h952E52483d9587A93193Q3021
17233B76214a23000D09773E5055M65074k56910e8809B66741J70983j37778J66460
17223D66406A52050f468A82514I0294N03520B85286C3725j2230M64923j13066
$$ plain form
17213 373352 567825 112901 276282 479500 303130 171191 217768 254955 262704 522550
17203 522550 418801 -42598 513126 221738 592362 307830 314158 317720 307131 245393 483349
17192 483349 473455 17182 173484 477021 624383 370454 89951 196410 389603 556328
17182 556328 213669 248958 425603 88376 35765 274706 349293 472806 98469 341102
17172 341102 360252 104407 195720 288642 154374 539551 479941 314228 437352 94054
17161 478205 164152 665639 692238 280924 298900 488269 522231 506137 509249 323556 691322
17150 691322 716255 75982 535323 609256 506419 464245 196069 287159 271128 356069 554875
17139 554875 261578 256808 246290 581504 591798 334333 542022 290860 383352 402986 358887
$$ packed form
17213C73352J94473A12901J63381K03218j76370j31939M6577L7187P749K59846
17203E22550j03749d2598E13126B21738L70624k84532O328L562j0589o1738K37956
17192D83349r894A7182J56302L03537J47362k53929H9951J06459J93193J66725
17182E56328B13669L5289J76645H8376C5765K38941P4587J23513I8469K42633
17172C41102J9150A04407R1313R2922j34268L85177n9610j65713J23124I4054
17161D78205A64152N01487K6599B80924J7976J89369L3962j6094L112j85693L67766
17150F91322K4933G5982M59341P3933j02837m2174A96069R1090j6031Q4941J98806
17139E54875B61578m770j0518L35214J0294k57465K07689k51162R2492J9634m4099
$$ plain form
17128 358887 792733 609574 381549 577551 432634 669604 425511 780260 541296 625149
17118 625149 920425 495150 296218 425507 492376 430651 545380 293892 589027 401219
17108 401219 384052 423612 559014 755475 539851 486843 583546 264337 379016 293635
17098 293635 387913 375870 363796 919673 477640 202774 571025 262138 698894 314013
17087 647447 378497 384881 632468 655568 335105 619453 752933 679450 581204 756720
17077 756720 664781 387679 739230 479142 267007 429885 926585 532003 323553 740032
17067 740032 546406 686190 757147 733079 698429 732801 514624 486484 1173115 1074248 768853
17056 768853 790657 666779 634551 650245 1113316 746382 839312 904238 671180 715507 465076
$$ packed form
17128C58887M33846j83159k28025J96002j44917K36970k44093L54749k38964Q3853
17118F25149K95276m25275j98932J29289O6869o1725J14729k51488K95135j87808
17108D01219j7167L9560J35402J96461k15624n3008R6703B64337J14679q5381
17098B93635R4278j2043j2074N55877m42033B02774L68251B62138M36756C14013
17087F47447k68950O384K47587K3100l20463K84348J33480p3483r8246J75516
17077G56720r1939k77102L51551k60088k12135J62878M96700l94582k08450M16479
17067G40032j93626J39784P0957k4068l4650L4372k18177k8140O86631r8867l05395
17056G68853K1804j23878l2228J5694M63071l66934R2930O4926k33058M4327k50431
$$ plain form
17045 465076 887538 890470 791945 839269 712947 656375 1010089 749869 578048 691660
17035 691660 598752 538080 645330 631048 960440 690110 951474 752216 818042 627031
17025 627031 793083 768483 787272 729567 972497 925799 562027 684151 1209659 789982
17015 789982 855317 713524 1056448 868387 832904 818238 979201 882752 1364185 655050
17004 889878 1099680 1123345 836771 1039975 890949 939250 776433 790341 1064464 870449
16994 870449 1128932 870481 1039957 1027292 1092910 938324 1230792 1328432 920658 1287493
16984 1287493 1134543 1226631 1041615 1157007 1085580 1210207 1242532 1263982 1005379 1264033
16974 1264033 879288 1240479 1199743 1295525 1080798 1196863 1453485 1121398 1027840 1306403
$$ packed form
17045D65076M22462K932r8525M7324j26322n6572L53714k60220j71821J13612
17035F91660r2908o0672J07250j4282L29392k70330K61364j99258O5826j91011
17025F27031J66052k4600J8789n7705K42930m6698l63772J22124N25508m19677
17015G89982O5335j41793L42924j88061l5483j4666J60963r6449M81433F55050
17004H89878K09802K3665k86574K03204j49026M8301j62817J3908K74123j94015
16994H70449K58483k58451J69476j2665O5618j54586K92468R7640m07774L66835
16984A287493j52950R2088j85016J15392p1427J24627L2325K1450k58603K58654
16974A264033l84745L61191m0736R5782k14727J16065K56622l32087r3558K78563
$$ plain form
16964 1306403 1222438 1594408 1047414 1283194 1409639 1364932 1388015 1206541 1297171 1452273
16954 1452273 1366436 1421603 1228870 1572537 1175513 1284682 1378389 1449153 1675836 1225024
16944 1225024 1205857 1520767 1423012 1531944 1659829 2026773 1526885 1644262 1328683 1731009
16934 1731009 1762537 1743231 1564329 1744688 1847426 1713663 1676268 1830348 1521911 1379759
16924 1379759 1901197 1919695 1746073 1768609 1641766 1972315 1746511 1658440 2078458 1695107
16914 1695107 1685989 2242839 1860944 2164249 1710935 1934366 1928535 1921418 2076088 1898872
16904 1898872 2522931 1977813 1927925 2052161 2365820 2139445 2359581 2555765 2573080 2423415
16894 2423415 2708807 2361180 2529068 2383302 2197616 2402252 2391977 2607247 2755282 2202399
$$ packed form
16964A306403q3965L71970n46994K35780J26445m4707K3083j81474R0630J55102
16954A452273q5837N5167j92733L43667l97024J09169R3707P0764K26683m50812
16944A225024j9167L14910r7755J08932J27885L66944m99888J17377l15579M02326
16934A731009L1528j9306j78902J80359J02738j33763l7395J54080l08437j42152
16924A379759N21438J8498j73622K2536j26843L30549k25804q8071M20018l83351
16914A695107r118N56850l81895L03305m53314K23431n831p117J54670j77216
16904A898872O24059n45118m9888J24236L13659k26375K20136J96184J7315j49665
16894B423415K85392l47627J67888j45766j85686K04636j0275K15270J48035n52883
$$ plain form
16884 2202399 2437351 2722782 2283913 2535126 3060285 2728673 2626464 2719158 2862957 2634869
16874 2634869 2798797 3155979 3057427 2892123 3009901 2988755 2881152 3410467 3316854 3238110
16864 3238110 3502227 3204684 3261030 3330059 3377645 3830161 3706327 3739273 3778033 3618058
16854 3618058 3435812 3963430 3795743 3733606 3852011 4217837 4007142 4511645 4299547 4353107
16844 4353107 4108665 4267596 4505126 4395931 4253452 4717711 4536144 4758838 4837773 5202055
16834 5202055 5249897 5139365 5311215 5473202 5379646 5544591 5720199 5210295 6046095 6108523
16824 6108523 6096565 6228321 6326858 6458443 6463574 6757070 6638488 7060444 6869072 6846747
16814 6846747 6927583 7372159 7286725 7608212 7615050 7994328 8002084 8217745 8096818 8485577
$$ packed form
16884B202399K34952K85431m38869K51213N25159l31612j02209R2694J43799k28088
16874B634869J63928L57182r8552j65304J17778k1146j07603N29315r3613p8744
16864C238110K64117k97543N6346O9029M7586M52516j23834L2946L8760j59975
16854C618058j82246N27618j67687o2137J18405L65826k10695N04503k12098N3560
16844D353107k44442J58931K37530j09195j42479M64259j81567K22694P8935L64282
16834E202055M7842j10532J71850J61987r3556J64945J75608n09904Q35800O2428
16824F108523j1958J31756R8537J31585N131K93496j18582M21956j91372k2325
16814F846747Q0836M44576q5434L21487O838L79278P756K15661j20927L88759
$$ plain form
16804 8485577 8593678 8957252 8815431 9203141 9171475 9420643 9568284 10132495 10204590 10442229
16794 10442229 10615319 11107884 11129688 11115134 11210065 11700331 12295696 12281011 12547710 13121446
16784 13121446 13268396 13301415 14078387 14078508 14686660 15045871 15251787 15699039 16576802 16365291
16774 16365291 16911698 17453646 17863623 18258714 18859362 19340430 19997310 20622881 21086650
16765 21086650 22014598 22868313 23601856 23633667 24466832 25192453 26052753 26777311 27610331
16756 27610331 28640646 29994046 30614071 31985497 32995458 34239522 35302708 36520452
16748 36520452 37633004 39345180 40422126 42179066 43972892 45425942 47196102 48904013
16740 48904013 50926174 52802541 54822609 57002277 59172685 61842006 64163986 67208717
$$ packed form
16804H485577J08101L63574j41821L87710l1666K49168J47641N64211P2095K37639
16794A0442229J73090M92565K1804j4554R4931M90266N95365j4685K66699N73736
16784A3121446J46950L3019P76972J21O08152L59211K05916M47252Q77763k11511
16774A6365291N46407N41948M09977L95091O00648M81068O56880O25571M63769
16765B1086650R27948Q53715P33543L1811Q33165P25621Q60300P24558Q33020
16756B7610331J030315J353400O20025J371426J009961J244064J063186J217744
16748C6520452J112552J712176J076946J756940J793826J453050J770160J707911
16740D8904013K022161J876367K020068K179668K170408K669321K321980L044731
$$ plain form
16732 67208717 69840154 72400793 74857325 77853938 80865929 84121926 87232962 90511698
16724 90511698 93513526 96494351 100595336 103666059 106740840 109665356 112959287 115783837
16716 115783837 118701917 120995890 123336740 125611943 127055175 128533948 129604016 130546518
16708 130546518 130993135 130991487 130472497 129897513 129068571 127372819 125641521 123596096 121185165
16699 121185165 118752929 116022351 113230799 110090673 107128922 103809226 100502345 96968192
16691 96968192 94022146 90575517 87631893 84115647 80946118 78101143 75238901 72421553
16683 72421553 69381279 66815874 64601663 62202767 59494993 57432533 54854232 53031592
16675 53031592 51117791 48817958 47357450 45556475 43749614 42179731 40718706 39397918
$$ packed form
16732F7208717K631437K560639K456532K996613L011991L255997L111036L278736
16724I0511698L001828K980825M100985L070723L074781K924516L293931K824550
16716A15783837K918080K293973K340850K275203J443232J478773J070068R42502
16708A30546518M46617j648n18990n74984q28942j695752j731298k045425k410931
16699A21185165k432236k730578k791552l140126k961751l319696l306881l534153
16691I6968192k946046l446629k943624l516246l169529k844975k862242k817348
16683G2421553l040274k565405k214211k398896k707774k062460k578301j822640
16675E3031592j913801k299833j460508j800975j806861j569883j461025j320788
$$ plain form
16667 39397918 37900576 36521305 35393986 33896468 33191385 31869872 30920282 29984773
16659 29984773 28633988 27655213 26948831 26448852 25468704 24426024 23628769 23203780 22855357
16650 22855357 21600759 20782630 20545362 20007964 19321431 18350698 18322812 18072764 17275991
16641 17275991 17060513 16150093 16084893 15625951 15095941 15002891 14541705 14007841 13714602 13294036
16631 13294036 12951394 13202102 12431892 12052056 12100399 11700912 11655272 11086946 10808069 10623810
16621 10623810 10293729 10232513 10212653 9605140 9749607 9310198 9080000 8865476 8834692 8382894
16611 8382894 8694670 8528986 7934195 8362906 8040581 7594546 7782990 7300399 7399934 7203712
16601 7203712 7293613 7099747 6901592 6672941 6667175 6712730 6210874 6197376 6236987 6079742
$$ packed form
16667C9397918j497342j379271j127319j497518p05083j321513r49590r35509
16659B9984773j350785r78775p06382m99979r80148j042680p97255m24989l48423
16650B2855357j254598q18129k37268n37398o86533r70733k7886k50048p96773
16641A7275991k15478r10420o5200m58942n30010r3050m61186n33864k93239m20566
16631A3294036l42642K50708p70210l79836M8343l99487m5640n68326k78877j84259
16621A0623810l30081o1216j9860o07513J44467m39409k30198k14524l0784m51798
16611H382894L11776j65684n94791M28711l22325m46035J88444m82591R9535j96222
16601G203712Q9901j93866j98155k28651n766M5555n01856j3498L9611j57245
$$ plain form
16591 6079742 5778938 6138239 5772653 5741849 5727081 5638040 5525390 5336824 5522552 5049334
16581 5049334 5364134 5308887 5094880 4882582 4869324 4527196 4345175 4669377 4591680 4845768
16571 4845768 4560741 4359405 4090885 4346002 4236367 4028574 4053080 3837667 4071487 3867845
16561 3867845 3903243 3749136 3882583 3468334 3715125 3484296 3647984 3586965 3595792 3319520
16551 3319520 3158534 3313705 3405840 3236020 3347436 2887444 3163347 3357974 2964253 2855706
16541 2855706 2577278 2917432 2811642 3046528 2884634 2666713 2574342 2620075 2940335 2833144
16531 2833144 2570320 2455365 2596811 2692801 2544126 2828920 2203350 2385696 2579572 2610172
16521 2610172 2303546 2829353 2456509 2441077 2144379 2398049 2191700 2465324 2187539 2136642
$$ packed form
16591F079742l00804L59301l65586l0804j4768q9041j12650j88566J85728m73218
16581E049334L14800n5247k14007k12298j3258l42128j82021L24202p7697K54088
16571D845768k85027k01336k68520K55117j09635k07793K4506k15413K33820k03642
16561C867845L5398j54107J33447m14249K46791k30829J63688o1019Q827k76272
16551C319520j60986J55171R2135j69820J11416m59992K75903J94627l93721j08547
16541B855706k78428L40154j05790K34886j61894k17921r2371M5733L20260j07191
16531B833144k62824j14955J41446R5990j48675K84794o25570J82346J93876L0600
16521B610172l06626N25807l72844j5432k96698K53670k06349K73624k77785n0897
$$ plain form
16511 2136642 2190058 2377632 1949855 1997819 2051105 1812710 2145307 2243250 1907162 2016206
16501 2016206 2039913 2028584 1853866 2113177 1807052 1689788 1790182 1779848 1943935 1906499
16491 1906499 1848531 1696906 1961944 1744154 1758243 1731306 1894362 1577228 1723946 2117505
16481 2117505 1432347 1619782 1680348 1495192 1827053 1243503 1343587 1534790 1501674 1740437
16471 1740437 1661155 1577658 1645429 1343305 1531053 1494312 1623588 1644951 1310006 1555597
16461 1555597 1494571 1700959 1289565 1399820 1206373 1394701 1577006 1537094 1229835 1371634
16451 1371634 1328848 1364053 1513924 1330155 1187394 1076204 1198856 1360054 988618 1126191
16441 1126191 1102598 1155498 1365021 1333997 988789 913600 1023539 1027794 1093208 1266487 1209836
$$ packed form
16511B136642N3416J87574m27777M7964N3286k38395L32597R7943l36088J09044
16501B016206K3707j1329j74718K59311l06125j17264J00394j0334J64087l7436
16491A906499n7968j51625K65038k17790J4089k6937J63056l17134J46718L93559
16481B117505o85158J87435O0566j85156L31861n83550J00084J91203l3116K38763
16471A740437p9282q3497O7771l02124J87748l6741J29276K1363l34945K45591
16461A555597o1026K06388m11394J10255j93447J88328J82305l9912l07259J41799
16451A371634m2786L5205J49871j83769j42761j11190J22652J61198l71436J37573
16441A126191k3593N2900K09523l1024l45208p5189J09939M255O5414J73279n6651
$$ plain form
16430 1209836 1173730 1188887 1365907 1055337 1265659 1285878 1065711 1222848 1349518 1025114
16420 1025114 1129568 1147400 916349 1125205 623577 1267475 1061066 631826 1010493 1146192
16410 1146192 981465 847776 942911 1124052 1177102 737022 947821 1027957 1049714 897687
16400 897687 946464 1108509 795213 985168 904681 817463 895110 872341 803566 953926 735616
16389 735616 661030 849728 1051314 957804 977075 1078596 957775 1027922 1184210 771437
16379 771437 612213 954938 908126 905601 500037 786930 1108650 1006179 742470 684012
16369 684012 786885 965610 915786 471134 544425 744186 721735 756514 604178 830230
16359 830230 458479 447171 753775 696927 820189 903578 639307 925739 667478 677990
$$ packed form
16430A209836l6106J5157J77020l10570K10322K0219k20167J57137J26670l24404
16420A025114J04454J7832k31051K08856n01628O43898k06409m29240L78667J35699
16410A146192j64727j33689R5135J81141N3050m40080K10799Q0136K1757j52027
16400H97687M8777J62045l13296J89955q0487q7218P7647k2769o8775J50360k18310
16389G35616p4586J88698K01586r3510J9271J01521j20821P0147J56288m12773
16379G71437j59224L42725m6812k525m05564K86893L21720j02471k63709n8458
16369F84012J02873J78725m9824m44652P3291J99761k2451L4779j52336K26052
16359H30230l71751j1308L06604n6848J23262Q3389k64271K86432k58261J0512
$$ plain form
16349 677990 675573 555612 807408 816965 693634 689995 767246 414282 684021 876645 620704
16338 620704 640772 736159 409287 142031 844210 1056735 608579 653790 393336 769822
16328 769822 589035 667525 291494 396935 685114 460994 418280 645052 613989 508192
16318 508192 435334 521319 767306 742113 541627 323812 654677 742511 717299 653090 670244
16307 670244 798998 313829 563148 815713 313432 526589 773666 533978 532607 317848
16297 317848 138020 459124 654477 292729 309478 551236 330201 622305 714908 317271
16286 470715 270631 539993 678749 573697 340261 547994 368613 594803 731223 696245
16276 696245 59633 411039 300526 799590 622125 581713 412183 463177 595474 583457
$$ packed form
16349F77990k417j19961K51796R557j23331l639P7251l52964K69739J92624k55941
16338F20704K0068R5387l26872A42031P02179K12525m48156M5211k60454L76486
16328G69822j80787P8490B91494J05441K88179k24120m2714K26772l1063j05797
16318E08192p2858Q5985K45987k5193k00486k17815L30865Q7834k5212o4209J7154
16307F70244J28754C13829K49319K52565C13432K13157K47077k39688j371k14759
16297C17848A38020L21104J95353B92729J6749K41758k21035K92104R2603C17271
16286D70715k00084K69362J38756j05052k33436K07733j79381K26190J36420l4978
16276F96245E9633L51406j10513M99064j77465m0412j69530N0994J32297j2017
$$ plain form
16266 583457 572813 237480 504923 215420 186891 229611 599410 664215 200471 546334
16256 546334 505502 141554 457140 284595 15584 371875 244611 286243 325749 340888
16246 340888 114133 391400 464670 484835 436722 469869 196362 690930 133845 422084
16236 422084 697850 188079 610924 572765 321623 270693 378001 451968 506893 652989
16226 652989 409627 241363 132430 347038 338933 118417 308372 622445 750118 135558
16215 295449 516011 175471 351536 335424 418813 276333 501084 441770 374584 147190
16204 200562 349006 350573 394135 281862 718426 85128 406201 277291 507141 271117
16194 271117 330650 243870 362458 503785 51046 355419 345801 253327 240908 90570 176236
$$ packed form
16266E83457j0644B37480K67443B15420k8529M2720L69799O4805B00471L45863
16256E46334m0832A41554L15586j72545A5584L56291j27264M1632L9506J5139
16246C40888A14133K77267P3270K0165m8113L3147A96362M94568A33845K88239
16236D22084K75766A88079M22845l8159k51142n0930J07308P3967N4925J46096
16226F52989k43362j68264j08933K14608q105A18417J89955L14073J27673A35558
16215B95449K20562A75471J76065j6112Q3389j42480K24751n9314o7186A47190
16204B00562J48444J567M3562j12273M36564H5128L21073j28910K29850k36024
16194B71117N9533q6780J18588J41327E1046L04373r618r2474j2419I0570Q5666
$$ plain form
16183 176236 356712 272398 398710 396553 155030 247433 202488 57831 -19880 455551 436202
16172 436202 309038 -40325 278788 207259 363307 430975 696808 412738 432116 220950
16162 220950 344327 22827 314512 52096 280026 415516 180988 404215 145860 131797
16152 131797 111054 133023 308748 666328 113903 452904 148376 102209 449932 333856
16142 333856 117244 -52816 373086 248479 243909 522436 34091 199143 167770 187717 -17046
16130 140384 233897 -8530 275176 -36532 239398 -89387 640612 367365 332876 471393 241473
16119 241473 262389 75849 300403 -182434 143467 -106691 447607 -128611 176273 89675
16109 89675 170724 -2988 52524 151237 81576 40979 -35712 -143148 526776 108613 132878
$$ packed form
16183A76236J80476q4314J26312k157A55030R2403m4945E7831a9880D55551j9349
16172D36202j27164d0325B78788p1529J56048O7668K65833k84070J9378k11166
16162B20950J23377B2827K91685E2096K27930J35490A80988K23227A45860j4063
16152A31797k0743K1969J75725L57580A13903L39001A48376m6167L47723j16076
16142C33856A17244e2816C73086j24607m570K78527C4091J65052l1373J9947a7046
16130A40384R3513h530B75176c6532B39398h9387F40612k73247l4489J38517k29920
16119B41473K0916G5849K24554a82434A43467a06691D47607a28611A76273q6598
16109H9675Q1049b988E2524R8713o9661m0597c5712j07436E26776A08613K4265
$$ plain form
16098 132878 -96600 462803 -197082 92822 131618 186975 184681 306357 240158 225208 397577
16087 397577 6451 43497 198892 174960 308263 233620 59283 203617 132 125938 217839
16076 217839 137743 53508 240460 58119 319534 292605 58116 173214 -36728 89307 56336
16065 56336 -246608 -159707 -255498 -129584 -23728 65662 90323 185521 -248987 178906 -151891
16053 24074 164414 108701 362081 57596 262430 -198824 -45071 124084 508677 -18911
16042 472206 201670 124096 198377 110915 -53937 17053 209045 -13158 425382 -109021 72549
16030 -7207 269193 -223094 -110334 24291 66786 -37303 -48006 123389 -8893 678 203618
16019 203618 453792 78857 -66956 -17556 -90612 -54160 12237 146121 102229 26386 83678
$$ packed form
16098A32878i6600D62803a97082I2822L8796N5357k294J21676o6199j4950J72369
16087C97577F451L7046J55395k3932J33303p4643E9283J44334A32J25806R1901
16076B17839q0096E3508J86952E8119K61415k6929E8116J15098c6728H9307l2971
16065E6336b46608Q6901r5791J25914b3728F5662K4661R5198b48987A78906a51891
16053B4074J40340n5713K53380E7596K04834a98824d5071A24084L84593a8911
16042D72206B01670p7574P4281q7462e3937A7053J91992a3158D25382a09021G2549
16030g207B69193b23094a10334B4291M2495c7303j0703A23389h893F78K02940
16019B03618K50174G8857f6956a7556p3056L6452A2237J33884m3892B6386N7292
$$ plain form
16008 83678 -103302 178222 340431 -46597 -29432 -243705 205053 -131284 103138 -76185
15997 215546 67644 109201 -199209 18066 305484 -165889 -41451 74355 111072 -87306 361247
15985 -170732 68434 170531 114586 169781 86358 347495 116188 -18520 -306888 -14831 -38775
15974 -38775 308934 237146 -41071 189106 272724 433371 18592 243800 586787 755731
15964 755731 519625 526332 313528 120494 355415 11606 -176956 260660 -60830 19520
15953 13497 -16798 202918 104689 22600 46006 514038 -2435 -233084 22813 -136207 -73833
15942 -73833 -49932 -63040 19222 -88766 278854 -35585 140464 260809 64238 -238359 -27137
15930 -47630 140853 102685 -146163 -106605 287931 -254056 -45138 55263 74076 414789 180352
$$ packed form
16008H3678a03302A78222J62209d6597J7165k14273B05053a31284A03138g6185
15997B15546F7644M1557a99209A8066K87418a65889d1451G4355L6717h7306C61247
15985a70732F8434J02097n5945N5195q3423K61137A16188a8520k88368a4831k3944
15974c8775C08934p1788d1071A89106Q3618J60647A8592K25208L42987J68944
15964G55731k36106O707k12804A20494K34921A1606a76956B60660f0830A9520
15953A3497a6798B02918r8229B2600K3406M68032b435k30649B2813a36207O2374
15942g3833K3901j3108A9222h8766B78854c5585A40464J20345F4238b38359b7137
15930d7630A40853l8168a46163L9558B87931b54056d5138E5263J8813L40713A80352
$$ plain form
15918 31679 23125 68099 -75527 -18766 300503 197865 225068 -288542 -240575 -178301 -44111
15906 -165944 1892 -157820 -2308 315836 -307552 284278 -99738 -153429 172126 -91254 113196
15894 -118286 -141928 -39847 43150 -44463 93951 51705 -187011 -57060 -53156 25908 72280
15883 72280 88805 -214088 44282 184691 -53729 112907 117697 109701 -11051 -39059 -16050
15871 141941 -44930 -391794 13154 135442 -36435 -307398 121014 -190787 -33333 -8516 -8456
15860 -8456 68849 89368 -180354 -195012 76073 220546 -147181 100655 56525 277504 -23845
15848 -200373 163738 79094 -35121 78469 137132 -178854 191040 -3155 270090 -188215 -19587
15836 -297996 6735 -196819 -20912 270170 -33511 1011 276158 -43119 178658 46887 -138768
$$ packed form
15918C1679q554M4974g5527a8766C00503j02638K7203b88542M7967O2274d4111
15906a65944A892a57820b308C15836c07552B84278i9738n3691A72126i1254A13196
15894a18286k3642c9847D3150d4463I3951m2246a87011e7060L904B5908M6372
15883G2280J6525b14088D4282J40409e3729A12907M790p996a1051k8008a6050
15871A41941d4930l46864A3154J22288c6435k70963A21014a90787c3333h516O0
15860h456F8849K0519a80354j4658G6073J44473a47181A00655m4130K20979b3845
15848b00373A63738G9094c5121G8469N8663a78854A91040c155B70090a88215a9587
15836b97996F735a96819b0912B70170c3511A011K75147d3119A78658D6887a38768
$$ plain form
15824 -240771 -19874 155839 580772 -355616 -211031 20410 -188502 16156 -14026 16805
15813 -74008 2881 101797 -24619 -193144 266141 -105958 42965 -178511 -239498 -301884 -58096
15801 100859 -43792 -198870 -97800 -413814 -151659 -35088 66034 -81637 -32427 -206937 -138654
15790 -138654 -491406 -199626 106135 88376 -35742 -163760 3715 249834 323962 195025
15780 195025 68088 112987 -42178 56946 -21386 95517 -78728 -118461 -207435 173699 -134080
15768 -122770 -274005 101593 98088 -87608 -181687 -388347 -163654 63420 35514 268197 -18560
15756 -162518 94769 48607 24398 133544 157757 -220567 5740 147367 32598 91564 89765
15745 89765 -203859 -138003 -107012 -4229 67086 -240017 -7383 -197571 210622 -12671 -63387
$$ packed form
15824b40771a9874A55839M24933c55616J44585B0410a88502A6156a4026A6805
15813g4008B881R8916b4619j68525B66141a05958D2965a78511o0987o2386e8096
15801A00859d3792j55078i7800l16014a51659c5088F6034h1637c2427j74510O8283
15790a38654l52752a99626A06135j7759c5742j28018C715K46119P4128j28937
15780A95025F8088M4899d2178E6946b1386I5517g8728l9733q8974A73699a34080
15768a22770j51235A01593l505h7608r4079k06660a63654F3420k7906K32683a8560
15756a62518I4769m6162k4209J09146K4213b20567E740J41627C2598N8966j799
15745H9765b03859O5856L0991d229F7086b40017g383j90188B10622a2671n0716
$$ plain form
15734 -63387 -61721 180318 45040 -72487 -7343 16992 -34790 188151 -137252 144391 -12380
15722 -31216 -100392 -80283 -237773 -157225 438963 370883 -467096 119181 133612 -130257 -339446
15711 -339446 -121640 -223977 314866 68093 -314274 -57096 77688 -96041 -51426 -48319 -398196
15700 -398196 -311327 -272336 63631 -109855 6071 -21386 46592 -224574 -141295 -86142 242907
15688 90776 377581 -247983 -90501 -79552 104696 -94477 -207857 -62400 -195827 -59924 -190218
15677 -190218 13124 -61233 -349097 376040 303349 -238948 -41405 -203605 116441 -327203
15666 72744 -460994 225633 -31769 -106681 191094 -152833 -344226 -231608 -27806 76112
15655 381210 -206297 -155271 -139377 -12999 461191 -176938 194591 -81994 -186740 99746
$$ packed form
15734f3387J666A80318D5040g2487g343A6992c4790A88151a37252A44391a2380
15722c1216o9176K0109j57490Q0548D38963o8080d67096A19181J4431a30257k09189
15711c39446a21640j02337C14866F8093c14274e7096G7688i6041M4615L107l49877
15700c98196Q6869L8991F3631a09855F071b1386D6592b24574Q3279N5153B42907
15688I0776K86805b47983i0501J0949A04696i4477j13380f2400j33427e9924j30294
15677a90218A3124f1233k87864C76040p2691b38948d1405j62200A16441c27203
15666G2744d60994B25633c1769p4912A91094a52833j91393J12618b7806G6112
15655C81210b06297N1026J5894a2999D61191a76938A94591h1994j04746I9746
$$ plain form
15644 202666 -79524 123423 -41509 67986 -91409 13829 -261048 -76784 116093 -381463 -131894
15632 221952 -132270 -434370 -48966 -79456 65484 -48595 113155 -153180 -167263 71964 -334513
15620 -44026 -73909 363980 -105876 -29818 -280762 -117752 -181796 -126987 124607 134741 14906
15608 -217498 -221508 -192621 -86955 -241233 -197399 171658 -91753 247323 -15169 -20470 -139217
15597 -139217 -391428 -209762 -265084 -358127 -10949 319465 55903 81075 92314 -79058 -158482
15586 -158482 53479 238932 199054 11634 -3959 40959 -59573 -10469 -9788 -52547 80837 -185518
15573 -31793 741735 87758 225521 -237293 -90242 153852 109536 351669 -96912 39531 36843
15562 36843 -246133 69336 -24154 174547 -112 -44779 96068 24291 6572 -321661 93492 -53759
$$ packed form
15644B02666g9524A23423d1509F7986i1409A3829b61048g6784A16093c81463a31894
15632B21952a32270l02100d8966l0490F5484d8595A13155a53180j4083G1964c34513
15620d4026k9883C63980a05876b9818k50944a17752o4044N4809A24607J0134A4906
15608b17498m010K8887h6955j54278M3834A71658i1753B47323a5169n301j18747
15597a39217k52211J81666n5322r3043a0949C19465E5903K5172J1239g9058p9424
15586a58482E3479J85453l9878A1634c959D0959e9573a0469O81m2759H0837a85518
15573c1793G41735H7758J37763b37293i0242A53852m4316K42133i6912C9531k688
15562C6843b46133F9336b4154A74547a12m4667I6068B4291F572c21661I3492e3759
$$ plain form
15549 60762 -187374 46488 213324 -137664 109950 110000 180743 -26622 398320 -14270 -96239
15538 -96239 -165614 90982 75840 112977 167108 161281 -97532 -97065 321130 199164 126618 -64039
15525 135130 131712 112000 231418 -89057 -75520 285835 80471 230623 160632 392195 -37149
15513 323346 -12480 142357 208802 199473 59764 -23146 132346 -195333 -52223 -29579 -142426
15502 -142426 -277302 -10771 -276709 312013 63470 386393 -176813 116457 55686 -193246
15491 -173944 246107 111691 -94815 -69709 327775 -36684 16032 64823 -58346 1984 60183
15480 60183 263088 120834 -238436 83563 411983 -149573 291352 76723 -180213 -286865
15470 -286865 -167332 243030 -226848 351661 -48459 350806 49443 -198671 194178 -71494
$$ packed form
15549F0762a87374D6488J66836a37664A09950N0P0743b6622C98320a4270q1969
15538i6239o9375I0982j5142L7137N4131n827i7532M67C21130j21966p2546f4039
15525A35130l418j9712J19418h9057J3537B85835H0471J50152o9991K31563c7149
15513C23346a2480A42357O6445r329E9764b3146A32346a95333e2223K2644j12847
15502a42426j34876a0771k65938C12013F3470L22923a76813A16457E5686a93246
15491a73944B46107A11691i4815K5106C27775c6684A6032M8791e8346A984N8199
15480F0183K02905A20834b38436H3563L28420a49573B91352G6723a80213j06652
15470b86865J19533B43030b26848C51661d8459C50806D9443a98671A94178g1494
$$ plain form
15459 -105973 177858 -63608 285094 222950 165870 -71218 6524 127498 60914 315850 279199
15448 279199 115345 206075 129477 68407 -31242 -150251 -113300 -209126 -331354 -139950 236339
15436 80950 311898 49639 -334283 -91069 101371 19545 36512 -94889 -114761 -35697 190539
15424 385828 152205 296104 -57102 -158660 66288 -211802 19055 150062 -268320 141501
15413 130120 -239525 185571 27629 -121842 277150 -70238 232890 -156601 36801 -165428
15402 146588 -203657 105965 -19916 173723 -175083 -16819 120150 81345 362549 -197858
15391 -168483 -18092 17899 -46435 -44952 -272806 -95677 -277717 -10580 369935 128153 -139562
15379 -45094 332236 140617 226310 28957 121206 -53138 121726 -10948 327564 9414 146793
$$ packed form
15459a05973A77858f3608B85094o2144n7080g1218F524J20974F0914K54936l6651
15448B79199A15345R0730p6598o1070c1242j19009L6951r5826j22228a39950B36339
15436H0950K30948D9639c34283i1069A01371A9545J6967i4889j9872c5697A90539
15424C85828A52205J43899e7102j01558F6288b11802A9055J31007b68320A41501
15413A30120b39525A85571B7629a21842B77150g0238B32890a56601C6801a65428
15402A46588b03657A05965a9916A73723a75083a6819A20150l8805K81204a97858
15391a68483a8092A7899d6435J483k27854i5677j82040a0580C69935A28153a39562
15379d5094C32236A40617Q5693B8957R2249e3138A21726a0948C27564I414J37379
$$ plain form
15368 146793 63537 -167574 350675 -37806 11194 25223 -59919 201043 274728 226920 34962
15356 -186997 -355806 -147581 135878 210937 -241967 215474 18067 277369 -114470 -8889
15345 193378 -382784 16939 -105624 118221 -43614 -31387 174036 -195832 -287163 202590
15334 -223300 48157 -31473 -154543 373964 40366 88993 152259 -56063 80972 113150 79264
15323 79264 79618 184763 -83914 38800 -199991 161180 -188213 48432 144071 -69926 148351
15311 34404 -122483 3607 -137192 -154460 -77797 -1483 180529 -68219 -310107 -131170 -15442
15299 279623 13398 473482 29544 -21871 122633 14390 -56553 137706 8066 -148040 -73633
15287 212145 14459 5915 -139322 67448 68715 98156 232020 108763 15452 -133277 -106984
$$ packed form
15368A46793F3537a67574C50675c7806A1194J4029e9919B01043P3685m7808C4962
15356a86997j68809a47581A35878P5059b41967B15474A8067K59302a14470h889
15345A93378c82784A6939a05624A18221d3614J2227A74036a95832r1331B02590
15334b23300D8157c1473j23070C73964D0366M8627O3266e6063H0972L2178l3886
15323G9264L54J05145h3914C8800a99991A61180a88213D8432R5639f9926A48351
15311C4404a22483C607a37192j7268P6663a483A80529f8219k41888a31170a5442
15299B79623A3398M60084B9544b1871A22633A4390e6553A37706H066a48040g3633
15287B12145A4459E915a39322F7448J267K9441J33864A08763A5452a33277K6293
$$ plain form
15276 -106984 276150 69597 -186554 -123399 145515 -118285 210547 261565 37493 -249861
15265 -17479 -346430 90416 -31946 14385 7842 366968 267816 -80335 95255 -20535 77838
15253 136615 43788 184092 172786 154667 99133 372302 64848 -68475 -25954 64395 186123
15242 186123 76082 -242926 -51251 20697 12560 83730 297888 23511 356322 17302 204946
15231 204946 266579 71422 -10356 292738 331469 46306 328303 371990 612669 708279 1502713
15220 1502713 2133320 2541015 2102370 2792491 1842134 1104543 834384 476054 418259 195121
15209 484860 -87363 372834 738305 120311 116042 -38365 177128 4757 160545 138579 163931
15198 163931 182118 -2759 73982 -122928 -299689 -181659 -48027 91178 115571 64061 197790
$$ packed form
15276a06984B76150F9597a86554O3155A45515a18285B10547N1018C7493b49861
15265a7479l28951I0416c1946A4385o543L59126r9152h0335I5255b0535G7838
15253A36615D3788J40304j1306j8119n5534K73169F4848f8475b5954F4395J21728
15242A86123G6082b42926e1251B0697q137P1170K14158B3511L32811A7302J87644
15231B04946O1633G1422a0356B92738L8731D6306K81997M3687K40679R5610P94434
15220A502713O30607M07695m38645O90121r50357p37591k70159l58330n7795A95121
15209D84860h7363C72834L65471A20311m269c8365A77128D757J55788k1966K5352
15198A63931J8187b759G3982a22928j76761J18030d8027I1178K4393n1510J33729
$$ plain form
15187 197790 -197197 313667 91362 279320 98533 -187109 30762 591337 221914 -111493
15176 107421 122042 -66340 159301 188786 -195657 181690 -66543 69348 240611 -76532 162201
15164 4502 61723 406059 -42857 164100 66409 -206507 94925 -189169 233123 41460 19141
15152 121880 -303130 176284 311883 -32754 105145 -39752 255741 223097 -3533 269299
15141 308967 118014 120839 113978 358632 216494 -36680 470224 436710 61714 56620 -198110
15129 150161 -38092 23544 476182 2157 -10681 -21357 87716 160748 -164630 66992 11910
15117 -23093 -191023 -141691 -125368 -35608 327088 210815 169787 -59555 358239 213422 -81751
15105 134884 292179 155093 -184632 213357 2362 -193672 -135518 156380 141062 450419
$$ packed form
15187A97790a97197C13667I1362J87958I8533a87109C0762N60575B21914a11493
15176A07421J4621f6340A59301K9485a95657A81690f6543F9348J71263g6532A62201
15164D502N7221L44336d2857A64100F6409b06507I4925a89169B33123D1460A9141
15152A21880c03130A76284J35599c2754A05145c9752B55741l2644c533B69299
15141C08967A18014K825o861K44654j42138c6680D70224l3514F1714n094a98110
15129A50161c8092B3544M52638B157a0681j0676H7716P3032a64630F6992A1910
15117b3093j67930M9332J6323c5608C27088j16273m1028e9555C58239j44817h1751
15105A34884J57295j37086a84632B13357B362a93672N8154A56380j5318L09357
$$ plain form
15095 450419 409587 528523 322560 510453 615133 449196 252652 -176659 -27553 115113
15084 200117 -232904 536348 -8530 21244 232107 172452 -109410 374753 143778 133397
15074 133397 214925 -195907 159362 5785 480315 109701 174288 74680 357276 67639 409746
15063 409746 397535 78999 -30282 -42335 421958 -20901 -19223 65042 251319 154493 220070
15052 220070 201962 127893 -161328 -198077 204453 53047 -27510 -213915 541128 -82384 341455
15040 265003 216613 227784 161631 245087 94365 361158 264270 326131 -20789 294239 439764
15029 439764 283910 -122149 145594 261016 361230 313286 566163 92120 275630 396987
15019 396987 177481 220038 137495 509355 68524 276283 217811 421174 314028 107408
$$ packed form
15095D50419m0832J18936k05963J87893J04680j65937j96544a76659b7553A15113
15084B00117b32904E36348h530B1244K10863n9655a09410C74753A43778j0381
15074A33397Q1528a95907A59362E785M74530A09701O4587G4680K82596F7639L42107
15063D09746j2211G8999c0282j2053D21958b0901J678F5042J86277r6826O5577
15052B20070j8108p4069a61328l6749B04453E3047b7510j86405E41128h2384C41455
15040B65003m8390J1171o6153Q3456I4365K66793r6888O1861b0789B94239J45525
15029D39764j55854a22149A45594J15422J00214m7944K52877I2120J83510J21357
15019C96987A77481M2557q2543L71860F8524K07759n8472K03363j07146A07408
$$ plain form
15008 528126 21682 -20494 207515 367856 433994 198706 380176 549316 188083 254499
14998 254499 48163 226422 406798 193754 548292 228564 137617 -3515 205705 255863
14988 255863 143948 146868 91360 255341 -3841 406686 17536 146140 208515 505306 -123603
14976 222249 -11900 624072 209733 299562 296836 448366 38284 351272 389970 150710 329141
14965 329141 425174 319154 588161 232234 93650 531696 10390 143553 273523 190106
14955 190106 348565 196753 146288 463119 417512 265039 270978 450372 28465 202214
14945 202214 297017 16483 278459 369192 272102 6657 226393 319890 -13724 62201 118569
14934 118569 241704 556197 247564 298572 73001 265826 445818 503477 649843 963922
$$ packed form
15008E28126B1682b0494B07515J60341O6138A98706J81470J69140A88083O6416
14998B54499D8163J78259J80376A93754L54538B28564r0947c515B05705N0158
14988B55863j11915K920n5508J63981c841D06686A7536J28604O2375K96791a23603
14976B22249a1900F24072B09733Q9829k726J51530C8284L12988L8698A50710J78431
14965C29141R6033j06020K69007B32234I3650M38046A0390J33163J29970q3417
14955A90106J58459j51812n0465L16831m5607j52473N939J79394B8465J73749
14945B02214R4803A6483K61976R0733r7090F657K19736R3497a3724F2201N6368
14934A18569J23135L14493B47564N1008G3001J92825J79992N7659J46366L14079
$$ plain form
14924 963922 355035 393874 -27657 317035 310194 589135 -27605 62237 499627 535891 405034
14913 405034 459162 342203 433500 662110 1138046 751721 672641 658475 750795 599704
14903 599704 672748 608703 788859 445679 810168 824531 785535 563029 455350 672765
14893 672765 427234 320186 94211 271486 581852 130789 194699 359172 262130 123422
14882 219266 673060 355261 543120 298194 505696 300328 -49227 504520 145819 508913
14872 508913 579629 461495 501488 453183 544304 559880 585867 640079 477959 442746 241671
14861 241671 519522 245218 352892 208794 352860 320200 326474 542689 484693 60184
14850 531049 478703 740902 382907 767047 376391 392536 579610 495602 667751 533230
$$ packed form
14924I63922C55035L8839b7657C17035o841K78941b7605F2237M37390L6264j30857
14913D05034N4128j16959R1297K28610M75936l86325p9080j4166R2320j51091
14903E99704P3044o4045J80156l43180L64489J4363l8996k22506j07679K17415
14893F72765k45531j07048I4211J77275L10366A30789O3910J64473r7042A23422
14882B19266M53794l17799J87859k44926K07502k05368d9227E04520A45819L63094
14872E08913P0716j18134L9993m8305R1121J5576K5987N4212j62120l5213k01075
14861B41671K77851B45218J07674j44098J44066l2660O274K16215n7996F0184
14850E31049n2346K62199l57995L84140C76391J6145J87074q4008J72149j34521
$$ plain form
14840 533230 274055 206591 459210 482115 471512 310947 249167 272638 347787 577269 550810
14829 550810 478807 444984 617582 654925 414483 917961 427690 706461 649327 699666
14819 699666 368710 782011 692061 700380 573705 386740 639071 525513 609631 468028
14809 468028 368471 771577 753513 224339 464684 627555 773002 347332 328616 830477
14799 830477 420524 571555 425924 295873 396722 194347 744558 422392 707222 691744
14789 691744 346059 422568 500691 510501 592516 639761 795741 754398 579414 540814 408807
14778 408807 412852 475401 785711 152452 673271 805021 830617 684747 464497 913809
14768 913809 772263 333539 459620 775709 560772 559115 518621 1015968 716543 531738
$$ packed form
14840E33230k59175o7464K52619K2905j0603j60565o1780K3471P5149K29482k6459
14829E50810p2003l3823J72598L7343k40442N03478D27690K78771n7134N0339
14819F99666l30956M13301q9950Q319j26675j86965K52331j13558Q4118j41603
14809D68028r9557M03106j8064B24339K40345J62871J45447C47332j8716N01861
14799H30477m09953J51031j45631j30051J00849A94347N50211l22166K84830j5478
14789F91744l45685P6509P8123R810Q2015M7245J55980m1343j74984l8600j32007
14778D08807M045O2549L10310A52452N20819J31750K5596j45870k20250M49312
14768I13809j41546C33539J26081L16089k14937j657m0494M97347k99425j84805
$$ plain form
14758 531738 575287 704371 406251 448961 397319 593108 408406 601369 431043 626633
14748 626633 553132 566556 413885 1024588 887856 589937 115347 609787 470995 539159
14738 539159 712093 993956 654648 572672 654094 526459 623562 495812 598387 842026
14728 842026 728868 408531 784151 448464 560512 823493 959464 556193 613711 701132
14718 701132 451591 730031 633839 908618 596642 1120631 917517 969238 1052848 935521
14708 935521 1012791 885336 1126322 750845 774272 1126387 706663 1049767 1262977 624659
14697 969910 619431 582691 773763 1004184 673743 1018777 1284055 987609 956804 1051832
14687 1051832 997814 900983 1036118 843225 1047007 1128789 1052653 1283990 1270662 940893
$$ packed form
14758E31738M3549J29084k98120M2710n1642J95789j84702J92963j70326J95590
14748F26633p3501J3424j52671O10703j36732k97919A15347M94440j38792O8164
14738E39159J72934K81863l39308q1976Q1422j27635R7103j27750J02575K43639
14728H42026j13158l20337L75620l35687J12048K62981J35971m03271N7518Q7421
14718G01132k49541K78440r6192K74779l11976N23989k03114N1721Q3610j17327
14708I35521P7270j27455K40986l75477K3427L52115m19724L43104K13210F24659
14697I69910l50479l6740J91072K30421l30441L45034K65278k96446l0805R5028
14687A051832n4018r6831J35135j92893K03782Q1782p6136K31337j3328l29769
$$ plain form
14677 940893 1147328 1034466 1038306 1057518 934080 734133 1339606 822438 902443 960342
14667 960342 1096640 1027792 800111 872793 1195681 921869 1206709 814652 890092 954457
14657 954457 914389 877844 992666 574482 858328 1052376 1194625 1304978 995543 903316
14647 903316 1267638 1167958 1160037 848928 869084 1000665 1153986 1049402 1435089 1068304
14637 1068304 1087004 1132268 1241848 1399860 1554370 892269 1080976 1320293 1324377 1069001
14627 1069001 1517826 886118 1333514 1113820 1353048 1475771 1285172 1196840 1107907 1258327
14617 1258327 1242066 1082966 959329 1377263 1341010 1161024 1231965 1346003 1595181 1226702
14607 1226702 1552580 1404968 1238062 1100777 1333928 1542838 1616627 1439437 1241043 1131418
$$ packed form
14677I40893K06435j12862L840J9212j23438j99947O05473n17168Q0005N7899
14667I60342J36298o8848k27681P2682L22888k73812K84840l92057P5440O4365
14657I54457m0068l6545J14822m18184K83846J94048J42249J10353l09435r2227
14647I03316L64322r9680p921l11109K0156J31581J53321j04584L85687l66785
14637A068304J8700M5264J09580J58012J54510o62101J88707K39317M084k55376
14627A069001M48825o31708M47396k19694K39228J22723j90599q8332q8933J50420
14617A258327j6261j59100j23637M17934l6253j79986P0941J14038K49178l68479
14607A226702L25878j47612j66906j37285K33151K08910P3789j77190j98394j09625
$$ plain form
14597 1131418 1019813 1234468 1718013 1421088 1292251 1978766 1627586 1625746 1528380 1398887
14587 1398887 1383473 1534696 1634259 1655325 1373564 1681997 1623893 1573238 1591718 1598167 1788217
14576 1788217 1841887 1641237 1796765 1789005 1677281 2012882 1976647 1719768 2067705 1677748
14566 1677748 1847340 2071175 2137202 1574414 2028489 2031111 2261102 2348186 2174107 2326328
14556 2326328 2316348 2035144 1958298 2515783 2230007 2361136 2570106 2480789 2097726 2810821
14546 2810821 2733631 2744158 3029976 3042962 3537338 3414792 3694201 4020626 4397223 5043276
14536 5043276 5855496 7418435 9569892 13155423 18472544 28573102 31505701 19846861
14528 19846861 11749775 7204381 5229998 3659956 3613962 2973574 2858969 2815572 3038231
$$ packed form
14597A131418j11605K14655M83545k96925j28837O86515l51180j840r7366j29493
14587A398887j5414J51223R9563K1066k81761L08433n8104n0655J8480O449J90050
14576A788217N3670k00650J55528p760j11724L35601l6235k56879L47937l89957
14566A677748J69592K23835O6027n62788M54075K622K29991Q7084j74079J52221
14556B326328r980k81204p6846N57485k85776J31129K08970q9317l83063P13095
14546B810821p7190J0527K85818J2986M94376j22546K79409L26425L76597O46053
14536E043276Q12220J562939K151457L585531N317121J0100558K932599j1658840
14528A9846861q097086m545394j974383j570042m5994o40388j14605m3397K22659
$$ plain form
14519 3038231 3216793 3460761 3634199 4279479 5865328 7487320 4753075 3639902 2819503
14510 2819503 2735077 2943229 2382803 2307270 2314927 2477681 2699314 2773481 2608031 2566605
14500 2566605 2607612 2619555 2791397 2639836 2883545 2547846 2576527 3046622 2786174 3244473
14490 3244473 2679061 2991725 3188837 3216590 2711121 3086847 3300581 3019130 2916049 3398557
14480 3398557 3162928 3228190 3589598 3235327 3478150 3145780 3316248 3710861 3489396 3817617
14470 3817617 3334532 3647130 3470357 3786299 3768061 3925567 3962569 3881335 4167601 4058809
14460 4058809 4361035 4318766 4302254 4347827 4175476 4301818 4279765 4406209 4490081 4682145
14450 4682145 4675297 4590318 4668277 4702144 4871676 5112020 4839260 5028503 4987359 4838652
$$ packed form
14519C038231J78562K43968J73438O45280J585849J621992k734245j113173q20399
14510B819503q4426K08152n60426p5533P657J62754K21633P4167j65450m1426
14500B566605M1007J1943J71842j51561K43709l35699K8681M70095k60448M58299
14490C244473n65412L12664J97112K7753n05469L75726K13734k81451j03081M82508
14480C398557k35629O5262L61408l54271K42823l32370J70468L94613k21465L28221
14470C817617m83085L12598j76773L15942j8238J57506L7002q1234K86266j08792
14460D058809L02226m2269j6512M5573j72351J26342k2053J26444Q3872J92064
14450D682145o848q4979P7959L3867J69532K40344k72760J89243m1144j48707
$$ plain form
14440 4838652 5411036 4990224 5292057 5247790 5572434 5510461 5392626 5728261 5823007 5911929
14430 5911929 5897410 5838090 5758120 5896261 5923796 5996407 6424922 6478723 5878578 6489659
14420 6489659 6593503 6619581 6805067 6565065 6826813 6845595 6952296 7041155 7280308 7235126
14410 7235126 7746030 7474535 7763692 7851301 7867420 8271873 8200067 8020749 8186479 8321264
14400 8321264 8818828 8731100 9353983 9171614 9388401 9378983 9271357 9285964 9735454 10011725
14390 10011725 10359334 10158441 10321288 10462904 10656290 10772082 11275841 11476247 11386477
14381 11386477 11879990 11657485 11606147 12116336 12034883 12435993 12665808 13001645 13028469 12965530
14371 12965530 13643191 14015558 14321770 14295577 14777475 15082130 14950211 15498862 15906007
$$ packed form
14440D838652N72384m20812L01833m4267L24644o1973j17835L35635R4746Q8922
14430E911929j4519n9320p9970J38141K7535P2611M28515N3801o00145O11081
14420F489659J03844K6078J85486k40002K61748J8782J06701Q8859K39153m5182
14410G235126N10904k71495K89157Q7609J6119M04453p1806j79318J65730J34785
14400H321264M97564q7728O22883j82369K16787r418j07626J4607M49490K76271
14390A0011725L47609k00893J62847J41616J93386J15792N03759K00406q9770
14381A1386477M93513k22505n1338N10189q1453M01110K29815L35837K6824o2939
14371A2965530O77661L72367L06212k6193M81898L04655j31919N48651M07145
$$ plain form
14362 15906007 16258722 16593912 16819584 16935290 17057978 17474296 17971903 18258387 18802771
14353 18802771 18988418 19787676 19731281 20439402 20860246 21276068 21543409 22147775 22695481
14344 22695481 22951161 23518717 23927042 24358756 25210014 25895960 26215568 26964322 27881528
14335 27881528 28333596 28990087 29601403 30699765 31406530 32180026 32853513 33918583 34753263
14326 34753263 35764767 36646129 37680305 38668990 39900882 40994615 42484957 43244156
14318 43244156 44751917 45914780 47377255 48834800 50262343 51716907 53479324 55547035
14310 55547035 57024238 59188460 61476613 63265150 65421774 67831152 70480788 73259143
14302 73259143 75823604 78668815 81744760 85173723 88180520 91744627 96152018 99563922
$$ packed form
14362A5906007L52715L35190K25672J15706J22688M16318M97607K86484N44384
14353A8802771J85647P99258n6395P08121M20844M15822K67341O04366N47706
14344B2695481K55680N67556M08325M31714Q51258O85946L19608P48754R17206
14335B7881528M52068O56491O11316J098362P06765P73496O73487J065070Q34680
14326C4753263J011504Q81362J034176R88685J231892J093733J490342P59199
14318D3244156J507761J162863J462475J457545J427543J454564J762417K067711
14310E5547035J477203K164222K288153J788537K156624K409378K649636K778355
14302G3259143K564461K845211L075945L428963L006797L564107M407391L411904
$$ plain form
14294 99563922 104197787 108801851 113407338 118339961 123853859 129201453 135278757 142048731
14286 142048731 148709252 155833226 163773609 171312689 180097563 189347246 198496286 208704213
14278 208704213 219087845 230134425 241717492 254389704 267517585 280946007 294701081
14271 294701081 308737724 322741438 336606546 350224071 363656929 376456675 388434113
14264 388434113 399607450 410748345 421273016 430661122 439082059 446791136 452008588
14257 452008588 455249996 457978319 460278830 458102463 452032580 448220522 439641617 429566969
14249 429566969 419002695 406569406 393458351 379601459 366857842 352740904 338997643
14242 338997643 325116499 311590718 298484090 285649221 272541029 260718532 248942909
$$ packed form
14294I9563922M633865M604064M605487M932623N513898N347594O077304O769974
14286A42048731O660521P123974P940383P539080Q784874R249683R149040J0207927
14278B08704213J0383632J1046580J1583067J2672212J3127881J3428422J3755074
14271B94701081J4036643J4003714J3865108J3617525J3432858J2799746J1977438
14264C88434113J1173337J1140895J0524671R388106Q420937P709077N217452
14257D52008588L241408K728323K300511k176367o069883l812058q578905j0074648
14249D29566969j0564274j2433289j3111055j3856892j2743617j4116938j3743261
14242C38997643j3881144j3525781j3106628j2834869j3108192j1822497j1775623
$$ plain form
14235 248942909 237331157 226537491 216045448 205423031 194889040 185073076 176356683
14228 176356683 167497333 159742513 152739412 147180404 140696228 134244535 127723436 122238945
14220 122238945 116611215 111654458 106756722 102528054 98568613 94531266 90401494 87219944
14212 87219944 83871052 80520254 77543260 74861727 71768782 69270507 66913207 64739946
14204 64739946 62704680 60508099 58355161 56708108 54828766 53278691 51674387 50059825
14196 50059825 48394351 47145026 46079580 44335613 43549500 42433267 41055038 39749810
14188 39749810 38617216 37561612 36222259 35817435 34564511 33881836 33038110 32158205 31362494
14179 31362494 30483256 29822622 29129345 28702510 27683850 26762086 26486234 25677754 24866645
$$ packed form
14235B48942909j1611752j0793666j0492043j0622417j0533991r815964q716393
14228A76356683q859350p754820p003101n559008o484176o451693o521099n484491
14220A22238945n627730m956757m897736m228668l959441m037347m129772l181550
14212H7219944l348892l350798k976994k681533l092945k498275k357300k173261
14204F4739946k035266k196581k152938j647053j879342j550075j604304j614562
14196E0059825j665474j249325j065446j743967p86113j116233j378229j305228
14188C9749810j132594j055604j339353m04824j252924o82675q43726q79905p95711
14179C1362494q79238o60634o93277m26835j018660r21764k75852q08480q11109
$$ plain form
14170 24866645 24640929 24073986 23522325 23137881 22547532 21883789 21426848 21333755 20839725
14161 20839725 20240980 20226809 19647927 19280901 18766159 18420054 17893399 17626326 17418624
14152 17418624 16889372 16937767 16258867 15945961 15641349 15572984 15139990 14751121 14700598 14411610
14142 14411610 13968788 14119260 13502731 13494976 13515474 12662619 12909981 12719342 12503295 12185762
14132 12185762 12150877 12006613 11946416 11448396 11085153 11080310 11183375 10833977 10540233 10453408
14122 10453408 10318328 10520055 10125860 10259972 9813910 10066679 9594265 9023112 9224251
14113 9224251 9430635 9001515 8858124 8984067 8773420 8804599 8455035 8391655 8499602 7982202
14103 7982202 8255434 8368297 7896762 7850606 7405354 7556862 7082607 7277295 7329021 7319760
$$ packed form
14170B4866645k25716n66943n51661l84444n90349o63743m56941r3093m94030
14161B0839725n98745j4171n78882l67026n14742l46105n26655k67073k07702
14152A7418624n29252M8395o78900l12906l04612o8365m32994l88869n0523k88988
14142A4411610m42822J50472o16529p755K0498q52855K47362j90639k16047l17533
14132A2185762l4885j44264o0197m98020l63243m843J03065l49398k93744q6825
14122A0453408j35080K01727l94195J34112m46062K52769m72414n71153K01139
14113I224251K06384m29120j43391J25943k10647L1179l49564o3380J07947n17400
14103G982202K73232J12863m71535m6156m45252J51508m74255J94688N1726r261
$$ plain form
14093 7319760 7136449 6698831 7234224 6819104 6700633 6531267 6291169 6485437 6175221
14084 6175221 6420155 6158804 6351297 5967831 6203113 6097750 6143811 5525684 5884288 5708250
14074 5708250 5697039 5526153 5608829 5443493 5371835 5506626 5271962 5090406 5424142 5133925
14064 5133925 5052864 5223751 5223539 4909249 4670301 4831163 4553740 4646195 4867013 4639750
14054 4639750 4568355 4404135 4221442 4459162 4362788 4256570 4254471 4243296 4366633 4097816
14044 4097816 4509747 4258636 4044427 3941764 4060820 3965242 4199011 4259746 3732031 3546743
14034 3546743 3598886 3642537 3591349 3405763 3657042 3669650 3570886 3361723 3471377 3709229
14024 3709229 3758062 3404985 3590842 3684597 3174869 3156329 3295801 3431664 3306140 3259827
$$ packed form
14093G319760j83311m37618N35393m15120j18471j69366k40098J94268l10216
14084F175221K44934k61351J92493l83466K35282j05363M6061o18127L58604j76038
14074E708250j1211j70886Q2676j65336p1658J34791k34664j81556L33736k90217
14064E133925q1061J70887k12l14290k38948J60862k77423R2455K20818k27263
14054D639750p1395j64220j82693K37720r6374j06218k099j1175J23337k68817
14044D097816M11931k51111k14209j02663J19056r5578K33769O0735n27715j85288
14034C546743N2143M3651n1188j85586K51279J2608r8764k09163J09654K37852
14024C709229M8833l53077J85857R3755n09728j8540J39472J35863j25524m6313
$$ plain form
14014 3259827 3435151 2997700 3255881 3038615 3280614 3493526 3038558 3051945 2902799 2595602
14004 2595602 2861905 2813064 3031800 2912496 3139819 2866963 2735717 2706638 2840426 2632241
13994 2632241 2775891 2880463 2534268 2396869 2719836 2391272 2436788 2713349 2406644 2401020
13984 2401020 2795752 2675877 2178309 3004797 2640565 3010184 3198399 3615741 3963260
13975 3963260 4972800 6184336 9182532 13774864 23696896 32334643 23117710 15753285
13967 15753285 10416264 7940931 6095894 5100911 4545332 4135178 3565015 3796656 3299036
13958 3299036 3303689 3096110 3082104 3093995 2890645 3027010 2968948 2995420 2492123 2454958 2321041
13947 2321041 2486194 2553410 2212270 2184197 2228347 2236286 2042797 2385123 1975996 2318570
$$ packed form
14014C259827J75324m37451K58181k17266K41999K12912m54968J3387j49146l07197
14004B595602K66303m8841K18736j19304K27323k72856j31246k9079J33788k08185
13994B632241J43650J04572l46195j37399L22967l28564M5516K76561l06705n624
13984B401020L94732j19875m97568Q26488l64232L69619J88215M17342L47519
13975C963260J009540J211536K998196M592332R922032Q637747r216933p364425
13967A5753285n337021k475333j845037r94983n55579m10154n70163K31641m97620
13958C299036M653k07579j4006J1891k03350J36365n8062K6472n03297l7165j33917
13947B321041J65153O7216l41140k8073M4150P939j93489L42326m09127L42574
$$ plain form
13937 2318570 2067336 1597608 2128735 1836078 2144620 2064746 2143757 2186552 1914208 2022527
13927 2022527 1953634 1895332 1842487 1654252 1863594 1761979 2108425 1997547 1759035 1722764
13917 1722764 1502650 1674696 1616675 1497476 1671720 1977588 1614922 1745252 1680742 1929562
13907 1929562 1542734 1622096 1587110 1511730 1590950 1409611 1651090 1788492 1818075 1330856
13897 1330856 1374189 1635354 1052014 1913522 1658061 1726848 1515925 1733670 1677619 1397259
13887 1397259 1555489 1637100 1546950 1653647 1471340 1393101 1377711 1144050 1494750 1415457
13877 1415457 1450213 1832335 1451585 1423916 1359110 910455 1434049 1349422 1344895 1407739 1134288
13866 1134288 1030636 1269763 1156090 1248074 1355903 1137433 1387939 1282038 1345314 1107157
$$ packed form
13937B318570k51234m69728N31127k92657L08542p9874P9011M2795k72344J08319
13927B022527o8893n8302n2845j88235K09342j01615L46446j10878k38512l6271
13917A722764k20114J72046n8021j19199J74244L05868l62666J30330o4510K48820
13907A929562l86828P9362l4986p5380P9220j81339K41479J37402K9583m87219
13897A330856M3333K61165n83340Q61508k55461O8787k10923K17745n6051k80360
13887A397259J58230Q1611r0150J06697j82307p8239j5390k33661L50700p9293
13877A415457L4756L82122l80750k7669o4806m48655N23594q4627m527O2844k73451
13866A134288j03652K39127j13673R1984J07829k18470K50506j05901O3276k38157
$$ plain form
13856 1107157 1207820 1315898 1055153 1167094 1196669 1285578 864583 1381213 1547032 1131944
13846 1131944 1214263 1615125 1436330 1249182 1070435 1315789 908315 1250038 1082557 1018410
13836 1018410 1147518 1178711 1094946 798594 1232814 997298 1256349 900530 1115252 1023455
13826 1023455 965057 1305981 826258 1017154 1368860 1158994 947628 911118 1084677 1113594
13816 1113594 869147 1216201 886810 957141 789335 1381028 905002 781481 898802 983752
13806 983752 935024 653911 866948 1117824 1151703 814420 635986 707004 1264997 1122041
13796 1122041 1169886 834400 764094 904419 1053518 981243 827536 1049099 1069589 741459
13786 741459 962656 732536 796442 885711 801776 796998 1043505 899895 953825 515157 1007506
$$ packed form
13856A107157J00663J08078k60745J11941K9575Q8909m20995N16630J65819m15088
13846A131944Q2319M00862j78795j87148j78747K45354m07474L41723j67481o4147
13836A018410J29108L1193q3765k96352M34220k35516K59051l55819K14722r1797
13826A023455n8398L40924m79723J90896L51706k09866k11366l6510J73559K8917
13816A113594k44447L47054l29391P0331j67806N91693m76026j23521J17321Q4950
13806I83752m8728k81113K13037K50876L3879l37283j78434P1018N57993j42956
13796A122041M7845l35486p0306J40325J49099p2275j53707K21563K0490l28130
13786G41459K21197k30120O3906Q9269q3935m778K46507j43610N3930m38668M92349
$$ plain form
13775 1007506 1030517 894681 839036 837631 805856 809258 668613 924121 878856 1036124 893237
13764 893237 771252 768615 760811 816435 600772 997486 638954 667189 459401 546409 858693
13753 858693 809615 733451 651882 815663 547207 591231 491422 687502 729297 997450 622351
13742 622351 943905 793936 558054 622665 805571 689273 882711 772084 640377 628299
13732 628299 531229 759379 641725 925743 780322 607936 574993 892328 563340 682657
13722 682657 575638 576719 760408 677513 706852 722995 462440 759940 333416 843919
13712 843919 696615 795845 510762 797408 616006 593104 464965 655287 649097 675759
13702 675759 436864 645149 650659 661768 770037 733347 570892 1009972 568554 448230
$$ packed form
13775A007506K3011j35836n5645j405l1775L402j40645K55508m5265J57268j42887
13764H93237j21985k637p804N5624k15663L96714l58532K8235k07788Q7008L12284
13753H58693m9078p6164q1569J63781k68456M4024r9809J96080M1795K68153l75099
13742F22351L21554j49969k35882O4611J82906j16298J93438j10627j31707j2078
13732F28299r7070K28150j17654K84018j45421j72386l2943L17335l28988J19317
13722F82657j07019J081J83689q2895K9339J6143k60555K97500C33416N10503
13712H43919j47304R9230k85083K86646j81402k2902j28139J90322o190K6662
13702F75759k38895K08285N510J1109J08269l6690j62455M39080m41418j20324
$$ plain form
13692 448230 699808 734351 405672 410418 743449 558836 801105 447755 485196 416213
13682 416213 488925 664891 555378 463378 530118 640307 548502 527023 452412 491730 485670
13671 485670 600839 385038 545225 543935 807296 626737 1060427 487932 754074 717936
13661 717936 616052 444432 742513 309826 776998 520383 313447 728866 449812 604038
13651 604038 457328 715575 511834 715799 328976 701158 394547 250108 519794 738450
13641 738450 769818 474846 393572 775040 641386 190747 558974 493598 593840 720122
13631 720122 687270 713361 496742 567050 229788 248072 246771 518158 603254 541196 629424
13620 629424 366346 544607 563355 480647 595527 397190 535000 460580 400851 297991
$$ packed form
13692D48230K51578L4543l28679M746L33031j84613K42269l53350L7441o8983
13682D16213P2712J75966j09513r2000O6740J10189r1805k1479p4611L9318o060
13671D85670J15169k15801J60187j290K63361j80559M33690D87932K66142l6138
13661G17936j01884j71620K98081C09826M67172k56615k06936M15419k79054J54226
13651F04038j46710K58247k03741K03965C28976L72182l06611j44439K69686K18656
13641G38450L1368k94972q1274L81468j33654A90747L68227o5376J00242J26282
13631G20122l2852K6091k16619P0308B29788J8284j301K71387Q5096o2058Q8228
13620F29424k63078J78261J8748q2708J14880j98337J37810p4420n9729j02860
$$ plain form
13610 297991 418441 479967 619447 415017 865877 248959 393531 674532 475416 24132
13599 396503 372144 301467 606966 128747 426283 451368 439674 175968 748158 410196
13589 410196 628540 345699 329763 -125020 809731 174451 564291 359396 279649 68276
13578 356132 350985 603055 295687 180993 228397 311392 565814 402404 248232 291145
13568 291145 54190 245543 414985 377323 287529 434543 182832 176455 245648 238770 335874
13557 335874 345289 351367 487124 327281 259000 405937 433629 265331 296478 361399 230258
13546 230258 245096 385364 207334 521185 445728 200076 341914 393102 488361 559802
13536 559802 363173 367321 189492 153649 240378 273112 608284 310718 255906 209590 421135
$$ packed form
13610B97991J20450O1526J39480k04430M50860B48959J44572K81001j99116B4132
13599C96503k4359p0677L05499A28747K97536K5085j1694A75968N72190l37962
13589D10196K18344k82841j5936a25020H09731A74451L89840k04895p9747F8276
13578C56132n147K52070B95687j14694M7404Q2995K54422j63410j54172M2913
13568B91145E4190J91353J69442l7662q9794J47014A82832o377O9193o878R7104
13557C35874R415O078J35757j59843o8281J46937K7692j68298L1147O4921j31141
13546B30258J4838J40268j78030L13851p5457B00076J41838N1188R5259P1441
13536E59802j96629M148j77829l5843Q6729L2734L35172k97566n4812m6316K11545
$$ plain form
13525 421135 166010 278102 282253 371419 277318 201546 350708 278222 132530 251659 550078
13514 550078 700198 367564 545580 334343 400431 275461 494377 171148 278552 260384
13504 260384 108563 451215 518980 407565 -66476 552255 506194 37210 468676 259939
13494 259939 255198 109623 646902 315802 445169 278272 283767 430106 78071 235964
13484 235964 367782 462740 -118177 79772 226755 307651 -55051 292020 -30904 141212
13473 6969 267084 -15302 124040 209427 540239 301201 135673 -3000 386251 328262 171098
13462 171098 88769 599520 483486 -52149 262293 193450 351398 392339 359245 137315
13451 225400 517574 102080 186201 240420 322963 260157 731535 437374 664758 303706
$$ packed form
13525D21135A66010J12092M151Q9166r4101p5772J49162p2486A32530J19129K98419
13514E50078J50120l32634J78016k11237O6088j24970K18916A71148J07404j8168
13504B60384A08563L42652O7765j11415f6476E52255m6061C7210M31466k08737
13494B59939m741A09623N37279C15802J29367j66897N495J46339G8071J57893
13484B35964J31818R4958a18177G9772J46983Q0896e5051B92020c0904A41212
13473F969K60115a5302A24040Q5387L30812k39038A35673c000C86251n7989j57164
13462A71098q2329N10751j16034e2149B62293o8843J57948M0941l3094A37315
13451B25400K92174A02080Q4121N4219Q2543o2806M71378k94161K27384C03706
$$ plain form
13440 403833 -66044 133158 318519 25530 163772 40476 1163 357345 243610 148651 111386
13429 111386 247607 312520 321587 301302 131378 488816 416495 134727 303971 314640 285529
13418 285529 313614 273780 411503 450794 65787 266423 136755 247088 -3097 241003 325521
13407 325521 -71622 288594 190453 548099 148850 266298 130635 146117 19314 334446
13397 334446 388606 234858 265189 184831 343040 23757 -128819 117101 319466 34215
13386 373726 147577 133723 206300 395897 246338 330873 422143 461458 5562 -154261 69082
13374 256374 80208 17695 534054 50034 213549 339751 -32379 154011 85105 416963
13364 416963 368347 306292 343445 396885 -92461 225285 523531 156538 -213113 193690
$$ packed form
13440D03833f6044A33158J85361B5530J38242D0476A163L56182j13735r4959l7265
13429A11386J36221O4913R067k0285A31378L57438p2321A34727J69244J0669k9111
13418B85529K8085l9834J37723L9291F5787K00636j29668J10333c097B41003Q4518
13407C25521g1622B88594r8141L57646A48850J17448A30635J5482A9314L15132
13397C34446N4160j53748L0331q0358J58209B3757a28819A17101K02365C4215
13386C73726A47577j3854P2577J89597j49559Q4535R1270L9315E562a54261F9082
13374B56374H0208A7695N16359E0034J63515J26202c2379A54011o8906L31858
13364D16963m8616o2055L7153N3440i2461B25285K98246A56538b13113A93690
$$ plain form
13353 195401 288825 372041 244200 393461 -86556 283988 360702 338292 336483 500352 422852
13342 422852 760597 287295 352870 453009 545073 152453 268576 37671 247384 179247
13332 179247 234191 161054 404891 203980 167458 299682 -35735 519058 392009 338709
13322 338709 137755 603247 419202 642273 556829 402577 314745 313662 470900 245316
13312 245316 466314 37174 4767 -16071 418834 136056 281051 476844 73366 12879 187553
13301 187553 200967 105215 387797 -137382 131710 99439 434896 328745 102390 296010
13291 296010 287933 381858 115129 57554 284364 45256 194247 62921 35053 140152 499984
13280 499984 175528 30076 94145 15651 75802 -254670 112035 348256 300101 165951
$$ packed form
13353A95401R3424Q3216j27841J49261h6556B83988P6714k2410j809J63869p7500
13342D22852L37745B87295O5575J00139R2064A52453J16123C7671K09713o8137
13332A79247N4944p3137K43837k00911l6522J32224c5735E19058j27049n3300
13322C38709A37755M65492j84045K23071q5444j54252q7832j083J57238k25584
13312B45316K20998C7174D767a6071D18834A36056J44995J95793G3366A2879J74674
13301A87553J3414r5752K82582a37382A31710l2271L35457j06151A02390J93620
13291B96010q077R3925A15129E7554K26810D5256J48991F2921k7868J05099L59832
13280D99984A75528C0076O4069A5651O0151b54670A12035K36221m8155j34150
$$ plain form
13270 165951 -91448 41649 205083 -11003 128175 244925 340430 337569 296905 -178143 23538
13258 -275238 261048 180232 65035 330172 139476 410953 -16380 83909 417875 204314
13247 206200 138400 -229355 46319 -227150 320992 209670 -188463 319346 -79276 107460
13236 382416 41064 261650 -106030 165949 132568 112141 62227 -135126 -89693 -23640 340827
13224 260361 150821 -8238 -177598 26409 354546 340321 289115 72688 -94264 -139607 236972
13212 258754 166819 239982 164683 190934 311997 445503 43814 52819 29877 231480 -11497
13200 175953 219922 249776 30073 321225 -39079 85563 -12418 77410 -123473 137209 -29519
13188 -100207 -107176 175517 318746 178790 333275 -237290 105371 92344 248447 -67619
$$ packed form
13270A65951i1448D1649J63434a1003A28175J16750R5505k861m0664a78143B3538
13258b75238B61048q0816F5035K65137A39476K71477a6380H3909L33966B04314
13247B06200o7800b29355D6319b27150C20992j11322a88463C19346g9276A07460
13236C82416D1064K20586a06030A65949l3381k0427m9914a35126M5433b3640C40827
13224B60361j09540h238j69360B6409L28137j4225n1206G2688i4264m5343B36972
13212B58754r1935P3163p5299K6251J21063J33506D3814R005k2942K01603a1497
13200A75953M3969K9854C0073K91152c9079H5563a2418G7410a23473A37209b9519
13188a00207o969A75517J43229j39956J54485b37290A05371j3027J56103f7619
$$ plain form
13177 83529 166521 -99635 202061 -153005 -140431 287121 460696 -178967 212914 17163
13166 126819 28050 145051 133460 281126 153658 173398 -164106 93078 213873 1185 -90261
13154 407489 198288 81608 212577 181911 78761 366200 -186507 -19027 240 299270 -76117
13142 211587 21079 26682 110500 88118 62145 294117 113207 237211 -6165 97802 -54830
13130 89257 101573 265554 -94863 -40255 -82087 -124457 -80434 -16169 -29048 26575 6665 -56414
13117 183911 -158354 167169 -5218 185130 -73932 212694 -91528 282050 -130660 40860
13106 64023 -96136 51333 -188973 53608 162577 239090 284404 308584 272134 -688 -7826 158977
13093 246525 208279 172523 11287 188666 187666 72559 -35964 180665 52044 -65460 199015
$$ packed form
13177H3529Q2992i9635B02061a53005J2574B87121J73575a78967B12914A7163
13166A26819B8050J17001j1591J47666j27468J9740a64106I3078J20795A185i0261
13154D07489A98288H1608J30969l0666G8761K87439a86507a9027B40K99030g6117
13142B11587B1079N603Q3818k2382k5973K31972A13207J24004f165I7802e4830
13130H9257J2316J63981i4863d0255m1832m2370M4023a6169j2879B6575F665e6414
13117A83911a58354A67169e218A85130g3932B12694i1528B82050a30660D0860
13106F4023i6136E1333a88973E3608J08969P6513M5314K4180l6450f88p138A58977
13093B46525l8246l5756A1287J77379j000G2559c5964A80665E2044f5460A99015
$$ plain form
13081 -1197 140433 13980 256576 185929 -14628 -117115 100905 -62108 48141 -5795 107630
13069 -197504 156494 70883 -50435 -82203 29308 -227137 -168729 419132 -309222 -37554 -89612
13058 -89612 474044 32076 80007 -93311 244043 84107 65255 -18615 -83909 190700 -120536
13046 50546 -62972 191024 337807 87206 109092 184858 28576 -65561 -293442 3911 240242
13035 240242 -312201 -249219 14922 307569 -77337 271724 -44797 42112 -28275 207935 117135
13024 117135 181473 373352 185175 -33032 -50778 17097 149493 425821 47741 -10442 111470
13012 264534 -18272 349424 74275 51187 167547 141482 -146423 56007 137776 -27365 258295
13000 -218620 -376624 -124062 -155885 -234480 -40397 191723 -4222 338885 326293 84317 -282823
$$ packed form
13081a197A40433A3980K42596p0647a4628j02487A00905f2108D8141e795A07630
13069a97504A56494G0883e0435l1768B9308b27137N8408D19132c09222c7554n2058
13058h9612D74044C2076M7931i3311B44043H4107j8852a8615o5294A90700a20536
13046E0546f2972A91024J46783H7206K1886P5766B8576f5561k27881C911K36331
13035B40242c12201O2982A4922K92647g7337B71724d4797D2112b8275B07935r0800
13024A17135O4338J91879A85175c3032j7746A7097J32396K76328D7741a0442A11470
13012B64534a8272C49424G4275k3088J16360k6065a46423E6007Q1769b7365B58295
13000b18620j58004a24062l1823p8595d0397A91723d222C38885j2592H4317b82823
$$ plain form
12988 147196 119536 393460 31838 246374 -37259 -37250 -40893 499387 114108 92129 -36176 136355
12975 65363 97103 443981 367610 -34855 -25861 -38763 -47121 -158291 133919 170594 -133860
12963 17713 114938 -8480 -33108 26733 230362 -109986 -208086 8192 446929 93678 -141616
12951 155613 99597 -199271 -36878 28809 314352 -56735 279090 39243 -84710 -62966 393595
12939 288685 -71067 -341746 -64363 136306 12425 123935 51750 -24795 73136 -138750 50040
12927 389549 233796 170257 190417 177816 -83682 -26683 -88226 202150 -156205 37049 -66322
12915 321704 12811 59111 -226094 -135723 38890 -74341 30074 -76729 -22610 -40459 -3999
12903 -168437 -84090 127490 196632 105082 141300 129053 170684 30518 -82953 155286 -248369
$$ packed form
12988A47196k7660K73924C1838K14536c7259Rl643D99387A14108k1979c6176A36355
12975F5363L1740L46878p6371c4855Q994j2902q358j11170A33919L6675a33860
12963A7713R7225h480k4628B6733K03629a09986r8100H192M38737I3678a41616
12951A55613n6016a99271c6878B8809K85543e6735B79090C9243h4710K1744C93595
12939B88685g1067k70679f4363A36306A2425J11510E1750b4795G3136a38750E0040
12927C89549j55753o3539K0160j2601h3682b6683o1543B02150a56205C7049f6322
12915C21704A2811M6300b26094R0371C8890g4341C0074g6729b2610j7849c999
12903a68437h4090A27490O9142r1550L6218j2247M1631C0518h2953A55286b48369
$$ plain form
12891 172188 -46687 -158791 79637 212805 350701 22217 335238 478 -50654 93757 195276
12880 195276 203134 21750 -66551 -196197 -33734 -39136 90408 -65757 -216423 375404 108927
12868 9057 43754 -51213 227273 -163179 -2668 288399 -86790 -187608 -59812 177817 136782
12857 136782 85211 -119237 56664 -135950 454887 -83125 46043 128370 74024 -174279 -13009
12845 12966 76675 58620 71922 989 96886 -359566 -200282 -168673 339521 44831 88400
12834 88400 117874 213332 168898 -63283 112423 27515 26257 -104209 -22410 -146652 143298
12822 -18919 125998 -416618 90611 29675 -114727 -463627 352368 -166660 -290630 -232054
12812 -232054 110274 264303 -50179 27218 74203 34792 -106491 -36157 -37208 -48109 111769
$$ packed form
12891A72188d6687j12104G9637J33168J37896B2217L13021D78e0654I3757J01519
12880A95276P858B1750f6551j29646c3734n402I0408f5757j50666C75404A08927
12868I057L4697e1213B27273a63179b668B88399h6790j00818e9812A77817m1035
12857A36782n1571a19237E6664a35950D54887h3125D6043Q2327n4346a74279a3009
12845A2966O3709j8055J3302I89R5897c59566J59284L1609C39521D4831M3569
12834H8400K9474R5458m4434f3283A12423B7515j258a04209b2410j24242A43298
12822a8919A25998d16618I0611B9675a14727l48900C52368a66660j23970N8576
12812b32054A10274J54029e0179B7218M6985C4792a06491c6157j051j0901A11769
$$ plain form
12800 -73687 -176934 316327 68292 -78547 -81522 211776 -24298 -418561 -204530 -22337 -71307
12789 -71307 -184372 -57746 141664 -196020 35679 -155839 50755 -294998 -406903 -58506
12778 178166 -209832 306577 101688 -226176 12861 139874 68715 -329963 -173239 -17355
12767 -131429 149689 182654 127821 -66625 -203080 -329311 108327 -282346 141766 -41984
12756 41863 -95272 104701 -280954 288370 19306 78753 -65657 395091 -44567 -77141 -172077
12745 -172077 80791 33302 339250 268093 50535 65737 -142203 153106 244683 -248384 382639
12733 436115 -243409 58861 -51329 255650 94917 -70178 -163700 186409 456946 -94036 -226732
12722 -226732 -51782 -169625 301009 211359 -193352 -8 79845 141674 -3737 -158755 132673
$$ packed form
12800g3687j03247C16327F8292g8547k975B11776b4298l94263b04530b2337m8970
12789g1307j13065e7746A41664a96020C5679a55839E0755b94998j11905e8506
12778A78166b09832C06577A01688b26176A2861J27013F8715c29963J56724a7355
12767a31429A49689L2965n4833f6625j36455j26231A08327b82346A41766d1984
12756D1863i5272A04701b80954B88370A9306N9447f5657C95091d4567l2574r4936
12745a72077H0791C3302L05948p1157E0535J5202a42203A53106R1577b48384C82639
12733D36115b43409E8861e1329B55650I4917g0178r3522A86409K70537i4036j32696
12722b26732e1782j17843C01009q9650a93352hG9845O1829c737j55018A32673
$$ plain form
12710 16070 265863 49015 269689 35281 277736 27344 47044 -83082 -22559 30662 202278
12699 202278 23422 134614 -184083 -62534 -34881 -358195 181089 343594 -266702 25259
12688 -21474 171781 -82418 180987 54670 -275595 -89672 249685 233802 -117097 -138671 180210
12676 428218 77977 121937 -295815 152704 10376 -59233 -197714 74073 112719 442513 132869
12664 213818 -49472 -29531 170255 238879 150807 57790 90650 319459 163422 237018 82388
12652 131151 302520 53511 49775 -16041 61882 502751 226823 119211 -73158 122875 176947
12641 176947 211977 158761 -160066 241985 184280 -25836 122526 -29592 11444 265895 242753
12630 242753 -214103 189270 33560 203998 -180246 81848 121093 7700 94674 -269507 149496
$$ packed form
12710A6070K49793D9015K20674C5281K42455B7344J9700h3082b2559C0662J71616
12699B02278B3422J11192a84083f2534K7653l23314A81089J62505b66702B5259
12688b1474A71781h2418A80987E4670b75595h9672B49685j5883a17097k1574A80210
12676D28218G7977M3960b95815A52704A0376e9233j38481G4073L8646L29794A32869
12664B13818d9472J9941A70255O8624q8072E7790L2860K28809j56037P3596H2388
12652A31151J71369E3511l736a6041F1882M40869B26823j07612g3158A22875N4072
12641A76947L5030n3216a60066B41985n7705b5836A22526b9592A1444K54451k3142
12630B42753b14103A89270C3560J70438a80246H1848L9245G700Q6974b69507A49496
$$ plain form
12618 270780 -100858 58779 -22040 506672 312782 47242 183065 260865 267063 142084 128977
12607 128977 -104712 37082 55174 285360 18897 109179 331909 325111 279100 -27994 142418
12595 -57123 -346271 375710 -98353 -75753 -94923 -118711 198042 104058 132102 -15072 381131
12583 376789 63170 390924 -169354 77763 4407 128677 82090 112537 25233 67956 52732
12572 52732 -164657 -7190 178584 -9552 62928 -171616 -64031 255607 -116101 142651 -74628
12560 -85242 -96648 -103561 26981 267 453869 -57952 54564 20178 229651 -191190 56224 -331493
12547 223016 -174383 -266261 251805 -169438 266110 -360591 -229579 -188717 -103333 87384
12536 -167093 188086 -183981 181552 -190110 -40180 37190 28457 -127874 250348 192388
$$ packed form
12618B70780a00858E8779b2040E06672j93890D7242J35823P7800O198j24979j3107
12607A28977a04712C7082J8092K30186A8897R0282K22730o798m6011b7994A42418
12595e7123k89148C75710i8353K2600j9170k3788A98042r3984K8044a5072C81131
12583C76789F3170L27754a69354G7763D407J24270m6587L0447B5233M2723j5224
12572E2732a64657g190A78584i552F2928a71616f4031B55607a16101A42651g4628
12560h5242j1406o913B6981B67M53602e7952E4564B0178K09473a91190E6224c31493
12547B23016a74383r1878B51805a69438B66110c60591J31012M0862Q5384H7384
12536a67093A88086a83981A81552a90110d0180C7190q733a27874B50348n7960
$$ plain form
12526 192388 -105740 -18731 -295297 92894 -66138 -230179 68506 -312852 399917 -71228
12515 168513 174769 -143562 133753 81921 193020 22917 158176 11118 199583 325796
12505 325796 157092 61185 -3559 309963 69217 113711 2563 166805 95930 126861 287389
12494 287389 -85500 308157 -4194 59880 218786 -121187 -10939 174997 -24346 457781 139190
12482 -119991 -23362 -68123 140216 -323924 143758 328975 47637 30095 5356 -67072 233143
12470 19175 -318665 151455 -20546 -84942 -219056 -203411 -252153 -162017 -338525 105721 248081
12459 248081 -165425 26945 115567 -99389 146084 14853 -401726 -71536 -233388 327801
12448 -165207 267300 286653 -51008 -68169 125849 146562 254145 -2067 -26141 179847 99939
$$ packed form
12526A92388a05740a8731k76566I2894f6138j64041F8506c12852C99917g1228
12515A68513O256a43562A33753n1832J11099B2917J35259A1118J88465J26213
12505C25796A57092F1185c559C09963F9217M4494B563J64242p0875L0931J60528
12494B87389h5500C08157d194E9880J58906a21187a0939A74997b4346D57781A39190
12482a19991b3362m4761A40216c23924A43758J85217D7637j7542E356f7072B33143
12470A9175c18665A51455b0546o4396j34114J5645m8742R0136j76508A05721J42360
12459B48081a65425B6945Q8622i9389A46084A4853d01726g1536j61852C27801
12448a65207B67300J9353e1008j7161A25849K0713J07583b067k4074A79847p9908
$$ plain form
12437 99939 199586 -81544 72446 248560 164247 173088 -55028 85843 185710 -20793 -76239 -276199
12425 -276199 -16790 -398884 -153251 108592 -56509 154184 141891 -31806 6524 342121 -78377
12413 -204341 -224353 127915 109186 181867 304380 -30302 64498 -163624 201400 56744 50549
12402 50549 38166 3110 -83850 136780 187464 144425 -86759 -120075 49959 -153320 15911
12390 181841 184291 310309 73798 -323800 -136582 25406 315907 134986 -40914 478536
12379 31886 -504881 -214850 -256844 65864 -99116 -82968 306388 147903 -167592 468188
12368 58060 179256 -194905 -191926 101129 -234207 -47817 129005 120240 -64392 -16387 -20403
12357 -20403 -246935 504971 334445 -20492 258446 -178929 -15814 -56096 179671 -33348
$$ packed form
12437I9939R9647h1544G2446J76114q4313Q841e5028H5843R9867b0793n5446j99960
12425b76199a6790l82094a53251A08592e6509A54184j2293c1806F524L35597g8377
12413b04341k0012A27915j8729P2681J22513c0302F4498a63624B01400E6744o195
12402E0549j2383C110h3850A36780N0684m3039h6759l3316D9959a53320A5911
12390A81841K450J26018G3798c23800a36582B5406K90501A34986d0914D78536
12379C1886e04881b14850m1994F5864i9116J6148C06388A47903a67592D68188
12368E8060J21196a94905K979A01129b34207d7817A29005q765f4392a6387m016
12357b0403k26532E04971j70526b0492B58446a78929a5814m0282A79671c3348
$$ plain form
12346 -18856 -60220 150620 78176 -79133 114125 350258 -44819 493067 296007 -4898 -53830
12335 -53830 125916 248263 429555 -111254 73175 56946 143789 240337 -65273 1003 461232
12324 461232 224451 263652 228748 164626 -259040 179280 57377 -64737 -85796 48076 105697
12313 105697 400104 156356 -22984 -52651 239814 22130 40898 113630 165320 265473 216059
12302 216059 385545 123254 156485 20120 107237 162043 75324 61292 100184 -52672 272031
12290 -47118 144954 135504 121797 67912 37174 216266 -64099 -131085 108699 -22778 56944
12278 -103174 -38814 171195 -66603 76739 150262 -70512 19977 38435 255258 -76368 -106014
12267 -106014 3254 212294 125861 -74365 -9172 197879 -72627 10066 180126 431347 29462
$$ packed form
12346a8856m1364A50620p2444g9133A14125K36133d4819D93067j97060d898m8932
12335e3830A25916J22347J81292a11254G3175j6229Q6843R6548f5273A003M60229
12324D61232B24451L9201l4904o4122b59040A79280E7377f4737k1059D8076N7621
12313A05697K94407A56356b2984k9667B39814B2130J8768P2732N1690J00153m9414
12302B16059J69486A23254L3231B0120Q7117N4806G5324j4032L8892e2672B72031
12290d7118A44954r450j3707n3885l0738J79092f4099o6986A08699b2778E6944
12278a03174c8814A71195f6603G6739P3523g0512A9977J8458K16823g6368k9646
12267a06014C254K09040q6433g4365i172A97879g2627A0066J70060K51221B9462
$$ plain form
12255 347227 463757 -252056 48924 29657 -93328 48732 -11125 231478 -64798 127405 144967
12244 144967 282424 230765 382211 122711 -263511 279871 -184299 355639 -122907 38914
12233 223009 -291058 122789 93325 115430 38738 72327 348129 306138 105892 -88232 36732
12221 45409 -31133 25039 287230 -70186 123369 -205199 89306 -116870 242127 56006 37908
12210 37908 303235 318341 186760 60307 -39472 293992 83540 131987 394671 136818 194
12198 174353 275580 145132 90214 202850 -215389 186741 228089 4199 257927 429995
12188 429995 -120495 401481 218646 -73116 421810 384948 -72644 42952 342126 511229
12178 511229 162074 140852 396437 348927 429084 177107 487000 126750 306137 415390
$$ packed form
12255C47227J16530b52056D8924j9267i3328D8732a1125B31478f4798A27405J7562
12244A44967J37457n1659J51446A22711b63511B79871a84299C55639a22907C8914
12233B23009b91058A22789k9464K2105C8738L3589K75802m1991A05892h8232C6732
12221D5409c1133B5039K62191g0186A23369b05199H9306a16870B42127E6006j8098
12210C7908K65327J5106j31581F0307c9472B93992H3540M8447K62684A36818A94
12198A74353J01227j30448n4918J12636b15389A86741M1348D199K53728J72068
12188D29995a20495D01481j82835g3116D21810l6862g2644D2952K99174J69103
12178E11229A62074k1222K55585m7510Q0157A77107L09893A26750J79387J09253
$$ plain form
12168 415390 21489 179732 -21730 162725 -218360 184446 609952 -293378 52755 163877
12158 163877 64194 271424 -162596 126698 -20341 167467 206014 261115 -60609 206130
12147 -54383 -24399 342627 352914 337897 -95769 -6416 89425 -408 85632 -152105 -146866 -57587
12134 143837 72232 49735 240666 24006 420257 148681 185150 88898 91423 -64849 149521
12122 184683 -22791 25668 55929 102646 168427 180753 -123247 73195 161972 255945 67495
12110 78404 248621 665640 544627 78486 251759 171190 -245934 75686 -208303 49716
12099 218291 54353 109062 188405 -46716 -66382 111900 248628 -132940 -716 149043 116349
12088 116349 172120 177323 240479 238830 -18896 228485 -169797 72675 -57348 -133281 96934
$$ packed form
12168D15390B1489J58243b1730A62725b18360A84446M25506b93378E2755J11122
12158A63877F4194K07230a62596A26698b0341A67467L8547N5101f0609B06130
12147e4383b4399C42627J0287j5017i5769f416H9425d08H5632a52105N239e7587
12134A43837p1605k2497J90931B4006L96251A48681L6469H8898K525f4849A49521
12122A84683b2791B5668L0261M6717O5781J2326a23247G3195Q8777R3973F7495
12110G8404J70217M17019j21013G8486J73273q0569b45934G5686b08303D9716
12099B18291E4353N4709P9343d6716j9666A11900J36728a32940g16A49043l2694
12088A16349N5771N203O3156j649a8896B28485a69797G2675e7348p5933I6934
$$ plain form
12076 44908 211926 -345768 89757 -349265 65449 178579 -445475 251814 147697 187367
12066 187367 104544 -117393 33730 373656 264741 48827 -9028 -102973 -123099 94150 101907
12055 101907 172340 252310 13884 120788 34328 320646 -189889 55786 110722 302758 257997
12044 257997 67897 156970 93037 -23295 -258364 -37506 -9898 -252445 -34424 147998 25766
12032 -187489 -119726 -3888 115898 106664 136444 52070 147995 -81394 185327 79381 -28019
12020 140110 342562 106593 -203489 -82313 -34818 104931 1 230510 95902 -130827 77843
12008 98193 -7524 -15347 -188604 47349 -39225 85328 23603 -200186 -202951 144722 -199935
11996 63341 151293 -80671 -24507 -61098 23433 -74317 332930 113302 -70555 9391 -100043
$$ packed form
12076D4908J67018c45768H9757c49265F5449J13130d45475B51814j04117L9670
12066A87367q2823a17393C3730L39926j08915D8827i028r3945k0126I4150P757
12055A01907P0433P9970A3884J06904C4328K86318a89889E5786N4936J92036m4761
12044B57997F7897Q9073o3933b3295k35069c7506i898k42547c4424A47998B5766
12032a87489O7763c888A15898r234K9780E2070R5925h1394A85327G9381b8019
12020A40110K02452A06593b03489h2313c4818A04931AK30509I5902a30827G7843
12008I8193g524p823j73257D7349c9225H5328B3603b00186k765A44722a99935
11996F3341Q7952h0671b4507l6591B3433g4317C32930A13302g0555I391a00043
$$ plain form
11984 -44391 -101747 82413 3747 -44422 -31592 -102427 -311024 -172158 228460 64708 -71865
11972 577 -49982 223844 -380706 -595658 161828 -77595 -68382 -59157 340021 -100395 -173436
11961 -173436 -138680 273149 -86361 222069 10394 35022 247593 -205797 28301 -69333 179242
11949 -118098 81604 -124943 118621 -144181 136820 -246011 -29648 196726 -115025 -15889
11938 96851 -18190 -69185 -49336 -270306 -227448 140507 190116 -220159 -156902 -65184 48664
11926 -191544 45980 76533 -155903 -3844 -25592 -50056 113323 -140873 38288 -229692 -292893
11915 -292893 -213359 94013 163647 -112052 -3387 -155500 -328169 -146675 83983 94505 200625
11904 200625 42033 -7366 -97506 260037 -34992 163416 -388266 216059 -227513 235192
$$ packed form
11984d4391n7356H2413C747d4422J2830p0835k08597J38866B28460F4708g1865
11972E77d9982B23844c80706k14952A61828g7595R213R225C40021a00395p3041
11961a73436L4756B73149h6361B22069A0394K4628K12571b05797B8301f9333A79242
11949a18098H1604a24943A18621a44181A36820b46011b9648A96726a15025a5889
11938I6851a8190n0995J9849k20970M2858A40507M9609b20159O3257f5184D8664
11926a91544D5980L0553a55903c844k1748k4464A13323a40873C8288b29692o3201
11915b92893P9534I4013O9634a12052c387j52113j72669a46675H3983J0522J06120
11904B00625D2033g366r0140B60037c4992A63416c88266B16059b27513B35192
$$ plain form
11893 -50432 -361680 143649 -241152 -116676 -185159 -164199 -402548 -91170 -29047 -242106
11883 -242106 281542 -57338 492695 53642 -120083 62005 88334 -132159 76001 71292 -91983
11871 -244312 -121821 -13995 197412 -167704 -303381 -75198 -191588 -19315 -105256 -159450
11861 -159450 138112 -180756 -309077 -268299 -151467 -26405 -242803 -380823 -114018 -68281
11851 -68281 -212206 -127121 2303 -162532 300843 -210717 84333 214652 34389 101115 86249
11840 86249 -110268 201908 114270 -80968 6674 -123898 -155810 55386 158750 276237 -64074
11828 27008 -168806 -260429 58087 -2442 -150217 533860 -192219 -112010 -132110 -31530 45400
11816 51826 97282 380146 -37864 -51621 -467393 -111260 -5058 -169833 -195003 63702 77683
$$ packed form
11893e0432l11248A43649b41152a16676o8483K0960k38349i1170b9047k13059
11883b42106B81542e7338D92695E3642a20083F2005K6329a32159G6001m709i1983
11871b44312a21821a3995A97412a67704j35677g5198j16390a9315q5941n4194
11861a59450A38112a80756j28321M0778J16832b6405k16398j38020a14018M5737
11851f8281j43925Q5085B303a62532C00843b10717H4333J30319C4389O6726j4866
11840H6249a10268B01908q7638h0968F674a23898l1912E5386J03364J17487f4074
11828B7008a68806r1623E8087b442j47775E33860a92219Q0209k0100c1530D5400
11816E1826M5456K82864c7864j3757m15772a11260e058j64775k5170F3702J3981
$$ plain form
11805 77683 -335211 105861 -36342 69832 55001 -212776 67688 203238 -60804 79881 -75265
11793 180320 -254944 -143050 135700 49940 -316923 46531 -159418 -114962 7218 -65176 -185824
11782 -185824 -13078 -346641 72374 -372252 23828 -12138 -11239 151071 -165570 -111719 110348
11770 29424 60284 98046 -105606 -138270 159002 42046 41964 54237 -209032 95179 -172137
11758 58444 -56099 21489 116081 -117042 220191 -214803 6038 -314306 -253524 71064 -34906
11746 -205611 168612 71349 12760 10106 102492 74561 -320277 -152508 -469569 -151984 -414018
11735 -414018 53307 138674 80367 -6582 -29459 -52572 -78052 -272362 8634 -153102 -27728
11723 142106 -70216 230820 -32794 -24268 72722 -58203 -591151 206846 -124524 -78255 -286549
$$ packed form
11805G7683c35211A05861c6342F9832j4831b12776F7688J35550f0804G9881g5265
11793A80320b54944J11894A35700D9940c16923D6531a59418M4456G218f5176j20648
11782a85824a3078l33563G2374c72252B3828a2138Q99A51071a65570N3851A10348
11770B9424L0860L7762a05606l2664A59002D2046q2J2273b09032I5179a72137
11758E8444e6099B1489R4592a17042B20191b14803F038c14306O0782G1064c4906
11746b05611A68612G1349A2760k654R2386k7931c20277a52508l17061a51984k62034
11735d14018E3307Q5367n8307f582k2877k3113k5480j94310H634a53102b7728
11723A42106g0216B30820c2794Q526G2722e8203n32948B06846a24524M6269k08294
$$ plain form
11712 -286549 24774 -337620 17943 -104536 336572 -284535 -154019 16822 -103166 76095
11701 9840 -53973 -21086 -311172 -225027 -114034 -74473 -293893 268547 -48299 70160 -281066
11689 -129132 -146014 -48019 -76365 118662 174945 7260 -152796 -223790 -119635 -275450 -163984
11678 -163984 -165812 -17979 528051 154276 2109 -91077 9720 82145 -6678 -127721 25425 -34863
11665 -191718 -31849 -214438 25929 -164079 277514 35674 -104000 -217661 59322 185470
11655 185470 -106925 110955 180920 113503 -101628 -329 -43728 -337610 -38470 -59897 -2004
11643 -93137 -75977 -171231 202968 -176616 91921 125995 111220 -86335 -191451 -49226 144852
11631 5481 200804 280822 22894 80897 278572 -263141 276968 22174 65676 45929 -380171
$$ packed form
11712b86549B4774c37620A7943a04536C36572b84535J30516A6822a03166G6095
11701I840e3973b1086k90086Q6145J10993L9561k19420B68547d8299G0160b81066
11689a29132j6882d8019k8346A18662N6283G260a52796p0994J04155j55815J11466
11678a63984j828a7979E28051A54276B109i1077I720P2425f678j21043B5425c4863
11665a91718c1849j82589B5929a64079B77514C5674a04000j13661E9322J26148
11655A85470a06925A10955O9965o7417a01628c29m3399k93882c8470k1427b004
11643i3137J7160r5254B02968a76616I1921L4074j4775h6335j05116d9226A44852
11631E481J95323Q0018B2894N8003J97675b63141B76968B2174M3502j9747c80171
$$ plain form
11619 312608 61525 190743 -177619 -129352 156364 -184232 -160153 -493308 -24927 31753
11608 -101634 -388175 -133442 -28279 -46286 -40115 -101018 122124 -1707 25624 104554 -71460
11596 121108 -341706 -130048 210992 -20650 39010 211908 129878 -91986 -76694 -72249 157210
11584 120358 33299 -60539 -79760 101223 -17726 -264077 37077 -74684 -121664 1847 181704
11573 181704 94597 114989 -27836 145297 240030 -85636 -128767 -83179 154080 -87651 200958
11561 87336 -348493 -105120 -103520 301345 -326735 -9523 1725 -475548 12760 93760 68845
11550 68845 252 309880 -96812 2777 225009 280245 -219466 -201878 -58008 -193054 -116855
11539 -116855 -183932 86130 97670 65540 31537 184373 -222703 -31289 38184 -9851 -194502
$$ packed form
11619C12608F1525J29218a77619M8267A56364a84232K4079l33155b4927C1753
11608a01634k86541a33442b8279j8007O171o0903A22124a707B5624P8930g1460
11596A21108c41706a30048B10992b0650C9010J72898q2030i1986J5292M445A57210
11584A20358C3299f0539j9221A01223a7726k46351C7077g4684m6980A847J79857
11573A81704q7107K0392b7836A45297R4733h5636m3131M5588A54080h7651B00958
11561H7336c48493a05120J600C01345c26735i523A725d75548A2760Q1000k4915
11550F8845B52L09628i6812B777K22232N5236b19466J7588e8008j35046P6199
11539a16855o7077H6130J1540l2130C1537J52836b22703c1289C8184i851j84651
$$ plain form
11528 -194502 -285345 108968 1242 -189772 205849 25831 260006 128345 -231113 375402
11517 130755 -4837 123840 -204349 233591 198650 200666 -86290 7978 -139 -198093 -298224
11506 -298224 152778 16837 -110815 11154 423721 -275855 352461 -29372 9924 198701
11496 198701 201077 147705 -313723 107930 171384 21644 398633 209777 143381 493539 67433
11484 28488 235779 -74068 19909 -353235 -245930 -73077 -246431 -81778 131311 -91079 220665
11472 -71721 -109926 165002 367766 161019 32619 -126513 -170224 178454 166632 97340 53766
11461 53766 38534 231044 195958 284948 56325 95695 -240042 -309839 244595 95213 211517
11450 211517 -11722 300862 82282 -36537 484884 3709 -191922 162817 -169337 73351 204421
$$ packed form
11528a94502r0843A08968A242a89772B05849B5831K34175A28345b31113C75402
11517A30755d837A23840b04349B33591l4941K016h6290G978a39j97954j00131
11506b98224A52778A6837a10815A1154M12567b75855C52461b9372I924J88777
11496A98701K376n3372c13723A07930O3454B1644L76989j88856o6396L50158F7433
11484B8488K07291g4068A9909c53235J07305g3077j73354h1778A31311i1079B20665
11472g1721l8205A65002K02764A61019C2619a26513m3711A78454j1822o9292m3574
11461E3766j5232J92510l5086Q8990E6325L9370b40042o9797B44595I5213J16304
11450B11517a1722C00862H2282c6537D84884C709a91922A62817a69337G3351J31070
$$ plain form
11439 204421 -203038 488802 -298538 440047 87182 -153162 31817 -439335 -45089 254332
11428 170613 291260 17476 93056 -231959 269913 -23837 -14738 -188149 91871 67636 52165
11417 52165 -242633 161883 173895 244901 245365 -84759 -112316 105261 -34351 -219971 109827
11405 42472 276461 17629 138575 -225947 103402 100582 127550 8570 -263737 74934 -97212
11393 287689 68999 60308 -66134 -62004 11606 52427 32840 -428610 -51764 185490 78257
11381 2329 -95374 396555 -183342 -144376 207472 -145865 -82582 50545 -20164 -185840 -123292
11370 -123292 -43399 55236 74276 -587911 272662 113185 50417 5131 27122 -163192 290806
11358 56581 -60731 185850 138961 -285769 38496 -66161 77215 -82671 -316015 227048 -42293
$$ packed form
11439B04421b03038D88802b98538D40047H7182a53162C1817d39335d5089B54332
11428A70613J20647A7476P5580b31959B69913b3837R099j73411I1871k4235j5471
11417E2165b42633A61883J2012P1006M64h4759k7557A05261c4351j85620A09827
11405D2472K33989A7629J20946b25947A03402k820K6968H570b63737G4934i7212
11393B87689F8999q691f6134M130A1606M0821j9587d28610e1764A85490G8257
11381B329i5374C96555a83342L8966B07472a45865O3283E0545b0164j65676O2548
11370a23292d3399E5236J9040e87911B72662A13185E0417E131K1991a63192B90806
11358E6581f0731A85850m6889b85769C8496f6161G7215h2671k33344B27048d2293
$$ plain form
11346 -210624 310623 -99494 -118869 -106716 -17865 60956 46688 -260575 10253 -8864 130346
11334 -87411 99819 -345734 117005 -244430 -82148 134310 -321898 23871 -34461 -96269 70449
11322 60269 49327 53174 -144169 309530 -36362 -230503 333380 104181 256906 -135663
11311 268452 157064 -240429 -32079 -103373 -36845 71415 -96519 79757 232976 -453900 186922
11299 4864 128856 50839 27222 104768 249248 33282 115946 -79399 -141611 69698 47264
11288 47264 -236191 232655 -194458 38902 -218559 6700 -158612 -216085 104534 -95479 -8154
11276 -98003 104613 -135710 -110094 10688 129869 -135309 -230025 -243040 -174908 255584 -280717
11264 -240873 123579 -242829 -237246 -167170 116261 -383602 25795 -43247 -99509 -197670 -475480
$$ packed form
11346b10624C10623i9494j9375J2153a7865F0956j4268b60575A0253h864A30346
11334h7411I9819c45734A17005b44430h2148A34310c21898B3871c4461o1808G0449
11322F0269j0942L847a44169C09530c6362j94141C33380A04181J52725a35663
11311B68452j11388b40429c2079p1294c6845G1415i6519G9757J53219d53900A86922
11299D864J23992E0839k3617P7546J44480C3282Q2664g9399o2212F9698k2434
11288D7264b36191B32655a94458C8902b18559F700a58612n7473A04534i5479h154
11276i8003A04613a35710K5616A0688J19181a35309r4716j3015O8132B55584b80717
11264b40873A23579b42829N583P0076A16261c83602B5795d3247n6262r8161k77810
$$ plain form
11253 -475480 -233419 350459 -79702 26100 -53909 101735 76950 64454 -225876 77637 -63036
11241 -31764 -286329 -466000 150426 -95677 142784 65330 31809 252359 18702 -107478
11230 -155545 -276195 75730 -157673 -8513 -217451 254412 24043 61112 239523 -270855
11219 126014 107808 -117165 -45742 -110455 -106033 55722 174188 -338976 113376 -111057 -134392
11208 -134392 -5382 -115313 33955 329789 -47079 -181652 -607149 205624 -178212 141027
11197 160497 -120765 -203858 -53846 250945 -61172 -201010 168909 -46559 -62685 230788
11186 -113820 203463 -36892 264216 -33796 -66267 -115755 57421 108650 -15306 -211904 -68834
11174 -157742 -47927 10575 -243910 -205004 -308993 78611 -196336 -94816 -150699 102078 -243785
$$ packed form
11253d75480b33419C50459g9702B6100e3909A01735k4785j2496b25876G7637f3036
11241c1764k54565j79671A50426i5677A42784F5330C1809K20550A8702a07478
11230a55545j20650G5730a57673h513k08938B54412B4043L7069J78411b70855
11219A26014j8206a17165d5742o4713M422E5722J18466c38976A13376a11057k3335
11208a34392e382j09931C3955K95834d7079j34573m25497B05624a78212A41027
11197A60497a20765q3093e3846B50945f1172j39838A68909d6559j6126B30788
11186a13820B03463c6892B64216c3796l2471m9488E7421N1229a5306j96598f8834
11174a57742d7927A0575b43910L8906j03989G8611a96336i4816n5883A02078b43785
$$ plain form
11162 -110481 203911 -30086 -50512 161302 81791 -239942 -55460 -107663 -198964 -234121 125825
11150 5049 56154 -185655 -92568 310451 3231 219239 -153303 12309 -156020 -225626 66949
11138 139670 170692 41589 120506 -59260 -110967 -2712 83709 -34274 186920 76751 -133253
11126 71541 -53885 257684 348094 -193307 -271551 59813 -111622 102488 116559 -136144 -14398
11114 306719 -74236 -18216 116362 -123939 60525 92366 -116572 135036 -64670 162542
11103 197379 -106466 211556 63557 97675 61359 20903 119604 -26900 17968 -44901 209466
11091 251297 -163330 190077 193049 140422 -41231 -2036 311538 378571 -66722 148578 -30189
11079 357439 -40802 101340 280932 -127203 58296 146024 75512 253322 141712 -139815
$$ packed form
11162a10481B03911c0086k0426A61302p9511b39942e5460n2203r1301l5157A25825
11150E049N1105a85655i2568C10451C231K16008a53303A2309a56020o9606F6949
11138A39670L1022D1589P8917e9260n1707b712H3709c4274A86920G6751a33253
11126G1541e3885B57684R0410a93307p8244E9813a11622A02488J4071a36144a4398
11114C06719g4236a8216A16362a23939F0525L1841a16572A35036f4670A62542
11103A97379a06466B11556F3557L4118l6316B0903R8701b6900A7968d4901B09466
11091B51297a63330A90077K972n2627d1231b036C11538O7033f6722A48578c0189
11079C57439d0802A01340J79592a27203E8296Q7728p0512J77810j11610a39815
$$ plain form
11068 -19316 196348 295698 72654 74132 259431 98048 392882 131791 104452 63310 232319
11057 232319 192476 154377 475104 138628 259899 325376 190090 204359 73043 213886
11047 213886 468727 510297 163015 348918 348389 577266 310543 375045 490262 475933 491363
11036 491363 595594 770590 294530 568615 613319 427935 545399 768611 506745 767261
11026 767261 541240 621640 703080 356518 888750 687636 530245 761496 539331 725476
11016 725476 510881 397833 497657 810558 724194 547609 418342 573111 687377 792979
11006 792979 658406 624799 875601 624391 419718 710595 782206 564067 593192 405733
10996 405733 482763 951977 352497 547357 693670 723483 444244 623247 388913 567271
$$ packed form
11068a9316A96348R9350G2654J478J85299I8048K94834A31791k7339m1142J69009
11057B32319l9843l8099L20727A38628J21271O5477j35286J4269G3043J40843
11047B13886K54841M1570A63015J85903n29K28877k66723O4502J15217j4329J5430
11036D91363J04231J74996B94530K74085M4704j85384J17464K23212k61866K60516
11026G67261k26021Q0400Q1440l46562N32232k01114j57391K31251k22165J86145
11016G25476k14595j13048R9824L12901q6364j76585j29267J54769J14266J05602
11006G92979j34573l3607K50802k51210k04673K90877P1611k18139K9125j87459
10996D05733P7030M69214C52497J94860J46313K9813k79239J79003k34334J78358
$$ plain form
10986 567271 366480 492455 513593 609867 382492 556707 907408 695046 308692 514029
10976 514029 714553 619445 816231 279117 571815 607559 372582 588558 604146 649295
10966 649295 383644 696846 875162 817962 1089908 1056312 1139307 1089306 1672611 1821812
10956 1821812 1710655 2044015 2180136 2143244 2309845 2161467 2706304 2464301 2068016 2415400
10946 2415400 2385047 1860750 1695378 1209022 1481552 799016 1154339 881766 695614 912190
10936 912190 1231906 898427 736193 641098 587889 1484 408262 334010 -29571 333390 -1504
10924 148005 200517 -127245 399038 370035 106561 165678 246862 172432 338931 169799
10914 169799 76620 -93339 219104 165665 15067 -49764 155927 -2294 74210 20637 23805
$$ packed form
10986E67271k00791J25975K1138R6274k27375J74215L50701k12362C08692K05337
10976E14029K00524r5108J96786B79117K92698L5744k34977K15976J5588M5149
10966F49295k65651L13202J78316n7200K71946l3596Q2995n0001N83305J49201
10956A821812j11157L33360J36121l6892J66601j48378N44837k42003l96285L47384
10946B415400l0353n24297j65372m86356K72530o82536L55323k72573j86152K16576
10936I12190L19716l33479j62234r5095n3209A484M06778p4252b9571C33390a504
10924A48005N2512a27245C99038k9003A06561N9117Q1184p4430J66499j69132
10914A69799G6620i3339B19104n3439A5067d9764A55927b294G4210B0637L168
$$ plain form
10903 23805 147090 -24786 -269793 -169531 44311 400899 308050 161426 45729 205266
10893 205266 117988 -197525 95319 -184121 -127130 -70241 31439 -85654 -333038 -199348 -314651
10882 -314651 -191769 -303230 -1669 160009 -120960 -192116 -160816 -112401 -161148 103501 -7137
10870 30117 -236763 -278118 276804 353006 200725 47592 399475 88414 -187620 -160585 209267
10858 37974 -106496 -66210 -492900 -200542 38816 91552 -288928 -310987 64680 41230 52906
10847 52906 -189436 -77233 24017 -97769 31120 151345 227045 -11724 -16042 64378 29863
10835 -207669 358684 -92420 -79859 -286890 298998 36794 12748 -184924 -86423 80014 -69402
10823 -133114 -187060 346790 -13548 -250252 -52828 117163 -314690 -207408 362610 -224103
$$ packed form
10903B3805J23285b4786k45007J00262D4311L56588r2849j46624D5729J59537
10893B05266q7278a97525I5319a84121N6991N6889C1439h5654k47384J33690j15303
10882c14651J22882j11461a669A60009a20960p1156L1300M8415m8747A03501g137
10870C0117b36763m1355B76804P6202j52281D7592L51883H8414a87620K7035B09267
10858C7974a06496M0286m26690b00542C8816N2736b88928k2059F4680k3450J1676
10847E2906a89436g7233B4017i7769C1120J20225P5700a1724m318F4378B9863
10835b07669C58684i2420J2561k07031B98998C6794A2748a84924h6423H0014f9402
10823a33114n3946C46790a3548k36704e2828A17163c14690J07282C62610b24103
$$ plain form
10812 -203262 102456 46570 -140203 -32338 -231810 305989 -56525 32650 -196811 -173020
10802 -173020 -130914 77180 -160816 -106269 84881 49627 -330423 -107661 -52434 -36159 -9620
10790 -295980 -294433 64715 -47706 -89411 271580 203802 -165452 162466 -68394 -196040 322542
10778 -116504 -4536 -163865 24034 -373193 234682 151857 -195721 -359805 -279311 -56837 254995
10766 -137360 -108830 -112776 -141482 -95651 -492924 20984 -18329 147814 55905 29374 -262456
10754 72243 128268 35927 189559 -22083 49072 267898 -37273 -48388 6649 223181 13495
10742 -26130 68150 -145952 -15081 -209789 -76941 -128727 195537 -266824 136704 16184 -194046
10730 -14888 -98656 161112 -172155 -178280 200549 56895 21304 -239348 -253126 42016 -13095
$$ packed form
10812b03262A02456D6570a40203c2338j99472C05989e6525C2650a96811K3791
10802a73020M2106G7180a60816N4547H4881l5254c30423a07661e2434J6275i620
10790b95980J547F4715d7706m1705B71580o7778a65452A62466f8394j27646C22542
10778a16504d536j59329B4034c73193B34682q2825a95721j64084Q0494e6837B54995
10766a37360K8530l946k8706M5831l97273B0984a8329A47814E5905k6531b62456
10754G2243N6025C5927J53632b2083D9072K18826c7273j1115F649K16532A3495
10742b6130F8150a45952a5081j94708g6941n1786A95537b66824A36704A6184a94046
10730a4888q3768A61112a72155o125B00549E6895B1304b39348j3778D2016a3095
$$ plain form
10718 -46644 -132667 -30723 -125940 70748 21909 -182512 -95970 24568 63351 -135975 -49134
10706 -116920 45086 -14000 163925 -108717 -136844 -16385 -34977 -333534 -48184 -138058 144498
10694 58206 303731 -83073 -460236 -57444 -327507 117562 -155987 109860 -80703 -151647
10684 -151647 -3895 -132663 -171651 -144555 -75032 -3933 -94356 -210352 44367 -222128 -163553
10673 -163553 122007 -233868 -161155 233820 126049 -417541 242364 -31165 -60846 -82136
10663 -82136 -302744 131532 -281465 -84280 8461 101787 -146650 20088 53040 -37319 -341161
10652 -341161 -265752 -255096 -79325 -77335 -176369 -322615 -195349 188963 -281155 -11454 -240112
10641 -240112 30066 -309271 -399133 -109335 -319982 113377 208896 -112436 45640 -127032
$$ packed form
10718d6644q6023c0723r5217G0748B1909a82512Q6542B4568L8783a35975d9134
10706a16920D5086a4000A63925a08717k8127a6385j8592k98557d8184q9874A44498
10694E8206K45525h3073l77163e7444k70063A17562a55987A09860h0703p0944
10684a51647c895j28768l8988K7096O9523c933r0423j15996D4367b22128N8575
10673a63553A22007b33868P2713B33820j07771d17541B42364c1165k9681k1290
10663h2136k20608A31532b81465h4280H461R3326a46650B0088L2952c7319l03842
10652c41161P5409J0656g9325J990r9034j46246J27266A88963b81155a1454k28658
10641b40112C0066c09271q9862a09335k10647A13377R5519a12436D5640a27032
$$ plain form
10630 4075 -370835 -4039 -21812 186539 -17977 7402 -64314 77066 258879 63421 -154942
10618 -170806 -171697 -115051 -67476 -57779 96702 -80703 42739 31527 -15267 -122688 59234 -168824
10605 183669 20263 54991 -208769 -329982 127971 -101760 -162586 -111576 -187730 4247 106756
10594 106756 -348362 -162888 -33281 -20464 -361803 29055 11320 117177 -187650 -31349
10583 -49744 -272816 21366 -135758 -148518 -149226 -332304 -87821 -350365 -164318 -237272 -273432
10572 -273432 -20188 87883 -134976 -71098 15990 -89780 509311 101842 65608 -132143 -73766
10561 -73766 -7977 189616 99881 8073 53241 -177810 -387262 106046 174814 -183808 -509
10549 -53106 -17186 16574 93156 -20478 -336274 153308 140296 -123156 162743 -111237 -228320
$$ packed form
10630D075c70835d039j7773A86539a7977G402f4314G7066J81813F3421a54942
10618a70806q91N6646M7575R697I6702h0703D2739j1212a5267j07421E9234a68824
10605A83669B0263L4728b08769j21213A27971a01760o0826N1010p6154D247J02509
10594A06756c48362a62888c3281J2817l41339B9055A1320J05857a87650c1349
10583d9744k23072B1366a35758j2760p08j83078h7821k62544a64318p2954l6160
10572b73432b0188H7883a34976O3878A5990h9780E09311A01842l6234a32143N8377
10561g3766g977A89616q9735H073M5168a77810k09452A06046O8768a83808e09
10549e3106a7186A6574P6582b0478l15796A53308j3012a23156A62743a11237j17083
$$ plain form
10538 -228320 -38278 -15122 -97345 -245826 222176 119691 -54883 26195 -61505 24083 -12668
10526 85068 -47709 -260386 -161112 202343 -6481 -89352 -80033 -55379 24948 -83064 -122676 4752
10513 -11922 56939 -10432 101531 -150682 -39485 -294563 -122920 -80405 128753 215146 -261088
10501 110273 74145 -264721 29984 -207226 79489 -440 -121989 -1606 -123795 -130721 274828
10489 -67177 -265649 59885 -145731 70623 -151035 345038 68087 -86164 -12324 191387 -229654
10477 -116096 -16871 -201514 165947 -135768 -277835 -243254 -41270 -26931 -28976 218012 -278771
10465 -143751 -50998 196307 189667 34716 -264725 -138606 -37843 -36055 -102120 -161037 303750
10453 -9427 -70734 -102970 333918 146882 -377 198364 -160380 -110791 -161311 -133666 -62965
$$ packed form
10538b28320c8278a5122q2223j48481B22176j02485e4883B6195f1505B4083a2668
10526H5068d7709k12677R9274B02343f481q2871R319K4654B4948h3064l9612D752
10513a1922E6939a0432A01531a50682c9485k55078a22920M2515A28753Q6393b61088
10501A10273l6128b64721B9984b07226G9489d40j21549a606j22189o926B74828
10489f7177j98472E9885a45731G0623a51035C45038F8087h6164a2324A91387b29654
10477a16096a6871j84643A65947a35768j42067L4581d1270J4339k045B18012b78771
10465a43751e0998A96307o640C4716b64725J26119c7843J788o6065n8917C03750
10453i427o1307l2236C33918A46882c77A98364a60380M9589n0520K7645f2965
$$ plain form
10441 69742 54481 66820 68961 -210352 -202484 29572 -153193 -255678 320087 113079 -337992
10429 132943 -159617 97900 124649 -104813 -365736 -81160 -64815 196078 288588 -129824
10418 102152 -321777 -72409 -273089 136072 34139 -44485 -70172 -79493 -204927 166990 -147954
10406 -36401 11213 -22676 -159221 65915 -172524 -369320 -206979 -170929 -220760 12468 63811
10395 63811 152346 -60652 106659 -201073 -421436 -59944 163998 57645 33586 215228 120432
10384 120432 -28003 -23865 112793 89583 -185019 151872 173533 -169657 -29478 -229873 92822
10372 -1480 363554 -30357 -13999 268859 55359 270197 400630 97652 321172 165183 -33947
10360 -75108 354385 287743 137245 136112 -63843 272940 306360 -30843 10208 143897 401171
$$ packed form
10441F9742j5261J2339K141b10352P868B9572a53193j02485C20087A13079c37992
10429A32943a59617I7900K6749a04813k60923h1160J6345A96078R2510a29824
10418A02152c21777g2409k00680A36072C4139d4485k5687r321j25434A66990a47954
10406c6401A1213b2676j36545F5915a72524j96796J62341L6050m9831A2468N1343
10395F3811Q8535f0652A06659b01073k20363e9944A63998E7645k4059J81642r4796
10384A20432b8003M138A12793k3210a85019A51872K1661a69657b9478k00395I2822
10372a480C63554c0357a3999B68859E5359K14838J30433I7652K23520j55989c3947
10360g5108C54385o6642A37245j133f3843B72940L3420c0843A0208J33689K57274
$$ plain form
10349 401171 215112 613809 649407 661813 158446 280165 197721 124071 -140019 57884
10338 260408 261785 378134 331207 -126855 268954 357907 353045 558793 503448 287839 239241
10327 239241 -14869 180795 140595 344 755812 181168 -61135 196715 479385 169098 28798
10315 59355 217898 298525 218484 240519 2207 75404 147827 303256 375815 -55841 467292
10303 133088 122428 -133284 -207574 -91086 126506 -242786 -111548 -198258 3180 151161 34556
10291 12729 151418 126659 -11969 147012 -147474 -54581 195633 -161157 139051 163997
10281 163997 234740 71053 140725 -188998 138581 -284619 -213190 153033 -276243 70095
10270 3900 -15561 -190262 90409 4917 47259 58442 56314 -96141 -30394 -277569 83632 165217
$$ packed form
10349D01171j86059L98697L5598J2406A58446J21719q2444p3650a40019E7884
10338B60408J377J16349m6927a26855B68954Q8953m862K05748n5345k15609m8598
10327B39241a4869A80795m0200C44P55468A81168f1135A96715K82670A69098B8798
10315E9355J58543Q0627q0041K2035B207P3197P2423J55429P2559e5841D67292
10303A33088j0660a33284p4290i1086A26506b42786a11548q6710C180J47981C4556
10291A2729J38689k4759a1969A47012a47474e4581A95633a61157A39051K4946
10281A63997P0743G1053O9672a88998A38581b84619P1429A53033b76243G0095
10270C900a5561j74701I0409D917M2342J1183k128i6141c0394k47175H3632Q1585
$$ plain form
10258 165217 -122332 72787 48268 -324606 83438 162906 -2141 298503 270354 -204016 -51118
10246 -43420 170184 34476 41581 79203 47228 -238833 -107863 -25247 174629 -55083 -8560
10234 -147508 -158829 74582 398559 196930 -137890 122270 17927 -164702 -89124 -265807
10224 -265807 96862 -33494 -8531 3067 74319 -97707 63197 -136895 -169014 277491 -72850
10212 81116 -225589 -66816 41341 76867 305249 101258 4860 -89717 -189699 -262280 305975
10200 -137330 -261670 15763 -26005 365704 -3336 -435971 163148 38305 -18090 -194889 53167
10188 -105702 -39537 -169928 -256789 271083 169 233424 161245 -294922 99971 -94626 -426590
10177 -426590 247793 -270866 -285479 346235 -63396 -128001 28317 56094 -31965 14864 -400304
$$ packed form
10258A65217a22332G2787k4519c24606H3438P9468b141B98503k8149b04016e1118
10246d3420A70184C4476P105L7622l1975b38833a07863b5247A74629e5083h560
10234a47508j1321G4582L23977A96930a37890A22270A7927a64702P5578j76683
10224b65807I6862c3494h531C067P1252i7707F3197a36895l2119B77491g2850
10212H1116b25589f6816D1341L5526K28382A01258D860h9717r9982p2581C05975
10200a37330j24340A5763b6005C65704c336m32635A63148C8305a8090j76799E3167
10188a05702c9537j30391q6861B71083A69K33255p2179b94922I9971i4626l31964
10177d26590B47793b70866j4613C46235f3396o4605B8317K7777c1965A4864d00304
$$ plain form
10165 -156171 41411 -133853 -61799 131474 118544 -294450 -174390 31038 -437194 4759 -116580
10153 -380799 -360111 284062 -44919 18950 -45018 118434 -219370 -66326 263261 82094 -423180
10141 73395 -138047 -207994 -130056 -283207 -188331 -269594 107605 -283727 66312 63914 63812
10130 63812 -284477 -146248 -18924 -206044 -163805 -125691 -81305 -253181 -40266 -1179 54549
10118 -150625 107538 52538 -193310 -224110 -81884 31101 -29387 -182715 -188594 -225410 -116158
10107 -116158 -68407 -37648 474083 -37164 58666 157481 -46026 -103830 -314527 -41655 37095
10095 -153429 19923 -76614 66858 -100802 51250 -295057 295737 -312985 -182614 62696
10084 -117311 -211587 -458027 421620 -148619 -279229 -325476 -392747 -73653 150498 1118 -55940
$$ packed form
10165a56171D1411a33853f1799A31474j2930b94450J20060C1038d37194D759a16580
10153c80799K0688B84062d4919A8950d5018A18434b19370f6326B63261H2094d23180
10141G3395a38047o9947P7938j53151R4876q1263A07605b83727F6312k398j02
10130F3812b84477J38229a8924j87120M2239L8114M4386j71876d0266a179E4549
10118a50625A07538E2538a93310l0800h1884C1101b9387j53328n879l6816J09252
10107a16158M7751L0759D74083c7164E8666R8815d6026n7804k10697d1655C7095
10095a53429A9923g6614F6858a00802E1250b95057B95737c12985J30371F2696
10084a17311r4276k46440D21620a48619j30610m6247o7271g3653A50498A118e5940
$$ plain form
10072 71821 -149038 -522561 -141094 57812 -176010 136808 -140615 -317845 -160603 197606
10061 -63804 -129100 -52628 -231730 -35857 -41183 20770 170535 -165287 352309 -49928 176214
10049 -318357 48162 -202621 -236029 47190 106711 -161402 203516 280890 75488 -46409 26165
10037 -167954 -105043 39362 -94798 76732 -72192 52555 35399 -198473 -305841 59313 31896
10026 31896 348788 9348 -327143 179276 -6822 -82079 -149766 336237 -244777 -467582 -65658
10014 149072 -305657 125094 -295012 -212053 -336321 -119186 -38329 -144425 -110073 -262055
10004 -262055 29929 -312868 54698 -274154 -134174 -30616 -37648 6643 -238394 -238989 207293
9992 79560 -113700 -278115 -237604 -408753 -281865 -113188 9534 -177707 -119772 -205200 -159878
$$ packed form
10072G1821a49038l73523a41094E7812a76010A36808a40615j77230J57242A97606
10061f3804o5296e2628j79102c5857n326B0770J49765a65287C52309d9928A76214
10049c18357D8162b02621l3408D7190N9521a61402B03516P7374G5488d6409B6165
10037a67954O2911C9362i4798G6732g2192E2555j7156a98473j07368E9313k7417
10026C1896L16892I348c27143A79276f822p5257o7687C36237b44777k22805f5658
10014A49072c05657A25094b95012Q2959j24268a19186c8329j06096L4352j51982
10004b62055B9929c12868E4698b74154a34174c0616p032F643b38394n95B07293
9992G9560a13700j64415M0511j71149J26888a13188I534a77707N7935q5428M5322
$$ plain form
9981 -159878 183893 -157114 92667 88655 -29432 -34042 127289 -261681 72853 5352 -1296 -378948
9969 -378948 -467247 85800 -9500 -212902 136888 118814 -76630 44969 136865 16933 269490
9958 269490 -19692 -479327 -261696 18221 -329653 -21027 -442151 -105778 215116 52702
9947 -259849 201550 -174566 88547 -359229 -174255 -158707 -103979 -98048 -160144 546514 565
9935 -311588 -143039 -96945 -51411 -43869 -191160 8162 216060 -283660 67194 -212814 54524
9923 31167 -54656 -246999 265805 139892 -115731 -61252 -13614 -218995 72043 -126861 -10175
9911 23477 -242080 136318 -224796 40061 76102 -18324 -53065 56307 24723 14061 -244157
9899 -68965 -23830 -133961 451 -216043 102501 181505 143954 -366050 -68912 105804 -12903
$$ packed form
9981a59878A83893a57114I2667m012b9432m610A27289b61681G2853E352a296l77652
9969c78948q8299H5800i500k03402A36888j8074g6630D4969R1896A6933K52557
9958B69490a9692m59635K17631A8221c29653b1027m21124a05778B15116E2702
9947b59849B01550a74566H8547c59229a74255J5548N4728N931o2096E46514E65
9935c11588a43039M6094M5534P542j47291H162K07898b83660F7194b12814E4524
9923C1167e4656j92343B65805j25913a15731N4479a3614k05381G2043a26861a0175
9911B3477b42080A36318b24796D0061L6041a8324l4741E6307B4723j0662b44157
9899f8965b3830j10131D51b16043A02501P9004l7551c66050f8912A05804a2903
$$ plain form
9887 -33454 137564 -260555 -43617 -73031 -233893 -166565 219483 -134107 -217199 -163864 -286450
9876 -286450 -44925 -91034 72258 30825 280552 -43174 -11914 -215969 -146647 67820 -227189
9864 123240 -230182 -134278 89788 -20243 27366 -196606 412452 -7924 -90423 -395285 147260
9852 8551 -230219 -198224 -33189 97841 -123119 -515106 45541 -44770 86922 -153123 -137754
9841 -137754 -128586 -300680 -124616 88112 -211022 -32937 44775 182432 -56410 -98165 -150047
9830 -150047 211792 -155583 -10926 -204701 334532 100841 -268654 -252756 237971 33979
9819 112301 -255164 -75985 -59588 50202 -99051 -165424 132252 -104223 -212017 -63131 -11614
9807 -166595 -177273 -56739 -126968 -113209 -224805 -298029 138745 -387945 -205085 71382 -373158
$$ packed form
9887c3454A37564b60555d3617k9414j60862O7328B19483a34107q3092N3335j22586
9876b86450d4925m6109G2258C0825K49727d3174a1914k04055O9322F7820b27189
9864A23240b30182R5904H9788b0243B7366a96606D12452g924q2499l04862A47260
9852H551b30219L1995c3189I7841a23119l91987D5541d4770H6922a53123J5369
9841a37754R168j72094a24616H8112b11022c2937D4775J37657e6410m1755n1882
9830a50047B11792a55583a0926j93775C34532A00841b68654J5898B37971C3979
9819A12301b55164g5985J6397E0202i9051o6373A32252a04223j07794f3131a1614
9807a66595j0678e6739p0229J3759j11596p3224A38745c87945J82860G1382c73158
$$ plain form
9795 -62102 -80275 -153820 -245902 -250097 -2221 -69933 -196043 168377 -362854 163409 136064
9784 136064 -252515 16836 -231532 -116764 -72124 95874 -305637 71781 -154892 -123146 -224627
9773 -224627 -82742 -70619 -316732 -297440 282336 -83596 248966 -75229 135351 37133 -336484
9761 -295314 41061 -69837 -525820 -344848 -128399 -246502 -179375 86404 -69659 -119402 -188247
9750 -188247 -146420 242254 -261424 -11100 127940 141250 -65803 256035 -23785 -215383 405402
9738 -190615 -447219 -62814 -67059 -91123 -90573 106926 39589 -13434 -105296 -129497 -215945 -145446
9726 -145446 -220175 -40404 -108441 -198819 115378 -322712 -42229 -241494 -129708 68343 -144358
9714 -87217 -183241 -265327 254361 -80091 -59259 -116030 139047 183121 -397168 -424334 -105871
$$ packed form
9795f2102j8173p3545r2082m195b221o7712j26110A68377c62854A63409k7345
9784A36064b52515A6836b31532J14768M4640I5874c05637G1781a54892L1746j01481
9773b24627h2742J2123k46113J9292B82336h3596B48966g5229A35351C7133c36484
9761b95314D1061f9837m55983J80972a28399j18103O7127H6404f9659m9743o8845
9750a88247M1827B42254b61424a1100A27940J3310f5803B56035b3785j91598D05402
9738a90615k56604f2814m245k4064N50A06926C9589a3434r1862k4201q6448P0499
9726a45446p4729d0404o8037r0378A15378c22712d2229j99265J11786F8343a44358
9714h7217r6024q2086B54361h0091K0832n6771A39047M4074c97168k7166a05871
$$ plain form
9702 -99468 69999 179069 -121795 289120 -291472 -83885 -97888 79896 -240362 2539 -78435
9690 32451 -249362 106451 -282002 -255935 -148606 -199358 103363 -212312 -11876 80971 -190556
9678 -67948 -111510 -95594 -137191 77127 -4879 -255116 -310400 93864 210216 106584 -49386
9666 -118523 -265174 86404 132050 34117 55902 -100729 -156320 -600 -299383 -223969 37217
9654 130175 -49955 160894 -255872 50715 297681 -35334 -62114 -186948 -267228 -42232 -298390
9643 -298390 191274 -2631 248558 -135678 127694 -146961 36648 -49434 -112441 -262322 158210
9631 -35182 -23860 -238121 169852 58140 -316995 77073 10383 -362429 -61441 -129637 -1977
9619 -86658 -18705 126473 71163 37905 162660 222296 -61389 -176513 -239821 103006 -159512
$$ packed form
9702i9468F9999J09070a21795B89120b91472h3885j4003G9896b40362B539g8435
9690C2451b49362A06451b82002K6067J07329n0752A03363b12312a1876H0971a90556
9678f7948m3562J5916m1597G7127d879k50237n5284I3864J16352j03632d9386
9666a18523j46651H6404M5646C4117K1785a00729n5591f00k98783P5414C7217
9654A30175d9955A60894b55872E0715K46966c5334k6780j24834q0280d2232k56158
9643b98390A91274b631B48558a35678A27694a46961C6648d9434o3007j49881A58210
9631c5182J1322k14261A69852E8140c16995G7073A0383c62429f1441o8196a977
9619h6658a8705A26473n5310l3258J24755N9636f1389j15124o3308A03006a59512
$$ plain form
9607 -168632 -120365 369861 80142 12833 -202631 -80901 -101194 -141808 -54489 -124428 26516
9595 -159491 6292 -123231 4718 7228 231675 94891 -112691 -434532 -129164 83036 -140606
9583 -268178 31660 -38768 -375193 -150538 77955 -39315 -238696 -236350 -314682 30749 24192
9572 24192 150886 -385245 -356397 -175602 310351 -150888 -291838 -210430 303189 -256157
9561 283094 -129550 -308869 -476978 115916 -146622 -375050 67890 293025 -1724 -41611
9551 -41611 -267059 -95169 -111036 -5762 124810 -309908 -295128 -95257 -180376 -271488 -444906
9540 -444906 10507 -100965 287291 272451 -56349 -94957 -227120 -156931 20250 277085 253273
9529 253273 -166003 -42128 -38723 -226376 112443 753 -110365 253736 43869 -153130 -47265
$$ packed form
9607a68632M8267C69861H0142A2833b02631h0901k0293m0614e4489o9939B6516
9595a59491F292a23231D718K510K24447I4891a12691l21841a29164H3036a40606
9583b68178C1660c8768l36425a50538G7955c9315j99381K346p8332C0749o557
9572B4192J26694c85245K8848a75602C10351a50888j40950Q1408C03189b56157
9561B83094a29550j79319j68109A15916a46622k28428F7890K25135a724l9887
9551d1611k25448i5169j5867e762A24810c09908J4780i5257q5119r1112j73418
9540d44906A0507a00965B87291j4840e6349l8608j32163P0189B0250K56835k3812
9529B53273a66003d2128L405j87653A12443G53a10365B53736D3869a53130d7265
$$ plain form
9517 -99724 41946 -94045 -155022 225879 -52102 45052 -362852 -219759 -279492 107426 93813
9506 93813 81300 150369 34371 -67362 132870 229842 -186363 328348 -47359 -6977 26851
9494 55262 251559 -58682 -127230 41342 -311766 -7683 -260502 -6827 -140560 -226865 -406284
9483 -406284 -71595 17771 -274286 154349 -266150 -85715 68729 129730 -230414 -239053 -74369
9471 -13918 41524 -109518 -113572 -54505 -301717 -56226 156031 47349 146939 102209 -200289
9459 -58616 -120961 -232501 -132237 -159164 -379482 -221288 -111937 -411208 65059 -162453
9448 99569 -64588 158060 55747 -67928 -103120 -163559 396964 -157555 -133004 -246603 335067
9436 -39823 387958 42135 21524 -112845 -46078 167274 -186273 51314 -64981 -229688 173153
$$ packed form
9517i9724D1946i4045o0977B25879e2102D5052c62852J43093n9733A07426j3613
9506I3813j2513O9069C4371f7362A32870R6972a86363C28348d7359f977B6851
9494E5262J96297e8682o8548D1342c11766g683k52819f827j33733q6305j79419
9483d06284g1595A7771b74286A54349b66150h5715F8729O1001b30414q639g4369
9471a3918D1524a09518m054e4505k47212e6226A56031D7349R9590m4730b00289
9459e8616o2345j11540J00264k6927k20318J58194J09351k99271F5059a62453
9448I9569f4588A58060E5747f7928l5192o0439C96964a57555K4551j13599C35067
9436c9823C87958D2135k0611a12845d6078A67274a86273E1314f4981j64707A73153
$$ plain form
9424 -107896 -349941 -65551 -93233 -132356 140820 -106044 46336 24434 -43751 -84399 -8435
9412 200005 74669 -280711 -176613 -281147 -388054 -82549 -177113 -240173 220538 272371 57233
9400 -342278 -31159 21150 -210166 255576 -26183 177710 -114445 -116488 198162 46990 120535
9389 120535 -67470 -139921 -147102 -202718 -42032 -113695 -207879 -30095 -115892 -249397 189599
9377 19250 344954 -211306 3046 82812 -214262 -180971 331098 -268930 -285435 -118776 152212
9365 34679 -72316 5683 -79348 -117136 -124001 -205171 -75990 282089 170258 53934 -284279 -109646
9352 -225508 -35602 126512 -123293 116579 -330241 302858 -212370 -60546 207725 49346
9341 -99250 305343 -139668 73382 -237151 50059 -142679 114641 18320 -292100 -29872 -214949
$$ packed form
9424a07896k42045f5551k7682l9123A40820a06044D6336k1902d3751m0648h435
9412B00005G4669b80711J04098j04534j06907h2549r4564o3060B20538N1833E7233
9400c42278c1159B1150b10166B55576b6183A77710a14445k043A98162D6990P3545
9389A20535f7470p2451p181n5616d2032p1663r4184c0095q5797j33505A89599
9377A9250L25704b11306C046P9766b14262L3291C31098b68930j6505a18776A52212
9365C4679g2316E683g9348l7788o865q1170g5990B82089j11831E3934b84279a09646
9352b25508c5602A26512a23293A16579c30241C02858b12370f0546B07725D9346
9341i9250C05343a39668G3382b37151E0059a42679A14641A8320b92100b9872j85077
$$ plain form
9330 -214949 -400943 -4378 -46459 -263368 39669 183856 -127741 -35329 -4142 -55164 -31402
9319 -31402 -108744 97998 80422 -270898 -203735 -189100 -74233 -265704 124250 -239488 -78689
9307 -202441 -166917 -199343 -199471 53832 185828 -26959 -49443 -46981 -143456 -279501 -223835 -190768
9295 -190768 -100185 -167569 -29817 327146 424894 -227738 -239721 442194 71661 31887 219539
9284 219539 -150915 134939 -298717 -125962 -96659 -274369 257715 169070 23702 76737
9274 76737 28290 165982 -140033 -156862 52340 -38571 85617 -180236 -251430 81669 -264646
9262 89789 -232517 -190190 128654 -178214 23822 75836 35118 173879 -174243 -52983 -251465
9251 -251465 208781 -66491 -507611 82348 -75985 159875 -121698 42340 -173457 217742
$$ packed form
9330b14949j85994d378m2081k16909C9669J44187a27741c5329d142n1022K3762
9319c1402p7342I7998j7576b70898O7163J4635g4233j91471A24250b39488g8689
9307b02441L5524l2426j28E3832J31996b6959k2484K462r6475j36045N5666L3067
9295a90768R0583o7384b9817C27146R7748b27738j1983D42194G1661C1887J87652
9284B19539a50915A34939b98717a25962K9303j77710B57715q8645B3702N3035
9274G6737B8290J37692a40033j6829E2340c8571H5617a80236p1194H1669b64646
9262H9789b32517M2327A28654a78214B3822N2014C5118J38761a74243e2983j98482
9251b51465B08781f6491m41120H2348g5985A59875a21698D2340a73457B17742
$$ plain form
9240 -29136 167310 68923 -142562 -193682 -206417 -245495 -330090 56114 -485328 -45469 19069
9228 -193500 -387060 -127180 -289468 -57268 -327366 185587 -97717 -123862 158386 -219666
9217 -251131 -180397 -150216 223626 -165843 -47587 -14526 805 -195477 100423 -63215 -177737
9206 -177737 -283302 -7617 -331062 161365 -146334 -74792 -237204 -4054 139115 -65075 -120362
9195 -120362 216758 -53645 -173880 -204293 -106110 -14189 -177024 -156257 -219801 -50268 -4935
9183 -71001 -254630 -153865 -248256 74390 246034 -313051 -111727 -4553 -19242 -405149 18674
9171 371651 118019 251304 -56628 30423 -61432 -278383 -135030 -361177 -209059 78916
9160 -192388 -139786 -17811 -122075 -258227 -634391 53394 316899 -120222 -85260 -317654
$$ packed form
9240b9136A67310F8923a42562n1120j2735l9078q4595E6114d85328d5469A9069
9228a93500j93560a27180j62288e7268k70098A85587i7717k6145A58386b19666
9217b51131P0734L0181B23626a65843d7587a4526H05a95477A00423f3215j14522
9206a77737j05565g617l23445A61365a46334P1542j62412d054A39115f5075n5287
9195a20362B16758e3645j20235l0413R8183a4189j62835K0767o3544e0268d935
9183g1001j83629J00765r4391G4390J71644c13051a11727d553j4689l85907A8674
9171C71651A18019J33285e6628C0423f1432k16951a35030k26147J52118G8916
9160a92388N2602a7811j04264j36152l76164E3394K63505a20222L4962k32394
$$ plain form
9150 -317654 146931 -135559 124896 -228180 51894 -176989 -32103 -201489 -19747 177957
9139 -18756 -293249 215767 -138854 -56093 -122322 -105108 -97821 449127 -196793 -106320 -350091
9128 -350091 -53614 -62195 -80779 285662 161953 100974 -98736 -98928 73558 113240 -15656 266655
9115 -241623 -140072 25382 347877 80323 76977 13716 49891 242308 177605 -146261 -149067
9104 -149067 -77030 -273651 226914 60872 -144712 -755 52195 -291342 96794 -405059 -113409
9092 -105890 -94135 -289387 230733 68708 86268 92960 -221137 -206580 174450 10496 -68605
9080 -385553 -235277 133856 47587 173347 112038 275 75919 4794 -130676 43788 -357740
9068 -195445 -172194 -60307 -66948 96479 263562 -27146 -76727 75289 263378 113263 135236
$$ packed form
9150c17654A46931a35559A24896b28180E1894a76989c2103j69386a9747A77957
9139a8756k74493B15767a38854e6093o6229J7214P287D49127a96793R0473k43771
9128c50091e3614q581j8584B85662j23709o0979i8736j92G3558L9682a5656B66655
9115b41623J01551B5382L22495H0323l346A3716L6175J92417o4703a46261k806
9104a49067P2037j96621B26914F0872a44712g55E2195b91342I6794d05059a13409
9092a05890J1755j95252B30733F8708J7560O692b21137J4557A74450A0496f8605
9080c85553J50276A33856D7587J25760o1309B75P5644D794a30676D3788c57740
9068a95445K3251f0307o641I6479J67083b7146m9581G5289J88089A13263K1973
$$ plain form
9057 135236 -223579 -206990 -43497 -263618 -161543 -340197 -30624 -219457 112005 34881
9046 -56333 -6443 67273 62011 -86783 -167849 35212 170712 -24649 -4081 -232830 32281 -209390
9033 -251212 204 -139183 -222429 -167558 111088 7381 353872 286147 -407234 187600 72476
9021 17745 111825 50404 -44271 -47413 -105721 -26574 -37422 12967 142934 -122207 98401 79296
9009 79296 -42557 140720 -195754 16046 -139884 -47128 -166004 -64412 -197533 4120 -145355
8997 -98171 -220056 -38406 14099 143099 62422 -218640 54657 -292457 -277803 50727 -154669
8985 -39542 48347 -74146 -212827 -457933 41401 -276124 -79089 -118918 54645 -243232 169651
8973 -203572 315576 117443 259826 -260226 89415 -138576 -197105 -107016 -30134 7548 83923
$$ packed form
9057A35236b23579J6589d3497k20121J02075j78654c0624j88833A12005C4881
9046e6333f443F7273n262h6783q1066C5212J35500b4649d081k28749C2281b09390
9033b51212B04a39183q3246N4871A11088G381L46491o7725d07234A87600G2476
9021A7745R4080E0404d4271l142n8308b6574j0848A2967J29967a22207I8401j9105
9009G9296d2557A40720a95754A6046a39884d7128j18876f4412j33121D120a45355
8997i8171j21885c8406A4099J29000F2422b18640E4657b92457J4654E0727a54669
8985c9542D8347g4146j38681k45106D1401b76124g9089l9829E4645b43232A69651
8973b03572C15576A17443J42383b60226H9415a38576n8529R0089c0134G548P6375
$$ plain form
8962 83923 -66741 202901 -343763 56412 -171021 177643 -238632 194400 -430006 -113034
8951 -205304 -115939 -42457 -75565 -239387 -45647 43093 140249 -111789 70542 19493 136578
8940 136578 168108 123760 171582 -100541 -291018 -189515 203180 21825 232039 -4466 -208601
8929 -208601 57394 -64217 -449502 -272859 -227257 -210800 -116323 210894 335771 7026 75631
8918 75631 126393 -141003 88795 177919 341576 2903 237979 2019 92924 346587 297907
8907 297907 705129 691081 1794120 2510275 6026388 5249813 2399298 1150508 799189
8898 799189 509575 663915 182410 197197 257514 193901 131360 127879 146781 439596 204319
8886 -197034 -161017 -51097 233886 -17530 45815 76018 -35179 -202746 -111648 139206 -49913
$$ packed form
8962H3923f6741B02901c43763E6412a71021A77643b38632A94400d30006a13034
8951b05304Q9365d2457l3108j63822d5647D3093R7156a11789G0542A9493J17085
8940A36578L1530m4348M7822a00541j90477J01503B03180B1825K10214d466k04135
8929b08601E7394f4217l85285J76643M5602J6457R4477B10894J24877G026O8605
8918G5631N0762a41003H8795Q9124J63657B903K35076B019R0905K53663m8680
8907B97907M07222j4048J103039P16155L516113p76575B399298A150508l51319
8898G99189k89614J54340A82410J4787O0317o3613o2541l481J8902K92815B04319
8886a97034L6017e1097B33886a7530D5815L0203c5179j67567R1098A39206d9913
$$ plain form
8874 -167491 -151617 -33106 280522 -116915 -63080 4426 -141387 -18497 162384 -249043 -272054
8863 -272054 -228466 -492658 261253 133215 -94744 -75683 -160163 -38176 45224 -186252 -191316
8852 -191316 -9647 -144987 -179218 -214444 -302243 80216 -41049 33672 -93525 -8976 -207937 -57725
8839 -237528 -122870 32480 -113594 -95074 -75750 -99238 157269 -466663 -147741 -416179
$$ packed form
8874a67491J5874c3106B80522a16915N3835D426a41387a8497A62384b49043k3011
8863b72054M3588k64192B61253j28038i4744J9061q4480c8176D5224a86252n064
8852a91316i647j35340l4231l5226q7799H0216d1049C3672i3525h976j98961e7725
8839b37528J14658C2480a13594J8520J9324k3488A57269d66663a47741k68438
$$ [...]
##END NTUPLES=NMR SPECTRUM
##END=
