
##TITLE=AC1210_ECURS12047_5946853_RW26vjYn89
##JCAMPDX= 6.0         $$ Bruker NMR JCAMP-DX V2.0
##DATA TYPE= NMR SPECTRUM
##DATA CLASS= NTUPLES
##ORIGIN= BRUKER
##OWNER= Administrator
$$ 1.72 TOPSPIN		Version 2.1
$$ 2012-04-11 05:53:41.015 -0500  Administrator@TOPSPIN
$$ Compression mode = diff/dup
##.OBSERVE FREQUENCY= 400.13188235
##.OBSERVE NUCLEUS= ^1H
##.ACQUISITION MODE= SIMULTANEOUS (DQD)
##.ACQUISITION SCHEME= undefined
##.AVERAGES= 64
##.DIGITISER RES= 22
##SPECTROMETER/DATA SYSTEM= spect
##.PULSE SEQUENCE= noesygpps1d.comp
##.SOLVENT NAME= COFFEE_meoh
##.SHIFT REFERENCE= INTERNAL, COFFEE_meoh, 1, 14.96869
##AUDIT TRAIL= $$ (NUMBER, WHEN, WHO, WHERE, PROCESS, VERSION, WHAT)
$$ ##TITLE= Audit trail, TOPSPIN		Version 2.1
$$ ##JCAMPDX= 5.01
$$ ##ORIGIN= Bruker BioSpin GmbH
$$ ##OWNER= Administrator
$$ $$ C:\Bruker\TOPSPIN/data/COFFEE/nmr/AC1210_ECURS12047_5946853_RW26vjYn89/12/pdata/1/auditp.txt
$$ ##AUDIT TRAIL=  $$ (NUMBER, WHEN, WHO, WHERE, PROCESS, VERSION, WHAT)
(   1,<2012-04-11 05:53:36.203 -0500>,<Administrator>,<TOPSPIN>,<go>,<TOPSPIN 2.1>,
      <created by zg
	started at 2012-04-11 05:42:04.484 -0500,
	POWCHK enabled, PULCHK disabled,
       configuration hash MD5:
       1A 1E CE 29 27 FD 77 03 67 4E F0 E3 C4 B2 CB 90
       data hash MD5: 64K
       A3 BB D7 16 BC 0E 6C AA 39 C0 EB BB 27 30 BD DC>)
(   2,<2012-04-11 05:53:38.968 -0500>,<Administrator>,<TOPSPIN>,<proc1d>,<TOPSPIN 2.1>,
      <Start of raw data processing
       efp LB = 0.3 FT_mod = 6 PKNL = 1 PHC0 = 0 PHC1 = 0 SI = 128K 
       data hash MD5: 128K
       2B BA B6 85 19 AC 08 BD 56 85 65 7E 39 24 D5 9D>)
(   3,<2012-04-11 05:53:40.203 -0500>,<Administrator>,<TOPSPIN>,<proc1d>,<TOPSPIN 2.1>,
      <pk PHC0 = 35.1947 PHC1 = 0 
       data hash MD5: 128K
       F9 ED 5D 36 87 10 CE 2B 23 7C 48 10 0D 69 9F 08>)
(   4,<2012-04-11 05:53:40.437 -0500>,<Administrator>,<TOPSPIN>,<proc1d>,<TOPSPIN 2.1>,
      <abs ABSG = 1 
       data hash MD5: 128K
       40 D2 30 00 79 BC 6B FD 75 2B 59 8E F8 DF 6D FE>)
(   5,<2012-04-11 05:53:40.515 -0500>,<Administrator>,<TOPSPIN>,<proc1d>,<TOPSPIN 2.1>,
      <abs ABSG = 2 
       data hash MD5: 128K
       3A A5 39 56 61 C9 FC 9B 80 F1 FE 58 C0 7D 20 DC>)
(   6,<2012-04-11 05:53:40.703 -0500>,<Administrator>,<TOPSPIN>,<proc1d>,<TOPSPIN 2.1>,
      <abs ABSG = 3 
       data hash MD5: 128K
       FE 6F A4 17 31 AA 95 9D 13 B5 FF 93 E7 9E 26 15>)
(   7,<2012-04-11 05:53:40.859 -0500>,<Administrator>,<TOPSPIN>,<proc1d>,<TOPSPIN 2.1>,
      <abs ABSG = 4 
       data hash MD5: 128K
       74 35 A1 97 1E 44 70 1E 1C 30 5E 39 C4 0D 20 37>)
(   8,<2012-04-11 05:53:40.921 -0500>,<Administrator>,<TOPSPIN>,<proc1d>,<TOPSPIN 2.1>,
      <abs ABSG = 5 
       data hash MD5: 128K
       19 CE 7F 58 AE 92 B1 9F 6A 62 97 2C 0A F5 62 6D>)
$$ ##END=
$$ 
$$ $$ hash MD5
$$ $$ 52 C6 7A E0 D5 0C 8A 2C AD D6 13 2D 7A 7F 07 9D
##$RELAX= 
##$RELAX= 
##$RELAX= 
##$RELAX= 
##$RELAX= 
##$RELAX= 
##$RELAX= 
##$RELAX= 
$$ Bruker specific parameters
$$ [...]
##$TP07= 0
##$TPNAME0= <>
##$TPNAME1= <>
##$TPNAME2= <>
##$TPNAME3= <>
##$TPNAME4= <>
##$TPNAME5= <>
##$TPNAME6= <>
##$TPNAME7= <>
##$TPOAL= (0..7)
0.5 0.5 0.5 0.5 0.5 0.5 0.5 0.5
##$TPOFFS= (0..7)
0 0 0 0 0 0 0 0
##$TUNHIN= 0
##$TUNHOUT= 0
##$TUNXOUT= 0
##$USERA1= <user>
##$USERA2= <user>
##$USERA3= <user>
##$USERA4= <user>
##$USERA5= <user>
##$V9= 5
##$VALIST= <valist>
##$VCLIST= <CCCCCCCCCCCCCCC>
##$VD= 0
##$VDLIST= <DDDDDDDDDDDDDDD>
##$VPLIST= <PPPPPPPPPPPPPPP>
##$VTLIST= <TTTTTTTTTTTTTTT>
##$WBST= 1024
##$WBSW= 4
##$XGAIN= (0..3)
0 0 0 0
##$XL= 0
##$YL= 0
##$YMAX_a= 11287922
##$YMIN_a= -5790904
##$ZGOPTNS= <>
##$ZL1= 120
##$ZL2= 120
##$ZL3= 120
##$ZL4= 120
##$ABSF1= 14.96869
##$ABSF2= -5.58384
##$ABSG= 5
##$ABSL= 3
##$ALPHA= 0
##$AQORDER= 0
##$ASSFAC= 0
##$ASSFACI= 0
##$ASSFACX= 0
##$ASSWID= 0
##$AUNMP= <proc_prof1d_extract.lims>
##$AXLEFT= 0
##$AXNAME= <>
##$AXNUC= <1H>
##$AXRIGHT= 0
##$AXTYPE= 0
##$AXUNIT= <>
##$AZFE= 0.1
##$AZFW= 0.1
##$BCFW= 0
##$BC_mod= 0
##$BYTORDP= 0
##$COROFFS= 0
##$CY= 15
##$DATMOD= 1
##$DC= 0
##$DFILT= <>
##$DTYPP= 0
##$F1P= 0
##$F2P= 0
##$FCOR= 0.5
##$FTSIZE= 131072
##$FT_mod= 6
##$GAMMA= 0
##$GB= 0
##$INTBC= 1
##$INTSCL= 1
##$ISEN= 128
##$LB= 0.3
##$LEV0= 0
##$LPBIN= 0
##$MAXI= 10000
##$MC2= 0
##$MEAN= 0
##$ME_mod= 0
##$MI= 0
##$NCOEF= 0
##$NC_proc= -3
##$NLEV= 6
##$NOISF1= 0
##$NOISF2= 0
##$NSP= 0
##$NTH_PI= 0
##$NZP= 0
##$OFFSET= 14.96869
##$PC= 1
##$PHC0= 35.1947
##$PHC1= 0
##$PH_mod= 1
##$PKNL= yes
##$PPARMOD= 0
##$PPDIAG= 0
##$PPIPTYP= 0
##$PPMPNUM= 2147483647
##$PPRESOL= 1
##$PSCAL= 4
##$PSIGN= 0
##$PYNMP= <proc.py>
##$REVERSE= no
##$SF= 400.130004770453
##$SI= 131072
##$SIGF1= 0
##$SIGF2= 0
##$SINO= 400
##$SIOLD= 131072
##$SPECTYP= <>
##$SREGLST= <1H.CDCl3>
##$SSB= 0
##$STSI= 131072
##$STSR= 0
##$SW_p= 8223.68421052632
##$SYMM= 0
##$S_DEV= 0
##$TDeff= 65536
##$TDoff= 0
##$TI= <>
##$TILT= no
##$TM1= 0
##$TM2= 0
##$TOPLEV= 0
##$USERP1= <user>
##$USERP2= <user>
##$USERP3= <user>
##$USERP4= <user>
##$USERP5= <user>
##$WDW= 1
##$XDIM= 131072
##$YMAX_p= 480771476
##$YMIN_p= -324510482
##$CURPLOT= <Network HP LaserJet P1505>
##$CURPRIN= <$Network HP LaserJet P1505>
##$DFORMAT= <normdp>
##$LAYOUT= <+/1D_H.xwp>
##$LFORMAT= <normlp>
##$PFORMAT= <normpl>
##$SURQMSG= 1
$$ End of Bruker specific parameters
$$ ---------------------------------
##NTUPLES= NMR SPECTRUM
##VAR_NAME=  FREQUENCY,     SPECTRUM/REAL,   SPECTRUM/IMAG
##SYMBOL=    X,             R,               I
##VAR_TYPE=  INDEPENDENT,   DEPENDENT,       DEPENDENT
##VAR_FORM=  AFFN,          ASDF,            ASDF
##VAR_DIM=   131072,        131072,          131072
##UNITS=     HZ,            ARBITRARY UNITS, ARBITRARY UNITS
##FACTOR=    0.0627417313425165, 1,          1
##FIRST=     8223.62146879498, 1194,         -76668
##LAST=      0,             2145,            -77420
##MIN=       0,             -324510482,      0
##MAX=       8223.62146879498, 480771476,    0
$$ Real data points
##PAGE= N=1
##DATA TABLE= (X++(R..R)), XYDATA
$$ [...]
60852A9605490j711504j500074j323286j175255j051242r45782q52743p68779
60844A0276825o93946o28138n69348n15793m67225m23723l85323l52898l27110
60835E913321l06431k88237k71616k56892k42872k27450k10938j95898j83225
60826C729762j71075j58276j46067j35536j25903j16671j09132j04144j00090
60817B562868r4874q8633q2936p8244p3770o9267o5502o2938o0861n8020n3964
60806A773859m9753m7170m6690m6540m4505m0616l7098l5622l5591l5195l3306
60795A321773l0111k6728k4396k3390k2747k1592k0339j9681j8904j6778j3822
60784A083285j1986j1771j1414r605p435o640p129p407o712n648n078n295n994
$$ y = [19605490, 17893986, 16393912, 15070626, 13895371, 12844129, 11898347, 11045604, 10276825, 9582879, 8954741, 8385393, 7869600, 7402375, 6978652, 6593329, 6240431, 5913321, 5606890, 5318653, 5047037, 4790145, 4547273, 4319823, 4108885, 3912987, 3729762, 3558687, 3400411, 3254344, 3118808, 2992905, 2876234, 2767102, 2662958, 2562868, 2467994, 2379361, 2296425, 2218181, 2144411, 2075144, 2009642, 1946704, 1885843, 1827823, 1773859, 1724106, 1676936, 1630246, 1583706, 1539201, 1498585, 1461487, 1425865, 1390274, 1355079, 1321773, 1291662, 1264934, 1240538, 1217148, 1194401, 1172809, 1152470, 1132789, 1113885, 1097107, 1083285, 1071299, 1059528, 1048114, 1038509, 1031074, 1024434, 1017305, 1009898, 1003186, 997538, 992460, 987165, 981171]
60771I81171o632o815o573n983m717k524p9J489J987K222K659L043L449M468N963
60756I73128O808O473N866N965O630P412Q478R768J0250R084O904M876L154J422
60742A066218L16Q61K697M250M811N187N859N779L821P82j190r99K85Q16j73k152
60726A097168m391o539q271r156r250r275r731j0173r949r308r122r599r960r460
60712I72984q090o242m270k598j701j666k053k330k253j790j036k18M69R39J018
60697I41163N71J92J062L406N664O286N793N832O629O974O663O979Q345R402R233
60682A024194Q769Q765Q018N177J174j862l387m483n710o704p650r356j1695j3439
60668I91811j4005j4153j4622j5211j5660j6270j7030j7069j5818j4149j3452
$$ y = [981171, 974539, 967724, 961151, 955168, 950451, 947927, 947848, 949337, 951324, 953546, 956205, 959248, 962697, 967165, 973128, 979936, 986409, 992275, 998240, 1004870, 1012282, 1020760, 1030528, 1040778, 1049862, 1056766, 1061642, 1064796, 1066218, 1066534, 1067395, 1070092, 1074342, 1079153, 1084340, 1090199, 1095978, 1099799, 1100581, 1099391, 1098392, 1098677, 1099493, 1099320, 1097168, 1092777, 1086238, 1077967, 1068811, 1059561, 1050286, 1040555, 1030382, 1020433, 1011125, 1002003, 992404, 982444, 972984, 964894, 958652, 954382, 951784, 950083, 948417, 946364, 944034, 941781, 939991, 938955, 938737, 939206, 940145, 941163, 941734, 941926, 942988, 946394, 952058, 958344, 964137, 969969, 976598, 983572, 990235, 997214, 1005559, 1014961, 1024194, 1032963, 1041728, 1049746, 1054923, 1056097, 1054235, 1050848, 1046365, 1040655, 1033951, 1026301, 1016945, 1005250, 991811, 977806, 963653, 949031, 933820, 918160, 901890, 884860, 867791, 851973, 837824, 824372]
60657H24372j3913j4413j4045j3015j2003j1172j0159q747p216o066n693o276
60645G01654p580q654q280o264m027l208l738m127l656l252l738m239l244p26
60631F36921J701K541J769M80j47K93J219J812K068K735M047N225N650N761O193
60616F78268O800P276P941Q890R125P822N974N345O110P017P667Q958J1118J2986
60602G91297J3787J4105J4349J3801J2135J0663J0762J1959J2791J2914J3083
60591I31646J3505J3562J2988J2229J1611J1114J0990J1480J1867J0806Q109N348
60579A065255M150M408M671L745J416j841n084p174p706p617q134r010q705o598
60565A021776m134l106l516m058m151m277m558m305l330k394j796n92J847M462
$$ y = [824372, 810459, 796046, 782001, 768986, 756983, 745811, 735652, 726905, 719689, 713623, 707930, 701654, 694074, 685420, 677140, 670876, 666849, 663641, 659903, 655776, 652120, 648868, 645130, 640891, 637647, 636921, 638622, 641163, 642932, 643412, 643265, 643558, 644777, 646589, 648657, 651392, 655439, 660664, 666314, 672075, 678268, 685068, 692344, 700285, 709175, 718300, 726122, 732096, 737441, 743551, 750568, 758235, 767193, 778311, 791297, 805084, 819189, 833538, 847339, 859474, 870137, 880899, 892858, 905649, 918563, 931646, 945151, 958713, 971701, 983930, 995541, 1006655, 1017645, 1029125, 1040992, 1051798, 1059907, 1065255, 1069405, 1073813, 1078484, 1082229, 1083645, 1081804, 1076720, 1069546, 1061840, 1054223, 1046089, 1037079, 1028374, 1021776, 1017642, 1014536, 1011020, 1006962, 1002811, 998534, 993976, 989671, 986341, 983947, 982151, 981559, 983406, 987868]
60551I87868N658N297M560M309M569N298O559Q090R621J1459J3881J6290J8009
60538A101468J9677K2535K6289K9050K9669K9068K8758K8994K8742K6794K2684
60527A393728J7252J2352R025O017J362m689r860j3153j5941j9184k1561k1703
60515A333645k0504j9625j9114j8228j7305j6899j6139j3986j1373r955r459q520
60503A152538p614q390j0181j0108p364m661m196m670m050l025l375m316l241
60490A077347K67L533M268L219K819M369P203R820J1134J1058J0334R904J0282
60477A165557J1521J3452J5765J8060K0068K1741K3094K4366K6251K9312L2908
60466A402095L5579L7012L8876M2950M9090N5832O2428O9249P6711Q4909R4155
$$ y = [987868, 993526, 998823, 1003383, 1007692, 1012261, 1017559, 1024118, 1032208, 1041829, 1053288, 1067169, 1083459, 1101468, 1121145, 1143680, 1169969, 1199019, 1228688, 1257756, 1286514, 1315508, 1344250, 1371044, 1393728, 1410980, 1423332, 1432357, 1438374, 1439736, 1435047, 1425187, 1412034, 1396093, 1376909, 1355348, 1333645, 1313141, 1293516, 1274402, 1256174, 1238869, 1221970, 1205831, 1191845, 1180472, 1170517, 1161058, 1152538, 1144924, 1136534, 1126353, 1116245, 1108881, 1104220, 1100024, 1095354, 1091304, 1088279, 1084904, 1080588, 1077347, 1077614, 1081147, 1085415, 1088634, 1091453, 1095822, 1103025, 1112845, 1123979, 1135037, 1145371, 1155275, 1165557, 1177078, 1190530, 1206295, 1224355, 1244423, 1266164, 1289258, 1313624, 1339875, 1369187, 1402095, 1437674, 1474686, 1513562, 1556512, 1605602, 1661434, 1723862, 1793111, 1869822, 1954731, 2048886]
60455B048886J04621J15582J26107J36508J47903J60073J70935J78467J81950
60446C371032J80763J73396J58919J38674J15298R0427O4331L7385J0688j4822
60436D326091l8774o0631p9279r3705j03621j09227j10816j08654j02686r2449
60426C426249p7987o0933m3775k7472j0613Q402K8822M8075O4295P7296Q7038
60415C519397R2370R1835Q5134P3296N7888M0648K3494Q167m173j2685j6398j4705
60403C944268q319R41J1623K3412L6220M9268O1856P4640Q9141J06018J24718
60392D513786J44998J67791J94007K23440K55617K90962L30022L72160M16445
60383F909228M63557N15223N71523O30373O90080P50478Q10037Q62911R00062
$$ y = [2048886, 2153507, 2269089, 2395196, 2531704, 2679607, 2839680, 3010615, 3189082, 3371032, 3551795, 3725191, 3884110, 4022784, 4138082, 4228509, 4292840, 4330225, 4340913, 4326091, 4287317, 4226686, 4147407, 4053702, 3950081, 3840854, 3730038, 3621384, 3518698, 3426249, 3348262, 3287329, 3243554, 3216082, 3205469, 3213871, 3242693, 3290768, 3355063, 3432359, 3519397, 3611767, 3703602, 3788736, 3862032, 3919920, 3960568, 3984062, 3992229, 3988056, 3975371, 3958973, 3944268, 3935949, 3936890, 3948513, 3971925, 4008145, 4057413, 4119269, 4193909, 4283050, 4389068, 4513786, 4658784, 4826575, 5020582, 5244022, 5499639, 5790601, 6120623, 6492783, 6909228, 7372785, 7888008, 8459531, 9089904, 9779984, 10530462, 11340499, 12203410, 13103472]
60374A3103472R12347Q91208Q28272P17815N60931L66189J46278q4467l09804
60365A7132241n12628o79442q03950q85994r28508r36577r17660q79905q29732
60356I757845p71781p10408o49414n90460n33435m78809m28454l83880l44878
60347D866326l10433k79920k52850k28340k05606j84661j66085j50379j37672
60338B950380j27366j17995j08171r8078q9342q2961p8042p3074o7811o3115n9499
60327A984926n6688n4354n2379n0331m7559m4039m0546l7637l4948l2017k9365
60316A505063k8062k8117k8046k6513k3955k1929k1022k0326j9105j7974j7763
60305A252251j7940j7133j4888j2065r691q257q041r065j0576j1484j1577j1559
$$ y = [13103472, 14015819, 14907027, 15735299, 16453114, 17014045, 17380234, 17526512, 17442045, 17132241, 16619613, 15940171, 15136221, 14250227, 13321719, 12385142, 11467482, 10587577, 9757845, 8986064, 8275656, 7626242, 7035782, 6502347, 6023538, 5595084, 5211204, 4866326, 4555893, 4275973, 4023123, 3794783, 3589177, 3404516, 3238431, 3088052, 2950380, 2823014, 2705019, 2596848, 2498770, 2409428, 2326467, 2248425, 2175351, 2107540, 2044425, 1984926, 1928238, 1873884, 1821505, 1771174, 1723615, 1679576, 1639030, 1601393, 1566445, 1534428, 1505063, 1477001, 1448884, 1420838, 1394325, 1370370, 1348441, 1327419, 1307093, 1287988, 1270014, 1252251, 1234311, 1217178, 1202290, 1190225, 1180534, 1172277, 1164236, 1155171, 1144595, 1133111, 1121534, 1109975]
60293A109975j1657j1216r981q870q797r392r599r007p965o996o703p651r391
60280I92750j0146q522n391l064k523k558j808o48k50n27j9K141M943O578O415
60265I77371N450M974N370O267P146P362O222L918K085K410M578O496O780O083
60251A052512N618N459M919L800K306L94j863l602l837k551m58J918M129N289
60237A074033M895L993M294N994P580P940P464O717N280K728k16k535m372o589
60223A117206r215j1270j2089j1969j1469j0743r874r255r238r535r261p562m374
60210I91352p32J845K713K810L548N012N965N899O205Q369J1510J2959J1526R097
60196A078078Q442J0330J3410J6156J7893J8505J8512J9302K2001K5952K9391
$$ y = [1109975, 1098318, 1087102, 1077121, 1068251, 1059454, 1050062, 1040463, 1031456, 1023491, 1016495, 1009792, 1002141, 992750, 982604, 974082, 968691, 965627, 963104, 960546, 958738, 958090, 957840, 957313, 957294, 959435, 964378, 970956, 977371, 982821, 987795, 993165, 999432, 1006578, 1013940, 1020162, 1024080, 1026165, 1028575, 1033153, 1039649, 1046429, 1052512, 1058130, 1063589, 1068508, 1072308, 1074614, 1075008, 1073145, 1069543, 1065706, 1063155, 1062697, 1064615, 1068744, 1074033, 1078928, 1082921, 1087215, 1093209, 1100789, 1108729, 1116193, 1122910, 1128190, 1130918, 1130702, 1128167, 1123795, 1117206, 1107991, 1096721, 1084632, 1072663, 1061194, 1050451, 1040577, 1031322, 1022084, 1012549, 1003288, 995726, 991352, 990620, 992465, 995178, 997988, 1001536, 1006548, 1012513, 1018412, 1024617, 1032986, 1044496, 1057455, 1068981, 1078078, 1086520, 1096850, 1110260, 1126416, 1144309, 1162814, 1181326, 1200628, 1222629, 1248581, 1277972]
60185A277972L1840L4561L8278M1951M4677M7359N1061N4823N6898N7622N9067
60174A796109O1852O4201O4585O3559O2147N9944N6083N1010M5896M0942L5584
60163B401912K9864K4290J8520J1748M516j254m614o757r073j1028j1014q620
60151B438490m983j308J938M632O976R858J4128J9461K4879L0374L6633M3009
60139B624087M7541M9818N2089N6107O0250O1754O0676N9391N8553N6120N0636
60128C237022M3255L5695K8149K0174J1990L823m578j2677j8820k2418k5009k7782
60116C268824k9372k7899k3971j9594j4923q409J03Q833J6914K5676L6369M8208
60104C280759N9550O9797P9308Q8394R7135J05419J12497J16933J17536J14011
$$ y = [1277972, 1309812, 1344373, 1382651, 1424602, 1469279, 1516638, 1567699, 1622522, 1679420, 1737042, 1796109, 1857961, 1922162, 1986747, 2050306, 2112453, 2172397, 2228480, 2279490, 2325386, 2366328, 2401912, 2431776, 2456066, 2474586, 2486334, 2490850, 2489596, 2484982, 2478225, 2469152, 2458124, 2447110, 2438490, 2433507, 2432199, 2434137, 2438769, 2445745, 2455603, 2469731, 2489192, 2514071, 2544445, 2581078, 2624087, 2671628, 2721446, 2773535, 2829642, 2889892, 2951646, 3012322, 3071713, 3130266, 3186386, 3237022, 3280277, 3315972, 3344121, 3364295, 3376285, 3380108, 3375530, 3362853, 3344033, 3321615, 3296606, 3268824, 3239452, 3211553, 3187582, 3167988, 3153065, 3144656, 3144759, 3153592, 3170506, 3196182, 3232551, 3280759, 3340309, 3410106, 3489414, 3577808, 3674943, 3780362, 3892859, 4009792, 4127328, 4241339]
60094D241339J06611R5658Q1474O4148M3591K0498k808k3502m0170n2790o1164
60083D472885o4763o4217o1343n7071n0492m0543k7603j2980K042J6162K8429
60072D140506L9562N1714O5933Q0836R4654J07499J20392J33127J44587J54487
60062E133297J63160J70040J73908J74550J72747J68491J60623J48677J33957
60053F599450J18261J02119Q4616O4472M1292J6404p578k8818m8019o7245q6803
60042F788151j04258j17045j25180j30657j34823j37307j37163j33986j27765
60033E639967j18610j07158r4672q2107o9279n5645m1723k8903j7600o512N451
60022E023209J7062K5718L0416L2671L4118L4262L1397K5054J6592P667r98r341
$$ y = [4241339, 4347950, 4443608, 4525082, 4589230, 4632821, 4653319, 4650511, 4627009, 4586839, 4534049, 4472885, 4408122, 4343905, 4282562, 4225491, 4174999, 4134456, 4106853, 4093873, 4095915, 4112077, 4140506, 4180068, 4231782, 4297715, 4378551, 4473205, 4580704, 4701096, 4834223, 4978810, 5133297, 5296457, 5466497, 5640405, 5814955, 5987702, 6156193, 6316816, 6465493, 6599450, 6717711, 6819830, 6904446, 6968918, 7010210, 7026614, 7019036, 6990218, 6942199, 6874954, 6788151, 6683893, 6566848, 6441668, 6311011, 6176188, 6038881, 5901718, 5767732, 5639967, 5521357, 5414199, 5319527, 5237420, 5168141, 5112496, 5070773, 5041870, 5024270, 5017758, 5023209, 5040271, 5065989, 5096405, 5129076, 5163194, 5197456, 5228853, 5253907, 5270499, 5278166, 5277168, 5267827]
60010E267827j7331k4952l2367l9774m7207n4388o0562o4633o5998o5308o3977
59999D731330o2691o0665n6587n0112m2119l3668k5026j5718n078P355K1616L6957
59987D445594N2003O5901P9355R3717J08906J22993J34238J42444J47414J47207
59977E539772J39654J25367J07365Q7480O4726L8037R148j8582m3307o5438q5719
59966E898503j03917j19325j31615j40818j47031j50288j50549j47911j42886
59957D664163j36124j27735j17455j05774r4172q3693p3721o2874n0675l7770
59947C774170k5015j2963j910Q363J8608K9248L9805M9633N8715O7000P3501P7029
59935D156184P7424P5165P0250O2632N3377M3900L4091K2639R449l777j5841k7441
$$ y = [5267827, 5250496, 5225544, 5193177, 5153403, 5106196, 5051808, 4991246, 4926613, 4860615, 4795307, 4731330, 4668639, 4607974, 4551387, 4501275, 4459156, 4425488, 4400462, 4384744, 4379666, 4387021, 4408637, 4445594, 4497597, 4563498, 4642853, 4736570, 4845476, 4968469, 5102707, 5245151, 5392565, 5539772, 5679426, 5804793, 5912158, 5999638, 6064364, 6102401, 6111549, 6092967, 6049660, 5984222, 5898503, 5794586, 5675261, 5543646, 5402828, 5255797, 5105509, 4954960, 4807049, 4664163, 4528039, 4400304, 4282849, 4177075, 4082903, 3999210, 3925489, 3862615, 3811940, 3774170, 3749155, 3736192, 3734282, 3742645, 3761253, 3790501, 3830306, 3879939, 3938654, 4005654, 4079155, 4156184, 4233608, 4308773, 4379023, 4441655, 4495032, 4538932, 4573023, 4595662, 4605111, 4601334, 4585493, 4558052]
59923D558052l9412n0820n9934o6254p0366p2311p1341o7199o0770n3370m5878
59912C900397l8384l0177k0479r764O5P606J3730K0488K8339L5643M1093M5432
59900C993989N0072N4875N8330N9602N9402N8773N7744N5488N1313M5232L7870
59889D582690L0188K3206J7696J3983J1943J1126J1041J1650J3687J8210K5620
59878D771040L5178M5834N7394P0664Q6200J03138J19486J33760J46169J57929
59868E726792J69331J78793J84096J84279J79898J71472J58343J39240J13509
59859G205753Q1511M4401M184l6185p3580j05990j33062j55296j72874j85263
59849F473599j91822j92601j88391j80065j68249j53862j38429j23120j07784
$$ y = [4558052, 4518640, 4467820, 4407886, 4341632, 4271266, 4198955, 4127614, 4060415, 3999645, 3946275, 3900397, 3862013, 3831836, 3811357, 3801593, 3801658, 3809264, 3822994, 3843482, 3871821, 3907464, 3948557, 3993989, 4044061, 4098936, 4157266, 4216868, 4276270, 4335043, 4392787, 4448275, 4499588, 4544820, 4582690, 4612878, 4636084, 4653780, 4667763, 4679706, 4690832, 4701873, 4713523, 4727210, 4745420, 4771040, 4806218, 4852052, 4909446, 4980110, 5066310, 5169448, 5288934, 5422694, 5568863, 5726792, 5896123, 6074916, 6259012, 6443291, 6623189, 6794661, 6953004, 7092244, 7205753, 7287264, 7331665, 7335849, 7299664, 7226084, 7120094, 6987032, 6831736, 6658862, 6473599, 6281777, 6089176, 5900785, 5720720, 5552471, 5398609, 5260180, 5137060, 5029276]
59840E029276r1793p5600o0296m5555k9684j2377M037J7213K7574L7198M6938
59829D846931N6048O3661O8862O9856O5153N5591M3463K9565J2820o997k8016
59818E276937m8279o7430q5748j02782j17573j29157j36586j39699j40210j40482
59808D168991j40774j39211j34910j29267j23439j16566j07761r8010q8560p9024
59798C011469o8855n9252n1611m5202l8395l1391k5700k1548j8040j5388j4705
59787B621382j5419j5176j2867r849p522n408k623J25J352R53L36N49J013K23
59773B557069k749p577j3215j8638k2880k4951k4734k3889k4652k7103k8754k7538
59761B310389k4401k1924k1153k0882j9522j6661j2988r546o707l490J499P851
$$ y = [5029276, 4937483, 4861883, 4801587, 4756032, 4726348, 4713971, 4718008, 4735221, 4762795, 4799993, 4846931, 4902979, 4966640, 5035502, 5105358, 5170511, 5226102, 5269565, 5299130, 5311950, 5304953, 5276937, 5228658, 5161228, 5075480, 4972698, 4855125, 4725968, 4589382, 4449683, 4309473, 4168991, 4028217, 3889006, 3754096, 3624829, 3501390, 3384824, 3277063, 3179053, 3090493, 3011469, 2942614, 2883362, 2831751, 2786549, 2748154, 2716763, 2691063, 2669515, 2651475, 2636087, 2621382, 2605963, 2590787, 2577920, 2568071, 2560549, 2555141, 2552518, 2552643, 2553995, 2554948, 2555284, 2555833, 2556846, 2557069, 2554320, 2546743, 2533528, 2514890, 2492010, 2467059, 2442325, 2418436, 2393784, 2366681, 2337927, 2310389, 2285988, 2264064, 2242911, 2222029, 2202507, 2185846, 2172858, 2163312, 2156605, 2153115, 2154614, 2162465]
59749B162465J3195J6176J8479K2529K8079L2710L5221L6815L9102M2351M5735
59738B492857M8181M9090M9035M9376N0361N0384M8106M4224L9813L4247K6928
59727B982602K0212J7934K1064K7117L3926M1511M9756N6746O0797O2777O5263
59716C439705P0205P7935Q7622R8178J09310J21616J35067J47967J58266J64846
59706D610717J65899J57243J34997J00004N7621J3404k8929o6029r4898j14919
59696D935110j27292j32035j28462j18914j08436r9331q9160p5786o1081m7676
59686C946937l5214k2595j1113k029O855J8564L2180M4111N3303O2025P1887Q2235
59674D247146R2484J03215J14550J25814J37322J50541J65921J82214J98203K13799
$$ y = [2162465, 2175660, 2191836, 2210315, 2232844, 2260923, 2293633, 2328854, 2365669, 2404771, 2447122, 2492857, 2541038, 2590128, 2639163, 2688539, 2738900, 2789284, 2837390, 2881614, 2921427, 2955674, 2982602, 3002814, 3020748, 3041812, 3068929, 3102855, 3144366, 3194122, 3250868, 3311665, 3374442, 3439705, 3509910, 3587845, 3675467, 3773645, 3882955, 4004571, 4139638, 4287605, 4445871, 4610717, 4776616, 4933859, 5068856, 5168860, 5226481, 5239885, 5210956, 5144927, 5050029, 4935110, 4807818, 4675783, 4547321, 4428407, 4319971, 4220640, 4131480, 4055694, 3994613, 3946937, 3911723, 3889128, 3878015, 3875986, 3882841, 3901405, 3933585, 3977696, 4030999, 4093024, 4164911, 4247146, 4339630, 4442845, 4557395, 4683209, 4820531, 4971072, 5136993, 5319207, 5517410, 5731209]
59664E731209K29303K45124K62247K81449L01783L21184L38563L54048L67350
59655H432260L77482L84118L87459L86635L80082L68048L53088L37406L21339
59646A1727917L05310K91671K83065K79694K79380K79790K79537K77579K72805
59637A4276748K64485K52321K35678K13347J84622J50634J14227P8267M4179J2226
59627A5826734j7168m2715o2543p4682p7763p2233o0642m5446k6465j760K8819
59616A5374136O2605R7206J32826J70444K09249K47365K83703L17298L45830L66779
59606A7607441L79350L83309L76383L54744L16052K60330J88222J00753J323j03833
59596A9864074k08026l05889l92823m64660n18911n55485n75517n80387n72131
$$ y = [5731209, 5960512, 6205636, 6467883, 6749332, 7051115, 7372299, 7710862, 8064910, 8432260, 8809742, 9193860, 9581319, 9967954, 10348036, 10716084, 11069172, 11406578, 11727917, 12033227, 12324898, 12607963, 12887657, 13167037, 13446827, 13726364, 14003943, 14276748, 14541233, 14793554, 15029232, 15242579, 15427201, 15577835, 15692062, 15770329, 15814508, 15826734, 15809566, 15766851, 15704308, 15629626, 15551863, 15479630, 15418988, 15373542, 15347077, 15345317, 15374136, 15436741, 15533947, 15666773, 15837217, 16046466, 16293831, 16577534, 16894832, 17240662, 17607441, 17986791, 18370100, 18746483, 19101227, 19417279, 19677609, 19865831, 19966584, 19967907, 19864074, 19656048, 19350159, 18957336, 18492676, 17973765, 17418280, 16842763, 16262376, 15690245]
59587A5690245n53613n27617m96751m64631m35934m14359m01270l96799m01111
59578A1598160m13489m30764m47787m59648m63356m58249m45613m27649m06083
59569G645522l81760l55525l28870l03160k78725k55243k32713k11553j92039
59560E105934j74239j58340j44364j31549j18652j05281r2606q2317p4782o8597
59550C955207o2235n5926n1386m9592m9360m8606m6680m4965m5153m7434n0543
59539C403327n3242n5323n7113n8386n8337n6695n4284n2012m9808m7131m4039
59528B816957m0879l7343l3080k9030k6655k5620k3826k0219j5968j2124p835
59517B544378k252L210O454P691R080J1721J4688J6920J8505J9930K1244K2400
$$ y = [15690245, 15136632, 14609015, 14112264, 13647633, 13211699, 12797340, 12396070, 11999271, 11598160, 11184671, 10753907, 10306120, 9846472, 9383116, 8924867, 8479254, 8051605, 7645522, 7263762, 6908237, 6579367, 6276207, 5997482, 5742239, 5509526, 5297973, 5105934, 4931695, 4773355, 4628991, 4497442, 4378790, 4273509, 4180903, 4098586, 4023804, 3955207, 3892972, 3837046, 3785660, 3736068, 3686708, 3638102, 3591422, 3546457, 3501304, 3453870, 3403327, 3350085, 3294762, 3237649, 3179263, 3120926, 3064231, 3009947, 2957935, 2908127, 2860996, 2816957, 2776078, 2738735, 2705655, 2676625, 2649970, 2624350, 2600524, 2580305, 2564337, 2552213, 2544378, 2542126, 2545336, 2551790, 2559481, 2568561, 2580282, 2594970, 2611890, 2630395, 2650325, 2671569, 2693969]
59505B693969K3609K5175K7409L0507L4052L7122L9575M2608M7173N2416N6897
59494C110512O0750O5408P1468P8138Q4689R1129R7517J03752J10124J16973J23752
59483D114212J29466J34019J38090J41623J43514J43026J40554J36681J31258
59474E352443J23813J14507J04436R4919Q6004P5639O1226M2626K2801M978r595
59463F073797k0542k7067k9407k9952l0453k9224k3500j3627k282R748K3741L9257
59451E940489N3614O5686P6846Q7069R3242R2975Q7173P6925O0544L6377O710
59440F677650k3952n3479q2588j11484j38388j61257j79077j91459j98390k00322
59430E337254j97583j90044j78497j65526j53525j42107j28993j13453r7401q2961
$$ y = [2693969, 2717578, 2742753, 2770162, 2800669, 2834721, 2871843, 2911418, 2954026, 3001199, 3053615, 3110512, 3171262, 3236670, 3308138, 3386276, 3470965, 3562094, 3659611, 3763363, 3873487, 3990460, 4114212, 4243678, 4377697, 4515787, 4657410, 4800924, 4943950, 5084504, 5221185, 5352443, 5476256, 5590763, 5695199, 5790118, 5876122, 5951761, 6012987, 6055613, 6078414, 6083392, 6073797, 6053255, 6026188, 5996781, 5966829, 5936376, 5907152, 5883652, 5870025, 5867743, 5877491, 5901232, 5940489, 5994103, 6059789, 6136635, 6223704, 6316946, 6409921, 6497094, 6574019, 6634563, 6670940, 6677650, 6653698, 6600219, 6517631, 6406147, 6267759, 6106502, 5927425, 5735966, 5537576, 5337254, 5139671, 4949627, 4771130, 4605604, 4452079, 4309972, 4180979, 4067526, 3970125, 3887164]
59420C887164p0254n8031m5563l3192k1581j0935q50R316J9852L0456M0495M9504
59408C796381N7516O5234P3639Q2877R1584R7911J01259J02394J01854R9120R3424
59397D763193Q4502P2268N6660L8189J7903l505k5742m7878o8232q5716j00375
59386D701267j12332j21203j27003j30522j32175j31536j28580j24272j19197
59377C574447j12704j04378r5392q7400q0761p4797o8972o2930n6055m8118l9904
59366B743036l2461k6214k1224j7418j3920r300l388K217O462J0419J5311K0368
59354B673888K4467K8647L4664M1670M6950N0002N3217N7796O1274O0446N5262
59343C188283M8609M3457M1478M3307M8398N5005O1754O9272P9043R0445R9913
$$ y = [3887164, 3816910, 3758879, 3713316, 3680124, 3658543, 3647608, 3646758, 3656074, 3675926, 3706382, 3746877, 3796381, 3853897, 3919131, 3992770, 4075647, 4167231, 4265142, 4366401, 4468795, 4570649, 4669769, 4763193, 4847695, 4919963, 4976623, 5014812, 5032715, 5029210, 5003468, 4955590, 4887358, 4801642, 4701267, 4588935, 4467732, 4340729, 4210207, 4078032, 3946496, 3817916, 3693644, 3574447, 3461743, 3357365, 3261973, 3174573, 3093812, 3019015, 2950043, 2887113, 2831058, 2782940, 2743036, 2710575, 2684361, 2663137, 2645719, 2631799, 2622499, 2619111, 2621328, 2627790, 2638209, 2653520, 2673888, 2698355, 2727002, 2761666, 2803336, 2850286, 2900288, 2953505, 3011301, 3072575, 3133021, 3188283, 3236892, 3280349, 3321827, 3365134, 3413532, 3468537, 3530291, 3599563, 3678606, 3769051, 3868964]
59332C868964J03666J00996R4921R0058Q9929R5197J03703J12409J20096J28067
59322D908006J37872J48872J59055J68048J77857J90133K04006K17502K30134
59313F541485K42903K56652K71779K88858L07841L26883L43557L57217L68624
59304I305799L77247L80770L77586L68134L53341L33533L09702K84005K57836
59295A2347953K30678K02057J73377J46472J21351R6497P0660M3224J3783j7445
59285A3428607m9567q2473j17434j54934j92796k27878k58911k86039l08350l23991
59275A1426234l32750l36636l37359l34684l27747l16737l02671k86481k69198
59266H581971k52256k36668k22032k06996j90864j74475j59368j46166j34094
$$ y = [3868964, 3972630, 4073626, 4168547, 4258605, 4348534, 4443731, 4547434, 4659843, 4779939, 4908006, 5045878, 5194750, 5353805, 5521853, 5699710, 5889843, 6093849, 6311351, 6541485, 6784388, 7041040, 7312819, 7601677, 7909518, 8236401, 8579958, 8937175, 9305799, 9683046, 10063816, 10441402, 10809536, 11162877, 11496410, 11806112, 12090117, 12347953, 12578631, 12780688, 12954065, 13100537, 13221888, 13318385, 13389045, 13432269, 13446052, 13428607, 13379040, 13296567, 13179133, 13024199, 12831403, 12603525, 12344614, 12058575, 11750225, 11426234, 11093484, 10756848, 10419489, 10084805, 9757058, 9440321, 9137650, 8851169, 8581971, 8329715, 8093047, 7871015, 7664019, 7473155, 7298680, 7139312, 6993146, 6859052]
59257F859052j22151j10379r9524q9869q1202p3718o7923o3487n9302n5027n1658
59246E984812n0133n0361n1936n4708n8052o0701o2206o3627o6133o9722p3840
59235E323393p8071q1446q2505q1177p9390p8503p7242p3624o7912o2072n7011
59224D504440n2014m6317l9681l1809k2873j4246p365j880L760J0324J7467K4833
59212D344639L1966L7698M1151M2979M4049M3405L9381L2474K4945J7525Q650
59201D708862k507j4378k5267l5458m5700n4865o0683o2389o1463n9790n7738
59190D228624n4194m8201m0306l2012k3966j5487o155L194J2004K1465L3011M5959
59178D123936N8088O7962P4897P7273P3294O4056N3937M7131M4942M6740N1820
$$ y = [6859052, 6736901, 6626522, 6526998, 6437129, 6355927, 6282209, 6214286, 6150799, 6091497, 6036470, 5984812, 5934679, 5884318, 5832382, 5777674, 5719622, 5658921, 5596715, 5533088, 5466955, 5397233, 5323393, 5245322, 5163876, 5081371, 5000194, 4920804, 4842301, 4765059, 4691435, 4623523, 4561451, 4504440, 4452426, 4406109, 4366428, 4334619, 4311746, 4297500, 4290135, 4288255, 4292015, 4302339, 4319806, 4344639, 4376605, 4414303, 4455454, 4498433, 4542482, 4585887, 4625268, 4657742, 4682687, 4700212, 4708862, 4706355, 4691977, 4666710, 4631252, 4585552, 4530687, 4470004, 4407615, 4346152, 4286362, 4228624, 4174430, 4126229, 4085923, 4053911, 4029945, 4014458, 4008303, 4011497, 4023501, 4044966, 4077977, 4123936, 4182024, 4249986, 4324883, 4402156, 4475450, 4539506, 4593443, 4640574, 4685516, 4732256, 4784076]
59167D784076N9514O8935P9625R1636J04365J16516J27848J39751J53196J67157
59157E892619J80085J92191K05033K19313K33875K46594K55541K59653K58769
59148G943673K52958K41608K23648J98731J67570J31025Q9791M5432P34m1804
59138I253366q1306j17770j50493j77984j99055k13438k21607k24510k23281k18748
59128G425174k11355k01816j91433j81303j71373j60820j49398j38146j28546
59119E890984j21079j14740j08119j00761r3138q5499p7532o9362o2060n6400
59109E002294n1757m6971m1707l6204l0398k4470j9756j7542j7011j5867j3279
59098D687332j0834j0113j0601j0745j0104r435r335r865j1368j4745k0448k7493
$$ y = [4784076, 4843590, 4912525, 4992150, 5083786, 5188151, 5304667, 5432515, 5572266, 5725462, 5892619, 6072704, 6264895, 6469928, 6689241, 6923116, 7169710, 7425251, 7684904, 7943673, 8196631, 8438239, 8661887, 8860618, 9028188, 9159213, 9249004, 9294436, 9295170, 9253366, 9172060, 9054290, 8903797, 8725813, 8526758, 8313320, 8091713, 7867203, 7643922, 7425174, 7213819, 7012003, 6820570, 6639267, 6467894, 6307074, 6157676, 6019530, 5890984, 5769905, 5655165, 5547046, 5446285, 5353147, 5267648, 5190116, 5120754, 5058694, 5002294, 4950537, 4903566, 4861859, 4825655, 4795257, 4770787, 4751031, 4733489, 4716478, 4700611, 4687332, 4676498, 4666385, 4655784, 4645039, 4634935, 4625500, 4616165, 4606300, 4594932, 4580187, 4559739, 4532246]
59086D532246l3927l8592m2254m6554n1809n6589n9653o1409o2790o3696o3647
59075C951326o3228o3519o4321o4262o2607n9832n6486n2594m8240m3664l8720
59064C333853l3123k7180k1394j5514r097k720K673P451J2870J8873K3788K6591
59052C317071K8028K9143L0040L0723L1756L3171L3785L2583L0225K8325K7683
59041C652533K7826K8089K8678L0623L4555L9514M3561M5898M7449M8461M6738
59030D073925L9840K8227J4223j460j9786m0073n9422p6148r1322j05780j17817
59019C644407j25371j28754j29618j28600j25544j20923j15407j08951j01705
59010B559534r4966q9811q5395p9969p3158o6075n9678n4216m9853m6725m4424
$$ y = [4532246, 4498319, 4459727, 4417473, 4370919, 4319110, 4262521, 4202868, 4141459, 4078669, 4014973, 3951326, 3888098, 3824579, 3760258, 3695996, 3633389, 3573557, 3517071, 3464477, 3416237, 3372573, 3333853, 3300730, 3273550, 3252156, 3236642, 3227545, 3224825, 3227498, 3234949, 3247819, 3266692, 3290480, 3317071, 3345099, 3374242, 3404282, 3435005, 3466761, 3499932, 3533717, 3566300, 3596525, 3624850, 3652533, 3680359, 3708448, 3737126, 3767749, 3802304, 3841818, 3885379, 3931277, 3978726, 4027187, 4073925, 4113765, 4141992, 4156215, 4154755, 4134969, 4094896, 4035474, 3959326, 3868004, 3762224, 3644407, 3519036, 3390282, 3260664, 3132064, 3006520, 2885597, 2770190, 2661239, 2559534, 2464568, 2374757, 2289362, 2209393, 2136235, 2070160, 2010482, 1956266, 1906413, 1859688, 1815264]
58999A815264m2210l9542l5968l1136k5668k1347j9430j9122j8537j6847j4739
58988A530718j3010j1553r706p186m590l080l067l269j734J972O309R619J1566
58975A502989J2637J3345J4427J6626J9555K1632K1935K1235K0629K0097J9151
58964A704258J7967J6932J5871J4486J2937J1130Q362M476O99j533j920r01J250
58951A804014M084O664Q479R976J1467J2359J2222J1511J0384Q008M176K92k738
58938A900898o356j2107j8542k2616k3834k4773k7287l0323l1950l1799l0578
58927A640733k8618k5904k2769j9755j7174j5059j3064j0390o674l058j294j366
58915A475608j013J716O227J0478J3542J6036J8339J9824K0103K0091K0926K2337
$$ y = [1815264, 1773054, 1733512, 1697544, 1666408, 1640740, 1619393, 1599963, 1580841, 1562304, 1545457, 1530718, 1517708, 1506155, 1496449, 1489263, 1484673, 1481593, 1478526, 1475257, 1473523, 1475495, 1481804, 1491423, 1502989, 1515626, 1528971, 1543398, 1560024, 1579579, 1601211, 1623146, 1644381, 1665010, 1685107, 1704258, 1722225, 1739157, 1755028, 1769514, 1782451, 1793581, 1801943, 1806419, 1807118, 1805585, 1803665, 1802764, 1804014, 1808098, 1814762, 1823241, 1833217, 1844684, 1857043, 1869265, 1880776, 1891160, 1899168, 1903344, 1903636, 1900898, 1894542, 1882435, 1863893, 1841277, 1817443, 1792670, 1765383, 1735060, 1703110, 1671311, 1640733, 1612115, 1586211, 1563442, 1543687, 1526513, 1511454, 1498390, 1488000, 1481326, 1478268, 1476974, 1475608, 1474595, 1476311, 1482538, 1493016, 1506558, 1522594, 1540933, 1560757, 1580860, 1600951, 1621877, 1644214]
58903A644214K2820K1396J8586J5615J3332J2015J1468J0984R867Q450Q003R112
58891A805862J1007J3104J6155K0697K5260K7772K8287K8639K9611L0282L0364
58880B067040L1216L3930L7914M1998M5617M8351M9705N0160N1188N3465N6230
58869B566814N8995O2540O7443P3022P8665Q4930R2323J00124J07497J14690J22111
58858C529154J29370J36351J44136J53615J64017J74107J84017J94928K07655
58849E017350K22439K39132K56405K71947K84769K96430L08625L20464L29528
58840G547089L34727L36310L33552L24301L06834K81009K47689K07969J62725
58831A0082205J12015N5612m864o5022j20218j68630k10801k46883k75837k96970
$$ y = [1644214, 1667034, 1688430, 1707016, 1722631, 1735963, 1747978, 1759446, 1770430, 1780297, 1788747, 1796750, 1805862, 1816869, 1829973, 1846128, 1866825, 1892085, 1919857, 1948144, 1976783, 2006394, 2036676, 2067040, 2098256, 2132186, 2170100, 2212098, 2257715, 2306066, 2355771, 2405931, 2457119, 2510584, 2566814, 2625809, 2688349, 2755792, 2828814, 2907479, 2992409, 3084732, 3184856, 3292353, 3407043, 3529154, 3658524, 3794875, 3939011, 4092626, 4256643, 4430750, 4614767, 4809695, 5017350, 5239789, 5478921, 5735326, 6007273, 6292042, 6588472, 6897097, 7217561, 7547089, 7881816, 8218126, 8551678, 8875979, 9182813, 9463822, 9711511, 9919480, 10082205, 10194220, 10249832, 10244968, 10179946, 10059728, 9891098, 9680297, 9433414, 9157577, 8860607]
58821H860607l10707l17931l19688l17333l11805l02935k90702k76891k64143
58812F148472k53339k43027k31655k19333k07317j96540j86822j76963j65742
58803D267734j53253j41005j30341j21282j13304j06306j00008r3360q5780p8301
58793C144794p2304o7553o2654n6979n1016m5237l9754l4727l0046k4921j8853
58782B640750j2630p424l325K84L501O223R114J2939J7374K1590K5709L0453L5820
58769B780378M1314M7150N3841O0759O6544P0973P5275Q0556Q6859R3795J01200
58758C558644J09098J17618J26781J36014J44456J52236J60767J71009J82377
58749D859000J94099K06468K19714K32808K44832K56542K68963K81399K92412
$$ y = [8860607, 8549900, 8231969, 7912281, 7594948, 7283143, 6980208, 6689506, 6412615, 6148472, 5895133, 5652106, 5420451, 5201118, 4993801, 4797261, 4610439, 4433476, 4267734, 4114481, 3973476, 3843135, 3721853, 3608549, 3502243, 3402235, 3308875, 3223095, 3144794, 3072490, 3004937, 2942283, 2885304, 2834288, 2789051, 2749297, 2714570, 2684524, 2659603, 2640750, 2628120, 2620696, 2617371, 2617655, 2621156, 2627379, 2636493, 2649432, 2666806, 2688396, 2714105, 2744558, 2780378, 2821692, 2868842, 2922683, 2983442, 3049986, 3120959, 3196234, 3276790, 3363649, 3457444, 3558644, 3667742, 3785360, 3912141, 4048155, 4192611, 4344847, 4505614, 4676623, 4859000, 5053099, 5259567, 5479281, 5712089, 5956921, 6213463, 6482426, 6763825, 7056237]
58740G056237L01818L09686L14075L11951L02221K86069K64406K36581K01509
58731I584553J58547J07686N0586q832o6494j20648j70898k15549k52150k80355
58721H786446l01968l17989l27683l30793l28582l22287l12397k99917k86540
58712E958290k73041k59105k45094k32168k20188k07314j92593j77415j63679
58703C987693j51863j41570j32526j24189j15652j06810r8531r0989q3038p4057
58693B868468o5263n8134n2382m6613m0455l4932l0868k7756k4424k0492j6886
58682B450263j4672j3524j1818q598m848k370j917k944m589o254p785r674j2444
58669B348826j5454j7341j8229k0040k3667k7489l0108l2856l7439m2558m5544
$$ y = [7056237, 7358055, 7667741, 7981816, 8293767, 8595988, 8882057, 9146463, 9383044, 9584553, 9743100, 9850786, 9901372, 9892540, 9826046, 9705398, 9534500, 9318951, 9066801, 8786446, 8484478, 8166489, 7838806, 7508013, 7179431, 6857144, 6544747, 6244830, 5958290, 5685249, 5426144, 5181050, 4948882, 4728694, 4521380, 4328787, 4151372, 3987693, 3835830, 3694260, 3561734, 3437545, 3321893, 3215083, 3116552, 3025563, 2942525, 2868468, 2803205, 2745071, 2692689, 2646076, 2605621, 2570689, 2539821, 2512065, 2487641, 2467149, 2450263, 2435591, 2422067, 2410249, 2401651, 2396803, 2394433, 2392516, 2389572, 2384983, 2378729, 2370944, 2361270, 2348826, 2333372, 2316031, 2297802, 2277762, 2254095, 2226606, 2196498, 2163642, 2126203, 2083645, 2038101]
58658B038101m6524m8233n1896n5761n7820n7748n6106n3659n1595n0493m9010
58647A459256m5474m0643l6928l4906l2853k9722k6351k3444k0610j7856j5859
58636A134610j4221j1547q000n787o341q703j1301j3533j4936j4645j2727j0548
58624A002321q978p413n256l113j799j119j78J782M815P750Q812P951P793J0369
58610A023737J3748J4240J1526Q817P897P038M472J139j296k908m621o595q666
58597A068528j0941j3075j4285j4674j5126j5547j4819j2882j1061j0040r190
58586I26888q175p314o129l601k14K365L931N786P883Q603P994Q450J1112J4058
58572I71637J5362J5532J5738J5864J5785J6473J8258J9838K0374K0934K2733
$$ y = [2038101, 1991577, 1943344, 1891448, 1835687, 1777867, 1720119, 1664013, 1610354, 1558759, 1508266, 1459256, 1413782, 1373139, 1336211, 1301305, 1268452, 1238730, 1212379, 1188935, 1168325, 1150469, 1134610, 1120389, 1108842, 1100842, 1095055, 1088714, 1080011, 1068710, 1055177, 1040241, 1025596, 1012869, 1002321, 993343, 985930, 980674, 977561, 975762, 974643, 974465, 976247, 981062, 988812, 997624, 1005575, 1013368, 1023737, 1037485, 1051725, 1063251, 1072068, 1079965, 1087003, 1091475, 1092614, 1091318, 1088410, 1083789, 1077194, 1068528, 1057587, 1044512, 1030227, 1015553, 1000427, 984880, 970061, 957179, 946118, 936078, 926888, 918713, 911399, 905270, 901669, 901455, 903820, 907751, 913537, 921420, 930023, 938017, 946467, 957579, 971637, 986999, 1002531, 1018269, 1034133, 1049918, 1066391, 1084649, 1104487, 1124861, 1145795, 1168528]
58561A168528K5523K8626L1876L4779L6768L8954M3209M8821N2641N3824N5530
58550A619079O0324O6628P1846P6348Q1807Q7603R1717R3898R5418R6543R6397
58539B537608R4552R1003Q5079P5865O3219M7448K8909Q737j1054k8989m4604
58528B947773n7205o5818p0939p4385p6629p6264p2899o8381o4043n9025n2591
58517B209594m5933m0160l4768k9651k6388k5632k5284k3243k0253j8116j6858
58506A903308j5531j4070j2474r821o144l735m490p316j0111j3024j7680k4293
58494A764619l1442l7954m3326m7144m9363n0359m9889m7242m3243m0416l9980
58483A284261m0393l9775l8027l5596l2309k8667k6062k4328k1379j6728j2939
$$ y = [1168528, 1194051, 1222677, 1254553, 1289332, 1326100, 1365054, 1408263, 1457084, 1509725, 1563549, 1619079, 1679403, 1746031, 1817877, 1894225, 1976032, 2063635, 2155352, 2249250, 2344668, 2441211, 2537608, 2632160, 2723163, 2808242, 2884107, 2947326, 2994774, 3023683, 3032420, 3021366, 2992377, 2947773, 2890568, 2824750, 2753811, 2679426, 2602797, 2526533, 2453634, 2385253, 2321210, 2262185, 2209594, 2163661, 2123501, 2088733, 2059082, 2032694, 2007062, 1981778, 1958535, 1938282, 1920166, 1903308, 1887777, 1873707, 1861233, 1851412, 1845268, 1841533, 1837043, 1829727, 1819616, 1806592, 1788912, 1764619, 1733177, 1695223, 1651897, 1604753, 1555390, 1505031, 1455142, 1407900, 1364657, 1324241, 1284261, 1243868, 1204093, 1166066, 1130470, 1098161, 1069494, 1043432, 1019104, 997725, 980997, 968058]
58472I68058j1830j1724j0508r006q950r748r824r344r197q835p498o148o047
58459H49399o637o702o325o012n437m554m241m396l364p02J632K494L468N802
58445H14425P946Q255P584P115O102M128L004M008N566O087O609Q247R736J0045
58431I08857J0611J2322J3230J2118J1197J2050J2208R399N933M791M418J956
58419A019090j221k222k440n348j0297j3697j4975j6290j7515j6765j4979j4846
58407H88495j5682j4355j0976q768q398p401n386m964o769p985o797m528k575
58394G83911p16R66J772K403M209O305O618N681N914P333P619O491O182P221P531
58379H59440O466O169P959J0373J1741J2059J1655J0482R144Q395P526N320K352
$$ y = [968058, 956228, 944504, 933996, 924990, 916040, 906292, 896468, 887124, 877927, 869092, 861594, 855446, 849399, 842762, 836060, 829735, 823723, 818286, 813732, 809491, 805095, 801731, 801029, 802661, 805155, 808623, 814425, 822371, 830626, 838210, 845325, 851427, 855555, 858559, 862567, 868133, 874220, 880829, 889076, 898812, 908857, 919468, 931790, 945020, 957138, 968335, 980385, 992593, 1001992, 1007925, 1012716, 1017134, 1019090, 1017869, 1015647, 1013207, 1007859, 997562, 983865, 968890, 952600, 935085, 918320, 903341, 888495, 872813, 858458, 847482, 838714, 830316, 822915, 817529, 812565, 805796, 797811, 791014, 786486, 783911, 783195, 784161, 785933, 788336, 792545, 798850, 805468, 811149, 817063, 824396, 832015, 838506, 844688, 851909, 859440, 865906, 872075, 880034, 890407, 902148, 914207, 925862, 936344, 945488, 953883, 961409, 966729, 969081]
58366I69081K7j895m311o221o143n174n424o189n129k540q15j85J181L185L766
58351I33214K881K819M422O357Q117J0241J1690J0637Q058O967P887Q409P266
58338A028965N445L234j71l847n448m792m057m180m177l974m559n299m404k203
58324I90533q27o62k16P30J121J530L548O513Q209Q662R810J1628J2144J1131
58310A063854J0290R863Q588O840O381P187P788Q309R715J0834R888Q375R450
58297A177362J2840J5186J5155J4508J4610J5496J7656K1061K3195K1853J8808
58286A367730J7179J6660J5329J3998J4159J3735J0249O230N725P228O373L945
58274A498540M420P672R319Q753R594J2141J2620J0412R202J0261J1164J1707
$$ y = [969081, 969108, 967213, 962902, 956681, 950538, 945364, 939940, 933751, 928622, 926082, 925267, 925082, 926263, 929448, 933214, 936095, 938914, 943336, 949693, 957810, 968051, 979741, 990378, 998436, 1005403, 1013290, 1021699, 1028965, 1034410, 1037644, 1037473, 1033626, 1028178, 1023386, 1019329, 1015149, 1010972, 1006998, 1002439, 997140, 992736, 990533, 989706, 989044, 988828, 989558, 990679, 992209, 995757, 1002270, 1010479, 1019141, 1028951, 1040579, 1052723, 1063854, 1074144, 1084007, 1092595, 1099435, 1105816, 1113003, 1120791, 1129100, 1138815, 1149649, 1159537, 1167912, 1177362, 1190202, 1205388, 1220543, 1235051, 1249661, 1265157, 1282813, 1303874, 1327069, 1348922, 1367730, 1384909, 1401569, 1416898, 1430896, 1445055, 1458790, 1469039, 1475269, 1480994, 1488222, 1494595, 1498540, 1502960, 1510632, 1519951, 1528704, 1538298, 1550439, 1563059, 1573471, 1582673, 1592934, 1604098, 1615805]
58262A615805J4443J8664K0517J9869K0610K3537K5664K6971L0729L6191L8283
58251A891283L5867L3403L3144L2605L0970L0862L2247L1593K8684K7397K8387
58240B236442K8041K6026K6462L0060L2420L1860L1611L2833L2957L2554L5858
58229B577124M2511M6815M7181M8438N2672N6108N7277N9834O4638O7503O7672
58218C187773P0213P6909Q3019Q6103Q9750R5581R9827J01101J03351J07948J10954
58207D212529J10989J11508J12932J11452J08042J09068J15275J20101J21667
58198E233563J25891J34533J41403J44556J51015J64623J80030J93537K08903
58189F678054K27356K43044K54072K67182K85774L04006L18375L34216L55034
$$ y = [1615805, 1630248, 1648912, 1669429, 1689298, 1709908, 1733445, 1759109, 1786080, 1816809, 1853000, 1891283, 1927150, 1960553, 1993697, 2026302, 2057272, 2088134, 2120381, 2151974, 2180658, 2208055, 2236442, 2264483, 2290509, 2316971, 2347031, 2379451, 2411311, 2442922, 2475755, 2508712, 2541266, 2577124, 2619635, 2666450, 2713631, 2762069, 2814741, 2870849, 2928126, 2987960, 3052598, 3120101, 3187773, 3257986, 3334895, 3417914, 3504017, 3593767, 3689348, 3789175, 3890276, 3993627, 4101575, 4212529, 4323518, 4435026, 4547958, 4659410, 4767452, 4876520, 4991795, 5111896, 5233563, 5359454, 5493987, 5635390, 5779946, 5930961, 6095584, 6275614, 6469151, 6678054, 6905410, 7148454, 7402526, 7669708, 7955482, 8259488, 8577863, 8912079, 9267113]
58180I267113L76464L96470M20368M50022M79435N06601N37991N75958O13998
58171A3624420O49715O89410P34341P76493Q13812Q54959R02773R48482R89230
58162B0983635J035312J092588J154276J218070J294122J387222J488195J591656
58154C1245076J704358J827899J953034K080811K228995K407598K609106K832215
58146D8889092L091962L396625L740715M132171M598791N155764N796962O530484
58138H5332566P388254Q385330R506223J0745804J2122251J3637951J5285134
58131A62403513J7116001J9255279K1828099K4924254K8543343L2261410L4749388
58124C41081287L3898051K8008881J7244431L894957q919983j8928493k5402439
$$ y = [9267113, 9643577, 10040047, 10460415, 10910437, 11389872, 11896473, 12434464, 13010422, 13624420, 14274135, 14963545, 15697886, 16474379, 17288191, 18143150, 19045923, 19994405, 20983635, 22018947, 23111535, 24265811, 25483881, 26778003, 28165225, 29653420, 31245076, 32949434, 34777333, 36730367, 38811178, 41040173, 43447771, 46056877, 48889092, 51981054, 55377679, 59118394, 63250565, 67849356, 73005120, 78802082, 85332566, 92720820, 101106150, 110612373, 121358177, 133480428, 147118379, 162403513, 179519514, 198774793, 220602892, 245527146, 274070489, 306331899, 341081287, 374979338, 402988219, 420232650, 424127607, 415207624, 396279131, 370876692]
58117C70876692k8738537k9741339k9204191k7758744k5818625k3611895k1289290
58110A84714071j8989821j6818597j4823912j3022965j1424519j0021021q790273
58103I0822963p716348o790994n995229n301218m692412m163581l704036l298540
58095D9160605k940627k628493k352716k102453j876611j675425j489703j311105
58087C2783472j142853r88576q42816p03423n78626m70308l65881k57048j48571
58078B7285370l8758Q7617K36713L98639N71839P68323R88066J221419J485039
58069C3004267J816762K226071K692443L210866L771516M298021M723609N163214
58061F0906769N834478O637931O914853N874214L346969J9677l102326n365537
$$ y = [370876692, 342138155, 312396816, 283192625, 255433881, 229615256, 206003361, 184714071, 165724250, 148905653, 134081741, 121058776, 109634257, 99613236, 90822963, 83106615, 76315621, 70320392, 65019174, 60326762, 56163181, 52459145, 49160605, 46219978, 43591485, 41238769, 39136316, 37259705, 35584280, 34094577, 32783472, 31640619, 30652043, 29809227, 29105804, 28527178, 28056870, 27690989, 27433941, 27285370, 27246612, 27334229, 27570942, 27969581, 28541420, 29309743, 30297809, 31519228, 33004267, 34821029, 37047100, 39739543, 42950409, 46721925, 51019946, 55743555, 60906769, 66741247, 73379178, 80294031, 86168245, 89515214, 89534891, 86432565, 81067028]
58053H1067028o642453p095371o962395o493763n897002n272422m641079m030405
58045C4032138l487345l026752k626821k275438j978457j727314j500587j297091
58037A6112333j132776j006343q98735q03833p30265o75087o23471n73183n34037
58028I134603n04269m70897m32331l98389l69000l34210k95002k64343k47080
58019E819082k36167k28170k25647k24854k17388k04174j93481j85856j74709
58010C928636j60231j49101j41689j32591j22334j16062j12326j05272r6055r0290
58000B702685q6487p8782o8938o3854o3331o1609n8731n9071o0875n8736n4378
57989A987893n3768n5512n3279m7772m5140m5194m2469l7564l6261l8243l7483
$$ y = [81067028, 74424575, 67329204, 60366809, 53873046, 47976044, 42703622, 38062543, 34032138, 30544793, 27518041, 24891220, 22615782, 20637325, 18910011, 17409424, 16112333, 14979557, 13973214, 13074479, 12270646, 11540381, 10865294, 10241823, 9668640, 9134603, 8630334, 8159437, 7727106, 7328717, 6959717, 6625507, 6330505, 6066162, 5819082, 5582915, 5354745, 5129098, 4904244, 4686856, 4482682, 4289201, 4103345, 3928636, 3768405, 3619304, 3477615, 3345024, 3222690, 3106628, 2994302, 2889030, 2792975, 2702685, 2616198, 2537416, 2468478, 2404624, 2341293, 2279684, 2220953, 2161882, 2101007, 2042271, 1987893, 1934125, 1878613, 1825334, 1777562, 1732422, 1687228, 1644759, 1607195, 1570934, 1532691, 1495208]
57978A495208l3447l1597l2972l3026l0682k9255k8695k5828k1848k0880k1791
57967A185187j9995j6468j6265j8829j8716j5435j3894j5228j5578j3934j3220
57956A007625j3532j1883q639p074o989n473l099k523k358L56L314K258n73N85
57942I51995M943O482M279L043L980L661J846K029L954L516N29j070j019l119
57928I85049p552j0294j0594j1664j3533j2732r659q803j0731j1137q898p911
57916H61541r661j0804r631q576q774q195o446n720n963m541j459N49J370L338
57902G87028N683N207K570J674K622J726j215k342j107j512m891p886q739r467
57888G69351j0626j0091q288q512j0747j0999q024n030l608j816P03J652J206
$$ y = [1495208, 1461761, 1430164, 1397192, 1364166, 1333484, 1304229, 1275534, 1249706, 1227858, 1206978, 1185187, 1165192, 1148724, 1132459, 1113630, 1094914, 1079479, 1065585, 1050357, 1034779, 1020845, 1007625, 994093, 982210, 973571, 966497, 959508, 954035, 950936, 948413, 946055, 946411, 949725, 951983, 951410, 951995, 956938, 963420, 967699, 970742, 974722, 978383, 980229, 982258, 986212, 989728, 990257, 989187, 988168, 985049, 977497, 967203, 956609, 944945, 931412, 918680, 909021, 900218, 889487, 878350, 869452, 861541, 851880, 841076, 831445, 822869, 814095, 805900, 799454, 793734, 787771, 783230, 781771, 782320, 783690, 787028, 792711, 797918, 800488, 802162, 804784, 806510, 805295, 802953, 801846, 800334, 795443, 787557, 778818, 769351, 758725, 748634, 740346, 731834, 721087, 710088, 702064, 697034, 693426, 691610, 692313, 693965, 695171]
57875F95171K332N010O073N685P589J1888J4227J3541J3835J6478J7498J4867
57863H24194J1841J0524Q390M022J41j884m659r009j1461j0655j0546j3863j7694
57850G79341j8960j9140k0144k0426j8767j7241j6965j5450j1579q690r238j0605
57838E92136r857q472q710r074p281m356k361j040L21Q27L74R17K859L685K482
57823E52450J967L596M820L964L558N598P662P282O228O619O583L809J39j521
57809F12754k025l622n472n618n099o058p565p149m978l131k048p53O47J495K290
57794E63668L593M629N057O237Q737J0559J0112Q932R194J0459J1127J1119J0941
57781F74364R984P938O151N482M617K326m69k557m290o018o923p058q099j0387
$$ y = [695171, 697503, 702513, 708586, 714271, 721860, 733748, 747975, 761516, 775351, 791829, 809327, 824194, 836035, 846559, 854949, 858971, 859112, 857228, 852569, 843560, 832099, 821444, 810898, 797035, 779341, 760381, 741241, 721097, 700671, 681904, 664663, 647698, 632248, 620669, 611979, 602741, 592136, 582279, 573807, 565097, 556023, 548742, 544386, 542025, 540985, 541306, 542133, 542507, 543424, 546283, 549968, 552450, 554417, 558013, 562833, 566797, 570355, 575953, 583615, 590897, 597125, 603744, 610327, 614136, 614275, 612754, 610729, 607107, 601635, 596017, 590918, 584860, 577295, 570146, 565168, 562037, 559989, 559236, 559883, 561378, 563668, 567261, 571890, 576947, 583184, 591921, 602480, 612592, 621524, 630718, 641177, 652304, 663423, 674364, 684348, 692286, 698437, 703919, 708536, 710862, 710393, 707836, 703546, 697528, 690605, 683547, 675448, 665061]
57767F65061j1801j1222j0430j0776j0839r420p821o969n377k453p32j971l897
57754E71353l784k570k396k684j943j120j804l091l468l860n655p584p715o804
57740E16875o623o752o098n735o875p705n787k351p06j262j485q1J901L703N609
57725D76628P224P652P279P403Q186Q704Q588Q099P242O197N801O308O811P039
57711E79161Q238J0898J3263J3652J2621J1303R461O868M692L609K367Q6j912
57698F74307k532l133n238p923r677j0851j2135j2551j1396j0171j0233j0407
57686E68060r314q014p828p592n810l540k387j533K63J764J484R36K206L977L505
57671E36177J276K14J201K682L815M860N307M693M459O056Q156Q648Q339R559
$$ y = [665061, 653260, 642038, 631608, 620832, 609993, 600573, 592752, 585783, 580406, 577953, 577221, 575250, 571353, 567569, 564999, 562603, 559919, 557976, 556856, 555052, 551961, 548493, 544633, 538978, 531394, 523679, 516875, 510252, 503500, 497402, 491667, 484792, 477087, 471300, 468949, 468243, 466981, 465496, 465415, 467316, 471019, 476628, 483852, 491504, 498783, 506186, 514372, 523076, 531664, 539763, 547005, 553202, 559003, 565311, 572122, 579161, 587399, 598297, 611560, 625212, 637833, 649136, 658597, 665465, 670157, 673766, 676133, 676219, 674307, 671775, 668642, 663404, 655481, 645804, 634953, 622818, 610267, 598871, 588700, 578467, 568060, 558746, 550732, 542904, 535312, 529502, 525962, 523575, 522042, 522305, 524069, 525553, 526489, 528695, 532672, 536177, 537453, 537667, 538868, 541550, 545365, 550225, 555532, 560225, 564684, 570740, 578896, 587544, 595883, 605442]
57657F05442J2069J3604J3625J3403J3164J2386J2076J3449J5016J4373J2375
57646G50982J2103J4065J5804J6145J6491J7920K0132K3342K8266L4033L8888
57635I88171M2871M7076N0431N0195M5687L8826L1123K2864J5042R054M534L94
57623A346268k084l27N310J1532J6574K1700K8080L5286M3316N2969O3601P3328
57611A695553Q2112R1858J02924J13495J22927J32559J42169J48656J49719J46136
57601B928108J38637J24569R9470O1069J1528m2409r1252j27407j49584j61573
57591B791156j66672j65210j57297j45015j30877j16420j03097r2288q3460p4580
57581A556240o5231n7239n1420m6089l9862l3625k8375k3427j8195j3823j1331
$$ y = [605442, 617511, 631115, 644740, 658143, 671307, 683693, 695769, 709218, 724234, 738607, 750982, 763085, 777150, 792954, 809099, 825590, 843510, 863642, 886984, 915250, 949283, 988171, 1031042, 1078118, 1128549, 1178744, 1224431, 1263257, 1294380, 1317244, 1332286, 1341340, 1345874, 1346268, 1344184, 1343857, 1349167, 1360699, 1377273, 1398973, 1427053, 1462339, 1505655, 1558624, 1622225, 1695553, 1777665, 1869523, 1972447, 2085942, 2208869, 2341428, 2483597, 2632253, 2781972, 2928108, 3066745, 3191314, 3290784, 3351853, 3363381, 3320972, 3229720, 3102313, 2952729, 2791156, 2624484, 2459274, 2301977, 2156962, 2026085, 1909665, 1806568, 1714280, 1630820, 1556240, 1491009, 1433770, 1382350, 1336261, 1296399, 1262774, 1234399, 1210972, 1192777, 1178954, 1167623]
57570A167623r750p618m885k088R15M030O252P357Q998J2663J7541K1699K4418
57557A247155K6157K7295K8284L0334L4426L9951M5160M8871N1141N2780N4505
57546A686059N6169N6477N4046M8880M2024L3820K3559J1035k757j6813l0780
57535A961719m3892n4454o1375o5576o8984p2330p4416p3576o9708o4828o1315
57524A251265n9514n7643n4315n0115m6193m2547l8877l5904l4267l2897l0240
57513G68753k6558k3460k1579k0280j9114j7900j5932j2859r920q536q104o988
57501E77523n189m082l950l837l514l372k755p46J493J653k22j542q11P82J772
57486E53203K256K735L161L762N051O555P209P239P920R378J0458J0810J1116
$$ y = [1167623, 1157873, 1150255, 1145370, 1143282, 1144197, 1148227, 1154479, 1161836, 1170834, 1183497, 1201038, 1222737, 1247155, 1273312, 1300607, 1328891, 1359225, 1393651, 1433602, 1478762, 1527633, 1578774, 1631554, 1686059, 1742228, 1798705, 1852751, 1901631, 1943655, 1977475, 2001034, 2012069, 2009312, 1992499, 1961719, 1917827, 1863373, 1801998, 1736422, 1667438, 1595108, 1520692, 1447116, 1377408, 1312580, 1251265, 1191751, 1134108, 1079793, 1029678, 983485, 940938, 902061, 866157, 831890, 798993, 768753, 742195, 718735, 697156, 676876, 657762, 639862, 623930, 611071, 601151, 592615, 584511, 577523, 572334, 568252, 564302, 560465, 556951, 553579, 550824, 550078, 551571, 553224, 553002, 551460, 550649, 551431, 553203, 555459, 558194, 561355, 565117, 570168, 576723, 583932, 591171, 599091, 608469, 618927, 629737, 640853]
57473F40853J1306J0791J0414J1707J4026J5070J4603J4956J7165J9398K0179
57462H00468K0519K1694K3406K5400K8522L2719L6151L7743L8718M0175M1075
57451A146590M0118L7846L5335L2346K8003K1957J3811L087r057j9665k6952l1993
57439A271426l6529m0747m4241m7307m9748n0008m7242m3105m0009l8426l6989
57428G97075l4379l0340k5751k2331k1163k1067j9680j6486j3191j0890q857o554
57416E66386m626l125j024J533K794K379K339L927N641O053O398Q346J1185J3332
57402F21538J5092J7806K1440K4975K8143L1208L3908L5964L7715L9256M0006
57391I47051L9920L9591L8490L5047K9378K3611J8254J0799k59j2358k2028k9052
$$ y = [640853, 652159, 662950, 673364, 685071, 699097, 714167, 728770, 743726, 760891, 780289, 800468, 820987, 842681, 866087, 891487, 920009, 952728, 988879, 1026622, 1065340, 1105515, 1146590, 1186708, 1224554, 1259889, 1292235, 1320238, 1342195, 1356006, 1359093, 1350036, 1330371, 1303419, 1271426, 1234897, 1194150, 1149909, 1102602, 1052854, 1002846, 955604, 912499, 872490, 834064, 797075, 762696, 732356, 706605, 684274, 663111, 642044, 622364, 605878, 592687, 581797, 572940, 566386, 561760, 558635, 557611, 559144, 561938, 564317, 566656, 570583, 576224, 582277, 588675, 597021, 608206, 621538, 636630, 654436, 675876, 700851, 728994, 760202, 794110, 830074, 867789, 907045, 947051, 986971, 1026562, 1065052, 1100099, 1129477, 1153088, 1171342, 1182141, 1181882, 1169524, 1147496, 1118444]
57379A118444l5185m0695m4772m7669m9889n0523m8883m6523m5222m4224m1920
57368F22939l8948l6872l4883l0931k5561k1651k0394k0157j9374j8193j7087
57357C38888j5884j4617j3669j2885j1835j0828j0395j0122r298q344q100q266
57345B04645p967p326o928o281m535k324j143j157j139m38L97P66N99J2o07o39
57329A65935k40n27j781k573j874q16r43j953k847l907n458o044m394k292k651
57314A27635n040o013m047j439p49j646k357k369k408k953l748m331m413m085
57300H2037l756l674l700l782m051m137l238j538n37j135k420l141l199k865j872
57285C8992n11j39j215k237k040j597j827j494M74K185J167j503k367m85J567
$$ y = [1118444, 1083259, 1042564, 997792, 950123, 900234, 849711, 800828, 754305, 709083, 664859, 622939, 583991, 547119, 512236, 481305, 455744, 434093, 413699, 393542, 374168, 355975, 338888, 323004, 308387, 294718, 281833, 269998, 259170, 248775, 238653, 229355, 221011, 212911, 204645, 196678, 189352, 182424, 176143, 171608, 169284, 168141, 166984, 165845, 165407, 165804, 166570, 167169, 167181, 166574, 165935, 165695, 165168, 163387, 160814, 158940, 158124, 157181, 155228, 152381, 148474, 143016, 136972, 132578, 130286, 127635, 122595, 116582, 112535, 111096, 110347, 108701, 106344, 103975, 101567, 98614, 94866, 90535, 86122, 82037, 78281, 74607, 70907, 67125, 63074, 58937, 55699, 54161, 53624, 52489, 50069, 46928, 43729, 40864, 38992, 38481, 38342, 37127, 34890, 32850, 31253, 29426, 27932, 28406, 30591, 31758, 30255, 27888, 27403, 28970]
57270B8970J554L6j244j389m98O61J024L47l70m71o45j232j061L79J361O75K28
57253B8325K046M279L522J88k067j787j033j246j389o98r6K6N90J514J237n21
57237C2890j851j452k47O52J599L168M969O425P361P439O495N423N257N555N422
57222H9105N536O939Q386P658N311M129M801N236M687N162P690J0173J0577R601
57208A84991Q640P404N360L556L087L052J764r12l580n002m995m426m646o028
57194A88265p117o311m155k497j769q53O27K011L420N606P943Q848Q439Q550R916
57179B20923J1518J2803J4287J5763J6363J6527J7554J9099J9652J9406J9761
57168D03656K0100J8407J5442J4716J7414K0690K2116K2445K2793K2441K1138
$$ y = [28970, 30524, 30560, 29316, 27927, 27429, 28090, 29114, 29461, 29091, 28620, 27975, 26743, 25682, 26061, 27422, 28097, 28325, 30371, 34650, 38172, 38360, 36293, 34506, 33473, 32227, 30838, 30140, 30044, 30070, 30660, 32174, 33411, 32890, 31039, 29587, 29340, 29992, 31591, 34759, 39728, 46153, 53514, 60953, 67448, 72871, 78128, 83683, 89105, 94641, 101580, 109966, 117624, 122935, 127064, 131865, 137101, 141788, 146950, 154640, 164813, 175390, 184991, 193631, 201035, 206395, 209951, 213038, 216090, 217854, 216942, 213362, 208360, 203365, 198939, 194293, 188265, 181148, 174837, 170682, 168185, 166416, 165563, 166190, 168201, 171621, 177227, 185170, 194018, 202457, 211007, 220923, 232441, 245244, 259531, 275294, 291657, 308184, 325738, 344837, 364489, 383895, 403656, 423756, 442163, 457605, 472321, 489735, 510425, 532541, 554986, 577779, 600220, 621358]
57157F21358K0532K1486K2701K3573K5593K9266L2422L3549L4167L5912L7693
57146I38252L7872L7133L7193L8413M0204M2197M3648M3628M2729M2707M3680
57135A387656M3950M3162M2858M3212M2340L9902L8173L8355L8962L9004L9387
57124A836961L9995L9023L6618L5369L5584L4117K9661K5018K2008J8589J3561
57113B166504R656Q840Q721O927N125N433O785Q165J1346J6727K0582K0525J9750
57100B315086K1743K4827K6284K7706L1324L4838L5292L4501L5254L5525L2257
57089B654637K7747K6145K6236K3807J8860J4344R634J471j0126k2639l6221n2611
57077B681284p0340q6522j01944j19286j38104j56666j76543j99793k23961k45746
$$ y = [621358, 641890, 663376, 686077, 709650, 735243, 764509, 796931, 830480, 864647, 900559, 938252, 976124, 1013257, 1050450, 1088863, 1129067, 1171264, 1214912, 1258540, 1301269, 1343976, 1387656, 1431606, 1474768, 1517626, 1560838, 1603178, 1643080, 1681253, 1719608, 1758570, 1797574, 1836961, 1876956, 1915979, 1952597, 1987966, 2023550, 2057667, 2087328, 2112346, 2134354, 2152943, 2166504, 2176160, 2185000, 2193721, 2200648, 2205773, 2211206, 2217991, 2226156, 2237502, 2254229, 2274811, 2295336, 2315086, 2336829, 2361656, 2387940, 2415646, 2446970, 2481808, 2517100, 2551601, 2586855, 2622380, 2654637, 2682384, 2708529, 2734765, 2758572, 2777432, 2791776, 2801410, 2802881, 2792755, 2770116, 2733895, 2681284, 2610944, 2524422, 2422478, 2303192, 2165088, 2008422, 1831879, 1632086, 1408125, 1162379]
57067A162379k67315k93049B79588g2791l84061m20667m61379n04284n52585o10289
57057c006056o74449p39588q07221q82948r66974j056303j153495j263862j386701
57048a1937597j519134j665938j835085k026560k236991k472545k744758l056583
57040b9495191l406434l804079m267907m807990n426538o132199o936239p835831
57032g2112408q819178r885392j1040056j2273588j3563384j4889485j6226265
57025a58809756j7542263j8849345k0199109k1486098k2196181k1491861j8754472
57018b99329085j4118015q424384k638998K665850P332090J1325758J4558055
57011b88628729J6938700J8478319J9296600J9564580J9444365J9042916J8397460
$$ y = [1162379, 895064, 602015, 279588, -72791, -456852, -877519, -1338898, -1843182, -2395767, -3006056, -3680505, -4420093, -5227314, -6110262, -7077236, -8133539, -9287034, -10550896, -11937597, -13456731, -15122669, -16957754, -18984314, -21221305, -23693850, -26438608, -29495191, -32901625, -36705704, -40973611, -45781601, -51208139, -57340338, -64276577, -72112408, -80931586, -90816978, -101857034, -114130622, -127694006, -142583491, -158809756, -176352019, -195201364, -215400473, -236886571, -259082752, -280574613, -299329085, -313447100, -321871484, -324510482, -321844632, -314512542, -303186784, -288628729, -271690029, -253211710, -233915110, -214350530, -194906165, -175863249, -157465789]
57004a57465789J7511925J6410744J5151885J3800454J2411923J1038185R726955
56997f1413718Q508715P396443O399781N527825M778187M136688L590293L130528
56989a7945258K744257K413073K124512J874818J659271J469105J299564J151932
56981c208726J025129R13085d58155B66411O49115N80692N16611M59630M11033
56972B883492L67218L25832K89266K59090K32350K06425J82736J62805J45018
56963E054232J28195J14380J05039R7764Q9500Q0345P1873O4299N7214N0810M4533
56952E958184L6580K6147J4224J339j3253k9311m4856n8596p0951q2069r1212
56941E646226r8819j06871j16473j27079j38497j51310j64780j76626j85509j91669
$$ y = [-157465789, -139953864, -123543120, -108391235, -94590781, -82178858, -71140673, -61413718, -52905003, -45508560, -39108779, -33580954, -28802767, -24666079, -21075786, -17945258, -15201001, -12787928, -10663416, -8788598, -7129327, -5660222, -4360658, -3208726, -2183597, -1270512, -458155, 266411, 915526, 1496218, 2012829, 2472459, 2883492, 3250710, 3576542, 3865808, 4124898, 4357248, 4563673, 4746409, 4909214, 5054232, 5182427, 5296807, 5401846, 5499610, 5589110, 5669455, 5741328, 5805627, 5862841, 5913651, 5958184, 5994764, 6020911, 6035135, 6036474, 6023221, 5993910, 5949054, 5890458, 5819507, 5737438, 5646226, 5547407, 5440536, 5324063, 5196984, 5058487, 4907177, 4742397, 4565771, 4380262, 4188593]
56931D188593j94752j93317j87051j77468j65886j52515j37595j21410j03285
56922B755314q2704o1481m2565k6423j0449Q070L0021N5032Q2535J13049J49251
56911B969650J93129K40551K83092L18570L53148L84009L84103L18185J79684
56902E624121M465j56405k72663l42907l78363l88985l81588l61217l31312k95534
56892B719612k59456k28000k02079j79994j60761j43951j28235j12813r9017q8137
56882A117169p9150p0631o3173n7687n3061m7759m2108l6894l1423k5039j8690
56871E91554j2969o856o44K328l81o816j3719k0587k7625l2463l2941l1197l0728
56858C76956l0912k8749k4690k2059k1296j9499j5820j2801j1757j1008r548q713
$$ y = [4188593, 3993841, 3800524, 3613473, 3436005, 3270119, 3117604, 2980009, 2858599, 2755314, 2672610, 2611129, 2568564, 2542141, 2531692, 2539762, 2569783, 2624815, 2707350, 2820399, 2969650, 3162779, 3403330, 3686422, 4004992, 4358140, 4742149, 5126252, 5444437, 5624121, 5628586, 5472181, 5199518, 4856611, 4478248, 4089263, 3707675, 3346458, 3015146, 2719612, 2460156, 2232156, 2030077, 1850083, 1689322, 1545371, 1417136, 1304323, 1205306, 1117169, 1038019, 967388, 904215, 846528, 793467, 745708, 703600, 666706, 635283, 610244, 591554, 578585, 571729, 571085, 573413, 573032, 566216, 552497, 531910, 504285, 471822, 438881, 407684, 376956, 346044, 317295, 292605, 270546, 249250, 229751, 213931, 201130, 189373, 178365, 168817, 160104]
56846A60104q897q045n014j695j78m6K39J250K796M414N019L950K794L974P115
56831A67780R128Q485P102P209Q827J1207J4266J7234J8145J6296J3514J1504
56819C10697R453N829J133k591m088l518j664M84K048L072M410O520R139J2213
56805C53137J5894J9565K2288K4580K7994L2548L6196L7435L6587L3787K7688
56794F67699J7624N573n458j3979j9883k3023k3311k1455j8377j4409r831n371
56782E35799j386K746P701J3367J9413K5827L2380L8543M4343N0105N4793N5937
56770H79568N2005M3617L1756J6503j266j8445l1726m0248m4871m5823m2884l7268
56758G60918l1392k6569k2207j7381j2043o527p46N613J2529J9467K5656L0690
$$ y = [160104, 151207, 143162, 138148, 136453, 136275, 136229, 136468, 137718, 140514, 144928, 149947, 153897, 156691, 160665, 167780, 176908, 185393, 192495, 199704, 208531, 219738, 234004, 251238, 269383, 285679, 299193, 310697, 320150, 325979, 327112, 324521, 320433, 316915, 315251, 315735, 317783, 320855, 325265, 331785, 340924, 353137, 369031, 388596, 410884, 435464, 463458, 496006, 532202, 569637, 606224, 640011, 667699, 685323, 690896, 685438, 671459, 651576, 628553, 605242, 583787, 565410, 551001, 541170, 535799, 534413, 537159, 544860, 558227, 577640, 603467, 635847, 674390, 718733, 768838, 823631, 879568, 931573, 975190, 1006946, 1023449, 1022183, 1003738, 972012, 931764, 886893, 841070, 798186, 760918, 729526, 702957, 680750, 663369, 651326, 644799, 644053, 649666, 662195, 681662, 707318, 738008]
56746G38008L4802L8026L8940L4995K4731R377p869k3712l5815m3067m5681m4828
56734G17907m1837l7818l3709k9835k5504k0042j4235r667o490l215J053N616
56722E02224R876J4379J9172K2467K2236J8177J1229K172p995j7226k3523k6631
56710E46557k7773k7984k7444k6025k3808k1294j9370j8492j7788j5896j3019
56699C07664j0893j0306r954q639p169o974p889q582q236o784m425j999r00j421
56685B13493k091j763j332j988k880k218m5J746J849N37j421l364m473m197k967
56670A88886j624m68M26O41J85O6R38J856J607N36l04j011k271l542l611k634
56654A79676j928j931j943j713j608j266J60K201L108K118M06o31q24o46l27J8
$$ y = [738008, 772810, 810836, 849776, 884771, 909502, 918879, 911010, 887298, 851483, 808416, 762735, 717907, 676070, 638252, 604543, 574708, 549204, 529162, 514927, 505260, 498770, 495555, 496608, 502224, 512100, 526479, 545651, 568118, 590354, 608531, 619760, 621932, 613937, 596711, 573188, 546557, 518784, 490800, 463356, 437331, 413523, 392229, 372859, 354367, 336579, 320683, 307664, 296771, 286465, 276511, 267872, 260703, 253729, 245840, 237258, 229022, 222238, 217813, 215814, 214914, 213493, 211402, 209639, 208307, 206319, 203439, 201221, 201176, 202922, 204771, 205308, 203887, 200523, 196050, 191853, 188886, 187262, 186794, 187220, 187861, 188046, 188112, 189050, 190906, 192513, 193049, 192745, 191734, 189463, 185921, 182310, 179676, 177748, 175817, 173874, 172161, 170553, 169287, 169447, 171648, 174756, 176874, 177280, 176649, 175825, 175179, 174852, 174870]
56638A74870J67Q6j19n49j164j437j065p19j087j587j177j14L43k05r02r91m18
56621A63932O68J790J854L52j363j492k72M68J51k3N30P70K1o98k07J285K904
56604A70670M301N332N580M964M010L027J704J05p86j68J422K563K288Q27n36
56589B05303l73J561L900M995M504L240J888P10o2m42r99j889k146j039L96O35
56573B20182o2j90N64J153J240J599K396K895K980L243L442K627R96j59n07q32
56557B41567r08M83K969M264L277J431M8j307k790k954j160P51J068P64J528K773
56541B51804K843K017J906K548K453J323O51J383K626L223L355L930N038N528
56527B90628M077P43k571l651k087O26K939M372M772L911K315J288J481K289L080
$$ y = [174870, 175037, 175123, 175004, 174455, 173291, 171854, 170789, 170070, 168983, 167396, 166219, 166105, 166448, 166243, 165341, 164350, 163932, 164600, 166390, 168244, 168596, 167233, 165741, 165469, 165937, 166088, 166065, 166595, 167365, 167386, 166688, 166481, 167766, 170670, 174971, 180303, 185883, 190847, 194857, 197884, 199588, 199693, 198907, 198739, 200161, 202724, 205012, 205839, 205303, 204930, 206491, 210391, 215386, 219890, 223130, 225018, 225728, 225666, 225224, 224225, 222336, 220190, 219151, 219547, 220182, 220120, 219930, 220494, 221647, 222887, 224486, 226882, 229777, 232757, 236000, 239442, 242069, 243065, 242906, 242399, 241567, 240659, 241142, 244111, 248375, 251652, 253083, 253131, 251824, 249034, 246080, 244920, 245671, 246739, 247503, 249031, 251804, 254647, 256664, 258570, 261118, 263571, 264894, 265545, 266928, 269554, 272777, 276132, 280062, 285100, 290628, 294705, 295448, 292877, 289226, 287139, 287765, 290704, 295076, 299848, 303759, 306074, 307362, 308843, 311132, 314212]
56512C14212L809M100L344K304K922N447P489P308O413P242R553J1090J0798R510
56498D05541Q120O960O568P282Q317Q741Q997J0026J1329J1525J0534R594R223
56485E22757Q752P851O946O035M566K765J715J648J384j47k681n202o893p265
56471E42231o454n692o456q657j0413j0274q921q079q193q117p017n811o178q322
56457D33647j0339j0172p839n194l807l864m924o537p804p588n906m216l552l296
56443C48609k620k217l274n290o313n342l447k301k385k940l128k920k855l029
56429C00548k696j260M67J016L11j14O69J636J476O12M63J355K258K403K146K172
56413C13462K560K826K720K827M008O044P289O553M815L977M223M092K997J924
$$ y = [314212, 318021, 322121, 325465, 327769, 330691, 336138, 343627, 350935, 357348, 364590, 374143, 385233, 396031, 405541, 413661, 420621, 427189, 434471, 442788, 451529, 460526, 470552, 481881, 493406, 503940, 513534, 522757, 531509, 539360, 546306, 552341, 556907, 559672, 561387, 563035, 564419, 564272, 561591, 556389, 549496, 542231, 535777, 530085, 523629, 514972, 504559, 494285, 485364, 477285, 469092, 460975, 453958, 448147, 441969, 433647, 423308, 413136, 405297, 400103, 396296, 392432, 387508, 380971, 373167, 365579, 359673, 355457, 351905, 348609, 345989, 343772, 340498, 335208, 328895, 323553, 320106, 317805, 315420, 312480, 309352, 306432, 303577, 300548, 297852, 296592, 297059, 298075, 298386, 298272, 298941, 300577, 302053, 302665, 303128, 304483, 306741, 309144, 311290, 313462, 316022, 318848, 321568, 324395, 328403, 334447, 341736, 348289, 353104, 357081, 361304, 365396, 368393, 370317]
56399C70317J495J241J225K373M378N410M967N030O969R179R437Q035O698N863
56385D42617N019M568N209O224O210N066L756K824K458L122M666N665N075L655
56371E06134K436R85j236l138l468k967l143l921m407m837n759o358n786n185
56357D59350n987p186o767n068m127m340m420m167m477m925m094k281j207j103
56343C99201p14j05o34k075k570j851j660k551l069k679k713l542l571k164j002
56328C68301j301j993j942j794k271k687k530k663l577m097l141j200J025L762
56314C43892O669P917O446L838K477K733L177K735J493J83l72R2O34N2j282j636
56298C79048l92J146J763J776J902K071K170K544L193L532L446L488L741L796
$$ y = [370317, 371812, 373053, 374278, 376651, 381029, 386439, 391406, 396436, 403405, 412584, 422021, 430056, 436754, 442617, 447636, 452204, 457413, 463637, 469847, 474913, 478669, 481493, 483951, 487073, 491739, 497404, 502479, 506134, 508570, 509555, 508319, 505181, 501713, 498746, 495603, 491682, 487275, 482438, 476679, 470321, 464535, 459350, 453363, 446177, 439410, 434342, 430215, 425875, 421455, 417288, 412811, 407886, 403792, 401511, 400304, 399201, 398487, 398382, 397748, 395673, 393103, 391252, 389592, 387041, 383972, 381293, 378580, 375038, 371467, 369303, 368301, 367000, 365007, 363065, 361271, 359000, 356313, 353783, 351120, 347543, 343446, 340305, 339105, 340130, 343892, 350561, 358478, 364924, 368762, 371239, 373972, 377149, 379884, 381377, 381560, 381188, 381280, 381914, 381966, 380684, 379048, 378656, 379802, 381565, 383341, 385243, 387314, 389484, 392028, 395221, 398753, 402199, 405687, 409428, 413224]
56284D13224L972M871N691M886K873J965L015M312M542M647N569O319N774M666
56270D76326M251M416M546M893N751O412O232N683N399N233N127N573O352O198
56256E52392M732L436L671M953O097O789P117O872O300O335P144P603O973N853
56242F36267M830L622K241J459J305P19n09j012j8J363J886J675J150J14j104
56227F53988j368m99J73n1j85N33J403J780J943J798P51m05K94K928N238O135
56211F74456P010Q475Q796P295O309P540R172R092Q532R798J2417J4391J5496
56198G98779J6762J8180J9428K1285K3966K5666K5224K4597K6003K8246K8709
56187A056845K7621K7327K8297K8754K7686K5582K2690J8820J4539J0705P313
$$ y = [413224, 417196, 422067, 427758, 432644, 435517, 437482, 440497, 444809, 449351, 453998, 459567, 465886, 471660, 476326, 480577, 484993, 489539, 494432, 500183, 506595, 512827, 518510, 523909, 529142, 534269, 539842, 546194, 552392, 557124, 560560, 564231, 569184, 575281, 582070, 589187, 596059, 602359, 608694, 615838, 623441, 630414, 636267, 641097, 644719, 646960, 648419, 649724, 650443, 649934, 648922, 648904, 650267, 652153, 653828, 654978, 655092, 653988, 652620, 652121, 652294, 652243, 652058, 652591, 653994, 655774, 657717, 659515, 660266, 659861, 660155, 663083, 668321, 674456, 681466, 689941, 698737, 706032, 712341, 719881, 729053, 738145, 746677, 756475, 768892, 783283, 798779, 815541, 833721, 853149, 874434, 898400, 924066, 949290, 973887, 999890, 1028136, 1056845, 1084466, 1111793, 1140090, 1168844, 1196530, 1222112, 1244802, 1263622, 1278161, 1288866, 1296179]
56176A296179M336K618K338J924K15j637k265k355k938l222k356j522j917k520
56162A286878k301k667m765o627o269n795q428j2919j5087j4123j3230j4193j5229
56149A165245j4635j3132j1930j1140j0761j1136j2023j2763j3063j2420r977
56138A032265o540m950o209p262n351k421j803k677j955qJ39j582k269j334j106
56123I86937k087k076n76K77p9N09K822M726M872M636N287O367P798J0550J4147
56108A044110J6308J6070J4818J3643J2319J1260J1676J3201J4031J3860J4030
56097A195326J4665J4600J4245J5341J7533J8551J8268J9196K2251K5375K7210
56086A402561K8934L1508L4172L6532L9184M1540M2238M2438M5341N1353N7043
$$ y = [1296179, 1300515, 1303133, 1305471, 1307395, 1307610, 1305973, 1303708, 1301353, 1298415, 1295193, 1292837, 1291315, 1289398, 1286878, 1284577, 1281910, 1277145, 1270518, 1264249, 1258454, 1250026, 1237107, 1222020, 1207897, 1194667, 1180474, 1165245, 1150610, 1137478, 1125548, 1114408, 1103647, 1092511, 1080488, 1067725, 1054662, 1042242, 1032265, 1025725, 1020775, 1014566, 1007304, 1001953, 999532, 997729, 995052, 993097, 993089, 993228, 991646, 989377, 988043, 986937, 984850, 982774, 982198, 982475, 982396, 982905, 985727, 990453, 995325, 999961, 1005248, 1011615, 1019413, 1029963, 1044110, 1060418, 1076488, 1091306, 1104949, 1117268, 1128528, 1140204, 1153405, 1167436, 1181296, 1195326, 1209991, 1224591, 1238836, 1254177, 1271710, 1290261, 1308529, 1327725, 1349976, 1375351, 1402561, 1431495, 1463003, 1497175, 1533707, 1572891, 1614431, 1656669, 1699107, 1744448, 1795801, 1852844]
56075A852844O0275O3178O8466P5815Q3639R2052J02268J14886J29987J47312
56065B790722J65786J84786K05973K31608K60840K89906L15586L35646L46422
56056E127275L43826L27423L00419K65751K25641J84899J50101J24048J04108
56047G153491Q6466O8638M7958K2475n316k9608m7560o1292p3434q5386j00787
56036F975645j25333j60342j99920k36512k66002k86382k95872k94782k85942
56027D824558k71376k51367k27759k04297j82637j61762j42257j26711j14725
56018C141667j02436q8637p6665o8284o0692n1796m3525l7241l0799k3100j7017
56007B541475j4451j2654q720l845j62K860N954P867Q499J0408J4530J8224K0155
$$ y = [1852844, 1913119, 1976297, 2044763, 2120578, 2204217, 2296269, 2398537, 2513423, 2643410, 2790722, 2956508, 3141294, 3347267, 3578875, 3839715, 4129621, 4445207, 4780853, 5127275, 5471101, 5798524, 6098943, 6364694, 6590335, 6775234, 6925335, 7049383, 7153491, 7239957, 7308595, 7356553, 7379028, 7373712, 7344104, 7296544, 7235252, 7161818, 7076432, 6975645, 6850312, 6689970, 6490050, 6253538, 5987536, 5701154, 5405282, 5110500, 4824558, 4553182, 4301815, 4074056, 3869759, 3687122, 3525360, 3383103, 3256392, 3141667, 3039231, 2950594, 2873929, 2805645, 2744953, 2693157, 2649632, 2612391, 2581592, 2558492, 2541475, 2527024, 2514370, 2505650, 2501805, 2501643, 2504503, 2510457, 2518324, 2526823, 2537231, 2551761, 2569985, 2590140]
55994B590140K2807K7397L0900L1349L1598L4311L7463L8597L9543M2906M7307
55983B974318M9968N1051N2218N3720N5595N8744O2725O5706O7971P1499P5176
55972C638691P5807P5045P8778Q7465R4157R5167R5602J00433J07307J12867J19115
55961D680434J28050J36499J41983J47857J56937J65858J71424J76857J86069
55952F091968J97373K08527K22121K39933K57579K71004K83015K97749L14223
55943H383492L30782L49809L72292L94083M13350M35031M62231M90614N17424
55934A2149108N47977N86289O27490O66864P07884P53573P98779Q39533Q81171
55925A8558668R28516R77340J024621J077246J140771J209989J281133J362244
$$ y = [2590140, 2612947, 2640344, 2671244, 2702593, 2734191, 2768502, 2805965, 2844562, 2884105, 2927011, 2974318, 3024286, 3075337, 3127555, 3181275, 3236870, 3295614, 3358339, 3424045, 3492016, 3563515, 3638691, 3714498, 3789543, 3868321, 3955786, 4049943, 4145110, 4240712, 4341145, 4448452, 4561319, 4680434, 4808484, 4944983, 5086966, 5234823, 5391760, 5557618, 5729042, 5905899, 6091968, 6289341, 6497868, 6719989, 6959922, 7217501, 7488505, 7771520, 8069269, 8383492, 8714274, 9064083, 9436375, 9830458, 10243808, 10678839, 11141070, 11631684, 12149108, 12697085, 13283374, 13910864, 14577728, 15285612, 16039185, 16837964, 17677497, 18558668, 19487184, 20464524, 21489145, 22566391, 23707162, 24917151, 26198284, 27560528]
55917B7560528J459954J567353J677056J794174J923416K057104K191442K341646
55909D2572673K524417K738466K979085L257358L586406L964586M393736M898284
55901G0915011N503320O209799P014377P934179Q985725J0163324J1471952J2960465
55893A41158152J4691472J6709364J9072851K1866299K5110082K8691465L2411999
55886B99711684L5930939L8407499L8252254L3694467K4073702J0700931l671448
55879D77100028j6335884k5758090l1658486l4481513l4938483l3783284l1660091
55872B68484197k9009131k6108838k3176230k0387993j7843392j5572277j3581112
55865A22805224j1863945j0388524r112974q014549p080184o281224n583200m971461
$$ y = [27560528, 29020482, 30587835, 32264891, 34059065, 35982481, 38039585, 40231027, 42572673, 45097090, 47835556, 50814641, 54071999, 57658405, 61622991, 66016727, 70915011, 76418331, 82628130, 89642507, 97576686, 106562411, 116725735, 128197687, 141158152, 155849624, 172558988, 191631839, 213498138, 238608220, 267299685, 299711684, 335642623, 374050122, 412302376, 445996843, 470070545, 480771476, 477100028, 460764144, 435006054, 403347568, 368866055, 333927572, 300144288, 268484197, 239475066, 213366228, 190189998, 169802005, 151958613, 136386336, 122805224, 110941279, 100552755, 91439781, 83425232, 76345048, 70063824, 64480624, 59509163]
55857E9509163m444293l989385l588426l236792k937707k682703k455814k251311
55849C3922732k070569j907386j752561j607922j480623j368239j263199j166721
55841B1305512j084359j012323r41872q73499q14071p63347p15469o70489o32604
55832A3797479n99806n66499n33808n06599m82896m56766m29429m07042l89324
55823I425310l70457l49766l31788l16747l00313k82331k67100k55220k43052
55814F708536k29924k18383k07689j94446j79427j66728j56113j42912j25862
55805E087052j09026r5717q6085q0906q2308r0030j01037j12939j24299j32770
55795D071935j37006j39219j41973j43666j41055j34441j26441j17606j07592
$$ y = [59509163, 55064870, 51075485, 47487059, 44250267, 41312560, 38629857, 36174043, 33922732, 31852163, 29944777, 28192216, 26584294, 25103671, 23735432, 22472233, 21305512, 20221153, 19208830, 18266958, 17393459, 16579388, 15816041, 15100572, 14430083, 13797479, 13197673, 12631174, 12097366, 11590767, 11107871, 10651105, 10221676, 9814634, 9425310, 9054853, 8705087, 8373299, 8056552, 7756239, 7473908, 7206808, 6951588, 6708536, 6478612, 6260229, 6052540, 5858094, 5678667, 5511939, 5355826, 5212914, 5087052, 4978026, 4882309, 4796224, 4715318, 4633010, 4542980, 4441943, 4329004, 4204705, 4071935, 3934929, 3795710, 3653737, 3510071, 3369016, 3234575, 3108134, 2990528, 2882936]
55786B882936r8500r2421q7428q0587p3038o7533o2963n6350m8490m2455l7953
55775B135218l2252k5445j9724j4616p921l67N516J0394J7098K5252L1533L4534
55763B159220L4759L0622J9354J925j7221l5007n0511o1955o7520o8810o9099
55752A875757o8517o5022n9511n5303n2781m9141m3618l8418l4185k9023k2723
55741A357515j7766j5082j2487q516m526j929k12J398K815M242O088P398O581
55728A325519L863Q77j940n258q677j1032j2502j3896j4321j2165q032m137j208
55715A237091J515L690L780J239l317r328j5647j9900k0981k0955k1966k2914
55703A112307k1998k0572k0839k1444j9599j6359j5361j7066j8707j9512k1347
$$ y = [2882936, 2784436, 2692015, 2604587, 2524000, 2450962, 2383429, 2320466, 2264116, 2215626, 2173171, 2135218, 2102966, 2077521, 2057797, 2043181, 2035260, 2034893, 2040409, 2050803, 2067901, 2093153, 2124686, 2159220, 2193979, 2224601, 2243955, 2245880, 2228659, 2193652, 2143141, 2081186, 2013666, 1944856, 1875757, 1807240, 1742218, 1682707, 1627404, 1574623, 1525482, 1481864, 1443446, 1409261, 1380238, 1357515, 1339749, 1324667, 1312180, 1303664, 1299138, 1297209, 1296997, 1298395, 1301210, 1305452, 1311540, 1318938, 1325519, 1329382, 1330259, 1328319, 1323061, 1314384, 1303352, 1290850, 1276954, 1262633, 1250468, 1242436, 1238299, 1237091, 1238606, 1242296, 1246076, 1247315, 1243998, 1234670, 1219023, 1199123, 1178142, 1157187, 1135221, 1112307, 1090309, 1069737, 1048898, 1027454, 1007855, 991496, 976135, 959069, 940362, 920850, 899503]
55692H99503k4045k4756k2662k0307j9305j8428j6786j5375j4521j3054j0961
55681F99303r883j0212j0552j0640j1816j4017j5250j4659j3353j1796r353o747
55669E61025n831o415o429n718o335q471r636q903q452r548j0274q980p071o498
55655D52464o939p237p371p386o330l910j532l30L11J308K405L085L393L178K078
55640D27187O31k5L8l41j438k555l749n513o941o597n173m684m979l912j178J112
55624C81883K265M132P422R980J0151R166Q635Q089O521M295K077k90k666m269
55610D47391n367p464j0790j3506j4217j3392j1714r258p087p147r450j1407j1047
55597C15545q868n960k730l00l91k450l409j742N38J190O34J32l92j070r34J76
$$ y = [899503, 875458, 850702, 828040, 807733, 788428, 770000, 753214, 737839, 723318, 710264, 699303, 689420, 679208, 668656, 658016, 646200, 632183, 616933, 602274, 588921, 577125, 567772, 561025, 555194, 548779, 542350, 536632, 530297, 521826, 512190, 503287, 494835, 485287, 475013, 466033, 458962, 452464, 445525, 438288, 430917, 423531, 417201, 413291, 411759, 411429, 411740, 413048, 415453, 418538, 421931, 425109, 427187, 427818, 427793, 427831, 427490, 426052, 423497, 419748, 414235, 407294, 400697, 395524, 390840, 385861, 381949, 380771, 381883, 384148, 388280, 395702, 405682, 415833, 424999, 433634, 441723, 448244, 452539, 454616, 454326, 451660, 447391, 442024, 434560, 423770, 410264, 396047, 382655, 370941, 361683, 354596, 347449, 337999, 326592, 315545, 306677, 300717, 297987, 297687, 297296, 294846, 291437, 289695, 290233, 291423, 292057, 292189, 291797, 290727, 289793, 289969]
55581B89969O87j22q02n93j128l387n412n284m231m226m506l305j331o25j045
55566B54659p44M29P31m85j897k393k309k268k230j892j266p42r92k266l559l452
55550B29324k114j217j418j434l81P29Q50O21R62J431J385J431K249L230L675
55535B39323M148N240O097N710M671M223M419M587M663M813M679M320N005P539
55521C09437J0641J2382J2710J3311J5343J8353K1033K2388K2706K3830K7592
55510E09726L3574L9536M4354M9107N4630N9957O4169O7875P1351P2686O9537
55499A136502O1590M9854L4730J6492l213k1970l8259n1487o1244o7614p1322
55488I84059p2578p0778o6274o1120n6874n2931m8257m3344l8987l4547k9321
$$ y = [289969, 290656, 290534, 289732, 289139, 288011, 284624, 279212, 273928, 269697, 265471, 260965, 257660, 256329, 255704, 254659, 253915, 254344, 255075, 254590, 252693, 250300, 247991, 245723, 243493, 241601, 240335, 239593, 238601, 236335, 232776, 229324, 227210, 225993, 224575, 223141, 222760, 223489, 224339, 224960, 225922, 227353, 228738, 230169, 232418, 235648, 239323, 243471, 248711, 254808, 260518, 265189, 269412, 273831, 278418, 283081, 287894, 292573, 296893, 301898, 309437, 320078, 332460, 345170, 358481, 373824, 392177, 413210, 435598, 458304, 482134, 509726, 543300, 582836, 627190, 676297, 730927, 790884, 855053, 922928, 994279, 1066965, 1136502, 1198092, 1247946, 1282676, 1299168, 1295955, 1273985, 1235726, 1184239, 1122995, 1055381, 984059, 911481, 840703, 774429, 713309, 656435, 603504, 555247, 511903, 472916, 438369, 409048]
55477D09048k4493k1705k0434j8711j6032j3719j2566j1785j0367q464p152p308
55465B36312q550r182p938n796m887n461n623m432l205k880k381j016k40j207
55451A73514k487k339j524j591j954j203k9j98j516k351k554l255m173l743j902
55436A42695n23q69k406m124n414n635m463k771j789j588j631k182l589m750m175
55421I6786k321j056j019j275j366j869k786l182k705k033j553r32j46K10n1l49
55405G4353j91L09N46m42l240o576p530m612Q0L049L196K020R19J15k69M3O66
55388F2436Q93P88P94P74O02J012K306L094K169Q61J355L226M042L207K581L040
55372I3180L029J434l75o28L17R35P88O37Q55Q96K45o87q18L07J562J313l36j398
$$ y = [409048, 384555, 362850, 342416, 323705, 307673, 293954, 281388, 269603, 259236, 250772, 243620, 236312, 227762, 218580, 210642, 204846, 199959, 194498, 188875, 184443, 181238, 178358, 175977, 174961, 174721, 173514, 171027, 168688, 167164, 165573, 163619, 162416, 162387, 162189, 160673, 158322, 155768, 152513, 148340, 144597, 142695, 142172, 141303, 138897, 134773, 129359, 123724, 119261, 116490, 114701, 113113, 111482, 109300, 105711, 100961, 96786, 94465, 93409, 92390, 91115, 89749, 87880, 85094, 81912, 79207, 77174, 75621, 74689, 74543, 74753, 74702, 74353, 74162, 74471, 75017, 74575, 71335, 64759, 57229, 52617, 52697, 55746, 58942, 60962, 61881, 61996, 61727, 61770, 62436, 63329, 64117, 64911, 65685, 66287, 67299, 69605, 72699, 74868, 75729, 77084, 80310, 84352, 87559, 90140, 93180, 96209, 97643, 97268, 96640, 96957, 97892, 98680, 99317, 100172, 101068, 101313, 100626, 99808, 100115, 101677, 102990, 102654, 101256]
55354A01256p28M49P22P07J438K058J346M45J438L717M606L562K948M115N342
55339A33421M740L014J962J890J739P44j032k964m010l473k096j501k220l218
55325A26996l518l224k685j841q69m79j128k597m429o016o397n048k898j530j378
55310H2959j539j182j03J699L805M978M402L079K685L285L539K783J462k01k174
55295A09477l581l424k253j474j346j341j900l556m788l437l49J217J12j488j930
55280G9939k119k722k390m60J173R31J46P07J873J618j69j848k486k329j676p78
55264F9410k23j04L93J510K022R81p50j880k428k754k144j46J786J846N36j73
55248F7882P3l10k107l993m323l011j107M80J415J755J788J793J874K028K176
$$ y = [101256, 100528, 100977, 101699, 102406, 103844, 105902, 107248, 107693, 109131, 112848, 117454, 121016, 123964, 128079, 133421, 138161, 141175, 143137, 145027, 146766, 147510, 146478, 143514, 139504, 136031, 133935, 132434, 130214, 126996, 123478, 120254, 117569, 115728, 114859, 114380, 113252, 110655, 106226, 100210, 93813, 88765, 85867, 84337, 82959, 81420, 80238, 80135, 81834, 85639, 90617, 95019, 98098, 100783, 104068, 107607, 110390, 111852, 111651, 109477, 105896, 102472, 100219, 98745, 97399, 96058, 94158, 90602, 85814, 82377, 82028, 83245, 83357, 81869, 79939, 77820, 75098, 72708, 72248, 73421, 74352, 74498, 75205, 77078, 78696, 78527, 76679, 74193, 71864, 70188, 69410, 69187, 69083, 69476, 70986, 73008, 73989, 73239, 71359, 68931, 66177, 64033, 63887, 65673, 67519, 68055, 67882, 67955, 67645, 65538, 61545, 57222, 54211, 53104, 53584, 54999, 56754, 58542, 60335, 62209, 64237, 66413]
55233F6413J995J181Q3m64k76l7j04J33J134K201K374J755J140P80L04l84q45
55216G7383q05o27j025k300l695l740j884L78Q70n93j898j313M40J355O31o84
55200F2493j083j25J195J401J83j066r81j05l7r69j468q58j99l28m74K58J255
55183E9092J312L70o97j341j550j284n52L04R44J325J464J350J244J335J076j85
55167F4207j854k463j635n29m5J08K85L28O01J938L680L568Q20k096k406o16N27
55150F4418j02r67m51J091K103J667K87p75p78j53L17P09J554K483K437J430O27
55133G5897M80K47k26L3J070J332J35r65o81j85r37j896j155O83J178l64k218
55116G2428l041l207l168k465j042p5o09k165l207k575l43K128L093J966jj135
$$ y = [66413, 68408, 69589, 69672, 69208, 68932, 68895, 68791, 68924, 70058, 72259, 74633, 76388, 77528, 78308, 78612, 78228, 77383, 76578, 75951, 74926, 72626, 68931, 65191, 63307, 63685, 64555, 63962, 62064, 60751, 61191, 62546, 63177, 62493, 61410, 61285, 62480, 63881, 64064, 62998, 62017, 61912, 61875, 60906, 59438, 58580, 58381, 58053, 57579, 57837, 59092, 60404, 60774, 60077, 58736, 57186, 55902, 55350, 55654, 56598, 57923, 59387, 60737, 61981, 63316, 64392, 64207, 62353, 59890, 58255, 57726, 57681, 57789, 58074, 58402, 59003, 60941, 64621, 68189, 69009, 66913, 64507, 63891, 64418, 64316, 63349, 62898, 63989, 66092, 67759, 68046, 67271, 66493, 66340, 66657, 67366, 68920, 71403, 73840, 75270, 75897, 76377, 76624, 76398, 76431, 77501, 78833, 78968, 78003, 77322, 77137, 76200, 74304, 73149, 73832, 75010, 74646, 72428, 69387, 66180, 63012, 60547, 59505, 59430, 58821, 56656, 53449, 50874, 50531, 52659, 55752, 57718, 57717, 56582]
55100E6582j198j150j418j284k21J005R76o21k215j729Q71K954K063q54k458j250
55084E0053P95J396R59J215K370L178K952K021Q15k11l18O08J405J049Q8l59l83
55067F7633p49j198o90Q68K386K987K693K053J871K844M577N441M359K155L32
55052I7562o43q53J97K610M753M711K778Q99r7j056k376l132k745k034j966k373
55036I6235k508k186j794j546j062K02J980K880J882Q5k88R85J575M4j884j959
55020I2641p75m75j277j554p32J85O40R40P84n68k438k987j599M92K041K671K087
55003I0076L11j217q30P90J160l85j740j330l03l15r69r62m38n22j303j692r50
54986G9381O15K253L360L685L421K881K001O70n65q98m29kK14Q84K013K529J958
$$ y = [56582, 55384, 54234, 52816, 51532, 51311, 52316, 53292, 52671, 50456, 48727, 49598, 52552, 54615, 53761, 51303, 50053, 50848, 52244, 53203, 54418, 56788, 59966, 62918, 64939, 65754, 65543, 65225, 65833, 67238, 68287, 68375, 68016, 67633, 66884, 65686, 64996, 65864, 68250, 71237, 73930, 75983, 77854, 80698, 85275, 90716, 95075, 97230, 97562, 96919, 96066, 96263, 98873, 103626, 108337, 111115, 112014, 111917, 110861, 108485, 105353, 102608, 100574, 98608, 96235, 93727, 91541, 89747, 88201, 87139, 87341, 89321, 92201, 94083, 94168, 93880, 94865, 96440, 96484, 94600, 92641, 91866, 91391, 90114, 88560, 87828, 88013, 88653, 89593, 90377, 89809, 87371, 84384, 82785, 83277, 85318, 87989, 90076, 90387, 89170, 88340, 89130, 90290, 89905, 88165, 86835, 86532, 86217, 85248, 84286, 83848, 83326, 82023, 80331, 79381, 79996, 82249, 85609, 89294, 92715, 95596, 97597, 98267, 97702, 96804, 96375, 96373, 96587, 97471, 99484, 102013, 103971]
54969A03971J366J844K873L060J976N09k76q3N20O98L10K71J366K824K937J335
54953A25501l61n77L94J228J340J108R41J005J537K604L615L698K649J088l75
54938A45395j643k678k966k034m65L06l94j577j957j718j863k261j911j061j218
54923A21955k389k388j46K124J916Q3o28L79J427J802K415L230K703M92j365j022
54907A30588Q92K406K498J601Q20J256L082M922N043L426J852J769L013M569N486
54892A73223N069L454K203K892M970O248N793M968N216O340P468Q378R228J0068
54878B55518J1200J2961J4723J5330J4821J4477J4532J3369R810N048J214j088
54866C81915k931n425q685j2039j4652j6273j7458j8581j8928j7682j5525j3874
$$ y = [103971, 105337, 107181, 110054, 113114, 115090, 115599, 115323, 115240, 115760, 116458, 116768, 117039, 118405, 121229, 124166, 125501, 125140, 124563, 124957, 126185, 127525, 128633, 129574, 130579, 132116, 134720, 138335, 142033, 144682, 145770, 145395, 143752, 141074, 138108, 136074, 135609, 135915, 135521, 133944, 131987, 130269, 128406, 126145, 124234, 123173, 121955, 119566, 117178, 117032, 119156, 121072, 121155, 120527, 120906, 122333, 124135, 126550, 129780, 132483, 132975, 131610, 130588, 131480, 133886, 136384, 137985, 138805, 140061, 143143, 148065, 153108, 156534, 158386, 160155, 163168, 167737, 173223, 178292, 181746, 183949, 186841, 191811, 198059, 203852, 208820, 214036, 220376, 227844, 236222, 245450, 255518, 266718, 279679, 294402, 309732, 324553, 339030, 353562, 366931, 376741, 381789, 383003, 381915, 378984, 373559, 364874, 352835, 338183, 321910, 304452, 285871, 266943, 249261, 233736, 219862]
54854B19862j2661j0513p377n117m838n210m499k851j493p79r3J086K868N032
54840A73417O760P120O383O047P027Q624R768J0381J1028J2062J3485J4803J4899
54827C01804J3055J0140P484M630kn954j0339j1399j0708j0671j1561j2220j2213
54814B52046j1869j1264j0388r462q268o284m069l094l448l348j866m57n54j332
54800A76343j193O9J899L992N385M389J197j217p47J055J834K069L251M301L150
54785B05777O61m67k36j263m226o707p108o663o732o775o122n330m711l552j982
54770A44564j633l145m775m831l994l795m091l681k491j572j422j569j584j387
54756A04594q09J95J025R14J5n72j1J322K223J914R13N54J487K878L408K869K182
$$ y = [219862, 207201, 196688, 189311, 184194, 179356, 174146, 169647, 166796, 165303, 164524, 164431, 165517, 168385, 173417, 180177, 187297, 193680, 199727, 206754, 215378, 225146, 235527, 246555, 258617, 272102, 286905, 301804, 314859, 324999, 332483, 337113, 337111, 331157, 320818, 309419, 298711, 288040, 276479, 264259, 252046, 240177, 228913, 218525, 209063, 200795, 194511, 190442, 187348, 183900, 180552, 178686, 178229, 177675, 176343, 175150, 175219, 177118, 181110, 186495, 190884, 192081, 190864, 190117, 191172, 193006, 195075, 198326, 202627, 205777, 206438, 205971, 205735, 204472, 200246, 193539, 186431, 179768, 173036, 166261, 160139, 154809, 150098, 146546, 144564, 142931, 139786, 135011, 130180, 126186, 122391, 118300, 114619, 112128, 110556, 109134, 107565, 105981, 104594, 103785, 103980, 105005, 105919, 105934, 105362, 105351, 106673, 108896, 110810, 111723, 112277, 113764, 116642, 120050, 122919, 125101]
54739A25101K024K148K193K406L149M211N123N934P090Q505R159Q206O480O147
54725A97876Q340J1558J3337J3305J3462J5237J7661J8986J8926J8301J7276J5170
54713C79435J1582O849J658l114o655q880j0362j1191j0741r098p631p183o699
54700C17970m926k515j002l79O80K535M182N084N948P413R118J0349J0800J0552
54686C75809R934R317Q615P369N768M827M838M644L479K502L065M399M694L716
54672D52976K412N66k866p317j0805j2820j4912j7913k0535k1407k0828j9730
54660C06821j8454j7198j6262j5113j2740r638p907q388r033p392l808r99j040
54647A78849l533o224o843m928k215o82k44O46K134K366L26k316l295k435j067
$$ y = [125101, 127125, 129273, 131466, 133872, 137021, 141232, 146355, 152289, 159379, 167884, 177043, 185249, 191729, 197876, 206216, 217774, 231111, 244416, 257878, 273115, 290776, 309762, 328688, 346989, 364265, 379435, 391017, 397866, 399524, 396410, 389755, 380875, 370513, 359322, 348581, 339483, 331852, 324669, 317970, 313044, 310529, 309527, 309148, 309828, 312363, 316545, 321629, 327577, 334990, 344108, 354457, 365257, 375809, 385743, 395060, 403675, 411044, 416812, 421639, 426477, 431121, 434600, 437102, 440167, 444566, 449260, 452976, 455388, 455954, 453088, 445771, 434966, 422146, 407234, 389321, 368786, 347379, 326551, 306821, 288367, 271169, 254907, 239794, 227054, 217416, 209509, 201121, 192088, 184696, 180888, 179889, 178849, 175316, 169092, 162249, 157321, 155106, 154424, 154180, 154826, 156960, 159326, 159652, 157336, 154041, 151606, 150539]
54632A50539J36J356K425K837K745K828L270L635L649L451L218K966K581J859
54618A87495Q63L46J196L143M737M955M207L436L062L193L909M737M688L619K693
54603B36279K777L172K814K018J926K757L662M117M418M899N413N648N505N293
54589B90698N882Q067J1341J3880J4572J4441J5244J7110J8684J9306J9772K0817
54577D69814K1969K2224K1001J8104J3654Q442L687k41m326r467j4811j8249j8721
54564E13080j7452j6674j7400j8717j9148j8248j6734j5322j3907j2017r790q134
54552C29537p816q606r517r779r354q484p311o151n665n996o127n011l350l070
54538B33300m710o426o310m666l120k347j960j955k794m168n084n193n013m744
$$ y = [150539, 150675, 152031, 154456, 157293, 160038, 162866, 166136, 169771, 173420, 176871, 180089, 183055, 185636, 187495, 188358, 188704, 189900, 193043, 197780, 202735, 206942, 210378, 213440, 216633, 220542, 225279, 229967, 233586, 236279, 239056, 242228, 245042, 247060, 248986, 251743, 255405, 259522, 263940, 268839, 274252, 279900, 285405, 290698, 296580, 304647, 315988, 329868, 344440, 358881, 374125, 391235, 409919, 429225, 448997, 469814, 491783, 514007, 535008, 553112, 566766, 575208, 578895, 578654, 574328, 564861, 550050, 531801, 513080, 495628, 478954, 461554, 442837, 423689, 405441, 388707, 373385, 359478, 347461, 337671, 329537, 321721, 313115, 303598, 293819, 284465, 275981, 268670, 262519, 256854, 250858, 244731, 239720, 236370, 233300, 228590, 222164, 215854, 211188, 208068, 205721, 203761, 201806, 199012, 194844, 189760, 184567, 179554, 174810]
54524A74810l974k629j178K10J646K628K300J007L10R66J932J929J133N72N62
54509A82224N01j51j242k027j835q88l80j059k000j669n5J501K515L803N312N269
54493A89819K661p27k048m97K331M493N075M211K887K469L468M931N668N604N346
54478B35691N019M478M251N191P232R294J0454J0633J0309J0064J0242J0564J0269
54465C43691Q942P038N193L483J701j80k307n165q696j1672j2737j1964j0807
54452C06520j0514j1049j1276j0016p266m641l971n059n669m291k024q62j086
54439B28796j570j844k258k563k064j131r97j652j484L88K688L621K960J726P13
54424B25329K44O06J687K455J833J06j216r58O79K561L554L257K400K459M220
$$ y = [174810, 170836, 168207, 167029, 167239, 168885, 171513, 173813, 174820, 175130, 176096, 178028, 179957, 181090, 181662, 182224, 182725, 182574, 181332, 179305, 177470, 176582, 176202, 175143, 173143, 171474, 171419, 172920, 175435, 179238, 184550, 189819, 192480, 191753, 189705, 189208, 191539, 196032, 201107, 205318, 208205, 210674, 214142, 219073, 224741, 230345, 235691, 240710, 245188, 249439, 254630, 261862, 271156, 281610, 292243, 302552, 312616, 322858, 333422, 343691, 352633, 359671, 364864, 368347, 370048, 369868, 367561, 362396, 353700, 342028, 329291, 317327, 306520, 296006, 284957, 273681, 263665, 256399, 251758, 247787, 242728, 237059, 232768, 230744, 229882, 228796, 227226, 225382, 223124, 220561, 218497, 217366, 216369, 214717, 213233, 213621, 216309, 219930, 222890, 224616, 225329, 225573, 226179, 227866, 230321, 232154, 232260, 231044, 230086, 230765, 233326, 236880, 240137, 242537, 244996, 249216]
54409B49216O557P281N514K688Q49M45M32P9k13J47J024J889K422K464J870P89
54393B83453l42j363k382l047k592j199m00j265k775l128k077q51k09M3k45j674
54377B59947l807m987m298k696j645j495j683j644j090j99J25q75k368k504q38
54362B29943R79J474J054P42O08N94J534L807N826N493K865J33p48N63L119N275
54346B63261N530M154L510N348Q163Q794O450L440J839J213K57r28j326q45m60
54331C08400q25j491j570q93l90j202l271n140n576m935m288l767k832j832j905
54316B68483l124m054l648k560j995k180k556k694k265r74O95J317K61r55k26
54301B43525K302M210L941K721K576L424L429J982P05R82J775J161o71j568n61
$$ y = [249216, 255773, 263054, 268568, 271256, 272105, 272550, 272982, 273061, 272848, 272995, 274019, 275908, 278330, 280794, 282664, 283453, 283111, 281748, 279366, 276319, 273727, 272528, 272128, 270863, 268088, 264960, 262883, 262032, 261823, 261866, 261621, 259947, 256140, 251153, 246855, 244159, 242514, 241019, 239336, 237692, 236602, 236403, 236528, 235653, 233285, 230781, 229943, 230922, 232396, 233450, 234192, 234800, 235394, 236928, 240735, 246561, 252054, 254919, 255052, 254304, 254867, 257986, 263261, 268791, 272945, 276455, 281803, 289966, 298760, 305210, 308650, 310489, 311702, 311959, 311031, 309705, 308860, 308400, 307575, 306084, 304514, 303621, 303231, 302029, 298758, 293618, 288042, 283107, 278819, 275052, 272220, 270388, 268483, 265359, 261305, 257657, 255097, 253102, 250922, 248366, 245672, 243407, 242433, 243128, 244445, 244706, 243751, 243525, 245827, 250037, 253978, 256699, 259275, 262699, 266128, 268110, 268815, 269797, 271572, 272733, 272062, 270494, 269933]
54286B69933P02L87r30j284k42O36R0j280k056j721r08n06j030k490m405o055
54270B48841o937p016o493n553m476l819m055m874n080l767j656p14j895l762
54256A88744m101k652j212j163k013k722l202l792m236m151l827l533k663o59
54242A48818J546K171O62j740l520m090l632k607j746j710k418l060k939k037
54228A23698p79L02P08K82n95j431k148k788k902j952k84R14Q85J05l41J47J286
54211A15107K282K400J454n6j320j813j593j108p25m00J28O91O64k1l51M71J529
54194A17339J235j15m08J178K759K493J336J470K922L708K887J644J116Q79J58
54179A40601o89p80r7N30M98k1o38j349k326l223l176k031j046j418k338j919
$$ y = [269933, 270635, 271022, 270092, 268808, 268566, 269202, 269292, 268012, 265956, 264235, 263327, 262821, 261791, 259301, 254896, 248841, 241904, 234888, 228395, 222842, 218366, 214547, 210492, 205618, 200538, 196771, 195115, 194401, 192506, 188744, 184643, 181991, 180779, 179616, 177603, 174881, 171679, 167887, 163651, 159500, 155673, 152140, 149477, 148818, 150364, 152535, 153197, 151457, 147937, 143847, 140215, 137608, 135862, 134152, 131734, 128674, 125735, 123698, 122919, 123221, 123929, 124211, 123616, 122185, 120037, 117249, 114347, 112395, 112111, 113025, 113910, 114015, 113674, 113821, 115107, 117389, 119789, 121243, 121187, 119867, 118054, 116461, 115353, 114628, 114228, 114356, 115047, 115711, 115690, 115339, 115810, 117339, 118574, 118459, 118051, 119229, 121988, 124481, 125817, 127287, 130209, 133917, 136804, 138448, 139564, 140443, 140601, 139912, 139132, 139035, 139565, 140063, 140042, 139404, 138055, 135729, 132506, 129330, 127299, 126253, 124835, 122497, 120578]
54163A20578j39Q24j17j166m38J085J181k50j470j738j696j506p68j89j067k907
54147A10217l518j965L33J811K432K597K107Q98m97j863l453m755m485k468k54
54132I7137P91Q37M46n74k253l560l429k077o41m6n37j573j951r99K65L01o00
54115H1537o86M05J067N55K90J245K081J446L73M39R39R6j746k491j523m03k65
54098H3359l23N14J981L015L079K395J406L70p08j762k263j595j83N33k05j438
54082H8175j828j254k61J129K932M193L969K907K447K557J724o05k895l241j456
54067I8493J004K499K344J067k00q61j234j560j254Q8J462J414P9q47k79J126
54051A03341K080J961Q86m78r56K82K460L713L254K174J603J208J65j244k097
$$ y = [120578, 120439, 121263, 121146, 119980, 119542, 120627, 121808, 121558, 120088, 118350, 116654, 115148, 114380, 114191, 113124, 110217, 106699, 104734, 105067, 106878, 109310, 111907, 114014, 114912, 114415, 112552, 109099, 104344, 99859, 97391, 97137, 97928, 98765, 99211, 98637, 96384, 92824, 89395, 87318, 86677, 86631, 86094, 84521, 82570, 81571, 81836, 82137, 81537, 80851, 81256, 82323, 82878, 83168, 84413, 86494, 87940, 88313, 88752, 89691, 89787, 88041, 85550, 84027, 83624, 83359, 83036, 83550, 85531, 88546, 91625, 94020, 95426, 95796, 95088, 93326, 91063, 89468, 89285, 89818, 89613, 88175, 86347, 85093, 84832, 85961, 88893, 93086, 97055, 99962, 102409, 104966, 106690, 106085, 103190, 99949, 98493, 99497, 101996, 104340, 105407, 105207, 104346, 103112, 101552, 100298, 100386, 101848, 103262, 103341, 102494, 102215, 103341, 105421, 107382, 108268, 107790, 106834, 107116, 109576, 113289, 116543, 118717, 120320, 121528, 121693, 120449, 118352]
54036A18352k230k060j396K56K266L046K180J331K165M042M725L169O83q90j152
54021A34487r64j049j419j783j778j102j05J05j059k464k391p80Q00J476K000
54006A23974K878L072J720q6o23M6N48N68J082K217K579J300n67j386p74N83K066
53989A39197L247L609L002K112J713J687J535J570K667M813O655O898N583L755
53975A88043K363J895K449L461L777K918K144L278O227Q684Q925P998Q162R781
53961B60105J1037J0536Q829P108N751M817M950O658R093J0580J0348R039P592
53948C66443O219M697L108J933J468J358Q32n22k251l458l716l446l481m401o157
53933C58626p940q600p649n965n001n216n725n610n037m797n213n837o017n514
$$ y = [118352, 116122, 114062, 112666, 112922, 115188, 118234, 120414, 121745, 123910, 127952, 132677, 135846, 136529, 135639, 134487, 133523, 132474, 131055, 129272, 127494, 126392, 126287, 126392, 125333, 122869, 120478, 119698, 120498, 121974, 123974, 126852, 129924, 131644, 131558, 130935, 130981, 131529, 132097, 133179, 135396, 137975, 139275, 138708, 137322, 136548, 137131, 139197, 142444, 146053, 149055, 151167, 152880, 154567, 156102, 157672, 160339, 165152, 171807, 178705, 184288, 188043, 190406, 192301, 194750, 198211, 201988, 204906, 207050, 210328, 216555, 225239, 234164, 242162, 250324, 260105, 271142, 281678, 290507, 297615, 303366, 308183, 313133, 319791, 328884, 339464, 349812, 358851, 366443, 372662, 377359, 380467, 382400, 383868, 385226, 386058, 385536, 383285, 379827, 376111, 372665, 369184, 364783, 358626, 350686, 342086, 334437, 328472, 323471, 318255, 312530, 306920, 301883, 297086, 291873, 286036, 280019, 274505]
53919B74505m698m125l857l369k408j603j690k463l143l483l580l017j479o8l81
53904B35141j967k425p18J210J264J17k20M45O72L8k85M77J779K977M085M943
53888B47533M937L976K848K222J969J924K456L800N330O035N556M475L774M096
53874C00931N268O451O939O800O592O611O750O865O941O917O701O286N582M324
53860C89958K452N35n65l90Q75K679M402N603O234O525O674O948P883R708J1474
53845D60995J1674J0118Q380P976Q863J0255J1833J3378J4096J3509J2311J1382
53833E94770J0473Q912O912N062L154P61j479k647l085l712m221l832l546n408
53819F02114r134j1665j1077r167q839j0316j1551j1366j0558j0229j0487j0916
$$ y = [274505, 269807, 265682, 261825, 258456, 256048, 254445, 252755, 250292, 247149, 243666, 240086, 237069, 235590, 235522, 235141, 233174, 230749, 230031, 231241, 232505, 232622, 232402, 232847, 233519, 233557, 233272, 233749, 235528, 238505, 242590, 247533, 252470, 256446, 259294, 261516, 263485, 265409, 267865, 271665, 276995, 283030, 288586, 293061, 296835, 300931, 306199, 312650, 319589, 326389, 332981, 339592, 346342, 353207, 360148, 367065, 373766, 380052, 385634, 389958, 392410, 392945, 392380, 391990, 392865, 395544, 399946, 405549, 411783, 418308, 424982, 431930, 439813, 449521, 460995, 472669, 482787, 491167, 499143, 508006, 518261, 530094, 543472, 557568, 571077, 583388, 594770, 605243, 614155, 621067, 626129, 629283, 630044, 628565, 625918, 622833, 619121, 614900, 611068, 607522, 602114, 592980, 581315, 570238, 561071, 552232, 541916, 530365, 518999, 508441, 498212, 487725, 476809]
53807D76809j1312j1599j1574j1078j0194r345r134r826j0856j1162j0269q728
53795C51732p435o787o687o848o933o752o462o269o004n459n016n240n824n823
53781B64193n093m540m562m269k925j211j68L04Q08R93J8j688k583k034j037n01
53765B35705k7Q82J361K06k070l460k897j444n57j12R06K273K367M24k016k602
53749B28939p12K083L808L738K431Q99R3O82K693N203O821O890O191O052O704
53734B82515P010O212N299N867P948R936J0604J0143R175P918O715O176O174N675
53720C87367M383L494L868M492L946K632K029K334K427J938J693J925J548j51
53706D23925k237l218k873k330k739m188n779o650o873p055p087o042l801j882
$$ y = [476809, 465497, 453898, 442324, 431246, 421052, 411707, 402573, 392747, 381891, 370729, 360460, 351732, 344297, 337510, 330823, 323975, 317042, 310290, 303828, 297559, 291555, 286096, 281080, 275840, 270016, 264193, 259100, 254560, 249998, 245729, 242804, 241593, 241425, 241729, 242537, 243530, 243548, 241860, 239277, 237243, 236206, 235705, 235678, 236560, 237921, 238127, 236057, 232597, 229700, 228256, 227699, 227587, 228493, 230766, 233133, 233557, 231541, 228939, 228227, 230310, 234118, 237856, 240287, 241186, 241279, 241961, 244654, 249857, 256678, 263568, 269759, 275811, 282515, 289525, 295737, 301036, 306903, 314851, 324787, 335391, 345534, 354709, 362627, 369342, 375518, 381692, 387367, 391750, 395244, 399112, 403604, 407550, 410182, 412211, 414545, 416972, 418910, 420603, 422528, 424076, 423925, 421688, 418470, 415597, 413267, 410528, 406340, 400561, 393911, 387038, 379983, 372896, 366854, 363053, 361171]
53692C61171j756k983m040m334m249l766k568j300j291k880n070o717p053n593
53678C07571l030j713l393o537p871o602m972m400l676j966r58k218m320m795
53664B51120l594k548k259j730o95k73j095k334k959k852k472k245k446l002l256
53649B17360k462n28J948M108M910L448Q4l031l621j542J138K392K121J725K301
53634B30351L497M031L222J774Q50P31R40J376K284L122K768J264J90N43J359
53619B58302J334Q04R66J924K783L228L603L664K599N18j098r13Q36K561K701
53604B83812J001j179j912m96J915L627L916L015J301p84k466l126k895k215j222
53589B82292r2M38k13j623k835l373l079j581J026L405M119L303K108P53j325
$$ y = [361171, 359415, 356432, 352392, 348058, 343809, 340043, 337475, 336175, 334884, 332004, 326934, 320217, 313164, 307571, 304541, 302828, 299435, 292898, 285027, 278425, 273453, 269053, 265377, 263411, 262453, 260235, 255915, 251120, 247526, 244978, 242719, 240989, 240294, 240021, 238926, 236592, 233633, 230781, 228309, 226064, 223618, 220616, 217360, 214898, 214370, 216318, 220426, 225336, 228784, 228868, 225837, 222216, 220674, 221812, 224204, 226325, 228050, 230351, 233848, 237879, 241101, 242875, 243725, 244456, 245396, 246772, 249056, 252178, 254946, 256210, 256400, 256943, 258302, 259636, 260440, 261406, 263330, 266113, 269341, 272944, 276608, 279207, 279725, 278627, 277714, 278550, 281111, 283812, 284813, 283634, 281722, 281226, 283141, 286768, 290684, 293699, 295000, 294216, 291750, 288624, 285729, 283514, 282292, 282200, 282638, 282425, 280802, 277967, 274594, 271515, 269934, 270960, 274365, 278484, 281787, 283895, 284648, 283323]
53574B83323l379l346p53J862J872j02j242m22O37K70p11m22J289K736K827K241
53558B86680J905J513M74n07r9J607K941K816K020J977L084M703N988O093M492
53543C25687J927L31R33K708L749L762M092N384O390N726L958L072M112N967O759
53528C84557N832M028K249P01l08R6K012L672L140J039J03J726M283N350M344
53513D22824K240P6j246q86Q60K117J350p33k161k044q89O53K060K452J367j74
53497D27866p03l09l61j305k125k068j600j235o93K24R61J055J002J563K615L273
53481D28160K970K151J895K863M539N776O162O367O784O731N715M783N309O899
53467D97104P914Q032Q695J0583J2074J1231Q551O780Q136J2167J6262J8019J7333
$$ y = [283323, 279944, 276598, 275845, 277707, 279579, 279477, 278235, 277813, 278450, 278720, 278009, 277587, 278876, 281612, 284439, 286680, 288585, 290098, 290572, 290065, 289966, 291573, 294514, 297330, 299350, 301327, 304411, 309114, 315102, 321195, 325687, 327614, 327945, 328878, 331586, 335335, 339097, 343189, 348573, 354963, 360689, 364647, 367719, 371831, 377798, 384557, 390389, 394417, 396666, 397367, 397059, 397155, 399167, 402839, 405979, 407018, 407121, 408847, 413130, 418480, 422824, 425064, 425140, 423894, 423008, 423868, 425985, 427335, 426602, 424441, 422397, 421508, 422161, 424221, 426673, 428040, 427866, 427163, 426854, 426493, 425188, 423063, 420995, 419395, 418160, 417467, 417691, 418652, 419707, 420709, 422272, 424887, 428160, 431130, 433281, 435176, 438039, 442578, 448354, 454516, 460883, 467667, 474398, 480113, 484896, 490205, 497104, 505018, 513050, 521745, 532328, 544402, 555633, 564184, 570964, 579100, 591267, 607529, 625548, 642881]
53454F42881J6254J6743J8655K0287K0598K0314K0851K2738K5184K6883K7209
53443H78597K6924K7497K9439L1648L2816L3060L3526L4810L6502L7959L8784
53432A241562L8861L8640L8957L9747L9598L7690L5576L5575L7598L9234L8958
53421A661996L7751L7194L7564L8245L8731L8574L7549L6477L6745L8331L9293
53410B078450L7838L4091K9427K5138K2248K1291K1313K0274J7361J4124J2383
53399B333938J1912J1189R485P019L873K01k936m540n347p212j0547j3678j5162
53386B318195j5807j7593k1118k4888k7217k8178k9167l0785l2012l1992l1770
53375B027668l3069l5585l6987l5984l3956l2807l2359l1086k8601k6051k4484
$$ y = [642881, 659135, 675878, 694533, 714820, 735418, 755732, 776583, 799321, 824505, 851388, 878597, 905521, 933018, 962457, 994105, 1026921, 1059981, 1093507, 1128317, 1164819, 1202778, 1241562, 1280423, 1319063, 1358020, 1397767, 1437365, 1475055, 1510631, 1546206, 1583804, 1623038, 1661996, 1699747, 1736941, 1774505, 1812750, 1851481, 1890055, 1927604, 1964081, 2000826, 2039157, 2078450, 2116288, 2150379, 2179806, 2204944, 2227192, 2248483, 2269796, 2290070, 2307431, 2321555, 2333938, 2345850, 2357039, 2366524, 2373543, 2377416, 2377617, 2374681, 2370141, 2364794, 2357582, 2347035, 2333357, 2318195, 2302388, 2284795, 2263677, 2238789, 2211572, 2183394, 2154227, 2123442, 2091430, 2059438, 2027668, 1994599, 1959014, 1922027, 1886043, 1852087, 1819280, 1786921, 1755835, 1727234, 1701183, 1676699]
53364A676699k3943k3987k3965k2860j9966j5928j2266r659p422m759j715J444
53352A511673M990R148J3166J5694J6349J6530J8342K2611K8136L2948L6169L8427
53340A764183M0725M3487M6593M9674N2095N3322N3747N4731N7313O1130O4947
53329B341947O7910O9933P1400P2997P5429P8631Q1507Q3081Q3714Q4604Q6177
53318C197330Q7721Q8545Q8752Q8687Q8306Q7452Q6306Q5036Q3284Q0431P6350
53307D138200P1573O6613O1371N5384M8547M1359L4400K7775K1260J4915R269
53296D590666M785J192k638q014j5383k3824l1714l8112m3268m7977n2960n8974
53284D273779o6634p5310q2908q7671r0056r1935r4197r6202r7434r8342r9223
$$ y = [1676699, 1652756, 1628769, 1604804, 1581944, 1561978, 1546050, 1533784, 1524125, 1516703, 1511944, 1510229, 1511673, 1516663, 1525811, 1538977, 1554671, 1571020, 1587550, 1605892, 1628503, 1656639, 1689587, 1725756, 1764183, 1804908, 1848395, 1894988, 1944662, 1996757, 2050079, 2103826, 2158557, 2215870, 2277000, 2341947, 2409857, 2479790, 2551190, 2624187, 2699616, 2778247, 2859754, 2942835, 3026549, 3111153, 3197330, 3285051, 3373596, 3462348, 3551035, 3639341, 3726793, 3813099, 3898135, 3981419, 4061850, 4138200, 4209773, 4276386, 4337757, 4393141, 4441688, 4483047, 4517447, 4545222, 4566482, 4581397, 4590666, 4595451, 4596643, 4594005, 4585991, 4570608, 4546784, 4515070, 4476958, 4433690, 4385713, 4332753, 4273779, 4207145, 4131835, 4048927, 3961256, 3871200, 3779265, 3685068, 3588866, 3491432, 3393090, 3293867]
53273C293867r9387r8069r5449r2298q9267q6893q5462q4469q2855q0274p7480
53262B321964p5091p2757o9922o6544o2621n7936n2990m9235m7345m5969m3156
53251A678398l8496l2997k7507k2309j7809j4356j1511q512n386k728m89K101
53239A498399N300Q395J0507J1404J1565J1946J3472J6135J8867K0847K2534K4677
53227A674048K6861K8106K8611K9568L1374L3280L5008L7238M0037M2121M2452
53216B048704M1677M1123M1113M1040M0422L9027L6550L3165L0032K8244K7294
53205B448391K5412K1499J6138J0759O604M471M355M780L381q41o165r994j1892
53192B516898j3830j7356k1656k5036k7349k9879l3405l7564m1905m6402n0670
$$ y = [3293867, 3194480, 3096411, 3000962, 2908664, 2819397, 2732504, 2647042, 2562573, 2479718, 2399444, 2321964, 2246873, 2174116, 2104194, 2037650, 1975029, 1917093, 1864103, 1814868, 1767523, 1721554, 1678398, 1639902, 1606905, 1579398, 1557089, 1539280, 1524924, 1513413, 1504901, 1499515, 1496787, 1496298, 1498399, 1503699, 1512094, 1522601, 1534005, 1545570, 1557516, 1570988, 1587123, 1605990, 1626837, 1649371, 1674048, 1700909, 1729015, 1757626, 1787194, 1818568, 1851848, 1886856, 1924094, 1964131, 2006252, 2048704, 2090381, 2131504, 2172617, 2213657, 2254079, 2293106, 2329656, 2362821, 2392853, 2421097, 2448391, 2473803, 2495302, 2511440, 2522199, 2528803, 2533274, 2537629, 2542409, 2545790, 2544949, 2538784, 2528790, 2516898, 2503068, 2485712, 2464056, 2439020, 2411671, 2381792, 2348387, 2310823, 2268918, 2222516, 2171846]
53181B171846n3831n5603n6750n7982n9118n9733n9881n9572n8333n5983n3263
53170A541797n0899m8630m5929m3199m1337m0463m0043l9985m0478m0978m0491
53159A069365l9084l7985l7802l7536l5975l3316l0735k8757k6797k4279k1573
53148G15526j9489j8118j6691j4781j3264j3239j4148j3971j1810r376q896j0177
53136E51566j0922r774p745o599o903q058r210r602q810p272o119o035o647p285
53122D40585p744p938p495o313n166m946n541o024n862n410n188n198n071m655
53108C58034m158l856l743l529l046k617k821l815n030n719n658n186m631l942
53094C00283l029k189j868j960j740r01k85r94k713l722k973j407o66j026j437
$$ y = [2171846, 2118015, 2062412, 2005662, 1947680, 1888562, 1828829, 1768948, 1709376, 1651043, 1595060, 1541797, 1490898, 1442268, 1396339, 1353140, 1311803, 1271340, 1231297, 1191312, 1150834, 1109856, 1069365, 1030281, 992296, 954494, 916958, 880983, 847667, 816932, 788175, 761378, 737099, 715526, 696037, 677919, 661228, 646447, 633183, 619944, 605796, 591825, 580015, 570639, 561743, 551566, 540644, 530870, 523125, 516526, 509623, 501565, 492355, 482753, 473943, 466671, 460552, 454517, 447870, 440585, 432841, 424903, 417408, 411095, 405929, 400983, 395442, 389418, 383556, 378146, 372958, 367760, 362689, 358034, 353876, 350020, 346277, 342748, 339702, 337085, 334264, 330449, 325419, 319700, 314042, 308856, 304225, 300283, 297254, 295065, 293197, 291237, 289497, 288596, 288311, 287317, 284604, 280882, 277909, 276502, 275836, 274810, 273373]
53079B73373j257r20q73q84p19p35j217j702j547r15n77q75j340j434j241j178
53063B55959j243r32n5O89L47j086k533l001k533j770j122p74j090k226l375l159
53047B32096j135J467K765J990Q1j324j419p79m42p35j215j561j852k021j749
53032B24167j170q88q99l37J001J815J034k75r7J698L140K814J503P96J158J914
53016B37374K345K285K074K235K835L196K811K323K715L567L284J266j257k955
53002B64098l811m328m381l780l028k652k446k240k692m337o325p259o968o409
52988B03442n989n043l170j195l95j118k467l200k942k564l057m044l958k087
52974A62213K36J106K47j063j871k387l108m040m900n401n178m040k500j434j121
$$ y = [273373, 272116, 271196, 270323, 269439, 268720, 267985, 266768, 265066, 263519, 262604, 262027, 261152, 259812, 258378, 257137, 255959, 254716, 253784, 253729, 254418, 254765, 253679, 251146, 248145, 245612, 243842, 242720, 241946, 240856, 238630, 235255, 232096, 230961, 232428, 235193, 237183, 237264, 235940, 234521, 233742, 233300, 232565, 231350, 229789, 227937, 225916, 224167, 222997, 222109, 221210, 220873, 221874, 223689, 224723, 224448, 224351, 226049, 229189, 232003, 233506, 234302, 235460, 237374, 239719, 242004, 244078, 246313, 249148, 252344, 255155, 257478, 260193, 263760, 267044, 268310, 267053, 264098, 260287, 255959, 251578, 247798, 244770, 242118, 239672, 237432, 234740, 230403, 224078, 216819, 209851, 203442, 197453, 192410, 189240, 188045, 187650, 186532, 184065, 180865, 177923, 175359, 172302, 168258, 164300, 162213, 162449, 163555, 163802, 162739, 160868, 158481, 155373, 151333, 146433, 141032, 135854, 131814, 129314, 127880, 126759]
52959A26759j042p35l56k74n92j149j572j356m22L24k17j818k868k246n98O57
52943A12495J008Q91O51L22J23L39O63N17R5L04J338K103J685P78P36J548J756
52926A27352N16j181j777r15M66J329J245M52j36N50K391L524K184j001l545m004
52910A27450l207k362j352K02J424J117k88j070l93R66J961K254J786N17j011
52895A27994j752j316l35N73J445K137J858M10q72m98J193K470K484K081K224
52880A40096K691K724K201J548J050R06J540L146M987N878N470M595M148M093
52866A85073L856L401L303L819M355M187L317K265J166l00j988k954k599j697
52852B05204j633k685l756l935l551l480m000m760n308n209m160k589j724k402
$$ y = [126759, 125717, 124982, 124626, 124352, 123760, 122611, 121039, 119683, 119261, 119585, 119368, 117550, 114682, 112436, 111838, 112495, 113503, 114394, 115045, 115367, 115490, 115829, 116492, 117009, 117104, 117408, 118746, 120849, 122534, 123312, 124048, 125596, 127352, 127868, 126687, 124910, 123995, 124461, 125790, 127035, 127487, 127351, 127901, 130292, 133816, 136000, 134999, 131454, 127450, 124243, 121881, 120529, 120731, 122155, 123272, 122984, 121914, 121521, 122487, 124448, 126702, 128488, 129005, 127994, 126242, 124926, 124591, 125164, 126609, 128746, 130604, 131014, 130142, 129644, 130837, 133307, 135791, 137872, 140096, 142787, 145511, 147712, 149260, 150310, 151216, 152756, 155902, 160889, 166767, 172237, 176832, 180980, 185073, 188929, 192330, 195633, 199452, 203807, 207994, 211311, 213576, 214742, 214442, 212454, 209500, 206901, 205204, 203571, 200886, 197130, 193195, 189644, 186164, 182164, 177404, 172096, 166887, 162727, 160138, 158414, 156012]
52838A56012m080n524o075n628l973j282J070J576N06m70p74j548l238m093k359
52823A20120J063L509L620K270R24K75L78Q10N92r27k837l326j919k00J50o89
52807A23813j267q34M2N79P61J009J281R99n0j083j012K24J505J937J830J874
52791A31608J926J382M30J0L71N06n61k356l207k006N64K687L406L632M715O339
52775A49446O760N169K609K42j932l821m309k948j414j331j659l24K096K891J395
52760A52870R0Q85K610L306K924K444J991J344R98J314J726J993K997M839N458
52745A87789L107o24k240n25K348L700K801N49j682k640j838r0J213J337K93j658
52729A91840l674m262k939j516k178m490n933n332m044l487l234k257o93N19P90
$$ y = [156012, 151932, 146408, 140333, 134705, 130732, 129450, 130520, 132096, 132602, 132132, 131358, 129810, 126572, 122479, 120120, 121183, 124692, 128312, 130582, 131506, 131781, 132159, 132969, 133561, 132634, 129797, 126471, 124552, 124352, 124502, 123813, 122546, 121712, 121754, 122333, 123094, 124103, 125384, 126383, 126333, 125250, 124238, 124462, 125967, 127904, 129734, 131608, 133534, 134916, 135346, 135356, 135727, 136233, 135672, 133316, 130109, 128103, 128667, 131354, 134760, 138392, 143107, 149446, 156206, 161375, 163984, 164226, 162294, 158473, 154164, 151216, 149802, 148471, 146812, 146488, 148584, 151475, 152870, 152960, 153845, 156455, 159761, 162685, 165129, 167120, 168464, 169462, 170776, 172502, 174495, 177492, 182331, 187789, 190896, 190272, 188032, 187507, 189855, 193555, 196356, 196905, 195223, 192583, 190745, 190655, 191868, 193205, 193498, 191840, 188166, 183904, 180965, 179449, 177271, 172781, 166848, 161516, 157472, 153985, 150751, 148494, 147801, 148320, 149110]
52714A49110K8j420k514k258j176j032k390l638l272k013j524j954k057j239j33
52699A22518O33R80P45l70j956k889k530j450p03q18j592k418k571j619J34J756
52683A07850K510K464K163J871J398O50n6m81r60j826k499j937l90K36j248l241
52667A06504k934M1K980L416J839L98J26N16J028J608K000J693P42k19q62j313
52651A17563j401n13J401L233L554J972m85k181k199j044m9J45J41O61J304J130
52635A23232J43o80q10o87p56q80j129k119l877n105m460k281p7J435K891M728
52619A09568N999N325K686j90j291j23J902K886K346J539J747K627K851K057J335
52604A41264J638K622L468M077M651M752L748K111J220J696K645K794J746o4j994
$$ y = [149110, 149138, 147718, 145204, 142946, 141770, 140738, 138348, 134710, 131438, 129425, 127901, 125947, 123890, 122651, 122518, 123151, 124131, 124876, 124506, 122550, 119661, 117131, 115681, 114978, 114160, 112568, 110150, 107579, 105960, 106094, 107850, 110360, 112824, 114987, 116858, 118256, 118906, 118850, 118369, 117409, 115583, 113084, 111147, 110757, 110993, 109745, 106504, 103570, 103611, 106591, 110007, 111846, 112244, 112370, 112886, 113914, 115522, 117522, 119215, 119957, 119738, 118876, 117563, 116162, 115649, 117050, 120283, 123837, 125809, 125324, 123143, 120944, 119900, 119851, 119996, 120137, 120798, 122102, 123232, 123375, 122695, 121885, 121198, 120442, 119562, 118433, 116314, 112437, 107332, 102872, 100591, 100514, 101949, 104840, 109568, 115567, 120892, 123578, 123388, 122097, 121974, 123876, 126762, 129108, 130647, 132394, 135021, 137872, 139929, 141264, 142902, 145524, 148992, 153069, 157720, 162472, 166220, 168331, 169551, 171247, 173892, 176686, 178432, 178368, 176374]
52589A76374l277l166j648K34J332J394Q60j0j147k187k783l265m226n370n669
52574A47446m772l459k358j172K47R66J17j488k016q02J073K393L062L506L726
52559A46469L442K559J076r69l051m253m239l607k885j828m13K14j094l612n223
52544A22586m803l172j643o58j64k24n72m08N68J480J381N78J58N02J090J494
52528A18193J722J587O26r56j927j199O80J827J047o52j140J85J480Q09j259k533
52512A18490k335k120k702k666q03J497J991Q41J44N93P33k14q65P1J591J795
52496A16041O20j27O91K067K096K37k072k995k198q50J74J165K319K713J659K92
52480A21832K72J300J595P18P1L41M62j98n27K67R97L15j064j593j308j289j428
$$ y = [176374, 173097, 169931, 168283, 168517, 169849, 171243, 172103, 172093, 170946, 168759, 165976, 162711, 158485, 153115, 147446, 142674, 139215, 136857, 135685, 135932, 136898, 137015, 135527, 133511, 132709, 133782, 136175, 139237, 142743, 146469, 149911, 152470, 153546, 152577, 149526, 145273, 141034, 137427, 134542, 132714, 132301, 132515, 131421, 127809, 122586, 117783, 114611, 112968, 112310, 112146, 111922, 111350, 110942, 111510, 112990, 114371, 114949, 115107, 115609, 116699, 118193, 119915, 121502, 122128, 121172, 119245, 118046, 118726, 120553, 121600, 120948, 119808, 119993, 121473, 122282, 121023, 118490, 116155, 114035, 111333, 108667, 107864, 109361, 111352, 112193, 112337, 112930, 113663, 113449, 112584, 112655, 114246, 116041, 116661, 116534, 117225, 119292, 121388, 121625, 119553, 116558, 114360, 113510, 113684, 114849, 117168, 119881, 121540, 121832, 122104, 123404, 124999, 125717, 125788, 126129, 126591, 126393, 125866, 126133, 127130, 127445, 126381, 124788, 123480, 122191, 120763]
52463A20763n75J282K720K830K174J594J144N21k99j069j338n65J127K511K315
52448A35135P82o17r75p64q21j242j480r98K68J682K244J490J2j243j843j767
52432A29863r87J02M53n64k125k868k527j758p84O70K138K465J349j60r23o87
52416A23657M01K086L514L382J358j180k452j995p92l9j73q35j359j331p56J50
52400A23636J145J794J615P15q9j84J57L80M60M18k14j565k547j884P8J663J785
52383A27363P60n84j582j626n82P59J501J806K279K600K063J173J117J659J343
52368A40049m7j017p74l31m87n77j94l71j670k584j482Q80K339K036P43p24j874
52351A33915j918n11J103J094o43k307k386j129J92O76L39N9Q63K801M607M974
$$ y = [120763, 120188, 121470, 124190, 127020, 129194, 130788, 131932, 132453, 132154, 131085, 129747, 129182, 130309, 132820, 135135, 135917, 135300, 134325, 133561, 132740, 131498, 130018, 129020, 129288, 130970, 133214, 134704, 134716, 133473, 131630, 129863, 128876, 128978, 129431, 128867, 126742, 123874, 121347, 119589, 118805, 119475, 121613, 124078, 125427, 125267, 124344, 123657, 124058, 126144, 129658, 133040, 134398, 133218, 130766, 128771, 127979, 127940, 127767, 126932, 125573, 124242, 123486, 123636, 124781, 126575, 128190, 128905, 128816, 128632, 128789, 129169, 129629, 130047, 129833, 128268, 125721, 123837, 123915, 125578, 127363, 128123, 127539, 125957, 124331, 123749, 124508, 126009, 127815, 130094, 132694, 134757, 135930, 137047, 138706, 140049, 140002, 138985, 138211, 137880, 137393, 136816, 136622, 136251, 134581, 131997, 130515, 131395, 133734, 135770, 136513, 135789, 133915, 131997, 131486, 132589, 133683, 133040, 130733, 128347, 127218, 127410, 128086, 128425, 128484, 129347, 132148, 136755, 141729]
52335A41729L889K213M73j198k380k637k214j597o48R84K770L568K982J676L78
52320A49988p02j386j323m44P83J673J706Q55j35k31O50J362J043K93J03K69j04
52303A54400r88j487j185l23R05K133K279P79q62n00J563K661J410m48p01L98
52287A60034J045N20m22j078j354j183n11K44N41L55K8k81m65j99P08J887K735
52270A62604K805J834M9j291p18J474L140K957K030J777J495j41k131k020L93
52255A74257K498K464J351Q96J150J452K128L599M926M831L474J986Q87K34N32
52240B06665J911K944K159M55K50K028L615L326K078J579J953K253K142J860J488
52225B36706J341K321M595O639O846N661M862M991M817L337J195j66K7J261K049
$$ y = [141729, 145618, 147831, 148304, 147106, 144726, 142089, 139875, 138278, 137630, 138614, 141384, 144952, 147934, 149610, 149988, 149286, 147900, 146577, 146133, 146916, 148589, 150295, 151150, 151015, 150784, 151434, 152796, 153839, 154132, 154235, 154504, 154400, 153412, 151925, 150740, 150417, 151322, 153455, 155734, 156513, 155651, 155151, 156714, 159375, 160785, 160337, 159636, 160034, 161079, 161599, 161177, 160099, 158745, 157562, 157051, 157295, 157836, 158191, 158219, 157938, 157473, 157274, 157982, 159869, 162604, 165409, 167243, 167292, 166001, 165283, 166757, 169897, 172854, 174884, 176661, 178156, 178015, 175884, 173864, 174257, 176755, 179219, 180570, 181466, 182616, 184068, 186196, 189795, 194721, 199552, 203026, 205012, 205899, 206133, 206665, 208576, 211520, 213679, 214134, 214384, 216412, 220027, 223353, 225431, 227010, 228963, 231216, 233358, 235218, 236706, 238047, 240368, 244963, 251602, 258448, 264109, 268971, 273962, 278779, 282116, 283311, 283145, 283172, 284433, 286482]
52210B86482J093j149k434j270R93J885J230J123K445L407K428O84M10J800L156
52195C02283L482L323L293L199K900K875L410L930L686K750J937J797J996J841
52181C42702J312J277K361L857M363L637L025L640M676M353K282J19l08J115L032
52166C81443M283M815N092N198M792L784K558J568R95R05J291J830K146K498L597
52151D26795N328O455O252N662N871O532O592O289O596P008N876L210J217J320
52137E01003K378K761K478K163J478J21p33K61K574M628O029P436Q636Q481O672
52122E56366M181J906J72n23K54J657J935N52j076j411n08M60P13L61NK21J058
52105E66323J830J702N52j105k770l987m049k720j159j017k285l068k040k49K52
$$ y = [286482, 287575, 286426, 283992, 282722, 283715, 285600, 286830, 287953, 290398, 293805, 296233, 296917, 297327, 299127, 302283, 305765, 309088, 312381, 315580, 318480, 321355, 324765, 328695, 332381, 335131, 337068, 338865, 340861, 342702, 344014, 345291, 347652, 351509, 355872, 359509, 362534, 366174, 370850, 375203, 377485, 377604, 377296, 378411, 381443, 385726, 390541, 395633, 400831, 405623, 409407, 411965, 413533, 414528, 415433, 416724, 418554, 420700, 423198, 426795, 432123, 438578, 444830, 450492, 456363, 462895, 469487, 475776, 482372, 489380, 495256, 498466, 499683, 501003, 503381, 506142, 508620, 510783, 512261, 512382, 511649, 511910, 514484, 519112, 525141, 532577, 541213, 549694, 556366, 560547, 562453, 562625, 562102, 562356, 564013, 565948, 566500, 565424, 564013, 563505, 563965, 564678, 565039, 565044, 565265, 566323, 568153, 569855, 570407, 569302, 566532, 562545, 558496, 555776, 554617, 553600, 551315, 548247, 546207, 545958, 546210]
52090E46210r66k391k691k235k207k716k561r47J131J929J135J61Q2K93j87r81
52074E33059j050n28o50k003l885n394o203o215n436m369l678l250k381j001L3
52059D87049J45k94p73j368k290l267l902m182m302m266l892l016j724o31o19
52044D52668j766k885k868k237k366l355l824k908j260J83J205J652J087j57o88
52029D32481K83J811K666L055L916N150N775N577N440N999O808O978O130M657
52015D96726L356K696K261J358L68Q27L384O434P676O685M980L825L080K301J727
52000E47684J740K139K564L074L832M558M732M135K985J767J099J404K405L187
51986E87305L106K477K130K442L008L202K822K263K181K861L741L711K148l46
$$ y = [546210, 545244, 542853, 540162, 537927, 535720, 533004, 530443, 529496, 530627, 532556, 533691, 533852, 533934, 534227, 534040, 533059, 532009, 531481, 530831, 528828, 524943, 519549, 513346, 507131, 501695, 497326, 493648, 490398, 488017, 487016, 487049, 487194, 486900, 486127, 484759, 482469, 479202, 475300, 471118, 466816, 462550, 458658, 455642, 453918, 453287, 452668, 450902, 448017, 445149, 442912, 440546, 437191, 433367, 430459, 429199, 429382, 430587, 432239, 433326, 433169, 432481, 432764, 434575, 437241, 440296, 444212, 449362, 455137, 460714, 466154, 472153, 478961, 485939, 492069, 496726, 500082, 502778, 505039, 506397, 506765, 507592, 510976, 517410, 525086, 531771, 536751, 540576, 543656, 545957, 547684, 549424, 551563, 554127, 557201, 561033, 565591, 570323, 574458, 577443, 579210, 580309, 581713, 584118, 587305, 590411, 592888, 595018, 597460, 600468, 603670, 606492, 608755, 610936, 613797, 617538, 621249, 623397, 623051]
51972F23051k433l233k897k237k026k588l661m582m855m660m547m683m752m655
51958E71242m814n441o026n893n034l992l240k861k504j417Q61L362M079K345
51944E40667R8l37Q34J566J088M91M11J30o09q97n37p19j865k662k541l081n208
51927E26829o811n604k999k428m598p124q486r463j0524j0729j0005r898j0937
51914D27223j1376r980q102p542p995q252q484r477j0646j0765j0140j0200j1128
51901C03136j1513j0494q849p624o808n830m722m147m509n374n772n089l757k894
51887B15754l156m102m784m681l933k972k071j154o9Q14O25r32k873l915l864
51872A78687l205j805O87L249L847J914p91k345k540k090j341o16o49j489j952
$$ y = [623051, 620618, 617385, 614488, 612251, 610225, 607637, 603976, 599394, 594539, 589879, 585332, 580649, 575897, 571242, 566428, 560987, 554961, 549068, 544034, 540042, 536802, 533941, 531437, 530020, 530881, 534243, 538322, 540667, 540765, 540428, 541262, 542828, 543916, 544407, 544818, 544948, 544339, 543442, 542905, 542186, 540321, 537659, 535118, 532037, 526829, 520018, 514414, 511415, 508987, 504389, 497265, 488779, 479316, 468792, 458063, 448058, 438160, 427223, 415847, 405867, 397765, 390223, 382228, 373976, 365492, 356015, 345369, 334604, 324464, 314264, 303136, 291623, 281129, 272280, 264656, 257848, 252018, 247296, 243149, 238640, 233266, 227494, 222405, 218648, 215754, 212598, 208496, 203712, 199031, 195098, 192126, 190055, 188901, 188832, 189646, 190271, 189339, 186466, 182551, 178687, 175482, 173677, 174364, 177613, 181460, 183374, 182583, 180238, 177698, 175608, 174267, 173651, 173002, 171513, 169561]
51857A69561j252l74n55j157n26J390K759K292P37l02j71M86O09l41j912k988
51841A68256k816j761r06r97j787k188j136J261L424L686K104J86j084k006k843
51826A61393k950j845j32J257J796R64j577m585n460l259k79P83K59L44J411J746
51810A49866P12j31M67J682K131J732J103K48j087k381k658j697k82P69J330J651
51794A53455J597P10q44j796j084N61J344Q64O62J646K505J816N01N10J752K216
51778A66415R94o08j225j105j234j937k870l465l033j291R07K242K476K572L107
51763A61945L575L497L242L307L542L572L254K447J016n60j268o87N47J636K399
51748A91464K925L140L096L079L045K520J490Q01J220K439L510M042M551N606
$$ y = [169561, 168309, 167935, 167380, 166223, 165697, 167087, 169846, 172138, 172875, 172573, 172402, 172888, 173497, 173156, 171244, 168256, 165440, 163679, 162773, 161776, 159989, 157801, 156665, 157926, 161350, 165036, 167140, 167326, 166242, 164236, 161393, 158443, 156598, 156466, 157723, 159519, 160483, 158906, 154321, 148861, 145602, 145323, 146106, 146365, 146709, 148120, 149866, 150578, 150447, 150914, 152596, 154727, 156459, 157562, 157810, 156723, 154342, 151684, 149987, 149705, 150474, 151804, 153455, 155052, 155762, 154918, 153122, 152038, 152599, 153943, 154807, 155469, 157115, 159620, 161436, 161937, 162447, 164199, 166415, 167409, 166801, 165576, 164471, 163237, 161300, 158430, 154965, 151932, 150641, 151548, 153790, 156266, 158838, 161945, 165520, 169017, 172259, 175566, 179108, 182680, 185934, 188381, 189397, 188837, 187569, 186882, 187429, 189065, 191464, 194389, 197529, 200625, 203704, 206749, 209269, 210759, 211560, 212780, 215219, 218729, 222771, 227322, 232928]
51734B32928O950P603O987N826N547O642Q121Q865Q870Q701Q390P659O585N204
51720C34878L020j24l186n041n917o536o531n273l774l803n200n978n238m070
51706B77227l271k308j143j008k216l089k332q64J4N96J372J268o41k861l022
51691B57722j127P46J495J831K261K229J470N88k0n60r40o96qM49P48J589K725
51674B70502K962K069J352J665K076J384p4j079j177p32P8J222K129K089J286
51659B85752O56P46J272J782K115K191J896J372J017J049J385J915K562K989K781
51644C11480K010J249P67J93p34j494j439q57p45j511k625l499m060m175l371
51629B91189j749o22j310l483n370n680m585k881j049N72J459J349O56mm20o20
$$ y = [232928, 239878, 247481, 254468, 260294, 265841, 272483, 280604, 289469, 298339, 307040, 315430, 323089, 329674, 334878, 337898, 337774, 334588, 329547, 323630, 317094, 310563, 305290, 301516, 297713, 292513, 286535, 281297, 277227, 273956, 271648, 270505, 269497, 267281, 264192, 261860, 260996, 261010, 261606, 262978, 264246, 263605, 260744, 257722, 256595, 257341, 258836, 260667, 262928, 265157, 266627, 267215, 267195, 266635, 265695, 264999, 264991, 265440, 266188, 267777, 270502, 273464, 275533, 276885, 278550, 280626, 282010, 281936, 280857, 279680, 278948, 279026, 280248, 282377, 284466, 285752, 286408, 287154, 288426, 290208, 292323, 294514, 296410, 297782, 298799, 299848, 301233, 303148, 305710, 308699, 311480, 313490, 314739, 315506, 315699, 314965, 313471, 312032, 311175, 310430, 308919, 306294, 302795, 298735, 294560, 291189, 289440, 288818, 287508, 284025, 278655, 272975, 268390, 265509, 264460, 265032, 266491, 267840, 268496, 268492, 268072, 267452]
51613B67452m74l2K4r87k613l383k420n55N84L13o67j472k003k496k699k166j133
51596B45273l88j90k0M78R83J274J787K831L780L889L453L280L285K535Q09q94
51580B72165j680j810k024k461k747k771k798k922k900k471j696r12m41k98k49
51565B43985j33R6O71J857L176L318J516j208k955k960k094j433j211j245j501
51550B39879j811j618n27J179K742L443K922J497J36m40o45j426k732l388k700
51535B36511j369l95J32N93R05Q31P32J128J653J361K28l74O71K581L287J892
51519B50367j60q44r2L29n96j852k216k160k788l673l191r46J466K363J673N94
51503B38274L07J141K257K104J6k712m103l741k791k078j375n75j33j09l0Jo27
$$ y = [267452, 266978, 266946, 266970, 265983, 263370, 259987, 257567, 257012, 257596, 257909, 257242, 255770, 253767, 251271, 248572, 246406, 245273, 244885, 244695, 244675, 245153, 246136, 247410, 249197, 252028, 255808, 259697, 263150, 266430, 269715, 272250, 273059, 272165, 270485, 268675, 266651, 264190, 261443, 258672, 255874, 252952, 250052, 247581, 245885, 244973, 244532, 244234, 243985, 243852, 243948, 244619, 246476, 249652, 252970, 254486, 253278, 250323, 247363, 245269, 243836, 242625, 241380, 239879, 238068, 236450, 235923, 237102, 239844, 243287, 246209, 247706, 247842, 247402, 246757, 245331, 242599, 239211, 236511, 235142, 234747, 234879, 235472, 236377, 237208, 237940, 239068, 240721, 242082, 242310, 241936, 242607, 245188, 248475, 250367, 250207, 249363, 249271, 249600, 249004, 247152, 244936, 242776, 239988, 236315, 233124, 232178, 233644, 236007, 237680, 238274, 238581, 239722, 241979, 244083, 244099, 241387, 237284, 233543, 230752, 228674, 227299, 226724, 226591, 226482, 226452, 226453, 225826]
51486B25826j603j764r92n06o60j64J633L220K952J339M5k64J22J055K213K573
51470B35025J687P13Q44J457J207K70m3O13J429J990K549K901K409J168Oo29p78
51453B52818k94Q38J837K048K179L215M341L639R86j401j833j045n60l45P37K874
51437B70034M713M799L146J261O41J241J707J309R53J786L404M339L875K439O28
51422C06275j080j969j604o64j93k52l24p13k136l986m586l395j720q91q75j040
51406B80847r84l36J071K316K000K04j323j457r38p03m00M96J401J638J671K075
51390B87578K115Q88q21j374o97m03j373k647l017k602k226k091j815j291q57
51375B69367p14o92o23o02q13j123j091l51R34K050K183J009r92k772l502l188
$$ y = [225826, 224223, 222459, 221467, 220961, 220301, 220137, 221770, 224990, 227942, 229281, 229326, 229062, 229184, 230239, 232452, 235025, 236712, 237425, 238269, 239726, 240933, 241203, 241160, 241773, 243202, 245192, 247741, 250642, 253051, 254219, 254225, 253596, 252818, 252524, 253362, 255199, 257247, 259426, 262641, 266982, 270621, 271607, 270206, 268373, 267328, 266768, 266423, 267160, 270034, 274747, 279546, 282692, 283953, 284594, 285835, 287542, 288851, 289804, 291590, 294994, 299333, 303208, 305647, 306275, 305195, 303226, 301622, 300958, 300765, 300513, 300189, 299476, 297340, 293354, 288768, 285373, 283653, 282762, 281887, 280847, 279863, 279527, 280598, 282914, 284914, 285118, 283795, 282338, 281400, 280697, 280297, 280793, 282194, 283832, 285503, 287578, 289693, 290581, 289760, 288386, 287689, 287286, 285913, 283266, 280249, 277647, 275421, 273330, 271515, 270224, 269367, 268653, 267961, 267338, 266736, 265923, 264800, 263709, 263358, 264292, 266342, 268525, 269534, 268542, 265770, 262268, 259080]
51359B59080k411j547o31J1k65j464k500k401j483o98l15j7Q8l46r54r85o17q59
51341B41686j907k664k228r91J39P59Q45L82l20p28q69j365k226k460j555n07
51325B25991o02j684k470k172j031L80J640K409K583K362J740K24k250m370m401
51310B18349k260J39R94M96N5J44j89j482k550j912o7Q47j16j404j249j74j10
51293B09511j581l182l638l094k350k022k524l663m011k174R23K341N59k584m237
51278A78274l816k896k659k786k541j817j041n82l64Q7R39J419O82o96j125k60
51262A60818M06j56r22o29Q4j76j167j386l81Q62J614K053K292K137J870K031
51246A69350K318J863P25n8r6j97j016k156k874k816j780K38K425L459K878J414
$$ y = [259080, 256669, 255122, 254491, 254502, 254237, 252773, 250273, 247872, 246389, 245691, 245376, 245359, 245447, 245101, 244147, 243162, 242545, 241686, 239779, 237115, 234887, 233896, 234035, 234794, 235639, 236021, 235701, 234973, 234104, 232739, 230513, 228053, 226498, 225991, 225389, 223705, 221235, 219063, 218032, 218412, 220052, 222461, 225044, 227406, 229146, 229370, 227120, 222750, 218349, 216089, 216228, 217222, 217718, 217773, 217917, 217728, 216246, 213696, 211784, 211717, 212564, 212448, 211044, 209795, 209621, 209511, 207930, 204748, 201110, 198016, 195666, 193644, 191120, 187457, 183446, 181272, 182195, 184536, 185095, 182511, 178274, 174458, 171562, 168903, 166117, 163576, 161759, 160718, 160136, 159772, 159859, 160798, 162217, 162899, 162203, 161078, 160818, 161224, 161068, 160146, 159517, 159601, 159425, 158258, 156872, 156491, 157353, 158967, 161020, 163312, 165449, 167319, 169350, 171668, 173531, 174256, 174198, 174102, 173905, 172889, 170733, 167859, 165043, 163263, 163501, 165926, 169385, 172263, 173677]
51230A73677k24j978l575m106l123j359J56J081J384Q18n65j999k681k442j427
51215A53637K21J813K156Q67q78j581q86O23K256L068J931j043l706l904k056
51200A52518m35j43k71J0J60l82j020r67l85J87P40J306J409Q81N04Q33J037R6
51182A56078j361j728q08r1l81n69M84J926J973M42q49k87J735L486L816L049
51166A66915K121J401N61m97j171q85o2K38m02j256j428r35n06n11l81O70K277
51149A66149K621K41l550n153k576J835L924K597L97o36j363k942m126l139p44
51134A53535P51Q13Q34J423J688J324J274J843J915Q83j52P1J314K525L101K808
51118A75950J502j84q90k02N03k13j855k685j893l20O64L22r57j826j125O56J749
$$ y = [173677, 173453, 171475, 167900, 163794, 160671, 159312, 159468, 160549, 161933, 162751, 162186, 160187, 157506, 155064, 153637, 153858, 155671, 157827, 158694, 157816, 156235, 155349, 155972, 158228, 161296, 163227, 162184, 158478, 154574, 152518, 152083, 151940, 151669, 151679, 151839, 151457, 150437, 149470, 149085, 149272, 150012, 151318, 152727, 153608, 154112, 154945, 155982, 156078, 154717, 152989, 152181, 152090, 151709, 151140, 151624, 153550, 155523, 155965, 155116, 154829, 156564, 160050, 163866, 166915, 169036, 170437, 170998, 170501, 169330, 168445, 168383, 168621, 168219, 166963, 165535, 164600, 164094, 163583, 163202, 163872, 166149, 168770, 169011, 165461, 160308, 157732, 159567, 163491, 166088, 166485, 165849, 164486, 161544, 157418, 154279, 153535, 154286, 155099, 155933, 157356, 159044, 160368, 161642, 163485, 165400, 166283, 166131, 166202, 167516, 170041, 173142, 175950, 177452, 177268, 176378, 176176, 176679, 176466, 174611, 171926, 170033, 169713, 170377, 170699, 169742, 167916, 166791, 167447, 169196]
51101A69196J368O49O70O50n81k318k728j441K66J597K859L902L710K157O26N8
51085A80640m22j786l059k449l0K097K472J824J503J354J31k323m404m514k817
51070A68217p42Q06J926K634K289O66j092j383K4J677K058J105n5n10m47n92j131
51053A75450j378o05J092K897L979L925K718R08l79j93J255K708L125K554J795
51038A99851J577K022K474K028O61l87j12O58K75j229k114j577q28q16o52M16
51022B02247J023l78k521k541L1K576K902J641M25n26j827l075l069j606N3N11
51006A95866n34k288l517l249j400J037K614K575J452M83M41J048J455J011l80
50991A96614k257l616l407j657J50O39L05P31K129L041K759K518L287L834K452
$$ y = [169196, 170564, 171213, 171883, 172533, 171952, 169634, 166906, 165465, 165731, 167328, 170187, 174089, 177799, 179956, 180582, 180640, 180218, 178432, 175373, 172924, 172894, 174991, 177463, 179287, 180790, 182144, 182275, 179952, 175548, 171034, 168217, 167475, 168281, 170207, 172841, 175130, 175796, 174704, 173321, 173345, 175022, 177080, 178185, 178130, 177620, 177173, 176581, 175450, 174072, 173467, 174559, 177456, 181435, 185360, 188078, 188986, 188607, 188414, 189669, 192377, 195502, 198056, 199851, 201428, 203450, 205924, 207952, 208613, 208226, 208114, 208772, 209047, 207818, 205704, 204127, 203299, 202483, 201831, 202247, 203270, 202892, 200371, 197830, 197861, 200437, 203339, 204980, 205405, 204879, 203052, 199977, 196908, 195302, 195355, 195866, 195332, 193044, 189527, 186278, 184878, 185915, 188529, 191104, 192556, 193039, 193480, 194528, 195983, 196994, 196614, 194357, 190741, 187334, 185677, 185827, 186466, 186771, 187502, 189631, 192672, 195431, 197949, 201236, 205070, 207522]
50976B07522j55j467l83J633K602K059R16L39R63K400L362K891J441J43o36j136
50960B22494j047K44K251L431K925J356k31j321j603q21O12J547J215K1r68r31
50944B29174J93J568J969J030j51l11M97J426K281L267L735K760Q78k44Q6J209
50928B49367K804N116P289P444N249K627J101J90n97j04K450N364O357N649N279
50913C05585N954O341N300L302J672J476K967N090O056N327M557N505P661R201
50899C75994R699J0242J1141J1403J0566R544R194R412R989J1230J3146J4986
50887E06546J6023J5978J4585J1899R326R047J1535J4531J5481J4376J3344J3847
50875F66518J5242J6067J5902J5558J5816J6420J6360J4971J2425R307O109L189
$$ y = [207522, 207367, 205900, 205517, 207150, 209752, 211811, 212727, 213066, 214029, 216429, 219791, 222682, 224123, 224266, 223630, 222494, 221447, 221691, 223942, 227373, 230298, 231654, 231423, 230102, 228499, 227678, 228290, 229837, 231052, 231073, 230105, 229174, 229367, 230935, 232904, 233934, 233783, 233472, 233969, 235395, 237676, 240943, 244678, 247438, 248316, 248072, 248158, 249367, 252171, 257287, 264576, 272020, 277269, 279896, 280997, 281187, 280590, 280486, 282936, 288300, 294657, 300306, 305585, 311539, 317880, 323180, 326482, 328154, 329630, 332597, 337687, 343743, 349070, 353627, 359132, 366793, 375994, 385693, 395935, 407076, 418479, 429045, 438589, 447783, 457195, 467184, 478414, 491560, 506546, 522569, 538547, 553132, 565031, 574357, 583404, 594939, 609470, 624951, 639327, 652671, 666518, 681760, 697827, 713729, 729287, 745103, 761523, 777883, 792854, 805279, 814586, 820695, 823884]
50863H23884P32j590m244o964q924j0081j1456j3409j4797j4873j4735j5391j5555
50850F92597j3528j0480r253j0034r993p688m951l350j707J080L266K890J287
50837F30136J272K979M272M466M868N990O884P334Q069Q681P865O208O095P884
50823G13003Q795O932M164L188L734L759K856K105J560L07j520k906l877n244
50809G36856o551o393m949m172m906n627m896l455k743k680k225j363j097j718
50795F84081k178j274J135M112O432P455P560P649Q220R103J0057J1192J2698
50782G66242J4586J6757J8889K0279K0401J9742J9434K0005K1102K2440K4093
50771I83970K5660K6182K5430K4461K4452K5699K8008L0987L3536L4261L3305
$$ y = [823884, 824616, 823026, 818782, 811818, 802894, 792813, 781357, 767948, 753151, 738278, 723543, 708152, 692597, 679069, 668589, 659336, 649302, 639309, 631621, 626670, 623320, 621613, 622693, 625959, 628849, 630136, 631408, 634387, 638659, 643125, 647993, 653983, 660867, 668201, 676270, 684951, 692816, 699024, 705119, 713003, 721798, 728730, 732894, 736082, 739816, 743575, 746431, 748536, 750096, 750403, 748883, 745977, 742100, 736856, 730305, 723912, 718963, 714791, 709885, 704258, 699362, 695907, 693164, 690484, 688259, 686896, 685799, 684081, 681903, 680629, 681764, 685876, 692308, 699763, 707323, 714972, 723192, 732295, 742352, 753544, 766242, 780828, 797585, 816474, 836753, 857154, 876896, 896330, 916335, 937437, 959877, 983970, 1009630, 1035812, 1061242, 1085703, 1110155, 1135854, 1163862, 1194849, 1228385, 1262646, 1295951]
50760A295951L2632L3649L5514L6836L7760L8941L9599L8447L5985L3765L1662
50749A690741K7931K2138J6062J1054O246M03n769j0375j2666j3584j4353j5256
50737A702572j5777j5460j4573j3692j2590j0071n581m12L641O379Q792J1058
50725A644286J2535J3650J5843J9253K2147K3406K4011K5161K6431K6932K6993
50714A880648K7347K7608K6854K5006K2443J9072J4935J1046Q292N991K834j283
50702B070793n581r960j4842j9759k3713k6835l0208l3913l6691l7903l8468l9375
50690A753545m0315m0445l9581l7957l5471l1901k7636k3703k1101k0037j9436
50679A415962j7409j2955p264k553M43L045O512J0430J3711J6334J9068K1976
$$ y = [1295951, 1328583, 1362232, 1397746, 1434582, 1472342, 1511283, 1550882, 1589329, 1625314, 1659079, 1690741, 1718672, 1740810, 1756872, 1767926, 1774172, 1774575, 1768806, 1758431, 1745765, 1732181, 1717828, 1702572, 1686795, 1671335, 1656762, 1643070, 1630480, 1620409, 1614828, 1614416, 1618057, 1624436, 1633228, 1644286, 1656821, 1670471, 1686314, 1705567, 1727714, 1751120, 1775131, 1800292, 1826723, 1853655, 1880648, 1907995, 1935603, 1962457, 1987463, 2009906, 2028978, 2043913, 2054959, 2063251, 2069242, 2072076, 2070793, 2065212, 2055252, 2040410, 2020651, 1996938, 1970103, 1939895, 1905982, 1869291, 1831388, 1792920, 1753545, 1713230, 1672785, 1633204, 1595247, 1559776, 1527875, 1500239, 1476536, 1455435, 1435398, 1415962, 1398553, 1385598, 1378334, 1375781, 1376224, 1379269, 1385781, 1396211, 1409922, 1426256, 1445324, 1467300]
50667A467300K4204K5182K5230K4802K3760K1755J9021J6320J4158J2269J0042
50656A684043P228L953K45l924p895j0246j0082q189o259n019l712j448J576M533
50642A644804P107R684J2615J5700J8477K0821K3046K5303K6998K7254K6073K4565
50630A882447K3634K2841K1326J9330J7822J6771J5143J2991J2074J3425J5322
50619B073126J5146J2867J1191J2168J4993J7472J8427J7927J6349J4565J4473
50608B238704J7797K4070L0818L6180M0607M5593N1433N6924O0938O3532O5525
50597B732121O7309O8246O7253O4198O0680N8794N8886N9114N7648N4672N1643
50586C400564M9204M6789M3902M0783L7935L5807L4782L4612L4160L2792L1745
$$ y = [1467300, 1491504, 1516686, 1541916, 1566718, 1590478, 1612233, 1631254, 1647574, 1661732, 1674001, 1684043, 1691271, 1695224, 1695469, 1691545, 1683650, 1673404, 1663322, 1655133, 1648874, 1643855, 1640143, 1638695, 1640271, 1644804, 1651911, 1661595, 1674210, 1689910, 1708387, 1729208, 1752254, 1777557, 1804555, 1831809, 1857882, 1882447, 1906081, 1928922, 1950248, 1969578, 1987400, 2004171, 2019314, 2032305, 2044379, 2057804, 2073126, 2088272, 2101139, 2112330, 2124498, 2139491, 2156963, 2175390, 2193317, 2209666, 2224231, 2238704, 2256501, 2280571, 2311389, 2347569, 2388176, 2433769, 2485202, 2542126, 2603064, 2666596, 2732121, 2799430, 2867676, 2934929, 2999127, 3059807, 3118601, 3177487, 3236601, 3294249, 3348921, 3400564, 3449768, 3496557, 3540459, 3581242, 3619177, 3654984, 3689766, 3724378, 3758538, 3791330, 3823075]
50575C823075L2843L5809L8408L9500M0308M2036M3752M3743M1583L7723L2197
50564D250977K5186J7901J1364M840k890j1169j7965k2572k6151k9435l1467l1233
50552D137386k9236k6649k3620j9322j3397o854j537J126J028q92l793p541j2243
50539C994456j7939k5146l4692m6211n7556o6924p4916q3187r1540r7897j01047
50528C297401j01742j01006r8970r5777r2021q7717q2210p5743o9698o4573n9171
50517B368773n2780m6648m2019l8038l3325k8578k5506k3702k0740j5677j0624
50506B031136q072p960q293p647n985l619n44L032O261Q271R081R747J1555J5129
50492B052092K0167K5759L0770L4434L7201M0781M6554N3826O0565O5944P1117
$$ y = [3823075, 3855918, 3891727, 3930135, 3969635, 4009943, 4051979, 4095731, 4139474, 4181057, 4218780, 4250977, 4276163, 4294064, 4305428, 4310268, 4307378, 4296209, 4278244, 4255672, 4229521, 4200086, 4168619, 4137386, 4108150, 4081501, 4057881, 4038559, 4025162, 4018308, 4016771, 4017897, 4018925, 4018033, 4014240, 4006699, 3994456, 3976517, 3951371, 3916679, 3870468, 3812912, 3745988, 3671072, 3587885, 3496345, 3398448, 3297401, 3195659, 3094653, 2995683, 2899906, 2807885, 2720168, 2637958, 2562215, 2492517, 2427944, 2368773, 2315993, 2269345, 2227326, 2189288, 2155963, 2127385, 2101879, 2078177, 2057437, 2041760, 2031136, 2023064, 2015104, 2006811, 1999164, 1993179, 1989560, 1989016, 1992048, 1998309, 2006580, 2015661, 2025408, 2036963, 2052092, 2072259, 2098018, 2128788, 2163222, 2200423, 2241204, 2287758, 2341584, 2402149, 2468093, 2539210]
50481B539210P6961Q2415Q6201Q9075R2692R6804R9645J01106J03475J08278J14163
50470C590025J19146J23449J28577J34581J40155J44990J50081J55640J60489
50461D847133J64111J67598J71625J74807J75433J73895J71877J69566J65173
50452F381218J57227J45882J31732J14617R4287P1297M6528K0454o468l3276n8977
50441G064521q3096j05175j24111j38791j48917j54550j55130j49852j39007j24234
50431E741658j07389q9791p2495n6496m2389l0319k0587j3961j1233j2919j9515
50420E264564l1443m8222o7877q7715j05871j21989j36325j48457j57219j62008
50410D197438j63619j63310j61326j57257j51751j46561j42197j36712j28114
$$ y = [2539210, 2616171, 2698586, 2784787, 2873862, 2966554, 3063358, 3163003, 3264109, 3367584, 3475862, 3590025, 3709171, 3832620, 3961197, 4095778, 4235933, 4380923, 4531004, 4686644, 4847133, 5011244, 5178842, 5350467, 5525274, 5700707, 5874602, 6046479, 6216045, 6381218, 6538445, 6684327, 6816059, 6930676, 7024963, 7096260, 7142788, 7163242, 7156774, 7123498, 7064521, 6981425, 6876250, 6752139, 6613348, 6464431, 6309881, 6154751, 6004899, 5865892, 5741658, 5634269, 5544478, 5471983, 5415487, 5373098, 5342779, 5322192, 5308231, 5296998, 5284079, 5264564, 5233121, 5184899, 5117022, 5029307, 4923436, 4801447, 4665122, 4516665, 4359446, 4197438, 4033819, 3870509, 3709183, 3551926, 3400175, 3253614, 3111417, 2974705, 2846591]
50401B846591j17297j07310r9881r4026q8003q1226p3921o6292n8881n2816m8727
50390A958211m5802m2516l7965l2172k5683j9475j4824j2443j1637j0747q600
50379A696347n533k978j899j475L78M784J0408J4871J7430J9393K1990K5019K7942
50366A826677L1103L5057L9422M3405M7040N1163N6409O2773O9825P6766Q2572
50355B422212Q6658Q9271R1000R2316R3877R6592J00700J05232J09117J12352
50345C399327J15421J18028J19259J18713J16558J12705J06828R9162R0347Q0521
50335D476869O9432N7499M5740L4479K2948J0322l704j9495l7296n5921p2774
50324D528099q6217r7040j06615j14407j18703j19257j17447j13891j07666r8416
$$ y = [2846591, 2729294, 2621984, 2522103, 2428077, 2340074, 2258848, 2184927, 2118635, 2059754, 2006938, 1958211, 1912409, 1869893, 1831928, 1799756, 1774073, 1754598, 1739774, 1727331, 1715694, 1704947, 1696347, 1690814, 1687836, 1685937, 1684462, 1684840, 1689624, 1700032, 1714903, 1732333, 1751726, 1773716, 1798735, 1826677, 1857780, 1892837, 1932259, 1975664, 2022704, 2073867, 2130276, 2193049, 2262874, 2339640, 2422212, 2508870, 2598141, 2689141, 2781457, 2875334, 2971926, 3072626, 3177858, 3286975, 3399327, 3514748, 3632776, 3752035, 3870748, 3987306, 4100011, 4206839, 4306001, 4396348, 4476869, 4546301, 4603800, 4649540, 4684019, 4706967, 4717289, 4713585, 4694090, 4656794, 4600873, 4528099, 4441882, 4344842, 4238227, 4123820, 4005117, 3885860, 3768413, 3654522, 3546856, 3448440]
50314C448440q7585p6618o5372n3578m2648l4341k8273k2713j7603j4986j6175
50303B988548k0403k6700l5111m4926n3462n8526o1072o3739o7311p0301p1572
50292B415425p1640p1279p0423o8706o5965o2100n7456n3442n1348n0495m8791
50281A743780m5285m0886l6471l1962k7714k4995k4055k3301k1451j9171j7404
50270A431085j5525j2788j0418j0257j1929j3198j2917j1796j0368q143n255l273
50258A305218l411m883n809n226l645k133j293q47K0J746L785N298O236P236Q650
50243A310942J0396J2747J6176K0199K3238K4140K3311K1927K0649J9577J8766
50232A522068J8042J6728J4419J1841J0123R145P428L956m84m368p267r993j3186
$$ y = [3448440, 3360855, 3284237, 3218865, 3165287, 3122639, 3088298, 3060025, 3037312, 3019709, 3004723, 2988548, 2968145, 2941445, 2906334, 2861408, 2807946, 2749420, 2688348, 2624609, 2557298, 2486997, 2415425, 2343785, 2272506, 2202083, 2133377, 2067412, 2005312, 1947856, 1894414, 1843066, 1792571, 1743780, 1698495, 1657609, 1621138, 1589176, 1561462, 1536467, 1512412, 1489111, 1467660, 1448489, 1431085, 1415560, 1402772, 1392354, 1382097, 1370168, 1356970, 1344053, 1332257, 1321889, 1313746, 1308491, 1305218, 1301807, 1296924, 1291115, 1285889, 1282244, 1280111, 1278818, 1277971, 1277991, 1279737, 1283522, 1288820, 1295056, 1302292, 1310942, 1321338, 1334085, 1350261, 1370460, 1393698, 1417838, 1441149, 1463076, 1483725, 1503302, 1522068, 1540110, 1556838, 1571257, 1583098, 1593221, 1602366, 1609794, 1613750, 1613266, 1608898, 1601631, 1591638, 1578452]
50219A578452j6751k0639k5077k9426l1868l1233k8647k6298k4908k3523k1486
50208A298596j9250j7187j5074j3252j2801j3834j4835j4629j3821j3306j2530
50197A138077j0671q599p846q235q309p894q293r704j0324q808o213m558m472
50184A034151n140n779o107n885m938l571k320j362n26K19P35R76J021R46R04
50169A003324J124J608J964J791J157N88O22J426K627L476L290J971J05j497k313
50154A021263k390k268k629l684m798m860l284p10J341J727N89j076k595l908
50140I92718m646l827j313J201J874J201J418L406N640O599O565O341N775M868
50126A027820M901O833R424J0557R797Q249O661N305N071O632Q721R191P856O540
$$ y = [1578452, 1561701, 1541062, 1515985, 1486559, 1454691, 1423458, 1394811, 1368513, 1343605, 1320082, 1298596, 1279346, 1262159, 1247085, 1233833, 1221032, 1207198, 1192363, 1177734, 1163913, 1150607, 1138077, 1127406, 1118807, 1110961, 1102726, 1094417, 1086523, 1078230, 1068526, 1058202, 1049394, 1043181, 1038623, 1034151, 1029011, 1023232, 1017125, 1011240, 1006302, 1002731, 1000411, 999049, 998523, 998742, 999477, 1000453, 1001474, 1002420, 1003324, 1004448, 1006056, 1008020, 1009811, 1010968, 1011556, 1012178, 1013604, 1016231, 1019707, 1022997, 1024968, 1025073, 1023576, 1021263, 1018873, 1016605, 1013976, 1010292, 1005494, 1000634, 997350, 996640, 997981, 999708, 1000297, 999221, 996626, 992718, 988072, 984245, 982932, 984133, 986007, 987208, 988626, 992032, 997672, 1004271, 1010836, 1017177, 1022952, 1027820, 1032721, 1039554, 1048978, 1059535, 1069332, 1077581, 1084242, 1089547, 1094618, 1101250, 1109971, 1119162, 1127018, 1133558]
50112A133558O296O375O068N591M780K972R04O38K575M548N125N889Q597J1689
50098A205605J2032R302O427N815P091Q652R730J0383J0747J0998J1360J1793
50086A319935J2086J2307J2620J2772J2492J2188J2470J2930J2453J0985R975
50075A453213J0488J1660J1836J0758R740R803J0573J1247J1862J2947J4317J5091
50063A593535J5088J5545J7956K2362K7219L0911L3191L5194L8223M2591M7554
50052A919369N2412N7329O2671O7943P2287P6055Q0610Q6107R0633R2414R1630
50041B749460Q9049Q4183P6519O7638N9937N3699M7423M0767L4826K9499K3201
50030C356201J5699Q615J943p186k0550l5742m9254o0888p2581q3977r2056r5035
$$ y = [1133558, 1139854, 1146229, 1152297, 1157888, 1162668, 1165640, 1166544, 1167182, 1169757, 1174305, 1179430, 1185319, 1193916, 1205605, 1217637, 1226939, 1233366, 1239181, 1246272, 1254924, 1264654, 1275037, 1285784, 1296782, 1308142, 1319935, 1332021, 1344328, 1356948, 1369720, 1382212, 1394400, 1406870, 1419800, 1432253, 1443238, 1453213, 1463701, 1475361, 1487197, 1497955, 1507695, 1517498, 1528071, 1539318, 1551180, 1564127, 1578444, 1593535, 1608623, 1624168, 1642124, 1664486, 1691705, 1722616, 1755807, 1791001, 1829224, 1871815, 1919369, 1971781, 2029110, 2091781, 2159724, 2232011, 2308066, 2388676, 2474783, 2565416, 2657830, 2749460, 2838509, 2922692, 2999211, 3066849, 3126786, 3180485, 3227908, 3268675, 3303501, 3333000, 3356201, 3371900, 3380515, 3382458, 3375272, 3354722, 3318980, 3269726, 3208838, 3136257, 3052280, 2960224, 2865189]
50018B865189r4291r2112q9329q5705q1168p6020p0593o5112n9475n3487m7628
50007B050269m2935l9414l5537l0475k5755k3236k2178k0387j7701j6115j6345
49996A760191j6605j5381j3427j2056j1103r701p824n943m191k842k623l556m275
49983A650664l555j841k88J011K741M756O049O209N987O279P192Q228Q914R208
49969A711554R591J0698J2592J4545J5760J6082J5890J5699J6013J7143J8785
49958A874352K0303K1735K3852K6671K8676K8439K6651K5450K5968K7515K9190
49947B158802L1000L2989L4444L4971L5702L8358M3205M8849N4153N9526O5957
49936B637956P3353Q0644Q7386R4576J03453J13776J23702J31401J36531J39951
$$ y = [2865189, 2770898, 2678786, 2589457, 2503752, 2422584, 2346564, 2275971, 2210859, 2151384, 2097897, 2050269, 2007334, 1967920, 1932383, 1901908, 1876153, 1852917, 1830739, 1810352, 1792651, 1776536, 1760191, 1743586, 1728205, 1714778, 1702722, 1691619, 1681918, 1674094, 1668151, 1663960, 1661118, 1658495, 1654939, 1650664, 1647109, 1645268, 1644980, 1645991, 1648732, 1653488, 1659537, 1665746, 1671733, 1678012, 1685204, 1693432, 1702346, 1711554, 1721145, 1731843, 1744435, 1758980, 1774740, 1790822, 1806712, 1822411, 1838424, 1855567, 1874352, 1894655, 1916390, 1940242, 1966913, 1995589, 2024028, 2050679, 2076129, 2102097, 2129612, 2158802, 2189802, 2222791, 2257235, 2292206, 2327908, 2366266, 2409471, 2458320, 2512473, 2571999, 2637956, 2711309, 2791953, 2879339, 2973915, 3077368, 3191144, 3314846, 3446247, 3582778, 3722729]
49926C722729J42238J42856J40855J36022J29057J20838J11974J03056R4752Q7142
49916D931519P9297P0083N9210M6936L2900J6002m167k6345m8543o9612q9521
49905D997759j08280j25176j39126j49477j56315j60152j61434j60422j57583
49896C679794j53636j48891j42816j34980j26266j18301j11503j04728r7246q9950
49886B451477q3703p7585p0176o2059n5465n1402m8581m5423m1857l8537l5458
49875A841231l2250k9156k6781k5206k4030k3028k2193k1383k0464j9562j8743
49864A578435j7647j5998j4253j3112j2426j1306r433p553o384n627m588l369
49852A456739k614k271j495n2J072J055O57J399L543N816P076P368P161O486N434
$$ y = [3722729, 3864967, 4007823, 4148678, 4284700, 4413757, 4534595, 4646569, 4749625, 4844377, 4931519, 5010816, 5080899, 5140109, 5187045, 5219945, 5235947, 5231780, 5205435, 5156892, 5087280, 4997759, 4889479, 4764303, 4625177, 4475700, 4319385, 4159233, 3997799, 3837377, 3679794, 3526158, 3377267, 3234451, 3099471, 2973205, 2854904, 2743401, 2638673, 2541427, 2451477, 2367774, 2290189, 2220013, 2157954, 2102489, 2051087, 2002506, 1957083, 1915226, 1876689, 1841231, 1808981, 1779825, 1753044, 1727838, 1703808, 1680780, 1658587, 1637204, 1616740, 1597178, 1578435, 1560788, 1544790, 1530537, 1517425, 1504999, 1493693, 1484260, 1476707, 1470323, 1464696, 1460108, 1456739, 1454125, 1451854, 1450359, 1450307, 1451379, 1452434, 1453091, 1454490, 1458033, 1463849, 1470925, 1478293, 1485454, 1491940, 1497374]
49837A497374M795N412P200R246J0642J0886R991Q738Q450R887J2584J5678J8845
49824A629728K1941K4340K5665K6765K8988L2508L6408M0352M5053N0872N6894
49813B019514O2016O6350P1060P6990Q3745Q9985R4592R7690J00093J01481R9898
49802B963414R4022Q5278P6441O8454O0206N1399M3709L8335L4034K8788K2225
$$ y = [1497374, 1502169, 1507581, 1514781, 1524027, 1534669, 1545555, 1555546, 1564284, 1572734, 1582621, 1595205, 1610883, 1629728, 1651669, 1676009, 1701674, 1728439, 1757427, 1789935, 1826343, 1866695, 1911748, 1962620, 2019514, 2081530, 2147880, 2218940, 2295930, 2379675, 2469660, 2564252, 2661942, 2762035, 2863516, 2963414, 3057436, 3142714, 3219155, 3287609, 3347815, 3399214, 3442923, 3481258, 3515292, 3544080, 3566305]
$$ [...]
##END NTUPLES=NMR SPECTRUM
##END=
