
##TITLE=AC1211_MCiAH12042_5946985_C7LGHNSIQK
##JCAMPDX= 6.0         $$ Bruker NMR JCAMP-DX V2.0
##DATA TYPE= NMR SPECTRUM
##DATA CLASS= NTUPLES
##ORIGIN= BRUKER
##OWNER= Administrator
$$ 1.72 TOPSPIN		Version 2.1
$$ 2012-04-11 03:41:14.656 -0500  Administrator@TOPSPIN
$$ Compression mode = diff/dup
##.OBSERVE FREQUENCY= 400.13188235
##.OBSERVE NUCLEUS= ^1H
##.ACQUISITION MODE= SIMULTANEOUS (DQD)
##.ACQUISITION SCHEME= undefined
##.AVERAGES= 8
##.DIGITISER RES= 22
##SPECTROMETER/DATA SYSTEM= spect
##.PULSE SEQUENCE= zg30
##.SOLVENT NAME= COFFEE_meoh
##.SHIFT REFERENCE= INTERNAL, COFFEE_meoh, 1, 14.98061
##AUDIT TRAIL= $$ (NUMBER, WHEN, WHO, WHERE, PROCESS, VERSION, WHAT)
$$ ##TITLE= Audit trail, TOPSPIN		Version 2.1
$$ ##JCAMPDX= 5.01
$$ ##ORIGIN= Bruker BioSpin GmbH
$$ ##OWNER= Administrator
$$ $$ C:\Bruker\TOPSPIN/data/COFFEE/nmr/AC1211_MCiAH12042_5946985_C7LGHNSIQK/10/pdata/1/auditp.txt
$$ ##AUDIT TRAIL=  $$ (NUMBER, WHEN, WHO, WHERE, PROCESS, VERSION, WHAT)
(   1,<2012-04-11 03:41:08.015 -0500>,<Administrator>,<TOPSPIN>,<go>,<TOPSPIN 2.1>,
      <created by zg
	started at 2012-04-11 03:40:01.593 -0500,
	POWCHK enabled, PULCHK disabled,
       configuration hash MD5:
       1A 1E CE 29 27 FD 77 03 67 4E F0 E3 C4 B2 CB 90
       data hash MD5: 64K
       07 4C D2 0A C4 C1 2F 6F 46 24 28 6B 4B 6C E8 4B>)
(   2,<2012-04-11 03:41:10.609 -0500>,<Administrator>,<TOPSPIN>,<proc1d>,<TOPSPIN 2.1>,
      <Start of raw data processing
       efp LB = 0 FT_mod = 6 PKNL = 1 PHC0 = 0 PHC1 = 0 SI = 32K 
       data hash MD5: 32K
       42 28 F8 C5 EF 89 FD CF 08 E8 BC 28 D5 E1 C3 2C>)
(   3,<2012-04-11 03:41:11.000 -0500>,<Administrator>,<TOPSPIN>,<proc1d>,<TOPSPIN 2.1>,
      <pk PHC0 = 208.9984 PHC1 = 0 
       data hash MD5: 32K
       EF B2 00 FC 4B E2 3D 12 FF B6 E2 4E 37 9C 28 88>)
(   4,<2012-04-11 03:41:11.062 -0500>,<Administrator>,<TOPSPIN>,<proc1d>,<TOPSPIN 2.1>,
      <abs ABSG = 1 
       data hash MD5: 32K
       00 1B ED B7 0D 82 3F 44 1F 6F 5C 5C 8D BD 98 CF>)
(   5,<2012-04-11 03:41:11.093 -0500>,<Administrator>,<TOPSPIN>,<proc1d>,<TOPSPIN 2.1>,
      <abs ABSG = 2 
       data hash MD5: 32K
       8A 24 E3 88 79 33 23 D7 F4 80 4E E4 4B 61 6E BC>)
(   6,<2012-04-11 03:41:11.125 -0500>,<Administrator>,<TOPSPIN>,<proc1d>,<TOPSPIN 2.1>,
      <abs ABSG = 3 
       data hash MD5: 32K
       34 EB 23 A8 51 2C F8 FD 8B 0E EA 2A 24 5E BE 08>)
(   7,<2012-04-11 03:41:11.156 -0500>,<Administrator>,<TOPSPIN>,<proc1d>,<TOPSPIN 2.1>,
      <abs ABSG = 4 
       data hash MD5: 32K
       B6 64 89 57 35 1F 86 64 C7 C7 14 02 85 FE C0 33>)
(   8,<2012-04-11 03:41:11.187 -0500>,<Administrator>,<TOPSPIN>,<proc1d>,<TOPSPIN 2.1>,
      <abs ABSG = 5 
       data hash MD5: 32K
       A8 06 CD 97 AE 90 31 AD 5B 90 7A 6C F6 BB D8 0B>)
$$ ##END=
$$ 
$$ $$ hash MD5
$$ $$ 37 6A 7A FE 8D AC 96 5A 4D 7D 7A 18 8F 79 3E E8
##$RELAX= 
##$RELAX= 
##$RELAX= 
##$RELAX= 
##$RELAX= 
##$RELAX= 
##$RELAX= 
$$ Bruker specific parameters
$$ --------------------------
$$ [...]
##$TP= (0..7)
150 150 150 150 150 150 150 150
##$TP07= 0
##$TPNAME0= <>
##$TPNAME1= <>
##$TPNAME2= <>
##$TPNAME3= <>
##$TPNAME4= <>
##$TPNAME5= <>
##$TPNAME6= <>
##$TPNAME7= <>
##$TPOAL= (0..7)
0.5 0.5 0.5 0.5 0.5 0.5 0.5 0.5
##$TPOFFS= (0..7)
0 0 0 0 0 0 0 0
##$TUNHIN= 0
##$TUNHOUT= 0
##$TUNXOUT= 0
##$USERA1= <user>
##$USERA2= <user>
##$USERA3= <user>
##$USERA4= <user>
##$USERA5= <user>
##$V9= 5
##$VALIST= <valist>
##$VCLIST= <CCCCCCCCCCCCCCC>
##$VD= 0
##$VDLIST= <DDDDDDDDDDDDDDD>
##$VPLIST= <PPPPPPPPPPPPPPP>
##$VTLIST= <TTTTTTTTTTTTTTT>
##$WBST= 1024
##$WBSW= 4
##$XGAIN= (0..3)
0 0 0 0
##$XL= 0
##$YL= 0
##$YMAX_a= 518738
##$YMIN_a= -650835
##$ZGOPTNS= <>
##$ZL1= 120
##$ZL2= 120
##$ZL3= 120
##$ZL4= 120
##$ABSF1= 14.98061
##$ABSF2= -5.57192
##$ABSG= 5
##$ABSL= 3
##$ALPHA= 0
##$AQORDER= 0
##$ASSFAC= 0
##$ASSFACI= 0
##$ASSFACX= 0
##$ASSWID= 0
##$AUNMP= <proc_prof1d_extract_pilot.lims>
##$AXLEFT= 0
##$AXNAME= <>
##$AXNUC= <1H>
##$AXRIGHT= 0
##$AXTYPE= 0
##$AXUNIT= <>
##$AZFE= 0.1
##$AZFW= 0.1
##$BCFW= 0
##$BC_mod= 0
##$BYTORDP= 0
##$COROFFS= 0
##$CY= 15
##$DATMOD= 1
##$DC= 0
##$DFILT= <>
##$DTYPP= 0
##$F1P= 0
##$F2P= 0
##$FCOR= 0.5
##$FTSIZE= 32768
##$FT_mod= 6
##$GAMMA= 0
##$GB= 0
##$INTBC= 1
##$INTSCL= 1
##$ISEN= 128
##$LB= 0
##$LEV0= 0
##$LPBIN= 0
##$MAXI= 10000
##$MC2= 0
##$MEAN= 0
##$ME_mod= 0
##$MI= 0
##$NCOEF= 0
##$NC_proc= -8
##$NLEV= 6
##$NOISF1= 0
##$NOISF2= 0
##$NSP= 0
##$NTH_PI= 0
##$NZP= 0
##$OFFSET= 14.98061
##$PC= 1
##$PHC0= 208.9984
##$PHC1= 0
##$PH_mod= 1
##$PKNL= yes
##$PPARMOD= 0
##$PPDIAG= 0
##$PPIPTYP= 0
##$PPMPNUM= 2147483647
##$PPRESOL= 1
##$PSCAL= 4
##$PSIGN= 0
##$PYNMP= <proc.py>
##$REVERSE= no
##$SF= 400.13
##$SI= 32768
##$SIGF1= 0
##$SIGF2= 0
##$SINO= 400
##$SIOLD= 32768
##$SPECTYP= <>
##$SREGLST= <1H.CDCl3>
##$SSB= 0
##$STSI= 32768
##$STSR= 0
##$SW_p= 8223.68421052632
##$SYMM= 0
##$S_DEV= 0
##$TDeff= 65536
##$TDoff= 0
##$TI= <>
##$TILT= no
##$TM1= 0
##$TM2= 0
##$TOPLEV= 0
##$USERP1= <user>
##$USERP2= <user>
##$USERP3= <user>
##$USERP4= <user>
##$USERP5= <user>
##$WDW= 1
##$XDIM= 32768
##$YMAX_p= 463698311
##$YMIN_p= -823641
##$CURPLOT= <Network HP LaserJet P1505>
##$CURPRIN= <$Network HP LaserJet P1505>
##$DFORMAT= <normdp>
##$LAYOUT= <+/1D_H.xwp>
##$LFORMAT= <normlp>
##$PFORMAT= <normpl>
##$SURQMSG= 1
$$ End of Bruker specific parameters
$$ ---------------------------------
##NTUPLES= NMR SPECTRUM
##VAR_NAME=  FREQUENCY,     SPECTRUM/REAL,   SPECTRUM/IMAG
##SYMBOL=    X,             R,               I
##VAR_TYPE=  INDEPENDENT,   DEPENDENT,       DEPENDENT
##VAR_FORM=  AFFN,          ASDF,            ASDF
##VAR_DIM=   32768,         32768,           32768
##UNITS=     HZ,            ARBITRARY UNITS, ARBITRARY UNITS
##FACTOR=    0.250966925370066, 1,           1
##FIRST=     8223.43324360095, 10649,        -73024
##LAST=      0,             -10339,          -271868
##MIN=       0,             -823641,         0
##MAX=       8223.43324360095, 463698311,    0
$$ Real data points
##PAGE= N=1
##DATA TABLE= (X++(R..R)), XYDATA
$$ [...]
19445c45860a66652f4194B80707b82284b9927j70775D4671J54487b73908a08998
19434c8502k23071A86429a53386A43870C5231c07081G3642b3235j07480j91787
19424c22502B7451f8897A66775c6054D9635a6997j4679I2868k3003R2182j9877
19413A42170a99563E1118c305C1251P0741C4730N6889J8809a71628g8712j66587
19402b45299d8237B04632G5497a23162L9324j11089A08952m7197b61204P1889
19392a89315A48491K6166B4119i9084r2298j18084J40230g6392L7182k2404k68060
19381c29674e2105E6615K3602a78923k23848G020b15389B31576H7769f2593H9778
19369a28132q6472D6612p811c69841I7561D8548b56973J07870A26267N4167b73122
$$ y = [-345860, -166652, -64194, 280707, -282284, -29927, -200702, 44671, 199158, -273908, -108998, -38502, -261573, 186429, -153386, 143870, 35231, -307081, 73642, -23235, -130715, -322502, 27451, -68897, 166775, -36054, 49635, -16997, -31676, 92868, 69865, 162047, 142170, -199563, 51118, -3305, 31251, 101992, 34730, 91619, 110428, -171628, -78712, -245299, -48237, 204632, 75497, -123162, -83838, -194927, 108952, 61755, -261204, -189315, 148491, 174657, 24119, -99084, -191382, -309466, -169236, -76392, -39210, -61614, -329674, -52105, 56615, 80217, -178923, -402771, 7020, -215389, 231576, 87769, -62593, 89778, -128132, -214604, 46612, 38801, -369841, 97561, 48548, -256973, -149103, 126267, 180434, -273122]
19357e7856j26446O1570M1104j65219p9702a20431j23189c2102B93011j13092
19347A79919i9144j48279P3795q4819c8020a4544j34783k58399a28194p4339N1633
19336a50900I9004a43402A76784K06890d9429B00322d18934a74151F7793d171
19325a22498F5936a22824c1855B2577K3843i3645B34640a96556a1649j30872L6250
19314a06271A16907c8712A24667a77782n7793a7432r0281m5436j68013d4562k23276
19303b67838B7762i0246k28518H1400i1397n5565a9531m6415A65860b13474P1931
19292a41543C3329b0376j76847A0047K19117b15179P4272A38336E2990A2678o316
19281F362g0897j3133d1435m2047A27825g3799q5556H5039N5423n8812c53630
$$ y = [-57856, -184302, -122732, -81628, -246847, -326549, -120431, -243620, -32102, 293011, 179919, -99144, -247423, -173628, -258447, -38020, -14544, -149327, -407726, -128194, -202533, -150900, 99004, -143402, 176784, 383674, -49429, 200322, -418934, -174151, 67793, -4171, -122498, 65936, -122824, -31855, 22577, 46420, -93645, 234640, -196556, -11649, -142521, -106271, 116907, -38712, 124667, -177782, -235575, -17432, -107713, -153149, -321162, -44562, -267838, 27762, -90246, -318764, 81400, -91397, -146962, -19531, -65946, 165860, -213474, -141543, 33329, -20376, -197223, 10047, 229164, -215179, -140907, 138336, 52990, 12678, 6362, -70897, -84030, -41435, -83482, 127825, -73799, -159355, 85039, 140462, 81650, -353630]
19269d3491A74023K5965n0370c86321a13805N2016C6290c11989a10367b5449C9314
19257a09828E572K53359b20179o1469P1142j09096a4229o3327l0155F82c15640
19245D993b00164M2635A52287i9131c3627l47746J65796e6182B8078K11028a08290
19233a44961j56757c3973k04280G805J13276f7510E9337a50516g4389o6091H8477
19221i9667j4893D0889M7693a08595A25975c43575e9745r7368A45891c4076k01983
19210b36059L4171Q8193r8824q2901f982k43951f54D4026L8072g8989j53600B4364
19197H8227a89839n8957b658A940b83800I5400a43503J4101j00115c4124j49453
19186a83577j4357L2078R03K3042j76435a18476A72534a90674A09679b6994k30209
$$ y = [-43491, 174023, 199988, 149618, -386321, -113805, -61789, 36290, -311989, -110367, -25449, 39314, -109828, 5572, 258931, -220179, -281648, -210506, -319602, -14229, -77556, -107711, 682, -315640, 4993, -200164, -157529, 152287, -99131, -33627, -381373, -215577, -56182, 28078, 239106, -108290, -144961, -301718, -33973, -238253, 7805, 121081, -67510, 59337, -150516, -74389, -140480, 88477, -99667, -114560, 40889, 88582, -108595, 125975, -343575, -59745, -157113, 145891, -34076, -236059, -201888, -113695, -212519, -295420, -6982, -250933, -654, 44026, 82098, -78989, -232589, 24364, 88227, -189839, -248796, -2658, 1940, -283800, 95400, -143503, -129402, -229517, -34124, -183577, -197934, -165856, -164953, -141911, -318346, -118476, 172534, -190674, 109679, -26994, -257203]
19175b57203a8475F3629J80632j11763A1859M059d2136D5135c2182C044J65600
19164A68644B583c64313a43617k78738g2963j62238L8311g9632A42855N4919c24143
19152c56452B2183b03985d8636B06350H2367J46275a97884i2770C0760J70615
19142B01375b61636B381b58667F0071a57837k42265d2890j5690A49525i8671J9065
19131g9606c2466n755D67774b18490c7281r0337n2376g458p4250j9622j92815
19120b94145f1824l57747D9317f0013o1936r4521D226a03938H7427a39093O3029
19109g6064m4008H8442J76897b81047M3294O447M3633k02846J4387a52185A76260
19097d8360j72214e813l1008l02271a60581A04575B2119a39146r4162a16623j92980
$$ y = [-257203, -18475, 63629, 244261, 132498, 11859, 15918, -42136, 45135, -32182, 3044, 168644, 2583, -364313, -143617, -422355, -72963, -235201, -196890, -79632, 142855, 197774, -324143, -356452, 22183, -203985, -48636, 206350, 82367, 228642, -197884, -92770, 30760, 201375, -261636, 2381, -258667, 60071, -157837, -400102, -42890, -58580, 149525, -98671, -79606, -32466, -38221, 467774, -218490, -37281, -127618, -179994, -7458, -81708, -101330, -294145, -61824, -419571, 49317, -60013, -121949, -216470, 4226, -103938, 87427, -139093, -76064, -120072, 88442, 265339, -281047, -237753, -231306, -187673, -390519, -376132, -152185, 176260, -48360, -220574, -5813, -36821, -339092, -160581, 104575, 22119, -139146, -233308, -116623, -309603]
19086c09603i8147k48404A21981c20434B8995h0766L7643n3752Q312A12724E3462
19074A89990J0537G6807b54492d1026j39687F5342a09988B8388J0732A0427c4561
19062D2009b0076A207J16963c9108A65605b45274C11311c00495A68520b06582
19051a83776Q9901k1339q871B19435c7498k27368A7723b57874C95645r1932g0564
19039b23031Q1110H5504b18055M9884F0850A3686a19812b9793j78268A02374n099
19028I7275K2791b3001j07628b0781C6341c8037k85887i456n7918E0158P225a02138
19015H0936a48418i374A25931i0152o4640B15849b51277A79709D6993K79788H6619
19003i3272l16907a39236c7378l75500A10442g2081j39463B17599a12545b6002
$$ y = [-309603, -98147, -346551, 121981, -320434, 28995, -80766, -43123, -96875, -88563, 112724, 53462, 189990, 200527, 76807, -254492, -41026, -180713, 65342, -109988, 28388, 39120, 10427, -34561, 42009, -20076, 1207, 118170, -39108, 165605, -245274, 311311, -300495, 168520, -206582, -183776, -93875, -115214, -124085, 219435, -37498, -264866, 17723, -257874, 395645, 303713, -70564, -223031, -141921, 85504, -218055, -168171, 60850, 13686, -119812, -29793, -208061, 102374, 97275, 120066, -23001, -130629, -20781, 36341, -38037, -323924, -9456, -67374, 50158, 57383, -102138, 80936, -148418, -9374, 125931, -90152, -154792, 215849, -251277, 179709, 46993, 326781, 86619, -93272, -410179, -139236, -37378, -412878, 110442, -72081, -211544, 217599, -112545, -26002]
18992a68565A22990D7098P8404l4565P9729b99312A14213m1124J01909i6610k1584
18981a18194a9593A97452a26668A20127c26877H4956d0143k92586I9007b02047
18970d6567j24919h2608m5372K9840B1603a13299a8607k11255k229g6638j10956
18959a87594B84212m742l3588P623G2526J51232b19167Q6337D9559K71799A4093
18947B3896a07449B0503O5066J0508J51340c18352J58548c6439j68273A29858
18936c16189M2823O0759K4629D3246a08142J8290B71972b5310j86509M9774G3147
18924B17880g9422r3646H6167e3729m2765I9021a07247N0130k03431f822A0692
18912C09490A50978a9328H3809J39206d2822b0390m9408I9177J33058a66274j66611
$$ y = [-168565, 122990, 47098, 125502, 90937, 170666, -299312, 114213, 73089, 174998, -96610, -118194, -19593, 197452, -126668, 120127, -326877, 84956, -40143, -332729, 99007, -202047, -46567, -171486, -82608, -127980, -98140, 21603, -113299, -18607, -229862, -232091, -76638, -187594, 284212, 279470, 245882, 253505, 72526, 223758, -219167, -132830, 49559, 321358, 14093, 23896, -107449, 20503, 85569, 96077, 247417, -318352, -159804, -36439, -204712, 129858, -316189, -273366, -212607, -187978, 43246, -108142, -89852, 271972, -25310, -211819, -162045, 73147, 217880, -79422, -173068, 86167, -53729, -96494, 99021, -107247, -57117, -260548, -6822, 10692, 309490, 150978, -19328, 83809, 223015, -42822, -20390, -69798, 99177, 232235, -166274, -332885]
18901c32885D3270b29527B51555H6696J10636J97418P6074B27126J71955r9690
18891B99391D0188N049k704A1773i8062E13747a70984g1868A90754b0708n7573
18880g8281m6535B83325a85466c4304q8908A83763a24197o5089g0726j48688j24344
18869c43758A62885j8494e18293D4811N5342A1369g5677i766j29968B9900b94788
18857D6587K8471J95248a14369j07080N4940C3401e9777F9275b36248P9445e9362
18845A6561a94744n4654O1609M4263k5408N7664K4545K1164B31281h5827A43584
18833f322B18414H9675c29318J42777p9976C01258a23297j46245n9655d6484C9405
18821c03628a21622C00934d7377k10969A85227H7385k0239b89308i2131M1674
$$ y = [-332885, 43270, -229527, 251555, 86696, 197332, 394750, 470824, 227126, 399081, 299391, 40188, 45237, 42533, 11773, -98062, 513747, -170984, -71868, 190754, -20708, -78281, -124816, 283325, -185466, -34304, -123212, 183763, -124197, -189286, -70726, -219414, -343758, 162885, 144391, -518293, 44811, 100153, 11369, -75677, -9766, -139734, 29900, -294788, 46587, 75058, 270306, -114369, -221449, -166509, 33401, -59777, 69275, -236248, -156803, -59362, 16561, -194744, -249398, -187789, -143526, -168934, -111270, -86725, -65561, 231281, -85827, 143584, -6322, 218414, 89675, -329318, -186541, -266517, 301258, -123297, -269542, -329197, -46484, 39405, -303628, -121622, 300934, -47377, -258346, 185227, 87385, 67146, -289308, -92131, -50457]
18811e0457k04340J06728p869A68466a30272j7948b5545c338E657K09529b06716
18799C68451A40167B6634K38976k7094I9549h1914A42943o7317i4597B10059D578
18787a94190d8166B47003E866b40782p4300a53744k568A03425d33907K871a69658
18775A51828i4629J7218j63912g6054J894F643c26459k9052b9873o2648L4562
18764e7959j82271R5217A95455b1458A70026J50118F273a30860o8321A21141l8356
18753H2785b9273j00973D4817g7857B39142d6624q0926G0089b62597J17065A09545
18741a59470L1952j1127a9633j34109E1015R743J6337c8839m6389a1027j50168
18730a61195O6681K5570A50243o2562c3829A91091j4335l5068d4603I3426c94690
$$ y = [-50457, -254797, -148069, -155938, 168466, -130272, -148220, -25545, -3338, 5657, 215186, -206716, 368451, 140167, 26634, 265610, 238516, 99549, -81914, 142943, 75626, -94597, 210059, 4578, -194190, -48166, 247003, 5866, -240782, -315082, -153744, -156312, 103425, -433907, -431036, -169658, 151828, -94629, -77411, -241323, -76054, -74160, 6643, -326459, -355511, -29873, -92521, -57959, -240230, -145013, 195455, -21458, 170026, 320144, 6273, -130860, -199181, 121141, 82785, -29273, -130246, 44817, -77857, 239142, -46624, -127550, 70089, -262597, -145532, 109545, -159470, -127518, -138645, -19633, -153742, 51015, 60758, 77095, -38839, -85228, -11027, -161195, -94514, -68944, 150243, 87681, -33829, 191091, 176756, 141688, -44603, 93426, -394690]
18718h8392L6553g810B4116h8629A59898a52385p7947J14933j81755A17024D5492
18706b52583L285Q6481G1507a66195C01563b10420k8106M8647Q5589j23251K5715
18695b01826R1638l60903J11895J34338E3935b99159f3062O652E6452A2377a2908
18683a57331c1850F0466J20085b03670B33551m5045F6754b38580G3635a35311
18672d5464A90232a29812F2609O1067a86080A16021E6164c0457j11823f0546C5165
18660B36868j0538D052b63316B02973a90903k40543J79946A3328a66875l7189
18650b04064b4356A56667a88078f4109k43425n6396J73378g8475A6505K38182
18640B54687j2120G2851h7801j75736a13857b1342k88241h0824l66773a30866
$$ y = [-88392, -51839, -7810, 24116, -88629, 159898, -152385, -230332, -115399, -297154, 117024, 45492, -252583, -249298, -162817, 71507, -166195, 301563, -210420, -238526, -189879, -104290, -227541, -201826, -110188, -471091, -359196, -224858, 53935, -299159, -63062, -56410, 56452, 12377, -12908, -157331, -31850, 60466, 180551, -203670, 233551, 188506, 66754, -238580, 73635, -135311, -45464, 190232, -129812, 62609, 123676, -186080, 116021, 56164, -30457, -142280, -60546, 35165, 236868, 226330, 4052, -263316, 202973, -190903, -431446, -251500, 13328, -166875, -204064, -24356, 156667, -188078, -64109, -307534, -363930, -190552, -78475, 16505, 254687, 242567, 72851, -87801, -263537, -113857, -21342, -309583, -80824, -447597, -130866]
18629b21118N8143d9226O233A76296g4629H983i5494o2735B9274O3929L7724b28335
18616B19019a53073D8432a11158A92864a44123e354j7339k59915k5666J29347
18606a78927I8573b46056A17400b50422M1754n8728f0692p1847l89245C5487e5377
18594b08587M1661H5388R6143R5855L7678a19050H2642B4963b78340a38129N1217
18583h6912C8618e0277k04623D40498a50184i408r9671F9169b50473B92834a25476
18571a4934l16692i4832K3832D292b20567b2566l30651a19705d0359B15510a60672
18559b46073A84753f2401A98393L2546i3664A11264H846a35817k43324a7985A22564
18547b22468G5188R1671a02129B5941b32614c8541H7231d312l35243A88731b8042
$$ y = [-221118, -162975, -49226, -42993, 176296, -74629, 8983, -95494, -158229, 29274, 93203, 130927, -228335, 219019, -153073, 48432, -111158, 192864, -144123, -5354, -22693, -282608, -308274, -178927, 98573, -246056, 117400, -250422, -208668, -267396, -60692, -132539, -521784, 35487, -55377, -208587, -166926, 85388, 181531, 277386, 315064, -119050, 82642, 24963, -278340, -138129, -86912, 38618, -50277, -254900, 440498, -150184, -9408, -109079, 69169, -250473, 292834, -125476, -14934, -331626, -94832, -71000, 4292, -220567, -22566, -353217, -119705, -40359, 215510, -160672, -246073, 184753, -62401, 198393, 230939, -93664, 111264, 8846, -135817, -379141, -17985, 122564, -222468, 75188, 166859, -102129, 25941, -232614, -38541, 87231, -4312, -339555, 188731, -28042]
18535I1355a34493L0333A44554f2610A96457h8005A8197J76339b60692a5137n8840
18524g3977q4706B07610c8967B90425d03516i517G2715b23050B09860a93243m0162
18513b33405d4196j36170g5358F9207b34466a7891O860o6663c5819K345j32208
18502a65682B28977h4333k45862b7582G7135K42018A16419A7741i9298k55338
18492c54636b3049A10232a33330k84620J99290a7899j0724n4180j36900p8170
18482b97873A0844K61025b87299E3033i9354I6670b00198A7274e4207o7920B67073
18470c02612j65285A66052P3256b5416j18385Q404A84746A6647J49963a30781
18459C1623c36147B19875H5387m0184b50927A73695b08466A16136d4390B09299
$$ y = [91355, -134493, -104160, 144554, -62610, 196457, -88005, 18197, 194536, -260692, -15137, -73977, -158683, 207610, -38967, 290425, -403516, -9517, 72715, -223050, 209860, -193243, -233405, -44196, -180366, -75358, 69207, -234466, -17891, -11031, -77694, -35819, -33474, -165682, 228977, -84333, -330195, -27582, 77135, 319153, 116419, 17741, -99298, -354636, -23049, 110232, -133330, -417950, -218660, -17899, -28623, -82803, -219703, -297873, 10844, 271869, -287299, 53033, -99354, 96670, -200198, 17274, -54207, -122127, 267073, -302612, -467897, 166052, 239308, -25416, -143801, -135397, 184746, 16647, 166610, -130781, 31623, -336147, 219875, 85387, 45203, -250927, 173695, -208466, 116136, -44390, 209299]
18448E1329g8425k8095F9493a04121F953c48941B62751E1756K16655b10605f0126
18436A4194J73776b14980C6455b52477i8990A57777c5965j83483m5807P1169b8477
18424A15743D650a4989A49650c8707p5024D4979J54822j6458a54219A96600d21642
18412B97359F7608J99037f9376A62297A9412K7707c31023a01204o424m9993A61922
18400i2436A42431a35042C15458a07792a3033I9814J09421a56928B39467c32439
18389g0031K9235k5431E5742c6813A29270k6755D0747h0997j50109M5593d6136
18377b21748i8665d6041B50132m9318K72846a69853A76503q7601M3973i2825k80766
18366c73591a50032l57409J92828J37066E858b5876B85055j12839k4955c3118
$$ y = [51329, -78425, -106520, 69493, -104121, 6953, -348941, 262751, 51756, 268411, -210605, -60126, 14194, 187970, -214980, 36455, -252477, -98990, 157777, -35965, -219448, -265255, -194086, -28477, 115743, 4650, -14989, 149650, -38707, -113731, 44979, 199801, 183343, -154219, 196600, -421642, 297359, 67608, 266645, -69376, 162297, 19412, 47119, -331023, -101204, -107628, -157621, 161922, -92436, 142431, -135042, 315458, -107792, -13033, 99814, 209235, -156928, 239467, -332439, -70031, -40796, -66227, 55742, -36813, 129270, 102515, 40747, -80997, -231106, -185513, -46136, -221748, -98665, -46041, 250132, 200814, 473660, -169853, 176503, 88902, 132875, -92825, -373591, -150032, -507441, -314613, -177547, 5858, -25876, 285055, 172216, 147261, -33118]
18355i7148M5224j29715j05888G9367p058J05033o0074a89129A08598a69336B30477
18343H9236J65642I1818d18657A17426f8821A01826m248D4709b51755I7292f8777
18331c08688J44012a6361k56678A79554l9525b09781Q2105B41694a04195D9061
18320B73517a11012j52698E8102L1576J66343A8546J9545h7539I9551d35188a60384
18308A25982a39235H9834J81266D5018b96158h9913J1661r9252B8952J33311m3925
18297A18338d8718b1286E8167R4414B6332A0793C485b62649A5018c53194M4096
18286c09098r306n4891a10084A54652g9195H0765L1932b5441n6a1422j52853e8316
18273c01704D9154P5302b02054D8956b54102N1458B34177a06843J8294C3650g579
$$ y = [-97148, -51924, -181639, -287527, 79367, 72309, 177342, 117268, -189129, 108598, -169336, 230477, 89236, 254878, 91818, -418657, 117426, -68821, 101826, 97578, 44709, -251755, 97292, -68777, -308688, -164676, -16361, -273039, 179554, 140029, -209781, -127676, 241694, -104195, 49061, 273517, -111012, -263710, 58102, 89678, 256021, 18546, 38091, -87539, 99551, -435188, -160384, 125982, -139235, 89834, 271100, 45018, -296158, -89913, -78252, -177504, 28952, 162263, 118338, -48718, -21286, 58167, 152581, 26332, 10793, 3485, -262649, 15018, -353194, -309098, -318404, -373295, -110084, 154652, -79195, 80765, 112697, -25441, -25497, -11422, -164275, -58316, -301704, 49154, 124456, -202054, 48956, -254102, -202644, 234177, -106843, -88549, 33650, -7579]
18261A59407a54456A73562a80317f2206A31224E4599a75095H8929a66051p0719
18251b36770R9637B76539I9555F805b98026B3015e6032k1017K0971q3409k530
18240a42017C8812b33390l5783M0465B06068A5570c7658J0233j09966B65827j30331
18229A35496b2015k29088A04110b1287j43166f2976B0036M5277R2030i2655j76656
18218b69311f0715A7261a94656k4001H410a83887b0186A1551J44409L574a48773
18206B57100a97771K7906C0434J2095L966J25105p7346J39876G1876b26204h9119
18194c407n1427A32441a16467e1889j07852A17758a14358C6218M9922k7383J2932
18183G1689a36828j19324I6797c02403B38243J9781r2153i6485F6977h5526l6956
$$ y = [159407, -154456, 173562, -180317, -62206, 131224, 54599, -175095, 88929, -166051, -236770, -137133, 276539, 99555, 6805, -298026, 23015, -56032, -77049, -56078, -139487, -142017, 38812, -233390, -269173, -228708, 206068, 15570, -37658, -27425, -137391, 265827, 135496, -22015, -251103, 104110, -21287, -164453, -62976, 20036, 65313, 157343, -92655, -269311, -60715, 17261, -194656, -218657, 8410, -183887, -20186, 11551, 155960, 159534, -148773, 257100, -197771, -169865, 30434, 42529, 46495, 171600, 94254, 234130, 71876, -226204, -89119, -3407, -54834, 132441, -116467, -51889, -159741, 117758, -114358, 36218, 86140, 58757, 71689, -136828, -256152, 96797, -302403, 238243, 258024, 165871, -96485, 66977, -85526, -122482]
18172a22482h327g54B45397a32139H6213a82365q5376c7692l57648H319b1439
18160d9699k0350K7030a8047k18140c171j91718C3170a131r1301n6658H1394K0226
18148A01620a44323j23568F928b89311Q9408P2570j0520A17203A93a3760D00510
18136B8010F322R156N9643e00330d7882k23551a29520n630j8881l2288b4629j5835
18124d0464A45312e4495k20857C95299a26603A42767j9078b5219G3936L3754a12970
18112A77492H5791c95509J72431B17550d7285A65055k3725b00650l9818J08585
18102a31883d9983C04030d23256J20674F8477D643e2316q728A03302P6265C681
18090E4025a80862e2183J2738j06489L010A09357D6659J81590D9745g7651B3383
$$ y = [-122482, -8327, -754, 245397, -132139, 86213, -182365, -267741, -37692, -395340, 8319, -21439, -49699, -70049, -43019, -18047, -236187, -3171, -194889, 33170, -1131, -92432, -149090, 81394, 101620, -144323, -267891, 6928, -289311, -199903, -127333, -137853, 117203, 193, -13760, 400510, 28010, 6322, 15478, 75121, -500330, -47882, -271433, -129520, -135150, -154031, -186319, -24629, -40464, 145312, -54495, -275352, 395299, -126603, 142767, 123689, -25219, 73936, 107690, -112970, 177492, 85791, -395509, -223078, 217550, -47285, 165055, 141330, -200650, -240468, -131883, -49983, 304030, -423256, -302582, 68477, 4643, -52316, -61044, 103302, 179567, 3681, 54025, -180862, -52183, -39445, -145934, -142924, 109357, 46659, 228249, 49745, -77651, 23383]
18078c5241k66433a45604A12701o228K33696a98650B23001q8206a29877A92803
18067a8188C17081D0311g1101b9442k39873b4350a0477H2409a82521C9077j5679
18056B3398P1532a13454d2007j07704A6614a19085m229C4700K01353a81433L6458
18045a44975a3868C2449J84501B1372b67704C4659A6483f3047o4519k21062C08568
18033c29976H9723a65374A41905a66959C0134c7412A17704b13527e5571b837B5679
18021A75790D1079J71397K22891f118A29672l8385L5948f8901C881b13781D7861
18009A70575c23092C9253j8610a98670A00435g842l68044A8301L01g6440k0796
17998i7236a7229G4285b74830B6003g1078j89461A52256c50957J70054I665h9484
$$ y = [-35241, -301674, -145604, 112701, 106473, 340169, -198650, 223001, 134795, -129877, 192803, -18188, 317081, 40311, -71101, -29442, -269315, -24350, -10477, 82409, -182521, 39077, 23398, 94930, -113454, -42007, -149711, 16614, -119085, -123314, 34700, 236053, -181433, -144975, -13868, 32449, 216950, 21372, -267704, 34659, 16483, -63047, -127566, -348628, 308568, -329976, 89723, -165374, 141905, -166959, 30134, -37412, 117704, -213527, -55571, -2837, 25679, 175790, 41079, 212476, 435367, -6118, 129672, 91287, 127235, -68901, 3881, -213781, 47861, 170575, -323092, 39253, 20643, -198670, 100435, -7842, -375886, 18301, 18602, -76440, -97236, -17229, 74285, -274830, 26003, -71078, -260539, 152256, -350957, -180903, 9665, -89484]
17986A2740a72661n20b635C2493f8576A13913h465B10863E7891b39157A73611
17974B7330e1831j31890d2069C1896A1703M0221g879A66324c42721B28946b71193
17962a05417A98029a58540j15139n5868J60162A66277c85493a17259B0152K9758
17952D9910i5076C1948N95624C870K64460j7079o6858a5195k65982C7635h6112
17940C06202o2577e7324C4727A6841b44469B0814J93627e1351l7871C0106a52091
17928D5532J51388H6986J38390H6454O4864F6974J2176a05829D02507D5977h5644
17916B47624g8793L7989J9979B71404G7625J798L08613c51154a10234p1105D8737
17904G096b49537B59860B9374M5252B9520a81758a6224H6754g5505n5455B3561
$$ y = [12740, -172661, -173181, -2635, 32493, -68576, 113913, -8465, 210863, 57891, -239157, 173611, 27330, -51831, -183721, -42069, 31896, 11703, 51924, -7879, 166324, -342721, 228946, -271193, -105417, 198029, -158540, -273679, -329547, -169385, 166277, -385493, -117259, 20152, 49910, -95076, 31948, 627572, 3870, 268330, 251251, 184393, -15195, -281177, 37635, -86112, 306202, 243625, -57324, 34727, 16841, -244469, 20814, 214441, -51351, -89222, 30106, -152091, 45532, 196920, 86986, 225376, 86454, 151318, 66974, 79150, -105829, 402507, 45977, -85644, 247624, -78793, -40804, -20825, 271404, 77625, 79423, 388036, -351154, -110234, -181339, 48737, 7096, -249537, 259860, 29374, 74626, 29520, -181758, -16224, 86754, -75505, -130960, 23561]
17892A9941h2298A89739a8868A69364G3437J09152G9532g4072j3295k68068A10587
17880a84475C5856a56F9825a0095H8531l7895k3177J22605J77140A09360J60727
17869B70087j04984K5897c5755k5916C00816A13775c67281A41024o5838K72259
17859C47445e5596A06992B3123K6754g4967A56039f7212K6143A22681K44622A7880
17847I4732j971b5795B9401K3168J11100c44448B0510g9238m5534M5682B13526
17835D4529A7608N9894a13801L9788j13786L658B806a83232R0757A11174b67721
17823A34443e1169B68334G7377c7721B78445e5112j1942l86632A36983l1134C9662
17811E1771a72832E46K47790A20285f0568m1916C5588J78723I1166Q2641m6728
$$ y = [19941, -82298, 189739, -18868, 169364, 73437, 182589, 79532, -74072, -87367, -355435, 110587, -184475, 35856, -156, 69825, -10095, 88531, 50636, 27459, 150064, 327204, 109360, 270087, 165103, 191000, -35755, -61671, 300816, 113775, -367281, 141024, 75186, 347445, -55596, 106992, 23123, 49877, -74967, 156039, -67212, -41069, 122681, 367303, 17880, 94732, 92761, -25795, 29401, 52569, 163669, -344448, 20510, -79238, -124772, -79090, 213526, 44529, 17608, 77502, -113801, -74013, -187799, -184141, 2806, -183232, -92475, 111174, -267721, 134443, -51169, 268334, 77377, -37721, 278445, -55112, -67054, -453686, 136983, 105849, 39662, 51771, -172832, 546, 248336, 120285, -60568, -102484, 35588, 214311, 91166, 173807, 127079]
17800A27079J20588a00050M2456j00882B01459e3327A07851k3589i057B5291J50829
17789A76120d7986A10818D3310a6650A74225J01078j20636j2618L06306j06477
17779C41878l2795C0603j3755c5835l3273B56887b52806A11087K6143b23423a4599
17767E15155B11877a40409H8264m597j2841N7271J81713j34251a67577C1307K35825
17756B67132C8715J72619g2172C0341N4716f9181I8583C7417J28909n8161K23084
17745C31249G7889N9232J2772O1416q2395a24226n9721I7388d2346I8600J4560
17734A13160n3310g9939A01208e8885A68367l2493f1985B42695h0128G8447k8893
17723D9554d5864A17107Q0638k9650B3128J81130H1274K24661Q3641a80859A68201
$$ y = [127079, 247667, -100050, -57594, -158476, 201459, -53327, 107851, 84262, -9057, 25291, 176120, -47986, 110818, 43310, -16650, 174225, 275303, 154667, 142049, 448355, 341878, 309083, 30603, 16848, -35835, -69108, 256887, -252806, 111087, 137230, -223423, -14599, 515155, 211877, -140409, 88264, 83667, 70826, 128097, 309810, 175559, -167577, 31307, 267132, 38715, 211334, -72172, 30341, 85057, -69181, 98583, 37417, 166326, 108165, 331249, 77889, 137121, 149893, 211309, 128914, -124226, -183947, 97388, -42346, 98600, 113160, 59850, -79939, 101208, -58885, 168367, 135874, -61985, 242695, -80128, 78447, 49554, -45864, 117107, 197745, 168095, 23128, 204258, 81274, 305935, 389576, -180859, 168201]
17711a74859B18661a14835B88501J38055B670g3144l0255D6584b73441B45087
17700A42195K15265b3952P366G4097b21028k7212C31665f1727J4797D5797p043
17689C8754K52415a96333d2630I4396L13005j19842r9366q3885a92252L3151B35185
17677A68007L1438G4294J95424a09552C76651a56885a1459C03829r8947o5541
17667A39341L6598K30329A79295J5625n5025g3892C27754R3932A50410o7375L9208
17656A22243g8790j11717K4078k5754r346A94128r1680J40656P3916a43527M9472
17645i4055D463M16221d0263H3955K30016A9853J17760J18519j8897b9739j32697
17634a62436I5455K45454a47219b0799j7612H1429J04291J82688c0695m3643B2619
$$ y = [-174859, 218661, -114835, 288501, 426556, 2670, -73144, -103399, 46584, -273441, 245087, 142195, 357460, -23952, -16586, 74097, -221028, -248240, 331665, -61727, -46930, 45797, 38754, 291169, -196333, -42630, 94396, 407401, 287559, 188193, 104308, -192252, -159101, 235185, 168007, 199445, 74294, 269718, -109552, 376651, -156885, -11459, 303829, 204882, 139341, 175939, 406268, 179295, 194920, 139895, -73892, 327754, 421686, 150410, 83035, 122243, -78790, -190507, -166429, -192183, -201529, 194128, 102448, 243104, 317020, -143527, -94055, 4463, 420684, -40263, 83955, 313971, 19853, 137613, 256132, 237235, -29739, -162436, 95455, 340909, -147219, -20799, -38411, 81429, 185720, 368408, -30695, -74338, 22619]
17622e7700A55417d660G6557b32279A11543a95834J8761B65068b0201A35459J81055
17611C16514h2597N819C21834b41456a04668A19174J90301G3K28337L4478I3071
17599b87503J13072C39910E6820g3325j56548g4604j14542C88267c922B09405
17588A70941K25974a6111j5511D35962B14154d2617B18448o3137b36197D8013
17577A54942i095A75167P8405J51141a0980B48750p88A9700J37066E0492c51805
17565a71116A49182o032i4079M1274j79631N9588D31668A91651Q3568N2167A03474
17553B27684J76802j96706M1768A7981O2007l7098L24398j4290K07714B43923
17542A39783k9906m157J18774N4244C1904L85826F2702D038J21552C4025J45442
$$ y = [-57700, 155417, -4660, 76557, -232279, 111543, -195834, -177073, 265068, -20201, 135459, 316514, -82597, -76778, 321834, -241456, -104668, 119174, 309475, 73, 228410, 262888, 93071, -287503, -174431, 339910, 56820, -73325, -229873, -74604, -189146, 388267, -3922, 209405, 170941, 396915, -16111, -31622, 435962, 214154, -42617, 218448, 155311, -236197, 48013, 154942, -9095, 175167, 253572, 404713, -10980, 248750, 247962, 19700, 156766, 50492, -351805, -171116, 149182, 143150, -94079, -52805, -232436, -172848, 431668, 191651, 275219, 327386, 103474, 227684, 404486, 207780, 249548, 17981, 79988, 42890, 367288, 352998, 560712, 243923, 139783, 109877, 105720, 224494, 278738, 31904, 417730, 62702, 4038, 125590, 34025, 179467]
17531A79467J38437A54917C8236L00825l8137r2407b69445A98256Q7275j09560
17521A75971L10144k7978Q1418q2434R0947j37219j66636k0759K41501m3828K78911
17510G00038M60873k61162K33974l81561j49332O148k43407A80895L24309k04379
17500C00825k5848J4252L90116K96095D62189K06587K17910N7773j74129j12098
17490F58232J10704j19451F5390J73650K60062A17657J08242P4712J6371D6769
17479A81694J31322B5046h6091A08201Q9831M43650A76799J18874A37969J15458
17469B53427K93155k16787n414Q7943r6474O371e9327D60172c5955I1918D1267
17457C50945o4090N9350J54160j57697p5221a14341B41870n0082b2855C02679
$$ y = [179467, 317904, 154917, 38236, 339061, 300924, 208517, -269445, 198256, 285531, 175971, 486115, 458137, 539555, 457121, 548068, 410849, 244213, 223454, 464955, 421127, 700038, 1160911, 899749, 1133723, 752162, 602830, 608978, 365571, 180895, 505204, 300825, 274977, 289229, 679345, 975440, 462189, 668776, 886686, 944459, 770330, 658232, 768936, 649485, 65390, 239040, 499102, 117657, 225899, 300611, 316982, 46769, 181694, 313016, 25046, -86091, 108201, 198032, 641682, 176799, 295673, 137969, 253427, 546582, 329795, 324381, 412324, 315850, 322221, -59327, 460172, -35955, 91918, 41267, 350945, 286855, 346205, 500365, 342668, 267447, -114341, 241870, 191788, -22855, 302679]
17446C13306E5356a32388D51218A22111j7511L0414B2915b206B79597L1049j25278
17435A85368L77377H4345L74666j82015K72375J13785k94913o2727o8968r552
17425B26996K42001L25138B85384R1772f9096A59673M03696j45815j32757L9100
17415C23897c6389C93936P7397j12563p5165j37263K46952J18885A38367K66439
17405D04806E8279f9077E56045J9453m4442j36936E0587N64688j34395l0320j31925
17394C18635j49209M88341B82920A30091J7694E2480a10031H6323K62984M7451
17384C96758j72180L46828A07722L26217j89920J8684f1853A78356J35062H9145
17373A44212M60554B33431J30819A52715L48968b70515B86784m0546J75783A16006
$$ y = [313306, 55356, -132388, 451218, 122111, 104600, 135014, 22915, -2206, 279597, 310646, 185368, 562745, 84345, 459011, 276996, 549371, 663156, 368243, 305516, 236548, 226996, 468997, 794135, 285384, 377156, -69096, 159673, 563369, 417554, 284797, 323897, -36389, 393936, 471333, 358770, 283605, 146342, 393294, 512179, 138367, 404806, 58279, -69077, 556045, 575498, 531056, 394120, 50587, 615275, 480880, 450560, 318635, 169426, 657767, 282920, 130091, 147785, 52480, -110031, 86323, 349307, 396758, 224578, 571406, 107722, 433939, 244019, 262703, -61853, 178356, 313418, 89145, 144212, 604766, 233431, 364250, 152715, 501683, -270515, 286784, 246238, 422021, 116006]
17362D88081A26441R0093J40434N6559j71801q2579I000J50138L4144b4465C26911
17350A47400J30448A19788R9042n0375m1706J06576o5336K40334D6355K39805
17340B86160C6290J84636J12621A08945k6636a03037c1491D94853j94484p2590
17330B27779J95905j60333R6512n6182P3543M2778o3985p1464J12100A91169L28519
17319E19688K80986B26076M3787A26123K66944F5110k4781K22149A01715J55850
17309B57565C1689L43230A43372M29694B50895J38264q75J47172o1475m0488j32130
17298C01363Q7618A82291K99799k15956j05625J16391J98933L9603j83192J84065
17288E16309A67029h3254B18778q8945J24476q6317J28117A08439J87821Q5211
$$ y = [488081, 126441, 216534, 356968, 413527, 241726, 159147, 9000, 159138, 193282, -24465, 326911, 147400, 277848, 119788, 218830, 168455, 126749, 233325, 167989, 408323, 46355, 286160, 36290, 220926, 333547, 108945, 82309, -103037, -31491, 494853, 300369, 227779, 423684, 263351, 359863, 303681, 377224, 420002, 356017, 284553, 396653, 191169, 519688, 800674, 226076, 269863, 126123, 393067, 65110, 40329, 262478, 101715, 257565, 31689, 374919, 143372, 573066, 250895, 389159, 388284, 535456, 473981, 433493, 301363, 388981, 182291, 482090, 266134, 160509, 276900, 475833, 515436, 332244, 516309, 167029, -83254, 218778, 129833, 254309, 167992, 296109, 108439, 296260, 381471]
17278C81471j55243J26154J94612m4828l8812A99430q2667m8122K18689r6872
17268A90458m383o6812M29582A52979J88063J06718j82840J0725M5066h4668D77051
17256c7917B71708P9837m4696j49111L23242j87147A05422j1020K34650j14484
17246B14568j06186L27559A01254L28969j95714b63444D41249j04588B5155O1765
17236H6920J59014J98330M9321k19003n3656J78051j68208K4783J69617p9964
17226C45205A34763K74729j74246Q0900r0703L46374A55303J90437L46385B10051
17215B48123P1841r9229k544J48667L32350N7431B07440M57994k656j55404n3514
17204D53860A64800K89291n1738J60691B33265Q1900m0050j5218K50684j20975
$$ y = [381471, 226228, 352382, 546994, 502166, 463354, 199430, 116763, 68641, 287330, 190458, 186075, 119263, 548845, 152979, 341042, 447760, 264920, 275645, 320711, -84668, 477051, -37917, 271708, 351545, 306849, 157738, 480980, 293833, 105422, 94402, 329052, 214568, 108382, 435941, 101254, 430223, 234509, -263444, 441249, 336661, 25155, 86920, 245934, 444264, 493585, 274582, 220926, 398977, 230769, 255552, 425169, 345205, 134763, 409492, 235246, 316146, 225443, 571817, 155303, 345740, 692125, 210051, 248123, 319964, 220735, 218191, 366858, 699208, 756639, 207440, 665434, 662778, 507374, 453860, 164800, 454091, 402353, 563044, 233265, 315165, 275115, 259897, 510581, 389606]
17194C89606R565K14449A88134L83296D4799M10610J03042r5418j33869n0649
17184B78515O2955K23333j8819L9402j52749J21545j26427J89861O3454C32585
17173F42652B67057M28102m4127j96971J42999k19472J95902A95104l18R5506
17163B90292j28666Q53464C15470M164p8239M53158B32941J00936J62697O4675
17153E61249j27084N0882j5921m9644P7200A46798L31956j68731L00399j16407
17143D94015P1590j53546j65310K87415J5844M4988K44671j92891k58530j85878
17133B02368L14833O8436o8675R7073p6030P8235n5777Q9380K7358j69667p8003
17122D29531O1810j03686K6620J43030j77676J30924k5756J58573J84425l47866
$$ y = [389606, 399171, 613620, 188134, 571430, 44799, 455409, 558451, 463033, 329164, 278515, 341470, 564803, 545984, 585386, 432637, 554182, 427755, 617616, 681070, 332585, 642652, 267057, 695159, 651032, 454061, 597060, 377588, 573490, 195104, 194786, 290292, 161626, 1015090, 315470, 319634, 241395, 694553, 232941, 333877, 496574, 561249, 434165, 485047, 469126, 419482, 496682, 146798, 478754, 310023, 610422, 494015, 565605, 412059, 246749, 534164, 550008, 594996, 839667, 646776, 388246, 202368, 517201, 585637, 516962, 614035, 538005, 616240, 560463, 649843, 677201, 507534, 429531, 491341, 387655, 414275, 557305, 379629, 510553, 484797, 643370, 827795, 479929]
17112D79929Q4918P6741K38195C44450J91710M629J32883L404N5727k86915L12977
17101G58865N8306R5C17395J40837L00674O1083l57839K74371L1001k54039K2499
17090E35982j48804p9940L23970J14614P1903r6239j83443L92496j24888l88204
17080D17447L51057J90517D03550M65792j59461j43720J37235r447l0129R8103
17070G61923k162M5642O8542j09061J44656k52598k68216L82122C56246O18063
17060I74309m58626K25436K3814K20727o1677C63975N63691k77355J20069K2980
17050G93360j3981j4957l24155J8296L80782Q4553O4544L57791k89247k45441
17040H11545J69736m20383L44670j61803K46103m3894k39761M79844E79187L93223
$$ y = [479929, 564847, 641588, 879783, 344450, 536160, 540789, 673672, 677076, 732803, 445888, 758865, 817171, 817266, 317395, 458232, 758906, 819989, 462150, 736521, 767522, 513483, 535982, 387178, 307238, 631208, 745822, 817725, 721486, 538043, 930539, 805651, 417447, 768504, 959021, 403550, 869342, 709881, 566161, 703396, 693949, 663820, 761923, 759761, 805403, 873945, 764884, 909540, 656942, 388726, 770848, 356246, 974309, 515683, 741119, 764933, 985660, 923983, 363975, 927666, 650311, 770380, 793360, 779379, 764422, 440267, 458563, 839345, 923898, 988442, 1346233, 1056986, 811545, 981281, 560898, 905568, 743765, 989868, 945974, 706213, 1186057, 579187, 972410]
17030I72410K07584j52490l03749M60830m08521K93439J32057j58705j28417K8414
17020I42852j20424j19598K52849O5987K00539k60315J73802l31587J42771M04117
17010A350993l20116L63394o05936L12087k90917J66095k17630M36998j96598
17001I98370K96175K1899K8046n36292K3288L34880L24385l66349k5181R9646
16991A198867k06333j71063L02979j34139P9324n9852L73035j22443q8356j84431
16981I87588l7971K79747j22893R863L8971l0758K09801k15995N81631m34277
16971A265707l07217J02379N37457l14725k6630M030K38497n8925r4753j97432
16961A148388M92935L2194j10472n6456k34443J01622j3588j8616J60794J76668
$$ y = [972410, 1179994, 1027504, 723755, 1184585, 776064, 1069503, 1201560, 1042855, 914438, 942852, 822428, 702830, 955679, 1021666, 1222205, 961890, 1135692, 804105, 946876, 1350993, 1030877, 1394271, 788335, 1100422, 809505, 975600, 757970, 1194968, 998370, 1294545, 1316444, 1344490, 808198, 831486, 1166366, 1490751, 1124402, 1099221, 1198867, 992534, 821471, 1124450, 990311, 1069635, 1009783, 1382818, 1260375, 1172019, 987588, 949617, 1229364, 1106471, 1116334, 1155305, 1124547, 1334348, 1118353, 1699984, 1265707, 958490, 1060869, 1598326, 1283601, 1256971, 1261001, 1499498, 1440573, 1345820, 1148388, 1641323, 1673517, 1563045, 1506589, 1272146, 1373768, 1360180, 1341564, 1502358, 1679026]
16951A679026j98277q6534l7339L74373j22314n3525L23570l50128K18906k2647
16941A725111j65172L29650j91151L53492k63321K11914k89331K7717N0196k52083
16931A537022K06626J98485K71256l48527R8689l29259K09372L5061m3019L55145
16921B190851j8679j49730k44345M17109j68504J03541l12800R3659J78465j88359
16911A901208L63549J6956k46490K16990M72940k13277k24952K80981m06099J75079
16901B336885l08277J82074K68865r342N7181J14997n4065M14871q47553N39856
16891B695492r5176J0652P7205J68439j13507L57756k24866o9586L36193J80769
16881C323371l51574J86007K54215l31397L66510K9847j36284L7896J77865P180
$$ y = [1679026, 1480749, 1394215, 1356876, 1731249, 1608935, 1555410, 1878980, 1528852, 1747758, 1725111, 1559939, 1889589, 1698438, 2051930, 1788609, 2000523, 1711192, 1738909, 1789105, 1537022, 1743648, 1942133, 2213389, 1864862, 1963551, 1634292, 1843664, 1878725, 1835706, 2190851, 2172172, 2022442, 1778097, 2195206, 2026702, 2130243, 1817443, 1911102, 2089567, 1901208, 2264757, 2281713, 2035223, 2252213, 2725153, 2511876, 2286924, 2567905, 2161806, 2336885, 2028608, 2210682, 2479547, 2470205, 2527386, 2642383, 2588318, 3003189, 2155636, 2695492, 2600316, 2610968, 2688173, 2856612, 2743105, 3100861, 2875995, 2806409, 3142602, 3323371, 2971797, 3157804, 3412019, 3080622, 3447132, 3476979, 3340695, 3378591, 3556456, 3563636]
16871C563636M940p6785N7467j29785L23794K9276J29665m5219j73243J68892
16861C852638m693J63853l81986N42016k61785L47024j81830O4398j37411J33066
16851D135290M18385l94052N57248j80145R3495J56868m41M16146J6884j05213
16841E114465J76250j54573j35247N13598m6059L28947n25998J45319L02777J29318
16831E848797m41994N39277j13898M46194m11136M68447N99809k67870L68299
16822G035925m12394J69593L10699L11750j32712K8388L32281l0796K43066j28438
16812G727362K03072L83591O893J07980K23157M76920Q0526K77414k11345Q6118
16802I361688L64165l8979L55061J52152L59167K24525n1647L92949N86884q3217
$$ y = [3563636, 3568576, 3491791, 3549258, 3419473, 3743267, 3772543, 3902208, 3856989, 3683746, 3852638, 3847945, 4011798, 3629812, 4171828, 3910043, 4257067, 4075237, 4139635, 4002224, 4135290, 4553675, 4159623, 4716871, 4536726, 4630221, 4787089, 4786648, 5202794, 5219678, 5114465, 5290715, 5136142, 5000895, 5514493, 5468434, 5797381, 5271383, 5416702, 5719479, 5848797, 5406803, 5946080, 5832182, 6278376, 5867240, 6335687, 6935496, 6667626, 7035925, 6623531, 6793124, 7103823, 7415573, 7282861, 7311249, 7643530, 7612734, 7855800, 7727362, 7930434, 8314025, 8320918, 8428898, 8652055, 9128975, 9209501, 9486915, 9275570, 9361688, 9725853, 9686874, 10041935, 10194087, 10553254, 10777779, 10726132, 11119081, 11705965, 11622748]
16792A1622748K13035M59737K83843N4828N77317J63945L74309L733N88868L42173
16782A4684536M13598J07019N69849M08028K76170O97839K69128N46887K1346
16773A7994400Q95059M2862O79217N81992O55974O15733R11760K72908Q33779
16764B3483684N44984L27582J303654O11883J158347N04437Q17159Q79022R42736
16755C0573488J347191Q66530Q41108J235067J160225J040147J374093J529814
16747C9967663Q76633K134963J081938J896202J604095J968274J252401K354304
16739E3136473J579019J922238K314033J961181J739453K706214K060660K658677
16731G0077948K377674K683217L149639J936762L294117K943821K874207K561706
$$ y = [11622748, 11835783, 12295520, 12579363, 12634191, 13211508, 13375453, 13749762, 13753495, 14342363, 14684536, 15098134, 15205153, 15775002, 16183030, 16459200, 17157039, 17426167, 17973054, 17994400, 18889459, 18932321, 19611538, 20193530, 20849504, 21465237, 22376997, 22649905, 23483684, 24028668, 24356250, 25659904, 26271787, 27430134, 27934571, 28751730, 29630752, 30573488, 31920679, 32787209, 33628317, 34863384, 36023609, 37063756, 38437849, 39967663, 40844296, 42979259, 44061197, 45957399, 47561494, 49529768, 50782169, 53136473, 54715492, 56637730, 58951763, 60912944, 62652397, 65358611, 67419271, 70077948, 72455622, 75138839, 78288478, 80225240, 83519357, 86463178, 89337385, 91899091]
16723I1899091K959770K601695K668483K835099K832771K085780K588992K059610
16715A12531291K176003J909956J629649R90678J224310N24737J198627m5776
16707A22139475j08790j40056q95716j048452j161476j512505k185941j635709
16699A13450830j796893k297993k517063k824064k955312k206107l285487k539852
16691I3028059k921186k684611k862445k652650k884836k691867k654834k851487
16683G0824143k223312k073784k677323k272413k084881k228087k203721k128182
16675E2932440j629786j688354j657821j744847j859070j252589j578929j562336
16667C9958708j280857j223286j230967j213133j341140o53381j371288n33020
$$ y = [91899091, 94858861, 97460556, 100129039, 102964138, 105796909, 107882689, 110471681, 112531291, 114707294, 116617250, 118246899, 119237577, 120461887, 120986624, 122185251, 122139475, 122030685, 121890629, 120994913, 119946461, 118784985, 117272480, 115086539, 113450830, 111653937, 109355944, 106838881, 104014817, 101059505, 98853398, 95567911, 93028059, 90106873, 87422262, 84559817, 81907167, 79022331, 76330464, 73675630, 70824143, 68600831, 66527047, 63849724, 61577311, 59492430, 57264343, 55060622, 52932440, 51302654, 49614300, 47956479, 46211632, 44352562, 43099973, 41521044, 39958708, 38677851, 37454565, 36223598, 35010465, 33669325, 33015944, 31644656, 31111636]
16659C1111636j558025p79094o79317p89292j182384o57878q04830m62485q38194
16650B3360137r33346j98007j050223j80104o51373o15531q13548j0577o13207
16641A8294221k68204q15448k78164n94348k16389k13874j056403L23716o00957
16632A4574150m26730k90534l48529m71822J89491m59059l72207k02004l39391
16623A1853365m85726J51396m99351k14223j52230j49846m94143L7497k73199
16614I773540j98482O3270j03389k40866n44052k87715P2144j57617K08590m57951
16604H127472k06571p6560J4099l60947l74473K04810k36744j10368N5535J29768
16594G166021l64095j20109n5827l05174k54761J22995j46814j91131K3546j48051
$$ y = [31111636, 29553611, 28774517, 28095200, 27305908, 26123524, 25465646, 24660816, 24198331, 23360137, 22426791, 22228784, 21178561, 20998457, 20347084, 19731553, 18918005, 18907428, 18294221, 18026017, 17210569, 16932405, 16338057, 16121668, 15907794, 14851391, 15175107, 14574150, 14147420, 13856886, 13508357, 13036535, 13226026, 12766967, 12394760, 12192756, 11853365, 11367639, 11519035, 11019684, 10805461, 10653231, 10503385, 10009242, 10046739, 9773540, 9575058, 9638328, 9534939, 9294073, 8750021, 8462306, 8534450, 8376833, 8585423, 8127472, 7920901, 7844341, 7858440, 7497493, 7123020, 7327830, 7091086, 6980718, 7036253, 7166021, 6801926, 6681817, 6625990, 6320816, 6066055, 6189050, 6042236, 5851105, 5874651, 5726600]
16584E726600j47036K8430j31010L05261l61089j32246j27277M84707o07516m49353
16574D589471L56287j86288L51386l11924m77666M83278l70016K31315l16505
16565D349338J43679j65130K65013l44022j09467j95341L5063L8053m7987k32321
16555C736878P7749K55814l3250m64360L03020l55489L35089m45351k07588K68670
16545C471182K05400n14319J44672j40601n4978J83749k66757Q7133K87586k41271
16535C161796L6252k88282P6406k68094L11999j60033J24585J0338j53632J13303
16525B964638k83092q9235L51270l35089K53486j15932l78717J81908j20763J07503
16515B535977j94323Q5959J10552n58129M16477J97581j76471j09810j23015J40870
$$ y = [5726600, 5579564, 5607994, 5476984, 5782245, 5421156, 5288910, 5161633, 5646340, 5038824, 4589471, 4945758, 4759470, 5110856, 4798932, 4321266, 4804544, 4434528, 4665843, 4349338, 4493017, 4327887, 4592900, 4248878, 4139411, 3944070, 3979133, 4017186, 3969199, 3736878, 3814627, 4070441, 4037191, 3572831, 3875851, 3520362, 3855451, 3410100, 3202512, 3471182, 3676582, 3162263, 3306935, 3166334, 3111356, 3295105, 3028348, 3115481, 3403067, 3161796, 3198048, 2909766, 2986172, 2718078, 3030077, 2870044, 2994629, 3004967, 2851335, 2964638, 2681546, 2592311, 2943581, 2608492, 2861978, 2746046, 2367329, 2549237, 2428474, 2535977, 2341654, 2427613, 2538165, 1980036, 2396513, 2594094, 2417623, 2307813, 2184798, 2325668]
16505B325668J67133j96367j66531J11939k57107K81761o74419R20478k74448
16496B238107l59874k33504K99538P6045J41442J47960l26144p9666P7911k42543
16486A739272J06265j86153J43723K34384k56331P3153q8980j62391J75234p5686
16476A702490j34197J59555J72232m89251K99548K13442j70909N412L7614l37336
16466A458600J18696j07925n791J8870N3967M0984O7533k14480M8761j60693K16243
16455A534765k81910k5312J54443L19396j60280K4018l63991K22468l28656K72511
16445A367452r3213L27690r656k74115j33995j08910M63906k30134M691k34337
16435A079379J70526J90155n27792O13813k97888N051k8463K39219l83744O4286
$$ y = [2325668, 2492801, 2296434, 2129903, 2241842, 1984735, 2266496, 1592077, 2512555, 2238107, 1878233, 1644729, 1944267, 2020312, 2161754, 2309714, 1983570, 1903904, 1981815, 1739272, 1845537, 1659384, 1803107, 2037491, 1781160, 1854313, 1765333, 1602942, 1778176, 1702490, 1568293, 1727848, 1900080, 1410829, 1710377, 1923819, 1752910, 1758322, 1795936, 1458600, 1577296, 1469371, 1463580, 1482450, 1536417, 1577401, 1644934, 1430454, 1479215, 1318522, 1534765, 1252855, 1227543, 1381986, 1701382, 1541102, 1565120, 1201129, 1423597, 1094941, 1367452, 1274239, 1601929, 1592273, 1318158, 1184163, 1075253, 1539159, 1309025, 1313716, 1079379, 1249905, 1440060, 912268, 1526081, 1228193, 1233244, 1204781, 1444000, 1060256, 1124542]
16425A124542J54511k83144L80706j27691Q0680l50514K92655k23844j27284k06696
16415G13921O99626k16656k78243R1768L79023n56313K54506j48968J91593j44661
16405I85596J0754J82634o1584k8541n6392J12264j71544K3381O5362j92913L36034
16394A205051j40513k08622J34734l8790j13151L15890j59201k42994K21048l38821
16384F34631M38441j60760m2546J83351k7063j27725j43216o3662L85580j71361
16374I05670J64599l86882J0532N2966J08825L02961E27000L03016k69810L32098
16364H92304j35767L30024j01406j64902q0209k28977J37092J66127J70148r7865
16354H86569r4894J5966k06693m1582M51213j64067q1718B58845P9126L70351
$$ y = [1124542, 1279053, 995909, 1376615, 1248924, 1329604, 979090, 1271745, 1047901, 920617, 713921, 1413547, 1196891, 918648, 1010416, 1389439, 833126, 1087632, 938664, 1130257, 985596, 996350, 1178984, 1117400, 1088859, 1032467, 1144731, 973187, 996568, 1061930, 869017, 1205051, 1064538, 855916, 990650, 951860, 838709, 1154599, 995398, 752404, 973452, 634631, 1073072, 912312, 869766, 1053117, 1026054, 898329, 755113, 691451, 1077031, 905670, 1070269, 683387, 693919, 746885, 855710, 1158671, 527000, 830016, 560206, 892304, 756537, 1086561, 985155, 820253, 740044, 511067, 648159, 814286, 984434, 886569, 791675, 807641, 600948, 559366, 1010579, 846512, 764794, 258845, 337971, 708322]
16344G08322K38253l98581L54715r6806j74538L0510K51723J46857l35711L0547
16334G55291K4905C44593N46753j61364J05698k74375q0315K70396j29587O9096
16324F90895j456K36183k96569B81900O13891l93718o9416Q1207R6537J48216
16314G58617M4236j95817L9819J7327J40048l32872M7259K93020k0083j19882
16304F71672J13977j19090q7265J07730j85081O308J71896B26275N3605L57269
16294F37149k13287J89774j31889J10018j4382k21954K58494K66411l18058J58607
16284G20883o4535C26208N34791l40892M01291D41510j80448L66331k10335q6098
16274C30960L09414k74437L60323m5661j90428K76052l45689K35945k47779j12648
$$ y = [708322, 946575, 547994, 902709, 805903, 631365, 661875, 913598, 1060455, 724744, 755291, 780196, 344593, 891346, 729982, 835680, 561305, 480990, 751386, 621799, 690895, 689439, 925622, 629053, 281900, 895791, 502073, 432657, 513864, 610401, 758617, 802853, 607036, 646855, 664182, 804230, 471358, 518617, 811637, 791554, 671672, 785649, 666559, 579294, 687024, 501943, 508251, 680147, 226275, 279880, 637149, 423862, 613636, 481747, 591765, 577383, 355429, 613923, 880334, 562276, 720883, 656348, 326208, 860999, 520107, 921398, 441510, 261062, 627393, 417058, 330960, 640374, 365937, 726260, 680599, 490171, 766223, 420534, 656479, 408700, 296052]
16264B96052K89539M8142j00649J2255Q7830B88091K19888P4607j22905q5433
16254C74248A50236K87834J67861k11130K6106K02441j47888J3082k8409K76464
16244G36597j79632G0750k4286K81894o2491A10254J21992J09306J63760K4267
16234E29579j24066M2628q134n2128j70825J3756l0259Q4738K84620B68539k4468
16223B44071J04931K34190j49685j9485K74879B60236J0651L14517B02644K48842
16213D51486O5455c0781C0679L06019o6626O4525r8691J72520A75355J88815n234
16202C58936A20203K47153I1702N3767L26476o4749j91830j02256k7507J44217
16192B29820J46809C8296J11784J19267M0221f2293B48958J55528I1223N6116
$$ y = [296052, 585591, 633733, 533084, 545339, 633169, 288091, 507979, 582586, 459681, 374248, 150236, 438070, 605931, 394801, 420907, 623348, 475460, 488542, 460133, 736597, 556965, 70750, 46464, 328358, 265867, 110254, 232246, 341552, 505312, 529579, 405513, 448141, 440007, 387879, 217054, 230810, 200551, 285289, 569909, 268539, 244071, 349002, 583192, 433507, 414022, 688901, 260236, 270887, 585404, 202644, 451486, 516941, -30781, 30679, 336698, 270072, 334597, 235906, 408426, 175355, 364170, 358936, 120203, 367356, 91702, 145469, 471945, 407196, 215366, 113110, 85603, 229820, 376629, 38296, 150080, 269347, 309568, -62293, 248958, 404486, 91223, 147339]
16182A47339K79229K10735B50247j8611K55084F6768g283E36073R648p7633A91072
16170B81043r6534f0645B89526J6065p3503A03425L74515A42716B040K60376J46936
16159D09352j67495I5568O5506K86492b1876B70557q9144J59629I0922K16264
16149C07186j9637c6073B07294r2951K36600j41068r1230K81364r3239N1187G664
16137A41251E0554J45309m4416p3588Q9120M660g7043B68649j1944J15291A43533
16125A24069K13778Q8601j57590p8045d9989B33095Q9762d7553A76579q2904K61989
16114C55664A7249L05911M15j48597L03635q690e3160B5713c689A35667D4381
16102f693B11804J0717J3293M7872a54398D31i470B46485J09372n529H1194K41614
$$ y = [147339, 426568, 637303, 250247, 231636, 486720, 66768, -7283, 536073, 545721, 468088, 191072, 281043, 184509, -60645, 289526, 305591, 232088, 103425, 477940, 142716, 2040, 262416, 409352, 241857, 95568, 161074, 447566, -21876, 270557, 181413, 341042, 90922, 307186, 287549, -36073, 207294, 114343, 350943, 209875, 118645, 400009, 306770, 357957, 7664, 141251, 50554, 195863, 151447, 77859, 166979, 171639, -77043, 268649, 256705, 371996, 143533, 124069, 337847, 426448, 268858, 190813, -49989, 233095, 322857, -47553, 176579, 93675, 355664, 17249, 323160, 323575, 174978, 478613, 469923, -53160, 25713, -3689, 135667, 44381, -6693, 211804, 222521, 235814, 283686, -154398, 431, -9470, 246485, 355857, 350328, 81194, 322808]
16090C22808j51929p1199o391E248h7631B57126c45961A7320J04851L0812o4008
16079H8975a99548h5316C5682p189g6316F281K73456k7784J86384B6913J5435
16068D2348J91998b97728A44759c2963D0138O4875J5103J47l4697Q1916o4678
16057A02804a0410k3769A17966n508l3617K25867b09539c8091C4466K1680N8897
16046A15043G189f8103B76136M756a03489N1042A78835n9472c9522A15300O2395
16035A77695K64424a31844A69246k2460i7530B34629c3653j43183D73548j02747
16025C70801a19741A74382H0801a93016B61273J63668B06815i010k61504D5915
16014B54681g9502A42185F8861f2079F1364a75280B35157I5007a05662L1771A89708
$$ y = [322808, 170879, 99680, 93289, 5248, -87631, 257126, -345961, 17320, 122171, 152983, 88975, -199548, -85316, 35682, 28493, -76316, 6281, 279737, 251953, 438337, 26913, 42348, 234346, -297728, 144759, -32963, 40138, 105013, 120116, 120263, 85566, 167482, 102804, -10410, -34179, 117966, 112458, 78841, 304708, -209539, -38091, 34466, 56146, 115043, 7189, -68103, 276136, 280892, -103489, -52447, 178835, 119363, -39522, 115300, 177695, 442119, -131844, 169246, 146786, -97530, 234629, -33653, -176836, 473548, 370801, -119741, 174382, 80801, -193016, 261273, 424941, 206815, -9010, -270514, 45915, 254681, -79502, 142185, 68861, -62079, 61364, -175280, 235157, 95007, -105662, -73891, 189708]
16002f8670D31127b17102B46855q8351F2048h5083H6197B2612d447j71911D21345
15990A06100L08085E2728K84721a52975C0851K8890K63223h2898B41837F2931
15979a60008C1991L25873j71670J2940J95598j02790K57242J49697L32929J12910
15969A144720j98218k7604o0494k90419k19084j31981M2632k3515n3079c73098
15958C27570a01340c3991A78133F69J97386K1043c09838E6198c8466C48566g970
15946A95819J01844r5076r7438m4682c7273A54917h0606I1628a02447J3401M3586
15935d5460k33793a6415G4935c04511a49704J2641D10589a60873e2054a2911q5527
15924i8438A24605k1102a24767j12238P6167L1366G6776g2920l5379j42241a1719
$$ y = [-68670, 431127, -217102, 246855, 158504, 62048, -85083, 86197, 22612, -4447, -176358, 421345, 106100, 414185, 52728, 337449, -152975, 30851, 59741, 322964, -82898, 241837, 62931, -160008, 31991, 357864, 186194, 199134, 394732, 291942, 549184, 698881, 1031810, 1144720, 946502, 918898, 858404, 567985, 348901, 216920, 259552, 236037, 182958, -373098, 327570, -101340, -33991, 178133, 669, 198055, 219098, -309838, 56198, -38466, 348566, -7970, 195819, 297663, 202587, 105149, 60467, -37273, 154917, -80606, 91628, -102447, -89046, -45460, -279253, -16415, 74935, -304511, -149704, -137063, 410589, -160873, -52054, -12911, -98438, 124605, 103503, -124767, -237005, -160838, -129472, 76776, -72920, -108299, -250540, -11719]
15912F1922a88608O1593E3274h1347C00687j40622c3318A19597d3681j53888A84779
15900F0555K73960A26073R8816a9926r5777M2038r1200h0071k7075k5761b2718
15888I852c51513A9155f4232A17672b03954A07251g1299k56573K7212J26520P084
15877a67056N4161A225M914J5564b69032A15120c49634E5050M2800h0654b0449
15865h3770k83095Q2949h1919j06840d6825A91940a46115O0244B09010c64787
15854d9031A78448d9482B75874i7937j10942F1872a08551m798E2875A0126b7980
15842H8301l4465k6059a4431A1998P1974b46504f8424E9790a26457F4790j6798
15831D7992g6356O136c0342P376A00023h6691B91820a7871O339k53213e9492f004
$$ y = [61922, -188608, -127015, 53274, -81347, 300687, 160065, -33318, 119597, -43681, -197569, 184779, 60555, 334515, 126073, 224889, -19926, -115703, -73665, -164865, -80071, -107146, -132907, -22718, 9852, -351513, 19155, -64232, 117672, -203954, 107251, -71299, -327872, -300660, -174140, -167056, -112895, 1225, 6139, 21703, -269032, 115120, -349634, 55050, 97850, -80654, -20449, -83770, -366865, -283916, -81919, -188759, -46825, 191940, -146115, -85871, 209010, -364787, -49031, 178448, -49482, 275874, -97937, -208879, 61872, -108551, -113349, 52875, 10126, -27980, 88301, 53836, 27777, -14431, 11998, 83972, -246504, -68424, 59790, -126457, 64790, 47992, -76356, -70220, -30342, -22966, 100023, -86691, 291820, -17871, -11532, -264745, -59492, -6004]
15818A57572j0376e5978A02971c2347H3113b6471B19320a55586c2357k13549H8335
15806F0284e4075B67047j18032b79512K6421B01103F7019f8457B94768D7602h1086
15794c00531A29714d3281q7257A67636m1519g19n8498r3723e8159K0792Q154j08066
15782a37279A50450J41798o9212K69b25158N5763D13691b1128j0458j93884O1117
15771a64353B4851J00060g1252C75399i7504k64683C01930c2418G6605a82720
15760D4723b2508k39978A00947C0474h0009k51545b62A23249M5617N7965b70940
15748A17888G484R8953K13168o2803j25214N0167h9268A28766R2858J59216G4786
15736A7424e1179A30482j3311e0405H5704K8839M5812c0896a567A17311a23294
$$ y = [157572, 147196, -55978, 102971, -32347, 83113, -26471, 219320, -155586, -32357, -245906, 88335, 60284, -54075, 267047, 149015, -279512, -253091, 201103, 67019, -68457, 294768, 47602, -81086, -300531, 129714, -43281, -130538, 167636, 126117, -719, -59217, -152940, -58159, -37367, -29213, -137279, 150450, 292248, 223036, 223305, -225158, -169395, 413691, -21128, -31586, -225470, -164353, 24851, 124911, -71252, 375399, -97504, -362187, 301930, -32418, 76605, -182720, 44723, -22508, -262486, 100947, 30474, -80009, -331554, -262, 123249, 168866, 226831, -270940, 117888, 7484, 106437, 319605, 256802, 131588, 181755, -89268, 128766, 221624, 380840, 74786, 17424, -51179, 130482, 117171, -50405, 85704, 114543, 160355, -30896, -1567, 117311, -123294]
15724b6791A14271B3950K04818h4158k59254i9520l3452J4313I9911K3038J16064
15713B39013b57859A19536A1408J37750K74006B1593M7134a30165e5339n9800
15703a15139L1674A01775b12830P0036a3363A22958b5698m0724a0528m6651B46413
15691a22132j59706g3478B21360r2907a1913m3552k2480j82645A15125a87252
15680A96448k5157E7041d7813J8543q1888E7993K07936d13436F0101J89300d2306
15668a41071j40678g7042I5397a2065j81539A18359J35693b42973a9671D2411
15657H8529a88801B9471e0500p6956J8017F7967a47966A46197c66591f9411l904
15646g3315M588C070c35986a1436m41261J02129L019J49699q1849A37170a07316
$$ y = [-26791, 114271, 23950, 228768, -84158, -343412, -99520, -132972, -118659, 99911, 122949, 239013, -257859, 119536, 11408, 149158, 423164, 21593, 68727, -130165, -55339, -115139, -83465, 101775, -212830, -142794, -13363, 122958, -25698, -66422, -10528, -57179, 246413, -122132, -281838, -73478, 221360, 128453, -11913, -55465, -77945, -260590, 115125, -187252, 196448, 171291, 57041, -47813, -29270, -111158, 57993, 265929, -413436, 60101, 249401, -42306, -141071, -281749, -77042, 95397, -12065, -193604, 118359, 254052, -242973, -19671, 42411, 88529, -188801, 29471, -50500, -127456, -109439, 67967, -147966, 146197, -366591, -69411, -73315, -68727, 3070, -335986, -11436, -452697, -350568, -347549, -197850, -279699, 137170, -107316]
15634c60581a55584a1678k631B38411L1859a60607K8664c3411D4030O6219B1747
15622e7418b087k44210F9518d28221J06059f6162A82924O1273A03585E756J05941
15611A11697C7071b86918B36507m582q7299J33417a12791K7370G3494M0725c9639
15599A27768n630O8022a07712E6201B2012J26272b07103D821c5519B06272c3142
15587b4465A4039O308c27120D3462e4351j24240A12476j1869h6380k91274A708
15575a91218B43269o6704a36531d4635j66901J02543A672a48197p1141g0465b4045
15563I1090m3256a67389D2682O6901i7120E492h9091k31640B3356e8856j84779
15552b43635j2959A60626d8047E8999h3798A76323H973a77491L0558I094N8361
$$ y = [-360581, -155584, -11678, -14309, 238411, 270270, -160607, -131943, -33411, 44030, 110249, 21747, -57418, -2087, -246297, 69518, -428221, -322162, -66162, 182924, 244197, 103585, 5756, 111697, 37071, -286918, 236507, 231925, 144626, 278043, -112791, -85421, 73494, 114219, -39639, 127768, 122138, 190160, -107712, 56201, 22012, 148284, -207103, 4821, -35519, 206272, -33142, -24465, 14039, 20347, -327120, 43462, -54351, -178591, 112476, 100607, -86380, -377654, 1708, -191218, 243269, 176565, -136531, -44635, -211536, -108993, 1672, -148197, -219338, -70465, -24045, 91090, 47834, -167389, 42682, 109583, -97120, 5492, -89091, -320731, 23356, -58856, -243635, -256594, 160626, -48047, 58999, -83798, 176323, 8973, -177491, -146933, 9094, 67455]
15541F7455K6454c78060a23049j01547r1615d7642A74083C8626N6464b4325A60019
15529a95611k2979n8748f0960m9058G9008g7328q8668e1739q7696H8706a10854
15517B9197e7047n424o5455A37589L4621c37963h8571H5749a62067A50721N3330
15506B04051b6614A72548C8174J83806r7728d9284B58517Q7510j06450B5838J07458
15495A33296R4071d9588B39066A6361e4858F7661K4507J24633C5418a27367A60670
15483H3685k2021B5334L08417i5683A12712h49j21205c8134A65991a16750B09018
15471A44130j3552h9204C7969M5409f1162E369L01758j6813p7077d6479C34235
15459D05857J45523J56483q070k84160p1957c5504A64101J43877f9909A71588
$$ y = [67455, 93909, -378060, -123049, -224596, -316211, -47642, 174083, 38626, 95090, -24325, 160019, -195611, -218590, -277338, -60960, -110018, 79008, -77328, -165996, -51739, -139435, 88706, -110854, 29197, -57047, -62471, -127926, 137589, 172210, -337963, -88571, 85749, -162067, 150721, 204051, -26614, 172548, 38174, 221980, 124252, -49284, 258517, 346027, 239577, 25838, 133296, 227367, -49588, 239066, 16361, -54858, 67661, 92168, 216801, 35418, -127367, 160670, 83685, 61664, 25334, 333751, -95683, 112712, -849, -122054, -38134, 165991, -116750, 209018, 144130, 130578, -89204, 37969, 83378, -61162, 5369, 307127, 290314, 213237, -46479, 334235, 405857, 551380, 707863, 699793, 415633, 343676, -35504, 164101, 307978, -69909, 171588]
15448D24686b32250M7311P5592d4001B70083q8158a02248B48009a9581F8040a63793
15436I4703a3118A01731O7750H0183J69757I3553J41996d8510D36489J03329R8383
15425F38201L17654l45084B37484E2767M29142F4736J1387N0452c44854a49848
15414f5583D0877i9788B18756b16418h5991j11841D3259q637c5937o6518I3530
15402a16020F9746A7058b1904F0646L08979b4444D35467i367n7708E3297R5811
15391A49108E66J11272b45316B703J45976h8853A9721J25832a09290b7096m7023
15380g4119j76250C39226I736d4123C44771j35731a60358A1269a00897B7175b05223
15368F4462a87328B78712I0169c4395k9096j28285B03714A1093g1924C68991A20344
$$ y = [424686, -232250, -184939, -109347, -44001, 270083, 181925, -102248, 248009, -19581, 68040, -163793, 94703, -13118, 101731, 169481, 80183, 249940, 93553, 235549, -48510, 436489, 539818, 638201, 955855, 610771, 237484, 52767, 481909, 64736, 76123, 126575, -344854, -149848, -65583, 40877, -99788, 218756, -216418, -85991, -197832, 43259, 34622, -35937, -102455, 93530, -116020, 69746, 17058, -21904, 60646, 369625, -24444, 435467, -9367, -67075, 53297, 149108, 566, 111838, -245316, 2703, 148679, -88853, 19721, 145553, -109290, -27096, -74119, -250369, 339226, 9736, -44123, 344771, 209040, -160358, 11269, -100897, 27175, -205223, 64462, -187328, 278712, 90169, -34395, -63491, -191776, 203714, 11093, -71924, 368991, 120344]
15356i4178j99469i1857A48411n8413l6575k2993b75009a6000A32167J48305A12632
15344A42581L48766j10602A87557p0222P0279n4551J38269H9835K09549B2469
15333A46877o5903P9768F0039J75216B0557M33662A0180J98363f5787k9612C52354
15321A19074k736j3530k2733a06375G4846M00007C5904J30984J18397q4924G9505
15309B70019F5698R8202J90985p3343H6051J89838K0078A24660J28014h6228E5761
15297A71623C7782a9287A11073J08233c96119H2393J40196J24889B8509N4128
15287H2637a31186A36628m582K22970a10749B37062N515M6166F5740B3118P1183
15276I4301L8259a67610A6513d02602A85583b80985b1249B42771m5975b39585
$$ y = [-94178, -293647, -91857, 148411, 89998, 53423, 30430, -275009, -16000, 132167, 280472, 112632, 142581, 491347, 380745, 187557, 117335, 187614, 133063, 271332, 89835, 299384, 22469, 146877, 80974, 160742, 60039, 235255, 20557, 454219, 10180, 208543, -65787, -95399, 352354, 119074, 116338, 102808, 80075, -106375, 74846, 474853, 35904, 166888, 285285, 200361, 79505, 270019, 65698, 163900, 354885, 281542, 86051, 275889, 295967, 124660, 252674, -86228, 55761, 171623, 37782, -19287, 111073, 219306, -396119, 82393, 222589, 347478, 28509, 82637, -131186, 136628, 132046, 355016, -110749, 237062, 242577, 288743, 65740, 23118, 94301, 132560, -167610, 16513, -402602, 185583, -280985, -21249, 242771, 196796, -239585]
15265D7602J59099b73722F8193a32538A0188J64167a39343j31783A40749k8859
15255A11890c8623B06039a49000B88707b19993A51985d29075A52318l4780n0963
15245F6575a08339a8090m2785H5546J28531j06422J8065J24759j12094K55255
15235C93640j41090N8654l1446J49913K0062l4503J78459O05925N06927k86049
15225A420492K24932l70206E57633k15373J00285r4482j19808A14054L4916k7126
15215A21844C4547F9M5113E115Q5641a15935B90717p5349c51688A74269k5507
15204A48762a16873p9002c2524B51749C4724K33319G7080a928B28484b62878K3406
15193b39472N7761a417B12359r4207d2521A06799f4983j02987I0644K86717c87982
$$ y = [47602, 206701, -273722, 68193, -132538, 10188, 174355, -139343, -271126, 140749, 111890, -38623, 206039, -149000, 288707, -219993, 151985, -429075, 152318, 117538, 66575, -108339, -18090, -60875, 85546, 214077, 107655, 125720, 250479, 138385, 393640, 252550, 311204, 279758, 429671, 449733, 415230, 593689, 1199614, 1706541, 1420492, 1645424, 1275218, 557633, 342260, 442545, 348063, 228255, 114054, 148970, 121844, 34547, 69, 45182, 5115, 90756, -115935, 290717, 215368, -351688, 174269, 148762, -116873, -195875, -32524, 251749, 34724, 268043, 77080, -1928, 228484, -262878, -239472, -181711, -1417, 212359, 118152, -42521, 106799, -64983, -167970, 90644, 377361, -387982]
15181a04828c5898D50484i0986A75629e9816A83943M9040O5176L1517g562m442
15170a2004j3575E4753A0018J14627m756l6243J30605h4490I2384J30557b03807
15158B2743J69579E8013B0194g2171m1817C09778a02817A26074K17342A47672
15147C53872A12226R132c66961B7994J53140l1198l8473f7863D1788L5645J28616
15136B06049b40933C09021I4100P8417a30791f5095C3076J21940J3957B8218J75062
15125B03280Q4425h135C26087n3993a82937B88104J15334A02417Q4185J5875G8941
15113D1205Q3192p018K05811A04018D9393K76576A56599a11375B57038r883P1827
15102C18982j33687M0258m1222o0934O8465G3245a06828I8182J00715E2713L67544
$$ y = [-104828, -35898, 450484, -90986, 175629, -59816, 183943, 232983, 298159, 329676, -7562, -12004, -25579, 54753, 10018, 124645, 119889, 83646, 214251, -84490, 92384, 222941, -203807, 22743, 192322, 58013, 20194, -72171, -113988, 309778, -102817, 126074, 343416, 147672, 353872, 112226, 121358, -366961, 27994, 181134, 149936, 111463, -67863, 41788, 77433, 206049, -240933, 309021, 94100, 172517, -130791, -65095, 33076, 155016, 168973, 28218, 203280, 287705, -8135, 326087, 272094, -182937, 288104, 403438, 102417, 186602, 202477, 78941, 41205, 124397, 117379, 323190, 104018, 49393, 325969, 156599, -111375, 257038, 247155, 318982, 185295, 225553, 184331, 123397, 191862, 73245, -106828, 98182, 198897, 52713, 420257]
15091D20257j99831m3544J00288b4042j1467j75006g0570G130O11129A90335a50904
15079A0072J76864K3598q8494J05228j12628Q7674P4805A3981L3152K80011b253
15067C9207K84111K50418c0840G0451b66277A26746K4427P4919J74264E0867h5698
15055A6083a35238B39263o0177b2438l2151B7931J35953J32073A37667L21726
15045D59393o3069b1822l0445B13734K46302j7389L3361j29509j8084A21867K49311
15034C71178K13769o3884k49372h1302C25771a3437A79244J82300A62944J29005
15024B91949j3573r7333m5343L92986B17417J08403k7634D4559K49707M24523
15014G18789J8254j24787j02865k13060L94420l39581K15519k70909K47032J87412
$$ y = [420257, 220426, 176882, 277170, -24042, -35509, -210515, -70570, 7130, 618259, 190335, -150904, 10072, 186936, 210534, 122040, 227268, 114640, 202314, 277119, 13981, 47133, 327144, -2253, 39207, 323318, 573736, -30840, 70451, -266277, 126746, 151173, 226092, 400356, 50867, -85698, 16083, -135238, 239263, 179086, -22438, -54589, 27931, 163884, 295957, 137667, 459393, 396324, -21822, -52267, 213734, 460036, 442647, 476008, 346499, 328415, 121867, 371178, 584947, 521063, 271691, -81302, 325771, -13437, 179244, 361544, 162944, 291949, 278376, 181043, 135700, 528686, 217417, 325820, 298186, 44559, 294266, 718789, 737043, 612256, 509391, 296331, 690751, 351170, 566689, 295780, 542812, 730224]
15004G30224C54950L30352B55609Q7609n6639P7888A62430J58364J33998J03050
14994E57842j94603M0992K4335A80107N7360K23576K68072B28689o0481K91590
14984D59798Q5428k7883j82784j21231N8621J6153j34145K62540A02762L12571
14974D15333P9580j70306J25649j69012K80078J2226p5824j04588J85405L24924
14964I03465k95498k24p9547K06574k69297q0371j42252M15612j50158M25945
14954I34249D05502A97842K61884A98340K15550p2434p3487K08725B03382J09777
14944C13159K41308B31083J75045A73528K64287j66091p774K10629k04510J11054
14934C81123J68508B43248l8692K05348M6176j41508O384K63989j01399j74743
$$ y = [730224, 354950, 685302, 255609, 343218, 286579, 364467, 162430, 320794, 454792, 557842, 363239, 404231, 428566, 180107, 237467, 461043, 729115, 228689, 168208, 459798, 545226, 517343, 334559, 213328, 271949, 288102, 153957, 416497, 102762, 415333, 494913, 324607, 450256, 281244, 561322, 573548, 497724, 393136, 578541, 903465, 607967, 607743, 528196, 734770, 465473, 385102, 242850, 658462, 508304, 934249, 405502, 197842, 459726, 198340, 413890, 341456, 267969, 476694, 203382, 313159, 554467, 231083, 406128, 173528, 437815, 271724, 263950, 474579, 270069, 381123, 549631, 243248, 204556, 409904, 456080, 314572, 320956, 584945, 483546, 308803]
14924C08803J48153j52984J93998q6194J0943J54843B26236O87647L7177N0579
14914A001639J06132j2745J60354K24323j9064l60391P51800m60373j71602K79892
14904A499965k0293K47959L20619R0719m279o58594k23764q2995N8576k07441
14894A020472k78273j54827J8790j1635k83125L38651r0808j1720k59632K28203
14884E16096A57102K02749A48541K95373K15o6030k9566Q0242j59026K08028k14989
14873B62788J96783k127N45601P8504m80944L57318j04542p9187m6452k07816
14863E19926N64119p6410l96850J44655k9892C34323J50071L32792k97824l4265
14853D85097N9508q0490L89701k95563M44291m33553K57652k81409Q2233k34711
$$ y = [308803, 456956, 303972, 497970, 411776, 422719, 577562, 226236, 913883, 951060, 1001639, 1107771, 1095026, 1255380, 1479703, 1460639, 1100248, 1852048, 1391675, 1220073, 1499965, 1479672, 1727631, 2048250, 2138969, 2134690, 1476096, 1252332, 1169337, 1227913, 1020472, 742199, 587372, 606162, 594527, 311402, 650053, 559245, 547525, 287893, 516096, 157102, 359851, 148541, 443914, 444129, 378099, 348533, 428775, 269749, 477777, 262788, 459571, 457444, 1003045, 1081549, 600605, 957923, 853381, 774194, 727742, 519926, 1084045, 1007635, 610785, 755440, 725548, 334323, 484394, 817186, 519362, 485097, 544605, 464115, 853816, 558253, 1002544, 568991, 826643, 545234, 627467, 392756]
14843C92756j18676K36781J69639j84418k3166J64846j48071K8204G0130N67105
14833F37235k07270M49817k09655k62413N93647m13618M79449O2391k07963M1656
14823I63276O771J6223l63480K69703j91423C27011K26301M14281k04910l66519
14813C96164K69381j71943M8886j50643o5880K40621B35338K19353L77569j14367
14803G17893j37640K62794j50242j22705R6899j65971k6915M46313j04970C86590
14792I11565k70990J32435J85637m3653K52963K7609l72448Q4103B71859L92068
14782F63927k42532K45265r7877P651n7978J69557n2598l1734r6284J21046O629
14771F35072j86608K44951J12176J4986k50594j24680N86744l71761Q5843j78009
$$ y = [392756, 274080, 510861, 680500, 496082, 472916, 637762, 489691, 517895, 70130, 637235, 429965, 879782, 670127, 407714, 1001361, 587743, 1067192, 1129583, 921620, 963276, 970047, 986270, 622790, 892493, 701070, 327011, 553312, 967593, 762683, 396164, 665545, 493602, 542488, 391845, 325965, 566586, 235338, 454691, 832260, 717893, 580253, 843047, 692805, 570100, 666999, 501028, 474113, 920426, 815456, 386590, 911565, 640575, 773010, 958647, 914994, 1167957, 1195566, 823118, 907221, 271859, 663927, 421395, 666660, 568783, 576434, 518456, 688013, 635415, 603681, 507397, 628443, 635072, 448464, 693415, 805591, 820577, 569983, 445303, 1032047, 660286, 746129, 568120]
14761E68120J47454j06395Q5112N485K92901C57615K69873Q2746n1406r72j78688
14750D79168L16142k33999P7454B77515N27552l98582A43151M30255K31534j79685
14740F25255r1532K3379L09473j48421q7259p9284l0215j05845L12195q2988k60864
14729C83894K26580l6156K68094J66938l63711J58842l6753B95836N63163J64026
14719A023025j77998K25276J58297j38886k66824J83299K10017L40296K32440
14710A788942l19881k9665j90718k14108J92749j53844k4725l40769l1094K68079
14700I44966j86703K11076m0167j08058K10976k68302q2506M84339J4483j74047
14690A006057j53992K80121P6406M57977n6626O8107k69642k8792L50718n98487
$$ y = [568120, 715574, 609179, 694291, 699776, 992677, 357615, 627488, 710234, 658828, 657856, 479168, 795310, 561311, 638765, 277515, 805067, 406485, 143151, 573406, 804940, 625255, 533723, 557102, 866575, 718154, 630895, 551611, 521396, 415551, 727746, 644758, 383894, 610474, 574318, 842412, 1009350, 645639, 804481, 767728, 295836, 858999, 1023025, 845027, 1070303, 1228600, 1089714, 822890, 1006189, 1216206, 1556502, 1788942, 1469061, 1439396, 1248678, 1034570, 1227319, 1073475, 1048750, 707981, 676887, 944966, 758263, 969339, 929172, 821114, 1032090, 763788, 681282, 1165621, 1180104, 1006057, 852065, 1132186, 1208592, 1666569, 1609943, 1678050, 1408408, 1379616, 1730334, 1131847]
14680A131847j62623M13244l93907M3081j28848j33323J86018Q2620j38788j61237
14670G38084K54224p1178p8073J98862J09054K5782k85540J89892k1358j96759
14660H62990R3570p0496K25064q8423j03411o044j76496R6905o2885P3615r3840
14649G50549J39126J33377K03036j80790J88075j35613J58036n1936j54334k3315
14639A026211J99124N0429p7980J07089J24204q4529J0970m41224j13970K91270
14629A091594K60246J41385o3959k48528j14972L7060J60134j97943r3361K44593
14619A216249j09138L78320k75663L74742l03028M74116k36340l81585j3277l3162
14609A091234M44168l59803J3925j16814M61831k90745M82332k77621j41407j5334
$$ y = [1131847, 969224, 1382468, 988561, 1031642, 902794, 769471, 955489, 1038109, 899321, 738084, 992308, 921130, 843057, 1041919, 1150973, 1176755, 891215, 1081107, 1059749, 862990, 956560, 886064, 1111128, 1022705, 919294, 913250, 736754, 833659, 770774, 844389, 750549, 889675, 1023052, 1226088, 1045298, 1233373, 1097760, 1255796, 1203860, 1049526, 1026211, 1225335, 1275764, 1197784, 1304873, 1429077, 1344548, 1355518, 914294, 800324, 1091594, 1351840, 1493225, 1429266, 1180738, 1065766, 1102826, 1262960, 1065017, 971656, 1216249, 1107111, 1485431, 1209768, 1584510, 1281482, 1755598, 1519258, 1137673, 1124396, 1091234, 1535402, 1175599, 1189524, 1072710, 1534541, 1243796, 1726128, 1448507, 1307100, 1291766]
14599A291766J11126p4651K63866j23445m5441l756m11299N22798o8285J66806
14589A629485j53229r3512J71807l13K04363l28000J29332J25975M1864l99513
14579A328259L29751J06524r5328j26417J04766J93475M2771J17097j43575k21900
14569A635423J12241r3555K01758L7976J3796j13143K3639K32751O6500l88743
14559A728643M90287j87953J75478r561o6578j9654J59366l2189r8520K06311
14549B345630J01748R6902J33554k0155M19740l5617l00850M94388J38174O07149
14539C980663L06980O7582Q11130R91829J020003K758628L670425O904707J1437716
14530C1949663j377664j2293990p138206m158849j940402n30905n4500Q58646
$$ y = [1291766, 1402892, 1328241, 1592107, 1468662, 1423221, 1419465, 1008166, 1530964, 1462679, 1629485, 1476256, 1382744, 1554551, 1554238, 1758601, 1430601, 1559933, 1685908, 1727772, 1328259, 1658010, 1764534, 1669206, 1542789, 1647555, 1841030, 1883801, 2000898, 1857323, 1635423, 1747664, 1654109, 1855867, 1893843, 1907639, 1794496, 1818135, 2050886, 2117386, 1728643, 2218930, 2030977, 2206455, 2196894, 2130316, 2110662, 2270028, 2237839, 2139319, 2345630, 2447378, 2544280, 2677834, 2657679, 3077419, 3041802, 2740952, 3235340, 3373514, 3980663, 4287643, 4355225, 5166355, 6158184, 7178187, 9936815, 13607240, 20511947, 31949663, 30571999, 18278009, 11139803, 6980954, 5040552, 4509647, 4455147, 5313793]
14522E313793j288154o33483p16541m8657l9849k36908L38110m85438K32787n1076
14512B384584r9506j53515O4657Q5432K66530k01208k05398O20532k45075k22163
14502B294870N20103m9104l42310O2330L64276m14330K97818J54105p9737p6241
14492B731780K29087m1813k43148K23156J61916M9118m5337M6979K36020j15103
14482C232655k7954j3142j17117l1217N98977m20123P7353L2401N5290J0017J78293
14471C575433j53685L41015J31991k39224J56590P9429o5902r6078N2996j98804
14461C583761L36692o0986J4672L86151M2603j54563M28225k40980O9214L40656
14451D745445n27441M36242j3168K0311K00339k63095k37706M79875j99144R2795
$$ y = [5313793, 4025639, 3392156, 2675615, 2626958, 2587109, 2350201, 2688311, 2202873, 2435660, 2384584, 2285078, 2131563, 2196220, 2281652, 2548182, 2346974, 2141576, 2762108, 2517033, 2294870, 2814973, 2765869, 2423559, 2485889, 2850165, 2435835, 2733653, 2887758, 2808021, 2731780, 2960867, 2919054, 2675906, 2899062, 3060978, 3110096, 3064759, 3111738, 3347758, 3232655, 3204701, 3191559, 3074442, 3043225, 3642202, 3222079, 3299432, 3331833, 3387123, 3397140, 3575433, 3421748, 3762763, 3894754, 3655530, 3812120, 3891549, 3825647, 3729569, 3782565, 3583761, 3920453, 3859467, 3874139, 4260290, 4302893, 4148330, 4576555, 4335575, 4404789, 4745445, 4218004, 4654246, 4641078, 4661389, 4861728, 4598633, 4360927, 4840802, 4641658, 4734453]
14441D734453N7943L16007J9555k03146K08164n8210J31553p9260N03429j30408
14431E500080J39957O1093j8288J46296q358J91249L92953m41696M6927P2020
14421F082233K29017L21328Q3108r8078O769L75909p8513J42724J67951r2403
14411G140045L21965j47219K81342K05654J85242J89949o9835M06808j01039L02592
14401H715504P3667P4001K891N5459J29674j60310L39855K12255J00174K46622
14391I789792j66210N84401R6205K14924l73788O77314l4670K16952K52179j93883
14381A1063216K25026L52308j5578J28928M4200O34356j47556L68021L00710K23015
14371A3176646J06451O56587n267M04557m0351N72104M33541q4459L99653K56425
$$ y = [4734453, 4792396, 5108403, 5127958, 4924812, 5132976, 5074766, 5206319, 5127059, 5630488, 5500080, 5640037, 5701130, 5682842, 5829138, 5820780, 6012029, 6404982, 5963286, 6010213, 6082233, 6311250, 6632578, 6715686, 6617608, 6624377, 7000286, 6921773, 7064497, 7232448, 7140045, 7462010, 7314791, 7596133, 7801787, 7987029, 8176978, 8107143, 8513951, 8412912, 8715504, 8789171, 8863172, 8866063, 8921522, 9051196, 8890886, 9230741, 9442996, 9543170, 9789792, 9623582, 10207983, 10304188, 10519112, 10145324, 10822638, 10787968, 11004920, 11257099, 11063216, 11288242, 11640550, 11624972, 11753900, 11798100, 12432456, 12284900, 12652921, 12953631, 13176646, 13283097, 13939684, 13934417, 14338974, 14298623, 14870727, 15304268, 15219809, 15619462, 15875887]
14361A5875887N77584J13633r2336M99721N67173J39166K04432P15373P9145P90738
14351A9470516R0332R91093M08577j44111O36335M86630O64653j81419R58030
14342B3380636K29496O05161N87807N79514N93182O63696N04863J281008M56660
14333B8882023O53560P65262O12105J144826O21786O28868R69660J309048Q65584
14324C6452722R99790J011936J165575Q52428J320853J586651J112826J583311
14316D6086092J168124J745728J723160J350166J895822J902016J929467K220656
14308F0021231K154740K229734J849925K849944K510040K966874K542044L137361
14300H0261893K918959L327168L699826L621536L676460M547590M300372N037420
$$ y = [15875887, 16453471, 16567104, 16474768, 16974489, 17541662, 17680828, 17885260, 18600633, 18679778, 19470516, 19560848, 20551941, 20960518, 20816407, 21452742, 21939372, 22604025, 22422606, 23380636, 23610132, 24215293, 24803100, 25382614, 25975796, 26639492, 27144355, 28425363, 28882023, 29535583, 30300845, 30912950, 32057776, 32679562, 33308430, 34278090, 35587138, 36452722, 37452512, 38464448, 39630023, 40482451, 41803304, 43389955, 44502781, 46086092, 47254216, 48999944, 50723104, 52073270, 53969092, 55871108, 57800575, 60021231, 62175971, 64405705, 66255630, 69105574, 71615614, 74582488, 77124532, 80261893, 83180852, 86508020, 90207846, 93829382, 97505842, 102053432, 106353804, 111391224]
14292A11391224M930610N416267N512168O553664O230870O751883P040927P662682
14284A61490295P824769Q782657Q930167R246377J0521684J0422894J1343683
14277B28562526J2134734J2356746J3313368J3733001J3948312J4353569J4445871
14270C22848127J4545404J4655044J4222414J4352494J3431205J1986631J1016029
14263D17057348J0467323R095906Q317269Q110623O079070L084826N98473L40471
14255D63151309N47002m937694p946980o540547q480760j1597815j2729956j2332789
14247C99131770j3108891j3317347j3623602j4639553j3328647j4318930j4759872
14240C02034928j3480121j3142064j2545454j2000334j1377000j1778345j0526373
$$ y = [111391224, 116321834, 121738101, 127250269, 133803933, 140034803, 146786686, 153827613, 161490295, 169315064, 178097721, 187027888, 196274265, 206795949, 217218843, 228562526, 240697260, 253054006, 266367374, 280100375, 294048687, 308402256, 322848127, 337393531, 352048575, 366270989, 380623483, 394054688, 406041319, 417057348, 427524671, 436620577, 444937846, 453048469, 459127539, 462212365, 462810838, 463151309, 463698311, 458760617, 450813637, 444273090, 435792330, 424194515, 411464559, 399131770, 386022879, 372705532, 359081930, 344442377, 331113730, 316794800, 302034928, 288554807, 275412743, 262867289, 250866955, 239489955, 227711610, 217185237]
14233B17185237j0106568j1007776j0031928r527903q633997q171162p942182
14226A51763721p263918p003687o387282n606273n770656n151413n053496m939291
14218A04587705m622755l794057l663367l538781l589215l633631l280429k926805
14210G5538665k505934k669670k450594k631899k276672j858659k204412j688824
14202E7252001k133835j587076j879473r91240j629919j629360j747684j079569
14194D4573845j453464j017311o73263j345330j269181j269199r68416r45201
14186C5632480m72452q58531j212362j045702p84518n31593q97808m47643j044736
14177B8337135p50775m80265r59421n37205o69628m04838o07371l97708p30560
$$ y = [217185237, 207078669, 196070893, 186038965, 176511062, 167877065, 159705903, 151763721, 144499803, 137496116, 131108834, 125502561, 119731905, 114580492, 109526996, 104587705, 99964950, 96170893, 92507526, 88968745, 85379530, 81745899, 78465470, 75538665, 73032731, 70363061, 67912467, 65280568, 63003896, 61145237, 58940825, 57252001, 55118166, 53531090, 51651617, 50660377, 49030458, 47401098, 45653414, 44573845, 43120381, 42103070, 41429807, 40084477, 38815296, 37546097, 36577681, 35632480, 35160028, 34301497, 33089135, 32043433, 31258915, 30727322, 29829514, 29381871, 28337135, 27586360, 27106095, 26146674, 25609469, 24939841, 24535003, 23927632, 23529924, 22799364]
14168B2799364o97173p3715p10910l83879m73685k95666n40704m35483j84260
14159A9003889n31233m86013k24587p4437o66390j26247l20292j17374m89923
14150A5967393o47082j08372m5237o59704J19016k48643l74915r3646m05792k92762
14140A3210256j25315l02280l23097J07048k47591j05371n49720k28615j20517
14131A1314798k5484n6883O577l19371k80184L2468l17195j06600j79039k42652
14121I826435K7176j33850k62149k10187J65170n13507J45849m12074p4579O1732
14111H620016k01494J86427o57372J17939L35755l43083l67015R9210k19214l33600
14101G237569J92393m08110O7537j28706O3593r4922K80664n22833Q4906k50532
$$ y = [22799364, 22102191, 22028476, 21317566, 20933687, 20460002, 20164336, 19623632, 19188149, 19003889, 18472656, 17986643, 17762056, 17687619, 17021229, 16894982, 16574690, 16457316, 15967393, 15320311, 15211939, 15166702, 14506998, 14626014, 14377371, 14002456, 13908810, 13503018, 13210256, 13084941, 12782661, 12459564, 12566612, 12319021, 12213650, 11663930, 11435315, 11314798, 11289314, 11232431, 11239008, 10919637, 10639453, 10671921, 10354726, 10248126, 10069087, 9826435, 9853611, 9719761, 9457612, 9247425, 9412595, 8899088, 9044937, 8632863, 8558284, 8620016, 8418522, 8604949, 7947577, 8065516, 8401271, 8058188, 7691173, 7790383, 7571169, 7237569, 7429962, 7021852, 7089389, 6960683, 7024276, 6929354, 7210018, 6687185, 6772091, 6521559]
14091F521559n2591m7188j7493j76246q2789K47255l30175k74497j680J46904
14081E933059o6677J58119r3116n8061k83194l8435m58837K55874R3144n2662
14071E389214o32838N4733R8052m4882K49085l01024j63780k52509J24095L66064
14061D886210j14326n46145K54846n1958M2277L8060k07029N6065m9203n6233
14051D252564J52696l01033Q6651K59948k62218O2702p3998K43331O5407m69680
14041D016370Q6291K7493j30602k77505J85585k87442O373j88244k38429M49984
14031C649874j36454j04307k91359J52496k13089L23741K86736n17083k7763K60927
14021C383719o4266m35125J38740J88402m25221J47247j3248P0392J82774n1316
$$ y = [6521559, 6468968, 6421780, 6404287, 6228041, 6145252, 6392507, 6062332, 5787835, 5786155, 5933059, 5866382, 6024501, 5931385, 5873324, 5590130, 5551695, 5092858, 5348732, 5441876, 5389214, 4756376, 4811109, 4909161, 4864279, 5113364, 4812340, 4648560, 4396051, 4520146, 4886210, 4771884, 4225739, 4480585, 4428627, 4470904, 4508964, 4301935, 4358000, 4308797, 4252564, 4405260, 4104227, 4190878, 4450826, 4188608, 4251310, 4177312, 4420643, 4486050, 4016370, 4102661, 4130154, 3999552, 3722047, 3907632, 3620190, 3626563, 3438319, 3199890, 3649874, 3513420, 3409113, 3117754, 3270250, 3057161, 3380902, 3667638, 3150555, 3122792, 3383719, 3319453, 2884328, 3023068, 3211470, 2786249, 2933496, 2920248, 2990640, 3173414, 3122098]
14011C122098j16061J5681j31690p1906N3369l62125N4647L17298j46296n4146
14001B680869j43667K28234l97327K26998m2594j47890L82333l33519p0006J5658
13991B399089K7365m3857j29518k431Q500K86606m10145J11785J2198O06504m16639
13980B449457J72087M41308j92901M55130K44933P86693J637863L044551O238946
13971A5278067J0692595P347531j1182322p510904m529624k526047j470754j083169
13963E015373m69376l79192o04855k67867l0300r3786j64293j8225m29606J07996
13953B665869j22379j87595L01353j76919l90351N16476m58907J64678k30275
13944B081950K33589j37981n8713J22822l65694l3872Q1913N0727l6899J88934
$$ y = [3122098, 3006037, 3021718, 2890028, 2818122, 2871491, 2509366, 2564013, 2881311, 2735015, 2680869, 2537202, 2765436, 2368109, 2595107, 2552513, 2404623, 2786956, 2453437, 2383431, 2399089, 2426454, 2382597, 2253079, 2250648, 2259148, 2545754, 2135609, 2247394, 2259592, 2866096, 2449457, 2621544, 3062852, 2869951, 3325081, 3570014, 4356707, 5994570, 9039121, 15278067, 25970662, 33318193, 22135871, 14624967, 10095343, 7569296, 6098542, 5015373, 4545997, 4166805, 3561950, 3294083, 3263783, 3169997, 3005704, 2987479, 2557873, 2665869, 2543490, 2355895, 2657248, 2480329, 2089978, 2606454, 2147547, 2312225, 2081950, 2315539, 2177558, 2118845, 2241667, 1875973, 1842101, 1924014, 1974741, 1937842, 2126776]
13934B126776P5336k41650k56315O2669J42016L19820n37651K39054Q2733o37553
13924A375235K93351P5755K32672l76689n8629j75433J90247K48376j87609J61031
13914A778307K43982k53134k63799K12231O6037n34657K26693k9180L29842k88169
13904A488153J79118p4625q8929K38144m16341K23463O33J11229j58728j75409
13894A326708J37404j6322O9855M0792N2369K1551k45827J4593J55163j30406
13884A425880l4163m9993m1994J81566j85220J84927k36030J26056k93817K62114
13874A339326J07207l06936K20540m63041K72837L20340l74332l2259o9266o5
13864A014351K2989J05057J20832o7206k6319j9192R5393k3882j86015P9281j76376
$$ y = [2126776, 2202112, 1960462, 1704147, 1766816, 1908832, 2228652, 1691001, 1930055, 2012788, 1375235, 1668586, 1744341, 1977013, 1600324, 1541695, 1366262, 1556509, 1804885, 1617276, 1778307, 2022289, 1769155, 1505356, 1717587, 1783624, 1248967, 1475660, 1446480, 1776322, 1488153, 1667271, 1592646, 1503717, 1741861, 1325520, 1548983, 1549616, 1660845, 1502117, 1326708, 1464112, 1447790, 1517645, 1558437, 1610806, 1632357, 1386530, 1401123, 1556286, 1425880, 1391717, 1341724, 1299730, 1481296, 1296076, 1481003, 1244973, 1371029, 1077212, 1339326, 1446533, 1139597, 1360137, 897096, 1169933, 1490273, 1115941, 1083682, 1014416, 1014351, 1037340, 1142397, 1263229, 1196023, 1169704, 1150512, 1245905, 1222023, 1036008, 1115289, 938913]
13853I38913N14602j24111j50179L76655F39168L26169p3128M42276q0927l31153
13843I22405K48305j35130J27340k2343n0814J3212k40489K95478N2378j47846
13833A062496o0337L6665q3487p15l0520k38571M06375k60725J98231k29899L47910
13822A147423K2892L2125O0834o28589N51316k7552j78537j30911j84907P73700
13812A437794m14685q8658J27053k90494J81327K6277j22508j83139J06074J82188
13802I61229K73838j80320m86479J80904j89201k4900J34007K97817j81168J18561
13792I04288j58802L9348K49423j95033K31192k47965j89025J02189M58357l73204
13782H20768l4062j10695j08471L4836J96587K9558m9855M6606M8011M0077Q852
$$ y = [938913, 1453515, 1329404, 1179225, 1555880, 639168, 965337, 892209, 1334485, 1253558, 922405, 1170710, 1035580, 1162920, 1140577, 1089763, 1102975, 862486, 1157964, 1210342, 1062496, 1002159, 1038824, 955337, 954622, 924102, 685531, 1091906, 831181, 1029412, 799513, 1147423, 1170315, 1202440, 1263274, 634685, 1186001, 1158449, 979912, 849001, 664094, 1437794, 1023109, 934451, 1061504, 771010, 952337, 978614, 856106, 672967, 779041, 961229, 1235067, 1054747, 568268, 749172, 559971, 535071, 669078, 966895, 785727, 904288, 745486, 784834, 1034257, 839224, 1070416, 822451, 633426, 735615, 1193972, 820768, 786706, 676011, 567540, 602376, 798963, 828521, 778666, 825272, 873283, 913360, 922212]
13771I22212l00215P0991M1650j52297j33435M08415k57649J23516j20690J74309
13761G76807P9309J0462k37809j39981J99748M105J86713k7974r7522Q5010k35954
13750F02914L64410m01769Q1537R7519j19990r5577L01023j78938l4437K93466
13740I10158k27401J47141m9761j21142P6477J81527C98311L81694l16351j07342
13730C56312K30045j85465J94415J08623k45032L80099j44050R5019J16748k45927
13720F60787k60049J48156n0800J76497l9454l9043j56295K80878C42394M4028
13710C86422L36428J23739j25681j14027k85614J46711Q505K43295k68151K20369
13700F71996M8695k27769j8041Q042M3782Q2416k06194M0163j8952K69777j00089
$$ y = [922212, 621997, 692988, 734638, 582341, 448906, 857321, 599672, 723188, 602498, 776807, 856116, 866578, 628769, 488788, 688536, 692641, 879354, 851380, 753858, 838868, 602914, 967324, 565555, 647092, 744611, 624621, 529044, 830067, 651129, 616692, 910158, 682757, 829898, 780137, 658995, 735472, 916999, 398311, 780005, 463654, 356312, 586357, 400892, 595307, 703930, 458898, 838997, 694947, 789966, 906714, 660787, 400738, 548894, 498094, 674591, 635137, 596094, 439799, 720677, 342394, 386422, 722850, 846589, 720908, 606881, 321267, 467978, 476483, 719778, 451627, 671996, 720691, 492922, 474881, 482923, 526705, 609121, 402927, 443090, 424138, 693915, 593826]
13689E93826j51807k5584K14202l9626k57756R5832L46990A47874P67977k00760
13679G15091k43676e1356F35642k06011J24813Q4730B93260Q5664K11482N9925
13669F50331k18302K8457O1443r6708L00778j46000B69780K01607j88183N48748
13659H31952k16557B43606K73906K19967k24515j38941Q5169l355O9799n5426
13649D70210o4123q6757K08051K79065B56864L64025A64710M14598k53884K3431
13639C48855A6907P10955j68812B75742j1818A00401L43305M4533Q6579k22494
13629C52324J13551B30206G6977L18275j76541L04109j94968J97724K04337B37861
13618D38305B02736J90761A8686J57507K90648K41454A12082L69610A99574K85193
$$ y = [593826, 442019, 416435, 630637, 591011, 333255, 429087, 776077, 147874, 915851, 715091, 471415, -51356, 635642, 429631, 554444, 639174, 293260, 378924, 590406, 650331, 432029, 460486, 521929, 425221, 725999, 579999, 269780, 471387, 283204, 831952, 615395, 243606, 517512, 737479, 512964, 374023, 459192, 455837, 525636, 470210, 406087, 319330, 527381, 806446, 256864, 620889, 164710, 579308, 325424, 348855, 16907, 727862, 559050, 275742, 263924, 100401, 443706, 488239, 574818, 352324, 465875, 230206, 76977, 395252, 218711, 522820, 327852, 525576, 729913, 237861, 438305, 202736, 393497, 18686, 176193, 466841, 708295, 112082, 481692, 199574, 484767]
13608D84767G4725L25317R0379l2321p9252J47061j66742A6480M18291L44772
13598G79543l36896Q0657J49543C24235K06637j96342j45201M724J17748J9180
13588C30981l0160k1895A00517L29363p6704J378K67883B24948K32621K09202
13578F66771j1165B58264N9661Q574l3321J42287j20166n5265L38607j2633A93727
13566D00941K59408j42143k57774Q3167P5378Q37j55362q0778H8219L94537p2109
13555D10647k8297J39831j90956K04377j61722a641E442K44597J12867q6559L0227
13544C06574J77872j27852L14972I0406N07931B46008R0049A26352k3360L27897
13534D30889A83405l0463K29968k7125r7354J8133r3602M25531j44229A14228
$$ y = [484767, 74725, 400042, 490421, 458100, 378848, 525909, 359167, 16480, 434771, 779543, 442647, 523304, 672847, 324235, 530872, 334530, 189329, 194053, 311801, 330981, 300821, 278926, 100517, 429880, 353176, 354554, 622437, 224948, 457569, 666771, 655606, 258264, 317925, 326499, 293178, 435465, 315299, 260034, 598641, 586008, 193727, 400941, 660349, 518206, 260432, 343599, 418977, 419814, 264452, 183674, 88219, 482756, 410647, 382350, 522181, 331225, 535602, 373880, -1641, 5442, 250039, 362906, 276347, 306574, 484446, 356594, 671566, 90406, 598337, 246008, 336057, 126352, 102992, 430889, 183405, 152942, 382910, 355785, 258431, 276564, 182962, 608493, 464264, 114228]
13523A46541J63969N5448J03670A46583J81832k319A19538L62700j62443L53750
13513F73545B88749A05358m6377K83956R062l5473p7373j08138K21098J40920
13503D93033d6909E76103j94027H0699J97454l1930q0963K7063p4684A9529J16874
13492A36403j5876a07003H6583L30010j34922g6513D59845j52487J4416M2161
13482C63935j10372A08619h5478E53622j30584j08456m3906n2689r709P5818J51741
13471D35837j93433J01687A42763K01813j2764n202A06119J00247n2893M5976
13461A99449Q542k0507K99110k03258j01072J29682H1001J19916J98949H3770
13450D74451J08019B41284P2825j13610B1260K97009j40252a22927E96704B83660
$$ y = [146541, 310510, 365958, 469628, 146583, 328415, 326096, 119538, 482238, 319795, 673545, 288749, 105358, 58981, 342937, 351999, 316526, 239153, 131015, 352113, 493033, -46909, 576103, 382076, 80699, 278153, 246223, 165260, 192323, 117639, 19529, 136403, 120527, -107003, 86583, 416593, 281671, -76513, 459845, 307358, 321774, 363935, 253563, 108619, -85478, 553622, 423038, 314582, 270676, 217987, 208278, 284096, 435837, 242404, 344091, 142763, 344576, 331812, 326610, 106119, 206366, 153473, 199449, 207991, 187484, 486594, 283336, 182264, 311946, 81001, 200917, 399866, 83770, 474451, 582470, 241284, 314109, 200499, 21260, 318269, 178017, -122927, 596704, 283660]
13439B48797A03588k9568K43643L981A7822K18486C1657R2454J18762R2638C002
13427E03836j61006a866B67441K6421J33768A69021o3792N2934a11554E10604
13416C29723a26890A08127k6582K41903O5139J9140A77034f3095C38640n322A39915
13404f3366E6079J83009N2067G9097J09014J82874R4209j60600J31086j08893
13394C26787I8158K64822H3470J49333B3275K84081o494A4923m019O9296K3894
13383A04094J36756l8015q5831B1039O539K78815l0411G1369J6639N33879A97659
13371B14312q3797J95523A8264M83728k32051J95011A74428J22608A39717O5436
13361B05153l0101K84983B29780a51936C19148F5817J69179A0629J06894O8676
$$ y = [248797, 103588, 74020, 317663, 321644, 17822, 236308, 31657, 124111, 242873, 335511, 3002, 503836, 342830, -1866, 267441, 293862, 427630, 169021, 105229, 158163, -111554, 510604, 329723, -126890, 108127, 81545, 323448, 388587, 407727, 177034, -63095, 338640, 333318, 139915, -63366, 56079, 239088, 291155, 79097, 188111, 370985, 465194, 304594, 435680, 326787, 98158, 362980, 83470, 232803, 23275, 307356, 300862, 14923, 10904, 80200, 104094, 240850, 202835, 117004, 21039, 27578, 306393, 275982, 71369, 88008, 621887, 197659, 214312, 130515, 326038, 18264, 501992, 269941, 464952, 174428, 297036, 139717, 205153, 175052, 460035, 229780, -151936, 319148, 65817, 234996, 10629, 117523, 186199]
13351A86199C9578Q0344K97035A14526L55920b05876D02086m8909A25152R3494
13341B18646G3375a3231A50364K43441m7460G5149J87859k2007j5112H8123P8836
13330A66959E1866O934O8645F3094J66260P3039Q2626G9063K4793J23302q3295
13319A43863J86223A06353J85649i6405D57150A61794J2133B1717J6478J50489
13309A88684L15884j81181o0606J1215A13822k9929J59068L3046L19662h5473
13298d3261l2976B71115O9725A66262C8179K71713E2581J7935b7082B65527F9318
13286C60031j08632a3641G9799L7983f9736F36579B99771p390p9755I9198a90057
13274A33676B2147J22455M70678b27971A04122f3690C11818H616J40188a76384
$$ y = [186199, 39578, 119922, 416957, 114526, 470446, -205876, 402086, 353177, 125152, 218646, 73375, -13231, 150364, 393805, 346345, 75149, 263008, 241001, 225889, 88123, 166959, 51866, 58800, 127445, 63094, 229354, 302393, 385019, 79063, 103856, 227158, 143863, 330086, 106353, 292002, -96405, 457150, 161794, 173927, 21717, 38195, 188684, 504568, 323387, 262781, 273996, 113822, 83893, 242961, 276007, 595669, -85473, -43261, -76237, 271115, 340840, 166262, 38179, 309892, 52581, 70516, -27082, 265527, 69318, 360031, 251399, -13641, 79799, 117782, -69736, 636579, 299771, 292381, 212626, 99198, -190057, 133676, 22147, 144602, 615280, -227971, 104122, -63690, 311818, 8616, 148804, -176384]
13263C99848B973K34186E2330b58833I4769k6972d8474B23945f2371A62177B2448
13251C29306B5723g2704B6357J38463i2985B56493b1900A66397J28051j24046
13241A70402n7206J77392H786a28528A8921a30996O4349b1378r7242C9511R1738
13230A31249J46702n1713f6220F555J07135J17414A08212j8833k9566j4723L39330
13219C84420D4569J5589k8189H383c0724F797J9242j0428J39411J27980c29353
13207D62374D0919A2280K61105D5074L82379H9433J14094D5250J47075a79070
13196G9074A5685K09212a69247m2227O6322A44202J64721A12836a76032C34255
13185g6214A03558b29275j15084J27696A79465K5082G2247J350B9133J83346M5364
$$ y = [399848, 2973, 237159, 52330, -258833, 94769, 67797, -48474, 223945, -62371, 162177, 22448, 329306, 25723, -72704, 26357, 164820, -92985, 256493, -21900, 166397, 294448, 170402, 113196, 290588, 8786, -128528, 18921, -130996, -66647, -21378, -118620, 39511, 131249, 277951, 226238, -66220, 6555, 113690, 231104, 108212, 89379, 59813, 45090, 384420, 44569, 60158, 31969, 8383, -30724, 6797, 26039, 15611, 155022, 283002, -329353, 462374, 40919, 12280, 273385, 45074, 427453, 89433, 203527, 45250, 192325, -179070, 79074, 15685, 224897, -169247, -211474, -145152, 144202, 308923, 112836, -176032, 334255, -76214, 103558, -229275, -344359, -216663, 179465, 204547, 72247, 73597, 29133, 212479, 257843]
13174B57843Q468H2688a87458A9266K03271Q3279c8487R291C5479J54800E8657
13162a51686F0557a06577H8532J31988h7851I3980h6956r3416m3659M7603A75695
13150a60119E2394K06408G2889d5375K1671B12081h7550j16115B25447E7230L86543
13139D43773j90012a90333g3925A131a39729A96097n759k4125o2864J3793K38254
13128C55396D2837a58212B37614m1226B0368a30604F8458L7552e312k89489J08552
13117a86249C7668I959M3227J12005R8739r4280m7587K64384j32594a10215A60886
13105a50324f4897A29423b71032B58127o8634R7884A29655J816K08575k9387b62241
13093A84199e4282A4499Q6626e6460o1029e3077C93583j48382P494J79416H2338
$$ y = [257843, 266311, 82688, -187458, 19266, 222537, 305816, -38487, -29196, 35479, 190279, 58657, -151686, 60557, -106577, 88532, 220520, -87851, 93980, -86956, -180372, -224031, -176428, 175695, -160119, 52394, 258802, 72889, -45375, -23704, 212081, -87550, -203665, 225447, 57230, 443773, 253761, -190333, -73925, 1131, -139729, 196097, 190338, 166213, 103349, 117142, 355396, 42837, -158212, 237614, 196388, 20368, -130604, 68458, 106010, -5312, -294801, -186249, 37668, 9959, 53186, 165191, 263930, 169650, 122063, 386447, 253853, -110215, 160886, -150324, -64897, 129423, -271032, 258127, 189493, 287377, 129655, 131471, 340046, 310659, -262241, 184199, -54282, 14499, 101125, -56460, -117489, -53077, 393583, 245201, 252695, 432111, 82338]
13081B50732j8825H7947d829j90320D36309i786F1646J1024k7260A3863P539L95312
13069D16714g1909A7644R3097K6496J5120a07924L8685C0398P6262a90355G8122
13057a73018H9523O4649e1163A79985j6664o8826J22218p300b8250m2669E3670
13045a57777B31476e698D7896g1102B07415L9184m2085r5892K20786n3963e9877
13033a76323j46001B8913b31215E5391Q3215g8669A31835i1014c3121P854C7072
13021b63483a4528B36454Q5400a12855B35712G3299h511j72063A19666e4302A18182
13009F6955a1652B12596a130B9517Q7478l472M831n3031B0478K48250i5574o6654
12997a62228I1926K335J10885M630a04383B59442B3092J51401j3293e7997A25465
$$ y = [250732, 231907, 87947, -4829, -195149, 436309, -9786, 61646, 72670, 45410, 13863, 21402, 416714, -71909, 17644, 110741, 137237, 152357, -107924, -69239, 30398, 106660, -190355, 78122, -173018, 89523, 154172, -51163, 179985, 163321, 94495, 216713, 209413, -28250, -70919, 53670, -157777, 231476, -5698, 47896, -71102, 207415, 246599, 204514, 108622, 329408, 275445, -59877, -176323, -322324, 28913, -231215, 55391, 138606, -78669, 131835, -91014, -33121, -25267, 37072, -263483, -14528, 236454, 321854, -112855, 235712, 73299, -8511, -180574, 119666, -54302, 118182, 66955, -11652, 212596, -1130, 29517, 116995, 113523, 118354, 65323, 20478, 268728, -95574, -162228, 91926, 94261, 205146, 209776, -104383, 259442, 23092, 174493, 161200, -57997, 125465]
12985A97458J77015j69676b8878H3148a43891C26075A24285a25055A14886a4862
12974D9040a60125B80828a56451I2437b96671e2863D0993P7696j9912a13539H5015
12962f5109B46274r3292A5748J69386M0120a00450A8913J89712a92921L4050E0332
12950f1772l8969j7688N0873k1885E3396R1562o9489j7086K32958A23143a3892
12938a71190k40348d6454o1597A04756a10695N1955A29211e7273k86111I8108
12927D8975b27281A27322m4697N4618k3509J7668a12127A31096b09083F3378J62114
12916B25492q8078b21F8306a05553I6622G199J46391J28548a72454n2479B77215
12904i81j68331A2906i0587a058B10430E3001K85161A4902K82670N3926j50084
$$ y = [197458, 374473, 204797, -28878, 83148, -143891, 326075, 124285, -125055, 114886, -14862, 49040, -160125, 280828, -156451, 92437, -296671, -52863, 40993, 118689, 98777, -113539, 85015, -65109, 246274, 152982, 15748, 185134, 225254, -100450, 18913, 208625, -192921, -158871, 50332, -61772, -100741, -118429, -67556, -89441, 53396, 144958, 75469, 58383, 291341, 123143, -13892, -171190, -411538, -46454, -108051, 104756, -110695, -58740, 129211, -57273, -343384, 98108, 48975, -227281, 127322, 82625, 137243, 113734, 131402, -112127, 131096, -209083, 63378, 225492, 137414, -221, 68306, -105553, 96622, 7199, 153590, 282138, -172454, -224933, 277215, -981, -169312, 12906, -90587, -1058, 210430, 53001, 338162, 14902, 297572, 351498, 201414]
12893B01414d3855A85071a92556B1173R5335K33026c19337a03098K802A16944
12882E1325L2828P9465b6133j62823C46076i512k03762h1199N703j55476g8470
12870a23544b0629m762j17123p5665j13093A82698a67608M3555B17845b24948
12859a34443O0604B3616b5445A68279b64235a4351a167A97147H1096b90543C17147
12847d8809I0623c0814E3614a27113J9888p2194C10354a21000A63376b38422C5890
12835a65679E1412J06987d8844l14382B81780Q6455A1205R5803d2266D7476h6160
12823a03236I6149I310c41498a3988q634j55666A38433b61848b6393j54835C1605
12811b11134A84012L7602n2883i0166H6988b26606g4278j3017A53381b47099R3880
$$ y = [201414, -43855, 185071, -192556, 21173, 116508, 349534, -319337, -103098, -100296, 116944, 51325, 84153, 163618, -26133, -188956, 346076, -9512, -213274, -81199, -75496, -230972, -78470, -123544, -20629, -25391, -142514, -218179, -331272, 182698, -167608, -124053, 217845, -224948, -134443, -73839, 23616, -25445, 168279, -264235, -14351, -1167, 197147, 81096, -290543, 317147, -48809, 90623, -30814, 53614, -127113, -107225, -179419, 310354, -121000, 163376, -238422, 35890, -165679, 51412, 158399, -48844, -363226, 281780, 368235, 11205, 107008, -42266, 47476, -86160, -103236, 96149, 9310, -341498, -13988, -22622, -178288, 138433, -261848, -26393, -181228, 31605, -211134, 184012, 221614, 168731, -90166, 86988, -226606, -74278, -87295, 153381, -247099, -153219]
12800a53219B02269E2343K651d84846a99630A45033d7717j6008A92755G7496K50804
12789C28300b5956j06516k6311P7031C96246F8027a13758j42454q4296C0007Q4491
12778A14498K3337N4990a86920A4743O3829J13918M208Q0009j12667K3123n3087
12767A34076D973b9573k26916B37967d6129A00814J26290m1801D7146R4275b8238
12755c02745b4235e512B12280K829a76056c7932C1579a11018d3354j86713M2383
12744a87684A30620k7478C9146i8227B86345d2542I947M963c0536A67347e02352
12732B20496A7769i4420o7058c0418B1492b35781j0048B8669N49b063A70323j8668
12720A51655Q2166E6837K64863G045L20411g8306j17103B43968n5482d6962C6874
$$ y = [-153219, 202269, 52343, 54994, -484846, -199630, 145033, -47717, -63725, 192755, 77496, 328300, -25956, -132472, -158783, -81752, 396246, 68027, -113758, -256212, -340508, 30007, 114498, 137835, 192825, -186920, 14743, 78572, 192490, 196698, 276707, 164040, 187163, 134076, 4973, -29573, -256489, 237967, -46129, 100814, 227104, 185303, 47146, 141421, -28238, -302745, -24235, -5512, 212280, 215109, -176056, -37932, 31579, -111018, -43354, -230067, -187684, 130620, 103142, 39146, -98227, 286345, -42542, 9947, 14910, -30536, 167347, -502352, 220496, 17769, -94420, -161478, -30418, 21492, -235781, -245829, 28669, 29218, -2063, 170323, 151655, 233821, 56837, 321700, 7045, 327456, -78306, -195409, 243968, 188486, -46962, 36874]
12708a34778C52848a69546h0666A94267a41320B2688a42602m2375A27599a00020
12697C34672a46957r7133C97561J233j08750c9634g209A99935a30023E04971D4632
12685I4171J8856g0501B3920d9841B56473b22433j1243D79250f5781r3213I2591
12673A24471c3329e849D04670A50865H384R4677h8057l1674B04616k404B8510
12661f8585l2978B65282d5847C49453e8782E05863b41983H6926i4994K4562E3710
12649A31817N3399F1226J25251p4322f8210p6737A99878i4375j10018G9429r452
12638F9977k4095h3436A06521B4411a64234C5214B15N8945a96339d6682j5431
12627f2113C51919A19071o911m3803J51318j02321L6923d616E5764K2007a3667
$$ y = [-134778, 352848, -169546, -80666, 194267, -141320, 22688, -142602, -184977, 127599, -100020, 334672, -146957, -244090, 397561, 398794, 290044, -39634, -7209, 199935, -130023, 504971, 44632, 94171, 113027, -70501, 23920, -49841, 256473, -222433, -233676, 479250, -65781, -158994, 92591, 124471, -33329, -5849, 404670, 150865, 8384, 103061, -88057, -119731, 204616, 202212, 28510, -68585, -101563, 265282, -45847, 349453, -58782, 505863, -241983, 86926, -94994, -70432, 53710, 131817, 185216, 61226, 186477, 112155, -68210, -144947, 199878, -94375, -204393, 79429, 69977, 45882, -83436, 106521, 24411, -164234, 35214, 215, 59160, -196339, -46682, -62113, 351919, 119071, 112160, 68357, 219675, 117354, 154277, -4616, 55764, 77771, -13667]
12615B57875a704J78o5061B24218c9552B15579h0565c5506g55B25719P745e8971
12602h8192E10328A08133E3119R3451c34708a12939A7445a01485b8615E3909R6603
12591A50512e6303E6062b01879B4246J52266Q98M2502K07169a32959B9982J49417
12580A79399J1387P673O1674F4529e3871A4964c0503n0992F4264h051l03490a23406
12567A04651i1259L5612E6200b04179d7988A02801a23960M8504F8601J41408m8930
12556A61079E0671A0269b2647k07663b8113G2074j6291E948N8845d5298B07050
12544a25957j01113d8311C7385F585K15604K42686d50903a11239k1113b0390A61692
12532b3724o1942D3705b42362a854I7050a06344E46a36245C55408a47065j07320
$$ y = [257875, -1704, -1526, -66587, 224218, -39552, 215579, -80565, -35506, -755, 225719, 233464, -58971, -88192, 510328, 108133, 53119, 146570, -334708, -112939, 17445, -101485, -28615, 53909, 150512, -56303, 56062, -201879, 24246, 176512, 177410, 219912, 427081, -132959, 29982, 179399, 190786, 198459, 260133, 64529, -53871, 14964, -30503, -81495, 64264, -8051, -311541, -123406, 104651, -91259, -55647, 56200, -204179, -47988, 102801, -123960, -75456, 68601, 210009, 161079, 50671, 10269, -22647, -230310, -28113, 72074, 55783, 5948, 64793, -45298, 207050, -125957, -227070, -48311, 37385, 6585, 222189, 464875, -450903, -111239, -132352, -20390, 161692, -23724, -85666, 43705, -242362, -1854, 97050, -106344, 546, -136245, 355408, -147065, -254385]
12521b54385A38299H446J13530a61769C566b64896a30548J0800l3137H3014g2057
12509D2910a1729q221A06182a0292L458G0103a57982O9631j26631L8111C71491
12497A91451A0193b76302B20044a07718B63595G62J16046M3422N4691A01127d7199
12485A78572K8798a50830f1621K0015B19785a6853j13418j69486A60240b10968
12474a10601B7302c3223A23940j1258c70999K0222A77501a23388k40849C4017
12463c07735B67053a58044C71703F923a63631G2690f9943I9104c06028e6330o3745
12452a20075K368H78g9364G9188R5913f1316p6543o6641Q5718J0775r4439j08433
12440c10879J18974i2559B63900f8086b3361j02211E504N1328e6013A26416K05969
$$ y = [-254385, 138299, 8446, 121976, -161769, 3566, -264896, -130548, -119748, -152885, 83014, -72057, 42910, -11729, -19950, 106182, -10292, -6834, 70103, -157982, -88351, -214982, -176871, 371491, 191451, 10193, -276302, 220044, -107718, 263595, 762, 116808, 160230, 214921, 101127, -47199, 178572, 207370, -150830, -61621, -41606, 219785, -16853, -130271, -299757, 160240, -210968, -110601, 27302, -33223, 123940, 112682, -370999, -350777, 177501, -123388, -364237, 34017, -307735, 267053, -158044, 371703, 6923, -163631, 72690, -69943, 99104, -306028, -56330, -120075, -117707, 878, -79364, 79188, 175101, -61316, -137859, -204500, -118782, -108007, -202446, -310879, -191905, -92559, 263900, -68086, -23361, -125572, 5504, 56832, -56013, 126416, 332385]
12429C32385b09832Q961d1291n3754C9990J31388b22587B41383G6944k6448J18236
12418A68732g1369k03131H0923h5857A51058b75813C3239a62935A11222j7964
12408I3258l0809d014n8142A02611J46926J7082l7807G4799b8589H4356a34411
12396b08643B02525a82568E6846b68216a03298A66941l836i977k39736B41732
12385a8209j10431H0051M0766Q3521r7895J8410a35827d8850n237C1370P1161
12374A02531P3895a19417D8473J70809E0118K25022j33335a3109p7123A08621
12363h6570C2441J80152G8654F619b09140A50277E7441d8664B46740A06650a90997
12351a27903J7919q6817L4957J6201r5725J7345A56349a31574A20304O0059b59959
$$ y = [332385, -209832, -200871, -41291, -95045, 39990, 171378, -222587, 241383, 76944, 50496, 168732, -71369, -274500, 80923, -85857, 151058, -275813, 33239, -162935, 111222, 93258, 62449, -4014, -62156, 102611, 249537, 266619, 228812, 74799, -28589, 84356, -134411, -208643, 202525, -182568, 56846, -268216, -103298, 166941, 163105, -9977, -249713, 241732, -18209, -128640, 80051, 120817, 204338, 106443, 124853, -135827, -48850, -54087, 31370, 102531, 176426, -119417, 48473, 219282, 50118, 275140, 141805, -13109, -90232, 108621, -86570, 32441, 212593, 78654, 6619, -209140, 150277, 57441, -48664, 246740, 106650, -190997, -127903, -109984, -196801, -161844, -145643, -241368, -224023, 156349, -131574, 120304, 180363, -259959]
12339B5180a2401H5570Q2a41024N8927q2771A26646K06234a72210B29638A7719
12327a07693A28469a90434i1476A45372g1361B5958J5734J27356J00536C2460
12316c98549a31607A67086C0755K88090d4517A51286O7524J06600J12584p8003
12306C59991A20585J56772G8825J95921D2394L17366A10675j3519K45277j21269
12296B21164K66724j24065j59081K5009a54689B05826B7188a62125C56326d9977
12285f9951B93782c935E20J87263L1349B4395L513L5728e4668D2325K50552o3524
12273B29353P4398b30264A19709J01766H951a16319a050j80136g7691A26076J04893
12262B30969N748c47471B56728l9818E3978J63998K9620a26224C35499a83339
$$ y = [25180, -12401, 85570, 85652, -141024, -82097, -164868, 126646, 332880, -172210, 229638, 17719, -107693, 128469, -190434, -91476, 145372, -71361, 25958, 41692, 169048, 269584, 32460, -398549, -131607, 167086, 30755, 318845, -44517, 151286, 218810, 325410, 437994, 359991, 120585, 277357, 78825, 274746, 42394, 359760, 110675, 97156, 342433, 221164, 487888, 363823, 204742, 229751, -154689, 205826, 27188, -162125, 356326, -49977, -69951, 293782, -3935, 520, 187783, 219132, 24395, 27908, 63636, -54668, 42325, 292877, 229353, 303751, -230264, 119709, 221475, 8951, -116319, -1050, -181186, -77691, 126076, 230969, 236717, -347471, 256728, 216910, 53978, 217976, 247596, -126224, 335499, -183339]
12251B11658o6620B9908g541B00166B7234Q5831J78038K08272E2304K56462e2401
12239b6775G7773N312K24702d7133B24168G8247J3352J07985L2840I6085b19854
12227D07005A72470a42191A90078Q9579m8363M22077a62262k6001A98696G4105
12216a81882C46153j62372C6590J92108C3751a18674C0623J50875p3849K85198
12206C92847h1471B09990G7588O773a401A90172K81357g1515B45779E7712J5721
12195G3433b12524e3616A32612a19181B49440R5725A32594O0153M8625H3022A5906
12183C8848a55758B3159J27476C174N79202B41787A00012J05645p640a5402A70005
12171H7394a35075j36781g2284C2339h6509C10579f3523a3739r8126C36689g0645
$$ y = [211658, 145038, 29908, -7541, 200166, 27234, 113065, 291103, 499375, 52304, 308766, -52401, -26775, 77773, 83085, 307787, -47133, 224168, 78247, 91599, 199584, 232424, 96085, -219854, 407005, 172470, -142191, 190078, 279657, 231294, 653371, -162262, -188263, 198696, 74105, -181882, 346153, 183781, 36590, 228698, 33751, -118674, 30623, 181498, 107649, 392847, -81471, 209990, 77588, 84361, -1401, 190172, 471529, -71515, 245779, 57712, 73433, -212524, -53616, 132612, -119181, 249440, 345165, 132594, 192747, 241372, 83022, 15906, 38848, -155758, 23159, 150635, 3174, 582376, 241787, 100012, 205657, 198017, -15402, 170005, 87394, -135075, -271856, -72284, 32339, -86509, 310579, -63523, -13739, -111865, 336689, -70645]
12159d0204C16797A09446A6052b1864B7073M50416j96349j23892K25632I1613
12148B46674L68737j17206A24241P8331A4020P1334g7338b5760A71503c561k3058
12137b6619A39181a72925A02054J15269J99529d7950A39513a8539E418J37398
12127A42816D9473J4553Q3279n5187P7466f844j52940B06889p256o2177B1886
12115C29400p8447G9673c06170A84072M8978i68B01957j2233B4486Q2004J34513
12104B41003J94442G5892c9188C14469I4560K04429b59830D69864i3753A77148
12093A16845a92264A90914K3811q6158E0948A5910J21718m3301a4010j84898A37656
12081I8529N0693m2648J57692b40823D4709J37894L20627A40515a79845C85585
$$ y = [-40204, 316797, 109446, 16052, -21864, 27073, 477489, 281140, 157248, 382880, 91613, 246674, 615411, 498205, 124241, 202572, 14020, 85354, -77338, -25760, 171503, -3561, -26619, 139181, -172925, 102054, 217323, 416852, -47950, 139513, -18539, 5418, 142816, 49473, 64026, 147305, 92118, 169584, -6844, -159784, 206889, 199633, 137456, 21886, 329400, 250953, 79673, -306170, 184072, 233050, -968, 201957, 189724, 24486, 106490, 241003, 435445, 75892, -39188, 314469, 94560, 298989, -259830, 469864, -93753, 177148, 116845, -192264, 190914, 214725, 128567, 50948, 15910, 137628, 94327, -14010, -198908, 137656, 98529, 149222, 106574, 264266, -240823, 44709, 182603, 503230, 140515, -179845, 385585]
12070A62143J76304a97648I3281N809b59783B59338B874i9933j5649L4004c1948
12058C23005C5742d8756H0580O753a73684I7945l5484J60992r8807J69051M0222
12047C33919A27255n259J97637b564l46005G8135P3816i5591k33135A55659n8383
12036I7276L2128A4683J6915h3104k63069C79951c370j22503d8993B35777b89164
12024D95148f9475o831d717k85732J16761A58490b54670B17284B5116b60975a3086
12012c064B67768B0620b2397D08356A21341l1852J65156g2117j4727B14693q3686
12001A31007m5603K30401q5557j03519o375J8054p982J17040a04873N1459a2820
11989A67043K38307e0795A21336a90808j8332f75A08246h9925p2104B42987d39440
$$ y = [162143, 338447, -197648, 93281, 99090, -259783, 259338, 2874, -99933, -115582, -81578, -31948, 323005, 35742, -48756, 80580, 87333, -173684, 97945, 62461, 223453, 124646, 293697, 333919, 127255, 121996, 319633, -2564, -348569, 78135, 151951, -95591, -328726, 155659, 97276, 129404, 14683, 31598, -83104, -346173, 379951, -3370, -125873, -48993, 235777, -289164, 495148, -69475, -76306, -4717, -290449, -173688, 158490, -254670, 217284, 25116, -260975, -13086, -3064, 267768, 20620, -22397, 408356, 121341, 89489, 254645, -72117, -86844, 214693, 131007, 85404, 315805, 230248, 126729, 120354, 138408, 130426, 247466, -104873, -53414, -12820, 167043, 405350, -50795, 121336, -190808, -209140, -675, 108246, -89925, -162029, 242987, -439440]
11977B2706J26817B1857a09067K4380B37027F7360J18971J89746f2238J6915j95309
11966b40632A40755d22356E6418J55401E8166b40988F1467b46697B60752f3986
11955a31824A02378D4732K1498a00396b4151a1462B32467a063m215j62834Q2976
11944h5136p5065L1928b7214k60766J00102n8841C99309G6823J93382e4617m5044
11933i9661H2736b35028d0494j18959j88978I7776R6847K1381I245a28135l7881
11922a66016A26439a87355A70927a90362P7023K7387C199R1033L6829B4602J15628
11911A40230P2308b0231H7563j7859g724l4369B60092L2923q6989A0752a17768
11899A08411G429e2248m4501A94346h489J78G9295J30243c38316A29901L3168
$$ y = [22706, 149523, 21857, -109067, -84687, 237027, 67360, 186331, 376077, -62238, -45323, -240632, 140755, -422356, 56418, 211819, 58166, -240988, 61467, -246697, 260752, -63986, -131824, 102378, 44732, 66230, -100396, -24151, -11462, 232467, -1063, -5278, -168112, -85136, -160201, -128273, -27214, -287980, -187878, -246719, 399309, 76823, 270205, -54617, -99661, 82736, -235028, -40494, -159453, -348431, 97776, 194623, 216004, 9245, -128135, -166016, 126439, -187355, 170927, -190362, -113339, -85952, 3199, 94232, 131061, 24602, 140230, 212538, -20231, 87563, 69704, -7724, -42093, 260092, 293015, 206026, 10752, -117768, 108411, 7429, -52248, -96749, 194346, -8489, -8311, 79295, 209538, -338316, 129901, 163069]
11888A63069p5849a75229B37165m1133a53853l9959n9157i365C77153j31612f7216
11876g8806J7342C8309b88424J38033A03397N2899d3250p202F136J46701l2720
11865A20117J93589c26303B21898d9419I0134M1733h9187B42895c39024a31374
11854d59190H9184d1545A12276a44420B62548F2542k9442g2614p7272c3084k07629
11843b40713B609a2722B3647a17167j28026c5311n855I8990b13615a9422B21100
11831a50190I2859J38825c06265B78252A25801B945a43315L7125k2756j07132
11821b36078f9383J6229r2462r6857R4345M3230G8719a21310A41011a47540j80039
11810c27579O3042J07344d8210B1650f7416o9064O05j52361B25388G0125a00515
$$ y = [163069, 87220, -175229, 237165, 196032, -153853, -193812, -252969, -9365, 377153, 245541, -67216, -78806, -61464, 38309, -288424, -150391, 103397, 156296, -43250, -50452, 6136, 152837, 120117, 313706, -326303, 221898, -49419, 90134, 131867, -89187, 242895, -339024, -131374, -459190, 89184, -41545, 112276, -144420, 262548, 62542, 33100, -72614, -149886, -33084, -240713, 2609, -12722, 23647, -117167, -245193, -35311, -41166, 98990, -213615, -19422, 221100, -150190, 92859, 231684, -306265, 278252, 125801, 2945, -143315, -106190, -128946, -236078, -69383, -53154, -145616, -242473, -148128, -104898, 78719, -121310, 141011, -147540, -327579, -264537, -157193, -48210, 21650, -67416, -136480, -135875, -288236, 225388, 70125, -100515]
11798a19969B25440I7432b82090K5895J7144B75303a48642N1102C71460A11881
11787c2744B42774a5246B05382D2385c1809A19255A697L89819B0567c4715l619
11776c8334A70784B1759J43763a97386H2638a05298A56868c4329j96645m4416
11766b75390B00639a63117A07948f1096j14430A22160d1153A2562g9608A13533
11755A7564b41159M6682D607a85018I7072a08021A72149c7079C0631A247J56426
11744A57673a19822j53263g9240B36426b13129a05129E8444K57673a61035E2606
11733a67683M0096E9606L2520J29201g0776G5889B2047b1587o6351r3278R0331
11722i0885d4794a7214l67754F8084D817K23313C5626a96298a5540j05667A62942
$$ y = [-119969, 225440, 97432, -282090, -256195, -239051, 275303, -148642, -97540, 371460, 111881, -32744, 242774, -15246, 205382, 42385, -31809, 119255, 1697, 391516, 20567, -34715, -38334, 170784, 21759, 165522, -197386, 82638, -105298, 156868, -34329, -230974, -275390, 200639, -163117, 107948, -61096, -175526, 122160, -41153, 12562, -79608, 113533, 17564, -241159, -194477, 4607, -185018, 97072, -108021, 172149, -37079, 30631, 1247, 157673, -119822, -273085, -79240, 236426, -213129, -105129, 58444, 316117, -161035, 52606, -167683, -127587, 59606, 92126, 221327, -70776, 75889, 22047, -21587, -87938, -181216, -90885, -44794, -17214, -384968, 68084, 4817, 228130, 35626, -196298, -15540, -121207, 162942]
11710a09606M4622n6644A36655i4166A18758J81864I3304m3003b26538M9216J7732
11699a59590B38310I3515D4661a09796B37042a07848D55082c55353a28471r2162
11689b20633R3993k85557C37716b7738A12021N8720a79312B01784J23949C055
11678b94190C38643J72690a21414C4333R8099o3476A2412b78952I36J06931n2623
11667E5244K39424E6479P4564a14207N6126J5051k0118n21340f1001q2303A28544
11655b3433F4588J44910b2195A88611p6912L3128a27000K1216o2474B49713E7712
11643a16098B51100m6840a8907o5321F478g3074C48426a43041c6190o8179n8057
11632a62426C2774J7799a41739f1173A86761a17291o9014d5027m773A12117K31398
$$ y = [-109606, -64984, -121628, 136655, -94166, 118758, 300622, 93304, 50301, -226538, -177322, -159590, 238310, 93515, 44661, -109796, 237042, -107848, 455082, -355353, -128471, -220633, -126640, -412197, 337716, -27738, 112021, 170741, -179312, 201784, 325733, 3055, -294190, 338643, 511333, -121414, 34333, 132432, 68956, 12412, -278952, 936, 107867, 55244, 294668, 56479, 131043, -114207, -58081, -43030, -63148, -584488, -61001, -143304, 128544, -23433, 64588, 209498, -22195, 188611, 111699, 144827, -127000, -105784, -168258, 249713, 57712, -116098, 251100, 204260, -18907, -84228, 6478, -73074, 348426, -143041, -36190, -104369, -162426, 32774, 50573, -141739, -61173, 186761, -117291, -186305, -45027, -49800, 112117, 343515]
11621C43515a79988L6203j74442E899J34023a13284E3987L49148j84519G6017
11610B43127d7591C8968J63802G1426i8453q4667C00674e0027A19530a01206j15260
11599b16466p4422D47899e9279B460P4107g6916D1294c8894j92577g100l4233
11588d1333A69994D7780N7701l2831a7821j15389I3324m610a0387A81359P7333
11577B58692a18350d1193b300A76879f1865k30882J46247M3142G2560R7889N3641
11566B24090B5935L19373r0560F0955A1490K64777Q8558a9927j22390o5010B14773
11554A51692b16993Q3951A03075m1198d9633P541A20881h6398j01128D3314a90176
11542D75976I5486J77299h1870A281J80326H7433K2788a04381G1561a36611B5057
$$ y = [343515, -179988, -143785, -318227, 5899, 139922, -113284, 53987, 403135, 218616, 76017, 243127, -47591, 38968, 202770, 71426, -98453, -183120, 300674, -50027, 119530, -101206, -216466, -290888, 447899, -59279, 2460, 76567, -76916, 41294, -38894, -231471, -7100, -41333, 169994, 47780, 105481, 72650, -17821, -133210, 93324, 88714, -10387, 181359, 258692, -118350, -41193, -2300, 176879, -61865, -292747, -146500, -103358, 72560, 170449, 224090, 25935, 345308, 254748, 60955, 11490, 276267, 364825, -19927, -142317, -207327, 214773, 151692, -216993, -133042, 103075, 61877, -49633, -42092, 120881, -86398, -187526, 43314, -190176, 475976, 95486, 272785, -81870, 1281, 181607, 87433, 110221, -104381, 71561, -136611, 25057]
11530g8857p7685A36235k8807f8471A59229p7488b46876I0341a61540G1076J64845
11519B35921O0400Q3948o8669b26352G7832j7987A5713M4052J21591a48472k5382
11508a73854F7049a62181G4313g8921k6361E7544g9598A55999J07960h8611F1444
11496A86492C9939j7764K99000c3789J2530q5911B30217O1964i9302A93795q9946
11485A03849K1062b75500F1189O3845h2827B39137a7j62960F7140K1810a39436
11473g1036m6418r6971F9195k6493M7749d2769j37797B5401O1522J29896F8954
11461a40658J2137A75379O1759H839J54323a60328f9356E3701b83410B07644J33573
11450C41217N4130A55777G6190K45289a69490o2170B63165G7320K41490G0534
$$ y = [-78857, -156542, 136235, 107428, -68471, 159229, 81741, -246876, 90341, -161540, 71076, 235921, 296321, 380269, 311600, -226352, 77832, 59845, 15713, 59765, 181356, -148472, -173854, 67049, -162181, 74313, -78921, -105282, 57544, -79598, 155999, 263959, -88611, 61444, 186492, 39939, 22175, 321175, -33789, -21259, -107170, 230217, 292181, -99302, 193795, 103849, 124911, -275500, 61189, 125034, -82827, 239137, -17, -162977, 67140, 88950, -139436, -71036, -117454, -214425, 69195, 42702, 90451, -42769, -180566, 25401, 86923, 216819, 68954, -140658, -128521, 175379, 237138, 8839, 163162, -160328, -69356, 53701, -283410, 207644, 341217, 395347, 155777, 76190, 321479, -169490, -231660, 263165, 77320, 318810, 70534]
11439B55867b7154A61983o0039R7546f4757H6863K22641b7973B83973C8709P8082
11428A16791c6457D8577B3787L94576c1615A13134a87738b311C99561p674d47260
11416c1214f217B3668K30042I7461a99078b7159a0268C04118A05225b17217D9070
11404A73560e3688A43932p1105l5565b51098i0591A75618E2095J75713b20301
11393i7803c7860j71536B94427A2799a61277A23736d1111F8546e8042n2360A67725
11381A89198F4166j4107a14594A160C10K02274A6023K9718a7161A10155b2650
11369b33814A8063L3394K44478A20495d87323C08025A3839J04328b76010j9699
11359b95709J42694L2807p6894H3664e3629A37345J58903E6495b09198B27776
$$ y = [255867, -27154, 161983, 101944, 199490, -64757, 86863, 309504, -27973, 283973, 38709, 116791, -36457, 48577, 23787, 418363, -31615, 113134, -187738, -2311, 399561, 391887, -447260, -31214, -6217, 23668, 253710, 97461, -199078, -27159, -10268, 304118, 105225, -217217, 49070, 173560, -53688, 143932, 72827, 37262, -251098, -90591, 175618, 52095, 227808, -220301, -97803, -37860, -209396, 294427, 12799, -161277, 123736, -41111, 68546, -58042, -110402, 167725, 189198, 64166, 50059, -114594, 1160, 310, 202584, 16023, 45741, -17161, 110155, -22650, -233814, 18063, 51457, 295935, 120495, -487323, 308025, 13839, 118167, -276010, -295709, -153015, -120208, -197102, 83664, -53629, 137345, 296248, 56495, -209198, 227776]
11348b8229H029i7068A4416M769J13305a61212B30724g7339B01431F1804g5567
11336b04175H9002d6295a3878B8910a89826A28980a49381B40532B0705b0399E6799
11324g6920j1152A08182l5434d37049g2308A10132a87159c5539k23597f2283A80788
11312h5959I213i8709l61828A03422g7501j09110f7920j61816d8902E9918e1987
11300A09655n3448K4319d9205l6169B70904F8536a56608A25419b46036j93537
11290d39573A16452f002B7370c52437h5830L2596A46736a51301A86726g9066j50993
11279b30059F1800b08305A38539a86233J8N8717g684A34594h7010b5986j05856
11268a31842k69746a52853r2138g9263J6557j95036F8264f8018B29434H1638a95523
$$ y = [-28229, 8029, -97068, 14416, 19185, 132490, -161212, 230724, -77339, 201431, 61804, -75567, -204175, 89002, -46295, -13878, 28910, -189826, 128980, -149381, 240532, 20705, -20399, 56799, -76920, -88072, 108182, 72748, -437049, -72308, 110132, -187159, -35539, -259136, -62283, 180788, -85959, 9213, -98709, -460537, 103422, -77501, -186611, -67920, -229736, -48902, 59918, -51987, 109655, 56207, 80526, -49205, -85374, 270904, 68536, -156608, 125419, -246036, -439573, 116452, -6002, 27370, -352437, -85830, -53234, 146736, -151301, 186726, -79066, -230059, 61800, -208305, 138539, -186233, -186215, -127498, -7684, 134594, -87010, -25986, -131842, -401588, -152853, -244991, -79263, -62706, -257742, 68264, -68018, 229434, 81638, -195523]
11256a23257D6800c30311F0710O2290h2046k8860M5309B69229b99149K1095a31676
11244a18242k12067e3536l76478K14639f2208A76516k7459n612b33578E9878a89311
11232B39727g0860e552k7504j32953A0921a08885A33530a17988k82373A34544
11221a7663H3909c15495L0135R5427e6950A78150b58173B50802I8217a39282B05093
11209B3181a57578g7827a2095A93709p6425b9874A05631A4013b6730I3301e7805
11197d6169A5123b73464h3022R882j9490r0751C55938e18093e4252j68015A74288
11185b0469n9261A30808J28934a62791k6395N3892L4288K6048k00259g6067j17062
11174a93129A80641E3307a10531A13191C2225K3032a09862F316b90155J35388
$$ y = [-123257, 46800, -330311, 60710, 123000, -82046, -110906, -65597, 269229, -299149, -278054, -131676, -118242, -330309, -53536, -430014, -215375, -62208, 176516, 149057, 143445, -233578, 59878, -189311, 239727, -70860, -5552, -33056, -166009, 10921, -108885, 133530, -117988, -400361, 134544, -17663, 83909, -315495, -285360, -189933, -56950, 178150, -258173, 250802, 98217, -139282, 205093, 23181, -157578, -77827, -12095, 193709, 117284, -29874, 105631, 14013, -26730, 93301, -57805, -46169, 15123, -273464, -83022, -73140, -92630, -183381, 355938, -518093, -54252, -222267, 174288, -20469, -79730, 130808, 259742, -162791, -189186, -135294, -101006, -74958, -275217, -76067, -193129, 180641, 53307, -110531, 113191, 32225, 55257, -109862, 6316, -290155, -154767]
11164a54767A4934a9755A48177d427m4418j80725A90206B373J19457J49088b60827
11152a79081k8899i8004A80520q0401f7003a6177o1917j49726C7513K2137b26554
11140a95070R3878R265k63674a3286k64819J16845A02107b66694k5514a09134
11129H2750b00422A99381n1365H147d3290j11333c6877m2662r0641G5223b81047
11117C77911a00157C1396N8779A8618M1542J73627m9718a46606j07967M9668K9137
11106a75768k0376j0283R7188D4359P926a15315p3180A40943J31159K03183e9667
11094G1911a019B88116b81944A95855G8708b90002n2930B4940J2748J56589G721
11082D15224A47693o0249B0268L63588q1675a33862f1891B0570a84651g5982E6951
$$ y = [-154767, 14934, -19755, 148177, -4427, -48845, -229570, 190206, 2373, 121830, 270918, -260827, -179081, -207980, -98004, 180520, 100119, -67003, -16177, -78094, -227820, 37513, 59650, -226554, -195070, -101192, -91927, -355601, -13286, -278105, -161260, 102107, -266694, -292208, -109134, 82750, -200422, 199381, 148016, 8147, -43290, -154623, -36877, -79539, -170180, 75223, -281047, 377911, -100157, 31396, 90175, 18618, 60160, 233787, 184069, -146606, -254573, -204905, -175768, -196144, -206427, -109239, 44359, 52285, -115315, -188495, 140943, 272102, 475285, -59667, 71911, -1019, 288116, -281944, 195855, 78708, -290002, -342932, 24940, 37688, 194277, 7721, 415224, 147693, 87444, 20268, 383856, 302181, -133862, -61891, 20570, -184651, -75982, 56951]
11070A5045M34626B11798J26812h7815D98987A23054c747A28168a01854A17799
11059b20819D3560K0959J84889J69591p2780n4056j04857J13368K24657B57693
11048B11494J00946j49393G6434K74295A34343L408P4109N27837A93755l4239
11038A59516N25737k27814O746j13192O2770J34512B48560N41264k23039r5992
11028D70793K22727C10578L37427j55915R4378L64447l66529Q4200k83705p4534
11018C10347k2463J88334K8239m1640j96574k2981J60700J13808m2436j13067
11008C62267K83295k82725J65525R1126k23796J03372l3116K22463j76696r5298
10998D16417L0828K70306q9037B17310J49829L18743B78754M16624B32125K87960
$$ y = [15045, 449671, 211798, 338610, -87815, 498987, 123054, -3747, 128168, -101854, 117799, -220819, 43560, 64519, 249408, 418999, 346219, 292163, 187306, 300674, 525331, 257693, 211494, 312440, 163047, 76434, 350729, 134343, 137751, 211860, 739697, 193755, 159516, 685253, 457439, 464185, 350993, 413763, 548275, 248560, 789824, 566785, 470793, 693520, 310578, 648005, 492090, 586468, 950915, 584386, 668586, 384881, 310347, 287884, 476218, 504457, 462817, 266243, 243262, 403962, 517770, 475334, 362267, 645562, 362837, 528362, 619488, 395692, 499064, 465948, 688411, 511715, 416417, 447245, 717551, 628514, 217310, 367139, 685882, 278754, 695378, 232125, 520085]
10988E20085n3409J48244P841k47666N06698D08756n7182A14007O52279j58118
10978F08168p5761j57697M09171k10278K3144B68647L21840N9701j72150j70357
10968C07681o9267N18232K5723q6213k51094O61001k66083L38488m15282K33262
10958I96448O6573K18418L93672k37248J70950J46454L07645k41653K2110p1144
10948A772225L03358o47767l1014r423J51453j48063l51966n9605M76951k59424
10938A196725K79893j24417R1619o3302l09576l4643o4284J36105m49408K5292
10928F84004j47795o8762j09305l9765M4893I6918J52869f5807J2120a6105F5160
10916f6847j05309A80177n3095K1851C2238R0648D2984K63216P1036a91531M9444
$$ y = [520085, 466676, 614920, 622761, 375095, 881793, 408756, 351574, 114007, 766286, 608168, 532407, 374710, 783881, 573603, 596747, 268647, 590487, 650188, 478038, 307681, 238414, 756646, 782369, 696156, 445062, 1106063, 839980, 1178468, 763186, 996448, 1063021, 1281439, 1675111, 1437863, 1608813, 1755267, 2062912, 1821259, 1843369, 1772225, 2075583, 1427816, 1396802, 1387379, 1538832, 1390769, 1038803, 979198, 1456149, 1196725, 1476618, 1352201, 1443820, 1380518, 1070942, 1036299, 972015, 1108120, 658712, 684004, 536209, 467447, 358142, 318377, 363270, 96918, 249787, -65807, -53687, -16105, 65160, -66847, -172156, 180177, 127082, 148933, 32238, 122886, 42984, 306200, 377236, -191531, -142087]
10905a42087K136A72771J69948a28788c6834A33340K30779b04681I5022h6584
10894A0836J47486M7639K49199a5911q298k6035o471C7341g5951B70717a76592
10882a52280F3312J85048g40732a62768B12507a79418A20490e2954K0199q0299
10872a13054d3113B53907a11033j18382d1322j91758e9212A04576b81720J20724
10862a60996A16487e9555k55400B58747B1088a32809B54723r2257a27303B082
10851b98015f1430p9853p7837A02874c19685R8832B86422O4481f9217k16459a17216
10839c55186J04885l4373C95335A29461a59373b2835E7806c52156h7167A25501
10828c06690E1125a13123n27163C5879Q7914h922G8010a40433m4042J934o9016
$$ y = [-142087, -139951, 172771, 342719, -128788, -36834, 133340, 364119, -204681, 95022, -86584, 10836, 158322, 205961, 455160, -15911, -24209, -50244, -56715, 37341, -75951, 270717, -176592, -152280, 63312, 248360, -740732, -162768, 212507, -179418, 120490, -52954, -32755, -113054, -43113, 253907, -111033, -229415, -41322, -233080, -59212, 104576, -281720, -160996, 116487, -59555, -314955, 258747, 21088, -132809, 254723, 162466, -127303, 2082, -298015, -61430, -141283, -219120, 102874, -319685, -220853, 286422, 350903, -69217, -285676, -117216, -355186, -250301, -284674, 395335, 129461, -159373, -22835, 57806, -352156, -87167, 125501, -306690, 51125, -113123, -640286, 35879, 123793, -8922, 78010, -140433, -184475, -182541, -251557]
10817b51557A91644a36788C1122a93783J8370j60896G7920e5117B12929i4141
10806a44968r6430a4174p693R371j90461E4515M4427a98302c9638k34939d4962
10794a50330J1822B91396a92720B08765G9105b62795F0803J40693a0835C18637
10783b55953k7393D52562b18732A81214b02414J3109D4518l405j6335e8040j33672
10772a91712E9376e3764F9778j0898b96514a01395J0600j18485c0882B08736K9074
10761B37810a80382b72C1326e7287A58151d2714A27300n0581J10606E8747K53708
10750C12455b61930A7060b56571R1825N1290K0531H3417a51785H831L9922J10895
10739A59648R152J29693b3172o4890o3074k27709b2419E091b70514A37879c7205
$$ y = [-251557, 191644, -136788, 31122, -193783, -175413, -336309, 77920, -55117, 212929, -94141, -144968, -241398, -14174, -21867, -12496, -202957, 54515, 98942, -198302, -39638, -274577, -44962, -150330, -138508, 291396, -192720, 208765, 79105, -262795, 60803, 201496, -10835, 318637, -255953, -283346, 452562, -218732, 181214, -202414, -189305, 44518, 41113, 24778, -58040, -191712, 59376, -53764, 69778, 58880, -296514, -101395, -90795, -209280, -30882, 208736, 237810, -180382, -272, 31326, -57287, 158151, -42714, 127300, 76719, 187325, 58747, 312455, -261930, 17060, -256571, -164746, -113456, -92925, 83417, -151785, 8831, 48753, 159648, 168800, 298493, -23172, -88062, -151136, -378845, -22419, 5091, -270514, 137879, -37205]
10727A04495d2176l66633i5470d4887k01771G7169b64260B8525c44926J61762
10717a83164j03793B3434b43706I9529h8498D2834h7470k25542B43841a07998
10706a19502b9495n6733q7193P2773J8042k72085H059g8640H2688a18000k14097
10695c32097P3006a18002M8252A27164c92464o0986P9832A28857a5552j3357C0969
10683C19200A52487i3840c4105j47040d3847H0075a55317A38206r859I466f2407
10671a12411j249j87457D2902c854j22214I2161a94037d7573J0452J0546k143
10660b8718l6321B52426A04393b64311R6889k079l3866i1193j24156L4651c6734
10648a51090f6410A45066d08719i9343k8523G5913a47616J4578r6908j26193g379
$$ y = [104495, -42176, -408809, -95470, -44887, -246658, 77169, -264260, 28525, -344926, -183164, -286957, 23434, -243706, 99529, -88498, 42834, -87470, -313012, 243841, -107998, -119502, -29495, -86228, -173421, -100648, -82606, -354691, 8059, -78640, 82688, -118000, -332097, -259091, -118002, -69750, 127164, -392464, -453450, -373618, 128857, -15552, -28909, 30969, 319200, 152487, -93840, -34105, -181145, -43847, 80075, -155317, 138206, 128347, 9466, -62407, -112411, -113660, -301117, 42902, -3854, -126068, 92161, -194037, -47573, -37121, -26575, -28718, -65039, 252426, 104393, -264311, -167422, -169501, -203367, -91193, -215349, -180698, -36734, -151090, -66410, 145066, -408719, -99343, -127866, 75913, -147616, -133038, -229946, -356139, -7379]
10636g6720G3531c19093R7213O84d2213m0259q5517c4100q045A9382c2924o6393
10624i9317q6810b1319A4804a89435B52895J05527d33904B09665B5634e1674A33183
10612c05718A12698O7389a56526r345j73372A27437b68812C10007p0525a11512
10601a38379m0641c5553k6990m18287A8369a48887I0742C1811Q5333M6605F5566
10589C6895b16207a2378j55711N8203A01331a2229l4039A26123b03357g5763A22106
10577b8979j6336G233J60526a64931m1078A13785c04402E894a91547j10151b7453
10565B58457r9126b28436N8901j92750C00867b5065l1500a1710j41278B15723
10554H9115b97402e0684j43216I5637g5633F7786M7278a91656A35088a60058j53881
$$ y = [-76720, 73531, -319093, -221880, -221196, -42213, -82472, -167989, -34100, -42145, 19382, -32924, -99317, -186127, -21319, 14804, -189435, 252895, 358422, -433904, 209665, 25634, -51674, 133183, -305718, 112698, 180087, -156526, -165871, -339243, 127437, -268812, 310007, 239482, -111512, -138379, -179020, -35553, -62543, -480830, 18369, -148887, 90742, 31811, 117144, 163749, 65566, 36895, -216207, -12378, -168089, -109886, 101331, -12229, -46268, 126123, -203357, -75763, 122106, -28979, -45315, 7233, 167759, -164931, -206009, 113785, -304402, 5894, -191547, -301698, -27453, 258457, 159331, -228436, -169535, -362285, 300867, -25065, -56565, -11710, -152988, 215723, 89115, -297402, -50684, -193900, 95637, -75633, 67786, 115064, -191656, 135088, -160058, -313939]
10543c13939A41717b273n3487j0610a65n9571b6078j06460j22714C91190e0585
10531a22607A57689j2468F164c87121a9468l6176k34643C5722a77264h2543A56572
10519b8758k91702J54393p1172D8257K30064a69154g516k37151c467B0315b48689
10507A45651a70748o7318H463i6568q3664A15753k3396c77061i0652j79713C4841
10495E2927a92803g5778b7934n13428b8636j26291R946F0496b84450L1155O0912
10484a92383L0611A98977e7476A84003b47736b7603m4231B70518K9433b67136
10473b89496E0091A2598J28407a68279A71522P449e6955A0141a36168C52093j02705
10462B49388j21594K24329J63826A33268J95357K6436H2277P4280k4368R4285
$$ y = [-313939, 141717, -2273, -55760, -66370, -165, -59736, -26078, -132538, -255252, 391190, -50585, -122607, 157689, 145221, 6164, -387121, -19468, -55644, -290287, 35722, -177264, -82543, 156572, -28758, -320460, -166067, -237239, 48257, 278321, -169154, -7516, -244667, -3467, 20315, -248689, 145651, -170748, -238066, 8463, -96568, -180232, 115753, 92357, -377061, -90652, -270365, 34841, 52927, -192803, -75778, -27934, -541362, -28636, -154927, -144981, 60496, -284450, -253295, -192383, -161772, 198977, -57476, 184003, -247736, -27603, -71834, 270518, 299951, -267136, -289496, 50091, 12598, 141005, -168279, 171522, 178971, -56955, 10141, -136168, 352093, 249388, 127794, 352123, 515949, 133268, 328625, 355061, 82277, 156557, 132189, 226474]
10452B26474o9449J95500j73475c3267A3331L72444j83282c453m7116b4623j04395
10441a29018o9978H0438a52774j1008e4181j1008A07726M5188b21712E9649a62806
10429b10303k08957H3746d33105a16419E4184L7147d20324c2512J0937p5908o0425
10418a57908O6810l36844a52840L4034o7565N8258D8884a6234j82507A61389a69238
10406a06297c7802A35431B7296n925N8181a38238L9363C19035h9226l4918A44070
10394a00846C2986b16449j28770N3140f1839A51788J95616a82776a3856B3573
10383a39146m6818B08908c0767F8196J30149c0023A04510a12808k59863B5700
10372a21228d6967j44169b27l45606B5968a80828A10593a12619n6213F6628N792
$$ y = [226474, 157025, 352525, 179050, -33267, 13331, 385775, 202493, -3453, -50569, -24623, -129018, -198996, 80438, -152774, -163782, -54181, -65189, 107726, 152914, -221712, 59649, -162806, -210303, -419260, 83746, -433105, -116419, 54184, 91331, -420324, -32512, -21575, -97483, -157908, -91098, -427942, -152840, -118806, -186371, -128113, 48884, -16234, -198741, 161389, -169238, -106297, -37802, 135431, 27296, 21371, 79552, -138238, -98875, 319035, -89226, -124144, 144070, -100846, 32986, -216449, -345219, -292079, -61839, 151788, 347404, -182776, -13856, 23573, -139146, -185964, 208908, -30767, 68196, 198345, -30023, 104510, -112808, -372671, 25700, -121228, -46967, -191136, -227, -345833, 25968, -180828, 110593, -112619, -168832, 66628, 72420]
10361G2420P4624J47658c6876A95969O1986j11800m4149J25420a748B14902G3467
10349C12024J73044j97673K1347m3124o2303J22186j02023k9123E3375a4332l9501
10338e3833B66898a87392A43866N1601M5173K2072M312R8633H9843c6097B39992
10326B31569L20884k32281e268n1581B93755F6391K54634D8300K14397A03011
10315H9819B1495J02708P883E4126J35824H1435L1042a46428C77367B4224a29512
10303B85643F4241O8479J30456I1463J30314g3750C91006A5253M2446b63854B56928
10291a12374K5209l4675A2328K24670f9297b0410I2776d17003a2279j90336c0053
10279a43588A16184C8086b80030e8702n6797l0055j20154R86C7812e5021K5807
$$ y = [72420, 147044, 294702, -36876, 195969, 257955, 146155, 102006, 227426, -1748, 214902, 73467, 312024, 485068, 287395, 308742, 265618, 203315, 325501, 223478, 194355, 53375, -14332, -53833, 266898, -187392, 143866, 195467, 240640, 262712, 267024, 365657, 89843, -36097, 239992, 231569, 552453, 320172, -5268, -56849, 293755, 66391, 321025, 48300, 262697, 103011, 89819, 21495, 124203, 132086, 54126, 189950, 81435, 112477, -146428, 377367, 24224, -129512, 285643, 64241, 132720, 263176, 91463, 221777, -73750, 391006, 15253, 57699, -263854, 256928, -112374, -87165, -121840, 12328, 236998, -69297, -20410, 92776, -417003, -12279, -202615, -30053, -143588, 116184, 38086, -280030, -58702, -115499, -145554, -265708, -264722, 37812, -55021, -29214]
10268b9214j07412C11818I9086f4228B56117p0271p6265i9631A9413c7715r9387
10257a37102r6408D2517c50947C22960C7636J42530b04900j83554e4652C41310
10246B27086b69154J21236J4620K2247C8581c7662k4153B05464O8802H6526C0826
10234B03467L636D5692K29883b13814A33556d6568B22399a6344l77184a18328
10223b20853L9106D31866c10370b5343A03445J11086b05246n3721J5582J16894
10213a26491G9438J82032l6771B6095a76229b2128j08118L3796p0863M1671i116
10201a39712A34472b29665B68792b42451I9426a48275k12G3641b59665F6768J38079
10190B04847J00482j19335M6790b53893e0461B21288d00468R9655R1821E5303
$$ y = [-29214, -136626, 311818, 99086, -64228, 256117, 185846, 109581, -99631, 19413, -37715, -137102, -233510, 42517, -350947, 322960, 37636, 180166, -204900, -388454, -54652, 341310, 227086, -269154, -147918, -133298, -111051, 38581, -37662, -61815, 205464, 274266, 86526, 30826, 203467, 207103, 45692, 275575, -213814, 133556, -46568, 222399, -16344, -393528, -118328, -220853, -181747, 431866, -310370, -25343, 103445, 214531, -205246, -258967, -243385, -126491, 79438, 261470, 224699, 26095, -176229, -22128, -130246, -96450, -167313, -125642, -9116, -139712, 134472, -229665, 268792, -242451, 99426, -148275, -148487, 73641, -259665, 66768, 204847, 305329, 185994, 232784, -253893, -50461, 221288, -400468, -300813, -208992, 55303]
10179b7933j1883j91213i3044L5182l38482a48047j51930F7895c14532D82546
10168c06268A22801a99224j59642a8581i53k42141J9801C23864b1530F9452a25766
10156a82232B33098h4629b0638r5233k59405C5950g927m01031a86460C184c47614
10144G2952a68508j18995J34791B40277p6523b29116M4930e9445j12281d2513
10133b37213B12996n2744G742e1735C63592h7653I3963h1453A24921f4665A8494
10121G058A432b24945K0187N8038B2748a72059j74594G915a45011e7600j92516
10110b50116R3762C0195a50181A88012a28977J3304E8447a53182A08184L608a01427
10098h0418j7962F1128i5613m1407n6669o6643O8679K1118a4122j5544C1432a58132
$$ y = [-27933, -39816, -231029, -93044, -57862, -396344, -148047, -299977, 67895, -314532, 482546, -306268, 122801, -199224, -358866, -18581, -953, -243094, -223293, 323864, -21530, 69452, -125766, -182232, 233098, -84629, -20638, -115871, -375276, 35950, -7927, -408958, -186460, 3184, -347614, 72952, -168508, -287503, -152712, 240277, 163754, -229116, -184186, -59445, -171726, -42513, -237213, 212996, 160252, 7742, -51735, 363592, -87653, 93963, -81453, 124921, -64665, 18494, 7058, 1432, -224945, -204758, -146720, 22748, -172059, -346653, 7915, -145011, -57600, -250116, -156354, 30195, -150181, 188012, -128977, -115673, 58447, -153182, 108184, 111792, -101427, -80418, -98380, 61128, -95613, -137020, -193689, -260332, -191653, -170535, -14122, -29666, 31432, -158132]
10085i4362C6304J80512b9474j28640f6287J4457B55294a84052I7399a31326O050
10074a25276d5175A9967D73c33025n809A28704O1054A9150a07408c6795n8630
10063i5425d1959I1376A897d9331j95727o8537a4517C3359h8105H4475c9774o2380
10051a02154A04030a94900Q7881k42148a44315c5800E792b1052r4935L650N4498
10040e7839j94089A14782n1264b83758F6552b00234j96363A57172J46860a29687
10029a02180J4868D1715b01676l40039K09249b9633j8816B07494H7980a69737
10018d44914d3456D11655a92383B04341a61024J5201j86124J14561A87285b0565
10007G2695i7114j8573c9926C9740h7033B95252A16701K23355D9138a36839A06959
$$ y = [-94362, 36304, 216816, -29474, -158114, -66287, -51830, 255294, -184052, 97399, -131326, -125276, -45175, 19967, 473, -333025, -338834, 128704, 189758, 19150, -107408, -36795, -95425, -41959, 91376, 1897, -49331, -245058, -313595, -14517, 33359, -88105, 84475, -39774, -102154, 104030, -194900, -107019, -349167, -144315, -35800, 5792, -21052, -115987, -112337, -57839, -251928, 114782, 63518, -283758, 66552, -200234, -396597, 157172, 304032, -129687, -102180, -87312, 41715, -201676, -541715, -332466, -29633, -48449, 207494, 87980, -169737, -444914, -43456, 411655, -192383, 204341, -161024, -145823, -331947, -217386, 187285, -20565, 72695, -97114, -115687, -39926, 39740, -87033, 295252, 116701, 340056, 49138, -136839, 106959]
9995b96238C9172a82947O7104K8928o3742q1813g6802k18528m0562a03235A63189
9983A8098L6794K06256A11837i1023D0529a84360B08904f2802K6210H1301b81594
9971c300l63467J15430B0054J87112a74953N0702I1026b66164a12271E8702b78931
9959c7784A75289b14410j3362h0820k3171L7375A12439M3897a47035L7742e1542
9947a13501R703o5460L8072j10096a2737k4259j9793j03262K2412A19948a36104
9935a62038H96c23468a0776j18870l9768E1752k2281j106J42420k4541a08405
9923i7101m3766B21883G1325f07406b7288D3058J08310a74852l4386A16875a51395
9911b1635A5609a08316e3017n1470b906q9244N20d385q2308J2972A9313a35857
$$ y = [-296238, 39172, -182947, -115843, -86915, -150657, -232470, -76802, -295330, -335892, -103235, 163189, 18098, 54892, 261148, 111837, -91023, 40529, -184360, 208904, -62802, -36592, 81301, -281594, -3300, -366767, -251337, 20054, 207166, -174953, -124251, 91026, -266164, -112271, 58702, -278931, -37784, 175289, -214410, -227772, -80820, -103991, -66616, 112439, 156336, -147035, -109293, -51542, -113501, -103798, -169258, -131186, -241282, -12737, -36996, -56789, -160051, -137639, 119948, -136104, -162038, 896, -323468, -10776, -129646, -169414, 51752, 29471, 28365, 170785, 146244, -108405, -97101, -140867, 221883, 71325, -607406, -27288, 43058, 151368, -174852, -209238, 116875, -151395, -21635, 15609, -108316, -53017, -104487, -2906, -92150, -91630, -4385, -86693, -73721, 19313, -135857]
9898a25446i527A1669c65384d0326k15136K2936N2940k02550a24961j11133A31894
9886H0212a69445G7973a67912A12962a30026j33866G0048b08663E16c89C9176
9874E3836j2752b08210D7349n864b86594a24459k42423A92637c07408O8433a08508
9862A84956E623d20191J47697J2085j04269J31671M0717H6926b74981B5581Q731
9851C4312i2884k53176J42302J9891j11005a7088q027J773k71849H2513l3767
9840D8746O2708b21435A03989k4400a63899j31699a25480e4583o868m771j04731
9829a70953j90867c7116C8482K79620j25299a72776k82242C3302J48772R7341
9819B79415c45638D7183f5557k3819D3448a53412c3178E2520a03311B33795a9739
$$ y = [-125446, -9527, 11669, -365384, -40326, -255462, -232526, -179586, -382136, -124961, -236094, 131894, 80212, -169445, 77973, -167912, 112962, -130026, -263892, 70048, -208663, 516, -389, 39176, 53836, 41084, -208210, 47349, 41485, -286594, -124459, -366882, 192637, -307408, -238975, -108508, 184956, 5623, -420191, -272494, -260409, -364678, -233007, -192290, 86926, -274981, 25581, 34312, -92884, -346060, -203758, -183867, -294872, -17088, -25115, -23342, -295191, 82513, 48746, 111454, -221435, 103989, 79589, -163899, -295598, -125480, -54583, -61451, -66222, -170953, -361820, -37116, 38482, 318102, 192803, -172776, -455018, 33302, 182074, 279415, -345638, 47183, -65557, -89376, 43448, -153412, -33178, 52520, -103311, 233795, -19739]
9807a09895b3231J0285j067G5277B739R1260b25527A45003a27304b5744j12480
9796a38224A37728b83283b9578j26821d9964r1972M6558A54674i5985k6881k35488
9785c58354k81841C0309K34844n7524g4480j51925i2353o65B96402a45782l3901
9774a79683B46100n4187a51453m6169I9144i6333m7010A85154J52109A51652a4508
9762d74235O8104d9945j91289E3685c65517D7376a75853A60078p7339N6123J90354
9751C29216a96113k11715e1736k70836I7128m2700a25375N6700q5498j89863A39809
9739c03935H6114d09390N2409f3976a5632A29966a10184l6023j05317c8545B73411
9727b1912k07749A72738E4674i9558r5998i2021B81756a85324L8312j847O0498
$$ y = [-109895, -23231, -12946, -14013, 75277, 2739, 93999, -225527, 145003, -127304, -25744, -138224, 137728, -283283, -29578, -156399, -49964, -141936, -95378, 154674, -95985, -122866, -358354, -640195, 30309, 265153, 207629, -74480, -226405, -92353, -93018, 296402, -145782, -179683, 246100, 191913, -151453, -197622, 99144, -96333, -143343, 185154, 337263, 151652, -14508, -474235, -406131, -49945, -241234, 53685, -365517, 47376, -175853, 160078, 82739, 138862, 329216, -196113, -407828, -51736, -322572, 97128, 54428, -125375, -68675, -154173, -344036, 139809, -303935, 86114, -409390, -356981, -63976, -15632, 129966, -110184, -146207, -251524, -38545, 273411, -21912, -229661, 172738, 54674, -99558, -195556, -92021, 281756, -185324, -147012, -148859, -88361]
9716h8361k64298e2878k32701B380c4628D6190b92345A0362c64743J60181n3908
9705b58470l2421B72409g3787p5133g0234k33825d1011k23353A4947c39471m3340
9694c82811J28489i1008B99361a2235A13402a71250I3288D5956b4933F4385d1781
9682A77684c094l85710A28043l6168c53663A27000e4781J9172B122b87811G6430
9670g9994K3584j07318f8083b8720l7089l05569a03202J6153A06819a32980a0917
9658H5247r905B609c61749Q9137i8080B41746c60869f5176j54157B17754C3767
9646a9659m4852B95103d961B3410e3327j45250f2205A84313D7894a28823M3565
9635h5258I4825g6128A40622a28266k97198D5639J5187d25778l9140J38204D14
$$ y = [-88361, -352659, -52878, -285579, 2380, -34628, 46190, -292345, 10362, -364743, -204562, -258470, -290891, 272409, -73787, -148920, -70234, -304059, -41011, -264364, 14947, -339471, -382811, -254322, -91008, 299361, -12235, 113402, -171250, 93288, 45956, -24933, 64385, -41781, 177684, -3094, -388804, 128043, 91875, -353663, 127000, -54781, -35609, 2122, -287811, 76430, -79994, -56410, -163728, -68083, -28720, -65809, -371378, -103202, -87049, 106819, -132980, -10917, 85247, 75342, 2609, -361749, -272612, -98080, 241746, -360869, -65176, -219333, 217754, 33767, -19659, -64511, 295103, -4961, 23410, -53327, -198577, -62205, 184313, 47894, -128823, -85258, 94825, -76128, 140622, -128266, -425464, 45639, 60826, -425778, -464918, -326714, 414]
9623a42422n897D9968b84074J40339E779J5785K71799I512J02460c24503A25369
9611a09149j20244A28194E2367J9799a91565c4685j2103a4139j16509A40795e8196
9599A4948a84397q789E8468J45592b37854I9126b81852J13881B85372b52080A00289
9587a87286a1724j03517B90646j01555b21472R5416B65975H019a92374H2567g8145
9575f6218j42822P0382A49966m6991a86787E1866e1895k9730E0515c81550J12300
9564b69250a16843K3137j81361i4117A20227J23156o6813F3494g7518A4878N5272
9553G0150a49869A03989k9766c155F6741d2779n4533k47051a06649m2138I0890
9541F6738k1263d64353J47294B96061m7893d1690M229K811B01981b60218G216
$$ y = [-142422, -148319, 49968, -284074, -143735, 5779, 21564, 293363, 9512, 111972, -324503, 125369, -109149, -229393, 128194, 52367, 72166, -191565, -34685, -46788, -14139, -130648, 140795, -58196, 14948, -184397, -193186, 58468, 204060, -237854, 99126, -281852, -167971, 285372, -252080, 100289, -187286, -11724, -115241, 290646, 189091, -221472, -126056, 265975, 8019, -192374, 82567, -78145, -66218, -209040, -138658, 149966, 102975, -186787, 51866, -51895, -81625, 50515, -381550, -269250, -116843, -93706, -275067, -94117, 120227, 243383, 176570, 63494, -77518, 14878, 70150, -149869, 103989, 74223, -3155, 66741, -42779, -97312, -344363, -106649, -148787, 90890, 66738, 45475, -464353, -317059, 296061, 248168, -41690, -37461, -34650, 201981, -260218, 7216]
9529c8508l1770j66196E068a99511J3592K0032k46845f5246A70512j9094E6572
9517b40194a02516j24868i703k4978j45817K5108C4092J26847J17620a09618j88596
9506b98214a30555N8406B59354a98703K6457K7938L1867L0343B27738c57643a65112
9494A01253e1921k2021j40091b5106k31619D9093g7150j44500g5481j14011C8545
9482a13258e5166j85516j12516c5569k19827a25476l9288P291r872H0435g7068
9470b27j14295e3545k77791G8384a05524D2735E546c3030n8162L4469N768K28
9458e0727A2071P825R0805c10427d5752J2627B21993f9542j63794C6122A1105
9446A11916O6895o6918c25527J55318B15255B3874h7142j19016e0006A36122d1667
$$ y = [-38508, -70278, -236474, 5068, -199511, -185919, -165887, -412732, -65246, 170512, 151418, 56572, -240194, -102516, -227384, -9703, -34681, -180498, -155390, 34092, 160939, 278559, -109618, -298214, -130555, -72149, 259354, -198703, -172246, -144308, -112441, -82098, 227738, -357643, -165112, 101253, -51921, -73942, -214033, -25106, -256725, 49093, -77150, -221650, -75481, -189492, 38545, -113258, -55166, -240682, -353198, -35569, -255396, -125476, -164764, -157473, -167345, 80435, -77068, -227, -114522, -53545, -331336, 78384, -105524, 42735, 5546, -33030, -91192, -56723, -50955, -50727, 12071, 19896, 110701, -310427, -45752, -33125, 221993, -69542, -233336, 36122, 11105, 111916, 178811, 111893, -325527, -170209, 215255, 23874, -87142, -206158, -50006, 136122, -41667]
9434c66567B6320d34849a4545j18551B1894f2120j69607A83665F3493d45895a16059
9422c53560a36658B84002d7264B15887D6078j1040A6370a01803I0527J43159j05366
9411A28320n8596P741j1553g5938B7903d8675B13127b74092G9270a47793J8003
9400a29790l9516A81177a16095j9059r1542e7021A31686b10786D1012b09646A28833
9388A5164J06764a1253q9490A2092M4891O216b94451a13938p9297B72462a79447
9376d1685C400K93924c79800j02631f4850k4903C15891i495A34017a45986k1299
9365a67285n9968Q9489e3202K1915l19723B48987d5069k32296b1393n2103m9503
9354a22999m6175B73445e7719F1208J12771b27766C4252a96378F7564M1854B0621
$$ y = [-366567, 26320, -434849, -14545, -133096, 21894, -62120, -231727, 183665, 63493, -445895, -116059, -353560, -136658, 284002, -47264, 215887, 46078, 35038, 16370, -101803, 90527, 233686, 128320, 69724, 77465, 65912, -75938, 27903, -48675, 213127, -274092, 79270, -147793, -129790, -169306, 181177, -116095, -135154, -226696, -57021, 131686, -210786, 41012, -209646, 128833, 15164, 121928, -11253, -100743, 12092, 56983, 63199, -294451, -113938, -193235, 272462, -179447, -41685, 3400, 297324, -379800, -482431, -64850, -89753, 315891, -9495, 134017, -145986, -167285, -227253, -137764, -53202, -31287, -351010, 248987, -45069, -277365, -21393, -73496, -122999, -169174, 273445, -57719, 61208, 173979, -227766, 34252, -196378, 67564, 109418, 20621]
9342a87165A37315e1327j78081F1017c27108A68354a3107m987A23428a35005A6734
9330f9231c031q2240e135l7825A73010a27784j00443a05062k4518j1918A28592
9318b33601I5537h383k29665c6938C9462a99988b4069j19547K9966k32569g1818
9306a82085p5732b7258j97504D330c13309A55773a75404d0978B22476a02003o377
9295a08380J6209A45599b72989L3785O9947L0066B34821C2862J78882b90558c8712
9283a21529A51180d220n7239k40899g1178A33835a47418A5081a39918O2423a3192
9271c8884m1029J6663b1312q7706A2526b7345k39281D736K40847A13888l4132
9260G9756B6745g5201l1708A53846d5043j20955J2611A2577b85775c1610A76540
$$ y = [-187165, 137315, -51327, -229408, 61017, -327108, 168354, -13107, -18094, 123428, -135005, 16734, -69231, -3031, -85271, -5135, -42960, 173010, -127784, -228227, -105062, -129580, -141498, 128592, -233601, 95537, -8383, -238048, -36938, 39462, -199988, -24069, -143616, -113650, -346219, -71818, -182085, -257817, -27258, -224762, 4330, -313309, 155773, -175404, -40978, 222476, -102003, -108380, -92171, 145599, -272989, -239204, -169257, -139191, 234821, 32862, 211744, -290558, -38712, -121529, 151180, -4220, -61459, -302358, -71178, 133835, -147418, 15081, -139918, -77495, -13192, -38884, -79913, -63250, -21312, -109018, 12526, -27345, -266626, 4736, 245583, 113888, 79756, 26745, -75201, -106909, 153846, -45043, -165998, -153387, 12577, -285775, -31610, 176540]
9248A29069n4684a50347j31500A53653b78414g3736l74213O2324C11305a81517
9237A32317b32132a14897j17378E0239r549h7011m4026c5530A74411a27993k3833
9226a51826A14023d1627j14394e8744j60722C841J37000J62874i5388m8456j06692
9215b50536P921e1883k89573a0129B90375a55382D26O6809R4223h8768j50555
9204b39323b3291n8685r5983G0341P0007b8917D42461C194a17991f486j70088
9193a76574E3110a58972l7648R6839l19466A8901c8306J6694a0594j17441ek44508
9181b44513A64589E2326i2480F2922d8654C6142b27717j7852a3131k4186j46001
9170a83318k670L3318A41115E4220j0892J23483a24303k8683L1706j06271g4612
$$ y = [129069, 74385, -150347, -281847, 153653, -278414, -73736, -447949, -385625, 311305, -181517, 132317, -232132, -114897, -232275, 50239, 40690, -87011, -131037, -35530, 174411, -127993, -151826, 114023, -41627, -156021, -58744, -219466, 3841, 140841, 303715, -95388, -143844, -250536, -242615, -51883, -341456, -10129, 290375, -155382, 426, 67235, 161458, -88768, -239323, -23291, -81976, -177959, 70341, 140348, -28917, 442461, 3194, -117991, -6486, -176574, 53110, -158972, -196620, -99781, -419247, 18901, -38306, -21612, -10594, -128035, -5, -244513, 164589, 52326, -92480, 62922, -48654, 36142, -227717, -245569, -13131, -37317, -183318, -185988, -152670, 141115, 54220, 43328, 166811, -124303, -152986, -121280, -227551, -74612]
9158A97855c96437e7962n8388l57276g7423j75972j49855d9624C21188b88166
9147c1980k36817K2031L5069R950A95452a10800j50246f2416A9708k688c2655
9135b80587e2880p6891j4296j78037O9884r2338O8558K7134c7589k82681Q5207
9124b35063A75215b65775B78018a19669B22011l5137a80780l6478j8010C38742
9113a03520k5642a7849p435A01687F762K52814l2727c30783B26751R127h6427
9101D0463c5952k4829A00654c16763e5892k31228A24760b25928O0817d1573F7811
9089f61k40205R2149A95066D5773e0904n49860A62869b12637j67630p0181a40846
9077A51975B9373N269f056r7800L2213k82260a40441p8820R8069B3981d3234D4207
$$ y = [197855, -396437, -57962, -116350, -473626, -77423, -253395, -403250, -49624, 321188, -288166, -31980, -268797, -246766, -211697, -201747, 195452, -110800, -261046, -62416, 19708, 17020, -32655, -280587, -52880, -129771, -144067, -322104, -252220, -344558, -276000, -248866, -37589, -320270, -235063, 175215, -265775, 278018, -119669, 222011, 186874, -180780, -217258, -235268, 338742, -103520, -129162, -17849, -25284, 101687, 6762, 259576, 226849, -330783, 226751, 235878, -86427, 40463, -35952, -60781, 100654, -316763, -55892, -287120, 124760, -225928, -165111, -41573, 67811, -661, -240866, -148717, 195066, 45773, -50904, -600764, 162869, -212637, -380267, -450448, -140846, 151975, 29373, 34642, -6056, -103856, -71643, -353903, -140441, -219261, -121192, 23981, -43234, 44207]
9064E6478c77382N2306J54279d3006n4190P907k82942D8619M0258a98742O9494
9053a29248e9649a9361k10381j17797J03891A1387d5247R312C0400a51234L862
9042a47372a9337k04416j66751A22708a64328o4629C91741J26262D4740J02530
9032A47270h4030I0044a41l15198H818J229c17776C1224a46125B21586r4462d7323
9019A97814a52589G0378b09504D98017h332p8463p6725G2419M5288l6880M897
9008H5724l8860h6001j4192n3143e8042h722A82876D2212J88370c54328A11326
8996A21977l8201c62221i5981A24678P1559a70407Q2881A40685a15261o7082b8954
8984b26590D6040a51414r99c5520B29260G2629J4481e4493k64944a27425H3475
$$ y = [56478, -377382, -325076, -170797, -43006, -97196, -89289, -372231, 48619, 88877, -198742, -129248, -59649, -19361, -229742, -347539, -243648, 11387, -45247, -35935, 30400, -151234, -147372, -19337, -223753, -390504, 122708, -164328, -228957, 391741, 518003, 44740, 147270, -84030, 90044, -141, -315339, 8818, 10047, -317776, 31224, -146125, 221586, 127124, -47323, 197814, -152589, 70378, -209504, 498017, -8332, -86795, -163520, 72419, 117707, 80827, 85724, 46864, -86001, -100193, -153336, -58042, -8722, 182876, 42212, 230582, -354328, 111326, 121977, 83776, -362221, -95981, 124678, 196237, -170407, -87526, 140685, -115261, -182343, -28954, -226590, 46040, -151414, -152413, -35520, 229260, 72629, 87110, -54493, -319437, -127425, 83475]
8972a36756A00749L4378h1897H2421d8139J7369k69064g8905A63997b1886q4439
8961a06325j72869A40737f5742j3180c3459j95343C00241c24044F951c05744I8444
8949f98452f4535j33514A75992a19296D3229c39205E9107A1216L8344f7947k8298
8938i6245L1278q0578A09995c00815B42543c26710C04107A15607b95905O7074
8928b28831J09515J6208c0320a3866o590A78597c93797B09929d5706p6814D67025
8916a17591C52598I7908J81403A38909n4152J7859J81422J80879K49312k85267
8906D28962Q06599N73584J955291M320737k813839k457451A238893l10027D31787
8896C19973A22200K862J61449A35244m8489h36B20840q0763C15N7933i0239j11379
$$ y = [-136756, 100749, 135127, -81897, 82421, -48139, -30770, -299834, -78905, 163997, -21886, -106325, -279194, 140737, -65742, -78922, -33459, -228802, 300241, -324044, 6951, -305744, 98444, -698452, -64535, -198049, 175992, -119296, 43229, -339205, 59107, 11216, 49560, -67947, -96245, -64967, -145545, 109995, -300815, 242543, -326710, 304107, 115607, -295905, -228831, -119316, -103108, -30320, -13866, -20456, 178597, -393797, 209929, -45706, -122520, 467025, -117591, 352598, 97908, 279311, 138909, 84757, 102616, 284038, 464917, 714229, 428962, 1235561, 1809145, 3764436, 8085173, 5271334, 2813883, 1238893, 928866, 431787, 319973, 122200, 125062, 286511, 135244, 86755, -836, 220840, 140077, 315, 58248, -90239, -201618]
8884b01618M6177G1218c13837C24202j27062c6547j63370A58508p8234e0585k0181
8873g0766B26100a50576f2162H9837c09885J51605N7229C3523a14700o3042h0610
8861a52311E173K35144b50798p8321a08504C952J41513J05530I1861d2895k7M928
8849c7994j28013a8810j7712A3532a16995l6209E649J99992k3225b04309e9391
$$ y = [-201618, -155441, 71218, -313837, 324202, 197140, -36547, -199917, 158508, 80274, -50585, -70766, 226100, -150576, -62162, 89837, -309885, -158280, -101051, 33523, -114700, -177742, -80610, -152311, 5173, 240317, -250798, -329119, -108504, 3952, 145465, 250995, 91861, -42895, -42922, -37994, -166007, -18810, -36522, 13532, -116995, -153204, 5649, 205641, 182416, -204309, -59391]
$$ [...]
##END NTUPLES=NMR SPECTRUM
##END=
