
##TITLE=AC1211_MCiAH12042_5946985_C7LGHNSIQK
##JCAMPDX= 6.0         $$ Bruker NMR JCAMP-DX V2.0
##DATA TYPE= NMR SPECTRUM
##DATA CLASS= NTUPLES
##ORIGIN= BRUKER
##OWNER= Administrator
$$ 1.72 TOPSPIN		Version 2.1
$$ 2012-04-11 03:54:49.156 -0500  Administrator@TOPSPIN
$$ Compression mode = diff/dup
##.OBSERVE FREQUENCY= 400.13188235
##.OBSERVE NUCLEUS= ^1H
##.ACQUISITION MODE= SIMULTANEOUS (DQD)
##.ACQUISITION SCHEME= undefined
##.AVERAGES= 64
##.DIGITISER RES= 22
##SPECTROMETER/DATA SYSTEM= spect
##.PULSE SEQUENCE= noesygpps1d.comp
##.SOLVENT NAME= COFFEE_meoh
##.SHIFT REFERENCE= INTERNAL, COFFEE_meoh, 1, 14.96855
##AUDIT TRAIL= $$ (NUMBER, WHEN, WHO, WHERE, PROCESS, VERSION, WHAT)
$$ ##TITLE= Audit trail, TOPSPIN		Version 2.1
$$ ##JCAMPDX= 5.01
$$ ##ORIGIN= Bruker BioSpin GmbH
$$ ##OWNER= Administrator
$$ $$ C:\Bruker\TOPSPIN/data/COFFEE/nmr/AC1211_MCiAH12042_5946985_C7LGHNSIQK/12/pdata/1/auditp.txt
$$ ##AUDIT TRAIL=  $$ (NUMBER, WHEN, WHO, WHERE, PROCESS, VERSION, WHAT)
(   1,<2012-04-11 03:54:44.421 -0500>,<Administrator>,<TOPSPIN>,<go>,<TOPSPIN 2.1>,
      <created by zg
	started at 2012-04-11 03:43:12.859 -0500,
	POWCHK enabled, PULCHK disabled,
       configuration hash MD5:
       1A 1E CE 29 27 FD 77 03 67 4E F0 E3 C4 B2 CB 90
       data hash MD5: 64K
       0A 26 54 9A 03 9E 4D 2A C7 70 D8 F4 8F FC 25 92>)
(   2,<2012-04-11 03:54:47.187 -0500>,<Administrator>,<TOPSPIN>,<proc1d>,<TOPSPIN 2.1>,
      <Start of raw data processing
       efp LB = 0.3 FT_mod = 6 PKNL = 1 PHC0 = 0 PHC1 = 0 SI = 128K 
       data hash MD5: 128K
       CB BD AF 02 CE D8 8D 32 33 97 5F 19 03 E5 AA D6>)
(   3,<2012-04-11 03:54:48.421 -0500>,<Administrator>,<TOPSPIN>,<proc1d>,<TOPSPIN 2.1>,
      <pk PHC0 = 31.63513 PHC1 = 0 
       data hash MD5: 128K
       90 4D E7 E0 81 FF 62 0F 61 F3 54 53 F2 D3 93 C9>)
(   4,<2012-04-11 03:54:48.656 -0500>,<Administrator>,<TOPSPIN>,<proc1d>,<TOPSPIN 2.1>,
      <abs ABSG = 1 
       data hash MD5: 128K
       22 BB 89 75 48 09 85 E0 AF CF E9 D7 DE 67 D0 8F>)
(   5,<2012-04-11 03:54:48.734 -0500>,<Administrator>,<TOPSPIN>,<proc1d>,<TOPSPIN 2.1>,
      <abs ABSG = 2 
       data hash MD5: 128K
       74 0E 01 8C 61 DE B5 BD 4A 4F 68 15 E0 D4 1E 64>)
(   6,<2012-04-11 03:54:48.906 -0500>,<Administrator>,<TOPSPIN>,<proc1d>,<TOPSPIN 2.1>,
      <abs ABSG = 3 
       data hash MD5: 128K
       CD 99 F4 B3 C3 4F 98 6E 29 97 9C 01 8E E5 43 78>)
(   7,<2012-04-11 03:54:49.015 -0500>,<Administrator>,<TOPSPIN>,<proc1d>,<TOPSPIN 2.1>,
      <abs ABSG = 4 
       data hash MD5: 128K
       BF 12 CB 2E CD F1 CF 55 22 C7 27 32 65 52 14 92>)
(   8,<2012-04-11 03:54:49.078 -0500>,<Administrator>,<TOPSPIN>,<proc1d>,<TOPSPIN 2.1>,
      <abs ABSG = 5 
       data hash MD5: 128K
       95 6B F0 40 80 51 B4 EF 64 BF F1 CB 08 F1 8E A0>)
$$ ##END=
$$ 
$$ $$ hash MD5
$$ $$ 86 9D 56 28 15 BC 2A 94 71 BC 1C C7 F6 F2 67 C2
##$RELAX= 
##$RELAX= 
##$RELAX= 
##$RELAX= 
##$RELAX= 
##$RELAX= 
##$RELAX= 
##$RELAX= 
$$ Bruker specific parameters
$$ [...]
##$TP07= 0
##$TPNAME0= <>
##$TPNAME1= <>
##$TPNAME2= <>
##$TPNAME3= <>
##$TPNAME4= <>
##$TPNAME5= <>
##$TPNAME6= <>
##$TPNAME7= <>
##$TPOAL= (0..7)
0.5 0.5 0.5 0.5 0.5 0.5 0.5 0.5
##$TPOFFS= (0..7)
0 0 0 0 0 0 0 0
##$TUNHIN= 0
##$TUNHOUT= 0
##$TUNXOUT= 0
##$USERA1= <user>
##$USERA2= <user>
##$USERA3= <user>
##$USERA4= <user>
##$USERA5= <user>
##$V9= 5
##$VALIST= <valist>
##$VCLIST= <CCCCCCCCCCCCCCC>
##$VD= 0
##$VDLIST= <DDDDDDDDDDDDDDD>
##$VPLIST= <PPPPPPPPPPPPPPP>
##$VTLIST= <TTTTTTTTTTTTTTT>
##$WBST= 1024
##$WBSW= 4
##$XGAIN= (0..3)
0 0 0 0
##$XL= 0
##$YL= 0
##$YMAX_a= 12749404
##$YMIN_a= -5923165
##$ZGOPTNS= <>
##$ZL1= 120
##$ZL2= 120
##$ZL3= 120
##$ZL4= 120
##$ABSF1= 14.96855
##$ABSF2= -5.583981
##$ABSG= 5
##$ABSL= 3
##$ALPHA= 0
##$AQORDER= 0
##$ASSFAC= 0
##$ASSFACI= 0
##$ASSFACX= 0
##$ASSWID= 0
##$AUNMP= <proc_prof1d_extract.lims>
##$AXLEFT= 0
##$AXNAME= <>
##$AXNUC= <1H>
##$AXRIGHT= 0
##$AXTYPE= 0
##$AXUNIT= <>
##$AZFE= 0.1
##$AZFW= 0.1
##$BCFW= 0
##$BC_mod= 0
##$BYTORDP= 0
##$COROFFS= 0
##$CY= 15
##$DATMOD= 1
##$DC= 0
##$DFILT= <>
##$DTYPP= 0
##$F1P= 0
##$F2P= 0
##$FCOR= 0.5
##$FTSIZE= 131072
##$FT_mod= 6
##$GAMMA= 0
##$GB= 0
##$INTBC= 1
##$INTSCL= 1
##$ISEN= 128
##$LB= 0.3
##$LEV0= 0
##$LPBIN= 0
##$MAXI= 10000
##$MC2= 0
##$MEAN= 0
##$ME_mod= 0
##$MI= 0
##$NCOEF= 0
##$NC_proc= -3
##$NLEV= 6
##$NOISF1= 0
##$NOISF2= 0
##$NSP= 0
##$NTH_PI= 0
##$NZP= 0
##$OFFSET= 14.96855
##$PC= 1
##$PHC0= 31.63513
##$PHC1= 0
##$PH_mod= 1
##$PKNL= yes
##$PPARMOD= 0
##$PPDIAG= 0
##$PPIPTYP= 0
##$PPMPNUM= 2147483647
##$PPRESOL= 1
##$PSCAL= 4
##$PSIGN= 0
##$PYNMP= <proc.py>
##$REVERSE= no
##$SF= 400.130004827803
##$SI= 131072
##$SIGF1= 0
##$SIGF2= 0
##$SINO= 400
##$SIOLD= 131072
##$SPECTYP= <>
##$SREGLST= <1H.CDCl3>
##$SSB= 0
##$STSI= 131072
##$STSR= 0
##$SW_p= 8223.68421052632
##$SYMM= 0
##$S_DEV= 0
##$TDeff= 65536
##$TDoff= 0
##$TI= <>
##$TILT= no
##$TM1= 0
##$TM2= 0
##$TOPLEV= 0
##$USERP1= <user>
##$USERP2= <user>
##$USERP3= <user>
##$USERP4= <user>
##$USERP5= <user>
##$WDW= 1
##$XDIM= 131072
##$YMAX_p= 500998058
##$YMIN_p= -488215769
##$CURPLOT= <Network HP LaserJet P1505>
##$CURPRIN= <$Network HP LaserJet P1505>
##$DFORMAT= <normdp>
##$LAYOUT= <+/1D_H.xwp>
##$LFORMAT= <normlp>
##$PFORMAT= <normpl>
##$SURQMSG= 1
$$ End of Bruker specific parameters
$$ ---------------------------------
##NTUPLES= NMR SPECTRUM
##VAR_NAME=  FREQUENCY,     SPECTRUM/REAL,   SPECTRUM/IMAG
##SYMBOL=    X,             R,               I
##VAR_TYPE=  INDEPENDENT,   DEPENDENT,       DEPENDENT
##VAR_FORM=  AFFN,          ASDF,            ASDF
##VAR_DIM=   131072,        131072,          131072
##UNITS=     HZ,            ARBITRARY UNITS, ARBITRARY UNITS
##FACTOR=    0.0627417313425165, 1,          1
##FIRST=     8223.62146879498, 3231,         -79165
##LAST=      0,             5732,            -80765
##MIN=       0,             -488215769,      0
##MAX=       8223.62146879498, 500998058,    0
$$ Real data points
##PAGE= N=1
##DATA TABLE= (X++(R..R)), XYDATA
$$ [...]
61772B571457q58J717M436O985Q823R631R917J0889J3227J6189J8586K0400K2704
$$ 2571457 2570599 2572316 2576752 2583737 2592560 2602191 2612108 2622997 2636224 2652413 2670999 2691399 2714103
61759B714103K6095L0033L3894L7827M2272M7140N1887N6231O0621O5980P2671
$$ 2714103 2740198 2770231 2804125 2841952 2884224 2931364 2983251 3039482 3100103 3166083 3238754
61748C238754P9739Q5797R0985R7131J05471J15098J24574J34084J44708J56433
$$ 3238754 3318493 3404290 3495275 3592406 3697877 3812975 3937549 4071633 4216341 4372774
61738D372774J68393J80459J93017K05755K18464K32590K49874K69627K89573
$$ 4372774 4541167 4721626 4914643 5120398 5338862 5571452 5821326 6090953 6380526
61729F380526L09628L32491L59922L90807M24000M60844N03322N51427O04228
$$ 6380526 6690154 7022645 7382567 7773374 8197374 8658218 9161540 9712967 10317195
61720A0317195O62277P26999P98508Q75684R57881J044975J136101J229769J324712
$$ 10317195 10979472 11706471 12504979 13380663 14338544 15383519 16519620 17749389 19074101
61711A9074101J418678J505895J576838J620699J626806J583344J476699J295222
$$ 19074101 20492779 21998674 23575512 25196211 26823017 28406361 29883060 31178282
61703C1178282J035871P08420L34047n9744m44016p92022j083062j306333j461654
$$ 31178282 32214153 32922573 33256620 33196876 32752860 31960838 30877776 29571443 28109789
61694B8109789j555752j597563j596466j562502j505314j432184j348142j257768
$$ 28109789 26554037 24956474 23360008 21797506 20292192 18860008 17511866 16254098
61686A6254098j165467j074004r84501q98339q17745p44045o76906o15917n61497
$$ 16254098 15088631 14014627 13030126 12131787 11314042 10569997 9893091 9277174 8715677
61677H715677n13406m69823m29099l91514l58077l28423l01105k75409k51857
$$ 8715677 8202271 7732448 7303349 6911835 6553758 6225335 5924230 5648821 5396964
61668E396964k31126k13266j97594j82745j67396j51781j38011j27951j21005
$$ 5396964 5165838 4952572 4754978 4572233 4404837 4253056 4115045 3987094 3866089
61659C866089j14737j07500r9662r2431q6270q0746p5349p0140o5622o2163n9578
$$ 3866089 3751352 3643852 3544190 3451759 3365489 3284743 3209394 3139254 3073632 3011469 2951891
61648B951891n7322n4998n2456m9695m7003m5022m4118m3807m3255m2202m1020
$$ 2951891 2894569 2839571 2787115 2737420 2690417 2645395 2601277 2557470 2514215 2472013 2430993
61637B430993m0116l9785m0190m0744l9996l7202l3689l1528l1096l1007l0148
$$ 2430993 2390877 2351092 2310902 2270158 2230162 2192960 2159271 2127743 2096647 2065640 2035492
61626B035492k8428k5882k2779k0529k0541k1777k1416j8617j5718j4707j4473
$$ 2035492 2007064 1981182 1958403 1937874 1917333 1895556 1874140 1855523 1839805 1825098 1810625
61615A810625j3014j0756r633r824r504p673n520m720n522o890p853q245q447
$$ 1810625 1797611 1786855 1777222 1767398 1757894 1750221 1744701 1739981 1734459 1727569 1719716 1711471 1703024
61602A703024q727q910q712q188p627p257p346q002q527p751n868m944o333q533
$$ 1703024 1694297 1685387 1676675 1668487 1660860 1653603 1646257 1638255 1629728 1621977 1616109 1611165 1604832 1596299
61588A596299r268q822r023r665q774o281m332l433j535J847L978L130J641K255
$$ 1596299 1587031 1578209 1569186 1559521 1550747 1544466 1540134 1536701 1535166 1537013 1540991 1544121 1545762 1548017
61574A548017L951M160L215L494N410P198P992Q356Q292P234N875N634O328O425
$$ 1548017 1551968 1556128 1559343 1562837 1568247 1575445 1583437 1591793 1600085 1607319 1613194 1618828 1625156 1631581
61560A631581N531M638L925K426R4j706k294k658l803n464o920q096r328j0843
$$ 1631581 1637112 1641750 1645675 1648101 1648195 1646489 1644195 1641537 1637734 1632270 1625350 1617254 1607926 1597083
61546A597083j2604j4050j4144j2571j0654j0087j0893j1561j0982r313p251n475
$$ 1597083 1584479 1570429 1556285 1543714 1533060 1522973 1512080 1500519 1489537 1480224 1472973 1467498
61534A467498m586m564m430l307j532J10J714L798O086P987R747J1794J3453J3949
$$ 1467498 1462912 1458348 1453918 1450611 1449079 1449189 1450903 1454701 1460787 1468774 1478521 1490315 1503768 1517717
61520A517717J4328J6628K0975K5181K7508K8452K9441L1109L3398L6223L9268
$$ 1517717 1532045 1548673 1569648 1594829 1622337 1650789 1680230 1711339 1744737 1780960 1820228
61509A820228M1869M3658M4924M6059M7030M7569M7529M7047M6545M6272M5653
$$ 1820228 1862097 1905755 1950679 1996738 2043768 2091337 2138866 2185913 2232458 2278730 2324383
61498B324383M3633M0104L6253L3111L0592K8539K7448K7136K5942K2737J8742
$$ 2324383 2368016 2408120 2444373 2477484 2508076 2536615 2564063 2591199 2617141 2639878 2658620
61487B658620J5777J3609J0733O934L133o39m913q825j0786j1081j1613j2928
$$ 2658620 2674397 2688006 2698739 2705673 2708806 2708167 2703254 2694429 2683643 2672562 2660949 2648021
61475B648021j3695j3359j2860j2062r013l099K997O227O828P543J0203J4533
$$ 2648021 2634326 2620967 2608107 2596045 2587032 2583933 2586930 2593157 2599985 2607528 2617731 2632264
61463B632264J9726K5672L2556M0160M7848N5121O2205P0023P9239Q9495J00074
$$ 2632264 2651990 2677662 2710218 2750378 2798226 2853347 2915552 2985575 3064814 3154309 3254383
61452C254383J10981J22831J36038J50893J67832J86468K04905K21561K37474
$$ 3254383 3365364 3488195 3624233 3775126 3942958 4129426 4334331 4555892 4793366
61443D793366K55198K75352K95774L14092L29173L39572L42525L35655L18506
$$ 4793366 5048564 5323916 5619690 5933782 6262955 6602527 6945052 7280707 7599213
61434G599213K91504K54460K07334J51892R1933L2099k3688p3578j17920j57141
$$ 7599213 7890717 8145177 8352511 8504403 8596336 8628435 8604747 8531169 8413249 8256108
61424H256108j89595k12580k25573k30925k31045k26498k17359k04848j90542
$$ 8256108 8066513 7853933 7628360 7397435 7166390 6939892 6722533 6517685 6327143
61415F327143j75117j58721j41627j23896j05452q7027o9752n3312l6190j8562
$$ 6327143 6152026 5993305 5851678 5727782 5622330 5535303 5465551 5412239 5376049 5357487
61405E357487l082Q637J8674K9992M2295N2797O0386O6555P2310P6418P7478P6167
$$ 5357487 5354405 5363042 5381716 5411708 5454003 5506800 5567186 5633741 5706051 5782469 5859947 5936114
61393E936114P4428P3299P2329P0720O8447O6366O5450O5847O6713O7123O6988
$$ 5936114 6010542 6083841 6156170 6226890 6295337 6361703 6427153 6493000 6559713 6626836 6693824
61382F693824O7073O8169P0213P1857P1066O6859O0606N4747M9898M4060L5276
$$ 6693824 6760897 6829066 6899279 6971136 7042202 7109061 7169667 7224414 7274312 7318372 7353648
61371G353648K4194J3253L970m036j1771j9615k7289l4345m0554m6027n0742n3901
$$ 7353648 7377842 7391095 7395065 7391029 7379258 7359643 7332354 7298009 7257455 7211428 7160686 7106785
61359G106785n4319n1861m7755m3067l7678l1437k5300k0148j5262r551l922n78
$$ 7106785 7052466 7000605 6952850 6909783 6872105 6840668 6815368 6795220 6779958 6770407 6766485 6765907
61347F765907J84O26K187L218J432k471n546o452o735p965r314q843n823o29O853
$$ 6765907 6766091 6766717 6768904 6772122 6773554 6771083 6765537 6759085 6752350 6744385 6735071 6726228 6720405 6719776 6726629
61332F726629J7280L0580M5922O2936Q1894J02643J24457J47155J71267J96768
$$ 6726629 6743909 6774489 6820411 6883347 6965241 7067884 7192341 7339496 7510763 7707531
61322G707531K22682K48287K73520K97647L18949L36464L50621L60805L63472
$$ 7707531 7930213 8178500 8452020 8749667 9068616 9405080 9755701 10116506 10479978
61313A0479978L54430L32417K98977K55568K02841J42713P9267J6708m2638r8108
$$ 10479978 10834408 11166825 11465802 11721370 11924211 12066924 12146191 12162899 12120261 12022153
61303A2022153j49493j96263k37242k70995k97308l17918l34752l47519l54240
$$ 12022153 11872660 11676397 11439155 11168160 10870852 10552934 10218182 9870663 9516423
61294I516423l54212l49272l41948l33295l22789l09436k92792k73580k53331
$$ 9516423 9162211 8812939 8470991 8137696 7814907 7505471 7212679 6939099 6685768
61285F685768k32902k11848j90048j69125j50626j33432j15045r5422p7318o2323
$$ 6685768 6452866 6241018 6050970 5881845 5731219 5597787 5482742 5387320 5310002 5247679
61275E247679m8680l4066j8749m619P558J8472K8617L7748M5694N2646N8678O3402
$$ 5247679 5198999 5164933 5146184 5141565 5149123 5167595 5196212 5233960 5279654 5332300 5390978 5454380
61263E454380O6156O6552O5148O3276O1616N9358N5713N1593M8458M5835M1849
$$ 5454380 5520536 5587088 5652236 5715512 5777128 5836486 5892199 5943792 5992250 6038085 6079934
61252F079934L6231L0824K6711K2676J7282J0779M107k541r316j6203k3571l1889
$$ 6079934 6116165 6146989 6173700 6196376 6213658 6224437 6228544 6226003 6216687 6200484 6176913 6145024
61240F145024m0298m7021n1878n6656o2257o7388p1181p4939p9602q3322q3738
$$ 6145024 6104726 6057705 6005827 5949171 5886914 5819526 5748345 5673406 5593804 5510482 5426744
61229E426744q1348p8576p6426p4010p0487o5585n8912n0656m2457l5866l0481
$$ 5426744 5345396 5266820 5190394 5116384 5045897 4980312 4921400 4870744 4828287 4792421 4761940
61218D761940k5292k1051j9309j9663k0172k0352k1460k3614k4856k3781k1408
$$ 4761940 4736648 4715597 4696288 4676625 4656453 4636101 4614641 4591027 4566171 4542390 4520982
61207D520982j9626j9017j8905j8365j6554j3058q430l573J817R196J9159L0466
$$ 4520982 4501356 4482339 4463434 4445069 4428515 4415457 4407027 4403454 4405271 4414467 4433626 4464092
61195D464092M1732N3174O5937Q0276R5135J09296J22316J34306J45093J53698
$$ 4464092 4505824 4558998 4624935 4705211 4800346 4909642 5031958 5166264 5311357 5465055
61185E465055J58695J59128J54709J44802J27699J01842O7767K8205j3685n5507
$$ 5465055 5623750 5782878 5937587 6082389 6210088 6311930 6379697 6407902 6394217 6338710
61175F338710r5134j30130j58449j79441j93763k02470k06383k05979k01580j93673
$$ 6338710 6243576 6113446 5954997 5775556 5581793 5379323 5172940 4966961 4765381 4571708
61165D571708j83212j71586j60105j49421j39322j29043j17875j05747r3433q2298
$$ 4571708 4388496 4216910 4056805 3907384 3768062 3639019 3521144 3415397 3321964 3239666
61155C239666p3574o7431o2511n6850m9736m2345l6063l0504k4005j5936p553
$$ 3239666 3166092 3098661 3036150 2979300 2929564 2887219 2851156 2820652 2796647 2780711 2773158
61144B773158m91M749Q641J1776J4509J6712J7563J6343J3657J1070R272P492
$$ 2773158 2772667 2777416 2786057 2797833 2812342 2829054 2846617 2862960 2876617 2887687 2896959 2904451
61132B904451M957J892j440n410r927j3718j5925j7647k0628k4810k8499l0770
$$ 2904451 2909408 2911300 2909860 2904450 2894523 2880805 2864880 2847233 2826605 2801795 2773296 2742526
61120B742526l2529l4884l7438l8724l8025l6372l5619l6561l8169l8912l8475
$$ 2742526 2709997 2675113 2637675 2598951 2560926 2524554 2488935 2452374 2414205 2375293 2336818
61109B336818l7653l6981l6480l6600l7984l9966m0777l9890l8831l8823l8913
$$ 2336818 2299165 2262184 2225704 2189104 2151120 2111154 2070377 2030487 1991656 1952833 1913920
61098A913920l7713l5838l4850l4569l3253l0455k7934k7395k8650l0540l2574
$$ 1913920 1876207 1840369 1805519 1770950 1737697 1707242 1679308 1651913 1623263 1592723 1560149
61087A560149l4751l6445l6437l4157l0342k6329k2965k0438j8809j7998j7106
$$ 1560149 1525398 1488953 1452516 1418359 1388017 1361688 1338723 1318285 1299476 1281478 1264372
61076A264372j4556r794m447q38N74J401L065N339P249Q441R218R983J0975J1951
$$ 1264372 1249816 1240022 1235575 1234737 1235311 1236712 1239777 1245116 1252365 1260806 1270024 1280007 1290982 1302933
61062A302933J2172J1422J0878J1796J3518J4163J3495J3451J5187J7232J7525
$$ 1302933 1315105 1326527 1337405 1349201 1362719 1376882 1390377 1403828 1419015 1436247 1453772
61051A453772J6022J4213J3048J2426J1958J1239R913Q103O236M092J002k657
$$ 1453772 1469794 1484007 1497055 1509481 1521439 1532678 1542591 1550694 1556930 1561022 1562024 1559367
61039A559367n332o242o258o267n960n068m430m832n886p021q393r909j0627j0240
$$ 1559367 1554035 1547793 1541535 1535268 1529308 1524240 1519810 1514978 1509092 1502071 1493678 1483769 1473142 1462902
61025A462902r882j0413j1107j1207j1329j2051j2544j2128j1731j2092j1954
$$ 1462902 1453020 1442607 1431500 1420293 1408964 1396913 1384369 1372241 1360510 1348418 1336464
61014A336464j0036p635o887p408p033n326l764k715r32J549K583R45j619k530
$$ 1336464 1326428 1318793 1311906 1304498 1297465 1292139 1288375 1285660 1284728 1286277 1288860 1289805 1288186 1285656
61000A285656j249R23K837M200N070N656O558Q301J0500J1824J1279R563Q710
$$ 1285656 1284407 1285330 1288167 1292367 1297437 1303093 1309651 1317952 1328452 1340276 1351555 1361118 1369828
60987A369828J0009J2603J4760J6003J7031J7951J8106J7599J7445J7997J8648
$$ 1369828 1379837 1392440 1407200 1423203 1440234 1458185 1476291 1493890 1511335 1529332 1547980
60976A547980J9370K0926K3255K5421K7549L0798L4814L7515L8318L9311M2012
$$ 1547980 1567350 1588276 1611531 1636952 1664501 1695299 1730113 1767628 1805946 1845257 1887269
60965A887269M5330M8095N1073N4660N7100N7361N7743O1150O7286P3947Q0390
$$ 1887269 1932599 1980694 2031767 2086427 2143527 2200888 2258631 2319781 2387067 2461014 2541404
60954B541404Q7091R3619R9341J05023J11568J18473J25689J35238J48505J63386
$$ 2541404 2628495 2722114 2821455 2926478 3038046 3156519 3282208 3417446 3565951 3729337
60944C729337J76691J87965J98547K08694K18606K30625K47223K67929K91089
$$ 3729337 3906028 4093993 4292540 4501234 4719840 4950465 5197688 5465617 5756706
60935E756706L17205L47539L81007M15756M52561M94035N42403O00984O74893
$$ 5756706 6073911 6421450 6802457 7218213 7670774 8164809 8707212 9308196 9983089
60926I983089P66239Q71329R86892J115768J261936J425490J610242J830215K096927
$$ 9983089 10749328 11620657 12607549 13723317 14985253 16410743 18020985 19851200 21948127
60917B1948127K404927K743562L111891L483765L742208L690070L189530K314188
$$ 21948127 24353054 27096616 30208507 33692272 37434480 41124550 44314080 46628268
60909D6628268J338374N52085Q7649q0718k1173K06572M83656N86887K94862m31970
$$ 46628268 47966642 48518727 48606376 48525658 48504485 48711057 49194713 49781600 50076462 49644492
60899D9644492j396023k301669k946292l289471l387620l310552l117121k863119
$$ 49644492 48248469 45946800 43000508 39711037 36323417 33012865 29895744 27032625
60891B7032625k595329k337924k096257j871462j665072j475380j299485j138677
$$ 27032625 24437296 22099372 20003115 18131653 16466581 14991201 13691716 12553039
60883A2553039r96732q74530p70450o83648o12666n53176n01373m57523m22181
$$ 12553039 11556307 10681777 9911327 9227679 8615013 8061837 7560464 7102941 6680760
60874F680760l91466l60608l30153l03950k82512k62956k44463k28962k16600
$$ 6680760 6289294 5928686 5598533 5294583 5012071 4749115 4504652 4275690 4059090
60865D059090k04834j92347j80385j69860j60002j50220j40757j31456j21998
$$ 4059090 3854256 3661909 3481524 3311664 3151662 3001442 2860685 2729229 2607231
60856B607231j13142j05766r9116r1998q4896p8892p3433o7472o1756n7511n3865
$$ 2607231 2494089 2388323 2289207 2197209 2112313 2033421 1959988 1892516 1830760 1773249 1719384
60845A719384m9221m4277m0835l8436l5169l1369k9378k9677l0065k8768k5900
$$ 1719384 1670163 1625886 1585051 1546615 1511446 1480077 1450699 1421022 1390957 1362189 1336289
60834A336289k1872j6985j2664j0549j0007q868o770n383n097m069j297J704L227
$$ 1336289 1314417 1297432 1284768 1274219 1264212 1255344 1248574 1243191 1238094 1234025 1232728 1234432 1237659
60821A237659L537L813M327M630M431L735K823K232J984J194o58k557l307l390
$$ 1237659 1241196 1245009 1249336 1253966 1258397 1262132 1264955 1267187 1269171 1270365 1269707 1267150 1263843 1260453
60807A260453m067n267o162p160r272j1727j2371j0599q118o600o104n888n373
$$ 1260453 1256386 1251119 1244957 1237797 1228525 1216798 1204427 1193828 1185710 1179110 1173006 1167118 1161745
60794A161745m208k609j423o87J157N071R251J1201J1382J2491J5366J8064J9057
$$ 1161745 1157537 1154928 1153505 1152818 1153975 1159046 1168297 1179498 1190880 1203371 1218737 1236801 1255858
60781A255858J8895J8323J7095J5326J4109J4012J4544J5472J6912J7851J6598
$$ 1255858 1274753 1293076 1310171 1325497 1339606 1353618 1368162 1383634 1400546 1418397 1434995
60770A434995J3290J0127Q450P479O508O338P379Q263P745O564O080O217O086
$$ 1434995 1448285 1458412 1466862 1474341 1480849 1487187 1494566 1502829 1510574 1517138 1523218 1529435 1535521
60757A535521N586N193M848M258L660L262K401K29l057o392r015j0963j2581j4044
$$ 1535521 1541107 1546300 1551148 1555406 1559066 1562328 1564729 1564958 1561901 1555509 1546494 1535531 1522950 1508906
60743A508906j5273j6243j7352j9188k1512k2828k1787j8875j5953j4227j3455
$$ 1508906 1493633 1477390 1460038 1440850 1419338 1396510 1374723 1355848 1339895 1325668 1312213
60732A312213j2855j1785r645o237k465K72J605K476L846N914Q504J1302J3583
$$ 1312213 1299358 1287573 1277928 1271691 1269226 1269498 1271103 1273579 1277425 1283339 1291843 1303145 1316728
60719A316728J4685J4867J5112J5980J7297J8723J9968K0624K0671K0817K1480
$$ 1316728 1331413 1346280 1361392 1377372 1394669 1413392 1433360 1453984 1474655 1495472 1516952
60708A516952K1864K1067J9582J8425J7202J4688J1194Q571P687P518P102O768
$$ 1516952 1538816 1559883 1579465 1597890 1615092 1629780 1640974 1649545 1657232 1664750 1671852 1678620
60696A678620O832O711O198O295P654R129R051P418N782N273N482N295M294L157
$$ 1678620 1685452 1692163 1698361 1704656 1712310 1721439 1730490 1737908 1743690 1748963 1754445 1759740 1764034 1767191
60682A767191K702K598J530r85l511m251l427l042m317o405p888q606r407j0686
$$ 1767191 1769893 1772491 1774021 1773036 1769525 1765274 1761847 1758805 1754488 1748083 1740195 1731589 1722182 1711496
60668A711496j1767j1701j0487r348r486j0503j0673r064o697n037m196l502l064
$$ 1711496 1699729 1688028 1677541 1668193 1658707 1648204 1637531 1628467 1621770 1616733 1612537 1609035 1605971
60655A605971l520m696n709o222o526o563o053n535o172q246j0600j1763j1232
$$ 1605971 1602451 1597755 1592046 1585824 1579298 1572735 1566682 1561147 1554975 1546729 1536129 1524366 1513134
60642A513134r674q165p113n805l636j664j627l064l106l05K994L787K497J847
$$ 1513134 1503460 1495295 1488182 1482377 1478741 1477077 1475450 1472386 1469280 1468975 1471969 1475756 1478253 1480100
60628A480100K542K434k37m737r106j2011j3376j4382j6600j9937k2123k1523
$$ 1480100 1482642 1485076 1484839 1480102 1470996 1458985 1445609 1431227 1414627 1394690 1372567 1351044
60616A351044j9581j8866j9645k0262j9979j9105j7098j3210q786o242n718n102
$$ 1351044 1331463 1312597 1292952 1272690 1252711 1233606 1216508 1203298 1194512 1188270 1182552 1177450
60604A177450l408j609j56J584L138K990J549J219K711L834L148K153K492L376
$$ 1177450 1174042 1172433 1172277 1173861 1176999 1179989 1181538 1182757 1185468 1189302 1192450 1194603 1197095 1200471
60590A200471L478L254L646M157M035L801L958L511J533q53j636l40K019M555
$$ 1200471 1203949 1207203 1210849 1215006 1219041 1222842 1226800 1230311 1231844 1230991 1229355 1229015 1231034 1235589
60576A235589O917Q773R947J0643J0922J0713J0690J2012J4691J7289J8793J9574
$$ 1235589 1242506 1251279 1261226 1271869 1282791 1293504 1304194 1316206 1330897 1348186 1366979 1386553
60564A386553K0191K0735K1800K4345K7819L0115L0376L0190L0994L1939L1491
$$ 1386553 1406744 1427479 1449279 1473624 1501443 1531558 1561934 1592124 1623118 1655057 1686548
60553A686548K9533K6578K2481J7442J2937J0030P808M853J199k419o098j0163
$$ 1686548 1716081 1742659 1765140 1782582 1795519 1805549 1813357 1818210 1819409 1816990 1810892 1800729
60541A800729j4114j7549k1009k4657k7361k8431k9035l0183l0656k8768k5064
$$ 1800729 1786615 1769066 1748057 1723400 1696039 1667608 1638573 1608390 1577734 1548966 1523902
60530A523902k1273j7524j2891p974m661l441l129l135l978n331n574l871j228
$$ 1523902 1502629 1485105 1472214 1464240 1459579 1456138 1453009 1449874 1445896 1440565 1434991 1431120 1429892
60517A429892R20J870J315o45k688k904r78J384K804L884N713P864R024R064R179
$$ 1429892 1430812 1432682 1433997 1433352 1430664 1427760 1426782 1428166 1430970 1434854 1440567 1448431 1457455 1466519 1475698
60502A475698J0031J0866J0803J0190R917R929R291P747O338O069O664P094O734
$$ 1475698 1485729 1496595 1507398 1517588 1527505 1537434 1546725 1554472 1560810 1566879 1573543 1580637 1587371
60489A587371N561M063L637N965J0756J5087J6656J6935J9171K3801K8318L1495
$$ 1587371 1592932 1596995 1600632 1606597 1617353 1632440 1649096 1666031 1685202 1709003 1737321 1768816
60477A768816L4861L9153M2164M1664L8244L3347K6489J6742N648l814j0626j5976
$$ 1768816 1803677 1842830 1884994 1926658 1964902 1998249 2024738 2041480 2047128 2043314 2032688 2016712
60465B016712k0499k3260k3456k1528j8351j4462j0207n629k26O274J2981J8475
$$ 2016712 1996213 1972953 1949497 1927969 1909618 1895156 1884949 1879320 1879094 1885368 1898349 1916824
60453A916824K2208K4557K5830K6230K6561K7895L0363L3154L5855L9168M4154
$$ 1916824 1939032 1963589 1989419 2015649 2042210 2070105 2100468 2133622 2169477 2208645 2252799
60442B252799N1251O0150P0211Q0922R2251J04720J19011J35338J53049J70823
$$ 2252799 2304050 2364200 2434411 2515333 2607584 2712304 2831315 2966653 3119702 3290525
60432C290525J87641K03812K20677K38967K58110K77802K99237L23484L49089
$$ 3290525 3478166 3681978 3902655 4141622 4399732 4677534 4976771 5300255 5649344
60423E649344L72464L89667L95730L83069L44119K77124J87718Q4267k6149j36301
$$ 5649344 6021808 6411475 6807205 7190274 7534393 7811517 7999235 8083502 8057353 7921052
60413G921052k36539l17200l73229m05357m17753m15662m03968l85924l63063
$$ 7921052 7684513 7367313 6994084 6588727 6170974 5755312 5351344 4965420 4602357
60404D602357l36699l08780k80866k53635k28062k05518j85820j66959j48017
$$ 4602357 4265658 3956878 3676012 3422377 3194315 2988797 2802977 2636018 2488001
60395B488001j30796j17008j05559r4393q3565p4520o7462o1502n6482n2600m9005
$$ 2488001 2357205 2240197 2134638 2040245 1956680 1882160 1814698 1753196 1696714 1644114 1595109
60384A595109m4800m0758l8115l6319l3943l1166k9255k8070k6256k3751k1914
$$ 1595109 1550309 1509551 1471436 1435117 1401174 1370008 1340753 1312683 1286427 1262676 1240762
60373A240762k1227k0750j9812j8493j6490j3491j0682r765j0262r722p076l952
$$ 1240762 1219535 1198785 1178973 1160480 1143990 1130499 1119817 1110052 1099790 1090068 1082992 1079040
60361A079040k153j550j227r55n88O23K911N067N651M569K909J790J810L002M675
$$ 1079040 1076887 1075337 1074110 1073155 1072567 1073190 1076101 1081168 1086819 1091388 1094297 1096087 1097897 1100899 1105574
60346A105574N757N723N034M618N135O537P914Q048O813N715O348Q552J0776J1863
$$ 1105574 1111331 1117054 1122088 1126706 1131841 1138378 1146292 1154340 1161153 1166868 1173216 1181768 1192544 1204407
60332A204407J1615J0114P696N500M751N240N530M932M283M390M587L447O23k577
$$ 1204407 1216022 1226136 1233832 1239332 1244083 1249323 1254853 1259785 1264068 1268458 1273045 1276492 1277115 1274538
60318A274538m452m547l932l719l771l421k968l246l703k713k74J442J338J356
$$ 1274538 1270086 1265539 1261607 1257888 1254117 1250696 1247728 1244482 1240779 1238066 1237792 1239234 1240572 1241928
60304A241928L486O399P292O071N136N615O350O646P455R140J0285R757Q466Q064
$$ 1241928 1245414 1251813 1259105 1265176 1270312 1275927 1282277 1288923 1296378 1305518 1315803 1325560 1334026 1342090
60290A342090Q975J0510J1942J2794J2847J2519J2507J2675J2012J0113P944O588
$$ 1342090 1351065 1361575 1373517 1386311 1399158 1411677 1424184 1436859 1448871 1458984 1466928 1473516
60278A473516N828M547K194m91k081j683K93K557M214N256N831N804N471N842
$$ 1473516 1479344 1483891 1486085 1485594 1483513 1481830 1482123 1484680 1488894 1494150 1499981 1505785 1511256 1517098
60264A517098P282Q515P860N035J012l236o888r016r398r195r580j0258j0348
$$ 1517098 1524380 1532895 1540755 1545790 1546802 1543566 1536678 1527662 1518264 1509069 1499489 1489231 1478883
60251A478883j0068j0098r864q141n162k568j308j019j279j948k317j446M66K308
$$ 1478883 1468815 1458717 1448853 1440712 1435550 1432982 1431674 1430655 1429376 1427428 1425111 1423665 1424131 1426439
60237A426439L652M737N266M813M344N263O865O854M938L668M692O270O023M584
$$ 1426439 1430091 1434828 1440094 1444907 1449251 1454514 1461379 1468233 1473171 1476839 1481531 1487801 1493824 1498408
60223A498408M501O387Q160P949O301N098N319O417P489Q489R997J1981J3449
$$ 1498408 1502909 1509296 1517456 1525405 1531706 1536804 1542123 1548540 1556029 1564518 1574515 1586496 1599945
60210A599945J3760J3687J4394J5802J7056J8338K0869K4865K8840L1498L3335
$$ 1599945 1613705 1627392 1641786 1657588 1674644 1692982 1713851 1738716 1767556 1799054 1832389
60199A832389L5678L8981M2804M6967N1829N7532O3559O9167P4179P9300Q5501
$$ 1832389 1868067 1907048 1949852 1996819 2048648 2106180 2169739 2238906 2313085 2392385 2477886
60188B477886R2969J00889J08567J16482J25621J36014J46477J55806J63756J70791
$$ 2477886 2570855 2671744 2780311 2896793 3022414 3158428 3304905 3460711 3624467 3795258
60178C795258J77190J82307J84591J82740J77036J69082J59883J48911J35486
$$ 3795258 3972448 4154755 4339346 4522086 4699122 4868204 5028087 5176998 5312484
60169E312484J20207J04117Q7132O8537M8691K9256J1730l446j6410k7196l5515
$$ 5312484 5432691 5536808 5623940 5692477 5741168 5770424 5782154 5778708 5762298 5735102 5699587
60158E699587m0856m2952m2324l9727l4904k6868j5845l813P767J9723L3731M9987
$$ 5699587 5658731 5615779 5573455 5533728 5498824 5471956 5456111 5452298 5460065 5479788 5513519 5563506
60146E563506O7320Q4645J01299J16808J31315J45310J58031J67354J72247J73770
$$ 5563506 5630826 5715471 5816770 5933578 6064893 6210203 6368234 6535588 6707835 6881605
60136F881605J72268J65513J51884J33804J15185R6385P4573M8778K1611m243
$$ 6881605 7053873 7219386 7371270 7505074 7620259 7716644 7791217 7839995 7861606 7857363
60126G857363k8575n1991p3812r2541j07038j16674j21430j21991j18804j11350
$$ 7857363 7828788 7776797 7702985 7610444 7503406 7386732 7265302 7143311 7024507 6913157
60116F913157r9483q4822o9243n2614l3787j3201P419K7453M7342O6542Q3634
$$ 6913157 6813674 6728852 6659609 6606995 6573208 6560007 6567426 6594879 6642221 6708763 6792397
60105F792397R8248J10672J19889J24122J23095J17551J07143R1445P2751N4812
$$ 6792397 6890645 7001317 7121206 7245328 7368423 7485974 7593117 7684562 7757313 7812125
60095G812125L8754K3081P818m599j3098j9287k3920k5078k1143j2886j350J3836
$$ 7812125 7850879 7873960 7881778 7877179 7864081 7844794 7820874 7795796 7774653 7761767 7760417 7774253
60083G774253L2644N3683P6318J01398J28594J55626J81685K09162K40188K73726
$$ 7774253 7806897 7860580 7936898 8038296 8166890 8322516 8504201 8713363 8953551 9227277
60073I227277L07724L41762L75606M07579M36746M64612M92075N16362N33611
$$ 9227277 9535001 9876763 10252369 10659948 11096694 11561306 12053381 12569743 13103354
60064A3103354N43107N46196N42184N28337N03700M70243M29982L83020L28915
$$ 13103354 13646461 14192657 14734841 15263178 15766878 16237121 16667103 17050123 17379038
60055A7379038K68431K03387J35541O5904n279p7678j49645k18253k80769l35555
$$ 17379038 17647469 17850856 17986397 18052301 18047022 17969344 17819699 17601446 17320677 16985122
60045A6985122l81422m17089m41667m54827m56355m46612m27434m01183l68851
$$ 16985122 16603700 16186611 15744944 15290117 14833762 14387150 13959716 13558533 13189682
60036A3189682l30537k87815k43493j98787j52934j06262o1403k0515J6448M9599
$$ 13189682 12859145 12571330 12327837 12129050 11976116 11869854 11808451 11787936 11804384 11853983
60026A1853983P7495R8963J14290J23195J23820J15526J00601Q1225N6881K6956
$$ 11853983 11931478 12030441 12144731 12267926 12391746 12507272 12607873 12689098 12745979 12772935
60016A2772935n985l8148o8407r7771j26142j52153j75566j97282k17235k34156
$$ 12772935 12766950 12728802 12660395 12562624 12436482 12284329 12108763 11911481 11694246 11460090
60006A1460090k47266k56511k61515k61817k57849k50476k39916k26062k09214
$$ 11460090 11212824 10956313 10694798 10432981 10175132 9924656 9684740 9458678 9249464
59997I249464j89491j66529j40781j14048q7672o1327l4717q891J5548L9902O5223
$$ 9249464 9059973 8893444 8752663 8638615 8550943 8489616 8454899 8446008 8461556 8501458 8566681
59986H566681R0005J11840J30205J45557J56856J62129J60876J53929J41611J23798
$$ 8566681 8656686 8768526 8898731 9044288 9201144 9363273 9524149 9678078 9819689 9943487
59976I943487J01181P4903M5570J4063j7715m8457p8675j08650j36485j60024
$$ 9943487 10044668 10119571 10165141 10179204 10161489 10113032 10034357 9925707 9789222 9629198
59966I629198j79243j94422k03524k04346j98424j89636j79364j65915j48549
$$ 9629198 9449955 9255533 9052009 8847663 8649239 8459603 8280239 8114324 7965775
59957G965775j28901j08115q5471o0837l5986j2401J0528L4180N9114Q5277J12351
$$ 7965775 7836874 7728759 7643288 7582451 7546465 7534064 7544592 7578772 7637886 7723163 7835514
59946G835514J39215J64306J86976K07462K25492K40072K50500K56063K54803
$$ 7835514 7974729 8139035 8326011 8533473 8758965 8999037 9249537 9505600 9760403
59937I760403K44504K25316J99971J71015J39198J04848O8949L2165n869m5095
$$ 9760403 10004907 10230223 10430194 10601209 10740407 10845255 10914204 10946369 10940500 10895405
59927A0895405q3725j19216j49941j75362j95105k08484k14789k13676k05407
$$ 10895405 10811680 10692464 10542523 10367161 10172056 9963572 9748783 9535107 9329700
59918I329700j90824j71191j48163j23676r8977p3619m6303j7118J1974L9219
$$ 9329700 9138876 8967685 8819522 8695846 8596869 8523250 8476947 8459829 8471803 8511022
59908H511022O4412Q7572J07860J24880J39679J53113J64176J71139J73246J70318
$$ 8511022 8575434 8663006 8770866 8895746 9035425 9188538 9352714 9523853 9697099 9867417
59898I867417J62220J50202J37212J24914J11861R6574Q1072O8794O0165N3090
$$ 9867417 10029637 10179839 10317051 10441965 10553826 10650400 10731472 10800266 10860431 10913521
59888A0913521M7134M4437M6658N3775O5938Q3925J07348J34713J65651K01093
$$ 10913521 10960655 11005092 11051750 11105525 11171463 11255388 11362736 11497449 11663100 11864193
59878A1864193K40959K83663L28073L73748M19023M61192M99087N33179N62232
$$ 11864193 12105152 12388815 12716888 13090636 13509659 13970851 14469938 15003117 15565349
59869A5565349N81969N88156N79093N53970N10549M46347L61510K59610J46284
$$ 15565349 16147318 16735474 17314567 17868537 18379086 18825433 19186943 19446553 19592837
59860A9592837K7755r0057k01911l02966l88751m56447n05934n38429n54473n54505
$$ 19592837 19620592 19530535 19328624 19025658 18636907 18180460 17674526 17136097 16581624 16027119
59850A6027119n40966n17830m87841m51765m10424l65582l18499k69502k19622
$$ 16027119 15486153 14968323 14480482 14028717 13618293 13252711 12934212 12664710 12445088
59841A2445088j70870j24095p8209l2565J1362N1748Q8683J23253J55089J81876
$$ 12445088 12274218 12150123 12071914 12039349 12050711 12102459 12191142 12314395 12469484 12651360
59831A2651360K00909K10403K09530J97867J74851J39893R3495L7992k3428q8206
$$ 12651360 12852269 13062672 13272202 13470069 13644920 13784813 13878308 13916300 13892872 13804666
59821A3804666j54149k18212k76837l27457l68628l98867m17091m24429m24056
$$ 13804666 13650517 13432305 13155468 12828011 12459383 12060516 11643425 11218996 10794940
59812A0794940m18491m08007l92201l71881l48619l23318k96320k68551k41818
$$ 10794940 10376449 9968442 9576241 9204360 8855741 8532423 8236103 7967552 7725734
59803G725734k17739j96460j76603j56965j38547j24190j15545j11097j07884
$$ 7725734 7507995 7311535 7134932 6977967 6839420 6715230 6599685 6488588 6380704
59794F380704j04452j01056r7692r3544q8212q2069p5319o7780n9679n1704m4392
$$ 6380704 6276252 6175196 6077504 5983960 5895748 5813679 5738360 5670580 5610901 5559197 5514805
59783E514805l8252l4265l3282l5126l9080m4910n2454o0605o7553p1769p2212
$$ 5514805 5476553 5442288 5409006 5373880 5334800 5289890 5237436 5176831 5109278 5037509 4965297
59772D965297o8567o2140n5398m9377m2633l3971k4812j7044j0013j989O438J3162
$$ 4965297 4896730 4834590 4779192 4729815 4687182 4653211 4628399 4611355 4601342 4599353 4605791 4618953
59760D618953J8182K3763L1149L9613M8647N8588O8880P7985Q5309R1156R4802
$$ 4618953 4637135 4660898 4692047 4731660 4780307 4838895 4907775 4985760 5071069 5162225 5257027
59749E257027R4883R1804Q7586Q3130P7707P1150O4079N5960M5732L4858K7020
$$ 5257027 5351910 5443714 5531300 5614430 5692137 5763287 5827366 5883326 5929058 5963916 5990936
59738E990936K3954K3887K4828K7067L1701L9076M9558O3474P9465R5299J11310
$$ 5990936 6014890 6038777 6063605 6090672 6122373 6161449 6211007 6274481 6353946 6449245 6560555
59727F560555J30534J54408J80854K07871K36370K67786L01393L35957L71769
$$ 6560555 6691089 6845497 7026351 7234222 7470592 7738378 8039771 8375728 8747497
59718H747497M08787M44594M76216N01969N18650N18129M89935M28003L34278
$$ 8747497 9156284 9600878 10077094 10579063 11097713 11615842 12105777 12533780 12868058
59709A2868058K17203Q8764l7826j50659k41392l06014l44527l60470l59312l45668
$$ 12868058 13085261 13174025 13136199 12985540 12744148 12438134 12093607 11733137 11373825 11028157
59699A1028157l22195k91324k56664k21485j86669j51411j15440p9626m5008j2167
$$ 11028157 10705962 10414638 10157974 9936489 9749820 9598409 9482969 9403343 9358335 9346168
59689I346168J8776M8190P6816J05313J34210J64000J94439K24096K51991K79602
$$ 9346168 9364944 9413134 9489950 9595263 9729473 9893473 10087912 10312008 10563999 10843601
59679A0843601L09719L43143L78234M13900M51179M91230N33705N78028O24561
$$ 10843601 11153320 11496463 11874697 12288597 12739776 13231006 13764711 14342739 14967300
59670A4967300O73367P23307P73471Q24178Q75434R25470R71656J011789J043653
$$ 14967300 15640667 16363974 17137445 17961623 18837057 19762527 20734183 21745972 22789625
59661B2789625J064705J073144J068459J050501J019547R78174R31883Q86927
$$ 22789625 23854330 24927474 25995933 27046434 28065981 29044155 29976038 30862965
59653C0862965Q48304Q19795Q04009Q01342Q10063Q27974Q52664Q79778R02989
$$ 30862965 31711269 32531064 33335073 34136415 34946478 35774452 36627116 37506894 38409883
59644C8409883R16525R16298Q98450Q59198P97310P14843O14581M98926L72435
$$ 38409883 39326408 40242706 41141156 42000354 42797664 43512507 44127088 44626014 44998449
59635D4998449K43014J18860N802r1242j66779k17067k42352k44869k25880j86191
$$ 44998449 45241463 45360323 45366125 45274883 45108104 44891037 44648685 44403816 44177936 43991745
59625D3991745j27859n3360L5653J37112K47443L63494M84261O08996P34908Q58169
$$ 43991745 43863886 43810526 43846179 43983291 44230734 44594228 45078489 45687485 46422393 47280562
59615D7280562R75531J082968J174091J241669J279074J278355J229116J122605
$$ 47280562 48256093 49339061 50513152 51754821 53033895 54312250 55541366 56663971
59607E6663971R56483P34089M61305J47815j89393n27808q45998j127607j360782
$$ 56663971 57620454 58354543 58815848 58963663 58774270 58246462 57400464 56272857 54912075
59598E4912075j538012j657745j723984j743144j722474j670962j599142j516940
$$ 54912075 53374063 51716318 49992334 48249190 46526716 44855754 43256612 41739672
59590D1739672j433387j358799j304942j280762j287662j318680j361362j401881
$$ 41739672 40306285 38947486 37642544 36361782 35074120 33755440 32394078 30992197
59582C0992197j428855j435821j421371j387494j337840j276683j208109j135502
$$ 30992197 29563342 28127521 26706150 25318656 23980816 22704133 21496024 20360522
59574B0360522j061538r88188r16434q46634p79483p15977o56332n99928n46870
$$ 20360522 19298984 18310796 17394362 16547728 15768245 15052268 14395936 13796008 13249138
59565A3249138m98425m55174m15770l78497l43191l10671k81168k54272k29832
$$ 13249138 12750713 12295539 11879769 11501272 11158081 10847410 10566242 10311970 10082138
59556A0082138k08077j89319j73995j62224j53124j45694j40644j39751j42958
$$ 10082138 9874061 9684742 9510747 9348523 9195399 9049705 8909061 8769310 8626352
59547H626352j47868j52799j58230j64190j68584j69965j69890j70166j69356
$$ 8626352 8478484 8325685 8167455 8003265 7834681 7664716 7494826 7324660 7155304
59538G155304j64467j55125j43681j31986j20322j08933r8305q7916p6578o4085
$$ 7155304 6990837 6835712 6692031 6560045 6439723 6330790 6232485 6144569 6067991 6003906
59528F003906n1277l8735k6683j5671o076K663J1052J8464K4265K9350L5094M1256
$$ 6003906 5952629 5913894 5887211 5871540 5865464 5868127 5879179 5897643 5921908 5951258 5986352 6027608
59516F027608M6317M9644N2197N5323N9561O4245O8049P0827P5058Q3723R6370
$$ 6027608 6073925 6123569 6175766 6231089 6290650 6354895 6422944 6493771 6568829 6652552 6748922
59505F748922J09328J20691J32571J47026J62591J77245J92243K10029K30096
$$ 6748922 6858250 6978941 7111512 7258538 7421129 7598374 7790617 8000646 8230742
59496H230742K50245K70562K92790L16635L40005L62363L84609M05755M22845
$$ 8230742 8480987 8751549 9044339 9360974 9700979 10063342 10447951 10853706 11276551
59487A1276551M34635M42724M48612M51664M50187M42671M28079M06978L82229
$$ 11276551 11711186 12153910 12602522 13054186 13504373 13947044 14375123 14782101 15164330
59478A5164330L56430L28789K96493K59110K19556J81038J45358J14114Q8962
$$ 15164330 15520760 15849549 16146042 16405152 16624708 16805746 16951104 17065218 17154180
59469A7154180P0099N6563M8385M6788N2093O3270P9620J00839J25010J48371
$$ 17154180 17224279 17280842 17329227 17376015 17428108 17491378 17570998 17671837 17796847 17945218
59459A7945218J67359J79330J81244J69655J42708J00875M5677k0811r5278j73748
$$ 17945218 18112577 18291907 18473151 18642806 18785514 18886389 18932066 18911255 18815977 18642229
59449A8642229k53244l31743m06556m74135n31330n75702o05224o19399o20205
$$ 18642229 18388985 18057242 17650686 17176551 16645221 16069519 15464295 14844896 14224691
59440A4224691o10372n91161n63403n29723m93406m55673m16360l76619l38400
$$ 14224691 13614319 13023158 12459755 11930032 11436626 10980953 10564593 10187974 9849574
59431I849574l01702k65214k29514j96730j66831j37245j06644p6390m7610j9611
$$ 9849574 9547872 9282658 9053144 8856414 8689583 8552338 8445694 8369304 8321694 8302083
59421H302083P936L4017N8697Q4103J11538J39534J66090J91183K15827K40192
$$ 8302083 8310019 8344036 8402733 8486836 8598374 8737908 8903998 9095181 9311008 9551200
59411I551200K63722K85761L05060L19780L28645L31001L25668L11313K88158
$$ 9551200 9814922 10100683 10405743 10725523 11054168 11385169 11710837 12022150 12310308
59402A2310308K57361K18291J68476J07256L7933l4417j05630j72597k32825k85150
$$ 12310308 12567669 12785960 12954436 13061692 13099625 13065208 12959578 12786981 12554156 12269006
59392A2269006l29516l65240l90850m06251m13404m14127m08730l97671l82937
$$ 12269006 11939490 11574250 11183400 10777149 10363745 9949618 9540888 9143217 8760280
59383H760280l66568l48952l29532l08342k86222k64324k43671k24407k05486
$$ 8760280 8393712 8044760 7715228 7406886 7120664 6856340 6612669 6388262 6182776
59374F182776j86217j67684j51185j35781j19552j02970q8499p6676o5451n3801
$$ 6182776 5996559 5828875 5677690 5541909 5422357 5319387 5230888 5154212 5088761 5034960
59364E034960m3143l4220k5424j5712o539R03P931J5955K4029L1055L8403M7638
$$ 5034960 4991817 4957597 4932173 4916461 4909922 4910825 4918756 4934711 4958740 4989795 5028198 5075836
59352E075836N6843O1976O1468N7434N2969N0322N1229N6653O5725P6614Q8996
$$ 5075836 5132679 5194655 5256123 5313557 5366526 5416848 5468077 5524730 5590455 5667069 5756065
59341E756065J04427J23550J43716J60208J69999J74392J78132J85948J99735
$$ 5756065 5860492 5984042 6127758 6287966 6457965 6632357 6810489 6996437 7196172
59332G196172K18739K41565K67349K95686L26600L60634L98185M38849M82147
$$ 7196172 7414911 7656476 7923825 8219511 8546111 8906745 9304930 9743779 10225926
59323A0225926N28269N77108O27088O76339P24462P71463Q15255Q51870Q77967
$$ 10225926 10754195 11331303 11958391 12634730 13359192 14130655 14945910 15797780 16675747
59314A6675747Q91372Q89763Q71461Q37803P92435P37842O74920O06422N37886
$$ 16675747 17567119 18456882 19328343 20166146 20958581 21696423 22371343 22977765 23515651
59305B3515651M73498M12960L53927K95668K38690J82369J24898O4886J741o4645
$$ 23515651 23989149 24402109 24756036 25051704 25290394 25472763 25597661 25662547 25664288 25599643
59295B5599643j33605k03851k74641l45493m13950m75094n24803n62806n91733
$$ 25599643 25466038 25262187 24987546 24642053 24228103 23753009 23228206 22665400 22073667
59286B2073667o14246o32220o47470o61547o74654o85609o92665o94187o89320
$$ 22073667 21459421 20827201 20179731 19518184 18843530 18157921 17465256 16771069 16081749
59277A6081749o78558o63176o43859o20502n93413n63625n31801m97943m62528
$$ 16081749 15403191 14740015 14096156 13475654 12882241 12318616 11786815 11288872 10826344
59268A0826344m26934l92230l58479l25528k93625k63118k34351k07806j83431
$$ 10826344 10399410 10007180 9648701 9323173 9029548 8766430 8532079 8324273 8140842
59259H140842j60092j36900j14718r4885p6830n8726m0224k2592o322R232K3962
$$ 8140842 7980750 7843850 7729132 7634247 7557417 7498691 7458467 7435875 7429553 7438785 7462747
59248G462747L7239N0186O4965Q1037R4860J04429J11787J19704J28006J34533
$$ 7462747 7499986 7550172 7615137 7696174 7791034 7895463 8007250 8126954 8254960 8389493
59238H389493J37795J37335J33226J26607J19256J11537J02230R1066P9693O9466
$$ 8389493 8527288 8664623 8797849 8924456 9043712 9155249 9257479 9348545 9428238 9497704
59228I497704O0465N3420M9980M9946N0945N2472N7521O8087Q1593R4330J06198
$$ 9497704 9558169 9611589 9661569 9711515 9762460 9814932 9872453 9940540 10022133 10116463 10222661
59217A0222661J19046J32177J42738J49599J53538J53875J47718J32881J09589
$$ 10222661 10341707 10473884 10616622 10766221 10919759 11073634 11221352 11354233 11463822
59208A1463822P9412M4398P362k8717o1917r1065j14602j31134j40862j45254
$$ 11463822 11543234 11587632 11594994 11566277 11504360 11413295 11298693 11167559 11026697 10881443
59198A0881443j45294j41002j32384j19896j04214q6367o7812m9651l2081j5158
$$ 10881443 10736149 10595147 10462763 10342867 10238653 10152286 10084474 10034823 10002742 9987584
59188I987584L50J3490K3986L2020L7605M0667M1443M0574L9234L8866M0079M2221
$$ 9987584 9987934 10001424 10025410 10057430 10095035 10135702 10177145 10217719 10256953 10295819 10335898 10378119
59176A0378119M5242N1433O3472Q1004J01298J23367J49027J79473K13503K49978
$$ 10378119 10423361 10474794 10538266 10619270 10720568 10843935 10992962 11172435 11385938 11635916
59166A1635916K89295L30842L71313M07376M37933M61950M75863M75237M57643
$$ 11635916 11925211 12256053 12627366 13034742 13472675 13934625 14410488 14885725 15343368
59157A5343368M22211L68056K95382K07102J07438k04j12478k24352l30106m25475
$$ 15343368 15765579 16133635 16429017 16636119 16743557 16743353 16630875 16406523 16076417 15650942
59147A5650942n07582n73714o21889o52002o65205o62938o47547o22819n92455
$$ 15650942 15143360 14569646 13947757 13295755 12630550 11967612 11320065 10697246 10104791
59138A0104791n58522n22158m84724m47426m10973l76470l45277l17099k89773
$$ 10104791 9546269 9024111 8539387 8091961 7680988 7304518 6959241 6642142 6352369
59129F352369k62078k35323k11165j89539j70069j53634j40736j29684j18257
$$ 6352369 6090291 5854968 5643803 5454264 5284195 5130561 4989825 4860141 4741884
59120D741884j06171r4600q4332p5513o7981o0649n2065m2544l4240k8012k2105
$$ 4741884 4635713 4541113 4456781 4381268 4313287 4252638 4200573 4158029 4123789 4095777 4073672
59109D073672j5080p914j683M639J2176J9929K6606L2850L9704M6680N3345O0917
$$ 4073672 4058592 4050678 4048995 4053634 4065810 4085739 4112345 4145195 4184899 4231579 4284924 4345841
59097D345841O9997P8605Q4865Q9955R5953J02471J08087J13463J20088J27246
$$ 4345841 4415838 4494443 4579308 4669263 4765216 4867687 4975774 5089237 5209325 5336571
59087E336571J33100J37828J42772J47414J49909J49913J48197J44239J36875
$$ 5336571 5469671 5607499 5750271 5897685 6047594 6197507 6345704 6489943 6626818
59078F626818J26741J15525J03328Q9212P3735N8470M3676K8906J5375N144j645
$$ 6626818 6753559 6869084 6972412 7061624 7135359 7193829 7237505 7266411 7281786 7286930 7285285
59067G285285o262q680p777l825J888R609K0767L5136N0728O6473Q2876J00167
$$ 7285285 7279023 7270343 7262566 7258741 7260629 7270238 7291005 7326141 7376869 7443342 7526218 7626385
59055G626385J18054J37147J58324J80557K01381K19683K36354K52355K67701
$$ 7626385 7744439 7881586 8039910 8220467 8421848 8641531 8877885 9130240 9397941
59046I397941K81947K93808L00688L00403K92956K78904K56854K24772J83177
$$ 9397941 9679888 9973696 10274384 10574787 10867743 11146647 11403501 11628273 11811450
59037A1811450J34900Q2270K6962k7939p8595j23341j62765j96813k23994k43714
$$ 11811450 11946350 12028620 12055582 12027643 11949048 11825707 11662942 11466129 11242135 10998421
59027A0998421k57400k67091k74397k80637k86262k90289k91914k92205k92591
$$ 10998421 10741021 10473930 10199533 9918896 9632634 9342345 9050431 8758226 8465635
59018H465635k92528k90705k87719k85009k81790k75793k66933k57592k49041
$$ 8465635 8173107 7882402 7594683 7309674 7027884 6752091 6485158 6227566 5978525
59009E978525k40124k29821k18872k08256j98040j88059j78020j66807j53607
$$ 5978525 5738401 5508580 5289708 5081452 4883412 4695353 4517333 4350526 4196919
59000D196919j39959j28914j21736j16908j12405j07400j01780r5818r0350q5836
$$ 4196919 4056960 3928046 3806310 3689402 3576997 3469597 3367817 3271999 3181649 3095813
58990C095813q1285p5618o9804o5902o4136o2661o0130n6835n3347m9657m5767
$$ 3095813 3014528 2938910 2869106 2803204 2739068 2676407 2616277 2559442 2506095 2456438 2410671
58979B410671m1862l7944l4300l1721l0126k7874k3873j9451j6419j4322j1487
$$ 2410671 2368809 2330865 2296565 2264844 2234718 2206844 2182971 2163520 2147101 2132779 2121292
58968B121292p917n078l567k963l145l764l223m79K843M243L588K595K040J644
$$ 2121292 2113375 2108297 2104730 2101767 2098622 2094858 2091635 2091156 2093999 2098242 2101830 2104425 2106465 2108109
58954B108109J796K884L726L159K451L711O674R365J1098J2350J2702J1717J0867
$$ 2108109 2109905 2112789 2116515 2119674 2122125 2125836 2132510 2141875 2152973 2165323 2178025 2189742 2200609
58941B200609J1836J3702J4570J4847J5866J6613J5403J3738J4402J6494J6634
$$ 2200609 2212445 2226147 2240717 2255564 2271430 2288043 2303446 2317184 2331586 2348080 2364714
58930B364714J4863J4855J7872K0975K2068K2676K4379K6147K6746K6675K6361
$$ 2364714 2379577 2394432 2412304 2433279 2455347 2478023 2502402 2528549 2555295 2581970 2608331
58919B608331K5205K3740K4017K6621K9646L1624L3271L5523L8092M0683M3364
$$ 2608331 2633536 2657276 2681293 2707914 2737560 2769184 2802455 2837978 2876070 2916753 2960117
58908B960117M5431M6113M6673M9383N4110N8457O1317O3633O5653O6576O7199
$$ 2960117 3005548 3051661 3098334 3147717 3201827 3260284 3321601 3385234 3450887 3517463 3584662
58897C584662O9723P4275P8458Q0989Q3071Q5839Q9387R4537J02380J11472J18838
$$ 3584662 3654385 3728660 3807118 3888107 3971178 4057017 4146404 4240941 4343321 4454793 4573631
58886D573631J24364J31037J40246J50206J59727J69947J81326J92447K03160
$$ 4573631 4697995 4829032 4969278 5119484 5279211 5449158 5630484 5822931 6026091
58877F026091K15594K30659K46571K62185K78834K97566L17537L38482L61867
$$ 6026091 6241685 6472344 6718915 6981100 7259934 7557500 7875037 8213519 8575386
58868H575386L88308M16583M46279M78536N13245N48838N85828O27068O73052
$$ 8575386 8963694 9380277 9826556 10305092 10818337 11367175 11953003 12580071 13253123
58859A3253123P20524P67433Q15494Q65824R15521R61122J002215J038752J067344
$$ 13253123 13973647 14741080 15556574 16422398 17337919 18299041 19301256 20340008 21407352
58850B1407352J082981J082399J063350J022589R56949Q65045P46329O00650M30824
$$ 21407352 22490333 23572732 24636082 25658671 26615620 27480665 28226994 28827644 29258468
58841B9258468K44160M9720j44567l31368n03160o54023p80893q82155r56951
$$ 29258468 29502628 29552348 29407781 29076413 28573253 27919230 27138337 26256182 25299231
58832B5299231j006739j035129j044845j037015j014151r81064r41508q96495
$$ 25299231 24292492 23257363 22212518 21175503 20161352 19180288 18238780 17342285
58824A7342285q47217p96813p47682o99641o52362o07238n65340n25975m88887
$$ 17342285 16495068 15698255 14950573 14250932 13598570 12991332 12425992 11900017 11411130
58815A1411130m55441m26162l99405l73811l49757l27219l04907k82797k62709
$$ 11411130 10955689 10529527 10130122 9756311 9406554 9079335 8774428 8491631 8228922
58806H228922k44969k27300k08455j90126j73759j58489j43686j30341j18260
$$ 8228922 7983953 7756653 7548198 7358072 7184313 7025824 6882138 6751797 6633537
58797F633537j05194r0680p7499o7215n7556m6400l4984k4627j3609m30J2794
$$ 6633537 6528343 6437663 6360164 6292949 6235393 6188993 6154009 6129382 6115773 6115343 6128137
58786F128137K3512L3052M4523N8331P2623Q6382R9538J11600J22687J34433J47848
$$ 6128137 6151649 6184701 6229224 6287555 6360178 6446560 6546098 6657698 6780385 6914818 7062666
58775G062666J61852J75627J90453K07450K25514K43327K61464K80872L01277
$$ 7062666 7224518 7400145 7590598 7798048 8023562 8266889 8528353 8809225 9110502
58766I110502L22670L46125L71838L98766M27411M60017M96859N35514N75288
$$ 9110502 9433172 9779297 10151135 10549901 10977312 11437329 11934188 12469702 13044990
58757A3044990O18606O66177P14759P62154Q10399Q60942R10212R53224R88285
$$ 13044990 13663596 14329773 15044532 15806686 16617085 17478027 18388239 19341463 20329748
58748B0329748J014687J028731J025588J002573R57408Q86094P86099O59387N09442
$$ 20329748 21344435 22373166 23398754 24401327 25358735 26244829 27030928 27690315 28199757
58739B8199757L38295J50022m5661k37252m17167n80868p23352q40528r32023
$$ 28199757 28538052 28688074 28642413 28405161 27987994 27407126 26683774 25843246 24911223
58730B4911223r99039j041457j060302j060606j047956j024052r89101r46405
$$ 24911223 23912184 22870727 21810425 20749819 19701863 18677811 17688710 16742305
58722A6742305r00699q53672q04732p54767p05762o58329o12779n70962n34072
$$ 16742305 15841606 14987934 14183202 13428435 12722673 12064344 11451565 10880603 10346531
58713A0346531n00498m68638m39660m14483l90713l65972l41746l20347l00663
$$ 10346531 9846033 9377395 8937735 8523252 8132539 7766567 7424821 7104474 6803811
58704F803811k80856k62528k47838k34684k19428k02700j87991j75998j64619
$$ 6803811 6522955 6260427 6012589 5777905 5558477 5355777 5167786 4991788 4827169
58695D827169j53133j42257j31366j19850j09747j03009r7573r0233q1964p6093
$$ 4827169 4674036 4531779 4400413 4280563 4170816 4067807 3970234 3880001 3798037 3721944
58685C721944p2642o8935o4602o1353n8750n4770n0070m7292m6512m5366m3349
$$ 3721944 3649302 3580367 3515765 3454412 3395662 3340892 3290822 3243530 3197018 3151652 3108303
58674C108303m2109m1862m1208m0185m0091m0738m0962m1078m1807m2024m0809
$$ 3108303 3066194 3024332 2983124 2942939 2902848 2862110 2821148 2780070 2738263 2696239 2655430
58663B655430m0198m2255m5044m5408m4117m4071m5024m4600m3276m3479m4677
$$ 2655430 2615232 2572977 2527933 2482525 2438408 2394337 2349313 2304713 2261437 2217958 2173281
58652B173281m4144m1932m0376l9312l6621l3143l2033l3203l3118l0493k7734
$$ 2173281 2129137 2087205 2046829 2007517 1970896 1937753 1905720 1872517 1839399 1808906 1781172
58641A781172k6421k5560k4707k4734k5059k4016k2304k2247k3315k2261j8210
$$ 1781172 1754751 1729191 1704484 1679750 1654691 1630675 1608371 1586124 1562809 1540548 1522338
58630A522338j3961j1699j0826j0351j0126r306o721l114l14J614L729N440N467
$$ 1522338 1508377 1496678 1485852 1475501 1465375 1456069 1449348 1446234 1445920 1447534 1451263 1456703 1462170
58617A462170M735M865M754K277j390l107k708k692l569l666l071l516m553l995
$$ 1462170 1466905 1471770 1476524 1478801 1477411 1474304 1471596 1468904 1465335 1461669 1458598 1455082 1450529 1446534
58603A446534k020q27m72Q35K540K292O25O92L037M898N182O000Q524J1210J2843
$$ 1446534 1444514 1443687 1443215 1444050 1446590 1448882 1449507 1450199 1453236 1458134 1463316 1469316 1477840 1489050 1501893
58588A501893J4065J5383J6743J9109K3316K7669L0038L1726L5595M0985M4577
$$ 1501893 1515958 1531341 1548084 1567193 1590509 1618178 1648216 1679942 1715537 1756522 1801099
58577A801099M5874M7599N0931N4569N8416O3934P0692P6639Q1931Q8713R7277
$$ 1801099 1846973 1894572 1945503 2000072 2058488 2122422 2193114 2269753 2351684 2440397 2537674
58566B537674J06236J16024J28021J40660J50900J59569J70776J86012K02919
$$ 2537674 2643910 2759934 2887955 3028615 3179515 3339084 3509860 3695872 3898791
58557C898791K19699K36486K52629K66957K80504K94570L06507L11775L09324
$$ 3898791 4118490 4354976 4607605 4874562 5155066 5449636 5756143 6067918 6377242
58548F377242L00151K81649K49323K04017J51599R5347L4395k9895r1986j47538
$$ 6377242 6677393 6959042 7208365 7412382 7563981 7659328 7693723 7663828 7571842 7424304
58538G424304j95405k33609k59044k72447k78490k79749k75304k65827k54533
$$ 7424304 7228899 6995290 6736246 6463799 6185309 5905560 5630256 5364429 5109896
58529E109896k42168k26434k07661j89882j75028j61034j46622j32967j19815
$$ 5109896 4867728 4641294 4433633 4243751 4068723 3907689 3761067 3628100 3508285
58520C508285j05349r0919q0529p4439o8592o1462n6052n3994n3186n2516n3256
$$ 3508285 3402936 3312017 3231488 3157049 3088457 3026995 2970943 2916949 2863763 2811247 2757991
58509B757991n4554n3237m9513m7177m6894m5240m1821m0866m3838m6749m7150
$$ 2757991 2703437 2650200 2600687 2553510 2506616 2461376 2419555 2378689 2334851 2288102 2240952
58498B240952m7621m9755n0804m9140m7360m6937m5267m0941l6769l4757l3122
$$ 2240952 2193331 2143576 2092772 2043632 1996272 1949335 1904068 1863127 1826358 1791601 1758479
58487A758479l0787k9600k9691k8074k4332k2172k2700k1972j8042j4573j4245
$$ 1758479 1727692 1698092 1668401 1640327 1615995 1593823 1571123 1549151 1531109 1516536 1502291
58476A502291j4320j2190r826r096q000n280l704m991o226m845k694j894j404
$$ 1502291 1487971 1475781 1465955 1456859 1448859 1443579 1439875 1434884 1428658 1423813 1421119 1419225 1417821
58463A417821o09j337l329l108m38l32n159j0389j2019j2550j5297j8288j8580
$$ 1417821 1417212 1415875 1412546 1409438 1409000 1408668 1403509 1393120 1381101 1368551 1353254 1334966 1316386
58450A316386j7744j8203j8567j7070j5561j5733j5408j2640r501q073o876m878
$$ 1316386 1298642 1280439 1261872 1244802 1229241 1213508 1198100 1185460 1175959 1167886 1161010 1156132
58438A156132m435o423p170m278r58n70j471j438k288n492p849o510m159m356
$$ 1156132 1151697 1145274 1138104 1133826 1132868 1132298 1130827 1129389 1127101 1121609 1113760 1107250 1103091 1098735
58424A098735n638n029l673m022m765l311n82Q63J014J213J385J297J670J873
$$ 1098735 1093097 1088068 1084395 1080373 1075608 1072297 1071715 1072578 1073592 1074805 1076190 1077487 1079157 1081030
58410A081030P2k528k153J017K129k95j601R04L555L588M220Q081J1740J1723
$$ 1081030 1081102 1078574 1076421 1077438 1079567 1079272 1077671 1078575 1082130 1085718 1089938 1098019 1109759 1121482
58396A121482J0286J0429J0583R084Q366R770R602N300J81k722n890j1457j6010
$$ 1121482 1131768 1142197 1152780 1161864 1170230 1180000 1189602 1194902 1195083 1192361 1186471 1175014 1159004
58383A159004j6586j6075j7231j7199j3687j0556j1166j2025r448o614p380q805
$$ 1159004 1142418 1126343 1109112 1091913 1078226 1067670 1056504 1044479 1035031 1028417 1021037 1012232
58371A012232o936m467n271o588m307j121j474k937o97L348M059K216K367M448
$$ 1012232 1005296 1000829 995558 988970 984663 983542 982068 979131 978434 981782 985841 988057 990424 994872
58357I94872N075M485N280O761O889P234R893J2530J2290J1335J2764J4779J4676
$$ 994872 999947 1004432 1009712 1016473 1023362 1030596 1040489 1053019 1065309 1076644 1089408 1104187 1118863
58344A118863J4572J7110J9635J8855J7093J7709J8613J6695J4134J3884J3563
$$ 1118863 1133435 1150545 1170180 1189035 1206128 1223837 1242450 1259145 1273279 1287163 1300726
58333A300726J0381P255P104O319J228m157m623k910m302p023o547m795o062p947
$$ 1300726 1311107 1318362 1325466 1331785 1333013 1328856 1324233 1321323 1317021 1309998 1303451 1298656 1292594 1284647
58319A284647n434m41J387K44K31J286J102J506M879P846O563M334N941Q711P661
$$ 1284647 1279213 1278772 1280159 1280403 1280634 1281920 1283022 1284528 1289407 1297253 1303816 1308150 1314091 1322802 1330463
58304A330463N174O530R961J0264Q369Q263Q291M890J058J753M529M096K282L875
$$ 1330463 1335637 1342167 1352128 1362392 1370761 1379024 1387315 1392205 1393263 1395016 1399545 1403641 1405923 1409798
58290A409798O528M857R55P68L319L437J852K716M446K987P64K647O469P298P196
$$ 1409798 1416326 1421183 1422138 1422906 1426225 1429662 1431514 1434230 1438676 1441663 1442427 1445074 1451543 1458841 1466037
58275A466037J0812J5423J5776J4449J6788K0026J8594J5701J8013K3058K3913
$$ 1466037 1476849 1492272 1508048 1522497 1539285 1559311 1577905 1593606 1611619 1634677 1658590
58264A658590K2155K3915K7286K6251K3099K3928K5726K1400J4053J2449J5466
$$ 1658590 1680745 1704660 1731946 1758197 1781296 1805224 1830950 1852350 1866403 1878852 1894318
58253A894318J4975J1327J1813J6216J7965J7455K0384K5053K5096K2601K4626
$$ 1894318 1909293 1920620 1932433 1948649 1966614 1984069 2004453 2029506 2054602 2077203 2101829
58242B101829K9228K9073K6241K8757L4992L6528L4165L5868M0949M1699L8760
$$ 2101829 2131057 2160130 2186371 2215128 2250120 2286648 2320813 2356681 2397630 2439329 2478089
58231B478089L9462M2958M2520M0323M4046N1136N2701N0507N3316N9176N8988
$$ 2478089 2517551 2560509 2603029 2643352 2687398 2738534 2791235 2841742 2895058 2954234 3013222
58220C013222N5184N8408O7497P1539P0280P3487Q1197Q4007Q2078Q4538R0824
$$ 3013222 3068406 3126814 3194311 3265850 3336130 3409617 3490814 3574821 3656899 3741437 3832261
58209C832261R2192R0753R6872J08579J14160J14282J20454J32481J39295J41306
$$ 3832261 3924453 4015206 4112078 4220657 4334817 4449099 4569553 4702034 4841329 4982635
58199D982635J49500J62849J69944J72446J82821J99085K06934K07281K15694
$$ 4982635 5132135 5294984 5464928 5637374 5820195 6019280 6226214 6433495 6649189
58190F649189K33662K46975K53955K67820K88903L02659L08153L20373L41207
$$ 6649189 6882851 7129826 7383781 7651601 7940504 8243163 8551316 8871689 9212896
58181I212896L56800L66748L86275M16185M41213M61607M94665N41122N82890
$$ 9212896 9569696 9936444 10322719 10738904 11180117 11641724 12136389 12677511 13260401
58172A3260401O18114O64128P21257P70060Q09805Q61659R27182R83206J025699
$$ 13260401 13878515 14542643 15263900 16033960 16843765 17705424 18632606 19615812 20641511
58163B0641511J078086J147432J214633J277683J360452J467326J574328J676635
$$ 20641511 21719597 22867029 24081662 25359345 26719797 28187123 29761451 31438086
58155C1438086J797810J940117K076132K203191K353659K537698K732274K940942
$$ 31438086 33235896 35176013 37252145 39455336 41808995 44346693 47078967 50019909
58147E0019909L202295L522373L866417M238430M697787N274946N948079O725300
$$ 50019909 53222204 56744577 60610994 64849424 69547211 74822157 80770236 87495536
58139H7495536P660566Q760165R975054J1322691J2904880J4761393J6827054
$$ 87495536 95156102 103916267 113891321 125214012 138118892 152880285 169707339
58132A69707339J9069283K1512845K4112242K6866857L0115138L4173480L8122286
$$ 169707339 188776622 210289467 234401709 261268566 291383704 325557184 363679470
58125C63679470L9211671L4370050K2856048P291982q101910k0184479k7987636
$$ 363679470 402891141 437261191 460117239 467409221 459307311 439122832 411135196
58118D11135196l1975890l3016193l2021181k9904834k7388601k4842518k2393713
$$ 411135196 379159306 346143113 314121932 284217098 256828497 231985979 209592266
58111B09592266k0101004j7974926j5958597j4009130j2165825j0487873q972778
$$ 209592266 189491262 171516336 155557739 141548609 129382784 118894911 109922133
58104A09922133p584631o318876n184791m151597l170395k248839j452235p99135
$$ 109922133 102337502 96018626 90833835 86682238 83511843 81263004 79810769 79011634
58096G9011634j88838M88551J124335J332510P37128o36859k315648l749229m681448
$$ 79011634 78822796 79311347 80435682 81768192 82505320 81868461 79552813 75803584 71122136
58087G1122136n151014n265055n096294m742396m333363l943719l569918l207396
$$ 71122136 65971122 60706067 55609773 50867377 46534014 42590295 39020377 35812981
58079C5812981k883941k607223k346526k087720j854292j657636j476054j300171
$$ 35812981 32929040 30321817 27975291 25887571 24033279 22375643 20899589 19599418
58071A9599418j153264j047860r62972q81915q15003p67965p23630o72161o27030
$$ 19599418 18446154 17398294 16435322 15553407 14738404 13970439 13246809 12574648 11947618
58062A1947618n95084n61515n19380m84190m64051m43584m12178l81622l61537
$$ 11947618 11352534 10791019 10271639 9787449 9323398 8879814 8467636 8086014 7724477
58053G724477l43251l21669l07906l06153l01892k86818k72600k67001k59041
$$ 7724477 7381226 7059557 6751651 6445498 6143606 5856788 5584188 5317187 5058146
58044E058146k41150k23927k15359k06301j89944j75417j68901j60894j45325
$$ 5058146 4816996 4593069 4377710 4171409 3981465 3806048 3637147 3476253 3330928
58035C330928j32083j27560j21508j06690r3356r0360q9226q0981p2460p1689
$$ 3330928 3198845 3071285 2949777 2843087 2749731 2659371 2570145 2489164 2416704 2345015
58025B345015p2365o6787o0240n9123n8225n2499m8431n1184n3173m7721m1780
$$ 2345015 2272650 2205863 2145623 2086500 2028275 1975776 1927345 1876161 1822988 1775267 1733487
58014A733487m2910m5516m2054l6585l5372l4755k9948k5589k6307k6791k1887
$$ 1733487 1690577 1645061 1603007 1566422 1531050 1496295 1466347 1440758 1414451 1387660 1365773
58003A365773j6827j7079j7836j3853r993j1693j4420j2831j1164j4347j7691
$$ 1365773 1348946 1331867 1314031 1300178 1290185 1278492 1264072 1251241 1240077 1225730 1208039
57992A208039j5699j2548j3738j5661j3341j0441j1704j3244j0024n635n185n765
$$ 1208039 1192340 1179792 1166054 1150393 1137052 1126611 1114907 1101663 1091639 1086004 1080819 1075054
57980A075054l106l45j202j755J948N264L091m54L26K294%l884m120k843m721
$$ 1075054 1071948 1071603 1070401 1068646 1070594 1075858 1078949 1078495 1078821 1081115 1081115 1077231 1073111 1070268 1065547
57965A065547p672p421o127p791j0058q934o805p694r406q283o870q985j1834
$$ 1065547 1057875 1050454 1044327 1036536 1026478 1017544 1010739 1003045 993639 985356 978486 969501 957667
57952I57667j0839p972p717q916p936n920n968p045o983p464r880j0864p852m402
$$ 957667 946828 938856 931139 922223 914287 908367 902399 895354 888371 880907 871027 860163 852311 847909
57938H47909m132m478k353n12j937l356j077K069K253J826M120O316M575J407
$$ 847909 843777 839299 836946 836434 834497 831141 830064 832133 834386 836212 840332 846648 851223 852630
57924H52630R62J653L54r62L92J573p16l674l682l142n107o332l194M32r74n304
$$ 852630 853592 855245 855599 854637 855029 856602 855886 852212 848530 845388 840281 833949 830755 831187 830213 824909
57908H24909p241p543r867j2477j1308p928o567o489m660k578l065l795j545P52
$$ 824909 817668 810125 800258 787781 776473 768545 761978 755489 750829 748251 745186 741391 739846 740598
57894G40598j056m078l076k0n25l766m415k204j135j298L20K697K401O51J121
$$ 740598 739542 735464 732388 732368 731843 728077 723662 721458 720323 719025 719345 722042 724443 725094 726215
57879G26215K498R15k047j772O93L53k668l882l225m904q911j0668r122p823p821
$$ 726215 728713 729628 727581 725809 726502 726855 724187 720305 717080 712176 703265 692597 683475 675652 667831
57864F67831o630m413m233n831n673l484k392k539r04K364L822L232M079P088
$$ 667831 661201 656788 652555 646724 641051 637567 635175 632636 631732 634096 637918 641150 645229 652317
57850F52317R133R076R063R601Q867P229P139Q195P506N160M175M889M532K418
$$ 652317 661450 670526 679589 689190 698057 705286 712425 720620 728126 733286 737461 742350 746882 749300
57836G49300N79p67l250o009o386m972m952o677p744q037r439j0962r672o324
$$ 749300 749879 749112 745862 739853 733467 728495 723543 716866 709122 701085 691646 680684 671012 664688
57822F64688m700n404n689n087n622o522m726r62O08o24q26J340K701J571L35
$$ 664688 659988 654584 648895 643808 638186 631664 626938 625976 626584 625960 625134 626474 629175 630746 631081
57807F31081O82J427K343N182R414J1572J0368Q244O834N234L498L284M006K771
$$ 631081 631763 633190 635533 640715 650129 661701 672069 680313 687147 692381 695879 699163 703169 705940
57793G05940p96l870n322o949r107r749q735q608r958j0409r242q606r093q551
$$ 705940 705144 701274 695952 689003 679896 670147 661412 652804 642846 632437 623195 614589 605496 596945
57779E96945o498n399o187o738o000n544n798n009l250l264n839q232q665q581
$$ 596945 590447 585048 578861 572123 566123 560579 554781 549772 546522 543258 537419 529187 520522 511941
57765E11941r108r120q154p682q134q133p560p901q843q306o534o020o828o278
$$ 511941 502833 493713 485559 477877 469743 461610 454050 446149 437306 429000 422466 416446 409618 403340
57751D03340m088l196m313m411k070K06P14J095K369K908K268K792N273P184P256
$$ 403340 399252 396056 391743 387332 385262 385468 386182 387277 389646 392554 394822 397614 402887 410071 417327
57736D17327P682R589J0547R007P182O885O386M083J702R99P04n61j517j028n69
$$ 417327 425009 434598 445145 454152 461334 468219 474605 478688 480390 481389 482093 481532 480015 478987 478418
57721D78418j414k331k417l138n188o533o053n856p358q237o278l194j717j501
$$ 478418 477004 474673 472256 469118 463930 457397 451344 445488 438130 429893 423615 420421 418704 417203
57707D17203q97k16l32l29O27J251N01j80N90J700J967K486M056M896L753K726
$$ 417203 416306 416090 415758 415429 416056 417307 417808 417628 418218 419918 421885 424371 428427 433323 437076 439802
57691D39802M009O086O340N414N652O933P311O550O024O127O374P040Q284Q832
$$ 439802 443811 449897 456237 461651 467303 474236 481547 488097 494121 500248 506622 513662 521946 530778
57677E30778P852O909P766R452R832Q882Q107P922P923Q703J0948J3540J4826
$$ 530778 538630 545539 553305 562757 572589 581471 589578 597500 605423 614126 625074 638614 653440
57664F53440J5156J6119J7842J8943J8834J8404J8727K0191K2541K4982K6811
$$ 653440 668596 684715 702557 721500 740334 758738 777465 797656 820197 845179 871990
57653H71990K8465L0808L3189L3926L3234L3599L6332L9832M2391M4545M7351
$$ 871990 900455 931263 964452 998378 1031612 1065211 1101543 1141375 1183766 1228311 1275662
57642A275662N0528N3834N8216O4054P0069P5464Q1173Q7652R3750R9362J06806
$$ 1275662 1326190 1380024 1438240 1502294 1572363 1647827 1729000 1816652 1910402 2009764 2116570
57631B116570J17673J30439J43145J56143J70193J84219J97383K11263K27365
$$ 2116570 2234243 2364682 2507827 2663970 2834163 3018382 3215765 3427028 3654393
57622C654393K44166K59042K71161K79906K82327K75166K58280K33550K01782
$$ 3654393 3898559 4157601 4428762 4708668 4990995 5266161 5524441 5757991 5959773
57613E959773J63448J21392Q0074M2611J0157j7403m2709p1419j08147j51599
$$ 5959773 6123221 6244613 6324687 6367298 6377455 6360052 6317343 6245924 6137777 5986178
57603E986178j95282k32325k58412k71832k73435k66233k53176k35846k16068
$$ 5986178 5790896 5558571 5300159 5028327 4754892 4488659 4235483 3999637 3783569
57594C783569j96788j79341j61831j42485j23053j06397r2377p8944o5981n4999
$$ 3783569 3586781 3407440 3245609 3103124 2980071 2873674 2781297 2702353 2636372 2581373
57584B581373m5929l7148k8134j9470j0737r76R170J8137K5860L3394M0841M7912
$$ 2581373 2535444 2498296 2470162 2450692 2439955 2438979 2448149 2466286 2492146 2525540 2566381 2614293
57572B614293N5855O6291P8522R0356J01338J12934J25813J39055J51808J63855
$$ 2614293 2670148 2736439 2814961 2905317 3006655 3119589 3245402 3384457 3536265 3700120
57562C700120J74833J84552J93364K00425K02502J96567J82733J62562J35536
$$ 3700120 3874953 4059505 4252869 4453294 4655796 4852363 5035096 5197658 5333194
57553E333194R9938N6645R438l8041q3331j23800j57071j82831k01929k13937
$$ 5333194 5433132 5489777 5499215 5461174 5377843 5254043 5096972 4914141 4712212 4498275
57543D498275k18006k15821k11071k05690j98829j89666j79028j67956j56691
$$ 4498275 4280269 4064448 3853377 3647687 3448858 3259192 3080164 2912208 2755517
57534B755517j45410j34440j23717j13424j04786r8546r3204q6561p8558p0766
$$ 2755517 2610107 2475667 2351950 2238526 2133740 2035194 1941990 1855429 1776871 1706105
57524A706105o3865n7668n2753m9659m7009m2857l7558l3037k9850k7237k5211
$$ 1706105 1642240 1584572 1531819 1482160 1435151 1392294 1354736 1321699 1291849 1264612 1239401
57513A239401k3940k1984j8270j4868j4433j5431j3962j0016p567q016q087n557
$$ 1239401 1215461 1193477 1175207 1160339 1145906 1130475 1116513 1106497 1098930 1090914 1082827 1077270
57501A077270k546j170J46L187O290P325P692J0128J4281J7647J9701K2102K5448
$$ 1077270 1074724 1073554 1073700 1076887 1083177 1090502 1098194 1108322 1122603 1140250 1159951 1182053 1207501
57488A207501K8478L0440L2186L4663L7783M1045M4414M8407N3549N9619O5424
$$ 1207501 1235979 1266419 1298605 1333268 1371051 1412096 1456510 1504917 1558466 1618085 1683509
57477A683509P0046P4205P9435Q6006R2983J00302J09091J19473J29772J38523
$$ 1683509 1753555 1827760 1907195 1993201 2086184 2186486 2295577 2415050 2544822 2683345
57467B683345J45812J51871J55942J57325J56049J51378J40935J22542R6336O4432
$$ 2683345 2829157 2981028 3136970 3294295 3450344 3601722 3742657 3865199 3961535 4025967
57457D025967K9447o094l9970p0750r7558j19266j34832j44538j49720j51264
$$ 4025967 4055414 4049320 4009350 3938600 3841042 3721776 3586944 3442406 3292686 3141422
57447C141422j49620j46019j41801j36434j28261j17536j06626r6739q6894p6828
$$ 3141422 2991802 2845783 2703982 2567548 2439287 2321751 2215125 2118386 2031492 1954664
57437A954664o8253o1801n5237m6736l7888l1297k6764k2105j6563j1048n830
$$ 1954664 1886411 1824610 1769373 1722637 1684749 1653452 1626688 1604583 1588020 1576972 1571142
57426A571142k49N591J0704J4848J8853K3532K9241L6131M3657N0305N5008N8667
$$ 1571142 1570893 1576484 1587188 1602036 1620889 1644421 1673662 1709793 1753450 1803755 1858763 1917430
57414A917430O3299P0006P8501Q8013R7712J06708J14678J22177J29491J35585
$$ 1917430 1980729 2050735 2129236 2217249 2314961 2421669 2536347 2658524 2788015 2923600
57404B923600J39057J39558J37306J31421J19725J00395P3429M0761N293l0343
$$ 2923600 3062657 3202215 3339521 3470942 3590667 3691062 3764491 3805252 3810545 3780202
57394C780202o4457r5796j22810j44162j59718j70085j75257j74967j70282j63472
$$ 3780202 3715745 3619949 3497139 3352977 3193259 3023174 2847917 2672950 2502668 2339196
57384B339196j55995j48024j39898j32171j23921j13348j01056r0567q4105p9764
$$ 2339196 2183201 2035177 1895279 1763108 1639187 1525839 1424783 1334216 1250111 1170347
57374A170347p4537o8316o2790n7953n2345m6122m1251l8705l7278l5488l3133
$$ 1170347 1095810 1027494 964704 906751 854406 808284 767033 728328 691050 655562 622429
57363F22429l0739k8606k6773k5200k3871k2937k2407k1562j9543j6864j5124
$$ 622429 591690 563084 536311 511111 487240 464303 441896 420334 400791 383927 368803
57352C68803j4756j4406j3337j2624j2839j2395j0112p757p691r158r510q335
$$ 368803 354047 339641 326304 313680 300841 288446 278334 270577 262886 253728 244218 235883
57340B35883p646q213q536p679o661o235n549m111l255m337o655q303q371p354
$$ 235883 228237 220024 211488 203809 197148 190913 185364 181253 177998 173661 167006 158703 150332 142978
57326A42978o070m958m181l666l132k332j343p06j148k771m346m181k194l31l61
$$ 142978 136908 131950 127769 124103 120971 118639 117296 116590 115442 112671 108325 104144 101950 101619 101258
57311A01258j954l602m549m845m472l702l575m626n640n129l600k873l480m299
$$ 101258 99304 95702 91153 86308 81836 78134 74559 69933 64293 59164 55564 52691 49211 44912
57297D4912m562m697n055n283n192n058m854m182B896E94a336j870k146k670k738
$$ 44912 40350 35653 30598 25315 20123 15065 10211 6029 2896 594 -1336 -3206 -5352 -8022 -10760
57282a0760j887r54j028j684j492p2J706L292M721b668B206L603L518N176P044
$$ -10760 -12647 -13601 -14629 -16313 -17805 -17877 -16171 -12879 -8158 -2668 2206 5809 9327 14503 21547
57267B1547P486O442M832L575L490M918O989Q234Q370Q501R301J0016R699Q577
$$ 21547 29033 35475 40307 43882 47372 52290 59279 67513 75883 84384 93685 103701 113400 121977
57253A21977P718P947R332J1279J3076J4571J6144J7751J8782J9402K0840K3426
$$ 121977 129695 137642 146974 158253 171329 185900 202044 219795 238577 257979 278819 302245
57241C02245K5566K6092K6336K8072L0612L2201L3283L5625L8834M0665M0770
$$ 302245 327811 353903 380239 408311 438923 471124 504407 540032 578866 619531 660301
57230F60301M1192M2878M4620M5929M8078N1325N3872N4753N5232N6000N5422
$$ 660301 701493 744371 788991 834920 882998 934323 988195 1042948 1098180 1154180 1209602
57219A209602N2155M7364M2584L7127K9353J9174P824l582j4121k3075l0904l8694
$$ 1209602 1261757 1309121 1351705 1388832 1418185 1437359 1445183 1441601 1427480 1404405 1373501 1334807
57207A334807m5857n0109n0795n0155n0010m9244m6217m1718l7585l4100l0757
$$ 1334807 1288950 1238841 1188046 1137891 1087881 1038637 992420 950702 913117 879017 848260
57196H48260k8121k6677k5047k1544j6769j2703r991p843n861m184k393N3K705
$$ 848260 820139 793462 768415 746871 730102 717399 707408 699565 693704 689520 687127 687180 689885
57183F89885M764O241P454Q161Q448R409J1604J3793J4790J5602J8083K2081K5698
$$ 689885 694649 700890 708344 716505 724953 734362 745966 759759 774549 790151 808234 830315 856013
57170H56013K7941K9574L1576L4083L6902L9960M3174M6328M8947N0290N0231
$$ 856013 883954 913528 945104 979187 1016089 1056049 1099223 1145551 1194498 1244788 1295019
57159A295019N0091N1400N3728N5167N5146N5004N5470N5573N4619N3190N1488
$$ 1295019 1345110 1396510 1450238 1505405 1560551 1615555 1671025 1726598 1781217 1834407 1885895
57148A885895M8938M6112M4712M4775M4533M3931M5120M8257N0349N0086N0250
$$ 1885895 1934833 1980945 2025657 2070432 2114965 2158896 2204016 2252273 2302622 2352708 2402958
57137B402958N2932N5866N6525N6294N7088N7022N3598M8649M5675M4361M2014
$$ 2402958 2455890 2511756 2568281 2624575 2681663 2738685 2792283 2840932 2886607 2930968 2972982
57126B972982L8816L7187L7210L7017L6767L8175M0642M1672M0650L8841L6425
$$ 2972982 3011798 3048985 3086195 3123212 3159979 3198154 3238796 3280468 3321118 3359959 3396384
57115C396384L2965K9868K8871K8812K7157K3694J9695J4966R293N156M925O812
$$ 3396384 3429349 3459217 3488088 3516900 3544057 3567751 3587446 3602412 3611705 3616861 3621786 3628598
57103C628598P640Q169J1379J7084K2842K8703L6002M2690M5245M4460M4203M5134
$$ 3628598 3636238 3644407 3655786 3672870 3695712 3724415 3760417 3803107 3848352 3892812 3937015 3982149
57091C982149M4625M2047L8790L3871K5185J4534N764j715j1959k5750m0564n6436
$$ 3982149 4026774 4068821 4107611 4141482 4166667 4181201 4186965 4185250 4173291 4147541 4106977 4050541
57079D050541p5549r6539j15671j33343j52986j74115j93238k10915k30595k51295
$$ 4050541 3974992 3878453 3762782 3629439 3476453 3302338 3109100 2898185 2667590 2416295
57069B416295k69598k88361l14601l48702l84922C86958h3484n29743n96784o69846
$$ 2416295 2146697 1858336 1543735 1195033 810111 386958 -83484 -613227 -1210011 -1879857
57059a879857p52825q46984r49390j061333j188154j329083j477896j635329j809814
$$ -1879857 -2632682 -3479666 -4429056 -5490389 -6678543 -8007626 -9485522 -11120851 -12930665
57050a2930665k004597k216521k449087k713205l013027l345920l719125m150690
$$ -12930665 -14935262 -17151783 -19600870 -22314075 -25327102 -28673022 -32392147 -36542837
57042c6542837m650859n219708n866695o614234p478642q468383r604507j0917697
$$ -36542837 -41193696 -46413404 -52280099 -58894333 -66372975 -74841358 -84445865 -95363562
57034i5363562j2417088j4082604j5885853j7786169j9709772k1577896k3344849
$$ -95363562 -107780650 -121863254 -137749107 -155535276 -175245048 -196822944 -220167793
57027b20167793k4929381k6114485k6677337k6733005k6803540k7275702k7720889
$$ -220167793 -245097174 -271211659 -297888996 -324622001 -351425541 -378701243 -406422132
57020d06422132k6931023k3786499j8094365j0603650k378100N721921J3105884
$$ -406422132 -433353155 -457139654 -475234019 -485837669 -488215769 -482493848 -469387964
57013d69387964J9335962K4115486K7341660K9095200K9591810K9150723K8136170
$$ -469387964 -450052002 -425936516 -398594856 -369499656 -339907846 -310757123 -282620953
57006b82620953K6846372K5438300K3959644K2427019K0858349J9263726J7647436
$$ -282620953 -255774581 -230336281 -206376637 -183949618 -163091269 -143827543 -126180107
56999a26180107J6023045J4413925J2845251J1345716R947798Q674249P529567
$$ -126180107 -110157062 -95743137 -82897886 -71552170 -61604372 -52930123 -45400556
56992d5400556O510938N618660M849169M188374L620993L138947K733659K388910
$$ -45400556 -38889618 -33270958 -28421789 -24233415 -20612422 -17473475 -14739816 -12350906
56984a2350906K089643J830939J611300J423691J259805J116589R91944Q79927
$$ -12350906 -10261263 -8430324 -6819024 -5395333 -4135528 -3018939 -2026995 -1147068
56976a147068c70876C11746O01076N28072M60919M03187L58725L25397K99459
$$ -1147068 -370876 311746 912822 1440894 1901813 2305000 2663725 2989122 3288581
56967C288581K80644K67876K55372K38517K19106K00284J81033J60098J40371
$$ 3288581 3569225 3837101 4092473 4330990 4550096 4750380 4931413 5091511 5231882
56958E231882J24397J09913R4322P9180O5909N1702L4335J6870K947q881k1867
$$ 5231882 5356279 5466192 5560514 5639694 5705603 5757305 5791640 5808510 5811457 5802576 5780709
56947E780709l5568m7342n5734n9506n7376n1273m4851l6824k3422j1713k2042
$$ 5780709 5745141 5697799 5642065 5582559 5525183 5473910 5429059 5392235 5368813 5357100 5335058
56936E335058o8831j43264k21533k85738l30468l54939l59227l47237l25370k97667
$$ 5335058 5266227 5122963 4901430 4615692 4285224 3930285 3571058 3223821 2898451 2600784
56926B600784k66686k37125k12862j92175j71424j51797j37051j26667j17098
$$ 2600784 2334098 2096973 1884111 1691936 1520512 1368715 1231664 1104997 987899
56917I87899j08189j02183r7674r0755q1556p3697o7634o0239n1008m2990l7194
$$ 987899 879710 777527 679853 589098 507542 433845 366211 305972 254964 211974 174780
56906A74780l1246k4153j7653j2266o549p24L340O176J0315J5241J7046J3996
$$ 174780 143534 119381 101728 89462 82913 82189 85529 91705 102020 117261 134307 148303
56894A48303Q543L110k267p358j0739j2294j3268j3219j0384n756k900k922l190
$$ 148303 156846 159956 157689 150331 139592 127298 114030 100811 90427 84671 81771 78849 75659
56881G5659k092j268j882k207o17K071M761P834J1421J4568J7243K0326K2365
$$ 75659 73567 72299 70417 68210 67593 69664 74425 82259 93680 108248 125491 145817 168182
56868A68182J9499J0442j031j0314j6414k0615k3222k3878k3306k2523k1331A6378
$$ 168182 187681 198123 197092 186778 170364 149749 126527 102649 79343 56820 35489 16378
56855A47a3332j1102r114p653o369m621k656j350n46P79K466L200K982L644O223
$$ 147 -13332 -24434 -33548 -41201 -47570 -52191 -54847 -56197 -56743 -55964 -53498 -50298 -47316 -43672 -37449
56840c7449R534J2074b207A2192J4228J3698J4337J6923K0738K4951K9255L2915
$$ -37449 -27915 -15841 -2207 12192 26420 40118 54455 71378 92116 117067 146322 179237
56828A79237L5036L6285L8484M1639M3113M0612L4556K6742J8339J0040K739k991
$$ 179237 214273 250558 289042 330681 373794 414406 448962 475704 494043 504083 506822 503831
56816E03831p119r279q979p021n237m179k531N66M170P226J0163J3896J8411K3072
$$ 503831 496712 487433 478454 471433 466196 462017 459486 460052 464222 471448 481611 495507 513918 536990
56802E36990K7483L1537L5388L9216M1866M0108L1263J6702J033j2287k2657k9821
$$ 536990 564473 596010 631398 670614 712480 752588 783851 800553 801586 789299 766642 736821
56790G36821l2572l0901k7002k2773j8020j2266o455j565K948Q090J3998K0661
$$ 736821 704249 673348 646346 623573 605553 593287 586832 585267 588215 596305 610303 630964
56778F30964K8541L7414M5888N3041N9243O4303O5898O1003M8396K9466P561j3327
$$ 630964 659505 696919 742807 795848 855091 919394 985292 1046295 1094691 1124157 1131718 1118391
56766A118391l0492m3419n2094n5308n2575m6799m2031l8608l3581k6131j9030
$$ 1118391 1087899 1044480 992386 937078 884503 837704 795673 757065 723484 697353 678323
56755F78323j3799q185j07R075J7350K5050L2809L9211M2843M4180M2968L6316
$$ 678323 664524 656339 656232 665307 682657 707707 740516 779727 822570 866750 909718 946034
56743I46034K2574N151j0522k2408l1544l8191m1417m1517l9846l6919l3006k9457
$$ 946034 968608 973759 963237 940829 909285 871094 829677 788160 748314 711395 678389 648932
56731F48932k6935k3551j7561j0870o867n498l522P57N996J0843J5369J9071K0096
$$ 648932 621997 598446 580885 570015 563148 557650 554128 554885 560881 571724 587093 606164 626260
56718F26260J7218J0939K312p640j7290k4836k9494l1275l0163k6999k4162k3414
$$ 626260 643478 654417 656729 649089 631799 606963 577469 546194 516031 489032 464870 441456
56706D41456k3520k2022j8702j5321j2600r842p119n468m909m487m132m544n396
$$ 441456 417936 395914 377212 361891 349291 339449 332330 326862 321953 317466 313334 308790 303394
56693C03394n635n317n211m976l902k893l328m425m296l257l258m258m265l151
$$ 303394 297759 292442 287231 282255 278353 275460 272132 267707 263411 260154 256896 252638 248373 245222
56679B45222l171m988o311n595m274l996m190l825l471l946m715m978m861m495
$$ 245222 242051 237063 230752 225157 220883 216887 212697 208872 205401 201455 196740 191762 186901 182406
56665A82406l349j475K1N15M53J0j070j896r22J307K130N44j310j584j339k067
$$ 182406 179057 177582 177603 178118 178571 178581 177511 175615 174693 176000 178130 178674 177364 175780 174441 172374
56649A72374k836k005j53P90L56m04q89j366k067l010m172m975m570l294k687
$$ 172374 169538 167533 167380 168170 168526 168122 167233 165867 163800 160790 156618 151643 147073 143779 141092
56634A41092l329l930l402k203p75J598M940P363P393O187N712N962N859N677
$$ 141092 137763 133833 130431 128228 127453 129051 133991 141354 148747 154934 160646 166608 172467 178144
56620A78144O442P623P580O052M459L737L461L117K899L043L305L292K758J690
$$ 178144 184586 192209 199789 205841 210300 214037 217498 220615 223514 226557 229862 233154 235912 237602
56606B37602N20q3K5L57O66J081J224L60j201k172k251k489k958j962J078L727
$$ 237602 238122 238039 238064 238421 239087 240168 241392 241752 240551 238379 236128 233639 230681 228719 229797 233524
56590B33524L426J052l51L62J702K214J909J106k79j892k742k297j200o73j504
$$ 233524 236950 238002 237651 238013 239715 241929 243838 244944 244665 242773 240031 237734 236534 235861 234357
56575B34357l399m992n156m486m666n903o340m710k170m33N57J637K388J910Q22
$$ 234357 230958 225966 220810 216324 211658 205755 199415 194705 192535 192102 192659 194296 196684 198594 199416
56560A99416O56J617K509K578K037J062k71j260j097j06N87N16K28L46J080K210
$$ 199416 200072 201689 204198 206776 208813 209875 209604 208344 207247 207141 207728 208244 208472 208818 209898 212108
56544B12108K908K178K91r73l29J476K994L940M595M515L239J559N27j48j284
$$ 212108 215016 217194 217485 216512 216183 217659 220653 224593 229188 233703 236942 238501 239028 238880 237596
56529B37596k429k398j140L26J474K444L127L345L487L756L391J917M65L67J162
$$ 237596 235167 232769 231629 231955 233429 235873 239000 242345 245832 249588 252979 254896 255361 255728 256890
56514B56890J587J925L545O312Q387Q609P615O515N786N580N998O882Q053R506
$$ 256890 258477 260402 263947 270259 278646 287255 294870 301385 307171 312751 318749 325631 333684 343190
56500C43190J0828J1114J0314R730J0093J0243R007P256O530O637O417N828N430
$$ 343190 354018 365132 375446 385176 395269 405512 414519 421775 428305 434942 441359 447187 452617
56487D52617M689K930J103M87L03j127l472m981n496o392p843q685q731q746q296
$$ 452617 457306 460236 461339 461826 462129 461002 457530 452549 447053 440661 432818 424133 415402 406656 398360
56472C98360o337l988l829n989p552o574m262k457j462j189k091l780m699m349
$$ 398360 392023 388035 384206 378217 370665 364091 359829 357372 355910 354721 352630 348850 344151 339802
56458C39802m100m849n557n119m030l221k653j890q56O09K468L555K531K83n01
$$ 339802 335702 330853 325296 320177 316147 312926 310273 308383 307527 308136 310604 314159 316690 316973 316472
56443C16472J173L266L536K038J14j299j562l52J299J452k90k217l043l333l731
$$ 316472 317645 320911 324447 326485 326599 325300 323738 323386 324685 326137 325847 323630 320587 317254 313523
56428C13523l563k270o22N25J329J905J702P68J88L57L75o7J35J454K619K736
$$ 313523 309960 307690 307068 307593 308922 310827 312529 313297 313485 313842 314217 314150 314285 315739 318358 321094
56412C21094K825L858M833M439L417L564N169O909P661P400O742O458O848P090
$$ 321094 323919 327777 332610 337049 340466 344030 349199 356108 363769 371169 377911 384369 391217 398307
56398C98307O062M249L657N183P266P853O624M557K554J268J081J356P34r93k380
$$ 398307 404369 408618 412275 417458 424724 432577 439201 443758 446312 447580 448661 450017 450751 449758 447378
56383D47378k321j459q47m55N3K55l75j544k668l577m163m173l848l811l960l427
$$ 447378 445057 443598 442751 442296 442349 442604 442229 440685 438017 434440 430277 426104 422256 418445 414485 411058
56367D11058j961m07L33k29k484n957q333p244l413j69M57o28j974l248l972l054
$$ 411058 409097 408690 409023 408794 406310 400353 392020 384776 381363 381194 381651 381023 379049 375801 371829 368775
56351C68775q13N90j26j857l162l940m182l192j219P8l2l35JJ02m92n40N80J398
$$ 368775 367962 368552 368426 366569 363407 359467 355285 352093 350874 350952 350920 350585 350586 350688 350196 349656 350236 351634
56333C51634Q35K51J199K864L583L487L752M468M924N115N407N600N368M847M066
$$ 351634 352469 352720 353919 356783 360366 363853 367605 372073 376997 382112 387519 393119 398487 403334 407400
56318D07400K921K190K889M186L943K118J261K597M049L555K014J233J126Q82
$$ 407400 410321 412511 415400 419586 423529 425647 426908 429505 433554 437109 439123 440356 441482 442364
56304D42364R48J868K786K901K934L527L766K854J700J350J455J562K108K931
$$ 442364 443312 445180 447966 450867 453801 457328 461094 463948 465648 466998 468453 470015 472123 475054
56290D75054K761J574J294K730M111M186M193M993M985L142J505K088L557L709
$$ 475054 477815 479389 480683 483413 487524 491710 495903 500896 505881 509023 510528 512616 516173 519882
56276E19882L210M051O075P760Q954J0313J1397J1693J2064J3140J3893J3766
$$ 519882 523092 527143 533218 540978 549932 560245 571642 583335 595399 608539 622432 636198
56264F36198J4137J5517J5698J3363J1219J2310J5121J5877J4196J3086J4051
$$ 636198 650335 665852 681550 694913 706132 718442 733563 749440 763636 776722 790773
56253G90773J5507J5639J4249J1948R530P824O890O089N617O290P172O004L192
$$ 790773 806280 821919 836168 848116 857646 865470 872360 878449 884066 890356 897528 903532 906724
56240I06724K260M677P544Q434Q824J0195J0652Q999Q287J1140J4888J5961J6138
$$ 906724 908984 913661 921205 929639 938463 948658 959310 968309 976596 987736 1002624 1018585 1034723
56227A034723J9455K5198K9153L0147L0494L1403L2576L5060L9864M4900M7688
$$ 1034723 1054178 1079376 1108529 1138676 1169170 1200573 1233149 1268209 1308073 1352973 1400661
56216A400661M9805N4363O0495O5071O8455P3645Q0675Q6949R2514J00000J09760
$$ 1400661 1450466 1504829 1565324 1630395 1698850 1772495 1853170 1940119 2032633 2132633 2242393
56205B242393J19825J30285J42902J56483J67723J76869J87888K02442K17830
$$ 2242393 2362218 2492503 2635405 2791888 2959611 3136480 3324368 3526810 3744640
56196C744640K31406K43086K52979K60211K64573K66017K62576K52120K35914
$$ 3744640 3976046 4219132 4472111 4732322 4996895 5262912 5525488 5777608 6013522
56187F013522K17006J95558J69311J38075J04131O8833L2714j823l1955n8100
$$ 6013522 6230528 6426086 6595397 6733472 6837603 6906436 6939150 6937327 6905372 6847272
56177F847272q2295j03811j20384j32672j43023j50872j54172j54680j56609j60461
$$ 6847272 6764977 6661166 6540782 6408110 6265087 6114215 5960043 5805363 5648754 5488293
56167E488293j63122j63925j65498j68662j71339j72729j73952j74642j73433
$$ 5488293 5325171 5161246 4995748 4827086 4655747 4483018 4309066 4134424 3960991
56158C960991j71465j70606j68811j62534j53270j46054j41596j35782j27149
$$ 3960991 3789526 3618920 3450109 3287575 3134305 2988251 2846655 2710873 2583724
56149B583724j18807j12197j04931r6035q7849q1449p5264o9242o5264o2542n7867
$$ 2583724 2464917 2352720 2247789 2151754 2063905 1982456 1907192 1837950 1772686 1710144 1652277
56138A652277n1161m5711m2143l7739l2359k9227k8674k6967k2756j9042j7290
$$ 1652277 1601116 1555405 1513262 1475523 1443164 1413937 1385263 1358296 1335540 1316498 1299208
56127A299208j5278j2267j0604j0427q512m259j242q65m8K727M692M477N036Q289
$$ 1299208 1283930 1271663 1261059 1250632 1242120 1237861 1236619 1235754 1235706 1238433 1243125 1247602 1252638 1260927
56113A260927J1868J3742J5439J8223K0507K1337K2161K3354K3104K1200J9668
$$ 1260927 1272795 1286537 1301976 1320199 1340706 1362043 1384204 1407558 1430662 1451862 1471530
56102A471530J8578J5860J2087J0478J1243J1187R478Q423Q098O418M946P854
$$ 1471530 1490108 1505968 1518055 1528533 1539776 1550963 1560441 1568864 1576962 1583380 1588326 1596180
56090A596180J4149J7972J8096J9824K5832L2610L8032M4734N3459O0731O6229
$$ 1596180 1610329 1628301 1646397 1666221 1692053 1724663 1762695 1807429 1860888 1921619 1987848
56079A987848P4988Q8950J03509J15663J28078J41571J51163J53788J52628J49734
$$ 1987848 2062836 2151786 2255295 2370958 2499036 2640607 2791770 2945558 3098186 3247920
56069C247920J41667J27158J11969J01077R2395Q2781P3678O5821N4893L7884
$$ 3247920 3389587 3516745 3628714 3729791 3822186 3904967 3978645 4044466 4099359 4137243
56059D137243J8281L71j6060l1224m1885m7288n2692o2356p4451q6694j00703
$$ 4137243 4155524 4155895 4139835 4108611 4066726 4019438 3966746 3904390 3829939 3743245 3642542
56048C642542j16419j28617j33782j34559j33286j27485j16079j03566r3495q3995
$$ 3642542 3526123 3397506 3263724 3129165 2995879 2868394 2752315 2648749 2555254 2471259
56038B471259p3814o5848o0606n3534m3362l5672l3480l1991k7562k3817k3506
$$ 2471259 2397445 2331597 2270991 2217457 2174095 2138423 2104943 2072952 2045390 2021573 1998067
56027A998067k2401j7313j2273j0733r371n621l405n025n400j035L164K727J367
$$ 1998067 1975666 1958353 1946080 1935347 1925976 1920355 1916950 1911925 1906525 1905490 1908654 1911381 1912748
56014A912748L132M934L935M293R139J3753J4130J4459J8753K3123K3823K4612
$$ 1912748 1915880 1920814 1924749 1929042 1938181 1951934 1966064 1980523 1999276 2022399 2046222 2070834
56002B070834K8419L0331K6981K4289K7451L1722L1704L0943L3630L5679L3368
$$ 2070834 2099253 2129584 2156565 2180854 2208305 2240027 2271731 2302674 2336304 2371983 2405351
55991B405351L1993L6437M1798M2748M3307M7728N1061M8945M7340N2016N7657
$$ 2405351 2437344 2473781 2515579 2558327 2601634 2649362 2700423 2749368 2796708 2848724 2906381
55980B906381N8213N8521O4490P1305P2943P3932P9833Q5635Q5615Q5204R0813
$$ 2906381 2964594 3023115 3087605 3158910 3231853 3305785 3385618 3471253 3556868 3642072 3732885
55969C732885R7671J00006J03076J12359J21473J24014J26553J36044J45734J48106
$$ 3732885 3830556 3930562 4033638 4145997 4267470 4391484 4518037 4654081 4799815 4947921
55959D947921J50188J60466J72292J76634J79697J90715K03565K08448K10924
$$ 4947921 5098109 5258575 5430867 5607501 5787198 5977913 6181478 6389926 6600850
55950F600850K21047K34397K42396K50576K67441K86041K96128L03881L20007
$$ 6600850 6821897 7056294 7298690 7549266 7816707 8102748 8398876 8702757 9022764
55941I022764L39595L53798L69511L96538M27472M51931M77987N17156N61493
$$ 9022764 9362359 9716157 10085668 10482206 10909678 11361609 11839596 12356752 12918245
55932A2918245N98872O36839O86875P39919P83551Q27937Q86973R49525R98812
$$ 12918245 13517117 14153956 14840831 15580750 16364301 17192238 18079211 19028736 20027548
55923B0027548J044438J104583J173292J237795J310405J408172J518792J623326
$$ 20027548 21071986 22176569 23349861 24587656 25898061 27306233 28825025 30448351
55915C0448351J733908J870028K017921K155942K299581K476464K679386K892885
$$ 30448351 32182259 34052287 36070208 38226150 40525731 43002195 45681581 48574466
55907D8574466L141535L457154L823442M213728M659403N217371N896981O687307
$$ 48574466 51716001 55173155 58996597 63210325 67869728 73087099 78984080 85671387
55899H5671387P621519Q731617R976228J1311748J2805429J4579810J6692364
$$ 85671387 93292906 102024523 112000751 123312499 136117928 150697738 167390102
55892A67390102J9187093K2188276K5762263K9745844L3907117L8094607M1695613
$$ 167390102 186577195 208765471 234527734 264273578 298180695 336275302 377970915
55885C77970915M2844357L8877425K8384875J2920486l668283j7720593k7561986
$$ 377970915 420815272 459692697 488077572 500998058 497329775 479609182 452047196
55878D52047196l3320122l5795795l5834282l4288348l1935742k9270448k6509179
$$ 452047196 418727074 382931279 347096997 312808649 280872907 251602459 225093280
55871B25093280k3781672k1196916j8784214j6525895j4453851j2627201j1039973
$$ 225093280 201311608 180114692 161330478 144804583 130350732 117723531 106683558
55864A06683558r639221q413904p386312o535611n805845n175735m653433m216310
$$ 106683558 97044337 88630433 81244121 74708510 68902665 63726930 59073497 54857187
55856E4857187l819987l457045l149152k890296k650940k428786k243612k088580
$$ 54857187 51037200 47580155 44431003 41540707 38889767 36460981 34217369 32128789
55848C2128789j934688j778300j640044j521819j406719j296739j210203j144873
$$ 32128789 30194101 28415801 26775757 25253938 23847219 22550480 21340277 20195404
55840B0195404j080678j015652r64097r22595q72041q10950p54912p05928o52745
$$ 20195404 19114726 18099074 17134977 16212382 15340341 14529391 13774479 13068551 12415806
55831A2415806n98375n57084n26546m91710m53728m26938m09723l86295l55781
$$ 12415806 11817431 11260347 10733801 10242091 9788363 9361425 8951702 8565407 8209626
55822H209626l32710l19586l04844k87162k76632k72164k61960k46555k38247
$$ 8209626 7876916 7557330 7252486 6965324 6688692 6416528 6154568 5908013 5669766
55813E669766k37514k32192k20078k10707k04804j93366j77418j68000j65820
$$ 5669766 5432252 5200060 4979982 4769275 4564471 4371105 4193687 4025687 3859867
55804C859867j60603j50759j44449j41250j32080j17489j07096j00790q9367p4059
$$ 3859867 3699264 3548505 3404056 3262806 3130726 3013237 2906141 2805351 2715984 2641925
55794B641925o6450o8055o8366o4263o3330o6656o6134o0703n8183n9140n5542
$$ 2641925 2575475 2507420 2439054 2374791 2311461 2244805 2178671 2117968 2059785 2000645 1945103
55783A945103m7045m2296m2396l9247l1947k8639l0228k8454k2318k0424k4370
$$ 1945103 1898058 1855762 1813366 1774119 1742172 1713533 1683305 1654851 1632533 1612109 1587739
55772A587739k5719k2455k2862k9452l4013l2597l1159l2467l1324k6790k5621
$$ 1587739 1562020 1539565 1516703 1487251 1453238 1420641 1389482 1357015 1325691 1298901 1273280
55761A273280k9269l0399k6506k4460k7409k9365k6958k4828k5267k3870j9449
$$ 1273280 1244011 1213612 1187106 1162646 1135237 1105872 1078914 1054086 1028819 1004949 985500
55750I85500j7149j8031j6374j0774p113p195n389J2L129J798J614M854N955K227
$$ 985500 968351 950320 933946 923172 916059 908864 903475 903487 906616 908414 910028 914882 920837 923064
55736I23064j311j838l517q289j1573j1322j1998j5518j7422j5836j5183j7211
$$ 923064 921753 919915 916398 908109 896536 885214 873216 857698 840276 824440 809257 792046
55724G92046j7389j4024j1967j3321j3384r825p302q887j1192j1848j3546j6867
$$ 792046 774657 760633 748666 735345 721961 712136 704834 695947 684755 672907 659361 642494
55712F42494j7494j4429j2836j4822j5471j1966q541q267p865n053l443n575q109
$$ 642494 625000 610571 597735 582913 567442 555476 546935 538668 530803 525750 522307 516732 508623
55699E08623q208q111r630j0589j0119j0910j3144j3010j0077q931j0771j1014
$$ 508623 500415 492304 482674 472085 461966 451056 437912 424902 414825 405894 395123 384109
55687C84109q213p274j0156j1536q090m384m752o441n684m063m034m137l039k717
$$ 384109 375896 368622 358466 346930 338840 334456 329704 323263 317579 313516 309482 305345 302306 299589
55673B99589l804l453j142o18k820l399n89J233o03k506j844j723m271n887l943
$$ 299589 295785 292332 291190 290572 287752 284353 283764 284997 284394 281888 280044 278321 274050 268163 264220
55658B64220j846k657l688k140l00l73J50L123N147L260K83j21J063J778L145
$$ 264220 262374 259717 256029 253889 253589 253216 253366 256489 261636 264896 265179 265058 266121 267899 271044
55643B71044N987P796P017N805N236L067o22j419K017M606L015J062K471M442
$$ 271044 277031 284827 291844 297649 302885 305952 305330 303911 305928 310534 313549 314611 317082 321524
55629C21524L630K547M255N937L864K57p46k6p28k174j907o84n08o76j36m75k476
$$ 321524 325154 327701 331956 337893 341757 342014 341268 341242 340514 338340 336433 335749 335241 334565 334429 333954 331478
55612C31478l248r52J232J32k124k081n60O7N78K372L620K434Q59J451K770K272
$$ 331478 328230 327278 328510 328642 326518 324437 323877 323944 324522 326894 330514 332948 333807 335258 338028 340300
55596C40300O97j68r53k307k303M1J946J274K02P97P30k355n910o477n435o181
$$ 340300 340997 340829 339876 337569 335266 335307 337253 338527 338729 339526 340256 337901 331991 325514 320079 313898
55580C13898q331r285r108r663j0850j1468j1888j2710j2949j2167j1802j1917
$$ 313898 305567 296282 287174 277511 266661 255193 243305 230595 217646 205479 193677 181760
55568A81760j0008n654k655l465n322n097m007m089m058k608j992m098o458o143
$$ 181760 171752 166098 163443 159978 154656 149559 145552 141463 137405 134797 132805 128707 122249 116106
55554A16106m264k905j289J105J624j023l149j644O25k57k485j952P31J983J403
$$ 116106 111842 108937 107648 108753 110377 109354 106205 104561 105186 104929 102444 100492 101223 103206 104609
55539A04609J090J004j45j393j281j042k084k677j081P10L75m28N27J481K9j935
$$ 104609 105699 106703 106558 105165 103884 102842 100758 98081 97000 97710 98085 97657 98184 99665 99694 97759
55523I7759j470K0m31j796j356p3m75j483n98P84l46k780k848o42O24K74K82Q17
$$ 97759 96289 96309 95878 94082 92726 92653 92178 90695 90097 90881 90535 87755 84907 84265 84889 85163 85445 86262
55505H6262M15l33L12J575J498P41J172K038J572P77J486K397J371j19N77K046
$$ 86262 86677 86344 86656 88231 89729 90470 91642 93680 95252 96029 97515 99912 101283 101164 101741 103787
55489A03787Q66k391l963k799j114QJ147J631L78j112p48K59n54k168j673N93
$$ 103787 104653 102262 98299 95500 94386 94394 95541 97172 97550 96438 95690 95949 95395 93227 91554 92147
55473I2147J850J789K318L332L067J847J410J383M63r3J509L364K249q13k082
$$ 92147 93997 95786 98104 101436 104503 106350 107760 109143 109606 109513 111022 114386 116635 115822 113740
55458A13740j250j207k388k456j459k211n200p611p933p506p209o340n029m136
$$ 113740 112490 111283 108895 106439 104980 102769 97569 89958 82025 74519 67310 60970 55941 51805
55444E1805k933k97K167J934l7o30K26j73k127l018k020j110j075n00P50Q40o55
$$ 51805 48872 48575 50742 52676 52639 52009 52235 52062 49935 46917 44897 43787 42712 42212 42962 43802 43147
55427D3147j905j871j265m56P32J272Pj842k211j521j485j602l11J269O44j643
$$ 43147 41242 39371 38106 37650 38382 39654 39661 37819 35608 34087 32602 31000 30689 31958 32602 30959
55411C0959k805k388k242k528j819o39q08j620q00J039J135m70j074l20n50j923
$$ 30959 28154 25766 23524 20996 19177 18538 17730 16110 15310 16349 17484 17014 15940 15620 15070 13147
55395A3147j747O55K671K842K631K924K439O62j055k080l164l968l122j035K89
$$ 13147 11400 12055 14726 17568 20199 23123 25562 26224 25169 23089 19925 15957 12835 11800 12089
55380A2089M76Q45J461J285R20J795K945K214K97k06O34M28q69r53K51L57r03
$$ 12089 12565 13410 14871 16156 17076 18871 21816 24030 24327 24121 24755 25183 24314 23361 23612 23969 23066
55363B3066j193J7O48J15P6P45N35l88l99k58k109m425l198J204L571J573j215
$$ 23066 21873 21890 22538 22653 22729 23474 24009 23621 23222 22964 20855 16430 13232 14436 18007 19580 18365
55346A8365j525o98q02j157j038j579k620j737J294K979J409n94j50J411J624
$$ 18365 16840 16142 15340 14183 13145 11566 8946 7209 8503 11482 12891 12297 12147 13558 15182
55331A5182Q80O45M81m49j208p68Q4L66M11M93Q1l91M85K354L028K035J337J629
$$ 15182 16062 16707 17188 16739 15531 14763 14847 15213 15624 16117 16198 15807 16292 18646 21674 23709 25046 26675
55313B6675J196m53j303n48k44j543k566j783m04K67Q48J591J225k35o31O78J426
$$ 26675 27871 27418 26115 25567 25323 23780 21214 19431 19027 19294 20142 21733 22958 22723 22092 22770 24196
55296B4196M83q2J040J851P62m54k5N27o43k122j661o9K54j010k405l231l579
$$ 24196 24679 24597 25637 27488 28250 27796 27771 28298 27655 25533 23872 23803 24057 23047 20642 17411 13832
55279A3832l218k279j710j689j116J69P07L6k00Q96J882J588J017J121J101M01
$$ 13832 10614 8335 6625 4936 3820 3989 4696 4732 4532 5428 7310 8898 9915 11036 12137 12538
55263A2538Q6O90J061O96P48J316M78k278m373l835k032p77O30L205N498N448
$$ 12538 12624 13314 14375 15071 15819 17135 17613 15335 10962 7127 5095 4318 4948 8153 13651 19099
55247A9099L179O6l033n027m444j951o12j696k604j064J157J227l68j197p83l72
$$ 19099 22278 22344 19311 14284 9840 7889 7277 5581 2977 1913 3070 4297 3929 2732 1949 1577
55231A577k37K65R91J417J762K081J541O6q57m38M0l56l60J184K954L055J752
$$ 1577 1340 1605 2596 4013 5775 7856 9397 9463 8606 8168 8208 7852 7492 8676 11630 14685 16437
55214A6437N53n3l28j77L44O33P98J742L154L304J723N3o69j224j789j068Q28
$$ 16437 16990 16937 16609 16432 16776 17409 18207 19949 23103 26407 28130 28183 27514 26290 24501 23433 24261
55197B4261J430m50k695l199k592k047j070M89J008k08j247q09m87j551k115j97
$$ 24261 25691 25241 22546 19347 16755 14708 13638 14127 15135 14927 13680 12871 12384 10833 8718 8521
55181H521K611L335J706m15j906k467j620J22Q17j92q71L41J993K114J092K49
$$ 8521 11132 14467 16173 15758 13852 11385 9765 9887 10704 10512 9641 9982 11975 14089 15181 15430
55165A5430k43j34J596M191M524J458j829k247q79j98m1P19J219M88j13N68Q79
$$ 15430 15187 15053 16649 20840 25364 26822 24993 22746 21867 21669 21628 22347 23566 24054 23941 24509 25388
55148B5388n93j911r99O17P77P44K332L522J448k161l155j181O98J510K748M073
$$ 25388 24795 22884 21885 22502 23279 24023 26355 29877 31325 29164 26009 24828 25526 27036 29784 33857
55132C3857L289N78j415j810k161k828k361p29K49J23M08J595K380K097J414N11
$$ 33857 37146 37724 36309 34499 32338 29510 27149 26420 26669 26792 27200 28795 31175 33272 34686 35197
55116C5197r45k091j634k48J96m36p27m28m52n55L30J596J414l25j849k220k021
$$ 35197 34252 32161 30527 30279 30475 30039 29312 28884 28432 27877 28207 29803 31217 30892 29043 26823 24802
55099B4802j595p89k33o87j408j121k73k34q83j123j129j830k658k119j90J794
$$ 24802 23207 22418 22185 21498 20090 18969 18696 18462 17579 16456 15327 13497 10839 8720 8530 10324
55083A0324L011L140J559j269k852j520Q81J604R61R43J399Q45o7M62J686J293
$$ 10324 13335 16475 18034 16765 13913 12393 13274 14878 15839 16782 18181 19026 18959 19421 21107 22400
55067B2400l37m45J546L239L154K323J741J321J413K557L664L258K247K565L417
$$ 22400 22063 21618 23164 26403 29557 31880 33621 34942 36355 38912 42576 45834 48081 50646 54063
55052E4063K377n0p01J120K597K143J402J559J239m34j958k197k123k305j409
$$ 54063 56440 56390 55689 56809 59406 61549 62951 64510 65749 65315 63357 61160 59037 56732 55323
55037E5323J040K943K500Q17r5o7Q6M21J192J579P70n85j126m96M82P14l06j795
$$ 55323 56363 59306 61806 62623 62528 62461 62547 62968 64160 65739 66509 65924 64798 64302 64784 65498 65192 63397
55019F3397j954kK240K183l02k848l529k371l33J539K170J500J183K597M567M881
$$ 63397 61443 61441 63681 65864 65562 62714 59185 56814 56481 58020 60190 61690 62873 65470 70037 74918
55003G4918L418J664j47k652m583l580JK899L239K283J426J05k213m373n124m609
$$ 74918 78336 80000 79853 77201 72618 69038 69039 71938 75177 77460 78886 78991 76778 72405 67281 62672
54987F2672l399j664J0O31K21j83j79o5N79K318L942L501J533P89K165L411K684
$$ 62672 59273 57609 57619 58250 58471 58288 58109 58044 58623 60941 64883 68384 69917 70706 72871 76282 78966
54970G8966J036L26P16J421K093K315J389k95j132n66p9r78k388k511r47J035
$$ 78966 80002 80328 81044 82465 84558 86873 88262 87967 86835 86269 86190 85212 82824 80313 79366 80401
54954H0401K033J750J006O00J46j119k227q98K801N283L941R65L8R98R77m96j331
$$ 80401 82434 84184 85190 85790 85936 84817 82590 81692 84493 89776 93717 94682 94720 95718 96695 96199 94868
54937I4868j093j382k111j424L64O10j140k186j242l38r44j595r67j69l00m56
$$ 94868 93775 92393 90282 88858 89222 89832 88692 86506 85264 84926 83982 82387 81420 81251 80951 80495
54921H0495J52O30M80P77J807K022Q43L3P37J570J287R97J935L157L361L060L253
$$ 80495 80647 81277 81757 82534 84341 86363 87206 87239 87976 89546 90833 91830 93765 96922 100283 103343 106596
54904A06596L596L541L641M348N032N310N725O236N987N419O254Q399R519Q990
$$ 106596 110192 113733 117374 121722 126754 132064 137789 144025 150012 155431 161685 170084 179603 188593
54890A88593R492J2805J6686J8153J7599J7014J6240J3813J0201P230M939J492
$$ 188593 198085 210890 227576 245729 263328 280342 296582 310395 320596 327826 332765 334257
54878C34257l916r807j4084j5853j5799j5383j5382j5043j3452j1385j0258r557
$$ 334257 330341 320534 306450 290597 274798 259415 244033 228990 215538 204153 193895 184338
54866A84338p605m951m149n553o232m394j989j250j343m78R85J812K304L244M157
$$ 184338 176733 171782 167633 162080 155848 151454 149465 148215 146872 146394 147379 149191 151495 154739 158896
54851A58896M584N447P202Q355P843P249Q567J1239J3507J5146J6635J6940J4570
$$ 158896 163480 168927 176129 184484 192327 199576 208143 219382 232889 248035 264670 281610 296180
54838B96180R945M743k61m958q558j0405j1301j2315j3166j3262j3260j3905j4385
$$ 296180 306125 310868 310607 305649 297091 286686 275385 263070 249904 236642 223382 209477 195092
54825A95092j3579j1958j0608r309p246m813l200k851l513m808n757m988k641
$$ 195092 181513 169555 158947 149638 142392 137579 134379 131528 128015 123207 117450 112462 109821
54812A09821p18l86m88K8J96q21j696j230q21k222m259m406k645j253j449k522
$$ 109821 109103 108717 108229 108257 108453 107632 105936 104706 103885 101663 97404 92998 90353 89100 87651 85129
54796H5129l628m330l916k174l87K34L65J259K435K527J515K38j366l413m404
$$ 85129 81501 77171 73255 71081 70694 70928 71293 72552 74987 77514 79029 79267 77901 74488 70084
54781G0084k852j39O56j227l359l408j578M47J520J666J630J897J901P80q07r46
$$ 70084 67232 67093 67749 66522 63163 59755 58177 58624 60144 61810 63440 65337 67238 68018 67211 66265
54765F6265P62K302K138J247J022J017N72P58K545M582N154M863N106N303M344
$$ 66265 67027 69329 71467 72714 73736 74753 75325 76083 78628 83210 88364 93227 98333 103636 107980
54750A07980L326L955N221M861L432L662N954P763P592O696O409O460O567P344
$$ 107980 111306 115261 120482 125343 128775 132437 138391 146154 153746 160442 166851 173311 179878 187222
54736A87222Q898J0494J2067J4237J6520J7506J7076J6475J5885J3915J0037N581
$$ 187222 196120 206614 218681 232918 249438 266944 284020 300495 316380 330295 340332 345913
54724C45913J660k064n855q755r806r303q200p225o827o910o584n228l739l505
$$ 345913 347573 345509 339654 330899 321093 311790 303590 296365 289538 282628 276044 270816 267077 263572
54710B63572m391n013m804m199l140j254N41P11l36k84J949M856O741P755Q775
$$ 263572 259181 254168 249364 245165 242025 240771 241312 242023 241687 241403 243352 248208 254949 262704 271479
54695B71479R847J0832J2311J4757J7497J9409K0117K0056J9955K0455K1551K2116
$$ 271479 281326 292158 304469 319226 336723 356132 376249 396305 416260 436715 458266 480382
54683D80382K0760J7432J3431R712O029J961k208n959r309j2590j5873j8845k1099
$$ 480382 501142 518574 532005 541717 547746 549707 547499 541540 532231 519641 503768 484923 463824
54670D63824k2469k3256k3799k3733k2223j9304j6264j4220j3007j2088j1587
$$ 463824 441355 418099 394300 370567 348344 329040 312776 298556 285549 273461 261874
54659B61874j1608j1416j0353q779p253n672m280m255n777o630m636q41J670J624
$$ 261874 250266 238850 228497 219718 212465 206793 202513 198258 192481 185851 181215 180374 182044 183668
54645A83668L57q73k063k895k144M63L211M104K783M19j527k189j779j425j905
$$ 183668 184025 183152 181089 178194 176050 176513 179724 183828 186611 187030 185503 183314 181535 180110 178205
54630A78205k592k153k86J792K447J113r23j231J190L917L323o09l602k432J077
$$ 178205 175613 173460 173174 174966 177413 178526 177603 176372 177562 181479 184802 184193 180591 178159 179236
54615A79236L157L213L219L602K939J259M87J429K794L644M551N831O607O316
$$ 179236 182393 185606 188825 192427 195366 196625 197112 198541 201335 204979 209530 215361 221968 228284
54601B28284N664N565O218P359Q350Q148O470M658M112M327L955L229L538M982
$$ 228284 233948 239513 245731 253090 261440 269588 276058 280716 284828 289155 293110 296339 299877 304859
54587C04859O240O649O708O764P012Q445J1853J6070J9166K1053K2984K4909K5762
$$ 304859 311099 317748 324456 331220 338232 346677 358530 374600 393766 414819 437803 462712 488474
54574D88474K6110K7776L0569L1989L0665K7685K3920J8534J1076K797n217j3257
$$ 488474 514584 542360 572929 604918 635583 663268 687188 705722 716798 719595 714378 701121
54562G01121k1194k7326l0304l0927l0911l0914l0534k9286k7048k4372k2426
$$ 701121 679927 652601 622297 591370 560459 529545 499011 469725 442677 418305 395879
54551C95879k1522k0009j6176j1036p366o107n849n794o725q536r394q338o651
$$ 395879 374357 354348 338172 327136 319770 313663 307814 302020 295295 286759 277365 269027 262376
54538B62376n746n500n540o084o660o054m521m041n243o159n317m006l921m483
$$ 262376 256630 251130 245590 239506 232846 226792 222271 218230 212987 206828 201511 197505 193584 189101
54524A89101m275l609l728m566n115n179n126m658l302j601o21o46j225j944k396
$$ 189101 184826 181217 177489 172923 167808 162629 157503 152845 149543 147942 147321 146675 145450 143506 141110
54509A41110k167j523j407k073k557k114j237o10l9P92J433J336P48K35n5j92
$$ 141110 138943 137420 136013 133940 131383 129269 128032 127422 127383 128175 129608 130944 131692 131927 131872 131680
54493A31680j59M0N38J740L374L749J571j611k620n77K265L977N043O237O639
$$ 131680 131521 131561 132099 133839 137213 140962 142533 140922 138302 137725 139990 143967 149010 155247 161886
54478A61886N261L047J666J517K237L969O741R429J0628J0203R282R309J1287
$$ 161886 167147 170194 171860 173377 175614 179583 186324 195753 206381 216584 225866 235175 246462
54465B46462J4871J7897J8098J5732J3178J1677J0218P924N351K590j598p309
$$ 246462 261333 279230 297328 313060 326238 337915 348133 356057 361408 363998 362400 355091
54453C55091j2114j3882j3473j3066j3258j3403j3464j3669j3455j2339j1021
$$ 355091 342977 329095 315622 302556 289298 275895 262431 248762 235307 222968 211947
54442B11947j0286r659q510p394p028o915o308n495m920m117k866k119k362k282
$$ 211947 201661 192002 183492 176098 169070 162155 155847 150352 145432 141315 138449 136330 133968 131686
54428A31686p22J175J632R76Q77J607J934J293K91m89p59m7J579K851K761K058
$$ 131686 130964 132139 133771 134747 135624 137231 139165 140458 140749 140260 139501 139454 141033 143884 146645 148703
54412A48703J872J719O07o34k02J763L056K335N52p21r75o42m06q60j901k583
$$ 148703 150575 152294 152901 152267 152065 153828 156884 159219 159771 159050 158075 157433 157027 156167 154266 151683
54396A51683k304j844k280l339l858l428k397r18P59J456J71k106l194k412j180
$$ 151683 149379 147535 145255 141916 138058 134630 132233 131315 132074 133530 133701 131595 128401 125989 124809
54381A24809q84j346j712j712j682k027k844l579l181j296Q70J662P67p28j721
$$ 124809 123925 122579 120867 119155 117473 115446 112602 109023 105842 104546 105416 107078 107845 107117 105396
54366A05396j869j250k11O26Q82P18J75j155k910l335j180K113L611K386N55N56
$$ 105396 103527 102277 102066 102692 103574 104292 104467 103312 100402 97067 95887 98000 101611 103997 104552 105108
54350A05108K463M409M916M141L255L105L592M198M750N352N749N479M719M135
$$ 105108 107571 111980 116896 121037 124292 127397 130989 135187 139937 145289 151038 156517 161236 165371
54336A65371L739K899J788J688L224N227O161N778M671L149J464K33l94j172k436
$$ 165371 169110 172009 173797 175485 178709 183936 190097 195875 200546 203695 205159 205392 204998 203826 201390
54321B01390l281l068k735l362m229l929k687k041k462k891k554j868j415j179
$$ 201390 198109 195041 192306 188944 184715 180786 178099 176058 173596 170705 168151 166283 164868 163689
54307A63689j113j507k468l585m291m281l704l121k904k507j116P67J409J96j235
$$ 163689 162576 161069 158601 155016 150725 146444 142740 139619 136715 134208 133092 133859 135268 135464 134229
54292A34229j104J83R33N85O%O89J882L066L436K821K220K593L778N139O386O951
$$ 134229 133125 133308 134241 134826 134832 134832 135521 137403 140469 143905 146726 148946 151539 155317 160456 166842 173793
54275A73793N792L041P45N49J561J884J304Q71N79n35k462m099m900n193n147
$$ 173793 179585 182626 183371 183920 185481 187365 188669 189540 190119 189584 187122 183023 178123 172930 167783
54260A67783m723m367m423m306l531k921l401m250m206l588l510l648k923j964
$$ 167783 163060 158693 154270 149964 146433 143512 140111 135861 131655 128067 124557 120909 117986 116022
54246A16022k539m430n238l724j341J32N69M41m06j931l194l499l306l288l318
$$ 116022 113483 109053 103815 100091 98750 98882 99451 99892 99486 97555 94361 90862 87556 84268 80950
54231H0950k897j901n83N74R11L70o3N50J623J869J224P00N17m3r41j150m38K61
$$ 80950 78053 76152 75569 76143 77054 77424 77361 77911 79534 81403 82627 83327 83844 83801 82860 81710 81272 81533
54213H1533N77J280K496K870J384j032k524k248p31R42J834J685J132J021J422
$$ 81533 82110 83390 85886 88756 90140 89108 86584 84336 83605 84547 86381 88066 89198 90219 91641
54198I1641J787J868J717J200M13K24J175K163J635j55j473j606j449j642j710
$$ 91641 93428 95296 97013 98213 98626 98850 100025 102188 103823 103668 102195 100589 99140 97498 95788
54183I5788j327q20k15P32J425R66l0J00J390J972J005p0l0L25Jl73J02Q82J030
$$ 95788 94461 93641 93426 94158 95583 96549 96519 96619 98009 99981 100986 100916 100886 101211 101212 100839 100941 101823 102853
54164A02853Q31R45R80K63q63j664k141k450k057o50R26J747K090K509K515J449
$$ 102853 103684 104629 105609 105872 105009 103345 101204 98754 96697 96047 96973 98720 100810 103319 105834 107283
54148A07283Qm40L12J292J679J154l74k264k948j675L1O4j401k297j735r84j077
$$ 107283 107291 106851 107163 108455 110134 111288 110914 108650 105702 104027 104058 104122 102721 100424 98689 97705 96628
54131I6628j208l75O45K82j532l152l231k001m55Q45J738J785O42r01j156M19
$$ 96628 95420 95045 95690 95972 94440 91288 88057 86056 85601 86446 88184 89969 90611 89710 88554 88973
54115H8973K030J446j092l057k920j876j701k104j491L83K102K682K566K328J726
$$ 88973 91003 92449 91357 88300 85380 83504 81803 79699 78208 78591 80693 83375 85941 88269 89995
54100H9995O07k81k19M11Q16R56J128Q91l37j745j614K03J570P73j088j585l41
$$ 89995 90602 90321 90102 90513 91329 92285 93413 94304 93967 92222 90608 90811 92381 93154 92066 90481 90140
54083I0140P02J28j265j991j743j104l96L03P09O08K19k05o30q99p76o52j288
$$ 90140 90842 90970 89705 87714 85971 84867 84471 84774 85483 86091 86310 86105 85475 84576 83800 83148 81860
54066H1860k414k618j281M11J164J277J647K099J862J001N9r95k238k792j815
$$ 81860 79446 76828 75547 75958 77122 78399 80046 82145 84007 85008 85067 84072 81834 79042 77227
54051G7227j9J092J189J042R58P00N43R05J165M11q07j073l85k30j226k246k206
$$ 77227 77208 78300 79489 80531 81489 82189 82732 83637 84802 85213 84406 83333 82948 82718 81492 79246 77040
54034G7040j334l46L60M26k63q71k65J362K645K845K259R75j128l037l084j341
$$ 77040 75706 75360 75720 76146 75883 75012 74747 76109 78754 81599 83858 84833 83705 80668 77584 76243
54018G6243J98M05L79J171J866J119o76j969j942q40O91J663J107o63j876j318
$$ 76243 76441 76846 77225 78396 80262 81381 80705 78736 76794 75954 76645 78308 79415 78752 76876 75558
54002G5558J71J014J032J326K547M178N193M907L506K092J756K360K835K825L018
$$ 75558 75729 76743 77775 79101 81648 85826 91019 95926 99432 101524 103280 105640 108475 111300 114318
53987A14318L611L692K787J882K007K717K986K885L240M171M958N155N024M978
$$ 114318 117929 121621 124408 126290 128297 131014 134000 136885 140125 144296 149254 154409 159433 164411
53973A64411N194N642O098O310O310O284O153N716N245N203N387N228M925N235
$$ 164411 169605 175247 181345 187655 193965 200249 206402 212118 217363 222566 227953 233181 238106 243341
53959B43341N990O066N218M605M900N173M528L594L338L411K918K043J568J354
$$ 243341 249331 255397 260615 265220 270120 275293 279821 283415 286753 290164 293082 295125 296693 298047
53945B98047N97o00j111k78J218J995J094j316l905n247n314n445o409p233o621
$$ 298047 298644 298044 296933 296655 297873 299868 300962 299646 295741 290494 285180 279735 273326 266093 259472
53930B59472m825l252k731l066l934n102n933n715m667l898m096m682m606l595
$$ 259472 254647 251395 248664 245598 241664 236562 230629 224914 220247 216349 212253 207571 202965 199370
53916A99370k455k129k703l395l500k939j815p7J788K456J268l55l30J209J987
$$ 199370 196915 194786 192083 188688 185188 182249 180434 180357 182145 184601 185869 185514 185184 186393 188380
53901A88380R15k95L40K230L224K573J491J168J571K141K680L255L832M242M312
$$ 188380 189295 189000 189340 191570 194794 197367 198858 200026 201597 203738 206418 209673 213505 217747 222059
53886B22059M008L613L568L984M509M818M993N296N694N734M940L627L248N120
$$ 222059 226067 229680 233248 237232 241741 246559 251552 256848 262542 268276 273216 276843 280091 285211
53872B85211Q313R841P980M551K504K076J206o86j805j107P6M22N10J104J432
$$ 285211 293524 303365 311345 315896 318400 320476 321682 320996 319191 318084 318160 318582 319092 320196 321628
53857C21628O59k74N3J442K723L616M612N670O418P044P839Q340Q022P336O973
$$ 321628 322287 322013 322066 323508 326231 329847 334459 340129 346547 353591 361430 369770 377792 385128 392101
53842C92101O618N460L536J638K98k76L1O49J59k067m584n420m517l455l135l136
$$ 392101 398719 404179 407715 409353 409651 409375 409406 410055 410214 408147 403563 398143 393626 390171 387036 383900
53826C83900l189l924n731p894r286r301q078o367n324n708p035p990p876p217
$$ 383900 380711 376787 371056 363162 353876 344575 336497 330130 324806 319098 312063 304073 296197 288980
53812B88980o818o638o056n066m644n622p348q095o979m963l604l436m059n037
$$ 288980 282162 275524 269468 264402 259758 254136 246788 238693 231714 226751 223147 219711 215652 210615
53798B10615n840n646m435l681m537n812n447l655k577k858k903j960j583k894
$$ 210615 204775 199129 194694 191013 186476 180664 175217 171562 168985 166127 163224 161264 159681 156787
53784A56787m518m629l395j885j52J900L028J948o01k636l285l079k496j479K6
$$ 156787 152269 147640 144245 142360 142208 144108 147136 149084 148483 145847 142562 139483 136987 135508 135534
53769A35534J908L930N207M543K041m86j591j730j884j888j310q05j109j575j165
$$ 135534 137442 141372 146579 151122 153163 152677 151086 149356 147472 145584 144274 143469 142360 140785 139620
53754A39620k13K55L77J169K803M430N405N612M970L722K775K798L282L321K825
$$ 139620 139407 139662 140039 141208 144011 148441 153846 159458 164428 168150 170925 173723 177005 180326 183151
53739A83151K367K324K884M060N131N134M539N176P581R777R868Q503P434O872
$$ 183151 185518 187842 190726 194786 199917 205051 209590 214766 222347 232124 241992 250495 257929 264801
53725B64801N915M392K688P46j147j587R8K163K414J121J81J55N1n77j233j866
$$ 264801 270716 275108 277796 278542 277395 275808 275906 278069 280483 281604 281785 281940 281991 281414 280181 278315
53709B78315k912m170n070n575n676m848l348k878m215n388m296k064j357k358
$$ 278315 275403 271233 266163 260588 254912 250064 246716 243838 239623 234235 229939 227875 226518 224160
53695B24160l005k586k215k089j200K00O23K23R71L380N406N284L334M85k772
$$ 224160 221155 218569 216354 214265 213065 213265 213888 214111 215082 218462 223868 229152 232486 232971 230199
53680B30199n326n569l489r46O89J494J377j86k151k097L88K617K429J071R79
$$ 230199 224873 219304 215815 214869 215558 217052 218429 218243 216092 213995 214383 217000 219429 220500 221479
53665B21479K279L194K698J221n36k009k512j805o98l06q81j828k479k510j977
$$ 221479 223758 226952 229650 230871 230335 228326 225814 224009 223311 223005 222124 220296 217817 215307 213330
53650B13330j249o19o1L27J58m43m86M17J053L78m79K62K096K890K225J780K337
$$ 213330 212081 211462 211401 211728 211886 211443 210957 211374 212427 212805 212326 212588 214684 217574 219799 221579 223916
53633B23916K732K325K176K885L295K471J294J025J668K597L500L935L372K383
$$ 223916 226648 228973 231149 234034 237329 239800 241094 242119 243787 246384 249884 253819 257191 259574
53619B59574K300L040K958J726J421L396N843O165M488K995K573K075N55j241
$$ 259574 261874 264914 267872 269598 271019 274415 280258 286423 290911 293906 296479 298554 299109 297868
53605B97868j853o99J278K213Q97j888m068m477l750k956k409k112k216k423j956
$$ 297868 296015 295316 296594 298807 299704 297816 293748 289271 285521 282565 280156 278044 275828 273405 271449
53590B71449p64J21K0m74n85m97p11j144j459j533j090L11K285L427K686M55j976
$$ 271449 270685 270806 270826 270352 269767 269270 268559 267415 265956 264423 263333 263644 265929 269356 272042 272497 270521
53573B70521l308k581J38L023L768K237P15Q74J747J567M65N0J076K729L868M092
$$ 270521 267213 264632 264770 267793 271561 273798 274513 275387 277134 278701 279166 279216 280292 283021 286889 290981
53557B90981L678L181K965K925K817K858L492M604N582O117O286N923M857L693
$$ 290981 294659 297840 300805 303730 306547 309405 312897 317501 323083 329200 335486 341409 346266 349959
53543C49959L328L667L789L398L084L200L634M621O367P857P629N958M802N187
$$ 349959 353287 356954 360743 364141 367225 370425 374059 378680 385047 392904 400533 406491 411293 416480
53529D16480O153O597O589O356N509M059K900K519K399K112J839J519Q04K08O24
$$ 416480 422633 429230 435819 442175 447684 451743 454643 457162 459561 461673 463512 465031 465835 466043 466667
53514D66667J399P59j233k138n27J921K835K118J181P51P91J400K473L319L703
$$ 466667 468066 468825 467592 465454 464927 466848 469683 471801 472982 473733 474524 475924 478397 481716 485419
53499D85419M336N558O548O600O016N106L655K183K175M022O056O673O200N752
$$ 485419 489755 495313 501861 508461 514477 519583 523238 525421 527596 531618 537674 544347 550547 556299
53485E56299N587N567N918O505O650O595P632R906J1585J1381J0253R494Q870
$$ 556299 561886 567453 573371 579876 586526 593121 600753 610659 622244 633625 643878 653372 662242
53472F62242P993P806Q987J0357J0509R785R174Q643Q138Q645J0536J2226J2416
$$ 662242 670235 678041 687028 697385 707894 717679 726853 735496 743634 752279 762815 775041 787457
53459G87457J2272J3427J5145J5574J4787J4350J4758J5399J6372J8232K0469
$$ 787457 799729 813156 828301 843875 858662 873012 887770 903169 919541 937773 958242
53448I58242K2135K3401K4752K5393K4503K3408K4393K7560L0820L2749L3741
$$ 958242 980377 1003778 1028530 1053923 1078426 1101834 1126227 1153787 1184607 1217356 1251097
53437A251097L4525L5283L6143L7090L7444L6779L6059L6590L8195L9635M0304
$$ 1251097 1285622 1320905 1357048 1394138 1431582 1468361 1504420 1541010 1579205 1618840 1659144
53426A659144M0329L9588L8071L6626L6022L5861L5511L5415L6112L6991L7290
$$ 1659144 1699473 1739061 1777132 1813758 1849780 1885641 1921152 1956567 1992679 2029670 2066960
53415B066960L7407L7683L7161L5262L3479L3288L3568L2381L0258K9166K9036
$$ 2066960 2104367 2142050 2179211 2214473 2247952 2281240 2314808 2347189 2377447 2406613 2435649
53404B435649K8105K6183K4659K3374K0400J5324J0180O514L747J043j453l819
$$ 2435649 2463754 2489937 2514596 2537970 2558370 2573694 2583874 2590388 2594135 2595178 2593725 2589906
53392B589906o931j0878j4341j6285j7139j7891j9157k1122k3277k4354k3917
$$ 2589906 2582975 2572097 2557756 2541471 2524332 2506441 2487284 2466162 2442885 2418531 2394614
53381B394614k3642k5449k8677l0920l1382l1420l1934l2304l2081l1695l1223
$$ 2394614 2370972 2345523 2316846 2285926 2254544 2223124 2191190 2158886 2126805 2095110 2063887
53370B063887l0255k9105k8430k7610k5497k2541k0169j8197j5346j2285j1249
$$ 2063887 2033632 2004527 1976097 1948487 1922990 1900449 1880280 1862083 1846737 1834452 1823203
53359A823203j2159j2035r289n864l860k548l52K379M454N969P625R265J0610
$$ 1823203 1811044 1799009 1789720 1783856 1779996 1777448 1777096 1779475 1783929 1789898 1797523 1806788 1817398
53346A817398J2197J4316J6288J7974K0540K4472K8168L0011L0598L1504L3099
$$ 1817398 1829595 1843911 1860199 1878173 1898713 1923185 1951353 1981364 2011962 2043466 2076565
53335B076565L5026L7661M1293M4800M6912M8282N0532N3660N6017N6891N7548
$$ 2076565 2111591 2149252 2190545 2235345 2282257 2330539 2381071 2434731 2490748 2547639 2605187
53324B605187N9416O2262O4622O5484O5220O5119O6028O7434O8132O7813O7385
$$ 2605187 2664603 2726865 2791487 2856971 2922191 2987310 3053338 3120772 3188904 3256717 3324102
53313C324102O7491O7419O5923O2671N8385N3963M9817M5908M2034L8126L4222
$$ 3324102 3391593 3459012 3524935 3587606 3645991 3699954 3749771 3795679 3837713 3875839 3910061
53302C910061L0076K5243J9789J4373R117L133m006j1137j6966k1951k7253l2564
$$ 3910061 3940137 3965380 3985169 3999542 4008659 4011792 4007786 3996649 3979683 3957732 3930479 3897915
53290C897915l6714l9996m3841m8257n1640n3418n4874n6978n9204o0941o2147
$$ 3897915 3861201 3821205 3777364 3729107 3677467 3624049 3569175 3512197 3452993 3392052 3329905
53279C329905o2229o0353n7575n6430n7369n7746n5614n2517n0890n0537m9678
$$ 3329905 3267676 3207323 3149748 3093318 3035949 2978203 2922589 2870072 2819182 2768645 2718967
53268B718967m8037m6708m5750m4056m1248l8155l5481l3278l1440k9769k7832
$$ 2718967 2670930 2624222 2578472 2534416 2493168 2455013 2419532 2386254 2354814 2325045 2297213
53257B297213k5515k3350k1740k0446j9382j9017j9300j9235j8351j7559j7587
$$ 2297213 2271698 2248348 2226608 2206162 2186780 2167763 2148463 2129228 2110877 2093318 2075731
53246B075731j7620j6621j5050j3995j3436j2619j1434j0121q308n610k622l4
$$ 2075731 2058111 2041490 2026440 2012445 1999009 1986390 1974956 1964835 1956527 1950917 1948295 1948261
53234A948261K550N717Q789J0710J1789J3155J4909J6397J7893K0230K2936K4528
$$ 1948261 1950811 1956528 1965317 1976027 1987816 2000971 2015880 2032277 2050170 2070400 2093336 2117864
53222B117864K4905K5769K8150L1023L2994L3985L4459L4198L2914L1302L0251
$$ 2117864 2142769 2168538 2196688 2227711 2260705 2294690 2329149 2363347 2396261 2427563 2457814
53211B457814K9356K7320K3850K0305J8143J7223J6046J3389R357M844M93l551
$$ 2457814 2487170 2514490 2538340 2558645 2576788 2594011 2610057 2623446 2632803 2637647 2638140 2634589
53199B634589p195j0189j2407j3963j5108j6300j8294k1640k5896k9808l2459
$$ 2634589 2627394 2617205 2604798 2590835 2575727 2559427 2541133 2519493 2493597 2463789 2431330
53188B431330l3880l4436l4152l3113l2083l2025l2908l3481l2567l0527k9000
$$ 2431330 2397450 2363014 2328862 2295749 2263666 2231641 2198733 2165252 2132685 2102158 2073158
53177B073158k8929k9265k8277k5959k4239k4542k6107k7228k7070k5606k2854
$$ 2073158 2044229 2014964 1986687 1960728 1936489 1911947 1885840 1858612 1831542 1805936 1783082
53166A783082j9433j6921j6296j6553j6223j5544j5545j5625j4014j0490o788
$$ 1783082 1763649 1746728 1730432 1713879 1697656 1682112 1666567 1650942 1636928 1626438 1619650
53155A619650m268k918k624l535m907n530n572o185p142p030o074o319q282r934
$$ 1619650 1615382 1612464 1609840 1606305 1601398 1595868 1590296 1584111 1576969 1569939 1563865 1557546 1549264 1539330
53141A539330j0104j0371j2119j4080j4670j4615j5119j5353j4180j2830j3220
$$ 1539330 1529226 1518855 1506736 1492656 1477986 1463371 1448252 1432899 1418719 1405889 1392669
53130A392669j4760j5375j4992j5452j7355j9385k0672k1712k2860k3787k4581
$$ 1392669 1377909 1362534 1347542 1332090 1314735 1295350 1274678 1252966 1230106 1206319 1181738
53119A181738k5664k6520k6022k4192k2274k1084k0591k0876k1949k2698k1778
$$ 1181738 1156074 1129554 1103532 1079340 1057066 1035982 1015391 994515 972566 949868 928090
53108I28090j9772j8837j9798k1138k1262k0369j9509j9061j8847j8709j8244
$$ 928090 908318 889481 869683 848545 827283 806914 787405 768344 749497 730788 712544
53097G12544j6902j4927j3496j3386j4152j4958j5505j5664j5046j3609j2063
$$ 712544 695642 680715 667219 653833 639681 624723 609218 593554 578508 564899 552836
53086E52836j1014j0083q513o501n240n591p034q172q189p607p471q042q660q740
$$ 552836 541822 531739 523226 516725 511485 505894 498860 490688 482499 474892 467421 459379 450719 441979
53072D41979q209o961m768k246r58j723l410m356m425m746n720o493o333n379
$$ 441979 433770 426809 422041 419795 418837 417114 413704 409348 404923 400177 394457 387964 381631 376252
53058C76252l944k120l89L20k36j032r23l3M69j44j324j889j238J87J505K137
$$ 376252 372308 370188 369799 370119 369883 368851 367928 367895 368364 368220 366896 365007 363769 363956 365461 367598
53042C67598J939J029m5l11O88J954J816j02k362l472l449l203l144l094l107
$$ 367598 369537 370566 370521 370210 370898 372852 374668 374566 372204 368732 365283 362080 358936 355842 352735
53027C52735l594m701o054p022p139o510n859n714n645m997m219m374n221n116
$$ 352735 349141 344440 338386 331364 324225 317715 311856 306142 300497 295500 291281 286907 281686 276570
53013B76570l480j983k318l920m999m965m510l982l139k121j377p04M94J925K433
$$ 276570 273090 271107 268789 264869 259870 254905 250395 246413 243274 241153 239776 239072 239566 241491 243924
52998B43924J379p02k851m427n093m704l399j647j40L96j58q60n84L66M51q36
$$ 243924 245303 244601 241750 237323 232230 227526 224127 222480 222340 222736 222578 221718 221134 221500 221951 221115
52982B21115j943j344K62R39P9j096j332o00L06O09J10o65j014r48j103j515j406
$$ 221115 219172 217828 218090 219029 219108 218012 216680 216080 216386 216995 217105 216440 215426 214478 213375 211860 210454
52965B10454m93L39L67K9q6k59q83j541j735j618j331o54j5m74j782j961j82J575
$$ 210454 209961 210300 210667 210696 210610 210351 209468 207927 206192 204574 203243 202589 202574 202100 200318 198357 198175 199750
52947A99750J386L60O89K026K284J144J72j07n93j210p52O37J197K80p95j166
$$ 199750 201136 201496 202185 204211 206495 207639 207811 207704 207111 205901 205149 205786 206983 207263 206468 205302
52931B05302j558k238j947k7K039K566J855J256J062N29n46j437j421n40N71J343
$$ 205302 203744 201506 199559 199532 201571 204137 205992 207248 208310 208839 208293 206856 205435 204895 205466 206809
52915B06809J906K880M323N307N122M375M056M080L835L603M158N252N847N637
$$ 206809 208715 211595 215918 221225 226347 230722 234778 238858 242693 246296 250454 255706 261553 267190
52901B67190N093M299L153K377K791L750L913L406L483M224M509M282M705N665
$$ 267190 272283 276582 279735 282112 284903 288653 292566 295972 299455 303679 308188 312470 317175 322840
52887C22840N284K693n06k456l114l325l381l363l588l835l389k460k167k616
$$ 322840 328124 330817 330311 327855 324741 321416 318035 314672 311084 307249 303860 301400 299233 296617
52873B96617k544j575j085j872k685k249j170n80l31qk83j654k951k795j719j243
$$ 296617 294073 292498 291413 289541 286856 284607 283437 282857 282526 282518 282235 280581 277630 274835 273116 271873
52857B71873j579j815j704j703j652r99j07R2l17k07J053K932M508N052M135K072
$$ 271873 270294 268479 266775 265072 263420 262421 262314 262406 262089 261882 262935 265867 270375 275427 279562 281634
52841B81634J01o96n30k86k83l63p36j597k279j886o95J26J68R3L18M16J45K5
$$ 281634 281735 281039 280509 280223 279940 279577 278841 277244 274965 273079 272384 272510 272678 272771 273089 273505 273650 273675
52823B73675M54R75J042J062J896L388M100K905N91p66j69J073R80o21k045j974
$$ 273675 274129 275104 276146 277208 279104 282492 286592 289497 290088 289322 289153 290226 291206 290585 288540 286566
52807B86566q17K72Q37J144J456J755J833J451P89O58J482K203J310q33j986r47
$$ 286566 285749 286021 286858 288002 289458 291213 293046 294497 295286 295944 297426 299629 300939 300106 298120 297173
52791B97173R12J905K508M126O251O700M620J848Q85K395M943O575O483N536N249
$$ 297173 298085 299990 302498 306624 312875 319575 324195 326043 326928 329323 334266 340841 347324 352860 358109
52776C58109N843N831M112J907J541L354N096M671K386j70k386m612o474o674
$$ 358109 363952 369783 373895 375802 377343 380697 385793 390464 392850 392680 390294 385682 379208 372534
52762C72534m883k697j887k305k451j760j307k109l810n382o342o593n968m679
$$ 372534 367651 364954 363067 360762 358311 356551 355244 353135 349325 343943 337601 331008 325040 320361
52748C20361l661l588m007m211m491n506o922p737p636o891n273k536K42J363
$$ 320361 316700 313112 309105 304894 300403 294897 287975 280238 272602 265711 260438 257902 258144 259507
52734B59507Q03K51N44O21l87j626k034k106k871m006m250l301k256k284l474
$$ 259507 260310 260561 261105 261726 261339 259713 257679 255573 252702 248696 244446 241145 238889 236605 233131
52719B33131m828n073l844k296j954k763l083j921k27N21J23o60j320j670j430
$$ 233131 228303 223230 219386 217090 215136 212373 209290 207369 207142 207663 207786 207126 205806 204136 202706
52704B02706o76j43l24o87o47p98k152m421n987n709m081k609k395l339m353m326
$$ 202706 202030 201887 201563 200876 200229 199431 197279 192858 186871 181162 177081 174472 172077 168738 164385 160059
52688A60059l067j355j82k03j542l490m498l491j304N0k21j001j198j194j722
$$ 160059 156992 155637 155455 155252 153710 150220 145722 142231 140927 140977 140756 139755 138557 137363 135641
52673A35641k348k074q21M71Q79O7j603k984k750q52J133J626P00l41l69Q80K790
$$ 135641 133293 131219 130398 130869 131748 131815 130212 127228 124478 123626 124759 126385 127085 126744 126375 127255 130045
52656A30045M005L316J056j005j692j627j852k212j963j190o41n46n84o35p95
$$ 130045 134050 137366 138422 137417 135725 134098 132246 130034 128071 126881 126240 125694 125110 124475 123680
52641A23680q43m11M68J447K164K149J077m76j120j16J762L258L981M312M778
$$ 123680 122837 122426 122894 124341 126505 128654 129731 129255 128135 128019 129781 133039 137020 141332 146110
52626A46110N842P488Q569P631M972K699J993J538k33k605l688l119k023j013
$$ 146110 151952 159440 168009 175640 180612 183311 185304 186842 186609 184004 180316 177197 175174 174161
52612A74161N0P37K03j334k628l051l104l237l283l116k977k995l072l162l076
$$ 174161 174211 174948 175151 173817 171189 168138 165034 161797 158514 155398 152421 149426 146354 143192 140116
52597A40116k341j043k93q76j732j111R00K172J049j817m415n297m491l180k662
$$ 140116 137775 136732 136439 135563 133831 132720 133620 135792 136841 135024 130609 125312 120821 117641 114979
52582A14979l123l399k370m07J144J606J456J366J449J472J253R12R13J601K419
$$ 114979 111856 108457 106087 105680 106824 108430 109886 111252 112701 114173 115426 116338 117251 118852 121271
52567A21271K282J080J9j83m90j970l818m269k976j188Q0P70Q43J2j377k260j948
$$ 121271 123553 124633 124652 124469 123979 122009 118191 113922 110946 109758 109838 110608 111451 111463 110086 107826 105878
52550A05878o54J012K361K589J291q04k235k072m89J569K910K775J593O36N31
$$ 105878 105224 106236 108597 111186 112477 111673 109438 107366 106877 108446 111356 114131 115724 116360 116891
52535A16891O99P55J376K916M214L971K479Q20p21k050k139m14J585J907J082
$$ 116891 117590 118345 119721 122637 126851 130822 133301 134121 133400 131350 129211 128797 130382 132289 133371
52520A33371J243K632L362K606J656J412J051R1l26O88K268L166L309K956J832
$$ 133371 134614 137246 140608 143214 144870 146282 147333 147424 147098 147786 150054 153220 156529 159485 161317
52505A61317K57k09J325L390L786K373J028J158K288L011K592J513Q59J116J687
$$ 161317 161574 161365 162690 166080 169866 172239 173267 174425 176713 179724 182316 183829 184688 185804 187491
52490A87491J827J806K312K897K223J77j430j027P85K137K039R46j52m92J28J063
$$ 187491 189318 191124 193436 196333 198556 198733 197303 196276 197061 199198 201237 202183 202031 201539 201667 202730
52474B02730J244L91n28n45N0K88J1P2J081K516L373L482L705M668N570N002K870
$$ 202730 203974 204365 203837 203292 203342 203630 203641 203713 204794 207310 210683 214165 217870 222538 228108 233110 235980
52457B35980O94m25j124k284l203k622q90L96O89Q53J280J191J54j032j407q23
$$ 235980 236674 236249 235125 232841 229638 227016 226126 226522 227211 228064 229344 230535 230689 229657 228250 227427
52441B27427L84J666K039R26n78n85R88K021R25j447l161l251j852L53K037J843
$$ 227427 227811 229477 231516 232442 231864 231279 232267 234288 235213 233766 230605 227354 225502 225855 227892 229735
52425B29735J00j080l90J025J433R54R83J932K899L030K131L64j601k522j720
$$ 229735 229835 228755 228365 229390 230823 231777 232760 234692 237591 240621 242752 243116 241515 238993 237273
52410B37273n1J042J178J049J181J550K049K457K219J016m52j025l30R62J873
$$ 237273 237222 238264 239442 240491 241672 243222 245271 247728 249947 250963 250511 249486 249156 250118 251991
52395B51991J786Q18J0N76K425L923L845K843K151J580J33j835k678j769l99J42
$$ 251991 253777 254595 254605 255181 257606 261529 265374 268217 270368 271948 272081 270246 267568 265799 265400 265542
52379B65542J99P70J825K488K402K017J747J598J627K001K370J797r7k236l048
$$ 265542 265741 266511 268336 270824 273226 275243 276990 278588 280215 282216 284586 286383 286286 284050 281002
52364B81002k403j866k635l836l646j789Q0N79L17Q18K445M059M564M016L027
$$ 281002 278599 276733 274098 270262 266616 264827 264907 265486 265803 266621 269066 273125 277689 281705 284732
52349B84732J690k79k383l102j461J378L037K688K027K864M536M820L008Q42L24
$$ 284732 286422 286143 283760 280658 279197 280575 283612 286300 288327 291191 295727 300547 303555 304397 304721
52334C04721J616L255L659K244j45j793j789j185j695l255l994k815p58O91J405
$$ 304721 306337 309592 313251 315495 315350 313557 311768 310583 308888 305633 301639 298824 298066 298757 300162
52319C00162J913J971J025n22j601j736j213k19J287K932L996M135L521K341P82
$$ 300162 302075 304046 305071 304549 302948 301212 299999 299780 301067 303999 307995 312130 315651 317992 318774
52304C18774l97NK324N183O498N493L486K406K848L851M370M233L642K743K065
$$ 318774 318377 318382 320706 325889 332387 337880 341366 343772 346620 350471 354841 359074 362716 365459 367524
52289C67524K517M136N575N755N312N336N429M499L020K644L540L925K796J520
$$ 367524 370041 374177 379752 385507 390819 396155 401584 406083 409103 411747 415287 419212 422008 423528
52275D23528J869L710N558O422O222N228M018L423L799M723N752O828P705P769
$$ 423528 425397 429107 434665 441087 447309 452537 456555 459978 463777 468500 474252 481080 488785 496554
52261D96554O998O262O172O391O577P179Q607J0303J1340J1314J0236Q257O206
$$ 496554 503552 509814 515986 522377 528954 536133 544740 555043 566383 577697 587933 596190 602396
52248F02396N612P374J0709J3965J6038J6796J6691J6468J6705J7362J8217J9590
$$ 602396 608008 615382 626091 640056 656094 672890 689581 706049 722754 740116 758333 777923
52236G77923K1716K3533K3517K2046K1332K2463K4005K4442K4338K4925K5971
$$ 777923 799639 823172 846689 868735 890067 912530 936535 960977 985315 1010240 1036211
52225A036211K6511K6602K6826K6975K6668K6393K6502K6073K4310K2316K1748
$$ 1036211 1062722 1089324 1116150 1143125 1169793 1196186 1222688 1248761 1273071 1295387 1317135
52214A317135K2327K2480K1933K1719K1828K0922J8673J6501J5415J4616J2898
$$ 1317135 1339462 1361942 1383875 1405594 1427422 1448344 1467017 1483518 1498933 1513549 1526447
52203A526447J0337P897O222N344M955M552L765K775K062J853K165K971L743L428
$$ 1526447 1536784 1544681 1550903 1556247 1561202 1565754 1569519 1572294 1574356 1576209 1578374 1581345 1585088 1588516
52189A588516J802L43O88K673N005P289R847J2024J2601J2018J2244J3928J5433
$$ 1588516 1590318 1590661 1591349 1594022 1599027 1606316 1616163 1628187 1640788 1652806 1665050 1678978 1694411
52176A694411J5457J4946J5367J6444J6880J6416J5939J6055J6547J6848J6329
$$ 1694411 1709868 1724814 1740181 1756625 1773505 1789921 1805860 1821915 1838462 1855310 1871639
52165A871639J4745J2907J2207J2700J2546J0310P013M646L386J721q41l044m166
$$ 1871639 1886384 1899291 1911498 1924198 1936744 1947054 1954067 1958713 1962099 1963820 1962979 1959935 1955769
52152A955769n503q584j2889j6354j7779j7831j7865j8461j9156j9208j8402j7283
$$ 1955769 1950266 1941682 1928793 1912439 1894660 1876829 1858964 1840503 1821347 1802139 1783737 1766454
52140A766454j6612j6618j7011j7665j8668j9501j8951j6681j4304j3764j4797
$$ 1766454 1749842 1733224 1716213 1698548 1679880 1660379 1641428 1624747 1610443 1596679 1581882
52129A581882j5201j3735j1539j0328j0281j0479j0264r327p400m970l480l634
$$ 1581882 1566681 1552946 1541407 1531079 1520798 1510319 1500055 1490728 1483328 1478358 1474878 1471244
52117A471244m182l701k858l357n094o281o224o074o525o687n856m783m308m213
$$ 1471244 1467062 1463361 1460503 1457146 1452052 1445771 1439547 1433473 1426948 1420261 1414405 1409622 1405314 1401101
52103A401101m181m634n660o395o342o298o945p679p714p282o652n129k427n4
$$ 1401101 1396920 1392286 1386626 1380231 1373889 1367591 1360646 1352967 1345253 1337971 1331319 1326190 1323763 1323709
52089A323709J42j631l473m113l777l260l260m188n557o015m924l445l042l607
$$ 1323709 1323851 1322220 1318747 1314634 1310857 1307597 1304337 1300149 1294592 1288577 1283653 1280208 1277166 1273559
52075A273559m096m279m488m270l028j612j541k596k794j154R96J899J370L29
$$ 1273559 1269463 1265184 1260696 1256426 1253398 1251786 1250245 1247649 1244855 1243701 1244697 1246596 1247966 1248295
52061A248295o26j419j955k075j799j270n54L62J501K781L863M451M835N533O292
$$ 1248295 1247669 1246250 1244295 1242220 1240421 1239151 1238597 1238959 1240460 1243241 1247104 1251555 1256390 1261923 1268215
52046A268215O192N353N463P730J1074J3466J4464J5210J6503J8221K0242K2529
$$ 1268215 1274407 1279760 1285223 1292953 1304027 1317493 1331957 1347167 1363670 1381891 1402133 1424662
52034A424662K4405K5213K5719K7542L0832L3723L4458L3264L1774L1330L2093
$$ 1424662 1449067 1474280 1499999 1527541 1558373 1592096 1626554 1659818 1691592 1722922 1755015
52023A755015L3192L3530L2849L1834L0758K8606K4575J9859J6745J5845J5487
$$ 1755015 1788207 1821737 1854586 1886420 1917178 1945784 1970359 1990218 2006963 2022808 2038295
52012B038295J3945J1169Q194N868M434L504K110m41l577n937o936p288q038r686
$$ 2038295 2052240 2063409 2071603 2077471 2081905 2085409 2087519 2087078 2083501 2077564 2070628 2063340 2055302 2045616
51998B045616j2036j4057j4313j2527j0603j0794j2862j4273j3382j1200r550
$$ 2045616 2033580 2019523 2005210 1992683 1982080 1971286 1958424 1944151 1930769 1919569 1910019
51987A910019q650p351n044k500q66k81L35J883L702M303L684L665N170O539N941
$$ 1910019 1901369 1894018 1888974 1886474 1885608 1885327 1885662 1887545 1891247 1895550 1899234 1902899 1908069 1914608 1920549
51972A920549M378M338O205Q139R176R989J0513R301O103K903J288N19o59j905
$$ 1920549 1924927 1929265 1935470 1943609 1952785 1962774 1973287 1982588 1988691 1991594 1992882 1993401 1992742 1990837
51958A990837k386k630l853o119q630j1139j3909j6578j8226j8600j8654j9787
$$ 1990837 1988451 1985821 1981968 1975849 1967219 1956080 1942171 1925593 1907367 1888767 1870113 1850326
51946A850326k2586k6033k8174k8167k7563k8602l1363l3740l4297l3772l3464
$$ 1850326 1827740 1801707 1773533 1745366 1717803 1689201 1657838 1624098 1589801 1556029 1522565
51935A522565l3685l4416l5916l7726l8316l6981l5120l4494l5031l5355l4815
$$ 1522565 1488880 1454464 1418548 1380822 1342506 1305525 1270405 1235911 1200880 1165525 1130710
51924A130710l3854l2924l2094l1424l0801k9769k8105k6273k4760k3482k2432
$$ 1130710 1096856 1063932 1031838 1000414 969613 939844 911739 885466 860706 837224 814792
51913H14792k2098k2510k2507k1028j8625j6770j5912j5171j3851j2374j1626
$$ 814792 792694 770184 747677 726649 708024 691254 675342 660171 646320 633946 622320
51902F22320j1835j2242j1752j0155q664q733j0176j1263j0946r990r435r020
$$ 622320 610485 598243 586491 576336 567672 558939 548763 537500 526554 516564 507129 498109
51890D98109q138p318p439q097q167p681p711q350q394p358o399o339n989l778
$$ 498109 489971 482653 475214 467117 458950 451269 443558 435208 426814 419456 413057 406718 400729 396951
51876C96951n47P94j295m965p003o127l637j385j89q4q05j612j518l45J023J829
$$ 396951 396404 397198 395903 390938 383935 377808 374171 372786 372597 372513 371708 370096 368578 368233 369256 371085
51860C71085K163K054Q92j463l839n081n414n540n198m019k986l355m503m616
$$ 371085 373248 375302 376194 374731 370892 365811 360397 354857 349659 345640 342654 339299 334796 330180
51846C30180l334k085j768j913k206l102m478n242m826l813k792j897j565k175
$$ 330180 326846 324761 322993 321080 318874 315772 311294 306052 301226 297413 294621 292724 291159 288984
51832B88984k789k038m90k49j715k860k456j782k031k252j351j68K05M27J319
$$ 288984 286195 284157 283667 283418 281703 278843 276387 274605 272574 270322 268971 268803 269008 269435 270754
51817B70754J865R63j66M32K238K974K013R36Q79J278J323R65L44l71n89R1Q13
$$ 270754 272619 273582 273416 273848 276086 279060 281073 282009 282888 284166 285489 286454 286798 286427 285838 285929 286742
51800B86742L39j126k042j592m74K91L43k39j089j462p60O89K047K989L705M256
$$ 286742 287081 285955 283913 282321 281847 282138 282481 282242 281153 279691 278931 279620 281667 284656 288361 292617
51784B92617M641N087N557N422M503L786L996M095K571l2j386l17J713K296M05
$$ 292617 297258 302345 307902 313324 317827 321613 325609 329704 332275 332243 330857 330540 332253 334549 334954
51769C34954k960n514n221k117J282K329R56p94j700k436l660m556m118k791j793
$$ 334954 331994 326480 321259 319142 320424 322753 323709 322915 321215 318779 315119 310563 306445 303654 301861
51754C01861j409q82J70J104J172N76J22J55L61O91J650L162L817K393k10j833
$$ 301861 300452 299570 299740 300844 302016 302592 302714 302869 303230 303921 305571 308733 312550 314943 314733 312900
51738C12900j737j039m38O64K213K643J226l28k63O58O53j52l61L9j27p39l80
$$ 312900 311163 310124 309686 310350 312563 315206 316432 316104 315841 316499 317152 317000 316639 316678 316551 315812 315432
51721C15432J143K277K101J425J097Q25K34k67l75m55o84o90m65n38p14J93K531
$$ 315432 316575 318852 320953 322378 323475 324300 324534 324267 323892 323437 322753 322063 321598 321060 320346 320539 323070
51704C23070M686M813L179J885K414M088M995M124K366J364J572J978J873J956
$$ 323070 327756 332569 335748 337633 340047 344135 349130 353254 355620 356984 358556 360534 362407 364363
51690C64363L076M577N032M289L621L933M782N339N437N579O392P992R468R535
$$ 364363 367439 372016 377048 381337 384958 388891 393673 399012 404449 410028 416420 424412 433880 443415
51676D43415Q333P806R259J1262J1557J0458J0507J2757J5369J6310J5550J3916
$$ 443415 451748 459554 468813 480075 491632 502090 512597 525354 540723 557033 572583 586499
51664E86499J1437Q022M551K059N39m93r32m11P69J832K237J786N18r86j805j690
$$ 586499 597936 605958 610509 612568 613107 612614 611682 611271 612040 613872 616109 617895 618413 617427 615622 613932
51648F13932j419j659k124k320k429k739k814k011n92M10K46r64k419l017k049
$$ 613932 612513 610854 608730 606410 603981 601242 598428 596417 595825 596235 596481 595517 593098 590081 588032
51633E88032j14J166R67M35J241L279M779M682L855L569L779L721L584M353N962
$$ 588032 587918 589084 590051 590486 591727 595006 599785 604467 608322 611891 615670 619391 622975 627328 633290
51618F33290O648M845J103k443m250m504m391m885o044o862n996l352p72j53j030
$$ 633290 639938 644783 645886 643443 639193 634689 630298 625413 619369 612507 606511 603159 602387 602234 601204
51603F01204j140N02K470L285L414L999M793M814M167L819L879L408J888q3j599
$$ 601204 600064 600566 603036 606321 609735 613734 618527 623341 627508 631327 635206 638614 640502 640419 638820
51588F38820k312k641l528n657q465j0468j1034j1036j1312j1470j1075j0899
$$ 638820 636508 633867 630339 624682 616217 605749 594715 583679 572367 560897 549822 538923
51576E38923j1678j2641j2566j1546j0269q488n935l966m236o021o918o129n078
$$ 538923 527245 514604 502038 490492 480223 471735 465800 461834 457598 451577 444659 438530 433452
51563D33452m743m513m022m032m727m894l796k426k098k834l893m655m470k821
$$ 433452 428709 424196 420174 416142 411415 406521 402725 400299 398201 395367 391474 386819 382349 379528
51549C79528m16R79N09q75j961k572k781k154o95M19J07j383l037m149m277l117
$$ 379528 379112 380091 380600 379725 377764 375192 372411 370257 369562 369981 370088 368705 365668 361519 357242 354125
51533C54125j191J98M79N01J074J749J906K149L547N975Q207R329R300Q465P241
$$ 354125 352934 353132 353611 354112 355186 356935 358841 360990 364537 370512 378719 388048 397348 405813 413054
51518D13054O160N570N514O031P194Q571R306R257R311J0025J0515R462O834L968
$$ 413054 419214 424784 430298 436329 443523 452094 461400 470657 479968 489993 500508 509970 516804 520772
51504E20772K075J141J36j926m946p506q131o978n845o250p782q681p671n026
$$ 520772 522847 523988 524124 522198 517252 509746 501615 494637 488792 482542 474760 466079 458408 453382
51490D53382k196n37k23k86K67J609L534N941Q286R315Q570P475P670Q648Q651
$$ 453382 451186 450649 450426 450140 450407 452016 455550 461491 469777 479092 487662 495137 502807 511455 520106
51475E20106P618P249Q056Q452P374N806M740L509J476k72n89m03j371l218m080
$$ 520106 527724 534973 543029 551481 558855 564661 569401 572910 574386 574114 573525 573122 571751 568533 564453
51460E64453l126j437l91l75r18j159m28R51J798J774K130L785N450N169L334
$$ 564453 561327 559890 559499 559124 558206 557047 556619 557570 559368 561142 563272 567057 572507 577676 581010
51445E81010K363L249M068K621o54l459m488m506m758n457o111o675p591q779
$$ 581010 583373 586622 590690 593311 592657 589198 584710 580204 575446 569989 563878 557203 549612 540833
51431E40833r284q326o356m612l783l532l276l027l286m245n125m533k069N31
$$ 540833 531549 523223 516867 512255 508472 504940 501664 498637 495351 491106 485981 481448 479379 479910
51417D79910R08q39j835j05K727L879L436L768N597P158P390P375P898P836O372
$$ 479910 480818 479979 478144 478039 480766 484645 488081 491849 497446 504604 511994 519369 527267 535103 541475
51402E41475M960N477P586R334R653R064Q601R045J0672J2904J4591J5159J4981
$$ 541475 546435 551912 559498 568832 578485 587549 596150 605195 615867 628771 643362 658521 673502
51389F73502J4412J3354J2005J0875R675P436M242J573M06J93L12Q43J229N5k584
$$ 673502 687914 701268 713273 724148 733823 741259 745501 747074 747480 747673 747985 748828 750057 750112 747528
51374G47528m189k965m13Q17L87j44n0K55Q64K222L693M086L489K965K707J976
$$ 747528 743339 740374 739961 740778 741165 741021 740971 741226 742090 744312 748005 752091 755580 758545 761252 763228
51358G63228O46o81j978l749n824p484q792j0364j1928j2540j2255j2188j2556
$$ 763228 763874 763193 761215 757466 751642 744158 735366 725002 713074 700534 688279 676091 663535
51345F63535j2128j0153p736o450o289n814m089j896q62j638l109l646k896j867
$$ 663535 651407 641254 633518 627068 620779 614965 610876 608980 608118 606480 603371 599725 596829 594962
51331E94962j379j237j034q47p80o66n48o13l61R84K896L693K911K062K167K008
$$ 594962 593583 592346 591312 590465 589685 589019 588471 587858 587497 588481 591377 595070 597981 600043 602210 604218
51315F04218N0l292o714r976j3145j5097j4806j3377j2872j3592j4216j4286j4562
$$ 604218 604268 600976 594262 584286 571141 556044 541238 527861 514989 501397 487181 472895 458333
51302D58333j5197j5220j4062j2132r905p671o109n788o114n883m962m413n019
$$ 458333 443136 427916 413854 401722 391817 384146 378037 372249 366135 360252 355290 350877 345858
51289C45858o447p665p525n610l191k436l683m679l743k279k410l444l143j602
$$ 345858 339411 331746 324221 318611 315420 312984 309301 304622 300879 298600 296190 292746 289603 288001
51275B88001j022k007k724k064j106r13j108j194j431j667j088K63J203J181R69
$$ 288001 286979 284972 282248 280184 279078 278165 277057 275863 274432 272765 271677 271940 273143 274324 275293
51260B75293J146J500K102L371M732M859L736K831K798K804K605L295N179O787
$$ 275293 276439 277939 280041 283412 288144 293003 296739 299570 302368 305172 307777 311072 316251 323038
51246C23038P092P000P489P889P381O754P164Q073P913O262M168K758K341K430
$$ 323038 330130 337130 344619 352508 359889 366643 373807 381880 389793 396055 400223 402981 405322 407752
51232D07752J998L07k050l552l677l546m239n351n953o067o504p736r528j1057
$$ 407752 409750 410057 408007 404455 400778 397232 392993 387642 381689 375622 369118 361382 351854 340797
51218C40797j1166r296o544m977n420o678p200o725o017n850o528p481p229m775
$$ 340797 329631 320335 313791 308814 303394 296716 289516 282791 276774 270924 264396 256915 249686 244911
51204B44911j345M66m30k629m270m712m048k462o15O41J374K119K186K77k812
$$ 244911 243566 244032 243602 240973 236703 231991 227943 225481 224866 225507 226881 229000 231186 231463 228651
51189B28651m241k851q16l44p41j97J334K829M102N046M375J443j718k444r65
$$ 228651 224410 221559 220743 220399 219658 219461 220795 223624 227726 232772 237147 238590 236872 234428 233463
51174B33463K71J92r7J36J74m55j064j078p47k71N27J335J374O71K21O05J353
$$ 233463 233734 233926 233829 233965 234139 233684 232620 231542 230795 230524 231051 232386 233760 234431 234652 235257 236610
51157B36610J865K140K307K244J885J300M32n98j150p21K4q6j159k049j804m74
$$ 236610 238475 240615 242922 245166 247051 248351 248783 248185 247035 246314 246338 246252 245093 243044 241240 240766
51141B40766J291K549K123l77l365m328k576j7J204Q35j67j291k369k622j238
$$ 240766 242057 244606 246729 246352 242987 238659 236083 236066 237270 238105 237938 236647 234278 231656 230418
51126B30418J167K771K579J401N91L63nq43j665j965j841j683j711k032k667l165
$$ 230418 231585 234356 236935 238336 238927 239290 239285 238442 236777 234812 232971 231288 229577 227545 224878 221713
51110B21713k736j196M34Q61m4j153j354n55M92R40O08K50P66J901K353J563O15
$$ 221713 218977 217781 218215 219076 219032 217879 216525 215970 216462 217402 218010 218260 219026 220927 223280 224843 225458
51093B25458N48O96Qq45m65N61J94j766l120k662j886k270k880k333j347j343
$$ 225458 226006 226702 226710 225865 225400 225961 226155 224389 221269 218607 216721 214451 211571 209238 207891 206548
51077B06548j802j220pL6j186j662l72J236J593J151J183J666J602P91k8m40p40
$$ 206548 204746 203526 203519 203555 202369 200707 200335 201571 203164 204315 205498 207164 208766 209557 209529 209089 208349
51060B08349r76n56P46K041K303J862K112L643N411O095N628M733L648K196P73
$$ 208349 207373 206817 207563 209604 211907 213769 215881 219524 224935 231030 236658 241391 245039 247235 248008
51045B48008K04O27J348J695J302k8j735k232o68J368J583J83o45m77j257l456
$$ 248008 248212 248839 250187 251882 253184 253156 251421 249189 248521 249889 251472 251655 251010 250533 249276 245820
51029B45820m387k106J393L012K782K763L267K970J966J671J942J144p42j721
$$ 245820 241433 239327 240720 243732 246514 249277 252544 255514 257480 259151 261093 262237 261495 259774
51015B59774j081n29j114j370l6J391P45j458k771k243j210p94l55J044K855L537
$$ 259774 258693 258164 257050 255680 255644 257035 257780 256322 253551 251308 250098 249304 248949 249993 252848 256385
50999B56385K433M58r62j355j337j605k088k275j967j361m96Q26K439L571L503
$$ 256385 258818 259276 258314 256959 255622 254017 251929 249654 247687 246326 245830 246656 249095 252666 256169
50984B56169K417J345J229J964K520K139J372J513K985M726N491N182M561M064
$$ 256169 258586 259931 261160 263124 265644 267783 269155 270668 273653 278379 283870 289052 293613 297677
50970B97677L675L650M446N813O638O019M161J990K93n60m51L47R41L67j229k310
$$ 297677 301352 305002 309448 315261 321899 327918 332079 334069 334362 333802 333351 333698 334639 335006 333777 331467
$$ [...]
##END NTUPLES=NMR SPECTRUM
##END=
