
##TITLE=AC1211_MCiAH12042_7160110_ttxhbOiQo4
##JCAMPDX= 6.0         $$ Bruker NMR JCAMP-DX V2.0
##DATA TYPE= NMR SPECTRUM
##DATA CLASS= NTUPLES
##ORIGIN= BRUKER
##OWNER= Administrator
$$ 1.72 TOPSPIN		Version 2.1
$$ 2012-11-30 21:08:33.545 -0500  Administrator@X
$$ Compression mode = diff/dup
##.OBSERVE FREQUENCY= 400.02188249412
##.OBSERVE NUCLEUS= ^1H
##.ACQUISITION MODE= SIMULTANEOUS (DQD)
##.ACQUISITION SCHEME= undefined
##.AVERAGES= 8
##.DIGITISER RES= 22
##SPECTROMETER/DATA SYSTEM= spect
##.PULSE SEQUENCE= zg30
##.SOLVENT NAME= COFFEE_meoh
##.SHIFT REFERENCE= INTERNAL, COFFEE_meoh, 1, 14.98509
##AUDIT TRAIL= $$ (NUMBER, WHEN, WHO, WHERE, PROCESS, VERSION, WHAT)
$$ ##TITLE= Audit trail, TOPSPIN		Version 2.1
$$ ##JCAMPDX= 5.01
$$ ##ORIGIN= Bruker BioSpin GmbH
$$ ##OWNER= Administrator
$$ $$ E:\/data/COFFEE/nmr/AC1211_MCiAH12042_7160110_ttxhbOiQo4/10/pdata/1/auditp.txt
$$ ##AUDIT TRAIL=  $$ (NUMBER, WHEN, WHO, WHERE, PROCESS, VERSION, WHAT)
(   1,<2012-11-30 21:08:25.154 -0500>,<Administrator>,<X>,<go>,<TOPSPIN 2.1>,
      <created by zg
	started at 2012-11-30 21:07:19.319 -0500,
	POWCHK enabled, PULCHK disabled,
       configuration hash MD5:
       86 BA 57 50 F2 9D 5C 9B 26 00 A9 28 5F 66 2E 89
       data hash MD5: 64K
       56 07 7B 65 55 B5 89 24 8B 1D 42 73 D9 9B 79 9E>)
(   2,<2012-11-30 21:08:28.311 -0500>,<Administrator>,<X>,<proc1d>,<TOPSPIN 2.1>,
      <Start of raw data processing
       efp LB = 0 FT_mod = 6 PKNL = 1 PHC0 = 0 PHC1 = 0 SI = 32K 
       data hash MD5: 32K
       22 93 D6 33 47 55 D3 0C 9D 29 2E 28 A7 09 18 8E>)
(   3,<2012-11-30 21:08:28.764 -0500>,<Administrator>,<X>,<proc1d>,<TOPSPIN 2.1>,
      <pk PHC0 = 99.05273 PHC1 = 0 
       data hash MD5: 32K
       7D 71 3C 37 48 99 F8 A7 AF 5F 21 3E 45 2C 19 82>)
(   4,<2012-11-30 21:08:29.029 -0500>,<Administrator>,<X>,<proc1d>,<TOPSPIN 2.1>,
      <abs ABSG = 1 
       data hash MD5: 32K
       36 B7 D4 F8 C3 42 38 49 70 D9 0F CC A7 54 CE 39>)
(   5,<2012-11-30 21:08:29.170 -0500>,<Administrator>,<X>,<proc1d>,<TOPSPIN 2.1>,
      <abs ABSG = 2 
       data hash MD5: 32K
       1B 12 EF 11 61 8D 37 DA F6 28 F3 0C 3A A9 03 43>)
(   6,<2012-11-30 21:08:29.326 -0500>,<Administrator>,<X>,<proc1d>,<TOPSPIN 2.1>,
      <abs ABSG = 3 
       data hash MD5: 32K
       6F DD 39 95 23 19 8B E2 AD B9 54 23 C5 62 C7 7F>)
(   7,<2012-11-30 21:08:29.467 -0500>,<Administrator>,<X>,<proc1d>,<TOPSPIN 2.1>,
      <abs ABSG = 4 
       data hash MD5: 32K
       91 BD FA 33 DE EE 1C 18 21 CD 74 FB E8 88 27 E8>)
(   8,<2012-11-30 21:08:29.639 -0500>,<Administrator>,<X>,<proc1d>,<TOPSPIN 2.1>,
      <abs ABSG = 5 
       data hash MD5: 32K
       D9 23 E4 58 5F C5 0A A8 4E 7C 80 D3 6F F5 89 3C>)
$$ ##END=
$$ 
$$ $$ hash MD5
$$ $$ 25 81 64 3A 9B 6E 55 EE 7C AC B8 61 A3 01 3E A6
##$RELAX= 
##$RELAX= 
##$RELAX= 
##$RELAX= 
##$RELAX= 
##$RELAX= 
##$RELAX= 
$$ Bruker specific parameters
$$ --------------------------
##$DU= <E:\>
##$EXPNO= 10
##$NAME= <AC1211_MCiAH12042_7160110_ttxhbOiQo4>
$$ [...]
##$TP= (0..7)
150 150 150 150 150 150 150 150
##$TP07= 0
##$TPNAME0= <>
##$TPNAME1= <>
##$TPNAME2= <>
##$TPNAME3= <>
##$TPNAME4= <>
##$TPNAME5= <>
##$TPNAME6= <>
##$TPNAME7= <>
##$TPOAL= (0..7)
0.5 0.5 0.5 0.5 0.5 0.5 0.5 0.5
##$TPOFFS= (0..7)
0 0 0 0 0 0 0 0
##$TUNHIN= 0
##$TUNHOUT= 0
##$TUNXOUT= 0
##$USERA1= <user>
##$USERA2= <user>
##$USERA3= <user>
##$USERA4= <user>
##$USERA5= <user>
##$V9= 5
##$VALIST= <valist>
##$VCLIST= <CCCCCCCCCCCCCCC>
##$VD= 0
##$VDLIST= <DDDDDDDDDDDDDDD>
##$VPLIST= <PPPPPPPPPPPPPPP>
##$VTLIST= <TTTTTTTTTTTTTTT>
##$WBST= 1024
##$WBSW= 4
##$XGAIN= (0..3)
0 0 0 0
##$XL= 0
##$YL= 0
##$YMAX_a= 672847
##$YMIN_a= -574668
##$ZGOPTNS= <>
##$ZL1= 120
##$ZL2= 120
##$ZL3= 120
##$ZL4= 120
##$ABSF1= 14.98509
##$ABSF2= -5.573092
##$ABSG= 5
##$ABSL= 3
##$ALPHA= 0
##$AQORDER= 0
##$ASSFAC= 0
##$ASSFACI= 0
##$ASSFACX= 0
##$ASSWID= 0
##$AUNMP= <proc_prof1d_extract_pilot.lims>
##$AXLEFT= 0
##$AXNAME= <>
##$AXNUC= <1H>
##$AXRIGHT= 0
##$AXTYPE= 0
##$AXUNIT= <>
##$AZFE= 0.1
##$AZFW= 0.1
##$BCFW= 0
##$BC_mod= 0
##$BYTORDP= 0
##$COROFFS= 0
##$CY= 15
##$DATMOD= 1
##$DC= 0
##$DFILT= <>
##$DTYPP= 0
##$F1P= 0
##$F2P= 0
##$FCOR= 0.5
##$FTSIZE= 32768
##$FT_mod= 6
##$GAMMA= 0
##$GB= 0
##$INTBC= 1
##$INTSCL= 1
##$ISEN= 128
##$LB= 0
##$LEV0= 0
##$LPBIN= 0
##$MAXI= 10000
##$MC2= 0
##$MEAN= 0
##$ME_mod= 0
##$MI= 0
##$NCOEF= 0
##$NC_proc= -8
##$NLEV= 6
##$NOISF1= 0
##$NOISF2= 0
##$NSP= 0
##$NTH_PI= 0
##$NZP= 0
##$OFFSET= 14.98509
##$PC= 1
##$PHC0= 99.05273
##$PHC1= 0
##$PH_mod= 1
##$PKNL= yes
##$PPARMOD= 0
##$PPDIAG= 0
##$PPIPTYP= 0
##$PPMPNUM= 2147483647
##$PPRESOL= 1
##$PSCAL= 4
##$PSIGN= 0
##$PYNMP= <proc.py>
##$REVERSE= no
##$SF= 400.02
##$SI= 32768
##$SIGF1= 0
##$SIGF2= 0
##$SINO= 400
##$SIOLD= 32768
##$SPECTYP= <>
##$SREGLST= <1H.CDCl3>
##$SSB= 0
##$STSI= 32768
##$STSR= 0
##$SW_p= 8223.68421052631
##$SYMM= 0
##$S_DEV= 0
##$TDeff= 65536
##$TDoff= 0
##$TI= <>
##$TILT= no
##$TM1= 0
##$TM2= 0
##$TOPLEV= 0
##$USERP1= <user>
##$USERP2= <user>
##$USERP3= <user>
##$USERP4= <user>
##$USERP5= <user>
##$WDW= 1
##$XDIM= 32768
##$YMAX_p= 471847277
##$YMIN_p= -701257
##$CURPLOT= <Network HP LaserJet P1505>
##$CURPRIN= <$Network HP LaserJet P1505>
##$DFORMAT= <normdp>
##$LAYOUT= <+/1D_H.xwp>
##$LFORMAT= <normlp>
##$PFORMAT= <normpl>
##$SURQMSG= 1
$$ End of Bruker specific parameters
$$ ---------------------------------
##NTUPLES= NMR SPECTRUM
##VAR_NAME=  FREQUENCY,     SPECTRUM/REAL,   SPECTRUM/IMAG
##SYMBOL=    X,             R,               I
##VAR_TYPE=  INDEPENDENT,   DEPENDENT,       DEPENDENT
##VAR_FORM=  AFFN,          ASDF,            ASDF
##VAR_DIM=   32768,         32768,           32768
##UNITS=     HZ,            ARBITRARY UNITS, ARBITRARY UNITS
##FACTOR=    0.250966925370066, 1,           1
##FIRST=     8223.43324360094, 65219,        -39962
##LAST=      0,             -166598,         -19325
##MIN=       0,             -701257,         0
##MAX=       8223.43324360094, 471847277,    0
$$ Real data points
##PAGE= N=1
##DATA TABLE= (X++(R..R)), XYDATA
$$ [...]
19551f7621A2003a185j36032L6865j99515H2062c1402B01531a10635l7032G8970
$$ -67621 12003 -1185 -137217 -100352 -299867 82062 -31402 201531 -110635 -147667 78970
19539G025a4445D52304a18835j3208M0341h503l54016a63045A71908a12658e0590
$$ 7025 -14445 452304 -118835 -132043 -91702 -8503 -362519 -163045 171908 -112658 -50590
19527B21066e6280H3591a1585K713D38N9092c90570B4116c99437A19152b18689
$$ 221066 -56280 83591 -11585 -8872 438 59530 -390570 24116 -399437 119152 -218689
19515d7666H9828a2112H617J74827b88091F1586a20039d7488r2940m7385k59661
$$ -47666 89828 -12112 8617 183444 -288091 61586 -120039 -47488 -140428 -187813 -447474
19504d47474A25412n1129C1690b72671B7576c52783B7893R2168O8978K35719a71876
$$ -447474 125412 74283 31690 -272671 27576 -352783 27893 120061 189039 424758 -171876
19492a18057h943j29529j86502B18826b24373J09858D2577o85e5117N40q375j80975
$$ -118057 -8943 -138472 -324974 218826 -224373 -114515 42577 41892 -55117 -54577 -62952 -243927
19480b43927c3121j00680B6004a89410E7227a47654k12219j65266a31508m2360
$$ -243927 -33121 -133801 26004 -189410 57227 -147654 -359873 -525139 -131508 -173868
19470a73868h2570A90347k8256J40402A44175b29620A42930P364i4917q0487A26846
$$ -173868 -82570 190347 162091 302493 144175 -229620 142930 150294 -94917 -175404 126846
19458A20498f7242A11650a462k29780A75587a9817l03835J52543h1046A70375
$$ 120498 -67242 111650 -1462 -231242 175587 -19817 -323652 -171109 -81046 170375
19447d46441A27428a71688O8518F9447b19262A75398a07250j19760K9956H182
$$ -446441 127428 -171688 -103170 69447 -219262 175398 -107250 -227010 -197054 8182
19436C8957a50430N3695j05217A4317J83009D5404g9480L3512l23717a09534j63181
$$ 38957 -150430 -96735 -201952 14317 197326 45404 -79480 -45968 -369685 -109534 -272715
19425b72715c8044A52938E4275b82170Q7585l34583a42779f1877A25381c32131
$$ -272715 -38044 152938 54275 -282170 -194585 -529168 -142779 -61877 125381 -332131
19414a88714D1511a30636A37107n239K4193e3598j69597i1031J5170k89897f8192
$$ -188714 41511 -130636 137107 131868 156061 -53598 -223195 -91031 -75861 -365758 -68192
19402I8445c3107j8839b4424q3184L7807E1667a68541c2865r0101I0236b88288
$$ 98445 -33107 -51946 -24424 -107608 -69801 51667 -168541 -32865 -122966 90236 -288288
19390A08474J63583c03984a09641b3657F8148a72227N7008j56682B60672f7484
$$ 108474 272057 -303984 -109641 -23657 68148 -172227 -115219 -271901 260672 -67484
19379A45794P1687h0841m8114A6312a46986O5675a719n35371e6336J0355C1340
$$ 145794 217481 -80841 -128955 16312 -146986 -81311 -1719 -537090 -56336 -45981 31340
19367A39712c49367d8122C1701a75934k5685D1425P956d45650B40372Q2512a81406
$$ 139712 -349367 -48122 31701 -175934 -201619 41425 49381 -445650 240372 322884 -181406
19355a89574A3890a11327C28318a37589Q009M9404C31284C3589e4891A15302f5045
$$ -189574 13890 -111327 328318 -137589 -129580 -80176 331284 33589 -54891 115302 -65045
19343A10498M0530d40657J22332J51979P9209o7859J0304k5124K8798j52078Q9739
$$ 110498 151028 -440657 -318325 -166346 -87137 -154996 -144692 -169816 -141018 -293096 -203357
19332b03357r4967L2810e7541I4677b3333C727a91554M5387p6672A47612a58689
$$ -203357 -298324 -265514 -57541 94677 -23333 3727 -191554 -146167 -222839 147612 -158689
19320a40228A36119i6691l9957A29898a24960o955O5696j05454A77668P0036c09478
$$ -140228 136119 -96691 -136648 129898 -124960 -131915 -66219 -171673 177668 247704 -309478
19308a35220n6753L6900A42161b5381j12741r8176M0955F1953b13253C21241a62203
$$ -135220 -191973 -155073 142161 -25381 -138122 -236298 -195343 61953 -213253 321241 -162203
19296a27176e8660H3197a74707o6661J00665D00182d8680A64434a72121A10174
$$ -127176 -58660 83197 -174707 -241368 -140703 400182 -48680 164434 -172121 110174
19285a78985B88052c29335J63481f4050B90078F5839b38769A26422c53661B9677
$$ -178985 288052 -329335 -165854 -64050 290078 65839 -238769 126422 -353661 29677
19274B2388b6426j0301F1112c77643a6289j38938H9965b6581q0298k20727I3644
$$ 22388 -26426 -36727 61112 -377643 -16289 -155227 89965 -26581 -106879 -327606 93644
19262D3676b12763j13248a37499j33016a01406j47039c7655n0275j96109F8357
$$ 43676 -212763 -326011 -137499 -270515 -101406 -248445 -37655 -87930 -284039 68357
19251b2026A50507b96546B52948j14220Q6698h4662C5665a51970j91263J11868
$$ -22026 150507 -296546 252948 138728 225426 -84662 35665 -151970 -343233 -231365
19241b31365N6808L4786A59654G1127J33476C142K7099a77185D0473A8155P2260
$$ -231365 -174557 -139771 159654 71127 204603 3142 30241 -177185 40473 18155 90415
19230I0415b70286R1195F793N5918a31854K3251j11113a00244A85329m3371a71007
$$ 90415 -270286 -179091 6793 62711 -131854 -108603 -219716 -100244 185329 141958 -171007
19218a44199l42709f7005B61274D1106b3941F2637a19331a6035j92615a8610C4722
$$ -144199 -486908 -67005 261274 41106 -23941 62637 -119331 -16035 -208650 -18610 34722
19206A3898a19166C1469c26983A31977b31556a05607c9697p8471j3144L2504l38915
$$ 13898 -119166 31469 -326983 131977 -231556 -105607 -39697 -118168 -131312 -98808 -437723
19195d37723C1457a67096O1154A10328a20417C86176B5459b51738L1850B12933
$$ -437723 31457 -167096 -105942 110328 -120417 386176 25459 -251738 -219888 212933
19184b52371j07877C09475a73348B2451c33935J05576B8161E034f1486C17601
$$ -252371 -360248 309475 -173348 22451 -333935 -228359 28161 5034 -61486 317601
19173a13303n7777d5477G9984c54262J70098j39957B997M6173N4793Q8971b07098
$$ -113303 -171080 -45477 79984 -354262 -184164 -324121 2997 49170 103963 192934 -207098
19161a46388F0289b22194h1717n522H3001h8282E9932c31437K659B6701a03881
$$ -146388 60289 -222194 -81717 -87239 83001 -88282 59932 -331437 -328778 26701 -103881
19149g1665n2929a5735A17491a98696B78490j09624a49955n2827R9457F7922g0677
$$ -71665 -124594 -15735 117491 -198696 278490 168866 -149955 -202782 -103325 67922 -70677
19137b83545E11291c2168j23339C8871i1752C22611C62P734O3195K42695b13566
$$ -283545 511291 -32168 -155507 38871 -91752 322611 362 8096 71291 313986 -213566
19125A68609d0879A9359a90054k17471c5683q9782e6786a850D7758J10540b49890
$$ 168609 -40879 19359 -190054 -407525 -35683 -125465 -56786 -1850 47758 158298 -249890
19113C07641b9126a0580G5370P5255P4179f1806A09340N485c00583M796g651k6878
$$ 307641 -29126 -10580 75370 150625 224804 -61806 109340 114825 -300583 -295787 -7651 -34529
19101c4529m2492n1843A34496a61125j44421B14558Q6867b56155g0017A3107M1068
$$ -34529 -77021 -128864 134496 -161125 -305546 214558 301425 -256155 -70017 13107 54175
19090E4175a20020j83726A90036a26048q4911A81037G2740R3776a74388L519J0264
$$ 54175 -120020 -303746 190036 -126048 -210959 181037 72740 166516 -174388 -170869 -160605
19079a60605N6749q7186D4205f4550j89783d183k4176C1853a34522A03161i5679
$$ -160605 -103856 -191042 44205 -64550 -254333 -4183 -28359 31853 -134522 103161 -95679
19067I2749a90688b9011j25026d1312G3296a30078K2458L7548q3017N9269r7502
$$ 92749 -190688 -29011 -154037 -41312 73296 -130078 -107620 -70072 -153089 -93820 -191322
19056a91322A36572B9734a84245C4784P985j5102a21016h169j30008l34254J74318
$$ -191322 136572 29734 -184245 34784 42769 27667 -121016 -8169 -138177 -472431 -298113
19045b98113I5448m6072k3412a34117h91j97127O4812N6018A54350A7020L67112
$$ -298113 95448 49376 25964 -134117 -891 -198018 -133206 -77188 154350 17020 384132
19034C84132a58786f3007q2430B72077h0814G4554a0079A08038k4576k4305i5505
$$ 384132 -158786 -63007 -145437 272077 -80814 74554 -10079 108038 83462 59157 -95505
19022b28687g536A64849b31797A12073b56998a1035B0570b56435K4376b9623C36720
$$ -228687 -7536 164849 -231797 112073 -256998 -11035 20570 -256435 -232059 -29623 336720
19010A27640g8983j65850c9783K524A20463h1885B5544d98432c6410j69114o0841
$$ 127640 -78983 -244833 -39783 -37259 120463 -81885 25544 -498432 -36410 -205524 -266365
18999b66365D0412J97206b03283B02986a06592l6508A25242b56213R0248A64860
$$ -266365 40412 237618 -203283 202986 -106592 -143100 125242 -256213 -165965 164860
18988d7235A84992E3249J94770I7389J1127j12e2655k9083l40384a15759j47195
$$ -47235 184992 53249 248019 97389 108516 108404 -52655 -81738 -422122 -115759 -262954
18977b62954C8710a461C80773E2178f5275D3065b49522G4011a80199J6702E4512
$$ -262954 38710 -1461 380773 52178 -65275 43065 -249522 74011 -180199 -163497 54512
18965b80838l9506R7954i6816K2012l99695J18886A7000c02562C5813J35781i1073
$$ -280838 -320344 -222390 -96816 -74804 -474499 -355613 17000 -302562 35813 171594 -91073
18953c41350a36949b0269j01697K7814E9521c54890L8435J54326f6955j71326
$$ -341350 -136949 -20269 -121966 -94152 59521 -354890 -316455 -162129 -66955 -238281
18943b38281b7372C21508h7223k43791h3874a6490n1880A83555K91523A58961
$$ -238281 -27372 321508 -87223 -331014 -83874 -16490 -68370 183555 475078 158961
18932a66300F0589J17449a2735j73829J7024e0520C42687b40343D3029j9385M4874
$$ -166300 60589 178038 -12735 -186564 -169540 -50520 342687 -240343 43029 23644 68518
18921F8518N7788c64004B68856J20487a11254j83210A40275a40541F1752J71410
$$ 68518 126306 -364004 268856 389343 -111254 -294464 140275 -140541 61752 233162
18911B33162b55443f2399o8034A0516O3332f9108G3491b45047J05425D0474a56574
$$ 233162 -255443 -62399 -130433 10516 73848 -69108 73491 -245047 -139622 40474 -156574
18899g6200A4205a1103k07336A50390G2850a55588q1470c0315p9789l08220C0277
$$ -76200 14205 -11103 -218439 150390 72850 -155588 -237058 -30315 -110104 -418324 30277
18887c39636e049A16796N4086R3183b92419e3776l17113C26276b75161h0784I8313
$$ -339636 -5049 116796 170882 264065 -292419 -53776 -370889 326276 -275161 -80784 98313
18875b12909b6766B0364K77551F8890K98978B956d05957i2134G7524a98405A2586
$$ -212909 -26766 20364 297915 68890 367868 2956 -405957 -92134 77524 -198405 12586
18863B92767c77847d6400L365D0944j614a91228C3886a43073a4668A50348a03172
$$ 292767 -377847 -46400 -43035 40944 39330 -191228 33886 -143073 -14668 150348 -103172
18851B99550d04500J32409c9549j3855D2029P3144H247d37003K04862H1954F636
$$ 299550 -404500 -272091 -39549 -53404 42029 115173 8247 -437003 -232141 81954 6636
18839a7988j79404j14195A88417m5707B0846a66549P1261j92185B4584i0981B9316
$$ -17988 -197392 -311587 188417 142710 20846 -166549 -95288 -287473 24584 -90981 29316
18827D0914C922N3631P6599B3682d17836i1681r2760F9732J1743M3327a85587
$$ 40914 3922 57553 134152 23682 -417836 -91681 -184441 69732 81475 124802 -185587
18815a47774c7420j44784O6862C2470J61269K0349q005L82h5793j12775A18473
$$ -147774 -37420 -182204 -115342 32470 193739 214088 206083 206465 -85793 -198568 118473
18803B72461e3855k46914B64013a22740B13203b14598H8500a3949c163B21592
$$ 272461 -53855 -300769 264013 -122740 213203 -214598 88500 -13949 -3163 221592
18792A98610q1004m1734L2399c3193d945l65732e3134B4673a99512A58917d7261
$$ 198610 117606 75872 108271 -33193 -4945 -370677 -53134 24673 -199512 158917 -47261
18780f1698A60187G0661l821b32082e1447m6994D3807e0642A30186N6883h9954
$$ -61698 160187 70661 66840 -232082 -51447 -98441 43807 -50642 130186 187069 -89954
18768d7692j66925H5029b02485O5505k8424A68280H3744J89824A30691c25136
$$ -47692 -214617 85029 -202485 -136980 -165404 168280 83744 273568 130691 -325136
18757i6194a1536j19513c5510r6232m6820A8719f7610j35487h9732q5491C36969
$$ -96194 -11536 -131049 -35510 -131742 -178562 18719 -67610 -203097 -89732 -175223 336969
18745a24453L852l0267D6759c417p3359j44878Q9332a8578k65041E0889d02308
$$ -124453 -120601 -150868 46759 -3417 -76776 -221654 -132322 -18578 -283619 50889 -402308
18733a55066A70587k2118B6411a96156l02579A8362a9332k07111A97480P6469
$$ -155066 170587 148469 26411 -196156 -498735 18362 -19332 -226443 197480 273949
18723B73949b83795K4267d928G0008H967c77994A37087d3355A91836a1137p9969
$$ 273949 -283795 -259528 -4928 70008 8967 -377994 137087 -43355 191836 -11137 -91106
18712i1106l142r176C4877f7700F9599b0959a408k87009e7226D64654A21669b53220
$$ -91106 -94248 -103424 34877 -67700 69599 -20959 -1408 -288417 -57226 464654 121669 -253220
18699A8018a70712P0180A3170P0438g4424a5903I5934a92110K4016j26272B57829
$$ 18018 -170712 -100532 13170 83608 -74424 -15903 95934 -192110 -168094 -294366 257829
18687a1894o2639k6395q92j9128j01693m7892a1720l724k6337r6897M5574k08493
$$ -11894 -74533 -100928 -101820 -120948 -222641 -270533 -11720 -15444 -41781 -138678 -93104 -301597
18675c01597i9252A55510B8215a33347p9383A47064L19020a17380C150J44246
$$ -301597 -99252 155510 28215 -133347 -212730 147064 466084 -117380 3150 147396
18665A47396i3509j5407B55737F8247c5102j07959H6839d15005a96564B37637
$$ 147396 -93509 -108916 255737 68247 -35102 -143061 86839 -415005 -196564 237637
18654B19743a40458a4728A8938a9428j40607a1766j70179A85609a23449j1402
$$ 219743 -140458 -14728 18938 -19428 -160035 -11766 -181945 185609 -123449 -134851
18644a34851A29399b90317a40494A8556b49794e3127P379A34457k44C4185J44457
$$ -134851 129399 -290317 -140494 18556 -249794 -53127 -45748 134457 134213 34185 178642
18633A78642a47279B30369b26738k37880K16382A65575b31075A32230a3694k92475
$$ 178642 -147279 230369 -226738 -464618 -248236 165575 -231075 132230 -13694 -306169
18623c06169I3221c4005A87330a16423a1954n4826I7632b63842h1174B64983d3085
$$ -306169 93221 -34005 187330 -116423 -11954 -66780 97632 -263842 -81174 264983 -43085
18611F0310B5360K5853b07794A62118J48871G1112a3659C59386d7204B4041c20134
$$ 60310 25360 51213 -207794 162118 310989 71112 -13659 359386 -47204 24041 -320134
18599A81430a42430A40105i4059j43289A51348a32036b886m58085b30082f5740
$$ 181430 -142430 140105 -94059 -237348 151348 -132036 -2886 -460971 -230082 -65740
18588d03304F0767a73923b8469j88583i8548r7051a2021k12672e0668B81193F0022
$$ -403304 60767 -173923 -28469 -217052 -98548 -195599 -12021 -224693 -50668 281193 60022
18576A2405K71649a10600B3357h9069M2781l35345e146l44403i5318j70475q2750
$$ 12405 284054 -110600 23357 -89069 -46288 -381633 -5146 -349549 -95318 -265793 -348543
18565c48543J15277M3162r9413i7858j893j74450C81149h9746k23017J35649f1145
$$ -348543 -233266 -190104 -289517 -97858 -99751 -274201 381149 -89746 -312763 -177114 -61145
18553c45259J44435D717K41603F3283i7383c1816j85036Q4159l23208i3082n9973
$$ -345259 -200824 4717 246320 63283 -97383 -31816 -216852 -132693 -455901 -93082 -153055
18542a53055a7220l65927a07337G1964b6131A90644b12092P6393A56693b39775
$$ -153055 -17220 -383147 -107337 71964 -26131 190644 -212092 -135699 156693 -239775
18531A00031b51565C9006b9858k52903f9469C71493a22901l50943H9651f948k07599
$$ 100031 -251565 39006 -29858 -282761 -69469 371493 -122901 -473844 89651 -6948 -214547
18520b14547L3541M6560l02472A87197b34695f8020B1068j0272g4459l87Q594
$$ -214547 -181006 -134446 -436918 187197 -234695 -68020 21068 10796 -74459 -74846 -66252
18509f6252i294o6133p1213A46180Q4833b98463c1603l9655k89855G1038a8486
$$ -66252 -9294 -75427 -146640 146180 231013 -298463 -31603 -71258 -361113 71038 -18486
18497b01056C40666a07601n18296A75654F0686J6384a06191B42199R0787c27811
$$ -201056 340666 -107601 -625897 175654 60686 77070 -106191 242199 332986 -327811
18486a7471A98011i1915A88670b04912A47443c5339G5884b91722c0822J4513A24047
$$ -17471 198011 -91915 188670 -204912 147443 -35339 75884 -291722 -30822 -16309 124047
18474f4595l0042j66690B67966C5350a00976F5308a87881e0018o8241A10687b92031
$$ -64595 -94637 -261327 267966 35350 -100976 65308 -187881 -50018 -118259 110687 -292031
18462C73498c9101l30534A41409a94539g5182A06997i7981B22593a79958A57120
$$ 373498 -39101 -369635 141409 -194539 -75182 106997 -97981 222593 -179958 157120
18451b9765k6061J9346l4638F8944a66983b3899A8087h5727j33140C07976e9545
$$ -29765 -55826 -36480 -71118 68944 -166983 -23899 18087 -85727 -218867 307976 -59545
18439B23417o1910a24904e6184B3354P8032b93788f1691o6241D57612b53188c157
$$ 223417 161507 -124904 -56184 23354 101386 -293788 -61691 -127932 457612 -253188 -3157
18427a25960G974b32117A60155c59619J14749a13017j48872D74818A30096b5977
$$ -125960 7974 -232117 160155 -359619 -244870 -113017 -261889 474818 130096 -25977
18416h6267A05533K06258C8311K2709J20609b44726J17062j5518b5873N095j8617
$$ -86267 105533 311791 38311 61020 181629 -244726 -127664 -143182 -25873 -20778 -39395
18405c9395l06455B94099b4203l88832i0408k88797a80446b7626k372l52033J76574
$$ -39395 -345850 294099 -24203 -413035 -90408 -379205 -180446 -27626 -29998 -382031 -205457
18394b05457A75008a08616C21657e773A32660a70908A69121P9298c3938m7586
$$ -205457 175008 -108616 321657 -5773 132660 -170908 169121 248419 -33938 -81524
18384h1524k33377M3853L7672B18445E3821A4727g5707k12636D0061a81224A01924
$$ -81524 -314901 -271048 -233376 218445 53821 14727 -75707 -288343 40061 -181224 101924
18372i5082o1365j06423A45359B7479P6811c3113l8968c0834B16451k9303a9288
$$ -95082 -156447 -262870 145359 27479 104290 -33113 -72081 -30834 216451 187148 -19288
18360b7380j02514e9056C82142b18657a0738C0198R2827a69542B14867e17598
$$ -27380 -129894 -59056 382142 -218657 -10738 30198 123025 -169542 214867 -517598
18349C6332a21348B20729f2148b263l05014D9128o880O7450b15169h3539J2018
$$ 36332 -121348 220729 -62148 -2263 -307277 49128 42248 109698 -215169 -83539 -71521
18338g1521B98008j14581m0157b04128l5523a10970o9563B8573a81029A09043
$$ -71521 298008 183427 143270 -204128 -239651 -110970 -180533 28573 -181029 109043
18327B16461a2696j50847A40305d37647B77973C3589a35268e5802n3737c7523
$$ 216461 -12696 -163543 140305 -437647 277973 33589 -135268 -55802 -109539 -37523
18316i8808j31606j0982N3284b2879j56058a4631j9460k48536P3544R4118j29097
$$ -98808 -230414 -241396 -188112 -22879 -178937 -14631 -34091 -282627 -209083 -114965 -244062
18305b44062k9726P263A47435A8034a03280A82548a86695n3338A40864m0272b39033
$$ -244062 -273788 -266525 147435 18034 -103280 182548 -186695 -240033 140864 100592 -239033
18293A12280K1381B6932a16859n6582d8480K1029D5544I617K04557e4739i294
$$ 112280 133661 26932 -116859 -173441 -48480 -27451 45544 9617 214174 -54739 -9294
18281c81430A24200h5775j88177N492A84555b65905A47264J53874b05828C60238
$$ -381430 124200 -85775 -273952 -268460 184555 -265905 147264 301138 -205828 360238
18270b8048n1977l6254A00467J39977b39030k3615g478k63523J07631j68140d7087
$$ -28048 -80025 -116279 100467 240444 -239030 -262645 -7478 -271001 -163370 -331510 -47087
18258b99888L0843C2797a12521I263J32114F2787d929k58661B11705i7637d0496
$$ -299888 -269045 32797 -112521 9263 141377 62787 -4929 -263590 211705 -97637 -40496
18246A18224D6484d70831a07892j00939k20351C21272a85387A02567a99644D9371
$$ 118224 46484 -470831 -107892 -208831 -429182 321272 -185387 102567 -199644 49371
18235H5359J328c6600o1559A26897M7933b21208D4636E558J42256f1942B8231
$$ 85359 86687 -36600 -98159 126897 174830 -221208 44636 5558 147814 -61942 28231
18223a92658J0442A38920i8503I3016M2904b24175a07617B3943b46492a14676
$$ -192658 -182216 138920 -98503 93016 135920 -224175 -107617 23943 -246492 -114676
18212a48017L7359C89373f0496A91139R4743j42459a20866N3907j8150B1365a82390
$$ -148017 -110658 389373 -60496 191139 285882 143423 -120866 -66959 -85109 21365 -182390
18200C73521j48290j5250d94541D7210O559K06352M6338c8743C27986d8194j98457
$$ 373521 225231 209981 -494541 47210 53769 260121 306459 -38743 327986 -48194 -246651
18189b46651i5104D07484a52034q8948b1249j49399l4043H9152M314I397b07846
$$ -246651 -95104 407484 -152034 -240982 -21249 -170648 -204691 89152 93466 9397 -207846
18177i2187I7420a80290j33575O2921F6406h11j34561G936J41795E1358b79673
$$ -92187 97420 -180290 -313865 -250944 66406 -811 -135372 7936 149731 51358 -279673
18165b9628j97167E1707f6288F515c14825b7365j04600k82125i3468k28759I3143
$$ -29628 -226795 51707 -66288 6515 -314825 -27365 -131965 -414090 -93468 -322227 93143
18153d4272i955B82986N9737i0189A09210a06990k22238B58239b97447a26995
$$ -44272 -9955 282986 342723 -90189 109210 -106990 -329228 258239 -297447 -126995
18142A54940b1794o3010q388A41442b02744A74155g9837A45963i2840G9034a77482
$$ 154940 -21794 -84804 -93192 141442 -202744 174155 -79837 145963 -92840 79034 -177482
18130a73059f2002q9471G2214l1753Q8765f2738C60513f7513j23493C0321O8464
$$ -173059 -62002 -151473 72214 40461 129226 -62738 360513 -67513 -191006 30321 98785
18119I8785m7503J33962a4001o5462l0487A24328a13406C2465a80189p8712C1383
$$ 98785 51282 185244 -14001 -79463 -109950 124328 -113406 32465 -180189 -258901 31383
18107B5471a89809p0651c1370k2700n5175A75471a97144Q4168A04375c41292b1066
$$ 25471 -189809 -260460 -31370 -54070 -109245 175471 -197144 -112976 104375 -341292 -21066
18095a85015b9655H9027R4251K33639h6909B59645a95792i2940j3901B82559r7403
$$ -185015 -29655 89027 183278 416917 -86909 259645 -195792 -92940 -106841 282559 185156
18084A85156D9216J75035b82260B0774J10497h0706G7990c42978a7250A64472
$$ 185156 49216 224251 -282260 20774 131271 -80706 77990 -342978 -17250 164472
18073A23964b08783k04430J45152a24916J974k0107j2670j39952d8801A38152
$$ 123964 -208783 -413213 -268061 -124916 -122942 -143049 -155719 -295671 -48801 138152
18062c7544j47580B25716j6164a26491A18616L6161a24164A9879c15939B85791
$$ -37544 -185124 225716 209552 -126491 118616 154777 -124164 19879 -315939 285791
18051H9093a89596A43595a42520A79236b9878l5788B1900h0779p4908j73028b7474
$$ 89093 -189596 143595 -142520 179236 -29878 -65666 21900 -80779 -155687 -328715 -27474
18039a27075m2172A85547p0027b54522P6272Q4035C1831b60546e2304r1651A36102
$$ -127075 -169247 185547 115520 -254522 -178250 -94215 31831 -260546 -52304 -143955 136102
18027i1925c996B38017a60117a7359o119k32255D8979P7827M0607a35080B07610
$$ -91925 -3996 238017 -160117 -17359 -23478 -255733 48979 126806 167413 -135080 207610
18015G9746O1671d312E7954e12376e4042j78148c5824C7226a33147n9000B53369
$$ 79746 141417 -4312 57954 -512376 -54042 -232190 -35824 37226 -133147 -192147 253369
18003A47390B1497b17348B5863c35742a36123A76691p3239J23687n6964B4023
$$ 147390 21497 -217348 25863 -335742 -136123 176691 103452 227139 170175 24023
17992B33009e8681b7094j16109j37984c7001B8084L4390a76960E4099M2505g6455
$$ 233009 -58681 -27094 -143203 -281187 -37001 28084 62474 -176960 54099 96604 -76455
17980A66272A7445R7010e2903j16376j82843A9642b4729A80942a28114k3890K5429
$$ 166272 17445 114455 -52903 -169279 -352122 19642 -24729 180942 -128114 -152004 -126575
17969a26575m3709A10294a67850h940j67250j76585B63926a43765A05121R0582
$$ -126575 -170284 110294 -167850 -8940 -176190 -352775 263926 -143765 105121 195703
17959A95703a01449b4394C9003j6118c5226I5206m3203a48670N2045r654B62623
$$ 195703 -101449 -24394 39003 22885 -35226 95206 52003 -148670 -96625 -106279 262623
17947a55263N3572k6689D09961C0844M2712b9829A12631J6748B8836g3290B2055
$$ -155263 -101691 -128380 409961 30844 73556 -29829 112631 129379 28836 -73290 22055
17935B09859b76109b3631B03020i0683p8643N1201A63921i9183A6029h0499r4621
$$ 209859 -276109 -23631 203020 -90683 -169326 -118125 163921 -99183 16029 -80499 -175120
17924a75120A38212J84115R0758G7104e4835B2712J22384c6315p0046B99210b94098
$$ -175120 138212 322327 413085 77104 -54835 22712 145096 -36315 -106361 299210 -294098
17912b10161D1140b71660B37517b12076A27383n6655Q9165r664c92741B45914
$$ -210161 41140 -271660 237517 -212076 127383 70728 159893 150229 -392741 245914
17901A73831N9649A01492K87102g2898j31620H2007b91473b1966D8527b38919
$$ 173831 233480 101492 388594 -72898 -204518 82007 -291473 -21966 48527 -238919
17890a28395e7781n4635e0293R549a9651k96372E2063J41842N3420j15009c28822
$$ -128395 -57781 -112416 -50293 -40744 -19651 -316023 52063 193905 247325 132316 -328822
17878c49865i3937q0365h4046A8423e35356b61283h8082l9187I206K4919j1460
$$ -349865 -93937 -174302 -84046 18423 -535356 -261283 -88082 -127269 9206 34125 22665
17867B2665b784I8300K04128d1845l7614B4645c03173A05330h1223A09388a69928
$$ 22665 -2784 98300 302428 -41845 -79459 24645 -303173 105330 -81223 109388 -169928
17855A69798b50215a7329E2610K7578a51377H8043a8958A8422J19773a51410B15307
$$ 169798 -250215 -17329 52610 80188 -151377 88043 -18958 18422 138195 -151410 215307
17843a99695F4086B5930M2502K15067d84835K41749A31686f6834b3082A0607K17016
$$ -199695 64086 25930 68432 283499 -484835 -243086 131686 -66834 -23082 10607 227623
17832B27623B5381a72405I1710K09412g5155E6947J3806J20238M9709o8279E1187
$$ 227623 25381 -172405 91710 301122 -75155 56947 70753 190991 240700 172421 51187
17820D08196c82056a13954E2275i9318B55990A03775i0596A09587a10558E2665
$$ 408196 -382056 -113954 52275 -99318 255990 103775 -90596 109587 -110558 52665
17809A10954f6886c2272B59650a45094B66059B0111J51979c5606j58937a0266
$$ 110954 -66886 -32272 259650 -145094 266059 20111 172090 -35606 -194543 -10266
17798a50297n8322A8394d5005n6835B20655b17301B13206m7291K4867f0224E0755
$$ -150297 -208619 18394 -45005 -101840 220655 -217301 213206 165915 190782 -60224 50755
17786A54620h9263A97440E6225a48769H6103M651a37384A37135K8532c50459e9815
$$ 154620 -89263 197440 56225 -148769 86103 90754 -137384 137135 165667 -350459 -59815
17774A65854A1748K5271e9811B02030O4631d62889A35700Q580G0994J5653c8490
$$ 165854 11748 37019 -59811 202030 266661 -462889 135700 144280 70994 86647 -38490
17762C32036a6217B36885j17054g0842E6942a03235J4675K2916e395j92208Q4716
$$ 332036 -16217 236885 119831 -70842 56942 -103235 -88560 -65644 -5395 -197603 -112887
17751a12887k3139B30361B4872a53022A82084A1262J58783d09930a34792j40780
$$ -112887 -136026 230361 24872 -153022 182084 11262 170045 -409930 -134792 -275572
17741b75572j8118F4157K472a36274j45296b3365k7341M681o0332k02891C20378
$$ -275572 -293690 64157 66629 -136274 -281570 -23365 -50706 -46025 -106357 -309248 320378
17729a33471G4395a52009A49205L0261n217a20443K9881j64502a1122j81224A20257
$$ -133471 74395 -152009 149205 179466 174249 -120443 -90562 -255064 -11122 -192346 120257
17717i2126E34789a23049B03362r9175g3395j44523A7372a14255K9716B03482
$$ -92126 534789 -123049 203362 104187 -73395 -217918 17372 -114255 -84539 203482
17706b20905k34090f0387n3072p8073D4897e4801a0726j7375C9911d01198A03211
$$ -220905 -454995 -60387 -113459 -191532 44897 -54801 -10726 -28101 39911 -401198 103211
17694a82344A6006K9604c7676k23368A35678K0665b97039f7758H5307b60006F6466
$$ -182344 16006 45610 -37676 -261044 135678 156343 -297039 -67758 85307 -260006 66466
17682A08784J59469E265a99024A34756c03584a7169j53016K8536C3535g728l4712
$$ 108784 268253 5265 -199024 134756 -303584 -17169 -170185 -141649 33535 -7728 -42440
17671d2440I2485A4069M812e21576B32495P4552b89890A5068J29367J52009a29577
$$ -42440 92485 14069 18881 -521576 232495 307047 -289890 15068 144435 296444 -129577
17659a86687e8202j74921B36314b72776d8434C1977R85i6358m0962k37237I1454
$$ -186687 -58202 -233123 236314 -272776 -48434 31977 32962 -96358 -137320 -374557 91454
17647E7884a08619q654l2978B03958a02995A40419F4726M28808j90765j08083
$$ 57884 -108619 -117273 -150251 203958 -102995 140419 64726 493534 302769 194686
17637A94686a19470C26154j42520C0119b3868n6711K5829l5512o1969A24260a07574
$$ 194686 -119470 326154 183634 30119 -23868 -80579 -54750 -90262 -152231 124260 -107574
17625A08373J0335J68691a3152F244b24941B0533i0005M0813q5037H550e613A71514
$$ 108373 118708 287399 -13152 6244 -224941 20533 -90005 -49192 -134229 8550 -5613 171514
17612d5104a2185D040K00751c7619k70300B5958J83397n2828A6906d3340A60974
$$ -45104 -12185 4040 204791 -37619 -307919 25958 209355 156527 16906 -43340 160974
17600i4444b7802C3726J24400a46393O5697J6169I7484J5314h0509A18701e0552
$$ -94444 -27802 33726 158126 -146393 -80696 -64527 97484 112798 -80509 118701 -50552
17588C78719A81720b9836m3930B2487J24402C1583J53803a64484A01853N6897
$$ 378719 181720 -29836 -73766 22487 146889 31583 185386 -164484 101853 158750
17578A58750c928n9987K5008p3588I7223N1627n1709a91674E3075J6657J12604
$$ 158750 -3928 -63915 -38907 -112495 97223 148850 97141 -191674 53075 69732 182336
17567A82336A4958J97147C0204L5062R450j3584B4419J40373e0316p0474q7209
$$ 182336 14958 212105 30204 65266 74716 61132 24419 164792 -50316 -120790 -207999
17556b07999i2482k1751j18313B39476E5862M7567J57396o5355a04481j01407
$$ -207999 -92482 -114233 -232546 239476 55862 103429 260825 195470 -104481 -205888
17546b05888B96004a19381F6270c53030I9372d5710D09082j5963E5120J27646
$$ -205888 296004 -119381 66270 -353030 99372 -45710 409082 393119 55120 182766
17536A82766K349b08424B44164a33734A26053O7742N1345e0565B6084J36731J6464
$$ 182766 185115 -208424 244164 -133734 126053 193795 245140 -50565 26084 162815 179279
17525A79279b94875A55368d6628A64107g9478a697j38526E3067J661J19150j2121
$$ 179279 -294875 155368 -46628 164107 -79478 -1697 -140223 53067 54728 173878 161757
17514A61757P3895E6369j9623L30659a62124B13958Q9498b20015B71157A00061
$$ 161757 235652 56369 36746 367405 -162124 213958 303456 -220015 271157 100061
17503B20262l1187n6474J93930A24827a3960E05552A76165b2665C13029A30301
$$ 220262 189075 132601 326531 124827 -13960 505552 176165 -22665 313029 130301
17492B69904p9479q3444J58344c10327A59075K1778p9919a40648k6810E9391a51294
$$ 269904 190425 106981 265325 -310327 159075 180853 100934 -140648 -167458 59391 -151294
17480G1043L26367j56557Q5225e2519B2123i7169C11059B9514L52522B9234d9636
$$ 71043 397410 240853 326078 -52519 22123 -97169 311059 29514 382036 29234 -49636
17468d3034r5040H8519L3474M47472j45981A94716a84822B39180J11489q4343
$$ -43034 -138074 88519 121993 569465 423484 194716 -184822 239180 350669 266326
17458B66326J36772h7805M017C84099d4544A21982K47036R3496A39092O6448K074
$$ 266326 403098 -87805 -83788 384099 -44544 121982 369018 462514 139092 205540 207614
17447B07614L0232M2674A20050J93722q7907r4867k0509K07882J79499j30573
$$ 207614 237846 280520 120050 313772 225865 130998 110489 318371 497870 367297
17437C67297A21910j2386m2107g2306F65198B32387l0334r1245J15932J35337
$$ 367297 121910 109524 67417 -72306 665198 232387 202053 110808 226740 362077
17427C62077o0666M362K45958h1421A279K76283I3586L2669E2546K61319E9582
$$ 362077 301411 305773 551731 -81421 1279 277562 93586 126255 52546 313865 59582
17415d858G1125J73933J23567A35839L02885q9980d8042D11688H3366k6516J96586
$$ -4858 71125 245058 368625 135839 438724 348744 -48042 411688 83366 56850 253436
17404B53436j14840l0885K82650A7148J15004a30291B45525C6060K60489B453
$$ 253436 138596 107711 390361 17148 132152 -130291 245525 36060 296549 2453
17393H5262K93652A78515K7186J98985a41791B64812J6261j134a19540A44976
$$ 85262 378914 178515 205701 404686 -141791 264812 281073 279939 -119540 144976
17382C65156A4684K92540A00477b4742C71343D3612J24916a0177j19130H0935
$$ 365156 14684 307224 100477 -24742 371343 43612 168528 -10177 -129307 80935
17371D32724a4547H906J88190P6793A35333N9489p1596J29303b09405A22190K62001
$$ 432724 -14547 8906 197096 273889 135333 194822 123226 252529 -209405 122190 384191
17360C84191a22669D09067o1865c0264B81545G4563q125q442K76668n5734c61210
$$ 384191 -122669 409067 347202 -30264 281545 74563 66438 57996 334664 278930 -361210
17348A27256n5487Q0162f3401C33431A13168K18616G7296a0325B31286J61263
$$ 127256 71769 151931 -63401 333431 113168 331784 77296 -10325 231286 392549
17338C92549A12104g8253A40407J655K64105j02166a37796A37097A1764L76404
$$ 392549 112104 -78253 140407 142062 406167 304001 -137796 137097 11764 388168
17328C88168A63201a39639I4553P6851J23659j37796k7190f485B5532J81838K27060
$$ 388168 163201 -139639 94553 171404 295063 157267 130077 -6485 25532 207370 434430
17317D34430f9887F1033M9060j5748J4610m6585K1124K93048A32553b07934A40893
$$ 434430 -69887 61033 110093 94345 108955 62370 83494 376542 132553 -207934 140893
17305b6839o1721C992J59982J477o5806K77167i2892A72940P1264O8260E1830
$$ -26839 -88560 3992 163974 165451 99645 376812 -92892 172940 244204 312464 51830
17293D21966m4781E6102a6757k3499r51C5487K78939a99461A19988n6796f8422
$$ 421966 377185 56102 -16757 -40256 -41207 35487 314426 -199461 119988 63192 -68422
17281A53969L2064l6427b49979B61292o4230J30006J3023j02282a18768B09506
$$ 153969 186033 149606 -249979 261292 197062 327068 340091 237809 -118768 209506
17270a51264A98316H3976J27061K23695I3839Q8307J11204f3898m6543A76391
$$ -151264 198316 83976 211037 434732 93839 182146 293350 -63898 -110441 176391
17259b6708l8072J4606B67006d9173C84096A50483P5876j3335b7918F0998Q0745
$$ -26708 -64780 -50174 267006 -49173 384096 150483 226359 213024 -27918 60998 141743
17248A41743Q2258k3101q940e0948B5553L7440J90553l0576L7069o7706L8216
$$ 141743 224001 200900 191960 -50948 25553 62993 253546 222970 260039 192333 230549
17237B30549a09535E56457A51296J70537m8087n193J21472r6171P7333M8277j43422
$$ 230549 -109535 556457 151296 321833 273746 268553 390025 293854 371187 419464 276042
17226B76042j19700R6317J6570J68866l6821o6186j07702B1676K35315P1391o9223
$$ 276042 156342 252659 269229 438095 401274 335088 227386 21676 256991 328382 259159
17215B59159P080p8760e7016B33066D881O5998J75738M37429B82536H5021K3642
$$ 259159 266239 187479 -57016 233066 4881 70879 246617 684046 282536 85021 108663
17204A08663d8273c209B80087O8065A17279l8499K68449K6516A59310k0061j5439
$$ 108663 -48273 -3209 280087 348152 117279 78780 347229 373745 159310 139249 123810
17193A23810K25519Q4022d508B71532O7863E1028B519L4346K92788E6450J78121
$$ 123810 349329 433351 -4508 271532 339395 51028 2519 36865 329653 56450 234571
17182B34571K97790j32851j71868O2767B0602K46252d4166B20589J4208P4221
$$ 234571 532361 399510 227642 290409 20602 266854 -44166 220589 234797 309018
17172C09018j15118Q4427j28129Q1813N6654A09813g2979D30070j38238J11284
$$ 309018 193900 278327 150198 232011 288665 109813 -72979 430070 291832 403116
17162D03116Q1397A53664b5378J419E52535C1448J94819n4257o9737N9956J9290
$$ 403116 484513 153664 -25378 -23959 552535 31448 226267 172010 102273 162229 181519
17151A81519K23549j55682n3275L6846J70115Q8417j6120B08407J77874J17682
$$ 181519 405068 249386 196111 232957 403072 491489 475369 208407 386281 503963
17141E03963A65571K41890A06473l2398L23190j17800j8311D0237K54850G6062
$$ 503963 165571 407461 106473 74075 397265 279465 261154 40237 295087 76062
17130A33265J84762E8623J64900K73664O4489j96573K05277j03787C8921Q13343
$$ 133265 318027 58623 223523 497187 561676 365103 570380 466593 38921 852264
17120H52264m15051B12721H2857J47248L50568B10014P4576M7697N1885k8276
$$ 852264 437213 212721 82857 230105 580673 210014 284590 332287 384172 355896
17110C55896A08264L34080J0990A61573M16666B44144N9536K27525A86446J48043
$$ 355896 108264 442344 453334 161573 578239 244144 303680 531205 186446 334489
17100C34489F2594J98716J15820A28248K89515q1480F3740J15051J08353M44639
$$ 334489 62594 261310 377130 128248 417763 336283 63740 178791 287144 731783
17090G31783j08295h9217A88634M61801g3715B63184K184j14379l3725O10627
$$ 731783 623488 -89217 188634 650435 -73715 263184 265368 150989 117264 727891
17080G27891j47422D0839L20822Q3447q4779J70834J9731n2255M4225j25485L2526
$$ 727891 580469 40839 361661 445108 360329 531163 550894 498639 542864 417379 449905
17069D49905A77261J26848J56233A18950K27104J84861o3357K55957j40500A51019
$$ 449905 177261 304109 460342 118950 346054 530915 467558 723515 583015 151019
17058A94006N9754M75856k61308K42195I9430L53932j83900P8433L0186j28548
$$ 194006 253760 729616 468308 710503 99430 453362 269462 347895 378081 249533
17048B49533J19733M2939N0939J00808j57712q3032L58208k44161j68806J46316
$$ 249533 369266 412205 463144 563952 406240 323208 681416 437255 268449 414765
17038D14765R3442J15960N3237m8851C12778L04648Q507k11308J89557j7528m6862
$$ 414765 508207 624167 677404 628553 312778 617426 625933 414625 604182 586654 539792
17027E39792M9043j13947K21575k67059K27198j47116j81179J5975L90652j18004
$$ 539792 588835 474888 696463 429404 656602 509486 328307 344282 734934 616930
17017F16930J42442l22636p5425L01780p9623J94614m5731M296K9052n5086k35776
$$ 616930 759372 436736 361311 663091 583468 778082 732351 736647 765699 710613 474837
17006D74837L3575J18970k26176L79835J81070m24681K93141j1465n3484n5967
$$ 474837 508412 627382 401206 781041 962111 537430 830571 819106 765622 709655
16996G09655j32077o7923L37704C77843M96200k2989j78066J235r0169R4641O0400
$$ 709655 577578 509655 847359 377843 874043 851054 672988 674223 584054 678695 739095
16985G39095j31976L103K52491j65204K68426M8875m07464J61054J37869l37945
$$ 739095 607119 610222 862713 697509 965935 1014810 607346 768400 906269 568324
16975E68324L75834j68076N1500o5052J46243k64722N01354m90527O6319j2161
$$ 568324 944158 776082 827582 762530 908773 644051 1145405 654878 721197 709036
16965G09036K36052P1159n6077j82952J22270k41401R6890J39373K41571l03747
$$ 709036 945088 1016247 960170 777218 899488 658087 754977 894350 1135921 832174
16955H32174J67549P5598j44444j09705L04695k49751j02103O57233l66127q0900
$$ 832174 999723 1075321 930877 821172 1125867 876116 774013 1431246 1065119 984219
16945I84219J54994K26197k05967J23941l02013m7858J17152L42926k80255k97524
$$ 984219 1139213 1365410 1159443 1283384 981371 933513 1050665 1393591 1113336 815812
16935H15812L99109N5244j69611Q8515K6628j31384M25115k08267Q9889j74886
$$ 815812 1214921 1270165 1100554 1189069 1215697 1084313 1509428 1301161 1391050 1216164
16925A216164O8544j8602p392P8695j54569J11015p245l1684P2564p8404M01261
$$ 1216164 1284708 1266106 1258714 1337409 1182840 1293855 1286610 1254926 1327490 1249086 1650347
16914A650347n9659j64187j05702L73392p6598k31686K53721l20305J66961O0168
$$ 1650347 1590688 1426501 1320799 1694191 1617593 1385907 1639628 1319323 1486284 1546452
16904A546452O2744J20004J14522J1730n55476K83291K2438K53556l41930n4927
$$ 1546452 1609196 1729200 1843722 1855452 1299976 1583267 1605705 1859261 1517331 1462404
16894A462404L66250k57744p0252K06043J36964L4914l00620M20717j51658j02653
$$ 1462404 1828654 1570910 1500658 1706701 1843665 1878579 1577959 1998676 1847018 1744365
16884A744365K06666P135k60815L75653k23729L0781K59974J14019J40048n6731
$$ 1744365 1951031 1958166 1697351 2073004 1849275 1880056 2140030 2254049 2394097 2337366
16874B337366j50268Q455L31820j85010N3386j62914R5152k11114M19017L108
$$ 2337366 2187098 2195553 2527373 2342363 2395749 2232835 2327987 2116873 2535890 2538998
16864B538998k62650J48788K33907j10021J31138k47447L39729L21745n27222
$$ 2538998 2276348 2425136 2659043 2549022 2680160 2432713 2772442 3094187 2566965
16855B566965K61269k98838L55897J06320M31065m63280J68760j74114k0133L26512
$$ 2566965 2828234 2529396 2885293 2991613 3422678 2959398 3128158 2954044 2933911 3260423
16845C260423P065M2049m5765J74451J29178r9047L5645J30519J41996N7432l51389
$$ 3260423 3267488 3309537 3263772 3438223 3567401 3468354 3503999 3634518 3776514 3833946 3482557
16834C482557M45837q0248K22601O6462k48770K47483J05747O4694J91723J66921
$$ 3482557 3928394 3848146 4070747 4137209 3888439 4135922 4241669 4306363 4498086 4665007
16824D665007k29733j4858L68537O6403J77312j53237K85010n6167O52402M2957
$$ 4665007 4435274 4420416 4788953 4855356 5032668 4879431 5164441 5108274 5760676 5803633
16814E803633l55653J8211K61008L15127J65899l22887N33342Q0050K57500O5249
$$ 5803633 5447980 5466191 5727199 6042326 6208225 5885338 6418680 6498730 6756230 6821479
16804F821479J68460j42857K25890M33653J53062K10855K09947N2768J74868K55608
$$ 6821479 6989939 6847082 7072972 7506625 7659687 7870542 8080489 8133257 8308125 8563733
16794H563733J53123M58213j9965L24425K87145M20483n3695K81693O07450J85354
$$ 8563733 8716856 9175069 9155104 9479529 9766674 10187157 10133462 10415155 11022605 11207959
16784A1207959J61384K65102K91005P57033J69249K89218N45280o1N34014J054071
$$ 11207959 11369343 11634445 11925450 12682483 12851732 13140950 13686230 13686169 14220183 15274254
16774A5274254M7101M82231R54818K7263R86262N22461P77880O54997P83320N37822
$$ 15274254 15321355 15803586 16758404 16785667 17771929 18294390 19072270 19727267 20510587 21048409
16764B1048409J120387O64399O64049J058833O17183J615658J121093J207587
$$ 21048409 22168796 22833195 23497244 24556077 25173260 26788918 27910011 29117598
16756B9117598J260275J614634J459216J362064J685786J627620K156896K163815
$$ 29117598 30377873 31992507 33451723 34813787 36499573 38127193 40284089 42447904
16748D2447904K136299K505807K121847K687879L193868K892403L520855L961733
$$ 42447904 44584203 47090010 49211857 51899736 55093604 57986007 61506862 65468595
16740F5468595L841713M317067M348810N083079N150458N838986O379509O528549
$$ 65468595 69310308 73627375 77976185 83059264 88209722 94048708 100428217 106956766
16732A06956766O606671P580052Q418426P999604Q520927R247128Q799884Q711374
$$ 106956766 113563437 121143489 129561915 137561519 146082446 155329574 164129458 172840832
16724A72840832Q706196Q406353P630899O245174N300566L947424K747825N79283
$$ 172840832 181547028 189953381 197584280 203829454 209130020 213077444 215825269 216404552
16716B16404552o29544l128063l567454n802635o511606p491425q328942q781934
$$ 216404552 215775008 212646945 209079491 203276856 196765250 189273825 180944883 172162949
16708A72162949r021471q823985q715306q916935q193413q155823p853317o867506
$$ 172162949 163141478 154317493 145602187 136685252 128491839 120336016 112482699 105615193
16700A05615193o509869o479154n983324n255665m957344m643840m505593l798395
$$ 105615193 99105324 92626170 86642846 81387181 76429837 71785997 67280404 63482009
16692F3482009l605193l745495l306073k695571k643153k566264k549685j844398
$$ 63482009 59876816 56131321 52825248 50129677 47486524 44920260 42370575 40526177
16684D0526177k338758j759498j961940j340390j867246j333626j057078j570508
$$ 40526177 38187419 36427921 34465981 33125591 31258345 29924719 28867641 27297133
16676B7297133j278261j186694r11645j247517r95132k38687n17752j286590q82694
$$ 27297133 26018872 24832178 23920533 22673016 21677884 21439197 20921445 19634855 18752161
16667A8752161p31857m46173j009307j80845n71099k33013r30042n24068n89241
$$ 18752161 18020304 17574131 16564824 16383979 15812880 15579867 14649825 14125757 13536516
16658A3536516l75917k27611n46529k59901l68639l09409m89550l53051l25343
$$ 13536516 13160599 12932988 12386459 12126558 11757919 11448510 10958960 10605909 10280566
16649A0280566J157q74633j24906o5572m21531k88543k13752k60947j92392k47193
$$ 10280566 10281723 9407090 9282184 9216612 8795081 8506538 8292786 8031839 7839447 7592254
16639G592254J78040m29833K557m20754j14186K03160n91243J18991m43815J11295
$$ 7592254 7770294 7340461 7343018 6922264 6808078 7011238 6419995 6538986 6095171 6206466
16629F206466k49300k09869k08952k23901K58794j95444q1338j35198j22160k09714
$$ 6206466 5957166 5747297 5538345 5314444 5573238 5377794 5296456 5161258 5039098 4829384
16619D829384j84535l1718R9935l52245L9742L4737o6722k09441m15141J63741
$$ 4829384 4644849 4613131 4713066 4360821 4400563 4435300 4368578 4159137 3743996 3907737
16609C907737J63253n79946J35094J68973k08448J69195m23634K50626j31265
$$ 3907737 4070990 3491044 3626138 3795111 3586663 3755858 3332224 3582850 3451585
16600C451585j3284k81099j15011K1755j40924j06528K16779K3297j19174P9998
$$ 3451585 3438301 3157202 3042191 3063946 2923022 2816494 3033273 3056570 2937396 3017394
16590C017394j95044q3954j62454J16428J6322J93o30749K42662J25609M4100
$$ 3017394 2822350 2738396 2575942 2692370 2708692 2708885 2078136 2320798 2446407 2490507
16580B490507N6773k90830Q2943k17613k3848P5241R3193j51541k23259J45096
$$ 2490507 2547280 2256450 2339393 2121780 2097932 2173173 2266366 2114825 1891566 2036662
16570B036662r9939J3631Q2349l19184M59007l91851K39800k20176k1295K75047
$$ 2036662 1936723 1950354 2032703 1713519 2172526 1780675 2020475 1800299 1779004 2054051
16560B054051q5787n08626L00435P2614j87452M2770k07079O4131J61830P3606
$$ 2054051 1968264 1459638 1760073 1832687 1645235 1688005 1480926 1545057 1706887 1780493
16550A780493k24871N2017J11033J3866k85130l11957J33207J30301n35974K84325
$$ 1780493 1555622 1607639 1718672 1732538 1447408 1135451 1268658 1398959 862985 1147310
16540A147310J63319k02051M99740m87948J45579J06021l84884Q24178m99450
$$ 1147310 1310629 1108578 1608318 1120370 1265949 1371970 987086 1811264 1311814
16531A311814J70913m88532k88326K56727K04148k0405n8837K49918m23356K36820
$$ 1311814 1482727 994195 705869 962596 1166744 1146339 1087502 1337420 914064 1150884
16521A150884k60223M7393q7943k01511M77002k45138o6971R4061j11955J38685
$$ 1150884 890661 938054 850111 648600 1125602 880464 813493 907554 795599 934284
16511I34284o3249o3239M8294k62794p802N82512k54442k92656Q5648P8216P468
$$ 934284 871035 807796 856090 593296 585494 1168006 913564 620908 706556 784772 792240
16500G92240J53213n2407k21251L764O3058k55705K94793n6304J5143j01053p1676
$$ 792240 945453 893046 671795 675559 738617 482912 777705 721401 736544 635491 563815
16489E63815L67882k50353j48443j19628L94456k05545P2076K31344J57628m00431
$$ 563815 931697 681344 532901 413273 807729 602184 674260 905604 1063232 662801
16479F62801M1198P1334j85050R9771j77095K7784j45996L2783L24503j84004
$$ 662801 703999 775333 590283 690054 512959 540743 394747 427530 752033 568029
16469E68029O2309L8881B87013P2696K67930j60935j82275K78344o7166K51276
$$ 568029 630338 669219 287013 359709 627639 466704 284429 562773 495607 746883
16459G46883k46435p382j11121L02635j78310j12621P7505o0088L11097j67836
$$ 746883 500448 493066 381945 684580 506270 393649 471154 411066 722163 554327
16449E54327j02648J67310p9383B08039n6565J52002L97159j49653L07759C19533
$$ 554327 451679 618989 539606 208039 151474 303476 700635 550982 858741 319533
16438C50869J38111j01569J39055k8488K11842l03235K91883o7560j22320m3420
$$ 350869 488980 387411 526466 497978 709820 406585 698468 630908 508588 465168
16428D65168N7182N3196k23544l0155j28963K51430k6688A43108L2077K54391
$$ 465168 522350 575546 352002 321847 192884 444314 417626 143108 175185 429576
16418D29576j53900J79466j44324J48975G4362J55021L03422k11920A00774O24478
$$ 429576 275676 455142 310818 459793 74362 229383 532805 320885 100774 725252
16408G25252k98388A49781O3849L98548n7441j74625q1733o4491O4055H8549M01541
$$ 725252 426864 149781 213630 612178 554737 380112 298379 233888 297943 88549 490090
16397D90090k13852M6386f5161C80121J09482J77655k46887n9528L94630B98647
$$ 490090 276238 322624 -65161 380121 489603 667258 420371 360843 755473 298647
16386E0975J33241J06261D0300J72785J66717K3755j0059A17468m5236a21525
$$ 50975 184216 290477 40300 213085 379802 403557 393498 117468 72232 -121525
16375C65353j43974K68537E9499L49769j87030k4866J64529I4933J60296j14084
$$ 365353 221379 489916 59499 409268 222238 197372 361901 94933 255229 141145
16365A41145P8226P6300A07872a43702A23776L48869k33653o8073J03498L00653
$$ 141145 219371 295671 107872 -143702 123776 472645 238992 170919 274417 575070
16355E75070A437J85189P7602q2098N63469A79987o5062K57936J4059j0145j66651
$$ 575070 1437 186626 264228 182130 745599 179987 114925 372861 386920 376775 210124
16344B10124j00809N2691o7111B5230N41398A77519L78733G9883M20342B37938
$$ 210124 109315 162006 94895 25230 566628 177519 556252 79883 500225 237938
16333A537P3547J20871O424j6396L17008L5847a5789F8965J23730N1325J33598
$$ 1537 75084 195955 202379 185983 502991 538838 -15789 68965 192695 244020 377618
16322C77618o4567A06108k8034Q0776K8652m1609K0352M8526b60384E0565J41757
$$ 377618 313051 106108 78074 158850 187502 145893 166245 214771 -260384 50565 192322
16311A92322a66331B5194J24997l9875B4637R522j2232O3329Q7990H6254L849
$$ 192322 -166331 25194 150191 110316 24637 34159 21927 85256 173246 86254 90103
16300I0103m0208K29263J09330j67580a16816B02900p095J37369F6273B7982J49227
$$ 90103 49895 279158 388488 220908 -116816 202900 195805 333174 66273 27982 177209
16289A77209K53730A21195R4619D3492A526J07649l3260b6137j03153E6016I329
$$ 177209 430939 121195 215814 43492 1526 109175 75915 -26137 -129290 56016 9329
16277a91386D4049f3810A42687G0245a41331B22002l3735n6390a38576b9179D70398
$$ -191386 44049 -63810 142687 70245 -141331 222002 188267 131877 -138576 -29179 470398
16265A97643a40437B83218r9572l517b9598B15951k2690K2762C5555A6443b86715
$$ 197643 -140437 283218 183646 180129 -29598 215951 193261 216023 35555 16443 -286715
16253C04964A36392J00123m8585K4531b2319B28159n5421H1129R7551d6847A37758
$$ 304964 136392 236515 187930 212461 -22319 228159 172738 81129 178680 -46847 137758
16241D22792c05542A8709L00003j13709p4536a85217d1074j06916A09327a61759
$$ 422792 -305542 18709 318712 205003 130467 -185217 -41074 -147990 109327 -161759
16230b87377A17240e44392B11900C8284K5516Q432a59807q1764M9850P6924m5942
$$ -287377 117240 -544392 211900 38284 63800 72232 -159807 -241571 -191721 -114797 -160739
16219a60739A37265L4676c5932L836i727A36252N6396J84352G9452K1778L19910
$$ -160739 137265 171941 -35932 -32096 -9727 136252 192648 377000 79452 101230 421140
16208D21140A33337b27801A26995A8789L11152I9507c7469C9252P8886b45039
$$ 421140 133337 -227801 126995 18789 329941 99507 -37469 39252 118138 -245039
16197B17810m3293a2886B29307d4619K85F6291b88665A47336a7741I3077B9298
$$ 217810 174517 -12886 229307 -44619 -44334 66291 -288665 147336 -17741 93077 29298
16185G4050a34462j5671A92987O0212A17491c0233A31831n1748c89251a01610
$$ 74050 -134462 -150133 192987 253199 117491 -30233 131831 80083 -389251 -101610
16174B66316O5602a7911A60735L2386c7263m5342d096E1523M5918E709J25576
$$ 266316 331918 -17911 160735 193121 -37263 -82605 -4096 51523 97441 5709 131285
16163A31285c28829q2459J00842b4188j31793H5760i4058A0117R0700g4169B83492
$$ 131285 -328829 -411288 -310446 -24188 -155981 85760 -94058 10117 100817 -74169 283492
16151A65017J37495e1779A11108C3550K574b89749C54003a21979A28243A0590
$$ 165017 302512 -51779 111108 33550 36124 -289749 354003 -121979 128243 10590
16140g3253A70804a43973L7598j15239K4264A71251J35917r1889b25456C01760
$$ -73253 170804 -143973 -106375 -221614 -197350 171251 307168 215279 -225456 301760
16129A20965n7073M23592I1725J89628E7628b35854D7801j4069a60533j56310
$$ 120965 63892 487484 91725 281353 57628 -235854 47801 33732 -160533 -316843
16119c16843A4042i8182r4397G419P5757o982b78458A73313c35030a42530A37111
$$ -316843 14042 -98182 -192579 7419 83176 76194 -278458 173313 -335030 -142530 137111
16107A4996J16743Q269o2832b49322B86752E2885c5980j45740A46776F807a19406
$$ 14996 131739 140008 77176 -249322 286752 52885 -35980 -181720 146776 6807 -119406
16095a05785A6590C936b45258B30602j05661g6196q1401o62A18937j8768A7269
$$ -105785 16590 3936 -245258 230602 124941 -76196 -157597 -158259 118937 100169 17269
16083A08974m2968b0484l7734C18120b9187q7459k43008C84256i4338A67655c79278
$$ 108974 66006 -20484 -58218 318120 -29187 -116646 -359654 384256 -94338 167655 -379278
16071H850K2947b86476a22114n7852p5115I0708C0163b57741e3704n7756n0535
$$ 8850 31797 -286476 -122114 -179966 -255081 90708 30163 -257741 -53704 -111460 -161995
16060a61995b9963n6451R76m997A04553K62842B8815d10589E7688J75514c50646
$$ -161995 -29963 -86414 -85438 -90435 104553 367395 28815 -410589 57688 233202 -350646
16048b66525J27153O1469k35557e1457j86460A801b00667q4757J37215A62444
$$ -266525 -139372 -77903 -313460 -51457 -237917 1801 -200667 -285424 -148209 162444
16037c46146d8562k7426E1698b00586h055k53658B26284b35752h0877A79613C1227
$$ -346146 -48562 -75988 51698 -200586 -8055 -261713 226284 -235752 -80877 179613 31227
16025a04509j86794A00997g1290E1098b16926A70024C9726b8822A09765O330a68941
$$ -104509 -291303 100997 -71290 51098 -216926 170024 39726 -28822 109765 116095 -168941
16013b3275p9391A8712o160b08190D05333a85797A21756c0534C26102G4830a68486
$$ -23275 -102666 18712 12552 -208190 405333 -185797 121756 -30534 326102 74830 -168486
16001a41184G2433d18565A94125E442P4368b94149P1108i3490B5951J08036c89358
$$ -141184 72433 -418565 194125 5442 79810 -294149 -223041 -93490 25951 133987 -389358
15989b69256A86521b45527A45298b4522C09758j7198a0246D12546A61448O8392
$$ -269256 186521 -245527 145298 -24522 309758 292560 -10246 412546 161448 229840
15979B29840I3946J01321a74559b2544n236j62971M9653J2046A28988c4167l7091
$$ 229840 93946 195267 -174559 -22544 -27780 -190751 -141098 -129052 128988 -34167 -71258
15968g1258m6255a2401l71162A25937a13889g544A14190J17312e3067G4131N2109
$$ -71258 -117513 -12401 -383563 125937 -113889 -7544 114190 231502 -53067 74131 126240
15957A26240m8427a9911k44195a17394n4992l6208B0510a02604k1027A18237i9942
$$ 126240 77813 -19911 -264106 -117394 -172386 -208594 20510 -102604 -123631 118237 -99942
15945A74285a80151J4344l45148a89078A9057J1492i8831D2476J15832a81663
$$ 174285 -180151 -165807 -510955 -189078 19057 30549 -98831 42476 158308 -181663
15934C24686e8290k22951j91574a66377M7064m28679f0420C8818K3346J68040
$$ 324686 -58290 -281241 -472815 -166377 -119313 -547992 -60420 38818 62164 230204
15924B30204D9622b05974p7211J18362b6651j8618j1999j47599B21444g6190k56544
$$ 230204 49622 -205974 -283185 -164823 -26651 -45269 -57268 -204867 221444 -76190 -332734
15913c32734A88100d2595A38123g7148H5280d3197A40715P8847q9513a15374j36023
$$ -332734 188100 -42595 138123 -77148 85280 -43197 140715 219562 130049 -115374 -251397
15902b51397J04759f8653m1548D22959a10324B55267b76227e0840A11448l049
$$ -251397 -146638 -68653 -110201 422959 -110324 255267 -276227 -50840 111448 108399
15892A08399B7380b96235J45562d9031A4702a96069j41901b2669j85368I9295
$$ 108399 27380 -296235 -150673 -49031 14702 -196069 -337970 -22669 -208037 99295
15881b016l16660A10264K9764J4253a49239c7772F9513c38029G1699f9019I6441
$$ -2016 -318676 110264 140028 154281 -149239 -37772 69513 -338029 71699 -69019 96441
15869E8648B6458a81021n0550L4441k096A11676E3351a41144D753c68678f7460
$$ 58648 26458 -181021 -231571 -197130 -199226 111676 53351 -141144 4753 -368678 -67460
15857b33531A50173a61764b7257l70260G2031g8100J913l87613b04029A14422
$$ -233531 150173 -161764 -27257 -397517 72031 -78100 -76187 -463800 -204029 114422
15846c5924j47499B76285J3999D6828a15679A66107i0016M25j41093B02647a20898
$$ -35924 -183423 276285 290284 46828 -115679 166107 -90016 -89591 -230684 202647 -120898
15834c05361h3731o6117k080E341J17444E3279h8326n4725j59902j3991H9735
$$ -305361 -83731 -149848 -151928 5341 122785 53279 -88326 -143051 -302953 -316944 89735
15822b53589a14058B5007a30929G2201G439b27231a9753B6666g9638k02119A48002
$$ -253589 -114058 25007 -130929 72201 7439 -227231 -19753 26666 -79638 -281757 148002
15810a32690b7128k4692k4226j52315M0605A58626G5899b80259C72546a19403
$$ -132690 -27128 -51820 -76046 -228361 -187756 158626 75899 -280259 372546 -119403
15799e4353B02889D1157a05939C999h1721j96204J10602A6637K57764f9165j5070
$$ -54353 202889 41157 -105939 3999 -81721 -277925 -167323 16637 274401 -69165 -84235
15788h4235C7051l43h1087A42510b72667d0310j68751i3623M4098a8538H2406
$$ -84235 37051 36708 -81087 142510 -272667 -40310 -209061 -93623 -49525 -18538 82406
15776B56341H6650e9955F3568c208l4431r4360k6494G4617f8035J8923C3212b04762
$$ 256341 86650 -59955 63568 -3208 -37639 -131999 -158493 74617 -68035 -49112 33212 -204762
15763a04273A03099d6721l14A31023a35268G0710b58282C01181j06184b36609
$$ -104273 103099 -46721 -47035 131023 -135268 70710 -258282 301181 194997 -236609
15752a92100A44354g5994A00079J43194c0196j63359i880r1387j5376B58958a63064
$$ -192100 144354 -75994 100079 243273 -30196 -193555 -9880 -101267 -116643 258958 -163064
15740f8116g200l16705i8465k06731H9262c00339a24773e3575m57232b8747j05229
$$ -68116 -7200 -323905 -98465 -305196 89262 -300339 -124773 -53575 -510807 -28747 -133976
15729a33976k50392a71211K9272B57943e07363A83236k7484F9238i0836b2225
$$ -133976 -384368 -171211 -141939 257943 -507363 183236 155752 69238 -90836 -22225
15718A66338c28597A19791a45885B57762i7609C15423A43989o7532c62283d9842
$$ 166338 -328597 119791 -145885 257762 -97609 315423 143989 76457 -362283 -49842
15707b9819j6433A9605O7329J7935a09832A2525N609L5818J26427a85997c6814
$$ -29819 -46252 19605 86934 104869 -109832 12525 18134 53952 180379 -185997 -36814
15695b15679D00894e360H4333f8630K7350q8083N6351C4027c3522A24923g4597
$$ -215679 400894 -5360 84333 -68630 -41280 -129363 -73012 34027 -33522 124923 -74597
15683D96871a15541E1282K00506a74565l05322i3059A59312a79042k82133a15268
$$ 496871 -115541 51282 251788 -174565 -479887 -93059 159312 -179042 -461175 -115268
15672a84012f5214A91001j8469J3800a86552F1571b12789o5961F3822J44271c66606
$$ -184012 -65214 191001 172532 186332 -186552 61571 -212789 -278750 63822 208093 -366606
15660c58943I8025b02888A27190m4382L32574c33299g5851f298E8625e5857A60491
$$ -358943 98025 -202888 127190 82808 415382 -333299 -75851 -6298 58625 -55857 160491
15648A33396e8319I3917m5344a72615H1127C541N0144h9175d0604R906F6108i5560
$$ 133396 -58319 93917 48573 -172615 81127 3541 53685 -89175 -40604 -30698 66108 -95560
15635c59820A17833B0979a11602l91072g563o5122G9986b3982H8361B1741J4088
$$ -359820 117833 20979 -111602 -502674 -7563 -72685 79986 -23982 88361 21741 35829
15624C5829R571a34855o392A24036C8621C14b12032R1578B74308b38809I1517
$$ 35829 45400 -134855 -141247 124036 38621 314 -212032 -120454 274308 -238809 91517
15612A70618a67472B28419r375b5004g750n9070k79808C3015b95710g9864L380
$$ 170618 -167472 228419 219044 -25004 -7750 -66820 -346628 33015 -295710 -79864 -76484
15601g6484k54786a21021k4067F1941J66777h4726B14672f9294k4753C80122f4202
$$ -76484 -331270 -121021 -145088 61941 228718 -84726 214672 -69294 -94047 380122 -64202
15589b71299C4202o601J58514a70588D0268f3700B20477c8829j27819b4720a0462
$$ -271299 34202 27601 186115 -170588 40268 -63700 220477 -38829 -166648 -24720 -10462
15577e8915j15845P1137B1938K26395b20537a3751q6755j80496J03998B55749
$$ -58915 -174760 -103623 21938 248333 -220537 -13751 -100506 -281002 -177004 255749
15566B12130b09452A51701b29741a12481H8630a1500C36682k2532C5439e6198
$$ 212130 -209452 151701 -229741 -112481 88630 -11500 336682 314150 35439 -56198
15555f7628L946A82506a92056l7647d3283j30147I8943j4466d0291j32511r979
$$ -67628 -63682 182506 -192056 -229703 -43283 -173430 98943 84477 -40291 -172802 -182781
15544a82781C57716a13769J0775B23254F8278b80969A92789h4429J8497A5145
$$ -182781 357716 -113769 -102994 223254 68278 -280969 192789 -84429 -65932 15145
15533b0958q7440D0086J94634b40067F7903K12490I8238G002f6103K8717B23208
$$ -20958 -108398 40086 234720 -240067 67903 280393 98238 7002 -66103 -37386 223208
15521A35614A9860L05386b23115B66531b2754A43392a18192d7537j65376C3078
$$ 135614 19860 325246 -223115 266531 -22754 143392 -118192 -47537 -212913 33078
15510A68107f1188k3637A19066B6592b0626D79782c0778j15797f2765B50334A19511
$$ 168107 -61188 -84825 119066 26592 -20626 479782 -30778 -146575 -62765 250334 119511
15498c5089D2656b57433J16053k14058A59256b04279h7196A55658p6939d0573
$$ -35089 42656 -257433 -141380 -355438 159256 -204279 -87196 155658 78719 -40573
15487c6444I158P8597l0104A5016Q6443a03539E2269b4389B402b41481A85548
$$ -36444 9158 87755 57651 15016 101459 -103539 52269 -24389 2402 -241481 185548
15475B20139b10236A5719J7318b51453G0960e1973A62197a21883L0118C5759J5885
$$ 220139 -210236 15719 33037 -251453 70960 -51973 162197 -121883 -91765 35759 51644
15464E1644G010J30934K3454a61372p2528g7896C15249h4390l39251F283K9219
$$ 51644 7010 137944 161398 -161372 -233900 -77896 315249 -84390 -423641 6283 35502
15453C5502J31423e58353C05245b66998a00459A8421i7708B34246F8941a7585
$$ 35502 166925 -558353 305245 -266998 -100459 18421 -97708 234246 68941 -17585
15442B61416A5868e2335A85738a64357B54892c33300C36823a25898A57600J49972
$$ 261416 15868 -52335 185738 -164357 254892 -333300 336823 -125898 157600 307572
15432C07572c469j30329A75031N3233a24488d3696j22306C1754a05948j81155
$$ 307572 -3469 -133798 175031 228264 -124488 -43696 -166002 31754 -105948 -287103
15422b87103J22204O9650K833k02637A85199a08130A75258J06292E8984O624B5916
$$ -287103 -164899 -95249 -92416 -295053 185199 -108130 175258 281550 58984 65608 25916
15410B20349F1396a05832j27838A10333i4522A10700b44287G2531b7793a027m2597
$$ 220349 61396 -105832 -233670 110333 -94522 110700 -244287 72531 -27793 -1027 -43624
15399d3624A78126J48061q9406J08605b5540A7129p453J15100d4432l99479D6457
$$ -43624 178126 326187 236781 345386 -25540 17129 9676 124776 -44432 -443911 46457
15387G1964Q570b26539Q5357a3102F0853a00902A90442A3017a85007L9464j95679
$$ 71964 80534 -226539 -141182 -13102 60853 -100902 190442 13017 -185007 -145543 -341222
15376c41222D20771G6020N459J26956J9786D0656J51184a17389M977i778C63114
$$ -341222 420771 76020 81479 208435 228221 40656 191840 -117389 -112412 -9778 363114
15364b27713a6094G8368b07392L0158k67932A74830H6916k752a13058D2886a56404
$$ -227713 -16094 78368 -207392 -177234 -445166 174830 86916 84164 -113058 42886 -156404
15352c048G9873a62116f0687k5353c4329j41396A13277P6761b82309q5206f6452
$$ -3048 79873 -162116 -60687 -86040 -34329 -175725 113277 190038 -282309 -367515 -66452
15340g6522k23104I4461a50963c6441k42998A86919J8481c2199A95212d0055a0697
$$ -76522 -299626 94461 -150963 -36441 -279439 186919 205400 -32199 195212 -40055 -10697
15328B10059m7099Q2840j20465E3615J25732F0844b29105f950F7519B9565e9363
$$ 210059 162960 245800 125335 53615 179347 60844 -229105 -6950 67519 29565 -59363
15316A45507Q2871a61317k72249a79116j04295N3882h8830K5449D38247d4476
$$ 145507 228378 -161317 -433566 -179116 -283411 -229529 -88830 -63381 438247 -44476
15305i5442C24919n1962j34038o4353j8721b72054c5514k7671n0310b0462B18742
$$ -95442 324919 272957 138919 74566 55845 -272054 -35514 -63185 -113495 -20462 218742
15293H9696f8365o4151m3896A79K51024a81881A77167a43152A54003h7551e592
$$ 89696 -68365 -132516 -176412 179 251203 -181881 177167 -143152 154003 -87551 -5592
15281A98237D3896i4072C7669f7056A47465k6097a4006J268A97155e0592o3288
$$ 198237 43896 -94072 37669 -67056 147465 121368 -14006 -12738 197155 -50592 -113880
15270a13880n6633d8148n1221l1022F8520f6685j27832A08373a39498I4876a18044
$$ -113880 -170513 -48148 -99369 -130391 68520 -66685 -194517 108373 -139498 94876 -118044
15258h5909C13294A52294E622Q2440e138B50027f0217C26863J24725O94118M60004
$$ -85909 313294 152294 5622 88062 -5138 250027 -60217 326863 451588 1145706 1605710
15247A605710k07593k22062j00087m84993p1176A4358a67574l8888B92827A15935
$$ 1605710 1398117 1176055 1075968 590975 519799 14358 -167574 -206462 292827 115935
15236H3772K29693e05523C16452a36021m1337E34115a43309C78178A73090g489
$$ 83772 313465 -505523 316452 -136021 -177358 534115 -143309 378178 173090 -7489
15225B53648h3182A22617d4898I0652c620B43859p5812G1761a57856B59050c8244
$$ 253648 -83182 122617 -44898 90652 -3620 243859 168047 71761 -157856 259050 -38244
15213A94267l7497E4338K6277A7227M2172O5850A0296f3941b3879H95J15327J44222
$$ 194267 156770 54338 80615 17227 59399 125249 10296 -63941 -23879 895 116222 260444
15201B60444B8394J47762a3514r4741G4566J82201i9156A06816N4452a2064E3223
$$ 260444 28394 176156 -13514 -108255 74566 256767 -99156 106816 161268 -12064 53223
15189A26533Q6537Q0309a67702o3227d6412I270C937j671Q0258P4705g535j33625
$$ 126533 213070 293379 -167702 -230929 -46412 9270 3937 2266 82524 157229 -7535 -141160
15177a41160H436K00562E9654O8537J97218q8878a28138D4330J3858J32227m6600
$$ -141160 8436 208998 59654 128191 325409 236531 -128138 44330 58188 190415 143815
15166A43815G1480B9639a25679E23640A0119O1153e2910A06043f003A44363P2563
$$ 143815 71480 29639 -125679 523640 10119 71272 -52910 106043 -6003 144363 216926
15155B16926l3993b46596h1261B00274F4815e6641j35604C6010L30516A25731
$$ 216926 182933 -246596 -81261 200274 64815 -56641 -192245 36010 366526 125731
15144A48048B9980J89942j00656l0144a78504F2913J1268b16472R6056B31260
$$ 148048 29980 219922 119266 89122 -178504 62913 74181 -216472 -120416 231260
15133B84927k4504l0568A03097J2952l1791a36362B25658L2759F9854Q5895P5123
$$ 284927 260423 229855 103097 116049 84258 -136362 225658 258417 69854 155749 230872
15122B30872E7174A1923J62247K25885A04657J13712b56319E82977A27829J3873
$$ 230872 57174 11923 174170 400055 104657 218369 -256319 582977 127829 141702
15112A41702b9784B79355B4682J82737n4650B635f138B18784f4649I9933c2191
$$ 141702 -29784 279355 24682 207419 152769 2635 -6138 218784 -64649 99933 -32191
15100F0296L1220L58473H0914J05018q0966J82631m9098p1484a9001H6179k8233
$$ 60296 91516 449989 80914 185932 104966 287597 238499 167015 -19001 86179 57946
15089E7946O5390K13148a05240L8469B18516o1058m9283a60929b7895B50146G5897
$$ 57946 123336 336484 -105240 -66771 218516 157458 108175 -160929 -27895 250146 75897
15077D08048H8730O4405K35562j18173C8739K37665D178K11595K4784j1957R8688
$$ 408048 88730 153135 388697 270524 38739 276404 4178 215773 240557 228600 327288
15066C27288A25708h2982A34974a10926A14815M1523K56420A71912K10832B0545
$$ 327288 125708 -82982 134974 -110926 114815 156338 412758 171912 382744 20545
15055e9890A13109M9335O3495p35D8298K63352o2152J53487j42215q1459o9214
$$ -59890 113109 162444 225939 225204 48298 311650 249498 402985 260770 179311 110097
15044A10097K03819j31701H9697K87997a3448C92293A66892R7107A21554K36501
$$ 110097 313916 182215 89697 377694 -13448 392293 166892 263999 121554 358055
15034C58055L9320I1936K62723F2741J8197L64448j45640J69907A16540b61876
$$ 358055 397375 91936 354659 62741 80938 445386 299746 469653 116540 -261876
15023A10012M3367F1546P9851J57320J1291E1355I019K68335K30531o4646j65972
$$ 110012 153379 61546 141397 298717 310008 51355 9019 277354 507885 443239 277267
15012B77267k9651K57961A95619b4007B39212q1283M8039L77546B46857J2242
$$ 277267 247616 505577 195619 -24007 239212 157929 205968 583514 246857 259099
15002B59099c1836H8239J34990G8885e301q751B77874N77j02672J69773j31238
$$ 259099 -31836 88239 223229 78885 -5301 -14052 277874 278451 175779 345552 214314
14991B14314C2908N2402e6399A98507l4533J4211K81714j79656L9078D5402M85993
$$ 214314 32908 85310 -56399 198507 163974 178185 459899 280243 319321 45402 531395
14980E31395A63979K42037F937K60778K57141M5951F880K04457R919J23536K3236
$$ 531395 163979 406016 6937 267715 524856 570807 6880 211337 221256 344792 368028
14969C68028k8580A03535J3570J18818f6861E2298M09123q1269A39921K52355
$$ 368028 339448 103535 117105 235923 -66861 52298 461421 380152 139921 392276
14959C92276j72581J14200q9224A04026P4558J19218K40808c12968C341K88637
$$ 392276 219695 333895 244671 104026 178584 297802 538610 -312968 3341 291978
14949B91978K9640q7028O3620R539A26675J93354m0526G6628K28183j16209E4346
$$ 291978 321618 234590 298210 307749 126675 320029 279503 76628 304811 188602 54346
14937C48833R5407B18308L43167A78910K91893j25364j27770J26316L9671j9603
$$ 348833 444240 218308 561475 178910 470803 345439 217669 343985 383656 364053
14927C64053j65278K31334N7149B31426D7652N7690J67674J88999j39863A60649
$$ 364053 198775 430109 487258 231426 47652 105342 273016 462015 322152 160649
14916A93093p315L48548k60995O6341o0401r2375J20915r1754j6411Q4411R3542
$$ 193093 185778 534326 273331 339672 279271 186896 307811 216057 199646 284057 377599
14905C77599J55598j87717A58088Q2939J11913j4650p2130K36636B19605A01715
$$ 377599 533197 345480 158088 241027 352940 338290 266160 502796 219605 101715
14894C77454J9216A36445Q1389K62551Q3147j43597A55806K00183D9589O65156
$$ 377454 396670 136445 217834 480385 563532 419935 155806 355989 49589 714745
14884G14745C30902L08185k10277A89380p2821h9652B65702J21324j24150J16420
$$ 714745 330902 639087 428810 189380 116559 -89652 265702 387026 262876 379296
14874C79296j66195J36800P1681L35234B80751j34425J51766K87852I2195K29547
$$ 379296 213101 349901 421582 756816 280751 146326 298092 585944 92195 321742
14864C21742n6495J57457J91380m1675B64125m5323K13779C3467O19784B88184
$$ 321742 265247 422704 614084 572409 264125 218802 432581 33467 653251 288184
14853F42466l3461J57674E1862N88072K6401k15137j50285J74904c4575F01659
$$ 642466 609005 766679 51862 639934 666335 451198 300913 475817 -34575 601659
14842C00918K05613R7893B99928K68308M116k17616L06599j80595j18899J7349
$$ 300918 506531 604424 299928 568236 572352 354736 661335 480740 361841 379190
14832C79190l2682P0115A91959K96784m7985n59O1680J3762n3889K57022C55861
$$ 379190 346508 416623 191959 488743 440758 440199 501879 515641 461752 718774 355861
14820C22524K55833j90793K30336j03370J01406j22018k739N9905J66334j63366
$$ 322524 578357 387564 617900 514530 615936 493918 491179 551084 717418 554052
14810E54052r0202J6615K77409j81113k5357k17569L27089j93819n633K31493
$$ 554052 463850 480465 757874 576761 551404 333835 660924 467105 461472 692965
14800F92965l01871L7235K24502j66484n9732A53802O82910l25857o611J1770
$$ 692965 391094 428329 652831 486347 426615 153802 836712 510855 504244 516014
14790E16014J09837k96392K56525R0437j40979J57440R0041l04688K65794l53173
$$ 516014 625851 329459 585984 676421 535442 692882 782923 478235 744029 390856
14780C90856Q8218K44209k22587J06946O2506B26130N12432Q7391j38576R1074
$$ 390856 479074 723283 500696 607642 670148 226130 738562 825953 687377 778451
14770G78451k92319p6882K55996n967j43636L11876j25301j65606J47359k32490
$$ 778451 486132 409250 665246 659279 515643 827519 702218 536612 683971 451481
14760D51481J29306K5648j09313K61232j95233B59479L90156k16120R6801K91387
$$ 451481 580787 606435 497122 758354 563121 259479 649635 433515 530316 821703
14750H21703q6964o8579j66561K2028L47947M2304m03914L82370k74610J4807
$$ 821703 734739 666160 499599 521627 869574 911878 507964 890334 615724 630531
14740F30531j2104j0626k35365L81078k96488j1044K76790J0768n9378K23612
$$ 630531 618427 607801 372436 753514 457026 445982 722772 733540 674162 897774
14730H97774K36991m52417K86993l44058J60726k69847J90313K68339k92663Q9922
$$ 897774 1134765 682348 969341 625283 786009 516162 706475 974814 682151 772073
14720G72073J1278j65380L29738l79898K63180j94504N03010k82806J60665A64524
$$ 772073 783351 617971 947709 567811 830991 636487 1139497 856691 1017356 164524
14709H85295j6121L58663n62812n5252J87982K88960m16490K57951l12536O41102
$$ 885295 869174 1227837 665025 609773 797755 1086715 670225 928176 615640 1256742
14699A256742l92190p5809K75138j57558M7998l56234M27689j02899J63389l75669
$$ 1256742 864552 788743 1063881 906323 954321 598087 1025776 922877 1086266 710597
14689G10597K51058l1735j23317K71271m02978L92599k17767j49556K95555j87634
$$ 710597 961655 929920 806603 1077874 674896 1067495 849728 700172 995727 808093
14679H08093K46769j60509K53286m659J6905k89996R2483L53257k39228K7988
$$ 808093 1054862 894353 1147639 1142980 1159885 869889 962372 1315629 1076401 1104389
14669A104389j285J49006o8747k44386N024J50893N2735J16335r8615l32021K98954
$$ 1104389 1103104 1252110 1183363 938977 944001 1094894 1147629 1263964 1165349 833328 1132282
14658A132282J93757l31860r2709K46288j6612k07723R9649J86459l03589M91298
$$ 1132282 1326039 994179 901470 1147758 1131146 923423 1023072 1209531 905942 1397240
14648A397240R1611l01560J65664R4755m56978j86295J93716N77996r9946m22830
$$ 1397240 1488851 1187291 1352955 1447710 990732 804437 998153 1576149 1476203 1053373
14638A053373J3785J93540k6211O4027P3218K69166m38687M12182m15555n3374
$$ 1053373 1067158 1260698 1234487 1298514 1371732 1640898 1202211 1614393 1198838 1145464
14628A145464M01262j27278J34382j97941l46465M20742p1636K04879O5285l90582
$$ 1145464 1546726 1419448 1553830 1355889 1009424 1430166 1358530 1563409 1628694 1238112
14618A238112J38680M7236Q822J73000k16212L31410k31818L14703q5984j07760
$$ 1238112 1376792 1424028 1432850 1605850 1389638 1721048 1489230 1803933 1717949 1610189
14608A610189j07196K56329L549k12845J48881k8126R0965k31443Q0701j85643
$$ 1610189 1502993 1759322 1762871 1550026 1698907 1670781 1761746 1530303 1611004 1425361
14598A425361P4331Q6005k13564J25279L24228r900j02466j24720K16009K62114
$$ 1425361 1499692 1585697 1372133 1497412 1821640 1811740 1709274 1584554 1800563 2062677
14588B062677j44905j26949J74954j6575J51166j86504J90689m4200L8157R2407
$$ 2062677 1917772 1790823 1965777 1949202 2100368 1913864 2104553 2060353 2098510 2190917
14578B190917k80291J59677j12144K0958L43474j19040K42302P036k38839j3760
$$ 2190917 1910626 2070303 1958159 1979117 2322591 2203551 2445853 2452889 2214050 2200290
14568B200290J80773p0029J75843l03467K83898K14649O3319J35568O2850k84181
$$ 2200290 2381063 2311034 2486877 2183410 2467308 2681957 2745276 2880844 2943694 2659513
14558B659513L55622J93583J82100M6870J12661L45328O07873L36269J127455
$$ 2659513 3015135 3208718 3390818 3437688 3550349 3895677 4503550 4839819 5967274
14549E967274J548243L686962R254600J5044945Q983629j6960807A1006417E407471
$$ 5967274 7515517 11202479 20457079 35502024 44485653 27524846 11006417 5407471
14540C922922q95130j97151k12219Q5087k76015O8653m51217J18799m9788K00621
$$ 3922922 3027792 2830641 2618422 2703509 2427494 2496147 2044930 2163729 2113941 2314562
14530B314562J11779j46482K43382m3080L7335L0850k88897J05921L70175p35
$$ 2314562 2426341 2279859 2523241 2480161 2517496 2548346 2259449 2365370 2735545 2734810
14520B734810j86501j29047J44941J22726K50825k76226l3767L1848M01133K3936
$$ 2734810 2548309 2419262 2564203 2686929 2937754 2661528 2627761 2659609 3060742 3084678
14510C084678k10121J8100R2448n326K44369n9249K49517l34250n5712K89689
$$ 3084678 2874557 2892657 2985105 2979779 3224148 3164899 3414416 3080166 3024454 3314143
14500C314143j39173J63174l31699M90436Q5055l27248L08050k80932K97668L75507
$$ 3314143 3174970 3338144 3006445 3496881 3581936 3254688 3562738 3281806 3579474 3954981
14490C954981k81977M4869n1650P3790J68704j35996n8295M2804L34562k27371
$$ 3954981 3673004 3717873 3666223 3740013 3908717 3772721 3714426 3757230 4091792 3864421
14480C864421L31532k66887K16332J95165L46524m37068K87436m04536O6303M13957
$$ 3864421 4195953 3929066 4145398 4340563 4687087 4250019 4537455 4132919 4199222 4613179
14470D613179j1906R4598j49957n4036J69477k02755K53558M59754k69356K39372
$$ 4613179 4601273 4695871 4545914 4491878 4661355 4458600 4712158 5171912 4902556 5141928
14460E141928k13846K61192K04498J6361m26064L86662m641J72420o27684M92975
$$ 5141928 4928082 5189274 5393772 5410133 4984069 5370731 5366090 5538510 4910826 5403801
14450E403801K35527J75368j5951l7467J40005K95289l50522K03048J7826p5575
$$ 5403801 5639328 5814696 5798745 5761278 5901283 6196572 5846050 6049098 6066924 5991349
14440E991349M44689q4454K02951K92239m44861N52555l0998L2688O85361m35337
$$ 5991349 6436038 6351584 6554535 6846774 6401913 6954468 6923470 6956158 7641519 7206182
14430G206182K78582j67557J14558J50986J70819l23486J26974K69254L68993
$$ 7206182 7484764 7317207 7431765 7582751 7753570 7430084 7557058 7826312 8195305
14421H195305m2562N31922k16688n8804M00576j2415L46467j54800j2388M57886
$$ 8195305 8152743 8684665 8467977 8409173 8809749 8797334 9143801 8989001 8976613 9434499
14411I434499K05635k10625J81690Q5653N16492N7268K69567L0526j18565L62189
$$ 9434499 9640134 9429509 9611199 9696852 10213344 10270612 10540179 10570705 10452140 10814329
14401A0814329K6405L01558N3859M57936K42056J67237k97625M66591J89260L6790
$$ 10814329 10840734 11142292 11196151 11654087 11896143 12063380 11765755 12232346 12421606 12458396
14391A2458396L66090l4695Q40139j51255L7626N33283O7761N74157K06866K78799
$$ 12458396 12824486 12789791 13629930 13478675 13516301 14049584 14117345 14691502 14898368 15177167
14381A5177167L68158k56057N62954J77169M45558J48604M82635K3135M79088
$$ 15177167 15545325 15289268 15852222 16029391 16474949 16623553 17106188 17129323 17608411
14372A7608411M32196l4573O20420K93026Q58104J00709L78199M64170P5350P67924
$$ 17608411 18040607 18006034 18626454 18919480 19777584 19878293 20256492 20720662 20796012 21563936
14362B1563936O83517j12965Q16468L56278P60392Q93398J03385M58686N14052
$$ 21563936 22247453 22134488 22950956 23307234 24067626 24961024 25064409 25523095 26037147
14353B6037147Q39097Q38507P8657P75288Q40074N90060Q28358J088385P70315
$$ 26037147 26876244 27714751 27793408 28568696 29408770 29998830 30827188 31915573 32685888
14344C2685888M96309J066962Q25890R54226J165077J182957N58259J309856J089493
$$ 32685888 33182197 34249159 35075049 36029275 37194352 38377309 38935568 40245424 41334917
14335D1334917J239082R89073J464129J505113J199719J576953J478242J351855
$$ 41334917 42573999 43563072 45027201 46532314 47732033 49308986 50787228 52139083
14327E2139083J954132J547532K095155K058006J776336K317744K029331K451631
$$ 52139083 54093215 55640747 57735902 59793908 61570244 63887988 65917319 68368950
14319F8368950K320197K401402L033425K764325K831481L244175L271192L373792
$$ 68368950 70689147 73090549 76123974 78888299 81719780 84963955 88235147 91608939
14311I1608939L803746L740364L975960M687707M341399M559709N550169N197384
$$ 91608939 95412685 99153049 103129009 107816716 112158115 116717824 122267993 127465377
14303A27465377N615488O176665O193471O966842P239400P388410Q028698Q420085
$$ 127465377 133080865 139257530 145451001 152417843 159657243 167045653 175074351 183494436
14295A83494436R216335R352973J0004331J0470349J1147740J1617494J2116045
$$ 183494436 192710771 202063744 212068075 222538424 233686164 245303658 257419703
14288B57419703J3205787J3132208J3539418J4197436J4482266J4983421J4930620
$$ 257419703 270625490 283757698 297297116 311494552 325976818 340960239 355890859
14281C55890859J4822774J5099929J4713979J3717477J3609641J2345711J1477262
$$ 355890859 370713633 385813562 400527541 414245018 427854659 440200370 451677632
14274D51677632R402778P452826L314041k212024j719697j012763j480866l444673
$$ 451677632 461080410 468533236 471847277 469635253 467915556 466902793 465421927 461977254
14266D61977254o490225r627366j1437961j2187960j2429274j1823583j2299573
$$ 461977254 455487029 445859663 434421702 422233742 409804468 397980885 385681312
14259C85681312j3875426j5119410j4716787j4483905j4266377j4758061j3980267
$$ 385681312 371805886 356686476 341969689 327485784 313219407 298461346 284481079
14252B84481079j3552462j3337389j2046199j2297172j1424580j0778838j0014544
$$ 284481079 270928617 257591228 245545029 233247857 221823277 211044439 201029895
14245B01029895r790510q841471q438666q574601p543982p287962o594450o260546
$$ 201029895 191239385 182397914 173959248 165384647 157840665 150552703 143958253 137697707
14237A37697707n748565n989858n524366n039237m665520m425755l885322m002126
$$ 137697707 131949142 125959284 120434918 115395681 110730161 106304406 102419084 98416958
14229I8416958m103577m015115l080740l518117l033020l077585k719195k247939
$$ 98416958 94313381 90298266 87217526 83699409 80666389 77588804 74869609 72621670
14221G2621670k726769j976632k753995k121094k440938j731224j891676j436960
$$ 72621670 69894901 67918269 65164274 63043180 60602242 58871018 56979342 55542382
14213E5542382j392504j963760j871801j367924j619108j107495p70037j220639
$$ 55542382 54149878 52186118 50314317 48946393 47327285 46219790 45449753 44229114
14205D4229114j586141j089077j041768r73165j360770m89296r32119j630950
$$ 44229114 42642973 41553896 40512128 39538963 38178193 37688897 36756778 35125828
14197C5125828q24812q63410j090899m67638o20953r28918p75904p78132m93407
$$ 35125828 34301016 33437606 32346707 31879069 31258116 30329198 29553294 28775162 28281755
14188B8281755q82769n48388m15324r45803o25385j54987l51717r66549l94519
$$ 28281755 27398986 26850598 26435274 25489471 24864086 24709099 24357382 23390833 22996314
14179B2996314n16406o44055k16878m34113n65172m04522k63828l15320n78082
$$ 22996314 22479908 21835853 21618975 21184862 20619690 20215168 19951340 19636020 19057938
14170A9057938l71770l03392l89079n6160m93338n22123j09354m73556k75307
$$ 19057938 18686168 18382776 17993697 17937537 17444199 16922076 16812722 16339166 16063859
14161A6063859k12247l89442l27340k95403K9809m12223k01152l30595k22997
$$ 16063859 15851612 15462170 15134830 14839427 14869236 14457013 14255861 13925266 13702269
14152A3702269k87342k50263o0631k46180k52130k80064j63165L5920m93235j65586
$$ 13702269 13414927 13164664 13104033 12857853 12605723 12325659 12162494 12198414 11705179 11539593
14142A1539593J65089l83927m19950k12553L90142l10861p8898k67295m0906p00076
$$ 11539593 11704682 11320755 10900805 10688252 11078394 10767533 10688635 10421340 10380434 9680358
14132I680358N19358l61829k7634m52878k10552j2077L85060n99151j50942j2891
$$ 9680358 10199716 9837887 9810253 9357375 9146823 9134746 9519806 8920655 8769713 8756822
14122H756822l2728j92997j19454j67871l3626k96459M68703l58106l04174K93296
$$ 8756822 8724094 8531097 8411643 8243772 8210146 7913687 8382390 8024284 7720110 8013406
14112H013406m12916J4811k98446l43304L18006k25361l04306L43738k94966j56389
$$ 8013406 7600490 7615301 7316855 6973551 7291557 7066196 6761890 7105628 6810662 6654273
14102F654273j51884k8141j03858M10054m81829K06101j05194M04143o99328J0965
$$ 6654273 6502389 6474248 6370390 6780444 6298615 6504716 6399522 6803665 6104337 6115302
14092F115302m61441K09492j89589J04512l03360r5069J790m0442j80199J29258
$$ 6115302 5653861 5863353 5673764 5778276 5474916 5379847 5381637 5341195 5160996 5290254
14082E290254M23790p37760L43820q3004k16180k02550K74534j00067p8846M2358
$$ 5290254 5714044 4976284 5320104 5237100 5020920 4818370 5092904 4992837 4913991 4956349
14072D956349l36718M58656k61873j80728J52727m38034M04375m24050J2256N34872
$$ 4956349 4619631 5078287 4816414 4635686 4788413 4350379 4754754 4330704 4342960 4877832
14062D877832o47338Q2583K44794j72547j954j7784j34840k4568l48280l0032
$$ 4877832 4230494 4313077 4557871 4385324 4383370 4365586 4230746 4206178 3857898 3827866
14052C827866K53527j51417m68572N21622l33448j08452K99479l08127M51924
$$ 3827866 4081393 3929976 3461404 3983026 3649578 3541126 3840605 3532478 3984402
14043C984402j03936n84793M37553n90260J45279L02371K5498j75198q9433O4202
$$ 3984402 3880466 3295673 3733226 3142966 3288245 3590616 3616114 3440916 3351483 3415685
14033C415685O2507l1810k10357J40724m43772L50439j69937p0405m4171J20617
$$ 3415685 3478192 3446382 3236025 3376749 2932977 3283416 3113479 3043074 2998903 3119520
14023C119520l24259J99869l31508m4175P7117J1450J72793q5673q8784m4413
$$ 3119520 2795261 2995130 2663622 2619447 2696564 2708014 2880807 2795134 2706350 2661937
14013B661937L01767k89513n7448J42112j67136j32562P24565q61991M87290l34242
$$ 2661937 2963704 2674191 2616743 2758855 2591719 2459157 3183722 2321731 2809021 2474779
14003B474779O8149k54394L40277p13159O70361j27497K39669k85927j83386J01484
$$ 2474779 2542928 2288534 2628811 1915652 2586013 2458516 2698185 2412258 2228872 2330356
13993B330356O0215N2906K63444L34772Q84851K407059P667242J4461123J4062526
$$ 2330356 2390571 2443477 2706921 3041693 3926544 6333603 14000845 28461968 42524494
13984D2524494j1583950j4301325o902452k351225j448337j122357m97350n7278
$$ 42524494 30940544 16639219 9736767 7385542 5937205 4814848 4317498 4260220
13976D260220m30500l50368m13042l98789L17097l2172l10636J73145q2549q8367
$$ 4260220 3829720 3479352 3066310 2667521 2984618 2952446 2641810 2814955 2732406 2644039
13966B644039k40213J22374J16185k40315J20159l76966L78179j03797r4530m63903
$$ 2644039 2403826 2526200 2642385 2402070 2522229 2145263 2523442 2419645 2325115 1861212
13956A861212L80489p1962Q4899n8465m25468J53441L01538k54061J71024l60454
$$ 1861212 2241701 2169739 2254638 2196173 1770705 1924146 2225684 1971623 2142647 1782193
13946A782193K5351M04996j75623k4285j17808N4239j12405q7086M05758j67815
$$ 1782193 1807544 2212540 2036917 2012632 1894824 1949063 1836658 1749572 2155330 1987515
13936A987515r4738j23747j08928Q0470Q2061K32650o13592M03511j14889K53985
$$ 1987515 1892777 1769030 1660102 1740572 1822633 2055283 1441691 1845202 1730313 1984298
13926A984298M068k85333j86996K66526q3877r5691L40204j36062k33201J03095
$$ 1984298 1988366 1703033 1516037 1782563 1698686 1602995 1943199 1807137 1573936 1677031
13916A677031l14115O99093o38886K38711l06882L17610l4248m63696L13587r9655
$$ 1677031 1362916 2062009 1423123 1661834 1354952 1672562 1638314 1174618 1488205 1388550
13906A388550J97243K9384j92604p8288J66605n5234J53648m2951l53958L05410
$$ 1388550 1585793 1615177 1422573 1344285 1510890 1455656 1609304 1566353 1212395 1517805
13896A517805k16004q6278j2464O8877K09819q8848J5867k2072M9270j46479k41071
$$ 1517805 1301801 1215523 1203059 1271936 1481755 1392907 1408774 1386702 1435972 1289493 1048422
13885A048422L55964m5590m80915O16474m9683J94589l66025k60587K15862k46290
$$ 1048422 1404386 1358796 877881 1494355 1444672 1639261 1273236 1012649 1228511 982221
13875I82221L1629L68230k700j45741K58856j36077J31737l83153J55444N27446
$$ 982221 1013850 1382080 1379380 1233639 1492495 1356418 1488155 1105002 1260446 1787892
13865A787892n89155k47023M58166k58362m5262J91959m13675L53788p2290j95671
$$ 1787892 1198737 951714 1409880 1151518 1106256 1298215 884540 1238328 1166038 970367
13855I70367j97331L34460L2507l63485L58933j52900P1479K83204K6414l53358
$$ 970367 773036 1107496 1140003 776518 1135451 982551 1054030 1337234 1363648 1010290
13845A010290M37167l83553P8421k06143L54957n03741J60820L0893L31385j99685
$$ 1010290 1447457 1063904 1142325 936182 1291139 787398 948218 979111 1310496 1110811
13835A110811r743E44884O30659j65707L55258m81930K09272l7724m3158j82405
$$ 1110811 1101068 544884 1175543 1009836 1365094 883164 1092436 1054712 1011554 829149
13825H29149L33720p5265k6459k62508M33199m27504L26035m1387j24598n6648
$$ 829149 1162869 1087604 1061145 798637 1231836 804332 1130367 1088980 964382 907734
13815I07734k8886j49790L82821o7701K2715N1985o8157k59141K37714N6404R428
$$ 907734 878848 729058 1111879 1044178 1066893 1118878 1050721 791580 1029294 1085698 1095126
13804A095126q7452l80056L43417j32249j32195J73626K27330l3212j05605k3476
$$ 1095126 1007674 627618 971035 838786 706591 880217 1107547 1074335 968730 945254
13794I45254K97968m46653K01311k17966Q2299j65570M54445l67589J84779k88816
$$ 945254 1243222 796569 997880 779914 862213 696643 1151088 783499 968278 679462
13784F79462N67358l63168j44332J8905k97262L32622k04644K64947r5385k02773
$$ 679462 1246820 883652 739320 758225 460963 793585 588941 853888 758503 555730
13774E55730L42437j73660j04876J64973J37407l47393K47234J59599o1228J46057
$$ 555730 898167 724507 619631 784604 922011 574618 821852 981451 920223 1066280
13764A066280k25136j14848J16591j89043J14933l78807N94716k52838l14175
$$ 1066280 841144 726296 842887 653844 768777 389970 984686 731848 417673
13755D17673K90632p2738J50326j08421J27634l33461J6737K16488J05126J37774
$$ 417673 708305 635567 785893 677472 805106 471645 488382 704870 809996 947770
13745I47770C31596M77555k74837L32814k40449R6273L6073O6066k47017K00621
$$ 947770 331596 809151 534314 867128 626679 722952 759025 825091 578074 778695
13735G78695C20602J89250j18692R9072m286j57162j19078M01424k0447L90209
$$ 778695 320602 509852 391160 490232 485946 328784 209706 611130 590683 980892
13725I80892l16738r9887J1464k8433J4249j53271k0191J92333J79101k94214
$$ 980892 664154 564267 575731 547298 561547 408276 388085 580418 759519 465305
13715D65305M44678j74279k50187L89638l73508M05532j16008C34218M47185P8099
$$ 465305 909983 735704 485517 875155 501647 907179 791171 334218 781403 859502
13705H59502l85579M4533j04465J21435L06415k04853j26546L77706p4741C28113
$$ 859502 473923 518456 413991 535426 841841 636988 510442 888148 813407 328113
13694E37718Q6300J16532l58302K58979j08195j79498l8810L2397A16379L58764
$$ 537718 624018 740550 382248 641227 533032 353534 314724 347121 116379 475143
13684D75143Q9819j34992P8813O1240N3551k11955K88459J17026C41423L34120
$$ 475143 564962 429970 508783 570023 623574 411619 700078 817104 341423 675543
13674F75543m0886B78250o3178L62352j09234L04418J18996l30807N6863A65315
$$ 675543 634657 278250 215072 577424 468190 772608 891604 560797 617660 165315
13663D10970A75899K46246K66388B45993J75609j10288L9846j30406L75876j27699
$$ 410970 175899 422145 688533 245993 421602 311314 351160 220754 596630 468931
13653D68931P0940k663k918P8548j35039p3082J88297K42341a5706F16731o5848
$$ 468931 539871 537208 534290 612838 477799 404717 593014 835355 -15706 616731 550883
13642E50883j04454N8956j6298o0429A23175O84305k75684P1l0862o6057K4349
$$ 550883 446429 505385 489087 428658 123175 807480 531796 531867 501005 434948 459297
13631D59297l9238j38342j28852K79509L481O6001d5097D62464j43328A55498
$$ 459297 420059 281717 152865 432374 435855 501856 -45097 462464 319136 155498
13620D32145J6833j16144J55127o7732j2487j99853L86841p7091A61907L25229
$$ 432145 448978 332834 487961 420229 407742 207889 594730 517639 161907 487136
13610D87136O5575B73541j9743L44086k07173j42026J26724O1643J70748B05302
$$ 487136 552711 273541 253798 597884 390711 248685 375409 437052 607800 205302
13599C97256j07529p08M70548a786C66596b83726B66786Q9446A08593M27392j29809
$$ 397256 289727 289019 759567 -1786 366596 -283726 266786 356232 108593 535985 406176
13588D06176L6583n8688A08580K76768P9256A80344K42319J48735j06352j21770
$$ 406176 442759 384071 108580 385348 464604 180344 422663 571398 465046 343276
13578C43276A55316J50390L20381j88773J73621j58012j88074K08956j92218q0979
$$ 343276 155316 305706 626087 437314 610935 452923 264849 473805 281587 200608
13568B00608J24093j0486J27049j83282Q8302J36848p2708j20976M3181f47B43555
$$ 200608 324701 314215 441264 257982 346284 483132 410424 289448 332629 -647 243555
13556C71159G7586M15781j38787r7980J13916l3873O3047j78462J04771p8783
$$ 371159 77586 493367 354580 256600 370516 336643 399690 221228 325999 247216
13546B47216J89584r0167A52011K71988L09375B69096p7089K77215q5701j02427
$$ 247216 436800 346633 152011 423999 733374 269096 192007 469222 383521 281094
13536B81094K76106k49796J62812j02595M1188A06753R2961K6012J52097L0891
$$ 281094 557200 307404 470216 367621 408809 106753 199714 225726 377823 408714
13526D08714H3569L23451L2984A06995J57574A29754J11112J21560K09706M2313
$$ 408714 83569 407020 440004 106995 264569 129754 240866 362426 572132 614445
13516F14445A92963j506m922L05000j24266J6864j41901L66892B44564j00611
$$ 614445 192963 191457 186535 491535 367269 384133 242232 609124 244564 143953
13506A43953M8600N1854K00863j78720j3286l1208O7509a83789C41408A37141
$$ 143953 192553 244407 445270 266550 253264 222056 289565 -183789 341408 137141
13495B23496L14410B10045j04132J24950K24939j88776O1203j59165K10459j38327
$$ 223496 537906 210045 105913 230863 455802 267026 328229 169064 379523 241196
13485B41196H0232K13563N9004O1744C3965K22281J24826A56900M55482k54453
$$ 241196 80232 293795 352799 414543 33965 256246 381072 156900 612382 357929
13475C57929A36316K12329E5733g0978D37595A18526M27602A59811K05174E2349
$$ 357929 136316 348645 55733 -70978 437595 118526 546128 159811 364985 52349
13464I5027O1115J20074a29598A05193e1879a2268A9061M96936k10951L38711
$$ 95027 156142 276216 -129598 105193 -51879 -12268 19061 515997 305046 643757
13454F43757k56623A27082Q3351o2547J05251Q1108I4415J95504J2988J054L14632
$$ 643757 387134 127082 210433 147886 253137 334245 94415 289919 302907 303961 618593
13443F18593A43959J41972D386L04501A53603J63955J94555j24941j07259a43381
$$ 618593 143959 285931 4386 308887 153603 317558 512113 387172 279913 -143381
13432E20170B43907R8101A58334L43631B24046R2651E953J26290K30636A56041
$$ 520170 243907 342008 158334 501965 224046 316697 5953 132243 362879 156041
13421E9994K72620J822j43471K04862j25616a16713A65876N25872B26648J24598
$$ 59994 332614 334436 190965 395827 270211 -116713 165876 691748 226648 351246
13411C51246C1436J83100g2498D17574j48532j28076F7004D759K20117r2844K01143
$$ 351246 31436 214536 -72498 417574 269042 140966 67004 4759 224876 132032 333175
13400C33175H2283L95470P9339j54280A10213N3222g8090B28780A10304K34816
$$ 333175 82283 477753 557092 402812 110213 163435 -78090 228780 110304 345120
13390C45120H7302K00577I1498J91474N6181p9534l8771d9721B69084j1233P4415
$$ 345120 87302 287879 91498 282972 339153 259619 220848 -49721 269084 257851 332266
13379C32266J71810d9698B26097K160P4919O288i9646k8338C80146M3040b9344
$$ 332266 504076 -49698 226097 228257 303176 309464 -99646 -127984 380146 423186 -29344
13367B06330m0362H0882J35962C435M04937A97861K19133j94657J01166j11076
$$ 206330 165968 80882 216844 3435 408372 197861 416994 222337 323503 212427
13357B12427H9204C2077R6372O2557J82429P5729j59680A26338L54070R6176k06349
$$ 212427 89204 32077 128449 191006 373435 449164 289484 126338 480408 576584 370235
13346C70235L6645O6153C9025N90182k24872E1909J47311R530a46406E03353k41752
$$ 370235 406880 473033 39025 629207 404335 51909 199220 208750 -146406 503353 261601
13335B61601m7689j04770J95763J18510A86912q4349J39943m5513R6804H1753
$$ 261601 213912 109142 304905 423415 186912 102563 242506 196993 293797 81753
13324I826M83458b20077B98528A24493m3395N07908A65823G6498J82612K36356
$$ 9826 493284 -220077 298528 124493 81098 589006 165823 76498 259110 495466
13314D95466H1254K62726J963Q6990B14936J33251b20361H2956j2408L40052a6837
$$ 495466 81254 343980 345943 432933 214936 348187 -220361 82956 70548 410600 -16837
13302B85804o1248D1673K96475H7638L13910n676M7907A89775J25873p2805n6586
$$ 285804 224556 41673 338148 87638 401548 395872 443779 189775 315648 242843 186257
13291A86257m2390n771J19785i4764o0041B81783J34641B1872M51913j82550m9075
$$ 186257 143867 138096 257881 -94764 -154805 281783 416424 21872 473785 291235 242160
13280B42160K65237k35722k3724R0625a31699a3057B38790J152K47445j39513
$$ 242160 507397 271675 247951 338576 -131699 -13057 238790 239942 487387 347874
13270C47874a708D4783n177J91771Q8934A1674L08766A24601J94689a3962d061
$$ 347874 -1708 44783 39606 231377 320311 11674 320440 124601 319290 -13962 -4061
13258I2441E182J57382A8743L0576J90640d0374O720B93412q5194e4256B63720
$$ 92441 5182 162564 18743 49319 239959 -40374 -33654 293412 208218 -54256 263720
13246C55947j69998o9394K07619e8273B68804N7944n8936a98876C52459j67608
$$ 355947 185949 116555 324174 -58273 268804 326748 267812 -198876 352459 184851
13236A84851q5951D3619i6002B42895A05734L9270c27241F4069k6763g9220A29533
$$ 184851 98900 43619 -96002 242895 105734 145004 -327241 64069 37306 -79220 129533
13224D3781J75390f4155k28564a0844A01272N076C4398R97M72410A36627J02545
$$ 43781 219171 -64155 -292719 -10844 101272 106348 34398 35395 507805 136627 239172
13213B39172G184J76280G7623J52849K37045A44152J1689D966a09076M1137A92950
$$ 239172 7184 183464 77623 230472 467517 144152 155841 4966 -109076 -67939 192950
13201f3989E0023J71269b82689B7818d1830n8972A58041a81824A33648l5282B430
$$ -63989 50023 221292 -282689 27818 -41830 -100802 158041 -181824 133648 98366 2430
13189d5147A80645b69E7135e7648K7978l5547D50774A90538o718J47251D6985
$$ -45147 180645 -269 57135 -57648 -29670 -65217 450774 190538 183820 331071 46985
13177B82359E15K53785l3460r6828K0002b04786b2082A93879J52366M5218F9394
$$ 282359 515 254300 220840 124012 144014 -204786 -22082 193879 346245 391463 69394
13165c64088A73392a72446I2142O8721n5898b76247J36870A98984K432c3771B41518
$$ -364088 173392 -172446 92142 160863 104965 -276247 -139377 198984 201416 -33771 241518
13153A51013R9746A3018O8995l420c97182a92373E2215J04240J39282I1935J93924
$$ 151013 250759 13018 82013 78593 -397182 -192373 52215 156455 295737 91935 285859
13142B85859A11349R5537D7189C066f4689C9117a21179j72292a42997c2390C36747
$$ 285859 111349 206886 47189 3066 -64689 39117 -121179 -293471 -142997 -32390 336747
13130I8972b9709B78608D1295K66227l8398B097J76962E0521j3171J65353a73657
$$ 98972 -29709 278608 41295 307522 269124 2097 179059 50521 37350 202703 -173657
13118B34157P0438E7617b3615B1996K0179h8214B20797J67B6404K51753F3724
$$ 234157 304595 57617 -23615 21996 42175 -88214 220797 220964 26404 278157 63724
13106A66774K9743o4407L811N2103a96086A66349J89047G8855e1042r543A78352
$$ 166774 196517 132110 135921 188024 -196086 166349 355396 78855 -51042 -60585 178352
13094A87785c26204A74617R4399b13014B86936A07842J28215K9520j29738Q4029
$$ 187785 -326204 174617 269016 -213014 286936 107842 236057 265577 135839 219868
13084B19868m7988L0464O1265a11579C33996e5999B46938C3037K00129d6180B56897
$$ 219868 171880 202344 263609 -111579 333996 -55999 246938 33037 233166 -46180 256897
13072A48282J29739L2427c0441D9731J37425J74890I2769J10027c2608D5437P0262
$$ 148282 278021 310448 -30441 49731 187156 362046 92769 202796 -32608 45437 115699
13061A15699l4607k5060L09778A23355J4514b19507A28036A7647a27390H2204
$$ 115699 81092 56032 365810 123355 137869 -219507 128036 17647 -127390 82204
13050A48810K80671A20112D547b801A03627g1888D0957K7829G47O118J3730K66165
$$ 148810 429481 120112 4547 -2801 103627 -71888 40957 68786 747 6865 20595 286760
13038B86760h0846A33207g2132j6995B70259b05065K256B45149d1914i455A41042
$$ 286760 -80846 133207 -72132 -89127 270259 -205065 -202809 245149 -41914 -9455 141042
13026E1068a90491E5004N13846B72750D3724J9278O7802F0673M6884J09275c18966
$$ 51068 -190491 55004 568850 272750 43724 63002 130804 60673 107557 216832 -318966
13014C29105A0946L15233A0042f7857A87460f0528E2150a62679B26215H5073J71134
$$ 329105 10946 326179 10042 -67857 187460 -60528 52150 -162679 226215 85073 256207
13003B56207E8582P4222o4602J88092p077c059I3480e9714k844I2085J05815c3489
$$ 256207 58582 132804 68202 256294 249217 -3059 93480 -59714 -62558 92085 197900 -33489
12990D38747I3655J73794a52712B95496A30919P2228b4200H5479r731a12129B28349
$$ 438747 93655 267449 -152712 295496 130919 203147 -24200 85479 75748 -112129 228349
12978a19769A00207a79509A37261j4070l1906B7457e9379B64555J87261j79778
$$ -119769 100207 -179509 137261 123191 91285 27457 -59379 264555 451816 272038
12968B72038a30140k55676C98112F5491g9045B30013A10808K06542E6596d495
$$ 272038 -130140 -385816 398112 65491 -79045 230013 110808 317350 56596 -4495
12957A1070c5712j14169B90714J856B6490a04968A5322K83196j35560p147a79395
$$ 11070 -35712 -149881 290714 292570 26490 -104968 15322 298518 162958 155811 -179395
12945A9159J44007O0690a2420k12833A15177K60684A06284f9668B02320C3503
$$ 19159 163166 223856 -12420 -225253 115177 375861 106284 -69668 202320 33503
12934C0522K7171K50992g1609L1118E5666Q6328b17884h4174K888A32740E2372
$$ 30522 57693 308685 -71609 -40491 55666 141994 -217884 -84174 -81286 132740 52372
12922B99380a2940B4663H338J2955J70433B6581N9374R6098m9644J76828b27952
$$ 299380 -12940 24663 8338 21293 191726 26581 85955 182053 132409 309237 -227952
12910C63280r5771b07710c6493a2264A17317E810j936K33817L5049n0021e5186
$$ 363280 267509 -207710 -36493 -12264 117317 5810 3874 237691 272740 222719 -55186
12898A48852N9449b08188B02671J93518c1093A80400P0609g6373G128Q4277Q6882
$$ 148852 208301 -208188 202671 396189 -31093 180400 251009 -76373 7128 91405 178287
12887A78287A664c2286A15316h1666D08750i1897A93928l1044g7204r811K7281
$$ 178287 1664 -32286 115316 -81666 408750 -91897 193928 162884 -77204 -87015 -59734
12876e9734H2595J43910E5413P9648b59972D30084k08010A00378f8427j08632
$$ -59734 82595 226505 55413 135061 -259972 430084 222074 100378 -68427 -177059
12866a77059D1445a276j35674F1958a95145B37786c7600j63647K4016e4789o1349
$$ -177059 41445 -1276 -136950 61958 -195145 237786 -37600 -201247 -177231 -54789 -116138
12855a16138I5453J58280e23B0560f1706o1782k9778L9316A86912a07963H0094
$$ -116138 95453 253733 -523 20560 -61706 -123488 -153266 -113950 186912 -107963 80094
12843F1873N5604O7050f1671j68440A65125m9792J50245A3282a58669k9955A719
$$ 61873 117477 184527 -61671 -230111 165125 115333 265578 13282 -158669 -188624 1719
12831B78222r1322j9278b25233A47364J181L749J8965j9287a60226p2179D6656
$$ 278222 186900 167622 -225233 147364 148545 152294 171259 151972 -160226 -232405 46656
12819E3124J24051Q3789c7637D24451B2068K85399a04112A81998h1990D06908
$$ 53124 177175 260964 -37637 424451 22068 307467 -104112 181998 -81990 406908
12808F5734J43915a7841k75507E11055b30519J12113I7591a11458q2006l1187
$$ 65734 209649 -17841 -293348 511055 -230519 -118406 97591 -111458 -193464 -224651
12798b24651B1167a21477J2938l2841R661C13317R490d7343k41452B34329l2980
$$ -224651 21167 -121477 -108539 -141380 -131719 313317 322807 -47343 -288795 234329 201349
12787B01349k7510f0613h710A80624J0435H8914b5512k2150A30181f8288A0410
$$ 201349 173839 -60613 -8710 180624 191059 88914 -25512 -47662 130181 -68288 10410
12775G8140k1869R1537K62712b9899l1745j67482e3156B92656j37312a80967j19151
$$ 78140 56271 147808 410520 -29899 -61644 -229126 -53156 292656 155344 -180967 -300118
12764c00118B45254q9553a19613A22242Q8280e3774k51858a5501j65794e4962
$$ -300118 245254 155701 -119613 122242 210522 -53774 -305632 -15501 -181295 -54962
12753a58774r5329A59065Q6750e2603E5514J1212N8926a70944M2553a4204B44809
$$ -158774 -254103 159065 245815 -52603 55514 66726 125652 -170944 -128391 -14204 244809
12741B2158J43062H2556L053J36083a10875A94599D8872J36835F7899a7766A13291
$$ 22158 165220 82556 85609 221692 -110875 194599 48872 185707 67899 -17766 113291
12729A43481n5488b78801r0120K3747h7796K2914C61222j63321c11594A30865
$$ 143481 87993 -278801 -368921 -345174 -87796 -64882 361222 197901 -311594 130865
12718A71462G0680L01237G0541d07773J31330A522b50469e724C14999A21200J35486
$$ 171462 70680 371917 70541 -407773 -276443 1522 -250469 -5724 314999 121200 256686
12707B56686A14380e7864B74747j33265E329J85002F041K21567C4492J42734a51669
$$ 256686 114380 -57864 274747 141482 5329 190331 6041 227608 34492 177226 -151669
12695a55023A32783J38388c26108A31468J19087n7607F5792L1196g8741D91623
$$ -155023 132783 271171 -326108 131468 250555 192948 65792 96988 -78741 491623
12684H361J33526k4222J91511e4578D16791j95090a8477j3163D51354A83342A756
$$ 8361 141887 117665 309176 -54578 416791 221701 -18477 -31640 451354 183342 1756
12672D9691M10638A29121K8439a18003A34858c7082D22362c065B48820A17162
$$ 49691 460329 129121 157560 -118003 134858 -37082 422362 -3065 248820 117162
12661B99985o9214B4624J35050l1383e5170j68607A62315e1193H3153C2216h8410
$$ 299985 230771 24624 159674 128291 -55170 -223777 162315 -51193 83153 32216 -88410
12649F5614a30796A23444c20723a16717B21407a8063j40911B0785N4423K35015
$$ 65614 -130796 123444 -320723 -116717 221407 -18063 -158974 20785 75208 310223
12639C10223N080l2888A16707D5567K59418J262f095q9018B3127a69431C33911
$$ 310223 315303 282415 116707 45567 304985 306247 -6095 -95113 23127 -169431 333911
12627A50838b7676C63275O7737k07908a977B40559A13577a9742B59828I8953f2004
$$ 150838 -27676 363275 431012 223104 -1977 240559 113577 -19742 259828 98953 -62004
12615b0492k37784k0252A15226J69543A14223k6046r218l3777i2706B40698F994
$$ -20492 -258276 -278528 115226 284769 114223 88177 78959 45182 -92706 240698 6994
12603A78293R785c1411n0677E4524B6765b0685E4147B1703M68278d4606C6854
$$ 178293 188078 -31411 -82088 54524 26765 -20685 54147 21703 489981 -44606 36854
12591a6102D73604h4295A0999L9597J73324A02596j6253a3197j3990A70990o3507
$$ -16102 473604 -84295 10999 50596 223920 102596 86343 -13197 -27187 170990 107483
12580A07483a94470q4491B21299i2949J6231B52818J32689c8373A78872b78321
$$ 107483 -194470 -278961 221299 -92949 -76718 252818 385507 -38373 178872 -278321
12569a84787B20311c7546A85370o8395n936N0600b59618B62278a76717A02555
$$ -184787 220311 -37546 185370 116975 111039 161639 -259618 262278 -176717 102555
12558C3991J91844d1499j97462E2295b1981A31933a07584E2300M3001b4133j20437
$$ 33991 225835 -41499 -238961 52295 -21981 131933 -107584 52300 95301 -24133 -144570
12547a44570j4001e4772A84735C9102c12735D3836J55734i2022A00877a72979
$$ -144570 -158571 -54772 184735 39102 -312735 43836 199570 -92022 100877 -172979
12536h2333J4349B98531d44372A88304a02924L1457j31769p0438J02062A72480
$$ -82333 -67984 298531 -444372 188304 -102924 -71467 -203236 -273674 -171612 172480
12525c841B12125c2610A32661R0306a00564A39940K09496A45007d4441D10931
$$ -3841 212125 -32610 132661 222967 -100564 139940 349436 145007 -44441 410931
12514B87820f6740l9092K7282B63858i7068E3899a96036j51066a27404A0810O7966
$$ 287820 -66740 -105832 -78550 263858 -97068 53899 -196036 -347102 -127404 10810 78776
12503G8776j6170N0733g8012J1633A27393B4679Q7910J58066H8156R5400k9013
$$ 78776 62606 113339 -78012 -66379 127393 24679 112589 270655 88156 183556 154543
12492A54543g817j9880A47360j1652e7465o558k03648d1676A08102n3057N5032
$$ 154543 -7817 -27697 147360 135708 -57465 -64023 -267671 -41676 108102 55045 110077
12481A10077K4960n5728e03548D3770r210P8512J93288e0550f72j7285H276J59565
$$ 110077 135037 79309 -503548 43770 34560 113072 306360 -50550 -672 -17957 8276 167841
12469A67841b10841B7292J21771a02237a5455j06075D8080L75082a40624e6805
$$ 167841 -210841 27292 149063 -102237 -15455 -121530 48080 423162 -140624 -56805
12458B69083l8535J84837b20869g4566j76302D84641A80989c52830d0813r3667
$$ 269083 230548 415385 -220869 -74566 -250868 484641 180989 -352830 -40813 -134480
12448a34480L0013j75582E863a96587Q0901o6651I4451B646L44730C3758b13441
$$ -134480 -104467 -280049 5863 -196587 -115686 -182337 94451 2646 347376 33758 -213441
12436A19721b75145d0070A51921D5586J63708E571d9209k1116I5629C9557M28805
$$ 119721 -275145 -40070 151921 45586 209294 5571 -49209 -70325 95629 39557 468362
12425D68362c3435k74423C80665c98183A36740a16923j05047N4639B97228b06475
$$ 468362 -33435 -307858 380665 -398183 136740 -116923 -221970 -167331 297228 -206475
12414g9178F6769h6006p3642P3056j28697c7894C59392a11756c0606I8161E794
$$ -79178 66769 -86006 -159648 -86592 -215289 -37894 359392 -111756 -30606 98161 5794
12402B25673h713B86204A10521a3228l35387H1606e5420k513m1142g660j51865
$$ 225673 -8713 286204 110521 -13228 -348615 81606 -55420 -57933 -99075 -7660 -159525
12391a59525I7415D3754c55644J75158f7127j77423A42484J66329D072K5698b68467
$$ -159525 97415 43754 -355644 -180486 -67127 -244550 142484 308813 4072 29770 -268467
12379b87807b0211D05013A4658K60474B8567M43206d7629j8097k98638a07948
$$ -287807 -20211 405013 14658 275132 28567 471773 -47629 -65726 -364364 -107948
12368a46839a2635j1088B01881a37898d3094C6123a89792O082g2535r4093C2655
$$ -146839 -12635 -23723 201881 -137898 -43094 36123 -189792 -183710 -72535 -166628 32655
12356a33484E3308J13922C7704L3706N7953B9533K09625d073E1543a60896B17398
$$ -133484 53308 167230 37704 71410 129363 29533 239158 -4073 51543 -160896 217398
12344A56148k4334R4571b20294B1666a33376A41498J45790a39572C3536q46N0328
$$ 156148 131814 226385 -220294 21666 -133376 141498 287288 -139572 33536 32690 83018
12333H3018P8506o6621h1754k3928B17332F8156h0262B8571L2556Q0897l0697
$$ 83018 161524 94903 -81754 -105682 217332 68156 -80262 28571 61127 142024 111327
12322A11327a75959d6635l13549B1870b7624A3527J28532a55598j31951a15698
$$ 111327 -175959 -46635 -360184 21870 -27624 13527 142059 -155598 -287549 -115698
12311a82915C4772K94195b0364A91645o6794J62691a51742N5667J0751a7137j97735
$$ -182915 34772 328967 -20364 191645 124851 287542 -151742 -96075 -85324 -17137 -214872
12300b14872I9146B2450J48229p9725a39769j08952B57849j27765J67070r6794
$$ -214872 99146 22450 170679 90954 -139769 -248721 257849 130084 297154 200360
12290B00360O2612b3551j61244E01915b7907A04007b1863C88550h1813A41787
$$ 200360 262972 -23551 -184795 501915 -27907 104007 -21863 388550 -81813 141787
12279G7828J38387K31680b8263C1677R1744K42J03900A06922h4680A03372J29222
$$ 77828 216215 447895 -28263 31677 123421 123663 227563 106922 -84680 103372 232594
12268B32594K5540d916B8906a02936a1402j8181B94160c69319G1706h3058D511
$$ 232594 258134 -4916 28906 -102936 -11402 -29583 294160 -369319 71706 -83058 4511
12256D6342J44243b31830P6309A29398b0748n6744J6839A11993a50406d820A0578
$$ 46342 190585 -231830 -155521 129398 -20748 -77492 -60653 111993 -150406 -4820 10578
12244h0472j30117A63580n8183J5045D9236J6398b6162A99118b7773B45653H8789
$$ -80472 -210589 163580 105397 120442 49236 65634 -26162 199118 -27773 245653 88789
12232d7509K1604o1901F1813J38250n655k3646p0449J69433j28007M0620o0974
$$ -47509 -25905 -87806 61813 200063 194408 170762 100313 269746 141739 182359 121385
12221A21385k0886M74706k14899a49688L7397M5927A42576j8943A5629M24053
$$ 121385 100499 575205 360306 -149688 -112291 -66364 142576 123633 15629 439682
12211D39682A58919e0838A10009a63326b8925A63257g9659A11769K3835j1865
$$ 439682 158919 -50838 110009 -163326 -28925 163257 -79659 111769 135604 123739
12201A23739L0833J78707h795D498M83840B14155p9037i3786A12403j1402c5380
$$ 123739 154572 333279 -8795 4498 488338 214155 135118 -93786 112403 101001 -35380
12189a3191C15720c01994j3799H3118P767K6673c153D45309E3540i4776B38418
$$ -13191 315720 -301994 -315793 83118 90885 117558 -3153 445309 53540 -94776 238418
12177d085F9202O8336d30749A10276a2151A79861k4776M7167C1626e3902B34030
$$ -4085 69202 137538 -430749 110276 -12151 179861 155085 202252 31626 -53902 234030
12165a71288B97066G0734J08098M0052h8193A00546K40234A37615D6389M13590
$$ -171288 297066 70734 178832 218884 -88193 100546 340780 137615 46389 459979
12155D59979k12179I6700L6668R2336c5502C17277c59286J73700B65773a06465
$$ 459979 247800 96700 133368 225704 -35502 317277 -359286 -185586 265773 -106465
12144B33659a81184a1023H0330J9865a85791D6089J8041P1813K4729A9642J28911
$$ 233659 -181184 -11023 80330 100195 -185791 46089 64130 135943 160672 19642 148553
12133A48553J51443E805J03696B747J66937J69887A41696f5823j25676B11594
$$ 148553 299996 5805 109501 2747 169684 339571 141696 -65823 -191499 211594
12122B27169o2464b53285D83067G1807M8766b53822a4921C7929J4012J63587g3943
$$ 227169 164705 -253285 483067 71807 120573 -253822 -14921 37929 51941 215528 -73943
12110A81460a71997C27859b4099A36258c5193B08029q9825a27713A04548f3424
$$ 181460 -171997 327859 -24099 136258 -35193 208029 118204 -127713 104548 -63424
12099C70a07881I9978b4822m6911k6891c6518B0805c50092a15686k05569e8435
$$ 370 -107881 99978 -24822 -71733 -98624 -36518 20805 -350092 -115686 -321255 -58435
12087A26087k3484h9459M0783D17626i3251F2977k5346a21541D62443e7406B22301
$$ 126087 102603 -89459 -48676 417626 -93251 62977 37631 -121541 462443 -57406 222301
12075g026A95430a05991F05463O73035L77762B75648A33865B4338K29388k8413
$$ -7026 195430 -105991 605463 1278498 1656260 275648 133865 24338 253726 225313
12065B25313a2656A31217m1208E702a28764B888g5601B6125k494b0298l7790B06088
$$ 225313 -12656 131217 90009 5702 -128764 2888 -75601 26125 23631 -20298 -58088 206088
12052C57630a41044l6732p4293e2799H7493c77550B4556a92416O1184m2311a1601
$$ 357630 -141044 -177776 -252069 -52799 87493 -377550 24556 -192416 -131232 -173543 -11601
12040d14987A97890c86195C6104e0729o5027A37799l7868a10413j79140J12808
$$ -414987 197890 -386195 36104 -50729 -115756 137799 99931 -110413 -289553 -176745
12030a76745g0195A84126c33122H220J42157g1972F7337r316a9197A48892K3459
$$ -176745 -70195 184126 -333122 8220 150377 -71972 67337 58021 -19197 148892 172351
12019A72351Q2890A02754P5415i1051l8711C00754H2109c70133A6722J19963k182
$$ 172351 255241 102754 178169 -91051 -129762 300754 82109 -370133 16722 136685 134503
12008A34503f6950k13007a25934L721D8879a12928k13634f899A78454D8179a72903
$$ 134503 -66950 -279957 -125934 -122213 48879 -112928 -326562 -6899 178454 48179 -172903
11996c45586h0506A83005o2614G743N9222N2385a0540E5535K3907b3195N557B10745
$$ -345586 -80506 183005 120391 7743 66965 119350 -10540 55535 79442 -23195 -17638 210745
11983b08920b3245n8101C76691e6456o2536b1519H9061a44703B48236j13536e6974
$$ -208920 -23245 -81346 376691 -56456 -118992 -21519 89061 -144703 248236 134700 -56974
11971b72936A7402K07455A3043c16929D1162i8630o7363P4834B76489j10866b4816
$$ -272936 17402 224857 13043 -316929 41162 -98630 -165993 -91159 276489 165623 -24816
11959e3557A48229L66054d736p0773j11704m739j23551A28963c52476a09192A22575
$$ -53557 148229 514283 -4736 -75509 -187213 -191952 -315503 128963 -352476 -109192 122575
11947H7507f4003A8044b28212g6901L1530D8219J84319o3413b07663A56503c28089
$$ 87507 -64003 18044 -228212 -76901 -45371 48219 232538 169125 -207663 156503 -328089
11935A05814b77412D6273a65079f3907k3085B13656G7303K3520K4804C0658a56506
$$ 105814 -277412 46273 -165079 -63907 -86992 213656 77303 100823 125627 30658 -156506
11923a05024j13693l5473J7173P8700j45690A28645g0713F4017L0850b77067C4069
$$ -105024 -218717 -254190 -237017 -158317 -304007 128645 -70713 64017 94867 -277067 34069
11911B21137G2826c24412a21488C3825c4689E8753e45966a32815H0657b7446j22040
$$ 221137 72826 -324412 -121488 33825 -34689 58753 -545966 -132815 80657 -27446 -149486
11900a49486j23115I0456i6064A59741F973P7599i4884F36R7607a23649m90964
$$ -149486 -272601 90456 -96064 159741 6973 84572 -94884 636 98243 -123649 -614613
11889f14613a82047D420a73261d0232k31859A82644B5596J84581r5402f6808L1754
$$ -614613 -182047 4420 -173261 -40232 -272091 182644 25596 210177 114775 -66808 -35054
11878c5054A09864R7687c54044a18283a6540B8486b6565m4273C68415B2667b33134
$$ -35054 109864 207551 -354044 -118283 -16540 28486 -26565 -70838 368415 22667 -233134
11866A38028F7612d1912E9390J43538h0936C5996J45840a63615F3788c85025E6316
$$ 138028 67612 -41912 59390 202928 -80936 35996 181836 -163615 63788 -385025 56316
11854G1433f9962r6433H7947L8376a54231A29769D1519K4839N9101i6033A75802
$$ 71433 -69962 -166395 87947 126323 -154231 129769 41519 66358 125459 -96033 175802
11842A21408a29532D7258b11796b4968A03914b91007a32141F0094c04463n6195
$$ 121408 -129532 47258 -211796 -24968 103914 -291007 -132141 60094 -304463 -360658
11832c60658h0186A69798c7513o1372A87823k2818f3177j17307d2998q3948O2278
$$ -360658 -80186 169798 -37513 -98885 187823 165005 -63177 -180484 -42998 -126946 -64668
11821f4668k25725I0306M6860b45135B06039a71133m3020Q4505r9690J04610n505
$$ -64668 -290393 90306 137166 -245135 206039 -171133 -214153 -129648 -229338 -124728 -130233
11810a30233l8692A3918b8383H2327a69847h4233A11850P6689q4015g6343o3567
$$ -130233 -168925 13918 -28383 82327 -169847 -84233 111850 188539 104524 -76343 -139910
11799a39910q1092j29343i4922A46158B5602M2315i7409m0531r8008G9748a36786
$$ -139910 -221002 -350345 -94922 146158 25602 67917 -97409 -137940 -235948 79748 -136786
11787H9116b45134A44706a60231B40654A04280K34483q94H1993J90626h5781j7944
$$ 89116 -245134 144706 -160231 240654 104280 338763 337869 81993 272619 -85781 -103725
11776a03725j96324R986r8080A33936J12432a38592C4740j5508J53229a45051
$$ -103725 -300049 -290063 -388143 133936 246368 -138592 34740 19232 172461 -145051
11765H9280m1438c479A23794a13086k976a1230E6986j5716a15181H8531O9482
$$ 89280 47842 -3479 123794 -113086 -116062 -11230 56986 41270 -115181 88531 158013
11754A58013n2679c86927e8619l7339A03481f8604A26846a25138k17781E2634
$$ 158013 105334 -386927 -58619 -95958 103481 -68604 126846 -125138 -342919 52634
11743B3811J75862J4956o2290J9494F3845a24141A51483a06442D1155P7363a91029
$$ 23811 199673 214629 152339 171833 63845 -124141 151483 -106442 41155 118518 -191029
11731a19493K2819D4699J46005g2492b5634k64425E6999b37307b4073p1654E8912
$$ -119493 -96674 44699 190704 -72492 -25634 -290059 56999 -237307 -24073 -95727 58912
11719B15288I1583b66402a27246B5357a63234B4802R5549J03471n3868i9706o6965
$$ 215288 91583 -266402 -127246 25357 -163234 24802 120351 223822 169954 -99706 -166671
11708a66671A14363c4605F2904b60057D2652J02645e9046B91096e3160A91034
$$ -166671 114363 -34605 62904 -260057 42652 145297 -59046 291096 -53160 191034
11697A47013b45282A91521F3161d6867A24814c54023R4227e0786j63042D10726
$$ 147013 -245282 191521 63161 -46867 124814 -354023 -259796 -50786 -213828 410726
11686G6055l7055G686K96984i8816A39885E0664B0919b8540r0483j08766P1881
$$ 76055 39000 7686 304670 -98816 139885 50664 20919 -28540 -119023 -227789 -155908
11675a55908B86431o7380b9081D33085j86633F0558j263M4635N6111A5669b13077
$$ -155908 286431 219051 -29081 433085 246452 60558 59295 103930 160041 15669 -213077
11663d2768j0083B61378A21567D4255j6764K32261J29068F5883Q3990a18348j45365
$$ -42768 -52851 261378 121567 44255 27491 259752 388820 65883 149873 -118348 -263713
11652b63713b1807F5750J32164A4130Q2981b49620A53271a60071A34883a86737
$$ -263713 -21807 65750 197914 14130 97111 -249620 153271 -160071 134883 -186737
11641B64265H0443a02072B26157a3112B47609b23774A32955M3795Q3713h8192
$$ 264265 80443 -102072 226157 -13112 247609 -223774 132955 176750 260463 -88192
11630e3276r3019C45189j6528e3349i812B38399m4468q3372L23011j19980r7400
$$ -53276 -146295 345189 328661 -53349 -9812 238399 193931 110559 433570 313590 216190
11619B16190D0625K75322a44658j06727F9599d7274j19116g4034j2115A75397
$$ 216190 40625 315947 -144658 -251385 69599 -47274 -166390 -74034 -86149 175397
11608b0175k11613C7595P0670M26048a24609B25797a69620C38332p7498h2836
$$ -20175 -231788 37595 108265 534313 -124609 225797 -169620 338332 260834 -82836
11597C67144a7128B53184m9123b77793C2700h286j90713j96401J37397B08016
$$ 367144 -17128 253184 204061 -277793 32700 -8286 -198999 -395400 -258003 208016
11586A86335o8797L2015J2929g8498L4951C1027J19458c3132m35375B61231k080
$$ 186335 117538 149553 162482 -78498 -43547 31027 150485 -33132 -468507 261231 259151
11575B59151F5816a50032O2396K4909B86550a9825o6972l0517a0633B81166m4891
$$ 259151 65816 -150032 -87636 -62727 286550 -19825 -86797 -117314 -10633 281166 236275
11564B36275m0028Q6525K9991H9065d2192C6314J08349d3430k52057f8914j54914
$$ 236275 196247 282772 312763 89065 -42192 36314 144663 -43430 -295487 -68914 -223828
11553b23828A82568a02213A87040K33431A32081b02461l0986c2443B24284j06612
$$ -223828 182568 -102213 187040 420471 132081 -202461 -233447 -32443 224284 117672
11543A17672l370R5674b04490e6787A40281N5362a41380A16950J31208A23138
$$ 117672 114302 209976 -204490 -56787 140281 195643 -141380 116950 248158 123138
11532B30616a82867D93290A64500J50731a55316A37748d0628A83583D9733J34771
$$ 230616 -182867 493290 164500 315231 -155316 137748 -40628 183583 49733 184504
11522A84504k2033H136J13682C9977L92743g3154B89551J84319j64986C2274J25767
$$ 184504 162471 8136 121818 39977 432720 -73154 289551 473870 308884 32274 158041
11511A58041E6036P012K78261e1616B8127f0000C32689c2847B9208M02553j48240
$$ 158041 56036 63048 341309 -51616 28127 -60000 332689 -32847 29208 431761 283521
11500B83521J70910A86408C5257b8418G1680d9320A63642J55709C3321a7575C00441
$$ 283521 454431 186408 35257 -28418 71680 -49320 163642 319351 33321 -17575 300441
11488B09653a11530D43380B7595d2775e501j3231D3476c6127G8618a86035A34148
$$ 209653 -111530 443380 27595 -42775 -5501 -18732 43476 -36127 78618 -186035 134148
11476B41145l6447a83406C51875A65503l5520b32744C27684j33095f1538K8151
$$ 241145 204698 -183406 351875 165503 129983 -232744 327684 194589 -61538 -33387
11466c3387j02944O5575C26194a11470k957C66469j78454N716J48443N4818j52160
$$ -33387 -136331 -70756 326194 -111470 -114427 366469 188015 193731 342174 396992 244832
11455B44832O1309g1294B18581H0100k8467Q4248C1433K87437b33483A07210K15871
$$ 244832 306141 -71294 218581 80100 51633 135881 31433 318870 -233483 107210 323081
11444C23081C8732Q012J25575K30652j99387G2513J27602b453H9660B093b94473
$$ 323081 38732 46744 172319 402971 203584 72513 200115 -2453 89660 2093 -294473
11432A00942i3428A29987D8274i6392E3553J60768a00199A84754J22580j44923
$$ 100942 -93428 129987 48274 -96392 53553 214321 -100199 184754 307334 162411
11422A62411c8678A39032a05586j36668J8281f751B57367D1194N7116J5952m3602
$$ 162411 -38678 139032 -105586 -242254 -223973 -6751 257367 41194 98310 114262 70660
11411G0660b3124n7448L3321p1608A06367a8281j19505K0111A84621a55586A02151
$$ 70660 -23124 -80572 -47251 -118859 106367 -18281 -137786 -117675 184621 -155586 102151
11399B4957N6581a5584B05513K61147I9168C512c877I5319a44199a376A74162
$$ 24957 81538 -15584 205513 466660 99168 3512 -3877 95319 -144199 -1376 174162
11387a36816A30160h2953b1146A93684r46D2521J47844c54359B52077a20660B15237
$$ -136816 130160 -82953 -21146 193684 192738 42521 190365 -354359 252077 -120660 215237
11375B0079d391k06108a05024B62604r7109a2091E7762d390q4491D7418b89137
$$ 20079 -4391 -210499 -105024 262604 165495 -12091 57762 -4390 -88881 47418 -289137
11363b10728c8349k45154A74859F4330J153a21050H2753A020J2301J64491a73687
$$ -210728 -38349 -283503 174859 64330 65483 -121050 82753 1020 13321 177812 -173687
11351e6933P63a137k02268l40526C802O6500c8475I5812c81482a965A35463k9862
$$ -56933 -56170 -1137 -203405 -543931 3802 70302 -38475 95812 -381482 -1965 135463 105601
11339A05601a04050l5916j10923a07402A38422J14712c84634a24431e4772o0640
$$ 105601 -104050 -139966 -250889 -107402 138422 253134 -384634 -124431 -54772 -115412
11329a15412o1486f861k59175b2108A51728N7924h8942p7184J3508l1634N5088
$$ -115412 -176898 -6861 -266036 -22108 151728 209652 -88942 -166126 -152618 -184252 -129164
11318a29164d6781A77768c3503B35325i5334l1924A44714J67129A02964c10569
$$ -129164 -46781 177768 -33503 235325 -95334 -127258 144714 311843 102964 -310569
11307D4857L9020J31113N6528D3293L9309h7903j06175q2773P4211L7289A2336
$$ 44857 83877 214990 271518 43293 82602 -87903 -194078 -276851 -202640 -165351 12336
11295a88848f2502k22972a1272k78921f9327C86087F9545L2886b05212a01867
$$ -188848 -62502 -285474 -11272 -290193 -69327 386087 69545 102431 -205212 -101867
11284A46719f2305j52914B71483a13470A88638a49075A29068L12840G7651a59284
$$ 146719 -62305 -215219 271483 -113470 188638 -149075 129068 441908 77651 -159284
11273d74606B66438e1141k303a3771l50575A945K67143A27546K7471b5123j6920
$$ -474606 266438 -51141 -53444 -13771 -364346 1945 269088 127546 155017 -25123 -42043
11262d2043B12661a27315k59713I3062c3057B23392d0044C01045j37762c58222
$$ -42043 212661 -127315 -387028 93062 -33057 223392 -40044 301045 163283 -358222
11251D9496A5156O3463J48328Q9790a71874P7717A57919C1953h9060j1443C03727
$$ 49496 15156 78619 226947 316737 -171874 -94157 157919 31953 -89060 -100503 303727
11239e1837j85627f5170A57900m6270A2616i3119M4340A89283k1221b81027H2222
$$ -51837 -237464 -65170 157900 111630 12616 -93119 -48779 189283 168062 -281027 82222
11227a06115j8568e3650k30912J12793C5228a57488J3976A65680a9596j96610
$$ -106115 -124683 -53650 -284562 -171769 35228 -157488 -143512 165680 -19596 -216206
11217b16206j42618M8249g890j5600C7294b39299M8474d1358p5508j94922a4346
$$ -216206 -358824 -310575 -7890 -23490 37294 -239299 -190825 -41358 -116866 -311788 -14346
11205A07712J4424d4416j62961J00665I3919D0150h4428B63665C2162c76623c9830
$$ 107712 122136 -44416 -207377 -106712 93919 40150 -84428 263665 32162 -376623 -39830
11193B4016a06034F7335K75428c8034q4882n8816A17854c2690A26352d45720P3473
$$ 24016 -106034 67335 342763 -38034 -122916 -181732 117854 -32690 126352 -445720 -372247
11182c72247B95767g5160j09689p5887A4645e0713r9703c5689A62163b10805L126
$$ -372247 295767 -75160 -184849 -260736 14645 -50713 -150416 -35689 162163 -210805 -207679
11171b07679d3099A65744l2314i8155A70331a13971B09476A425P3500a81746h0714
$$ -207679 -43099 165744 133430 -98155 170331 -113971 209476 1425 74925 -181746 -80714
11159A42243a3753r6310E2041J76948h6929a5445k04745q0649B6697h4282J8777
$$ 142243 -13753 -110063 52041 228989 -86929 -15445 -220190 -300839 26697 -84282 -65505
11148f5505j91706G8634h5308j40383A04697a02500P462A86563E0344N7321h1603
$$ -65505 -257211 78634 -85308 -225691 104697 -102500 -95038 186563 50344 107665 -81603
11136C53621a38648N8698A30755J7493c5310f934n3416B28037A02481j1257j2338
$$ 353621 -138648 -79950 130755 148248 -35310 -6934 -60350 228037 102481 91224 78886
11125G8886K88187A15118e9299q8436C5394N4167J90576h6982A7905h2500A8212
$$ 78886 367073 115118 -59299 -147735 35394 89561 280137 -86982 17905 -82500 18212
11113a26598I0303J60080A6830K207J08290K75882a6165l8750E7274J20902L2527
$$ -126598 90303 250383 16830 19037 127327 403209 -16165 -54915 57274 178176 210703
11102B10703c6108g277D2587L28789m1790c5051C03213f9107p5B22071h311D96574
$$ 210703 -36108 -7277 42587 371376 329586 -35051 303213 -69107 -69182 222071 -8311 496574
11089G9605M01799b1725H5581B0284J20572L09597A10231r064J4533C1444J96111
$$ 79605 481404 -21725 85581 20284 140856 450453 110231 101167 115700 31444 227555
11078B27555j12546L3359K87006j37209l539m0257m3262Q2327F8682K55296j32564
$$ 227555 115009 148368 435374 298165 294626 254369 211107 293434 68682 323978 191414
11067A91414L19937A45276M47154k73189L08582j00608j99589L18609L4043N855
$$ 191414 511351 145276 592430 319241 627823 527215 327626 646235 680278 686133
11057F86133L7391k09952K5138k8434R898l9743K39792j75701K12552J58450k93664
$$ 686133 723524 513572 538710 510276 520174 480431 720223 544522 757074 915524 621860
11046F21860j48948J7442J22619J43017J33997j22084l07597K18353n6488M45489
$$ 621860 472912 490354 612973 755990 889987 767903 460306 678659 622171 1067660
11036A067660E05550n9959l4374K19981K50880j74497M4779q2915O8680K29870
$$ 1067660 505550 445591 411217 631198 882078 707581 752360 669445 738125 967995
11026I67995j98859j75790J90763j63401J0085J20290J19346m09026K10520N1131
$$ 967995 769136 593346 784109 620708 630793 751083 870429 461403 671923 723054
11016G23054l10071J53971j3362J34268k80534P0767k0190K5200m7942j11994
$$ 723054 412983 566954 553592 687860 407326 478093 457903 483103 435161 323167
11006C23167N31683m6161j24279K46875l04757J46493l60199N98015E00808p4898
$$ 323167 854850 808689 684410 931285 626528 773021 412822 1010837 500808 425910
10996D25910m5042L93859k69029K06022j55653K0870L70338O3552j91405j81851
$$ 425910 380868 774727 505698 711720 556067 576937 947275 1010827 819422 637571
10986F37571J62301K82909J77678m76579M32422j1986J89503j65144K82598j16115
$$ 637571 799872 1082781 1260459 783880 1216302 1204316 1393819 1228675 1511273 1395158
10976A395158N67787j09289N18578M13222k93785M93716m10545j82720J56887
$$ 1395158 1962945 1853656 2372234 2785456 2491671 2985387 2574842 2392122 2549009
10967B549009n65296l51523M48369m86371k661n7494j14484L10651k01220r4755
$$ 2549009 1983713 1632190 2080559 1594188 1591527 1534033 1419549 1730200 1528980 1434225
10957A434225J60612K21185j73847j77535j48384l15661j92964r6202B45077j09910
$$ 1434225 1594837 1816022 1642175 1464640 1316256 1000595 807631 711429 245077 135167
10947A35167L52546O6056j72868j62539G5819f4677D79281a53166G573N3393J1349
$$ 135167 487713 553769 380901 218362 75819 -64677 479281 -153166 7573 60966 72315
10936G2315K7392L59718k0981C6632a41657E21691k13731F3423j2463c4119B96727
$$ 72315 99707 459425 438444 36632 -141657 521691 307960 63423 50960 -34119 296727
10924A50741J96015B1245J20813O2075F1586L61194a16638M9668A66417E2048
$$ 150741 346756 21245 142058 204133 61586 422780 -116638 -66970 166417 52048
10913c2732A03426a13474K7301q2095J273d1147B0150a43648B9428J9904l983
$$ -32732 103426 -113474 -86173 -168268 -166995 -41147 20150 -143648 29428 49332 45349
10902D5349a68233C73856e1389q687A20074E2602L20371I3628A0584b15112I6129
$$ 45349 -168233 373856 -51389 -60076 120074 52602 372973 93628 10584 -215112 96129
10890A31760D1913J51438p2190D6849c03971B2241e6788j17265L2146A2277b36774
$$ 131760 41913 193351 121161 46849 -303971 22241 -56788 -174053 -141907 12277 -236774
10878A05005j6220a82825Q6945I6006b38677O1059d825k6434A5457a1687j87947
$$ 105005 88785 -182825 -95880 96006 -238677 -177618 -4825 -31259 15457 -11687 -199634
10867a99634j22730D4121a93143N9128B57748e0028B12693C4956a82632c7757
$$ -199634 -322364 44121 -193143 -134015 257748 -50028 212693 34956 -182632 -37757
10856D7937a92694c3780B1962C359a52151K1002j98631a52546I2038b22845A07586
$$ 47937 -192694 -33780 21962 3359 -152151 -131149 -329780 -152546 92038 -222845 107586
10844H0286a87844j00772A30191b89060B4090i211n9394j32764B0530b06239N1268
$$ 80286 -187844 -288616 130191 -289060 24090 -9211 -68605 -201369 20530 -206239 -154971
10833a54971B81565j03912J17253J24199H4497J62038B284K99713q7248b8622
$$ -154971 281565 177653 294906 419105 84497 246535 2284 301997 214749 -28622
10822e065B9280b69477a26961A10115a0661B80866B6506K8469h1094A05808j9721
$$ -5065 29280 -269477 -126961 110115 -10661 280866 26506 54975 -81094 105808 86087
10811H6087J13453a12352c5189A67499A1143b05833B57740B4972a37310l8597
$$ 86087 199540 -112352 -35189 167499 11143 -205833 257740 24972 -137310 -175907
10801a75907H2438m1188K49589A03339N5726p3766P894b58291d2272k57632Q6144
$$ -175907 82438 41250 290839 103339 159065 85299 93193 -258291 -42272 -299904 -213760
10790b13760A88876b31900o0673A65308L3684a79801A7052J96061f8491A73916
$$ -213760 188876 -231900 -292573 165308 198992 -179801 17052 213113 -68491 173916
10779g9246A64035D5396J68466K8591D9460a06120A90550n5929f505B32600j00838
$$ -79246 164035 45396 213862 242453 49460 -106120 190550 134621 -6505 232600 131762
10768A31762J4266a88807h5306l6745j86461B84661g4219j9636E8069L6019B8508
$$ 131762 146028 -188807 -85306 -122051 -308512 284661 -74219 -93855 58069 94088 28508
10756b45612k7079I1736b847j26366n3901A08595c46186a7709B6228K60311b18307
$$ -245612 -272691 91736 -2847 -129213 -183114 108595 -346186 -17709 26228 286539 -218307
10744B08321p6401Q1400a65809p5291R3314m5232A59395f528j96425k3175b0917
$$ 208321 131920 213320 -165809 -241100 -147786 -193018 159395 -6528 -202953 -226128 -20917
10732B0583O4408i6066b9250j2174B13209A00344b92046J38572K2272L8252A177
$$ 20583 84991 -96066 -29250 -41424 213209 100344 -292046 -153474 -131202 -92950 1177
10720B19728b05372A9275J99710a11963A39980d7991A7742a06589M0765j28673
$$ 219728 -205372 19275 218985 -111963 139980 -47991 17742 -106589 -65824 -194497
10710a94497A10968a17458B2745c09536D3624e6955D6910a8713A14164b00992
$$ -194497 110968 -117458 22745 -309536 43624 -56955 46910 -18713 114164 -200992
10699b78737A13869a02925p6373b7672j67128g0000r2445N5565d7975k31810a0172
$$ -278737 113869 -102925 -179298 -27672 -194800 -70000 -162445 -106880 -47975 -279785 -10172
10687A78245H2216c30744j21023g1063j33883H8594b79400i8920j07796o1303
$$ 178245 82216 -330744 -451767 -71063 -204946 88594 -279400 -98920 -206716 -268019
10677b68019A92824F8134J53351b70382J6909e0986B43638a80094J4901F5726
$$ -268019 192824 68134 221485 -270382 -253473 -50986 243638 -180094 -165193 65726
10666H6393Q1711j6553a68242A63124g5885r5388A58188k3509B493a11211k0515
$$ 86393 168104 151551 -168242 163124 -75885 -171273 158188 134679 2493 -111211 -131726
10655a31726d2608j39264C2131a50275j7665j6327C10389h1141j20299m9744B35733
$$ -131726 -42608 -181872 32131 -150275 -167940 -184267 310389 -81141 -201440 -251184 235733
10643a28676K5781b7920A78374a22657l0715f7886k89554C18982a51896j45675
$$ -128676 -102895 -27920 178374 -122657 -153372 -67886 -357440 318982 -151896 -297571
10633b97571j7728D8477i2933C5557d0853b761B92498A12199b08354d0766j43134
$$ -297571 -315299 48477 -92933 35557 -40853 -2761 292498 112199 -208354 -40766 -183900
10622a83900A18562O8291h1063j03029j6384A7500h1156B48835a09272c9768J6446
$$ -183900 118562 186853 -81063 -184092 -200476 17500 -81156 248835 -109272 -39768 -23322
10611b3322F0319b4425j66640e9986A569a30736D588J12699c02264C1184K43640
$$ -23322 60319 -24425 -191065 -59986 1569 -130736 4588 117287 -302264 31184 274824
10600B74824b76149k7360Q5365J07881j35245C6484N2072f2646L368j2836A10612
$$ 274824 -276149 -303509 -218144 -110263 -245508 36484 88556 -62646 -59278 -72114 110612
10588c22246p4880J45521E3927b59730f0545k53243a48172j34638g2702B17373
$$ -322246 -397126 -251605 53927 -259730 -60545 -313788 -148172 -282810 -72702 217373
10577a94494B09975I9266a90320I855K31443L6726a34221k10408J45430L6920
$$ -194494 209975 99266 -190320 9855 241298 278024 -134221 -344629 -199199 -162279
10567a62279F7037a33074k17677e8383A77097p5631a82689Q1234C584K29396A08880
$$ -162279 67037 -133074 -350751 -58383 177097 101466 -182689 -101455 3584 232980 108880
10555a25173A7913c43431F401a04288l3735A44086E7846h6153j28961j5046a09569
$$ -125173 17913 -343431 6401 -104288 -138023 144086 57846 -86153 -215114 -230160 -109569
10543G8936J18087a22426F7898f8569j03348A072g8281C13984b41726B17973k024
$$ 78936 197023 -122426 67898 -68569 -171917 1072 -78281 313984 -241726 217973 215949
10532B15949d8551j477q9214c9277j54143B93283a32805D956P3995a39688B15949
$$ 215949 -48551 -50028 -139242 -39277 -193420 293283 -132805 4956 78951 -139688 215949
10520B72288I9814b33939Q2400G151a76533B73472b32008b1365k57525D2224R9824
$$ 272288 99814 -233939 -151539 7151 -176533 273472 -232008 -21365 -278890 42224 142048
10509A42048J5677d37911B1363K12748J07441B0347e6531j41755B23703r56i5073
$$ 142048 157725 -437911 21363 234111 341552 20347 -56531 -198286 223703 222747 -95073
10497C1515a4558A90227b0925B21087a37727b7320j11216n1658D219b25209O6697
$$ 31515 -14558 190227 -20925 221087 -137727 -27320 -138536 -190194 4219 -225209 -158512
10486a58512G0279K66783a6214D3445L01457M016P5977q8295J94477c51540E2663
$$ -158512 70279 337062 -16214 43445 344902 348918 424895 336600 531077 -351540 52663
10474G150Q0199L5946f7377e550A46395c3673r5598L2828B48586F0305c35827
$$ 7150 87349 123295 -67377 -5550 146395 -33673 -129271 -96443 248586 60305 -335827
10462A0587Q1677b77978A88790b09912A56922l7112b33109I6910R3333h3331K579
$$ 10587 92264 -277978 188790 -209912 156922 119810 -233109 96910 190243 -83331 -80752
10451h0752A59367b36676D5693b43109A62183b89091B74453b00863f7566F200
$$ -80752 159367 -236676 45693 -243109 162183 -289091 274453 -200863 -67566 6200
10440b49121a4341o7449L9425C5454f4761k2256J2231E1674r228c78024A12970
$$ -249121 -14341 -81790 -42365 35454 -64761 -87017 -74786 51674 42446 -378024 112970
10428a69857A35685a08803c8466B30939A2826c49904C35992A21264A2402b34091
$$ -169857 135685 -108803 -38466 230939 12826 -349904 335992 121264 12402 -234091
10417e218H6912I756g5154B03129a77174k5718G5330g6298A1914b67044a20462
$$ -5218 86912 9756 -75154 203129 -177174 -202892 75330 -76298 11914 -267044 -120462
10405C56154b30775C53629A276g7729F7321b44418f9381A47313G3182d65759A68093
$$ 356154 -230775 353629 1276 -77729 67321 -244418 -69381 147313 73182 -465759 168093
10393d0963r6591B1367J15127q414C8874J32401g6835A69343a79010m4581C47692
$$ -40963 -137554 21367 136494 128080 38874 171275 -76835 169343 -179010 -223591 347692
10381a16023B0566K76629J53259a00133D59651K4455E3993K36898m9640K93975
$$ -116023 20566 297195 450454 -100133 459651 484106 53993 290891 241251 535226
10371E35226B17222J26844O05577m01178k40958M28861C24769J27762a79194i757
$$ 535226 217222 344066 949643 548465 307507 736368 324769 452531 -179194 -9757
10360C39746A27518J11852D0351O6175K17907k4180A8671L33320m1565K66419
$$ 339746 127518 239370 40351 106526 324433 300253 18671 351991 310426 576845
10350E76845k29174k3599j19486M3019K34083k19084J1264J90381A9617L03749
$$ 576845 347671 324072 204586 247605 481688 262604 273868 464249 19617 323366
10340C23366A09745K2218K5689P3988j07987f4145E66231k52422F6167J27703
$$ 323366 109745 131963 157652 231640 123653 -64145 566231 313809 66167 193870
10330A93870C098c575B34887a09866B97891i6042C25897J31437G0267J19655j7283
$$ 193870 3098 -3575 234887 -109866 297891 -96042 325897 457334 70267 189922 172639
10319A72639J3781H2826L6765P9514A1322K27976r1403m7653J83447a80172C3855
$$ 172639 186420 82826 119591 199105 11322 239298 147895 100242 283689 -180172 33855
10307A55278e6604k95345E9217b84015a06879k0667q8119E3428M2230f9401b7727
$$ 155278 -56604 -351949 59217 -284015 -106879 -127546 -215665 53428 95658 -69401 -27727
10295A08663O1291g6687j06075O7321j75364A11284b63614P0587F6470h2401F2028
$$ 108663 169954 -76687 -182762 -115441 -290805 111284 -263614 -193027 66470 -82401 62028
10283A085b26011Q7598d3442C8235c3551j00663n2854F3225k842b15668N6264
$$ 1085 -226011 -138413 -43442 38235 -33551 -134214 -187068 63225 60383 -215668 -159404
10272a59404I4747a66861p7626B75627a82492e0914j2359B08507j5011b0068A29858
$$ -159404 94747 -166861 -244487 275627 -182492 -50914 -63273 208507 193496 -20068 129858
10260C5947J88788K78926j88859B6761J62902f5207G6520B9027a21326j72418
$$ 35947 224735 503661 314802 26761 189663 -65207 76520 29027 -121326 -293744
10250b93744a08277j70840H3713C1864d6683a11j6945k48821B44984j13644j0522
$$ -293744 -108277 -279117 83713 31864 -46683 -111 -17056 -265877 244984 131340 120818
10239A20818m9313N2732d1559k5755C17332a28617B03659l4391A2382Q1823a43812
$$ 120818 71505 124237 -41559 -67314 317332 -128617 203659 169268 12382 94205 -143812
10227e7225B59450r7625a28769k1405i965A07323a01474E0703J00876b2244j52185
$$ -57225 259450 161825 -128769 -150174 -9965 107323 -101474 50703 151579 -22244 -174429
10216a74429A74131c16280N3460h6145G8176J5873a10906j76376H2203i506A75802
$$ -174429 174131 -316280 -262820 -86145 78176 94049 -110906 -287282 82203 -9506 175802
10204C16256B4947O6570a88720A67370b464k03970g1504r660A29038k9978c90856
$$ 316256 24947 91517 -188720 167370 -2464 -206434 -71504 -81164 129038 99060 -390856
10192h5176B21543g9796A02867a16453N1971A37710b86881A54948c34078E4620
$$ -85176 221543 -79796 102867 -116453 -64482 137710 -286881 154948 -334078 54620
10181c68473a37033j99432H6435B5a69634J7015j05843F7062d0738j76312J7502
$$ -368473 -137033 -336465 86435 25 -169634 -152619 -258462 67062 -40738 -217050 -199548
10170a99548G7705P4855m745a45522J0690D76165E4746a72249e939o2634C3478
$$ -199548 77705 152560 147815 -145522 -134832 476165 54746 -172249 -5939 -68573 33478
10158A28041B3322P6957a47013J0784A74762q2847c46165A15774a34590G4576
$$ 128041 23322 100279 -147013 -136229 174762 91915 -346165 115774 -134590 74576
10147e6298p5176r202K9288j19532k00191d5876j00000k698A59089b96174A81723
$$ -56298 -131474 -140676 -111388 -230920 -431111 -45876 -145876 -148574 159089 -296174 181723
10135c03866a39490A57796m5488a93273I0552f4424K4757k01448C0172L349N4561
$$ -303866 -139490 157796 112308 -193273 90552 -64424 -39667 -241115 30172 33521 88082
10124H8082b28725A03a82921B49664a72035g68B56782a70948B0946K2128K09644
$$ 88082 -228725 103 -182921 249664 -172035 -768 256782 -170948 20946 43074 252718
10113B52718n8570a85513o2218n670C9477J88068a72213e7991j8609j22035P9803
$$ 252718 194148 -185513 -247731 -253401 39477 227545 -172213 -57991 -76600 -198635 -118832
10102a18832J4676B89710a04799k25769J25418k9954F5176b48688B9930J65551
$$ -118832 -104156 289710 -104799 -330568 -205150 -235104 65176 -248688 29930 195481
10092A95481a01662M7864C3438N0095A904e68935A94679l7836c10245A68625b48952
$$ 195481 -101662 -53798 33438 83533 1904 -568935 194679 156843 -310245 168625 -248952
10080C9326c32734C9511g6394H3208c15341D360e91383B0221i8371n0637E8463
$$ 39326 -332734 39511 -76394 83208 -315341 4360 -591383 20221 -98371 -149008 58463
10068a04521G2049a151q7677b9955C5799J74275I3150Q0464a39533N595k05883
$$ -104521 72049 -1151 -88828 -29955 35799 210074 93150 173614 -139533 -133938 -339821
10057c39821b2666q072B53381C3922a27118r9570A41950E3582h605q157o73926
$$ -339821 -22666 -30738 253381 33922 -127118 -226688 141950 53582 -8605 -16762 -690688
10046f90688A36843c24916c4809m82r9131E5970J43810D530K19516b30622d2664
$$ -690688 136843 -324916 -34809 -35291 -134422 55970 199780 4530 224046 -230622 -42664
10034f2867k96257a4064j78986D219b44865M0287A14234h8976A3694J09476m5138
$$ -62867 -359124 -14064 -193050 4219 -244865 -204578 114234 -88976 13694 123170 78032
10023G8032j3404c0919j86277a02341j83721J02846L9934n7770k72755C1707b25509
$$ 78032 64628 -30919 -217196 -102341 -286062 -183216 -143282 -201052 -473807 31707 -225509
10011b57156A03372c05061D3854e852B28999b18869j3216f3109j15084j9807i1882
$$ -257156 103372 -305061 43854 -5852 228999 -218869 -232085 -63109 -178193 -198000 -91882
9999b41146r6133A61533e55558A61468a0389A34478K8994o4103O1077A3069c62019
$$ -241146 -337279 161533 -555558 161468 -10389 134478 163472 99369 160446 13069 -362019
9987D4178a39209l9819c1328A44016b69222B2870g4707k5056L9264A13914a70281
$$ 44178 -139209 -179028 -31328 144016 -269222 22870 -74707 -99763 -60499 113914 -170281
9975D3467a17001a7206l38965g4863A85161g6404A78675a78612J8786B2039c11379
$$ 43467 -117001 -17206 -356171 -74863 185161 -76404 178675 -178612 -159826 22039 -311379
9963a3051C82914c2327l6568B1560e4440A01680d4758k94811B5063c4016j93298
$$ -13051 382914 -32327 -68895 21560 -54440 101680 -44758 -339569 25063 -34016 -227314
9952b27314Q7371N4647l26537J10866j12421A37477F7373a32049a6769j19359
$$ -227314 -139943 -85296 -411833 -300967 -413388 137477 67373 -132049 -16769 -136128
9942a36128L9825F2134N1537a07659P994K489n3489d3839r0504j47730K3652H2565
$$ -136128 -96303 62134 113671 -107659 -99665 -97176 -150665 -43839 -134343 -282073 -258421 82565
9929d75871b11963a3281F6408e1243j06035K3914c0380C3808R6040a38251O012
$$ -475871 -211963 -13281 66408 -51243 -157278 -133364 -30380 33808 129848 -138251 -132239
9918a32239b4936n8525j17051g4331J1663k32388D8522L3475i6132k253j06747
$$ -132239 -24936 -83461 -200512 -74331 -62668 -295056 48522 81997 -96132 -98385 -205132
9907b05132g7935n0773k26894i113E54J78744G9148c66034a5911A76770b97806
$$ -205132 -77935 -128708 -355602 -9113 554 179298 79148 -366034 -15911 176770 -297806
9895d2228N170j75409A82176a87755g8277A00831R0085i3431o9873g1006q3867
$$ -42228 -37058 -212467 182176 -187755 -78277 100831 190916 -93431 -163304 -71006 -154873
9884a54873l02927C0826c38064F170a00038j948A53471e4704D0721A3105b03438
$$ -154873 -457800 30826 -338064 6170 -100038 -101986 153471 -54704 40721 13105 -203438
9872B33453C1813b41515A85416d4785l681K3967j2161e777k36349n3697J41162
$$ 233453 31813 -241515 185416 -44785 -48466 -24499 -36660 -5777 -242126 -295823 -154661
9861a54661j32273A00206J42113e88158b72944h7056A01871m4507a46812E6954
$$ -154661 -286934 100206 242319 -588158 -272944 -87056 101871 57364 -146812 56954
9850b90992E5861a6194k8880o2482p7034L540B07547d77105g1546j6129F8301
$$ -290992 55861 -16194 -45074 -107556 -184590 -181050 207547 -477105 -71546 -87675 68301
9838b84427L7419H5116e886j70217M4897H9980h9472k4622n816H7908J14298a75700
$$ -284427 -247008 85116 -5886 -176103 -131206 89980 -89472 -114094 -119910 87908 202206 -175700
9825F8458a15103B34419b62914M5519A75390a26292k50195A04932a22468A5824
$$ 68458 -115103 234419 -262914 -217395 175390 -126292 -376487 104932 -122468 15824
9814c1486j65847N3649A66127c49054l1029A41102c5899j72600A07627D8085a67907
$$ -31486 -197333 -143684 166127 -349054 -380083 141102 -35899 -208499 107627 48085 -167907
9802a11992j274B0308J99787d8689A18806f4581l51901J82035F9649L1982d3798
$$ -111992 -113266 20308 220095 -48689 118806 -64581 -416482 -234447 69649 101631 -43798
9790A0558a23761m6794L2301j86999a58702L7818C8181J40953a51874p5888A17664
$$ 10558 -123761 -170555 -138254 -325253 -158702 -120884 38181 179134 -151874 -227762 117664
9778d37382C12648a84131l3215l756E1870a99577j8483A50761a97481B0288f5947
$$ -437382 312648 -184131 -217346 -221102 51870 -199577 -218060 150761 -197481 20288 -65947
9766I0580b4698j91228k6264M4032C28859e9579F0325c16040B01009b20720A28979
$$ 90580 -24698 -215926 -242190 -198158 328859 -59579 60325 -316040 201009 -220720 128979
9754A4058J7826e7884j79225K8266A61135f2561J8251A15787h8050j31308g752
$$ 14058 31884 -57884 -237109 -208843 161135 -62561 -44310 115787 -88050 -219358 -7752
9742A61432e1284k15857k1773d6485J2904k35890A53021a69194f1245A16780a02076
$$ 161432 -51284 -267141 -288914 -46485 -33581 -269471 153021 -169194 -61245 116780 -102076
9730i4376A40231g3636H3583R4929H2890a47474A12256J5874a77519j38413f4050
$$ -94376 140231 -73636 83583 178512 82890 -147474 112256 128130 -177519 -315932 -64050
9718c82845A60339c08371D8134b38712B60680a7756G5507a84603A0082O2219J67727
$$ -382845 160339 -308371 48134 -238712 260680 -17756 75507 -184603 10082 72301 240028
9707B40028a51803F7944c00547a31568B71967e2719k45189h6601j81662A23685
$$ 240028 -151803 67944 -300547 -131568 271967 -52719 -297908 -86601 -268263 123685
9696a57915n8683h7998B74907b77102f7880D46d8891l40014J08500K6028C4716
$$ -157915 -216598 -87998 274907 -277102 -67880 446 -48891 -388905 -280405 -254377 34716
9684d05575G4927a7708l7274l60994I723M8407c28439f1490H553c47200R0296
$$ -405575 74927 -17708 -54982 -415976 9723 58130 -328439 -61490 8553 -347200 -256904
9673b56904A62163a61868j58126B15086a47211E5365g0099r148q0981n2287a04134
$$ -256904 162163 -161868 -319994 215086 -147211 55365 -70099 -79247 -160228 -212515 -104134
9661A17546K019i0236c7636l84679d8442D8286f1033k96450d6374D605b7516a3503
$$ 117546 119565 -90236 -37636 -422315 -48442 48286 -61033 -357483 -46374 4605 -27516 -13503
9648C4673a21193A55924D5215Q2072A0412J99736d2644j16119D5142h0797F2233
$$ 34673 -121193 155924 45215 127287 10412 210148 -42644 -158763 45142 -80797 62233
9636a09511D3596b41256Q6784J7748J9187B31608c950k17331D4055L9152R5558
$$ -109511 43596 -241256 -154472 -136724 -117537 231608 -3950 -221281 44055 83207 178765
9625A78765a34014d2886k87351A95911J41485c676j91798B1513J85786b10503
$$ 178765 -134014 -42886 -330237 195911 337396 -3676 -195474 21513 207299 -210503
9614c19122n8500A23922a87439A03288k7000h1309a7738g271A07467a81465B89381
$$ -319122 -377622 123922 -187439 103288 76288 -81309 -17738 -7271 107467 -181465 289381
9602i1602l3380H8203a64791A04986a80486k17882G5645L2591D5220g7409b8172
$$ -91602 -124982 88203 -164791 104986 -180486 -398368 75645 108236 45220 -77409 -28172
9590d37437g8548j37944j1384b0876i549m22096J44033a22060k37233g6812k83414
$$ -437437 -78548 -216492 -227876 -20876 -9549 -431645 -287612 -122060 -359293 -76812 -360226
9579c60226R0009F5334b83563A3747i3538c9897p5772j15762I5218d5045k54164
$$ -360226 -270217 65334 -283563 13747 -93538 -39897 -115669 -231431 95218 -45045 -299209
9568b99209A17211b69914F0509b06616A33733f1598b4111r4827k43259A51142
$$ -299209 117211 -269914 60509 -206616 133733 -61598 -24111 -118938 -362197 151142
9557a30699A89422b12361B50959a45514j98099B07314j1953p7877i8413j4589
$$ -130699 189422 -212361 250959 -145514 -343613 207314 195361 117484 -98413 -113002
9547a13002I675a5447A964c38697a68345j87713a42718g1175a9819B59291E3847
$$ -113002 9675 -15447 1964 -338697 -168345 -356058 -142718 -71175 -19819 259291 53847
9535a87390c7010a1288B53248b53529E1317c1704A34526a81493e6966j14468B3054
$$ -187390 -37010 -11288 253248 -253529 51317 -31704 134526 -181493 -56966 -171434 23054
9523d4046k6086L1157A58481q199a76265K749e6397j15729Q2176c2554k50051
$$ -44046 -70132 -38975 158481 150282 -176265 -173516 -56397 -172126 -89950 -32554 -282605
9512b82605A06204c7337l22438D8804a22752C36246A5285e5823k50063p447D7267
$$ -282605 106204 -37337 -359775 48804 -122752 336246 15285 -55823 -305886 -313333 47267
9500b71855e4709o4507G8916e0436n1849E5406A8628i8046B60764b79364h9741
$$ -271855 -54709 -119216 78916 -50436 -102285 55406 18628 -98046 260764 -279364 -89741
9488a16306M6058p7673j50333m135R1831R6594C76499A02903l4144a49735E2671
$$ -116306 -70248 -147921 -298254 -302389 -210558 -113964 376499 102903 68759 -149735 52671
9476b12105Q3750o4887g761j32503B05323a3995E5322h1188c8307A9273h9035
$$ -212105 -128355 -193242 -7761 -140264 205323 -13995 55322 -81188 -38307 19273 -89035
9464a18441a5988n23623a22443k65836A37262m9104a26393j12850g3492j85792
$$ -118441 -15988 -539611 -122443 -388279 137262 88158 -126393 -239243 -73492 -259284
9454b59284p2369a54302f23B55406a62682j77434g2582j38423R9773j40431b2921
$$ -259284 -331653 -154302 -623 255406 -162682 -340116 -72582 -211005 -111232 -251663 -22921
9442B10971a74571p891C18339q6209H2884f9613l82126A09035A235J20146j3623
$$ 210971 -174571 -182462 318339 232130 82884 -69613 -451739 109035 1235 121381 107758
9431A07758i2803j2856d2524A03393b8063j78015d0148e029m716j91198j31449
$$ 107758 -92803 -105659 -42524 103393 -28063 -206078 -40148 -5029 -9745 -200943 -332392
9420c32392J10520e3262E1750b92958a45468c9208r3380l9403G7781K0523O064
$$ -332392 -221872 -53262 51750 -292958 -145468 -39208 -132588 -171991 77781 98304 104368
9409A04368D9660O3866a4959r925c241j92478Q5681B7602c50737A11896O0095
$$ 104368 49660 113526 -14959 -24884 -3241 -195719 -110038 27602 -350737 111896 171991
9398A71991a55634e6887B52150A21495J01006C939i3692B0943b02175e4429A71480
$$ 171991 -155634 -56887 252150 121495 222501 3939 -93692 20943 -202175 -54429 171480
9386a53789d6697l3437A72415A6843b9410m16984R5210J35102N749A19958c89064
$$ -153789 -46697 -80134 172415 16843 -29410 -446394 -351184 -216082 -210333 119958 -389064
9374b11383h0097j41561E2988c61053A3771R7155J06122a30559a9019q908l11067
$$ -211383 -80097 -221658 52988 -361053 13771 110926 217048 -130559 -19019 -27927 -338994
9363c38994D853d62850a88654j52787a31400e3268k96823A15858a83123A00508
$$ -338994 4853 -462850 -188654 -341441 -131400 -53268 -350091 115858 -183123 100508
9352b12956g6594A0148c47247a46208o2069C486L1625c73977d4431F1238k905
$$ -212956 -76594 10148 -347247 -146208 -208277 3486 35111 -373977 -44431 61238 58333
9341E8333a0293l79161B8179c256m49832J85256A86411a66372A82756h1588B7779
$$ 58333 -10293 -389454 28179 -3256 -453088 -267832 186411 -166372 182756 -81588 27779
9329d71958b9375j20140A46284F4506J1197L2941b83455e5823k39092C60188j61655
$$ -471958 -29375 -149515 146284 64506 75703 108644 -283455 -55823 -294915 360188 198533
9318A98533a16662D333b1871C6703a9354l5119I2788c80948A5620a74558P2874
$$ 198533 -116662 4333 -21871 36703 -19354 -54473 92788 -380948 15620 -174558 -101684
9307a01684q3654G8963K36503i2990H1809d18979J80074j7359A81605a26978e6805
$$ -101684 -185338 78963 315466 -92990 81809 -418979 -238905 -256264 181605 -126978 -56805
9295b62373A0662O4034a34437N396A06594a39278L5542F0180J10680a03439a3829
$$ -262373 10662 74696 -134437 -129041 106594 -139278 -103736 60180 170860 -103439 -13829
9283e4360E3330a97778h609j01567A0060a75171f0421q6592j36568O6956B973
$$ -54360 53330 -197778 -8609 -110176 10060 -175171 -60421 -147013 -283581 -216625 2973
9271B1358K1821c68574a11453A10391K53114I4146a91432G4580a53498J4579B30274
$$ 21358 43179 -368574 -111453 110391 363505 94146 -191432 74580 -153498 -138919 230274
9259b4942A66459b86249d0923l0319A70328c30857a37760m42613A14358b23289
$$ -24942 166459 -286249 -40923 -71242 170328 -330857 -137760 -580373 114358 -223289
9248D4272a0949o2135j4292C4253j6500J73990b5590o3605I5933c86A37138h2282
$$ 44272 -10949 -73084 -87376 34253 17753 191743 -25590 -89195 95933 -386 137138 -82282
9235g9003p4003B56952c2371G7526d0385A83744b01251l5813P7205j02190N1138
$$ -79003 -153006 256952 -32371 77526 -40385 183744 -201251 -237064 -159859 -262049 -210911
9224b10911R7582n1151A1708a22048J0691k03975a27072f3058b7785l1322B5412
$$ -210911 -113329 -164480 11708 -122048 -111357 -315332 -127072 -63058 -27785 -59107 25412
9212i8850b6848k87141A54480A7650d1487m52310e1004b1471E5040a6769F4499
$$ -98850 -26848 -313989 154480 17650 -41487 -493797 -51004 -21471 55040 -16769 64499
9200A56997F0199c83861C19648D7857a88q1580n9457C60227G3329g4032k66705
$$ 156997 60199 -383861 319648 47857 -188 -81768 -141225 360227 73329 -74032 -340737
9189c40737A89379a34508j52669A17134n2541M7639a96815k7576A03930h0055
$$ -340737 189379 -134508 -287177 117134 64593 112232 -196815 -224391 103930 -80055
9178h2416q668o6653B68496h9570D2590a7822j86794b2855D1631c35041c9932
$$ -82416 -91084 -157737 268496 -89570 42590 -17822 -204616 -22855 41631 -335041 -39932
9166h0862D453b22129A88087j3790c51433I1295O061B743J78243J35838A11811
$$ -80862 4453 -222129 188087 174297 -351433 91295 97356 2743 180986 316824 111811
9154a49574L2882l65680d5250J6029l2112G3580b91826a07682n1641f4823A31192
$$ -149574 -116692 -482372 -45250 -29221 -61333 73580 -291826 -107682 -159323 -64823 131192
9142B3985M1376O3734D6672c4444A26011L36218a30593f0976j13957p2272o1156
$$ 23985 65361 129095 46672 -34444 126011 462229 -130593 -60976 -174933 -247205 -308361
9131c08361c7943F4445c57464R5438E0893a1473o6930A63109o6505a37816j51031
$$ -308361 -37943 64445 -357464 -262026 50893 -11473 -78403 163109 96604 -137816 -288847
9120b88847J34077A04686a49065F3929b20535L0138d6102C2801c50097A87447
$$ -288847 -154770 104686 -149065 63929 -220535 -190397 -46102 32801 -350097 187447
9109a25223m721o5203P2698I0637Q108g4220H3987h6898j81627A82170b9897B74977
$$ -125223 -129944 -195147 -122449 90637 98745 -74220 83987 -86898 -268525 182170 -29897 274977
9096b01001A171b18016l8550c2378o327q7981c1640j96867b2898j71212M8664
$$ -201001 1171 -218016 -256566 -32378 -38705 -126686 -31640 -228507 -22898 -194110 -145446
9085a45446k27854a52005G6570K2613i2747A17133b24492k6769g9696a2969A39301
$$ -145446 -373300 -152005 76570 99183 -92747 117133 -224492 -251261 -79696 -12969 139301
9073c27607A06218Q9430a48746B8564P3621b26993d5359k54065a27885A77883
$$ -327607 106218 195648 -148746 28564 102185 -226993 -45359 -299424 -127885 177883
9062A05196b76823A29676m7335a36589j32078A14588a11367I0658b6818k88029
$$ 105196 -276823 129676 82341 -136589 -268667 114588 -111367 90658 -26818 -314847
9052c14847B59687b96785B88661n2914r0581b027I9729A0944P1422a66544B12821
$$ -314847 259687 -296785 288661 235747 145166 -2027 99729 10944 82366 -166544 212821
9040a20705n1252m6108J2117R8129j13012a00934n5789B9055d72684a65117A57328
$$ -120705 -171957 -218065 -205948 -107819 -220831 -100934 -156723 29055 -472684 -165117 157328
9028G1525P6989D943a69975j6705Q3746q672N3876j48557N849j28234a25211A18472
$$ 71525 148514 4943 -169975 -186680 -102934 -111606 -57730 -206287 -200438 -328672 -125211 118472
9015A47289a2417G3814j5233a3145A23366c6479l247j67662O7440M4366D9820
$$ 147289 -12417 73814 58581 -13145 123366 -36479 -39726 -207388 -139948 -95582 49820
9003E274M2087e2617m0495M5337j49639A42390b13381J03755k15507a52425A08477
$$ 5274 47361 -52617 -93112 -47775 -197414 142390 -213381 -109626 -325133 -152425 108477
8991E0545L1637J79957a3418G7258k9714N7752a05899j01048n0135g2328j4345
$$ 50545 82182 262139 -13418 77258 47544 105296 -105899 -206947 -257082 -72328 -86673
8980h6673n5427c153m61932a41109A07425e6027G1784B2866K20712I0590e1005
$$ -86673 -142100 -3153 -465085 -141109 107425 -56027 71784 22866 243578 90590 -51005
8968b89397A10078E52J11463P2154h3219B81962L3894A20743c62322a4636k19228
$$ -289397 110078 552 112015 184169 -83219 281962 315856 120743 -362322 -14636 -233864
8957b33864A15496c30019D8874e8750p9510f4000B84756a7784f35j52783n4805
$$ -233864 115496 -330019 48874 -58750 -138260 -64000 284756 -17784 -635 -153418 -208223
8946b08223A70144M1285a76166j08813K4563R3991A2766J2971N0373K75455A21692
$$ -208223 170144 211429 -176166 -284979 -260416 -166425 12766 25737 76110 351565 121692
8934D39559j85642b04894L3468E0391a12580G1b13265E8729L26064Q9019Q33389
$$ 439559 253917 -204894 -171426 50391 -112580 71 -213265 58729 384793 473812 1307201
8923A307201K693708P718590k478904B337799F62200j70702Q3793B22461Q3444
$$ 1307201 4000909 11719499 9240595 2337799 662200 491498 575291 222461 305905
8914C05905p9291j10419h5293B211L530J40262b2611B34727k414M4641C600b07502
$$ 305905 226614 116195 -85293 2211 5741 146003 -22611 234727 232313 276954 3600 -207502
8901B73107f3295C2183K84907D1863K5774b64164N7360B1340R5096J37941b69762
$$ 273107 -63295 32183 317090 41863 67637 -264164 -206804 21340 116436 254377 -269762
8889a64249P2517j073r1271F34L6568e9139b8016p8892L2105p1633H7502b10391
$$ -164249 -91732 -92805 -184076 634 37202 -59139 -28016 -106908 -74803 -146436 87502 -210391
8876a62559A68269i9689m8831b6527j14651F0394J11320J5009k9146a94181B33369
$$ -162559 168269 -99689 -148520 -26527 -141178 60394 171714 186723 157577 -194181 233369
$$ [...]
##END NTUPLES=NMR SPECTRUM
##END=
