
##TITLE=AC1211_MCiAH12042_7160110_ttxhbOiQo4
##JCAMPDX= 6.0         $$ Bruker NMR JCAMP-DX V2.0
##DATA TYPE= NMR SPECTRUM
##DATA CLASS= NTUPLES
##ORIGIN= BRUKER
##OWNER= Administrator
$$ 1.72 TOPSPIN		Version 2.1
$$ 2012-11-30 21:21:35.518 -0500  Administrator@X
$$ Compression mode = diff/dup
##.OBSERVE FREQUENCY= 400.02188249412
##.OBSERVE NUCLEUS= ^1H
##.ACQUISITION MODE= SIMULTANEOUS (DQD)
##.ACQUISITION SCHEME= undefined
##.AVERAGES= 64
##.DIGITISER RES= 22
##SPECTROMETER/DATA SYSTEM= spect
##.PULSE SEQUENCE= noesygpps1d.comp
##.SOLVENT NAME= COFFEE_meoh
##.SHIFT REFERENCE= INTERNAL, COFFEE_meoh, 1, 14.9608
##AUDIT TRAIL= $$ (NUMBER, WHEN, WHO, WHERE, PROCESS, VERSION, WHAT)
$$ ##TITLE= Audit trail, TOPSPIN		Version 2.1
$$ ##JCAMPDX= 5.01
$$ ##ORIGIN= Bruker BioSpin GmbH
$$ ##OWNER= Administrator
$$ $$ E:\/data/COFFEE/nmr/AC1211_MCiAH12042_7160110_ttxhbOiQo4/12/pdata/1/auditp.txt
$$ ##AUDIT TRAIL=  $$ (NUMBER, WHEN, WHO, WHERE, PROCESS, VERSION, WHAT)
(   1,<2012-11-30 21:21:29.378 -0500>,<Administrator>,<X>,<go>,<TOPSPIN 2.1>,
      <created by zg
	started at 2012-11-30 21:09:59.842 -0500,
	POWCHK enabled, PULCHK disabled,
       configuration hash MD5:
       86 BA 57 50 F2 9D 5C 9B 26 00 A9 28 5F 66 2E 89
       data hash MD5: 64K
       46 B4 A9 EF 1E 40 5C F3 05 79 ED 42 18 39 33 AB>)
(   2,<2012-11-30 21:21:32.518 -0500>,<Administrator>,<X>,<proc1d>,<TOPSPIN 2.1>,
      <Start of raw data processing
       efp LB = 0.3 FT_mod = 6 PKNL = 1 PHC0 = 0 PHC1 = 0 SI = 128K 
       data hash MD5: 128K
       41 94 57 DA 7F F0 99 DF C9 E4 99 B3 89 94 46 5D>)
(   3,<2012-11-30 21:21:33.659 -0500>,<Administrator>,<X>,<proc1d>,<TOPSPIN 2.1>,
      <pk PHC0 = -78.5907 PHC1 = 0 
       data hash MD5: 128K
       87 B7 75 E4 70 C6 BC 43 96 2F 48 44 78 18 F3 80>)
(   4,<2012-11-30 21:21:34.425 -0500>,<Administrator>,<X>,<proc1d>,<TOPSPIN 2.1>,
      <abs ABSG = 1 
       data hash MD5: 128K
       26 39 25 FD 3F C1 DC 16 D1 5D FD 68 BA 17 4E EF>)
(   5,<2012-11-30 21:21:34.581 -0500>,<Administrator>,<X>,<proc1d>,<TOPSPIN 2.1>,
      <abs ABSG = 2 
       data hash MD5: 128K
       6A 6E 91 D3 A2 01 C1 8A 11 0E 9A F7 E6 8F D2 95>)
(   6,<2012-11-30 21:21:34.768 -0500>,<Administrator>,<X>,<proc1d>,<TOPSPIN 2.1>,
      <abs ABSG = 3 
       data hash MD5: 128K
       B2 9E 28 61 A8 7C 68 A2 F2 AC D0 6F 8D 0F 1B 9A>)
(   7,<2012-11-30 21:21:34.956 -0500>,<Administrator>,<X>,<proc1d>,<TOPSPIN 2.1>,
      <abs ABSG = 4 
       data hash MD5: 128K
       2A 59 2F 77 B7 E4 5D DA ED 09 8D 40 15 0C F4 FC>)
(   8,<2012-11-30 21:21:35.159 -0500>,<Administrator>,<X>,<proc1d>,<TOPSPIN 2.1>,
      <abs ABSG = 5 
       data hash MD5: 128K
       93 3D 4E F5 CD 6A BC E1 58 BD 30 33 58 28 AE 56>)
$$ ##END=
$$ 
$$ $$ hash MD5
$$ $$ B2 3C DB B1 17 E1 08 0B 72 A5 63 F4 65 43 CC 14
##$RELAX= 
##$RELAX= 
##$RELAX= 
##$RELAX= 
##$RELAX= 
##$RELAX= 
##$RELAX= 
##$RELAX= 
$$ Bruker specific parameters
$$ --------------------------
##$DU= <E:\>
##$EXPNO= 12
$$ [...]
150 150 150 150 150 150 150 150
##$TP07= 0
##$TPNAME0= <>
##$TPNAME1= <>
##$TPNAME2= <>
##$TPNAME3= <>
##$TPNAME4= <>
##$TPNAME5= <>
##$TPNAME6= <>
##$TPNAME7= <>
##$TPOAL= (0..7)
0.5 0.5 0.5 0.5 0.5 0.5 0.5 0.5
##$TPOFFS= (0..7)
0 0 0 0 0 0 0 0
##$TUNHIN= 0
##$TUNHOUT= 0
##$TUNXOUT= 0
##$USERA1= <user>
##$USERA2= <user>
##$USERA3= <user>
##$USERA4= <user>
##$USERA5= <user>
##$V9= 5
##$VALIST= <valist>
##$VCLIST= <CCCCCCCCCCCCCCC>
##$VD= 0
##$VDLIST= <DDDDDDDDDDDDDDD>
##$VPLIST= <PPPPPPPPPPPPPPP>
##$VTLIST= <TTTTTTTTTTTTTTT>
##$WBST= 1024
##$WBSW= 4
##$XGAIN= (0..3)
0 0 0 0
##$XL= 0
##$YL= 0
##$YMAX_a= 6149587
##$YMIN_a= -12511061
##$ZGOPTNS= <>
##$ZL1= 120
##$ZL2= 120
##$ZL3= 120
##$ZL4= 120
##$ABSF1= 14.9608
##$ABSF2= -5.597382
##$ABSG= 5
##$ABSL= 3
##$ALPHA= 0
##$AQORDER= 0
##$ASSFAC= 0
##$ASSFACI= 0
##$ASSFACX= 0
##$ASSWID= 0
##$AUNMP= <proc_prof1d_extract.lims>
##$AXLEFT= 0
##$AXNAME= <>
##$AXNUC= <1H>
##$AXRIGHT= 0
##$AXTYPE= 0
##$AXUNIT= <>
##$AZFE= 0.1
##$AZFW= 0.1
##$BCFW= 0
##$BC_mod= 0
##$BYTORDP= 0
##$COROFFS= 0
##$CY= 15
##$DATMOD= 1
##$DC= 0
##$DFILT= <>
##$DTYPP= 0
##$F1P= 0
##$F2P= 0
##$FCOR= 0.5
##$FTSIZE= 131072
##$FT_mod= 6
##$GAMMA= 0
##$GB= 0
##$INTBC= 1
##$INTSCL= 1
##$ISEN= 128
##$LB= 0.3
##$LEV0= 0
##$LPBIN= 0
##$MAXI= 10000
##$MC2= 0
##$MEAN= 0
##$ME_mod= 0
##$MI= 0
##$NCOEF= 0
##$NC_proc= -2
##$NLEV= 6
##$NOISF1= 0
##$NOISF2= 0
##$NSP= 0
##$NTH_PI= 0
##$NZP= 0
##$OFFSET= 14.9608
##$PC= 1
##$PHC0= -78.5907
##$PHC1= 0
##$PH_mod= 1
##$PKNL= yes
##$PPARMOD= 0
##$PPDIAG= 0
##$PPIPTYP= 0
##$PPMPNUM= 2147483647
##$PPRESOL= 1
##$PSCAL= 4
##$PSIGN= 0
##$PYNMP= <proc.py>
##$REVERSE= no
##$SF= 400.020009715651
##$SI= 131072
##$SIGF1= 0
##$SIGF2= 0
##$SINO= 400
##$SIOLD= 131072
##$SPECTYP= <>
##$SREGLST= <1H.CDCl3>
##$SSB= 0
##$STSI= 131072
##$STSR= 0
##$SW_p= 8223.68421052631
##$SYMM= 0
##$S_DEV= 0
##$TDeff= 65536
##$TDoff= 0
##$TI= <>
##$TILT= no
##$TM1= 0
##$TM2= 0
##$TOPLEV= 0
##$USERP1= <user>
##$USERP2= <user>
##$USERP3= <user>
##$USERP4= <user>
##$USERP5= <user>
##$WDW= 1
##$XDIM= 131072
##$YMAX_p= 426299223
##$YMIN_p= -12604
##$CURPLOT= <Network HP LaserJet P1505>
##$CURPRIN= <$Network HP LaserJet P1505>
##$DFORMAT= <normdp>
##$LAYOUT= <+/1D_H.xwp>
##$LFORMAT= <normlp>
##$PFORMAT= <normpl>
##$SURQMSG= 1
$$ End of Bruker specific parameters
$$ ---------------------------------
##NTUPLES= NMR SPECTRUM
##VAR_NAME=  FREQUENCY,     SPECTRUM/REAL,   SPECTRUM/IMAG
##SYMBOL=    X,             R,               I
##VAR_TYPE=  INDEPENDENT,   DEPENDENT,       DEPENDENT
##VAR_FORM=  AFFN,          ASDF,            ASDF
##VAR_DIM=   131072,        131072,          131072
##UNITS=     HZ,            ARBITRARY UNITS, ARBITRARY UNITS
##FACTOR=    0.0627417313425164, 1,          1
##FIRST=     8223.62146879497, 4009,         -61735
##LAST=      0,             6315,            -60999
##MIN=       0,             -12604,          0
##MAX=       8223.62146879497, 426299223,    0
$$ Real data points
##PAGE= N=1
##DATA TABLE= (X++(R..R)), XYDATA
$$ [...]
63976C20321O316O481P389Q412R415J0387J0859J0565J0164J0342J0723J0614
63964D31988J0363J0900J2200J3426J4389J5638J7122J8175J9060K1126K4871
63953F09258K9050L2557L6213M1594M8895N7107O5872P5879Q7478J00107J13319
63942A297329J27341J42098J56435J69000J79491J88413J95885K01293K03954
63933B861239K03439J99156J90150J75739J56085J32027J04699P5476M5810J6553
63923D160373j2523m2020p1751j00482j26666j49063j66828j79634j87880j92306
63913B931220j93279j90894j85694j78618j70011j59424j46828j33317j20064
63904A453091j07140r4214q1848p1146o2282n4305m6535l9341l3428k8963k5661
$$ plain form
63976 320321 326637 333118 340507 348919 358334 368721 379580 390145 400309 410651 421374 431988
63964 431988 442351 453251 465451 478877 493266 508904 526026 544201 563261 584387 609258
63953 609258 638308 670865 707078 748672 797567 854674 920546 996425 1083903 1184010 1297329
63942 1297329 1424670 1566768 1723203 1892203 2071694 2260107 2455992 2657285 2861239
63933 2861239 3064678 3263834 3453984 3629723 3785808 3917835 4022534 4098010 4143820 4160373
63923 4160373 4147850 4105830 4034079 3933597 3806931 3657868 3491040 3311406 3123526 2931220
63913 2931220 2737941 2547047 2361353 2182735 2012724 1853300 1706472 1573155 1453091
63904 1453091 1345951 1251737 1169889 1098743 1036461 982156 935621 896280 862852 833889 808228
63893H08228k3157k1104j9291j7826j6855j6114j5251j4556j4626j5144j4822
63882F19482j2940j0445q850q452q087o487l424L23L652N900P276Q608J0497J2741
63868F09794J4669J5884J6547J7123J7929J8794J9109J8411J6957J5466J4228
63857G94911J2832J0860Q464O036L738J613k82k177m599p577j0234j1746j2474
63844G89365j3511j5235j7042j8474j9845k1443k2767k3119k2641k2225k2415
63833E70648k2837k2807k2126k1133k0152j9230j8286j7264j6067j4604j3066
63822C63076j1897j1259j0716r782q654p991q004q198q070p561o736n548m245
63809B54415l511l708m246m220l471k597k021j537q33l3M28K01p06j859k578k452
$$ plain form
63893 808228 785071 763967 744676 726850 709995 693881 678630 664074 649448 634304 619482
63882 619482 606542 596097 587247 578795 570708 564221 560797 561120 564772 570672 577948 586556 597053 609794
63868 609794 624463 640347 656894 674017 691946 710740 729849 748260 765217 780683 794911
63857 794911 807743 818603 827067 833103 836841 838454 838172 835995 831396 823819 813585 801839 789365
63844 789365 775854 760619 743577 725103 705258 683815 661048 637929 615288 593063 570648
63833 570648 547811 525004 502878 481745 461593 442363 424077 406813 390746 376142 363076
63822 363076 351179 339920 329204 319422 310768 302777 294773 286575 278505 270944 264208 258660 254415
63809 254415 250904 247196 242950 238730 235259 232662 230641 229104 228271 228238 228666 228867 228161 226302 223724 221272
63793B21272j756j170j054j193j198j003r05j202j816k305k301j995j936k259
63779A99179k404j837q23r6M1j02j93k39l22m06m72n52n34k23K98O31N01M5m01
63760A92091o20n84l59n6K29M36N06M53N34J097J968K320J557J74o91n26K47J017
63742A99793J468J394P49J13L28J351K084J773R95P03Q70Q37N99Q61J896L107
63726B18921L859M146M211M142L981L824L619L209K864L274M661O172O544N312
63712B78739L161J263L78L53K15r47k914m366m332l374k814l024l156k573j725
63697B54884j279j123q16m90m78l94M92K012L060L036K563K428K512K286J773
63682B70466J398J242J135J222J772K497K701K190J454R11M94J26%K25N79R30
$$ plain form
63793 221272 219516 218346 217292 216099 214901 213898 212993 211791 209975 207670 205369 203374 201438 199179
63779 199179 196775 194938 194115 194019 194060 193958 193765 193526 193204 192798 192326 191774 191240 191017 191315 191946 192447 192492 192091
63760 192091 191471 190887 190528 190472 190701 191137 191643 192096 192630 193727 195695 198015 199572 199746 199055 198529 198776 199793
63742 199793 201261 202655 203404 203517 203845 205196 207280 209053 210048 210751 211621 212458 213057 213918 215814 218921
63726 218921 222780 226926 231137 235279 239260 243084 246703 249912 252776 256050 260711 266883 273427 278739
63712 278739 281900 283163 283541 283894 284109 283162 280248 275882 271550 268176 265362 262338 259182 256609 254884
63697 254884 253605 252482 251666 251176 250698 250304 250796 252808 255868 258904 261467 263895 266407 268693 270466
63682 270466 271864 273106 274241 275463 277235 279732 282433 284623 286077 286988 287482 287608 287608 287833 288412 289342
63666B89342J520K467L297L299K344J030P3l23n71j185k173l005l347l555m143
63651B85070m914n214m943m698m754m606l794k622j616p94J7O27Q19R21J390K086
63635B52975K500K546K577K680K612K367K317K713L441M314N167N782O122O575
63621C04688P458Q388Q717Q558Q718R529J0449J1028J1607J2657J4053J5503J7256
63608D48609J9795K3041K6369K9291L1762L3883L5572L6487L6130L4218L0978
63597G86135K6795K1620J5201Q113J862k470n239p352q905r417r050q735r202
63584G99356j0593j2983j6416k0341k3820k6486k8598k9995k9837k7843k5000
63573E47444k2410k0035j7260j4218j1667r773p894n596l200j187M05J754K944
$$ plain form
63666 289342 290862 293329 296626 299925 302269 303299 303372 303049 302478 301293 299120 296115 292768 289213 285070
63651 285070 280156 274942 269999 265301 260547 255941 252147 249525 247909 247115 247132 247759 248578 249499 250889 252975
63635 252975 255475 258021 260598 263278 265890 268257 270574 273287 276728 281042 286209 291991 298113 304688
63621 304688 312146 320534 329251 337809 346527 356056 366505 377533 389140 401797 415850 431353 448609
63608 448609 468404 491445 517814 547105 578867 612750 648322 684809 720939 755157 786135
63597 786135 812930 834550 849751 857864 859726 857256 852017 844665 835760 826343 817293 808558 799356
63584 799356 788763 775780 759364 739023 715203 688717 660119 630124 600287 572444 547444
63573 547444 525034 504999 487739 473521 461854 452081 444187 438591 435391 434204 434609 436363 439307
63560D39307M108N508P158Q678R671J0131J0340J0589J1122J2091J3447J5088
63548E57238J7120J9746K2799K5804K8723L2254L6945M2245M6637M8568M6903
63537I24982M1020L1173J8973O899l040j0118j4436j6193j5608j3342j0523q240
63525I31547p111p320q950j2179j6986k2714k8203l2566l5697l7787l8664l8035
63513F45335l6191l3849l1267k8178k4716k1700j9592j7848j5819j3768j2336
63502C90071j1387j0251q826p625o793n929n050m750n141n387m776l629k648j908
63488C05971j133m65k76m99p29q13p09m1J462L166M012L865L681M071M515M319
63472C30397L704L296L085K594J805J153O55j91j487k584l011l239m005n102n483
$$ plain form
63560 439307 443415 448923 456081 464759 474430 484561 494901 505490 516612 528703 542150 557238
63548 557238 574358 594104 616903 642707 671430 703684 740629 782874 829511 878079 924982
63537 924982 966002 997175 1016148 1023047 1020007 1009889 995453 979260 963652 950310 939787 931547
63525 931547 924436 917116 908166 895987 879001 856287 828084 795518 759821 722034 683370 645335
63513 645335 609144 575295 544028 515850 491134 469434 449842 431994 416175 402407 390071
63502 390071 378684 368433 359607 351982 345189 339260 334210 329460 324319 318932 314156 310527 307879 305971
63488 305971 304838 304373 304097 303598 302869 302056 301347 301306 302768 305934 309946 313811 317492 321563 326078 330397
63472 330397 334101 337397 340482 343076 344881 346034 346689 346498 345011 342427 339416 336177 332172 327070 321587
63457C21587m639l325k628k578k192q78O48J164M46m35l67O80J925K886L774M886
63441C20954O067O992P727Q687J0096J1786J3532J5342J7361J9717K2642K6383
63429D87286L0589L3875L4465L1549K5862J8898J1945O004K011N19J251L554P184
63416F94992J2154J7922K3539K8714L3970L9288M3345M4794M3722M0963L6391
63405A059794K9096J9353R284J022n034r533j2531j3480j2568j1147j0609j1460
63393A032187j3643j7200k2166k8051l3756l8138m0581m1171m0387l8682l6292
63382F82120l3437l0486k7759k5235k2615j9676j6461j3224j0287p819n664l449
63370D66008j118Q08J868K436L489N520Q040J0298J2154J4064J6447J9233K1939
$$ plain form
63457 321587 316948 313623 310995 308417 306225 305347 305995 307159 307605 307170 306803 307483 309408 312294 316068 320954
63441 320954 327021 334013 341740 350427 360523 372309 385841 401183 418544 438261 460903 487286
63429 487286 517875 551750 586215 617764 643626 662524 674469 680473 682484 683003 684254 687808 694992
63416 694992 707146 725068 748607 777321 811291 850579 893924 938718 982440 1023403 1059794
63405 1059794 1088890 1108243 1117527 1118549 1113515 1103982 1091451 1077971 1065403 1054256 1043647 1032187
63393 1032187 1018544 1001344 979178 951127 917371 879233 838652 797481 757094 718412 682120
63382 682120 648683 618197 590438 565203 542588 522912 506451 493227 482940 475121 469457 466008
63370 466008 464890 465698 467566 470002 473491 479011 487051 497349 509503 523567 540014 559247 581186
63357E81186K4105K5854K7977L1136L4955L8325M0694M2429M3676M3580M1248
63346I75165L6924L1422K4798J6640P611m04o076r719j2215j3691j3931j3454
63334A023070j3297j3959j5399j7859k1771k6721l1307l4408l6049l6682l6217
63323G39401l4349l1414k8180k4936k1364j7316j3109q948m840j532q36m048j0117
63310E38412j6073j9524k0351j9904j9200j8271j6786j4748j2598j0956j0089
63299C59912r486q257o281m543l912l891l341k226j738k553l799m167l452k457
63285B99809j889j893k360l018l341k951k130j583j613j833j663r18O5O98N64
63270B75944j45p32o76j14N34J162J846K352K273J679J159J176J659K302K883
$$ plain form
63357 581186 605291 631145 659122 690258 725213 763538 804232 846661 890337 933917 975165
63346 975165 1012089 1043511 1068309 1084949 1092560 1092156 1086080 1076361 1064146 1050455 1036524 1023070
63334 1023070 1009773 995814 980415 962556 940785 914064 882757 848349 812300 775618 739401
63323 739401 705052 673638 645458 620522 599158 581842 568733 559785 554945 553413 552577 548529 538412
63310 538412 522339 502815 482464 462560 443360 425089 408303 393555 380957 370001 359912
63299 359912 350426 342169 335888 331345 327433 323542 320201 317975 316237 313684 309885 305718 302266 299809
63285 299809 297920 296027 293667 290649 287308 284357 282227 280644 279031 277198 275535 274617 274682 275380 275944
63270 275944 275799 275067 274391 274277 274811 275973 277819 280171 282444 284123 285282 286458 288117 290419 293302
63255B93302L223L228L119L361M091M804M854M205L568L740M849O228P125P579
63241C57276Q368R991J1975J3491J4409J5302J6564J8045J9478K0751K1683K2109
63229E49442K2252K2603K3213K3569K3292K2522K1546K0522J9824K0026K1126
63218G89937K2223K2477K2060K1724K1790K1949K1763K0731J8176J3664P633J087
63206A005214n337j1672j8002k3893k8505l1099l1543l0572k9376k8626k7953
63195G38636k6572k4178k0924j6914j2269p584l739j147M52J585K791M595P184
63182F41916J0132J2810J4961J6467J6898J6085J4987J4993J6171J7126J6892
63171H09438J6050J5548J5236J4334J2740J0927R026O729L912O00l454q434j3760
$$ plain form
63255 293302 296525 299753 302872 306233 310324 315128 319982 324187 327755 331495 336344 342572 349697 357276
63241 357276 365644 375635 387610 401101 415510 430812 447376 465421 484899 505650 527333 549442
63229 549442 571694 594297 617510 641079 664371 686893 708439 728961 748785 768811 789937
63218 789937 812160 834637 856697 878421 900211 922160 943923 964654 982830 996494 1004127 1005214
63206 1005214 999877 988205 970203 946310 917805 886706 855163 824591 795215 766589 738636
63195 738636 712064 687886 666962 650048 637779 630195 626456 625309 625761 627346 630137 634732 641916
63182 641916 652048 664858 679819 696286 713184 729269 744256 759249 775420 792546 809438
63171 809438 825488 841036 856272 870606 883346 894273 903299 910028 913940 914540 911086 902652 888892
63158H88892j8417k2012k4949k7494k9361l0325l0629l0537k9875k8324k5922
63147E91047k3118k0515j8587j7306j6044j4223j2148j0731j0208r668q129n789
63135D24581l779k885k888l004k648j825j045q42j112j074j49J256K158K155J792
63120D10691J777K244K918L613M208M439M153L693L670M235M882N015M530L721
63106D63789K847K083J651J771K349K964L212K982K346J428N01N0M13J307J899
63091D91592J580O25q8j7N63J018J095R43O26L1p14j106p51K88J738L416N038
63074E05877O096O360O319O648P393Q131Q772R621J0625J1292J1542J2060J3380
63061F24116J5185J6885J8482K0369K2625K5104K7886L1071L4316L7202L9940
$$ plain form
63158 888892 870475 848463 823514 796020 766659 736334 705705 675168 645293 616969 591047
63147 591047 567929 547414 528827 511521 495477 481254 469106 458375 448167 438499 430370 424581
63135 424581 420802 417917 415029 412025 409377 407552 406507 405665 404553 403479 403330 404586 406744 408899 410691
63120 410691 412468 414712 417630 421243 425451 429890 434043 437736 441406 445641 450523 455538 460068 463789
63106 463789 466636 468719 470370 472141 474490 477454 480666 483648 485994 487422 487923 487973 488386 489693 491592
63091 491592 493172 493797 493709 493692 494255 495273 496368 497311 497937 497968 497254 496148 495397 495685 497423 500839 505877
63074 505877 511973 518333 524652 531300 538693 546824 555596 565217 575842 587134 598676 610736 624116
63061 624116 639301 656186 674668 695037 717662 742766 770652 801723 836039 873241 913181
63050I13181M3095M6624M9857N2426N4492N5922N6052N4785N3270N2783N3277
63039A485764N3725N3719N3909N4734N5500N5242N4077N2943N2084N0406M6676
63028B068779M0883L3869K5908J6330M734q059k0671l2410m3393n3633o2516o9168
63016A900653p2976p3906p2598p0024o6635o1935n5398m7635m0056l3349k6960
63005A279181k0199j3112o064Q42P334J2745J6854K0474K4376K7988L0089L0574
62993A411082L0586L0817L0688K9574K8021K7064K6824K6435K5154K2909J9770
62982A708924J5487R802K953m436j1897j9398k7040l4606m1580m7621n2774n7041
62970A440773n9965o1000o0202n8183n5375n1766m7482m3139l9240l5574l1702
$$ plain form
63050 913181 956276 1002900 1052757 1105183 1159675 1215597 1271649 1326434 1379704 1432487 1485764
63039 1485764 1539489 1593208 1647117 1701851 1757351 1812593 1866670 1919613 1971697 2022103 2068779
63028 2068779 2109662 2143531 2169439 2185769 2190503 2182444 2161773 2129363 2085970 2032337 1969821 1900653
63016 1900653 1827677 1753771 1681173 1611149 1544514 1482579 1427181 1379546 1339490 1306141 1279181
63005 1279181 1258982 1245870 1239806 1240648 1247982 1260727 1277581 1298055 1322431 1350419 1380508 1411082
62993 1411082 1441668 1472485 1503173 1532747 1560768 1587832 1614656 1641091 1666245 1689154 1708924
62982 1708924 1724411 1734213 1737166 1732730 1720833 1701435 1674395 1639789 1598209 1550588 1497814 1440773
62970 1440773 1380808 1319808 1259606 1201423 1146048 1094282 1046800 1003661 964421 928847 897145
62959H97145k7858k4833k2979k1718k0221j8301j6503j5494j5411j5708j5587
62948F82532j4766j3793j3327j3213j2681j1567j0748j0993j1801j2020j1371
62937E46252j0663j0467j0342r671q642p818p148o088m637l533l263l378l134
62924D57468k430j801j622j668j442o62N51J689K073J309k44j574j846j171m78
62909D48152n71j347k015k017j577j366j780k645l471l821l520k722j858j340
62895D18102j257j393j538j638j604j284o94j34J07O9l8j40k60k83MO08J287J821
62877D11735K189K398K317J821J007J43n66j074j388j484j364j074o62j41L99
62862D14256O67L29n99j625k163k023j414n05P05K060L068L324K979K492K022
$$ plain form
62959 897145 869287 844454 821475 799757 779536 761235 744732 729238 713827 698119 682532
62948 682532 667766 653973 640646 627433 614752 603185 592437 581444 569643 557623 546252
62937 546252 535589 525122 514780 505109 496467 488649 481501 475413 470776 467243 463980 460602 457468
62924 457468 455038 453237 451615 449947 448505 447843 448394 450083 452156 453465 453221 451647 449801 448630 448152
62909 448152 447581 446234 444219 442202 440625 439259 437479 434834 431363 427542 424022 421300 419442 418102
62895 418102 416845 415452 413914 412276 410672 409388 408694 408560 408667 408736 408698 408558 408298 408015 408019 408627 409914 411735
62877 411735 413924 416322 418639 420460 421467 421610 421044 419970 418582 417098 415734 414660 413998 413857 414256
62862 414256 414923 415252 414653 413028 410865 408842 407428 406923 407628 409688 412756 416080 419059 421551 423573
62847D23573J380O28L14Q71J908K492K146J335P82N01j37j392k553k683j757p05
62831D26703l01l87l28J25O58Q90O99J95k79j88P45K084K885K598J660J020J184
62814D39963J833K328K479K680L321M177M622M436M117M213M598M783M736M969
62800D93255N745O743P630Q531R604J0520J0897J1094J2019J3978J6233J7943
62788F24192J9230K0921K3412K6300K9267L2786L7548M3453M9639N5526O1305
62777A023579O7319P3429P9361Q5174R0847R5552R7941R7225R3579Q7493P9180
62766A970679O8710N6248M1915K5851Q679q457k4647l9684n3465o5268p4182q0131
62754A826248q3899q6109q6702q5552q3149q0269p7205p3658o9347o4458n9422
$$ plain form
62847 423573 424953 425581 425895 426766 428674 431166 433312 434647 435429 435930 435793 434401 431848 429165 427408 426703
62831 426703 426402 426015 425687 425812 426470 427360 428059 428254 427975 427787 428532 430616 433501 436099 437759 438779 439963
62814 439963 441796 444124 446603 449283 452604 456781 461403 465839 469956 474169 478767 483550 488286 493255
62800 493255 499000 505743 513373 521904 531508 542028 552925 564019 576038 590016 606249 624192
62788 624192 643422 664343 687755 714055 743322 776108 813656 857109 906748 962274 1023579
62777 1023579 1090898 1164327 1243688 1328862 1419709 1515261 1613202 1710427 1804006 1891499 1970679
62766 1970679 2039389 2095637 2137552 2163403 2172082 2163625 2138978 2099294 2045829 1980561 1906379 1826248
62754 1826248 1742349 1656240 1569538 1483986 1400837 1320568 1243363 1169705 1100358 1035900 976478
62743I76478n4465m9515m4532l9796l5737l2485k9693k6939k4150k1550j9268
62732E98348j7176j5119j3174j1533j0211q941p430n764m406l712l379k682j272
62719D93549L88J616K259K655L046L425L919M858O362Q112R787J1493J3563J6112
62705E81144J8983K2054K5334K8779L2272L5751L9326M3155M7338N1888N6656
62694I82680O1254O5179O8159P0240P1427P1284O9167O4817N8539N0724M1469
62683A674939L0801J8986O291p225k1209l4464m5554n4119o0927o6445p0016p0969
62671A300089o9922o8167o6138o3338n9623n5620n1761m7776m3471l9307l5694
62660F99272l2344k8842k5414k2594k0445j8675j7174j5893j4430j2377j0058
$$ plain form
62743 976478 922013 872498 827966 788170 752433 719948 690255 663316 639166 617616 598348
62732 598348 581172 566053 552879 541346 531135 522194 514764 509000 504594 500882 497503 494821 493549
62719 493549 493937 495553 497812 500467 503513 506938 510857 515715 522077 530189 539976 551469 565032 581144
62705 581144 600127 622181 647515 676294 708566 744317 783643 826798 874136 926024 982680
62694 982680 1043934 1109113 1177272 1247512 1318939 1390223 1459390 1524207 1582746 1633470 1674939
62683 1674939 1705740 1724726 1731017 1723792 1702583 1668119 1622565 1568446 1507519 1441074 1371058 1300089
62671 1300089 1230167 1162000 1095862 1032524 972901 917281 865520 817744 774273 734966 699272
62660 699272 666928 638086 612672 590078 569633 550958 533784 517891 503461 491084 481026
62649D81026q309p530p382p427p494p391o810n772m740m052l574l134k898l004
62635D01509l163k963k361j535m85Q10J913K078J059n23j706j996j591r94n67
62620C89485l22j6N43J284J924K277K464K819L568M588N525O141O566P123P947
62605D41916Q843R550J0052J0625J1603J3130J5054J7070J9069K1371K4472K8399
62593F31154L2460L5765L8046L9834M1787M3912M5443M5479M3718M0515L6288
62582A074401L1001K4339J6293P366j789j0612j8592k5291l0639l4966l8496m1013
62570I52002m2268m2487m2090m1012l8859l5778l2693l0335k8391k5991k2900
62559E69198j9828j7549j6105j4915j3435j1581r662q082p058o505o171n892n648
$$ plain form
62649 481026 472717 465187 457805 450378 442884 435493 428683 422911 418171 414119 410545 407411 404513 401509
62635 401509 398346 395383 393022 391487 391002 391812 393725 395803 396862 396339 394633 392637 391046 390052 389485
62620 389485 389163 389147 389690 390974 392898 395175 397639 400458 404026 408614 414139 420280 426846 433969 441916
62605 441916 450759 460309 470361 480986 492589 505719 520773 537843 556912 578283 602755 631154
62593 631154 663614 699379 737425 777259 819046 862958 908401 953880 997598 1038113 1074401
62582 1074401 1105402 1129741 1146034 1153400 1151611 1140999 1122407 1097116 1066477 1031511 993015 952002
62570 952002 909734 867247 825157 784145 745286 709508 676815 646480 618089 592098 569198
62559 569198 549370 531821 515716 500801 487366 475785 466123 458041 450983 444478 438307 432415 426767
62546D26767n402n051m546l932l176k191j151n55o58r99q31l2Q21J338J773K345
62530D04520K617K095J218J085K159L758M979N640O149O879Q027R706J1806J3990
62516D84628J6203J8899K2365K6053K9111L1517L4086L7258M0383M2359M2619
62505H25481M1308L8895L5884L2491K8319K2666J5571Q189J692l970r651j5513
62493A021362k0609k4037k5777k6190k5332k3276k0655j8077j5279j1511o765
62482H03854j932K428O741J1490J6237K0204K3396K6451K9504L1962L3416L4027
62470A037778L3777L1981K8019K2170J5284Q019Q47n673j1396j7145k3917l1367
62458A088377l7768m1814m3904m5259m6282m6344m4982m2537l9541l6023l1771
$$ plain form
62546 426767 421365 416314 411768 407836 404660 402469 401318 400763 400105 399106 398275 398243 399064 400402 402175 404520
62530 404520 407137 409232 410450 411535 413694 417452 422431 428071 434220 441099 449126 458832 470638 484628
62516 484628 500831 519730 542095 568148 597259 628776 662862 700120 740503 782862 825481
62505 825481 866789 905684 941568 974059 1002378 1025044 1040615 1048804 1050496 1046526 1036875 1021362
62493 1021362 1000753 976716 950939 924749 899417 876141 855486 837409 822130 810619 803854
62482 803854 801922 804350 811091 822581 838818 859022 882418 908869 938373 970335 1003751 1037778
62470 1037778 1071555 1103536 1131555 1153725 1169009 1177028 1177875 1172202 1160806 1143661 1119744 1088377
62458 1088377 1050609 1008795 964891 919632 873350 827006 782024 739487 699946 663923 632152
62447F32152k7052k2636j9107j6330j3759j1164q800o889n196l359j486j19N19
62434D96774R04J750L254M920N964N852M595K716Q29p88k210l550m825o160p756
62419E02269r478j0721j0977j0373r443q519p647o923o517o347o077n524m852
62406C98871m300l878l544l347l320l308l159k945k812k637k067j074j97j8l94
62391C61871n36N9J004J629J917K388L109L385K686J468P02Q10J425K041K488
62376C86446K887L467M438N704O830P525Q131R177J0496J1282J1180J0873J1332
62363D89768J2816J4904J7159J9435K1756K4317K7578L1855L6875M1997M6917
62352G85377N1799N6604O0715O3392O4305O3361O0301N4844M7138L7722K7165
$$ plain form
62447 632152 605100 582464 563357 547027 533268 522104 513304 506415 501219 497860 496374 496255 496774
62434 496774 497678 499428 502682 507602 513566 519418 524013 526729 527558 526770 524560 521010 516185 510025 502269
62419 502269 492791 482070 471093 460720 451277 442758 435111 428188 421671 415324 409247 403723 398871
62406 398871 394571 390693 387149 383802 380482 377174 374015 371070 368258 365621 363554 362480 362283 362265 361871
62391 361871 361335 361394 362398 364027 365944 368332 371441 374826 377512 378980 379682 380492 381917 383958 386446
62376 386446 389333 392800 397238 402942 409772 417297 425428 434605 445101 456383 467563 478436 489768
62363 489768 502584 517488 534647 554082 575838 600155 627733 659588 696463 738460 785377
62352 785377 837176 893780 954495 1017887 1082192 1145553 1205854 1260698 1307836 1345558 1372723
62341A372723J6106N545l525j1015j7814k4689l1482l7626m2913m7207m9879n0313
62329A077911m8856m6447m3409l9466l4944l0875k7535k3997j9852j6401j5063
62318G31066j5211j4905j3537j2484j3009j4731j6529j7978j9185j9895j9576
62307E54026j8188j6309j4551j3151j1924j0506q765p117o177n962n775n001l735
62294D26865k434j392p92q40j427j927j733r07m0N26J003J765K763L393L063J971
62278D29857J210J685L009L999M196M281M832N471N673N737O297P289Q090Q459
62264E00085Q793R628J1346J4062J7323K0258K2639K5459K9773L5256M0743M5908
62252G81273N1360N7109O2077O5455O7509O8412O7207O2764N5256M5904L5665
$$ plain form
62341 1372723 1388829 1394374 1390849 1379834 1362020 1337331 1305849 1268223 1225310 1178103 1128224 1077911
62329 1077911 1029055 982608 939199 899733 864789 833914 806379 782382 762530 746129 731066
62318 731066 715855 700950 687413 674929 661920 647189 630660 612682 593497 573602 554026
62307 554026 535838 519529 504978 491827 479903 469397 460632 453515 447338 441376 435601 430600 426865
62294 426865 424431 423039 422247 421407 419980 418053 416320 415413 415373 415899 416902 418667 421430 424823 427886 429857
62278 429857 431067 432752 435761 439760 443956 448237 453069 458540 464213 469950 476247 483536 491626 500085
62264 500085 508878 518506 529852 543914 561237 581495 604134 629593 659366 694622 735365 781273
62252 781273 832633 889742 951819 1017274 1084783 1153195 1220402 1283166 1338422 1384326 1419991
62241A419991K4964J4422M876l503j1450j9690k8166l6346m3782n0058n4589n6981
62229A159688n7521n6860n5199n2155m7602m2235l6993l2139k7401k2910j9323
62218G09350j6862j4787j2387j0092q987r306j0067j0267r920r689r843j0024
62206E77119r887r686j0012j1009j1911j1659j0059q117o938o497n847m396k519
62193D68582q98K73J294K557M238O110P512P846P279O715O948Q039R549J1007
62179E47051J1986J2109J1352J0249R473R222R094Q508P263N837N115N689P499
62166F60447J0255J3994J8786K4107K9161L3850L8711M3679M7546M9125M8426
62155A018087M6172M2578L7265L0171K1990J3661N828j271p671j3550j9021k4104
$$ plain form
62241 1419991 1444955 1459377 1464253 1460750 1449300 1429610 1401444 1365098 1321316 1271258 1216669 1159688
62229 1159688 1102167 1045307 990108 937953 890351 848116 811123 778984 751583 728673 709350
62218 709350 692488 677701 665314 655222 646235 636929 626862 616595 606675 596986 587143 577119
62206 577119 567232 557546 547534 536525 524614 512955 502896 494779 487841 481344 475497 471101 468582
62193 468582 467684 467957 469251 471808 476046 482156 489668 497514 504793 511508 518456 526495 536044 547051
62179 547051 559037 571146 582498 592747 602220 611442 620536 629044 636307 642144 647259 652948 660447
62166 660447 670702 684696 703482 727589 756750 790600 829311 872990 920536 969661 1018087
62155 1018087 1064259 1106837 1144102 1174273 1196263 1209924 1215752 1214481 1206810 1193260 1174239 1150135
62143A150135k8858l3271l6935l9198l9855l9298l7813l5180l1391k7234k3560
62132G77542k0308j6866j3113r493o287l511j388r3R04K405M234N274N056M570
62118G28926M976O069O568N619L462R31j178k345k460j853j085o28q55k046m183
62103G39918o783r095j0485j0675r797q331o732n050l053q63R23J900K418L187
62089F77482M404N596O186O014N326M540M048M073M607N505O563P571Q398R157
62075G59470J0159J1593J3313J5062J6706J8180J9296J9860J9896J9625J9263
62064I42423J8983J9061J9872K1716K4563K7954L1122L3387L4478L4316L2578
62053A240453K8804K3058J6187R118K245m264r936j4458j8484k3264k9189l5184
$$ plain form
62143 1150135 1121277 1088006 1051071 1011873 972018 932720 894907 859727 828336 801102 777542
62132 777542 757234 740368 727255 717762 711475 707964 706576 706483 707387 709792 714026 719300 724356 728926
62118 728926 733902 739971 746539 752158 755620 756551 755373 753028 750568 748715 747630 747002 746147 744101 739918
62103 739918 733135 724040 713555 702880 693083 684752 678020 672970 669917 669054 669977 671877 674295 677482
62089 677482 681886 687482 693668 699682 705008 709548 713596 717669 722276 727781 734344 741915 750313 759470
62075 759470 769629 781222 794535 809597 826303 844483 863779 883639 903535 923160 942423
62064 942423 961406 980467 1000339 1022055 1046618 1074572 1105694 1139081 1173559 1207875 1240453
62053 1240453 1269257 1292315 1308502 1317620 1319865 1315601 1305665 1291207 1272723 1249459 1220270 1185086
62041A185086l9875m2957m5064m6601m7299m6908m5733m4247m2462l9995l6708
62030G07237l2897k8885k4726k0522j6795j4182j2690j1685j0634r630q925q274
62018E07392p200n730m481l884l727l546l226k978k948k990k768k027r30o4J33
62003D61026L8N09J767L016L458L279L203L401L466L260L076K971K549J603M44
61988D97066n93j494k216k561k717l419n060p023q375q936r148r157q726p919
61974D19722p211o775o270n469m651m169l939l620l029k268j576j137q93o04k68
61959C67843l03q86j353q71L17J053Q24M13P02J506K125K418K661K859K935L258
61943C85501M204N324N778N575N701O878Q829J0914J2820J4384J5299J5449J5197
$$ plain form
62041 1185086 1145211 1102254 1057190 1010589 963290 916382 870649 826402 783940 743945 707237
62030 707237 674340 645455 620729 600207 583412 569230 556540 544855 534221 524591 515666 507392
62018 507392 500192 494462 489981 486097 482370 478824 475598 472620 469672 466682 463914 461887 460957 460893 461026
62003 461026 461064 461573 463340 466356 469814 473093 476296 479697 483163 486423 489499 492470 495019 496622 497066
61988 497066 496473 494979 492763 490202 487485 484066 479006 471983 463608 454672 445524 436367 427641 419722
61974 419722 412511 405736 399466 393997 389346 385177 381238 377618 374589 372321 370745 369608 368715 368111 367843
61959 367843 367540 366654 365301 364430 364747 365800 366624 367037 367739 369245 371370 373788 376449 379308 382243 385501
61943 385501 389705 395029 400807 406382 412083 418961 427790 438704 451524 465908 481207 496656 511853
61930E11853J4956J4640J3864J2566J1149J0074R422Q893Q051O672M860K798M83
61917F30281k163m899p149q451q804q462p526n843l369n27J983L928N957Q805
61903E93761J2063J4311J4793J4388J4384J4688J4029J1643P986L873j55l579
61891G12185n956p626r500j1731j3310j3490j2909j2632j2672j2241j1106r808
61879E79204q708p618o448n533n217n521o340p492q546r054r032q818q354p116
61865D75407m928k465o63K10O02J065J813K758L723M567N299O099P187Q703J0615
61850E19992J2798J5160J7642K0088K2139K3541K4467K5304K5995K5942K4772
61839G57840K2818K0468J7331J2650O615O62l777o603q847j1276j3434j4098j2614
$$ plain form
61930 511853 526809 541449 555313 567879 579028 589102 598524 607417 615468 622140 627000 629798 630281
61917 630281 628118 623219 616070 607619 598815 590353 582827 576984 573615 573088 575071 578999 584956 593761
61903 593761 605824 620135 634928 649316 663700 678388 692417 704060 712046 715919 715764 712185
61891 712185 706229 698603 689103 677372 664062 650572 637663 625031 612359 600118 589012 579204
61879 579204 570496 562878 556430 550897 545680 540159 533819 526327 517781 508727 499695 490877 482523 475407
61865 475407 470479 468014 467351 467561 468163 469228 471041 473799 477522 482089 487388 493487 500674 509377 519992
61850 519992 532790 547950 565592 585680 607819 631360 655827 681131 707126 733068 757840
61839 757840 780658 801126 818457 831107 837722 838384 834607 828004 819157 807881 794447 780349 767735
61826G67735r670o601l971j158K483O504R811J1983J3459J4534J4701J3268J0144
61813H43222N740M71n262j0847j5633j9350k2230k4590k6419k7379k7221k6184
61801F44318k4835k3438k1717j9483j7185j5440j4155j2664j0750q927p598o553
61789D61573n541m767m417m255m061m082m472m679m105l019k214j890j588j163
61775D11320r82j020o29L91J137O56p38j787j831j472j606k204k312j234N02J525
61759C99716J049k44r55m94N15J239J455J293P44m4m60j8Q88J386J182P33M27
61742D08412J11m38j045j423j545j578j659j871k213k479k400j966j314l61J033
61727C89264K411K896K286J526J546K101K274J837J434J560K026K456K718K771
$$ plain form
61826 767735 758065 751464 747493 746335 748818 755322 765133 777116 790575 805109 819810 833078 843222
61813 843222 848962 849433 844171 833324 817691 798341 776111 751521 725102 697723 670502 644318
61801 644318 619483 596045 574328 554845 537660 522220 508065 495401 484651 475724 468126 461573
61789 461573 456032 451265 446848 442593 438532 434450 429978 425299 421194 418175 415961 414071 412483 411320
61775 411320 410338 409318 408689 409080 410217 410873 410135 408348 406517 405045 403439 401235 398923 397689 398191 399716
61759 399716 400765 400521 399566 399072 399587 400826 402281 403574 404318 404274 403814 403796 404684 406070 407252 407985 408412
61742 408412 408523 408085 407040 405617 404072 402494 400835 398964 396751 394272 391872 389906 388592 388231 389264
61727 389264 391675 394571 396857 398383 399929 402030 404304 406141 407575 409135 411161 413617 416335 419106
61713D19106K589K382K478K768K704K045J223P59O54N45J77n56j676k959l904
61698D28335m223m170m208m411m463m094l344k547k141k397l094l640l646l274
61684C78683k939k842k872k767k275j413o63n95j170j788k151k530k978k863j762
61669C47075l87R9n21j421j881j861j524r40l34n0q1m6K24M84N23M15K73K03M89
61650C40739J274K053K055J298O75Q09J405J965K476L009L227K891K422K387K748
61635C71433L065L173L109K678J681M06o48j445k290l158l641l574l184k612j879
61620C63114j281j286j808k129j824j327j245j461j368q12l68n95j393k139k378
61605C41700k223k172k620l541m571n382n856o003n829n309m455l365k234j336
$$ plain form
61713 419106 421695 424077 426555 429323 432027 434072 435295 436054 436708 437253 437430 436874 435198 432239 428335
61698 428335 424112 419942 415734 411323 406860 402766 399422 396875 394734 392337 389243 385603 381957 378683
61684 378683 375744 372902 370030 367263 364988 363575 362912 362317 361147 359359 357208 354678 351700 348837 347075
61669 347075 346688 346787 346266 344845 342964 341103 339579 338639 338305 338255 338174 338128 338352 338836 339359 339774 340047 340250 340739
61650 340739 342013 344066 346121 347419 348094 348903 350308 352273 354749 357758 360985 363876 366298 368685 371433
61635 371433 374498 377671 380780 383458 385139 385545 384897 383452 381162 378004 374363 370789 367605 364993 363114
61620 363114 361833 360547 358739 356610 354786 353459 352214 350753 349385 348573 348205 347610 346217 344078 341700
61605 341700 339477 337305 334685 331144 326573 321191 315335 309332 303503 298194 293739 290374 288140 286804
61591B86804r62j293k227l233l570k930j914j525k051k695k548j667q47n43n19
61576B58280n26p09j190j638j666j410j313j525j819k061k337k517k135r94L69
61561B36809J202J392J462J689J786J538J263J277J270P89O8j93K38R85J783K641
61545B55999L237K979K032J431J669J888J200J37j44L64N99J76j54J11M53L68
61529B72345K79P35J364J393Q02L11L38N30L03n45j720k656k856k296j474q64
61513B65989n02j73J44K63R3k90p62j103j014m15L68R10J094R74N00l08r89r51
61495B63828k77J75k90j353k072k043j774j792j771j018L13J142R21N03R57J945
61479B57394K177J396Q09J286K182K505K410K610K915K529J461N81K75L5l97n07
$$ plain form
61591 286804 285842 284549 282322 279089 275519 272589 270675 269150 267099 264404 261856 260189 259342 258799 258280
61576 258280 257754 257045 255855 254217 252551 251141 249828 248303 246484 244423 242086 239569 237434 236440 236809
61561 236809 238011 239403 240865 242554 244340 245878 247141 248418 249688 250477 250545 250352 250590 251575 253358 255999
61545 255999 259236 262215 264247 265678 267347 269235 270435 270572 270428 270792 271391 271567 271413 271524 271977 272345
61529 272345 272624 273359 274723 276116 276918 277229 277567 278097 278400 277855 276135 273479 270623 268327 266853 265989
61513 265989 265487 265314 265458 265721 265814 265524 264762 263659 262645 262230 262598 263508 264602 265576 266076 265768 264779 263828
61495 263828 263551 263726 263436 262083 260011 257968 256194 254402 252631 251613 251926 253068 253989 254492 255449 257394
61479 257394 259571 260967 261776 263062 265244 267749 270159 272769 275684 278213 279674 280255 280530 280565 280168 279661
61463B79661j5L95lq68j208o76J98P91R71Q87O90M77L23K84M50Q86J421J658J410
61444B87732R65P53Q18Q22N19N3j82J20R19J782K233K247K290K763L438L668L054
61427C13994J887R60R10J612K153J707N08k78J30J224J888J734J393J480J793
61412C33095J701J022K32j00J25N45P33M71k64j291k199k552k384k289k676l065
61396C21104k735j939j795k660l405k876j533q13j167j651j432p70k44J66P59
61381B99009J382J583J237O27P5j84pM28O56M93M35J063K149K759K301J135J38
61364C15279r3M18J182J665J732J748K076K512K489J901J416J718K714L734M374
61349C44865M759N056N148N020N060N626O445O787O321N442M701M209L795L465
$$ plain form
61463 279661 279646 280041 280038 279170 277962 277286 277484 278275 279246 280133 280823 281300 281623 281907 282357 283243 284664 286322 287732
61444 287732 288697 289450 290268 291090 291609 291662 291480 291600 292519 294301 296534 298781 301071 303834 307272 310940 313994
61427 313994 315881 316841 317751 319363 321516 323223 323731 323453 323583 324807 326695 328429 329822 331302 333095
61412 333095 334796 335818 336050 335950 336075 336620 337353 337824 337560 336269 334070 331518 329134 326845 324169 321104
61396 321104 318369 316430 314635 311975 308570 305694 304161 303348 302181 300530 299098 298328 298084 298250 299009
61381 299009 300391 301974 303211 303838 303913 303729 303722 304150 304806 305299 305734 306797 308946 311705 314006 315141 315279
61364 315279 315186 315604 316786 318451 320183 321931 324007 326519 329008 330909 332325 334043 336757 340491 344865
61349 344865 349624 354680 359828 364848 369908 375534 381979 388766 395087 400529 405230 409439 413234 416699
61335D16699L345L315L075K606K326K554L040L154K571J629R71Q40Q09L26n62
61320D46698j236j285r19n28k13J0m1l43l61L49J409K121K527L276M496N613O462
61303D68035P662R491J1122J1659J1263J0623R750Q094N625L029R19n98j634k393
61289E52647l221m296n294n865o247o881p556p658p245p084p465p728p200o055
61275D62852m849l791k830k024j390p24O4P28J084J322J662K013K285K652L175
61260D62229L501L409L321L851M939N902O211N919N432N150N219N377N185M593
61246E30238M086M030M127L853L184K464J797R85n4j215k408l458l981l822l461
61231E36365l460l646l398k653j952j484p46O08K178L420M316N135N881O326O295
$$ plain form
61335 416699 420044 423359 426434 429040 431366 433920 436960 440114 442685 444314 445285 446125 446934 447260 446698
61320 446698 445462 444177 443258 442730 442517 442527 442486 442143 441782 442131 443540 445661 448188 451464 455960 461573 468035
61303 468035 475697 485188 496310 507969 519232 529855 539605 547699 553324 556353 557272 556674 555040 552647
61289 552647 549426 545130 539836 533971 527724 520843 513287 505629 498384 491300 483835 476107 468907 462852
61275 462852 458003 454212 451382 449358 447968 447244 447308 448036 449120 450442 452104 454117 456402 459054 462229
61260 462229 465730 469139 472460 476311 481250 487152 493363 499282 504714 509864 515083 520460 525645 530238
61246 530238 534324 538354 542481 546334 549518 551982 553779 554764 554710 553495 551087 547629 543648 539826 536365
61231 536365 532905 529259 525861 523208 521256 519772 519026 519634 521812 525232 529548 534683 540564 546890 553185
61216E53185N763M950M490N034O395P491P493O676N796N035M108L069K389K207
61202F24081K036J428N65R0M62J583K972M274N546O963Q354R383J0116J0912J1627
61187G00392J1456R980P778N617L536J445Lj9R24J451R44K1p37j582k776l866
61171G34567m361m385m201l667k796k189k295k724l042l688n201o924p630p367
61157F74097p549q975j0699j1316j0629r458q431p574o791o105n473m781m047
61144E72269l407k973k878l265m078n014n858o657p385p659p099n837m444l371
61130E02344k662k095j460o94R7P94J468K295L273M278N403O899Q690J0301J1559
61115E50490J2889J4615J6312J7405J8123J9239K0937K2588K3638K4161K4298
$$ plain form
61216 553185 558948 563898 568388 573422 579817 587308 594801 601477 607273 612308 616416 619485 621874 624081
61202 624081 626117 627545 628110 628200 628662 630245 633217 637491 643037 650000 658354 667737 677853 688765 700392
61187 700392 711848 721828 729606 735223 738759 740204 740207 740188 741112 742563 743507 743528 742791 741209 738433 734567
61171 734567 730206 725821 721620 717953 715157 712968 710673 707949 704907 701219 696018 689094 681464 674097
61157 674097 666548 657573 646874 635558 624929 615471 607040 599466 592675 586570 581097 576316 572269
61144 572269 568862 565889 563011 559746 555668 550654 544796 538139 530754 523095 515996 510159 505715 502344
61130 502344 499682 497587 496127 495433 495530 496324 497792 500087 503360 507638 513041 519940 528630 538931 550490
61115 550490 563379 577994 594306 611711 629834 649073 670010 692598 716236 740397 764695
61104G64695K3856K2821K1750K1077K0297J8518J5760J3108J1252R477O575K581
61092I51767j138l595n324p414r969j2244j4005j5777j7640j8715j8376j7321
61080H10249j6830j7273j7942j8072j7487j6450j5393j4700j4308j3617j2179
61069F35998j0260q404o776n414m656m654m739m072k738j449l38J031K583L656
61055E89768M141M674N535O315O952Q037R702J1164J1945J2609J3698J4829J5623
61042G14992J6624J8414K0529K2235K3729K5568K7506K9051L0779L3718L7620
61031A000765M1060M3400M5474M8039N0546N2001N2303N2293N2919N4827N8311
61020A551938O3315O9560P6780Q4667R2707J00527J08539J18102J31211J50103
$$ plain form
61104 764695 788551 811372 833122 854199 874496 893014 908774 921882 933134 942611 949186 951767
61092 951767 950629 947034 941710 934296 924327 912083 898078 882301 864661 845946 827570 810249
61080 810249 793419 776146 758204 740132 722645 706195 690802 676102 661794 648177 635998
61069 635998 625738 617334 610558 605144 600488 595834 591095 587023 584285 582836 582498 583529 586112 589768
61055 589768 593909 598583 604118 610433 617385 625422 635124 646288 658233 670842 684540 699369 714992
61042 714992 731616 750030 770559 792794 816523 842091 869597 898648 929427 963145 1000765
61031 1000765 1041825 1085225 1130699 1178738 1229284 1281285 1333588 1385881 1438800 1493627 1551938
61020 1551938 1615253 1684813 1761593 1846260 1938967 2039494 2148033 2266135 2397346 2547449
61010B547449J77007K14073K63945L30117M15396N19515O39887P75861R30628
61001F813878J107596J307163J527790J760815J969039K068781J955430J577880
60993B0088372J002333L95233p0582l03703l07465j39170J16434L40488L90547
60984B1512487J65031l21775r32805j486359j853227j998780j960184j801521
60976A1322867j583614j352357j135630r45116p82583o46140n32742m38783l61312
60967C544590k98616k48921k09538j78098j53518j34762j19593j05738r2624q0909
60957A922273p0711o1291n2073m3081l4614k7229k1744j8516j6946j6248j6315
60946A543505j7194j8199j8438j7960j7596j7815j8548j9934k2376k5784k9419
$$ plain form
61010 2547449 2724456 2938529 3202474 3532591 3947987 4467502 5107389 5883250 6813878
61001 6813878 7921474 9228637 10756427 12517242 14486281 16555062 18510492 20088372
60993 20088372 21090705 21485938 21415356 21111653 20804188 20665018 20781452 21121940 21512487
60984 21512487 21677518 21355743 20422938 18936579 17083352 15084572 13124388 11322867
60976 11322867 9739253 8386896 7251266 6306150 5523567 4877427 4344685 3905902 3544590
60967 3544590 3245974 2997053 2787515 2609417 2455899 2321137 2201544 2095806 2003182 1922273
60957 1922273 1851562 1790271 1738198 1695117 1660503 1633274 1611530 1593014 1576068 1559820 1543505
60946 1543505 1526311 1508112 1489674 1471714 1454118 1436303 1417755 1397821 1375445 1349661 1320242
60935A320242l2598l5032l6514l6943l6682l6364l6189l5859l5181l4347l3565
60924I30968l2795l1845l0466k8523k6361k4752k3993k3304k1693j9235j6913
60913F51088j5318j4163j3039j1952j0956r904q737p620o645n710m780l907k992
60900E35365j899p66J44Q59J537J987J878J337Q57O36M98M04M49L90k01j299k473
60883E39703l584m773n753n909n289m745m818n104n070m828m741m823m965n224
60869D70077n551n591n210m774m609m539m293l893l359k534j541r64j076j435
60855D20708j597j760k123k271j797j156j076j457j596j328j168j347j526j412
60841C99094j136r05q24j099j818k573k841k741k816l051k841k101j616j855k111
$$ plain form
60935 1320242 1287644 1252612 1216098 1179155 1142473 1106109 1069920 1034061 998880 964533 930968
60924 930968 898173 866328 835862 807339 780978 756226 732233 708929 687236 668001 651088
60913 651088 635770 621607 608568 596616 585660 575756 567019 559399 552754 547044 542264 538357 535365
60900 535365 533466 532700 532844 533703 535240 537227 539105 540442 541299 541935 542433 542837 543286 543676 543475 542176 539703
60883 539703 536119 531346 525593 519684 514395 509650 504832 499728 494658 489830 485089 480266 475301 470077
60869 470077 464526 458935 453725 448951 444342 439803 435510 431617 428258 425724 424183 423219 422143 420708
60855 420708 419111 417351 415228 412957 411160 410004 408928 407471 405875 404547 403379 402032 400506 399094
60841 399094 397958 397053 396229 395130 393312 390739 387898 385157 382341 379290 376449 374348 372732 370877 368766
60826C68766j503l08M23L69L00Q92J859K484K555K393K263K148K017J913J694
60811C88265J075Q9p51j008q80q97j165j324j231j182j361j517j467j477j731
60796C73438j790j180l43l20j412k746l371l365l423l795m077l926l528l272l259
60781C33631l297l170k797k280j885j805j841j489o13J34Jp55r73MJ487K438K756
60764C19546K942K888K025O90K19J226K625L042K575K291K515K579K123J654J666
60749C50606J952K138K263K479K570K218J478P35L44L99O65N94l02j888l479m593
60733C58179n362o031o402o167n542n157n324n754o024n936n419m337k733j122
60719B86869k30l48j064j638j632j039q8R12J529J366M65o27j379j679j646j234
$$ plain form
60826 368766 367263 366955 367378 367747 368047 368939 370798 373282 375837 378230 380493 382641 384658 386571 388265
60811 388265 389340 389429 388678 387670 386790 385893 384728 383404 382173 380991 379630 378113 376646 375169 373438
60796 373438 371648 370468 370125 369805 368393 365647 362276 358911 355488 351693 347616 343690 340162 336890 333631
60781 333631 330334 327164 324367 322087 320202 318397 316556 315067 314454 314588 314589 313834 312861 312865 314352 316790 319546
60764 319546 322488 325376 327401 328091 328310 329536 332161 335203 337778 340069 342584 345163 347286 348940 350606
60749 350606 352558 354696 356959 359438 362008 364226 365704 366439 366783 367182 367847 368441 368139 366251 362772 358179
60733 358179 352817 346786 340384 334217 328675 323518 318194 312440 306416 300480 295061 290724 287991 286869
60719 286869 286639 286291 285227 283589 281957 280918 280830 281742 283271 284637 285102 284475 283096 281417 279771 278537
60703B78537m57K96N62M64N33Q19P30K8m86J30J562K382J730M14jJ058K667L631
60685B94599L810L935M380M615M096L253L063L795M661M927M760M684M587L912
60671C53077K764K095K509L249K997J514o1o97p61j366k741l914m063l577l375
60656C47650l610l646l101k277j559r52m40k34l45k62M60J522K189K192J933J742
60640C41262J329K50j326k613k992k668k421k685l096l035k476j965j813j734
60626C14017j428j115j148j393j419j080n39J82J121J908J992J442J030J179J322
60611C16071P76j18l61L32J074R48J34l93n3P00R62L58n46q38k21O51R11M58O9
60592C20914M46J361J907J533N85j81m45m87o49q53q01m52r8oj58l59l83pQ79
$$ plain form
60703 278537 278080 278376 278938 279402 279935 280754 281484 281512 281026 281156 282718 285100 286830 287244 287243 288301 290968 294599
60685 294599 298409 302344 306724 311339 315435 318688 321751 325546 330207 335134 339894 344578 349165 353077
60671 353077 355841 357936 360445 363694 366691 368205 368144 367447 366686 365320 362579 358665 354602 351025 347650
60656 347650 344040 340394 337293 335016 333457 332505 332065 331831 331486 331224 331684 333206 335395 337587 339520 341262
60640 341262 342591 342841 341515 338902 335910 333242 330821 328136 325040 322005 319529 317564 315751 314017
60626 314017 312589 311474 310326 308933 307514 306434 305895 306077 307198 309106 311098 312540 313570 314749 316071
60611 316071 316847 316729 316368 316700 317774 318722 318856 318463 318410 319110 320072 320430 319884 319046 318825 319476 320387 320845 320914
60592 320914 321360 322721 324628 326161 326746 326565 326120 325633 324984 324131 323330 322878 322780 322774 322616 322257 321874 321867 322746
60573C22746K055L066L715M284N037N791O254O617P292Q174Q641Q420P923P528
60559D07543O976N762L752J120j882m673o342o496n858n442n211m315k540p57
60545C81637L09J055K330M260O218P659Q548R190R947J1008J2167J2880J2766
60532D79974J1854J0283Q039N272K502J64j820l596m810n005m475m127m423m962
60518D84870n202n102m828m286l314k090r52K7R67J764K132K085K106K601L440
60503D74218M235N045O499R097J2632J6471K0233K3874K7276L0186L2632L4900
60491F97298L6813L7470L6053L2606K7732K1760J4715O805j627j0432j9323k7245
60479H52625l2898l6059l7706l8507l7900l5204l1128k7332k4686k2665k0405
$$ plain form
60573 322746 324801 327867 331582 335866 340903 346694 352948 359565 366857 375031 383672 392092 400015 407543
60559 407543 414519 420281 424033 425153 423271 418598 412256 405760 399902 394460 389249 384934 382394 381637
60545 381637 381946 383001 385331 389591 395809 403468 412016 421206 431153 442161 454328 467208 479974
60532 479974 491828 502111 510150 515422 517924 518088 516268 512672 507862 502857 498382 494255 489832 484870
60518 484870 479668 474566 469738 465452 462138 460048 459096 459123 460090 461854 463986 466071 468177 470778 474218
60503 474218 478453 483498 489997 499094 511726 528197 548430 572304 599580 629766 662398 697298
60491 697298 734111 771581 807634 840240 867972 889732 904447 911252 909625 899193 879870 852625
60479 852625 819727 783668 745962 707455 669555 634351 603223 575891 551205 528540 508135
60468E08135j7765j5179j3045j1541j0727j0416j0103r327q087o750n610m640
60456C84945l723k937k503k488k587k363j713j102j123j880k842l429l536l396
60442C49323l090k493j680j024p25n18j25J94p9r19j710j995j905j701j366r20
60426C29267p01q86j051o99j9M09N15P28J145J330J075P37O61P28P36P30P17N06
60408C35928J27p5knj50R8R81J834J969J672J620J758J635J530K106L099L470
60391C57595K996K630K939L248K856K102J534R26Q8j31J111L024L826L013J884
60376C89641J681K196K588K689K895L329L681L637L157K524K271K635L047K645
60362D28616J518P79J138J979K406K496K852L454L815M059M890O546Q529J0371
$$ plain form
60468 508135 490370 475191 462146 450605 439878 429462 419359 410032 401945 395195 389585 384945
60456 384945 381222 378285 375782 373294 370707 368344 366631 365529 364406 362526 359684 356255 352719 349323
60442 349323 346233 343740 342060 341036 340311 339793 339668 339862 339783 338864 337154 335159 333254 331553 330187 329267
60426 329267 328566 327680 326629 325930 325911 326320 326835 327563 328708 330038 331113 331850 332511 333239 333975 334705 335422 335928
60408 335928 336055 335980 335978 335973 335823 335921 336902 338736 340705 342377 343997 345755 347390 348920 351026 354125 357595
60391 357595 360591 363221 366160 369408 372264 374366 375900 376826 376914 376783 377894 380918 384744 387757 389641
60376 389641 391322 393518 396106 398795 401690 405019 408700 412337 415494 418018 420289 422924 425971 428616
60362 428616 430134 430913 432051 434030 436436 438932 441784 445238 449053 453112 458002 464548 473077 483448
60348D83448J1930J2909J2852J1835J0430Q763O333L059k63k951n236p496r315
60335E36298j0031r789r289q740p822o524n317m462l806l307l203l549m058m538
60321D51863n056n537n637n176m320l196j735l9J449K463L282M365N818P483R381
60306D55408J1782J4817J8166K1086K2858K3296K2712K1186J8101J2858N968j110
60294F47128p333j2737j7514k1137k2867k2782k1697k0218j8378j6100j3523j0830
60282D42012q131n603l522k087j321j064r50n43K19P77M88n86j658k059j865j593
60266D12514j549j637j697j780j989k249k365k299k146j876j371q90j048j891
60252C87727k371j431M62J670J392M74o8l30p20p92K6J119J315O81M77J251K148
$$ plain form
60348 483448 495378 508287 521139 532974 543404 552167 558500 561559 561296 558345 553109 545613 536298
60335 536298 526267 516478 507189 498449 490627 484103 478786 474324 470518 467211 464008 460459 456401 451863
60321 451863 446807 441270 435633 430457 426137 422941 421206 421167 422616 425079 428361 432726 438544 446027 455408
60306 455408 467190 482007 500173 521259 544117 567413 590125 611311 629412 642270 648238 647128
60294 647128 639795 627058 609544 588407 565540 542758 521061 500843 482465 466365 452842 442012
60282 442012 433881 428278 424756 422669 421348 420284 419334 418791 419010 419787 420275 419689 418031 415972 414107 412514
60266 412514 410965 409328 407631 405851 403862 401613 399248 396949 394803 392927 391556 390666 389618 387727
60252 387727 385356 383925 384387 386057 387449 387923 387855 387525 386805 386013 386039 387158 388473 389154 389631 390882 393030
60235C93030K317K011J737J335N55j56k99j78l94p86o63J19R75J389J244N65m83
60218D02318j270j058J69J669K751L231L201K878K784L393M434N088N094N094
60204D39776N532N879N498M768M623N181N666N607N439N653N997N890N253M521
60190E15283L987L505K811J876J014O42R18J452J491N50j139k808l782l891l524
60175E18385l373l954n070n842n526m362l408l441m125m458l937l100k870l441
60161D61478m080m048l438k793k179j081O10K105K478J724O56K2J3M63J062J421
60145D54413J316R31O06L94K03K54Q94J964K787L049L228L919N042N983O233N751
60129D96967M883M173L930L864L376K355J332O70Q9p05j391j453r32k16O19J682
$$ plain form
60235 393030 395347 397358 399095 400430 400985 400829 400530 400352 399958 399172 398509 398628 399603 400992 402236 402801 402318
60218 402318 401048 399990 400159 401828 404579 407810 411011 413889 416673 420066 424500 429588 434682 439776
60204 439776 445308 451187 456685 461453 466076 471257 476923 482530 487969 493622 499619 505509 510762 515283
60190 515283 519270 522775 525586 527462 528476 529118 530036 531488 532979 533529 532390 529582 525800 521909 518385
60175 518385 515012 511058 505988 500146 494620 490258 486850 483409 479284 474826 470889 467789 464919 461478
60161 461478 457398 453350 449912 447119 444940 443859 444469 446574 449052 450776 451432 451454 451467 451930 452992 454413
60145 454413 455729 456660 457266 457660 457863 458117 459011 460975 463762 466811 470039 473958 479000 484983 491216 496967
60129 496967 501850 506023 509953 513817 517193 519548 520880 521550 521639 520934 519543 518090 517158 516942 517561 519243
60113E19243K663L016K714K314K209K306K442K607K652K262J467P14L15J04j38
60098E46890l62n05p61j287j914k416k841l282l510l114j966m51P10Q16l16j999
60082E23692l058k836j705m86M18J093J550J575J030Q2r27j685k094k377k914
60067E11358l758m460m653m596m842n410n740n475m916m523m414m477m644m772
60053D44678m516l712k665j742q81J08R14J043P08P47J375J774J372R42J582L001
60037D44728L775L322K660K864L657M110L986L698L329K602J668J111J113J117
60023D83740M73r65k853m470n019m347l449l549m656n602n658n351n435n842o158
60008D20859o368o547o256n161l835l188l234l208k816k562k714k735k052q71
$$ plain form
60113 519243 521906 524922 527636 529950 532159 534465 536907 539514 542166 544428 545895 546609 546924 547028 546890
60098 546890 546528 546023 545262 543975 542061 539645 536804 533522 530012 526898 524932 524481 525191 526007 525691 523692
60082 523692 520634 517798 516093 515607 516025 517118 518668 520243 521273 521355 520428 518743 516649 514272 511358
60067 511358 507600 503140 498487 493891 489049 483639 477899 472424 467508 462985 458571 454094 449450 444678
60053 444678 440162 436450 433785 432043 431162 431270 432184 433227 433935 434682 436057 437831 439203 440145 441727 444728
60037 444728 448503 451825 454485 457349 461006 465116 469102 472800 476129 478731 480399 481510 482623 483740
60023 483740 484213 483248 480395 475925 470906 466559 463110 459561 454905 449303 443645 438294 432859 427017 420859
60008 420859 414491 407944 401688 396527 392692 389504 386270 383062 380246 377684 374970 372235 370183 369312
59994C69312J62P01P92N83K36p4l02m88l99L77J775K965L177K583K014J942K117
59977C87473K205K198K151J897J343P82N21L26l51j571k651k902k414j789j344
59962C85874r26n13m03o64p60k31N36O78k3r11j403j597j754j668j071l08m3k97
59944C74516l67J92R74J362J380J454J630J513R75M04J03j66o90j191j139o10
59928C80340l41p59j339j170jJ520K553K822K678K675L142M002M915N608O099
59913D12744O539O826O556N396L528J595K11m02l57J39Q08J247J103M72j03k26
59897D46076r5j21l32l98k29m0J42O01J331J753J463R58J146K288L794M951N477
59880D68765N447N114M804M598M140L179K249K224L070L637L033J669N11k94j325
$$ plain form
59994 369312 369474 370175 370967 371550 371786 371712 371410 370922 370523 370900 372675 375640 378817 381400 383414 385356 387473
59977 387473 389678 391876 394027 395924 397267 398049 398570 398896 398545 396974 394323 391421 389007 387218 385874
59962 385874 384948 384435 384032 383368 382608 382377 382913 383591 383568 382657 381254 379657 377903 376235 375164 374856 374813 374516
59944 374516 374149 374341 375315 376677 378057 379511 381141 382654 383629 384033 384136 383970 383280 382089 380950 380340
59928 380340 379999 379240 377901 376731 376730 378250 380803 383625 386303 388978 392120 396122 401037 406645 412744
59913 412744 419283 426109 432665 438061 441589 443184 443395 442993 442636 442775 443583 444830 445933 446405 446302 446076
59897 446076 445981 445860 445528 445130 444901 444861 445003 445604 446935 448688 450151 451109 452255 454543 458337 463288 468765
59880 468765 474212 479326 484130 488728 492868 496047 498296 500520 503590 507227 510260 511929 512440 512146 510821
59865E10821k724l812m059l805l732l900l691k610r12O05J382J611K002L038M597
59850D94811O250P772R149J0238J0589R683P271L704j6k717l874l858l260k252
59836E43490r94l08j203l671o508q537r495r574q690o806m552k868k042j563r52
59821D75727l30r5l97j038j676j978j803j352j059j200j644j996j969j584j114
59806D56492q27p83q46r00r07q57p62p55r58j244j389j491j877k453k561j886
59790D35996j049q68j271j535j335j012q33p13o65q82j205j145o88m98r93j736
59774D19568k090k047j905j591q51Q7O23N00P4r5L49J386K512L017K703K256K529
59757D27025L452M104L813K935K385K670L464L999L808L117K534K370K489K776
$$ plain form
59865 510821 508097 504285 500226 496421 492689 488789 485098 482488 481576 482181 483563 485174 487176 490214 494811
59850 494811 501061 508833 517982 528220 538809 548492 555763 559467 559451 556734 552860 549002 545742 543490
59836 543490 542496 542188 540985 537314 530806 522269 512774 503200 494510 487704 483152 480284 478242 476679 475727
59821 475727 475397 475302 474905 473867 472191 470213 468410 467058 465999 464799 463155 461159 459190 457606 456492
59806 456492 455665 454882 454036 453136 452229 451372 450610 449855 448897 447653 446264 444773 442896 440443 437882 435996
59790 435996 434947 434079 432808 431273 429938 428926 428093 427380 426715 425833 424628 423483 422795 422297 421304 419568
59774 419568 417478 415431 413526 411935 411084 411171 411794 412294 412368 412273 412622 414008 416520 419537 422240 424496 427025
59757 427025 430477 434581 438394 441329 443714 446384 449848 453847 457655 460772 463306 465676 468165 470941
59743D70941L394M395N340N618N047L957K832K049J715J614J455J299J387J505
59729E12548R93k20j189j097l98j15m13o45n92p32j218j468j028k30L27M47K27
59712E05197k02o30q07p70p75q22o66l76m17q93j238q89%P92J038P13J25k59j82
59693D98939J54M29P99J667K861L577L363K612J883J219M67k19n95o86o44o06
59677E15220q58j707k858l415k894j931j550k080l080l968m352m126l624l406
59663D75371l556l535l008k344j973j759j434j124r02l84N75J281J112O60J028
59648D60008K181K917K615K048K232L055L480K724R64r10k117k636k991l333l164
59633D67073k266j409j474k123k165j176j2L95R0k72l15j47p5l55j009j757k310
$$ plain form
59743 470941 474335 478730 484070 489688 494735 498692 501524 503573 505288 506902 508357 509656 511043 512548
59729 512548 513541 513321 512132 511035 510637 510522 510109 509464 508872 508140 506922 505454 504426 504196 504523 504970 505197
59712 505197 504995 504365 503558 502788 502013 501191 500525 500149 499732 498839 497601 496712 496712 497504 498542 499255 499380 499121 498939
59693 498939 499093 499522 500321 501988 504849 508426 511789 514401 516284 517503 517970 517751 517156 516470 515826 515220
59677 515220 514362 512655 509797 506382 503488 501557 500007 497927 494847 490879 486527 482401 478777 475371
59663 475371 471815 468280 465272 462928 460955 459196 457762 456638 455736 455352 455927 457208 458320 458980 460008
59648 460008 462189 465106 467721 469769 472001 475056 478536 481260 482224 481314 479197 476561 473570 470237 467073
59633 467073 464807 463398 461924 459801 457636 456460 456448 456843 456933 456661 456346 456199 456124 455769 454760 453003 450693
59616D50693k620k715k520k124j919k080k161j789j416j702k282k084q28N88J361
59601D26402J660J960K206K104J703J347J324J729K277K230J060o53j609j277
59587D42463m39o3k11m00m28m11m04m18n24p05q82j161j644j935j487o08l68j176
59569D29199k090k082j363q52q56r39p76m75k35j57k94m88l79J29O49Q23P33N39
59551D21086J91k27k82K20R04J429J950K557K878K786K944L976N531O953Q364
59536D61260J0295J2666J5064J7534J9898K0498J7043R186n23q676j3345j4495
59524E46405j3150j0677q157n854l544j453k06K28P59J923L101L437K853J669
59510E17334r5k272m020m623m528m752n381n543m901m315m658n617o113n562m327
$$ plain form
59616 450693 448073 445358 442838 440714 438795 436715 434554 432765 431349 429647 427365 425281 424453 425041 426402
59601 426402 428062 430022 432228 434332 436035 437382 438706 440435 442712 444942 446002 445349 443740 442463
59587 442463 442024 441961 441750 441350 440922 440511 440107 439689 439165 438460 437578 436417 434773 432838 431351 430743 430375 429199
59569 429199 427109 425027 423664 422812 421956 421017 420241 419766 419531 419374 419080 418592 418213 418342 418991 419814 420547 421086
59551 421086 421277 421050 420768 420988 421892 423321 425271 427828 430706 433492 436436 440412 445943 452896 461260
59536 461260 471555 484221 499285 516819 536717 557215 574258 583444 582921 574245 560900 546405
59524 546405 533255 522578 514421 508567 505023 503570 503364 503592 504351 506274 509375 512812 515665 517334
59510 517334 517239 514967 510947 506324 501796 497044 491663 486120 481219 476904 472246 466629 460516 454954 450627
59495D50627l112k341k022j953j939k005k295k743k934k517j632p44m8O50J441
59480D26433K030K212K291K704L381L864M027M244M760N251N205M506L531K823
59466D77262K741L089L090K060K84j106j356p93j26M63J169J911K409K643K824
59451D96564L021L240L751M852O417P984R163R620R028P462N590L902K033m76
59437E72151l071m642n069n386o235p084p207o695o065n508m978m558m262l843
59423D97548l114k077n88J578M050N964P117Q431J0731J3659J6352J8617K0792
59410E99060K3035K5505K8496L1183L0745K4388J2655l75j0576j6544j8827j7986
59398G10759j4479r409l959J648P249J0921R533J887r347j9531k5535k7123k5708
$$ plain form
59495 450627 447515 445174 443152 441199 439260 437255 434960 432217 429283 426766 425134 424390 424342 424992 426433
59480 426433 428463 430675 432966 435670 439051 442915 446942 451186 455946 461197 466402 470908 474439 477262
59466 477262 480003 483092 486182 488242 488526 487420 486064 485271 485145 485608 486777 488688 491097 493740 496564
59451 496564 499585 502825 506576 511428 517845 525829 534992 544612 553640 561102 566692 570594 572627 572151
59437 572151 569080 564438 559369 553983 547748 540664 533457 526762 520697 515189 510211 505653 501391 497548
59423 497548 494434 492357 491769 493347 497397 503361 510478 518909 529640 543299 559651 578268 599060
59410 599060 622095 647600 676096 707279 738024 762412 775067 774692 764116 747572 728745 710759
59398 710759 696280 686871 682912 684560 691809 702730 712263 714150 704803 685272 659737 632614 606906
59385F06906k2797j9530j6637j4193j1735q965o173l798j868k28R88J505J455
59372E04930J355J458J581J598J789K406L203L634L451K887K416K418L023M025
59358E40174M963N400N221M710M390M743N808P065P847Q009P997Q245Q695R043
59344F32310R212R315R404R452R516R709J0013J0283J0342R986R021P446N506
59331G51515L404J157j211l479n512p453r344j0820j1488j1535j1468j1358j0821
59318F61587r807q868q422q169p490o209m692l392k510j890j101K03J817L142
59304F04199L999N004O782R121J1242J2604J2799J0875N759k152j0477j6533j9310
59291F33912j9529j8246j6159j3989j2441j1426j0006p670n251l994l968m011
$$ plain form
59385 606906 584109 564579 547942 533749 522014 513049 506876 503078 501210 500982 501970 503475 504930
59372 504930 506285 507743 509324 510922 512711 515117 518320 521954 525405 528292 530708 533126 536149 540174
59358 540174 545137 550537 555758 560468 564858 569601 575409 582474 590321 598330 606327 614572 623267 632310
59344 632310 641522 650837 660241 669693 679209 688918 698931 709214 719556 729542 738563 746009 751515
59331 751515 754919 756076 754865 751386 745874 738421 729077 718257 706769 695234 683766 672408 661587
59318 661587 651780 642912 634490 626321 618831 612622 607930 604538 602028 600138 599037 599240 601057 604199
59304 604199 608198 613202 619984 629105 640347 652951 665750 676625 682384 680232 669755 653222 633912
59291 633912 614383 596137 579978 565989 553548 542122 532116 524446 519195 515201 511233 507222
59279E07222l239j982j097q01n71M2R40J827K722L970N714P566Q930R643J0057
59264E50943J0407J0384R653Q535P667P047N971M055J802j51j826l545n139o143
59250E99660o546o784o986o864o365n897n661n298m466l417k612k085j558r50
59236E34171l82J93J012K143L402M532N272N343M759M070L904M242M492M293L816
59221E85262L139J922K4j923l097l431l563l944m461m871n143n239m920m012k671
59206E43072j364o43q85j901k874l058k610k280k223j764o18L33R8r17j374p90
59190E20202r5k40j027j648j803j758j696j492j034l70L62Q57P38N7m07J08J373
59173E12127K394K650K634K976L600M107M553N280O152O668O844P337Q422R359
$$ plain form
59279 507222 503983 502001 500904 500103 499532 499574 500514 502341 505063 509033 514747 522313 531243 540886 550943
59264 550943 561350 571734 581387 589922 597589 604636 610607 614662 616464 616313 614487 610942 605803 599660
59250 599660 593114 586330 579344 572480 566115 560218 554557 549259 544793 541376 538764 536679 535121 534171
59236 534171 533789 533982 534994 537137 540539 545071 550343 555686 560445 564515 568419 572661 577153 581446 585262
59221 585262 588401 590323 590347 588424 585327 581896 578333 574389 569928 565057 559914 554675 549755 545743 543072
59206 543072 541708 541065 540180 538279 535405 532347 529737 527457 525234 523470 522852 523185 523283 522366 520992 520202
59190 520202 520107 519867 518840 517192 515389 513631 511935 510443 509409 509039 509401 510258 510996 511053 510646 510754 512127
59173 512127 514521 517171 519805 522781 526381 530488 535041 540321 546473 553141 559985 567322 575744 585103
59159E85103R223Q099O885O077N303M183L012K219J501R9k111m282n557o021o442
59144F07291p223q033q419q425q410q448q292p832p341p122p111o953o387n487
59130E01808m629m223m361m641m477l628k316q39O29J777K162J851J684K425L818
59115D87040M985N562N875O171O389O748P658Q780Q981P782O210N552N769N860
59101E79362N369M760M463M358M217L955L387K328J068K12o5j53l04l40j87j45
59085F12285l74n91o08p15j179j769k126k357k830l652m685n879p187q202q403
59070E61728p778o920o372o134n899n554n222m942m532l872l151k695k527k323
59056D93807j872j385j175j202j185j113j243j584j719j285m55L00P39R73J083
$$ plain form
59159 585103 594326 602425 609310 615387 620690 624873 627885 630104 631605 631704 629593 625311 619754 613733 607291
59144 607291 600068 592035 583616 575191 566781 558333 550041 542209 534868 527746 520635 513682 507295 501808
59130 501808 497179 492956 488595 483954 479477 475849 473533 472694 473323 475100 477262 479113 480797 483222 487040
59115 487040 492025 497587 503462 509633 516022 522770 530428 539208 548189 555971 562181 567733 573502 579362
59101 579362 584731 589491 593954 598312 602529 606484 609871 612199 613267 613479 613414 613261 612957 612617 612430 612285
59085 612285 611911 611320 610712 609997 608818 607049 604923 602566 599736 596084 591399 585520 578333 570131 561728
59070 561728 553950 547030 540658 534524 528625 523071 517849 512907 508375 504503 501352 498657 496130 493807
59056 493807 491935 490550 489375 488173 486988 485875 484632 483048 481329 480044 479589 479889 480628 481601 482684
59041D82684R01K69n56j010q64n46n96q84p98k08K75K58J83N11Q86P59N28J141
59023D82933K690M261N267O141P429Q960J0217J0970J1122J0535R375Q222P416
59010E85538O679N648M378K999J436j73j260j488j261j058p47mR80J833K677L820
58994F09997M999N611N549N211M824M284L596K838J868O23l65n11k24o56k198
58979F45446l911m703m496l828k928j658j02J425K857M427O195P816Q933R546
58965F65019R895J0070J0006R878J0126J0801J1109J0247Q538P102O340N463L946
58952G78540K409J401J25k528o168r366j1603j3423j4761j4682j3210j1923j1852
58939F72959j1988j0829q613o805o082n943n941o074o029n239l837k691k271k215
$$ plain form
59041 482684 483585 483854 483298 482288 481424 480878 480282 479398 478600 478392 478667 478925 479108 479619 480505 481264 481792 482933
59023 482933 485623 489884 495151 501292 508721 517681 527898 538868 549990 560525 569900 578122 585538
59010 585538 592217 597865 602243 605242 606678 606505 605245 603757 602496 601438 600691 600687 601667 603500 606177 609997
58994 609997 614996 620607 626156 631367 636191 640475 644071 646909 648777 649400 649035 648524 648300 647644 645446
58979 645446 641535 636832 632336 628508 625580 623922 623820 625245 628102 632529 638724 646540 655473 665019
58965 665019 674914 684984 694990 704868 714994 725795 736904 747151 755689 762791 769131 774594 778540
58952 778540 780949 782350 782475 779947 773779 764413 752810 739387 724626 709944 696734 684811 672959
58939 672959 660971 650142 641529 634724 628642 622699 616758 610684 604655 599416 595579 592888 590617 588402
58925E88402k152k198k366k252j693j105p87l90M26J300J554R85p9j207j885j646
58909E74907o19L36O82J019K215L920M889M779M705N715P498R086J0120J0800
58895F40052J1156J1155J1256J1934J2760J2750J1823J1164J1739J3070J3982
58884G72841J4209J4609J5860J7480J8314J7710J5979J3876J1856R776P257M133
58872I33900O52k721n659q151j0415j2503j4089j4759j4532j3922j3329j2656
58860H11816j1691j0588r670q981q372p943p929q242q582q978r696j0557j0852
58847F89735j0244r228q440p842p021n990n252n118n316n343n089m989n576o783
58833E97504p809p858o972n869n123m749m500m145l476k482j595j255j146m37
$$ plain form
58925 588402 586250 584052 581686 579434 577741 576636 575849 575459 575885 577185 578739 579724 579645 578438 576553 574907
58909 574907 574288 574624 575306 576325 578540 582460 587349 592128 596833 602548 610046 619132 629252 640052
58895 640052 651208 662363 673619 685553 698313 711063 722886 734050 745789 758859 772841
58884 772841 787050 801659 817519 834999 853313 871023 887002 900878 912734 922510 929767 933900
58872 933900 934552 931831 926172 918021 907606 895103 881014 866255 851723 837801 824472 811816
58860 811816 800125 789537 779867 770886 762514 754571 746642 738400 729818 720840 711144 700587 689735
58847 689735 679491 670263 661823 653981 646960 640970 635718 630600 625284 619941 614852 609863 604287 597504
58833 597504 589695 581837 574865 568996 563873 559124 554624 550479 547003 544521 542926 541671 540525 540088
58819E40088J050K452K952K742K557K732L116L550M010M400M592M555M334M091
58805E87221M091M262L920K523P10k50j54j75j132k441l196l419l615l939m492
58790E79914n618p099p825p156n861m892m005k680j467j095r00L05K242L530L777
58775E41170L833M065L984L523L173K659J009j783m448o152p170p620p039n646
58761E23558m633m485m343l669l225l574l933l452k573k048j610p00L30Q64J163
58746D87670J840K736L290L452L408K991K266K066K925M038M311L944L995M730
58732E33662N520O013O356O405N782M661L664L003K512K341K852L863M705N034
58718E96373M995M779M612M905N731O431O439O199O527P360P935P929P549O749
$$ plain form
58819 540088 541138 543590 546542 549284 551841 554573 557689 561239 565249 569649 574241 578796 583130 587221
58805 587221 591312 595574 599494 602017 602727 602477 602323 602148 601016 598575 595379 591960 588345 584406 579914
58790 579914 574296 567197 559372 552216 546355 541463 537458 534778 533311 532216 531316 531621 533863 537393 541170
58775 541170 545003 549068 553052 556575 559748 562407 563416 561633 557185 551033 543863 536243 529204 523558
58761 523558 518925 514440 510097 506428 503203 499629 495696 492244 489671 487623 486013 485313 485643 486507 487670
58746 487670 489510 492246 495536 498988 502396 505387 507653 509719 512644 516682 520993 524937 528932 533662
58732 533662 539182 545195 551551 557956 563738 568399 572063 575066 577578 579919 582771 586634 591339 596373
58718 596373 601368 606147 610759 615664 621395 627826 634265 640464 646991 654351 662286 670215 677764 684513
58704F84513N346L696K349J091o52k702m379n846p938j0613j2693j3483j3604
58691F25085j3839j4152j4245j4148j3707j2410j0307q417p507p112o313n049
58679D97879m017l677l855m108m048l616l234l332l522k840j131M71R92J010J892
58664D64864L982O293P872Q700R167R248Q568O989M896K839R78r65l141n073o048
58649E19169n915n197m370l430k338j467j250j622k076k172j833j267p69m85l18
58634D84660p0L07P61J300J876K257K388K712L610M584M606L420J877Q07J33n66
58618E14662j257j614j587j284o32M21J616K670L591M357M634M237L555L073K692
58603E39134K090J432J089Q26K4j239k058j862j142p75j051j700k433k986k961
$$ plain form
58704 684513 689859 693555 695904 696995 696343 693641 689262 683416 675478 664865 652172 638689 625085
58691 625085 611246 597094 582849 568701 554994 542584 532277 523860 516353 509241 502928 497879
58679 497879 493862 490185 486330 482222 478174 474558 471324 467992 464470 461630 460499 460970 461962 462972 464864
58664 464864 468846 475139 483011 491711 500878 510126 518694 525683 530579 533418 534396 533431 530290 525217 519169
58649 519169 513254 508057 503687 500257 497919 496452 495202 493580 491504 489332 487499 486232 485463 484978 484660
58634 484660 484590 484897 485658 486958 488834 491091 493479 496191 499801 504385 508991 512411 514288 515095 515228 514662
58618 514662 513405 511791 510204 508920 508288 508709 510325 512995 516586 520943 525577 529814 533369 536442 539134
58603 539134 541224 542656 543745 544571 544595 543356 541298 539436 538294 537519 536468 534768 532335 529349 526388
58588E26388k162j038l28r3M76K065M229N729N886N344N295O101P007P194O761
58573E78854O411O437O464O220O043O408P229Q013Q556R136J0087J1508J3417
58560F84783J5797J8311K0390K1779K2687K3077K2317K0041J7026J4476J2539
58549H93223J0246P012L449M00k086m334o186p154p104o286n046m035m294o371
58535H61434r467j2198j4090j5664j7141j7929j7589j6504j5213j3672j1653r377
58523F90937p266n413l780k638k161j834r42K91P52j32j499k062j671j333j835
58508F59414k839l530l530k989k209j620j755k662l521l476k718k227k393k597
58494F21348k239j422m21Q09K092K737K359J627J549K310L302L947M056L719L391
$$ plain form
58588 526388 524226 523188 522860 522767 523243 525308 529537 535266 541152 546496 551791 557892 564899 572093 578854
58573 578854 585265 591702 598166 604386 610429 616837 624066 632079 640635 649771 659858 671366 684783
58560 684783 700580 718891 739281 761060 783747 806824 829141 849182 866208 880684 893223
58549 893223 903469 910481 913930 914330 912244 907910 901724 894570 887466 881180 876134 872099 867805 861434
58535 861434 851967 839769 825679 810015 792874 774945 757356 740852 725639 711967 700314 690937
58523 690937 683671 678258 674478 671840 669679 667845 666903 667194 667946 667814 666315 664253 662582 661249 659414
58508 659414 656575 653045 649515 646526 644317 642697 640942 638280 634759 631283 628565 626338 623945 621348
58494 621348 619109 617687 617266 618075 620167 622904 625263 626890 628439 630749 634051 637998 642054 645773 649164
58479F49164L816N291P224Q838J0039J1118J1990J2342J2258J2018J1422J0018
58467G65538P848N406K883R9k918n671p535p982o892m962l394k605j721oJ909
58452G39997L116M088N928Q345R795R639Q698P603N995L764J605k30k523n586
58438H00234q245r196q602p583o704n807m745l517k021k85J320K569L758N211
58424G56387O826Q377R799J0877J1226J0879J0382R977R247P850N984L800J099
58411H62710j889m244n410n873o252o457o328o318o676o701n786m609m198m242
58397G87727l503j798l79j55m84j25J301L182M796N889O560O853O599N612M045
58382H26120K377J065L47L15R04J741K398K766K960K996K962L301M234N097N118
$$ plain form
58479 649164 652980 658271 665495 674333 684372 695490 707480 719822 732080 744098 755520 765538
58467 765538 773386 778792 781675 781774 778856 773185 765650 757668 750776 745814 742420 739815 738094 738088 739997
58452 739997 743113 747201 753129 761474 771269 780908 789606 797209 803204 806968 808573 808343 805820 800234
58438 800234 791989 782793 774191 766608 759904 754097 749352 745835 743814 743529 744849 747418 751176 756387
58424 756387 763213 771590 781389 792266 803492 814371 824753 834730 843977 851827 857811 861611 862710
58411 862710 860821 856577 851167 845294 839042 832585 826257 819939 813263 806562 800776 796167 791969 787727
58397 787727 784224 782426 782047 781892 781408 781283 782584 785766 790562 796451 803011 809864 816463 822075 826120
58382 826120 828497 829562 829909 830224 831128 832869 835267 838033 840993 843989 846951 850252 854486 859583 864701
58367H64701M757N135O171O568O042O106P812J0048J1200J1362J1627J2069J2021
58354I75619J1823J2574J4120J4793J3508J1111R167Q138P254N763L883K636K747
58341A093136L800M716N137N782P207Q860R886J0304J0748J1543J2621J3913J5220
58328A212873J6077J6355J6534J6879J6894J6204J5359J4878J4167J2390R950
58317A378560Q092P313P209P523Q261Q957Q986Q637Q887R949J1037J1692J2420
58304A497523J3728J5307J6552J7323J7865J8342J8829J9465K0429K1720K2911
58293A699994K3237K2405K1379K1675K3536K5376K5648K4672K3995K4522K5973
58282A962412K7743K9472L0952L2147L3226L4242L5091L5946L7160L8500L9245
$$ plain form
58367 864701 869458 874593 880764 887332 893374 899480 907292 917340 928540 939902 951529 963598 975619
58354 975619 987442 1000016 1014136 1028929 1042437 1053548 1062715 1070853 1078107 1083870 1087753 1090389 1093136
58341 1093136 1096936 1101652 1106789 1112571 1119778 1128638 1138524 1148828 1159576 1171119 1183740 1197653 1212873
58328 1212873 1228950 1245305 1261839 1278718 1295612 1311816 1327175 1342053 1356220 1368610 1378560
58317 1378560 1386652 1393965 1401174 1408697 1416958 1425915 1434901 1443538 1452425 1462374 1473411 1485103 1497523
58304 1497523 1511251 1526558 1543110 1560433 1578298 1596640 1615469 1634934 1655363 1677083 1699994
58293 1699994 1723231 1745636 1767015 1788690 1812226 1837602 1863250 1887922 1911917 1936439 1962412
58282 1962412 1990155 2019627 2050579 2082726 2115952 2150194 2185285 2221231 2258391 2296891 2336136
58271B336136L9449M0133M1783M3691M5481M7997N1743N5595N8330O0411O2981
58260B883730O5907O8327P0356P2827P5847P8951Q2136Q5506Q8449R0369R1664
58249C754069R2959R4206R5729R8966J04579J10859J15827J20048J25479J32425
58239D845146J39690J47164J55871J65853J76150J86729J98464K11326K24459
58230F450852K37918K52570K68464K85106L03084L23584L46513L70772L96125
58221I234988M23403M53403M87041N25651N69720O18448O72113P33197Q03465
58212A4521429Q82093R69009J067617J181450J310976J457285J626119J824216
58204B4840194K054921K322862K640984L028569L506517M101864M855030N816845
$$ plain form
58271 2336136 2375585 2415718 2457501 2501192 2546673 2594670 2646413 2702008 2760338 2820749 2883730
58260 2883730 2949637 3017964 3088320 3161147 3236994 3315945 3398081 3483587 3572036 3662405 3754069
58249 3754069 3847028 3941234 4036963 4135929 4240508 4351367 4467194 4587242 4712721 4845146
58239 4845146 4984836 5132000 5287871 5453724 5629874 5816603 6015067 6226393 6450852
58230 6450852 6688770 6941340 7209804 7494910 7797994 8121578 8468091 8838863 9234988
58221 9234988 9658391 10111794 10598835 11124486 11694206 12312654 12984767 13717964 14521429
58212 14521429 15403522 16372531 17440148 18621598 19932574 21389859 23015978 24840194
58204 24840194 26895115 29217977 31858961 34887530 38394047 42495911 47350941 53167786
58196E3167786P041563Q586388J0505566J2827782J5541452J8614201K2018519
58189A48303257K5715692K9607421L3487133L6949603L9214400L9021415L4925343
58182C87224264K6073203J3001756k234269j6826451k8364973l5626338l8647740
58175C04599452l8291742l5707879l1950694k7804709k3763019k0085514j6875284
58168A10120611j4142392j1851056r950575q387824p108316o059036n195205m482419
58160D2943788l892694l402150k992377k649977k363377k122045j918294j746783
58152B1856091j601867j477313j367857j268526j173263j077332r80951q88040
58144A2020942q01486p21776o49448n85883n31531m85665m47786m17139l91138
$$ plain form
58196 53167786 60209349 68795737 79301303 92129085 107670537 126284738 148303257
58189 148303257 174018949 203626370 237113503 274063106 313277506 352298921 387224264
58182 387224264 413297467 426299223 424064954 407238503 378873530 343247192 304599452
58175 304599452 266307710 230599831 198649137 170844428 147081409 126995895 110120611
58168 110120611 95978219 84127163 74176588 65788764 58680448 52621412 47426207 42943788
58160 42943788 39051094 35648944 32656567 30006590 27643213 25521168 23602874 21856091
58152 21856091 20254224 18776911 17409054 16140528 14967265 13889933 12908982 12020942
58144 12020942 11219456 10497680 9848232 9262349 8730818 8245153 7797367 7380228 6989090
58135F989090l66598l42521l19730k98119k76614k55526k36475k19879k04593
58126D469035j90142j77230j65907j55297j45250j36400j28470j20462j12657
58117C137220j06477j02157r8318r4027q9566q5040q0141p5438p1994o9354o5843
58106B198865o1233n7205n4642n2382m9393m6419m4453m3204m2050m1246m1078
58095A665560m0908l9989l8440l6715l4864l2945l1303k9984k8624k7206k6064
58084A298518k4975k3371k1730k1343k2277k2891k2161k1116k1022k1312k0599
58073A055721j8901j7508j7110j7201j7226j7236j7365j7325j6747j5668j4630
58062H68804j4152j4038j3347j1565r556q688r065r554r620j0023j1251j2372
$$ plain form
58135 6989090 6622492 6279971 5960241 5662122 5385508 5129982 4893507 4673628 4469035
58126 4469035 4278893 4101663 3935756 3780459 3635209 3498809 3370339 3249877 3137220
58117 3137220 3030743 2928586 2830268 2736241 2646675 2561635 2481494 2406056 2334062 2264708 2198865
58106 2198865 2137632 2080427 2025785 1973403 1924010 1877591 1833138 1789934 1747884 1706638 1665560
58095 1665560 1624652 1584663 1546223 1509508 1474644 1441699 1410396 1380412 1351788 1324582 1298518
58084 1298518 1273543 1250172 1228442 1207099 1184822 1161931 1139770 1118654 1097632 1076320 1055721
58073 1055721 1036820 1019312 1002202 985001 967775 950539 933174 915849 899102 883434 868804
58062 868804 854652 840614 827267 815702 806146 797458 788393 778839 769219 759196 747945 735573
58050G35573j2262j1194j0238r643q750p303n899n091m783m674m846n540o556
58037F38794p230p162o801o993p795q239p591o476o176p049q319r286r905j0241
58023E29531j0137r713r428r355q991q061o971o173n615n075m548m058l538l089
58009D34779k909k847k565k250k475l183l490k865j863j286j189j120p95j39P90
57994D06593J509J310K37o15k80J038K527L774M626M635L453J550k52j781l432
57979D24892n154o264o343n785n275n107n087m870m310l659l331l360l207k420
57965C60720j258l38J90O63J202J479J276Q81O62N91L98O9k02m72j144k422l832
57948C58463m577m291l261j949o59K24J97o35j176l13J771L751M679M798M789
$$ plain form
58050 735573 723311 712117 701879 692236 683486 676183 670284 665193 660410 655736 650890 645350 638794
58037 638794 631564 624402 617601 610608 602813 594574 586983 580507 574331 567282 558963 549677 539772 529531
58023 529531 519394 509681 500253 490898 481907 473846 466875 460702 455087 450012 445464 441406 437868 434779
58009 434779 431870 429023 426458 424208 421733 418550 415060 412195 410332 409046 407857 406737 405942 405803 406593
57994 406593 408102 409412 409649 409034 408754 409792 412319 416093 420719 425354 428807 430357 430105 428324 424892
57979 424892 419738 413474 407131 401346 396071 390964 385877 381007 376697 373038 369707 366347 363140 360720
57965 360720 359462 359124 359314 359977 361179 362658 363934 364815 365477 366068 366466 366535 366333 365861 364717 362295 358463
57948 358463 353886 349595 346334 344385 343726 343950 344147 343512 342336 342023 343794 347545 352224 357022 361811
57933C61811M890N020N255N624N767N262M139K779J414Q4j066j829k280k788l572
57918C90510m409m862m769m436m286m367m328l914l297k706j961p50P05J669J718
57903C50517J181N94M8o79j543k123k147j875j844k209k491k181j424q71q26r99
57887C31128j168j476j818j552m59N83O28J3k39m6k80j213k060k307k409k803
57871C14522l117k966k683k665k596k062j456j497k187k771k589j526J12J719
57857B88238K670K942L245M128N196N639N226M426L772L609M134N131N718M930
57843C49004K673j28k302l225l086k616k509k880l354l730m215m869n289n183
57829C08291m840m641m372l526k151r09l68m95p35l81R24K688L846L855L307L096
$$ plain form
57933 361811 366701 371721 376976 382600 388367 393629 397768 400547 401961 402045 400979 399150 396870 394082 390510
57918 390510 386101 381239 376470 372034 367748 363381 359053 355139 351842 349136 347175 346425 347130 348799 350517
57903 350517 351698 352292 352340 351661 350118 347995 345848 343973 342129 339920 337429 335248 333824 332953 332127 331128
57887 331128 329960 328484 326666 325114 324655 325238 325866 325879 325640 325594 325314 324101 322041 319734 317325 314522
57871 314522 311405 308439 305756 303091 300495 298433 296977 295480 293293 290522 287933 286407 286519 288238
57857 288238 290908 293850 297095 301223 306419 312058 317284 321710 325482 329091 333225 338356 344074 349004
57843 349004 351677 351549 349247 346022 342936 340320 337811 334931 331577 327847 323632 318763 313474 308291
57829 308291 303451 298810 294438 290912 288761 287852 287484 286989 286254 285873 286797 289485 293331 297186 300493 303589
57813C03589L217K809J297r82l201m730n474n823o224o666o678n971m829l608
57799B56726k318j002k11m04j111j292n41N22J099J024P29P07J121J701J993J910
57783B60653J842K118K570K881L123L517L961M195M251M293M162L601K756J976
57769C05899J215K26p71j241j240j498k394l370l710l475l329l715m533n414o047
57754B66603o232n820m654k759o59P52J011O82P96J657K586K892K681K505K580
57739B64621K669K540K257K007J860J760J742J982K571L230L505L250K783K470
57725B99247K367K430K690L032L042K474J632R64M67j35q28j407j984k894l988
57710C07109m544m085l053k478l063m576n961o168n050l469k381j937j613r45
$$ plain form
57813 303589 306806 309615 310912 309930 306729 301999 296525 290702 284478 277812 271134 265163 260334 256726
57799 256726 254408 253406 253195 252791 251680 250388 249847 250369 251468 252492 253221 253928 255049 256750 258743 260653
57783 260653 262495 264613 267183 270064 273187 276704 280665 284860 289111 293404 297566 301167 303923 305899
57769 305899 307114 307340 306569 305328 304088 302590 300196 296826 293116 289641 286312 282597 278064 272650 266603
57754 266603 260371 254551 249897 247138 246479 247231 248242 248924 249720 251377 253963 256855 259536 262041 264621
57739 264621 267290 269830 272087 274094 275954 277714 279456 281438 284009 287239 290744 293994 296777 299247
57725 299247 301614 304044 306734 309766 312808 315282 316914 317878 318345 318210 317382 315975 313991 311097 307109
57710 307109 302565 298480 295427 292949 289886 285310 279349 273181 268131 264662 262281 260344 258731 257786
57696B57786L7R70J462J484J522J980K236J035j731m340n132m556m281m764m960
57681B38748m291l398k686j494N64K637L961N239P647J1044J4346J7351K1012
57668C10680K5877L1238L6167M0475M4031M5528M2577L3323J8020o63j8775l2848
57656E75630m1241m4267m3328l9824l4743k8904k3270j8667j5201j2284r508p286
57644B57107o199n921n306l735j863p65o60q44o80k56o3l00o78p89n51k17J5K47
57626B28542O59J183J495J302N50n44j521j938j761j372j068q20o83j064k151
57611B20809l308l658l077k159j293m03M24P11K34n90j200j372j104m52L34Q30
57595B04726Q54O26M13K80J70p6p99k157l590m096l275j758n28p7k44n00l00L77
$$ plain form
57696 257786 257823 258793 260255 261739 263261 265241 267477 268512 266781 262441 257309 252753 248472 243708 238748
57681 238748 234457 231059 228373 226879 227443 230080 234041 239280 246927 257971 272317 289668 310680
57668 310680 336557 367795 403962 444437 488468 533996 576573 609896 627916 627253 608478 575630
57656 575630 534389 490122 446794 406970 372227 343323 320053 301386 286185 273901 264393 257107
57644 257107 250908 244987 239681 235946 234083 233318 232658 231814 231134 230878 230815 230515 229837 229048 228497 228280 228295 228542
57626 228542 229201 230384 231879 233181 233731 233187 231666 229728 227967 226595 225527 224707 224024 222960 220809
57611 220809 217501 213843 210766 208607 207314 206911 207335 208046 208280 207690 206490 205118 204014 203562 203896 204726
57595 204726 205580 206206 206619 206899 207069 206993 206194 204037 200447 196351 193076 191318 190790 190713 190469 189969 189669 190046
57577A90046P64M3j568k938l303k921k389j870j312p39q8P86J575J547M94p44
57561A77383j155o02K64P78O75R3m71n02K4P28J446K258K889K771J938J141P54
57544A90412L03m63q79l37O73J227J151R20Q22Q79J134J394J184N22K39Q10J422
57527B01413J003k81j421j965k124j946j440j248k047l353l925l331k286j513
57513A75536j177j346j990k509k210j392j052j437j789j586j095n91qM22J80n86
57497A57370j099j137j249j560j538j319j925l513m605m030k681k209k795l348
57483A24362l336l193l184l034k544j764n73J028K363K596J823R56N71M55K65
57468A16791m9m65r48j224j034o10m08m19l08j70m44j076j414j102m45K22R26
$$ plain form
57577 190046 190810 190853 189285 186347 183044 180123 177734 175864 174552 173813 173725 174511 176086 177633 178127 177383
57561 177383 176228 175626 175890 176668 177343 177436 176965 176463 176487 177215 178661 180919 183808 186579 188517 189658 190412
57544 190412 190715 190252 189373 189036 189709 190936 192087 193007 193829 194708 195842 197236 198420 198942 199181 199991 201413
57527 201413 202416 202135 200714 198749 196625 194679 193239 191991 189944 186591 182666 179335 177049 175536
57513 175536 174359 173013 171023 168514 166304 164912 163860 162423 160634 159048 157953 157362 157354 157776 157956 157370
57497 157370 156271 155134 153885 152325 150787 149468 147543 144030 139425 135395 132714 130505 127710 124362
57483 124362 121026 117833 114649 111615 109071 107307 106734 107762 110125 112721 114544 115500 116071 116526 116791
57468 116791 116742 116277 115329 114105 113071 112461 112053 111634 111326 111156 110712 109636 108222 107120 106675 106897 107823
57451A07823J625J941J661J050M64Q2J47Q44J634J514M11l04N68K308L086K297
57435A27151J241J281K213K851K680K243K172K446K664K605K320J882J330Q21
57421A55900N93P27J055J386J716K072K227J835R48J37p1K59O51Q87J151J548
57405A73021J846J850J818K140K740L091K862K301J846J532J046L35q9L50J575
57390A98264K836L468L491L308L080K694K277K203K544K896L017L151L439L399
57376B40067K653J757J602K065K132J413P61R84J652J753R86j00q83j033m43O14
57360B55980J479J791J975K528L077K833J795Q36N84R46J708K864M123M821M699
57345B92039M267M031L857L475L115L149L430L464L072K463J872J455J378J582
$$ plain form
57451 107823 109448 111389 113050 114100 114564 114646 114793 115637 117271 118785 119196 118892 119460 121768 124854 127151
57435 127151 128392 129673 131886 134737 137417 139660 141832 144278 146942 149547 151867 153749 155079 155900
57421 155900 156493 157220 158275 159661 161377 163449 165676 167511 168459 168596 168525 168784 169435 170322 171473 173021
57405 173021 174867 176717 178535 180675 183415 186506 189368 191669 193515 195047 196093 196428 196339 196689 198264
57390 198264 201100 204568 208059 211367 214447 217141 219418 221621 224165 227061 230078 233229 236668 240067
57376 240067 242720 244477 246079 248144 250276 251689 252450 253434 255086 256839 257825 257725 256842 255809 255366 255980
57360 255980 257459 259250 261225 263753 266830 269663 271458 272294 272878 273824 275532 278396 282519 287340 292039
57345 292039 296306 300337 304194 307669 310784 313933 317363 320827 323899 326362 328234 329689 331067 332649
57331C32649J681J463J356J940L036L816L837L523L494L830M201M345M212L814
57317C77197L308L046L260L726L958L787L531L616M077M573M718M466M153M160
57303D31576M499M792M855N082N879O861P101O411N778O112O995P371P070O871
57289E17253P152P357P062O723O914P475P907Q110Q232Q187P907P704P867Q161
57275F24011Q311Q558R146R574R180Q294P999Q730R812J0488J0704J0739J0656
57262G46202J0448J0188R884R534R431R915J0772J1310J1253J1067J1218J1567
57250H72789J1761J1804J1960J2340J2818J3213J3436J3640J4162J5033J5759
57239A018715J5897J5703J5729J6067J6628J7802J9897K1990K2520K1311J9938
$$ plain form
57331 332649 334330 335793 337149 339089 342125 345941 349778 353301 356795 360625 364826 369171 373383 377197
57317 377197 380505 383551 386811 390537 394495 398282 401813 405429 409506 414079 418797 423263 427416 431576
57303 431576 436075 440867 445722 450804 456683 463544 470645 477056 482834 488946 495941 503312 510382 517253
57289 517253 524405 531762 538824 545547 552461 559936 567843 575953 584185 592372 600279 607983 615850 624011
57275 624011 632322 640880 650026 659600 668780 677074 685073 693803 703615 714103 724807 735546 746202
57262 746202 756650 766838 776722 786256 795687 805602 816374 827684 838937 850004 861222 872789
57250 872789 884550 896354 908314 920654 933472 946685 960121 973761 987923 1002956 1018715
57239 1018715 1034612 1050315 1066044 1082111 1098739 1116541 1136438 1158428 1180948 1202259 1222197
57228A222197J9687K0128K0297K0278K0740K1608K2259K2582K3010K3662K4193
57217A460641K4377K4318K4207K4223K4457K4623K4316K3819K4063K5387K6927
57206A731358K7809K8228K8704K9070K9129K9595L1171L3114L3990L3687L3370
57195B069225L3492L3230L2116L0969L0548L0340K9400K7771K6350K5695K5542
57184B394678K5305K4779K4461K5131K6816K8364K8724K8472K9138L0958L2401
57173B699227L2349L1638L1624L2164L2118L1269L0489L0172K9669K8427K6749
57162C035895K5059K3223K1032J8786J6801J4750J2093R006O340M573L338K087
57150C192983Q34k8l81m02j5J191L344N877Q033R618J0979J2334J3532J4442J5276
$$ plain form
57228 1222197 1241884 1262012 1282309 1302587 1323327 1344935 1367194 1389776 1412786 1436448 1460641
57217 1460641 1485018 1509336 1533543 1557766 1582223 1606846 1631162 1654981 1679044 1704431 1731358
57206 1731358 1759167 1787395 1816099 1845169 1874298 1903893 1935064 1968178 2002168 2035855 2069225
57195 2069225 2102717 2135947 2168063 2199032 2229580 2259920 2289320 2317091 2343441 2369136 2394678
57184 2394678 2419983 2444762 2469223 2494354 2521170 2549534 2578258 2606730 2635868 2666826 2699227
57173 2699227 2731576 2763214 2794838 2827002 2859120 2890389 2920878 2951050 2980719 3009146 3035895
57162 3035895 3060954 3084177 3105209 3123995 3140796 3155546 3167639 3176645 3182985 3187558 3190896 3192983
57150 3192983 3193817 3193789 3193408 3193006 3192991 3194182 3197526 3203403 3211436 3221054 3232033 3244367 3257899 3272341 3287617
57135C287617J6224J6966J6860J5641J3697J1591R570P808O926P724J0284J3690
57123C434598J6950J9866K2704K5334K7285K8553K9845L1981L5459M0499M6993
57112C760067N4427O2396P1219Q1550R3479J06692J21701J40029J62862J90214
57102D844636K21932K59066L03942L59396M28231N12946O15545P37759Q81027
57093I164480J045175J226731J419060J613717J800668J967728K101850K191131
57085B2530540K224507K193308K102103J982118J884919J847984J859328J858185
57077C8482992J773089J560573J214468P53033K07767l79406r60384j490586j936854
57068C9224692k279110k509169k629509k650532k586681k454642k273485k062990
$$ plain form
57135 3287617 3303841 3320807 3337667 3353308 3367005 3378596 3388166 3395974 3402900 3410624 3420908 3434598
57123 3434598 3451548 3471414 3494118 3519452 3546737 3575290 3605135 3637116 3672575 3713074 3760067
57112 3760067 3814494 3876890 3948109 4029659 4123138 4229830 4351531 4491560 4654422 4844636
57102 4844636 5066568 5325634 5629576 5988972 6417203 6930149 7545694 8283453 9164480
57093 9164480 10209655 11436386 12855446 14469163 16269831 18237559 20339409 22530540
57085 22530540 24755047 26948355 29050458 31032576 32917495 34765479 36624807 38482992
57077 38482992 40256081 41816654 43031122 43784155 43991922 43612516 42652132 41161546 39224692
57068 39224692 36945582 34436413 31806904 29156372 26569691 24115049 21841564 19778574
57060A9778574j839806j615755j399575j198278j016055q53684p10490n86275
57052A0558656m80754l92594l20472k64546k25878k05204k03345k21790k60257
57043G983816l12369l64817m02555m16266m05931l78399l42097l03338k65785
57034D792259k31398k00873j73859j50024j30219j15670j05575r6707q6962p9309
57024C421663q0634r5458j20793j47575j66929j74944j72684j63375j50263j35915
57014B013093j22005j09297r8103q8748q1395p5655p0863o6661o3084o0146n7753
57003A119383n5789n3883n1332m7799m3951m0768l8319l5894l3289l1018k9154
56992F58187k6972k4126k1254j8779j6022j2319q318n216l075r86J276K698K190
$$ plain form
57060 19778574 17938768 16323013 14923438 13725160 12709105 11855421 11144931 10558656
57052 10558656 10077902 9685308 9364836 9100290 8874412 8669208 8465863 8244073 7983816
57043 7983816 7671447 7306630 6904075 6487809 6081878 5703479 5361382 5058044 4792259
57034 4792259 4560861 4359988 4186129 4036105 3905886 3790216 3684641 3587934 3500972 3421663
57024 3421663 3341029 3245571 3124778 2977203 2810274 2635330 2462646 2299271 2149008 2013093
57014 2013093 1891088 1781791 1683688 1594940 1513545 1437890 1367027 1300366 1237282 1177136 1119383
57003 1119383 1063594 1009711 958379 910580 866629 825861 787542 751648 718359 687341 658187
56992 658187 631215 607089 585835 567056 551034 538715 530397 525181 522106 521120 522396 525094 527284
56979E27284m11m554r534j4635j9141k2493k4306k4406k3166k1516k0171j8948
56967C24003j7243j4970j2521r991p086l790n05K513N407Q334J1228J3907J5860
56954C15146J6011J3282P691N18o637j2661j6954j9375k0318k0281j9244j6944
56942B20234j3787j0785q344n780k467J199M497P468J0638J4039J7278K0399K3728
56929B78317K6654K7263K3725J5890N323n903j6129k4111k8933l0421k9423k7264
56917B14988k4791k2145j9343j6619j4097j1565q905o483m742l700l202l307l920
56904G2169m263l496j810k84M49Q14J386K090K615L124M037N410O934Q357R675
56889A07207J1139J3225J6250J9743K2553K3860K3656K1956J8142J1796L829l874
$$ plain form
56979 527284 526873 522319 512785 498150 479009 456516 432210 407804 384638 363122 342951 324003
56967 324003 306760 291790 279269 269278 262192 258402 257897 260410 265817 274151 285379 299286 315146
56954 315146 331157 344439 352130 352648 346011 333350 316396 297021 276703 256422 237178 220234
56942 220234 206447 195662 187318 181538 179071 180270 184767 192235 202873 216912 234190 254589 278317
56929 278317 304971 332234 355959 371849 377172 371269 355140 331029 302096 271675 242252 214988
56917 214988 190197 168052 148709 132090 117993 106428 97523 91040 86298 82598 79396 76089 72169
56904 72169 67906 64410 62600 62316 62765 63579 64965 67055 69670 72794 76831 82241 89175 97532 107207
56889 107207 118346 131571 147821 167564 190117 213977 237633 259589 277731 289527 293356 289482
56877B89482r916j3825j5390j4504j1865q975o845n114k763O66M865R346J3778
56864B28940J8093K2695K8311L5120M2107M7789N1299N2204M9361M1112K7203
56853F44234J0001o791k0478l0072l5335l6156l3151k7936k2116j6212r893l038
56841D13057L994J1061J8589K7018L6204M5666N5219O4870P4046Q1095Q3589P9048
56829I93456O5681M3235J3916j7512m5184o4612p4442p6294p3048o6998n9110
56818F39088m9678l9395k9441k0462j1913k905O514J5506K3759L1849M0154M8118
56806F51194N4732N8858N8543N1071L5050J2428j2282l4644n1798o2257o5787
56795F95108o3757n8482n1704m4136l6437k9566k3831j8438j2469n885P39O888
$$ plain form
56877 289482 279566 265741 250351 235847 223982 215007 208162 203048 200285 200951 205816 215162 228940
56864 228940 247033 269728 298039 333159 375266 423055 474354 526558 575919 617031 644234
56853 644234 654235 647444 626966 596894 561559 525403 492252 464316 442200 425988 416095 413057
56841 413057 417051 428112 446701 473719 509923 555589 610808 675678 749724 830819 914408 993456
56829 993456 1059137 1102372 1116288 1098776 1053592 988980 914538 838244 765196 698198 639088
56818 639088 589410 550015 520574 500112 488199 485294 491808 507314 531073 562922 603076 651194
56806 651194 705926 764784 823327 874398 909448 921876 909594 874950 823152 760895 695108
56795 695108 631351 572869 521165 477029 440592 411026 387195 368757 356288 350403 351142 358030
56783C58030J2290J7053K1818K6930L1149L1948K7672J8837P091o092j9097k9712
56771D97917l6247l8786l8559l6481l3094k9282k5952k3149k0387j7666j5383
56760A82931j3437j1334r124p384o334n676n286n276n399n185m621m081l559k760
56746I3475j950j835k459k988k816k218j679j236q02n05m05k95r5m1k47m85n21
56729G2898l46L1N82J009R31M50Q9J32M07P61J223J615J527Q27j81j181j987k255
56711G6532j721p50j52k18m57l72K9N31R63J055O55J48N9J58k78j176j538r14
56693G2554j51j43n73n37J64R71J387J238N51k69m90J81J109J483J252R15P32
56676H0374O52P38J034J241J021N71L91N54O39L89L4r7QJ56L16O55J171J383P38
$$ plain form
56783 358030 370320 387373 409191 436121 467270 499218 526890 545727 552818 546726 527629 497917
56771 497917 461670 422884 384325 347844 314750 285468 259516 236367 215980 198314 182931
56760 182931 169494 158160 149036 141652 135318 129642 124356 119080 113681 108496 103875 99794 96235 93475
56746 93475 91525 89690 87231 84243 81427 79209 77530 76294 75492 74987 74582 74287 74192 74151 73904 73419 72898
56729 72898 72552 72583 73165 74174 75105 75555 75644 75776 76183 76944 78167 79782 81309 82136 81955 80774 78787 76532
56711 76532 74811 74061 73909 73691 73234 72862 72891 73422 74385 75440 76095 76243 76302 76460 76182 75006 73468 72554
56693 72554 72403 72260 71687 71150 71314 72285 73672 74910 75461 75192 74702 74883 75992 77475 78727 79642 80374
56676 80374 81026 81764 82798 84039 85060 85631 86022 86576 87215 87604 87638 87541 87549 87705 88021 88676 89847 91230 91968
56657I1968n29j305p95M08J063Q88P38J167J722J891J883K001J903J133q1j069
56641A02986j520j498j130o85o28j109j670j818j629j409j176q57p06r66j379
56626H4806j444j026l58L49R72J333J351J190J068J068J235J521J590J132N05
56611I5292N05J307K265K950L617M239M020K570Q70J74M17N90K78m4N5N35J208
56594A20848J737J536M56n76m84N30J216R49L31J31M13Q15J099J109P97M76O26
56577A32009J259J816J785J105O9p94q64K5J201J783J689J546J729K049K460L328
56561A52195M770O287P329P905Q384Q978R587R848R214P293M324J228j027k067
56547B34248k211k050j959j852j506j105j223k014k773k657j739r63j131k123
$$ plain form
56657 91968 91439 90134 89339 89747 90810 91698 92436 93603 95325 97216 99099 101100 103003 104136 104055 102986
56641 102986 101466 99968 98838 98153 97525 96416 94746 92928 91299 89890 88714 87857 87151 86185 84806
56626 84806 83362 82336 81978 82327 83299 84632 85983 87173 88241 89309 90544 92065 93655 94787 95292
56611 95292 95797 97104 99369 102319 105936 110175 114195 116765 117635 117809 118226 118816 119094 119050 119105 119640 120848
56594 120848 122585 124121 124577 124001 123517 124047 125263 126212 126543 126674 127087 127902 129001 130110 130907 131383 132009
56577 132009 133268 135084 136869 137974 138043 137249 136385 136410 137611 139394 141083 142629 144358 146407 148867 152195
56561 152195 156965 163252 170581 178486 186870 195848 205435 215283 224497 231790 236114 237342 236315 234248
56547 234248 232037 229987 228028 226176 224670 223565 222342 220328 217555 214898 213159 212196 211065 208942
56533B08942l115l310k593j656j313j527j486p58J5j2p47j377j431j165j059j392
56517A86016k046k452k058j215j051j968k812k351j077n36j246k267k758k790
56503A59389k551j841p69n9j86q07j348j666j791j561r25k22J33P7j24n0O56J844
56485A48199K641K226Q54l37o22k72J39M30O09O17N33P03J290J965K181J670O65
56468A63491j69j95M80R80O96J14R6O74J198J390J402J098K61n56m48L28M58n25
56450A70773j482j305l60L81P16R47R55N28J62M96J190J172R7j162j562r67p2
56433A70507L88K42q3q0K57M57K17r3J41J048K059K441J959J085N43N65O55K23
56415A82531o61j439j790j855j794j545j046l65L60Q81Q58K49l65l19M07J294
$$ plain form
56533 208942 205827 202517 199924 198268 196955 195428 193942 193184 193199 193187 192440 191063 189632 188467 187408 186016
56517 186016 183970 181518 179460 178245 177194 175226 172414 170063 168986 168450 167204 164937 162179 159389
56503 159389 156838 154997 154228 154169 153983 153176 151828 150162 148371 146810 145885 145663 145796 145873 145749 145699 146355 148199
56485 148199 150840 153066 153920 153583 152961 152689 152828 153258 153867 154484 155017 155720 157010 158975 161156 162826 163491
56468 163491 163322 163127 163607 164587 165283 165397 165493 166167 167365 168755 170157 171255 171516 170960 170512 170840 171298 170773
56450 170773 169291 167986 167626 168007 168723 169670 170625 171153 171315 171811 173001 174173 174270 173108 171546 170579 170507
56433 170507 170895 171137 171054 170974 171231 171688 171905 171812 171953 173001 175060 177501 179460 180545 181088 181653 182308 182531
56415 182531 181870 180431 178641 176786 174992 173447 172401 172036 172396 173277 174135 174384 174019 173700 174107 175401
56399A75401J944K205J934J268R10J370K084K053J307Q33J044J289J077P99R12
56384A96430J256J626K152K723K783K254J894K215K702K653K168J742J498J381
56370B25477J496J608R89n47j926j990r63qL56N27Q04R43P31L00k38r20j629k021
56352B22989j895j398q63n87n87m61K23J264J867J649J118R08R99J121J399J949
56336B29695K254J736P81M77J253K379K950K848K577K541K676K689K454K193K240
56321B61743K588K875K854K638K403K088J573Q73rj075j996k147j348k88J97J36
56305B73105K75J065K184L059L539L886M332M793N100N319N673O034N852M865
56291C29081L661L121L439M085M571M753M557M038L726M223N330O172O363O423
$$ plain form
56399 175401 177345 179550 181484 182752 183662 185032 187116 189169 190476 191309 192353 193642 194719 195518 196430
56384 196430 197686 199312 201464 204187 206970 209224 211118 213333 216035 218688 220856 222598 224096 225477
56370 225477 226973 228581 229570 229023 227097 225107 224144 224136 224492 225019 225823 226766 227497 227797 227559 226639 225010 222989
56352 222989 221094 219696 218833 218246 217659 217198 217421 218685 220552 222201 223319 224227 225226 226347 227746 229695
56336 229695 231949 233685 234466 234943 236196 238575 241525 244373 246950 249491 252167 254856 257310 259503 261743
56321 261743 264331 267206 270060 272698 275101 277189 278762 279635 279626 278551 276555 274408 273060 272772 272969 273105
56305 273105 273380 274445 276629 279688 283227 287113 291445 296238 301338 306657 312330 318364 324216 329081
56291 329081 332742 335863 339302 343387 347958 352711 357268 361306 365032 369255 374585 380757 387120 393543
56277C93543O857P523Q136Q817R717J0585J1103J1291J1386J1687J2588J4251
56265E17484J6122J7307J7644J7902J8764K0282K2376K5171K8521L1979L5496
56254G69048L9499M4089M8916N4174O0763O9062P8321Q7738R7272J06894J16010
56243A571786J24325J32436J40645J47885J52625J54235J52695J47644J38658
56234B862934J25991J10095R0835O8033M2514J5823j0792l6417n9926q0267r7123
56223C031700j10592j20549j26995j30681j32531j32648j30567j26363j20711
56214A900063j14214j07202j00108r3243q6394p9273p2296o6302o1498n7230n2793
56203A009510m8070m3417l9242l5666l2463k9473k6968k5152k3359k0636j7254
$$ plain form
56277 393543 400400 407923 416059 424876 434593 445178 456281 467572 478958 490645 503233 517484
56265 517484 533606 550913 568557 586459 605223 625505 647881 673052 701573 733552 769048
56254 769048 808547 852636 901552 955726 1016489 1085551 1163872 1251610 1348882 1455776 1571786
56243 1571786 1696111 1828547 1969192 2117077 2269702 2423937 2576632 2724276 2862934
56234 2862934 2988925 3099020 3189855 3257888 3300402 3316225 3305433 3269016 3209090 3128823 3031700
56223 3031700 2921108 2800559 2673564 2542883 2410352 2277704 2147137 2020774 1900063
56214 1900063 1785849 1678647 1578539 1485296 1398902 1319629 1247333 1181031 1119533 1062303 1009510
56203 1009510 961440 918023 878781 843115 810652 781179 754211 729059 705700 685064 667810
56192F67810j4718j3789j3429j2308j0543r059q078p103n963m913m099l588l531
56179E56689l706l458k654k062k062j812n56J023J765J710J782K275K743K990
56165E54667L160L174L055L405M660O189P046P217P274P298P111P188Q158R728
56151F39330J1054J2013J3229J5051J7324J9863K2549K5370K8938L4236M1110
56140H80067M8013N4119O0560O8254P5609Q0008Q0726P8597P3733O5740N5979
56129A621405M7292M1311L7778L6405L7268L8898L8191L3354K5685J7605J0155
56118A985347L056l979j1086j8760k7621l7858m9109o0499p0613p7917q1375q0656
56106A468930p6081o8872o0811n3007m5329l7716l1162k6466k2821j8898j4778
$$ plain form
56192 667810 653092 639303 625874 613566 603023 593964 585886 578783 572820 567907 563808 560220 556689
56179 556689 552983 549525 546871 544809 542747 540935 540379 541402 543167 544877 546659 548934 551677 554667
56165 554667 557827 561001 564056 567461 572121 578310 585356 592573 599847 607145 614256 621444 629602 639330
56151 639330 650384 662397 675626 690677 708001 727864 750413 775783 804721 838957 880067
56140 880067 928080 982199 1042759 1111013 1186622 1266630 1347356 1425953 1499686 1565426 1621405
56129 1621405 1668697 1710008 1747786 1784191 1821459 1860357 1898548 1931902 1957587 1975192 1985347
56118 1985347 1988403 1984424 1973338 1954578 1926957 1889099 1839990 1779491 1708878 1630961 1549586 1468930
56106 1468930 1392849 1323977 1263166 1210159 1164830 1127114 1095952 1069486 1046665 1027767 1012989
56095A012989j1485r150p086n199l815k485n36J466K405K564L264M652N493N291
56081I98368N000N402O214P037P953Q955R838J0761J1903J2786J3007J3216J4126
56068A124566J5075J5079J4755J5459J6870J7341J6509J5636J5443J5466J5610
56057A297809J6483J7991J9336K0434K1785K3057K3545K3777K4768K5851K5446
56046A540282K3849K2976K3338K3657K3580K4305K6025K7292K7572K8143K9697
56035A820716L1222L2098L3205L5110L7052L8554M0246M2396M4352M6019M8153
56024B249123N0713N2738N4262N6423N9304O1629O3017O4512O6499O8172O9480
56013B915872P1469P4343P7216Q0129Q4149Q9293R4521R9818J05934J12078J16589
$$ plain form
56095 1012989 1001504 992354 985268 980069 976254 973769 973233 974699 977104 979668 982932 987584 993077 998368
56081 998368 1003368 1008770 1014984 1022021 1029974 1038929 1048767 1059528 1071431 1084217 1097224 1110440 1124566
56068 1124566 1139641 1154720 1169475 1184934 1201804 1219145 1235654 1251290 1266733 1282199 1297809
56057 1297809 1314292 1332283 1351619 1372053 1393838 1416895 1440440 1464217 1488985 1514836 1540282
56046 1540282 1564131 1587107 1610445 1634102 1657682 1681987 1708012 1735304 1762876 1791019 1820716
56035 1820716 1851938 1884036 1917241 1952351 1989403 2027957 2068203 2110599 2154951 2200970 2249123
56024 2249123 2299836 2352574 2406836 2463259 2522563 2584192 2647209 2711721 2778220 2846392 2915872
56013 2915872 2987341 3061684 3138900 3219029 3303178 3392471 3486992 3586810 3692744 3804822 3921411
56002C921411J19970J24539J30895J37589J44265J52140J61254J70430J80033
55993E242526J91476K03911K15060K25375K37670K52469K67814K83839L03055
55984G423195L25625L48926L72564L99217M29789M62425M97076N36249N80594
55975A1375660O28800O82470P45586Q18585Q98836R87536J089853J207945J341134
55966A9776405J493821J675715J893475K150819K458188K834058L296710L866120
55958C9445311M576562N478060O624985Q072078R873436J2061347J4622656J7516054
55950A18270489K0711754K4183821K7851089L1526358L4849359L7114249L7111122
55943C31618241L3366431K4956150J2397790k204221j6026861k6773519l3411879
$$ plain form
56002 3921411 4041381 4165920 4296815 4434404 4578669 4730809 4892063 5062493 5242526
55993 5242526 5434002 5637913 5852973 6078348 6316018 6568487 6836301 7120140 7423195
55984 7423195 7748820 8097746 8470310 8869527 9299316 9761741 10258817 10795066 11375660
55975 11375660 12004460 12686930 13432516 14251101 15149937 16137473 17227326 18435271 19776405
55966 19776405 21270226 22945941 24839416 26990235 29448423 32282481 35579191 39445311
55958 39445311 44021873 49499933 56124918 64196996 74070432 86131779 100754435 118270489
55950 118270489 138982243 163166064 191017153 222543511 257392870 294507119 331618241
55943 331618241 364984672 389940822 402338612 400134391 384107530 357334011 323922132
55936C23922132l6109020l5724584l3320349k9857008k6048729k2336848j8948956
55929A21576638j5978787j3439917j1300672r515489q040784o830752n835394
55922E0634843n011887m331053l768962l300623k905949k573714k294764k057415
55914B4390476j852820j678245j531268j405693j295445j196936j105502j015220
55906A3309347r24813q38789p60591o89278o24204n67340n18836m75426m35430
55897G474640m00716l71759l45417l19609k95765k74625k54168k33730k15775
55888D763076k01298j87597j72769j58641j47006j36904j27879j22096j20596
55879C388290j20683j19472j17046j14055j09370j02508r5454q9702q4136p7865
$$ plain form
55936 323922132 287813112 252088528 218768179 188911171 162862442 140525594 121576638
55929 121576638 105597851 92157934 80857262 71341773 63300989 56470237 50634843
55922 50634843 45622956 41291903 37522941 34222318 31316369 28742655 26447891 24390476
55914 24390476 22537656 20859411 19328143 17922450 16627005 15430069 14324567 13309347
55906 13309347 12384534 11545745 10785154 10095876 9471672 8904332 8385496 7910070 7474640
55897 7474640 7073924 6702165 6356748 6037139 5741374 5466749 5212581 4978851 4763076
55888 4763076 4561778 4374181 4201412 4042771 3895765 3758861 3630982 3508886 3388290
55879 3388290 3267607 3148135 3031089 2917034 2807664 2705156 2609702 2520000 2435864 2357999
55869B357999p2515o9457o7392o4741o2046n9907n7056n2660m8294m5486m3401
55858A715044m0951l9054l8706l8772l7850l6484l5601l4532l2522l0549k9746
55847A320277k9565k9252k9451l0522l1020k9764k7906k6940k6179k4235k1684
55836A013759k0114j9562j8865j7760j6832j6017j4852j3639j2963j2580j1961
55825H38614j1336j1160j1224j1226j1458j2058j2563j2870j3628j4816j5210
55814G01065j4159j2704j1906j1285j0082q856q524q821q809q179p054n422l696
55801E81568k745k579k006n43O07M77p8J27O82N43j27m41k82p9K00P37J216J449
55783E78726J891K612K604J005j827n279r377j3744j6840j7477j6204j4114j1316
$$ plain form
55869 2357999 2285484 2216027 2148635 2083894 2021848 1961941 1904885 1852225 1803931 1758445 1715044
55858 1715044 1674093 1635039 1596333 1557561 1519711 1483227 1447626 1413094 1380572 1350023 1320277
55847 1320277 1290712 1261460 1232009 1201487 1170467 1140703 1112797 1085857 1059678 1035443 1013759
55836 1013759 993645 974083 955218 937458 920626 904609 889757 876118 863155 850575 838614
55825 838614 827278 816118 804894 793668 782210 770152 757589 744719 731091 716275 701065
55814 701065 686906 674202 662296 651011 640929 632073 623549 614728 605919 597740 590686 585264 581568
55801 581568 578823 576244 574238 573695 574302 574779 574701 574828 575510 576053 575926 575485 575203 575124 575324 576061 577277 578726
55783 578726 580617 583229 585833 586838 585011 579732 570355 556611 539771 522294 506090 491976 480660
55770D80660p759m398k062o1K430M289L362p65o179j0553j2691j2534j0852q784
55756D14103o995n399m077l622m060m362l867l291l497m174m669n134n778o023
55742C49155n469m812m604m074k492q16m35j088j489j421j701k546l418m098m616
55727C06076m583l928l711m792o120o026m723l952m242m374l566k622k401k604
55713B48432k499j876q74L82J660K805M024N352O038N291L506J852P93j58j403
55698B73325k891m562o174o914o209m792m006m068m143l936m004m374m115k734
55684B10403j043j35j70m99m29L18J452K294K462K305K242J937Q37q20k192k853
55668B16109k957k675k243k196k645k677j499J33P53K45j37K38P18P68P09P70
$$ plain form
55770 480660 472901 468503 466441 466380 468810 473099 476461 475696 469517 458964 446273 433739 422887 414103
55756 414103 407108 401709 397632 394010 389950 385588 381721 378430 374933 370759 366090 360956 355178 349155
55742 349155 343686 338874 334270 330196 327704 326888 326453 325365 323876 322455 320754 318208 314790 310692 306076
55727 306076 301493 297565 293854 289062 282942 276916 272193 268241 263999 259625 256059 253437 251036 248432
55713 248432 245933 244057 243183 243565 245225 248030 252054 257406 263444 268735 272241 274093 274886 274728 273325
55698 273325 270434 265872 259698 252784 246575 241783 237777 233709 229566 225630 221626 217252 213137 210403
55684 210403 209360 209225 209055 208556 208127 208445 209897 212191 214653 216958 219200 221137 221974 221154 218962 216109
55668 216109 213152 210477 208234 206038 203393 200716 199217 199350 200103 200348 200211 200449 201167 201935 202644 203414
55652B03414O71N04Q94J771K067J327N42O69J165Q74k18r95o92L33J170J249P07
55635B15452O2n20j500l142m737n297m952m735m958m804l887l113l362m105m162
55620A62240l226j908p13J53M09o6p81j160j359j928k749l104k802k377k037j193
55604A37399M29J877J879M24j271k196k348k140j797j540j735k317k491j656k76
55589A22241O11O20J98j40k17J04Q48J611J924J928K114K414K389K254K786M059
55573A45744N147N454N441N708O262P079Q307R440R296P587N493L813J681j736
55559B24716n229o854o675o592p593q652q573p553o511n836n289m543l497k435
55545A38884j939k257k773k663j892j066n10j22L7k38p40r52o88j94K65M25lq51
$$ plain form
55652 203414 204085 204589 205483 207254 209321 210648 211190 211859 213024 213898 213680 212685 211993 212326 213496 214745 215452
55635 215452 215514 214994 213494 210352 205615 200318 195366 190631 185673 180869 176982 173869 170507 166402 162240
55620 162240 159014 157106 156393 156546 156955 156889 156108 154948 153589 151661 148912 145808 143006 140629 138592 137399
55604 137399 137828 139705 141584 142008 140737 138541 136193 134053 132256 130716 128981 126664 124173 122517 122241
55589 122241 122852 123472 123670 123530 123313 123417 124265 125876 127800 129728 131842 134256 136645 138899 141685 145744
55573 145744 150891 156345 161786 167494 173756 180835 189142 198582 207878 215465 220958 224771 226452 224716
55559 224716 219487 212633 205958 199366 191773 183121 174548 166995 160484 154648 149359 144816 141319 138884
55545 138884 136945 134688 131915 129252 127360 126294 125784 125662 125699 125461 124721 123769 123081 122887 123152 123577 123574 122723
55527A22723j349j119q73j347j993j766q21l02n97j009j125j314j710j807j373
55512A04218q57o40o81j059k003l191l821l610l003k316j501p82o25r03r89q33
55496G7404r79j422j469r23l46R6Q62J774J872J063O06J164J611Q00n35r26l28
55479H0324K06M15Q59J364R51m35j443j091j28P1o48j215r42l79m10j004j294
55462G5201p64J52P39Q22O14J51o05j315j512j152n34K06R92J409J068L36kK06
55444G6012M22L87L96N19L41k30o24m23K4J38j99p05j054r41l06M36P33N25J45
55425G5596k60o16n27J72O35r5j429j684l97J048J489J413J668J999J829J468
55409H2309J487J619J287O57J98k05q76j530j757j818k138k356j858q80j45K52
$$ plain form
55527 122723 121374 120255 119382 118035 116042 114276 113455 113153 112556 111547 110422 109108 107398 105591 104218
55512 104218 103361 102721 102040 100981 98978 95787 91966 88356 85353 83037 81536 80754 80129 79226 78237 77404
55496 77404 76425 75003 73534 72611 72265 72361 73223 74997 76869 77932 78538 79702 81313 82113 81578 80652 80324
55479 80324 80530 80945 81804 83168 84119 83684 82241 81150 81022 81093 80445 79230 78288 77909 77499 76495 75201
55462 75201 74437 74589 75328 76150 76764 76915 76310 74995 73483 72331 71797 72003 72995 74404 75472 75808 75806 76012
55444 76012 76434 76821 77217 77736 78077 77847 77223 76800 76824 76962 76763 76058 75004 74063 73757 74193 74926 75451 75596
55425 75596 75336 74720 74193 74365 75000 74905 73476 71792 71395 72443 73932 75345 77013 79012 80841 82309
55409 82309 83796 85415 86702 87359 87557 87352 86476 84946 83189 81371 79233 76877 75019 74139 73994 74246
55393G4246P45J255J236O67J03j88m11n21j94M43P89O24L97M62O08N35L36K51
55375H1383K88L11K45O3k88q03j360j739j703j222o54m30n02m69k42j81l47k42
55357G2108L30P14L16m38o60k93n1k98n85m21Q6M65M12K9l07l56l06m60n70J9
55337F9734J320K337K218J326O25M30L68K50K09K26J74J75L48L21k67r85j006
55320G7803l66K3l00p41o45k33j08k39j0Q37J741J909J173J43n49r16j317j627
55302G6578j246j19Q63R11M41N05J349K152K093J190Pr42j422j489j380j256j050
55285G7185p71p22j123j624j587q73j0M59N46O52J032J491J593J170N65K12M5
55268G8240k80o66n67J59R37J254J187R17K93o38j266j162p04m66l93k07j27m68
$$ plain form
55393 74246 74991 76246 77482 78149 78252 78064 77653 77132 76938 77381 78170 78794 79191 79653 80261 80796 81132 81383
55375 81383 81671 81982 82227 82290 82002 81199 79839 78100 76397 75175 74521 74091 73589 73120 72878 72697 72350 72108
55357 72108 72438 73152 73468 73030 72370 72077 72026 71728 71143 70722 70808 71273 71685 71714 71407 71051 70745 70285 69715 69734
55337 69734 71054 73391 75609 76935 77560 77990 78358 78608 78817 79043 79217 79392 79740 80061 79794 78809 77803
55320 77803 77437 77460 77160 76419 75774 75541 75433 75194 75184 76021 77762 79671 80844 80987 80438 79522 78205 76578
55302 76578 75332 75213 76076 76987 77428 77933 79282 81434 83527 84717 84724 83782 82360 80871 79491 78235 77185
55285 77185 76414 75692 74569 72945 71358 70485 70475 70934 71480 72132 73164 74655 76248 77418 77983 78195 78240
55268 78240 77960 77294 76727 76886 77823 79077 80264 81181 81474 80836 79570 78408 77704 77238 76845 76638 76511 76043
55250G6043q93q38l99j27j72k95m88q10q57k18P35J281J388J483J444P86j73m71
55232G7419M8M22L9n18m77M7N25Q05R25O36k64j385k020j792q67K42R18Q06J86
55213G5695k33n7M50P01K93p06j638j582l69R34J118L40j81R9M85L21m9l9K41
55194G5823L28J77N0P3K49N93Q74O78K2n13n52m05l81j75N88J524J816J149k1
55175H1897j062j577j454q96k90J48M62N96K86m07q63o31j19p9m99o76k39L17
55157G4914L62L0K0O63J464J693J248P12N38N13J97l68p39p08m70k59j55k29m76
55138G8950o84p16p72j019j070n04L26O85O34R13J532J472K07j284j697r15K26
55121G6284J091J484J301O45N4j21k23o22q93l27R79K173K648K315J213l66j508
$$ plain form
55250 76043 75150 74312 73913 73786 73614 73319 72831 72021 71164 70946 71681 72962 74350 75833 77277 78063 77890 77419
55232 77419 77467 77889 77928 77410 76933 76980 77505 78310 79235 79871 79607 78222 76202 74410 73543 73785 74703 75509 75695
55213 75695 75462 75405 75855 76556 76849 76143 74505 72923 72554 73488 74606 74946 74765 74864 75349 75670 75621 75582 75823
55194 75823 76151 76328 76378 76451 76700 77293 78167 78845 78867 78354 77802 77397 77016 76841 77429 78953 80769 81918 81897
55175 81897 80835 79258 77804 76908 76618 76766 77228 77824 78110 77703 76840 76209 76090 76011 75512 74836 74597 74914
55157 74914 75276 75306 75326 75989 77453 79146 80394 81106 81644 82157 82354 81986 81247 80539 80069 79810 79655 79426 78950
55138 78950 78266 77550 76778 75759 74689 74185 74511 75196 75830 76743 78275 79747 79954 78670 76973 76058 76284
55121 76284 77375 78859 80160 80805 80859 80738 80515 79893 79000 78673 79652 81825 84473 86788 88001 87635 86127
55104H6127j336j68P12N94k2m32o04p40o34m5P35J197J191Q85L68k50n77k73M46
55085H7174R69J044R54R12O85M1o00n16L63J155J014K18j31N08J430J546O69m05
55067I7030q57o56l60m28p44p86k59M53O71K25l83o90q11r86r83m42M26R52P65
55048I2137L9q61j538j510o28M18O78J87l5M41O58l34j856k315j287J7M56K56
55030H4923K47N45O44L51lj83k65k41L9M40N20J52k10k01j01l79q52p91J27J309
55010H6071J883J582Q50K58L8R4K47M29O78J035J427J627J393P03j15n75m37K6
54992I7214K59k0n13o25p6P42J029L75p02j115l61Q51J361Q63J21r6J27J89j78
54973I9445o50q00n34j79j90o13r50p18j46J55J08K28O10O69J97j06K63O70L48
$$ plain form
55104 86127 84791 84623 85335 85929 85907 85475 84871 84131 83497 83452 84187 85384 86575 87460 87828 87578 87001 86728 87174
55085 87174 88143 89187 90141 91053 91738 91779 91179 90663 91026 92181 93195 93413 93282 93790 95220 96766 97435 97030
55067 97030 96173 95517 95157 94729 93985 93199 92940 93393 94064 94289 93906 93216 92405 91419 90436 89994 90420 91372 92137
55048 92137 92176 91315 89777 88267 87639 88057 88735 88922 88887 89328 89986 89652 87796 85481 84194 84211 84667 84923
55030 84923 85170 85715 86359 86710 86707 86524 86259 86018 86057 86497 87017 87169 86959 86758 86657 86278 85426 84635 84762 86071
55010 86071 87954 89536 90386 90644 90682 90776 91023 91452 92130 93165 94592 96219 97612 98315 98200 97625 97188 97214
54992 97214 97473 97453 96940 96315 96239 96981 98010 98385 97683 96568 96207 97058 98419 99282 99403 99307 99434 99623 99445
54973 99445 98795 97995 97461 97282 97092 96479 95529 94811 94665 94820 94928 95156 95766 96435 96632 96526 96789 97459 97807
54954I7807k47p1Q15J258P40L9n9K00J14m84j167j376p65M40J308J032l2p34o58
54935I8160n02p72j006p04k53k37m70l85k0J39Lk7L40J002J641J873J462P86O74
54916A01704J472K593L356L856M508N199N522N479N267M688L435J816M44o85k018
54901A46636l416m070l646k820k435k631l060l411l432k866j756n67J74K82j16
54886A12866p36j152j036n72l22n23p80o79l43j09J10O66J534K198K331K264K581
54869A18298L400M270M779M976N091N011M342K931J110o17j903k559k575k296
54855A44258k295k805l438l704l570l306l000k585k191k060k173k254k188k052
54841A06637j847j467r86o03k79K15P75Q42K9j284k187k043r56L38J025P82N5
$$ plain form
54954 97807 97560 97489 98304 99562 100302 100341 100282 100482 100596 100112 98945 97569 96804 97244 98552 99584 99552 98818 98160
54935 98160 97658 96886 95880 95176 94923 94686 94216 93831 93811 93950 93953 93926 94266 95268 96909 98782 100244 101030 101704
54916 101704 103176 105769 109125 112981 117489 122688 128210 133689 138956 143644 147079 148895 149339 148654 146636
54901 146636 143220 139150 135504 132684 130249 127618 124558 121147 117715 114849 113093 112526 112700 112982 112866
54886 112866 112130 110978 109942 109370 109048 108525 107745 107066 106723 106614 106724 107390 108924 111122 113453 115717 118298
54869 118298 121698 125968 130747 135723 140814 145825 150167 153098 154208 153591 151688 149129 146554 144258
54855 144258 141963 139158 135720 132016 128446 125140 122140 119555 117364 115304 113131 110877 108689 106637
54841 106637 104790 103323 102337 101734 101455 101670 102445 103287 103316 102032 99845 97802 96846 97184 98209 98991 99046
54824I9046l33L6P62J079O61j28p42j016j122j148r98o94n18o26p60o06k01K38
54806I2930P23J251J392O87m51r39l17P02J274J467J761K089J954J269M52j33
54790A06111l61j97J48J08n82j281j127k55K96q1q87j296r89j10R89J768J798
54773A04052J319J075J331J529J215Q23J076J997K932L375L328L040K798K897
54759A32787L441M139M567M622M507M363M106L563K532P93j620m107n800o281
54745A51612n920n351m836m245l531k918k559k277j857j444j406j739j978j771
54731A09780j325j011p77l44J74L10m2l52j05N84J191J472J569J723K038K590
54715A17475L444M488N366N658N191M193L195K622K351J742K76j818l661m575
$$ plain form
54824 99046 98713 98749 99511 100590 101251 101123 100381 99365 98243 97095 96097 95403 94885 94259 93499 92893 92692 92930
54806 92930 93653 94904 96296 96983 96532 95593 95276 95978 97252 98719 100480 102569 104523 105792 106244 106111
54790 106111 105750 105553 105701 105809 105227 103946 102819 102564 102860 102779 101892 100596 99607 99497 100486 102254 104052
54773 104052 105371 106446 107777 109306 110521 111344 112420 114417 117349 120724 124052 127092 129890 132787
54759 132787 136228 140367 144934 149556 154063 158426 162532 166095 168627 169420 167800 163693 157893 151612
54745 151612 145692 140341 135505 131260 127729 124811 122252 119975 118118 116674 115268 113529 111551 109780
54731 109780 108455 107444 106667 106323 106497 106807 106765 106413 106308 106892 108083 109555 111124 112847 114885 117475
54715 117475 120919 125407 130773 136431 141622 145815 149010 151632 153983 155725 156001 154183 150522 145947
54701A45947m664m497m311l828k897j922j439j456j572j626j792k001j792j026
54687A11124k93k24o45q50o12l85n28p95q24o92p39r73r81m63L68R95J138R41
54669A05562O46K81j80n51o05m85n27o99o33l38l86r64j306o02P51J505J091K05
54651A02765k62k70l14m98m30J04P36R23O17L66O21J117J140M29m85r70r91q75
54633A03723p41m93j80Q1L94R35J627K206K428J991O58j057j842r95M12O55m17
54616A09385j286q95J21O68O28N04M02J20k06l01k56l38m95n23m05j89J96N56
54598A07686M03k68o09k1Q28Q28j2o61o40n02o81p71l52J97K72n6k12K2L29M10
54578A06190L12K14J14p6k64j09N90J424J526N30q11j325p13K69Q74J064J051
$$ plain form
54701 145947 141283 136786 132475 128647 125750 123828 122389 120933 119361 117735 115943 113942 112150 111124
54687 111124 110831 110607 109962 109112 108500 108115 107587 106792 105968 105276 104537 103564 102583 102120 102488 103483 104621 105562
54669 105562 106208 106489 106309 105758 105153 104668 104141 103442 102809 102471 102085 101121 99815 99213 99964 101469 102560 102765
54651 102765 102503 102233 101919 101421 100991 101095 101831 102754 103371 103737 104358 105475 106615 107044 106559 105589 104598 103723
54633 103723 102982 102489 102309 102390 102784 103719 105346 107552 109980 111971 112629 111572 109730 108735 109147 109802 109385
54616 109385 108099 107204 107325 107993 108621 109125 109527 109647 109441 109140 108884 108546 108051 107528 107123 106934 107130 107686
54598 107686 108089 107821 107212 107191 108019 108847 108835 108174 107534 107032 106351 105580 105228 105425 105697 105641 105429 105451 105780 106190
54578 106190 106502 106716 106830 106754 106490 106381 106971 108395 109921 110451 109640 108315 107602 107871 108745 109809 110860
54561A10860P50J33l98m75l43m33n84k81M18Q11N07p3l45k57q3M9J02j4k28k06
54541A09910J67M78L27J5J93R24J585J728J540J327J041N58N5k17k82l09k67j5
54523A18758L60N30K21n43j432j973j808r47K31J184J382N43r54k047j842o47
54507A11016K98K52k91m41k9M82P72Q71Q31O37L39K8k50l45r7K65K00m18j029
54488A13091j147r39p05l46J78M59L84O10J491K059J217m34j222o76J08M76J080
54471A15684K258K963K202O11m10m59j86n9%J5j02k04o3J39K2l78o35m97m4N66
54451A21423J139J366J063M18k50q27j274j445j295j065r29p15k69J81L40L34
54435A18195M74O74N85J04n49j149j519j400o55L93J134J232Q88N68N64P24O17
$$ plain form
54561 110860 111610 111743 111345 110870 110527 110094 109510 109229 109647 110458 110965 110892 110547 110290 110207 110256 110358 110344 110116 109910
54541 109910 110077 110555 110882 110897 111090 112014 113599 115327 116867 118194 119235 119793 119848 119631 119349 119040 118773 118758
54523 118758 119118 119648 119869 119326 117894 115921 114113 113166 113397 114581 115963 116506 115552 113505 111663 111016
54507 111016 111314 111566 111275 110834 110805 111287 112059 112930 113761 114398 114737 114765 114515 114170 114073 114338 114538 114120 113091
54488 113091 111944 111005 110300 109954 110132 110591 110975 111585 113076 115135 116352 115918 114696 114020 114128 114604 115684
54471 115684 117942 120905 123107 123718 123308 122849 122663 122604 122604 122619 122517 122313 122250 122389 122411 122033 121398 120901 120857 121423
54451 121423 122562 123928 124991 125409 125159 124332 123058 121613 120318 119253 118324 117609 117340 117521 117861 118195
54435 118195 118669 119343 119928 120032 119483 118334 116815 115415 114760 115153 116287 117519 118407 118975 119539 120263 120880
54418A20880J14k50J22R77J432J192Q70Q55O71m0o24k93O70J362J577J751J847
54401A33113J333K51n77o10k08K9pm7J89Q60J776K312K003J206O86N31J90m35
54383A42595p17l95j19m32q33m97N05J341J466R83J35q62j593j589q84p1L76N23
54365A39932O25O86O15O17J020J776K406K602K582K662K758K604K325K291K434
54350A67935K191J330L12l92r15j573k264k739l072l333l193k524k048k515l378
54335A43822l267j924o45m72q65p74k63j88o99j095j011r29j270j664j467o29
54319A26660L26R23J145J244J372J414J113L82m52q21m87J25K77k78r73j039l67
54302A30564M15P10N29J63l87j245k072k179j358k92J81pk36m4M03P45R52J206
$$ plain form
54418 120880 120994 120744 120866 121843 123275 124467 125337 126192 126863 126823 126199 125906 126576 127938 129515 131266 133113
54401 133113 134446 134697 134120 133510 133302 133331 133324 133277 133466 134326 136102 138414 140417 141623 142309 142840 143030 142595
54383 142595 141878 141483 141364 140932 140099 139602 140107 141448 142914 143897 144032 143170 141577 139988 139104 139033 139409 139932
54365 139932 140557 141243 141858 142475 143495 145271 147677 150279 152861 155523 158281 160885 163210 165501 167935
54350 167935 170126 171456 171768 171376 170461 168888 166624 163885 160813 157480 154287 151763 149715 147200 143822
54335 143822 140555 138631 137986 137514 136649 135875 135612 135424 134725 133630 132619 131690 130420 128756 127289 126660
54319 126660 126986 127909 129054 130298 131670 133084 134197 134579 134127 133306 132819 132944 133221 132943 131970 130931 130564
54302 130564 130979 131689 132218 132381 131994 130749 128677 126498 125140 124848 125029 125022 124786 124742 125145 125890 126842 128048
54284A28048J447J387R71N49M38N13M37J82J7J05L02L95K98M0k43k94rL63N57
54265A35503P17J108J411R39l13j359j346n30K24M83M09K61K30N02R79J173Q07
54248A41198L28L64Q47J193J087O38r6j101k021k329j948j316q00m73l80n76q75
54231A33740r44o79j82M77J129J356R28K41j39k10k94l07P2O79R93R22P23L10
54213A38815n81j516j616q05L5L49M81P02O28N7m94n90m81m03q8M40M47l56r70
54194A34054m04P82J203N85r8k30k38n63q84p18j62L00L94J96n6j89k82n99j156
54175A31935j499j211m80J34L83M33M47M17L71M06N25O66Q25R35Q10M41J00o7
54157A35571l06p36r92p87n00n83o71j03Q27J063L58j99L19J372J714J038J81
$$ plain form
54284 128048 129495 130882 131853 132402 132840 133353 133790 133972 133989 134094 134396 134791 135089 135129 134886 134592 134583 134946 135503
54265 135503 136220 137328 138739 139678 139365 138006 136660 136130 136354 136837 137246 137507 137737 138239 139218 140391 141198
54248 141198 141526 141890 142737 143930 145017 145655 145559 144458 142437 140108 138160 136844 136044 135571 135191 134615 133740
54231 133740 132796 132117 131935 132412 133541 134897 135825 136066 135927 135717 135423 135116 135188 135867 136860 137782 138505 138815
54213 138815 138234 136718 135102 134297 134332 134681 135162 135864 136492 136549 136055 135465 134984 134581 134493 134933 135380 135024 134054
54194 134054 133650 134432 135635 136220 136122 135892 135654 135091 134207 133489 133327 133627 134021 134217 134161 133972 133690 133091 131935
54175 131935 130436 129225 128745 128879 129262 129695 130142 130559 130930 131336 131861 132527 133352 134287 135097 135538 135638 135571
54157 135571 135265 134529 133537 132750 132250 131667 130996 130893 131720 132783 133141 132942 133261 134633 136347 137385 137566
54140A37566q8Q9J84Q6Q7K88L51K0m08m01P6M81M38K16K86O46Q82P35L00j88m55
54119A41191k31M38J000Q55R0n63n01K50J161J619J318N62J36N12J228J391P75
54102A51231J8k84k15j58j98k10k01k91n08p66r76r98o46Q2Q73J350J416J265
54084A50784J086Q78N45J52kL03R15J458J819K244K878L532M031M521N160N717
54068A86021N790N196L851J646j087l310m092l680l139l013k926k535k108j946
54054A74668j822j453r76o53m37j72J06M13R62J764K349K336K023K007K340K581
54038A86036K547K642L309M439N453N904N969O226O868P194O357M559L057K691
54024B53251K980K978K551K133J727R53m4n47l16k0l48j216k073k599k757k592
$$ plain form
54140 137566 137478 137567 137751 137837 137924 138212 138563 138583 138175 137774 137850 138331 138769 138985 139271 139917 140799 141534 141834 141646 141191
54119 141191 140960 141398 142398 143253 143343 142780 142279 142529 143690 145309 146627 147189 147325 147837 149065 150456 151231
54102 151231 151249 150965 150750 150592 150394 150184 149983 149692 149184 148418 147442 146444 145798 145880 146753 148103 149519 150784
54084 150784 151870 152748 153293 153445 153443 153746 154661 156119 157938 160182 163060 166592 170623 175144 180304 186021
54068 186021 191811 197007 200858 202504 201417 198107 194015 190335 187196 184183 181257 178722 176614 174668
54054 174668 172846 171393 170417 169764 169327 169155 169261 169674 170636 172400 174749 177085 179108 181115 183455 186036
54038 186036 188583 191225 194534 198973 204426 210330 216299 222525 229393 236587 242944 247503 250560 253251
54024 253251 256231 259209 261760 263893 265620 266573 266529 265982 265666 265646 265298 264082 262009 259410 256653 254061
54008B54061k262k050j991j777j301r95j253j728j666q41J84P47O53M0r32k077
53992B36812l135l877m257m377m404m456m382l782k528j265r20j595k325k226
53978A93283j485q64o13m02j78l03q05j124r42p14r00j131p17K34R31J040J071
53961A86381J409J645J256M92J5J8K38O89J651K904L644L440K770K268J882J344
53945B12046R61J263K004K347K121K168L152M657N933P012Q427J0133J1404J1804
53931B85432J1695J1699J2037J2376J1995J0130O603K300j371l660m862n524n737
53918C43113n369m512l297j607N97K846M465N344O008O773P173O428M461K166
53904C74589N78m3k08m01o87j113j893k891l395l025k530k951m185n175n554o142
$$ plain form
54008 254061 251799 249749 247758 245981 244680 243685 242432 240704 239038 238197 238381 239128 239781 239821 238889 236812
53992 236812 233677 229800 225543 221166 216762 212306 207924 204142 201614 200349 199429 197834 195509 193283
53978 193283 191798 190934 190321 189919 189741 189438 188633 187509 186567 185853 184953 183822 183105 183339 184270 185310 186381
53961 186381 187790 189435 190691 191183 191198 191216 191454 192143 193794 196698 200342 203782 206552 208820 210702 212046
53945 212046 213007 214270 216274 218621 220742 222910 226062 230719 236652 243664 252091 262224 273628 285432
53931 285432 297127 308826 320863 333239 345234 355364 361967 364267 362896 359236 354374 348850 343113
53918 343113 337744 333232 329935 328328 328925 331771 336236 341580 347588 354361 361534 367962 372423 374589
53904 374589 375167 375124 374916 374515 373828 372715 370822 367931 364536 361511 358981 356030 351845 346670 341116 334974
53888C34974p485q758q749p405n839n139n525o365o616n656m043l028l049l294
53874B54023l068k803l091l489l246k620k369k395k060j615j991l140l869l574
53860B14693k969k714k480j885j363j340j439j282j328k058k893k867j994j135
53846A86946p79p00o97q06q62n39M9M19M07L10K75J06k71n74n83l81j10J46J93
53827A82549k00q78j298j054k05R12J875K173J563N56J38O74J462J669J359J188
53811A92483J390J620J641J681J931K235K444K730L264L852M188M310M496M847
53797B33112N228N551N779N700N065L965K838J978J366R73Q44Q20O09L42M77R41
53781B75588Q90j24j340j841j926k501l411l536k652k047k763m181m978m750m009
$$ plain form
53888 334974 327489 318731 309982 302577 296738 291599 286074 279709 273093 267437 263394 260366 257317 254023
53874 254023 250955 248152 245061 241572 238326 235706 233337 230942 228882 227267 225276 222136 218267 214693
53860 214693 211724 209010 206530 204645 203282 201942 200503 199221 197893 195835 192942 190075 188081 186946
53846 186946 186167 185467 184770 183964 183102 182563 182612 183031 183438 183748 184023 184129 183858 183284 182701 182320 182210 182356 182549
53827 182549 182349 181471 180173 179119 178914 179826 181701 183874 185437 185993 186131 186805 188267 189936 191295 192483
53811 192483 193873 195493 197134 198815 200746 202981 205425 208155 211419 215271 219459 223769 228265 233112
53797 233112 238340 243891 249670 255370 260435 264400 267238 269216 270582 271555 272399 273219 273828 274170 274647 275588
53781 275588 276478 276354 275014 273173 271247 268746 265335 261799 259147 257100 254337 250156 245178 240428 236419
53766B36419l168k389k032k386l060l357l252l325l730l831l066j665l55K96K06
53751B01305k82o60o82n76o13o79n67n18r05j454j389m58O45J186J142Q81M95
53734A96871n8n11l83M31J465K047J840J111N65O53J089J274J158J243J670J907
53718B12372J640J323J417J583J263O33K53M5m49r72n85R43K637L540L726L679
53702B33048L418K883K551K865L346L154K425K257L208M509M998M359L144K015
53688B78180J302R90P52K40m70q53n83p1j9n99j322j689j689j629j611j437r55
53671B68537m09k21m38o09m33k51n79j252j523j065m32l24p90j382j680j481q24
53654B54844r7J52j18l21p4K84L35K97N33P67N35J56M29J406K254K432K252K108
$$ plain form
53766 236419 233251 230862 228830 226444 223384 220027 216775 213450 209720 205889 202823 201158 200803 201099 201305
53751 201305 201023 200363 199681 199105 198492 197813 197246 196728 195823 194369 192980 192522 193167 194353 195495 196376 196871
53734 196871 196813 196302 195919 196350 197815 199862 201702 202813 203378 204031 205120 206394 207552 208795 210465 212372
53718 212372 214012 215335 216752 218335 219598 220231 220484 220529 220080 219108 218523 219466 222103 225643 229369 233048
53702 233048 236466 239349 241900 244765 248111 251265 253690 255947 259155 263664 268662 273021 276165 278180
53688 278180 279482 280472 281224 281464 280994 280141 279558 279487 279468 278869 277547 275858 274169 272540 270929 269492 268537
53671 268537 268128 267907 267469 266860 266427 266176 265597 264345 262822 261757 261325 261001 260211 258829 257149 255668 254844
53654 254844 254747 254899 254781 254460 254386 254670 255005 255302 255835 256602 257137 257293 257722 259128 261382 263814 266066 268174
53636B68174J876J452J238J568K067K077J510R04P96J287K053K569K529K246K397
53621B94743L223M234M856N086N231N364N318N085M863M812N046N685O617P280
53607C67443O975N532L540J955J304J220Q08l28j493j693q69nQ7m41j010j310
53591C81715j276q39j88J49j09o18r46j148j439j667j560j254j050r97j076j476
53575C66221k150k449j897j064r05j357j462q97m43o66r34l38R54J883J822J181
53559C57499P54Q79J314J649J710J626J579J646J786J904J827J464J124J359K230
53544C80350K994K940K348K161K819L857M680N175N523N826O169O672P353Q137
53530D47004Q996R849J0373J0375J0285J0776J1823J2640J2724J2437J2400J2857
$$ plain form
53636 268174 270050 271502 272740 274308 276375 278452 279962 280866 281662 282949 285002 287571 290100 292346 294743
53621 294743 297966 302200 307056 312142 317373 322737 328055 333140 338003 342815 347861 353546 360163 367443
53607 367443 374418 379950 383490 385445 386749 387969 388777 388449 386956 385263 384394 384389 384476 384035 383025 381715
53591 381715 380439 379600 379412 379561 379452 378834 377888 376740 375301 373634 372074 370820 369770 368773 367697 366221
53575 366221 364071 361622 359725 358661 357756 356399 354937 354040 353597 352931 351997 351659 352613 354496 356318 357499
53559 357499 358253 359132 360446 362095 363805 365431 367010 368656 370442 372346 374173 375637 376761 378120 380350
53544 380350 383344 386284 388632 390793 393612 397469 402149 407324 412847 418673 424842 431514 438867 447004
53530 447004 456000 465849 476222 486597 496882 507658 519481 532121 544845 557282 569682 582539
53518E82539J3837J5436J7435J9156K0158K0835K1857K3322K4767K5824K6403
53507H11569K6502K6279K6179K6515K6961K6851K5965K4698K3503K2520K1712
53496A089254K1040K0440J9891J9519J9392J9354J9290J9466K0208K1168K1470
53485A310492K0722J9533J8747J8452J8120J7467J6734J6027J4916J2992J0533
53474A494735Q191O099L792J099j449l494n646q725j2336j4991j5826j5525j5221
53461A420703j5162j4998j4921j5661j7405j9440k1002k2002k2714k3147k3059
53450A211192k2437k1674k1220k1132k1016k0382j9132j7567j5909j4019j1732
53439A004972r253o989n073l395j994j093o98m25J74J278K790M458N939P066Q042
$$ plain form
53518 582539 596376 611812 629247 648403 668561 689396 711253 734575 759342 785166 811569
53507 811569 838071 864350 890529 917044 944005 970856 996821 1021519 1045022 1067542 1089254
53496 1089254 1110294 1130734 1150625 1170144 1189536 1208890 1228180 1247646 1267854 1289022 1310492
53485 1310492 1331214 1350747 1369494 1387946 1406066 1423533 1440267 1456294 1471210 1484202 1494735
53474 1494735 1502926 1509025 1512817 1513916 1512467 1508973 1503327 1494602 1482266 1467275 1451449 1435924 1420703
53461 1420703 1405541 1390543 1375622 1359961 1342556 1323116 1302114 1280112 1257398 1234251 1211192
53450 1211192 1188755 1167081 1145861 1124729 1103713 1083331 1064199 1046632 1030723 1016704 1004972
53439 1004972 995719 988730 983657 980262 978268 977175 976477 976052 976226 977504 980294 984752 990691 997757 1005799
53424A005799R248J0771J2351J3769J5035J6176J7174J8237J9777K1853K3909
53413A184099K5415K6561K8009L0000L2080L3846L5540L7671M0155M2334M3862
53402A559572M5314M7525N0476N3209N4924N5796N6494N7256N7856N8273N8799
53391B155494N9504N9974N9809N9007N7746N6016N3742N1033M8211M5623M3381
53380B749540M1057L7777L3050K7527K2467J8318J4292R566M233j320p272j3938
53368B935297k0894k7387l3464l9789m6313n1974n5936n8428n9999o0645o0183
53357B420285n9020n7898n6976n5730n3759n1363m9228m7722m6601m5415m4150
53346A852423m3389m3552m4048m3609m1597l8646l5785l3340l1016k8692k6585
$$ plain form
53424 1005799 1015047 1025818 1038169 1051938 1066973 1083149 1100323 1118560 1138337 1160190 1184099
53413 1184099 1209514 1236075 1264084 1294084 1326164 1360010 1395550 1433221 1473376 1515710 1559572
53402 1559572 1604886 1652411 1702887 1756096 1811020 1866816 1923310 1980566 2038422 2096695 2155494
53391 2155494 2214998 2274972 2334781 2393788 2451534 2507550 2561292 2612325 2660536 2706159 2749540
53380 2749540 2790597 2828374 2861424 2888951 2911418 2929736 2944028 2953594 2957827 2956507 2949235 2935297
53368 2935297 2914403 2887016 2853552 2813763 2767450 2715476 2659540 2601112 2541113 2480468 2420285
53357 2420285 2361265 2303367 2246391 2190661 2136902 2085539 2036311 1988589 1941988 1896573 1852423
53346 1852423 1809034 1765482 1721434 1677825 1636228 1597582 1561797 1528457 1497441 1468749 1442164
53335A442164k4724k2812k0655j8398j6271j4388j2939j2293j2685j3838j4989
53324A258172j5407j4903j3936j3062j2385j1634j0682r642q406o675m629l102
53312A133709k508k037n76J752L732M750N549P119R405J1554J2956J3762J4585
53299A213752J6036J8285K0840K2941K4370K5646K7234K8873K9938L0244L0148
53288A488307K9918K9331K7938K5633K2922K0608J9038J7701J5704J2635Q787
53277A718522M607M03l524o960j0148j3562j7053j9771k1293k2306k3660k5329
53265A559926k6818k8224k9963l1727l2572l2232l1570l1431l1668l1566l0870
53254A221285k9972k9339k9079k8956k8666k8116k7529k7137k6828k6306k5550
$$ plain form
53335 1442164 1417440 1394628 1373973 1355575 1339304 1324916 1311977 1299684 1286999 1273161 1258172
53324 1258172 1242765 1227862 1213926 1200864 1188479 1176845 1166163 1156521 1148115 1141440 1136811 1133709
53312 1133709 1131201 1129164 1128588 1130340 1134072 1138822 1144371 1151490 1160895 1172449 1185405 1199167 1213752
53299 1213752 1229788 1248073 1268913 1291854 1316224 1341870 1369104 1397977 1427915 1458159 1488307
53288 1488307 1518225 1547556 1575494 1601127 1624049 1644657 1663695 1681396 1697100 1709735 1718522
53277 1718522 1723129 1723532 1720008 1713048 1702900 1689338 1672285 1652514 1631221 1608915 1585255 1559926
53265 1559926 1533108 1504884 1474921 1443194 1410622 1378390 1346820 1315389 1283721 1252155 1221285
53254 1221285 1191313 1161974 1132895 1103939 1075273 1047157 1019628 992491 965663 939357 913807
53243I13807k4822k4215k3505k2587k1710k1074k0436j9412j7990j6490j5071
53232F86495j3521j1607r529p874p103p149p546p991q592r506j0522j1290j1856
53219E62409j2680j3969j5252j5704j4919j3354j1951j1210j0676r521p727o337
53207D19109o237p084p798p917p917q287q881r221q982q078o721n599n450o172
53193C14765o761o417n443m719m524m359l761k950k514k675k961k706j897j322
53179B61756j585k184k040j004j77n09j553k140j831j233j047j369j814j954j604
53164B39712j027p71r65j017l82M90N85l24j336j593j223q11m72L7N68O15Q8m49
53146B31725n14l29m17q03r53n29J36M55L04O9J08L75O16O86N79M18M29O93Q17
$$ plain form
53243 913807 888985 864770 841265 818678 796968 775894 755458 736046 718056 701566 686495
53232 686495 672974 661367 651838 643964 636861 629712 622166 614175 605583 596077 585555 574265 562409
53219 562409 549729 535760 520508 504804 489885 476531 464580 453370 442694 433173 425446 419109
53207 419109 412872 405788 397990 390073 382156 373869 364988 355767 346785 338707 331986 326387 320937 314765
53193 314765 308004 301587 296144 291425 286901 282542 278781 275831 273317 270642 267681 264975 263078 261756
53179 261756 260171 257987 255947 254943 254766 254257 252704 250564 248733 247500 246453 245084 243270 241316 239712
53164 239712 238685 237914 236949 235932 235550 236040 236625 236301 234965 233372 232149 231338 230866 230903 231471 232086 232174 231725
53146 231725 231211 230882 230465 229662 228709 228180 228316 228771 229075 229144 229252 229627 230243 230929 231508 231926 232355 233048 233865
53127B33865K12j050j997j820r64n64q74r57j16J047J539J348J293J690J981J714
53111B36347J124N90L6o40j118j119j004j305j825j876j373j039j262j450q84
53096B23202J34O03Q8q53j439j406r46l14K19L55qn49p55m16J61M70L06j09m15
53077B18328m62l03k6K72M49M61M68N55L90m92j910k951k824j662l03M82M47j16
53059B10803o39p68p24r00j054m48R58K116K135J376O90J78m78r29n17M46Q62
53042B13107M78J96N17P09N1r90j501j385j098p52j85L12J90n31j202j302q85
53025B05729l22j4j78n81o10Q5J088J719J824J793J843J749J276N25j90o03o00
53008B14533k52J96M80M20po20j008q41l31j24n55j240j526j153l80L41P16Q28
$$ plain form
53127 233865 234077 233027 231030 229210 228246 227682 226808 225851 225735 226782 228321 229669 230962 232652 234633 236347
53111 236347 237471 238061 238097 237457 236339 235220 234216 232911 231086 229210 227837 226798 225536 224086 223202
53096 223202 223336 223939 224027 223174 221735 220329 219383 219069 219288 219643 219635 219086 218331 217915 218076 218546 218852 218743 218328
53077 218328 217866 217563 217537 217809 218258 218719 219187 219742 220132 219640 217730 214779 211955 210293 209990 210472 210919 210803
53059 210803 210164 209396 208672 207772 206718 206270 207228 209344 211479 212855 213545 213723 213245 212316 211799 212245 213107
53042 213107 213585 213781 214298 215007 215058 214068 212567 211182 210084 209332 209147 209459 209649 209118 207916 206614 205729
53025 205729 205407 205393 205215 204634 204024 204109 205197 206916 208740 210533 212376 214125 215401 215926 215736 215133 214533
53008 214533 214281 214477 214957 215377 215370 214750 213742 212901 212570 212446 211891 210651 209125 207972 207592 207933 208649 209477
52990B09477J010J340J328O22j67l5R57J614J271O30M74M84J14j49M77J602K082
52973B23131J689J239J133Q99L47J58Q61K006K829L089K930K347J319J22q56j406
52957B41837j454r93l14P5j03o61j272j815k269k571k682k569k132j363o27l93
52941B20694o47r03p99m01O2L97L41k88j215j808j778j463j316j393j439j253
52925B06791q66m86l03j80K95J165J811J689J083O11K72l00q23n80L03Q05M64
52908B11751L2K47P48P28L1r21j713j936j297j95L49p8o62n95k42l59p24m97L85
52889B05052J184J478J458J207N94p4j47M67J153J458J421J078L75k79k22M34
52873B16637P23J83l85o2Q67J365J078O21O00Q70Q73L35m58q84n04N17J540K003
$$ plain form
52990 209477 210487 211827 213155 213777 213610 213575 214532 216146 217417 218047 218521 219005 219119 218970 219447 221049 223131
52973 223131 224820 226059 227192 228091 228438 228596 229457 231463 234292 237381 240311 242658 243977 244099 243243 241837
52957 241837 240383 239390 239076 239151 239048 238387 237115 235300 233031 230460 227778 225209 223077 221714 221087 220694
52941 220694 220047 219144 218345 217944 218006 218403 218744 218456 217241 215433 213655 212192 210876 209483 208044 206791
52925 206791 205925 205439 205136 204956 205251 206416 208227 209916 210999 211610 211882 211582 210759 210179 210482 211287 211751
52908 211751 211783 212030 212778 213506 213537 212616 210903 208967 207670 207475 207824 207746 207084 206489 206247 205888 205164 204667 205052
52889 205052 206236 207714 209172 210379 210973 210899 210752 211219 212372 213830 215251 216329 216704 216425 216203 216637
52873 216637 217360 217543 217158 217096 217963 219328 220406 221027 221627 222497 223370 223705 223247 222363 221859 222376 223916 225919
52855B25919J790J124L73K1L63J038J166K94j027j924k215k382k780l264l580
52840B14916l626l287k453j357n91n60j048j449j357q17j46L82P41J053J311J302
52824B03014R53O11O50Q05L11j049k440k829k150j207o04k36K00O64R91J215J435
52807B00334J572J521J340J072N95l7l41J05R84J409Q33n23k066l261l643k945
52791A96949j552m88m42r64j015k43P19J184J148R55O90L03L7K16O60Q18N29K67
52773A99771L78N27K14m56r38j007q27m71J08N36J50j024j984j877j016k84J35
52756A91935P15J486J784J304O93P21J220J379Q23qm96m86j96J39L75M20L25L76
52738B02509Q86J783K575K816K569K278K233K361K366J949R62l21j111p34N24
$$ plain form
52855 225919 227709 228833 229206 229227 229590 230628 231794 232088 231061 229137 226922 224540 221760 218496 214916
52840 214916 211290 208003 205550 204193 203602 203042 201994 200545 199188 198371 198225 198607 199348 200401 201712 203014
52824 203014 203967 204578 205228 206033 206344 205295 202855 200026 197876 196669 196065 195829 196029 196693 197684 198899 200334
52807 200334 201906 203427 204767 205839 206434 206397 206056 206161 207145 208554 209387 208864 206798 203537 199894 196949
52791 196949 195397 194909 194467 193503 192488 192245 192964 194148 195296 196251 196941 197244 197281 197497 198157 198975 199504 199771
52773 199771 200149 200676 200890 200434 199496 198489 197662 197191 197299 197835 197985 196961 194977 193100 192084 191800 191935
52756 191935 192650 194136 195920 197224 197917 198638 199858 201237 202060 202052 201556 201070 200874 201013 201388 201808 202133 202509
52738 202509 203395 205178 207753 210569 213138 215416 217649 220010 222376 224325 225287 224966 223855 223121 223645
52723B23645J568J678J183P42L73l40j387k264k633k641k570k586k702k776k527
52708B06763j887j160n80J9P41J124P24Ro9O93J552J891J837J647J223N22q9k76
52690B14684j55L0K21L76L41J55J01K62L14Rn19j029j419j550j244o39r0L46Q40
52671B11034J147P18k99r33o23K4K31J41K98O37O68L04j64n65o98j77R76J921
52653B14640J939J494J668K679L768M318M323L809K622R57o19j763k555l026l063
52638B31191k811k597k425j991j298o96l31m5J57J41J99Q81K085K935K847K196
52622B30438J657J314Q18J4r12j685j996j565m75O64J118O77j30n33k93j4m13
52605B28684j200j195Q7J530J766R86N06Q15J056O01k4j53M1R9J10L38N81M72
$$ plain form
52723 223645 225213 226891 228074 228816 229189 228849 227462 225198 222565 219924 217354 214768 212066 209290 206763
52708 206763 204876 203716 203136 203155 203896 205020 205744 205753 205684 206377 207929 209820 211657 213304 214527 215049 214960 214684
52690 214684 214529 214559 214780 215156 215497 215652 215753 216015 216329 216338 215819 214790 213371 211821 210577 209938 209848 210194 211034
52671 211034 212181 212899 212600 211667 211044 211068 211299 211440 211738 212375 213043 213347 213183 212618 211920 211743 212719 214640
52653 214640 216579 218073 219741 222420 226188 230506 234829 238638 241260 242217 241598 239835 237280 234254 231191
52638 231191 228380 225783 223358 221367 220069 219373 219042 218997 219154 219295 219494 220375 222460 225395 228242 230438
52622 230438 232095 233409 234227 234241 233329 231644 229648 228083 227608 228272 229390 230067 229937 229404 229111 229097 228684
52605 228684 227484 226289 226376 227906 229672 230658 231164 231979 233035 233636 233612 233459 233500 233599 233709 234047 234628 235100
52587B35100O7l65p46r87q01j49N12P86P82O57K93k17l02J77M89J18k41K51J029
52568B36453P74n48j569j492j009q67p00M9Q95R78L77j72n25j114j792j672m95
52551B27571P56J028N03R2J5k89r41j159l50R14J480R47j33j038j471j344o63
52534B25918K25P17N38J9l90n94p17p15m62n4K00J67J00M37J278K101K184J402
52516B32354M65O8Q5jj36J73R43J643K095K649L249L262K637K301K747L000J944
52499B59478M7j283j678j958k500k720k298j813j720j657j221p10n27m84k64n2
52483B38640j44l46l37k81m89p19l92N30J423J701J320O37J35J71O64J053Q83
52466B44449L63P3J91M00M88O70J206J983K613K751K355J740J298J034N12m59
$$ plain form
52587 235100 235167 234802 234056 233069 232268 232119 232631 233417 234199 234856 235149 234932 234630 234807 235296 235414 235173 235424 236453
52568 236453 237227 236679 235110 233618 232609 231742 231042 231091 231986 232964 233341 233169 232644 231530 229738 228066 227571
52551 227571 228327 229355 229858 229950 229965 229676 228735 227576 227226 228140 229620 230567 230434 229396 227925 226581 225918
52534 225918 226143 226860 227398 227417 227027 226433 225716 225001 224539 224485 224685 224852 224952 225389 226667 228768 230952 232354
52516 232354 232819 232887 232972 232971 232835 233008 233951 235594 237689 240338 243587 246849 249486 251787 254534 257534 259478
52499 259478 259525 258242 256564 254606 252106 249386 247088 245275 243555 241898 240677 239967 239440 238956 238692 238640
52483 238640 238496 238150 237813 237532 237043 236324 235932 236462 237885 239586 240906 241543 241678 241849 242513 243566 244449
52466 244449 244812 244885 245076 245476 245964 246634 247840 249823 252436 255187 257542 259282 260580 261614 262126 261667
52450B61667j360j556j288j429k272l109l263k963k821k863k612j880r81j91M75
52435B33554R35R41M70j00m35o81j163j748j758p23R45K170K237J464P46O14R11
52418B38379J305J679J975K027J788J484J319J253J334J894L071M415N432O311
52404B73666P575R105J0129J0202R502Q083N547J879j979m931o750p835q322q031
52390B97840p107o091n259m367l163j841q80n53o68o46k6J019J753J737J428J588
52374B74764K268K850K999L041L341L767M026M159M379M672M793M591M072L294
52360C27016K343J396N71k00j026j830k331k273j608m98P59J837K469K551K231
52345C31407J907K046K811L844M481M373L895L896M892O473P658Q022Q261R356
$$ plain form
52450 261667 260307 258751 257463 256034 253762 250653 247390 244427 241606 238743 236131 234251 233270 233079 233554
52435 233554 234489 235430 235900 235800 235365 234684 233521 231773 230015 229292 230237 232407 234644 236108 236854 237468 238379
52418 238379 239684 241363 243338 245365 247153 248637 249956 251209 252543 254437 257508 261923 267355 273666
52404 273666 281241 290346 300475 310677 320179 328262 333809 335688 333709 328778 322028 314193 305871 297840
52390 297840 290733 284642 279383 275016 271853 270012 269132 268579 267911 267265 267239 268258 270011 271748 273176 274764
52374 274764 277032 279882 282881 285922 289263 293030 297056 301215 305594 310266 315059 319650 323722 327016
52360 327016 329359 330755 331326 331126 330100 328270 325939 323666 322058 321560 322319 324156 326625 329176 331407
52345 331407 333314 335360 338171 342015 346496 350869 354764 358660 363552 370025 377683 385705 393966 403322
52331D03322J1308J3104J3938J3977J3841J3966J4704J6412J8865K1021K2008
52320E76466K2123K2311K2886K3336K3203K2466K1246J9762J8526J7885J7369
52309H07579J6159J4241J2392J0978R614Q107O868O093N332M399L867M038M096
52296I13763K995Q24j376k811l395l422l423m123n774p665q791q960q752q525
52282H50565q047o962n186k853k63K148M188O133Q277J0432J2254J3771J5120
52269H99577J6017J6128J5766J5592J5630J5297J4327J3046J1716J0300R028Q378
52257A060802Q249P840O705N375M501L905K927J382l30j759k704l230l769m905
52243A084989o731q604r879j0685j1665j3102j4709j6017j6653j6350j5185j3712
$$ plain form
52331 403322 414630 427734 441672 455649 469490 483456 498160 514572 533437 554458 576466
52320 576466 598589 620900 643786 667122 690325 712791 734037 753799 772325 790210 807579
52309 807579 823738 837979 850371 861349 870963 879070 885938 892031 897363 901762 905629 909667 913763
52296 913763 916758 917582 916206 913395 910000 906578 903155 899032 893258 885593 876802 867842 859090 850565
52282 850565 842518 835556 830370 827517 827254 829402 833590 839723 848000 858432 870686 884457 899577
52269 899577 915594 931722 947488 963080 978710 994007 1008334 1021380 1033096 1043396 1052424 1060802
52257 1060802 1069051 1076891 1083596 1088971 1093472 1097377 1100304 1101686 1101356 1099597 1096893 1093663 1089894 1084989
52243 1084989 1078258 1069654 1059775 1049090 1037425 1024323 1009614 993597 976944 960594 945409 931697
52231I31697j2462j1324r776p768o001n128m982m739l793k328j113p22q95p73
52217H59893J68J447K098J813J390J880L457N237O185O156O006O574P675Q250
52203I18229P592O089M636L592K719J897J375J289J432J562J605J430R19M47P03
52188I55516J672K258J555J87l91K04P92K47j145k317k834l096l438l720l786
52173I41704l855m287n127n999o397o139n568n137m749l779j988n4J167J667K136
52158H93595K915L630L898L872L887L934L674K844J569L98o6J98N34M66M56J218
52142I27022K471L175L055K990L570M145L998L679M253N672O876P438Q100R553
52128I95997J1486J3274J4940J6981J9491K1935K3790K5130K6520K8322L0129
$$ plain form
52231 931697 919235 907911 898135 890367 884366 879238 874256 869517 865724 863396 862283 861561 860666 859893
52217 859893 860061 861508 863606 865419 866809 868689 872146 877383 883568 889724 895730 902304 909979 918229
52203 918229 925821 931910 936546 940138 942857 944754 946129 947418 948850 950412 952017 953447 954366 954813 955516
52188 955516 957188 959446 961001 961188 960797 961001 961793 962040 960895 958578 955744 952648 949210 945490 941704
52173 941704 937849 933562 928435 922436 916039 909900 904332 899195 894446 890667 888679 888625 889792 891459 893595
52158 893595 896510 900140 904038 907910 911797 915731 919405 922249 923818 924216 924150 924348 924882 925348 925804 927022
52142 927022 929493 932668 935723 938713 942283 946428 950426 954105 958358 964030 970906 978344 986444 995997
52128 995997 1007483 1020757 1035697 1052678 1072169 1094104 1117894 1143024 1169544 1197866 1227995
52117A227995L1072L0821L0104K9816K9798K8926K6459K2826J8961J5286J1677
52106A503741Q064M601J309k026n438q464j0455j1272j1525j2016j2909j3610
52094A430000j3485j2573j1447j0566r978r559r314r318r514r635r367q597p578
52081A299069o636n757m602l058j398J69J892M114O749R411J1838J3814J4976
52068A340581J5184J5009J5273J6037J6511J6078J5003J3920J3005J1866J0092
$$ plain form
52117 1227995 1259067 1289888 1319992 1349808 1379606 1408532 1434991 1457817 1476778 1492064 1503741
52106 1503741 1511805 1516406 1517715 1515689 1510251 1501787 1491332 1480060 1468535 1456519 1443610 1430000
52094 1430000 1416515 1403942 1392495 1381929 1371951 1362392 1353078 1343760 1334246 1324611 1315244 1306647 1299069
52081 1299069 1292433 1286676 1282074 1279016 1277618 1277787 1279679 1283793 1290542 1299953 1311791 1325605 1340581
52068 1340581 1355765 1370774 1386047 1402084 1418595 1434673 1449676 1463596 1476601 1488467 1498559
$$ [...]
##END NTUPLES=NMR SPECTRUM
##END=
