
##TITLE=AC1211_MCiAH12042_7165471_DYK4JUfp71
##JCAMPDX= 6.0         $$ Bruker NMR JCAMP-DX V2.0
##DATA TYPE= NMR SPECTRUM
##DATA CLASS= NTUPLES
##ORIGIN= BRUKER
##OWNER= Administrator
$$ 1.72 TOPSPIN		Version 2.1
$$ 2012-12-02 03:54:46.835 -0500  Administrator@X
$$ Compression mode = diff/dup
##.OBSERVE FREQUENCY= 400.02188249412
##.OBSERVE NUCLEUS= ^1H
##.ACQUISITION MODE= SIMULTANEOUS (DQD)
##.ACQUISITION SCHEME= undefined
##.AVERAGES= 8
##.DIGITISER RES= 22
##SPECTROMETER/DATA SYSTEM= spect
##.PULSE SEQUENCE= zg30
##.SOLVENT NAME= COFFEE_meoh
##.SHIFT REFERENCE= INTERNAL, COFFEE_meoh, 1, 14.98509
##AUDIT TRAIL= $$ (NUMBER, WHEN, WHO, WHERE, PROCESS, VERSION, WHAT)
$$ ##TITLE= Audit trail, TOPSPIN		Version 2.1
$$ ##JCAMPDX= 5.01
$$ ##ORIGIN= Bruker BioSpin GmbH
$$ ##OWNER= Administrator
$$ $$ E:\/data/COFFEE/nmr/AC1211_MCiAH12042_7165471_DYK4JUfp71/10/pdata/1/auditp.txt
$$ ##AUDIT TRAIL=  $$ (NUMBER, WHEN, WHO, WHERE, PROCESS, VERSION, WHAT)
(   1,<2012-12-02 03:54:38.710 -0500>,<Administrator>,<X>,<go>,<TOPSPIN 2.1>,
      <created by zg
	started at 2012-12-02 03:53:32.600 -0500,
	POWCHK enabled, PULCHK disabled,
       configuration hash MD5:
       86 BA 57 50 F2 9D 5C 9B 26 00 A9 28 5F 66 2E 89
       data hash MD5: 64K
       B6 CF 1E 2D DD 66 BA 0C 05 82 E1 58 0A C7 6F CC>)
(   2,<2012-12-02 03:54:41.803 -0500>,<Administrator>,<X>,<proc1d>,<TOPSPIN 2.1>,
      <Start of raw data processing
       efp LB = 0 FT_mod = 6 PKNL = 1 PHC0 = 0 PHC1 = 0 SI = 32K 
       data hash MD5: 32K
       EE 2A 6D 4B 18 7A 34 90 1B 80 C1 7E F2 8F FC E5>)
(   3,<2012-12-02 03:54:42.272 -0500>,<Administrator>,<X>,<proc1d>,<TOPSPIN 2.1>,
      <pk PHC0 = 95.79529 PHC1 = 0 
       data hash MD5: 32K
       97 DB 73 3C B8 66 2F D1 92 C9 3D A0 0A E9 2D D9>)
(   4,<2012-12-02 03:54:42.491 -0500>,<Administrator>,<X>,<proc1d>,<TOPSPIN 2.1>,
      <abs ABSG = 1 
       data hash MD5: 32K
       12 90 F0 87 79 E6 28 5B 63 9D 02 D7 E4 8F F3 A9>)
(   5,<2012-12-02 03:54:42.647 -0500>,<Administrator>,<X>,<proc1d>,<TOPSPIN 2.1>,
      <abs ABSG = 2 
       data hash MD5: 32K
       03 50 DA 78 EE 1E 90 74 4A 68 08 76 5E C3 DF 48>)
(   6,<2012-12-02 03:54:42.788 -0500>,<Administrator>,<X>,<proc1d>,<TOPSPIN 2.1>,
      <abs ABSG = 3 
       data hash MD5: 32K
       06 C1 23 43 79 C4 0F 55 12 EE 9A A4 F0 99 55 CB>)
(   7,<2012-12-02 03:54:42.944 -0500>,<Administrator>,<X>,<proc1d>,<TOPSPIN 2.1>,
      <abs ABSG = 4 
       data hash MD5: 32K
       CC 00 6F 20 40 B2 BC 7A 1F 15 94 60 47 D5 19 4F>)
(   8,<2012-12-02 03:54:43.131 -0500>,<Administrator>,<X>,<proc1d>,<TOPSPIN 2.1>,
      <abs ABSG = 5 
       data hash MD5: 32K
       66 DA AD BD 24 8F 0B A4 57 E6 F6 9F 65 69 74 99>)
$$ ##END=
$$ 
$$ $$ hash MD5
$$ $$ 05 7D 0A E7 6E 67 7B 11 6A 9B 9B 98 71 D6 1B ED
##$RELAX= 
##$RELAX= 
##$RELAX= 
##$RELAX= 
##$RELAX= 
##$RELAX= 
##$RELAX= 
$$ Bruker specific parameters
$$ --------------------------
##$DU= <E:\>
##$EXPNO= 10
##$NAME= <AC1211_MCiAH12042_7165471_DYK4JUfp71>
$$ [...]
##$TP= (0..7)
150 150 150 150 150 150 150 150
##$TP07= 0
##$TPNAME0= <>
##$TPNAME1= <>
##$TPNAME2= <>
##$TPNAME3= <>
##$TPNAME4= <>
##$TPNAME5= <>
##$TPNAME6= <>
##$TPNAME7= <>
##$TPOAL= (0..7)
0.5 0.5 0.5 0.5 0.5 0.5 0.5 0.5
##$TPOFFS= (0..7)
0 0 0 0 0 0 0 0
##$TUNHIN= 0
##$TUNHOUT= 0
##$TUNXOUT= 0
##$USERA1= <user>
##$USERA2= <user>
##$USERA3= <user>
##$USERA4= <user>
##$USERA5= <user>
##$V9= 5
##$VALIST= <valist>
##$VCLIST= <CCCCCCCCCCCCCCC>
##$VD= 0
##$VDLIST= <DDDDDDDDDDDDDDD>
##$VPLIST= <PPPPPPPPPPPPPPP>
##$VTLIST= <TTTTTTTTTTTTTTT>
##$WBST= 1024
##$WBSW= 4
##$XGAIN= (0..3)
0 0 0 0
##$XL= 0
##$YL= 0
##$YMAX_a= 617970
##$YMIN_a= -521695
##$ZGOPTNS= <>
##$ZL1= 120
##$ZL2= 120
##$ZL3= 120
##$ZL4= 120
##$ABSF1= 14.98509
##$ABSF2= -5.573092
##$ABSG= 5
##$ABSL= 3
##$ALPHA= 0
##$AQORDER= 0
##$ASSFAC= 0
##$ASSFACI= 0
##$ASSFACX= 0
##$ASSWID= 0
##$AUNMP= <proc_prof1d_extract_pilot.lims>
##$AXLEFT= 0
##$AXNAME= <>
##$AXNUC= <1H>
##$AXRIGHT= 0
##$AXTYPE= 0
##$AXUNIT= <>
##$AZFE= 0.1
##$AZFW= 0.1
##$BCFW= 0
##$BC_mod= 0
##$BYTORDP= 0
##$COROFFS= 0
##$CY= 15
##$DATMOD= 1
##$DC= 0
##$DFILT= <>
##$DTYPP= 0
##$F1P= 0
##$F2P= 0
##$FCOR= 0.5
##$FTSIZE= 32768
##$FT_mod= 6
##$GAMMA= 0
##$GB= 0
##$INTBC= 1
##$INTSCL= 1
##$ISEN= 128
##$LB= 0
##$LEV0= 0
##$LPBIN= 0
##$MAXI= 10000
##$MC2= 0
##$MEAN= 0
##$ME_mod= 0
##$MI= 0
##$NCOEF= 0
##$NC_proc= -8
##$NLEV= 6
##$NOISF1= 0
##$NOISF2= 0
##$NSP= 0
##$NTH_PI= 0
##$NZP= 0
##$OFFSET= 14.98509
##$PC= 1
##$PHC0= 95.79529
##$PHC1= 0
##$PH_mod= 1
##$PKNL= yes
##$PPARMOD= 0
##$PPDIAG= 0
##$PPIPTYP= 0
##$PPMPNUM= 2147483647
##$PPRESOL= 1
##$PSCAL= 4
##$PSIGN= 0
##$PYNMP= <proc.py>
##$REVERSE= no
##$SF= 400.02
##$SI= 32768
##$SIGF1= 0
##$SIGF2= 0
##$SINO= 400
##$SIOLD= 32768
##$SPECTYP= <>
##$SREGLST= <1H.CDCl3>
##$SSB= 0
##$STSI= 32768
##$STSR= 0
##$SW_p= 8223.68421052631
##$SYMM= 0
##$S_DEV= 0
##$TDeff= 65536
##$TDoff= 0
##$TI= <>
##$TILT= no
##$TM1= 0
##$TM2= 0
##$TOPLEV= 0
##$USERP1= <user>
##$USERP2= <user>
##$USERP3= <user>
##$USERP4= <user>
##$USERP5= <user>
##$WDW= 1
##$XDIM= 32768
##$YMAX_p= 472650060
##$YMIN_p= -685052
##$CURPLOT= <Network HP LaserJet P1505>
##$CURPRIN= <$Network HP LaserJet P1505>
##$DFORMAT= <normdp>
##$LAYOUT= <+/1D_H.xwp>
##$LFORMAT= <normlp>
##$PFORMAT= <normpl>
##$SURQMSG= 1
$$ End of Bruker specific parameters
$$ ---------------------------------
##NTUPLES= NMR SPECTRUM
##VAR_NAME=  FREQUENCY,     SPECTRUM/REAL,   SPECTRUM/IMAG
##SYMBOL=    X,             R,               I
##VAR_TYPE=  INDEPENDENT,   DEPENDENT,       DEPENDENT
##VAR_FORM=  AFFN,          ASDF,            ASDF
##VAR_DIM=   32768,         32768,           32768
##UNITS=     HZ,            ARBITRARY UNITS, ARBITRARY UNITS
##FACTOR=    0.250966925370066, 1,           1
##FIRST=     8223.43324360094, 65828,        -57229
##LAST=      0,             -80222,          16420
##MIN=       0,             -685052,         0
##MAX=       8223.43324360094, 472650060,    0
$$ Real data points
##PAGE= N=1
##DATA TABLE= (X++(R..R)), XYDATA
$$ [...]
$$ plain form
19518 -143359 -162199 -394321 236561 -168115 159454 -179784 -519654 -6524 -189076 67922
19507 -127226 -123691 28041 155825 -178834 -15464 45608 -314270 -277797 60303 -8153 1036
19495 191664 -209354 -127588 -34342 61860 -393511 203840 -69462 59117 -258269 -153269
19485 -153269 -18406 -339210 37540 -363745 -947 158531 21129 7369 -243016 119422 223247
19474 223247 -312499 -27514 57328 175684 102391 -13022 -300882 -42397 -105863 34636 -314515
19462 223684 -128672 -294470 -165975 43072 113112 -37710 -87961 170331 -108825 -217773
19452 -217773 41134 -143749 49054 -101901 -180369 -168450 -166811 -332168 209490 -278264 -113874
19440 18243 -25304 -50541 -111367 -254394 -139395 -97916 -289309 102455 -310680 -30108 85084
$$ packed form
19518a43359j8840k32122B36561a68115A59454a79784l39870f524j82552F7922
19507a27226L535B8041J27784a78834a5464D5608c14270L6473F0303h153A036
19495A91664b09354Q1766c4342F1860c93511B03840f9462E9117b58269J05000
19485a53269a8406l20804C7540c63745i47A58531B1129G369b43016A19422J03825
19474B23247c12499b7514E7328J18356p3293a3022k87860d2397o3466C4636c14515
19462B23684a28672j65798J28495D3072P0040c7710n0251A70331a08825j08948
19452b17773D1134a43749D9054a01901p8468J1919J639j65357B09490b78264a13874
19440A8243b5304k5237o0826j43027J14999M1479j91393A02455c10680c0108H5084
$$ plain form
19428 58851 -302689 -271668 -151002 -10945 -102062 -140620 -94521 -74320 -276204 -180467 -272466
19417 -272466 -64396 -1752 369356 -46403 95314 131735 -43597 -349467 251987 146165 -421498
19405 212866 -417251 -82188 -147674 -85137 -291782 112280 22381 -111466 -231312 -345503
19395 -345503 75264 20191 -57888 -120107 -39927 -228238 -5946 -103166 13434 -44225 -9017 -148490
19383 -148490 112285 78183 -152494 247746 184256 -192943 -143358 74885 57203 -49423 -88528
19372 -88528 -95686 -238255 -292783 106878 -103055 -32374 -378548 -142903 -93608 4484 6567
19361 6567 -73990 -87112 147809 68585 -29382 -120859 -315450 169642 -326789 -157316 -184447
19350 -184447 1542 -57932 -30587 391836 -126434 -91010 -28794 -95296 -348882 -147321 -229705
$$ packed form
19428E8851c02689L1021J20666a0945r1117l8558M6099K0201k01884R5737r1999
19417b72466f4396a752C69356d6403I5314L6421d3597l05870B51987j05822d21498
19405B12866d17251h2188o5486O2537k06645A12280B2381a11466j19846j14191
19395c45503G5264B0191e7888o2219c9927j88311e946r7220A3434d4225i017j39473
19383a48490A12285l4102a52494B47746o3490a92943M9585G4885j7682d9423l9105
19372h8528p158j42569n4528A06878a03055c2374l46174a42903M9295D484K083
19361F567g3990j3122A47809F8585b9382r1477j94591A69642c26789a57316k7131
19350a84447A542e7932K7345C91836a26434L5424b8794o6502k53586a47321q2384
$$ plain form
19339 -229705 164521 107570 135503 -129709 -49974 -103896 79107 -1965 51978 14474 -120505
19327 -18846 -133979 -192612 -183008 75094 -140757 -251852 -352157 47055 -46087 -362830 152030
19315 -41611 -152765 -205615 -187475 -49733 164512 258309 -85751 120722 17845 53963 -164880
19303 169908 -196823 -62257 -80692 -305335 79250 -270889 -168400 209110 15000 29804
19293 29804 69336 -573388 -381074 50670 -374340 -87806 -215250 -44949 -217292 -215814 -172135
19282 -172135 -68757 128418 -196760 -198826 57809 -288371 192891 -4137 -150960 77347 10992
19270 168077 23118 89247 -195956 -455997 203525 -32231 -51090 137326 29698 31877 -9006
19258 -12797 115957 -295738 -194263 -8949 57688 58604 -311539 -123571 59804 -187567 -91425
$$ packed form
19339b29705A64521n6951K7933a29709d9974n3922G9107a965E1978A4474a20505
19327a8846j15133n8633R604G5094a40757j11095j00305D7055d6087l16743A52030
19315d1611j11154n2850J8140d9733A64512R3797h5751A20722A7845L6118a64880
19303A69908a96823f2257j8435k24643G9250b70889J02489B09110A5000J4804
19293B9804L9532e73388J92314E0670c74340h7806j27444d4949j72343J478M3679
19282a72135f8757A28418a96760k066E7809b88371A92891d137j46823G7347A0992
19270A68077B3118O6129a95956k60041B03525c2231j8859A37326B9698K179i006
19258a2797A15957b95738J01475h949E7688R16c11539a23571E9804a87567i1425
$$ plain form
19246 -21994 -60272 -193417 -15669 -106299 -27721 -248750 276979 230156 -62193 -216332 -57284
19234 41534 87832 -40332 -119490 -487168 -93577 -219938 -147715 32474 99793 -37995 -219686
19223 -219686 -199050 -36133 183879 26030 -123845 -37470 -152349 57520 -225907 -557723
19213 -557723 59448 -247375 -87165 -257239 -366163 -156935 101380 -281820 -218655 -71877
19202 6361 -297828 -226644 -264607 -42888 444431 126808 -104061 250508 -147374 84367 -178853
19190 -75722 -390431 327585 11318 -67424 -100333 -6614 127687 -78221 -50924 -281393 310901
19178 178813 360082 339689 -16987 -318190 78651 -214167 210732 183353 -252322 79006
19167 -195800 -139386 -44825 -159608 253447 -221989 -81150 -60779 50341 -88369 -123924 -80653
$$ packed form
19246b1994l8278j33145a5669r0630b7721k21029B76979m6823f2193j54139e7284
19234D1534M6298d0332p9158l67678i3577j26361P2223C2474O7319c7995j81691
19223b19686K0636c6133A83879B6030a23845c7470j14879E7520b25907l31816
19213e57723E9448b47375h7165j70074j08924a56935A01380b81820O3165g1877
19202F361b97828P1184l7963d2888D44431A26808a04061B50508a47374H4367a78853
19190g5722l14709C27585A1318f7424l2909f614A27687g8221K7297k30469C10901
19178A78813J81269k0393a6987l01203G8651b14167B10732k7379b52322G9006
19167a95800N6414d4825j14783B53447b21989h1150K0371E0341h8369l5555M3271
$$ plain form
19156 -80653 -152222 -304922 -120609 317692 114389 -301925 -352700 -181367 -302995 -236680
19146 -236680 32743 20240 -141010 -354722 -51709 93166 -45194 -358307 96534 101961 -194650
19134 140510 -65805 137263 -57548 -225939 -100307 21183 84273 -122764 145170 -2150 -18864
19123 -18864 -192207 122727 83865 233673 54296 13110 65149 -103747 449866 171626
19112 -51148 39697 141861 -161994 51971 143145 -148754 -386549 -149926 86563 -54381 -27769
19101 -27769 -375710 -293414 -18950 -60396 169949 -253412 -56215 90419 -199458 4826 -235646
19089 -114963 -281022 -22717 75506 -112373 -124661 136041 -195627 -349219 43802 -35438
19078 33921 258226 -54670 -143181 345908 87274 -174428 129390 163477 -205465 9736 523876
$$ packed form
19156h0653p1569j52700a20609C17692A14389c01925n0775J71333j21628O6315
19146b36680C2743j2503a41010k13712e1709I3166d5194l13113I6534N427a94650
19134A40510f5805A37263e7548j68391a00307B1183O3090a22764A45170b150j6714
19123a8864j73343A22727l8862J49808E4296A3110N2039a03747D49866A71626
19112e1148C9697J02164a61994E1971R1174a48754k37795a49926H6563e4381K6612
19101b7769l47941Q2296a8950m1446A69949b53412e6215I0419a99458D826b35646
19089a14963j66059b2717G5506a12373j2288A36041a95627j53592D3802c5438
19078C3921K24305e4670q8511C45908H7274a74428A29390L4087b05465I736N14140
$$ plain form
19067 523876 -551901 -182007 -292894 -118604 -333749 6490 -217742 89067 -4966 -262954
19057 -262954 168347 67265 -14685 -470693 45077 -157566 -202624 -218484 22169 -177738 -153450
19046 -153450 -473385 -130492 -119153 -101029 -251452 -224564 -122407 195180 346149 -148683
19035 -129313 -319397 -198941 4537 56404 -99144 110335 -274126 156168 -30000 30926 38130
19024 38130 125641 -3088 -75041 168732 -342186 58652 -55426 77447 -214001 135708 -190647
19012 84080 -32084 273597 -113180 -43464 26542 40180 213088 -168486 -66920 -142154 402978
19000 -292290 -349781 88743 79895 -222680 64266 -54627 165495 24160 -3531 -65210 51851
18988 15051 39833 -213375 29909 33011 287218 5732 32981 195916 91392 -30711 5081 68390
$$ packed form
19067E23876e51901a82007j10887a18604k15145F490b17742H9067d966k57988
19057b62954A68347F7265a4685m56008D5077a57566m5058j5860B2169a77738K4288
19046a53450l19935a30492J1339J8124j50423K6888J02157A95180J50969a48683
19035a29313j90084J20456D537N1867i9144A10335b74126A56168c0000C0926P204
19024C8130Q7511c088p1953A68732c42186E8652e5426G7447b14001A35708a90647
19012H4080c2084B73597a13180d3464B6542J3638J72908a68486f6920p5234D02978
19000b92290n7491H8743q848b22680F4266e4627A65495B4160c531o1679E1851
18988A5051K4782b13375B9909L102K54207E732K7249J62935I1392c0711E081O3309
$$ plain form
18976 68390 38813 73997 348810 -379920 164052 329026 697644 521562 165657 331522
18966 331522 -282976 -76061 276347 -27900 256275 -219038 97863 -118711 -351371 41466
18955 238523 73672 231178 -122830 -214849 123906 -192230 -229059 237970 -10411 -165034
18945 -165034 -322414 -13371 -280 49859 166510 -175518 127175 14186 -299589 -42352 -293591
18934 -293591 -23330 107406 -160615 39545 -24216 -244362 -135574 137644 -146933 -59599
18923 294999 -7045 68121 -222262 -84681 -221710 -43889 -30607 120541 198191 -166713 -288879
18912 -288879 -68486 -151305 -39778 -54796 -16787 417344 586579 481916 380102 51426 235715
18901 235715 67033 202697 -81098 -164648 -310063 -196583 5479 -283509 41798 46199 -227110
$$ packed form
18976F8390k9577L5184K74813c79920A64052J64974L68618j76082A65657J65865
18966C31522b82976g6061B76347b7900B56275b19038I7863a18711k32660D1466
18955B38523G3672J57506a22830r2019A23906a92230l6829B37970a0411j54623
18945a65034j57380a3371b80D9859J16651a75518A27175A4186b99589d2352k51239
18934b93591b3330A07406a60615C9545b4216k20146J08788A37644a46933e9599
18923B94999g045F8121b22262h4681j37029d3889J3282A20541P7650a66713j22166
18912b88879f8486q2819c9778j5018a6787D17344J69235j04663j01814E1426J84289
18901B35715F7033J35664h1098q3550j45415J13480E479b83509D1798M401b27110
$$ plain form
18889 96546 -102907 75005 -30034 -82773 283269 157086 173201 57628 -282117 -260933 -352418
18878 -352418 112359 -451743 -180813 -234074 23288 -159063 -9584 -258684 -207850 189679
18867 -103247 -52015 -476024 35059 -46315 109301 -9224 -319994 -190218 -956 2691 287742
18856 287742 -30647 -223678 -230521 154023 52920 189520 41166 -286217 -375498 107264 -94602
18844 14403 13089 108732 49453 2670 -473409 -114790 29420 187164 -60571 -133965 -23399
18832 53217 37803 -133337 12023 976 -25960 -78061 -275451 121606 -316303 -281219 -314614
18821 -314614 -307117 -41080 125774 120872 132771 52154 48849 91917 222699 -78327 -167185 98802
18808 314875 139111 335273 170107 153290 61141 254316 -31574 43395 -249126 -147082
$$ packed form
18889I6546a02907G5005c0034n2739B83269j26183J6115E7628b82117K1184r1485
18878c52418A12359d51743a80813n3261B3288a59063i584k49100N0834A89679
18867a03247N1232m24009C5059d6315A09301i224l10770J29776i56B691K85051
18856B87742c0647j93031o843A54023E2920J36600D1166b86217q9281A07264i4602
18844A4403j314R5643D9453B670d73409a14790B9420J57744f0571p3394b3399
18832E3217j5414a33337A2023I76b5960n2101j97390A21606c16303L5084l3395
18821c14614P497d1080A25774m902J1899E2154l305M3068J30782g8327q8858I8802
18808C14875A39111J96162j65166j6817F1141J93175c1574D3395b49126J02044
$$ plain form
18798 -147082 -157639 -444408 78424 -33277 -323174 -341890 -342917 -92603 -29199 -28834 -91538 76398
18785 30874 -140834 51293 -291556 21010 83422 54063 43890 164903 165086 30447 42140
18774 42140 -354323 -94896 -66475 198226 400762 -85150 100257 7985 -62915 -133384 -278641
18763 -278641 -73419 -184778 21540 -130911 -74412 -202720 96970 -382053 191709 33613
18752 -143685 -214065 -151910 245774 96155 116453 102480 -135504 93653 30432 -177648 -286875
18741 -286875 124118 -89664 43928 69988 67823 9575 -113123 65438 285107 -113420 -380970
18730 -380970 -209089 302763 17578 -244676 2571 13415 -1417 -305862 -28304 136637 58453
18718 -90896 -365215 -68000 -203866 -219887 -5231 -1658 37205 -149675 -64062 -180858 -230876
$$ packed form
18798a47082j0557k86769G8424c3277k89897j8716j027i2603b9199L65o2704G6398
18785C0874a40834E1293b91556B1010O2412k9359j0173J21013J83C0447J1693
18774D2140c54323i4896K8421A98226K02536h5150A00257G985f2915p0469j45257
18763b78641g3419j11359B1540a30911N6499j28308I6970c82053A91709C3613
18752a43685p0380O2155B45774I6155K0298j3973a35504I3653C0432a77648j09227
18741b86875A24118h9664D3928K6060k165I575a13123F5438K19669a13420k67550
18730c80970J71881C02763A7578b44676B571J0844a417l04445b8304A36637E8453
18718i0896k74319f8000j35866j6021e231a658C7205a49675f4062j16796n0018
$$ plain form
18707 -230876 -148660 -327533 -362634 -144766 27551 15503 -95078 -47345 -8632 262012 -50495
18695 -201304 114720 -161096 -243857 -79067 -210772 -52764 -600 -203409 -399237 -262088 316167
18683 -88099 -135815 -139965 7106 187834 -95179 78082 -105422 -159039 -172992 74458 148110 107549
18671 107549 90028 -3553 149242 191818 235843 -65687 136263 -100582 -401653 -77753 -120129
18660 -120129 -276975 -130126 -255331 175995 -277600 -293681 -220397 -91237 56078 134357
18650 134357 7506 -277566 219383 -75258 91684 22468 -106967 174562 113210 246006 506815
18639 506815 37689 139745 -175695 10889 93475 -148800 -26620 -401380 -319637 24071 22426
18628 22426 -115073 42288 -322344 219957 284909 -176613 -50461 128284 65316 -77843 -132189
$$ packed form
18707b30876Q2216j78873l5101a44766B7551j2048i5078d7345h632B62012e0495
18695b01304A14720a61096q2761g9067j31705e2764f00k02809j95828J37149C16167
18683h8099m7716m150G106J80728i5179G8082a05422n3617j3953G4458P3652m0561
18671A07549j7521c553A49242M2576M4025f5687A36263a00582l01071g7753m2376
18660a20129j56846a30126j25205A75995b77600j6081P3284i1237E6078P8279
18650A34357G506b77566B19383g5258I1684B2468a06967A74562o1352J32796K60809
18639E06815C7689J02056a75695A0889Q2586a48800b6620l74760Q1743B4071j645
18628B2426a15073D2288c22344B19957O4952a76613e0461A28284o2968g7843n4346
$$ plain form
18617 -132189 -170478 81329 147287 259803 103133 -210209 -7543 -88327 -275612 -5436 321685
18605 -126391 -88516 -216509 -298352 -234789 -2109 -2719 241 95875 113085 -35540 57354 -202074
18592 -90540 -90289 -91815 86680 568 -260930 66066 -290156 -206012 44167 -15909 -20576 -383527
18580 -383527 -55630 50465 31155 -88623 363052 14518 92783 -102264 -181212 -170116 -175205
18569 -175205 -222666 100467 -309902 160546 -145841 -73771 -226723 -141850 -36059 -250100
18559 -250100 84223 -75599 35039 -64197 237134 -182451 -60305 -198874 -242717 163318 48893
18547 87518 -203672 -85391 -143556 -106651 430500 -2223 314912 137107 -512954 105743 45453
18535 32057 61525 -70000 1674 -130655 -137424 -186072 94632 -165312 -204741 -111697 -298114
$$ packed form
18617a32189l8289H1329O5958J12516A03133b10209g543q0784j87285e436C21685
18605a26391L7875j27993q1843O3563b109o10B41R5634J7210c5540E7354b02074
18592i0540K51j526H6680E68b60930F6066b90156Q4144D4167a5909m667l62951
18580c83527e5630E0465j9310h8623C63052A4518P8265a02264p8948J1096n089
18569a75205m7461A00467c09902A60546a45841P2070j52952Q4873c6059k14041
18559b50100H4223g5599C5039f4197B37134a82451f0305j38569m3843A63318D8893
18547H7518b03672h5391n8165L6905D30500b223C14912A37107e12954A05743D5453
18535C2057K9468g0000A674a30655o769m8648I4632a65312l9429R3044j86417
$$ plain form
18524 -298114 244269 5109 -154349 4754 130466 -8662 -70255 135404 -88773 260546 -40484
18512 188925 91333 -312667 -443620 -79876 248858 204639 -65947 -71293 137058 -204269 -190103
18501 -190103 24735 -147038 326993 122246 38931 205330 -90478 141834 -137420 27341
18490 50220 -138444 157897 444513 -196887 -40 -196378 10428 -111880 -74837 61549 -34502
18478 77033 -142850 -184075 84232 -61624 2907 365317 -117379 553751 -18543 -22354 -133979
18467 -133979 -177872 40971 80804 -285172 114969 222441 -259716 -329754 -481574 -21714
18456 -19745 -313433 -484931 227944 -114265 -78553 101091 86326 -4382 -168113 -161815 -169615
18445 -169615 -202796 88308 247134 -165646 -329035 -317000 -176480 54417 203860 15953
$$ packed form
18524b98114B44269E109a54349D754J25712h662o1593A35404h8773B60546d0484
18512A88925I1333c12667j30953g9876B48858m4219f5947n346A37058b04269J4166
18501a90103B4735a47038C26993A22246C8931J66399i0478A41834a37420B7341
18490E0220a38444A57897K86616a96887d0j96338A0428a11880L7043F1549c4502
18478G7033a42850m1225H4232f1624B907L62410a17379E53751a8543l811j11625
18467a33979m3893D0971L9833b85172A14969J07472b59716p0038j51820b1714
18456a9745k93688j71498B27944a14265L5712A01091j4765d382j63731O298p800
18445a69615l3181H8308J58826a65646j63389J2035J40520E4417J49443A5953
$$ plain form
18434 64518 -373561 12718 -61984 117040 -46609 -263220 -27684 -255716 239062 158193 -185451
18422 100221 -192247 -247495 40880 -177198 131374 -147388 164420 -171244 110983 17785
18411 -106898 -18596 235172 13706 65680 -209926 -15874 51346 70281 135672 -252200 -72996
18399 -3495 2481 123974 95947 22377 -168017 -244536 37713 -234846 -170180 -400445 279935
18387 131152 317314 -28622 99976 63197 -66035 -300676 -73866 -267798 26293 -163047 -33989
18375 16380 34141 -6161 26499 54346 96304 6367 -75508 96528 -75691 134766 -12946 105936
18362 66094 -224911 97601 -114261 -126838 5964 79643 75254 59762 -168536 88439 14822
18350 288734 -131617 -128545 150852 28776 -129606 20614 -25769 -131540 -87473 -105240 86713
$$ packed form
18434F4518c73561A2718f1984A17040d6609k16611b7684k28032B39062q0869a85451
18422A00221a92247n5248D0880a77198A31374a47388A64420a71244A10983A7785
18411a06898a8596B35172A3706N1974b09926a5874E1346J8935O5391b52200g2996
18399c495B481J21493k8027B2377a68017p6519C7713b34846O4666k30265B79935
18387A31152J86162b8622I9976l6779f6035k34641g3866j93932B6293a63047c3989
18375A6380J7761f161B6499K7847M1958F367g5508I6528g5691A34766a2946A05936
18362F6094b24911I7601a14261j2577E964P3679m389j5492a68536H8439A4822
18350B88734a31617L072A50852B8776a29606B0614b5769j05771M4067j7767H6713
$$ plain form
18338 28584 265259 -55850 -334761 -348790 -9056 -91485 235655 155997 -52029 45059 160228
18327 160228 159917 -89532 -42735 268904 -24010 -87014 66098 1004 -335742 -242396 33166 -71767
18314 -403850 31830 95359 -32031 -105600 86975 367263 -119207 -202649 75635 277735 282
18302 -105977 -120059 57114 25922 -412002 -76574 118165 24411 306328 -58218 86515 73253
18291 73253 288364 -280683 -188604 -224548 -68114 -99030 -23937 -329085 -235499 112742 -128310
18279 -126428 -514985 -106907 300903 -12848 -92078 91639 133326 245621 -36578 -86667 -184864
18268 -184864 113701 36276 -18740 -191602 10989 317206 358579 190363 -26429 -185987
18258 -185987 -48272 128445 139226 114914 147347 140785 215239 -190626 -79560 -250 -175207
$$ packed form
18338B8584K36675e5850k78911j4029i056q2429B35655p9658e2029D5059J15169
18327A60228l11h9532d2735B68904b4010o3004F6098A004c35742R3346C3166g1767
18314d03850C1830O3529c2031p3569H6975K80288a19207q3442G5635K02100B82
18302a05977j4082E7114B5922d12002g6574A18165B4411K81917e8218H6515j3262
18291G3253K15111b80683R2079l5944f8114l0916b3937l05148R3586A12742a28310
18279a26428l88557a06907C00903a2848p9230I1639M1687J12295c6578n0089r8197
18268a84864A13701C6276a8740j72862A0989L06217M1373j68216b6429j59558
18258a85987d8272A28445J0781k4312L2433o562P4454a90626g9560b50j74957
$$ plain form
18247 -175207 -106863 -114027 -285855 98923 233457 -192026 -206398 121948 -263753 154290
18236 -99215 178966 -104186 183539 43292 -57474 75963 -121410 23756 56872 5355 -59845
18224 -230050 254830 -172473 200792 -246375 196469 282309 -156736 -138749 -301914 -104284
18213 4809 259447 59753 233980 -52747 140853 158828 36834 -41401 360792 40152 55944
18202 55944 -213790 -279597 -124638 66347 80845 -52050 222365 -162428 -241681 -782 233214
18190 144396 306220 -20525 155854 -326746 -59137 302313 -55708 -32898 111081 -310223
18179 101754 122887 383977 -273088 -360827 -5971 -122894 -104982 12577 -53881 115650 383771
18168 383771 -79892 -192679 40532 72783 -252680 -111758 -292321 122522 -220850 70746
$$ packed form
18247a75207O8344p164j71828I8923J34534a92026j4372A21948b63753A54290
18236i9215A78966a04186A83539D3292e7474G5963a21410B3756L3116E355e9845
18224b30050B54830a72473B00792b46375A96469Q5840a56736J7987j63165a04284
18213D809K54638E9753J74227e2747A40853J7975C6834d1401C60792D0152J5792
18202E5944b13790o5807a24638F6347J4498e2050B22365a62428p9253g82B33214
18190A44396J61824b0525A55854c26746e9137C02313e5708K2810A11081c10223
18179A01754K1133K61090b73088q7739e971j16923J7912A2577e3881A15650K68121
18168C83771g9892j12787D0532L2251b52680a11758j80563A22522b20850G0746
$$ plain form
18157 -117230 -147947 -54226 27502 -3196 -83567 124876 -130781 -54808 -132672 30699 106978
18146 106978 -200610 -228735 -246098 2395 208228 -311552 310714 -68102 27650 -222135 35613
18134 -51456 -103692 77345 219246 -210229 -81587 96313 -317190 314515 -161867 -121941 357825
18122 -291509 -91896 268950 -53640 104845 -221718 -31724 -126267 -200415 -1998 -138454 98642
18110 -42966 -26567 84619 122226 -8276 -76406 -82495 45342 -128062 162007 85989 166995 -274451
18097 161319 199188 21486 -23836 -495093 246676 78731 11837 -216912 -90065 287807 -152725
18085 -112878 -167888 -23982 39589 7387 -105208 192023 -156861 90250 -96768 -271415 219716
18073 12822 83136 -142631 -306537 -243493 72532 35604 -19790 128945 -91009 50495 -79377
$$ packed form
18157a17230l0717e4226B7502c196q0371A24876a30781e4808p7864C0699P6279
18146A06978b00610k8125j7363B395K05833c11552C10714f8102B7650b22135C5613
18134e1456n2236G7345J41901b10229h1587I6313c17190C14515a61867L9926C57825
18122b91509i1896B68950e3640A04845b21718c1724r4543p4148a998j36456I8642
18110d2966J6399H4619L7607h276o8130o089D5342a28062A62007p6018Q1006b74451
18097A61319L7869B1486b3836m71257B46676G8731A1837b16912i0065B87807a52725
18085a12878n5010b3982C9589G387a05208A92023a56861I0250i6768j74647B19716
18073A2822P0314a42631j63906O3044G2532C5604a9790A28945i1009E0495g9377
$$ plain form
18061 1248 45499 -278962 -475549 -318530 108318 96306 -258645 293152 54581 74677 -130927
18049 -63836 -19152 1187 47030 183075 7961 -343557 140429 -34861 -70244 186494 -15467
18037 172011 30170 -119876 140849 -214963 151650 97000 -57992 200048 -180971 167828
18026 -291841 -34226 333001 247959 18156 178723 -167619 -3887 409349 272740 -66013 -107522
18015 -107522 -120977 81586 -125503 -31628 -298168 -71055 -11221 150818 200083 -1730 183279
18003 -2117 84149 -303176 -80956 -192035 9588 -231445 -199227 242392 232012 -13741 -38157
17992 -38157 60477 113486 302042 110786 276003 -233026 -58579 -196525 -40011 147885
17981 17564 86403 165629 -329084 -99838 -66240 136435 137691 -39667 50105 341299 -313304
$$ packed form
18061A248M4251b78962j96587J57019A08318j2012b58645B93152E4581K0096a30927
18049f3836a9152A187M5843J36045G961c43557A40429c4861l5383A86494a5467
18037A72011C0170a19876A40849b14963A51650n4650e7992B00048a80971A67828
18026b91841c4226C33001q5042A8156J60567a67619c887D09349j36609f6013m1509
18015a07522j3455H1586a25503c1628k66540g1055a1221A50818M9265a730A83279
18003b117H4149c03176h0956j11079I588b31445L2218B42392j0380a3741k4416
17992c8157F0477N3009J88556A10786J65217b33026e8579j37946d0011A47885
17981A7564O8839P9226c29084i9838L3598A36435J256c9667E0105K91194c13304
$$ plain form
17969 188788 -96443 124013 -138732 97438 -16239 325663 -12012 -62819 -53798 -244681 25737
17957 186781 318033 -299848 -29364 -209191 34257 127873 331779 59445 -55860 107710
17946 -7283 324090 -877 -162806 -173096 -22143 -123440 33148 -217560 -9895 -52421 -33663 -19427
17934 -19427 -86484 51679 -250305 -88876 -187224 -375660 222990 -45345 99792 -386501 18950
17922 -183132 -115591 -239517 325300 -56719 308826 205934 253479 271450 -308089 105329
17911 173642 -62430 -103347 163514 63845 102107 -48970 -43734 -89207 138300 299695 169607
17900 169607 2204 51020 -169706 -163915 160044 -55647 45905 219126 -28384 20655 275385
17889 275385 52703 209960 411884 327734 -82343 -322177 -157785 105959 70005 -200558
$$ packed form
17969A88788i6443A24013a38732I7438a6239C25663a2012n0807R021j90883B5737
17957A86781J31252b99848b9364j79827C4257R3616K03906E9445e5860A07710
17946g283C24090h77j61929j0290b2143j01297C3148b17560i895m2526J8758J4236
17934a9427o7057E1679b50305h8876r8348j88436B22990d5345I9792c86501A8950
17922a83132O7541j23926C25300e6719C08826j02892M7545J7971c08089A05329
17911A73642f2430m0917A63514F3845L8262d8970N236m5473A38300J61395j30088
17900A69607B204M8816a69706N791A60044e5647D5905J73221b8384B0655K54730
17889B75385E2703J57257K01924q4150h2343k39834a57785A05959l5954b00558
$$ plain form
17878 3085 -20668 56730 113448 -184833 -59668 -261056 -171761 122351 29080 -246766 215983
17866 -158517 121206 420800 140541 -373375 94671 131534 -301151 407716 -152762 50634
17855 -53941 27491 -168146 218347 -175774 -2867 -23777 151037 -124373 81610 179988 250408
17844 250408 281940 253973 308431 -40746 -302275 15706 -61334 40878 -20114 -166388 61049
17832 339668 157439 -230579 126825 -236002 22251 34194 72855 -89637 154133 -174869
17821 -99848 -178652 366802 66324 -191260 71381 3237 99443 -8271 -24412 -53105 -261685
17810 -261685 -3233 5766 19252 -56764 52803 -157950 67811 238407 -55808 460669 -29241
17798 365452 335283 -85846 38972 221337 34996 -230910 64657 -377685 -7555 46408 26104
$$ packed form
17878C085b0668E6730N6718a84833e9668k01388Q9295A22351B9080b46766B15983
17866a58517A21206K99594A40541c73375I4671L6863c01151D07716a52762E0634
17855e3941B7491a68146B18347a75774b867k0910A51037a24373H1610R8378P0420
17844B50408L1532k7967N4458d0746k61529A5706f1334D0878b0114j46274F1049
17832C39668A57439b30579A26825b36002B2251J1943L8661h9637A54133a74869
17821i9848p8804C66802F6324a91260G1381C237R6206h271j6141k8693k08580
17810b61685c233E766J3486e6764E2803a57950F7811J70596e5808D60669b9241
17798C65452l0169h5846C8972J82365C4996b30910F4657c77685g555D6408k0304
$$ plain form
17787 26104 -89701 -238878 -23152 -51435 -57935 250473 -12746 -64054 64046 70534 190567
17776 190567 -555121 121396 394480 394212 138872 -63233 -108780 -29192 -191035 61436 179693
17765 179693 258426 -228099 220962 347167 144980 169137 179596 -51700 -152841 85621
17754 -226394 -10709 -41864 -69162 4513 26758 223867 -261464 67115 15491 141993 217461
17743 217461 -95727 41683 17639 219755 289025 -27421 -52561 87000 87613 22958 -145409
17731 -53277 233619 19701 -132485 -139372 250959 -228900 -217062 360599 -69482 220675 51555
17719 -100033 -82199 -74697 -16778 93416 22003 -26967 97578 41181 -105220 -2942 35936 280226
17707 280226 302801 63736 20818 139655 167616 96701 494357 257007 -148896 211078
$$ packed form
17787B6104h9701j49177b3152k8283o500B50473a2746n1308F4046O488J20033
17776A90567e55121A21396K73084k68A38872f3233m5547b9192j61843F1436J18257
17765A79693P8733b28099B20962J26205A44980K4157J0459e1700j01141H5621
17754b26394a0709l1155k7298D513K2245J97109b61464F7115A5491J26502P5468
17743B17461i5727D1683A7639K02116O9270b7421k5140H7000O13B2958a45409
17731e3277B33619A9701a32485o887B50959b28900J1838C60599f9482B20675E1555
17719a00033J7834P502a6778I3416B2003b6967I7578D1181a05220b942C5936K44290
17707B80226K2575F3736B0818J18837K7961p0915L97656k37350a48896B11078
$$ plain form
17696 -17717 259293 -61695 381556 315396 -84110 -33798 133578 44845 -188351 74202 -39385
17684 75012 102694 129730 215439 348822 -7553 -221440 369065 81949 -178891 53310 287465
17673 287465 -59213 -71983 243695 -263340 4217 50925 141996 -348994 245952 -126613 -2132
17661 93581 162020 56655 -230122 298194 24504 133802 -143573 370475 -63987 -264465
17651 -264465 417925 -120753 -175906 112186 113990 392299 300769 12657 435768 110932
17640 146899 276152 110061 88364 135426 193564 158723 -12047 246693 110520 143014 118016
17629 118016 41690 -84515 -52415 22345 135422 429046 -76967 321522 155465 -4339 24000
17617 106164 367612 328489 25373 225294 -162200 13866 459738 -52675 38151 -181141
$$ packed form
17696a7717B59293f1695C81556o6160h4110c3798A33578D4845a88351G4202c9385
17684G5012K7682K7036Q5709J33383g553k13887C69065H1949a78891E3310K34155
17673B87465e9213j2770B43695b63340D217M6708R1071c48994B45952a26613b132
17661I3581O8439E6655b30122B98194B4504J09298a43573C70475f3987k00478
17651b64465D17925a20753n5153A12186J804K78309r1530A2657M23111A10932
17640A46899J29253A10061k1697M7062N8138l4841a2047B46693A10520L2494k4998
17629A18016D1690h4515L2100B2345J13077K93624g6967C21522A55465d339B4000
17617A06164K61448l9123B5373J99921a62200A3866M45872e2675C8151a81141
$$ plain form
17606 93565 -91528 -5909 -10898 69367 197408 -19921 -50733 -9068 -272826 139789 157199 -197126
17593 83440 11029 -415380 418940 -75820 177402 263211 -130652 -56928 7384 266454 266012
17582 266012 9289 -93218 -6530 7421 135540 410773 281308 -69792 109916 -15141 83599
17570 453794 -5139 101719 128205 259526 50597 83685 328664 31653 252858 -107160 664160
17558 -267652 -121590 9980 168219 14899 219251 173776 153831 350592 163778 -22960 -23781
17547 -23781 356226 -812 219075 207904 36316 25697 312595 198936 199330 -39757 150021
17535 314831 47160 180078 112836 -64482 129448 204738 298414 53908 212964 273925 387260
17524 387260 1096179 784064 1021323 762165 801129 660947 595713 277154 236392 341720
$$ packed form
17606I3565i1528e909m989F9367J28041a9921l0812i068k63758A39789J7410a97126
17593H3440A1029d15380D18940g5820A77402Q5809a30652e6928G384K59070m42
17582B66012I289i3218f530G421J28119K75233j29465f9792A09916a5141H3599
17570D53794e139A01719K6486J31321E0597L3088K44979C1653K21205a07160F64160
17558b67652a21590I980J58239A4899K04352m5475j9945J96761A63778b2960q21
17547b3781C56226h12B19075j1171C6316j0619K86898j13659L94c9757A50021
17535C14831D7160J32918o7242f4482A29448P5290R3676E3908J59056O0961J13335
17524C87260P08919l12115K37259k59158L8964j40182o5234B77154m0762J05328
$$ plain form
17514 341720 -77183 534271 373550 631624 567990 670474 861707 954632 804803 515848
17504 515848 495546 456057 459545 476611 379051 323240 494114 223313 280062 488595 -1426
17492 366837 89734 -139094 543133 90413 387396 194698 291303 146671 668143 263401
17481 745464 221136 256172 381602 35045 40306 18591 369060 514401 162629 149280 130221
17470 130221 234677 199221 134991 159913 252010 293735 192952 324922 43350 106711 277264
17459 277264 440770 6758 371792 162902 135836 82778 334209 89517 236031 450146
17449 450146 346772 205772 205284 616241 155225 241018 662703 342920 696819 270471
17438 13733 296626 464409 61215 145701 173825 125428 -174717 164994 356078 302049 231542
$$ packed form
17514C41720g7183E34271j60721K58074o3634J02484J91233R2925j49829k88955
17504E15848k0302l9489L488J7066r7560n5811J70874B23313N6749K08533a426
17492C66837H9734a39094E43133I0413K96983j92698R6605j44632N21472B63401
17481G45464B21136L5036J25430C5045N261A8591L50469J45341A62629j3349j9059
17470A30221J04456l5456o4230K4922R2097M1725j00783J31970D3350O3361J70553
17459B77264J63506F758L65034A62902k7066n3058K51431H9517J46514K14115
17449D50146j03374j41000m88M10957A55225Q5793M21685l19783L53899B70471
17438A3733K82893J67783F1215Q4486K8124m8397a74717A64994J91084n4029p0507
$$ plain form
17427 231542 259961 180682 132360 331859 493879 366574 404040 235434 640244 458545
17417 458545 -84513 260691 16882 365035 449433 380241 541752 -44783 147649 609543
17407 609543 213433 560388 170819 279284 30576 132502 554885 61258 390852 79072
17396 181495 297099 102331 59381 129517 213836 18785 312679 590649 213487 52981
17385 608480 127932 131501 74895 5504 119993 16228 400438 164839 89952 381960 124082
17373 89673 164705 232629 326018 159653 -100995 -92313 133264 162788 212028 523334 132142
17361 407563 104702 77656 60561 267690 428310 457333 92055 29854 587236 426533
17351 426533 418677 338811 223925 706303 419519 430512 70246 45800 610568 265127 175773
$$ packed form
17427B31542K8419p9279m8322J99499J62020j27305L7466j68606M04810j81699
17417D58545h4513B60691A6882L48153Q4398o9192J61511d4783A47649M61894
17407F09543B13433L46955A70819J08465C0576J01926M22383F1258L29594G9072
17396A81495J15604A02331m2950P0136Q4319A8785K93894K77970B13487E2981
17385F08480A27932L569n6606E504J14489A6228L84210A64839p4887K92008A24082
17373H9673P5032O7924R3389A59653a00995Q682A33264K9524M9240L11306A32142
17361D07563A04702k7046j7095K07129J60620K9023I2055B9854N57382j60703
17351D26533p856p9866j14886M82378k86784J0993G0246k4446N64768B65127q9354
$$ plain form
17340 175773 211095 372952 253440 328320 -4481 285756 342223 -95043 392853 193535 420155
17329 420155 144026 -204670 -24662 501604 510834 -68329 504427 278482 244869 118215
17318 192933 93176 401717 254373 -6653 319824 42433 386586 -9729 526129 -127489 274109
17306 171126 300779 115661 149280 224589 202177 253630 21377 5124 315607 195733 25807
17294 207449 163153 170079 90238 471034 171382 99768 344350 337434 310447 307660 503066
17283 503066 417340 304233 -211834 -118112 358338 -135457 165717 571667 344159 179716
17273 179716 432082 316345 504445 -23888 223463 446221 137410 337932 346587 387955
17263 387955 44264 207572 265129 601544 93355 -27661 283052 363279 237381 277348 178593
$$ packed form
17340A75773L5322J61857j19512P4880d481B85756N6467i5043C92853A93535K26620
17329D20155A44026b04670b4662E01604R230f8329E04427k25945l3613A18215
17318A92933I3176L08541j47344f653C19824D2433L44153i729E26129a27489B74109
17306A71126J29653A15661L3619P5309k2412N1453B1377E124L10483j19874B5807
17294B07449m4296O926p9841L80796A71382p1614K44582o916k6987k787J95406
17283E03066q5726j13107b11834R3722C58338a35457A65717M05950k27508j64443
17273A79716K52366j15737J88100b3888B23463K22758A37410K00522Q655M1368
17263C87955D4264J63308N7557L36415I3355b7661B83052Q0227j25898L9967r8755
$$ plain form
17252 178593 214211 381531 141538 313178 59400 165946 319831 480513 254275 218911
17242 218911 371193 88867 327891 168477 255209 430972 256398 409132 440391 48490
17231 218401 237999 -2382 532549 391197 -66499 231597 322813 410433 593300 249039 505081
17220 505081 875085 171908 334273 398160 342477 345189 -42452 357180 333457 -35082 237108
17208 152381 268332 701320 111072 151992 282761 423028 411298 146456 -72499 72255
17197 128681 307251 616342 447699 470983 567746 536013 265908 463906 503083 275274
17187 275274 198165 280592 258612 343396 394659 587455 318914 350672 440321 316396 523219
17176 523219 497201 374791 378734 176779 487765 699367 72517 156309 286900 483494
$$ packed form
17252A78593L5618J67320A41538J71640E9400J06546J53885J60682k26238l5364
17242B18911J52282H8867K39024j59414Q6732J75763j74574J52734L1259D8490
17231B18401J9598b382E32549j41352f6499B31597R1216Q7620J82867B49039K56042
17220E05081L70004A71908J62365O3887n5683K712d2452C57180k3723c5082B37108
17208A52381J15951M32988A11072M0920J30769J40267j1730A46456g2499G2255
17197A28681J78570L09091j68643K3284R6763l1733B65908J97998L9177k27809
17187B75274p7109Q2427k1980Q4784N1263J92796k68541L1758Q9649j23925K06823
17176E23219k6018j22410L943A76779L10986K11602G2517Q3792J30591J96594
$$ plain form
17166 483494 473724 670797 332278 390213 451799 762252 205572 754573 456526 729800
17156 729800 449281 186794 351651 328388 483940 195339 627860 414370 410743 574896
17146 574896 646779 623664 477470 522729 431326 155595 447497 447206 428000 441117 256790
17135 256790 562773 541551 485644 724815 447503 197284 418793 396801 290425 707238
17125 707238 748756 686237 542848 338758 610204 318235 628433 266620 719814 512772
17115 512772 824178 786953 403959 341653 559309 458353 534059 471006 807069 238294
17104 533966 303926 447312 420460 709779 634891 463225 389824 809087 757563 422055
17094 422055 642898 590925 564774 515744 566391 308384 544902 631199 668561 745887 439473
$$ packed form
17166D83494r770J97073C32278N7935O1586L10453B05572N49001k98047K73274
17156G29800k80519A86794J64857k3263J55552A95339M32521k13490l627J64153
17146E74896P1883k3115j46194M5259r1403A55595K91902k91j9206J3117j84327
17135B56790L05983k1222n5907K39171k77312A97284K21509k1992j06376M16813
17125G07238M1518o2519j43389k04090K71446k91969L10198B66620M53194k07042
17115E12772L11406l7225l82994o2306K17656j00956P5706o3053L36063B38294
17104E33966k30040J43386k6852K89319p4888j71666p3401M19263n1524l35508
17094D22055K20843n1973k6151m9030N0647k58007K36518Q6297L7362P7326l06414
$$ plain form
17083 439473 629332 646564 531796 430869 395341 733620 896318 948889 519384 760766
17073 760766 628981 563801 853967 610949 673295 646349 880500 710077 758358 958393
17063 958393 549744 669697 729142 925109 516334 853047 677169 700222 741199 620325
17053 620325 603559 808063 694954 739078 828967 797416 866829 529791 985114 1011200 537464
17042 537464 769969 839982 663891 759457 800543 782415 911014 847604 641112 952566
17032 952566 821065 829400 863782 816663 1086380 823675 929335 847007 1016012 1068493 833146
17021 833146 878283 1038747 1061982 800437 1117372 984817 1004266 872276 1161330 610726
17011 610726 856515 708397 1022362 801090 1025554 992640 970006 1074334 1484882 1203204
$$ packed form
17083D39473J89859J7232j14768j00927l5528L38279J62698N2571m29505K41382
17073G60766j31785o5180K90166k43018O2346k6946K34151j70423M8281K00035
17063I58393m08649J19953N9445J95967m08775L36713j75878K3053M0977j20874
17053F20325j6766K04504j13109M4124Q9889l1551O9413l37038M55323K6086m73736
17042E37464K32505P0013j76091R5566M1086j8128J28599o3410k06492L11454
17032I52566j31501Q335L4382m7119K69717k62705J05660q2328J69005N2481k35347
17021H33146M5137J60464K3235k61545L16935j32555J9449j31990K89054n50604
17011F10726K45789j48118L13965k21272K24464l2914k2634J04328M10548k81678
$$ plain form
17001 1203204 1050020 1042167 1157039 837806 1022903 982111 1069728 1225746 1118555 641250
16991 641250 1251193 1164001 1167054 889626 946574 1502566 1235573 1066579 989133 1171220
16981 1171220 1171991 1021924 1318833 1580414 1438952 1066737 1164044 1061304 1166574 1278461
16971 1278461 1366163 1148061 1293737 1651771 1402566 1245641 1201246 1487321 1567026 1370041
16961 1370041 1337531 1639048 1451686 1625616 1623346 1025378 1665443 1498671 1304482 1814883
16951 1814883 1759553 1535995 1632114 1795718 1624520 1404644 1415102 1964927 1546467 1725476
16941 1725476 1593613 1674611 1822035 1806586 1787334 2088997 2011927 2066554 1666598 1590897
16931 1590897 1935616 2050869 1814741 1810200 1817148 1853580 1915181 1907205 2309563 1969842 2373146
$$ packed form
17001A203204j53184p853J14872l19233J85097m0792Q7617J56018j07191m77305
16991F41250O09943q7192L053k77428N6948N55992k66993j68994p7446J82087
16981A171220P71j50067K96909K61581j41462l72215R7307j02740J05270J11887
16971A278461Q7702k18102J45676L58034k49205j56925m4395K86075P9705j96985
16961A370041l2510L01517j87362J73930k270n97968O40065j66772j94189N10401
16951A814883n5330k23558R6119J63604j71198k19876J0458N49825m18460J79009
16941A725476j31863Q0998J47424j5449j9252L01663p7070N4627l99956p5701
16931A590897L44719J15253k36128m541O948L6432O1601p976M02358l39721M03304
$$ plain form
16920 2373146 2182091 2062581 1855977 2168572 2252312 2329164 2016611 2197870 2190812 2474432
16910 2474432 1890495 2474581 2293902 2130790 2363742 2323041 2474394 2583454 2210157 2401327
16900 2401327 2353013 2597874 2587987 2819098 2540560 2872355 2457715 2964111 3007576 2939045
16890 2939045 2762481 2808917 3092462 2704498 3045992 2900915 3097467 2982186 3176141 3130011
16880 3130011 3244338 3066285 3290199 3404588 3156542 3135114 3315293 3591101 3285121 3663030
16870 3663030 3562611 3666284 3914757 3730183 3616199 3818428 3772838 3951245 4126077 4001502
16860 4001502 4364144 4398865 4252867 3977587 4269826 4768293 4658515 4333591 4845883 4665715
16850 4665715 4768763 4698519 4649158 5196215 4928279 5019030 5355912 5294254 5150900 5575839
$$ packed form
16920B373146j91055j19510k06604L12595Q3740P6852l12553J81259p058K83620
16910B474432n83937N84086j80679j63112K32952m0701J51353J09060l73297J91170
16900B401327m8314K44861r887K31111k78538L31795m14640N06396M3465o8531
16890B939045j76564M6436K83545l87964L41494j45077J96552j15281J93955m6130
16880C130011J14327j78053K23914J14389k48046k1428J80179K75808l05980L77909
16870C663030j00419J03673K48473j84574j13984K02229m5590J78407J74832j24575
16860D001502L62642L4721j45998k75280K92239M98467j09778l24924N12292j80168
16850D665715J03048p0244m9361N47057k67936R0751L36882o1658j43354M24939
$$ plain form
16840 5575839 5617013 5610413 5797871 5869536 5811118 6549351 6228971 6312766 6238913 6575042 6686967
16829 6686967 6649825 6721699 6483338 6957182 7203610 7297706 7074924 7351033 7763274 7594923
16819 7594923 8183273 8195106 8170162 8746147 8439459 8879114 8525825 9114747 9413932 9365896
16809 9365896 9869590 9938530 9893330 10243788 10392284 10485635 11158622 11057794 11483720 11944651
16799 11944651 11891997 12528928 12670961 13008384 13109631 13532303 13538306 14003488 14269387 14479546
16789 14479546 15192411 15450176 16060243 16303731 16593346 17211741 17564715 18549923 18640115
16780 18640115 19288972 19614007 20452628 20910282 21799414 22103108 22715949 23421064 24226647
16771 24226647 25081248 25925621 26529349 27830303 28561060 29461992 30418121 31675986 32247740
$$ packed form
16840E575839M1174o600J87458P1665n8418P38233l20380Q3795p3853L36129J11925
16829F686967l7142P1874k38361M73844K46428R4096k22782K76109M12241j68351
16819G594923N88350J1833k4944N75985l06688M39655l53289N88922K99185m8036
16809I365896N03694O8940m5200L50458J48496R3351O72987j00828M25926M60931
16799A1944651n2654O36931J42033L37423J01247M22672O003M65182K65899K10159
16789A4479546P12865K57765O10067K43488K89615O18395L52974R85208R0192
16780A8640115O48857L25035Q38621M57654Q89132L03694O12841P05115Q05583
16771B4226647Q54601Q44373O03728J300954P30757R00932R56129J257865N71754
$$ plain form
16762 32247740 33700061 34846534 35893270 37292565 38563834 40012919 41629938 42776947
16754 42776947 44767475 46345716 48014213 50006905 51920587 53800826 55787700 58052093
16746 58052093 60619265 62936175 65360536 67623355 70183256 73121947 75829369 78851598
16738 78851598 81747842 84761732 87861675 90566788 93328153 96827903 99584032 102432730
16730 102432730 105405093 108189621 110606098 113270481 115380656 117044575 118556728 120108064
16722 120108064 120984196 121675918 121787629 121614687 121307187 120847134 119790140 117929346 116377503
16713 116377503 114656367 112287677 109700564 107294710 104131244 101532891 98586645 95631859
16705 95631859 92481909 89417882 86047748 83152317 80391603 77452568 74635385 71910351
$$ packed form
16762C2247740J452321J146473J046736J399295J271269J449085J617019J147009
16754D2776947J990528J578241J668497J992692J913682J880239J986874K264393
16746E8052093K567172K316910K424361K262819K559901K938691K707422L022229
16738G8851598K896244L013890L099943K705113K761365L499750K756129K848698
16730A02432730K972363K784528K416477K664383K110175J663919J512153J551336
16722A20108064Q76132O91722J11711j72942l07500m60053j056994j860794j551843
16713A16377503j721136k368690k587113k405854l163466k598353k946246k954786
16705I5631859l149950l064027l370134k895431k760714k939035k817183k725034
$$ plain form
16697 71910351 69130129 66550077 63717809 61222215 59177562 56987288 54524371 52792855
16689 52792855 50677167 48900846 46756054 44875525 43354868 41743649 40060065 39042689
16681 39042689 37436101 36102465 34985552 33733946 32741417 31343643 30438291 29184696
16673 29184696 28050078 27097661 26595728 25807348 24908874 24069988 23797248 22585283 22029587
16664 22029587 21238485 20841199 19979077 19631014 18716952 18096629 17625965 17421298 16771697
16655 16771697 16578607 15674716 15965688 15331152 14744437 14381274 13905558 13539412 13277572
16646 13277572 13051211 12916387 12080946 12168046 12133328 11664406 11341621 10985385 10970051 10771363
16636 10771363 9931529 9661771 9818150 9749568 9441522 9128692 9292890 8719366 8653032 8060212
$$ packed form
16697G1910351k780222k580052k832268k495594k044653k190274k462917j731516
16689E2792855k115688j776321k144792j880529j520657j611219j683584j017376
16681C9042689j606588j333636j116913j251606r92529j397774r05352j253595
16673B9184696j134618r52417n01933p88380q98474q38886k72740j211965n55696
16664B2029587p91102l97286q62122l48063r14062o20323m70664k04667o49601
16655A6771697j93090r03891K90972o34536n86715l63163m75716l66146k61840
16646A3277572k26361j34824q35441Q7100l4718m68922l22785l56236j5334j98688
16636A0771363q39834k69758J56379o8582l08046l12830J64198n73524o6334n92820
$$ plain form
16626 8060212 8254396 8091423 7798750 7971510 7586947 7483717 7284897 7090764 7260342
16617 7260342 7436009 6771099 6717617 6281524 6479378 6337369 6392819 5928784 5856468 6192588
16607 6192588 5876033 5874157 5783826 5490514 5613419 5217882 5255337 5369239 5132115 4946449
16597 4946449 5017106 5243908 4864043 4786256 4740821 4899394 5049486 4464487 4579801 4403485
16587 4403485 4294950 3947719 4296901 4003873 4256410 4066517 3750170 3737976 3559958 3654754
16577 3654754 3576761 3581336 3404614 3461395 3364511 3225916 3207719 3680615 3342584 3277455 3221315
16566 3221315 3269785 3059710 3258992 2958485 3112030 3551251 2742826 2989704 2914140 2946495
16556 2946495 2627930 2763889 2807996 2453922 2557252 2564331 2540163 2446408 2258774 2576418
$$ packed form
16626H060212J94184j62973k92673J72760l84563j03230j98820j94133J69578
16617G260342J75667o64910n3482m36093J97854j42009N5450m64035p2316L36120
16607F192588l16555j876r0331k93312J22905l95537L7455J13902k37124j85666
16597D946449P0657K26802l79865p7787m5435J58573J50092n84999J15314j76316
16587D403485j08535l47231L49182k93028K52537j89893l16347j2194j78018R4796
16577C654754p7993M575j76722N6781r6884j38595j8197M72896l38031o5129n6140
16566C221315M8470k10075J99282l00507J53545M39221q08425K46878p5564L2355
16556B946495l18565J35959M4107l54074J03330P079k4168r3755j87634L17644
$$ plain form
16546 2576418 2589419 2400214 2294946 2562402 2559766 2409384 2440131 2375756 2132209 2088287
16536 2088287 2338244 2404944 2320607 2091873 1810533 2123117 1710286 2249217 1992251 1974720
16526 1974720 1631725 1828637 2068963 1851921 1841688 1547550 1662826 1929676 1845939 1659271
16516 1659271 1685332 1566215 2235640 1900745 1780306 1520421 1840378 1709080 1803637 1617608
16506 1617608 1583444 1562502 1754845 1600044 1530231 1198793 1606779 1340528 1515540 1368792
16496 1368792 1336646 1625218 1429612 1611246 1669225 1255269 1591550 1727486 1132887 1501129
16486 1501129 1299372 1429444 1012730 1392190 1490086 1267507 1031961 1324953 1306430 1277429
16476 1277429 1250197 1378112 1176628 1292642 1459896 1373879 1322135 1357289 1005833 1115063
$$ packed form
16546B576418J3001j89205j05268K67456k636j50382L0747o4375k43547m3922
16536B088287K49957O6700q4337k28734k81340L12584m12831N38931k56966j7531
16526A974720l42995J96912K40326k17042j0233k94138J15276K66850q3737j86668
16516A659271K6061j19117O69425l34895j20439k59885L19957j31298R4557j86029
16506A617608l4164k0942J92343j54801o9813l31438M07986k66251J75012j46748
16496A368792l2146K88572j95606J81634N7979m13956L36281J35936n94599L68242
16486A501129k01757J30072m16714L79460R7896k22579k35546K92992j8523k9001
16476A277429k7232J27915k01484J16014J67254q6017n1744L5154l51456J09230
$$ plain form
16466 1115063 1155064 1162230 1081031 1187001 966275 1083307 1341213 1109079 1360384 1365541
16456 1365541 987641 1065355 975851 846226 1169726 993487 1050039 726954 952968 921110
16446 921110 894945 1163238 893308 674007 866401 834545 951534 871734 723059 1138958
16436 1138958 973629 884925 601012 1007214 968427 1026101 717981 1042890 837770 797045
16426 797045 713626 826726 959632 744370 801163 1041752 525932 542072 971054 663247
16416 663247 799693 942811 612898 432308 806810 729478 922883 754988 550974 586575
16406 586575 841663 796594 645218 968955 545866 598419 447107 549109 746523 659860
16396 659860 312510 753487 667701 618623 945094 573398 648340 937403 722398 804123
$$ packed form
16466A115063M0001P166q1199J05970k20726J17032K57906k32134K51305N157
16456A365541l77900P7714q9504j29625L23500j76239N6552l23085K26014l1858
16446I21110k6165K68293k69930k19301J92394l1856J16989p9800j48675M15899
16436A138958j65329q8704k83913M06202l8787N7674l08120L24909k05120m0725
16426G97045q3419J13100J32906k15262N6793K40589n15820J6140M28982l07807
16416F63247J36446J43118l29913j80590L74502p7332J93405j67895k04014L5601
16406E86575K55088m5069j51376L23737m23089N2553j51312J02002J97414q6663
16396F59860C12510M40977q5786m9078L26471l71696P4942K89063k15005Q1725
$$ plain form
16386 804123 597008 417808 534261 705541 593326 699671 711673 574355 649507 619446
16376 619446 604811 549124 470493 648096 539834 700589 782557 554805 585455 805094
16366 805094 508619 410875 523674 733554 377129 408146 742742 380820 603581 426577
16356 426577 820211 416876 573585 666224 826436 450457 451155 494971 663889 639732 537473
16345 537473 695042 417416 360551 316295 515918 384945 484596 588349 583321 426440
16335 426440 538111 900854 186767 402047 633072 517595 637475 915716 574695 404597
16325 404597 558092 390590 417031 357121 440984 458859 571289 355267 233731 782274
16315 782274 62333 653959 473047 -16638 651736 353988 264749 301786 637552 358994
$$ packed form
16386H04123k07115j79200J16453J71280j12215J06345J2002j37318P5152l0061
16376F19446j4635n5687p8631J77603j08262J60755Q1968k27752L0650K19639
16366H05094k96475r7744J12799K09880l56425L1017L34596l61922K22761j77004
16356D26577L93634m03335J56709R2639J60212l75979O98M3816J68918k4157j02259
16345E37473J57569k77626n6865m4256J99623j30973R9651J03753n028j56881
16335D26440J11671L62743A86767K15280K31025j15477J19880K78241l41021j70098
16325D04597J53495j67502K6441n9910Q3863J7875J12430k16022j21536N48543
16315G82274F2333N91626j80912a6638F51736k97748q9239L7037L35766k78558
$$ plain form
16305 358994 195859 588716 243350 437910 261186 518920 652528 80246 497360 216031
16294 706752 209405 231734 276179 199035 394346 337220 529408 456442 379592 493718 83520
16282 122564 300198 223968 576870 135216 518805 95159 390648 430897 273783 298182
16272 298182 163908 16932 633921 460981 64156 140259 176179 -110671 568439 391306
16262 391306 192720 187563 457559 330371 185896 580173 -52367 45694 224487 142548
16252 142548 228948 219745 449621 83932 564635 297201 202587 404268 -101167 234788
16241 329693 189302 243967 -44922 -116960 367502 210793 511023 16450 251143 414659
16231 414659 139624 34855 228712 217168 104044 76813 199425 -126658 -98157 370884
$$ packed form
16305C58994j63135L92857B43350J94560j76724K57734J33608H0246M17114B16031
16294G06752B09405K2329M4445p7144J95311n7126J92188p2966p6850J14126H3520
16282A22564J77634p6230L52902A35216L83589I5159K95489M0249j57114K4399
16272B98182j34274A6932O16989j72940F4156P6103L5920a10671E68439j77133
16262C91306A92720n157K69996j27188j44475L94277e2367D5694J78793q1939
16252A42548Q6400r203K29876H3932M80703k67434r4614K01681a01167B34788
16241C29693j40391N4665d4922p2038C67502j56709L00230A6450K34693J63516
16231D14659A39624C4855J93857j1544A04044k7231J22612a26658K8501C70884
$$ plain form
16220 440588 352694 -110675 449289 81414 433466 91435 -137468 -26915 -113254 274313
16209 78781 491349 69589 23683 396226 162992 509862 -165792 168880 207594 225456
16199 225456 236726 105154 21584 291170 195279 253207 62150 -93370 144607 256609 184901
16188 184901 218507 -84667 164203 151165 148777 212087 185131 371706 288371 403103 -21413
16176 231274 24286 251897 -67455 205721 401580 38982 242873 126935 -105202 159493
16165 91534 110053 175311 549618 353738 -13656 247608 51415 -41121 -40759 276187 374638
16154 374638 -20314 188463 -243428 48648 20159 -43225 226920 185783 -146238 233947
16143 255912 35875 243090 186499 277897 -69740 186417 -105244 123882 39214 -74725 98992
$$ packed form
16220D40588q7894a10675D49289H1414L52052I1435a37468b6915q6339B74313
16209G8781M12568F9589B3683L72543A62992L46870a65792A68880L8714J7862
16199B25456J1270A05154B1584K69586r5891N7928F2150i3370A44607J12002p1708
16188A84901L3606h4667A64203j3038k388O3310k6956J86575q3335J14732b1413
16176B31274B4286K27611f7455B05721J95859C8982K03891j15938a05202A59493
16165I1534J8519O5258L74307j95880a3656B47608E1415d1121L62B76187R8451
16154C74638b0314A88463b43428D8648B0159d3225B26920m1137a46238B33947
16143B55912C5875K07215n6591R1398f9740A86417a05244A23882C9214g4725I8992
$$ plain form
16131 296316 29860 44203 215537 154105 -243802 282969 564325 -25555 380088 313035
16121 313035 -34723 141179 110516 35427 -72098 -274169 182024 125759 241209 26683 165706
16110 165706 -16151 167686 433458 171885 261161 -56283 111495 -92588 26426 52995 247009
16099 247009 -80039 252909 137026 207404 147493 -14644 206354 -103161 -52608 -58183 131430
16087 433428 -12457 508133 -137979 204562 -17309 -90051 -173755 -46665 434609 39783 43979
16076 43979 44844 -7878 -236473 -226089 -240838 71327 149746 59278 95973 114974 97226 219706
16064 219706 15855 154781 329972 8025 33052 42797 135813 61294 229920 130905 321446
16053 321446 -191811 134659 -74126 -89287 -103751 220428 76496 -113966 310117 363386
$$ packed form
16131B96316B9860J4343J71334o1432b43802B82969K81356b5555C80088o7053
16121C13035c4723A41179l0663C5427g2098k02071A82024n6265J15450B6683J39023
16110A65706a6151A67686K65772A71885Q9276e6283A11495i2588B6426K6569J94014
16099B47009h0039B52909j15883P0378n9911a4644B06354a03161N0553n575A31430
16087D33428a2457E08133a37979B04562a7309p2742q3704d6665D34609C9783M196
16076D3979Q65g878k28595J0384j4749G1327P8419E9278L6695J9001j7748J22480
16064B19706A5855J38926J75191H025K5027R745R3016F1294J68626r9015J90541
16053C21446a91811A34659g4126j5161j4464B20428G6496a13966C10117N3269
$$ plain form
16043 363386 375032 20884 -234178 130285 -124365 51315 138212 116509 139220 176649 -246130
16031 124997 120452 269607 -258906 -103144 -225768 -33951 557423 184887 22547 36882
16021 36882 157910 222868 105348 -56177 -7647 402939 123486 -175160 -9904 308995 53907
16009 17046 58701 145970 60138 -105811 37038 24446 -139483 243778 -49509 141913 -17330
15997 -232082 -1487 -195899 -41061 140399 51091 -173420 4578 86339 169141 284058 452075
15986 452075 658395 819405 1333286 926861 996803 588335 369354 311276 439188 -216293
15975 34419 69725 12489 572651 -20957 126076 -32980 125098 -15525 8840 -41554 -115357
15964 -115357 35392 141984 97855 192756 255076 8039 -246354 -154246 -45900 -200769 -31809
$$ packed form
16043C63386J1646B0884b34178A30285a24365E1315Q6897k1703K2711L7429b46130
16031A24997m545J49155b58906a03144j22624c3951E57423A84887B2547J4335
16021C6882J21028O4958A05348e6177g647D02939A23486a75160i904C08995E3907
16009A7046M1655Q7269F0138a05811C7038j2592a39483B43778d9509A41913a7330
15997b32082a487j94412d1061A40399E1091a73420D578Q1761Q2802J14917J68017
15986D52075K06320J61010N13881m06425O9942m08468k18981n8078J27912b16293
15975C4419L5306A2489N60162b0957A26076c2980A25098a5525H840d1554p3803
15964a15357C5392J06592m4129R4901O2320H039b46354R2108d5900j54869c1809
$$ plain form
15952 -62391 79138 133251 -26250 115916 140459 2908 181623 -255194 228888 6415 11090
15941 11090 -147904 111308 18539 64546 62779 71086 -128189 -174217 -221953 -116555 77747
15929 118762 -242507 -37556 -144213 16190 7114 -241935 -155797 -226383 -82253 -298137 -393306
15918 -393306 -26278 -181372 105296 149470 36976 -87491 284030 152322 141208 116050 92602
15907 92602 99837 -251064 9005 245313 -90320 -1439 129021 280794 -250905 -63357 -5820
15895 -157934 138395 148107 61146 -158680 -164437 -11127 149273 -47352 211484 418603 -116145
15883 175431 -227902 -70315 170011 -13784 64528 -57835 -298732 -45453 31413 63582 -111654
15871 -124362 104224 206905 -143268 219345 -58033 95424 -119733 98291 -240616 -143787
$$ packed form
15952f2391G9138N4113b6250A15916K4543B908J78715b55194B28888F415M675
15941A1090a47904A11308A8539M6007j767Q307a28189m6028m7736J05398G7747
15929A18762b42507c7556j06657A6190G114b41935Q6138p0586h2253k15884r5169
15918c93306b6278j55094A05296M4174C6976h7491B84030j31708j1114k5158k3448
15907I2602P235b51064I005K36308i0320a439A29021J51773b50905f3357e820
15895a57934A38395R712F1146a58680n757a1127A49273d7352B11484K07119a16145
15883A75431b27902g0315A70011a3784F4528e7835k40897d5453C1413L2169a11654
15871a24362A04224J02681a43268B19345e8033I5424a19733I8291b40616R6829
$$ plain form
15861 -143787 -211655 62621 -63086 -54302 -153828 94046 -306811 -32046 251791 -252854 7600
15849 -79863 -261115 7864 -215790 74552 -337283 -26155 -10439 -237297 -21250 72263 -32356
15837 141345 -18189 -145185 -135433 67994 -56805 110039 -20183 -31178 103854 353311 132576
15825 89727 27295 -378052 152370 355132 57335 -165615 69450 60442 314317 -257764 15331
15813 -123524 -166978 -54349 -118285 -61812 83283 117867 -90723 -306705 107825 204958 -18514
15801 92136 -316684 34776 -317137 -95877 -29051 -102070 -351898 -108631 153099 -431895
15790 -85979 -838 444569 47097 59189 10371 206339 130908 17565 -61 92877 346839 -334396
15777 -35050 347210 7302 20011 -9213 83051 -83879 -78491 -161616 -142285 -16297 -224418 -223116
$$ packed form
15861a43787o7868F2621f3086Q784r9526I4046c06811c2046B51791b52854G600
15849g9863j81252G864b15790G4552c37283b6155a0439k26858b1250G2263c2356
15837A41345a8189j26996R752F7994e6805A10039b0183j0995A03854K49457A32576
15825H9727B7295c78052A52370K02762E7335a65615F9450r008K53875b57764A5331
15813a23524m3454e4349o3936N6473H3283L4584i0723k15982A07825R7133a8514
15801I2136c16684C4776c17137i5877b9051p3019k49828a08631A53099d31895
15790h5979h38D44569D7097J2092A0371J95968p5431A7565f1I2877K53962c34396
15777c5050C47210G302J2709i213H3051h3879N388q3125J9331a6297k08121J302
$$ plain form
15765 -223116 293735 -53441 -169092 -306638 324851 -325923 256278 -132789 -140403 183040
15754 195517 23687 101867 -244882 55424 -175621 -237581 -59660 -101672 -12388 219505 -5407
15742 87104 -6838 -136437 -167710 -463324 158264 250242 19393 -233374 -115808 -73398 107707
15730 120070 26897 -66107 11046 -166498 -24512 212420 240604 108147 -17276 -117908 -38042
15718 -212457 -88986 -193375 302233 25091 -158322 122137 -88279 140545 93219 -304957
15707 240930 61848 -113853 -83227 23646 19107 63375 -101638 -159469 54644 -82076 -213794
15696 -213794 -219444 76758 91096 -24958 -232854 -152204 274636 -11866 -311508 -49174 152372
15684 -57305 -152534 83630 -87502 86780 133667 -139100 -81441 -79405 -196375 226551 -126963
$$ packed form
15765b23116B93735e3441j15651j37546C24851c25923B56278a32789p614A83040
15754A95517B3687P8180b44882E5424a75621o1960e9660m2012a2388B19505e407
15742H7104f838j29599l1273k95614A58264R1978A9393b33374a15808M2410A07707
15730A20070B6897f6107A1046a66498b4512B12420K8184A08147a7276j00632c8042
15718b12457h8986j04389C02233B5091a58322A22137h8279A40545m7326c04957
15707B40930F1848a13853L0626B3646m539M4268a01638n7831E4644h2076j31718
15696b13794n650G6758J4338b4958k07896Q0650B74636a1866k99642d9174A52372
15684e7305r5229H3630h7502H6780M6887a39100N7659K036j16970B26551a26963
$$ plain form
15672 -207500 116239 -9013 99070 -71610 50529 91563 195785 -458465 -72539 -132676 -31436
15660 263625 -16438 40642 545 205751 257472 187654 90334 -20523 -5754 -65672 -237289 -28683
15647 -138965 -114894 -221639 332502 -86940 -183026 -162551 239018 171232 -126938 -391157
15637 -391157 -146722 -191983 153173 -36330 -53680 -56831 -327088 -198865 -102105 -89105 -12904
15625 19070 5409 -124135 362453 -31238 -48469 143716 -40030 -31500 43713 205706 230723
15614 230723 -54592 -17910 -143360 96723 -76712 -92904 63443 -56080 -39535 279775 -10118
15602 -18986 12561 12191 117452 -117361 -239291 232058 -53871 -69265 -57223 321823 -212874
15590 71112 -116773 34644 -26766 274190 -15935 245896 60309 -5134 -323584 -92105 73773
$$ packed form
15672b07500A16239i013I9070g1610E0529M1034J04222d58465g2539o0137c1436
15660B63625a6438D0642E45K05206N1721o9818I0334b0523e754n9918j71617b8683
15647a38965K4071j06745C32502h6940r6086K0475B39018o7786a26938k64219
15637c91157a46722m5261A53173c6330j7350l151k70257J28223R6760J3000a2904
15625A9070E409a24135C62453c1238j7231A43716d0030Q530D3713J61993K5017
15614B30723e4592a7910j25450I6723g6712j6192F3443e6080J6545B79775a0118
15602a8986A2561l70J05261a17361j21930B32058e3871j5394J2042C21823b12874
15590G1112a16773C4644b6766B74190a5935B45896F0309e134l18450i2105G3773
$$ plain form
15578 262807 -19179 131965 -100151 48372 136832 62516 -17275 -166007 -79807 -171480 -320843
15567 -320843 246863 -314028 77099 -232192 348238 -61834 268701 201282 82867 -389362
15556 242063 -61647 -119686 74507 -157418 -175192 -216537 75198 97453 259296 84373 -172041
15544 74792 196144 -136331 -271712 -159561 215029 214808 83132 273229 -38390 -63308 90955
15532 116278 -230117 -152635 17759 -91633 53683 355930 -241966 -137916 282945 -126094
15521 -213329 -164675 402009 35820 40734 -244058 84729 -169909 134007 196604 300727 -111924
15509 31806 179683 -8837 202363 276506 247530 54688 192481 -145805 -196590 106879 73625
15498 73625 343409 495572 131650 -4471 -115850 161342 -22320 -2087 80745 435141 -223370
$$ packed form
15578B62807a9179A31965a00151D8372Q8460F2516a7275j48732g9807r1673j49363
15567c20843B46863c14028G7099b32192C48238f1834B68701o7419H2867c89362
15556B42063f1647n8039G4507a57418j7774m1345G5198K2255J61843H4373a72041
15544G4792J21352a36331j35381J12151B15029k21H3132J90097c8390k4918I0955
15532A16278b30117P7482A7759i1633E3683L02247b41966J04050B82945a26094
15521b13329M8654D02009C5820M914b44058H4729a69909A34007O2597J04123a11924
15509C1806J47877h837B02363P4143k8976E4688J37793a45805n0785A06879l3254
15498G3625K69784J52163A31650d471j11379A61342b2320b087H0745L54396b23370
$$ plain form
15486 251393 -394959 333610 -95930 178519 262316 -34548 40733 -18707 139092 338387
15476 338387 247471 154196 43340 216442 805617 816789 531866 174883 -114309 -66842
15466 -66842 85841 58086 282435 -255682 44818 212723 -9807 141634 347299 32630 92600
15455 92600 -787 70992 14623 19492 173642 357377 223127 -81477 68069 -99863 -157208 313031
15442 30580 565066 735442 271917 993335 1133424 647055 279744 226821 -225897 21453
15431 206786 83098 62179 120307 95187 -249600 191330 -202325 -89342 -137292 30152 -370148
15419 4179 -13397 -137511 -56665 265795 37733 -177981 -48763 -31460 137663 -110584 91911
15407 -4330 176725 205885 164897 58799 -215395 158323 -24010 158953 -107786 180852 -123965
$$ packed form
15486B51393c94959C33610i5930A78519Q3797c4548D0733a8707A39092J99295
15476C38387r0916r3275D3340J73102N89175J1172k84923A74883a14309M7467
15466f6842H5841k7755K24349b55682D4818J67905i807A41634K05665C2630N9970
15455I2600g87G0992A4623M869J54150J83735j34250h1477F8069i9863n7345C13031
15442C0580N34486J70376B71917P21418J40089m86369B79744n2923b25897B1453
15431B06786H3098k0919N8128k5120b49600A91330b02325h9342m7950C0152c70148
15419D179a3397j24114e6665B65795C7733a77981d8763J7303A37663a10584I1911
15407d330A76725K9160m0988E8799b15395A58323b4010A58953a07786A80852a23965
$$ plain form
15395 156001 190820 -197678 127017 11366 -162996 -127770 -193276 51125 36 92400 -262614
15383 94292 -322130 -67163 -71621 155820 -184104 -100499 -350135 -144472 443038 -148513
15372 88439 64449 -74501 -29317 11700 -245537 34979 170559 120240 316766 247521 289852
15361 289852 441009 188551 182673 366130 213718 114978 170161 139141 -90749 357798 245610
15350 245610 75986 187296 135143 148625 222262 -23937 191620 1128 36382 69609 310168
15339 310168 -460051 106592 306049 144043 117908 40996 87613 14390 58165 108012 -99878
15327 28134 7273 418853 309388 286982 206739 38396 17626 -13142 -146340 127528 435912
15316 435912 -125912 43923 170474 -296691 415499 307984 -243419 244552 51259 315707
$$ packed form
15395A56001L4819a97678A27017A1366a62996L5226o5506E1125C6R2364b62614
15383I4292c22130f7163m458A55820a84104Q3605k49636a44472D43038a48513
15372H8439k3990g4501b9317A1700b45537C4979J35580n0319J96526o9245M2331
15361B89852J51157A88551n878J83457j52412r8740N5183l1020i0749C57798j12188
15350B45610G5986J11310n2153J3482P3637b3937A91620A128L5254L3227K40559
15339C10168d60051A06592J99457A44043k6135D0996M6617A4390M3775M9847i9878
15327B8134G273M11580j09465k2406q0243C8396A7626a3142j33198A27528L08384
15316D35912a25912D3923J26551b96691D15499j07515b43419B44552E1259K64448
$$ plain form
15306 315707 -149884 150778 78321 -81741 -23600 206911 300680 1641 21748 -44216 227752
15294 -93940 -170053 538805 14824 -50998 95882 -101706 178839 252190 -101577 446696 31919
15282 70943 -8894 294049 66221 -210031 -242711 50696 117437 436967 327376 -280289 83260
15270 -183698 61764 -135435 155173 175335 71279 -119316 -5046 214243 -194826 -7569 -48374
15259 -48374 -8746 -20533 248391 419223 -10139 -185686 58938 269005 -23486 -227070 86510
15247 284221 167524 362834 242677 556302 1014215 1848522 1563175 1523763 1849403 883188
15236 444927 -259924 -151575 247670 93819 -56542 53263 100478 -270466 207888 -6982 -139805
15225 -139805 -31879 86947 -35792 -91631 155931 347527 262791 10131 -111109 64086 -215934
$$ packed form
15306C15707a49884A50778p2457h1741b3600B06911R3769A641K0107d4216B27752
15294i3940p6113E38805A4824e0998I5882a01706A78839P3351a01577D46696C1919
15282G0943h894B94049F6221b10031l2680E0696O6741L19530j09591b80289H3260
15270a83698F1764a35435A55173K0162G1279a19316e046B14243a94826g569m0805
15259d8374h746j1787B48391J70832a0139j75547E8938K10067b3486k03584H6510
15247B84221j16697J95310j20157L13625M57913Q34307k85347l9412L25640H83188
15236D44927b59924J08349B47670I3819e6542E3263M7215b70466B07888f982j32823
15225a39805c1879H6947c5792n5839A55931J91596q4736A0131a11109F4086b15934
$$ plain form
15213 188113 34588 15011 76813 -201953 277660 40701 171101 -264232 133111 60249
15202 8875 -132455 38207 408157 -95260 126315 205310 224003 -17703 85433 560817 28005
15190 48972 25506 -15963 84614 414260 -7937 -65862 -105942 -61734 -98687 28489 69336 526893
15178 526893 47320 299977 -91927 337994 -67660 48730 158285 -156019 255387 24275
15167 -264260 302141 228247 182511 98063 162346 -49381 -163413 115833 198120 -32504 -37064
15156 -37064 -11220 429772 82797 86637 -136008 125966 231818 324164 189099 83601 184304
15145 184304 -87741 196487 -44606 92472 -40074 265695 77785 -227974 -1616 121149 368027
15134 368027 308986 -54913 154569 173799 -189388 75407 -86726 64554 212139 532865 1493
$$ packed form
15213A88113C4588A5011O1802b01953B77660D0701J30400b64232A33111F0249
15202H875a32455C8207L69950i5260A26315P8995J8693a7703H5433M75384B8005
15190D8972k3466a5963H4614L29646g937n7925m0080M4208l6953B8489M0847M57557
15178E26893D7320K52657i1927C37994f7660D8730J09555a56019B55387B4275
15167b64260C02141p3894m5736q4448O4283d9381j14032A15833Q2287c2504m560
15156c7064a1220D29772H2797L840a36008A25966J05852R2346j35065H3601J00703
15145A84304h7741A96487d4606I2472d0074B65695G7785b27974a616A21149K46878
15134C68027n9041e4913A54569J9230a89388G5407h6726F4554J47585L20726A493
$$ plain form
15122 590210 -182018 164432 328239 185864 422444 308476 234184 116735 -150337 50925
15111 410050 162223 55289 363112 -97054 98804 234581 428082 126028 223281 -415193
15100 103226 35954 158519 201536 -71873 -20552 142867 240267 141863 195676 208433 -286423
15088 51263 -267350 184492 314485 -38049 -217178 143529 551935 596521 -22763 -124114
15078 -124114 481571 227928 -40520 -4187 23306 -180495 189080 295120 130780 121401 408775
15067 408775 38270 422193 178899 118477 -7369 194109 183683 462884 -89695 184338 362997
15056 362997 287992 -16722 231346 337241 340394 469223 340691 -67854 331189 249628 218667
15045 218667 101179 303025 59954 -88136 90897 70866 205178 454309 567045 288776
$$ packed form
15122E90210a82018A64432J63807j42375K36580j13968p4292A16735a50337E0925
15111D10050A62223E5289L07823i7054I8804J35777J93501A26028R7253d15193
15100A03226C5954J22565M3017g1873b0552A42867R7400r8404N3813J2757b86423
15088E1263b67350A84492J29993c8049j79129A43529M08406M4586b2763j01351
15078a24114D81571B27928d0520d187B3306a80495A89080J06040A30780r379K87374
15067D08775C8270L83923A78899o0422g369A94109j0426K79201h9695A84338J78659
15056C62997p5005a6722B31346J05895L153J28829j28532f7854C31189q1561l0961
15045B18667A01179K01846E9954h8136I0897k0031J34312K49131J12736k78269
$$ plain form
15035 288776 192146 163646 249337 323640 61384 579016 590566 725865 963617 811538 514773
15024 514773 597549 354243 289134 649700 782453 396618 542472 374958 648523 333248
15014 333248 208127 319162 27133 193944 306262 489894 405944 260061 370924 309345
15004 309345 214723 320981 -144130 -112000 250058 134670 128763 273116 179192 373465
14994 373465 290400 471009 425805 581293 395043 308762 227355 259994 525049 461701 348973
14983 348973 487467 519543 645548 831404 738057 304885 375739 553994 597539 157565
14972 456011 637133 794113 325443 899733 564562 615810 -73473 91644 110033 93429
14962 93429 440032 277847 127486 118411 17606 476618 284929 192809 370582 106626
$$ packed form
15035B88776r6630k8500Q5691P4303F1384N17632J1550J35299K37752j52079k96765
15024E14773Q2776k43306o5109L60566J32753l85835J45854j67514K73565l15275
15014C33248j25121J11035B7133J66811J12318J83632q3950j45883J10863o1579
15004C09345r4622J06258a44130L2130B50058j15388n907J44353r3924J94273
14994C73465q3065J80609m5204J55488j86250q6281q1407L2639K65055o3348j12728
14983C48973J38494L2076J26005J85856r3347C04885P0854J78255M3545A57565
14972D56011J81122J56980C25443N74290l35171N1248g3473I1644J8389j6604
14962I3429L46603j62185A27486r075A7606M59012j91689r2120J77773A06626
$$ plain form
14951 341027 422874 200969 395035 435598 585996 272548 595961 169892 230992 782149
14941 782149 399402 1010844 331241 425112 465628 143276 387488 394890 451505 587742
14931 587742 677953 584748 1042606 1039272 1246693 1394828 1028684 1446512 1569214 1374937
14921 1374937 1235391 1124969 1249343 1262106 1392359 1954853 2019039 1765163 1646795 1319362
14911 1319362 1103009 717978 815692 714645 371706 571876 332449 238704 515640 534474
14901 534474 844784 114124 619837 336581 164762 223341 653730 491416 257606 156980
14891 156980 271955 394079 544928 573579 290981 612268 661082 933409 765772 724247
14881 724247 514913 750449 370085 351712 632421 885885 445626 271820 790476 542388
$$ packed form
14951C41027Q1847B00969J94066M0563J50398B72548L23413A69892O1100N51157
14941G82149l82747O11442C31241R3871M0516A43276K44212P402N6615J36237
14931E87742R0211r3205M57858l334K07421J48135l66144M17828J22702j94277
14921A374937j39546j10422J24374J2763J30253N62494O4186k53876j18368l27433
14911A319362k16353l85031R7714j01047l42939K00170k39427r3745K76936J8834
14901E34474L10310A14124N05713k83256A64762N8579M30389j62314k33810j00626
14891A56980J14975J22124J50849K8651k82598L21287M8814K72327j67637m1525
14881G24247k09334K35536C70085j8373K80709K53464m40259j73806N18656k48088
$$ plain form
14871 542388 266188 404532 434832 254338 485159 348957 581683 366150 669177 642134
14861 642134 258727 450216 242035 242816 251701 433527 413614 -15161 48994 519146 490128
14850 490128 487879 80848 147584 350826 446949 245978 802427 726447 769693 974505 846357
14839 846357 1227208 1181929 809341 763927 604193 587171 432193 251607 641678 605032
14829 605032 405910 485067 587838 641195 604257 211537 679158 262987 562184 468469
14819 468469 572319 651879 635197 343682 241073 797389 688694 598788 977274 410352
14808 578121 440561 571176 426267 718812 808890 906252 1034451 797657 948760 616695
14798 616695 705983 665427 654730 688986 140345 380697 686278 505005 336141 699563
$$ packed form
14871E42388B66188J38344L0300j80494K30821j36202K32726k15533L03027k7043
14861F42134B58727J91489k08181P81Q885J81826j9913a5161D8994M70152k9018
14850D90128k249H0848O6736K03242R6123k00971N56449p5980M3246K04812j28148
14839H46357L80851m5279l72588m5414j59734j7022j54978j80586L90071l6646
14829F05032j99122P9157J02771N3357l6938B11537M67621B62987K99197r3715
14819D68469J03850P9560j6682k91515j02609N56316j08695q9906L78486D10352
14808E78121j37560J30615j44909K92545R0078R7362J28199k36794J51103l32065
14798F16695Q9288m0556j0697L4256A40345K40352L05581j81273j68864L63422
$$ plain form
14788 699563 626913 373197 560651 477427 514459 907707 599492 1015976 880461 492697
14778 492697 627398 975594 447603 1067094 750733 806080 697552 768606 737248 237191
14767 652978 366629 434707 496766 552799 380770 346988 642465 427589 563468 622190
14757 622190 685481 443643 530548 466220 684123 713657 442060 653208 913330 651768
14747 651768 613815 362443 376732 524961 803215 847002 573280 727336 879406 426474
14736 782977 659628 463971 904583 833778 599845 967971 966772 880557 975991 1213001
14726 1213001 1305177 1667858 1153637 1385819 1294403 960794 847422 939541 752641 800800
14716 800800 240650 812595 276799 640525 782532 813461 761883 787187 798938 698875
$$ packed form
14788F99563p2650k53716J87454q3224L7032L93248l08215M16484j35515l87764
14778D92697J34701L48196D47603O19491l16361N5347j08528P1054l1358B37191
14767F52978k86349O8078O2059N6033j72029l3782K95477k14876J35879N8722
14757F22190O3291k41838Q6905o4328K17903K9534k71597K11148K60122k61562
14747F51768l7953k51372J4289J48229K78254M3787k73722J54056J52070D26474
14736G82977j23349j95657M40612p0805k33933L68126j199q6215R5434K37010
14726A213001R2176L62681n14221K32182r1416l33609j13372R2119j86900M8159
14716H00800B40650N71945B76799L63726J42007L0929n1578K5304J1751j00063
$$ plain form
14706 698875 678691 813849 749315 1155328 1243084 902551 1573499 1813177 1510498 1508817
14696 1508817 1175689 1062116 866106 1124950 908916 1017383 597432 883673 1050323
14687 1050323 810439 910430 818048 708818 730039 1042787 936422 798702 736651 1212160
14677 1212160 990507 1124733 495250 713618 740165 1060230 735135 884243 970300 1012035
14667 1012035 869230 500476 928826 877932 758635 896395 1136016 902811 864755 974311
14657 974311 1157515 892710 1034246 1152622 791964 1360874 1415353 1074977 1074774 928150
14647 928150 1138033 917813 1237220 1172365 1040978 895505 1096995 921870 1249796 1223087
14637 1223087 1118775 1209971 1154792 987460 1166267 906306 1187958 1262735 1337906 1342326
$$ packed form
14706F98875k0184J35158o4534M06013Q7756l40533O70948K39678l02679j681
14696A508817l33128j13573j96010K58844k16034J08467m19951K86241J66650
14687A050323k39884R9991r2382j09230K1221L12748j06365j37720o2051M75509
14677A212160k21653J34226D95250K18368K6547L20065l25095J49108Q6057M1735
14667A012035j42805l68754M28350n0894j19297J37760K39621k33205l8056J09556
14657I74311J83204k64805J41536J18376l60658N68910N4479l40376k03j46624
14647I28150K09883k20220L19407o4855j31387j45473K01490j75125L27926k6709
14637A223087j04312R1196n5179j67332J78807k59961K81652P4777P5171M420
$$ plain form
14627 1342326 1115227 1062305 1299401 1154343 1188724 1040289 1113601 1182719 1113925 1213531
14617 1213531 1285742 1014526 1232974 1122716 1177356 1270502 1297066 1489071 1183447 1168105
14607 1168105 1224031 1492736 1644853 1049051 1250431 1344102 1101801 1390239 1355077 1450128
14597 1450128 1287140 1273065 1136243 1674259 1273854 1269063 1401522 1237652 1319128 1647524
14587 1647524 1679873 1459786 1790154 1482613 1632082 1915033 1789344 1751254 1787456 1801455
14577 1801455 1877598 1854101 1734330 1615891 1719546 1785715 1852850 1794613 1588456 2036040
14567 2036040 1945561 1552866 1876768 2236072 2138944 2092240 2036821 2420575 2434556 2269068
14557 2269068 2081236 2769457 3224037 3015801 3116976 3469743 4127424 4715545 6364576
$$ packed form
14627A342326k27099n2922K37096j45058L4381j48435P3312O9118o8794R9606
14617A213531P2211k71216K18448j10258N4640R3146K6564J92005l05624j5342
14607A168105N5926K68705J52117n95802K01380R3671k42301K88438l5162R5051
14597A450128j62988j4075j36822N38016m00405m791J32459j63870Q1476L28396
14587A647524L2349k20087L30368l07541J49469K82951j25689l8090L6202J3999
14577A801455P6143k3497j19771j18439J03655O6169O7135n8237k06157M47584
14567B036040r0479l92695L23902L59304r7128m6704n5419L83754J3981j65488
14557B269068j87832O88221M54580k08236J01175L52767O57681N88121J649031
$$ plain form
14548 6364576 9324905 16943323 32672681 43258048 26712602 9614988 4445874 2588714
14540 2588714 2276410 2699561 3974716 4932043 3138697 2091559 1909943 1657812 1755313
14531 1755313 1413904 2097272 1526498 1594215 1857012 1715619 2080485 1806870 2091581 2220934
14521 2220934 2271260 2000207 2134369 2229432 2279026 2270893 2080538 2308108 2190086 2693852
14511 2693852 2203095 2494260 2542304 2585783 2440126 2245137 2577504 2619903 2588182 2978926
14501 2978926 2689591 2789622 2621821 3103567 2842239 2770615 2637394 2704571 3137540 3045430
14491 3045430 2838699 3132377 2849675 3032637 3064213 3021856 3008240 3208045 3342256 2900379
14481 2900379 3001351 3570204 3457384 3535751 3704478 3669423 3598207 3443077 3676920 4139204
$$ packed form
14548F364576K960329P618418J5729358J0585367j6545446I614988D445874j857160
14540B588714l12304M23151J275155R57327j793346j047138j81616k52131R7501
14531A755313l41409O83368n70774O7717K62797j41393L64866k73615K84711J29353
14521B220934N0326k71053J34162R5063M9594q133j90355K27570j18022N03766
14511B693852m90757K91165M8044M3479j45657j94989L32367M2399l1721L90744
14501B978926k89335J00031j67801M81746k61328p1624j33221O7177M32969r2110
14491C045430k06731K93678k82702J82962L1576m2357j3616J99805J34211m41877
14481B900379J00972N68853j12820P8367J68727l5055p1216j55130K33843M62284
$$ plain form
14471 4139204 3755855 3745200 3745732 3655915 3904728 3590517 3782095 4065291 4195231 4370603
14461 4370603 4507229 4649217 4257775 4007825 4123315 4232127 4436590 4473816 4215186 4684815
14451 4684815 4432793 4614636 4534728 4564977 4947434 4881925 4808856 5042075 5109055 5238164
14441 5238164 5170953 5155571 5470742 5347904 5791753 5533943 5512438 5731367 5818139 5791831
14431 5791831 6011077 6084096 6455483 6020373 6057912 6664876 6550647 6319986 6914509 6602701
14421 6602701 6879494 6790281 7280603 7403275 7787237 7837652 7519112 7776848 7585852 7938236
14411 7938236 7768782 7988846 8176099 8083570 8414528 8487364 8524857 8741881 9401368 9418163
14401 9418163 9405456 9433341 9469404 9732510 9531356 9919789 10346488 9967456 10427501 10313773
$$ packed form
14471D139204l83349j0655N32q9817K48813l14211J91578K83196J29940J75372
14461D370603J36626J41988l91442k49950J15490J08812K04463L7226k58630M69629
14451D684815k52022J81843p9908L0249L82457o5509p3069K33219O6980J29109
14441E238164o7211j5382L15171j22838M43849k57810k1505K18929Q6772k6308
14431E791831K19246P3019L71387m35110L7539O06964j14229k30661N94523l11808
14421F602701K76793q9213M90322J22672L83962N0415l18540K57736j90996L52384
14411G938236j69454K20064J87253r2529L30958P2836L7493K17024O59487J6795
14401I418163j2707K7885L6063K63106k01154L88433M26699l79032M60045j13728
$$ plain form
14391 10313773 10525407 10773266 11362195 11040263 11788943 11873264 11965931 12180399 12467310 12763446
14381 12763446 12796452 12971787 13679312 13456946 13609503 14067708 14369399 14351441 14507242 15131899
14371 15131899 15241780 15544334 16195624 16092273 16710325 17230430 17738939 17996041 18225641
14362 18225641 18648845 19109582 19266344 19747723 20424820 20652671 21293724 22084070 22081160 22752910
14352 22752910 23158323 23686011 24516400 25390718 25634752 26515590 26983895 27838172 28629071
14343 28629071 29137427 30103411 30700459 31363223 32570872 33231151 34181048 35507540 36133143
14334 36133143 37288773 38708017 39847654 41295085 42130514 43385289 44890794 46681365
14326 46681365 47802729 49919145 51485087 53066186 55446901 57315470 59024188 61022046
$$ packed form
14391A0313773K11634K47859N88929l21932P48680Q4321R2667K14468K86911K96136
14381A2763446L3006J75335P07525k22366J52557M58205L01691j7958J55801O24657
14371A5131899J09881L02554O51290j03351O18052N20105N08509K57102K29600
14362A8225641M23204M60737J56762M81379O77097K27851O41053P90346k910O71750
14352B2752910M05413N27688Q30389Q74318K44034Q80838M68305Q54277P90899
14343B8629071N08356R65984N97048O62764J207649O60279R49897J326492O25603
14334C6133143J155630J419244J139637J447431Q35429J254775J505505J790571
14326D6681365J121364K116416J565942J581099K380715J868569J708718J997858
$$ plain form
14318 61022046 63587403 66012934 68863973 71575171 73787891 76802071 80127347 83432126
14310 83432126 87245466 90899942 94719485 99218124 103622781 108378998 113540774 119359128
14302 119359128 124885901 130996724 137908470 144621953 151827817 159957042 167912057 177047461
14294 177047461 186791952 197042620 207474927 218787816 231097315 243895345 257417537
14287 257417537 271293532 286351969 301942879 317406200 333835068 350218732 367039250
14280 367039250 383626879 399917099 415270827 430239570 443327490 454490915 463720969
14273 463720969 470207472 472650060 469189543 466038402 462512972 459827728 457577897 450477664
14265 450477664 438855733 424715210 409553177 393697811 377795471 360891442 343861603
$$ packed form
14318F1022046K565357K425531K851039K711198K212720L014180L325276L304779
14310H3432126L813340L654476L819543M498639M404657M756217N161776N818354
14302A19359128N526773O110823O911746O713483P205864Q129225P955015R135404
14294A77047461R744491J0250668J0432307J1312889J2309499J2798030J3522192
14287B57417537J3875995J5058437J5590910J5463321J6428868J6383664J6820518
14280C67039250J6587629J6290220J5353728J4968743J3087920J1163425R230054
14273D63720969O486503K442588l460517l151141l525430k685244k249831p100233
14265D50477664j1621931j4140523j5162033j5855366j5902340j6904029j7029839
$$ plain form
14258 343861603 326958749 310794023 294834607 279651207 264586729 250979273 237173784
14251 237173784 224847387 212893797 201527393 192257799 183009826 173223838 164117036
14244 164117036 156461043 148639245 141101659 134495847 127851996 122199688 116336115 111362315
14236 111362315 106575458 101461645 97070682 93057822 89096780 85799351 82735433 79097743
14228 79097743 76017250 72816280 70077235 67150588 64749593 62566812 59950239 57932910
14220 57932910 56316661 54298505 52000420 50435313 49138787 47415632 45846431 44953781
14212 44953781 43302526 41744484 40502746 39267901 38188644 37681143 36622997 35525785
14204 35525785 33809881 32841716 32217941 31198430 30960744 30206464 28807202 28243109 27500821
$$ packed form
14258C43861603j6902854j6164726j5959416j5183400j5064478j3607456j3805489
14251B37173784j2326397j1953590j1366404r269594r247973r785988r106802
14244A64117036p655993p821798p537586o605812o643851n652308n863573m973800
14236A11362315m786857n113813m390963m012860l961042l297429l063918l637690
14228G9097743l080493l200970k739045k926647k400995k182781k616573k017329
14220E7932910j616249k018156k298085j565107j296526j723155j569201q92650
14212D4953781j651255j558042j241738j234845j079257n07501j058146j097212
14204C5525785j715904r68165o23775j019511k37686p54280j399262n64093p42288
$$ plain form
14195 27500821 26745744 26486266 25866389 25067100 24463664 23802231 23140090 22659359 21995835
14186 21995835 21889196 20933209 20958525 20031388 19907925 19155052 19124284 19021842 17962033
14177 17962033 18084665 17631762 17065387 16620476 16738766 15664536 15991719 15373806 15319368
14168 15319368 14771129 14556636 14308339 14169561 13512168 13586761 13239420 13542927 12921823
14159 12921823 12655795 12190932 12403794 12352829 11674644 11595652 11677356 11265075 11250463 10779918
14149 10779918 10493336 10496746 10523981 10072793 10102646 9828877 10195827 9433184 9767753 9228457
14139 9228457 9000359 8703692 8902246 8677305 8444225 8835215 8528641 8546364 8312308 8087001
14129 8087001 7713167 8104524 7764607 7330000 7577386 7172273 7185249 7210375 6958779 6725677
$$ packed form
14195B7500821p55077k59478o19877p99289o03436o61433o62141m80731o63524
14186B1995835j06639r55987K5316r27137j23463p52873l0768j02442j059809
14177A7962033J22632m52903n66375m44911J18290j074230L27183o17913n4438
14168A5319368n48239k14493k48297j38778o57393P4593l47341L03507o21104
14159A2921823k66028m64863K12862n0965o78185p8992Q1704m12281j4612m70545
14149A0779918k86582L410K7235m51188K9853k73769L66950p62643L34569n39296
14139I228457k28098k96667J98554k24941k33080L90990l06574J7723k34056k25307
14129H087001l73834L91357l39917m34607K47386m05113J2976K5126k51596k33102
$$ plain form
14119 6725677 7041567 6790686 6543865 6688663 6416572 6416669 6207380 6448831 6093648 6029075
14109 6029075 6080779 6221901 6000038 5717154 5345637 5863172 5847116 5541266 6045448 5411705
14099 5411705 5434621 5487976 5170060 5195628 5080531 5282855 4847323 4898342 4719199 4814082
14089 4814082 4604510 4870061 4917537 4737046 4647234 4616504 4341366 4555205 4433590 4340704
14079 4340704 4450144 4411957 4339022 4446719 4292148 3930657 3781873 3923008 4105364 4068828
14069 4068828 3525192 4020444 4212903 3807780 3703875 4031016 3959883 3657627 3774614 3721005
14059 3721005 3776896 3886686 4078540 3539146 3507857 3270608 3107794 3502632 3372426 3042426
14049 3042426 3085328 3367519 2875491 3096959 3065947 3055159 2856617 2816850 3288772 3103105
$$ packed form
14119F725677L15890k50881k46821J44798k72091R7k09289K41451l55183o4573
14109F029075N1704J41122k21863k82884l71517N17535j6056l05850N04182o33743
14099E411705K2916N3355l17916K5568j15097K02324m35532N1019j79143R4883
14089D814082k09572K65551M7476j80491q9812l0730k75138K13839j21615r2886
14079D340704J09440l8187p2935J07697j54571l61491j48784J41135J82356l6536
14069D068828n43636M95252J92459m05123j03905L27141p1133l02256J16987n3609
14059C721005N5891J09790J91854n39394l1289k37249j62814L94838j30206l30000
14049C042426M2902K82191m92028K21468l1012j0788j98542l9767M71922j85667
$$ plain form
14039 3103105 3031435 2729025 2932060 2886220 3042070 2569090 2874547 2565815 2393588 2699470
14029 2699470 2736414 2889010 2600911 2419538 2766836 2450631 2314666 2511540 2716762 2284699
14019 2284699 2354211 2202560 2305979 2497082 2112061 2381774 2562701 2005272 1907106 2267868
14009 2267868 2202115 2007847 2046682 2097790 2078734 2111655 2102394 1756499 1964448 1774142 1974458
13998 1974458 1928987 2200601 1661375 2042770 2026918 1582841 2032454 2221960 1857385 2845732
13988 2845732 4451465 10652907 24970623 42213449 33226036 15782323 8269549 5712531
13980 5712531 4345364 3486205 3317111 2985903 2833269 2697594 2533315 2249939 2303567
13971 2303567 2412230 2516050 2296803 2045720 2199216 2544879 1882018 1915166 1960016 1879311
$$ packed form
14039C103105p1670l02410K03035m5840J55850m72980L05457l08732j72227L05882
14029B699470L6944J52596k88099j81373L47298l16205j35965J96874K05222m32063
14019B284699O9512j51651J03419J91103l85021K69713J80927n57429r8166L60762
14009B267868o5753j94268L8835N1108j9056L2921r261l45895K07949j90306K00316
13998A974458m5471K71614n39226L81395j5852m44077M49613J89506l64575R88347
13988B845732J605733O201442J4317716J7242826q987413A5782323p512774k557018
13980E712531j367167q59159j69094l31208j52634j35675j64279k83376N3628
13971B303567J08663J03820k19247k51083J53496L45663o62861L3148M4850q0705
$$ plain form
13961 1879311 2171355 2151940 1923448 2040741 1951801 1679432 1889761 1911117 1849133 1610968
13951 1610968 1794046 2110935 1833386 1766968 1528150 1496535 1822877 1805710 1662391 1592359
13941 1592359 1502907 1513549 1666783 1839159 1588997 1611733 1582579 1629583 1696762 1380986
13931 1380986 1281989 1407697 1292721 1719064 1674535 1327631 1430837 1316793 1309973 1538705
13921 1538705 1464455 1176708 1469124 1322990 1423993 1289817 1094671 1359492 1639112 1358215
13911 1358215 1305760 1455485 1079169 1069230 1422350 1249328 1108735 1309653 1481770 1695271
13901 1695271 1212274 1046540 1533308 1058329 1086861 1396606 1313273 1248004 1160308 1016294
13891 1016294 984188 1291566 1348814 874482 1241883 1340232 993724 1252352 1182512 1330909
$$ packed form
13961A879311K92044j9415k28492J17293q8940k72369K10329K1356o1984k38165
13951A610968J83078L16889k77549o6418k38818l1615L26342j7167j43319p0032
13941A592359q9452J0642J53234J72376k50162K2736k9154M7004O7179l15776
13931A380986r8997J25708j14976M26343m4529l46904J03206j14044o820K28732
13921A538705p4250k87747K92416j46134J01003j34176j95146K64821K79620k80897
13911A358215n2455J49725l76316r939L53120j73022j40593K00918J72117K13501
13901A695271m82997j65734M86768m74979K8532L09745q3333o5269q7696j44014
13891A016294l2106L07378N7248m74332L67401R8349l46508K58628o9840J48397
$$ plain form
13881 1330909 1237059 1219801 1004309 1225751 1074382 1119247 1009906 839007 990071 1158545
13871 1158545 995976 776960 1324467 823861 869639 965224 905667 1054691 868088 987640
13861 987640 1223420 1279225 852552 961420 775543 772300 1088266 967536 1000117 1235024
13851 1235024 1072201 1014820 879882 973189 823651 1079209 709351 1104708 914144 849194
13841 849194 1223608 975227 982520 551970 869598 929279 705380 978580 914274 836966
13831 836966 890408 830083 931148 868924 511137 944411 848841 685582 833944 702762
13821 702762 1007853 764987 642329 448927 813732 681804 850499 909803 749760 827330
13811 827330 951155 809451 706807 574241 661136 970245 711864 878187 675773 621504
$$ packed form
13881A330909r3850j7258k15492K21442j51369M4865j09341j70899J51064J68474
13871A158545j62569k19016N47507n00606M5778R5585n9557J49024j86603J19552
13861I87640K35780N5805m26673J08868j85877l243L15966j20730L2581K34907
13851A235024j62823n7381j34938R3307j49538K55558l69858L95357j90564o4950
13841H49194L74414k48381P293m30550L17628N9681k23899K73200o4306p7308
13831H36966N3442o0325J01065o2224l57787M33274r5570j63259J48362j31182
13821G02762L05091k42866j22658j93402L64805j31928J68695N9304j60043P7570
13811H27330J23825j41704j02644j32566Q6895L09109k58381J66323k02414n4269
$$ plain form
13801 621504 788869 505192 794717 604382 128664 654033 371335 335850 637233 897042
13791 897042 554940 806942 963798 444775 928480 453154 549885 670183 1053578 603351
13781 603351 888967 587213 589482 348940 843933 822825 905109 322622 721464 450739
13771 450739 726677 629136 560396 484298 408637 442020 381494 686890 756515 812991 634427
13760 634427 591736 477746 868962 643810 434751 652712 604221 615657 819436 515243
13750 515243 590162 859682 706413 579418 608903 688600 560096 445941 452014 499098 271493
13739 271493 691044 338254 525705 516955 526537 517069 749910 335134 623697 82047 803174
13728 803174 665274 539226 746350 663356 532280 402603 437846 514083 330555 425735
$$ packed form
13801F21504J67365k83677K89525j90335A28664N25369k82698l5485L01383K59809
13791H97042l42102K52002J56856D44775M83705D53154R6731J20298L83395m50227
13781F03351K85616l01754K269k40542M94993k1108Q2284C22622L98842k70725
13771D50739K75938r7541o8740p6098p5661L3383o0526L05396O9625N6476j78564
13760F34427m2691j13990L91216k25152k09059K17961m8491J1436K03779l04193
13750E15243P4919K69520j53269j26995K9485P9697j28504j14155O073M7084k27605
13739B71493M19551C38254J87451q750R582r468K32841C35134K88563H2047P21127
13728H03174j37900j26048K07124q2994j31076j29677L5243P6237j83528R5180
$$ plain form
13718 425735 688346 392622 477770 682235 520778 537838 647680 680356 387608 374315
13708 374315 381581 548109 335241 350136 583728 622313 665890 547215 454382 431392 394444
13697 394444 289037 507133 99341 902235 463345 580331 98459 241951 474950 366722
13687 366722 261778 48293 486483 522829 481191 494569 260913 647636 412834 623441
13677 623441 391195 95474 364940 527125 683536 413939 436988 273320 384462 352027
13667 352027 423485 217135 488456 414742 651247 499359 440861 474786 339722 142183
13656 581018 453555 273864 592360 530903 360708 94983 481477 306208 604984 256730
13645 512486 447859 570718 460391 382601 106410 567966 562976 594679 339496 479075
$$ packed form
13718D25735K62611k95724Q5148K04465j61457J7060J09842L2676k92748j3293
13708C74315P266J66528k12868J4895K33592L8585M3577j18675r2833k2990l6948
13697C94444j05407K18096I9341Q02894m38890J16986I8459J43492K32999j08228
13687C66722j04944D8293M38190L6346m1638J3378k33656L86723k34802K10607
13677F23441k32246I5474K69466J62185J56411k69597K3049j63668J11142l2435
13667C52027P1458k06350K71321p3714K36505j51888n8498L3925j35064A42183
13656E81018j27463j79691L18496o1457j70195I4983L86494j75269K98776B56730
13645E12486o4627J22859j10327p7790A06410M61556m990L1703k55183J39579
$$ plain form
13635 479075 298599 549613 287751 89206 421394 442811 -42829 456322 558964 92875
13624 193346 204963 227662 387229 222890 415434 393967 598785 509373 314289 344401
13614 344401 233876 485729 421022 236568 351291 525721 412389 215605 454352 481108
13604 481108 375108 295491 484507 458698 200481 431209 218301 289438 211803 290419
13594 290419 458081 223777 494019 97369 446781 308915 215657 392072 500276 321369
13584 321369 207287 396071 498877 313854 32799 347648 239714 358427 224566 371053
13574 371053 254715 507992 111087 114119 209457 179046 -102067 155160 168249 -83720 345300
13562 325040 350152 249347 65462 329855 227181 301034 419891 89479 394968 309070
$$ packed form
13635D79075j80476K51014k61862H9206L32188K1417d2829D56322J02642I2875
13624A93346J1617K2699J59567j64339J92544k1467K04818q9412j95084L0112
13614C44401j10525K51853o4707j84454J14723J74430j13332j96784K38747K6756
13604D81108j06000p9617J89016k5809B00481K30728k12908P1137p7635P8616
13594B90419J67662B23777K70242I7369L49412j37866r3258J76415J08204j78907
13584C21369j14082J88784J02806j85023C2799L14849j07934J18713j33861J46487
13574C71053j16338K53277A11087L032R5338l0411a02067A55160J3089h3720C45300
13562C25040K5112j00805F5462K64393j02674P3853J18857H9479L05489q5898
$$ plain form
13552 309070 -16580 89648 1701 143801 375332 611358 164709 83199 216400 194989 520497
13541 520497 124709 244598 284420 299361 477017 198109 260848 410728 -283021 228572
13530 247836 79653 -150743 394114 372471 271489 285365 414031 322730 182393 384056
13520 384056 225462 256600 115075 145484 374674 826694 345884 105029 233625 419062
13510 419062 518192 -275589 312269 406251 151403 156146 570617 206899 135730 375234
13500 375234 -51773 378613 197786 27235 172365 123552 217064 33322 -9481 170152 307009
13489 307009 287966 -206032 -93979 362330 174774 297439 151864 315930 292717 193719
13479 193719 307675 129139 282581 -35926 345616 434756 366538 309273 263973 235032 177359
$$ packed form
13552C09070a6580H9648A701J42100K31531K36026A64709q1510J33201k1411L25508
13541E20497A24709J19889L9822J4941J77656A98109O2739J49880b83021B28572
13530B47836G9653a50743C94114k1643j00982J3876J28666r1301j40337K01663
13520C84056j58594L1138A15075L0409K29190M52020C45884A05029J28596J85437
13510D19062R9130b75589C12269R3982A51403M743M14471B06899p1169K39504
13500C75234e1773C78613j80827B7235J45130m8813R3512C3322i481A70152J36857
13489C07009j9043b06032i3979C62330A74774J22665j45575J64066k3213r8998
13479A93719J13956A29139J53442c5926C45616Q9140o8218n7265m5300k8941n7673
$$ plain form
13468 177359 397211 267250 554059 248034 32281 330775 341793 263087 493137 295657
13458 295657 -22464 100056 -42077 171631 350825 28900 381655 352994 168283 221833
13448 221833 182393 406004 152535 -40036 554463 101944 154040 218113 76698 283671
13438 283671 -18304 233920 81479 -27836 8885 326919 49342 -103864 371606 183175 290976
13427 290976 415856 -38256 273079 96229 -113789 249022 141924 322639 213612 -56330
13416 233851 -8220 16552 318700 -64333 101702 276043 16014 46075 247166 193544 87107
13404 -96821 289724 -254961 377508 -135426 344772 187284 114168 280429 324634 181938
13394 181938 366412 121783 128251 281466 188942 -308197 -87808 194422 81856 -18276 219677
$$ packed form
13468A77359K19852j29961K86809B48034C2281K98494J1018p8706K30050j97480
13458B95657b2464A00056d2077A71631J79194B8900L52755k8661A68283N3550
13448B21833l9440K23611A52535d0036E54463A01944N2096O4073G6698K06973
13438B83671a8304B33920H1479b7836H885L18034D9342a03864C71606A83175J07801
13427B90976J24880c8256B73079I6229a13789B49022j07098J80715j09027e6330
13416B33851h220A6552L02148f4333A01702J74341A6014L0061K01091n3622H7107
13404i6821B89724b54961C77508a35426C44772j57488p3116J66261M4205j42696
13394A81938J84474A21783O468J53215r2524c08197h7808A94422H1856a8276B19677
$$ plain form
13382 -18061 272574 63644 83345 274648 21051 95095 231725 229883 238378 364506 427271
13371 427271 106962 -77045 205764 207113 54934 379783 294700 465799 248528 -12899 397554
13359 652233 350627 421238 190320 -48118 370029 84214 266348 99350 -44773 462127
13348 376887 238539 244196 27316 12184 61819 395499 107992 574064 5758 -8532 362826
13336 535831 38972 241883 329458 499694 422874 166264 202283 81476 32855 -207459 208632
13324 98426 197508 69556 4392 4934 228447 12156 104611 195355 348284 403054 2245 495989
13312 495989 -65934 231065 72619 469198 102189 282087 -29101 480980 95385 105795
13302 105795 432925 85883 -235685 109979 -173438 312056 22317 129222 279558 147278
$$ packed form
13382a8061B72574F3644J9701J91303B1051P4044J36630j842Q495J26128O2765
13371D27271A06962g7045B05764J349E4934L24849q5083J71099k17271a2899C97554
13359F52233l01606P0611A90320d8118C70029H4214J82134I9350d4773D62127
13348C76887j38348N657B7316A2184M9635L33680A07992M66072E758h532C62826
13336E35831C8972K02911Q7575J70236p6820A66264L6019H1476C2855b07459B08632
13324I8426R9082F9556D392N42K23513A2156R2455R0744J52929N4770B245M93744
13312D95989f5934B31065G2619L96579A02189J79898b9101D80980I5385J0410
13302A05795L27130H5883b35685A09979a73438C12056B2317J06905J50336j32280
$$ plain form
13292 147278 210373 398035 117942 138489 -180900 81185 -78414 83132 193077 78514 351344
13281 351344 -67082 -83261 82076 273952 -83247 284856 95899 21761 -146199 144669 -168161
13269 298981 -104401 120359 161111 427513 107870 156732 -274027 157713 14438 53734
13259 53734 28757 231707 -233030 434748 136316 172542 32302 -99960 79338 329604 213137
13248 213137 -61628 94854 -155631 78389 -77127 466737 -15030 125134 150647 165013 -349
13236 52778 253774 28900 241116 205180 -71322 -47926 177480 23611 224831 20114 62235
13225 62235 168029 -134266 187279 69581 167372 264300 341617 32369 35123 234829 122562
13214 122562 41642 173801 12444 201946 -69105 109342 106364 96972 20851 341273 -51367
$$ packed form
13292A47278O3095J87662A17942K0547a80900H1185g8414H3132J09945G8514K72830
13281C51344f7082j6179H2076J91876h3247B84856I5899B1761a46199A44669a68161
13269B98981a04401A20359M0752K66402A07870M8862b74027A57713A4438L9296
13259E3734k4977K02950b33030D34748A36316L6226C2302i9960G9338K50266j16467
13248B13137f1628I4854a55631G8389g7127D66737a5030A25134K5513J4366c49
13236E2778K00996B8900K12216l5936g1322K3396A77480B3611K01220B0114M2121
13225F2235J05794a34266A87279F9581R7791R6928P7317C2369K754J99706j12267
13214A22562D1642J32159A2444J89502f9105A09342k978r392B0851L20422e1367
$$ plain form
13202 -333583 -10498 342660 90088 8140 260740 157231 197733 -35782 -46566 291611 169812
13191 169812 -52465 18490 39133 350821 280834 80786 187391 177201 -21854 178097 97681
13180 97681 -219949 -187840 19940 -107253 -55850 7745 237349 140395 -202955 -287165 79756
13168 -135582 516758 -84807 226058 181303 229583 -166371 81762 274513 -13567 -156617
13158 -156617 -48856 425829 242889 193157 -30493 -43167 -168584 236477 455052 -275811
13147 -381049 112816 -18392 -242865 -200884 181132 255597 130958 66266 146583 152625 105763
13136 105763 248620 42014 209753 157008 86675 -117334 99867 -119252 320652 38251
13125 385536 169657 -2189 64805 -621 -33145 269076 -268217 -136043 144541 -404251 73419
$$ packed form
13202c33583a0498C42660I0088H140K52600j03509M0502c5782j0784B91611j21799
13191A69812e2465A8490K0643L11688o9987H0786J06605j0190b1854A78097q0416
13180I7681b19949L2109A9940a07253N1403G745K29604r6954b02955q4210G9756
13168a35582E16758h4807B26058m4755M8280a66371H1762J92751a3567j43050
13158a56617d8856D25829j82940m9732c0493j2674j25417B36477K18575b75811
13147c81049A12816a8392k24473M1981A81132P4465j24639o4692Q0317O042m6862
13136A05763J42857D2014J67739n2745p0333a17334I9867a19252C20652C8251
13125C85536A69657b189F4805f21l2524B69076b68217J32174A44541d04251G3419
$$ plain form
13113 -10673 145134 -159229 95571 95761 355093 72144 134738 -10932 112676 1985 72125
13102 72125 -81909 -193684 127125 -18906 52421 -219738 198382 139299 30989 29362 211710
13091 211710 66635 -99749 213347 -134127 213239 -127241 -59368 19019 -6762 305354 133393
13079 92171 9929 -229833 241326 54485 -103925 205130 91696 -27999 42747 -138121 -41947
13067 7774 234571 102508 111417 -95708 69135 -238420 -84825 150894 217542 -94362 -31317
13055 65085 -15073 100090 -293665 152249 311686 422493 188176 131669 239849 46804
13044 -35102 -122246 -8031 334208 3245 144453 68868 123948 153828 -48947 -307025 177438
13032 209278 3793 240334 372338 58433 -59433 301213 145791 317823 -155592 63590
$$ packed form
13113a0673A45134a59229I5571J90K59332G2144O2594a0932A12676A985P0140
13102G2125h1909j11775A27125a8906E2421b19738A98382n9083C0989j627J82348
13091B11710F6635i9749B13347a34127B13239a27241e9368A9019f762C05354A33393
13079I2171I929b29833B41326E4485a03925B05130I1696b7999D2747a38121d1947
13067G774K26797A02508Q909i5708F9135b38420h4825A50894O6648i4362c1317
13055F5085a5073A00090b93665A52249J59437J10807A88176n6507J08180D6804
13044c5102q7144h031C34208C245J41208F8868N5080K9880d8947k58078A77438
13032B09278C793K36541J32004E8433e9433C01213A45791J72032a55592F3590
$$ plain form
13021 137388 154906 156134 -315591 111317 59174 -29226 223999 98696 72262 -113351 -157518
13010 -157518 190318 193427 80427 -27728 7575 175083 195152 341997 -54982 92756 193522
12999 193522 -273312 200124 -44397 121293 13602 281848 158951 18360 -287898 102160
12988 -145548 -68134 120146 -41559 9732 -71729 298877 113671 94867 161551 -153559 21187
12976 -21113 33258 212270 415010 102578 31376 255179 128227 130546 38192 -117819 -7788
12964 209059 -7058 122112 -263985 37867 83339 -122127 75265 76036 -106911 250945 346684
12953 346684 109755 34907 131783 -101318 42401 67625 45780 -260526 71025 -73248 -89004
12942 -89004 -196295 -29172 222565 85678 -472204 -53825 162338 -20488 147949 110666 -288928
$$ packed form
13021A37388J7518J228c15591A11317n2143b9226B23999I8696k6434a13351m4167
13010a57518A90318L109H0427b7728G575J67508K0069J46845e4982I2756J00766
12999A93522b73312B00124d4397A21293A3602K68246j22897A8360b87898A02160
12988a45548f8134A20146d1559I732g1729B98877A13671j8804O6684a53559B1187
12976b1113C3258J79012K02740A02578C1376K23803j26952K319C8192a17819g788
12964B09059g058A22112b63985C7867M5472a22127G5265P71a06911B50945R5739
12953C46684A09755C4907R6876a01318D2401K5224k1845b60526G1025g3248j5756
12942h9004j07291b9172B22565H5678d72204e3825A62338b0488A47949l7283b88928
$$ plain form
12930 -245722 -107758 184773 58878 -48617 131102 -82125 283689 64909 82022 -76537 129257
12918 245006 -224089 -273184 -221082 2197 227818 -155814 52522 312506 5913 -72567 -95761
12907 -95761 -151089 -372464 -6791 -111651 6114 -23605 464532 135165 410264 149604 -139084
12895 108935 90913 132055 152873 -26812 -292794 -119623 -154355 223288 161546 -37505 -136891
12884 -136891 -12402 12068 28490 -40066 87544 -80510 -182834 39456 -178087 -30564 1021
12872 251803 -2456 375772 -121977 30162 -285836 9506 -197069 -151830 -232427 -383 -90284
12861 -90284 83923 44295 -277186 -83857 293936 103994 165992 93317 94682 -73173 18364
12849 212237 15399 54773 250260 -112457 -143813 -71403 10250 33115 -165100 63318 73878
$$ packed form
12930b45722a07758A84773E8878d8617A31102h2125B83689F4909J7113g6537A29257
12918B45006b24089m9095N2102B197K25621a55814E2522K59984E913g2567k3194
12907i5761n5328k21375f791j04860F114b3605D64532A35165K75099A49604a39084
12895A08935j8022M1142K0818b6812k65982a19623l4732B23288o1742c7505r9386
12884a36891a2402A2068J6422d0066H7544h0510j02324C9456a78087c0564A021
12872B51803b456C75772a21977C0162b85836I506a97069M5239q0597c83q9901
12861i0284H3923l9628b77186h3857B93936A03994O1998p2675J365g3173A8364
12849B12237A5399L9374J95487a12457l1356g1403A0250K2865a65100F3318J0560
$$ plain form
12838 73878 4538 173602 -241140 75161 -250 40099 19650 323967 -193205 248003 160727
12827 160727 -234193 -33522 64393 -28886 80384 -55294 157979 259406 -105834 121545
12816 131443 6721 33482 -403593 8739 160582 14437 -52158 -18013 141906 -100927 -157767
12805 -157767 321427 -357334 -17897 12465 -44841 -132168 139925 -50143 406867 -32077 -144517
12794 -144517 -49002 187730 394491 -128576 -118697 135038 145578 53423 -148775 -259931
12784 -259931 -2455 179879 -64754 -55770 -118131 69416 -230242 -226088 -111210 -256332 226721
12772 -123938 -228414 47531 37706 44468 24706 55766 173951 -426291 170932 -210295 103378
12760 -205003 -89544 184939 -5428 104924 152937 -124838 -70374 -128033 181758 54973 -48929
$$ packed form
12838G3878D538J69064b41140G5161b50D0099A9650L04317a93205B48003q7276
12827A60727b34193c3522F4393b8886H0384e5294A57979J01427a05834A21545
12816A31443F721K6761d03593H739J51843A4437e2158a8013A41906a00927n6840
12805a57767C21427c57334a7897A2465d4841q7327A39925e0143D06867c2077j12440
12794a44517d9002A87730K06761a28576R879A35038J0540E3423a48775j11156
12784b59931b455A79879f4754Q984o2361F9416b30242M154a11210j45122B26721
12772a23938j04476D7531r825O762j9762L1060J18185d26291A70932b10295A03378
12760b05003h9544A84939e428A04924M8013a24838N4464n7659A81758E4973d8929
$$ plain form
12748 -54926 373889 -200484 -183957 65858 18874 -398450 -54754 -165167 -338253 45875 217423
12737 217423 -89153 344397 -178174 -14602 235851 160402 15697 -31000 29963 195226 -137118
12725 -10193 206555 10244 208752 -223883 -118911 108416 67452 31593 -58153 -336783
12715 -336783 -187619 -83217 230972 230903 -8653 410087 -135861 91250 367511 364825 -57158
12703 120827 -122087 152449 51863 97929 -331335 -118373 -287247 -28315 336048 47590
12692 -11600 -232685 187512 40284 32454 169625 -206088 -157371 373 -230206 -122457 27521
12680 -56818 91902 280184 -89087 92821 -22272 28379 -97982 -82757 -79259 324251 87985
12668 118736 -22727 -10866 238603 109288 189080 29086 -83370 20626 194674 1663 337270
$$ packed form
12748e4926C73889b00484J6527F5858A8874c98450e4754j10413j73086D5875J71548
12737B17423h9153C44397a78174a4602B35851p5449A5697c1000B9963J65263a37118
12725a0193B06555A0244J98508b23883J04972A08416m0964C1593e8153k78630
12715c36783J49164h3217B30972o9h653D10087a35861I1250K76261k686e7158
12703A20827a22087A52449E1863M6066c31335a18373j68874b8315C36048D7590
12692a1600k21085A87512D0284p830J37171b06088M8717C73b30206J07749B7521
12680e6818I1902J88282h9087I2821b2272B8379i7982J5225L498C24251H7985
12668A18736b2727a0866B38603A09288P9792B9086h3370B0626J74048A663L35607
$$ plain form
12657 337270 238958 48844 -116965 126055 60496 98845 -161885 164337 169878 -1675 400959
12645 4786 -92255 -20979 160018 -28791 -88036 46709 100809 -297969 188778 166403 -12324
12633 58519 292526 368597 24915 246038 89524 55412 133605 194686 154315 235081 81507
12621 14856 93159 50902 384783 435522 123091 -125023 249928 58534 -208246 -158394 16186
12609 -301929 82914 -41498 126029 296150 -246444 102791 -38113 30986 -60040 45112 -148067
12597 -192998 90946 155569 -134472 -46345 -183107 -53646 124753 519745 -20433 -7770 -140700
12586 -140700 -63831 41287 4550 6965 -240362 82828 55634 -94927 -131908 127956 55153
12574 304456 -220220 138296 65966 -103951 -128668 153912 -191975 -182310 48616 -112284
$$ packed form
12657C37270r8312D8844a16965A26055F0496L8349a61885A64337N541a675D00959
12645D786i2255b0979A60018b8791n9245D6709N4100b97969A88778k2375a2324
12633E8519K34007P6071B4915K21123H9524l4112P8193O1081m0371Q0766H1507
12621A4856P8303m2257L33881N0739A23091a25023B49928E8534b08246M9852A6186
12609c01929H2914d1498A26029J70121b46444A02791c8113C0986f0040D5112a48067
12597a92998I0946O4623a34472d6345j36762e3646A24753L94992b0433g770j32930
12586a40700f3831D1287D550K415b40362H2828k7194i4927l6981A27956E5153
12574C04456b20220A38296F5966a03951k4717A53912a91975R665D8616a12284
$$ plain form
12563 133909 27963 -47788 153044 229812 -124390 -105281 -360510 -80382 -122195 -105912 -440073
12552 -440073 -368417 189612 102750 183853 -246121 246471 283032 -216211 181738 -244056
12541 -48901 4971 340523 105185 -199895 20942 352396 -27718 267607 20028 -284289 -237216
12530 -237216 180852 56433 -315018 -313896 120484 170517 74793 -84877 74678 -63470 37023
12518 -42409 -35677 -21451 -168137 93392 -340611 129325 118584 139637 80697 405293 319896
12507 319896 -176367 -183557 -152651 182187 56035 75797 141215 -32847 -122934 226060 -230675
12495 -90349 4477 -83361 78892 50112 -100674 -190793 -92256 -50927 80217 -276236 31703
12483 -222726 -171649 177516 -123044 182395 -130395 263799 74071 120668 -139755 -172410
$$ packed form
12563A33909B7963d7788A53044P6768a24390J9109k55229h0382m1813J6283l34161
12552d40073P1656A89612q6862Q1103b46121B46471L6561b16211A81738b44056
12541d8901D971L35552A05185a99895B0942L31454b7718B67607B0028b84289M7073
12530b37216A80852E6433c15018J122A20484N0033G4793h4877G4678f3470C7023
12518d2409O732J4226j46686I3392c40611A29325j0741K1053n8940L24596q5397
12507C19896a76367p190L0906A82187E6035J9762O5418c2847r0087B26060b30675
12495i0349D477h3361G8892k8780a00674r0119i2256M1329H0217b76236C1703
12483b22726N1077A77516a23044A82395a30395B63799G4071M6597a39755l2655
$$ plain form
12473 -172410 -31141 -103050 -27648 -71444 -140564 -315590 121757 396023 44844 -346629 -31593
12461 -207122 -62309 -400764 -22156 40655 -107644 -14969 -196526 -330659 283476 -188634
12450 149485 -141214 74075 186697 89517 317108 180383 -66391 -103445 -32088 40241 93021
12439 93021 310718 -308112 129897 -339577 62450 -435320 -36364 45902 -333560 -13380
12428 108085 42189 254081 -76658 -259618 -237764 243778 -273117 -142048 -42550 -43372 155846
12416 36532 222545 114263 203549 65722 127752 54744 92468 -290390 416431 -39036 -62924
12405 -62924 -158937 -75536 135077 -8287 -130447 3786 -103416 -182635 -200409 -219739 14935
12393 107213 121427 -191636 125972 34786 172588 239253 254790 -221676 119612 318344
$$ packed form
12473a72410c1141p1909b7648m3796o9120j75026A21757K74266D4844c46629c1593
12461b07122f2309l38455b2156D0655a07644a4969j81557j34133B83476a88634
12450A49485a41214G4075J12622H9517K27591j36725f6391l7054c2088D0241N2780
12439I3021K17697c08112A29897c39577F2450d35320c6364D5902c33560a3380
12428A08085D2189K11892g6658j82960K1854B43778b73117J31069d2550q22A55846
12416C6532J86013j08282Q9286F5722O2030E4744L7724b90390D16431c9036k3888
12405f2924r6013g5536A35077h287j22160C786a03416p9219j7774j9330A4935
12393A07213J4214a91636A25972C4786J37802O6665J5537b21676A19612J98732
$$ plain form
12383 318344 172431 41431 16674 -167198 77801 -68360 186404 235299 -257650 151210
12372 301847 169501 -227403 -373298 99631 211506 -56021 46686 18470 -249722 -91772
12361 365373 -32541 -245683 -313013 -114923 5454 -161305 247359 -40837 24731 -172015 -136250
12350 -136250 -274711 -127443 -141772 -89903 -102457 205571 -84233 33712 233047 345938
12340 345938 113590 376694 -131098 -127771 114489 177526 157238 147079 -95745 54233 250643
12329 250643 323230 -45 161737 353984 203171 -212179 29058 -46252 -185953 607004 107182
12317 168009 -214823 255007 -91758 13727 -12663 213284 29574 -52644 30111 -111341 222617
12305 -8850 121496 61024 86505 231288 167797 -1013 128934 -139181 26310 -294805 -143388
$$ packed form
12383C18344j45913D1431A6674a67198G7801f8360A86404M8895b57650A51210
12372C01847j32346b27403j45895I9631J11875e6021D6686A8470b49722i1772
12361C65373c2541k13142o7330a14923E454a61305B47359d0837B4731a72015L5765
12350a36250j38461a27443j4329N1869j2554B05571h4233C3712J99335J12891
12340C45938A13590K63104a31098L327A14489O3037k0288j0159i5745E4233J96410
12329B50643P2587d5A61737J92247j50813b12179B9058d6252j39701F07004A07182
12317A68009b14823B55007i1758A3727a2663B13284B9574e2644C0111a11341B22617
12305h850A21496o0472K5481J44783o3491a013A28934a39181B6310b94805a43388
$$ plain form
12293 90273 122889 202168 -54443 235558 29179 73915 406509 113672 174967 -133453 280131
12281 113032 71815 33561 21820 299187 39440 106377 20278 121880 -14649 211083 -61140
12269 116807 131847 181611 129899 -103863 128485 -44225 230013 132782 585835 157517
12258 588981 -284144 290236 71533 114009 31735 167253 182969 118149 129901 231961 -217731
12246 208525 74614 413995 72346 180633 299272 -70129 122266 -190892 -123983 165239
12235 -126580 82588 202104 58438 193476 203917 338003 528045 24355 -83591 193396
12224 49863 96088 170588 29584 118928 550132 222237 -86087 205911 89280 256769 312047
12213 312047 263549 323416 122587 235964 -246923 135901 154852 240559 76011 403643
$$ packed form
12293I0273L2616P9279e4443B35558B9179M4736L32594A13672O1295a33453B80131
12281A13032m1217C3561j1741K77367C9440O6937B0278J01602a4649B11083f1140
12269A16807J5040M9764n1712a03863A28485d4225B30013r7231M53053A57517
12258E88981b84144B90236G1533M2476C1735J35518J5716o4820J1752J02060b17731
12246B08525G4614L39381G2346J08287J18639g0129A22266a90892O6909A65239
12235a26580H2588J19516E8438J35038J0441J34086J90042B4355h3591A93396
12224D9863M6225P4500B9584Q9344M31204B22237h6087B05911H9280J67489N5278
12213C12047m8498N9867A22587J13377b46923A35901J8951Q5707G6011L27632
$$ plain form
12203 403643 61867 207271 -128592 80625 111446 118547 -33520 199735 255055 222131 -47454
12191 158196 204867 376363 -34642 480976 330854 227637 -305771 275022 172636 104031
12181 104031 -44492 169631 -36435 23625 -187806 -13014 244710 -151677 352344 98894
12170 52992 140729 -89597 -198679 568046 474072 113532 335424 242943 185700 32518 234160
12159 234160 111951 213516 290502 -281418 80195 248641 -99527 218664 156070 168964
12149 168964 345482 98091 -40310 4322 318037 -54101 24439 71693 153738 236635 63826
12137 163797 -145838 -48985 124533 49335 293050 205772 178221 287478 -148429 126095
12126 152759 127393 8419 -436828 131436 161681 294390 442312 16875 -388395 -196284
$$ packed form
12203D03643F1867J45404a28592H0625L0821P101c3520A99735N5320l2924d7454
12191A58196M6671J71496c4642D80976j50122j03217c05771B75022j02386o8605
12181A04031d4492A69631c6435B3625a87806a3014B44710a51677C52344I8894
12170E2992Q7737h9597j09082E68046r3974A13532K21892r2481n7243C2518K01642
12159B34160A11951J01565P6986b81418H0195J68446i9527B18664o2594J2894
12149A68964J76518I8091d0310D322L13715e4101B4439M7254Q2045Q2897F3826
12137A63797a45838d8985A24533D9335K43715q7278k7551J09257a48429A26095
12126A52759k5366H419d36828A31436L0245J32709J47922A6875c88395J92111
$$ plain form
12116 -196284 186795 234051 354858 406800 186422 -66790 15179 -81341 7431 -162716 105265
12104 74718 62190 -91076 183847 32533 -246758 54263 80002 -30159 -25442 121207 206909
12093 206909 137293 -97576 356275 306009 -479128 190739 188017 145496 212778 9253 -270502
12081 259734 207575 134782 180791 422430 235968 132521 291362 162765 256746 173406
12071 173406 157889 329474 -88968 14674 428190 112425 131154 103681 525088 -19758 -251996
12060 -251996 -67624 194703 167307 -156696 166767 -179693 168344 -6954 97771 153666 -87445
12048 -6901 -33359 28462 -59402 -23324 86077 -68456 -36749 -263290 14534 -225204 -227447 -78225
12035 -17786 53205 -25858 -403945 276455 -138464 -80701 -176241 185781 -11600 -175344 -242304
$$ packed form
12116a96284A86795M7256J20807N1942A86422f6790A5179h1341G431a62716A05265
12104G4718j2528i1076A83847C2533b46758E4263K5739c0159M717A21207Q5702
12093B06909o9616i7576C56275n0266d79128A90739k722m2521O7282I253b70502
12081B59734n2159p2793M6009K41639j86462j03447J58841j28597R3981q3340
12071A73406j5517J71585h8968A4674M13516A12425J8729k7473M21407a9758k32238
12060b51996f7624A94703k7396a56696A66767a79693A68344f954I7771N5895h7445
12048f901k6458B8462e9402b3324H6077f8456L1707k26541A4534b25204k243g8225
12035a7786E3205b5858l78087B76455a38464N7763r5540A85781a1600j63744o6960
$$ plain form
12024 -242304 -110683 99 -98373 91059 133305 -4069 214651 283717 -101468 93859 -376547
12012 208923 166729 -12089 -107075 30446 55246 85909 -32741 20911 -11 272053 -247209 -223225
12000 -223225 -118641 119835 -42990 -119688 -277784 198737 -210313 -54834 135764 91772
11990 91772 232960 21964 -60446 -49925 65709 85887 105332 419825 -172147 -55143 84231
11978 -223291 328481 91431 117796 -170721 12787 22876 39062 -23497 434916 -48048 23100
11966 146062 -135697 -288664 203304 -71217 270031 199252 -21688 -122146 -146280 -432531
11956 -432531 -48870 74648 149192 -30506 80914 189151 -173370 229036 130328 -98768 -246176
11945 -246176 14890 -56123 -1820 92290 59415 132032 -116549 181355 58921 -223355 201267
$$ packed form
12024b42304a10683I9i8373I1059M2246d069B14651O9066a01468I3859c76547
12012B08923m2194a2089r4986C0446K4800L0663c2741B0911a1B72053b47209K3984
12000b23225J04584A19835d2990p6698j58096A98737b10313e4834A35764m3992
11990I1772J41188B1964f0446J0521F5709K0178J9445L14493a72147e5143H4231
11978b23291C28481I1431K6365a70721A2787J0089J6186b3497D34916d8048B3100
11966A46062a35697j52967B03304g1217B70031p0779b1688j00458k4134k86251
11956d32531d8870G4648P4544c0506H0914J08237a73370B29036r8708i8768j47408
11945b46176A4890e6123a820I2290l2875P2617a16549A81355E8921b23355B01267
$$ plain form
11933 186622 141224 273330 181509 288028 379567 155091 216105 -139538 -134730 -27174 83784
11921 -367162 -240445 -446470 79052 51719 -87174 -137155 -18343 -157710 -65021 -381112 140835
11909 52879 -321657 -31858 -358085 -12375 -12853 -41785 115183 50343 37111 92573 -48394
11897 -92824 106851 -41752 -294278 52126 -115916 196279 -37238 102751 -328374 -206777
11887 -206777 -6296 -81696 -99256 -217633 93491 32763 177628 -175239 -215466 56711 -106913
11875 -236430 -286963 -323286 -273695 81042 -462807 8489 -351431 193633 -685052 16963 165037
11864 165037 -168838 -196648 -19322 -175980 32987 -142224 -36799 -76305 -74099 194901 196459
11853 196459 20616 -211530 21360 -197079 -63411 -37930 -186256 6800 247339 34990 -98541
$$ packed form
11933A86622m5398J32106r1821J06519R1539A55091O1014a39538M808b7174H3784
11921c67162J26717k06025G9052k7333h7174m9981a8343j39367f5021l16091A40835
11909E2879c21657c1858l26227a2375m78k8932A15183E0343j3232N5462d8394
11897i2824A06851d1752k52526E2126a15916A96279c7238A02751c28374J21597
11887b06777f296p5400j7560j18377I3491C2763J44865a75239m0227E6711a06913
11875b36430n0533l6323M9591H1042d62807H489c51431A93633f85052A6963J48074
11864A65037a68838k7810a9322j56658C2987a42224c6799l9506K206A94901J558
11853A96459B0616b11530B1360a97079f3411K5481j48326F800K40539C4990i8541
$$ plain form
11841 55029 -252570 -88738 295930 306857 -146033 -95980 46890 -277658 -193012 176351 -26183
11829 -140902 -156179 -107852 76909 282767 312718 55563 -305372 -171301 -74636 -183084 -269028
11818 -269028 234277 -116883 -234122 -94435 195782 -388739 -247905 -188101 170770 -197411
11807 -91521 94892 134627 -403895 119703 -8997 -179214 -196642 63698 -34784 -148119 -192505
11796 -192505 190837 -46687 252604 23912 -68532 308401 -28908 17208 99977 53468 -191221
11784 -132674 -40149 203124 39315 48348 -205823 138694 -131626 -37743 -73262 -17455 50202
11772 123642 -26930 263862 -136096 167024 197170 -270022 63330 53754 -120886 -247512
11762 -247512 -78966 8980 -102581 -212271 202719 -268241 -206200 200268 431525 -59345
$$ packed form
11841E5029b52570h8738B95930J0927a46033N0053D6890b77658Q4646A76351b6183
11829a40902j5277M8327G6909K05858K9951E5563c05372J34071g4636j08448q5944
11818b69028B34277a16883j17239i4435A95782c88739J40834N9804A70770a97411
11807i1521I4892L9735d03895A19703h997j70217j7428F3698c4784j13335m4386
11796a92505A90837d6687B52604B3912f8532C08401b8908A7208Q2769m6509a91221
11784a32674d0149B03124C9315R033b05823A38694a31626c7743l5519a7455E0202
11772A23642b6930B63862a36096A67024L0146b70022F3330r576a20886j26626
11762b47512g8966H980a02581j09690B02719b68241O2041B00268K31257e9345
$$ plain form
11751 -273872 195019 -184592 -189183 -37498 -44254 -3485 103385 -82348 94218 -95276 122741
11739 122186 -199287 64042 -231363 263659 245382 138293 -96280 92956 -164747 -49740
11728 -130604 137652 128923 11027 -344255 101670 -73456 -66883 -302811 -176857 86425 119167
11717 119167 -194343 18816 -132956 33106 -153586 -178066 87140 98268 198137 12648 -64197
11705 212424 38384 20656 -63216 305271 -7478 -377595 150714 -236318 -7759 -77153 -84475
11694 -84475 -59497 -149555 -215263 283651 -174741 362292 -138728 55469 222189 -126341
11683 121972 168712 85309 233412 184866 145168 -122234 287918 147746 -376341 -63447
11672 161404 98491 120354 325232 -218924 83925 261821 416204 197145 -371428 -202496
$$ packed form
11751b73872A95019a84592m591c7498o756c485A03385h2348I4218i5276A22741
11739A22186a99287F4042b31363B63659j8277j07089i6280I2956a64747d9740
11728a30604A37652q729A1027c44255A01670g3456O573k35928J25954H6425L2742
11717A19167a94343A8816a32956C3106a53586k4480H7140J1128R9869A2648f4197
11705B12424C8384j7728f3216C05271g478l70117A50714b36318g759o9394p322
11694h4475K4978r0058o5708B83651a74741C62292a38728E5469J66720a26341
11683A21972M6740q3403J48103m8546l9698a22234B87918j40172c76341f3447
11672A61404o2913K1863K04878b18924H3925J77896J54383A97145c71428J68932
$$ plain form
11662 -202496 -127999 794 -318548 92450 244991 413178 -294459 -261336 -2803 -152919 130435
11650 122176 148291 127903 -257856 -52762 92247 -355575 29304 54812 -110953 90160 137527
11639 137527 -101862 118942 -116160 97597 -163941 -157428 -25744 37398 -82130 -14852 -216004
11628 -216004 -38885 68333 71899 -175576 23173 108127 -39294 164908 172019 71860 -91396
11616 -110228 -4528 45041 -118422 -37623 -204269 78577 2603 74956 -91879 233780 -215589
11604 -304535 157319 325380 -22321 153582 -582003 9590 -418372 -24980 -86875 -174004 388649
11592 83542 68649 318519 147778 -111982 283829 -115430 -181228 -120561 150592 -122042
11581 -231168 33666 -126701 -108737 117872 213185 34591 289472 98488 268345 -104102
$$ packed form
11662b02496P4497G94c18548I2450J52541J68187b94459L3123b803j50116A30435
11650A22176K6115k0388b57856e2762I2247c55575B9304K5508a10953I0160M7367
11639A37527a01862A18942a16160I7597a63941O513b5744C7398h2130a4852k01152
11628b16004c8885F8333L566a75576B3173Q4954c9294A64908P111G1860i1396
11616a10228d528D5041a18422c7623j66646G8577B603P2353i1879B33780b15589
11604c04535A57319J68061b2321A53582e82003I590d18372b4980o1895q7129C88649
11592H3542j4893K49870A47778a11982B83829a15430o5798O0667A50592a22042
11581b31168C3666a26701J7964A17872R5313C4591K54881I8488J69857a04102
$$ plain form
11570 125889 408454 -67229 56716 -29328 -291696 -59534 -24513 52241 -13992 -120655 -47264
11558 -20084 185550 -291713 46549 17494 15535 -77700 -73303 172248 -102552 -156509 -48827
11546 78834 53082 -236446 -209325 -211606 240673 19221 -85160 56866 140223 -27988 -143757
11535 -143757 -86127 180377 123520 127961 -222328 120692 336241 106325 -257383 128687
11524 -50738 160574 155174 325574 240506 296510 -119259 357736 55119 -29525 75068 -137893
11512 88578 -4671 117949 -190877 324793 58028 273113 107355 90429 28137 208802 175348
11501 175348 267144 601898 4462 77586 234986 326412 317162 220218 76110 213989 454081
11490 454081 318568 125882 53904 63029 -109096 78581 89807 -159917 318485 395989 97977
$$ packed form
11570A25889K82565f7229E6716b9328k62368e9534b4513E2241a3992j06663d7264
11558b0084A85550b91713D6549A7494j959g7700M397A72248a02552n3957d8827
11546G8834k5752b36446K7121k281B40673A9221h5160E6866Q3357b7988j15769
11535a43757N7630A80377n6857M441b22328A20692K15549A06325b57383A28687
11524e0738A60574n400J70400q5068N6004a19259C57736E5119b9525G5068a37893
11512H8578d671A17949a90877C24793E8028K15085A07355j6926B8137J80665l3454
11501A75348R1796L34754D462P3124J57400R1426r250r6944G6110J37879K40092
11490D54081j35513A25882E3904R125a09096G8581J1226a59917C18485P7504I7977
$$ plain form
11478 27466 -96822 359859 120613 -17405 68328 -115287 356850 242917 -65084 605400
11467 -13949 170907 154519 514513 354946 -50766 200198 173315 101435 321477 -86684 195906
11455 296251 -113692 235606 272681 175951 -88165 132635 562819 43934 57842 -42024 -2840
11443 241287 81344 -127066 78429 366088 -76082 188133 12570 -116287 95778 -808 31520
11431 65054 219926 139348 -145183 259168 751 -11162 221984 230721 -76164 71011 116386
11420 116386 -93597 -156505 78891 105313 36134 107961 62738 138241 31282 -103656 212203
11408 -188112 128741 -28637 68299 -225651 -53400 87624 -10517 42537 481802 178005 229034
11397 229034 -25772 -237461 -262224 -45940 163216 54065 -194085 -129663 -163864 -509695 191868
$$ packed form
11478B7466i6822C59859A20613a7405F8328a15287C56850j13933f5084F05400
11467a3949A70907j6388L59994j59567e0766B00198k6883p1880K20042h6684A95906
11455B96251a13692B35606L7075r6730h8165A32635M30184D3934J3908d2024b840
11443B41287H1344a27066G8429K87659g6082A88133A2570a16287I5778h08C1520
11431F5054J54872q0578a45183B59168G51a1162B21984Q737g6164G1011M5375
11420A16386i3597o2908G8891K6422C6134P1827m5223P5503C1282a03656B12203
11408a88112A28741b8637F8299b25651e3400H7624a0517D2537M39265A78005N1029
11397B29034b5772k11689k4763d5940A63216E4065a94085O4422l4201l45831A91868
$$ plain form
11385 -136642 44147 -57425 41289 6938 -137357 175339 -34018 -134602 -151320 87445 -135919
11373 -320147 -298047 -94850 33176 196756 248908 -235395 333270 -106484 193474 -13254
11362 -179211 -189870 -27217 -89105 30809 -489704 -66282 17886 -199279 140854 -163886 -39492
11350 -36610 140431 -62378 109084 -45062 -87088 69614 -212 -180260 127979 175005 -44681
11338 294144 -108758 209437 123181 9373 117958 -74128 143517 -104918 198458 -5956 -422874
11327 -422874 -118020 -9065 16595 -98502 -12198 -151053 -273407 147749 -11038 -417314 64019
11315 -36643 187287 -251998 -172172 -64221 62795 -101011 30846 -52935 -314200 -195007 -101978
11304 -101978 -16045 173468 -87849 -189983 -24440 -264033 -352265 -146346 -219224 -191016 -71721
$$ packed form
11385a36642D4147e7425D1289F938a37357A75339c4018j00584j6718H7445a35919
11373c20147K2100i4850C3176J63580N2152b35395C33270a06484A93474a3254
11362a79211j0659b7217o1888C0809d89704f6282A7886a99279A40854a63886c9492
11350c6610A40431f2378A09084d5062m2026F9614b12j80048A27979M7026d4681
11338B94144a08758B09437q6256I373J08585g4128A43517a04918A98458e956m16918
11327d22874a18020i065A6595i8502a2198j38855j22354A47749a1038m06276F4019
11315c6643A87287b51998P9826f4221F2795a01011C0846e2935k61265J19193R3029
11304a01978a6045A73468h7849j02134b4440k39593q8232a46346p2878K8208g1721
$$ plain form
11292 125651 -141814 1822 -582 -228551 317331 -173914 -54994 133950 -175654 77973 -166330
11280 -83266 48463 85018 -247642 99671 263920 -17056 130596 74465 -43988 123288 -179537
11268 -30322 39965 25943 34681 -179360 -191535 137865 50866 -163754 -117306 131186 190625
11257 190625 -289316 -428623 -95850 -46918 -383435 -330640 85655 -67306 -58783 -272754 172640
11245 -4860 -39935 -54831 -166114 -112727 109438 -97006 44511 20271 -16954 141836 230937
11234 230937 278689 -150391 -411483 27443 -298798 -299552 -58459 -419699 -41455 -149292 144307
11222 104256 85260 -74261 160896 -6929 171810 -29358 36587 -52899 -58020 -106580 10248
11210 210207 153953 -177112 2291 -55936 -121488 -534956 85434 -522613 -135802 -95058 -58361
$$ packed form
11292A25651a41814A822e82k27969C17331a73914e4994A33950a75654G7973a66330
11280h3266D8463L6555b47642I9671J64249a7056A30596n6131d3988A23288a79537
11268c0322C9965j4022Q738a79360j2175A37865E0866a63754M6448A31186N9439
11257A90625b89316j39307i5850d6918l36517N2795H5655f7306Q523k13971A72640
11245d860l5075j4896j11283N3387A09438i7006D4511B0271a6954A41836Q9101
11234B30937M7752a50391k61092B7443b98798p54e8459l61240d1455j07837A44307
11222A04256j8996g4261A60896f929A71810b9358C6587e2899n121m8560A0248
11210B10207n6254a77112B291e5936o5552m13468H5434e22613a35802M0744L6697
$$ plain form
11199 -58361 92316 -42756 -186586 -28352 2918 -381891 -7350 -68935 -15051 431206 -386141
11187 -181439 78624 -381869 1792 -457401 -570156 77882 -321618 174616 -47917 -8828 150392
11175 133191 -31446 -229730 -183252 -318282 -276333 -16887 -80953 -44753 83113 -76770 376632
11163 -13640 -57095 -207476 241308 215493 276649 -102306 -49474 79250 327905 -167345 -178953
11152 -178953 16681 72934 -290848 -141456 70480 -16276 -100638 189306 -330417 301031
11141 -87463 123055 -328184 297732 228678 -203963 -75382 -70130 191023 129084 20834 -141862
11129 -172431 110618 115706 189404 -119636 269646 69991 204402 -211 232863 106615 141771
11118 141771 -210831 -159903 69270 27311 387021 -99077 309528 7502 132950 120552 232492
$$ packed form
11199e8361I2316d2756j43830b8352B918c81891g350o1585a5051D31206c86141
11187a81439G8624c81869A792d57401j12755G7882c21618A74616d7917h828A50392
11175A33191c1446j98284M6478j35030M1949a6887o4066L6200H3113g6770C76632
11163a3640m3455j50381B41308k5815O1156a02306d9474G9250K48655a67345j1608
11152a78953A6681N6253b90848a41456G0480a6276q4362A89306c30417C01031
11141h7463A23055c28184B97732o9054b03963g5382N252A91023o1939B0834a41862
11129a72431A10618N088P3698a19636B69646F9991J34411b11B32863A06615L5156
11118A41771b10831N0928F9270B7311L59710i9077C09528G502J25448j2398J11940
$$ plain form
11107 232492 -38016 287135 -233729 -7668 512259 112369 -21845 -173576 111714 190798
11097 190798 386004 110156 58587 445617 209745 -27728 161777 116042 -36067 61097
11086 137947 335355 299899 368236 472435 284307 289422 118746 80646 374455 -11542 -206307
11075 -206307 52484 140236 195594 377422 263817 318296 341367 219774 275613 332228 353588
11064 353588 350939 397825 260602 407236 317707 645003 267552 470546 563382 489758 711515
11053 711515 400120 946999 681628 433517 1178814 1201396 324710 557401 721556 940832
11043 940832 635190 517856 662587 723622 708192 458321 758502 757457 571895 880018
11033 880018 828757 1102424 849130 681767 841274 802757 664563 491831 1015042 561872
$$ packed form
11107B32492c8016B87135b33729g668E12259A12369b1845j51731A11714P9084
11097A90798J95206A10156n1569L87030B09745b7728A61777m5735c6067F1097
11086A37947J97408l5456O8337J04199j88128N115A18746l8100K93809a1542j94765
11075b06307E2484Q7752N5358J81828j13605N4479K3071j21593N5839N6615K1360
11064C53588k649M6886j37223J46634q9529L27296B67552K02994R2836p3624K21757
11053G11515l11395N46879k65371k48111P45297K2582C24710K32691J64155K19276
11043I40832l05642j17334J44731O1035j5430k49871L00181j045j85562L08123
11033H80018n1261K73667k53294j67363J59507l8517j38194j72732N23211m53170
$$ plain form
11023 561872 554606 803672 726066 603397 853783 597845 707977 397859 487748 458019
11013 458019 559981 722847 535413 628285 603816 599033 794619 462377 472355 641340 495963
11002 495963 463551 318509 590813 705417 578178 650365 865736 742670 590525 672887
10992 672887 772402 673494 758159 494634 921758 621877 679566 598837 664810 816109 869582
10981 869582 793065 919420 902318 911520 1259559 997164 1196586 1537685 1524423 1831621
10971 1831621 2178255 2257934 2204610 2434103 2504555 2504076 2633464 2753032 2235743 1914123
10961 1914123 1805375 1697327 1416113 1289144 1222650 1448684 1358492 1335553 1370120 1168236
10951 1168236 1324388 983382 1172687 1013536 598650 420377 473052 617878 592593 455938
$$ packed form
11023E61872p266K49066p7606j22669K50386k55938J10132l10118Q9889k9729
11013D58019J01962J62866j87434R2872k4469m783J95586l32242R978J68985j45377
11002D95963l2412j45042K72304J14604j27239P2187K15371j23066j52145Q2362
10992F72887R9515r8908Q4665k63525M27124k99881N7689q0729O5973J51299N3473
10981H69582p6517J26355j7102R202L48039k62395J99422L41099j3262L07198
10971A831621L46634P9679n3324K29493P0452m79J29388J19568n17289l21620
10961A914123j08748j08048k81214j26969o6494K26034r0192k2939L4567k01884
10951A168236J56152l41006J89305j59151m14886j78273N2675J44826k5285j36655
$$ plain form
10941 455938 135592 175392 -78353 -143652 -7422 5228 53007 21678 213284 -138282 -213217
10930 -213217 97171 130190 57634 -68433 295502 96840 274119 161914 -94203 8042 -188507
10918 -24509 139506 -22300 -105550 -18292 -156966 -153563 -48174 203992 91157 -119048 168557
10906 -34811 -262777 66676 -246294 112389 58368 -65909 58177 161265 -123532 90638 145723
10895 145723 -190315 -344347 50036 -249191 318542 356294 65675 402632 122116 -355397
10884 -47573 50569 -96452 80188 -93688 144311 -56796 96055 -164911 -105973 -35210 -76664
10873 -76664 -166272 272132 23886 163927 97624 -145652 -400391 -15056 -245408 172853
10862 -218204 90371 85131 281075 -37800 -416994 374879 -198998 207048 95124 -100819
$$ packed form
10941D55938A35592L9800g8353o5299g422E228M7779B1678J91606a38282p4935
10930b13217I7171L3019E7634f8433B95502I6840J77279j12205i4203H042a88507
10918b4509A39506b2300q3250a8292j38674L403d8174B03992I1157a19048A68557
10906c4811k27966F6676b46294A12389n4021f5909E8177J03088a23532I0638N5085
10895A45723a90315j54032E0036b49191C18542L7752F5675L36957A22116c55397
10884d7573E0569i6452H0188i3688A44311e6796I6055a64911N8938c5210m1454
10873g6664q9608B72132B3886J40041o6303a45652k54739a5056k30352A72853
10862b18204I0371n240J95944c7800l79194C74879a98998B07048I5124a00819
$$ plain form
10851 -202855 -322362 -280389 61783 -115800 -3451 -262175 176337 -85371 -54883 -61645 -523070
10840 -523070 68481 262969 -241691 133065 172398 -178113 50190 -78148 275476 200495
10830 200495 32983 -20740 79632 -9396 31635 140583 38930 -189771 157 176202 -190458
10818 -194444 -160160 -267763 124954 -187700 155445 38326 -339347 -98960 -107393 -247887
10808 -247887 139415 145746 -199563 -305650 -305703 71631 348356 71919 -179448 78871 115352
10797 115352 -54108 -170813 -117337 -70030 -172635 -114633 6023 -265563 -74194 286855 -47279
10785 -123596 -106951 -78740 -164744 -115858 -171881 148523 -155447 -75427 16436 -136663 97851
10773 -208648 47763 118666 -118666 122398 27327 -211960 -18430 -366186 -205790 -23292
$$ packed form
10851b02855j19507M1973F1783a15800c451k58724A76337h5371L0488o762m61425
10840e23070F8481J94488b41691A33065L9333a78113E0190g8148B75476p4981
10830B00495C2983b0740G9632i396C1635J08948C8930a89771A57J76045a90458
10818a94444L4284j07603A24954a87700A55445C8326c39347i8960q433j40494
10808b47887A39415O331a99563j06087n3G1631K76725G1919a79448G8871L6481
10797A15352e4108j16705N3476M7307j02605N8002F023b65563g4194B86855d7279
10785a23596J6645K8211q6004M8886n6023A48523a55447g5427A6436a36663I7851
10773b08648D7763P0903a18666A22398B7327b11960a8430l47756J60396b3292
$$ plain form
10762 -163022 324557 -71108 25996 -137205 -293281 -268534 4433 8508 207485 141109 -125539
10750 -113089 144362 220318 -343985 43081 -138519 -258551 -96490 -243643 24937 61968
10740 61968 -330688 144976 61328 -263439 54041 132374 124375 -57455 113414 67152 -75319
10728 -1601 129029 -220185 -292496 202640 100781 -151687 -224292 287830 -196407 214400
10717 51078 -27777 -1357 270661 294250 60921 -177137 -179359 180780 280039 133007 -273771
10705 17853 -129898 2146 204161 -52109 -17632 -22572 -186632 -72200 71731 59654 -64514
10693 -385536 -343475 -359783 -24279 -74970 -239828 -128364 -63062 207994 2153 25797 -116690
10681 -275292 -59782 -28570 -383249 27758 60625 1922 -146659 5794 -142314 232574 -98698
$$ packed form
10762a63022C24557g1108B5996a37205j56076K4747D433M075J98977o6376a25539
10750a13089A44362P5956c43985D3081a38519j20032i6490j47153B4937L7031
10740F1968c30688A44976F1328b63439E4041P8333p999e7455A13414m6262g5319
10728a601A29029b20185p2311B02640A00781a51687p2605B87830a96407B14400
10717E1078b7777a357B70661K3589F0921a77137k222A80780R9259A33007b73771
10705A7853a29898B146K02015e2109a7632m940j64060g2200G1731j2077f4514
10693c85536M2061j6308b4279n0691j64858J11464f3062B07994B153K3644a16690
10681b75292e9782b8570l54679B7758L2867A922a46659E794a42314B32574i8698
$$ plain form
10669 -22944 -459970 205302 92288 -161601 129470 -118316 -131587 55269 -237784 -107848
10658 -32446 36939 -29735 -247728 -87565 238033 -515666 155937 -10057 241189 222802 -29469
10646 79612 -108449 413993 -125643 -281559 -254458 -82938 155443 -80289 109468 -204632
10635 -68497 -119468 -74734 -189971 116483 -322916 -219057 -47503 -326057 -530332 160537
10624 -135915 -115120 -132368 -219821 154033 -202977 22898 87693 -66560 -49549 -179366 -184518
10613 -184518 36590 14338 -111057 -33735 -78061 -224779 -206678 -134196 -78392 202051 -242581
10601 99274 165765 142221 -359323 89472 -56134 -51197 -120678 -208678 45192 -214703 -8517 -79708
10589 -79708 -474634 -65796 -67733 90207 28 -339472 165064 -103231 -326143 -418154 -18833
$$ packed form
10669b2944m37026B05302I2288a61601A29470a18316j3271E5269b37784a07848
10658c2446C6939b9735k17993h7565B38033e15666A55937a0057B41189j8387b9469
10646G9612a08449D13993a25643j55916K7101h2938A55443h0289A09468b04632
10635f8497n0971M4734j15237A16483c22916J03859d7503k78554k04275A60537
10624a35915K0795j7248q7453A54033b02977B2898O4795f6560J7011j29817n152
10613a84518C6590A4338a11057c3735m4326j46718J8101P2482N5804B02051b42581
10601I9274O6491k3544c59323H9472e6134M937o9481q8000D5192b14703h517p1191
10589g9708l94926f5796j937I0207B8c39472A65064a03231k22912r2011a8833
$$ plain form
10577 54778 -11240 -241497 -57389 -293186 103538 -357612 -116530 313199 85986 -94558
10566 -126345 110441 -194501 205738 41949 42142 -150516 -175291 162035 207832 87737 -17260
10554 106254 3646 -81979 -210173 -254370 -63725 -149635 -84376 -90144 354657 146042 -38689
10542 -140238 -115232 169561 -89536 188298 1352 -257655 37430 -161122 -179661 45160 -231089
10530 85642 -97153 -160695 118381 -79792 293393 -236463 -129174 -225966 -307161 127275 -914
10518 35046 -49433 287130 -202196 -30822 -57484 -95523 9402 12548 -25413 -125461 -132911 58394
10505 -137361 -39479 138356 -237299 -110039 -179725 -133370 -140288 -229154 175286 28093 -162985
10493 -105396 -160438 -212085 -194050 314660 -23503 -192163 79474 91700 70415 105581 -239628
$$ packed form
10577E4778a1240k30257e7389k35797A03538c57612a16530C13199H5986i4558
10566a26345A10441a94501B05738D1949J93a50516k4775A62035M5797H7737a7260
10554A06254C646h1979j28194m4197f3725q5910O5259n768C54657A46042c8689
10542a40238K5006A69561h9536A88298A352b57655C7430a61122j8539D5160b31089
10530H5642i7153o3542A18381g9792B93393b36463J07289r6792q1195A27275i14
10518C5046d9433B87130b02196c0822k6662l8039I402L146b5413j00048p450E8394
10505a37361c9479A38356b37299a10039o9686M6355o918q8866A75286B8093a62985
10493a05396n5042n1647J8035C14660b3503j68660G9474J2226k1285L5166b39628
$$ plain form
10481 -251936 4208 72225 -282133 -244535 -165897 284548 568803 527669 527989 -151426 104359
10469 49577 144766 43179 -27950 274028 -132872 -470153 -6226 -152889 130404 -402657 27494
10457 48145 -9749 -123803 239856 -249703 -225147 -110885 -97774 41270 -215343 160246 28112
10445 162359 -255431 -176753 -281786 39647 22481 -44806 -243477 -127743 -85286 -87597 -105482
10434 -105482 1474 31678 -1701 -327305 -414611 43749 102828 -68375 -195749 -97306 19906
10422 69893 41991 -244934 -145882 -36535 -101409 156562 278507 3436 145848 -117601 169745
10410 -89335 62898 -149377 -9215 1043 97715 -94932 -190098 -122893 -158838 -115148 32470 -17821
10397 187727 -109353 -275807 -213140 116441 62067 -72875 172235 180363 343334 141747
$$ packed form
10481b51936D208O8017b82133L7598P8638B84548K84255m1134L20a51426A04359
10469D9577R5189D3179b7950B74028a32872l37281f226j46663A30404d02657B7494
10457D8145i749j14054B39856b49703K4556a10885J3111D1270b15343A60246B8112
10445A62359b55431P8678j05033C9647j7166d4806j98671J15734M2457k311j7885
10434a05482A474L0204a701l25604q7306D3749N9079f8375j27374i7306A9906
10422F9893k7902b44934R9052c6535o4874A56562J21945C436J42412a17601A69745
10410h9335F2898a49377i215A043R6672i4932r5166O7205l5945M3690C2470a7821
10397A87727a09353j66454O2667A16441n4374g2875A72235Q128J62971A41747
$$ plain form
10386 396544 186335 327315 -159372 -93981 202 452934 272209 65659 210712 441325
10376 441325 60308 237837 281441 -7665 492168 236846 234150 321699 170223 226085 223262
10365 223262 297737 443750 185377 472308 649548 268325 320525 416144 410267 68694 44530
10354 44530 -44768 226795 -138236 515418 223648 195936 435178 487973 270440 212300
10344 212300 270621 186588 374725 164846 546924 84433 147162 254477 63124 95342 -12679
10332 31459 184254 -211343 246099 179845 133818 507640 -54740 -13762 -251642 -89657 -86852
10321 -86852 -28 223558 285388 313719 399489 122214 -63426 335273 5402 -185048 368706
10309 -13912 -71795 -145492 -234127 -245438 -209679 153550 42717 44461 -47561 -162811 -100489
$$ packed form
10386C96544A86335J40980a59372O5391B02M52732j80725F5659J45053K30613
10376D41325F0308J77529M3604g665D92168B36846k696Q7549j51476N5862k823
10365B23262P4475J46013A85377K86931J77240B68325N2200R5619n877F8694k4164
10354D4530d4768B26795a38236E15418B23648k7712K39242N2795k17533n8140
10344B12300N8321q4033J88137A64846L82078H4433O2729J07315F3124L2218a2679
10332C1459J52795b11343B46099o6254m6027L73822e4740a3762k37880h9657K805
10321h6852b8B23558O1830K8331Q5770A22214f3426C35273E402a85048C68706
10309a3912n7883p3697q8635j1311L5759A53550D2717J744d7561j15250O2322
$$ plain form
10298 -100489 -239976 55859 55463 -41774 67487 -153371 -137122 -24453 -65848 -101563 477681
10286 -149260 -245242 -131211 41196 225295 246236 -181129 -230114 46806 10882 -50708 -238076
10275 -238076 21005 45468 -21446 -70672 26334 9830 81236 79456 187205 -227863 475560
10263 -315590 115758 38013 -93135 -172496 -224908 -86330 -154431 -120123 253889 12827 19549
10252 19549 -21401 107591 159661 68139 342154 218562 281488 -162708 65192 269767 -152522
10240 -139702 -196705 -40335 -3823 -10833 -168141 -203438 41395 -459964 -501936 -13707 -189193
10229 -189193 -126484 38030 -78367 -42969 -135440 42298 163526 -258939 -149464 -153361 135691
10217 -338082 -482997 -334089 -22381 75513 198851 -149975 -205310 -165848 271897 -423626
$$ packed form
10298a00489j39487E5859l96d1774F7487a53371J6249b4453m1395l5715D77681
10286a49260r5982J14031D1196J84099K0941a81129m8985D6806A0882e0708j87368
10275b38076B1005K4463b1446m9226B6334I830P1406j780J07749b27863D75560
10263c15590A15758C8013i3135p9361n2412h6330o8101L4308B53889A2827O722
10252A9549b1401A07591N2070F8139K74015j23592O2926a62708F5192K04575a52522
10240a39702n7003d0335c823p010j57308l5297D1395d59964m1972a3707j75486
10229a89193O2709C8030g8367L5398r2471D2298J21228b58939J09475l897A35691
10217c38082j44915J48908b2381G5513J23338a49975n5335L9462B71897d23626
$$ plain form
10206 103050 -45574 -96041 -142001 -135455 -24657 22416 82232 143235 -185574 -112968 25358
10194 -192249 113501 164847 392201 158230 11579 -282295 -201463 -4795 -218782 -79159 -106486
10183 -106486 19824 26407 -248212 -21386 -88422 13751 -11413 -158635 225616 53287 -272439
10171 -113022 -72165 -282463 -139116 -148220 -271272 -291051 -233340 -175908 -384670 -56907 -15288
10159 -2739 -213852 -55704 239493 -195768 -63290 -168191 76467 73358 -40189 13938 27106
10148 27106 -238869 65407 -19829 30260 -156691 -198688 -295752 132597 -103024 128896 -254247
10136 -182850 -88322 -101993 -441321 39667 -80743 -200126 198334 26399 58068 -330341 48522
10124 -34787 48616 -75066 35897 -15639 -32662 72687 -457164 -33956 -41790 97984 -89835 160229
$$ packed form
10206A03050d5574n0467m5960O546b4657B2416N9816O1003a85574P2606B5358
10194a92249A13501N1346K27354A58230A1579b82295Q0832d795k13987g9159k7327
10183a06486A9824O583b48212b1386o7036A3751a1413j47222B25616E3287b72439
10171a13022M0857k10298a39116r104j23052j9779N7711N7432k08762e6907a5288
10159b739k11113e5704B39493a95768f3290j04901G6467l109d0189A3938J3168
10148B7106b38869F5407a9829C0260a56691m1997r7064A32597a03024A28896b54247
10136a82850h8322j3671l39328C9667h0743j19383A98334B6399L1669c30341D8522
10124c4787D8616g5066C5897a5639j7023G2687d57164c3956p834I7984h9835A60229
$$ plain form
10111 -129146 -95713 -79998 -310756 2110 -94147 176184 121314 26740 -101430 48550 -81521
10099 -152904 -136931 -41231 -256141 87430 -90876 -270236 -91275 152824 92454 -254740 -18176
10087 68064 -238235 -44494 87270 -35009 33677 115166 -110450 -29423 38376 -272484 -33106
10075 11032 129434 -19475 248086 -161180 119933 -115470 -125605 -99383 -119017 340838
10064 -264835 25035 -80420 -52396 309303 -108372 85256 44095 -212940 -232812 293625 -189297
10052 -252768 62522 -24292 -110938 264660 -76881 -451878 -211390 231782 49869 -187195
10041 115637 112193 -32103 -86156 1345 1333 -103763 -18075 230956 156039 149863 -178988 458028
10028 -84751 80365 -57973 6750 -103683 -335030 -265927 -401582 282229 343334 -209511 -333335
$$ packed form
10111a29146L3433J5715k30758B110i4147A76184n4870B6740a01430D8550h1521
10099a52904J5973d1231k14910H7430i0876j79360i1275A52824o0370b54740a8176
10087F8064b38235d4494H7270c5009C3677Q1489a10450b9423C8376b72484c3106
10075A1032J18402a9475B48086a61180A19933a15470j0135K6222j9634C40838
10064b64835B5035h0420K8024C09303a08372H5256m1161b12940j9872B93625a89297
10052b52768F2522b4292q6646B64660g6881l74997b11390B31782D9869a87195
10041A15637l444c2103n4053A345j2a03763a8075B30956p4917o176a78988D58028
10028h4751H0365e7973F750a03683k31347O9103j35655B82229O1105b09511j23824
$$ plain form
10017 -333335 -127145 -26799 -120795 65148 -181565 -84858 236120 -311735 -152329 -203167
10007 -203167 -415170 176893 -173051 42435 -221145 -131533 -188858 -89163 73191 -48994 236280
9995 -29964 46019 -56291 192420 -22606 253316 148847 143619 -239793 51166 71290 -523804
9983 -271554 -115229 -20076 121874 117370 265399 -171846 129124 -230694 -52223 164982
9972 -135921 -338097 -156267 -602915 -1088 -236454 135282 -294760 -186678 -375538 -3253
9961 -54307 -27205 136384 -145646 -72540 -186333 -297748 154484 -18910 -120885 -105677 113625
9949 394987 -36782 44773 -231823 -14170 -35999 -200804 -192244 5688 -144463 -75222 91057
9937 -16174 -408340 -95530 -300921 75642 67810 -1725 -55512 -69725 63686 -34272 -279318 12144
$$ packed form
10017c33335a27145b6799r3996F5148a81565h4858B36120c11735a52329n0838
10007b03167k12003A76893a73051D2435b21145Q9612n7325h9163G3191d8994B36280
9995b9964D6019e6291A92420b2606B53316j04469n228b39793E1166K0124e23804
9983b71554a15229b0076A21874m504J48029a71846A29124b30694e2223A64982
9972a35921k02176a56267m46648a088k35366A35282b94760J08082j88860c253
9961e4307K7102A36384a45646g2540j13793j11415A54484a8910j01975J5208A13625
9949C94987c6782D4773b31823a4170k1829j64805Q560E688a44463O9241I1057
9937a6174l92166i5530k05391G5642p832a725n3787j4213F3686c4272k45046A2144
$$ plain form
9924 168376 -80214 -131457 -18891 -112918 -64049 -60178 117663 -353486 122175 -251661 47624
9912 -356539 -371921 -163382 47972 -19836 -259973 -97132 -125331 -12620 1278 -94794 -250775
9901 -250775 -241040 -309247 -144598 24304 98004 140400 -93141 -174211 -54392 -57027 -204129 65668
9888 -359777 102359 -290830 89367 -17649 -52914 56510 -110093 52927 122004 79410 -221950
9876 -32152 -210435 7701 102370 249592 -43262 -194762 -447956 -17564 169274 -271912 -150386
9865 -150386 -46077 -170164 104364 113299 -45294 185271 -178756 -201956 126781 264675 153453
9854 153453 -79128 80941 -162131 -165277 -90837 -56376 -140706 -203144 -310034 -207226 -66300
9842 -23771 -35049 159558 -156978 -151736 326634 189734 -137557 -240797 -63311 -148186 -222375
$$ packed form
9924A68376h0214n1243a8891r4027M8869L871A17663c53486A22175b51661D7624
9912c56539j5382a63382D7972a9836k40137i7132k8199a2620A278i4794j55981
9901b50775R735o8207a44598B4304P3700M2396i3141q1070e4392k635j47102F5668
9888c59777A02359b90830H9367a7649l5265E6510a10093E2927O9077m2594b21950
9876c2152j78283G701R4669J47222d3262j51500k53194a7564A69274b71912J21526
9865a50386d6077j24087A04364Q935d5294A85271a78756k3200A26781J37894j11222
9854A53453g9128H0941a62131l146P4440L4461q4330o2438j06890J02808f6300
9842b3771j1278A59558a56978N242C26634j36900a37557j03240f3311q4875p4189
$$ plain form
9831 -222375 -77889 32273 -125946 129262 -823 14912 54643 -172474 -92055 -211471 -11039
9819 324193 -971 -86290 82347 -278523 -170499 32796 -333160 -221033 -154359 130210 -208003
9807 131669 -8412 -215556 -139671 44332 152086 -46538 -41087 202293 108182 -194202 136899
9795 228351 33560 -103425 97298 -40380 186224 -277844 -113615 -172559 -134834 -280643 600159
9783 299613 -61416 -54580 -20781 190005 -13227 88640 -157684 114148 -203311 32995 42980
9772 42980 -457655 118381 114702 102387 -8199 15400 -189345 -228760 39466 -161992 -224895
9761 -224895 -156668 42198 -239634 -89246 -156168 -157784 76603 -52799 -75959 -244010 -103278
9749 149904 -52622 -304655 -271908 -245869 115661 48402 -168128 64588 -161483 -243026 -55286
$$ packed form
9831b22375g7889C2273a25946A29262h23A4912L9731a72474Q0419j19416a1039
9819C24193i71q5319H2347b78523J08024C2796c33160J12127O6674A30210b08003
9807A31669h412k07144P5885D4332J07754d6538N451B02293r4111a94202A36899
9795B28351C3560a03425I7298d0380A86224b77844a13615n8944L7725j45809F00159
9783B99613f1416O836b0781A90005a3227H8640a57684A14148b03311C2995R985
9772D2980d57655A18381l679j2315h199A5400a89345l9415C9466a61992o2903
9761b24895O8227D2198b39634h9246o6922j616G6603e2799k3160j68051a03278
9749A49904e2622k52033L2747K6039A15661D8402a68128F4588a61483q1543e5286
$$ plain form
9737 -271034 34835 -43147 -293385 -140669 94250 -215844 90962 -175900 -76873 -77819 -148770
9726 -148770 -148566 -365174 -127460 -181554 -231751 -173871 -203508 -188224 195537 88444 39198
9714 23237 14282 99456 72498 37782 246996 57858 -34068 -125584 -154205 189476 28175 18863
9702 18863 -41841 -36997 41846 -225589 -66200 -27608 -165364 6732 -25425 -361403 -254685
9691 -254685 -317503 -16367 7293 23011 -101059 -364878 -117470 -224038 -3109 42596 234460
9680 234460 -230282 11879 55145 344748 -89655 84828 20942 -21008 -108713 -154049 -320082
9669 -320082 -73423 -160023 333377 -80846 11469 -118941 194832 -13859 -105431 172363 99380
9658 99380 93297 384616 159554 -57576 -35906 -69177 -180868 -335938 -53431 78269 60846
$$ packed form
9737b71034C4835d3147k50238a40669I4250b15844I0962a75900g6873r46p0951
9726a48770K04k16608a27460n4094n0197N7880k9637J5284A95537H8444C9198
9714B3237q955Q5174k6958l4716K09214E7858c4068r1516k8621A89476B8175r312
9702A8863d1841M844D1846b25589f6200b7608j37756F732b5425l35978J06718
9691b54685o2818a6367G293J5718a01059k63819a17470j06568c109D2596J91864
9680B34460b30282A1879M3266K89603h9655H4828B0942b1008q7705m5336j66033
9669c20082g3423q6600C33377h0846A1469a18941A94832a3859r1572A72363p2983
9658I9380o083K91319A59554e7576K1670l3271j11691j55070e3431G8269j7423
$$ plain form
9647 60846 -124691 -410839 -334146 -195404 -107443 70459 258968 -216869 -148005 -187593 -93046
9635 -123218 140478 -324601 78593 166806 -184962 -65178 -44056 -242379 -120253 -39470 171778
9623 146096 -237928 -192380 -65425 -151221 25245 307559 260178 -45671 -136182 26772 -96496
9611 -79052 66568 33470 -168406 63913 -38897 68078 -207455 47230 40309 -201613 51238
9599 -436288 136103 -53780 1839 172040 -200905 -82615 -86564 39644 30450 -162069 -47911
9587 -151674 117000 -36134 -150912 -161888 -128280 -27409 54710 146176 120806 -171655 56670
9575 -209153 -149939 -325221 -22733 -155028 -96186 -117705 -546388 -169165 -209725 -214596 212922
9563 32470 -203634 -36607 -26418 156574 264234 -61477 -149968 -201708 36071 90711 -161749
$$ packed form
9647F0846a24691k86148P6693J38742Q7961G0459J88509b16869O8864l9588i3046
9635a23218A40478c24601G8593Q8213a84962f5178K1122j98323a20253c9470A71778
9623A46096b37928M5548f5425q5796B5245K82314m7381d5671r0511B6772i6496
9611g9052F6568l3098a68406F3913c8897F8078b07455D7230o921b01613E1238
9599d36288A36103e3780A839J70201b00905h2615l949C9644r194a62069d7911
9587a51674A17000c6134j14778j0976L3608b7409E4710R1466k5370a71655E6670
9575b09153N9214j75282b2733j32295N8842k1519m28683a69165m0560m871B12922
9563C2470b03634c6607J0189A56574J07660f1477q8491n1740C6071N4640a61749
$$ plain form
9551 -44506 -113068 55351 -153127 141842 -256453 -82987 353963 -36731 -164094 33992 -227862
9539 -164902 -115995 139595 52937 173869 -26023 224135 -226596 234856 157610 60405 225060
9528 225060 -34422 -17636 -88122 -196835 -70903 -49725 16556 187462 -13803 -316953 -342710
9517 -342710 74645 4355 321101 635 32144 -320814 -47241 172260 -82246 -35164 -449861
9506 -449861 14840 -197704 80459 133711 -297199 -326666 195456 7438 -262202 49405 21742
9494 -167898 -164902 -150648 191881 227813 158933 -40386 381070 -151890 -56137 -326482 -123383
9482 -15462 -104597 -52897 300573 -64875 -108590 137547 215477 -66324 78764 -228635 -571981
9471 -571981 -82636 -180695 -96534 -38477 112887 -131401 -114062 -38985 -387281 34173 -272280
$$ packed form
9551d4506o8562E5351a53127A41842b56453h2987C53963c6731j27363C3992b27862
9539a64902M8907A39595E2937J20932b6023B24135b26596B34856p7246F0405J64655
9528B25060c4422J6786p0486j08713g0903K1178A6556J70906a3803l03150k5757
9517c42710G4645D355L16746F35L1509c20814d7241A72260h2246c5164m14697
9506d49861A4840a97704H0459N3252b97199k9467A95456G438b62202D9405B1742
9494a67898K996J4254A91881L5932o8880d0386C81070a51890e6137k70345a23383
9482a5462q9135N1700C00573f4875m3715A37547P7930f6324G8764b28635l43346
9471e71981h2636r8059Q4161c8477A12887a31401J7339c8985l48296C4173b72280
$$ plain form
9459 -343105 -401194 -79993 -338046 160995 153308 33392 -88871 -171734 -210199 -267066 154066
9447 -148218 145892 -45492 -125294 -13823 64130 29463 -16902 45179 -123449 55850 -210576
9435 -222898 -82238 28429 203775 3128 -154768 -69165 -109688 -2168 101865 82205 190483
9424 190483 161530 -101992 -26133 -60556 -136544 -272634 -282877 202080 -66725 -98643 -29764
9412 66971 -133682 1906 54115 -37462 5361 -68678 -138455 46499 12833 -485765 136431 200713
9400 200713 -41712 147361 -17191 164492 -57640 29747 -186754 -81205 -42460 133178 -178916
9388 -307327 -145200 -9366 -151824 -98786 -42439 -413037 5906 76489 -316812 -251714 -58962
9376 -416755 39805 -132405 -389106 399407 -201624 45493 -335521 -138004 117888 -165114
$$ packed form
9459c43105n8089g9993k58053A60995p687C3392h8871q2863l8465n6867A54066
9447a48218A45892d5492p9802a3823F4130B9463a6902D5179a23449E5850b10576
9435b22898h2238B8429J75346C128a54768f9165m0523b168A01865j9660J08278
9424A90483k8953a01992b6133l4423p5988j36090j0243B02080f6725l1918b9764
9412F6971a33682A906N2209c7462E361f8678o9777D6499A2833d85765A36431O4282
9400B00713d1712A47361a7191A64492e7640B9747a86754h1205L8745A33178a78916
9388c07327a45200i366j42458N3038d2439l70598E906P0583c16812O5098e8962
9376d16755C9805a32405k56701C99407b01624D5493c35521a38004A17888a65114
$$ plain form
9365 -154742 -77623 -116743 10064 103577 -75412 83032 -108051 201645 -103530 192153 -136882
9353 -140617 -230950 -46035 -87388 -231511 82087 -20016 133709 25770 -11704 288046 -224066
9341 -198200 -387496 -140216 342258 173123 150194 44615 -62047 -137089 -393733 -56579 -323762
9330 -323762 -80366 -127372 -365017 -275404 -31418 218539 17654 146748 -360656 -142075 57889
9318 -119936 -191529 -200623 -58753 43688 39519 83641 55858 -138381 -240958 53405 -23430 33245
9305 -164921 -220635 259011 41603 163800 -110769 -165323 82401 -223807 -159791 164018 -78619
9293 -131926 17971 15698 29490 -207803 -265944 -369515 13770 -100171 -276677 -9771 102057
9281 -61037 -89783 -341818 13578 -198197 -227856 -132982 1154 -193140 61987 -221604 101855
$$ packed form
9365a54742P7119l9120A0064R3513g5412H3032a08051B01645a03530A92153a36882
9353a40617r0333d6035m1353j44123H2087b0016A33709B5770a1704B88046b24066
9341a98200j89296a40216C42258j69135k2929D4615f2047p5042k56644e6579k67183
9330c23762h0366m7006k37645Q9613c1418B18539A7654J29094c60656a42075E7889
9318a19936p1593r094e8753D3688m169M4122k7783a38381j02577E3405b3430C3245
9305a64921n5714B59011D1603J22197a10769n4554H2401b23807O4016A64018g8619
9293a31926A7971k273J3792b07803n8141j03571A3770a00171j76506i771A02057
9281f1037k8746k52035A3578a98197k9659R4874A154a93140F1987b21604A01855
$$ plain form
9269 -72280 353380 168324 -161980 -457998 162689 266924 -255973 49226 295727 290822
9259 290822 -259288 38232 -124621 -113704 -338280 -177178 45517 -86095 -199293 -392930
9249 -392930 158129 -83977 -96404 32740 16519 105265 -143113 127309 -249289 163218 21451
9237 16033 81420 -89274 -141791 165763 -88577 -91153 205187 -228425 -6281 -98584 -417842
9226 -417842 -253639 -16076 -190599 -49486 411608 37060 237334 10667 19487 -87803 -101083
9215 -101083 -99368 142846 230076 -336420 -415226 108694 81656 -72635 103894 114717 -107393
9203 -407306 811 184550 12303 84608 66699 156321 -110857 219930 -236459 -270313 222381
9191 13703 -74791 71206 -90437 -83440 18600 -4695 247173 68727 -62798 189270 222418 178267
$$ packed form
9269g2280C53380A68324a61980k96018A62689J04235b55973D9226K46501m905
9259B90822b59288C8232a24621J0917k24576J61102D5517h6095j13198j93637
9249c92930A58129h3977j2427C2740j6221Q8746a43113A27309b49289A63218B1451
9237A6033O5387h9274n2517A65763h8577k576B05187b28425f281r2303l19258
9226d17842J64203a6076j74523d9486D11608C7060K00274A0667Q820h7803j3280
9215a01083J715A42846Q7230c36420p8806A08694k7038g2635A03894J0823a07393
9203d07306H11J83739A2303P2305j7909Q9622a10857B19930b36459l3854B22381
9191A3703g4791G1206i0437O997A8600d695B47173F8727f2798A89270L3148m4151
$$ plain form
9179 178267 67515 147559 4536 -25147 131693 167384 -45482 -291515 50646 -194277 -210105
9168 -210105 -108534 138284 -182806 -196134 -259036 63151 38188 -267007 62517 -203324 -18567
9156 -93774 -56389 -85072 -352567 49741 -19919 -191419 -230434 155198 -233664 2952 -303656
9144 112470 -344534 -31199 -189912 120934 -173827 -56146 -35867 -136217 -246362 -35891
9133 -283261 274597 -354228 -96207 76491 -324708 -147443 -156631 -272489 123983 40451 -76232
9121 5614 -196102 186928 -165284 178389 -71678 -135825 34173 -376231 -186027 -150358 -37010
9109 -323762 -49220 -146346 -214867 -198538 7804 -82389 181430 48620 -91058 273368 212204
9098 212204 -2932 76102 -87831 -69334 -326150 -106959 -82177 -251958 -6941 -125423 -118826
$$ packed form
9179A78267F7515Q0044D536b5147A31693L5691d5482k46033E0646a94277j5828
9168b10105J01571A38284a82806j3328o2902F3151k4963b67007F2517b03324a8567
9156i3774L7385k8683k67495D9741a9919j71500l9015A55198b33664B952c03656
9144A12470c44534c1199j58713A20934a73827e6146K0279j00350j10145c5891
9133b83261B74597c54228i6207G6491c24708a47443r188j15858A23983D0451g6232
9121E614a96102A86928a65284A78389g1678o4147C4173c76231a86027L5669c7010
9109c23762d9220r7126o8521J6329G804h2389A81430D8620i1058B73368o1164
9098B12204b932G6102h7831J8497k56816a06959K4782j69781f941j18482O597
$$ plain form
9087 -118826 -176457 43202 -237577 -499019 8347 320990 -98030 74508 -29687 140549 81222
9076 81222 -128866 -244470 115521 -238815 148603 104892 197838 333513 -164125 95528
9065 -7821 141477 -62914 183988 29526 -54363 117940 331131 -161710 -283123 -110181 -268099
9054 -268099 24963 -155258 138324 -118217 46706 -297848 -446701 -156988 -24499 223394
9043 -70425 -226779 305986 30274 -109648 344565 -76837 84034 441131 -298520 -10673 -261015
9032 -261015 214353 -118936 -4921 -90268 -343334 -28362 -287092 64591 263766 -146019 -411205
9021 -411205 103447 -37622 66524 -37956 -122332 -104032 320769 -125124 -179356 346337 118308
9009 -188588 -12136 -73945 -52490 -161132 -131953 -343890 -28129 164724 -16454 236122 -116088
$$ packed form
9087a18826n7631D3202b37577k61442H347L12643i8030G4508b9687A40549n9327
9076H1222a28866j15604A15521b38815A48603m3711R2946J35675a64125I5528
9065g821A41477f2914A83988B9526e4363A17940K13191a61710j21413a10181j57918
9054b68099B4963a55258A38324a18217D6706b97848j48853a56988b4499B23394
9043g0425j56354C05986C0274a09648C44565g6837H4034L57097b98520a0673k50342
9032b61015B14353a18936d921q5347k53066b8362k58730F4591J99175a46019k65186
9021d11205A03447c7622F6524c7956q4376J8300C20769a25124n4232C46337A18308
9009a88588a2136o1809K1455j08642K9179k11937b8129A64724a6454B36122a16088
$$ plain form
8997 280915 172226 -9355 -233191 -82035 -159638 -256244 55334 73432 -209743 -139285 -75947
8986 -75947 -93171 162528 -113042 -253341 -18624 -145500 -296661 30732 -209900 192593
8975 165933 -77927 66461 -293940 117178 -67023 -160645 -230102 -56126 88953 110075 -441017
8963 -55037 -559179 -289626 -51744 121723 155400 -333852 8431 8954 -300735 125798 26158
8951 116330 145563 5165 -274457 265619 -36440 -262795 -131347 -104416 -61839 264988 145631
8940 145631 273957 -56462 -158746 42247 -214728 -102007 -101563 -118136 379544 -90001 -9211
8928 -8377 208316 25707 78500 177547 46110 329536 518051 1508773 4213360 9732267
8918 9732267 6492930 1239395 404979 76195 148467 2722 130475 -116424 9042 78328
$$ packed form
8997B80915j08689i355k23836h2035p7603r6606E5334J8098b09743P0458O3338
8986g5947j7224A62528a13042j40299a8624j26876j51161C0732b09900A92593
8975A65933g7927F6461b93940A17178f7023r3622o9457e6126H8953K1122d41017
8963e5037n04142K69553e1744A21723L3677c33852H431N23c00735A25798B6158
8951A16330K9233E165b74457B65619c6440k26355a31347K6931M2577B64988j19357
8940A45631J28326e6462j02284D2247b14728a02007M44j6573C79544i0001i211
8928h377B08316B5707N2793R9047D6110K83426J88515R90722K704587N518907
8918I732267l239337A239395D04979G6195P2272B722J27753a16424I042O9286
$$ plain form
8908 78328 -179292 327840 98215 245645 -208606 223607 -154248 186270 122524 213958
8898 213958 86900 133598 10644 -36728 -77654 174700 149728 -274645 61745 -198895 313611
8886 -142287 -315664 -101819 -333520 61325 -121178 83985 -223824 -162167 -200154 -3610 -111331
8875 -111331 -307222 58412 26330 179160 179576 111567 -153099 -199989 -7073 -114605 65509
8863 -175522 187349 -281904 52800 -106355 -35589 5620 209125 -90976 102574 -421700 -54883
$$ packed form
8908G8328a79292C27840I8215J47430b08606B23607a54248A86270o3746R1434
8898B13958H6900M6698A0644c6728m0926A74700k4972b74645F1745a98895C13611
8886a42287j73377a01819k31701F1325a21178H3985b23824O1657l7987c610j07721
8875a11331j95891E8412B6330J52830M16o8009a53099m6890g073j07532F5509
8863a75522A87349b81904E2800a06355c5589E620K03505i0976A02574d21700e4883
$$ [...]
##END NTUPLES=NMR SPECTRUM
##END=
