
##TITLE=AC1212_MSMAH12043_5946067_dS4KgYYhX7
##JCAMPDX= 6.0         $$ Bruker NMR JCAMP-DX V2.0
##DATA TYPE= NMR SPECTRUM
##DATA CLASS= NTUPLES
##ORIGIN= BRUKER
##OWNER= Administrator
$$ 1.72 TOPSPIN		Version 2.1
$$ 2012-04-10 20:30:24.031 -0500  Administrator@TOPSPIN
$$ Compression mode = diff/dup
##.OBSERVE FREQUENCY= 400.13188235
##.OBSERVE NUCLEUS= ^1H
##.ACQUISITION MODE= SIMULTANEOUS (DQD)
##.ACQUISITION SCHEME= undefined
##.AVERAGES= 8
##.DIGITISER RES= 22
##SPECTROMETER/DATA SYSTEM= spect
##.PULSE SEQUENCE= zg30
##.SOLVENT NAME= COFFEE_meoh
##.SHIFT REFERENCE= INTERNAL, COFFEE_meoh, 1, 14.98061
##AUDIT TRAIL= $$ (NUMBER, WHEN, WHO, WHERE, PROCESS, VERSION, WHAT)
$$ ##TITLE= Audit trail, TOPSPIN		Version 2.1
$$ ##JCAMPDX= 5.01
$$ ##ORIGIN= Bruker BioSpin GmbH
$$ ##OWNER= Administrator
$$ $$ C:\Bruker\TOPSPIN/data/COFFEE/nmr/AC1212_MSMAH12043_5946067_dS4KgYYhX7/10/pdata/1/auditp.txt
$$ ##AUDIT TRAIL=  $$ (NUMBER, WHEN, WHO, WHERE, PROCESS, VERSION, WHAT)
(   1,<2012-04-10 20:30:16.265 -0500>,<Administrator>,<TOPSPIN>,<go>,<TOPSPIN 2.1>,
      <created by zg
	started at 2012-04-10 20:29:09.343 -0500,
	POWCHK enabled, PULCHK disabled,
       configuration hash MD5:
       1A 1E CE 29 27 FD 77 03 67 4E F0 E3 C4 B2 CB 90
       data hash MD5: 64K
       C5 27 2A 71 2E 46 D2 12 2D ED 56 D8 9D 2F B3 7A>)
(   2,<2012-04-10 20:30:19.375 -0500>,<Administrator>,<TOPSPIN>,<proc1d>,<TOPSPIN 2.1>,
      <Start of raw data processing
       efp LB = 0 FT_mod = 6 PKNL = 1 PHC0 = 0 PHC1 = 0 SI = 32K 
       data hash MD5: 32K
       4F 33 CF 37 EA 53 3C 8F E4 5E CC DD A4 65 9B 67>)
(   3,<2012-04-10 20:30:19.687 -0500>,<Administrator>,<TOPSPIN>,<proc1d>,<TOPSPIN 2.1>,
      <pk PHC0 = 210.3662 PHC1 = 0 
       data hash MD5: 32K
       87 C2 C3 EF 27 A4 96 6F 01 1F DF BD 95 4E 0A 57>)
(   4,<2012-04-10 20:30:19.843 -0500>,<Administrator>,<TOPSPIN>,<proc1d>,<TOPSPIN 2.1>,
      <abs ABSG = 1 
       data hash MD5: 32K
       21 41 6F 3E 7A C1 D5 C1 FF F1 A5 2D FB AF 59 16>)
(   5,<2012-04-10 20:30:19.968 -0500>,<Administrator>,<TOPSPIN>,<proc1d>,<TOPSPIN 2.1>,
      <abs ABSG = 2 
       data hash MD5: 32K
       D1 0F CC 32 03 14 07 B6 8A 03 91 97 C9 BC 45 DA>)
(   6,<2012-04-10 20:30:20.015 -0500>,<Administrator>,<TOPSPIN>,<proc1d>,<TOPSPIN 2.1>,
      <abs ABSG = 3 
       data hash MD5: 32K
       0B C5 96 3B 9A 30 54 7B DD 11 E8 CF A2 2E 62 95>)
(   7,<2012-04-10 20:30:20.062 -0500>,<Administrator>,<TOPSPIN>,<proc1d>,<TOPSPIN 2.1>,
      <abs ABSG = 4 
       data hash MD5: 32K
       84 18 09 00 63 E4 30 D7 B5 AF 59 7E 3C B6 B4 56>)
(   8,<2012-04-10 20:30:20.078 -0500>,<Administrator>,<TOPSPIN>,<proc1d>,<TOPSPIN 2.1>,
      <abs ABSG = 5 
       data hash MD5: 32K
       62 22 43 A5 87 8E 7F C9 79 DA 10 A7 BD 11 20 96>)
$$ ##END=
$$ 
$$ $$ hash MD5
$$ $$ 36 D2 3E 4A 72 7B 70 CC D0 5F 5C F2 53 2E 09 AA
##$RELAX= 
##$RELAX= 
##$RELAX= 
##$RELAX= 
##$RELAX= 
##$RELAX= 
##$RELAX= 
$$ Bruker specific parameters
$$ --------------------------
$$ [...]
##$TP= (0..7)
150 150 150 150 150 150 150 150
##$TP07= 0
##$TPNAME0= <>
##$TPNAME1= <>
##$TPNAME2= <>
##$TPNAME3= <>
##$TPNAME4= <>
##$TPNAME5= <>
##$TPNAME6= <>
##$TPNAME7= <>
##$TPOAL= (0..7)
0.5 0.5 0.5 0.5 0.5 0.5 0.5 0.5
##$TPOFFS= (0..7)
0 0 0 0 0 0 0 0
##$TUNHIN= 0
##$TUNHOUT= 0
##$TUNXOUT= 0
##$USERA1= <user>
##$USERA2= <user>
##$USERA3= <user>
##$USERA4= <user>
##$USERA5= <user>
##$V9= 5
##$VALIST= <valist>
##$VCLIST= <CCCCCCCCCCCCCCC>
##$VD= 0
##$VDLIST= <DDDDDDDDDDDDDDD>
##$VPLIST= <PPPPPPPPPPPPPPP>
##$VTLIST= <TTTTTTTTTTTTTTT>
##$WBST= 1024
##$WBSW= 4
##$XGAIN= (0..3)
0 0 0 0
##$XL= 0
##$YL= 0
##$YMAX_a= 521605
##$YMIN_a= -646206
##$ZGOPTNS= <>
##$ZL1= 120
##$ZL2= 120
##$ZL3= 120
##$ZL4= 120
##$ABSF1= 14.98061
##$ABSF2= -5.57192
##$ABSG= 5
##$ABSL= 3
##$ALPHA= 0
##$AQORDER= 0
##$ASSFAC= 0
##$ASSFACI= 0
##$ASSFACX= 0
##$ASSWID= 0
##$AUNMP= <proc_prof1d_extract_pilot.lims>
##$AXLEFT= 0
##$AXNAME= <>
##$AXNUC= <1H>
##$AXRIGHT= 0
##$AXTYPE= 0
##$AXUNIT= <>
##$AZFE= 0.1
##$AZFW= 0.1
##$BCFW= 0
##$BC_mod= 0
##$BYTORDP= 0
##$COROFFS= 0
##$CY= 15
##$DATMOD= 1
##$DC= 0
##$DFILT= <>
##$DTYPP= 0
##$F1P= 0
##$F2P= 0
##$FCOR= 0.5
##$FTSIZE= 32768
##$FT_mod= 6
##$GAMMA= 0
##$GB= 0
##$INTBC= 1
##$INTSCL= 1
##$ISEN= 128
##$LB= 0
##$LEV0= 0
##$LPBIN= 0
##$MAXI= 10000
##$MC2= 0
##$MEAN= 0
##$ME_mod= 0
##$MI= 0
##$NCOEF= 0
##$NC_proc= -8
##$NLEV= 6
##$NOISF1= 0
##$NOISF2= 0
##$NSP= 0
##$NTH_PI= 0
##$NZP= 0
##$OFFSET= 14.98061
##$PC= 1
##$PHC0= 210.3662
##$PHC1= 0
##$PH_mod= 1
##$PKNL= yes
##$PPARMOD= 0
##$PPDIAG= 0
##$PPIPTYP= 0
##$PPMPNUM= 2147483647
##$PPRESOL= 1
##$PSCAL= 4
##$PSIGN= 0
##$PYNMP= <proc.py>
##$REVERSE= no
##$SF= 400.13
##$SI= 32768
##$SIGF1= 0
##$SIGF2= 0
##$SINO= 400
##$SIOLD= 32768
##$SPECTYP= <>
##$SREGLST= <1H.CDCl3>
##$SSB= 0
##$STSI= 32768
##$STSR= 0
##$SW_p= 8223.68421052632
##$SYMM= 0
##$S_DEV= 0
##$TDeff= 65536
##$TDoff= 0
##$TI= <>
##$TILT= no
##$TM1= 0
##$TM2= 0
##$TOPLEV= 0
##$USERP1= <user>
##$USERP2= <user>
##$USERP3= <user>
##$USERP4= <user>
##$USERP5= <user>
##$WDW= 1
##$XDIM= 32768
##$YMAX_p= 462028872
##$YMIN_p= -623982
##$CURPLOT= <Network HP LaserJet P1505>
##$CURPRIN= <$Network HP LaserJet P1505>
##$DFORMAT= <normdp>
##$LAYOUT= <+/1D_H.xwp>
##$LFORMAT= <normlp>
##$PFORMAT= <normpl>
##$SURQMSG= 1
$$ End of Bruker specific parameters
$$ ---------------------------------
##NTUPLES= NMR SPECTRUM
##VAR_NAME=  FREQUENCY,     SPECTRUM/REAL,   SPECTRUM/IMAG
##SYMBOL=    X,             R,               I
##VAR_TYPE=  INDEPENDENT,   DEPENDENT,       DEPENDENT
##VAR_FORM=  AFFN,          ASDF,            ASDF
##VAR_DIM=   32768,         32768,           32768
##UNITS=     HZ,            ARBITRARY UNITS, ARBITRARY UNITS
##FACTOR=    0.250966925370066, 1,           1
##FIRST=     8223.43324360095, -231698,      111997
##LAST=      0,             -49525,          -24428
##MIN=       0,             -623982,         0
##MAX=       8223.43324360095, 462028872,    0
$$ Real data points
##PAGE= N=1
##DATA TABLE= (X++(R..R)), XYDATA
$$ [...]
23744 -81793 -268009 245011 -188600 -139502 -297220 -30370 -298569 113402 -204318 -100746
23733 28171 -89967 -52843 -236987 26339 97194 -294412 -256499 4665 -263732 -104689 -193572
23722 -193572 -254014 230213 -112466 -19274 -198343 -94061 -59004 104175 228694 179675
23712 179675 -295313 5701 26054 156485 173251 -105429 -158801 201656 34776 -15450 -52648
23701 -52648 -67457 -84609 9584 -5557 -31548 -56539 -28369 -2852 118875 78801 -338724 2951
23688 182811 53081 204248 -1645 59218 -25159 94413 -18453 -33911 19068 21193 172682
23677 172682 3787 22931 -79996 326424 -73539 20971 -411300 -14670 -106158 -105805 -106447 -36766
23664 -44969 -26648 86862 -112469 -192355 -37070 76021 -21670 -57492 -426058 156065 33310
23652 -52631 141460 -105622 78256 126052 154930 216418 -17684 130452 -83927 -24130 -104446
23641 -104446 79844 208787 10793 -90095 -71074 67463 60463 101969 -216956 -5184 33126
23629 -97732 15187 -78753 -394359 -75048 33646 -224121 291570 213452 -5790 391955 -18481
23617 53686 176066 54810 -124295 -97419 133986 -521029 16033 -88474 -1126 18296 213340
23606 213340 99826 202171 -95307 553905 92437 231852 -362537 55142 136122 -86886 -171748
23595 -171748 13720 3934 -129066 -119823 -69164 -200204 203952 276933 193427 -80358 -221008
23584 -221008 -15803 139265 -83450 317431 157047 190967 -19469 184967 173040 -144843
23573 1005 155555 124998 -233683 -230636 305873 111895 40386 -45842 110385 -129793 67934
23561 276501 38218 -158535 -50673 -53719 136417 -125611 -209034 -107161 -79731 -11498 146176
23549 -44085 -138135 -54675 98082 163800 -146414 -215519 128313 -2761 -20186 196246 254140
23538 254140 33766 -157899 -185768 92845 -275628 42634 -39659 -535654 -101849 -60623 189211
23526 34825 -18582 11247 165639 172320 -195414 -19278 -126195 70044 47773 104660 275929
23515 275929 -39714 -312436 -77523 -244273 213428 42438 85086 126550 -42967 133795 164950
23504 164950 -76440 54553 -33020 -26505 11121 -287196 92184 305603 130055 19897 49000
23493 49000 -113313 169427 -209993 -180005 -253986 -80207 143543 175825 263107 20033 26819
23482 26819 -214641 -52809 15866 52573 -40774 -227781 21243 319898 -235099 -94435 -141761
23471 -141761 296615 -109939 -97758 -515817 -139687 125059 -19736 -154811 89594 -207353
23460 21624 -70730 190977 283814 -64120 -12699 -60642 38175 -23774 100151 -139100 -85311
23449 -85311 7976 -486671 -10295 138848 189826 407734 -241679 -211067 -93680 104542 -110675
23437 19872 -115424 -179428 -227352 -40252 14453 -75004 -1382 -191884 -138823 122683 -142913
23425 -190053 194783 -232712 33778 -8987 298424 -78276 173938 8193 -64010 -251153 -86287
23413 -82612 63054 -172256 -324272 364536 -322406 62300 -50374 354314 184323 -125148
23402 110559 -21085 94871 -45409 15569 80545 -75496 62988 26963 141521 53102 -312300
23390 -62880 107397 -6871 -69605 -58979 121364 -73906 -152348 92020 -355114 183270 119348
23379 119348 -60476 -152684 -219044 -81252 -280564 82548 -20034 138277 -179741 -26724 206655
23367 -242033 173060 -186609 -43866 -215573 8819 196904 48796 152173 95193 -63256 107969
23355 -450966 103681 95732 -319116 -231364 92823 54322 39643 52623 53493 -40883 -52859 -22234
23342 125382 -242894 -178963 217349 282595 1991 190357 -86189 -151739 -274311 110389 -150007
23330 -262218 -145341 365764 -47643 -163263 54012 81492 -380910 94079 -31509 9797 -276628
23318 -83837 -55847 -50952 -72374 48153 1617 537928 146098 -32283 -97347 -45090 -198768
23307 -198768 -117147 -213236 -29204 155250 89182 -71976 -106126 -138769 6444 -146685 -131200
23296 -131200 -431907 -220048 164471 224938 -66479 187357 237668 -42443 -9369 -164452 346349
23284 -301059 -178589 29025 -46807 -185639 51 133690 -330797 -4091 69988 106566 -54677
23272 -356507 36430 -251079 242858 -281243 271312 21864 -226209 -156857 -166595 -186309 384494
23260 102535 -224213 -357995 158207 288930 -72299 -41746 122947 -46719 -131107 -50287
23249 85196 283490 -90683 -183367 -10839 -130914 -146236 -75904 -120875 -166101 21835 -123529
23237 10540 91487 -139855 -347667 43032 68559 101181 57729 130311 -24806 186729 82644
23225 -9770 73186 10706 -223497 -65849 -67042 -1185 -41110 -123176 -115958 211807 179092 -208854
23212 -42229 -366390 4345 188982 69137 256252 -28882 -54463 58541 -102288 52880 17765
23200 67757 -58993 21712 40162 -66715 76017 -180148 -185845 58664 68235 91696 -68536 -174643
23188 -174643 191755 -206524 32621 -373923 -80044 -226611 -143441 -152965 271148 35993 63066
23177 63066 67455 -49466 -194127 -136533 -199001 86928 -31419 58407 -87851 -258202 -43447
23165 -42394 -181901 4620 158553 172472 192840 112551 1071 244599 -71897 -93229 -11609
23153 304309 182000 242368 -363746 243403 -376939 90847 84340 -412681 -89890 20974 200781
23142 200781 101820 -126840 -122905 -6802 80809 32862 -230207 -329586 -196609 279892 197995
23131 197995 37626 -314475 -276757 96811 65178 2311 106916 307173 5334 153116 -123623
23119 -312208 -131788 -231359 16482 -71478 297464 72504 -40180 -65357 106 11462 -78108
23107 -228225 295323 198083 97467 -89329 411353 270116 10657 -16621 85372 -108341 -90426
23096 -90426 100669 -252179 -546613 -3409 133464 -193420 5858 -129384 199848 181804 61751
23084 24583 35491 350609 177661 -96490 204981 390762 -411834 58405 -104757 -244577
23074 -244577 -39769 -98956 -76472 -19107 116720 -164873 -100980 -82625 86017 -75081 282762
23062 -48580 49496 -49160 -124807 100684 122641 40343 -587 -209550 -170193 115579 -176847
23050 227754 20189 -103146 -173227 -262925 -50341 25109 -80069 -134601 150288 7374 -51660
23038 114560 268425 17445 15616 -170526 -83519 -6925 -289608 164778 259052 15896 441072
23027 441072 373882 -220676 137558 16078 132650 -18077 -27450 228466 -9917 -58892 -50252
23016 -50252 -38800 239196 -5852 -194894 -62626 121385 97187 1310 193238 119818 -237082
23004 -195086 -235232 137258 62097 -53636 -81240 -7131 -114739 190095 -110175 143036 113867
22993 113867 -165133 111848 76983 353784 -155868 46450 -98915 -38819 -270787 40082
22982 -271481 -1624 -4909 144626 -41984 -250691 -13400 -99642 -326060 230462 145944 156656
22971 156656 -63433 -74677 -30879 -306617 37328 -201724 -123558 -445809 112484 163765 -369940
22959 -437693 123232 174360 -9984 -12107 -90879 -156455 -38963 116595 -45038 321304 143403
22947 -25756 -17841 -207402 213055 -171303 61819 310492 -118016 177053 -123457 -40630
22936 -60023 -496498 -71169 -200316 -145499 -101010 54580 173402 76220 74957 -296542 99188
22924 -62258 82876 21397 12309 137281 -30285 -19074 -69990 -192851 -103763 -253478 -341147
22913 -341147 -87308 -35874 -130290 -209412 89264 -129328 -52720 -18485 51845 208433 -223999
22901 -181236 -150538 -147455 -275870 -254599 35565 41124 170882 -7427 -193634 -60220 -410453
22890 -410453 29661 -192368 9969 252188 -350486 218499 -131486 -116202 -42121 239344
22879 -78415 -106000 170095 -28288 -38921 173059 -10601 258405 -435917 -283204 76929 220230
22868 220230 55151 126789 -62820 -178711 66969 10500 -122155 5098 -54121 -207548 -86827
22856 34242 20770 -219649 -239904 69918 195146 126619 -100278 -18304 -257289 -123494 83319
22844 -242064 107082 -36672 161668 45303 127820 198523 -126758 -121543 46610 60004 -18376
22832 -123864 -221687 -168110 -169974 198196 51814 188391 62814 -63721 -65489 226472 14812
22820 -240938 -297362 120983 -57176 144714 180786 53127 -155539 -66611 -111227 -111777 182031
22808 -91783 211425 -82345 -90308 56665 -77040 -82310 -368970 -388552 232996 16629 441227
22797 441227 -208773 -314740 -4444 52182 36137 259864 52472 252553 -271235 -38813 87987
22785 -8721 356206 -222766 -122061 133744 -232916 -24347 -180952 70752 190341 -159397
22774 -1015 -60207 -170330 -58746 -100959 157359 -47420 161507 107066 102315 -180651 -91053
22763 -91053 74538 -18215 -207326 357898 26535 -81128 -33627 -241943 290185 144182 127913
22752 127913 -404262 -202991 -242088 96962 -451041 10364 -123432 -120976 -294236 137866
22741 107549 -75635 -84572 -134249 -52279 -129697 -151870 -82900 96847 -46379 69072 -176416
22729 -197435 126939 290934 -226215 -137333 -234870 161739 -51044 -179168 -63970 2818 73805
22718 73805 -131075 -116915 -114865 -186009 -354696 -129799 -203552 -160135 2956 -109297 -46378
22706 164833 -380871 14934 -71771 31136 187147 202905 255864 -207126 181789 -469609
22695 -29558 -219770 -308420 -255597 226026 67771 170658 -73362 10714 -59959 244617 -262816
22683 129657 -16378 -130373 -75502 -75427 8339 73638 -282804 11758 -224900 -328410 -202020
22672 -202020 -308355 -466747 -585612 -152010 -25681 -314559 -230253 102777 263498 -137080
22661 -66471 -285981 83678 -200914 126700 -20284 98595 156226 -4348 -293288 -71007 -26323
22649 274348 -55771 -40894 -76054 35262 42037 75849 -155388 22286 -264894 -22334 -346181
22638 -346181 161617 224813 -19683 275442 -26522 -106178 65860 216749 28974 -28858 -222225
22627 -222225 -158540 -44989 -127179 -3581 -24080 -181997 166164 -140973 -124148 76775 19150
22615 -21243 -101608 -182025 -231006 -45184 -139034 -371250 290320 -185590 26214 -208072 -352018
22604 -352018 -162180 -139942 -378954 360983 -154565 -24710 120895 74180 -108636 -151710
22594 -151710 -42209 76736 30577 142735 28858 -93871 -115830 -46747 36371 -160146 -291621
22583 -291621 97095 -44115 331129 -103774 35770 -25048 704 -225756 -97293 25768 -43759
22571 13584 -326882 -145360 -349077 -100645 -50170 -23919 170489 -178007 -297323 41042
22560 100167 -87328 -166785 -24360 -452481 122787 131633 112057 -24220 7612 -144883 -157843
22549 -157843 144525 196617 -30369 153162 334137 169999 -25481 -108690 -436615 -327310
22539 -327310 -429176 21521 326083 -40344 -146396 -50664 -382899 80013 -82651 -62043 5287
22527 445934 -343305 259076 37901 -257536 -26640 88692 -69697 -77216 -9944 334134 -131745
22515 229226 -207279 172362 252123 31237 -229317 -12759 174181 99671 -95915 -275936
22505 -275936 -254842 17620 71582 -4238 -82637 -70169 -153357 439195 105504 -38823 -204077
22494 -204077 39287 257919 30137 -82540 -242889 257710 258988 -153707 3354 53204 92196
22483 92196 72677 -48290 22278 -232749 -25604 -242459 -110674 -160460 -42083 -64415 -54865
22472 -54865 310475 -168225 -66345 146806 -168466 -224354 -105206 117850 -189133 -26559
22461 -93753 25213 -438992 40148 6402 -202726 266434 -204095 -10680 87631 142800 -303851
22449 -55942 233473 248668 -90364 -324454 57649 83046 -374333 -143644 22964 -105051 -75548
22438 -75548 387172 -102347 198589 -221626 -90693 222420 -150229 82508 -226125 -221878
22428 -221878 42188 96705 96039 -36774 -316352 -95183 -22325 252397 -28760 -343069 -28572
22416 -71179 -31225 -240439 27009 -191378 -188288 121513 1571 -228168 -47426 -241092 146798
22404 7558 -12697 -2618 203961 -172369 212383 58787 -478916 -172205 -69506 173044 -159117
22392 -22009 -114265 -183735 23914 -10248 -21731 -61532 -289884 -28035 -206565 -43383 71883
22380 -110945 48591 124195 169864 -133027 89593 -282469 -63074 145111 364683 75004 -25146
22368 -100442 350497 153465 -205118 -3776 -30661 -160855 113140 -92604 26100 -60784 62755
22356 -61551 -2127 -159746 -115285 76933 84424 -349484 283895 -46630 66787 303736 -262235
22344 -166947 49519 263392 -98242 -81457 269000 -302813 -200319 -378926 142200 -6895
22333 434776 87247 -184649 -36557 -280625 -70995 280499 31400 -248726 -51885 -365598
22323 -365598 -408872 43854 -55691 95909 -17616 -262343 -279352 -212057 -343469 -152377 -209957
22312 -209957 221471 153800 -155371 -21830 270419 306500 238744 -209674 166989 -120566
22301 -36542 -266205 -166192 150529 -182611 5523 -289643 -158772 -117268 -252924 96139
22290 16877 3079 -107382 -238779 -129835 29045 27951 -31356 -97524 -22540 -74681 -91163
22279 -91163 -83664 -252855 -180534 183516 -109750 -201603 306337 156269 320161 44003 249282
22268 249282 121882 -139815 -226671 116287 285352 -267368 -52885 72078 -100050 129739
22257 -277674 -74779 19225 -141361 -81336 14537 -271852 -143171 -157973 314542 -232105
22246 -101723 115547 57899 117705 -258098 -132047 4298 48997 -219240 -264506 -280652 50575
22234 73121 -212779 -112112 -113181 209374 4081 -157839 619 -133010 -23822 28987 611114
22223 611114 -97575 -255311 67320 -93020 -164038 -215387 -49492 94204 -90946 -149804 158831
22211 10659 -268714 -64826 -126352 -24338 -190354 140208 124932 149301 -13621 -25139 -139799
22200 -139799 127896 67574 -342112 210482 380342 -44658 445531 4128 -258309 65056
22189 -213215 -51946 15040 -120377 -89316 15592 -219143 -173115 -39950 -270921 39794 99752
22178 99752 204915 -158387 96644 -249995 228417 -385382 -127872 -443075 -71871 292583
22167 106774 -229938 -205240 189260 -209933 199166 118305 -179091 -173446 110802 165298
22157 165298 -219460 -256070 -185970 -21174 -226730 -77621 -253709 -125715 39287 -49685 -205360
22146 -205360 -203764 -271755 -73718 -68408 -154267 -391814 188523 -166056 -340824 43598 -317999
22134 -244041 -63778 -245962 -129976 122295 -108722 -13840 -107474 -38342 -174885 83734
22123 240590 -33688 2837 16892 2444 -64663 -84060 86048 416979 -161833 -7938 81531 -62119
22110 22588 -8874 57925 200954 -206731 -249242 -295288 -10335 -194600 14921 -78303 -130525
22099 -130525 -270752 -229447 -298561 -96792 43262 1736 -298755 -57507 173901 115209 221490
22088 221490 -128213 -74594 -90757 -431964 40104 -47288 212336 11881 126279 128471 -87991
22076 94791 -256948 -27485 197438 141209 -19155 -14075 256127 64329 -11281 -155216 27655
22064 -124276 -107410 190722 124539 159530 2225 81734 -87263 59755 -50161 -23126 144536
22052 -80208 -36917 -106083 -136361 -170787 23133 -126386 -69434 -35994 197509 -102186 47056
22040 12945 91357 106393 -74926 -108976 -41445 139454 -31491 -37044 -210573 -58168 -224858
22029 -224858 -106105 -91428 -307699 -163014 50509 111327 298627 24480 -147425 -221432
22019 -221432 -184975 -71645 157927 34343 -659 -216140 -63280 -130826 53455 -155358 -41481
22007 -184369 -176781 -215236 -21241 -192755 -20629 -2783 -28617 -235164 -302186 -68260 -91151
21996 -91151 106440 49982 215716 -152475 91352 -239725 -14784 370849 -351971 -57688
21985 219827 -87234 282417 -154810 -184830 -197868 -163984 -257654 144485 39254 -219 -23936
21974 -23936 -421574 157425 -2910 -123584 -227585 -230283 -37940 -97868 -112379 54194 -74316
21962 -242419 -361003 1749 -23082 13657 -240086 -125128 -31428 -235725 -72169 24019 -23444
21950 -261129 -270458 -88508 -72399 -71126 -62115 -77873 -327701 -372833 -14611 235837 -157821
21938 159958 -280540 -419626 75609 -193715 -43367 140007 -91977 -73175 266303 2622 60764
21927 60764 -250162 176920 -225991 -167575 -83601 -160807 13971 -57141 20497 -11751 -90068
21916 -90068 105302 -126918 -142444 111202 -46137 -82433 -84043 -277343 -39116 -128962 -191616
21905 -191616 -255510 -193902 53453 -65031 -235982 139448 172131 206447 -139292 -147317 242199
21893 -31554 -134544 151184 -147705 21565 159212 -217155 -62626 -318512 17333 -126433
21882 -310139 -14617 42841 93025 21239 -15149 79649 -283250 8451 -138137 -264511 -177308
21871 -177308 -293168 -103669 -46769 -262943 -118395 -299780 182096 -10111 -249162 33725
21860 76439 -149955 -329924 179675 144884 -322019 -246980 44017 110787 -119334 -208526 -201135
21849 -201135 49097 -17521 89953 179766 -260028 -41482 169139 -182467 -195852 -154716 -230361
21838 -230361 -49834 162929 -92385 33683 66104 -287652 114747 122529 102428 -43946 -195292
21827 -195292 -181983 -121043 -24197 -108460 48331 -186035 -239168 -22156 -421950 -231668 177269
21815 -183 -66689 -67020 -26463 -23111 -129151 87540 50345 268972 58238 -100762 99809 172955
21803 172955 101145 -399283 -137947 -201308 -210349 -41183 56448 121389 -147028 277520 -54666
21791 15361 -92981 153484 -111276 -133597 88014 -172418 -102323 -412107 32384 137925 308103
21780 308103 -159661 58244 11038 -2608 373981 198458 95327 -20753 -131156 -470923 422715
21768 135334 158240 -127316 -346218 97626 -266092 -45198 -73608 -252350 509187 -418238
21757 29330 234773 -127309 4612 156627 -33976 32208 171200 -93734 290461 -281284 -96898
21745 -233893 84086 -247034 53914 166152 77630 269422 586963 -305153 -363133 -140280
21734 -306010 179057 -315476 -129304 228076 411002 203408 -167972 129502 -187593 -163193
21724 -163193 -86174 -61418 96356 181649 19910 270828 201821 -346943 130687 233454 -70203
21712 83834 11119 -254260 34467 253051 133026 -92269 -295170 -128682 108544 -132872
21701 -76633 -47317 139749 -135486 -57507 -359889 -149398 245093 -103796 -114709 -118474 -295228
21690 -295228 112355 -207704 -63914 -238098 -132129 -464526 -139432 -128593 134987 -344401
21679 -118569 271687 -131506 -126768 62021 407 -236578 -43172 132904 65633 71715 84035
21668 84035 -101973 9522 -141129 -538488 43108 -296965 85847 -68076 31480 -93768 21313
21656 138619 67921 -131344 99313 -74851 -256025 -168880 -119864 59794 -125038 -166131 173626
21644 93662 -93379 -87458 -188025 92522 -36292 46496 -107635 -253835 85657 21576 -54936
21632 -40951 -127692 -23960 133914 -190526 -169892 -264483 -275129 -17615 -117907 -120560 81572
21620 59608 -96826 -82308 178232 -35497 139246 -297720 21313 -180780 -6303 -215086 -140451
21609 -140451 -15401 -128913 27026 31480 -158745 -26484 57894 -216077 -17115 -369855 -163916
21597 -164756 -64422 -78002 -92532 -358840 89059 167420 -228735 -176351 -274861 224145 9004
21585 126143 231056 -78943 -47753 -306518 105880 6770 -66320 -55044 -226794 214073 11259
21573 -123668 128025 236818 -67559 57334 2600 255413 -315579 -195021 23255 -41439 -45112
21562 -45112 -339979 184900 -23106 -7156 59957 -425180 -276632 -88063 277257 151685 -95749
21550 -476598 205634 165416 -51625 52610 -90405 116479 30355 158953 -96273 -221089 -61781
21538 -70250 -83933 7098 -163428 -182831 -422509 -143655 67495 87689 -142258 -427215 98359
21526 -441476 56419 -113687 184173 208504 189924 -194170 2205 63966 -261386 -277871 22009
21514 9493 84478 -199267 6605 -5291 41603 208304 -83398 -281163 -181877 21220 -40709 -66584
21502 -66584 -257369 150499 -244654 -21824 -109871 47572 -284860 -116429 6522 54819 -88932
21490 -253978 -141613 -440586 126505 102803 -93288 -340104 -213933 -264020 -303234 -237467
21480 -237467 -155243 -274746 -54525 -124874 -87169 -183776 -266625 -288816 24368 -258832 -70631
21468 16613 128409 -16915 -3527 -5469 -126166 46004 -137984 126318 110491 -21497 -124925
21457 -124925 -92421 -77103 11656 -218670 -33996 146306 21694 -78731 40170 -117883 210887
21445 61141 -12338 -214542 2110 120189 203576 -173579 -283839 264299 -103889 -59392 -73115
21434 -73115 -5218 -93822 -28257 13939 79249 -128847 -100353 -285841 44900 441138 169711
21422 -68466 117483 308318 62349 119445 252790 202776 115952 -40581 134950 32379 4131
21410 -172754 -37002 -43935 -141445 -64608 175764 209087 -32288 721 79540 -146100 -80357 247720
21397 -307962 87481 225634 78856 23706 95676 -267544 -227254 -159917 124854 -262537 -239458
21386 -239458 -15261 311762 -245699 -183716 -142025 -40262 251127 158584 -144335 -112172 -205419
21375 -205419 166489 -365997 49500 50893 -107797 -75571 -380658 -9778 -107622 -64758 166307
21363 -95873 85439 102688 98331 150594 -100252 -251662 -99728 -321476 396732 155706 -38349
21351 -29919 -5291 -353162 -396537 -15104 182422 -102657 -120933 -163980 17876 228521 -40279
21339 -105954 21675 53593 86390 -262683 162265 -355401 -15968 327212 -206219 -112630
21329 -112630 -258608 -238979 -55704 -36007 5204 -359389 116060 77451 108866 -2323 -368908
21318 -368908 119527 -99676 16329 189526 -461436 -30179 202641 -47180 -42027 94305 -343667
21306 94854 188597 -190183 -205361 -129964 14844 -167705 9560 -217311 -62990 108739 53621
21294 -100018 -143096 -123749 -98059 -50490 76398 252965 87903 181682 -130327 151932 -43883
21282 -83084 137113 -17333 23067 -122342 32361 29778 -246101 -143338 -115482 -52066 -89060
21271 -89060 58522 28828 -23111 -136752 -12062 92205 -138024 -239281 24013 157556 -40281
21259 -11449 -264365 -113536 294804 -423 -72734 -422514 -316264 205637 105584 58525 127122
21248 127122 23338 -98663 368786 -318243 -100537 268536 48256 152511 -149122 -62866
21237 -132325 -74311 27915 -146904 150760 -86879 -503496 -56045 78576 21921 -301147 -24542
21225 -296627 -118477 86478 -16524 -96477 35273 -87714 302791 -111982 -138022 102029 -244325
21213 -24102 303972 -98435 -75631 389540 -65011 346966 -96528 4466 -132911 -193691 145484
21201 212889 -180209 3724 45102 -198593 -232255 -242517 -40343 40950 -219131 151865 -236319
21189 107053 191582 44101 -219425 -531707 -50621 -255914 -160454 234176 -250060 -136307
21179 -136307 -124537 160313 -78748 -139698 -77125 -230562 212019 -130228 45116 -100826
21168 42840 -289800 -291116 -336821 176124 -159326 -163927 -47239 81443 -290476 -192304 52284
21156 115823 -209542 -145330 14184 -115650 -119582 -35384 -61341 -234194 440084 -52802 -156606
21145 -156606 -102429 -262375 -49314 -186778 217348 -532275 78369 -60383 -94107 -233880
21135 -233880 7976 169307 247694 -319967 -229813 -106491 8955 159042 300700 -114853 -162027
21124 -162027 -110422 -403739 -100543 -36826 21204 -32967 -356670 -271943 -412154 -56496 -272290
21113 -272290 -64526 72359 -218412 316880 -329597 -159262 -285284 -17368 117119 -176463
21102 -144614 -172733 -126698 -92506 -43797 -304817 -141389 144930 60881 -142140 -167057 -244428
21091 -244428 117649 144370 -28007 105130 29795 -102713 -76667 2750 285317 -93220 143720
21079 -14941 47188 -1789 -75880 -36665 -30404 -188262 -332992 -85383 27786 -75222 107484
21067 186881 -116018 -161257 -169600 -263953 209880 171234 79306 -175642 -214788 84301 72924
21056 72924 -53087 190713 4913 127972 -25141 -71689 -250905 115877 -87555 -178631 143229
21044 48489 239498 -85155 59110 -66255 -13528 -356153 -183239 -186060 -170495 235378 10596
21032 7851 226597 223073 -6223 -134203 -20198 -68549 446571 160944 81618 -23980 9440 3062
21019 -81213 -351132 425804 -162906 -51968 -534302 135375 -173945 30007 -276366 -85762
21008 97151 110750 -91799 42890 -211769 -110500 34840 -51861 2488 210582 186489 45975
20996 -69523 172521 205819 231227 476864 445305 479310 -101271 269827 -52005 36171 -83756
20984 39623 -51855 -15615 78825 98882 -116954 188756 233128 68120 -200821 283209 -44559
20972 -42886 45193 -92448 -133545 69980 -186767 191405 -157892 -256374 -41849 451173 -71704
20960 -34934 118637 -19086 -106520 -383892 -68785 -4235 -532730 -155906 331508 -235756 -313629
20949 -313629 -305873 35540 -64873 -83625 -216531 -213690 74935 -179787 -85472 -226244 114692
20937 -7940 -124519 66042 208991 -77408 210443 407703 20085 609995 21404 535972 67460
20925 -146058 -42091 -96607 54208 129386 -305904 52281 -86009 31879 -53557 -153887 261944
20913 -36704 132599 198653 -164280 -231720 -307473 -79517 -160887 -147630 -57440 -61723 -2384 51752
20900 -173740 440442 -4171 -38831 146851 200107 126799 -84293 -190025 -21531 -33031 -100741
20889 -100741 -35037 32395 97821 89457 58352 -227510 -99875 124501 145003 -169507 14029
20877 -83678 -142188 -62668 -162604 -169266 -175280 -219181 -127936 163979 -76719 -216610 196710
20865 215226 -14373 105581 15715 -229118 -207995 -262038 -34049 -183394 -122438 11891 145773
20854 145773 1068 108094 48329 178287 -36949 -157757 138258 -66170 -46520 289381 -70118
20842 -55078 -184722 69522 -6691 -469667 -46467 -74681 -53210 -364407 -100026 -224906 62566
20830 42308 64174 -221105 -261586 -109049 -43485 -302339 -171495 241141 -23089 -98201 -9498
20818 -73966 15456 107288 -55272 -210515 80957 279425 -239064 146937 284001 -57327 -266320
20807 -266320 43008 -218693 -88682 2964 -53822 78895 -95789 147047 -317238 -43284 417183
20795 -372853 55959 244515 -392194 244493 -132827 -50846 -146482 -157178 -304622 163547
20784 -175398 -196820 213902 -170656 189790 -70637 -154975 91255 -116058 30573 -38912 -101652
20773 -101652 -48898 61888 -279323 -236557 -334279 -88364 272147 73102 -50331 -135044 -145255
20762 -145255 -120641 -245621 -140785 -216836 311469 -168572 32665 161 -209933 -37833 -99947
20751 -99947 -117454 129509 22915 148483 78924 -414265 -154112 -23726 -64766 127783 -271146
20739 -137481 -180686 -167310 -17646 -65410 416260 -8910 -263081 137159 -71799 -69459 -40089
20728 -40089 294601 -360872 -142158 5049 147778 -475673 -165961 -183962 -285443 -217790
20718 -217790 -95663 -45867 -22594 -220244 142854 -241000 128246 -30023 64289 -7108 -78864
20707 -78864 -268439 32756 -119756 -182035 29721 -98841 -221518 -135803 259471 -81625 242922
20695 -24995 -249938 -57869 56117 87628 245089 -93529 -82313 73228 -316300 -270470 -173937
20684 -173937 -137284 1713 181034 82497 -139192 22783 -86428 76321 237046 -28454 -218469
20673 -218469 -241891 -90092 -131340 -201604 75519 -202711 -28445 80630 16474 -149568 -47885
20661 -150336 -72337 -201739 -156174 -105221 154817 -2714 168697 -106404 -88666 -313231 -26828
20649 28622 545881 -122975 -112326 84223 -127323 -168023 12044 20108 -153990 19908 19550
20638 19550 -165097 -56302 93574 50113 38906 -429905 -337627 -62097 -35138 -13126 95885
20626 -133096 -433144 -26436 -255432 -164920 -49386 -168725 4472 -17159 212510 -157604 103886
20614 -170688 -19269 142611 -32335 -120308 -93055 -78254 -7591 -470891 188290 -136518 -166868
20603 -166868 -325789 -139735 -128618 -305347 91745 -47964 -48512 -380466 -217044 -352776 -145648
20591 183348 135213 99143 -376568 -73367 13325 -172709 -108500 11969 449572 -449769 -39265
20579 34937 554 -141034 -1933 -113441 -269022 46145 -2584 153819 -87757 123130 207823
20568 207823 177359 88813 334948 -70557 6366 -274604 37764 -200561 82128 -245335 43695
20556 243747 -288520 -13836 34724 -171232 157005 3364 82628 59245 209061 -65116 -6335
20544 -172410 -292711 -8470 -153747 -389710 -222291 -150620 -84320 452987 -284498 161350
20533 44286 -68627 -136420 -4654 24892 72968 -246420 -130576 -240906 -112361 -69525 131520
20521 -167422 -90968 20070 -100022 223450 76388 164145 150993 6960 -86778 23728 173785
20510 173785 146923 -111682 -227539 -24548 167119 210104 -181154 -60942 -285110 -166394
20500 -166394 -217121 105870 -206504 46286 190005 68796 -123107 -354617 -174061 -129868
20490 -129868 -137727 -57950 -157681 -413465 368068 -30435 149952 120856 -62640 127853 -291871
20478 -138810 58217 -427444 115940 14790 -106235 87846 -17910 23587 -159729 -268920
20468 -268920 3465 -39272 310426 -228587 104443 -105443 88347 133241 121604 205206 140438
20457 140438 -205026 86877 -275006 -259468 -163533 -51557 -105306 217525 -6073 298956 -88601
20445 -28708 -45108 -52853 -238325 -331379 173384 43516 9314 -88811 -267749 171167 -123761
20433 -310573 -136057 54504 -79497 54763 212965 -359402 232294 -243339 84674 -119368
20422 -3350 76320 -188704 -225937 67999 69854 21274 -67236 -131379 65161 -397055 -369910 -37039
20409 -341804 -126121 110248 -382399 18718 29870 -203746 80935 -183091 -157532 -250230
20399 -250230 -265978 -227699 -363053 -198477 -156602 45240 307668 -136236 -117791 -87689 -53308
20388 -53308 -49658 -143097 -25992 -300103 -239092 -401301 149453 165618 -117238 -165322 -133236
20377 -133236 77216 154852 213617 105610 -23722 -208376 -139036 159206 17527 -225761 143191
20365 36113 -89193 -188077 -228935 52610 79243 28160 161416 235065 -144499 65117 117809
20354 117809 -6258 -309442 10430 -55473 -254995 -191578 193575 -299205 113612 -147478
20343 -159970 -178732 48482 -365841 -251104 -2646 77894 -181710 183658 -179173 -101000 17252
20331 -91611 72091 -24611 -14756 -418649 -62515 -449128 8294 -22838 -227910 93506 -352944
20319 -240467 -259712 -97568 -104979 47057 167614 -67104 -258324 171957 -133225 275113 224148
20308 224148 141198 -43782 170933 -133086 8268 -77842 -187305 -399 64491 -44771 -200370
20297 -200370 -46461 416830 -286390 -326336 81038 51275 -16463 -160462 25262 15619 128532
20286 128532 -78223 -9432 -189532 -5038 -385148 61047 -50957 314592 261581 25771 -222631
20274 17734 -221787 56698 -267271 362494 127409 -53018 -55030 222264 30838 311663 221903
20263 221903 -196330 61260 83906 -123323 -36083 237160 -229705 -392379 125514 -59706
20252 93919 109361 -344345 -170534 -112283 194787 41540 -276666 -111861 133683 63416
20241 -192688 -92775 -112260 -455536 -21965 -372808 101288 -70627 -55711 139044 -268163
20230 39192 182969 22167 34026 458854 -37925 -162567 -57342 96948 -39570 -217442 55620
20218 20583 -79000 -232812 4054 -106519 -123332 -3306 54238 -114202 10195 -122413 140145
20206 22206 79447 57030 -115232 -108251 -297547 81494 -329498 -173007 -11491 64803 61075
20195 61075 13038 -118953 -139207 89413 -210746 46871 94818 62664 -12163 214363 -123686
20183 -253780 275713 -24140 -78387 -71789 22675 94906 3832 -75920 -46927 -246374 169472
20171 -62206 89080 139344 190999 140439 104301 227786 -112719 -95796 -51026 196079 -105693
20159 236782 -21106 54283 -149032 1722 84879 -12559 164718 202523 -43510 91862 128686
20148 128686 262054 152666 -2815 306633 -55122 266258 -7488 -246384 95466 24741 98365
20137 98365 -44591 -83826 94652 157211 552469 390944 240564 608433 375932 99429 300924
20126 300924 426119 83573 326018 290097 305553 34718 -94971 -87393 -5492 859 -213443 4222
20113 -163582 -135772 -166309 135201 -253425 -199171 45219 269375 77805 -133350 55917 -138111
20101 -148064 195420 74176 -257917 -117398 -142049 -382272 13145 173917 71867 54845
20091 54845 -61461 -23034 -184569 150978 8988 -235419 69555 101539 -182170 -3576 170577
20079 17565 -325987 -172531 -207597 -126949 -93084 311202 -110539 -98948 190935 92132 -129805
20067 -87581 -208178 -4933 -3651 -124025 -231388 -175694 -20952 47856 -180960 -135468 -319855
20056 -319855 109846 -62443 107364 -37862 -114445 -23595 170645 -185572 70347 -280016
20045 -1460 -381009 126476 43302 -63135 499082 92555 -134950 -71061 -258070 -9188 -54747
20034 -54747 84577 -35779 5049 54613 -451611 -80570 46152 20046 -136985 -203545 -257033
20023 -257033 18501 59086 -40609 -173201 57739 -42592 143331 123829 -131354 282494 80289
20011 183743 -242786 -48996 -45479 12564 147334 -142113 40534 -246116 58034 -117831 119047
19999 -174837 69371 -774 61150 -259510 -118373 1902 2776 63384 -25346 149309 90696 105093
19987 105093 -63550 153725 30326 107978 -32829 109849 -181513 83128 450670 119905
19976 -170952 114387 439870 -54792 185576 410428 -147245 288891 -51470 -5398 -299045
19966 -299045 165373 82906 229767 32257 58118 14345 -288776 -207362 228143 -21447 -315989
19955 -315989 -390038 -18992 -95509 -90534 27091 62721 38692 -165986 240813 436076 14394
19943 217552 164923 27547 311842 227393 89891 202790 -137337 -145815 -111858 -185438 3666
19931 -377884 -31459 214546 -250915 168264 -19024 131615 -251844 -137190 10085 250832
19921 250832 -26970 107516 50400 -7413 -157818 -101005 -284166 9243 139972 -237440 -127193
19910 -127193 -168454 48522 -56700 34907 -6806 44055 -19168 -313925 -25104 -59737 -172501
19899 -172501 -218553 166550 172775 -220758 -210476 -197736 3084 217149 210732 -6789 67742 -153143
19886 -41652 -93004 -172354 170710 -51698 -63211 -174384 290004 -251861 -302141 -83381 -75423
19875 -75423 -5439 -119091 73575 -220770 174595 -513 -215035 -46239 -123404 -22538 -180826
19864 -180826 -55277 -13372 123836 -38957 61613 -231372 158325 -210211 -33190 139684
19853 158193 -176841 -195796 25659 -64990 63380 138365 153731 -3775 139690 -88854 152613
19841 150715 -122456 -103655 405391 233156 55111 65491 -78930 39499 -196292 72675 -199125
19829 -12208 -142645 -403246 -265217 105816 49504 214064 -5885 -36119 -455135 88566 21308
19817 107373 306469 -144108 84851 31877 -112386 -145102 -373614 10755 22824 40876 -246632
19805 255572 -17297 48570 25497 -366317 -250795 -326700 210096 -129964 -194187 -6007 -116787
19794 -116787 -25159 -306427 -119923 -142015 -160683 92187 141026 53042 -110391 -240959 -194958
19783 -194958 255435 -14941 -73808 47124 -76009 15792 -63081 -13641 199660 -218677 166458
19771 -36606 182085 116796 -144233 -106503 -8806 -181211 -186867 68903 -19786 -184319 -25835
19759 -90031 -242751 -110924 -11449 58934 -233868 299871 -212952 -236328 215617 -410604
19748 3595 -8945 -186285 -250155 -57622 146428 45324 126318 -105572 -181405 218243 -15602
19736 37069 -345925 201157 -7066 -23793 -66800 -111258 48950 -135442 152208 -78063 -155771
19725 -155771 -40156 147832 -216859 -10498 -107683 298212 20598 30680 314977 350682 449963
19714 449963 392872 613314 58722 -4121 247141 91784 -47300 -53833 -425768 8728 -236038
19702 10593 141752 -83021 121907 31186 97755 -162623 127926 307542 -267527 24543
19691 -174518 -204491 191557 -39441 -160830 373074 31951 -38245 -84270 -70252 156300 313636
19680 313636 22619 -45515 106134 -5820 93618 -99349 103835 60774 -124162 204963 -253715
19668 74189 -312752 32007 -391307 -262635 431419 131347 260234 9209 -192896 124612
19657 -4688 82828 -186219 54835 -219498 134444 -96613 44441 145939 54088 294576 210301
19646 210301 -38694 -311718 99806 62558 -53468 -512883 -266696 -330659 131190 224922 -111195
19634 -193992 4677 -132490 -167373 339323 -54160 -14195 -352020 -113126 -283949 373135
19623 1406 207646 -317434 -29691 -60743 161400 276309 -63972 -222436 -282653 -288366 -165078
19612 -165078 38826 55049 -222427 -36410 179755 136268 -69758 -4014 224388 -140294 -341723
19601 -341723 20929 -89549 -268438 -60258 -306866 23757 129129 7737 21635 -173789 -141194
19590 -141194 -202757 34280 -159944 -298683 -471947 53698 218429 -73152 -209795 -405916
19580 -405916 -78733 -72696 -275716 -18579 -265002 -58795 -82476 -119253 -22706 -124847 -233417
19569 -233417 -75773 -148941 -252395 -303850 -163432 221396 -268724 -276209 -194129 221087 -260024
19557 -297050 -400326 96040 -261120 22788 112987 457488 -21917 93124 -31153 -148114 -33863
19545 220849 -263312 136975 -248950 -188078 25713 -241976 -438982 15609 -101270 55880
19534 147685 -316739 78671 139885 -83918 161412 30967 79384 -25765 -108443 109345 -81732
19522 210305 94000 42318 -164394 48524 -92741 216798 -255625 -61054 -280501 292303
19511 130265 -298394 -178418 200875 -64257 -65819 -74905 -434113 -42332 36083 -67840 -138053
19500 -138053 -140638 -186082 -129864 -38073 -352196 120824 -225175 11979 -340031 -122921 -293014
19489 -293014 134218 -467940 -2750 -275735 46338 60741 -41566 -166437 -104514 -23786 -300128
19478 -300128 -478013 212797 -103156 -103612 -425141 -86664 432854 -195078 -309287 -158692
19468 -158692 -585532 3995 -82857 -96836 73657 155773 230520 11161 -88223 -43824 -252267
19457 -252267 -194930 261285 -209137 2736 -230073 4519 61008 60860 8090 232419 -109415
19445 -65612 164536 -176525 38081 -169448 -175791 -125714 -211140 87995 117719 46308 178925
19434 178925 -114456 123737 -91973 -37408 -219626 5233 -217958 34026 162331 36561 35593
19423 35593 -538411 -68952 263111 -101441 -333270 73124 -224359 168311 -266819 -96677
19412 346454 -169241 218052 -166878 -279976 -297005 328588 -239716 126957 -13700 125367
19401 -426929 -61724 387881 6599 -52030 -263966 61750 -2241 -20897 -68408 97372 64564
19390 64564 -177238 -3417 -368945 -250203 130518 -111875 43904 -65365 -129015 91092 -21960
19378 -107254 193035 -141054 -134039 -33158 15920 -208352 -70719 -224572 251029 -199454
19367 -155388 -127417 -125294 -198435 -168423 71834 -362671 -229034 -319317 86510 -270227 -451397
19356 -451397 -101672 28799 -174409 -237629 -104060 96270 -264628 -43990 -50973 -27663 -156497
19345 -156497 -65304 -141447 139128 150611 -108641 -195154 28800 94623 58143 -21569 -185611
19334 -185611 -124604 -122489 64600 -36713 8765 -163842 -120502 5280 128398 106869 -132520
19322 -286128 130865 -144365 361697 33446 -415344 135705 -125454 -43915 31996 283142
19312 283142 273153 -297782 -349213 -149131 -86037 128415 -417896 132959 -459623 -20640
19301 122656 -141830 -126188 -117388 230544 20990 -145226 -36337 -45999 50233 68853 223873
19290 223873 -45966 61458 -131214 53472 -86338 -91485 134928 208499 -254588 -258904 -61387
19278 184150 -41066 76864 112397 -55252 -172038 40584 19511 295408 -234636 92597 38130
19266 -305209 101338 -123128 -143468 111325 -129222 -100665 -179901 -281406 -296296 -89645
19255 -95481 -254849 -475269 -119988 -185114 -256551 -8798 178587 -156709 308875 -8298 -195027
19244 -195027 -160098 -70380 -121226 -235043 -25786 162250 6738 258070 -226918 172722 -217933
19232 29712 110625 133214 -32762 -308300 -14195 -343927 -75220 26048 -113516 -61288 130233
19220 148494 -75171 -77376 -301725 177957 -220901 -73148 -431289 92475 -122546 -126245 -63390
19209 -63390 -247440 -228284 -69383 -185526 -187919 -101565 -155072 -180667 -114443 -53561 -47693 241745
19196 -338808 -258627 -8470 -273117 -310206 123393 177259 -313893 97031 40347 6785 189904
19185 189904 -115566 -186055 239313 -448670 19520 -144425 -110179 -304903 -166460 -231525
19175 -231525 -88410 194237 -100272 -442850 18218 22370 30934 -110255 -191443 -291385 -55238
19163 -82127 -166035 155021 52212 -187471 99356 118903 -168879 -325712 -215691 -145568 -41686
19151 49474 -258122 -112676 338198 11361 54672 -25542 -166356 123501 328830 -80148
19140 -106250 53172 2058 56833 -93246 224259 -480195 -91398 -61924 30694 -173332 -265400
19129 -265400 256477 104380 -76279 103641 160745 37651 -12016 -132656 -61214 -165131
19119 -165131 -123595 -87484 -45667 -123196 -219831 -168798 -22840 22671 -238732 67720 -228404
19107 -28379 -7594 157679 -137898 -42624 -63441 170089 29899 2511 -232346 67667 -291768
19095 -94189 223537 79840 -97461 2722 -102314 -17340 20560 -107180 -113404 -252253 213914
19083 64912 -64803 231363 103030 15001 -129088 -299487 42640 -413566 -260978 -24133
19072 -151926 -252539 -138492 -227865 -302586 -1780 -15098 6678 -244223 96235 29982 4696
19060 51786 439424 -362437 -96044 90177 -34239 179918 -92845 119366 -54481 247916 465844
19049 465844 15653 -234992 48503 -63787 77131 -293803 149222 -237168 102699 -198058
19038 298734 104660 -120013 -56918 109789 -178475 248397 146159 -170813 37903 -232113
19027 -189357 71706 42628 -66385 181364 154861 -140088 -177400 -104107 -47324 85338 -114646
19015 -111433 11891 126822 228557 124353 -118226 -170337 -93658 93322 28219 329005
19005 329005 262790 189918 128369 25618 7774 -105479 162793 124435 125320 148442 -265871
18993 -36343 -42925 35819 252536 -179081 142995 -182726 -126293 73912 -39627 102202 100092
18982 100092 -3811 -48043 96980 -153769 -143803 -326261 -194077 -165857 140316 -126568 26358
18970 -63284 30464 27653 241779 -222777 -66207 -7365 28495 180476 -22998 -243675 222305
18958 373326 177972 455313 332504 -31990 127978 98520 -252078 145206 161484 -428053
18947 93257 125830 -90575 -152894 -143357 371291 -269468 118699 66840 -100094 -147234 -107163
18936 -107163 -96199 74905 52804 -29109 -28314 -100085 -267741 -409500 -162956 -42260 5806
18924 -65590 147156 -335391 99467 79645 30858 -30200 47151 -42712 -101276 -171473 69458
18912 -416744 -335598 190150 23756 100241 337812 -208737 -129720 95809 -8376 -154964 -135903
18901 -135903 -481421 122242 -68737 123061 130595 232730 296825 326118 256169 73335 144327
18890 144327 181302 151046 -220879 -101636 274931 -11434 -64425 -215063 209605 275020
18880 275020 -206123 -181747 89276 187817 51758 -374943 -35869 -147796 -429402 58464 -81088
18868 -52741 -163561 178464 -18933 -170720 -195323 -140319 -141638 -203255 -417574 -219618 136227
18856 87678 85659 -111279 112073 -108599 -73989 -274969 -5769 103232 -142543 44240 -39213
18844 -454945 -53892 -157843 122742 -319952 131412 178217 -16042 204788 -209355 78320
18833 177668 215627 90769 121804 -150579 -438716 29485 14588 -481442 493974 71487 -390310
18821 127201 -77878 -121865 -164055 -243477 99320 15044 92330 -154881 160083 -639 -332535
18810 -332535 -117223 130955 -109048 -145828 189538 99928 269011 -36910 -56811 -137869
18800 -137869 -23159 300801 77374 46709 -229830 257031 -58250 -104990 73695 3194 -39698
18788 -125120 -22364 -174622 -388609 -160935 -117751 -95942 -108076 -158815 339791 208716
18778 208716 6320 28689 48682 -83178 148525 314212 23289 -66519 -253633 -39730 -120636
18767 -120636 -112105 -112895 241150 66575 95940 -60732 157321 14576 10540 -61784 -155825 -74489
18754 52637 -97136 -115890 -182131 155513 85348 41972 -318953 -12357 -173317 -11132 -88341
18743 -88341 -41265 180751 -202078 -163399 -260634 -203620 104280 -31876 -45379 -35281 -231230
18732 -231230 -50410 136356 -55342 78168 206124 196164 53759 17142 -166674 -32472 36467
18720 -246331 -65289 102573 -67491 -3026 -5681 100 -80771 11838 -273312 92377 -165361 -147936
18708 -147936 200779 -31280 -123994 -154378 -231366 91236 118105 -9992 -64439 -187899 105931
18696 -170316 132233 26739 -351733 11088 188293 -29667 -201199 -3916 -26988 -219071 17706
18684 -182382 -93804 -12026 -145227 -14695 -47433 -73242 -46327 152043 187863 152012 255191
18673 255191 -155815 -52926 173771 -152638 -220167 -103711 -139314 187257 137298 -96088
18662 -1592 -176857 -108519 -257814 35154 -141961 34891 266565 -194258 -714 -196392 -122094
18651 -122094 -112490 25701 -74120 -186817 -143225 -44299 23601 -317294 -229000 -184068 32804
18639 -112942 -178605 293862 -31604 -84184 -35987 -209649 -65272 20983 -138734 -95431 -187109
18628 -187109 15356 -302422 -123348 217078 153916 -295923 -228095 26308 273694 -176152
18617 -197655 -118270 103503 -41695 -183869 -112943 -213288 -91725 -18318 -119837 83611 -139810
18605 -53914 -65046 49207 -57740 -362646 -114289 -167670 -50779 20381 -320245 -3997 14886
18593 -15806 142845 -321547 364963 16186 -384719 -40179 -276362 -186042 11700 42201 130560
18582 130560 -77597 272737 -143068 22308 -200272 -114639 -194444 146848 223984 21546 164480
18571 164480 -62264 69702 23832 119669 222874 -192706 -198952 -224682 -50640 -364053 -199688
18560 -199688 -108269 -91475 -57188 -37950 -148603 -58113 -438433 21846 -52622 143669 33109
18548 -168450 121437 85115 -248285 -167402 51790 72537 -174697 101753 -53527 -125539 -98850
18537 -98850 264185 42661 -184657 -77489 -43070 85366 36619 -88469 -204786 31620 254826
18526 254826 218503 -93099 22770 -332180 153656 149893 -87089 182992 -373734 -74380 31961
18514 -254920 239437 -280821 87519 -128984 -19789 32241 107917 -259287 -109773 339639
18503 161751 117813 -146606 120127 23840 -327746 -304063 -78114 -140225 -256925 -40412 -125044
18492 -125044 348641 50184 -219770 -106782 -61745 -251737 -32539 -133740 -62551 35380
18481 92553 75377 -105683 373332 -260132 -134246 -91252 -106649 -268523 152401 -334793
18470 -252913 -58524 -31605 -309621 -100736 140094 -125308 -87477 -84523 124247 11359 -39335
18458 -72603 -78670 -80668 -312722 46832 63065 93787 11366 -35686 353549 97875 -383301
18446 -105592 -60470 -173446 -346199 222835 -115839 -294405 -70102 -113570 7752 -330950
18435 -232086 -370536 -193604 34704 -155823 169100 -159979 -95649 -205428 85909 -114530
18424 -132932 -241790 -236776 -86484 -49650 312946 48002 -98963 101245 -2962 53690 -102811
18412 -193774 50379 33527 125768 155843 454593 79520 198863 215950 -247423 195945 -112535
18400 37745 -34340 334325 -130282 103131 342766 -593382 -327528 -70938 16429 -44485
18389 -33495 204223 52315 16692 -12234 269866 -36702 -157396 -136655 24053 6066 -20433
18377 10152 46592 -106468 -24448 -250770 -106259 27093 -285700 86328 424205 -227050
18366 -34637 57227 -75503 210053 -123819 -3469 -212718 -177324 -316531 -190552 -77214 216257
18354 -77686 -341845 943 142845 -170298 -211430 325489 143331 250362 -4743 392722 66302
18342 51836 -97509 30269 277395 161299 -15660 -41252 -366925 -379895 31943 -222631 50417
18330 -381607 -78556 107900 -95148 -228957 -88951 -269534 -204084 -515843 68263 104424 115261
18319 115261 -76470 -122632 113284 -131791 12536 -203284 -42792 10083 349808 -102183
18308 -206724 -18532 39710 -48981 296314 -265598 -285869 -275113 -194699 -271886 116685 -80276
18296 -222877 88730 49076 101555 -45263 -251419 109417 -345648 223603 200582 339456
18286 339456 -151665 -127473 -91020 98490 121484 198404 204684 48249 -3660 16741 -344243
18274 -114041 -56672 -69154 -24635 -71972 91666 -178819 -17375 -31310 298783 207092 178910
18263 178910 112714 -83934 -73170 66591 -140465 62566 -12523 -8665 149046 59081 -82300
18251 -223541 18274 10978 -97989 84741 -102810 -13125 -337727 -88912 97096 218692 -175879
18239 262974 -265359 -93845 192328 84644 -87793 -103118 -64885 -3512 -190597 89492 67150
18228 67150 -49321 -20460 327448 148048 -128397 -2236 59656 -160058 -182122 -230802 117532
18216 -137035 98636 -334154 318650 -153430 -204921 -24145 -37853 175093 42209 -269746
18205 274669 -138903 -347875 -17935 46703 -68471 -72503 -21657 -15615 -58393 -326040 -25518
18193 173563 -154983 -237651 -87456 -149139 7489 24164 228256 -19198 -17201 -17407 -220208 -232659
18181 -232659 -159144 -122918 76427 -101033 157280 -11181 59805 219184 213125 35942 -120020
18169 39940 -252554 -204207 68408 248031 -114966 -97346 -57562 205948 59667 -401432 -53464
18157 -10122 87928 -241366 104509 -284504 180095 -124149 150103 175207 -73644 21748
18146 -19813 -54619 -145569 40922 70098 -56318 82061 -88699 196979 -173403 -45633 -22648
18134 76574 -46126 103739 -131791 -338667 73054 113938 -399943 197819 -18631 196306
18123 93220 -136285 -70690 -20887 -94771 -293966 81584 47357 -182995 -207334 135550 -229787
18111 320305 -102104 -7160 477 167236 261996 -333638 78840 277393 -71189 129766 418676
18100 418676 62010 -261889 104002 119194 -131438 142074 124006 -177054 -225456 -172860
18090 -172860 126927 111872 -31444 77631 39987 23122 -202056 183382 -78081 -27372 -144168
18079 -144168 12604 -215243 78353 -24601 -42642 -234381 60959 -313364 182884 -539471
18068 -34827 -91172 -236181 -181128 180876 -87918 -87514 124668 -153376 24219 157134 30342
18056 -94860 -141434 -20010 -4879 -80906 52924 -306095 116210 166876 49825 341253 -166643
18044 143391 -42477 251465 306884 -228580 -38155 33662 96827 173139 158271 -118295 165490
18032 -93350 1043 -96215 190148 -39868 -148678 8151 -155471 -273102 4381 -55130 187083
18020 -283064 42383 160412 5860 101757 22336 -59930 -147170 -52115 -147973 6981 -15377 93665
18007 -24045 175273 109707 350449 -59261 -216795 193975 173209 151337 35655 53251 -226257
17995 -46573 246564 -174923 356934 -336475 -152633 -86964 6880 -125464 -51122 170284
17984 107552 111611 -234082 -227024 38760 -31022 118476 -248113 236543 -18144 -1938 281758
17972 -89146 128988 -190009 -102743 -218256 58538 -163087 52725 -61699 -406806 69707 207704
17961 207704 5944 68069 -132460 45410 -425181 171653 -164584 -286721 -203695 277244
17950 -54676 45084 -328526 100186 60547 -2387 394793 51018 -125991 -48218 115876 161741
17939 161741 -222421 345515 76366 -14213 -83340 -13049 -99172 154858 -138598 -21200 15940
17927 -167409 195686 169126 -84573 -29095 239916 306966 92422 -63431 278930 16493 41687
17916 41687 42357 -26667 -94826 -186849 -248932 28233 -92502 -16683 -137396 -170132 -76505 12076
17903 410647 250905 111989 -54807 166159 108974 -98750 -183506 -132954 156829 -82304 10946
17891 -72652 -64667 -210996 188965 -22868 186522 188032 233939 346330 -210859 -163553 -298113
17880 -298113 268313 107053 108089 -56555 8675 246 140282 66355 25515 122452 -270822
17868 193742 42303 151791 190938 155443 -64062 -29852 -211371 -190861 33242 189530 -162616
17856 -86212 -24762 -10654 -82500 -2341 -105290 147112 77315 -119083 -213420 247146 12870
17844 -34953 373298 48234 127523 124130 133127 8543 71100 -26340 -385762 -55561 -164367 -81844
17831 131569 -49823 120629 231088 88584 -85063 188754 69979 -283863 20778 278772
17821 278772 179854 161395 185665 182293 -161366 199535 346482 212166 272440 -134207 131106
17809 -64807 -189360 231938 -34744 108189 353395 80071 466157 -6514 106575 114711 -208121
17797 -43303 -14744 147390 -2875 -191520 -74305 -480739 -196087 191781 164216 -67300 -239507
17786 -239507 -131056 -72927 28345 -64577 -200976 269243 -91771 40591 -39532 -94103 145955
17774 126237 372344 -169231 91145 597368 118474 -131482 251306 -107368 190166 120143
17764 120143 214579 83298 34598 81666 224579 -960 166695 -321293 51272 -196293 147152
17752 -21248 287984 216515 81230 97264 -45535 133428 -348067 273194 -15240 -193832 162885
17740 13811 -188744 153985 51492 86659 216610 156320 157748 -82051 -186711 -136295 -112012
17729 -112012 -109858 -27051 65735 259713 238846 -39539 -162652 -230777 218789 276783 70367
17717 80772 50596 53994 332941 -4577 -233576 103129 -119848 142245 125384 96623 62805
17706 62805 193375 116953 61550 70741 380352 -50238 -157605 84341 8374 99947 -107864
17694 -137652 20184 41186 288729 16714 23294 129959 129433 268804 -5997 -243787 -7682 65472
17681 -153327 -96808 103773 -29591 86144 -65600 75274 196063 267625 -4961 -165951 -26012
17669 -66020 -52160 -39141 394037 -306436 105161 321792 245155 -136914 121696 115052 470850
17658 470850 200554 -35052 99514 -53453 -94552 21039 -16113 -186369 392689 107557 16410
17646 216961 -105373 72388 89941 339653 -34142 -117679 151577 174698 -26861 44435 62101
17635 62101 89990 211456 380387 61573 148984 198992 10953 189461 11146 510796 -136975
17623 173618 91945 35304 215069 118659 11295 -212982 112560 -34623 122284 139677 158455
17612 158455 -43929 -97557 -159209 118321 277888 163823 -51832 279174 -68253 186091
17601 -17139 232719 305075 -263907 252599 30673 103940 150385 177077 208437 -73602 -84898
17590 -84898 382167 -50216 -72604 179964 109001 192569 72465 156671 73672 97222 56991
17579 56991 246938 -138562 494274 -120240 -84481 277531 433876 205402 250165 158150
17569 158150 -109928 128351 -125334 -36478 387275 10299 243262 -37917 377910 -96968
17558 396723 468866 149962 108126 195247 -11207 66019 -151612 248438 -159044 119208
17547 -9880 367201 6882 199095 132375 146783 151390 315686 288226 461355 229682 68574
17535 -42748 248287 76394 250785 116841 463814 300265 51830 144623 289664 507945
17525 507945 -137406 575654 179469 112175 219755 340446 342425 9946 123790 459709
17515 459709 451743 565431 558426 530266 649983 1062279 983019 1059823 555127 822562 680277
17504 680277 375884 407245 481687 487582 899413 96811 477050 679671 725283 657022 950422
17493 950422 937902 610754 779340 547598 520225 376837 410199 349264 43869 371558
17483 371558 524348 206771 94604 80591 382394 309026 146775 500651 392712 493287
17473 493287 127987 363604 125294 177937 354490 400545 197092 89695 237790 577731
17463 577731 284560 350424 152725 108286 76771 36841 154192 579737 128359 -28879
17452 142259 216610 541677 471179 209484 230557 271141 470238 337165 375820 442802 382347
17441 382347 262478 165629 5494 112758 242240 394048 333012 201922 386076 395328 -99374
17429 352129 195021 407053 499440 396765 238793 184997 -41160 280074 172919 254774
17419 254774 196467 490864 49142 383542 738139 212056 418825 180890 503709 238768
17408 361071 314328 295845 388127 121508 329867 384619 -21446 287279 602647 295856
17397 396474 239564 13344 276093 75367 304246 287884 531188 349597 202241 -93075
17386 -27171 237880 173922 223007 167704 250438 186853 88654 364609 84794 259793 -9385
17374 342037 241181 15246 233224 -65271 120794 402849 637927 -119848 252404 39895
17363 107586 128151 335656 100479 233518 110561 87768 393871 164000 302899 171688
17353 171688 232533 471912 346304 377531 -146335 385055 552583 143855 309872 267560
17343 267560 87341 -151669 374969 39443 171122 294903 342107 203715 179297 459758
17333 459758 312461 276993 371510 72726 404592 199847 -45536 247531 18404 421109
17323 421109 250222 110601 274867 42156 134219 98985 434422 251242 281132 346825
17313 346825 69210 -56163 -65696 104511 451239 368314 343548 314088 265276 144131 431466
17302 431466 680083 389514 -72865 530665 170195 550458 127394 407277 442543 -4866
17291 605390 -111010 86084 439219 120866 320136 505777 23134 103837 219209 445819
17281 445819 687445 462591 256106 339898 615553 186589 592962 78012 202518 411776
17271 411776 485169 115951 170294 369397 488800 59275 252738 596338 431836 481333
17261 481333 554701 369805 418668 367465 539910 245186 394335 260247 173650 169717 566405
17250 566405 327958 52842 347773 416175 424383 389563 259011 434506 556708 399580
17240 399580 386545 532995 358132 325193 245679 427806 429734 234885 342759 238804
17230 238804 305146 493323 151139 451846 99160 632030 165620 291472 246696 560779
17220 560779 16312 358166 606807 219770 243218 534047 233530 165821 337646 625918
17210 625918 645313 429783 536203 310131 495172 265416 280344 157051 266542 266921
17200 266921 275156 282486 243709 592830 521048 245520 182326 508029 290787 536748 137548
17188 460085 154000 311057 887973 646777 154665 395701 673511 349983 116335 410223
17178 410223 446951 689460 520455 514490 485473 417607 723264 165663 37015 41751 641068
17167 641068 331536 441568 546513 638843 343956 574409 479880 122068 451175 677299
17157 677299 408313 561771 410110 628565 653499 870819 264932 870635 544458 415444
17147 415444 593220 303164 711009 252129 469747 328647 476624 404801 300559 495724
17137 495724 804130 521723 511221 328906 346588 647416 577236 657306 711282 436035
17127 436035 299219 740087 523460 269970 449146 330332 539510 747150 468279 584176
17117 584176 498031 513350 654624 394633 336537 538376 582778 732222 753204 311423
17106 326324 672110 448130 682511 464015 205298 601635 604955 589915 392100 752770
17096 752770 468869 665874 301168 201421 445756 817477 759156 358365 903003 395421
17085 491411 678617 486440 485229 621428 684295 514883 625307 547142 530710 522634 635005
17074 635005 657931 643326 1057925 574924 460267 674534 583032 732760 771945 521963
17064 521963 1125866 751285 844207 653777 1064899 706389 613385 754663 484184 654148
17054 654148 1004320 893842 778364 1141015 835180 635319 898692 907522 1036321 741413
17044 741413 828021 873987 1010433 598633 746864 1057183 724206 775060 1186669 880694
17034 880694 554959 711594 1046312 560803 773970 1027980 778100 900917 991223 815062
17024 815062 1387587 900055 1322493 830466 807641 747227 937471 1097470 615701 861487
17014 861487 1020593 993139 1015188 1112900 1255123 895689 1170938 791746 1181072 1121225
17004 1121225 825433 1119848 1234749 1261496 779448 1344430 1029984 981287 992048 1436838
16994 1436838 1222509 899215 1211841 1150507 1118840 847601 823565 859228 1006498 1369070
16984 1369070 1115945 1054091 1278002 1052769 878992 1544902 1031648 1250313 988363 1084783
16974 1084783 1635960 1557680 1336645 1177328 1129508 1132162 1132995 1500799 1386743 1325580 1519801
16963 1519801 1120807 1240009 1226930 1721090 1450924 1485269 1435439 1688711 1482112 1665906
16953 1665906 1564653 1566787 1676447 1636165 1826474 1400380 1271289 1377595 1532414 1752476
16943 1752476 1646673 1902824 1739379 1335568 1886013 1582894 1864589 1729806 1684346 1673733
16933 1673733 1812511 2017541 1668248 1790029 1717879 1917681 2187516 1870816 1876531 2187127
16923 2187127 1677360 2160170 2135302 2188489 1909831 1907005 1947039 2077008 2298298 2108417
16913 2108417 2184883 2106604 2027909 2256792 2351031 2244694 1910054 1950939 2034949 2397879
16903 2397879 2284023 2320717 2437536 2377552 2412270 2477961 2329075 2594302 2304660 2309641
16893 2309641 2686699 2667888 2623057 2510425 2727940 2578645 2621291 3112444 2789392 2688105
16883 2688105 2428674 3110143 3253018 2929868 3060684 3051818 3014102 3172125 2935896 2971723
16873 2971723 3441765 3018142 3551702 3281944 3606849 3261618 3065688 3304756 3441136
16864 3441136 3575487 3508542 3539129 3747730 3544461 3905477 3942701 3767483 3816044 3728329
16854 3728329 3949186 3834854 4089937 4107150 4201747 4329778 4274920 4328168 4467614 4194198
16844 4194198 4408981 4598424 4451209 4622345 5137034 4880259 4821045 5214704 5222052 4929410
16834 4929410 5366471 5309366 5373160 5580654 5667006 5571426 5770490 5968234 6149218 6054492
16824 6054492 6287338 6378855 6354611 6053043 6577516 6657207 6732063 7252316 7236922 7400110
16814 7400110 7365722 7674518 7472103 7691198 7503544 8204102 8020434 8315274 8465561 8443725
16804 8443725 8603251 9027774 9132687 9647661 9582678 9591493 10001461 9881326 10556821 10974016
16794 10974016 10933710 11349331 11163376 11207242 11799621 12080884 12016946 12504258 12731234 13137134
16784 13137134 13489953 13631738 14021442 14574728 14799557 15184081 15484257 15927961 16445272
16775 16445272 16803516 17425884 17541188 18109500 18809203 18758624 19704404 19866049 20619960
16766 20619960 21456593 22337554 22818210 23132250 24186350 24832186 25346822 26129327 27274268
16757 27274268 28419097 29137463 29751593 30853678 31976236 32972240 34093527 35487534
16749 35487534 36899160 38163499 39492021 40573879 42329616 43825402 45453009 47245564
16741 47245564 49208108 51298808 53149324 54963942 57155581 59394877 61592730 64087135
16733 64087135 66574159 69125939 71692111 74429319 77574247 80600570 83046607 86272195
16725 86272195 89766057 92818322 96117071 99022821 102051323 105269737 108240345 111374569
16717 111374569 113775543 116821435 119060956 121531964 123203218 125305475 126798052 128064417
16709 128064417 128359743 129187137 128953273 128967659 128455210 127198761 125628373 124309744 122521525
16700 122521525 119943246 117583880 115314288 112540053 109448584 106570752 102915883 100116792
16692 100116792 97014043 93243267 90198520 87571321 84328397 81011844 78118358 75370963
16684 75370963 72357615 69710827 67283406 64351595 61977847 59755615 57406892 55150098
16676 55150098 52920763 51010305 49229033 47317245 45721803 43842936 42332082 40665354
16668 40665354 39557765 38092332 36551281 35469010 34122778 33011520 31953117 30762828
16660 30762828 29965736 28712742 28070813 27121950 26565424 25079206 24681414 23776027 22992056
16651 22992056 22461322 21722321 20882598 20309761 19775841 19432983 18632372 18324607 17656272
16642 17656272 17167321 16968605 16295419 15333100 15615979 15212496 14912959 14292300 14076964
16633 14076964 13637539 13731263 13351861 12377815 12655956 12271606 11835042 11696452 11285621
16624 11285621 11164172 10813007 10540933 10609254 10411860 10185333 9686716 9623656 9172808 9036587
16614 9036587 8894298 8843814 8775159 8604643 8500839 8308517 8146979 8092417 7384417 7471118
16604 7471118 7147869 7657470 7169047 7146858 6745025 6534661 6911190 6210409 6600217 6514308
16594 6514308 6313475 5869345 5945271 5963771 5722811 5832532 5529685 5273840 5243741 5150671
16584 5150671 4919868 5227306 5056960 5116614 4778360 4526526 4971002 4679256 4465286 4596363
16574 4596363 4388336 4407250 4427549 4245778 4335755 4128293 4048257 4114093 3886438 3374014
16564 3374014 3754391 3826105 3641545 3620154 3790881 3552123 3553888 3590921 3647475 3199296
16554 3199296 3321196 3314771 3396498 3448477 3125796 2930077 3177442 3239312 2965038 3020568
16544 3020568 3216841 2775921 2700436 2969823 2915743 2599780 3002183 2532122 2514196 2800456
16534 2800456 2970210 2584919 2552395 2494362 2351855 2458233 2391161 2565815 2883654 2509113
16524 2509113 2690189 2129700 2326041 2140265 2302371 2310892 2102111 2088021 2231357 2377744
16514 2377744 2224271 1972619 2128905 2159054 2292337 1935800 1957200 1806144 1916733 2003394
16504 2003394 1984938 2319854 1858916 1683815 1683168 2027259 1794598 2140367 1781722 1787849
16494 1787849 1432152 1921493 1750261 1558933 1983366 1623100 1726445 1670965 1809275 1944655
16484 1944655 1740540 1737047 1694477 1762867 1585573 1500930 1601588 1431505 1292254 1761216
16474 1761216 1409734 1532828 1542865 1438913 1424235 1437700 1522514 1445392 1450538 1521653 1484919
16463 1484919 1214338 1311163 1181704 1519467 1350881 1572328 1145159 1297975 1362648 1149804
16453 1149804 1186513 1197338 983743 1211695 1396071 1322471 1219661 1231490 1241072 1087704
16443 1087704 831844 1351807 913596 1088379 887407 1216455 1048045 1230519 1186434 833864
16433 833864 1190287 1066651 1223336 1060900 1207016 1184605 1073472 1016245 1283627 940891
16423 940891 721551 1293259 880600 1307099 1071408 1020734 886815 976242 857630 872733
16413 872733 776613 514407 704995 897235 788901 806101 858519 1108026 1063577 1003100
16403 1003100 1070611 649492 640690 932095 799774 777218 962085 822495 769524 660708
16393 660708 1118455 889224 667238 780966 904869 587805 809314 951962 570988 834507
16383 834507 627796 821500 766969 841786 877421 707679 904302 829016 573324 834763
16373 834763 661438 639314 598609 797243 632623 731712 628263 769477 656143 847051
16363 847051 583444 708149 611888 529598 516100 591169 785355 811153 708225 676493 797883
16352 797883 238917 705476 643567 380958 509298 669869 660199 727298 353171 460742
16342 460742 605492 772856 371195 331254 777774 569940 694249 381655 527539 367434
16332 367434 342855 698572 576394 845273 511956 739440 694759 484344 464315 593242
16322 593242 523912 348142 613543 553078 727435 483795 709740 538540 863574 542492
16312 542492 156312 1016573 737639 537079 411695 576450 477010 327540 560590 530138
16302 530138 693539 813002 375311 687518 117000 300696 566255 396625 727783 399052
16292 399052 312261 472241 618105 509943 327534 530781 447775 591092 629096 571212
16282 571212 545533 786756 418086 370829 495498 656332 454729 435982 62920 372089
16272 372089 469488 369630 163157 280768 523387 101381 261422 281461 212274 362480
16262 362480 -62311 476930 181835 722891 164152 593271 443183 298240 763467 136137
16251 123488 272790 200250 273756 381563 485484 345873 319069 148469 371239 290526
16241 290526 326104 385347 543794 354827 319847 -90967 492409 323571 441335 253969
16231 253969 236456 537412 457605 279717 434004 284186 268110 236117 428225 481807
16221 481807 531948 137013 18594 184518 353304 402670 251568 156404 382924 129926
16210 -56574 485746 466168 37468 292069 504908 757909 270909 290302 50065 363368
16200 363368 -94431 242131 520538 360454 323419 82579 479567 366326 125665 130651
16190 130651 293279 190730 219909 589978 129874 52545 15395 51611 351086 107994
16179 471410 208904 249930 337054 266582 325946 133836 172022 -57605 233014 71014 230353
16168 230353 314532 52432 146650 119908 -43989 154397 390208 323277 208544 -23622 456487
16156 322824 293007 215365 75791 -20013 -32732 172176 102400 404944 191366 129217 180445
16145 180445 347482 220370 272503 368832 142071 373528 240621 7118 187305 375537
16135 375537 346265 60676 203379 119538 -288130 233388 88183 338644 -109182 83469
16124 -6610 233583 123662 18859 328439 418213 203381 189359 138073 -48522 171714 378988
16113 378988 -402422 43188 255357 362681 18318 -15835 -57694 -268671 140800 230602
16103 230602 -24563 -323249 156049 -149337 50122 230599 54415 -75185 170466 -120594
16092 219246 387121 -204754 -211283 330532 -6491 -18495 315299 94064 52072 175904 141999
16081 141999 -29510 201525 313624 283226 211643 100733 284621 133582 117677 395322
16071 395322 183570 -11245 -55510 -120145 300250 111997 -30047 -10784 178875 145340 -122070
16059 75621 99699 -39555 -30670 164178 349468 157825 408866 107796 192244 47994 214413
16048 214413 -221287 367384 94876 409525 238039 -90455 203542 142280 -341186 416224
16037 -32701 144500 1168 50046 66365 86501 54861 -98851 136477 -343709 -71773 39706
16025 244672 -35359 -3483 -122597 343494 208959 199542 108436 60711 -148984 159031 317993
16014 317993 -61239 -295468 -256293 73015 183215 60829 105015 16912 -111550 -70101 138364
16002 -83472 131375 -16106 -65593 -106688 -79889 -55793 -182544 46195 242752 296582 19673
15990 -207389 -39779 225797 124691 169699 52211 -136713 191009 15004 222589 -187579
15979 395804 390295 139129 -177250 391842 203164 309050 264473 686500 785753 855146
15969 855146 938802 697208 710941 500277 397960 139264 670240 299348 441782 -153034
15958 -37805 97237 96767 145137 -203192 -55578 -63676 -51455 -200569 153692 46407 -158703
15946 -270473 64082 2542 110068 -274093 -223143 38280 -12112 -340474 -3770 -160309 -430511
15935 -430511 74687 -21873 35101 -6735 -55276 -278395 52682 -283182 -142778 86393 187947
15924 187947 91068 93396 259776 256400 -294380 -52349 184624 135118 -25579 -223316 24700
15912 -163828 -46170 317717 -210076 230872 -217714 131429 -422947 58125 -6849 -160365
15902 -160365 -149312 389110 -46164 -204684 279202 254371 -131406 -80934 95050 103917 -155036
15890 6512 -73322 -2185 80765 36864 -138115 284860 96125 90271 -273596 -267066 278135 -225337
15877 -185927 -343051 -253738 -196301 -219908 31338 314476 425419 -198410 -218429 -140243 117541
15865 2091 -209868 -127022 26837 -86283 -182582 -31532 164777 -251306 -54221 -52893 -24070
15853 150726 -130759 -467067 108932 241696 -224016 -18152 218963 294786 -17426 -229261
15843 -229261 335663 133959 49230 37995 -75448 16576 -92053 224013 184521 -331187 -145358
15831 -247039 105597 -17238 -6398 63748 -318559 335126 -243961 -196756 -60765 -43864 213594
15819 45449 90403 60778 -174955 -132113 -94583 -313646 88888 44075 145557 -64410 40187
15807 -33910 -96483 -94782 -153695 97638 -160106 207095 155655 -28910 -62711 202979 250609
15796 250609 -40870 -46018 131168 -183189 -305777 217726 86391 -288852 -229888 -26392 -373016
15785 -373016 -66999 -78781 -163242 130149 -169970 -491406 -167156 208011 -262079 68682
15774 91828 -8939 -194152 -275054 -9891 163674 199595 -111126 -222365 -55064 87062 69959
15763 69959 -298708 5727 223999 97497 281854 84423 -2251 -317834 -157695 -187681 231578
15751 111072 69944 -155656 -1461 -81447 164563 167530 -133663 -6793 327122 -315485 -215294
15740 -215294 -147431 234211 -110889 -27039 195563 172617 -108567 -193949 55437 -187786
15729 278736 298820 -88123 121363 -10163 -410465 123457 164583 -207371 -98114 175998
15718 -92872 -142913 -121662 -67954 -38036 -202506 27478 146752 -251570 -73487 -160080 186572
15706 -19108 104107 -338699 -34920 39388 -155858 63830 193094 157913 -253797 -346764 121201
15694 34666 257448 117573 111491 -213555 -106665 -169886 2160 328705 -80363 -163140 214540
15682 23378 73259 134734 -108108 -329386 -246556 -25247 -14863 256554 79614 -239851 134596
15670 -52754 -161790 -285605 -115220 -209723 -28039 59287 184060 -115922 287421 -45004
15659 21966 -184246 -149903 131897 -368100 56648 150365 120100 -179636 286791 -85642 20331
15647 69693 98426 -356393 -44225 -36447 63635 133511 66889 -1951 -75520 -93224 -109745 -29230
15634 322522 3073 -162763 27386 -17338 -100579 -268853 189203 -3653 122780 183354 53489
15622 -74556 -48031 -36168 1393 256522 -220126 -161465 37744 38074 -81381 177975 190448 -315316
15609 193063 -272814 109284 -157392 -196048 -471612 7547 38084 -27491 12443 13738 -6181
15597 -173187 82811 -111278 -126255 -88649 -147468 -29699 -57646 -145905 -82078 -65904 -77824
15586 -77824 -352338 -13255 -93257 119529 -2795 -350384 -2166 -70305 128587 221229 -292473
15574 202719 -44046 -184211 -79755 -211369 139384 -62572 131016 -83006 313804 -108858
15563 172643 123419 25184 -177599 -50767 286883 4263 73791 -147221 -3147 -32071 82462
15551 80878 -144084 87141 96972 179384 -162400 -24912 40197 -135216 -111475 -6876 34422
15539 -73408 -217736 -217756 301319 143470 -237127 -157355 44748 168631 167927 -244557 13417
15527 -194711 -446347 301491 33796 -264653 -159853 97621 55760 -16454 -269097 -182588
15517 -182588 -75276 42817 245137 267466 -41203 -93123 -27335 -63183 141963 -15759 367201
15505 242269 103978 438744 114572 -289153 190838 123501 410195 -59563 100623 397278
15495 397278 61563 115776 -80429 -112968 104422 207867 241859 409666 107579 172346 373004
15484 373004 38096 -11379 121812 -92393 61524 319250 182607 153380 276083 -48940 149579
15472 26468 -174423 173098 -75341 -112123 153329 148279 287971 135681 142112 455709 3665
15460 79644 445975 655851 348484 679971 537721 314670 -7901 -286223 -151228 268870
15449 99892 169747 -47305 -68281 -36349 214912 224998 191215 209011 200423 376306 -184641
15437 186098 -209132 41590 289828 91033 317622 30807 130324 153506 239969 370354 282703
15426 282703 890887 641050 921312 757744 437373 49364 49864 125051 228585 129868 198804
15415 198804 74070 76479 -46087 306693 34628 46666 -335535 203283 -50312 221278 -37476
15403 95138 -81766 -168348 -224783 -41005 90782 172936 117009 -10314 -179236 -206145 25453
15391 190418 220809 -429735 -365330 233581 158904 -30824 17617 -3757 -162563 216652 141974
15380 141974 304347 -77244 -79463 -18644 -162840 397871 -160361 -184493 -143395 155619 54302
15368 9682 -49613 147722 12920 -78083 -20890 -159508 57605 396787 123824 411770 92651
15356 418204 245755 29032 219237 210517 207204 395671 128301 132088 230242 687744 47853
15344 80173 10864 278880 2737 129214 445968 -22976 -141892 -65351 378474 22326 15585
15333 15585 137620 382093 -159739 29607 340128 178509 245435 364835 187154 103620
15323 103620 113611 241634 307658 142112 166580 -237919 174374 25253 103640 195726 171953
15312 171953 -13328 294655 26830 153852 47190 -146563 371843 51475 -75524 -159804 -238142
15301 -238142 355550 8812 150615 -878 349537 40995 113211 455571 302799 66463 131475
15290 131475 -26710 65540 -110236 154051 26742 261248 204817 -161840 -73390 80604 91717
15279 91717 -26738 143443 261031 220217 -88191 101428 -110819 140352 -116175 102879
15268 79512 -73144 207208 113109 50261 -105419 -162874 -115145 97724 53778 315334 229008
15257 229008 264725 295172 -109847 265411 -95331 321037 -144001 -398316 -52649 201745
15246 -129491 -236851 -221135 403350 -99718 -175015 256613 81941 -412516 141093 -167906
15235 133300 69190 27609 165850 368899 112907 231929 649545 831944 1853501 1273470
15225 1273470 1297666 1115115 910199 189993 160722 323126 309669 -307602 490583 79892
15214 97213 156840 14391 85368 174468 64101 14782 7377 -327268 464689 334493 6221
15202 196956 247353 18155 79813 151067 202795 193198 -300516 -187335 -319161 -137433 155308
15190 -210363 -139559 -84960 85556 76259 -120356 320796 249081 160155 270161 174611 -10011
15178 -298352 145259 -29249 23251 -73011 131048 361816 265698 -114452 -208438 -172829 119298
15166 9690 312651 -414 104341 -145435 318144 -110135 -5479 269862 -75065 22461 78797
15155 78797 94689 -231877 367979 153413 -56791 275624 179554 27335 257505 -86156 451154
15143 61472 -15203 177200 -309368 102332 291473 279031 39475 -105586 25744 181044
15133 181044 45960 -184641 -191555 279258 278741 131019 123507 135931 -23279 -233547 96931
15121 3756 303653 295704 -47632 436457 254671 23240 335404 180359 343316 42375 210379
15110 210379 -180129 197342 310141 211074 640939 175066 448335 699374 132254 578031
15100 578031 412682 52562 -128881 11235 64302 150433 -418 -64135 101855 99398 -144715
15088 -4003 44303 118421 -51065 -84315 315450 -9818 143240 205848 278072 8430 256724 250326
15076 250326 390261 244333 149896 229830 85031 199941 14183 106645 -1693 214770 110779
15065 110779 113086 -104909 -217152 334610 260384 132810 150602 104802 218713 228628 68160
15053 74224 -137653 85021 215532 129281 378318 93843 332563 589813 277754 98983
15042 456320 349232 186897 395520 242418 519215 73537 1234 504664 245419 258418
15032 258418 590353 261634 29645 150192 210274 326573 207943 356130 560094 470356
15022 470356 100026 374923 223564 435214 455094 257263 246391 375614 782168 462499
15012 462499 702977 555546 460860 393463 398810 545752 483077 457033 319233 450712 174549
15000 362243 442615 293699 245597 339465 275368 516164 348629 435784 387524 566046 444553
14989 444553 388260 554983 409203 360068 254512 544570 542295 497184 339666 486776
14979 486776 464641 427977 366279 555701 355610 432248 455595 349556 694552 494762
14969 494762 827684 607999 716856 762912 947481 630291 825603 747424 721270 457362
14959 457362 645476 797693 500916 706412 560275 761095 408850 660430 492468 385565
14949 385565 432754 90456 195100 302419 502619 403602 401826 80860 500807 365578 711893
14938 711893 552835 227808 255218 72480 165966 370875 43100 435713 109956 431969
14928 431969 638270 529236 596965 454135 536592 402716 371439 564840 391254 395430
14918 395430 329014 734425 1063945 758661 829569 1143062 1451982 1206625 1487118 1537140
14908 1537140 2021383 1546046 1020526 1454292 1248265 1719193 1588234 1945978 2019165 1444405
14898 1444405 1602743 1104147 1072462 799229 752114 511675 589726 281133 590689 910691
14888 910691 674346 495563 495682 438755 326157 385496 232002 392057 425613 456807 648470
14877 648470 391913 434719 465046 485743 515230 753117 782670 730415 830770 719505 722769
14866 722769 843188 750014 748680 1097957 757688 480301 162595 485436 745629 459100
14856 459100 364509 853872 548004 521148 568483 753390 621998 730051 699784 494829
14846 494829 204226 609749 863478 578680 635380 573537 404687 688279 694659 368889
14836 368889 546918 774852 564226 511489 728628 790765 321817 1068486 254582 910366
14826 910366 990208 975037 711114 878237 1098442 948993 778163 772584 729425 620967
14816 620967 530593 611856 629420 623791 573134 328899 700150 304154 718214 711027 685963
14805 685963 730124 629974 785109 872154 860078 268784 874232 695597 831473 709121
14795 709121 708977 925783 1050310 526667 427452 818155 698146 1091317 1331194 1104148
14785 1104148 550149 1029995 706517 558713 582708 507950 562858 399814 570814 604737
14775 604737 796349 563497 845524 520102 444434 739309 607214 827056 891604 715919
14765 715919 253175 566775 633600 944521 1054206 1089392 1024631 922860 901968 978742
14755 978742 719177 823909 562473 688695 932288 408778 531017 902254 665259 847470
14745 847470 1014108 736455 494841 975242 625557 308268 629393 734446 750561 541019
14735 541019 572160 692559 728225 642624 537083 387860 783747 712059 838928 756703
14725 756703 600941 764270 557982 511361 583700 944144 882511 1056786 1045730 788703
14715 788703 1003425 1449486 1386737 1449536 1765016 1489909 1235172 1362697 1357768 1303751
14705 1303751 1011187 1048089 1067698 884225 603181 753837 982238 1083248 768679 434806
14695 434806 711302 751952 778805 788155 1056147 1146275 1456776 1027067 1734746 1670956 1514984
14684 1514984 1794808 1607738 1028953 774787 1361869 1348652 1079762 1079587 650811 1316276
14674 1316276 880507 921783 901283 801519 1038559 651177 673599 933458 888378 969263
14664 969263 943002 1040379 1017633 1250511 394432 763910 1071287 1083240 748637 681176
14654 681176 1337049 1134804 946815 960437 1091542 1154400 978852 1348134 909322 1052371
14644 1052371 1207673 1201807 1417754 1047421 1253229 1060749 1581486 1262579 1496075 1509746
14634 1509746 1473441 1337545 1436646 1034728 1266061 1465655 992213 1278200 1332769 1322593
14624 1322593 995330 1160979 1131485 1217056 1185047 1233698 1011018 1257798 1307306 1191986
14614 1191986 1511836 1109728 1410657 1364443 1240603 1358580 1248312 1714449 1457505 1480713
14604 1480713 1232180 1403360 1676323 1542551 1271325 1639327 1423633 1828537 1741172 1673978
14594 1673978 1678418 1590057 1153792 1607027 1471481 1920314 1955588 1539259 1463153 1676931
14584 1676931 1738585 1420894 1700252 1514678 1451206 1557521 1575096 1307664 1812930 1583137
14574 1583137 1832422 1555166 1823113 1724132 1812725 1495285 1812455 1939768 1895235 1626732
14564 1626732 2301006 1926038 2239019 2033816 1786544 2072741 1797523 2183399 2091118 2098929
14554 2098929 1913216 2185582 2469150 2539737 2423907 2694753 2551138 2503650 2574232 2530109
14544 2530109 2991799 2998642 3397096 3793987 3923414 4150956 4982321 5160870 6299155 7481249
14534 7481249 10194520 13761389 20667256 32056660 31957584 17744503 10660686 6427429
14526 6427429 5144138 3982217 4145854 4852587 4396066 3483467 3015428 2620858 2718178
14517 2718178 2441469 2719042 2414570 2398511 2287281 2326403 2456939 2232245 2526320 2508249
14507 2508249 2217874 2500636 2607518 2809627 2579181 2391834 2847940 2739618 2589598
14498 2589598 2430388 2738795 2689856 2936199 2527480 2997383 2875510 2780791 2971798 3190021
14488 3190021 2930104 3074839 2892048 3190065 3387557 3193707 3519478 3461525 3236512 3230619
14478 3230619 3766070 3715374 3449075 3419307 3674668 3507497 3835602 3491004 3481941 3682033
14468 3682033 3643883 3779025 3759201 4026442 3811243 3983124 3918127 4020971 3970108 4081182
14458 4081182 4295488 4053625 4261450 4273960 4529260 4336447 4505893 4410517 4865825 4519920
14448 4519920 4766268 4627828 4889143 4747398 5010752 5004120 5148051 4823288 5310401 5157404
14438 5157404 5504714 5374421 5425721 5617266 5637738 5657635 5549593 5762542 5616114 5774735
14428 5774735 5663019 5922379 6453621 6449095 6118556 6196948 6154615 6441705 6576800 6586754
14418 6586754 6445073 6915030 6845177 7081954 6816726 7214932 7453202 7422713 7263417 8012360
14408 8012360 7537713 7799248 8168408 8079085 8289028 8788949 8488706 9011877 8896109 8869986
14398 8869986 8841481 8994762 8995041 9572495 9465271 9579122 9545999 10049282 9927024 10342906
14388 10342906 10331559 10568980 11046341 10831917 10800729 11193661 11080214 11370126 11556375 11640548
14378 11640548 11952994 12440801 12275468 12823685 12531545 13026500 13405546 13699017 13760674
14369 13760674 13872385 14177538 14394679 15002307 15102674 15523009 15890064 15935404 16386192
14360 16386192 16581147 16950538 17169906 17379883 17710844 18572521 18825627 18866364 19278654
14351 19278654 19878434 20261795 20934689 21444930 21651607 21796884 22368975 22900400 23260959
14342 23260959 23802893 24172876 25101936 25813371 26150740 26748336 27458960 28307968 28697651
14333 28697651 29425971 30497256 31373295 31487646 32641445 33595025 34599332 35340261 36414152
14324 36414152 37445798 38601818 39317891 40835013 42047982 43180906 44571264 46102011
14316 46102011 47323033 48629307 50469583 52299090 53816017 55711790 57992595 59675833
14308 59675833 61756107 64183009 66254167 68985424 71412828 74220701 76863221 80099528
14300 80099528 82978816 86634580 90053559 93925775 97891536 101932533 106567593 111134076
14292 111134076 116006525 121653656 127315482 133428376 139651566 146198182 153758225 160771193
14284 160771193 169088507 177448200 186384878 195789060 206100915 216836549 227761418
14277 227761418 239898689 252121116 265375414 279173879 293108805 307519958 321755794
14270 321755794 336450331 351039734 365411295 379424416 393011956 405143622 416579639
14263 416579639 426370504 435070930 442976966 449862318 455847576 459555890 461144181 461241071
14255 461241071 462028872 458650777 449992424 443160452 434790597 422195430 410971714 398904337
14247 398904337 384905024 371840011 357759129 343689963 329689560 316881044 303166286
14240 303166286 289504770 276349062 264242828 252404578 240898257 230211194 219202517
14233 219202517 208723157 197877443 187503625 178157938 169268439 161227648 153279234
14226 153279234 145842081 139043045 133032071 126905488 121387776 116244118 110885189 106288632
14218 106288632 101707369 97675327 94066118 90462209 86770667 83257409 79786140 77026143
14210 77026143 74390247 71589043 69190503 66318777 64229886 62296878 59981167 58046854
14202 58046854 56283135 54581690 52678187 51247047 49895600 48009334 46721764 45018098
14194 45018098 43954843 42419338 42180460 40892859 39475397 38610583 37429542 36230983
14186 36230983 35521749 34654731 33856973 32807043 31881870 30838877 30317897 29662434 28948932
14177 28948932 28116238 27197982 26671411 25897267 25580551 24890137 24596781 23723994 23404889
14168 23404889 22885216 22137166 22215146 21389744 20942056 20393044 19658316 19432888 18975797
14159 18975797 18725899 18226633 18037702 17639174 17234318 17135801 17046683 16409156 16176008 15839413
14149 15839413 15731539 15422932 14997855 14595286 14317782 14201060 14050562 13779397 13452659
14140 13452659 13295934 12865083 12839568 12829310 12408792 12079714 12017158 11880966 11234600 11403503
14130 11403503 11164054 10975265 11014390 10841447 10610365 10573646 10338083 10240326 9908431 9876636
14120 9876636 9721011 9533669 9348013 9068465 8769774 9126455 8826939 8663341 8934068
14111 8934068 8498388 8406968 8140679 8134854 8259795 7935500 7749629 7863825 7982318 7805928
14101 7805928 7779955 7193759 7293340 7119536 7086874 6907941 7338724 7253196 6534511 6567587
14091 6567587 6800757 6477306 6589613 6361879 6085832 5647567 6034357 6290145 5805443
14082 5805443 6064956 5939985 5779104 5441289 5420858 5538701 5310883 5333767 5231532 5553670
14072 5553670 5240353 5174103 5110855 5192325 5633569 4760694 4789881 5074840 4839638 4742519
14062 4742519 4840562 4493105 4527623 4557723 4482450 4688326 4329179 4390996 4241695 4238268 3954211
14051 3954211 4208340 4386060 4285155 4311364 4450370 4212872 4173904 4066078 3894812 3833912
14041 3833912 3844288 3843494 3828396 3847785 3785403 3422600 3652502 3565279 3720683 3740638 3799085
14030 3799085 3661913 3280991 3257399 3130705 3518589 3295855 3497197 3201958 2923559 3194529
14020 3194529 3056863 3004430 2979620 3051679 3565466 2929711 3292343 2967037 3131230 2770657
14010 2770657 2928832 2734572 2872932 2898058 2853120 2831616 2934413 2696007 2544521 2881708
14000 2881708 2607133 2416466 2437721 2523102 2359914 2368047 2383709 2746369 2197663 2392560
13990 2392560 2612163 2163393 2107616 2297979 2437532 2227673 2527316 2287240 2587861 2727025
13980 2727025 2884321 2951880 3271286 3628927 3871393 4758546 6279047 9321459 15272902
13971 15272902 26656541 34313481 21867671 14252174 9593561 7087533 5645756 4873508
13963 4873508 4283102 3846567 3574042 3439256 2999154 2832275 2763426 2761703 2855201 2693937
13953 2693937 2581955 2644704 2365423 2712863 2497174 2168569 2396277 2203414 2336546 2395547
13943 2395547 2050470 1969165 1920831 2040678 2356466 2141630 2035984 2060780 1748330 1926079
13933 1926079 1669545 1791289 1852649 1779177 1492653 1637297 1924084 1631542 1871191 2071855
13923 2071855 1866539 1793693 1672972 1915314 1651607 1710898 1685323 1527085 1512697 1813443
13913 1813443 1804807 1861438 1619168 1449908 1668529 1579824 1498021 1555938 1588114 1322170 1589531
13902 1589531 1648177 1564525 1494413 1378108 1617972 1627614 1443863 1496919 1740168 1292750
13892 1292750 1384540 1561042 1692452 1353728 935467 1473254 1531387 1561032 911140 1350312
13882 1350312 1388161 1099268 1278667 1638199 1369019 1256194 1400657 1627248 1129831 1193852
13872 1193852 1237224 1210358 1424069 1395586 1042489 1277679 1441323 1179106 1045339 1362003
13862 1362003 885002 1438212 1418258 1327243 1082100 1565477 999678 1407055 1033150 1322872
13852 1322872 1060056 1409261 1199354 1089049 1085775 1004121 1046691 1060456 974601 910454 1241841
13841 1241841 1048151 1107122 1355503 989530 814387 1087483 789033 1029248 1124478 1329413
13831 1329413 816744 886779 1153621 923944 1138904 1186201 853432 1038101 1068518 916021
13821 916021 916063 1146112 1005713 653963 706085 946103 1132131 791927 899918 887519 907086
13810 907086 896368 1024396 1100440 1173784 873871 900253 982953 971087 860344 1195431 1282269
13799 1282269 879746 734073 921644 907818 644902 902114 849522 826702 793857 687818
13789 687818 666397 968435 549987 518563 678852 983922 426341 720031 751898 1030372
13779 1030372 818800 941944 856513 684586 713900 706675 853531 939050 1053899 498182
13768 1036500 945430 775545 810123 891901 807697 1019920 819762 727490 867505 440621
13758 440621 453799 642252 655801 862398 629039 554271 1062552 382600 751710 768114
13748 768114 512360 329509 375491 569077 751210 248293 683981 264528 682170 799647
13738 799647 790616 734634 559718 898744 549812 793209 682989 900696 559012 629421
13728 629421 490072 601932 801182 471903 478367 503000 482414 545819 543331 783375 828133
13717 828133 775635 817480 444595 845318 798820 721588 430265 528760 530011 686711 687007
13706 687007 859705 395834 483342 713013 761771 367228 433656 723236 721206 394565
13696 394565 364214 755138 548763 452120 436413 231857 393500 381060 567242 579180
13686 579180 630167 661362 456402 557818 732607 264371 291150 457039 754350 426758
13676 426758 528471 392053 218018 209990 689413 679878 637230 482446 322527 464284
13666 464284 692404 452250 465441 402054 564845 484853 469736 678635 646930 760549
13656 760549 757728 519796 465542 388586 204100 251293 498627 240439 733821 841810
13646 841810 312684 522251 438599 351623 598489 500009 410755 297586 427709 342860
13636 342860 337875 837380 489974 574231 407006 384787 697717 623838 551840 645896 312251
13624 695210 689799 348449 434868 240582 143638 467887 566537 683208 508704 127736
13613 261020 451365 326699 521709 125769 538077 126674 507920 215214 458557 723866
13603 723866 331193 643167 216682 635346 448113 552650 409816 181767 167435 248286
13593 248286 132521 176720 564666 426478 428664 597759 293580 452935 430922 303913
13583 303913 540570 176650 398792 563180 871145 559286 432500 370872 267810 590004
13573 590004 139980 536293 252584 325479 173855 200456 285910 323360 364374 341273 377924
13562 377924 283725 232087 246642 244368 253235 279833 591482 341479 204853 101727 94825
13551 94825 411699 207197 191601 108831 316951 154727 233011 157800 510299 274434
13541 274434 404575 376109 200842 138626 148822 591853 729869 130407 293455 125616
13530 338990 251657 612239 340312 345253 615039 110449 213671 325995 436487 9717
13519 511204 293249 424774 278602 174424 100006 169260 587100 196637 322171 201906
13509 201906 96969 164602 250653 -87528 43632 308712 236436 251150 115577 669881 322165
13497 297314 107375 97389 182239 289795 200868 487739 278772 50985 406149 128077
13486 143503 457738 100370 539323 -23757 138724 261957 159563 447794 223223 222404
13476 222404 -67551 121262 120390 340811 140639 358478 36739 -100099 81701 272766 244215
13465 244215 327309 -29512 468129 49092 57311 217272 114833 340067 171799 15503 337004
13454 337004 185955 209763 189227 -171907 272656 121753 178795 37466 -26591 543632
13443 229313 279473 314809 245775 53984 139999 72893 137899 229268 340940 45978 94211
13432 94211 338395 69371 141895 133380 170372 4290 164744 357583 680776 290399 465134
13421 465134 175638 156253 242476 65767 229434 196724 171984 292368 512809 266660
13411 266660 107526 450908 235607 -59336 85627 96444 343939 -76634 172036 324646
13401 324646 126723 65075 12169 383854 336302 -3059 175900 334155 245159 316084 539575
13390 539575 412341 200919 272198 140310 189370 120107 23167 182460 291498 155626
13380 155626 260647 -25003 269091 411759 426088 285169 42207 12618 285185 86728
13369 153824 240534 316085 368554 140556 285113 427422 317650 187080 386277 471759
13359 471759 108429 173507 117063 -53084 257836 -7645 315609 156553 106740 161821 -135131
13347 456305 242519 180843 198962 367772 91007 119515 189183 221009 94600 28600 144748
13336 144748 154497 123020 -25557 185862 73649 188093 256096 172149 409658 135008 304885
13325 304885 197607 229798 213295 -12034 10009 138916 577522 440333 -33396 251437
13314 258757 326695 307440 447577 168285 146828 96081 252502 -63658 28253 116887 276298
13303 276298 -113171 381682 -47157 346609 -32589 -179955 364831 128930 350554 384697
13293 384697 271037 199488 309023 126227 34902 398474 -65631 -51190 208470 160410
13283 160410 47964 -124313 -8281 427685 290749 -203060 127401 -54412 373550 -63218
13272 80645 -99873 123272 88412 143616 26332 460104 250666 201899 25264 107850 -75273
13260 348700 269401 153951 -6212 151373 75954 -126062 231067 -43928 -131489 -69484 122624
13248 171533 169088 -149965 245876 27160 248732 170304 -97109 -36620 157489 171244 422452
13237 422452 279789 152177 323591 248322 -77201 -3662 444052 136948 -18178 233816
13226 89165 77036 158346 182467 147010 -473894 399161 242716 -66898 126654 185133 2360
13214 213067 131560 321040 68561 51216 90143 293531 127229 -75121 29528 384192 200006
13203 200006 -215133 63196 -109895 97355 -225669 69344 255577 9236 -71329 22130 400415
13192 400415 185496 171055 240047 337411 -100982 43228 132973 190958 166564 126040 73397
13181 73397 -74761 -38457 119889 241827 -118132 416411 162301 -31327 15989 127966
13171 127966 -73294 232827 83984 146318 30211 -99590 64606 269082 226863 -23544 175231
13159 209292 -90934 178289 15163 63889 323282 -323205 198457 -198265 249238 -73163
13148 -145712 24128 -115075 -25068 -29642 -174462 -30687 -512636 356216 247364 88650 -289298
13136 -9206 -17224 -284114 110274 -104603 -100896 13197 122008 184304 39822 -148715 49982
13124 -5700 32066 14701 -219037 -75151 171870 168613 117820 220017 -291740 -96221 -87492
13113 -87492 84773 92213 141471 -6455 116031 54253 50045 -304430 21855 -145207 381793
13101 314748 11571 -172235 -21577 228246 418320 116743 135026 250833 -66655 -74769 -106040
13090 -106040 -294352 174536 76579 107508 -105613 -64660 -9485 216946 113715 149334 140898
13079 140898 86055 73919 271355 483026 39560 219190 293523 -136718 -48889 -108733 -57503
13068 -57503 240163 75298 -68517 34444 -88782 -217864 -123464 97057 -284125 -183325 192087
13056 201331 -153589 128918 -175049 -73450 80541 -95493 162817 415018 -165264 -277542
13046 -277542 72193 282159 152888 -44559 -73526 208373 85269 64049 205704 68482 5338
13034 2048 416517 -55328 -3441 237648 246349 -14240 147808 163054 383093 108417 -110558
13022 61423 132281 -292110 302738 -19818 201667 -106883 73886 192025 116424 19092 10911
13011 10911 231850 -27612 -192782 242578 -38100 9715 -235602 -116259 -27134 339926 142082
12999 163720 282835 -169819 113958 236545 427038 103955 26667 120134 43751 37085
12989 37085 72146 168412 -123146 -237930 149487 -132460 69500 192315 306790 204660
12979 204660 125633 16137 -273851 205008 -244219 143276 373575 141509 107615 35517
12968 22675 70115 25482 167181 229776 263373 76972 16142 79706 -531 -8634 118114 -114256
12955 -100840 -18955 83081 177614 -49107 -106639 211213 227069 103149 92048 -5802 -197501
12944 -197501 278698 436579 -293690 162344 116918 173534 167130 -13341 248276 204727 -44416
12932 -48679 -149405 -4107 -12125 33637 -44045 359105 24552 42315 -151320 153462 -118581
12920 119668 -18301 191389 192860 -132155 -55483 -17961 -240412 40165 -171403 146644 -78782
12908 -227582 -67934 191847 91916 -165586 75734 55045 154191 313984 -92668 -79806 -214319
12897 -214319 323199 307667 37729 12328 -276874 -206672 10026 -25031 1459 90489 19745
12885 68836 -93529 -38399 -9635 -84150 56139 -158921 -31289 -269412 -76928 -235698 -108444
12873 -83816 28650 -43447 -93019 -84621 43402 116872 210101 -76033 16906 -130438 313222
12861 111359 -360109 -72168 26465 -279638 135743 -114028 242087 -124429 380983 57914
12850 26263 -8414 298652 189879 133848 -258168 -107473 -60772 -172696 212463 -74586 100276
12838 50506 352266 -64490 -114647 91228 123274 112609 197693 47927 79779 -210784 22340
12826 68220 -8425 113527 6306 208859 -119357 -44338 24889 -230172 16524 -207647 59250
12814 -106568 -155612 58935 207878 -71976 547533 91942 -277312 -283684 235766 -51883 400752
12802 396221 -57761 110651 -99341 8272 28640 75454 -60545 -66407 -322259 447614 -75405
12790 32792 219874 -138395 -162562 73604 -199096 -159217 -117429 40423 97019 -60949 66896
12778 72503 -37767 7124 274752 106204 -25749 -297704 43260 149308 -56965 140706 136179
12767 136179 -59613 -132453 122791 104014 -302197 -39742 76953 -64202 -397324 -2334 95534
12755 -53442 28701 35325 -144439 258570 107051 -60660 -166057 120067 166351 151216 -19596
12743 -27307 -131067 -223476 63491 -208930 112952 101083 -103192 51845 -52776 -344819 -177246
12732 -177246 -125551 77129 -253820 -115236 -120098 -78227 43138 -52735 -64618 -111450 153624
12720 -93430 426635 144839 15769 313095 -175184 -182612 149751 -18621 103523 105736 221222
12709 221222 41023 -89231 -217800 -225442 74656 -154460 -377850 229076 -8224 55130 -71343
12697 104330 -146807 -142277 144598 96488 194268 -69335 -57120 44978 295628 386517 253755
12686 253755 251227 -127495 -112914 -63047 69155 152862 104957 153805 -194438 196079 342907
12675 342907 -157770 387210 29487 -77718 102040 66933 18264 385502 -20836 89246 -8857
12663 62548 148217 75241 -193718 -65261 112545 -144282 23055 213967 280697 -6739 56496
12651 181855 189455 219409 -171248 185415 -107818 141596 330220 154802 68747 263427
12641 263427 170309 -116926 -98153 165819 -42711 -224849 237259 39140 -97032 -137975 75420
12629 -219149 272916 2493 -202734 96091 78781 76318 -39996 199178 213762 185860 94524
12618 94524 -168505 5075 67481 137991 175600 -32378 321139 -84863 232357 67118 -6471
12606 131460 89666 34942 128192 142072 90235 62307 -152313 -26279 249404 43767 -107338
12594 -70086 -73911 -9551 -254157 20807 77724 -13783 240701 10849 247186 -94425 -210523
12583 -210523 253393 31836 -117343 -129882 198786 98036 -90511 163263 18018 155899
12573 155899 -149942 15283 156499 72926 58018 -20206 58169 28856 73042 -330532 264725
12561 -134100 -9195 121609 2528 24076 -142035 165779 120877 -111650 230170 -119671 189958
12549 394555 -183671 210317 -199591 -195515 87000 -6662 260651 -4480 -48034 -348515 -102043
12537 -197291 187459 -401793 478463 -231071 -93921 123523 -208222 69450 -30374 -227531
12527 -227531 -33793 -35801 -269526 3702 146335 -153958 -152161 -51797 136650 8001 -75340
12515 -86234 -275116 68583 65444 -82310 -32227 -45686 285619 -83862 -149753 10324 -148285
12503 12168 -448723 3419 141261 122629 16881 368271 -84755 -123276 77667 -145946 -62662
12491 -156172 -75543 -88663 105271 213492 190897 114419 38351 -17981 -280123 25879 6157
12479 115097 94511 256633 144664 -465994 8252 -34116 -245454 423895 66613 114781 -135582
12467 -128591 15880 278211 -353862 -54111 -6934 -115628 -259993 -55174 46553 -87334 -146611
12456 -146611 49292 236886 63084 117915 -174323 5996 -130680 273725 161954 -72775 3785
12444 131565 159155 -47028 90695 -270811 26427 -264431 284657 112340 -267012 23085
12433 249296 -49701 -73715 -15963 78151 -81871 36474 -155742 -254000 -59270 -203696 -98236
12421 -190883 -311100 -121114 205350 -226758 -26559 -67149 -69498 227878 -98294 112134
12410 242263 25394 119041 -221136 64314 135413 230476 -121930 -103832 -121267 111017 46380
12398 -327876 -190474 207462 -124544 -66903 -31662 -70467 -29239 -5282 -279877 -123701 -98155
12387 -98155 333389 -249162 261847 -296799 58694 -213558 -143487 116831 225928 220871
12377 220871 15104 -155290 -72981 -116846 29503 48635 -34228 222752 -43767 -146869 67946
12365 95310 -12105 -30540 -114414 33203 -176474 121981 -312030 317223 207677 37912 89787
12354 89787 -52274 142658 83199 127008 -140522 -151909 -188961 -6481 180576 -231941 81540
12342 40990 -195486 -5714 -104967 188289 -189090 198710 -238014 233854 -70432 126433
12331 37428 196264 132757 -27259 -82584 67314 174977 -53351 -99518 -252990 184261 -64634
12319 118742 -102530 81037 147046 139425 23865 86006 6595 100798 360618 163875 81171
12307 73047 110639 319875 249636 306204 130199 128933 233529 199355 58497 112352 276525
12296 276525 -69708 122879 -56803 -110719 -115928 126782 261853 132693 -126656 278113
12285 316578 -92916 -162770 16590 -7819 -509662 -184719 32550 -69358 89850 32678 -212246
12273 -74156 19882 313332 289790 -95169 -69807 36324 209670 187401 -282107 60285 68655
12262 68655 208240 404231 -26190 138704 -129055 129100 -34521 224065 -163273 136444
12251 41038 162165 171832 97960 448386 304986 190125 -24667 435068 180302 -267487
12240 13559 62459 199302 -109158 149216 49005 107743 -139036 -20156 234754 209264 222383
12229 222383 84724 -103780 -16808 261905 302591 5883 156072 -141377 250177 8186 -18028
12217 325551 96969 -107535 75353 129227 458841 -332360 270949 79555 127220 62305 84270
12206 84270 29044 -156496 239866 217038 124478 135311 42514 194305 -52909 -135453 -13445
12194 285075 319662 111417 166776 29097 96334 -198064 198802 54573 361096 485611
12184 485611 188050 379717 151335 106730 161006 82677 11936 364320 -87064 299604
12173 -14360 343641 183258 311263 292691 253126 205613 -117417 -2698 -64550 98966 -20624
12161 72406 -37605 -13588 258541 116903 -63787 26824 131741 314538 -108302 179010
12150 109786 166958 134950 164591 374459 218308 197881 344547 146074 28004 98501 213707
12139 213707 -55167 334488 214846 34633 121678 -29209 -923 379955 -58439 343318 188810
12128 188810 102192 48010 -83393 185624 182316 122395 179450 254306 309349 136621 227703
12117 227703 236394 94999 -40649 -98089 353953 227591 -107053 -202126 104083 113783 -62526
12105 34792 175937 239388 305296 24972 162862 -12375 137261 72451 4356 78406 49968
12094 49968 250853 -177065 184809 -10586 237539 176783 -49890 74279 -8342 -222370 97673
12082 77854 160286 316543 151128 412364 -120209 131088 216706 26797 30314 -72044 103262
12070 4949 31246 108450 277213 228329 27375 -47319 -48859 250441 240932 -128835 142365
12058 252106 135548 8352 278055 188248 202312 99683 69890 101754 18329 198747 460988
12047 460988 -62740 -23930 305739 -134280 -108393 -100718 23789 23485 121022 45083 136206 -72308
12034 69772 -47393 58928 -22712 287261 458830 -11037 153525 93159 2098 103745 60708
12023 60708 -26349 241605 -219261 -201738 -66801 -86410 -69403 256274 -24517 -60932 125569
12011 142678 104890 -223246 -343304 107625 -86915 -133844 14437 22124 -215847 196852 29055
11999 -44054 1673 7555 -22715 -25975 197912 -141170 79109 64976 145135 255291 76238 -129314
11986 203720 15082 -449716 -10220 -17424 -206593 -121528 -36196 189247 30294 100814 211507
11975 211507 111332 -94353 -198281 -52570 -33922 -140965 9965 221402 290236 187156 -162438
11963 -64358 -110444 63469 45607 110915 3194 -94164 -90624 -163842 -9513 219037 199398 -114852
11950 -14290 -17280 -163466 -146689 -128299 -146570 -55534 -9151 267610 61087 129458 121976 57609
11937 90495 -131070 146725 -26903 -214441 203299 -223182 42475 8457 -58651 -68475 386905
11925 -194457 -222829 -145011 13513 84573 -178964 -250184 52466 -183961 21484 16076 -157294
11913 -131380 -91899 96772 91516 -72870 143248 187591 -183483 -31444 -186955 53197 167786
11902 167786 -63641 -62938 -57639 51846 14268 148066 -85125 38599 38860 98685 199922 103346
11890 103346 113568 238866 -180693 85831 39364 -24314 139269 -110696 -49271 83055 -8787
11878 25411 98044 -301064 -175540 -70334 -492355 -356101 95699 -207055 162245 -7096 -222967
11867 -222967 -22851 -143613 194085 -83166 379862 -102620 -227917 52959 -299600 87516
11856 -19840 11298 -148861 -61478 176625 -61388 344356 64519 -260423 -27915 45043 223681
11845 223681 231655 -225214 -320673 -173752 115353 -188351 -195225 87409 -44835 -276015 261318
11833 -174478 -52136 -192816 79294 -251983 75354 -173514 -302896 -188318 -124278 64073
11822 49224 -193468 100278 223685 -84437 -113837 132775 -225413 -57471 37833 71975 -126377
11810 -164899 -35996 -327009 -152682 -316215 -56235 -153748 -5857 -50397 -26407 43066 -319133
11798 23964 -1335 148201 -112270 -264108 -47511 103170 -229727 -239238 -138489 36229 -69539
11786 249239 -69668 29658 -207708 223907 19371 48824 -62783 -256264 -297159 -7244 -210608
11775 -210608 386003 -360515 -247535 -109920 -106194 6397 -155936 -4479 -264979 -41270 -156665
11764 -156665 369991 34522 -239790 -75521 88811 55877 58252 -145 180197 147505 154184 -210533
11751 -92657 -204072 -235087 -169639 -143920 370934 -375891 -141671 -113670 126216 45853 97437
11740 97437 128309 -220699 98695 -147894 67213 435538 -94660 39114 -12549 82413 -164082
11728 -188793 -160787 -155794 124422 -159506 -47066 173401 -199777 -67348 -36229 -72166 -142372
11717 -142372 249464 -186967 198153 14926 -416990 47856 -83133 192265 131248 95981
11707 95981 130298 279576 85227 438471 126105 43429 49125 121832 116551 1544 -16099 92338
11694 -166218 -494078 -2180 74913 103588 19034 -67513 268125 132095 -27697 62684 196424
11683 196424 50176 48305 145921 -99879 235720 -135952 -87074 69880 -85778 71621 47896
11672 47896 168463 70247 247389 -275026 323681 28503 176866 341090 77525 -284919
11661 -34389 -75348 218851 444103 285676 -109227 49808 163635 171825 -61523 48905 -144725
11649 149061 16700 -177651 81371 70999 -132422 -242029 213071 113717 -219657 -134009
11639 -134009 43245 248353 229733 79333 -171256 22123 5553 -113063 -92074 -2748 105975
11627 61234 19957 -84806 -81164 25793 -74619 337492 9888 -201102 -18910 -443401 255103
11615 -66089 -67698 459717 318866 -105690 -16776 -144890 86109 -89934 122998 114271 52531
11603 -40993 33505 -32719 -171412 32403 197135 -139095 31589 397248 209255 -457409
11592 197859 211928 79684 149978 190537 -1680 400809 177779 171932 259001 129751 -240994
11580 -30500 198291 44539 -4069 -172507 -355691 140725 360668 -38318 -56446 222091 -24591
11568 -95732 111120 227661 -31481 151367 18322 -319412 172088 467481 162566 118087
11558 118087 140965 80356 -182416 -38539 88180 -213803 -29651 -321424 361745 -84800 -53305
11547 -53305 24864 38377 65583 -169240 21459 -107463 -189929 -174822 -88285 -7571 298042
11535 -329362 43312 249084 218748 -136491 -51889 114194 68070 257609 364002 -42677
11524 -67906 148343 79047 8509 21754 107590 238281 265759 -96129 65616 184681 -174300
11512 67 -35043 184618 -207064 -269380 -28594 207575 260530 -45376 24139 92686 106972 -108514
11499 -167535 75505 -9785 -255793 485621 -51663 128028 293632 170339 -100887 93014
11488 -40501 -57288 106761 200155 12267 27976 -103789 -98233 -107807 85086 -35143 129830
11476 33602 209567 184808 107255 149792 56745 -123121 15578 157446 75 281562 -359846
11464 -55117 -328707 -109557 -71111 161070 -168311 223389 40724 293078 359230 297186
11454 297186 167438 123977 336399 152147 256617 -86191 -64923 142428 133448 48713 60115
11443 60115 -124565 260495 -61443 35959 16058 -77918 -65101 101660 -69631 -68523 49424
11431 353635 628296 -139059 251259 188396 50342 -57321 -120881 -198490 -352099 56217 274853
11420 274853 -187037 -243233 -88804 45015 118575 -123466 -77797 300260 203002 -76091 12675
11408 -241651 -203174 -124702 124032 -188614 3904 -75598 -406831 -53380 102903 -521874 -182109
11396 3910 43826 164035 180884 358661 -278388 -401494 40399 -155371 152277 211575 -47093
11384 -160410 -42593 65698 -54753 -232127 383749 319062 -39936 95243 223306 -4284 -57279
11373 -57279 -225441 -7045 -45023 191042 -125994 241385 -240753 40794 137070 -12746 128357
11361 221138 326765 -127595 60510 212935 148373 37496 53744 245536 -93783 -379050
11351 -379050 100496 -111973 -310099 -148724 100666 -218659 -202471 128130 -220709 130322
11340 -244634 -98125 -177502 158942 70478 -66939 93530 -194795 -114169 451127 -34755 75521
11328 63805 55915 -103824 -185808 -156942 164978 35298 -137121 31725 -116867 -143821 22271
11316 246415 -122697 182821 -205414 119566 -52692 302405 42184 11629 70655 -102820
11305 121462 148865 61608 -51011 -132145 -38515 -284018 15332 205265 2240 243914 361950
11294 361950 50335 -53496 -68713 132405 -60312 184736 272162 -133832 -31488 -32131 28611
11282 -27230 -88320 -378401 -169571 -54822 19977 212538 -161957 7763 -90133 136935 -152749
11270 -4329 -14674 258890 222664 119981 -56032 106253 178565 -49792 -12246 -108197 -368710
11259 -368710 -255922 133129 -404341 331263 49616 -46256 -79695 -38292 9142 -122817 157134
11247 -63454 -64161 -192410 -9863 -20468 16664 -353123 -183635 -120812 -169865 -11691 356985
11235 -93230 -146138 -10031 -117504 -208008 22869 -201918 70369 87516 -7323 -125118 194765
11223 -40565 -42795 82992 -589401 91299 -146171 -383604 88259 -129809 -134845 29055 119186
11212 119186 -131922 97336 -135578 29805 164957 5710 105317 -384472 -143596 -23812 177049
11200 1094 -202710 -311145 6325 16259 116257 239157 -304231 -134690 12084 -411840 -157988
11188 -197952 -56515 115239 -290282 -150279 187129 -78993 -89404 262442 206606 -239440
11177 -104482 -21333 -103914 -175393 121513 -147176 203959 -85942 13458 -119266 -56431 117830
11165 -1618 48080 -350192 207978 -266616 148596 -254479 -40589 116148 -44868 188324
11154 -176107 -217681 84451 -30898 -234370 121067 -62310 103164 -116167 -357804 -102935
11143 -222756 -3753 89819 -96953 -27979 -250464 -325002 -14964 136828 -179687 23295 -174934
11131 -85656 -298339 166163 -60371 -132130 260812 -190494 -201530 984 247384 91672 -10323
11119 161296 24944 388866 -55311 135071 -53815 319378 -116884 -18740 -301456 -25042
11108 4314 279406 -131931 314897 102573 -32991 131132 -132816 -74680 98275 275247
11098 275247 -82637 -105143 -156987 -53983 91669 83523 148746 114962 77840 -91389 29311 -106951
11085 -32650 -97654 -140757 -10111 240890 219537 277401 47827 -33149 -30084 34009 -84621 -146184
11073 -146184 -312001 138031 -34316 182023 98685 139047 352012 297023 36284 277916
11063 277916 242228 119695 253107 2361 252360 200820 -37097 85197 140258 400074 292691
11052 292691 308159 180205 350172 408726 429347 713929 344462 269895 45358 662741
11042 662741 63130 191701 612340 494916 585108 588317 568245 297774 613561 560322 696212
11031 696212 330117 94767 397647 848628 473207 496363 470251 821268 338874 809489
11021 809489 854887 600834 396287 553534 529074 683866 499916 805989 252450 252419 416718
11010 416718 467799 436665 533402 -4382 527088 355130 561921 809803 401420 506621
11000 506621 406516 661661 402715 415739 778871 398791 757212 628371 435836 534773
10990 534773 495541 193819 599136 84599 485001 560329 438176 232338 205643 313437
10980 313437 138322 481294 434875 305999 -32380 275437 393640 432328 568844 433131
10970 433131 652184 505157 632543 453593 700310 828165 792364 857023 660468 898686
10960 898686 904306 1228946 1036309 1458947 2077849 1566559 1966513 1556278 1945665 1936964
10950 1936964 1885433 1679222 1602810 1340990 1407363 1325765 1281829 1526179 1338612 1540201
10940 1540201 1514673 1361670 1475038 1447882 1476342 1249494 1409230 962877 1143124 778768
10930 778768 1020120 479646 9075 286471 455050 324568 608101 394945 418128 147081
10919 136153 218092 360637 96098 -37468 44710 192702 275289 51179 -103179 84304 219363
10908 219363 -87491 35727 -161182 -93851 154255 -89994 82957 93603 73544 50004 -19534
10896 -232718 -45033 122188 -30137 120871 -4120 108666 12714 121435 123536 127381 -156647
10884 135527 -39778 -276627 -159751 -20721 -87868 -95872 -122712 65073 98533 -260759 55154
10872 95711 363918 13427 -65213 -130969 -443453 101648 154316 -308308 277696 -103480
10861 -38179 120184 -225349 289585 24907 53549 47201 -239612 -396963 -6664 53767 -88363
10849 -134611 -25261 129797 -4664 -73571 47083 32308 -233619 58987 -344775 -180587 221558
10837 191351 -34655 159218 69803 -269935 146070 -98078 -63461 -40562 143030 -319499
10826 -210291 -68515 -103841 299208 -211062 -346608 114736 47560 -351945 -59518 188167
10815 565600 -176652 -18053 67862 78697 163344 133737 23406 118485 -309553 -135570 146043
10803 260961 -119677 213818 -279046 117583 -249832 -161789 -171869 -370368 67740 -135007
10792 -46350 -35707 -101432 107087 144473 -9259 4963 -182950 65616 65156 49395 43604 217603
10780 217603 42518 166119 321872 -143108 14309 -74808 143149 -205768 -108580 -89119
10770 -89119 -197711 208355 -185325 461144 425818 420778 -292113 159699 -67868 33799 -70624
10758 -203139 140015 -370045 54587 126584 -48889 -52550 -41184 -17910 -193338 -195930 -215320
10747 -215320 -166823 -274413 127663 -384616 -151503 -31934 -147975 -246407 159492 -73816
10736 -155232 93088 -128994 -67383 -56426 66882 -446596 11968 -188213 -28188 82894 -4790
10724 -247228 -121027 -143646 170486 -48550 198434 -85352 -484998 -185059 54001 -401751
10713 -68668 31539 258127 295068 24845 -371379 -270539 79990 -199257 -70522 -59958 100392
10701 -300997 -184616 99899 -37989 -39585 146803 -103904 -83837 -45726 -279369 -18173 -331439
10690 -331439 -166777 -218101 -210644 -22705 77180 -170411 -57605 -72833 -39333 -170351 -49683
10678 -47068 -57790 53424 92630 -117655 207209 -409415 -116242 -62777 -108679 -36197 -149283
10667 -149283 -212928 217 -24410 14366 -165409 -214576 -104927 -206405 -195857 -396886 -234804
10656 -234804 -30643 134609 -135100 -190836 -156216 -175069 -264130 40271 -267789 -15652 -10828
10645 -10828 -381357 -262453 5319 -197451 -95935 -122717 -72574 -51979 -87219 -356653 -103208
10633 136082 -25162 -394381 -187912 -141191 -135304 -54857 -139033 -203444 -51082 -373945 73001
10621 -89364 84807 137771 -169407 -43916 -100563 -91777 232170 -183427 -49515 -29654 -266444
10610 -266444 117913 -126904 -380995 39582 -162136 294787 -164837 -207854 -50360 -140778
10600 -140778 -39073 -340594 100214 -98034 139870 -2018 -186796 -210182 -275072 91298 -275299
10588 -200636 -86589 113573 -309841 114444 -45464 149401 -207170 107065 -299909 -50620
10577 -236974 273855 -21969 -14246 -60517 -35777 -299291 -208223 -292276 -184060 196911 -154689
10565 -73745 -222774 -471889 -568571 -316387 -129713 190251 -99513 249213 129837 -6384
10554 190821 -107760 83317 -204828 89685 -195139 -2089 109590 -383907 -177356 -102283
10544 -102283 111415 229463 -48194 -66144 -96790 139359 -66986 61463 -86839 13388 -277809
10532 -93064 178165 355344 -246924 28131 134136 24866 7899 -12348 -145646 256812 -110464
10520 -68031 -182871 -40624 -88647 222941 -79886 32264 -99357 -174356 -117873 43185 40679
10509 40679 21939 128882 89100 -187310 -102431 -103753 -321851 -40645 52052 256557 85840
10497 60573 -36878 -187399 -202803 44261 -24189 58753 -51974 49462 -3454 -551767 -146463
10485 -234757 52206 -228104 -190504 372707 192206 66885 -176341 80164 -21309 178337
10474 -88658 -18923 103826 -132347 131323 -17591 190228 79358 -90161 -6090 356977 -151473
10462 327014 334142 441817 296878 415494 146743 436193 289444 500715 41452 292113
10452 292113 29627 -338175 196994 115154 -84322 -124519 -112797 232060 -57294 -143408 1187
10440 -164382 95368 -89374 -126941 -247393 -270046 -12478 -129421 -64615 -123595 61306 -295484
10428 -210059 98637 -184202 -190166 -240663 13140 225152 109085 -207598 37563 -33530 73506
10416 18293 -19875 111487 59052 -223594 -60178 -117985 -208137 -125120 109766 10332 120329
10405 120329 155404 3213 87771 272612 -104272 -52741 -103695 -153195 -12072 -23236 98286
10393 -24396 1302 119213 -349198 -84358 82276 -161743 -132146 -152920 -413629 -8933 -516821
10382 -516821 -302410 145372 52585 49046 -205798 144532 104754 30002 -199779 125520
10371 161436 216851 -83147 -41069 249075 107014 -185072 -299348 -56403 13399 243471
10361 243471 316463 134267 99566 231718 452975 7028 94914 219308 98545 -30574 51637
10349 408796 388835 429868 341700 65495 218338 -251388 213652 147961 354717 211462
10339 211462 222265 387342 215069 -69812 98162 186899 438945 292102 98229 497885
10329 497885 -4353 132557 449108 379102 275716 210360 155140 52958 283689 63392 -129628
10317 176123 -41432 168653 184328 199113 98330 96353 264675 95032 223507 -131054 57427
10305 87492 -118369 93779 -123124 245577 428163 203914 -2701 350961 151069 -284200
10294 313969 151352 -89063 -24555 -101820 -522081 -187845 97119 61608 -84936 -60027 -119827
10283 -119827 -122748 161010 125706 -310984 -84164 -21197 -186663 23208 146128 118202 -206680
10271 -271734 -139695 -98891 -84485 199141 -178804 266595 -3158 -333269 119743 -169957
10260 72127 -123459 302662 -108892 9101 214268 450549 263862 -131018 160692 -55337
10249 84503 -81647 -102408 43144 -266818 169934 159199 -13344 102007 -213984 -13851 104807
10237 107339 -9347 189305 194087 74063 -16133 -253848 160547 158982 -391441 43053 -45661
10225 -333690 -130227 29319 -155462 327789 257193 -106986 352197 -249454 197742 105459
10215 105459 -404410 55880 120801 286935 178302 -289898 -58459 30374 145694 -109888
10204 366663 -96342 6924 110189 190237 -32693 -305315 116632 -184506 59971 -193404 -232563
10193 -232563 -121707 -293860 247824 11670 5550 203717 -117522 -94481 253739 133398
10183 133398 -128752 -197691 146695 -206733 172250 -38817 -185457 37252 -99145 126179
10172 -56800 106350 -236591 -41508 101666 -145652 -18086 178893 189325 -115517 -90885
10162 -90885 -189730 2921 68242 -138004 -266521 152278 117214 103007 -34400 -390506 -259374
10151 -259374 48142 71189 -310270 301789 177019 -154978 -232812 116535 -102979 30048
10140 134356 -392955 -307694 97011 42236 79282 -188910 -190220 -69337 -310671 -241844 26848
10128 -182359 -247052 -214870 -310970 156518 -197536 -37047 -189524 -70920 -122146 -62548 221006
10116 -295405 -56395 -201057 -200875 -178127 91757 -172181 29358 -3372 -50613 -297940 -88302
10104 -227247 55970 -240348 -179865 -52801 -57356 -327366 -229583 -102480 -54352 218523 -230445
10092 -57288 -244061 -192536 -144236 198196 81681 -207421 -1196 -115872 -180597 -142431 -32992
10080 -19401 -210114 -501671 -47524 -50390 94205 124182 55171 -72077 -30764 -246039 212522
10068 -34718 -297825 -141983 22973 314137 -215280 -215784 -61158 -49984 -207804 -213814 -165452
10057 -165452 20156 12390 115308 -321095 -109309 75959 -143681 -158950 43804 -202625 -162523
10046 -162523 -166273 -190408 -14480 65542 55090 196043 -13208 -60069 -57405 -124231 -276121
10035 -276121 85773 -89203 163655 59017 21210 -26855 -4532 -2076 -251960 -72448 55516
10023 -122683 -56034 1138 -36474 -86649 27060 -258752 2770 213528 59179 -289337 -21730
10011 -94958 90362 99306 -142697 14875 -36409 -89455 -78646 -136332 -398839 -385325 -14229
9999 127848 -181452 -307615 7254 -113708 20020 7212 -144270 -326823 -130124 -411939 -411508
9988 -411508 131779 -260001 -244395 86621 54870 -283466 164499 -113019 -191340 -180245 119376
9976 -198574 -68579 -5177 -95427 -125339 -143991 -27671 181654 113102 222531 123909 -73989
9964 90630 11557 38738 139688 -146470 -192708 -6447 -11514 240924 -103517 224192 -38811
9952 -49226 -185910 -144238 287004 -60125 -162822 171068 293246 226715 -104255 -285318
9942 -285318 -319004 -123203 339382 197193 -188466 -457120 -184911 -31622 -68226 90011
9931 96438 -442550 -55977 -156607 -5672 197253 150988 -44951 19835 -22917 -36938 -105388
9920 -105388 77239 -91170 -256007 -135344 -100324 -50665 -80143 -199038 -48749 -7975 -215558
9909 -215558 -73447 -166552 -303391 93539 54341 -11066 -100717 26893 -53318 142324 -355855
9897 -512413 223833 -37249 -163241 -215415 -273344 -40356 -128100 22153 7823 68406 229166
9886 229166 184655 53524 91411 -66631 28324 208492 188492 -151887 -141808 -37278 -205089
9875 -205089 -210874 48543 -169754 -87440 -138872 -168486 106455 -47276 -200303 -259499 -18818
9863 -88098 -181272 62624 -63541 76873 69011 83998 -322047 123235 -17208 25169 -147491
9851 -40174 -26215 -418864 -78685 -291393 -79006 -28678 163374 59205 151170 206297 -336366
9839 -123342 -228804 -181146 227440 -245657 -25270 180696 -323430 128210 -128750 63728
9828 -79118 -212380 -76926 62575 -244730 123905 -17559 -106026 65645 96261 -51691 -59684
9817 -59684 -49798 41382 -180135 -120713 -260340 49708 -296698 -237099 -164701 63815 -23774
9805 41536 -291170 46640 -187644 -130182 -192832 -186529 -149550 53940 213453 -101034 231875
9793 15170 -81644 88185 -157952 -161604 96364 -219083 -91594 -79023 79464 34815 38543 -345445
9780 -120985 -254852 267023 -180652 -187469 -113660 -96592 171418 -96061 123635 104641 34003
9768 -128830 -32874 -183625 -84690 -155929 -386341 -105172 -103500 -127493 -206652 -99518 -73046
9757 -73046 -2253 197848 -90402 122662 -253809 -290727 -327087 -602349 -94453 523 20052 -411307
9744 -102211 -13756 109858 -177316 341110 -140307 -248976 -297717 90732 -284025 -319569
9734 -319569 143996 -280449 -123737 -81993 19532 -152338 -165147 30239 -263196 -119263
9723 102286 -74447 -61081 -196371 130300 9771 8724 -182117 -212397 -121482 -47641 -45508 324181
9710 -261371 -47769 -203990 -164088 -144979 12534 -416364 -431656 -59017 -73651 -209655 -1669
9698 -370862 -92888 -124076 1634 61254 -300895 -120997 -240302 -355281 45644 -184871 -181782
9687 -181782 -23594 10187 -88025 -254486 -135199 -124076 -254489 242892 319576 92986 -59397
9675 -399398 121015 100350 -130204 -243279 -52227 -2705 -173751 -93759 -1638 327198 85300
9663 -220754 -99171 84134 -137655 -266068 360976 -44092 72389 263000 -150492 -169650 -468209
9652 -468209 -165984 48512 -14928 -142884 30495 13798 -130315 120128 26942 -242090 112027
9640 19772 208181 22666 -80841 -121913 -375875 200255 255832 256133 -32620 -44172 -170082
9629 -170082 121532 -246643 -184041 10656 -467 -54086 109337 156580 -53306 117519 -423744
9617 -161891 -391814 -252257 -318972 -177688 -178884 -7155 183483 -46916 -231239 -362759 -179830
9605 211745 -179176 -31643 -3236 80723 -78120 -12438 -983 -163325 193118 -208312 -90405
9593 72580 -207783 82846 -623982 -150018 292156 -505442 -26679 13763 67470 251917 -393408
9581 -204220 -92804 -212733 -37185 -27622 -79159 146915 -139315 125830 154720 -142691 227088
9569 256248 87777 -503818 275298 -356754 92776 8095 -244591 124939 -48621 51121 -52799
9557 265997 -20274 248415 -226667 -149497 -239433 -85405 -243510 317533 -361887 -42909 -30288
9546 -30288 59501 198500 -10769 -221886 -13579 128994 -318043 249694 -79095 -212856 -131684
9535 -131684 82157 1926 126091 201839 -283763 -22269 363363 461 -114098 -128771 -292569
9524 -292569 -280436 -127686 -159644 -412317 45497 -153995 -8456 -125582 -77953 191484 -107452
9512 95226 75151 76510 222010 -15502 -116863 -16099 -114908 -138881 -43629 -108604 -157082 -254867
9500 -254867 -128548 -346543 -151569 42451 -188049 -347255 -49477 -287302 -49399 -75058
9490 -75058 128680 167578 -50424 54876 -44548 -416560 271438 -135089 -151170 -20995 -210276
9479 -210276 -304727 191939 -19247 -465289 -295030 180774 11400 9674 -341333 -39649 -276219
9468 -276219 -98570 357099 -2744 -113296 -205514 130162 -376422 28104 -467322 114564 163155
9457 163155 -146642 -11586 15304 -478208 -257878 -65789 159356 -46574 -85934 -152166 110998
9445 -158611 -2675 -5101 193884 90532 -232193 2368 -297396 45626 -23546 308123 -137832
9433 -80079 -89279 -84041 -65914 -213918 94413 161984 -302992 54069 412421 -107705 -143743
9422 -143743 -172449 -90022 -5231 113828 108406 -39949 -255445 12407 -85877 -129429 -106589 307831
9409 -93822 -124774 -361314 -32193 136610 -35003 293761 -137165 304801 -213353 -28111 -9602
9397 109797 -86131 95763 -293268 135418 -62811 -27504 -143791 60147 -115562 -169905 222187
9385 140857 -35231 -209359 -270187 -161501 -212016 -43769 -279232 -128934 -107061 -331829 67720
9373 -32841 -119422 -181722 -70428 -8510 -3358 -58290 -64698 69215 351 -247318 -120769 -130230 -43594
9359 -273791 -173017 168137 -396832 175381 -1132 -115596 -96934 -105683 -31952 365222 78073
9347 -190352 -117749 -13273 47632 -279162 -481684 -226400 39550 -186903 45167 -120011 91447
9335 -364909 -251417 56892 -100838 -95746 -51003 -257971 46092 -34078 -139728 -109623 54852
9323 240105 -118707 -61533 -510483 62028 -185178 -66895 -56603 239007 -69422 -269303 -110538
9311 -107632 -73934 113498 150544 35000 4406 -52187 93282 -363247 233994 5142 283222
9300 283222 -109694 -390368 -146744 -72007 -169090 -188595 -128884 -17668 9725 -65209 -192935
9289 -192935 -327936 -259569 -23017 -387782 -19643 4226 86278 -133403 182503 -257979 -31488
9277 -168193 83359 -71894 -138568 -225396 41547 -16046 90588 -122988 319301 -140152 166671
9265 86898 -20208 109701 228317 287477 -15803 -65807 -179519 -188199 -234196 84133 -71599
9253 -78019 -67219 -97259 -510695 53560 190686 11812 -44376 -274800 311763 -345035 -197315
9242 -197315 -163463 -181024 -32128 -226062 -240978 89465 -20617 -188488 -26604 -56559 -277030
9231 -277030 -143780 -274486 186595 -42731 -183623 -144950 44814 -261297 10421 142072
9221 142072 -141506 -120598 -140524 -56592 150938 -71399 -396026 166081 -48362 -118779 -239372
9210 -239372 148088 -202868 106235 -192934 41173 34485 5701 -158445 156562 -63419 -51634
9199 -51634 34349 29112 -50630 -174851 22800 73512 -74904 -18728 20798 -340476 -162005
9187 -126344 -123644 149742 108901 -39230 -266430 166714 -299957 -169797 -40422 -174107 85427
9175 -276005 -71598 2812 149211 -60614 -57080 -298843 23765 -7413 -43100 251010 -54066 2305
9162 121964 -234681 -203949 -77923 -109097 39800 -184873 -87317 -165143 -64794 266971 24932
9150 -157426 24229 112445 -69623 -157745 6593 -149151 -1590 -75243 24287 -2079 -269816 233973
9137 -50206 17107 -75072 -130490 232682 -90595 71264 123012 -359448 -161219 254522 92869
9125 -81188 -382976 -59066 170905 2637 253727 120956 -28494 -104229 67260 -112095 64129
9113 105136 -24104 -212787 -55787 51950 52371 73305 -2082 -44434 -223390 -443523 -280190
9102 -280190 -47988 9786 -22986 -355182 -350771 67237 53936 -147577 2534 -195988 139193
9090 -139206 8772 -287114 -223307 -4191 77947 -170121 -69380 -347731 236735 -100462 220952
9078 273384 -55582 -140901 -183578 -77886 -260118 217489 -106521 -308018 -186410 -86125 -431859
9067 -431859 -25913 -31880 -267037 -245285 81861 67680 -80352 -100359 -98109 141300 -306679
9055 -142056 146 -246270 -362308 -144689 -170207 108034 196952 22800 -126896 60166 -221075
9043 16176 -346539 283574 42636 241200 -122815 -206338 -220624 2898 40608 37819 -254661
9031 -49571 -26018 -28477 38884 -66708 -196338 273189 150966 -58227 8554 -144396 -344755
9020 -344755 -205686 -10164 194386 195234 -36098 62607 -316838 -365666 -77123 -309622 255219
9008 101385 43736 -248280 -312458 -280515 -20358 -370570 262175 7490 -165575 -36208 -115406
8997 -115406 5189 -248735 38671 -161892 1485 -234932 175073 -170192 176863 -203702 204538
8985 -97210 -363442 -46494 -34345 48045 45601 -263832 -66025 -274322 132750 -87483 -209173
8974 -209173 31736 -87732 43024 104574 -87625 37666 228082 184188 206479 48934 -34373
8962 226756 118889 279085 210299 -446246 133965 -152045 -9439 -67760 -179144 -160605 5764
8950 -213928 -193407 133167 -110397 -345914 -37248 -125559 -79847 -137077 377369 210782 53617
8938 -299771 147486 -82623 -235463 94275 -172600 -302597 27303 -241371 -79646 222661
8927 35152 7017 -98173 186162 -215208 -148592 112896 -159374 2809 105564 -214823 148399
8915 272041 186128 259321 203022 -93336 151314 19951 328831 533779 500797 810152 2051409
8904 2051409 3642331 8442399 4242862 2122046 1193671 713422 242455 502532 -52287
8894 -284615 203809 284999 74904 -216779 44778 229311 -373844 220969 37064 13242 46156
8883 46156 -173927 192292 -163390 -93986 -46118 -29617 -326966 -297331 -67152 18579 -44551
8871 -42631 -104236 -389104 338668 -149679 99731 -111513 -125042 392441 -73316 75225 22214
8859 10442 112190 -62904 -26816 -327997 -18929 128358 -141773 52558 -112658 -10536 -49605
8848 -49605 -97186 307363 -16522 -124425 -294547 50777 -188520 -67671 -160722 57990 35557
8837 35557 -22691 -21235 16237 -261656 111539 -124479 -174931 190103 25684 -105617 -206830
8826 -206830 -315119 223190 44356 252528 -343539 56079 -115927 -44792 134184 -248692
8815 -2941 95034 -51281 -87373 136182 -26148 245640 -223250 -150719 -208978 119918 -75538
8803 -186597 -92415 -64393 -104902 -193915 152405 -213739 -219124 293878 -83846 213095 -325259
8791 -180440 82561 23102 357159 174905 -6345 -193462 -1095 -222531 202427 -85294 44485
8779 207663 54473 30205 104606 42942 -137320 -134895 114052 -319476 32983 36371 -1646 383878
8766 -225635 25609 32993 206850 -240408 134420 200259 -56688 -109869 -264550 -66946 86073
8754 158193 -300046 193253 -239827 14705 72370 258246 -159896 -25775 -77545 88362 1908
8742 -170336 210456 -159959 90114 -192726 -152707 -203344 -68748 -257660 -188768 280056 -172478
8730 -61735 -301902 -15396 167135 -166155 -219756 -245900 -147465 216398 -78700 81750 40073
8718 114744 -65515 -106547 -65482 -192561 -119933 -259802 -188656 -297394 -10440 40023 -250064
8706 -253237 70679 59336 -49249 72612 -243683 -69091 3628 -47842 157053 -275212 -64601
8694 -5005 -173787 256436 -85577 222157 -146073 -151086 -23411 59298 -230529 19076 -79781
8682 -313045 24638 -321228 1287 101862 38950 235423 76619 38944 159672 41444 -188909
8670 -252190 41467 139111 -12258 -56020 -18663 98989 318606 -46922 -190877 -13998 -223784
8659 -223784 -204048 -41794 -228711 -282496 88329 49183 92564 -173298 107170 -187887 -162623
8648 -162623 -133945 74925 -278940 -7325 -116197 75194 -80191 -133940 28693 -448 59680 -342144
8635 -7802 83935 -244405 128864 -508248 114943 -224056 -216791 -185500 144306 104230 -127097
8623 -60951 -173738 -15769 -126633 69699 322070 -18800 -140373 36639 136980 -172323 256610
8611 -20330 -350908 55566 215074 176283 54565 -546475 -3999 -130899 10432 303546 183759
8600 183759 -328096 -59416 -285685 -38585 5195 -3837 -379651 -65214 -41041 36580 -190799
8588 -138990 -82902 75773 -128481 -263766 -253464 -28387 -280652 -157902 -375921 159935
8577 135711 -278939 15347 59933 167172 -523967 -12873 99615 -284336 -95128 76398 12127
8565 -65791 -35914 -45326 202591 12838 -98149 72184 229154 -180416 -251849 249899 136969
8554 136969 -129937 30498 -95844 -159948 50587 190015 -11144 -228323 17092 73178 -364517
8542 23112 -266247 -297320 22055 -154126 -7013 81097 97578 321226 -258834 113121 141012
8531 141012 -110759 -62118 -266305 -274622 295436 94885 90782 91907 77676 89622 27443 235940
8519 235940 -205450 -163970 172461 -237369 130543 -130421 76144 -29936 -286847 271171
8508 -64856 70731 -427609 -177984 -321104 -323497 69835 283999 -217322 -133839 -42674 -162210
8497 -162210 151282 -279936 -299704 41576 109833 -82168 43981 -223171 -400360 -217690 121925
8485 -65908 -23050 -98558 202990 -65307 251247 -49541 13432 -197867 -182510 -188896 -224870
8474 -224870 276423 -208096 215332 -108522 198824 -59860 -302342 284259 -314561 41621
8463 -368910 66327 67069 -189749 107420 29807 -140987 -132914 37465 -126709 109079 165315
8452 165315 232174 -313969 -25738 -101899 37606 243779 -414936 56209 -353498 76381 -87721
8440 18250 186035 160407 -214188 -461410 -439471 -108670 -73623 168039 -202417 -96778 -114704
8429 -114704 -204808 81295 253009 -21578 -27955 -146137 -163796 -2011 -163501 -38808 329825
8417 -193239 124520 16270 187030 110669 31759 -58276 -95655 99968 -531907 338240 416046
8406 416046 37419 14597 -45276 -125858 37730 -199866 106612 -264702 63593 -320617 44723
8394 9543 2064 29058 -131650 -273949 66403 142645 -124330 -151903 1283 95162 -113627 -78676
8382 -78676 -176096 -207105 85213 -113436 -123873 99433 21499 -77850 27548 -435073 -62065
8370 -15464 64392 -149757 -217216 -151945 -164022 -139552 70581 56555 -152918 -84631 140665
8358 72536 -129464 -90692 -219 31583 151073 -56212 67380 145574 -135997 19005 -104538
8346 -75409 -284080 52756 263757 55089 -134908 22838 210593 -98106 -16742 -213849 -11531
8334 -153454 -64270 -230063 -144238 273359 -48205 174736 -33184 -61379 -334409 237347 134830
8323 134830 -285437 -15585 334441 6314 -115928 -443416 -37942 -18690 -153716 -94481 -107310
8312 -107310 169313 210530 41615 -121324 -24774 -382199 -75214 -163167 8783 21673 -73359
8300 321016 173454 258424 -330902 -4060 -133927 68791 -104402 63901 172916 -29235 9378
8288 365637 119638 49988 227006 148063 -47231 20378 -334385 -13187 -136292 -26273 43688
8276 -55121 79370 124309 -26882 -79419 134410 69035 -105368 259182 -66878 18904 -81506
8264 -84150 76072 -212549 -292148 -493784 -193833 -262762 -323336 86493 25023 -14849 -353140
8253 -353140 -41750 338499 -237759 -132173 -119687 -272093 32482 -12081 49388 -57436 91854
8241 165489 89603 -352307 -125035 97131 -174840 -196030 -124504 -15076 65937 4787 -323909
8229 -193470 243158 14646 75935 -297024 29744 -462860 -141437 20434 -120404 -186865 -28770
8217 -118201 133210 235116 120541 -307795 128091 -165693 -498225 175182 -16853 -30131
8207 -30131 316390 109146 -289234 -82138 -13808 -472700 -50540 -369319 -98714 79321 323223
8196 323223 -113903 113755 -202191 -155946 -82612 -259030 -12473 -253307 -273936 -206465 157094
8184 -90985 -54171 242425 238687 -271679 371251 13767 93656 55803 38895 216294 -155216
8172 -71149 104291 83039 320710 -209912 -167938 -308568 -350699 123926 -62443 -231905 108718
8160 77692 -87627 72777 191806 -22921 -17305 74966 -114319 240723 -274255 35223 55405
8149 55405 93531 -7547 45803 -60260 -174997 -71268 -311393 78516 -53398 -115892 -15611 5368
8136 73436 197779 -241044 -294989 -96150 159490 142026 -29132 -153674 -160158 -14932 -112034
8125 -112034 72414 36589 2556 -98686 -154448 114503 -172694 330209 325010 310126 -255533
8113 -15338 -128827 63146 -216498 -39980 306567 54563 -36933 46723 -201522 -433550 -5573
8101 -68147 192710 -19921 -211273 245090 -71504 -99907 41010 -223717 128318 -350570 181637
8089 -332092 416417 -274291 -240968 127434 -66600 -94711 100854 78502 82892 14421 -87889
8077 16355 -63847 -24521 -4468 -98806 -18894 -108437 -149111 -217634 -66063 160393 -24559 134752
8064 40759 -166644 -58866 -61557 -114871 -222699 155993 -100458 -108533 -53155 -12650 -384994
8053 -384994 365443 123904 257462 -15450 86808 7342 -96705 197420 -172143 157348 142895
8042 142895 175478 -3222 -113264 38104 -120837 -107653 -132374 179323 64598 -164565 -203070
8031 -203070 312689 -103827 231926 -147589 11897 -144817 -273976 -62577 -77016 -268853
8021 -268853 -230972 -228172 -218536 101322 -277241 77652 -45656 -354175 161801 -202009 -307023
8010 -307023 60411 -11426 216763 -103979 -120942 -81670 -202486 -96586 -439803 -221036 -67184
7998 -413367 -222042 -53717 -156608 -110907 -44262 56297 -277631 37192 1289 -250793 -58713
7986 322490 39743 -80404 -50502 182061 103048 -82419 97961 8284 -130216 -249314 -83198
7974 176853 59522 -226168 -97235 111103 -5922 -255606 91139 6480 101465 -4007 315877
7962 -99848 -53507 -185192 -75781 114599 -176611 -29469 -156813 -80560 -74838 114823 -105987
7950 -56770 -76923 -230042 -7007 -91875 -358898 -143871 -216757 28496 -132005 158230 -512850
7938 -134952 139267 31100 -6800 -194879 128208 -203107 27739 -253787 -30650 184941 -44252
7926 115872 -129212 -104863 -156968 62379 140159 -27848 -250139 319675 -258638 -291014 167395
7914 -331339 24487 -39056 9055 -295897 7350 -161750 -598400 122853 32649 -71505 -66248
7903 -66248 -43258 113395 67870 154341 281166 129440 -6314 209757 -95822 -184391 128206
7891 35192 -177067 27499 13049 166515 -146958 30396 57685 -525533 -76855 -54231 -110561
7880 -110561 28305 -35012 -277739 -336866 16413 -201377 -66883 -213174 -8792 83956 -275623
7868 -122665 118166 -75437 41675 -310266 27682 -145118 -238125 -52401 -187672 -280289 119258
7856 48760 134642 45938 -113206 233435 -283399 -227049 141022 -75892 -17942 247810 165233
7845 165233 -72898 -47132 49198 -104081 216188 -65035 127394 156646 111712 173312 16904
7833 -153208 139419 -59514 -177454 -124259 -108717 569 44123 -310638 204310 -47069 60698
7821 293422 -287327 -465489 155460 -55419 380580 -319676 -136055 -16000 -438123 -296139
7811 -296139 -124170 60027 -59497 -170942 387226 -341800 -120837 -81418 -217350 -106776
7800 -168912 -183719 -94639 -330145 -48100 -122013 160315 -128251 -82808 -21952 -63154 -70519
7789 -70519 -237643 -18765 162716 178545 -400463 -414055 -100055 184994 -53136 -59607 -93623
7778 -93623 -33767 -276716 -460953 -181985 190808 24185 -63873 -98850 75178 47807 64172
7767 64172 107633 19565 -243061 164756 -141574 209031 31649 -292206 -282498 249208 143703
7756 143703 -50619 5870 -152176 -87950 258575 -145844 -37571 -312399 158080 -244397 -407384
7745 -407384 220408 -134476 -138831 74190 -38376 -90992 96396 122659 -169566 -71502 -78128
7734 -78128 -772 -80377 -201017 126737 143749 52640 -145702 5918 190393 99274 101473 -197578
7721 -170338 239799 -61938 88929 85707 -15507 123036 -539 26847 166282 23784 75144 -195468
7708 -3480 -57332 -270561 -81222 -228907 -210276 92103 -120540 4269 94456 -300722 293200
7696 67619 267192 16814 -27910 -146126 -35595 265993 -208471 196627 23657 -141094 151714
7684 32190 -239004 -41553 -34317 -209708 232176 12701 -63028 -263310 -173679 -107048 153654
7672 -463195 -116877 26457 -96181 -127131 252622 -150445 122601 20573 228796 -130336
7661 146979 -76237 -306990 -161395 -231974 4216 -26343 154177 281828 -150905 133000 253647
7650 253647 -305821 46272 -27844 -44317 -64394 -57602 -373369 361414 -121228 23542 -202173
7638 -168017 -146584 283446 180998 132962 -170586 20563 172871 -230910 50785 100912 47766
7626 -184860 33814 39313 113105 -75985 2901 178260 258999 212222 -127726 -281632 -117081
7614 -110931 201191 -115749 -298631 333527 34741 437934 -34828 151364 -168595 166238
7603 -280450 -131530 282566 -256755 -207075 -78300 -64624 -242688 95351 93313 350525 -111580
7591 -423296 3376 26376 1100 -241149 -111649 -157135 11210 14103 113938 -185366 248489
7579 148032 -9404 106603 -265355 22347 -502178 -138893 -195917 305562 103105 129259 104906
7568 104906 -333363 -254161 -302363 -287123 88767 -172123 37684 11209 -68398 -39720 117158
7556 18711 -48873 299346 -193813 -240083 -188727 -80091 -76097 -117053 80385 40781 34236 221240
7544 221240 -122975 127019 159581 -40057 44021 149685 307244 -78353 -141334 110239 -13660
7532 -357143 142857 40951 113268 87589 70447 80716 -178040 -164002 227446 -205098 -802
7520 106821 -442416 175017 32979 92127 -235660 -124907 -585059 -266735 -37289 47122
7509 8030 -113822 -74816 174521 -193462 43117 166569 -135755 -47658 -283800 -37437 58095
7497 -30182 -437837 329300 -263507 -120824 11551 208552 -246880 407117 -173166 -69644
7486 35565 -217408 79884 160104 -134431 -269595 -339276 -132784 141046 -261922 80183 -13763
7474 89434 295581 15799 -32851 -113800 71739 -53484 189263 65980 91102 -173419 -243853
7463 -243853 34674 -53838 78823 167846 -104191 -156924 114678 -373223 134 60855 180023
7452 180023 55253 -124903 -76716 181047 -171159 1437 -151252 162052 83261 -34057 -30256
7441 -30256 173532 299110 125660 476017 1314 16478 104761 33970 -32369 72158 -136789
7429 -129314 118915 264758 7444 -332209 33946 52369 66399 -27170 60888 5809 -190117
7417 32177 -47539 77130 135031 -5726 172263 622980 -102079 13671 -136626 -22686 -131010
7406 -131010 -13159 220241 -149575 43868 -11373 170756 -119645 71269 279604 101598
7395 -75993 -286688 175594 5873 199789 168341 229601 -222685 42628 -262207 -131094 200507
7383 -270373 -260919 -319325 -78131 -29710 -48392 -202782 241805 185630 -166432 -392013 -35379
7371 -30551 -18311 39173 82799 101281 -278468 -44500 -49425 160638 -87351 27510 196847
7360 196847 -146838 172172 77075 -266633 28735 91125 89901 -42947 117740 -287744 99727
7348 131213 375547 -83566 3210 -82475 -147455 -116929 21429 -218680 -28303 88211 80738 87845
7336 87845 202640 -325654 196491 248439 -25468 -131295 -37693 -103266 -103189 48526 121665 103909
7324 103909 -161683 -87635 31755 232378 236924 -113185 75739 4481 240588 28816 -371244
7312 121773 -161054 -355692 129085 -54454 -38371 37042 -303091 -48006 -160293 -74609 84439
7300 -168670 -25676 -60384 294672 49240 -13872 -61195 -77281 -257747 -53750 132770 -142766
7288 67553 173340 -223537 -237480 135049 -134385 -197664 -48173 131557 -88523 92172 -252516
7276 66353 77118 -571575 205162 157891 80542 84595 -24750 359959 112038 -219929 -214797
7265 -214797 350475 -14387 -5859 -236139 119031 120036 253149 290622 377290 91240 -188370
7253 -115071 -199174 -138899 -39363 -150701 -184073 -53747 -90469 4274 -283227 -51734 -101734
7242 -101734 210084 -77214 -137676 -70113 32429 116174 -24495 113482 -212257 285218 -106976
7230 -71304 163874 -139668 -173495 -320359 -44105 149921 -623660 -161496 -62508 -93948 -41599
7218 -69811 42292 -226442 -326263 141569 261248 44869 -64872 -58626 160831 3762 -9733 218360
7205 -45252 135217 -20340 56734 -166332 -109612 -128891 -129069 91000 19210 140488 -220790
7193 332481 1283 -105087 -94604 -94808 -110401 62849 -148060 -36058 -99845 98973 -31983 -78639
7181 -78639 -173934 -174407 109879 845 -407547 -438773 -104692 -133520 68849 328260 58574 82760
7169 82760 -56562 -211834 -248162 230304 -207992 56423 84001 197461 60445 230970 -87319
7157 107106 -10569 48393 283868 -144442 -239476 -57156 250264 -237124 -146715 62385 -8731
7145 10226 -106586 63431 -60018 -133624 -61807 181615 259573 124744 24914 -229229 -108543
7133 -273399 29796 -67539 100038 -145279 50264 -230678 -289919 -275743 -38934 201944 151842
7122 151842 -14538 25189 -19384 -148280 44873 -272203 86872 129296 -226275 -170940 155985
7110 45106 -273816 -8448 -206066 -62906 2218 163950 -149313 6337 -263307 -90336 277159
7098 217548 -209435 -80408 -2443 -348652 -35335 -263927 -287327 -92783 -348137 70223 4845
7086 88682 -231909 -259395 -162982 162141 23828 37432 -98902 -70621 18898 141231 -198816
7074 84999 -29768 -232405 -63841 -31631 34435 -121984 -167155 9027 176106 55056 -34803
7062 36483 59763 184134 313691 44902 98063 98227 -96754 78878 -127765 -220666 -4801 -160016
7050 -160016 408998 45816 -249194 324290 -219445 170437 -89757 17173 22586 -173402 64906
7038 -33749 44162 129719 -145159 174589 19553 248220 76621 -263160 277643 190281 132418
7027 132418 -175497 169943 -242687 -161188 40473 149155 -165281 -114426 -357595 157427
7016 -80390 113462 -197103 -71126 -279676 83207 -17432 -73646 -135704 -35967 -20609 -167960
7005 -167960 99168 18753 22507 -177041 -195998 -256109 -178979 21254 -87915 -112351 -167343 -71015
6992 17896 122829 -4886 -224269 161218 -212524 -173603 -199619 -72264 -83743 -134183 -94391
6981 -94391 -89834 -57895 -252794 65070 216479 -88063 7025 -40932 182626 34201 -91451 -80429
6969 -80429 142362 70269 -53798 -18092 -138577 289307 175281 171296 302833 26467 -143099
6957 75532 295367 23714 -226033 -80947 -199759 283936 -108986 -255255 255786 -123034
6946 304295 -40553 21120 -151772 -88295 7830 266004 129049 -42705 28047 -65880 -1900
6934 106203 -85131 195768 -226429 -19275 -68911 -371817 79492 177066 -96587 137199 -47170
6922 -33529 81111 173209 -56250 273287 -156072 137198 -127620 39919 -18205 -57260 187
6910 96854 -343683 -212546 206033 -32501 12717 -88933 -233473 -174202 -39160 62927 -289342
6898 134027 -87052 -58662 -221980 -122807 58652 -75850 43562 251226 18357 -229716 -121060
6887 -121060 -168529 120619 -173007 -238899 107803 198746 50312 89465 -59334 8768 -136554
6875 34889 -2473 154602 -107414 238560 202862 -79275 115964 -71895 -266905 90662 -151788
6863 109257 -80168 50020 37738 -296616 82280 48375 44477 -206122 47748 -532063 166724
6851 -195533 70159 12061 -107827 -71759 -163443 -57270 8940 -347286 -155298 13414 17341
6840 17341 74452 -3224 36382 -5613 18275 1941 -202627 24813 420919 -95161 -237391 -76721
6827 -413064 -68602 -72333 123565 178704 -15263 81405 122431 -85802 -21450 -266970 -368508
6816 -368508 103341 -257287 323941 -51988 15769 80121 -63776 129779 233145 67691 -117526
6804 -97085 159638 152941 123386 -382360 -100796 127001 -194872 93821 193998 93268 -26362
6792 160736 -251309 -112248 166293 -139573 -19742 -99091 -149448 -124580 -167499 47807 136910
6781 136910 239719 -336924 74186 136103 33499 53613 -396696 19251 -2313 282450 288093
6770 288093 43025 -266238 -19979 92424 189487 -154666 130205 178970 -1147 -49589 -294414
6759 -294414 -362493 111251 203169 82686 -11021 -433755 70805 -346993 -59827 -283748 -123035
6747 -208278 -229933 31125 -269661 4707 18613 -136455 -225672 -151225 -86001 -78904 68609 372881
6735 372881 -286458 287414 -182984 -293223 52989 -194546 -45712 -268243 -94033 -127255
6725 -127255 100638 69688 -99509 283294 174201 -136472 32151 72298 -129591 -205394 22512
6713 163723 100773 -67369 -12463 -13178 72604 -240245 38691 -30308 264650 94847 344424
6702 344424 -387716 -316664 140967 -176482 521327 -23930 -277773 -199195 -17497 -291242
6692 -291242 194029 -353822 -183852 -46783 -302230 -1129 172366 -29174 69842 251376 113099
6680 91523 -2330 -30306 -241753 367770 -304422 87071 147761 -1097 -290798 -57756 196373
6668 152973 352794 -25645 59282 185600 -110447 -35940 -352089 308374 320724 171725
6658 171725 -21037 411085 -257554 -150375 -66050 -218312 54580 -16320 196942 -191506
6647 90769 -70994 45483 -29807 -85694 14758 -175314 70609 313258 -169256 207269 -33025
6635 138691 117385 -129992 -55556 -171250 278456 30314 -379790 2681 88568 -13235 205713
6623 -19000 68500 -196331 -328077 -8620 167039 175054 146293 -166587 260453 96170 -93747
6611 108686 273978 -67381 212657 -216374 -7937 -236094 24675 -5461 428619 110130 -491606
6599 103461 164068 -6923 -212169 -140076 -102425 93440 -7802 -274940 -226308 -269200 -33855 -224796
6587 -224796 18945 -83515 115915 -123740 -78482 -215720 21408 -62106 211274 -83430 -159038
6576 -159038 -40906 -191097 -325763 -46031 -230604 3427 -69422 46205 -209372 -76874 46857
6564 -325056 244010 144564 -60168 -146371 -90204 429948 248084 10198 62815 -107669 22572
6552 1739 -69052 50934 262884 270953 -199158 167678 -229330 -139105 -171315 204796 -49422
6540 45469 -216503 -52429 441380 -226523 53867 -155117 -209416 -244029 -49323 202546 -488399
6528 -205594 39011 -30714 218311 23596 -97270 -9889 141817 -4813 -35363 385153 -93009
6516 -225514 -17955 69041 154883 -292419 345972 -440249 -113096 -166975 177479 219870 -125359
6504 141084 -198643 -101852 27775 80102 -243876 38441 -234563 361395 114573 -96047 195879
6492 -147682 -20172 80051 -97156 -59529 -160964 -54314 -17296 210969 -221674 -160944 121857
6480 84463 -7875 228506 -11753 548743 7235 -179026 133220 90388 123504 9027 60931 -157749
6467 57072 73519 185815 -276916 -2284 228606 174487 274789 -5607 39781 18854 55405
6456 55405 149684 -124958 -350017 58709 -4926 -26874 48695 196632 -206201 -112431 -412783
6445 -412783 -48205 -1542 159254 -279681 327299 28411 172481 -356733 338769 -289415
6434 -199643 98635 -41084 90428 17044 -197145 -152864 92320 -272036 -63695 -197040 -53745
6422 45618 -67340 8823 -127474 126898 -68149 -159020 285877 217889 176414 -99393 -305450
6411 -305450 372443 -260016 55576 143341 58900 -11782 -84133 39911 272993 -66786 -51210
6400 -51210 -170082 -21534 26878 52352 -255160 -5002 -434848 195735 -207014 138168 103674
6389 103674 278330 261331 -165371 -187426 20216 104994 294323 150778 -26359 61267 -75799
6377 141594 142975 133922 -198820 -257049 91478 -121629 -86018 100363 112883 191503 -430664
6365 174077 -53149 130968 -115643 -23446 -84303 138683 158779 -353223 72000 -40483 -102715
6354 -102715 101976 -163598 -11964 333033 -367231 -59719 -91623 143992 29235 108089 -160978
6342 -52601 5143 -195299 -171690 -116731 60203 -3832 277622 -295763 11640 -118044 24930
6330 -111064 -227992 -198927 572098 -343147 -70819 52681 118456 -313402 151110 -30225 -228194
6319 -228194 24129 -5896 -62712 -18833 -214124 179389 -38516 -149370 49733 -356305 -390356
6308 -390356 126141 37847 -200939 -51403 94428 202217 14946 172583 230097 -159908 -359304
6297 -359304 288012 58667 -227592 258925 -35020 344988 -242482 37851 -320529 145130
6286 -217507 309533 -359503 272868 -26421 199016 -266542 -45838 -39688 52883 -161251 67991
6274 47387 148348 -164587 -80834 14777 122295 155063 -102943 63016 -96594 -82243 -179368
6263 -179368 -42662 161487 -161740 118274 264597 478781 -239842 202936 -112139 54898
6252 31536 -317465 48210 -8207 -41713 -347979 -351522 -38165 148468 -154411 233141 -254134
6240 62842 -389174 230900 148239 175218 92430 332705 -190142 7250 58033 -373208 -2943
6228 261271 107402 14794 181891 148827 185653 -214415 -327921 202198 -251376 -82243
6217 207864 -186517 238525 35411 -63854 118321 -69133 273591 153011 -177469 24877
6206 52841 139517 291418 49190 -35749 95370 168868 53465 218491 89474 74595 -12062
6194 174735 57638 -4650 -192473 245323 -80613 -174268 62135 52631 -64629 -284572 -361378
6183 -361378 20622 117899 167345 -112556 130711 158258 -5449 -144008 258809 -69944 260444
6171 -21272 218275 58439 -275070 -72395 -19296 -392527 53055 22352 -297584 -58407 156393
6159 -58375 -12785 96567 161984 -114803 48408 242541 -92042 -96802 124346 -40235 501273
6147 -260258 151780 -405450 197155 240239 -217969 -26954 -7737 -49865 -49819 108771 90228
6136 90228 -65194 84170 -121221 40045 -294460 21863 60400 -101957 -80300 132337 -16494
6124 366034 12674 -70713 41093 183790 275086 68122 22403 -222959 248145 -117507 -17519
6112 -389607 32863 91415 -3947 -193406 117239 -37775 -156661 -94778 -239700 -76408 -293773
6101 -293773 305418 -268674 -227386 -66088 -77047 -2200 -207350 366203 -283006 144536 -86964
6089 10644 98704 -102121 297032 -4928 -464 331046 46072 -270588 101566 -65792 206615
6077 -23303 58112 -96435 -149352 246891 79335 66575 176278 -268789 -173128 11475 -185255
6065 -60306 63938 -40341 387259 -84360 -437221 187461 -216927 95161 32742 179724 -57076
6053 25938 -178577 -269873 -264036 75004 192923 -163814 100508 -103273 -115766 -15894 -2895
6041 107974 -2794 -217912 -218180 320594 47071 -600 177367 -101069 337653 -100902 -102982 33178
6028 209965 59948 17812 114940 -65526 -453756 52135 139533 55602 463004 -10390 29897
6016 -171301 -155042 224192 -1950 165346 154094 -138134 -242635 -345648 -117581 -201244 -36574
6004 -51091 53402 119504 74818 77811 -207767 -239697 -308111 133305 91691 55278 -10088 -65824
5992 -65824 92000 18345 -201357 95749 16272 -8686 48520 52471 -7635 40640 -217276 -425350
5980 -425350 -89190 -175568 215068 -116920 -19740 -109253 -254945 -119565 -165711 -77963 -408116
5969 -408116 -195380 -55483 162511 126725 -233612 121584 -69621 267800 219993 -64263 31319
5957 -38651 -53008 -139932 36175 9320 -203195 -70585 -204891 -158589 -169929 -149593 -162890 79475
5944 -135490 109481 -145404 -135660 150257 58641 -231524 -3445 -240481 39857 -34015 -340097
5933 -340097 73395 174635 -47478 -53497 47341 -467212 -435862 -82090 76672 -100739 -4502
5921 80604 -117868 -386134 -279655 201251 39993 -68138 -166696 -20766 -166440 -207060 -271844
5910 -271844 173267 185740 -88824 -48437 -149472 -190892 236065 46247 57392 -64682 171926
5898 81141 -109450 137479 87411 -353040 -106863 -69515 17263 -135275 -225071 459570 250090
5887 250090 -166099 -301770 34649 -53307 -187077 231856 30141 -36922 -55319 -56356 -54598
5876 -54598 -43136 225524 -121218 20268 28292 -132920 339772 -67672 206562 -186372 111228
5864 -25824 16087 -287428 84005 33979 -53360 104788 -80581 52641 -59165 -35607 -119233
5853 -119233 120320 293927 70539 205788 -73189 64718 148710 211835 -21305 323866 220633
5842 220633 28123 -144885 139269 -100863 -160690 41923 285743 -90571 -256113 334407
5831 342867 170703 114411 -187 476158 -32687 -108187 -18656 -150961 -42171 26062 14805
5820 14805 210733 152681 -83852 204327 -134159 -140567 -28744 56695 -244939 -115825 -84819
5809 -84819 -365168 -33454 311619 -144541 119849 -163465 208163 -127591 -35656 235981
5798 41348 -58210 19962 208509 -47156 -103828 -138431 66652 -67132 90987 149773 -235258
5786 80495 -168147 -151945 101932 -75633 287447 -19076 161786 -240255 191278 -215426
5775 130431 -308112 -43575 70982 102878 -51952 17454 96446 -348970 -95563 -125998 -217999
5764 -217999 300918 -28966 -90868 144370 -137369 -223494 40180 58677 109359 -310517 12462
5752 202922 199017 -56722 14299 -9735 -6737 -148918 -431138 240793 308832 286096 -84563 -159726
5740 -159726 57489 -69121 -331130 -89087 -51915 -168102 -62396 47138 97648 -71609 -100406
5729 -100406 25912 -208323 23386 -250192 224901 98498 -120492 226265 107475 35721
5718 120006 -39007 55599 -13568 -338177 -107138 -8282 49703 -130304 148602 -108265 -312755
5707 -312755 57316 -51041 -306534 -138200 112671 -61940 -141119 10583 323090 -113428 148379
5695 98431 162822 111318 95267 349010 -269891 72389 82 118380 422603 -278787 -103666
5683 -249580 -177969 112576 145023 -184112 -5887 -133100 -92797 238728 -99858 364408 -214550
5671 236617 169132 102634 -94547 -104305 -103128 -4256 80037 234239 -127228 -225174 -37594 -300505
5659 -300505 -52697 186115 297868 -2074 -61629 -194267 -83376 179090 317381 140251 -135569
5647 -51965 268705 -163150 -44130 -101521 -174968 -141659 319945 50789 -376223 -422358 -165493
5635 363919 230153 -176815 -169244 -136996 1373 148628 53276 -100815 453749 237008 -211635
5623 122607 -103918 67122 207454 37712 5964 3551 -179740 -271760 107429 205181 -92151
5611 -113320 7930 38364 110436 19244 73349 278264 -102981 -269531 299243 119737 -284547
5599 -72186 91259 177303 -41326 -45820 -110324 106782 -376645 -154103 130248 154651 437507
5588 437507 -113017 -219184 15436 146432 -215921 145324 -110118 240493 -187621 15024
5577 -104603 120739 186264 117102 -189285 -332837 92870 160797 73288 46818 91065 52221
5566 52221 83353 97014 -35149 -118444 108904 58673 287671 -132282 158283 -85732 54568
5554 -37250 -96101 -109118 113354 28303 97346 122169 -16743 171658 -77225 63188 -31836
5542 202181 -400011 -231018 -122545 -261467 128032 -283993 25543 348127 178714 -264105
5531 -2367 61178 -4014 152768 -145265 -120809 455220 -256127 -239457 -90563 88720 3255 -166228
5518 188194 42433 -70891 -46878 165728 139546 -102977 145477 -228602 -14341 94062 180885
5507 180885 -32439 105815 79775 290590 222098 203225 119017 201544 -156931 -93748 -84291
5496 -84291 428018 111782 -79064 -52110 -153355 236693 -139850 -199523 -83545 -101701 51248
5484 -208228 -215191 12964 -289813 257842 312550 -165870 -126818 37313 4563 382158 210290
5473 210290 133292 20784 19940 -39611 207041 -247363 168384 -180170 81058 343677 -218539
5461 244866 115702 51435 17925 -10417 -187769 53349 7416 -198029 160510 -147991 120167
5449 -125825 -124057 213579 99770 46583 48292 182904 251879 51746 237489 -109297 -84780
5438 -84780 -238032 -129877 -36728 169185 -173351 140057 -149810 196381 -120411 279031
5427 3436 59884 -140016 222750 106971 100185 -137340 -8148 129510 -178981 41927 -428357
5415 -72507 137226 -27969 7165 -173314 52189 -52191 -183446 -24011 122932 95116 -36985
5403 660543 85068 -184463 -263603 175632 140878 -12093 307102 -80534 103619 -33287 -169032
5392 -169032 -11749 -65542 127 105819 -384376 3774 -102256 7009 -209168 166194 8427 137209
5380 137209 80687 -275006 196399 -90209 26735 31181 -147718 394894 65419 234601 -427689
5368 180349 -298959 -40132 64163 134131 19092 468798 70448 -9053 112669 115261 47134
5356 210789 219772 -298115 -184092 19696 -441751 54149 129861 85436 -194766 -22526 -76131
5345 -76131 -341492 64165 -167792 328305 58766 -62458 64331 3099 116432 -25801 100744
5333 117519 -169225 -35325 21541 123975 -267419 -317901 204012 37767 89817 -91323 -106222
5322 -106222 177494 -141620 -204775 -1036 72483 -23751 -204596 -172797 323119 -31874 11450
5310 171437 97292 -58280 32114 -17016 -33636 49974 -23867 35217 -86782 -202329 -130474
5299 -130474 -59743 -91815 -15349 153593 -50560 50005 49650 107668 -206833 163814 -234576
5287 28837 251841 -169352 295214 -18406 149394 -258358 57511 -89860 65526 123962 -45045
5275 -188360 -214778 -279482 -100718 302414 -126020 149234 -238652 -8250 -254811 145752
5264 -1796 290741 -55336 279535 -21400 -66742 -244348 65886 1724 106490 43355 74321
5253 74321 -60859 -85788 -244091 -147613 187961 -29948 -443 -26477 58329 174656 10817 117004
5241 117004 -4601 -42301 -89032 58065 143433 -59379 147310 43608 -17217 10322 156685
5230 156685 127736 -174207 184581 -107675 -187893 90236 -412499 -248552 6243 -157877 334948
5218 3450 -88998 -92105 -86021 -17820 -101875 -72293 -255605 286167 19185 62701 -5772 -181768
5206 -181768 309977 -127259 29214 -131897 36444 -118091 -50153 -55917 151513 204765 -36491
5194 89907 -97577 -111638 309434 159043 18696 -240348 -135628 235021 -16782 -13272 19006
5182 151414 330996 -98550 67514 -127621 -61209 110154 -378 -112945 -87107 35659 6190
5170 -161091 17872 -106034 64711 -88846 -26690 -60635 3398 159394 76562 192338 -176144
5158 2133 -244512 201408 -50891 -306801 148674 44986 47133 243671 -199578 76461 -47593
5146 -137507 -60736 -249676 -145158 249450 95902 -395190 -129718 346086 -257232 -504781
5136 -504781 77574 434004 -8152 155083 80610 -193778 -70152 -149897 56625 308052 56606
5124 -42890 -26198 -209570 -93371 196864 -152724 142802 -230345 -147453 116155 -112947
5113 -48309 213391 -109354 166304 164973 -106311 175660 -117762 -3824 29406 -67779 -36311
5102 -36311 104411 191760 -117539 -86094 -226075 -251332 -7733 171750 -75443 -120752 139317
5090 124483 164426 76634 45301 95132 253469 -63163 37742 317388 -202486 165356 -174927
5078 -144518 12321 158534 -106951 135706 -159339 -122078 35139 -136022 -139946 249911 -223490
5066 350952 46617 -77904 -48897 -177546 -8463 -140089 -247829 -135665 172378 155194 -213127
5054 15722 30929 43327 -34617 304128 150779 -44099 -179773 -23890 -59097 286956 53611
5042 -15814 210389 -11170 -253125 277241 -143554 -50759 153688 86404 -121313 -236486
5032 -236486 209165 -16374 -117026 111441 84582 -117067 -123513 129766 -24710 351849 239785
5021 239785 -227264 183801 37862 256442 523406 286023 75485 116142 221579 237482
5011 237482 86480 -44059 63849 75171 13616 35247 -134786 -114664 89028 -85812 -350787
5000 -350787 -2126 -153962 135535 12397 -16922 133039 -122817 312237 -166494 119365
4989 -134334 -149696 53491 -417359 -132918 -139358 64611 -191674 -213748 134385 332509 -89730
4977 371207 107924 174459 -65311 152104 23512 -60943 75483 -227852 -148201 67325 -243782
4965 56232 7267 -71132 -4611 -117170 153178 -99395 398794 194767 252907 187822 42724
4953 -318095 417226 -170753 -134885 -317574 42088 -40362 87816 -352809 -78572 -308418 134284
4941 -166281 166294 201863 -11264 108677 153071 30359 55415 -345495 -67536 70796 57477
4930 57477 257870 -20849 218844 63850 -39407 -20092 168987 -76719 -241057 21371 -140772
4918 52565 15720 428159 201215 -301388 103822 19165 -152644 89031 -193258 280461
4907 186277 114617 241748 173076 278217 109367 41430 316457 -253397 124789 -53047
4896 -71245 84994 -147732 211790 64126 -38581 -136265 -108617 69405 33258 207110 -183284
4884 -207446 19040 103763 -1103 -232268 138051 12389 -80110 -180686 182035 -43973 59022
4872 1871 -186998 86483 42808 -48780 388645 -415315 116318 56956 -13290 -461219 -8049
4860 301297 -57552 -111156 127890 228758 -48540 468327 -339815 100844 -65676 -211038
4850 -211038 -79271 -43543 63049 -89007 -37795 -69069 371550 229299 -182896 -205409 156299
4838 273068 127603 28605 -88818 68626 -276268 -11361 -331057 -187875 166615 15475 -305740
4826 13890 6857 -265742 126270 74056 -42291 145831 9263 262660 171296 401978 -225714
4814 2697 -103595 -88759 177195 -211761 348636 205626 -106804 -242185 -172758 -293937
4804 -293937 142716 -117153 -181947 -173550 121542 -169332 -19600 19050 -30612 92728 84184
4793 84184 13049 131855 10632 170545 63995 -8620 -48633 -48791 64698 267576 296101 42760
4780 387943 276034 -4820 -101066 136430 -2312 -171622 -227086 150551 7979 -314210 -244306
4769 -244306 142142 -33749 -85007 283275 -267005 -3015 -37985 186509 383895 142866 145932
4758 145932 -225998 107444 -189434 134856 367504 136647 -271606 -102838 6412 127739
4748 127739 51303 -4621 154813 259916 -78827 -19301 -99510 -35150 -86847 -27677 -75785
4737 -75785 -112113 64509 92735 -101860 79406 285345 -154754 255341 44063 111132 12819
4725 -58063 -174533 -66020 237978 204675 -76360 29803 29874 87849 -211226 -77689 -159754 -132303
4713 -132303 72243 317363 146828 148475 -184291 -39233 -188286 22830 12962 -181628 97941
4701 -232484 12488 182211 -91029 -202547 93816 28569 40074 46940 134789 -12185 22830
4689 -19172 -19520 -362245 -208269 5086 85031 -72621 -121020 4670 66608 102132 -119259 -28181
4676 -146921 36802 -64938 17885 210202 26012 -4599 -89603 27117 -62380 -64470 -95485 -341243
4664 -341243 -157056 205996 369998 279819 -149973 -176348 10539 -44753 -56702 196065 -55985
4652 138836 -66543 56735 134052 225653 -172848 123779 141409 -59521 -363251 69912 -97791
4640 -31507 -60924 238862 302393 211585 235863 -64640 167094 102702 -17523 250000 -165215
4628 -1009 57039 -148477 96150 -397857 -109794 -24469 -223489 46747 -201751 49698 133995
4617 133995 -452466 95104 30987 106606 -28615 66379 77039 78117 19272 65358 215912
4606 215912 8395 -89209 205034 -179553 289038 130414 158472 40722 -141739 247212 174710
4595 174710 -76586 37498 -96061 562038 153106 250119 -223113 -92333 -216509 -502820 52839
4583 -56107 -259968 -158260 -182145 49419 26115 -74377 68954 -58987 6510 1457 159559 51567
4570 263967 117891 -28823 -167327 83335 -286057 -172109 316020 -48197 170439 -139479
4559 -437 104496 47102 82096 20144 -122858 -54515 -191698 60025 37632 -57123 23476 -19802
4546 -61959 135531 -171757 -100700 98389 -126885 100436 14996 -150672 -23648 288359 24172
4534 -5667 -16716 -9841 -136721 126910 -32210 -163089 -308032 -86251 -223845 -93333 169618
4522 84531 -135302 195660 98194 107401 392877 115001 90865 -1511 -179706 -78839 -90418
4511 -90418 71643 -118866 -210085 84770 235365 173172 -196080 76198 155861 -19388 271968
4499 -87596 285229 -100184 -91276 161217 -28497 -201456 -71704 306196 28505 135718 -125586
4487 -32722 50453 256146 -98355 -34216 -198271 -81907 -71588 -10263 327152 -147055 -31687
4475 -258549 -133435 -74545 -161731 -168624 68670 222890 -161248 155414 261306 -109229 -106965
4464 -106965 314388 -18981 -55534 -284509 596113 6011 162036 46499 -144645 211188 -85580
$$ [...]
##END NTUPLES=NMR SPECTRUM
##END=
