
##TITLE=AC1212_MSMAH12043_5946067_dS4KgYYhX7
##JCAMPDX= 6.0         $$ Bruker NMR JCAMP-DX V2.0
##DATA TYPE= NMR SPECTRUM
##DATA CLASS= NTUPLES
##ORIGIN= BRUKER
##OWNER= Administrator
$$ 1.72 TOPSPIN		Version 2.1
$$ 2012-04-10 20:43:57.765 -0500  Administrator@TOPSPIN
$$ Compression mode = diff/dup
##.OBSERVE FREQUENCY= 400.13188235
##.OBSERVE NUCLEUS= ^1H
##.ACQUISITION MODE= SIMULTANEOUS (DQD)
##.ACQUISITION SCHEME= undefined
##.AVERAGES= 64
##.DIGITISER RES= 22
##SPECTROMETER/DATA SYSTEM= spect
##.PULSE SEQUENCE= noesygpps1d.comp
##.SOLVENT NAME= COFFEE_meoh
##.SHIFT REFERENCE= INTERNAL, COFFEE_meoh, 1, 14.96841
##AUDIT TRAIL= $$ (NUMBER, WHEN, WHO, WHERE, PROCESS, VERSION, WHAT)
$$ ##TITLE= Audit trail, TOPSPIN		Version 2.1
$$ ##JCAMPDX= 5.01
$$ ##ORIGIN= Bruker BioSpin GmbH
$$ ##OWNER= Administrator
$$ $$ C:\Bruker\TOPSPIN/data/COFFEE/nmr/AC1212_MSMAH12043_5946067_dS4KgYYhX7/12/pdata/1/auditp.txt
$$ ##AUDIT TRAIL=  $$ (NUMBER, WHEN, WHO, WHERE, PROCESS, VERSION, WHAT)
(   1,<2012-04-10 20:43:52.328 -0500>,<Administrator>,<TOPSPIN>,<go>,<TOPSPIN 2.1>,
      <created by zg
	started at 2012-04-10 20:32:20.765 -0500,
	POWCHK enabled, PULCHK disabled,
       configuration hash MD5:
       1A 1E CE 29 27 FD 77 03 67 4E F0 E3 C4 B2 CB 90
       data hash MD5: 64K
       BC 84 97 31 A8 5B 6B B4 98 90 03 10 7F 66 65 31>)
(   2,<2012-04-10 20:43:55.312 -0500>,<Administrator>,<TOPSPIN>,<proc1d>,<TOPSPIN 2.1>,
      <Start of raw data processing
       efp LB = 0.3 FT_mod = 6 PKNL = 1 PHC0 = 0 PHC1 = 0 SI = 128K 
       data hash MD5: 128K
       51 2C DF 53 17 76 87 53 5B 52 D2 98 C6 9B A8 03>)
(   3,<2012-04-10 20:43:56.453 -0500>,<Administrator>,<TOPSPIN>,<proc1d>,<TOPSPIN 2.1>,
      <pk PHC0 = 31.99219 PHC1 = 0 
       data hash MD5: 128K
       0B 97 B0 66 3C 60 6B 61 99 2F 2D 68 A0 5E 12 B9>)
(   4,<2012-04-10 20:43:57.390 -0500>,<Administrator>,<TOPSPIN>,<proc1d>,<TOPSPIN 2.1>,
      <abs ABSG = 1 
       data hash MD5: 128K
       A9 AA 8E B2 0D 95 FD 90 4B 4E 5F 74 E9 FA D8 C0>)
(   5,<2012-04-10 20:43:57.468 -0500>,<Administrator>,<TOPSPIN>,<proc1d>,<TOPSPIN 2.1>,
      <abs ABSG = 2 
       data hash MD5: 128K
       0D 1B 28 DB 4E 67 D7 A8 AA 9E C3 AD C5 AE 57 1F>)
(   6,<2012-04-10 20:43:57.546 -0500>,<Administrator>,<TOPSPIN>,<proc1d>,<TOPSPIN 2.1>,
      <abs ABSG = 3 
       data hash MD5: 128K
       35 FE 5E 37 E9 17 2C 78 AC 25 92 80 8C B8 34 DB>)
(   7,<2012-04-10 20:43:57.609 -0500>,<Administrator>,<TOPSPIN>,<proc1d>,<TOPSPIN 2.1>,
      <abs ABSG = 4 
       data hash MD5: 128K
       60 F9 8A C0 7F 43 F4 56 F4 22 3D DB DB 3F 4E A7>)
(   8,<2012-04-10 20:43:57.671 -0500>,<Administrator>,<TOPSPIN>,<proc1d>,<TOPSPIN 2.1>,
      <abs ABSG = 5 
       data hash MD5: 128K
       04 2B F0 79 DE AB 9E DF BF A9 76 B6 15 A5 FD 79>)
$$ ##END=
$$ 
$$ $$ hash MD5
$$ $$ 5A 5F 7B 2E C7 92 5D B6 44 F7 C4 C6 85 94 24 18
##$RELAX= 
##$RELAX= 
##$RELAX= 
##$RELAX= 
##$RELAX= 
##$RELAX= 
##$RELAX= 
##$RELAX= 
$$ Bruker specific parameters
$$ [...]
##$TP07= 0
##$TPNAME0= <>
##$TPNAME1= <>
##$TPNAME2= <>
##$TPNAME3= <>
##$TPNAME4= <>
##$TPNAME5= <>
##$TPNAME6= <>
##$TPNAME7= <>
##$TPOAL= (0..7)
0.5 0.5 0.5 0.5 0.5 0.5 0.5 0.5
##$TPOFFS= (0..7)
0 0 0 0 0 0 0 0
##$TUNHIN= 0
##$TUNHOUT= 0
##$TUNXOUT= 0
##$USERA1= <user>
##$USERA2= <user>
##$USERA3= <user>
##$USERA4= <user>
##$USERA5= <user>
##$V9= 5
##$VALIST= <valist>
##$VCLIST= <CCCCCCCCCCCCCCC>
##$VD= 0
##$VDLIST= <DDDDDDDDDDDDDDD>
##$VPLIST= <PPPPPPPPPPPPPPP>
##$VTLIST= <TTTTTTTTTTTTTTT>
##$WBST= 1024
##$WBSW= 4
##$XGAIN= (0..3)
0 0 0 0
##$XL= 0
##$YL= 0
##$YMAX_a= 13955532
##$YMIN_a= -5797435
##$ZGOPTNS= <>
##$ZL1= 120
##$ZL2= 120
##$ZL3= 120
##$ZL4= 120
##$ABSF1= 14.96841
##$ABSF2= -5.584121
##$ABSG= 5
##$ABSL= 3
##$ALPHA= 0
##$AQORDER= 0
##$ASSFAC= 0
##$ASSFACI= 0
##$ASSFACX= 0
##$ASSWID= 0
##$AUNMP= <proc_prof1d_extract.lims>
##$AXLEFT= 0
##$AXNAME= <>
##$AXNUC= <1H>
##$AXRIGHT= 0
##$AXTYPE= 0
##$AXUNIT= <>
##$AZFE= 0.1
##$AZFW= 0.1
##$BCFW= 0
##$BC_mod= 0
##$BYTORDP= 0
##$COROFFS= 0
##$CY= 15
##$DATMOD= 1
##$DC= 0
##$DFILT= <>
##$DTYPP= 0
##$F1P= 0
##$F2P= 0
##$FCOR= 0.5
##$FTSIZE= 131072
##$FT_mod= 6
##$GAMMA= 0
##$GB= 0
##$INTBC= 1
##$INTSCL= 1
##$ISEN= 128
##$LB= 0.3
##$LEV0= 0
##$LPBIN= 0
##$MAXI= 10000
##$MC2= 0
##$MEAN= 0
##$ME_mod= 0
##$MI= 0
##$NCOEF= 0
##$NC_proc= -3
##$NLEV= 6
##$NOISF1= 0
##$NOISF2= 0
##$NSP= 0
##$NTH_PI= 0
##$NZP= 0
##$OFFSET= 14.96841
##$PC= 1
##$PHC0= 31.99219
##$PHC1= 0
##$PH_mod= 1
##$PKNL= yes
##$PPARMOD= 0
##$PPDIAG= 0
##$PPIPTYP= 0
##$PPMPNUM= 2147483647
##$PPRESOL= 1
##$PSCAL= 4
##$PSIGN= 0
##$PYNMP= <proc.py>
##$REVERSE= no
##$SF= 400.130004883192
##$SI= 131072
##$SIGF1= 0
##$SIGF2= 0
##$SINO= 400
##$SIOLD= 131072
##$SPECTYP= <>
##$SREGLST= <1H.CDCl3>
##$SSB= 0
##$STSI= 131072
##$STSR= 0
##$SW_p= 8223.68421052632
##$SYMM= 0
##$S_DEV= 0
##$TDeff= 65536
##$TDoff= 0
##$TI= <>
##$TILT= no
##$TM1= 0
##$TM2= 0
##$TOPLEV= 0
##$USERP1= <user>
##$USERP2= <user>
##$USERP3= <user>
##$USERP4= <user>
##$USERP5= <user>
##$WDW= 1
##$XDIM= 131072
##$YMAX_p= 511220132
##$YMIN_p= -184952546
##$CURPLOT= <Network HP LaserJet P1505>
##$CURPRIN= <$Network HP LaserJet P1505>
##$DFORMAT= <normdp>
##$LAYOUT= <+/1D_H.xwp>
##$LFORMAT= <normlp>
##$PFORMAT= <normpl>
##$SURQMSG= 1
$$ End of Bruker specific parameters
$$ ---------------------------------
##NTUPLES= NMR SPECTRUM
##VAR_NAME=  FREQUENCY,     SPECTRUM/REAL,   SPECTRUM/IMAG
##SYMBOL=    X,             R,               I
##VAR_TYPE=  INDEPENDENT,   DEPENDENT,       DEPENDENT
##VAR_FORM=  AFFN,          ASDF,            ASDF
##VAR_DIM=   131072,        131072,          131072
##UNITS=     HZ,            ARBITRARY UNITS, ARBITRARY UNITS
##FACTOR=    0.0627417313425165, 1,          1
##FIRST=     8223.62146879498, -5111,        -93832
##LAST=      0,             -3543,           -96127
##MIN=       0,             -184952546,      0
##MAX=       8223.62146879498, 511220132,    0
$$ Real data points
##PAGE= N=1
##DATA TABLE= (X++(R..R)), XYDATA
$$ [...]
60731A218624r909r592q129n110j853M99K106L496M886O713R443J2413J4115J4186
60717A251888J3945J4534J5680J6860J8312K0116K1424K1580K1137K1011K1371
60706A457858K1917K2431K2623K2283K1881K1844K1071J7919J3043R415Q492Q376
60694A669153P038N263M641M557L520J973J327J154j6j803k441j879j863l005
60680A687619m205n166p005r785j1690j1625j0922j1472j3546j6158j8247j8943
60668A548855j7986j6491j5992j6139j4802j1212p449n831o005n818m054j187
60656A425889J743L783M237L266K097J852K421K979K970K197O83q52j161m1R47
60641A453010K96j402k320j867j145j062j208q59j94m2r67k957n589q316j0747
$$ y = [1218624, 1208715, 1199123, 1190994, 1185884, 1184031, 1184530, 1186636, 1190132, 1195018, 1201731, 1211174, 1223587, 1237702, 1251888, 1265833, 1280367, 1296047, 1312907, 1331219, 1351335, 1372759, 1394339, 1415476, 1436487, 1457858, 1479775, 1502206, 1524829, 1547112, 1568993, 1590837, 1611908, 1629827, 1642870, 1652285, 1660777, 1669153, 1676191, 1681454, 1686095, 1690652, 1694172, 1696145, 1697472, 1698626, 1698610, 1696807, 1694366, 1692487, 1690624, 1687619, 1683414, 1678248, 1671243, 1661458, 1649768, 1638143, 1627221, 1615749, 1602203, 1586045, 1567798, 1548855, 1530869, 1514378, 1498386, 1482247, 1467445, 1456233, 1448784, 1442953, 1436948, 1431130, 1427076, 1425889, 1427632, 1431415, 1435652, 1438918, 1441015, 1442867, 1445288, 1448267, 1451237, 1453434, 1454117, 1453265, 1452104, 1452063, 1453010, 1453306, 1451904, 1449584, 1447717, 1446572, 1445510, 1444302, 1443443, 1443249, 1443207, 1442240, 1439283, 1433694, 1425378, 1414631]
60626A414631j2752j4078j4113j2661j0975j1168j4019j7822k0069k0055j9134
60615A247785j8567j7974j6410j4143j2446j1727j0852q578n141j978k51J29K00
60602A130047R68K412L452L198K190J777K185K125P95o25l92J540L664M889N287
60587A163512N151M571L989L895L729K277k61j759o19K055L790L796L619M837
60573A202582P170R177R957R699R179R288J0773J3571J6362J7483J6724J5881
60561A347846J6983K0099K3298K4740K4322K3230K2400K1855K1168K0113J8785
60550A584839J7370J5909J4201J1898Q727M780O85k720n199p623j1106j5453j9081
60537A597227k0872k1536k2360k3295k3234k1790j9584j6914j3560j0029p617
$$ y = [1414631, 1401879, 1387801, 1373688, 1361027, 1350052, 1338884, 1324865, 1307043, 1286974, 1266919, 1247785, 1229218, 1211244, 1194834, 1180691, 1168245, 1156518, 1145666, 1137088, 1131947, 1129969, 1129718, 1129847, 1130047, 1131015, 1133427, 1136879, 1140077, 1142267, 1144044, 1146229, 1148354, 1149149, 1148524, 1148132, 1149672, 1153336, 1158225, 1163512, 1168663, 1173234, 1177223, 1181118, 1184847, 1187124, 1186863, 1185104, 1184485, 1186540, 1190330, 1194126, 1197745, 1202582, 1209752, 1218929, 1228886, 1238585, 1247764, 1257052, 1267825, 1281396, 1297758, 1315241, 1331965, 1347846, 1364829, 1384928, 1408226, 1432966, 1457288, 1480518, 1502918, 1524773, 1545941, 1566054, 1584839, 1602209, 1618118, 1632319, 1644217, 1652944, 1657724, 1658409, 1655689, 1650490, 1642867, 1631761, 1616308, 1597227, 1576355, 1554819, 1532459, 1509164, 1485930, 1464140, 1444556, 1427642, 1414082, 1404053, 1396436]
60526A396436o678o004m507k543r72o0K1j206l460n159n136m197l891m352m505
60511A343787l859k814j618k15J016J610K067L425N702P791R053J0031J1298J2467
60497A399741J2869J2598J2340J2458J2681J2658J2614J3316J5208J7640J9324
60486A553447J9648J9257J9298K0607K3649K8334L3461L7345L9763M2577M7469
60475A884855N3507N7796N8177N4561M7903L8957K7960J4918K46j4470k6680l4506
60463B163224l7982l8313l6445l2917k8371k3287j7530j0978m221J992P611J2750
60451A955533J6994K0177K3293K7394L1904L5315L7455L9917M4161N0229N7444
60440B339816O5319P3583Q2161R1509J02427J15365J30153J46129J62048J76403
$$ y = [1396436, 1389758, 1383754, 1379247, 1376704, 1375732, 1375672, 1375693, 1374487, 1371027, 1365868, 1360732, 1356535, 1352644, 1348292, 1343787, 1339928, 1337114, 1335496, 1335281, 1336297, 1337907, 1339974, 1343399, 1349101, 1356892, 1365945, 1375976, 1387274, 1399741, 1412610, 1425208, 1437548, 1450006, 1462687, 1475345, 1487959, 1501275, 1516483, 1534123, 1553447, 1573095, 1592352, 1611650, 1632257, 1655906, 1684240, 1717701, 1755046, 1794809, 1837386, 1884855, 1938362, 1996158, 2054335, 2108896, 2156799, 2195756, 2223716, 2238634, 2238880, 2224410, 2197730, 2163224, 2125242, 2086929, 2050484, 2017567, 1989196, 1965909, 1948379, 1937401, 1933180, 1935172, 1942783, 1955533, 1972527, 1992704, 2015997, 2043391, 2075295, 2110610, 2148065, 2187982, 2232143, 2282372, 2339816, 2405135, 2478718, 2560879, 2652388, 2754815, 2870180, 3000333, 3146462, 3308510, 3484913]
60430C484913J88737K00372K13064K27286K42748K60323K82190L09787L42148
60421E751568L75931M05933M25485M27568M06450L58782K83998J84929O8255n6107
60411H632792j76567k81921l64066m20270m52536m64274m58479m39363m13201
60402E162115l85180l56369l25878k94970k66488k40926k16293j92115j70623
60393B713273j53149j37996j23287j09656r8497q9314q0637p2275o4910n8380
60383A725172n2031m6258m2096l9549l7548l5537l3976l3106l2137l0020k6735
60372A316179k3432k1243k0084j9019j7761j7039j6984j6163j3425j0036q334
60361A132659q572q732p508n662m079k404m23Q40O34q9N6J055J997K632L271L734
$$ y = [3484913, 3673650, 3874022, 4087086, 4314372, 4557120, 4817443, 5099633, 5409420, 5751568, 6127499, 6533432, 6958917, 7386485, 7792935, 8151717, 8435715, 8620644, 8688899, 8632792, 8456225, 8174304, 7810238, 7389968, 6937432, 6473158, 6014679, 5575316, 5162115, 4776935, 4420566, 4094688, 3799718, 3533230, 3292304, 3076011, 2883896, 2713273, 2560124, 2422128, 2298841, 2189185, 2090688, 2001374, 1920737, 1848462, 1783552, 1725172, 1673141, 1626883, 1584787, 1545238, 1507690, 1472153, 1438177, 1405071, 1372934, 1342914, 1316179, 1292747, 1271504, 1251420, 1232401, 1214640, 1197601, 1180617, 1164454, 1151029, 1140993, 1132659, 1124087, 1115355, 1107847, 1102185, 1098106, 1095702, 1095279, 1096119, 1096753, 1096664, 1096720, 1097775, 1099772, 1102404, 1105675, 1109409]
60345A109409L430K325J130O83J479L372N385O357O111N527N364N606O144P073
60331A169395P994Q005O950N875N647N818N399M109K364O61o16j345j939k763
60317A215554l346l048k591l539n875p569p180n450l492j074J939L972L469J567
60303A183337J055K852N029N486M266L080L456N661Q649J0880J1677J1725J1947
60290A269100J2242J1930J1049J0369J0286J0505J0692J0783J0629J0085R423
60279A387093R033Q667P601N676L588J981Q58K15O02K348M527N636N523N794P545
60264A456687R391Q891N842K714J410R61n69l187n369o534p419q323q599p944
60250A437952o817n476l904k673k501k909k696j936j908k795l187k407j563j417
$$ y = [1109409, 1112839, 1115164, 1116294, 1116977, 1118456, 1121828, 1127213, 1133570, 1139681, 1145208, 1150572, 1156178, 1162322, 1169395, 1177389, 1185394, 1192344, 1198219, 1203866, 1209684, 1215083, 1219192, 1221556, 1222217, 1221601, 1220256, 1218317, 1215554, 1212208, 1209160, 1206569, 1203030, 1197155, 1189586, 1182406, 1176956, 1173464, 1172390, 1174329, 1178301, 1181770, 1183337, 1184392, 1187244, 1192273, 1197759, 1202025, 1205105, 1208561, 1214222, 1222871, 1233751, 1245428, 1257153, 1269100, 1281342, 1293272, 1304321, 1314690, 1324976, 1335481, 1346173, 1356956, 1367585, 1377670, 1387093, 1396126, 1404793, 1412394, 1418070, 1421658, 1423639, 1424497, 1424712, 1425314, 1427662, 1432189, 1437825, 1443348, 1449142, 1456687, 1466078, 1474969, 1480811, 1483525, 1484935, 1485896, 1485327, 1482140, 1476771, 1470237, 1462818, 1454495, 1445896, 1437952, 1431135, 1425659, 1421755, 1419082, 1416581, 1413672, 1410976, 1409040, 1407132, 1404337, 1401150, 1398743, 1397180, 1395763]
60236A395763q60J205L823N234N214M794M416L796L187L417M647O041O884P473
60222A455034Q649J0643J2432J2582J1061R736J0265J1960J2915J2842J3163J4348
60210A595630J5186J5170J5582J7224J8882J9438J9992K2294K6149K9965L3083
60199A828595L6120L9651M3777M8554N3696N8387O2352O6487P1458P6529Q0970
60188B466576Q5887R3225J03224J14129J24251J33296J41818J50321J58879J66939
60178C738545J73576J78296J81205J82135J80343J75462J67888J57677J44209
60169E279336J27687J09784R1841P3448N4007L4600J6879J051j3562k6582l6686
60158E711803m3180m6193m5771m2221l6746l0238k1793j0034M284J8542L1347
$$ y = [1395763, 1394903, 1396108, 1399931, 1405165, 1410379, 1415173, 1419589, 1423385, 1426572, 1429989, 1434636, 1440677, 1447561, 1455034, 1463683, 1474326, 1486758, 1499340, 1510401, 1520137, 1530402, 1542362, 1555277, 1568119, 1581282, 1595630, 1610816, 1625986, 1641568, 1658792, 1677674, 1697112, 1717104, 1739398, 1765547, 1795512, 1828595, 1864715, 1904366, 1948143, 1996697, 2050393, 2108780, 2171132, 2237619, 2309077, 2385606, 2466576, 2552463, 2645688, 2748912, 2863041, 2987292, 3120588, 3262406, 3412727, 3571606, 3738545, 3912121, 4090417, 4271622, 4453757, 4634100, 4809562, 4977450, 5135127, 5279336, 5407023, 5516807, 5608648, 5682096, 5736103, 5770703, 5787582, 5788633, 5775071, 5748489, 5711803, 5668623, 5622430, 5576659, 5534438, 5497692, 5467454, 5445661, 5435627, 5439911, 5458453, 5489800]
60147E489800M4026N8824P6558R6070J15010J31130J43611J53332J61279J67089
60137F636729J69671J68594J63814J54681J40606J22424J01903P9946N6406L1433
60127G826207N815j9966m5688p0284r1740j08397j19688j25658j26620j23216
60117G000765j16114j05550r1771p5648n8242m0035k1163j985J7351L7274N7778
60106F602660P7504R4694J08576J18915J24938J25947J22427J15302J04528Q9891
60096G685382P2733N5391L9083K3793R997j101q962j3702j4568j0153m85J2639
60084G850047K7910M5724O6561Q9495J13168J37310J62472J88881K16285K44520
60074I142373K73864L04980L38406L73604M08717M41911M72664N00863N25124
$$ y = [5489800, 5533826, 5592650, 5669208, 5765278, 5880288, 6011418, 6155029, 6308361, 6469640, 6636729, 6806400, 6974994, 7138808, 7293489, 7434095, 7556519, 7658422, 7738368, 7794774, 7826207, 7832022, 7812056, 7766368, 7696084, 7604344, 7495947, 7376259, 7250601, 7123981, 7000765, 6884651, 6779101, 6687330, 6611682, 6553440, 6513405, 6492242, 6490257, 6507608, 6544882, 6602660, 6680164, 6774858, 6883434, 7002349, 7127287, 7253234, 7375661, 7490963, 7595491, 7685382, 7758115, 7813506, 7852589, 7876382, 7886379, 7885278, 7876316, 7862614, 7848046, 7837893, 7837408, 7850047, 7877957, 7923681, 7990242, 8079737, 8192905, 8330215, 8492687, 8681568, 8897853, 9142373, 9416237, 9721217, 10059623, 10433227, 10841944, 11283855, 11756519, 12257382, 12782506]
60065A2782506N43245N54157N57996N54175N40958N17385M84316M42878L93143
60056A7370759L35120K70201K00681J28435N4562k0156r4955j68642k38981l03019
60046A7534005l58404m03928m38563m60824m69772m66184m52159m29746m00336
60037A3654089l65005l24912k81359k35705j89152j42461r5998n0295o627L3043
60027A1995618O6794R3550J12982J24513J26945J19844J04883Q4772O0767L2585
60017A2923253R43l1499o2532r2189j20811j46998j69301j88753k07483k25334
60007A1679296k40191k51360k60187k66876k69035k64510k54116k40358k24631
59998I408032k06706j86178j63364j39029j13908q8395o2444l5939r023J8184
$$ y = [12782506, 13325751, 13879908, 14437904, 14992079, 15533037, 16050422, 16534738, 16977616, 17370759, 17705879, 17976080, 18176761, 18305196, 18359758, 18339602, 18244647, 18076005, 17837024, 17534005, 17175601, 16771673, 16333110, 15872286, 15402514, 14936330, 14484171, 14054425, 13654089, 13289084, 12964172, 12682813, 12447108, 12257956, 12115495, 12019497, 11969202, 11962575, 11995618, 12062412, 12155962, 12268944, 12393457, 12520402, 12640246, 12745129, 12829901, 12890668, 12923253, 12924196, 12892697, 12830165, 12737976, 12617165, 12470167, 12300866, 12112113, 11904630, 11679296, 11439105, 11187745, 10927558, 10660682, 10391647, 10127137, 9873021, 9632663, 9408032, 9201326, 9015148, 8851784, 8712755, 8598847, 8510452, 8448008, 8412069, 8403046, 8421230]
59988H421230M5669P2637R7119J17603J34690J49806J62351J69603J69568J62535
59978I702811J49652J31617J09371Q4518N7865K8585m099l9047p3823j06533j36172
59967I904745j61762j82168j96679k05198k08032k05793j99239j88768j74418
59958H182688j56655j36738j15757r3711p0155m5508k0867L522K8764N5619Q2911
59947G714113J08618J32505J56434J81500K05891K26690K42815K54567K60798
59938I483931K58872K47797K29483K06144J78298J46336J12073P7152M1339M116
59928A0985541l3239o8854j02304j33547j60809j81638j95383k02724k03410j96699
59918I506934j83531j66028j45070j20648r4334o8730m4039j7671J1687M1526
$$ y = [8421230, 8466899, 8539536, 8636655, 8754258, 8888948, 9038754, 9201105, 9370708, 9540276, 9702811, 9852463, 9984080, 10093451, 10177969, 10235834, 10264419, 10260320, 10221273, 10147450, 10040917, 9904745, 9742983, 9560815, 9364136, 9158938, 8950906, 8745113, 8545874, 8357106, 8182688, 8026033, 7889295, 7773538, 7679827, 7609672, 7564164, 7543297, 7546819, 7575583, 7631202, 7714113, 7822731, 7955236, 8111670, 8293170, 8499061, 8725751, 8968566, 9223133, 9483931, 9742803, 9990600, 10220083, 10426227, 10604525, 10750861, 10862934, 10940086, 10981425, 10985541, 10952302, 10883448, 10781144, 10647597, 10486788, 10305150, 10109767, 9907043, 9703633, 9506934, 9323403, 9157375, 9012305, 8891657, 8797323, 8728593, 8684554, 8666883, 8678570, 8720096]
59908H720096O8151R0361J09535J27203J43478J57131J66509J70817J70699J67183
59898A0091163J60492J50697J38926J26590J13978J01037Q8865P8635O9690O0978
59888A1181051N4129N2523N7065O5577P7005R3573J17489J47617J80995K16141
59878A2243165K53519K93966L37732L83979M30289M73553N11944N44821N70399
59869A6043367N84993N85201N69274N35759M82731M09599L18443K12839R6972
59860A9839178k3314j40638k48876l44784m25922m88809n30969n53627n60598
59851A6521641n55068n38734n13131m80146m41534l98837l53444l05937k56308
59842A2678502k05576j56121j09299o3794j7805K7895P0519J08278J41309J69749
$$ y = [8720096, 8788247, 8878608, 8988143, 9115346, 9258824, 9415955, 9582464, 9753281, 9923980, 10091163, 10251655, 10402352, 10541278, 10667868, 10781846, 10882883, 10971748, 11050383, 11120073, 11181051, 11235180, 11287703, 11344768, 11410345, 11487350, 11580923, 11698412, 11846029, 12027024, 12243165, 12496684, 12790650, 13128382, 13512361, 13942650, 14416203, 14928147, 15472968, 16043367, 16628360, 17213561, 17782835, 18318594, 18801325, 19210924, 19529367, 19742206, 19839178, 19815864, 19675226, 19426350, 19081566, 18655644, 18166835, 17635866, 17082239, 16521641, 15966573, 15427839, 14914708, 14434562, 13993028, 13594191, 13240747, 12934810, 12678502, 12472926, 12316805, 12207506, 12143712, 12125907, 12153802, 12224321, 12332599, 12473908, 12643657]
59832A2643657J92363K07251K12966K08573J93306J66468J27589P6863J5788n2644
59822A3992180j24341j94656k59112l14680l60718l97969m26492m45119m52960
59813A1016133m50675m40261m24342m05484l84987l62167l35788l06419k76585
59804G629425k48648k23443k00645j79189j57673j35954j16377j01743r2070q4929
59794F088754p8935p4903p3261p2463p0673o7383o2884n7784n3282m9986m6242
59783E380958l9969l2458k7871k8159l1242l5087m0510m8134n5641o0438o2983
59772D918466o5013o6241o5092o1269n5504m8054l9416l1031k3345j4758m462
59761D444281N343J2317J7364K2650K7949L2046L6490M4362N5623O6816P5548
$$ y = [12643657, 12836020, 13043271, 13256237, 13464810, 13658116, 13824584, 13952173, 14029036, 14044824, 13992180, 13867839, 13673183, 13414071, 13099391, 12738673, 12340704, 11914212, 11469093, 11016133, 10565458, 10125197, 9700855, 9295371, 8910384, 8548217, 8212429, 7906010, 7629425, 7380777, 7157334, 6956689, 6777500, 6619827, 6483873, 6367496, 6265753, 6173683, 6088754, 6009819, 5934916, 5861655, 5789192, 5718519, 5651136, 5588252, 5530468, 5477186, 5427200, 5380958, 5340989, 5308531, 5280660, 5252501, 5221259, 5186172, 5145662, 5097528, 5041887, 4981449, 4918466, 4853453, 4787212, 4722120, 4660851, 4605347, 4557293, 4517877, 4486846, 4463501, 4448743, 4444281, 4449624, 4461941, 4479305, 4501955, 4529904, 4561950, 4598440, 4642802, 4698425, 4765241, 4840789]
59750D840789Q2428Q8332R2424R3864R3302R1654Q8774Q4111P7719P0172O2174
59739E765743N4328M6670L8843L1471K6642K5946K8797L3731M0546M9765O1003
59728F203485P3496Q7623J04193J22918J43286J66236J92981K22546K52686K83122
59718G852572L15946L52583L92008M32130M71147N06850N35462N51200N46353
59709A1956251N12663M44992L44878K20638Q4768m8404j64891k54687l14889l48710
59699A2432609l61470l58012l42638l19101k89964k56986k21937j86200j49998
59690I946303j13342p7312m3214j0965K0354N0932Q0630J10202J40451J70840
59680A0274879K00631K30806K62804K95879L28137L60040L94452M32934M74194
$$ y = [4840789, 4923217, 5011549, 5103973, 5197837, 5291139, 5382793, 5471567, 5555678, 5633397, 5703569, 5765743, 5820071, 5866741, 5905584, 5937055, 5963697, 5989643, 6018440, 6052171, 6092717, 6142482, 6203485, 6276981, 6364604, 6468797, 6591715, 6735001, 6901237, 7094218, 7316764, 7569450, 7852572, 8168518, 8521101, 8913109, 9345239, 9816386, 10323236, 10858698, 11409898, 11956251, 12468914, 12913906, 13258784, 13479422, 13564190, 13515786, 13350895, 13096208, 12781319, 12432609, 12071139, 11713127, 11370489, 11051388, 10761424, 10504438, 10282501, 10096301, 9946303, 9832961, 9755649, 9712435, 9701470, 9721824, 9772756, 9853386, 9963588, 10104039, 10274879, 10475510, 10706316, 10969120, 11264999, 11593136, 11953176, 12347628, 12780562, 13254756]
59671A3254756N16666N60533O06544O54779P05389P58824Q14295Q69463R22419
59662A9663668R72708J019522J060061J090615J108383J111721J099868J073703
59654B8200249J036412R92693R47455R05245Q70153Q45551Q33828Q35847Q49864
59645C6317297Q71191Q93728R11965R21159R16488Q93343Q48543P80674O89926
59636D4044314N78825M52822L18948J84017N4853o0877j56197k27393k73859k95777
59626D4619676k93507k68876k24900j63773q6661M354J05979K15882L33560M58142
59616D4699876N86882P16574Q44977R69299J083945J181007J252816J292986J294825
59607E3923187J249605J147641R82298P53859M70250J45220k03032n52600q80841
$$ y = [13254756, 13771422, 14331955, 14938499, 15593278, 16298667, 17057491, 17871786, 18741249, 19663668, 20636376, 21655898, 22715959, 23806574, 24914957, 26026678, 27126546, 28200249, 29236661, 30229354, 31176809, 32082054, 32952207, 33797758, 34631586, 35467433, 36317297, 37188488, 38082216, 38994181, 39915340, 40831828, 41725171, 42573714, 43354388, 44044314, 44623139, 45075961, 45394909, 45578926, 45633779, 45572902, 45416705, 45189312, 44915453, 44619676, 44326169, 44057293, 43832393, 43668620, 43581959, 43586313, 43692292, 43908174, 44241734, 44699876, 45286758, 46003332, 46848309, 47817608, 48901553, 50082560, 51335376, 52628362, 53923187, 55172792, 56320433, 57302731, 58056590, 58526840, 58672060, 58469028, 57916428, 57035587]
59598E7035587j169673j408244j590647j713451j777485j790302j763579j707636
59590D4114570j629876j537698j440543j348962j273540j224252j207818j223806
59582C3228075j263707j314013j360037j389010j393446j373240j333479j279620
59574B2521523j215415j144409j070654r97019r24334q53004p84150p18757o57097
59565A4156684n99470n46432m97907m53020m11100l72000l35607l02117k72400
59556A0366631k46733k23619k01548j81645j66526j56559j49265j42802j38055
59547H759879j36750j39232j44706j51987j59211j64266j66419j66638j66021
59538G364649j64632j61836j56646j48128j36776j25042j14882j05292r4240q2231
$$ y = [57035587, 55865914, 54457670, 52867023, 51153572, 49376087, 47585785, 45822206, 44114570, 42484694, 40946996, 39506453, 38157491, 36883951, 35659699, 34451881, 33228075, 31964368, 30650355, 29290318, 27901308, 26507862, 25134622, 23801143, 22521523, 21306108, 20161699, 19091045, 18094026, 17169692, 16316688, 15532538, 14813781, 14156684, 13557214, 13010782, 12512875, 12059855, 11648755, 11276755, 10941148, 10639031, 10366631, 10119898, 9896279, 9694731, 9513086, 9346560, 9190001, 9040736, 8897934, 8759879, 8623129, 8483897, 8339191, 8187204, 8027993, 7863727, 7697308, 7530670, 7364649, 7200017, 7038181, 6881535, 6733407, 6596631, 6471589, 6356707, 6251415, 6157175, 6074944]
59528F074944p1327o1107m8908l4465k1065j1005k906N232J3170K0320K7644L5455
59516E925982M1552M4082M4804M7092N1810N7167O1757O5771O9929P5001Q1899
59505F566846R0789J00587J10559J21747J35460J51030J66536J81409J96945K14423
59495H036331K33904K54830K76827K99602L22667L45383L67217L87971M07635
59486A0932367M25658M40591M50931M56023M55508M48622M35226M17094L96558
59477A4858578L73959L47819L17269K82746K44750K04271J64645J30397J03375
59468A7027809Q1942O4679N2649M7038M6905N0968N9822P4637R4819J18103J41437
59457A7860808J60536J70190J67005J50853J22438Q0758K4725m3753j20153k00136
$$ y = [6074944, 6003617, 5942510, 5893602, 5859137, 5838072, 5827067, 5824161, 5829393, 5842563, 5862883, 5890527, 5925982, 5967534, 6011616, 6056420, 6103512, 6155322, 6212489, 6274246, 6340017, 6409946, 6484947, 6566846, 6657635, 6758222, 6868781, 6990528, 7125988, 7277018, 7443554, 7624963, 7821908, 8036331, 8270235, 8525065, 8801892, 9101494, 9424161, 9769544, 10136761, 10524732, 10932367, 11358025, 11798616, 12249547, 12705570, 13161078, 13609700, 14044926, 14462020, 14858578, 15232537, 15580356, 15897625, 16180371, 16425121, 16629392, 16794037, 16924434, 17027809, 17109751, 17174430, 17227079, 17274117, 17321022, 17371990, 17431812, 17506449, 17601268, 17719371, 17860808, 18021344, 18191534, 18358539, 18509392, 18631830, 18712588, 18737313, 18693560, 18573407, 18373271]
59447A8373271k80485l58014m29355m91876n43667n82824o07725o17993o14752
59438A3846580o00203n77213n48376n14940m77255m36553l95290l55321l16958
59429I624471k80251k45857k13808j82767j51508j20194q9598o0199l2630p459
59419H240200J6442M1706O9349R7173J22669J46320J70557J96389K22760K48406
59409I571971K72699K94837L13537L27694L36533L39173L34253L19739K93310
59400A2403746K54109K04184J47045Q4564J6938n4122j24344j89955k49736l02846
59390A2189583l46781l79501m01876m15922m21878m19310m10122l97864l84091
59381H612238l67525l47053l23934l00670k78825k58260k37821k16619j95139
$$ y = [18373271, 18092786, 17734772, 17305417, 16813541, 16269874, 15687050, 15079325, 14461332, 13846580, 13246377, 12669164, 12120788, 11605848, 11128593, 10692040, 10296750, 9941429, 9624471, 9344220, 9098363, 8884555, 8701788, 8550280, 8430086, 8340488, 8280289, 8247659, 8240200, 8256642, 8298348, 8367697, 8464870, 8587539, 8733859, 8904416, 9100805, 9323565, 9571971, 9844670, 10139507, 10453044, 10780738, 11117271, 11456444, 11790697, 12110436, 12403746, 12657855, 12862039, 13009084, 13093648, 13110586, 13056464, 12932120, 12742165, 12492429, 12189583, 11842802, 11463301, 11061425, 10645503, 10223625, 9804315, 9394193, 8996329, 8612238, 8244713, 7897660, 7573726, 7273056, 6994231, 6735971, 6498150, 6281531, 6086392]
59372F086392j74940j57049j41074j26172j12059r8574q5197p1823n9306m8384
59362E011814l8556k8667j8237p775J767R736J6516K3445L1241L8952M5646N2275
59350E138157N9816O5942O6563O1345N5081N2587N4618N9819O7895P8980R2322
59339E853125J07664J25789J45396J61594J70385J73665J77461J86184K00614
59330G301877K20139K44174K71777L02094L35231L71335M09513M49086M90960
59321A0396186N36150N83911O32747O82076P31063P76906Q16212Q47108Q68137
59312A6870496Q76277Q68487Q44703Q07436P59238P02462O40478N76549N11860
59303B3457986M46834L83783L25716K72564K20911J67594J11719N3083r148p5579
$$ y = [6086392, 5911452, 5754403, 5613329, 5487157, 5375098, 5276524, 5191327, 5119504, 5060198, 5011814, 4973258, 4944591, 4926354, 4918579, 4920346, 4930082, 4946598, 4970043, 5001284, 5040236, 5085882, 5138157, 5197973, 5263915, 5330478, 5391823, 5446904, 5499491, 5554109, 5613928, 5681823, 5760803, 5853125, 5960789, 6086578, 6231974, 6393568, 6563953, 6737618, 6915079, 7101263, 7301877, 7522016, 7766190, 8037967, 8340061, 8675292, 9046627, 9456140, 9905226, 10396186, 10932336, 11516247, 12148994, 12831070, 13562133, 14339039, 15155251, 16002359, 16870496, 17746773, 18615260, 19459963, 20267399, 21026637, 21729099, 22369577, 22946126, 23457986, 23904820, 24288603, 24614319, 24886883, 25107794, 25275388, 25387107, 25440190, 25431042, 25355463]
59293B5355463j45733k18280k90900l60027m22099m75217n19010n53593n79985
59284B1790619o00735o18474o34162o47853o60152o71089o78525o79839o74890
59275A5924900o65274o51075o30659o03748n72515n39231n04617m68871m32879
59266A0856031l97721l64016l31868l00677k69315k37653k07474j80690j57072
59257H409545j34963j13709r3849p5365n7448l9827k2917o752Q917K3615L6563
59246G933810M7959N8731O9246P9220Q8304R5726J00133J01175J00352R8890R5697
59235H869243Q9034P9306O8449N7416M6353L6462K9418K5236K2806K2219K4578
59224I370520K9834L6864M5569N6886P0868Q6569J03615J21922J40064J55847
$$ y = [25355463, 25209730, 24991450, 24700550, 24340523, 23918424, 23443207, 22924197, 22370604, 21790619, 21189884, 20571410, 19937248, 19289395, 18629243, 17958154, 17279629, 16599790, 15924900, 15259626, 14608551, 13977892, 13374144, 12801629, 12262398, 11757781, 11288910, 10856031, 10458310, 10094294, 9762426, 9461749, 9192434, 8954781, 8747307, 8566617, 8409545, 8274582, 8160873, 8067024, 7991659, 7934211, 7894384, 7871467, 7864715, 7873632, 7897247, 7933810, 7981769, 8040500, 8109746, 8188966, 8277270, 8372996, 8473129, 8574304, 8674656, 8773546, 8869243, 8958277, 9037583, 9106032, 9163448, 9209801, 9246263, 9275681, 9300917, 9323723, 9345942, 9370520, 9400354, 9437218, 9482787, 9539673, 9610541, 9697110, 9800725, 9922647, 10062711, 10218558]
59214A0218558J68423J78100J84330J85725J81535J70982J51831J22438Q5417
59205A1647339M6629J0091k3933n5623q3221j04914j20803j31635j37225j37210
59195A0909495j32170j23192j11357r8144q5071p2594o0287m8348l7813k9339
59185A0111180k3070j9425j8500j8866j8562j7246j5759j3729r505k397O923J8475
59173I979519L3442N2315P4383R9510J28557J61518J96909K33665K72179L12757
59163A1544754L54197L94283M30474M59848M79518M87349M81271M58310M15914
59154A5505918L54369K76604J85836Q4801k3009j33313k42265l46063m39474n16831
59144A4706573n75013o14145o35653o41360o34308o18092n94793n65053n30328
$$ y = [10218558, 10386981, 10565081, 10749411, 10935136, 11116671, 11287653, 11439484, 11561922, 11647339, 11693968, 11704059, 11680126, 11624503, 11541282, 11436368, 11315565, 11183930, 11046705, 10909495, 10777325, 10654133, 10542776, 10444632, 10359561, 10286967, 10226680, 10178332, 10140519, 10111180, 10088110, 10068685, 10050185, 10031319, 10012757, 9995511, 9979752, 9966023, 9956518, 9954121, 9961044, 9979519, 10012961, 10065276, 10139659, 10239169, 10367726, 10529244, 10726153, 10959818, 11231997, 11544754, 11898951, 12293234, 12723708, 13183556, 13663074, 14150423, 14631694, 15090004, 15505918, 15860287, 16136891, 16322727, 16407528, 16384519, 16251206, 16008941, 15662878, 15223404, 14706573, 14131560, 13517415, 12881762, 12240402, 11606094, 10988002, 10393209, 9828156, 9297828]
59135I297828m93191m55335m17265l80265l46635l17264k90693k65261k40905
59126F091014k18408j98120j79799j62702j45947j29800j16015j05447r6163q5691
59116D652922p4415o4415n5793m6796l7274k9087k2888j7143j0620l391M713J3976
59104D309789K2988K9732L4831M0939M8617N5800O1863O8820P7481Q5734R2080
59093D928674R7868J04293J09957J13464J16133J20085J25377J30697J35095J37586
59083F119229J36859J32906J27319J20741J11836R9923Q6575P3168N9028M3660
59073G111244K8761J6148N366m637j2899j7615j8781j7766j4966r451m69J1746
59061G076681K6137M1170N5928P1386Q9295J09385J29183J47224J64684J83097
$$ y = [9297828, 8804637, 8349302, 7932037, 7551772, 7205137, 6887873, 6597180, 6331919, 6091014, 5872606, 5674486, 5494687, 5331985, 5186038, 5056238, 4940223, 4834776, 4738613, 4652922, 4578507, 4514092, 4458299, 4411503, 4374229, 4345142, 4322254, 4305111, 4294491, 4291100, 4295813, 4309789, 4332777, 4362509, 4397340, 4438279, 4486896, 4542696, 4604559, 4673379, 4750860, 4836594, 4928674, 5026542, 5130835, 5240792, 5354256, 5470389, 5590474, 5715851, 5846548, 5981643, 6119229, 6256088, 6388994, 6516313, 6637054, 6748890, 6848813, 6935388, 7008556, 7067584, 7111244, 7140005, 7156153, 7161519, 7156882, 7143983, 7126368, 7107587, 7089821, 7074855, 7065404, 7064935, 7076681, 7102818, 7143988, 7199916, 7271302, 7360597, 7469982, 7599165, 7746389, 7911073, 8094170]
59051H094170K02284K21609K41457K62000K81833K99092L12912L22777L27485
59042A0565619L25439L14909K93812K60850K17327J66249J09484M7867j5678p5868
59032A2210010j28969j74711k13557k44768k68431k86742l01552l12710l20312
59023I958258l26120l30975l33147l31180l26358l20444l13216l04253k95032
59014G077533k86712k77702k66007k52594k39972k28588k16994k04584j91920
59005D912460j79266j66828j55603j46195j37524j28374j19148j10539j01924
58996C667059r2928q5142p9988p5918p0232o2972n6794n3317n1807n1042n0552
58985B936367n0125m9820n0318n1922n3445n3484n2273n0883m9142m5986m1599
$$ y = [8094170, 8296454, 8518063, 8759520, 9021520, 9303353, 9602445, 9915357, 10238134, 10565619, 10891058, 11205967, 11499779, 11760629, 11977956, 12144205, 12253689, 12301556, 12285878, 12210010, 12081041, 11906330, 11692773, 11448005, 11179574, 10892832, 10591280, 10278570, 9958258, 9632138, 9301163, 8968016, 8636836, 8310478, 7990034, 7676818, 7372565, 7077533, 6790821, 6513119, 6247112, 5994518, 5754546, 5525958, 5308964, 5104380, 4912460, 4733194, 4566366, 4410763, 4264568, 4127044, 3998670, 3879522, 3768983, 3667059, 3574131, 3488989, 3409001, 3333083, 3262851, 3199879, 3143085, 3089768, 3037961, 2986919, 2936367, 2886242, 2836422, 2786104, 2734182, 2680737, 2627253, 2574980, 2524097, 2474955, 2428969, 2387370]
58974B387370l7494l4392l1429k7648k3231j8995j5427j2398r455o454l970k707
58962B163770k371j880q18J23L42O4l37p99j188j427j952k852k741r4M264P773
58946B159877R397J0439J2038J3726J4812J5074J3832J0616P034N619O422P316
58934B286202P866R702J2556J3672J2593J2729J6017J9438J9548J7498J6617J7515
58922B461953J8698J9928K1851K3854K5182K6905L0106L3416L4893L5120L6112
58911B768018L8180M0260M2203M4573M7027M8943N0842N3486N6576N9722O3339
58900C313169O7251P0115P1731P3909P7377Q0062Q0561Q1009Q3987Q8593R2317
58889D180081R5086R8739J04025J10748J19353J29750J40004J48831J57921J69290
$$ y = [2387370, 2349876, 2315484, 2284055, 2256407, 2233176, 2214181, 2198754, 2186356, 2176901, 2170447, 2166477, 2163770, 2161399, 2159519, 2158701, 2158824, 2159166, 2159230, 2158893, 2158094, 2156906, 2155479, 2153527, 2150675, 2147934, 2147840, 2152104, 2159877, 2169274, 2179713, 2191751, 2205477, 2220289, 2235363, 2249195, 2259811, 2266845, 2272464, 2278886, 2286202, 2294068, 2303770, 2316326, 2329998, 2342591, 2355320, 2371337, 2390775, 2410323, 2427821, 2444438, 2461953, 2480651, 2500579, 2522430, 2546284, 2571466, 2598371, 2628477, 2661893, 2696786, 2731906, 2768018, 2806198, 2846458, 2888661, 2933234, 2980261, 3029204, 3080046, 3133532, 3190108, 3249830, 3313169, 3380420, 3450535, 3522266, 3596175, 3673552, 3753614, 3834175, 3915184, 3999171, 4087764, 4180081, 4275167, 4373906, 4477931, 4588679, 4708032, 4837782, 4977786, 5126617, 5284538, 5453828]
58879E453828J81920J93772K05492K19141K34675K50816K68176K88294L10522
58870G606636L32835L55088L78693M04028M30864M60355M93759N30051N67552
58861A1559861O07041O50410O97192P45192P93752Q43496Q93575R41962R87766
58852A8720247J030292J066405J091384J101723J094686J066230J012212R30882
58844B7114061Q21746O83717N17982L31668J35146o3747k59532m44578o09387
58835B8227076p47924q59390r44570j003845j038987j053470j050132j030965
58827B0497793r99398r60017r15675q67208q16020p64485p13816o64083o16276
58818A3180815n71960n31217m93358m59194m29935m04328l79884l56548l36076
$$ y = [5453828, 5635748, 5829520, 6035012, 6254153, 6488828, 6739644, 7007820, 7296114, 7606636, 7939471, 8294559, 8673252, 9077280, 9508144, 9968499, 10462258, 10992309, 11559861, 12166902, 12817312, 13514504, 14259696, 15053448, 15896944, 16790519, 17732481, 18720247, 19750539, 20816944, 21908328, 23010051, 24104737, 25170967, 26183179, 27114061, 27935807, 28619524, 29137506, 29469174, 29604320, 29540573, 29281041, 28836463, 28227076, 27479152, 26619762, 25675192, 24671347, 23632360, 22578890, 21528758, 20497793, 19498395, 18538378, 17622703, 16755495, 15939475, 15174990, 14461174, 13797091, 13180815, 12608855, 12077638, 11584280, 11125086, 10695151, 10290823, 9910939, 9554391, 9218315]
58809I218315l17993k99420k79165k58978k40421k23220k06890j91362j75767
58800G025099j59238j42945j28813j16385j03610r0456p8815o8852n8538m6847
58790F030600l4649k2368r696K432J2671K2205L3794M7599O0951P2446Q3305R4535
58778F393825J05955J18395J33490J50547J66650J80688J94610K10287K27822
58769G882269K47244K68761K90897L11571L31656L54429L80896M08890M37396
58760A0914009M68298N02862N39881N78803O21441O68755P18597P68403Q17791
58751A6598840Q66968R14604R58665R97267J027324J044045J042877J020582R74088
58742B5445260R00384P98282O68592N12763L33919J39613n9364k53799m37596
$$ y = [9218315, 8900322, 8600902, 8321737, 8062759, 7822338, 7599118, 7392228, 7200866, 7025099, 6865861, 6722916, 6594103, 6477718, 6374108, 6283652, 6204837, 6135985, 6077447, 6030600, 5995951, 5973583, 5963887, 5966319, 5978990, 6001195, 6034989, 6082588, 6143539, 6215985, 6299290, 6393825, 6499780, 6618175, 6751665, 6902212, 7068862, 7249550, 7444160, 7654447, 7882269, 8129513, 8398274, 8689171, 9000742, 9332398, 9686827, 10067723, 10476613, 10914009, 11382307, 11885169, 12425050, 13003853, 13625294, 14294049, 15012646, 15781049, 16598840, 17465808, 18380412, 19339077, 20336344, 21363668, 22407713, 23450590, 24471172, 25445260, 26345644, 27143926, 27812518, 28325281, 28659200, 28798813, 28739449, 28485650, 28048054]
58733B8048054o04685p48066q63495r51497j014357j053383j070317j068853j052951
58724A9620450j025266r88361r45672r00120q53121q05635p58579p11807o64698
58715A1967191o18399n75615n37663n03399m71449m41680m14222l88925l65915
58706G649924l44935l24244l02359k80621k61719k45809k30649k15231k00563
58697E243794j87093j74290j62626j52864j43512j32384j20598j11375j04695
58688C954357r7229q8050q0174p5235p0833o4950n9170n5314n2210m8187m4018
58677C218987m1123l9174l7426l6284l5829l4853l2919l1386l1126l1270l1312
58666B836285l2195l4070l5325l5242l5562l7959m1745m5186m7463m8455m8315
$$ y = [28048054, 27443369, 26695303, 25831808, 24880311, 23865954, 22812571, 21742254, 20673401, 19620450, 18595184, 17606823, 16661151, 15761031, 14907910, 14102275, 13343696, 12631889, 11967191, 11348792, 10773177, 10235514, 9732115, 9260666, 8818986, 8404764, 8015839, 7649924, 7304989, 6980745, 6678386, 6397765, 6136046, 5890237, 5659588, 5444357, 5243794, 5056701, 4882411, 4719785, 4566921, 4423409, 4291025, 4170427, 4059052, 3954357, 3857128, 3769078, 3688904, 3613669, 3542836, 3477886, 3418716, 3363402, 3311192, 3263005, 3218987, 3177864, 3138690, 3101264, 3064980, 3029151, 2994298, 2961379, 2929993, 2898867, 2867597, 2836285, 2804090, 2770020, 2734695, 2699453, 2663891, 2625932, 2584187, 2539001, 2491538, 2443083, 2394768]
58655B394768m7914m8133m8571m8502m8602m9387m8733m4289l7995l4436l4522
58644A903684l4621l2535l0195k9370k8691k6668k4283k2743k1620k0622k0524
58633A611812k1095k0875j9795j9303j9325j8226j6145j4753j3485j0177n909
58622A432724m475n874n395j008L371M302L747M541N421M110J650J43r48k951
58608A439358n003n771n748n491m096j488M43Q97J461K613K353K42q49P02K594
58593A422217K975L685O311Q825R448J0342J3867J8283K0883K2605K5801K9851
58581A595093L2576L4011L5594L7480L9559M2999M8001N2242N4324N6618O1981
58570B090478O9760P7663Q5266R3039J00307J06917J14717J24814J35524J45566
$$ y = [2394768, 2346854, 2298721, 2250150, 2201648, 2153046, 2103659, 2054926, 2010637, 1972642, 1938206, 1903684, 1869063, 1836528, 1806333, 1776963, 1748272, 1721604, 1697321, 1674578, 1652958, 1632336, 1611812, 1590717, 1569842, 1550047, 1530744, 1511419, 1493193, 1477048, 1462295, 1448810, 1438633, 1432724, 1428249, 1422375, 1416980, 1415972, 1419343, 1423645, 1427392, 1431933, 1437354, 1441464, 1443114, 1443257, 1442309, 1439358, 1434355, 1428584, 1422836, 1417345, 1413249, 1411761, 1412204, 1413101, 1414562, 1417175, 1419528, 1419770, 1418921, 1419623, 1422217, 1425192, 1428877, 1435188, 1444013, 1453461, 1463803, 1477670, 1495953, 1516836, 1539441, 1565242, 1595093, 1627669, 1661680, 1697274, 1734754, 1774313, 1817312, 1865313, 1917555, 1971879, 2028497, 2090478, 2160238, 2237901, 2323167, 2416206, 2516513, 2623430, 2738147, 2862961, 2998485, 3144051]
58560C144051J56798J71200J87528K03615K19738K37086K55167K73046K90646
58551E138875L06498L16847L19471L15643L05889K86705K54309K08983J53358
58542G606578Q9569K1076m6056j07107j61497k08906k45888k69690k82532k88456
58532F107091k88509k82341k71864k59589k45517k29011k11613j95005j78549
58523C945093j61618j45807j31982j18211j03583r0884q2101p4630o5709n7469
58513B913099n3407n2675n2064n1015n0488m9414m6711m4593m5461m7321m6507
58502B373443m3194m0383l9072l8353l8565m0576m3225m4785m5582m6316m5799
58491A907593m3206m0377l8909l7418l4501l1753l0751k9912k7477k4798k3484
$$ y = [3144051, 3300849, 3472049, 3659577, 3863192, 4082930, 4320016, 4575183, 4848229, 5138875, 5445373, 5762220, 6081691, 6397334, 6703223, 6989928, 7244237, 7453220, 7606578, 7696147, 7717223, 7671167, 7564060, 7402563, 7193657, 6947769, 6678079, 6395547, 6107091, 5818582, 5536241, 5264377, 5004788, 4759271, 4530260, 4318647, 4123642, 3945093, 3783475, 3637668, 3505686, 3387475, 3283892, 3193008, 3110907, 3036277, 2970568, 2913099, 2859692, 2807017, 2754953, 2703938, 2653450, 2604036, 2557325, 2512732, 2467271, 2419950, 2373443, 2330249, 2289866, 2250794, 2212441, 2173876, 2133300, 2090075, 2045290, 1999708, 1953392, 1907593, 1864387, 1824010, 1785101, 1747683, 1713182, 1681429, 1650678, 1620766, 1593289, 1568491, 1545007]
58480A545007k2362k0474j9639k0679k0746j8093j5625j5680j5460j2192q700
58469A355357q617r949r021p219p844r434q515o402o978r762j1189j1016j1632
58456A237779j2585j1495r198q662r949j0896j1335j2170j2168j0258q779r853
58444A110431j1077r445o761o089n960l686j393k531n214n350l879m367n818m695
58430A034166k064j796l389l348k174l117n343n178l005k211k485r30J329O26
58416A001081j993k024O27J786M80l74j72j003k227j291N54k74k968l491j736
58401I86975j070j486l4K625L070J972L135O090O759N186N340P323P120M304K738
58386A040047L122K043j094l187l958o366r914j0610q372p493q997r351p667p175
$$ y = [1545007, 1522645, 1502171, 1482532, 1461853, 1441107, 1423014, 1407389, 1391709, 1376249, 1364057, 1355357, 1346740, 1336791, 1327770, 1320551, 1312707, 1303273, 1294758, 1288356, 1281378, 1271616, 1260427, 1249411, 1237779, 1225194, 1213699, 1204501, 1195839, 1185890, 1174994, 1163659, 1151489, 1139321, 1129063, 1120284, 1110431, 1099354, 1089909, 1083148, 1077059, 1071099, 1067413, 1066020, 1063489, 1058275, 1052925, 1049046, 1044679, 1038861, 1034166, 1032102, 1030306, 1026917, 1023569, 1021395, 1018278, 1012935, 1007757, 1004752, 1002541, 1000056, 999126, 1000455, 1001081, 999088, 997064, 997691, 999477, 999957, 999583, 999411, 998408, 996181, 994890, 995444, 995170, 992202, 988711, 986975, 985905, 984419, 984385, 987010, 990080, 992052, 995187, 1001277, 1008036, 1013222, 1018562, 1025885, 1033005, 1037309, 1040047, 1043169, 1045212, 1044118, 1040931, 1036973, 1030607, 1020693, 1010083, 1001711, 994218, 985221, 975870, 968203, 961028]
58372I61028q524q401n955m160l852k805j343k184m117k851J018K032j092l414
58358I15380k189l09K21J463M373O484O588O222N527L289J543L879Q741J0701
58344I71913Q957Q036R697J1012J0994J2091J4159J3922J1468J0572J1687J1209
58332A105717Q472O793O934O106L928K714J881j030l982k662J190J631j411k104
58318A134177J073L554L471L764M948M370L179N359R317R336N861N184Q385J0146
58304A212124R250J0115J2853J2105P491N005O150N861L084L013O564Q050N854
58291A307519N149P441P778M938L940N762N170J581J202N247P065M332L074N942
58277A376140P650N879N629Q687R795P529P894J2717J5537J3609J2955J6785J9813
$$ y = [961028, 952504, 944103, 938148, 933988, 930136, 927331, 925988, 923804, 919687, 916836, 917854, 919886, 918794, 915380, 913191, 912882, 913103, 914566, 918939, 925423, 932011, 938233, 943760, 947049, 948592, 952471, 961212, 971913, 980870, 988906, 998603, 1009615, 1020609, 1032700, 1046859, 1060781, 1072249, 1082821, 1094508, 1105717, 1114189, 1120982, 1127916, 1134022, 1137950, 1140664, 1142545, 1141515, 1137533, 1134871, 1136061, 1137692, 1136281, 1134177, 1135250, 1138804, 1142275, 1146039, 1150987, 1155357, 1158536, 1163895, 1173212, 1182548, 1188409, 1193593, 1201978, 1212124, 1221374, 1231489, 1244342, 1256447, 1263938, 1268943, 1275093, 1280954, 1284038, 1287051, 1293615, 1301665, 1307519, 1312668, 1320109, 1327887, 1332825, 1336765, 1342527, 1347697, 1349278, 1350480, 1355727, 1362792, 1367124, 1370198, 1376140, 1383790, 1389669, 1395298, 1403985, 1413780, 1421309, 1429203, 1441920, 1457457, 1471066, 1484021, 1500806, 1520619]
58264A520619J8779J7899J9377J9310J7235J8565K3409K4452J9994J7237J8763
58253A735639J8374J4509J4258J9240K1368J8033J7332K2267K4317J9523J6366
58242A941226K0058K3480K1812K1891K8283L3904L3584L3551L8384M1886L9889
58231B277948L8842M2610M4190L9692L6928M0844M4229M2274M2181M8492N3440
58220B751670N2113N2633O0512O7554O7339O7096P2754P7003P4090P1763P6410
58209C490937Q0964P9745Q0479Q9246R8506J02515J09198J23866J36906J40837
58199D533199J43733J52553J59743J60040J63295J76097J88201J92184J98577
58190F067622K15902K34035K43783K54284K73799K92313L01088L10348L29291
$$ y = [1520619, 1539398, 1557297, 1576674, 1595984, 1613219, 1631784, 1655193, 1679645, 1699639, 1716876, 1735639, 1754013, 1768522, 1782780, 1802020, 1823388, 1841421, 1858753, 1881020, 1905337, 1924860, 1941226, 1961284, 1984764, 2006576, 2028467, 2056750, 2090654, 2124238, 2157789, 2196173, 2238059, 2277948, 2316790, 2359400, 2403590, 2443282, 2480210, 2521054, 2565283, 2607557, 2649738, 2698230, 2751670, 2803783, 2856416, 2916928, 2984482, 3051821, 3118917, 3191671, 3268674, 3342764, 3414527, 3490937, 3571901, 3651646, 3732125, 3821371, 3919877, 4022392, 4131590, 4255456, 4392362, 4533199, 4676932, 4829485, 4989228, 5149268, 5312563, 5488660, 5676861, 5869045, 6067622, 6283524, 6517559, 6761342, 7015626, 7289425, 7581738, 7882826, 8193174, 8522465]
58181H522465L48111L58743L73078M00732M29591M49072M71407N08394N48929
58172A2410522N81886O18473O68290P16768P51675P88380Q42846R03708R58112
58163A9240660J019519J101237J188530J267061J351968J457585J566913J664395
58155B9857868J769154J900797K043737K182462K338530K532895K747343K965931
58147D8338717L216376L524459L869080M233243M655098N174435N778790O462914
58139H5253112P283497Q282812R421210J0671540J2118544J3871799J5945233
58132A62847747J8309029K0957967K3830752K6847380L0197563L4224280L8373196
58125C55587914M0238294L6483909K5523112R357402p514901k1049625k9603392
$$ y = [8522465, 8870576, 9229319, 9602397, 10003129, 10432720, 10881792, 11353199, 11861593, 12410522, 12992408, 13610881, 14279171, 14995939, 15747614, 16535994, 17378840, 18282548, 19240660, 20260179, 21361416, 22549946, 23817007, 25168975, 26626560, 28193473, 29857868, 31627022, 33527819, 35571556, 37754018, 40092548, 42625443, 45372786, 48338717, 51555093, 55079552, 58948632, 63181875, 67836973, 73011408, 78790198, 85253112, 92536609, 100819421, 110240631, 120912171, 133030715, 146902514, 162847747, 181156776, 202114743, 225945495, 252792875, 282990438, 317214718, 355587914, 395826208, 432310117, 457833229, 467190631, 459675730, 438626105, 409022713]
58118D09022713l3632405l4375395l3040575l0636046k7888621k5153858k2524489
58111B01771324k0036291j7724366j5575786j3562369j1714722j0094516q709225
58104A04354049p506723o435304n462124m546387l641264k734375j869218j105792
58096G1052862m40346K18784R18148J457026J408835M84524j112735k787102m019978
58087F7180018m677201m891214m808377m526071m150070l773441l416931l062514
58079C3874199k723847k430610k174992j931609j708705j529886j385558j248796
58071A8740196j121282j020603r38811q54734p72916p11950o67242o20857n75779
58062A1456022n46084n24644m93404m55595m27162m05949l78460l47639l26040
$$ y = [409022713, 375390308, 341014913, 307974338, 277338292, 249449671, 224295813, 201771324, 181735033, 164010667, 148434881, 134872512, 123157790, 113063274, 104354049, 96847326, 90412022, 84949898, 80403511, 76762247, 74027872, 72158654, 71052862, 70612516, 70831300, 71749448, 73206474, 74615309, 75099833, 73987098, 71199996, 67180018, 62502817, 57611603, 52803226, 48277155, 44127085, 40353644, 36936713, 33874199, 31150352, 28719742, 26544750, 24613141, 22904436, 21374550, 19988992, 18740196, 17618914, 16598311, 15659500, 14804766, 14031850, 13319900, 12652658, 12031801, 11456022, 10909938, 10385294, 9891890, 9436295, 9009133, 8603184, 8224724, 7877085, 7551045]
58053G551045l10570k90687k72507k68579k72284k67630k56141k49795k45958
58044E116894k33715k17029k07513k01454j87453j69759j60921j57810j47777
58035C433463j32759j24786j22623j14806j01619r3175q9568q2737p4097p1135
58025B426158p0600o3885n4860n3700n7242n4230m6137m3839m7047m5801l9760
58014A849057l7586l9122l6071k9021k6722k9351k8743k4273k2903k4554k2593
58003A528118j7851j7445k0669k0336j6801j6656j8976j6908j1592j0584j3604
57992A346696j3465r888q993j0391q288m197n064r647j0014n905m558o952p066
57979A242268m415m569p441p346m439m259o492n917l591n089q613p230k241j660
$$ y = [7551045, 7240475, 6949788, 6677281, 6408702, 6136418, 5868788, 5612647, 5362852, 5116894, 4883179, 4666150, 4458637, 4257183, 4069730, 3899971, 3739050, 3581240, 3433463, 3300704, 3175918, 3053295, 2938489, 2836870, 2743695, 2654127, 2571390, 2497293, 2426158, 2355558, 2291673, 2236813, 2183113, 2125871, 2071641, 2025504, 1981665, 1934618, 1888817, 1849057, 1811471, 1772349, 1736278, 1707257, 1680535, 1651184, 1622441, 1598168, 1575265, 1550711, 1528118, 1510267, 1492822, 1472153, 1451817, 1435016, 1418360, 1399384, 1382476, 1370884, 1360300, 1346696, 1333231, 1323343, 1314350, 1303959, 1295671, 1291474, 1286410, 1276763, 1266749, 1260844, 1256286, 1249334, 1242268, 1237853, 1233284, 1225843, 1218497, 1214058, 1209799, 1203307, 1197390, 1193799, 1188710, 1180097, 1172867, 1170626, 1168966]
57965A168966n831p123l984k708m837n301l816n773j0652j1607p928o374q622
57952A084410q938n921n045p574q062n199m458p523r277p722p093q828r038p135
57938I82597p491j0361j0401o413l702m646n626n048n634p098n406j066O64n88
57924I09781O37N371Q046O485N141O290O626M816M025M811L761R54N46K316J173
57909I70779l343n850n026n607q584q855n240l464o028q071o612n247o263o607
57895H85982n189n810r125r899o174l129l944m778k857j634l413m482k248j07
57881H23193n89n57K132L990K587J328K762L451M28l217m064l970n314o279n572
57866H10309o364j0468j3783j2426q771o719n581l272j118p83l40K126M643M949
$$ y = [1168966, 1163135, 1156012, 1152028, 1149320, 1144483, 1139182, 1135366, 1129593, 1118941, 1107334, 1099406, 1093032, 1084410, 1075472, 1069551, 1064506, 1056932, 1048870, 1043671, 1039213, 1031690, 1022413, 1014691, 1007598, 998770, 989732, 982597, 975106, 964745, 954344, 947931, 944229, 939583, 933957, 928909, 923275, 916177, 910771, 909705, 910369, 909781, 910418, 915789, 923835, 930320, 935461, 941751, 948377, 953193, 957218, 962029, 965790, 966744, 967290, 969606, 970779, 967436, 961586, 956560, 950953, 942369, 933514, 928274, 924810, 918782, 910711, 904099, 898852, 892589, 885982, 880793, 874983, 865858, 855959, 849785, 846656, 842712, 837934, 835077, 833443, 830030, 825548, 823300, 823193, 822604, 822047, 824179, 828169, 830756, 832084, 834846, 838297, 838725, 835508, 831444, 827474, 822160, 815881, 810309, 803945, 793477, 779694, 767268, 758497, 751778, 746197, 742925, 741807, 741024, 740684, 742810, 747453, 752402]
57852G52402M394M710M711L570L407N268O564N821N714Q036R923Q814O899O848
57838H37081P080N135K181L21j168l377m929m824m882o233o789n279m191n651
57824H04475p830q526q803r923j0144p915n042l654k902j560p15j210j518o57
57810G34076m9j84J033M264O832P220P617R426J0340Q753O981O981O801M600K381
57795H17072K223K391O84j636k800m027o570q368p322n279n231o892q130q404
57781G57711q086o907n499n936q366r936r100p853p646o865m879m562p599j0861
57767F53616j0866q779p751q252q980r624r853q481o112n610p623r077q390q086
57753E36132r658j0176p436m149l320l387j931l09l88l42J882M221M103L284M486
$$ y = [752402, 756796, 761506, 766217, 769787, 773194, 778462, 785026, 790847, 796561, 804597, 814520, 823334, 830233, 837081, 844161, 849296, 851477, 851798, 850630, 847253, 842324, 837500, 832618, 826385, 819596, 814317, 810126, 804475, 796645, 788119, 779316, 769393, 759249, 751334, 746292, 742638, 739736, 738176, 737461, 736251, 734733, 734076, 734027, 733843, 734876, 739140, 745972, 753192, 760809, 770235, 780575, 789328, 796309, 803290, 810091, 814691, 817072, 819295, 821686, 822370, 820734, 817934, 813907, 807337, 798969, 791647, 786368, 781137, 774245, 766115, 757711, 749625, 742718, 737219, 731283, 722917, 712981, 703881, 696028, 688382, 681517, 676638, 672076, 664477, 653616, 642750, 633971, 626220, 617968, 608988, 599364, 589511, 581030, 574918, 569308, 561685, 552608, 544218, 536132, 526474, 516298, 508862, 504713, 501393, 498006, 496075, 495766, 495378, 495036, 496918, 501139, 505242, 508526, 513012]
57738E13012O229N703M148M605O513P098O292N874N540L998K317K329L174K923
57724E79755J840R60l22k062j921Q80K613R4m015n282m158l966m776m364l218
57709E52058l337l660j851N27r3k996l878j573P39J121J166K252L468M056M556
57694E52555M993M602L667L367L878M626N805P524Q384P177N040L829L611L850
57680F22908N248P954R801R182P883Q184Q977P981O025N740P282Q688R276R661
57666G34790R683R332J0257J3384J6529J7312J6685J6690J6834J6110J6305J9395
57654I13306K3448K5156K4970K5741K7806K9423L0653L2728L4829L5552L6364
57643A239976L9616M4305M7799N0293N3601N7157N9683O3205P0353P8974Q4660
$$ y = [513012, 519241, 524944, 529092, 533697, 540210, 547308, 553600, 559474, 565014, 569012, 571329, 573658, 576832, 579755, 581595, 582555, 582233, 580171, 578250, 579130, 581743, 581837, 577822, 572540, 568382, 564416, 559640, 555276, 552058, 548721, 545061, 543210, 543737, 543644, 540648, 536770, 535197, 535936, 537057, 538223, 540475, 543943, 547999, 552555, 557548, 562150, 565817, 569184, 573062, 577688, 583493, 591017, 599401, 606578, 611618, 615447, 619058, 622908, 628156, 636110, 645911, 655093, 662976, 671160, 680137, 688118, 694143, 699883, 707165, 715853, 725129, 734790, 744473, 753805, 764062, 777446, 793975, 811287, 827972, 844662, 861496, 877606, 893911, 913306, 936754, 961910, 986880, 1012621, 1040427, 1069850, 1100503, 1133231, 1168060, 1203612, 1239976, 1279592, 1323897, 1371696, 1421989, 1475590, 1532747, 1592430, 1655635, 1725988, 1804962, 1889622]
57632A889622Q7744R2433R9771J07200J14833J26083J41289J56432J69564J83392
57622C168363J99929K17225K33150K48023K61597K71280K75345K74441K68194
57613E417547K53512K28056J93114J52011J08352O6017K7102j1503n6008j08246
57603F269954j62397k10015k45760k67824k76461k74176k65008k51793k35386
57594D081134k16862j98195j80168j61974j43498j25930j09781r4547q0549o8685
57584B700945n8234m7449l6517k7281j9988j3001n897K35N811J2892K1695L0090
57572B563301L7299M5109N4451O3670P1594P9836R0643J04100J18415J31597J42563
57561C502578J52102J62538J74732J86177J93946J98174J99685J95422J80372
$$ y = [1889622, 1977366, 2069799, 2169570, 2276770, 2391603, 2517686, 2658975, 2815407, 2984971, 3168363, 3368292, 3585517, 3818667, 4066690, 4328287, 4599567, 4874912, 5149353, 5417547, 5671059, 5899115, 6092229, 6244240, 6352592, 6418609, 6445711, 6434208, 6378200, 6269954, 6107557, 5897542, 5651782, 5383958, 5107497, 4833321, 4568313, 4316520, 4081134, 3864272, 3666077, 3485909, 3323935, 3180437, 3054507, 2944726, 2850179, 2769630, 2700945, 2642711, 2595262, 2558745, 2531464, 2511476, 2498475, 2492578, 2492813, 2498624, 2511516, 2533211, 2563301, 2600600, 2645709, 2700160, 2763830, 2835424, 2915260, 3005903, 3110003, 3228418, 3360015, 3502578, 3654680, 3817218, 3991950, 4178127, 4372073, 4570247, 4769932, 4965354, 5145726]
57552E145726J53777J19505Q0325L5982j2398o0178j02971j39374j68912j90522
57542D860960k04309k12030k14721k12372k06302j99079j91417j82144j71606
57533C066980j61841j52913j42518j30097j18019j07901r8935r0619q3705p7654
57523A902778p0704o3283n7882n4618n0670m5129m0461l7966l5810l2974l1020
57512A382261l0227k8125k3925k0312j8587j6166j1504p461o669p215o286m692
57500A201092m201l451m10L560N952P503J0542J4553J7036J7796J9047K1822K4993
57487A335834K7508K9383L0914L2476L4562L6892L8531L9769M2420M7308N3118
57476A748715N8620O4007O9287P3820P8522Q5636R4974J03339J09386J15907J25225
$$ y = [5145726, 5299503, 5419008, 5499333, 5535315, 5522917, 5462739, 5359768, 5220394, 5051482, 4860960, 4656651, 4444621, 4229900, 4017528, 3811226, 3612147, 3420730, 3238586, 3066980, 2905139, 2752226, 2609708, 2479611, 2361592, 2253691, 2154756, 2064137, 1980432, 1902778, 1832074, 1768791, 1710909, 1656291, 1605621, 1560492, 1520031, 1482065, 1446255, 1413281, 1382261, 1352034, 1323909, 1299984, 1279672, 1261085, 1244919, 1233415, 1225954, 1219285, 1212070, 1205784, 1201092, 1196891, 1193440, 1193030, 1196590, 1202542, 1210045, 1220587, 1235140, 1252176, 1269972, 1289019, 1310841, 1335834, 1363342, 1392725, 1423639, 1456115, 1490677, 1527569, 1566100, 1605869, 1648289, 1695597, 1748715, 1807335, 1871342, 1940629, 2014449, 2092971, 2178607, 2273581, 2376920, 2486306, 2602213, 2727438]
57465B727438J35477J43866J50475J55839J57623J53086J42720J28296J09184
57456D004004Q3770N2785J8476j7691n3694q5349j09387j26655j39486j47626
57446C479147j49896j47990j44937j40961j34374j25599j16992j09292j01320
57437B307786r2640q3725p4281o4181n5262m9203m4390l7797k9392k1670j5500
57426A739745r585l746O54L708P416J2563J7681K1634K5190K9516L4925M1216
57414A920917M7726N3263N7698O3092P1370Q1351R0200R7385J04891J13798J22958
57403B824649J31095J37855J42388J43048J38932J30083J15760R4252O5068L0182
57393C953312p243m4369p8877j08868j33064j50741j61729j66865j67798j65655
$$ y = [2727438, 2862915, 3006781, 3157256, 3313095, 3470718, 3623804, 3766524, 3894820, 4004004, 4087774, 4140559, 4159035, 4141344, 4087650, 4002301, 3892914, 3766259, 3626773, 3479147, 3329251, 3181261, 3036324, 2895363, 2760989, 2635390, 2518398, 2409106, 2307786, 2215146, 2131421, 2057140, 1992959, 1937697, 1888494, 1844104, 1806307, 1776915, 1755245, 1739745, 1730160, 1726414, 1727068, 1730776, 1738192, 1750755, 1768436, 1790070, 1815260, 1844776, 1879701, 1920917, 1968643, 2021906, 2079604, 2142696, 2214066, 2295417, 2385617, 2483002, 2587893, 2701691, 2824649, 2955744, 3093599, 3235987, 3379035, 3517967, 3648050, 3763810, 3858062, 3923130, 3953312, 3946069, 3901700, 3822823, 3713955, 3580891, 3430150, 3268421, 3101556, 2933758, 2768103]
57383B768103j60640j53506j46129j39601j32995j25230j16966j09311j01946
57374A581779r4041q5928p8301p0887o3515n7356n3377n0474m6904m2652l8828
57363H99516l5669l2776l0353k8636k6933k4661k2257k0020j7480j5136j4860
57352F30735j6827j8164j6636j3737j1858j0626q786p541q589j0361r861p290
57340D90459n506n520n791n481n271n326n195n320o041n901l734j472j676l196
57326D25029k738j83J328L92j281k441l653m710m225k453j435j684j690j052j198
57311C98006k337k764j890j166j241q92M79J753K142J919P73j967n033n966m545
57296C77271l028k536k027j171j195k160k399j435o59l86P98K928L990L388L018
$$ y = [2768103, 2607463, 2453957, 2307828, 2168227, 2035232, 1910002, 1793036, 1683725, 1581779, 1487738, 1401810, 1323509, 1252622, 1189107, 1131751, 1078374, 1027900, 980996, 938344, 899516, 863847, 831071, 800718, 772082, 745149, 720488, 698231, 678211, 660731, 645595, 630735, 613908, 595744, 579108, 565371, 553513, 542887, 534101, 526560, 517971, 507610, 497749, 490459, 484953, 479433, 473642, 468161, 462890, 457564, 452369, 447049, 441008, 435107, 431373, 429901, 428225, 425029, 422291, 422108, 423436, 423828, 422547, 420106, 416453, 411743, 407518, 405065, 403630, 401946, 400256, 399204, 398006, 395669, 392905, 391015, 389849, 388608, 387716, 388195, 389948, 392090, 394009, 394782, 392815, 387782, 381816, 377271, 374243, 371707, 369680, 368509, 367314, 365154, 362755, 361320, 360661, 360275, 361073, 364001, 367991, 371379, 374397]
57281C74397L734L857K592J871L076M681N042N011N780O342N140K636N58L1J503
57266D26251M842Q428R913Q836O846M962K839J096J447L496M376K981J779K844
57252D90936M771N393N065N196N660N741N798O205O299N857N910O736P156P024
57238E73747Q137J1048J3407J3345J2333J2695J4302J5697J6632J7522J8089J8345
57226G45299J9230K0639K0796J9157J7870J8493J9552J9423J9407K1458K4737
57215I66061K6984K7775K7999K7507K5537K2241J7848J1757M297k209o171q993
57203A140633j2618j6596j9507k1445k2821k2533j9793j6167j3306j0293n708
57192I59846o95K732M943P398R623J0376J0618J2127J4175J4659J3867J4054J5748
$$ y = [374397, 378131, 381988, 384580, 386451, 389527, 394208, 399250, 404261, 410041, 416383, 421523, 424159, 424717, 424748, 426251, 431093, 439521, 449434, 458270, 465116, 470078, 472917, 474013, 475460, 478956, 483332, 486313, 488092, 490936, 495707, 501100, 506165, 511361, 517021, 522762, 528560, 534765, 541064, 546921, 552831, 559567, 566723, 573747, 581884, 592932, 606339, 619684, 632017, 644712, 659014, 674711, 691343, 708865, 726954, 745299, 764529, 785168, 805964, 825121, 842991, 861484, 881036, 900459, 919866, 941324, 966061, 993045, 1020820, 1048819, 1076326, 1101863, 1124104, 1141952, 1153709, 1158006, 1155797, 1149626, 1140633, 1128015, 1111419, 1091912, 1070467, 1047646, 1025113, 1005320, 989153, 975847, 965554, 959846, 959151, 961883, 966826, 974224, 983847, 994223, 1004841, 1016968, 1031143, 1045802, 1059669, 1073723, 1089471]
57179A089471J7391J8394J9726K1649K3404K5223K8295L2620L6830M0067M2307
57168A395377M3332M3205M3199M4387M5869M6412M7113N0141N5257N9821O2263
57157A936376O3503O4865O6205O6308O4074N9580N4690N1738N0837M9683M7044
57146B574903M4702M4623M6042M7119M7675M8264M8270M7016M5280M3721M1564
57135C079179L8761L7225L7622L7296L4243L0822L0217L1355L0990K9098K8207
57124C445015K8732K8957K8718K9278L0144K9632K8064K7112K6682K5617K4772
57113C752723K5886K8231K9656L0201L1351L2725L2999L3070L4594L6225L5212
57102D102873L1990K9492K8548K7630K6295K5346K4533K3699K4590K7639K8782
$$ y = [1089471, 1106862, 1125256, 1144982, 1166631, 1190035, 1215258, 1243553, 1276173, 1313003, 1353070, 1395377, 1438709, 1481914, 1525113, 1569500, 1615369, 1661781, 1708894, 1759035, 1814292, 1874113, 1936376, 1999879, 2064744, 2130949, 2197257, 2261331, 2320911, 2375601, 2427339, 2478176, 2527859, 2574903, 2619605, 2664228, 2710270, 2757389, 2805064, 2853328, 2901598, 2948614, 2993894, 3037615, 3079179, 3117940, 3155165, 3192787, 3230083, 3264326, 3295148, 3325365, 3356720, 3387710, 3416808, 3445015, 3473747, 3502704, 3531422, 3560700, 3590844, 3620476, 3648540, 3675652, 3702334, 3727951, 3752723, 3778609, 3806840, 3836496, 3866697, 3898048, 3930773, 3963772, 3996842, 4031436, 4067661, 4102873, 4134863, 4164355, 4192903, 4220533, 4246828, 4272174, 4296707, 4320406, 4344996, 4372635, 4401417]
57091D401417K4101J6004R845O108J352m666q947j1274j4116j7255j8806k0974
57079D362789k8214l9920n1472o2187p5273r0073j02011j10748j20729j32727
57069C549435j42576j49493j57859j69028j79183j87072j96203k07549k18129
57060A942343k28864k45809k71278l01929l37536A74140b63796m96903n57385
57051a318084o23850o97990p76584q61769r62664j083344j220372j375438j557801
57042a0477896j770003k003551k251904k512373k771475l007209l214267l411568
57034c1420246l620396l854057m128898m452747m793693n098083n352819n585185
57026f8306124n795677n996382o404356p495048r633263j2532674j5160773j6302513
$$ y = [4401417, 4425518, 4441522, 4451367, 4457475, 4458827, 4454161, 4445214, 4433940, 4419824, 4402569, 4383763, 4362789, 4334575, 4294655, 4243183, 4180996, 4105723, 4015650, 3913639, 3802891, 3682162, 3549435, 3406859, 3257366, 3099507, 2930479, 2751296, 2564224, 2368021, 2160472, 1942343, 1713479, 1467670, 1196392, 894463, 556927, 174140, -263796, -760699, -1318084, -1941934, -2639924, -3416508, -4278277, -5240941, -6324285, -7544657, -8920095, -10477896, -12247899, -14251450, -16503354, -19015727, -21787202, -24794411, -28008678, -31420246, -35040642, -38894699, -43023597, -47476344, -52270037, -57368120, -62720939, -68306124, -74101801, -80098183, -86502539, -93997587, -103630850, -116163524, -131324297, -147626810]
57018a47626810j5274847j2170426p590067k290396K977417P532786J0880946
57011a63561397J2829740J3495701J3202308J2346818J1281791J0236816R310562
57004h0857661Q522601P863017P304244O803549O322695N843585N360194M868330
56996b7969446M372474L890705L440635L026092K644158K296626J986604J711600
56988d600552J468634J260390g82703A65026Q28234P26851O42333N69811N04643
56979C436898M47846M01650L63318L28557K97098K69499K42222K11481J78917
56970F177486J48516J20900R5496P5134O2902N6538N0928M4587L9396L5629L1526
56959F939038K6548K1192J4621N721m473j4028k2454k9664l4665l7529m0339m3860
$$ y = [-147626810, -162901657, -175072083, -182662150, -184952546, -181975129, -174442343, -163561397, -150731657, -137235956, -124033648, -111686830, -100405039, -90168223, -80857661, -72335060, -64472043, -57167799, -50364250, -44041555, -38197970, -32837776, -27969446, -23596972, -19706267, -16265632, -13239540, -10595382, -8298756, -6312152, -4600552, -3131918, -1871528, -782703, 165026, 993260, 1720111, 2362444, 2932255, 3436898, 3884744, 4286394, 4649712, 4978269, 5275367, 5544866, 5787088, 5998569, 6177486, 6326002, 6446902, 6542398, 6617532, 6680434, 6736972, 6787900, 6832487, 6871883, 6907512, 6939038, 6965586, 6986778, 7001399, 7007120, 7002647, 6988619, 6966165, 6936501, 6901836, 6864307, 6823968, 6780108]
56947F780108m5901m5530m6064n1095o0276p1309q2015q7640q2388p0446p1384
56936F066060j05192j70888k45620l05135l40134l53660l51138l37192l17050
56927C540051k95366k73965k52741k31766k11448j91959j73714j57590j44084
56918A607418j33011j23982j16315j08854j00926r3002q5392p7296o8468o0492
56908F39680n4557m9174m2279l4443k7673k2000j5971r608l965J588Q517J5655
56896D05770J9726J9442J6376J1665M868l372j0528j5067j7713j9133j8710j6496
56884C76828j4152j2799j1739j0205q527o876m576j455J734M735P983J1152J3481
56871C45584J5765J9582K3709K3825J7082N168q011j9622k7872l1389l0604k8126
$$ y = [6780108, 6734207, 6688677, 6642613, 6591518, 6531242, 6459933, 6377918, 6290278, 6207890, 6137444, 6066060, 5960868, 5789980, 5544360, 5239225, 4899091, 4545431, 4194293, 3857101, 3540051, 3244685, 2970720, 2717979, 2486213, 2274765, 2082806, 1909092, 1751502, 1607418, 1474407, 1350425, 1234110, 1125256, 1024330, 931328, 845936, 768640, 700172, 639680, 585123, 535949, 493670, 459227, 431554, 409554, 393583, 383975, 380010, 381598, 390115, 405770, 425496, 444938, 461314, 472979, 477847, 474475, 463947, 448880, 431167, 412034, 393324, 376828, 362676, 349877, 338138, 327933, 319406, 312530, 307954, 306499, 308233, 312968, 320951, 332103, 345584, 361349, 380931, 404640, 428465, 445547, 450715, 442704, 423082, 395210, 363821, 333217, 305091]
56859C05091k5876k3160j9045j4890j2719j2239j1496r717p727o230n247m859
56847A51886n064n147m247k410l50J297K001J372j05j151j282j517k724m139m475
56832A23945l738k919k475k071j237M66L438P258J0413J1455J0144P163L442J78
56818A65462j423j084M39K533N223Q111J0056J0676J1208J3147J6665K0899K4900
56805B86812K8012L0273L2872L7043M2239M6647M9557N1162M9657M1308K5194
56794G20776N971j0057k0339k6087k8762k8808k6676k2836j7260j0444l968J490
56782E33000P473J5179K3028K9064L4479M1852N0849N8775O5045P1290P6329P4409
56770A080772O0538L5908O903j9706l9693n1676n6717n7257n5273n1400m5926
$$ y = [305091, 279215, 256055, 237010, 222120, 209401, 197162, 185666, 175949, 168222, 161992, 156745, 151886, 146822, 141675, 137428, 135018, 134668, 135965, 137966, 139338, 139233, 138082, 136800, 135283, 132559, 128420, 123945, 120207, 117288, 114813, 112742, 111505, 111971, 115409, 122667, 133080, 144535, 154679, 161842, 165284, 165462, 164039, 162955, 163394, 165927, 171150, 179261, 189317, 199993, 211201, 224348, 241013, 261912, 286812, 314824, 345097, 377969, 415012, 457251, 503898, 553455, 604617, 654274, 695582, 720776, 726747, 716690, 696351, 670264, 641502, 612694, 586018, 563182, 545922, 535478, 531510, 533000, 540473, 555652, 578680, 607744, 642223, 684075, 734924, 793699, 858744, 930034, 1006363, 1080772, 1141310, 1177218, 1184121, 1164415, 1124722, 1073046, 1016329, 959072, 903799, 852399, 806473]
56759H06473l9736l3757k8090k2066j4872o141L485J2551K0058K6376L2279L7594
56747G94154M1524M3373M1810L4471K0310K040j5496k9255l8802m3946m4235m1036
56735G64912l7532l5499l3741l0577k6154k1497j6944j2624q987n609q07O108
56723E41049J3228J7973J9967K0751K1107J9814J5011O070n579j7002k5377k9651
56711E97361l0710l0005k8472k6611k4767k2986k1097j9105j7146j5203j3283
56700C47976j1712j0623r607q440p535o880n521l352k308l831o042n864l457j900
56686B60904k495l319k922k443k902l202k388j583j888k464k451k781m118m785
56672B21163l124n70P2j505l191l743l863m278m749m896m515l269j283J81q7j644
$$ y = [806473, 766737, 732980, 704890, 682824, 667952, 661811, 665296, 677847, 697905, 724281, 756560, 794154, 835678, 879051, 920861, 955332, 975642, 977682, 962186, 932931, 894129, 850183, 805948, 764912, 727380, 691881, 658140, 627563, 601409, 579912, 562968, 550344, 541357, 535748, 534941, 541049, 554277, 572250, 592217, 612968, 634075, 653889, 668900, 674970, 669391, 652389, 627012, 597361, 566651, 536646, 508174, 481563, 456796, 433810, 412713, 393608, 376462, 361259, 347976, 336264, 325641, 316034, 307594, 300059, 293179, 287658, 284306, 281998, 278167, 272125, 266261, 262804, 260904, 258409, 255090, 252168, 249725, 246823, 243621, 241233, 239650, 237762, 235298, 232847, 230066, 225948, 221163, 218039, 217469, 217541, 216036, 212845, 209102, 205239, 200961, 196212, 191316, 186801, 183532, 182249, 182430, 182343, 180699]
56656A80699l048l573l267k003Q3J714J641M75L0R03J871J653K50j402k179j397
56640A72450M63J818J582M34k23r1l5p40k130l638m362l600k013j426k461l231
56624A52797j623J667L860L509J876J048J859L652N187N632N241M909M744L821
56610A98179J791p2l68P23K118L272L872L077N84k092k912j702j60K25o20j804
56594B04111k216j343j83o02k952n275n885n613o117p100o984n479l690k266j226
56579A47180j094k320l908m314l430k259j106K23J052N88l31j77R29J704K080
56564A34817L019M173M173L210K977L723L726K238P76O43J174J301J146J135J017
56549A69248P65J046J944K512K234J761J564J174L76r3K47Q22J060J145J223J057
$$ y = [180699, 177651, 174078, 170811, 168808, 168891, 170605, 172246, 172721, 172751, 173654, 175525, 177178, 177428, 176026, 173847, 172450, 172913, 174731, 176313, 176747, 176524, 176433, 176398, 175658, 173528, 169890, 165528, 161928, 159915, 158489, 156028, 152797, 151174, 152841, 156701, 160210, 162086, 163134, 164993, 168645, 173832, 179464, 184705, 189614, 194358, 198179, 199970, 199898, 199530, 200253, 202371, 205643, 209515, 212592, 213176, 211084, 208172, 206470, 206310, 206535, 205915, 204111, 201895, 200552, 200369, 199767, 196815, 191540, 185655, 180042, 173925, 166825, 159841, 154362, 150672, 148406, 147180, 146086, 143766, 139858, 135544, 132114, 129855, 128749, 128972, 130024, 130612, 130281, 130104, 131033, 132737, 134817, 137836, 142009, 146182, 149392, 152369, 156092, 159818, 162056, 162832, 163475, 164649, 165950, 167096, 168231, 169248, 170013, 171059, 173003, 175515, 177749, 179510, 181074, 182248, 182624, 182531, 182778, 183600, 184660, 185805, 187028, 188085]
56533A88085Q73J400K538L154K737J997J392M96n52m93J213L213L950L542K969
56518B16514K431J629R91J460L259N564P227P555O787N971N894O059N575M996
56504B81912O062R142J2128J2690J0894Q758P918Q412R449J0372J0856J0719R897
56491D09209Q630P416O493N451L880K298J662J755J160o62k444k981k789l036
56477D36042l942n195o722p926p665o298o124q018r461q143n878o008q182r059
56463C37421p426n343m336l805l391l759m576m538l862l996m526l370o10R60Q3
56448B84926j099o45M43M40n38j576k429k819k253j453j834k872k340J37K330
56433B68418L056L611M447L624L60k745l128j548M6J493L223M206L565K412K090
$$ y = [188085, 188958, 190358, 192896, 196050, 198787, 200784, 202176, 202672, 202120, 201627, 202840, 206053, 210003, 213545, 216514, 218945, 220574, 221565, 223025, 226284, 231848, 239075, 246630, 253417, 259388, 265282, 271341, 276916, 281912, 287974, 297116, 309244, 321934, 332828, 341586, 349504, 357916, 367365, 377737, 388593, 399312, 409209, 417839, 425255, 431748, 437199, 441079, 443377, 445039, 446794, 447954, 447292, 444848, 441867, 439078, 436042, 432100, 426905, 420183, 412257, 404592, 398294, 392170, 384152, 374691, 366548, 360670, 354662, 346480, 337421, 329995, 324652, 320316, 316511, 313120, 309361, 304785, 300247, 296385, 292389, 287863, 284493, 283883, 284843, 284926, 283827, 283182, 283625, 284065, 283527, 281951, 279522, 276703, 274450, 272997, 271163, 268291, 265951, 266088, 268418, 271474, 275085, 279532, 283156, 283516, 280771, 277643, 276095, 276141, 277634, 280857, 285063, 288628, 291040, 293130]
56418B93130K175K036K524M177N513N164M156M123M804N100N043M979M472L745
56404C51141M381O686Q266P322N532N445O694P226O701O155N628M661M131N051
56390D35020O263N636L066M81o13j57J095J808P20j638k984k281j249j656k972
56375D40539m137n552p284p432m753j326r2j056k276l151m300n415n760n808o117
56360C76080n711l807j866j605k228k071j715k681m273m499l416k751k837k509
56346C34111j620j200j431j575j441j041L45K675L837K176o18j615p01J4oO33
56330C32543K281L652M083M049L595K403J249J300K148K354J630Q39L84J96O26
56315C63332J839L153M334O106P966P562M255J167J043K154J454k22J96K590M000
$$ y = [293130, 295305, 297341, 299865, 304042, 309555, 314719, 318875, 322998, 327802, 332902, 337945, 342924, 347396, 351141, 355522, 362208, 370474, 377796, 383328, 388773, 395467, 402693, 409394, 415549, 421177, 425838, 429969, 435020, 441283, 446919, 449985, 450466, 449853, 449696, 450791, 452599, 453319, 451681, 448697, 446416, 445167, 443511, 440539, 436402, 430850, 423566, 416134, 411381, 410055, 409963, 408907, 406631, 403480, 399180, 393765, 388005, 382197, 376080, 370369, 366562, 364696, 363091, 360863, 358792, 357077, 354396, 350123, 345624, 342208, 339457, 336620, 334111, 332491, 331291, 329860, 328285, 326844, 325803, 326148, 328823, 332660, 334836, 334218, 332603, 331902, 331916, 331910, 332543, 334824, 338476, 342559, 346608, 350203, 352606, 353855, 355155, 357303, 359657, 361287, 362126, 362510, 362706, 363332, 365171, 368324, 372658, 378764, 386730, 394292, 398547, 399714, 400757, 402911, 404365, 404143, 404339, 406929, 410929]
56300D10929L640L590M671N282M523L287K128Q42K23J346L182L639K829K670L446
56285D56227L693L239L392M138M066L202L145M145M692M168L545L287K966K938
56271E06843M085N923P157P861R015J0270J0580J0508J1494J3251J4302J4625
56259F25914J5271J5973J5704J5061J5478J6538J6644J5716J4799J3710J1703
56248G92511R687R065R265Q857Q171Q076P595N678L918M229N266M574K892K746
56234H82530M104N274O551Q902J0659R982R171J1742J6447J9215J9856K1416K3876
56221A049725K4463K3854K5919L0922L4915L6663L9338M4394M9307N2778N6829
56210A469107O2275O7259P1738P8363Q7321R5226J00747J06715J15028J24213
$$ y = [410929, 414569, 418159, 422830, 428112, 432635, 435922, 438050, 438892, 439115, 440461, 443643, 447282, 450111, 452781, 456227, 459920, 463159, 466551, 470689, 474755, 477957, 481102, 485247, 489939, 494107, 497652, 500939, 503905, 506843, 510928, 516851, 524008, 531869, 540884, 551154, 561734, 572242, 583736, 596987, 611289, 625914, 641185, 657158, 672862, 687923, 703401, 719939, 736583, 752299, 767098, 780808, 792511, 802198, 811263, 820528, 829385, 837556, 845632, 853227, 858905, 862823, 867052, 872318, 876892, 879784, 882530, 886634, 891908, 898459, 907361, 918020, 928002, 937173, 948915, 965362, 984577, 1004433, 1025849, 1049725, 1074188, 1098042, 1123961, 1154883, 1189798, 1226461, 1265799, 1310193, 1359500, 1412278, 1469107, 1531382, 1598641, 1670379, 1748742, 1836063, 1931289, 2032036, 2138751, 2253779, 2377992]
56200B377992J33546J44738J57765J69712J79566J89581K00420K09637K16476
56191C979433K22984K28571K28857K22284K12652K02357J88250J67256J41425
56182E794069J14167Q5874N6629K9184N635j5623l6428n5327p0204q1460r0343
56171E736173r6929j01773j06456j10972j13766j15657j19861j26821j33275j37819
56161D572844j42831j49124j53636j54733j55049j56510j57064j54941j51740
56152C197216j48587j43681j36322j29074j23272j16723j08393j00852r5393q9360
56142B005559q1157p3266o7434o1605n4732m9632m7652m5383m0341l5290l3064
56131A416003l1607k8224k4516k2845k1773j9038j5535j2704r466n172k003j274
$$ y = [2377992, 2511538, 2656276, 2814041, 2983753, 3163319, 3352900, 3553320, 3762957, 3979433, 4202417, 4430988, 4659845, 4882129, 5094781, 5297138, 5485388, 5652644, 5794069, 5908236, 5994110, 6050739, 6079923, 6085558, 6069935, 6033507, 5978180, 5907976, 5826516, 5736173, 5639244, 5537471, 5431015, 5320043, 5206277, 5090620, 4970759, 4843938, 4710663, 4572844, 4430013, 4280889, 4127253, 3972520, 3817471, 3660961, 3503897, 3348956, 3197216, 3048629, 2904948, 2768626, 2639552, 2516280, 2399557, 2291164, 2190312, 2094919, 2005559, 1924402, 1851136, 1783702, 1722097, 1667365, 1617733, 1570081, 1524698, 1484357, 1449067, 1416003, 1384396, 1356172, 1331656, 1308811, 1287038, 1268000, 1252465, 1239761, 1230295, 1225123, 1223120, 1221846]
56119A221846r61L67J330J872M755R965J3018J2219J2134J5914J9904K0341J9903
56106A352607K2319K5683K6659K6711K8427K9680K7203K2478J8898J6329J3274
56095A610268J0972J0613J0107Q118P540J0528J4134J5488J7064K1920K7988L2297
56083A797037L6738M4241N3059O0277O7379P7142Q8581R9795J12067J26199J38786
56072B701301J47000J52855J57867J58129J50219J37597J25690J15207J05572
56063C951437R9542R7681R2994P8322N5593L1539Q364j4692l4857m8402n6997
56052D260524o5037p3514q2153r3713j09930j26524j38126j44662j47665j45039
56042C134161j35617j24046j14555j04613r1311p8721p1508o6304n7516m7207
$$ y = [1221846, 1220885, 1221252, 1222582, 1224454, 1229209, 1239174, 1252192, 1264411, 1276545, 1292459, 1312363, 1332704, 1352607, 1374926, 1400609, 1427268, 1453979, 1482406, 1512086, 1539289, 1561767, 1580665, 1596994, 1610268, 1621240, 1631853, 1641960, 1650078, 1657618, 1668146, 1682280, 1697768, 1714832, 1736752, 1764740, 1797037, 1833775, 1878016, 1931075, 1991352, 2058731, 2135873, 2224454, 2324249, 2436316, 2562515, 2701301, 2848301, 3001156, 3159023, 3317152, 3467371, 3604968, 3730658, 3845865, 3951437, 4050979, 4148660, 4241654, 4319976, 4375569, 4407108, 4415472, 4400780, 4365923, 4317521, 4260524, 4195487, 4121973, 4039820, 3946107, 3836177, 3709653, 3571527, 3426865, 3279200, 3134161, 2998544, 2874498, 2759943, 2655330, 2564019, 2485298, 2413790, 2347486, 2289970, 2242763]
56032B242763m1033l8423l4989l1005k9372k8564k5228k0638j7595j4631r956
56021A951329o626o844o195q73M704N218L667N117P245O035M881Q492J3406J4289
56007B003845J3981J7242K0484J8494J5611J8782K4761K6024K4456K7063L2543
55996B243286L4540L4177L7029M1288M1079L8160L8481M0735M0049L9034M3148
55985B671006M9163N0433M9416N2646N7966N9509O0231O5990P2253P1137O6776
55974C326526O8860P5465P7674P6729Q0660Q7846R0457R0721R7238J08281J15274
55963D295731J19586J29130J41565J48082J50750J58672J70082J75949J78136
55954E667683J85800J97116K03288K07356K19670K37892K51158K60828K76841
$$ y = [2242763, 2201730, 2163307, 2128318, 2097313, 2067941, 2039377, 2014149, 1993511, 1975916, 1961285, 1951329, 1944703, 1937859, 1931664, 1930791, 1935495, 1940713, 1944380, 1949497, 1956742, 1962777, 1967658, 1976150, 1989556, 2003845, 2017826, 2035068, 2055552, 2074046, 2089657, 2108439, 2133200, 2159224, 2183680, 2210743, 2243286, 2277826, 2312003, 2349032, 2390320, 2431399, 2469559, 2508040, 2548775, 2588824, 2627858, 2671006, 2720169, 2770602, 2820018, 2872664, 2930630, 2990139, 3050370, 3116360, 3188613, 3259750, 3326526, 3395386, 3470851, 3548525, 3625254, 3705914, 3793760, 3884217, 3974938, 4072176, 4180457, 4295731, 4415317, 4544447, 4686012, 4834094, 4984844, 5143516, 5313598, 5489547, 5667683, 5853483, 6050599, 6253887, 6461243, 6680913, 6918805, 7169963, 7430791, 7707632]
55945G707632K96946L10513L19650L35142L55060L69414L82200M05544M35982
55936A0918083M60605M82582N15362N56020N90889O23204O67005P17983P60069
55927A6291802P97138Q47237R09256R67651J026175J102390J192273J276542J358743
55918B5769207J458716J571700J675059J773357J893586K037866K186381K345041
55910D0710913K541015K772148L013052L270727L578956L939451M329501M767037
55902F8922800N302264N946666O683283P543272Q585813R802570J1141609J2635301
55894A36563578J4403736J6532027J9063404K2096047K5711858K9803374L4161873
55887B98335897L8641567M2708008M4561499M1312447L0982739J4677975l543956
$$ y = [7707632, 8004578, 8315091, 8634741, 8969883, 9324943, 9694357, 10076557, 10482101, 10918083, 11378688, 11861270, 12376632, 12932652, 13523541, 14146745, 14813750, 15531733, 16291802, 17088940, 17936177, 18845433, 19813084, 20839259, 21941649, 23133922, 24410464, 25769207, 27227923, 28799623, 30474682, 32248039, 34141625, 36179491, 38365872, 40710913, 43251928, 46024076, 49037128, 52307855, 55886811, 59826262, 64155763, 68922800, 74225064, 80171730, 86855013, 94398285, 102984098, 112786668, 123928277, 136563578, 150967314, 167499341, 186562745, 208658792, 234370650, 264174024, 298335897, 336977464, 379685472, 424246971, 465559418, 496542157, 511220132, 507676176]
55880E07676176j9223063k9961699l5764969l7801248l7321152l5367337l2739707
55873B79497001k9891039k6973643k4068127k1289871j8707107j6320124j4161541
55866A28085549j2311197j0787644r516496q426415p497222o701664n982953n315493
55858F1546465m723759m220892l783262l397757l077970k818362k582907k354394
55850C4587162k150428j978986j821214j669016j537951j430987j327993j222254
55842B1448333j131356j061734r96843r29969q75122q35600p93909p42981o97158
55833A3383661o62625o25876n81053n40844n10709m78780m40756m09409l90075
55824H743534l70849l46017l25952l15088l02654k83856k68751k61753k53037
$$ y = [507676176, 488453113, 458491414, 422726445, 384925197, 347604045, 312236708, 279497001, 249605962, 222632319, 198564192, 177274321, 158567214, 142247090, 128085549, 115774352, 104986708, 95470212, 87043797, 79546575, 72844911, 66861958, 61546465, 56822706, 52601814, 48818552, 45420795, 42342825, 39524463, 36941556, 34587162, 32436734, 30457748, 28636534, 26967518, 25429567, 23998580, 22670587, 21448333, 20316977, 19255243, 18258400, 17328431, 16453309, 15617709, 14823800, 14080819, 13383661, 12721036, 12095160, 11514107, 10973263, 10462554, 9983774, 9543018, 9133609, 8743534, 8372685, 8026668, 7700716, 7385628, 7082974, 6799118, 6530367, 6268614, 6015577]
55815F015577k38278k26654k21572k13357j98767j88348j86569j83436j73561
55806D185035j65343j63460j60005j50691j42764j39320j32420j19222j08727
55797B903083j05099j00170q9638q1144p9114p6839p0756o7481o9497o8649o1307
55786B033389n5604n6191n5775m9218m2440l9889l6481k9373k4902k6108k5807
55775A591601j9467j3185j1855j1184q242q075j2894j6383j5754j7840k6155l3312
55763A397255l3783l3024l6341l9449l7938l5802l6657l6157l1036k6528k7099
55752A023441k8379k5491k1152j8791j5998j1299q903j0221r181k603L098K292
55740H76813r07p68P69l19k644m012o572j1235j3825j2437j1673j4315j6134j4184
$$ y = [6015577, 5777299, 5550645, 5329073, 5115716, 4916949, 4728601, 4542032, 4358596, 4185035, 4019692, 3856232, 3696227, 3545536, 3402772, 3263452, 3131032, 3011810, 2903083, 2797984, 2697814, 2608176, 2527032, 2447918, 2371079, 2300323, 2232842, 2163345, 2094696, 2033389, 1977785, 1921594, 1865819, 1816601, 1774161, 1734272, 1697791, 1668418, 1643516, 1617408, 1591601, 1572134, 1558949, 1547094, 1535910, 1527668, 1519593, 1506699, 1490316, 1474562, 1456722, 1430567, 1397255, 1363472, 1330448, 1294107, 1254658, 1216720, 1180918, 1144261, 1108104, 1077068, 1050540, 1023441, 995062, 969571, 948419, 929628, 913630, 902331, 893428, 883207, 874026, 871423, 874521, 876813, 875906, 875138, 875907, 875588, 872944, 868932, 862360, 851125, 837300, 824863, 813190, 798875, 782741, 768557]
55726G68557j2476j3885j4356j1062q512j0173j1641q672m703l899l846j926k049
55713F61357p787j4993j8158j8545j9481j9338j5790j1807j0984j1607j1002j0719
55701D91146j1991j1495p296l772m872p511p242n444n402o125n603n449p067p788
55687C94089n821m326n687o776m830k960m567p197p213n883n725n378l170j320
55673C23236j701j808L72K036O48j338j348j437l656n575n061m627o361p442n482
55658B80456l369m025n292m671m091n164n037j959L89o44j317J857N527N437L881
55643B61978M897O771N683K677Q88k44k198k811k88K213J658P93L138O539P478
55628B99172P457R036R826O878L210L213N119M574K415K193L059J733r80k022
$$ y = [768557, 756081, 742196, 727840, 716778, 708266, 698093, 686452, 677780, 673077, 669178, 665332, 663406, 661357, 653570, 638577, 620419, 601874, 582393, 563055, 547265, 535458, 524474, 512867, 501865, 491146, 479155, 467660, 460364, 456592, 451720, 444209, 436967, 431523, 426121, 419996, 414393, 408944, 401877, 394089, 388268, 383942, 378255, 371479, 366649, 363689, 359122, 351925, 344712, 338829, 333104, 327726, 324556, 323236, 321535, 319727, 320099, 322135, 322783, 321445, 320097, 318660, 315004, 309429, 304368, 299741, 293380, 285938, 280456, 277087, 273062, 267770, 263099, 259008, 253844, 248807, 246848, 247237, 246593, 245276, 247133, 252660, 258097, 261978, 266875, 273646, 279329, 282006, 282894, 282650, 280452, 277641, 277353, 279566, 281224, 282017, 285155, 291694, 299172, 306629, 315665, 325491, 332369, 335579, 338792, 343911, 348485, 350900, 353093, 356152, 357885, 356905, 354883]
55614C54883j974l164m418l604k684m347o285m949k303k521m483l978j245R0k35
55599C08783L12J330N14r38J47K995M059L042K596L189L223K955L506L378O20
55584C39711k985m541n007o923r258r318q006q240r855j0732j1105j2184j2628
55571B28929j1091r801j0786j1273q158m259m178o516o604m781n031o944o234
55558A33273k647o10j708k777j889p00k80L75J114M77j027j487j300k317l798
55543A14699l438j692r29r86J37J909K007O57K5Oj101k558k196o72n33j667j837
55526A01831r02m93m43M22J087J8j310o04R55R44N29K321N076N472L857L219L676
55509A25655L166K440M147P652R821J0205J0530J0181P275L259J163K31k388n693
$$ y = [354883, 352909, 349745, 345327, 341723, 339039, 334692, 328407, 323458, 321155, 318634, 314151, 310173, 308928, 309018, 308783, 309095, 310425, 310939, 310001, 310148, 313143, 317202, 320244, 322840, 326029, 329252, 332207, 335713, 339091, 339711, 336726, 332185, 327178, 320255, 310997, 301679, 293673, 285433, 275578, 264846, 253741, 241557, 228929, 217838, 208037, 197251, 185978, 177820, 173561, 169383, 162867, 156263, 151482, 146451, 139507, 133273, 130626, 130016, 128308, 125531, 123642, 122942, 122662, 123037, 124151, 124628, 123601, 122114, 120814, 118497, 114699, 111261, 109569, 108640, 107654, 107791, 109700, 111707, 112364, 112389, 112395, 111294, 108736, 106540, 105868, 105335, 103668, 101831, 100929, 100436, 99993, 100415, 101502, 101520, 100210, 99606, 100561, 101505, 102034, 104355, 109431, 114903, 118760, 121979, 125655, 128821, 131261, 135408, 143060, 152881, 163086, 173616, 183797, 191072, 194331, 195494, 195725, 193337, 187644]
55495A87644o277m781m929o748o885n319n472p464p571n008l283l877m290l310
55481A12430k694k602q15K306L315J466N0P74J559J100Q70J404J173K53O81K219
55465A23489K198M12l84M12M30o69l48J592K047J29j202n54l14j853l185l179
55449A19021l663n495o736o482o424p022o165l430j627k413l956m418m138l325
55435E3727j490j48j847n363o345l976k288l423m426k835o55k73o81m58n93j685
55419A7241j914k66J331J274N73J59p68k034j741J27J003K62M61K316K797M46
55403B1267j602p74Q20L19j403k269k623l253k849n80J568J894J732K386K301
55388A6934K34j668j191K0p29k534k477l34J444J443L36r04j688j563q24m79o37
$$ y = [187644, 181367, 176586, 171657, 164909, 158024, 152705, 147233, 139769, 132198, 127190, 123907, 120030, 115740, 112430, 109736, 107134, 106319, 108625, 111940, 113406, 113456, 114230, 115789, 116889, 117759, 119163, 120336, 120589, 121270, 123489, 125687, 126099, 125715, 126127, 126557, 125888, 125540, 127132, 129179, 129308, 128106, 127552, 127238, 125385, 122200, 119021, 115358, 109863, 103127, 96645, 90221, 83199, 77034, 73604, 71977, 69564, 65608, 61190, 57052, 53727, 52237, 52089, 50242, 44879, 38534, 34558, 32270, 28847, 24421, 21586, 20931, 20658, 19977, 19519, 18926, 17241, 15327, 15061, 16392, 17666, 18239, 18398, 17630, 15596, 13855, 13982, 14985, 15247, 15708, 18024, 20821, 21267, 19665, 18891, 19711, 20030, 18627, 16358, 13735, 10482, 7633, 7053, 8621, 10515, 12247, 14633, 16934, 17168, 15500, 14309, 14329, 13600, 11066, 8589, 8255, 9699, 11142, 11478, 10574, 8886, 7323, 6499, 6020, 5383]
55371E383l25L36j65j919D77a432q26q54p13Q48c63B474J710M19m42l22J267L123
55353H229K978Q09q57q28p14j502j729m98P26Q86J016J582J175l83q00P85J743
55336A2618R7k151k393j439j513k556d25k771j747N68f25D692L801J142J8N06
55320A0159J213J792K282J930N80l21J01O48K25n02j000k154l980m446k484n3
55304C990P15L27L1n91k121a011l038j709l90R12J774Q53j610l017j956j85N82
55287h795J142K171K024k60k432k195o77q2l8Q17J694J096k22o12m95j168k001
55270a0033j484r8M21j56o64o11k70L87J230J390O40J34N16P76K60P4J017J878
55252d593J388K56j86J40P94f06A113J70d90j306b50B948J733l06k92N96L79J4
$$ y = [5383, 5058, 5394, 5229, 3310, 477, -1432, -2258, -3112, -3825, -2977, -363, 2474, 4184, 4603, 4161, 3839, 5106, 8229, 11207, 12016, 11159, 10331, 9617, 8115, 6386, 5888, 6614, 7500, 8516, 10098, 11273, 10890, 10090, 10875, 12618, 12715, 10564, 8171, 6732, 5219, 2663, -425, -3196, -4943, -4375, -625, 4692, 8493, 9635, 9653, 10159, 11372, 13164, 15446, 17376, 17956, 17635, 17736, 18384, 18609, 18107, 17107, 14953, 10973, 6527, 4043, 3990, 4705, 5032, 5063, 4472, 2351, -1011, -4049, -5758, -6148, -5236, -3462, -2609, -4219, -7236, -9192, -9377, -8795, -7653, -5482, -3458, -3718, -6150, -8345, -9022, -9104, -9142, -8325, -6631, -5535, -5757, -6369, -6864, -8032, -10033, -11517, -11615, -11194, -11350, -12014, -12625, -12895, -12508, -11278, -9888, -9248, -9114, -8598, -7822, -7562, -7488, -6471, -4593, -3205, -2949, -3135, -2995, -2201, -606, 1113, 1283, -490, -1796, -250, 2948, 4681, 4375, 4083, 4679, 5058, 5072]
55234E072J048K316K114J322J306R03j256l489l395j711p81q32o64l47l80K23
55218A449K092L430K616J140J089J597P94n28n58k2p25k019k075j322j175p73
55202E010J408L858L706J302l89l36MN8O15J261O30r21j732j581j384q16Q30K132
55184A3655R84j842l557l333k479j243J174L671L844J747l4m56j079k591l286
55169E175k016m5J096J531J836J695Q29j75o37m57K98J420K144J771P58K67P11
55152A6201J491J857J442M76m9O60J774J705O62M57J189P50j308k288o43J161
55136B5537N16j199j261j20Nq43j033n84n93p27k79l45j904l151j972L32J080
55119A3459O53J306K778K869J531O43L76m80j246k72J262N21k100l208j757l04
$$ y = [5072, 6120, 8436, 10550, 11872, 13178, 14081, 12825, 9336, 5941, 4230, 3449, 2617, 1953, 1606, 1226, 1449, 3541, 6971, 9587, 10727, 11816, 13413, 14207, 13679, 13121, 13099, 12374, 10355, 8280, 6958, 5783, 5010, 6418, 10276, 13982, 15284, 14895, 14559, 14563, 14621, 15236, 16497, 17127, 16206, 14474, 12893, 11509, 10693, 11523, 13655, 14639, 12797, 9240, 5907, 3428, 2185, 3359, 7030, 10874, 12621, 12587, 12131, 11052, 8461, 5175, 3159, 3114, 4210, 5741, 7577, 9272, 10101, 9926, 9289, 8832, 9130, 10550, 12694, 14465, 15223, 15490, 16201, 17692, 19549, 20991, 21467, 21418, 22078, 23852, 25557, 26219, 26676, 27865, 28615, 27307, 25019, 24376, 25537, 26053, 24854, 23593, 23473, 23478, 22635, 21602, 21018, 20425, 19698, 19419, 19074, 17170, 14019, 12047, 12379, 13459, 14112, 15418, 18196, 21065, 22596, 23239, 23615, 23135, 21889, 21617, 22879, 23400, 21300, 18092, 16335, 16031]
55103A6031l93m93N62J422Q13n64j666k301k069m21J678K424J822J398J279J65
55087A9687j705k359j272j96k97r09j426k084k446j539J23Q81N94P30J611J942
55071A1335J382J249K203L262L498K909J610oo55K92J198L57r13j28K149L107
55055C2849K340K193L390L905K819J876K172K340J215j35l41M71J581K411J827
55040F0913j055m813o549n201k251Q71L739N417M739K546J151J202J319R64J017
55025F4009J345P07n86p26L71P56n2k61P99J411O34m6M99J127N17q68j961k354
55007F5321j798k90Q88L27j121j417o50o37j299p46Q58J055m93j026N99J755L01
54990F1627k068k696j555p1J244K191K085J106O12R11P13k58n31K71N04m42r04
$$ y = [16031, 15638, 15145, 15707, 17129, 17942, 17378, 15712, 13411, 11342, 10921, 12599, 15023, 16845, 18243, 19522, 19687, 17982, 15623, 14351, 14155, 13858, 12949, 11523, 9439, 6993, 5454, 5577, 6458, 7052, 7782, 9393, 11335, 12717, 13966, 16169, 19431, 22929, 25838, 27448, 27442, 26787, 27079, 28277, 28634, 27721, 27593, 29742, 32849, 35189, 37382, 40772, 44677, 47496, 49372, 51544, 53884, 55099, 54964, 54623, 55094, 56675, 59086, 60913, 59858, 55045, 48496, 43295, 41044, 41915, 45654, 51071, 55810, 58356, 59507, 60709, 62028, 62992, 64009, 65354, 66061, 65475, 64749, 65120, 65876, 65824, 65563, 66362, 67773, 68407, 68361, 68860, 69987, 70504, 69636, 67675, 65321, 63523, 63233, 64121, 64448, 63327, 61910, 61260, 60623, 59324, 58578, 59436, 60491, 59998, 58972, 59571, 61326, 61627, 59559, 56863, 55308, 55237, 56481, 58672, 60757, 61863, 62475, 63386, 64099, 63841, 63310, 63581, 64085, 63643, 62739]
54973F2739j11K26q13j227P30L500M474L283J136j112k482j575J378L885M292
54958G8323L711L443K641L83k021k861k464j972j218K69J618J753J064M85J53
54943H3307P6P39J793J795L73r58j242j452k250k440j153L39O19J85j1k45p70
54926G8705p68j46n10k530m155l422j373j85R7R03K414L554L864L571K587R27
54910H3533n08q86m77J03Q33J673K169K299K602K959K686K132K454L501L958L896
54894A12927M663N815N221L206L289P112J1695J3757J3859J4016J4040J3070J2211
54881B34881J2598J2669J0327O318K841K82k105l986n015o582r619j2110j1766
54868B28733j0021j0173j2335j3429j1851r226p443o559n931n322m575l710l386
$$ y = [62739, 62628, 62854, 62041, 60814, 61544, 65044, 69518, 72801, 73937, 72825, 70343, 68768, 70146, 74031, 78323, 82034, 85477, 88118, 88501, 86480, 83619, 81155, 79183, 77965, 78234, 79852, 81605, 82669, 83154, 83307, 83383, 84122, 85915, 87710, 88083, 87125, 85883, 84431, 82181, 79741, 78588, 78927, 79546, 79731, 79720, 79475, 78705, 77937, 77791, 77281, 74751, 70596, 67174, 65801, 65616, 65713, 66616, 69030, 72584, 76448, 80019, 82606, 83533, 83025, 82139, 81662, 81765, 82598, 84271, 86440, 88739, 91341, 94300, 96986, 99118, 101572, 105073, 109031, 112927, 117590, 123405, 128626, 131832, 135121, 142233, 153928, 167685, 181544, 195560, 209600, 222670, 234881, 247479, 260148, 270475, 276793, 279634, 279916, 277811, 273825, 268810, 262228, 252609, 240499, 228733, 218712, 208539, 196204, 182775, 170924, 161698, 154255, 147696, 141765, 136443, 131868, 128158, 124772]
54855A24772l938m343l422j546J79J631L184M360M675N086O844R505J1661J2927
54841A71575J3602J3234J1503R885J0189J1579J1036P156J886k004l975n682q494
54828B41490j1699j3273j2394j0628j0067j0865j1661j1749j1134r142n437k185
54816A21256k247m786n714l409q53q25k215k936l182l475k455L62K260Q76j848
54801I0809k386o07R59J245R59J72j365k405j660l19m83j946k933l042k934k182
54785G1882r5K130K661J704N46r46l292n038m395k374j363j313l54J410K006J196
54769F4365P69J162Q23o63j660j191k23M02J132K322L420L878L432J679r64k318
54753G6365n97K791M595L740K079J400J821K975M551N537M974L663L450M690N996
$$ y = [124772, 120834, 116491, 113069, 111523, 111702, 113333, 116517, 120877, 125552, 130638, 137482, 146987, 158648, 171575, 185177, 198411, 209914, 219799, 229988, 241567, 252603, 259759, 261645, 259641, 255666, 249984, 241490, 229791, 216518, 204124, 193496, 183429, 172564, 160903, 149154, 138020, 128878, 123441, 121256, 119009, 114223, 108509, 105100, 104247, 103422, 101207, 98271, 95089, 91614, 89159, 89521, 91781, 92657, 90809, 88423, 87816, 88775, 90020, 90979, 91151, 89786, 87381, 85721, 85402, 84919, 82973, 80040, 76998, 74064, 71882, 71787, 73917, 76578, 78282, 78828, 77882, 74590, 69552, 65157, 62783, 61420, 60107, 59753, 61163, 63169, 64365, 65134, 66296, 67119, 66456, 64796, 63605, 63382, 63784, 64916, 67238, 70658, 74536, 77968, 79647, 78683, 76365, 75768, 78559, 83154, 86894, 88973, 90373, 92194, 95169, 99720, 105257, 110231, 113894, 117344, 122034, 128030]
54738A28030O382O083N575N388O508R246J2095J3371J3475J3834J4450J4496J4421
54725B63354J5077J5249J2713P539K178j597l840m884n011n354o813q234p858
54712B72519o279n733o641p288o643n175l101m18J512J041q79j434L28K767M632
54697B39208O146P032O378M973N234P996J1606J4627J7239J9537K0865K1563K3064
54684D05468K5549K7464K7900K7363K5835K2419J7514J2925R011M021k778r601
54672E93090j4775j8802k2600k5610k6981k7122k6792k5908k4250k2229k0228
54661C37793j8266j6725j6126j5706j3759r961o147m212m411n946p899r208q943
54648B00484p081m298j252J137J532j55j760j395j28q4p54m6J693J800m75k968
$$ y = [128030, 134412, 140495, 146070, 151458, 157966, 167212, 179307, 192678, 206153, 219987, 234437, 248933, 263354, 278431, 293680, 306393, 313932, 316110, 314513, 310673, 305789, 300778, 295424, 288611, 280377, 272519, 266240, 260507, 253866, 246578, 239935, 234760, 231659, 231241, 232753, 233794, 232915, 231481, 231809, 234576, 239208, 245354, 252386, 258764, 263737, 268971, 276967, 288573, 303200, 320439, 339976, 360841, 382404, 405468, 431017, 458481, 486381, 513744, 539579, 561998, 579512, 592437, 601448, 605469, 602691, 593090, 578315, 559513, 536913, 511303, 484322, 457200, 430408, 404500, 380250, 358021, 337793, 319527, 302802, 286676, 270970, 257211, 247250, 241103, 236891, 232480, 226534, 218635, 209427, 200484, 193403, 189105, 187853, 188990, 190522, 190367, 188607, 187212, 187084, 187000, 186246, 186200, 187893, 189693, 189218, 186250]
54632A86250m060m116l217p10K151K545K89j286j29J713J749P89R55K188K964
54617A88075K881K559K224J933K034K255J676N37N23K215M049M841N473O827Q005
54602B36107Q148Q168Q968R482Q434O753O270O948P182O326N363N297O058O843
54588C36347O884O169N732O627Q544J0284J1604J3367J5872J8440K0863K3652
54576D84385K6626K8892L0550L2714L5443L7402L7958L7682L6309L2317K5264
54565H45542J6625P499k423j2804k1772k8188l2939l6901l9428l9978l9323l7975
54553E77935l5290l1209k7116k3867k0822j7817j5937j5299j4327j2510j1492
54542C52249j1836j1307q389n153m256n088n526n592o559p788p601o524o839r021
$$ y = [186250, 182190, 178074, 174857, 174147, 176298, 178843, 179132, 177846, 177717, 179430, 181179, 181968, 182923, 185111, 188075, 190956, 193515, 195739, 197672, 199706, 201961, 203637, 204174, 204697, 206912, 210961, 215802, 221275, 228102, 236107, 244255, 252423, 261391, 270873, 279307, 286060, 292330, 299278, 306460, 312786, 318149, 323446, 329504, 336347, 343231, 349400, 355132, 361759, 370303, 380587, 392191, 405558, 421430, 439870, 460733, 484385, 511011, 539903, 570453, 603167, 638610, 676012, 713970, 751652, 787961, 820278, 845542, 862167, 869666, 867243, 854439, 832667, 804479, 771540, 734639, 695211, 655233, 615910, 577935, 542645, 511436, 484320, 460453, 439631, 421814, 405877, 390578, 376251, 363741, 352249, 340413, 329106, 320717, 315564, 311308, 306220, 300694, 295102, 288543, 280755, 273154, 266630, 259791, 250770]
54528B50770j1049j1305j0230q994q125p600p146o372n379m801m725m352l337
54515A57355k422j978j304k73j60j526k731k215r32q59k069k989k726j585l2J425
54499A34979K063J888J924K473K249O00q27k55J433J932O54r34j386j85K480N348
54483A54436O416N189L657L575M043L492K706L576N831P518Q148Q965J0332J1255
54469B39139J1430J1688J2280J2756J3644J6098J9510K1439K0615J8432J6715
54458D13746J5292J2656Q055K193l542q068j1327j4277j7688k0837k2023k0520
54446C33660j7635j5503j5050j5211j4275j2056j0319j0501j1531j1099q889o978
54434A84613o732p059o412m960l695k809k068j686j714j564j018o06k34R86K737
$$ y = [250770, 239721, 228416, 218186, 209192, 201067, 193467, 186321, 179949, 174570, 169769, 165044, 160692, 157355, 154933, 152955, 151651, 151378, 151218, 149692, 146961, 144746, 143814, 142955, 140886, 137897, 135171, 133586, 133554, 134979, 137042, 138930, 140854, 143327, 145576, 146176, 145349, 145094, 146527, 148459, 149113, 148179, 146793, 146608, 149088, 154436, 160852, 166041, 169698, 173273, 177316, 180808, 183514, 187090, 192921, 200439, 208587, 217552, 227884, 239139, 250569, 262257, 274537, 287293, 300937, 317035, 336545, 357984, 378599, 397031, 413746, 429038, 441694, 449749, 451942, 448400, 440332, 429005, 414728, 397040, 376203, 354180, 333660, 316025, 300522, 285472, 270261, 255986, 243930, 233611, 223110, 211579, 200480, 191591, 184613, 177881, 170822, 164410, 159450, 155755, 152946, 150878, 149192, 147478, 145914, 144896, 144290, 144056, 145042, 147779]
54419A47779L035J165q00r50k56m00o78M19J911J515m79j313K16K216K519J145
54403A57044m34r36R5K019L240K600O61j126k078k245j571l60J65p92k199k576
54387A51507k174k268k866k873k244k207l316m645n073m261k551q86n50j858l481
54372A10254l917l055j472P41L170M261L107J171M57O30M4j064o86J728M334N354
54356A25057M710L093J060o55j456j710k014j809j00K517M100L740K414J447J339
54341A41733J944K627K449J392R26K123L902M724N038O050O866N552K795J604
54327A89725L004M662M567L549K969K219J64k521m185m371l895l537l677m479
54313A84194n546n942n260m116l179k351j435q74j264k511l839m258l151r15R13
$$ y = [147779, 150814, 151979, 151179, 150229, 149973, 149573, 148895, 149314, 151225, 152740, 152261, 150948, 151164, 153380, 155899, 157044, 156610, 155674, 155769, 157788, 161028, 163628, 164289, 163163, 161085, 158840, 157269, 156909, 157074, 156282, 154083, 151507, 149333, 147065, 144199, 141326, 139082, 136875, 133559, 128914, 123841, 119580, 117029, 116143, 115593, 113735, 110254, 106337, 103282, 101810, 102551, 105721, 109982, 113089, 114260, 114717, 115347, 115391, 114327, 113641, 115369, 119703, 125057, 129767, 132860, 133920, 133265, 131809, 130099, 128085, 126276, 126176, 128693, 132793, 136533, 138947, 140394, 141733, 143677, 146304, 148753, 150145, 151071, 153194, 157096, 161820, 166858, 172908, 179774, 185326, 188121, 189725, 192729, 197391, 201958, 205507, 208476, 210695, 210859, 208338, 204153, 199782, 195887, 192350, 188673, 184194, 178648, 172706, 167446, 163330, 160151, 157800, 156365, 155491, 154227, 151716, 147877, 143619, 140468, 139553, 140466]
54298A40466R21p52k709l767l499j877N64K433K611J681J203J691K350K616K732
54283A46664K854K778K711L188M138M975N591O170O220M984K828R64j93j149j835
54268A90888j448j2J191J162P9j522l365m984n752n663n229m610l744l213l814
54253A49964n261o423o754o441n401l651k365k793m029l725j453M63J75j384k292
54238I8630k176j866j711j545j504j801k102j985j642j574j892k284k317j595
54224G2636j17J450K333K536K514K218J314K43nP31J530J618R60k73j788k544
54208H5356j329J583M198M710L188J208L32R02J822J650L54n65k27L73L03N54
54192A04412K228L834K890k15k501k674k506l328l871k884j563j579k317j992
$$ y = [140466, 141387, 140635, 137926, 134159, 130660, 128783, 129347, 131780, 134391, 136072, 137275, 138966, 141316, 143932, 146664, 149518, 152296, 155007, 158195, 162333, 167308, 172899, 179069, 185289, 190273, 193101, 194065, 193872, 192723, 190888, 189440, 189428, 190619, 191781, 191860, 190338, 186973, 181989, 176237, 170574, 165345, 160735, 156991, 153778, 149964, 144703, 138280, 131526, 125085, 119684, 116033, 113668, 110875, 106846, 103121, 101668, 102131, 102306, 100922, 98630, 96454, 94588, 92877, 91332, 89828, 88027, 85925, 83940, 82298, 80724, 78832, 76548, 74231, 72636, 72519, 73969, 76302, 78838, 81352, 83570, 84884, 85127, 85122, 85853, 87383, 89001, 89961, 89688, 87900, 85356, 84027, 85610, 89808, 94518, 97706, 98914, 99246, 100148, 101970, 103620, 103974, 103409, 103182, 103555, 103858, 104412, 106640, 110474, 113364, 113149, 110648, 107974, 105468, 102140, 98269, 95385, 93822, 92243, 89926, 87934]
54178H7934m49R33J470J707K054K154J658P53j53p62r54p93l69L61J299J851J519
54161A00213O31q9m51n09K10J954L434K819K16k256l250l511l953l947k553k46
54145H8712J732K944L624L659K748J374O31R43J485J102k99j589j740j167j097
54130A03062j570j211N30K131K059R66L46M4j056k536k801j763j068j467j918
54115I3748j687j568k280l187l254k195k76J890L206L018K244K241K577J542r40
54100I5079k742k356o69O42J024P99L23jP3J27k10k57O25J260q5k713m013l027
54082H3879j341j69R73K060J772j5j374j232j011j978l126l119k300j324J69J886
54066G3750K044R8j634j216j02n75j808j319P75J836P85o64q98l11J40M40R26
$$ y = [87934, 87485, 88418, 89888, 91595, 93649, 95803, 97461, 98214, 98061, 97299, 96345, 95552, 95183, 95544, 96843, 98694, 100213, 100844, 100755, 100304, 99795, 100005, 101959, 105393, 108212, 108428, 106172, 102922, 99411, 95458, 91511, 88958, 88712, 90444, 93388, 97012, 100671, 103419, 104793, 105424, 106367, 107852, 108954, 108655, 107066, 105326, 104159, 103062, 101492, 100281, 100811, 102942, 105001, 105967, 106313, 106357, 105301, 102765, 99964, 98201, 97133, 95666, 93748, 92061, 90493, 88213, 85026, 81772, 79577, 79301, 81191, 84397, 87415, 89659, 91900, 94477, 96019, 95079, 92337, 89981, 89312, 89954, 90978, 91777, 92100, 92099, 92172, 92299, 92089, 91832, 92457, 93717, 93632, 90919, 86906, 83879, 82538, 82369, 83342, 85402, 87174, 87159, 85785, 84553, 83542, 81564, 78438, 75319, 73019, 71695, 71864, 73750, 75794, 75892, 74258, 73042, 72940, 72365, 70557, 69238, 70013, 71849, 72634, 71970, 71072, 70761, 70901, 71341, 72267]
54049G2267J390J393Q88J93k78k68R3N20J070J843K317J903J235J453K091J353
54033H9463r08k452j833m11J80O26K178L818L507J377m67q98o71n98n82m01j76
54016I1752J4O0l75j285j919j816j526j566j366k67J136J715J277M08m62r59n05
53999H4316Q16J843J750J117Q54R47J094J543K306K660K416K536L352L602K575
53984A13727J732K420L412K896J730K213M282N568N210N005O336Q119Q675Q075
53970A79400P527P484P325O459N202M562N159O299O564N550M342L959M247M739
53956B58818N374N692M665K495J209K083L649L843K874K163J535k64k842m335
53942B86959m149l494l135k570j616r95r76r61q64j488l072m703n544n694n550
$$ y = [72267, 73657, 75050, 75938, 76131, 75853, 75585, 75678, 76198, 77268, 79111, 81428, 83331, 84566, 86019, 88110, 89463, 88555, 86103, 84270, 83859, 84039, 84665, 86843, 90661, 94168, 95545, 95078, 94180, 93509, 92911, 92329, 91928, 91752, 91766, 91826, 91451, 90166, 88247, 86431, 84905, 83339, 81973, 81706, 82842, 84557, 85834, 86242, 85780, 84821, 84316, 85132, 86975, 88725, 89842, 90696, 91643, 92737, 94280, 96586, 99246, 101662, 104198, 107550, 111152, 113727, 115459, 117879, 121291, 124187, 125917, 128130, 132412, 137980, 143190, 148195, 154531, 162650, 171325, 179400, 186927, 194411, 201736, 208195, 213397, 217959, 223118, 229417, 235981, 241531, 245873, 249832, 254079, 258818, 264192, 269884, 274549, 277044, 278253, 280336, 283985, 287828, 290702, 292865, 294400, 294136, 291294, 286959, 282810, 279316, 276181, 273611, 271995, 271000, 270024, 269063, 268199, 266711, 263639, 258936, 253392, 247698, 242148]
53927B42148n222m811m472l978k958j523k16M48j44k518n956q239p755n330k838
53912A86636p70J422L300L619K330O45q24k311l324k708o89Q17O77o3J03J122
53896A89982J841J673J158J219K265L679M188L265J974J828K945M087M291L717
53882B28112L058K943L703N082O253O717O799O777O256N222M857N998P459P333
53868C06569N597L967L395L225K721J948J075K9r15j291j209j018k89J701M469
53853C29974O452O718N694M327L544M196O285Q302Q617P502O594O444N907M133
53839D14689J819J43m95m33l10q37k170l519m129m447n366o597o988o343n679
53824C69338n667o034o587p574q781r404r173q700q546q639q637q253p255n896
$$ y = [242148, 236926, 232115, 227643, 223665, 220707, 219184, 218968, 219416, 219272, 216754, 210798, 202559, 194804, 189474, 186636, 185866, 187288, 190588, 194207, 196537, 197182, 196358, 194047, 190723, 188015, 187326, 188143, 188820, 188757, 188860, 189982, 191823, 193496, 194654, 195873, 198138, 201817, 206005, 209270, 211244, 213072, 216017, 220104, 224395, 228112, 231170, 234113, 237816, 242898, 249151, 255868, 262667, 269444, 275700, 280922, 285779, 291777, 299236, 306569, 312166, 316133, 319528, 322753, 325474, 327422, 328497, 328526, 327611, 326320, 325111, 324093, 323804, 325505, 329974, 336426, 343144, 348838, 353165, 356709, 360905, 367190, 375492, 384109, 391611, 398205, 404649, 410556, 414689, 416508, 416651, 416156, 415723, 415413, 414576, 412406, 408887, 404758, 400311, 394945, 388348, 381360, 375017, 369338, 363671, 357637, 351050, 343476, 334695, 325291, 316118, 307418, 298872, 290233, 281596, 273343, 266088, 260192]
53810B60192n041n082n191m561l860m264n507o253n957n005l547j745q16j892
53796B01471l922m561l328k090k217l025l568m082m891n284m505k885j373o88
53782A55052j134k277k726j441N60J093l33j810j571R1J741K368J683J49q28l1
53766A50586J827K599J428k79j027r48q48q62q19p42k99J046K717L085J698J81
53750A59343l1L52K3m58N31K888M552M281L379L897N882P360P023N881N599N980
53734B16482N421L776K990M193N805N806M652M147M526M631M258M208M301L521
53720B78717K087J300J197M63j018j706j088p05j656k951l439l605m272m854m362
53705B54108l092k063j515r73l58j05m82j306k080k341k250k603l629m272l700
$$ y = [260192, 255151, 250069, 244878, 240317, 236457, 232193, 226686, 220433, 214476, 209471, 205924, 204179, 203363, 201471, 197549, 192988, 189660, 187570, 185353, 182328, 178760, 174678, 169787, 164503, 159998, 157113, 155740, 155052, 153918, 151641, 148915, 147474, 148034, 149127, 148794, 146984, 145413, 145504, 147245, 149613, 151296, 151445, 150617, 150586, 152413, 155012, 156440, 156161, 155134, 154186, 153338, 152476, 151657, 150915, 150616, 151662, 154379, 157464, 159162, 159343, 159312, 159664, 159687, 159229, 159760, 162648, 167200, 171481, 174860, 178757, 184639, 191999, 199022, 204903, 210502, 216482, 221903, 225679, 228669, 232862, 238667, 244473, 249125, 253272, 257798, 262429, 266687, 270895, 275196, 278717, 280804, 282104, 283301, 283764, 282746, 281040, 279952, 279247, 277591, 274640, 271201, 267596, 263324, 258470, 254108, 251016, 248953, 247438, 246465, 246107, 246002, 245520, 244214, 242134, 239793, 237543, 234940, 231311, 227039, 223339]
53690B23339k854l083l757l209j731j233j875j647j5O75j100l236k783J41L007
53675B00639M234L990K719Q40m35P9J830K813J904J75l32J184L363L998K389N1
53659B29441j231j444j651k048k146k204k714k750r95J590K405R13m83J5J376
53644B18074J977J865J616R12k15n12N87J731J743J415J739K013J425J061K265
53629B37696M126M659L732K850K614K347J921K124L176M217M500M143L764L962
53615B85831M811N336M148J407p14m01J611L177L313K610J728O52p66k335l486
53600C06922l459k154q87j192k562k870j533n50j383k605k239p76l9k18j82N5
53584B84328n72j972k743k225j148j62Q20J779K327K400K175J405r3j376j036
$$ y = [223339, 220485, 217402, 213645, 210436, 208705, 207472, 205597, 203950, 203935, 204610, 203510, 200274, 197491, 197632, 200639, 204873, 208863, 211582, 212422, 211987, 212066, 213896, 216709, 218613, 218788, 218456, 219640, 223003, 227001, 229390, 229441, 228210, 226766, 225115, 223067, 220921, 218717, 216003, 213253, 212258, 213848, 216253, 217166, 216683, 216698, 218074, 220051, 221916, 223532, 224444, 224229, 223717, 224304, 226035, 227778, 229193, 230932, 232945, 234370, 235431, 237696, 241822, 246481, 250213, 253063, 255677, 258024, 259945, 262069, 265245, 269462, 273962, 278105, 281869, 285831, 290642, 295978, 300126, 301533, 300819, 300418, 302029, 305206, 308519, 311129, 312857, 313509, 312743, 310408, 306922, 303463, 301309, 300422, 299230, 296668, 293798, 292265, 291715, 290332, 287727, 285488, 284712, 284673, 284455, 284273, 284328, 283756, 281784, 279041, 276816, 275668, 275506, 276326, 278105, 280432, 282832, 285007, 286412, 286319, 284943, 283907]
53569B83907R89L126L915L230J849O00O8M61J431K300K677K815L397M774O140
53554C21679N943L857J905K349M656O107N486M269L883L805L327L172L934M658
53540C79030M554M588N656O546N728M082L826N327O842P062O231N118M366M476
53526D53432N124M889L032J024Q91K488L830L695K530J140k2m69M5R14J356J454
53510D85353J698K028K274K800L608L620K136K76m85m24o51r04q6J509K483K527
53494E07762K508K494J748P23J088L285N636O561O310N924N630M994L936L074
53480E61673L368N356Q245J0109R858Q621Q332R197R708Q931P606O912P148P858
53466F72922Q553R240J0568J3123J6188J7891J7305J5808J5451J6661J8335J9573
$$ y = [283907, 284896, 288022, 291937, 295167, 297016, 297616, 297684, 298145, 299576, 301876, 304553, 307368, 310765, 315539, 321679, 327622, 331479, 333384, 335733, 340389, 346496, 351982, 356251, 360134, 363939, 367266, 370438, 374372, 379030, 383584, 388172, 393828, 400374, 406102, 410184, 414010, 419337, 426179, 433241, 439472, 444590, 448956, 453432, 458556, 463445, 466477, 467501, 468392, 470880, 474710, 478405, 480935, 482075, 482053, 481584, 481629, 482543, 483899, 485353, 487051, 489079, 491353, 494153, 497761, 501381, 503517, 503793, 503308, 502884, 502233, 501329, 501243, 502752, 505235, 507762, 510270, 512764, 514512, 515235, 516323, 519608, 525244, 531805, 538115, 544039, 549669, 554663, 558599, 561673, 565041, 570397, 578642, 588751, 598609, 607230, 615562, 624759, 634467, 643398, 651004, 657916, 665064, 672922, 681475, 690715, 701283, 714406, 730594, 748485, 765790, 781598, 797049, 813710, 832045, 851618]
53454H51618K0198K0247K0031K0264K1203K2272K3219K4693K6736K7954K7613
53443A106048K7310K8791L1158L2111L1284L0307L0205L0795L2154L4503L6806
53432A451472L7598L7244L7440L8471L8929L8197L7292L6875L6295L5033L3552
53421A858398L2410L1917L2616L4437L5518L3921L0707K9169L0388L1706L0560
53410B211747K7883K6316K6492K6674K5396K2964K0527J8517J6345J3310R688
53399B445859O452L832R94k373n305p262r329j2235j4478j4436j3484j4529j7863
53386B345843k1079k2962k4675k6706k7462k6141k4615k4958k6762k8317k9081
53375B063085k9475k9393k8385k6700k5128k3999k2999k1560j9226j6152j3270
$$ y = [851618, 871816, 892063, 912094, 932358, 953561, 975833, 999052, 1023745, 1050481, 1078435, 1106048, 1133358, 1162149, 1193307, 1225418, 1256702, 1287009, 1317214, 1348009, 1380163, 1414666, 1451472, 1489070, 1526314, 1563754, 1602225, 1641154, 1679351, 1716643, 1753518, 1789813, 1824846, 1858398, 1890808, 1922725, 1955341, 1989778, 2025296, 2059217, 2089924, 2119093, 2149481, 2181187, 2211747, 2239630, 2265946, 2292438, 2319112, 2344508, 2367472, 2387999, 2406516, 2422861, 2436171, 2445859, 2452311, 2456143, 2457137, 2454764, 2449459, 2442197, 2432868, 2420633, 2406155, 2391719, 2378235, 2363706, 2345843, 2324764, 2301802, 2277127, 2250421, 2222959, 2196818, 2172203, 2147245, 2120483, 2092166, 2063085, 2033610, 2004217, 1975832, 1949132, 1924004, 1900005, 1877006, 1855446, 1836220, 1820068, 1806798]
53364A806798j1370r998q154n859m049l061k353j596q55K11K004M069N720P329
53350A778836R615J2084J3815J5293J7564J9972K1122K1793K4227K8322L1434
53339A994077L2526L3645L6205L8709L9725M0662M3530M7840N1631N4106N5666
53328B468322N6708N7918O0278O3399O5303O5251O5115O6410O7799O7619O7118
53317C171240O8578P1264P1975O9220O4580O0041N6111N2659M9739M7079M4137
53306C826623M0845L7344L3034K7147K0245J3934Q902M158j559q447j5747k2503
53294C963976k8149l2890l7495m2252m6446m9332n1263n3104n4962n6202n6593
53283C455288n6628n6799n7216n7763n8077n7494n5642n3123n1111n0220n0111
$$ y = [1806798, 1795428, 1785430, 1777276, 1771417, 1767368, 1764307, 1761954, 1760358, 1759503, 1759714, 1761718, 1765787, 1771507, 1778836, 1788451, 1800535, 1814350, 1829643, 1847207, 1867179, 1888301, 1910094, 1934321, 1962643, 1994077, 2026603, 2060248, 2096453, 2135162, 2174887, 2215549, 2259079, 2306919, 2358550, 2412656, 2468322, 2525030, 2582948, 2643226, 2706625, 2771928, 2837179, 2902294, 2968704, 3036503, 3104122, 3171240, 3239818, 3311082, 3383057, 3452277, 3516857, 3576898, 3633009, 3685668, 3735407, 3782486, 3826623, 3867468, 3904812, 3937846, 3964993, 3985238, 3999172, 4008074, 4012232, 4010673, 4002226, 3986479, 3963976, 3935827, 3902937, 3865442, 3823190, 3776744, 3727412, 3676149, 3623045, 3568083, 3511881, 3455288, 3398660, 3341861, 3284645, 3226882, 3168805, 3111311, 3055669, 3002546, 2951435, 2901215, 2851104]
53272B851104n0178n0180n0103m9611m7960m4746m0732l7595l6298l6003l5164
53261B372534l3397l1524k9915k7889k5065k2295k0659k0094j9651j8852j8279
53250B104914j8841k0564k2132k1964j9839j7080j4866j3126j1542j0546j0170
53239A924244q899n339o55K447L062K898L734N770Q571J1975J5371J7600J8213
53226A998992J8071J8312J9632K2472K6629L0602L2606L2464L1383L0177K8976
53215B290316K8259K8394K8360K6923K4829K3611K2493J9213J4142J0403R130
53204B526073P691M048k62l266n836r431j2944j4553j5003j6359j8793k1012k2786
53191B397567k4679k6209k6637k6824k8054k9593k9724k8777k8857l0614l2396
$$ y = [2851104, 2800926, 2750746, 2700643, 2651032, 2603072, 2558326, 2517594, 2479999, 2443701, 2407698, 2372534, 2339137, 2307613, 2277698, 2249809, 2224744, 2202449, 2181790, 2161696, 2142045, 2123193, 2104914, 2086073, 2065509, 2043377, 2021413, 2001574, 1984494, 1969628, 1956502, 1944960, 1934414, 1924244, 1915345, 1910006, 1909351, 1911798, 1914860, 1917758, 1921492, 1927262, 1935833, 1947808, 1963179, 1980779, 1998992, 2017063, 2035375, 2055007, 2077479, 2104108, 2134710, 2167316, 2199780, 2231163, 2261340, 2290316, 2318575, 2346969, 2375329, 2402252, 2427081, 2450692, 2473185, 2492398, 2506540, 2516943, 2526073, 2533764, 2537812, 2537550, 2534284, 2528448, 2519017, 2506073, 2491520, 2476517, 2460158, 2441365, 2420353, 2397567, 2372888, 2346679, 2320042, 2293218, 2265164, 2235571, 2205847, 2177070, 2148213, 2117599, 2085203]
53180B085203l2830l2452l2296l2212l1252k9032k6334k4606k4625k5586k5993
53169A767985k5546k4985k3981k1095j6722j4025j5203j8274j9491j7931j5639
53158A555093j4098j2765j0927r115q363r142j0994j2589j2695j1809j1970j4098
53146A416528j6660j7905j8077j8038j7367j5651j4368j5128j6893j7164j5445
53135A233832j3472j2453j2270j3005j5011j7388j8453j7994j7417j7620j8313
53124A060436j9299k0657k1674k1349k0085j9225j8853j7795j5902j4500j4236
53113H56861j4246j3934j3830j4081j3726j2413j1493j2290j4153j5213j4544
53102G06938j2832j1359j0895j1297j1837j1976j1797j1598j1330j0779r962r039
$$ y = [2085203, 2052373, 2019921, 1987625, 1955413, 1924161, 1895129, 1868795, 1844189, 1819564, 1793978, 1767985, 1742439, 1717454, 1693473, 1672378, 1655656, 1641631, 1626428, 1608154, 1588663, 1570732, 1555093, 1540995, 1528230, 1517303, 1508188, 1499825, 1490683, 1479689, 1467100, 1454405, 1442596, 1430626, 1416528, 1399868, 1381963, 1363886, 1345848, 1328481, 1312830, 1298462, 1283334, 1266441, 1249277, 1233832, 1220360, 1207907, 1195637, 1182632, 1167621, 1150233, 1131780, 1113786, 1096369, 1078749, 1060436, 1041137, 1020480, 998806, 977457, 957372, 938147, 919294, 901499, 885597, 871097, 856861, 842615, 828681, 814851, 800770, 787044, 774631, 763138, 750848, 736695, 721482, 706938, 694106, 682747, 671852, 660555, 648718, 636742, 624945, 613347, 602017, 591238, 581276, 572237]
53090E72237q222p982q669r570r326p917p054p810q932q669p115n469m090k855
53076D68557k408l239m278m225l540l428l614l243l159m749o879o756m095j843
53062D13101k086l605m363m278m212l942k743j055k28r64k625l823l458j778k77
53047C73664M9kP59J840J788O94J68R19K074L036M128N001M291J742q88k009k066
53030C95188k446l643n256o765p529o966n491m521m884n853o290n985n430m943
53016C19186m526m135l791l827m771o362p023n396k291M6N55J4p71j963l569m815
53000B66561n171m848l909k139k53J05j656m026n064m378k914j645r29o01k54
52985B28879J07k63j828l544l760k392j041q08j182j250q59k01N52Q34L7j343
$$ y = [572237, 564015, 556033, 547364, 537794, 528468, 520551, 513497, 505687, 496755, 488086, 480971, 475502, 471412, 468557, 466149, 462910, 458632, 454407, 450867, 447439, 443825, 440582, 437423, 432674, 425795, 419039, 414944, 413101, 411015, 407410, 403047, 398769, 394557, 390615, 387872, 386817, 386589, 385625, 383000, 379177, 375719, 373941, 373664, 373713, 373711, 374470, 376310, 378098, 378792, 378960, 379879, 381953, 384989, 389117, 394118, 398409, 400151, 399263, 397254, 395188, 392742, 389099, 383843, 377078, 369549, 362583, 357092, 352571, 347687, 341834, 335544, 329559, 324129, 319186, 314660, 310525, 306734, 302907, 298136, 291774, 284751, 279355, 277064, 277110, 277665, 277679, 276908, 274945, 271376, 266561, 261390, 256542, 252633, 250494, 250241, 250346, 248690, 244664, 239600, 235222, 232308, 230663, 229734, 229133, 228879, 228986, 228723, 226895, 223351, 219591, 217199, 216158, 215350, 214168, 212918, 212059, 211858, 212410, 213244, 213281, 211938]
52969B11938k008j671j390j702j722p06N92R68L75l27o52r30j727l030l841k931
52953A91236n77J147P81m54l87R30J615J080N97O67K47q86j190J93J872K230J440
52936B00541M55m94j304j337m86K14Mo05j075j741k633k744j583k02L50N11J120
52919A88991J995K590K966L193K888K354K793M296M947L368J019M30K005L955
52905B27790M625L699J825L08N12K400M342N169N423N745N399L877K545K957M422
52890B81038N160M971M886M924M332L558L757M399L534P35k044l052k567j734
52876C11897j122r81j543k367k379j362n20j046k691m201m525l483j881j132j927
52861B80737l158k964j111O56R08K13o9K60L39k83j178j810k003j680p52N86J829
$$ y = [211938, 209930, 208259, 206869, 205167, 203445, 202739, 203331, 204299, 204674, 204347, 203695, 202765, 201038, 198008, 194167, 191236, 190659, 191806, 192587, 192133, 191746, 192676, 194291, 195371, 195968, 196635, 196882, 195996, 194806, 194999, 196871, 199101, 200541, 200996, 200502, 199198, 197861, 197375, 197589, 197593, 196988, 195913, 194172, 191539, 188795, 187212, 187010, 187360, 187871, 188991, 190986, 193576, 196542, 199735, 202623, 204977, 207770, 212066, 217013, 220381, 221400, 221830, 223835, 227790, 232415, 236114, 237939, 238247, 238759, 241159, 245501, 250670, 256093, 261838, 267237, 271114, 273659, 276616, 281038, 286198, 291169, 296055, 300979, 305311, 308869, 312626, 317025, 320559, 321294, 319250, 316198, 313631, 311897, 310775, 309794, 308251, 305884, 303505, 302143, 301623, 300577, 297886, 293685, 289160, 285677, 283796, 282664, 280737, 277579, 274615, 273504, 274160, 275068, 275281, 275212, 275472, 275811, 275528, 274350, 272540, 270537, 268857, 268105, 268691, 270520]
52844B70520K563K735K585K427K440K482K184J493R80J270K079K381J688O97K24
52829B98748k0p31j488j074N56J845J729J086J268K112K530K340K203K205J772
52814C15081Q27q7p36j089n69J220L009K731K37k132k298q29K22m5o20j22J422
52797C16222K471J725l4n65R78K811L078K437K617L365K995J400K53K85O65J134
52781C41837K303L597L449K284K632N201P327O844N064M166L773K335K11j028
52767C89995j208j291j319o94J64K36m76j274k160l464m707n271n621o486p374
52752C49050p286o325n274m185k709j381j130j909k873l482l503k815k154k979
52738C01045n211o386m730k001j107j853j570L69J410k92l170m497l710k365j820
$$ y = [270520, 273083, 275818, 278403, 280830, 283270, 285752, 287936, 289429, 290409, 291679, 293758, 296139, 297827, 298524, 298748, 298728, 297997, 296509, 295435, 295991, 297836, 299565, 300651, 301919, 304031, 306561, 308901, 311104, 313309, 315081, 315908, 315821, 315085, 313996, 313427, 314647, 317656, 320387, 320624, 318492, 316194, 315365, 315587, 315542, 314922, 314800, 316222, 318693, 320418, 320384, 319819, 320797, 323608, 326686, 329123, 331740, 335105, 338100, 339500, 339753, 340038, 340703, 341837, 344140, 347737, 351186, 353470, 356102, 361303, 368630, 375474, 380538, 384704, 388477, 390812, 391023, 389995, 388787, 387496, 386177, 385483, 385647, 385883, 385407, 384133, 381973, 378509, 373802, 368531, 362910, 356424, 349050, 341764, 335439, 330165, 325980, 323271, 321890, 320760, 318851, 315978, 312496, 308993, 306178, 304024, 301045, 295834, 289448, 284718, 282717, 281610, 279757, 278187, 278556, 279966, 279674, 276504, 272007, 268297, 265932, 264112]
52723B64112k069k432k568k673k912k914k367j911k475l530l384j801p97j666
52709B30613k813k209o17l69j773l018l094k764k709k695k533k237j337L60J560
52694B04365P45j551l437m326m937m982l246l39J138m7k190l301l504l710l656
52679A67022k645j145l11m93j137j658j747j351q19n95n61k17M19Q68J022J015
52663A57667L67j462l597m227k949j423j129j553j304j89O58K42j171k217j676
52648A36037J04J319Q18n02j167j306j907k544j797J33J210M65p39r02k15O41
52632A29648J882L755N423N966N615N145M802M521M476M556M128K995J976J829
52618A86717K205K283J866J265O42j6p14j449k060k000j134n67j618l786n019
$$ y = [264112, 262043, 259611, 257043, 254370, 251458, 248544, 246177, 244266, 241791, 238261, 234877, 233076, 232279, 230613, 227800, 225591, 224974, 224605, 222832, 219814, 216720, 213956, 211247, 208552, 206019, 203782, 202445, 202805, 204365, 205110, 203559, 200122, 195796, 190859, 185877, 182631, 182292, 183430, 183383, 181193, 177892, 174388, 170678, 167022, 164377, 163232, 162921, 162428, 161291, 159633, 157886, 156535, 155716, 155121, 154560, 154343, 154762, 155630, 156652, 157667, 158034, 156572, 152975, 148748, 145799, 144376, 143247, 141694, 140390, 140201, 140859, 141101, 139930, 137713, 136037, 136141, 137460, 138278, 137776, 136609, 135303, 133396, 130852, 129055, 129188, 130398, 130863, 130124, 129222, 129007, 129648, 131530, 135285, 140708, 146674, 152289, 157434, 162236, 166757, 171233, 175789, 179917, 182912, 184888, 186717, 188922, 191205, 193071, 194336, 194978, 194962, 194248, 192799, 190739, 188739, 187605, 187038, 185420, 181634, 176615]
52603A76615m408l313l197l642l497k827k566k856k929k338j508j118j384j771
52589A39261j402j49P80J79j380k229k022k098k979l206j555Q94K090J428q9j255
52573A26268j374l76Q65J131M98L71J140J231k81j645p73J431K291J231J33L2
52557A32173j90j341k359k173j479j393j514p37Q10J871J804J130M99O3j23J00
52541A27141M68L16l77m40J230L931N358M032J053j044j020Q7P02N92N61Q82J005
52524A44477P17Q47K187M035M499K565m57k067j078J305L070L393K866K253J787
52509A70399J455J379J709K507L640M547M367K778O03q94j220q95p17j173k181
52494A86304k830j795J082L947M532K654L39m53N70K474M069M328K988J122K60
$$ y = [176615, 172207, 168894, 165697, 162055, 158558, 155731, 153165, 150309, 147380, 145042, 143534, 142416, 141032, 139261, 137859, 137710, 138490, 138669, 137289, 135060, 133038, 130940, 127961, 124755, 123200, 124094, 126184, 127612, 127523, 126268, 124894, 124518, 125383, 126514, 127012, 127383, 128523, 129754, 129473, 127828, 127055, 128486, 130777, 132008, 132141, 132173, 131983, 130642, 128283, 126110, 124631, 123238, 121724, 120987, 121797, 123668, 125472, 126602, 127101, 127164, 127041, 127141, 127609, 127925, 127548, 127108, 128338, 132269, 137627, 141659, 142712, 141668, 140648, 140735, 141437, 142029, 142590, 143472, 144477, 145194, 146041, 148228, 152263, 156762, 159327, 158870, 156803, 155725, 157030, 160100, 163493, 166359, 168612, 170399, 171854, 173233, 174942, 177449, 181089, 185636, 190003, 192781, 193384, 192490, 191270, 190375, 189658, 188485, 186304, 183474, 181679, 182761, 186708, 191240, 193894, 194233, 193780, 194350, 196824, 200893, 205221, 208209, 209331, 209591]
52479B09591O88J379J724K212L048L307K299Q47K32M44M80O8O7J042K255K543
52463B32226J905J609K601M077M275K716Q69L04Q50J285J094N66j64j027j383
52448B51803p84j01m94j472j494m45J78l38r84r04m57O9J026J969J492m34j698
52431B46932q71P74J487J727K745L920L660K253J500J841J877Q60k05l26J96O73
52415B69043R40R12L69l71m87J79Q61J082J264J718J942J526J105J515K428K609
52399B86635J508L7m76K68J353J763J326M75m90j393j746j042M06J619K149K434
52383B94826K731K546J702J099J543K455K694K263J970J813J041oL56K767N270
52368C25070N300K802L23j85M74J70j582l085k748j015M65Q85P83R02J389K027
$$ y = [209591, 210279, 211658, 213382, 215594, 218642, 221949, 224248, 225095, 225327, 225771, 226251, 226319, 226386, 227428, 229683, 232226, 234131, 235740, 238341, 242418, 246693, 249409, 250278, 250582, 251432, 252717, 253811, 254377, 254213, 253186, 251803, 251019, 250918, 250424, 248952, 247458, 247013, 247191, 246853, 245869, 244965, 244508, 244577, 245603, 247572, 249064, 248630, 246932, 246061, 246835, 248322, 250049, 252794, 256714, 260374, 262627, 264127, 265968, 267845, 268705, 268500, 268174, 268370, 269043, 269983, 270895, 271264, 270893, 270406, 270585, 271446, 272528, 273792, 275510, 277452, 278978, 280083, 281598, 284026, 286635, 288143, 288180, 287704, 287972, 289325, 291088, 292414, 292889, 292399, 291006, 289260, 288218, 288624, 290243, 292392, 294826, 297557, 300103, 301805, 302904, 304447, 306902, 309596, 311859, 313829, 315642, 316683, 316677, 317033, 319800, 325070, 330370, 333172, 333495, 333310, 333784, 333954, 332372, 329287, 326539, 325524, 325989, 326874, 327657, 328559, 329948, 331975]
52352C31975K440K104R56J03Q70K823L757K372K0r87j92R35J240J024R91J138
52336C51569J011L41q29k157k887k330p48N74M73j016k860l955l723k263l92P08
52320C31516N36pN15K289L921M166L344K435J435j83j770j740J38K030K270J241
52304C52136L49K99J198L137N345N899L893J209L82J303J828J258J101K317L913
52289C85567M721M817M575L998L458L637M138L776K853L323N709P716P203N089
52275D50580L778L877M163L927L732M188N221O320O781O129M909M384M837N134
52261E17960M647M464N628P320Q106Q163Q819J0511J2487J4026J4729J4117J2288
52248F43265J0648J0815J2992J6075J8913K0612K0567J9388J9023K0609K2853
$$ y = [331975, 334415, 336519, 337475, 337578, 338448, 341271, 345028, 347400, 347420, 346433, 346241, 347176, 348416, 349440, 350431, 351569, 352580, 352921, 352092, 349935, 347048, 344718, 343970, 344544, 345017, 344001, 341141, 337186, 333463, 331200, 330808, 331516, 332052, 332045, 332560, 334849, 338770, 342936, 346280, 348715, 350150, 349967, 348197, 346457, 346595, 348625, 350895, 352136, 352485, 352784, 353982, 357119, 362464, 368363, 372256, 373465, 373847, 375150, 376978, 378236, 379337, 381654, 385567, 390288, 395105, 399680, 403678, 407136, 410773, 414911, 418687, 421540, 424863, 430572, 438288, 445491, 450580, 454358, 458235, 462398, 466325, 470057, 474245, 479466, 485786, 492567, 498696, 503605, 507989, 512826, 517960, 522607, 527071, 532699, 540019, 548125, 556288, 565107, 575618, 588105, 602131, 616860, 630977, 643265, 653913, 664728, 677720, 693795, 712708, 733320, 753887, 773275, 792298, 812907, 835760]
52237H35760K3905K4055K4915K6496K7255K6853K6755K7692K8489K8150K7596
52226A127921K8133K9338K9691K8759K7777K7994K9067K9361K7784K5043K2795
52215A433663K1627K0659J9205J7766J6803J5602J3390J0685Q416O475M435K978
52203A591704K950L516K878P43j426k521k643j920l06J232J149m61j499n23J605
52188A594478L416M973P130R691J1608J2590J3491J5058J6914J7968J7603J6514
52176A741434J6246J7618J9784K1216K1386K0856J9965J8340J5827J3070J0961
52165A936703R952R932J0055Q951N924K065p85k239l649o037q808j0943j2461
52152A938660j4089j5997j7609j8316j8112j7692j7883j8574j8520j7011j5531
$$ y = [835760, 859665, 883720, 908635, 935131, 962386, 989239, 1015994, 1043686, 1072175, 1100325, 1127921, 1156054, 1185392, 1215083, 1243842, 1271619, 1299613, 1328680, 1358041, 1385825, 1410868, 1433663, 1455290, 1475949, 1495154, 1512920, 1529723, 1545325, 1558715, 1569400, 1577816, 1584291, 1588726, 1591704, 1594654, 1598170, 1601048, 1601791, 1600365, 1597844, 1595201, 1593281, 1592975, 1594207, 1595356, 1594895, 1593396, 1592873, 1594478, 1597894, 1602867, 1609997, 1619688, 1631296, 1643886, 1657377, 1672435, 1689349, 1707317, 1724920, 1741434, 1757680, 1775298, 1795082, 1816298, 1837684, 1858540, 1878505, 1896845, 1912672, 1925742, 1936703, 1946655, 1956587, 1966642, 1975593, 1981517, 1983582, 1982797, 1980558, 1976909, 1970872, 1962064, 1951121, 1938660, 1924571, 1908574, 1890965, 1872649, 1854537, 1836845, 1818962, 1800388, 1781868, 1764857, 1749326]
52141A749326j6465j9889k2872k2608j9320j5407j2664j1333j1043j1350j1463
52130A574912j0526q607o768n967o135o492o491o164n724n173m489l994m096m700
52116A489586n199n235m965m464l508k342j884k559l581m175m776n883o581n677
52102A428757m014l829n639p442p509o484n927o155o443o313n513l731j472m14
52088A357872j611l837m950m545m007m161m270l596k663k445l091m053m889n451
52074A304303n699n659n216l867j399R48J096j258l525l023m99P37q30l204l994
52059A268911l576l699m381m038k078M32K602M486O002O677O886P758R452J0914
52045A306348J1912J3639J6554J9171K0255K0774K2297K4650K6731K8525L0677
$$ y = [1749326, 1732861, 1712972, 1690100, 1667492, 1648172, 1632765, 1620101, 1608768, 1597725, 1586375, 1574912, 1564386, 1555779, 1549011, 1543044, 1536909, 1530417, 1523926, 1517762, 1512038, 1506865, 1502376, 1498382, 1494286, 1489586, 1484387, 1479152, 1474187, 1469723, 1466215, 1463873, 1461989, 1459430, 1455849, 1451674, 1446898, 1441015, 1434434, 1428757, 1424743, 1420914, 1415275, 1407833, 1400324, 1393840, 1387913, 1381758, 1375315, 1369002, 1363489, 1359758, 1358286, 1357872, 1356261, 1352424, 1347474, 1342929, 1338922, 1334761, 1330491, 1326895, 1324232, 1321787, 1318696, 1314643, 1309754, 1304303, 1298604, 1292945, 1287729, 1283862, 1282463, 1283411, 1284507, 1283249, 1279724, 1276701, 1276202, 1276939, 1276109, 1272905, 1268911, 1265335, 1261636, 1257255, 1253217, 1251139, 1251571, 1254173, 1258659, 1264661, 1271338, 1278224, 1285982, 1295434, 1306348, 1318260, 1331899, 1348453, 1367624, 1387879, 1408653, 1430950, 1455600, 1482331, 1510856, 1541533]
52034A541533L2780L4030L5025L6928L9074L9462L7797L6104L5780L5653L4014
52023A938180L1174K8867K7836K7175K5689K3106J9854J6357J2771R245O172L948
52011B170374K465J126n33k496m650p072r795j2637j5362j7395j7658j5792j3545
51998B057030j3372j5091j5686j3502j0791j0303j1011r673n837k462j621k015
51986A945666j328R84L989O670Q170P999O944O782Q271J0121J0487Q978O808N572
51972B036113N950P124P466O326M830M216L986K860R48n53j593l423o405r420
51958B058425j1761j3965j6331j8155j9183k0279k1823k2790k2546k2420k4205
51947A844967k7708l0869l2091l1720l1440l2646l5239l7729l8591l7604l5787
$$ y = [1541533, 1574313, 1608343, 1643368, 1680296, 1719370, 1758832, 1796629, 1832733, 1868513, 1904166, 1938180, 1969354, 1998221, 2026057, 2053232, 2078921, 2102027, 2121881, 2138238, 2151009, 2160254, 2166426, 2170374, 2172839, 2173965, 2173432, 2170936, 2166286, 2159214, 2149419, 2136782, 2121420, 2104025, 2086367, 2070575, 2057030, 2043658, 2028567, 2012881, 1999379, 1988588, 1978285, 1967274, 1957601, 1951764, 1949302, 1947681, 1945666, 1944338, 1945322, 1949311, 1955981, 1964151, 1972150, 1979094, 1985876, 1994147, 2004268, 2014755, 2023733, 2030541, 2036113, 2042063, 2049187, 2056653, 2062979, 2067809, 2072025, 2076011, 2078871, 2079819, 2079266, 2077673, 2074250, 2067845, 2058425, 2046664, 2032699, 2016368, 1998213, 1979030, 1958751, 1936928, 1914138, 1891592, 1869172, 1844967, 1817259, 1786390, 1754299, 1722579, 1691139, 1658493, 1623254, 1585525, 1546934, 1509330, 1473543]
51936A473543l4350l4050l5042l6622l7566l7520l7577l8485l9067l7660l4601
51925A071003l1810l0208k9262k8697k8838k9214k8738k7501k6570k5776k3725
51914G60664k0412j7871j7382j7839j7718j7040j6455j5907j5244j4817j4637
51903E75342j4067j3031j2152j1224r207o521n397o876r159j0146j0030r977r866
51890D47689r061q060p621p219o094m989n084n870n814m772m229n191p018q246
51876C58421p765n471k558p45n66r69j010j159k102l277l613l035k232j594j219
51861C21106j324j726j576n13N25M32p41k253l635m476m173k869j816j825k172
51846B92964j917j464j771k784l742m352m645m334l362k429k060j725q00K96P65
$$ y = [1473543, 1439193, 1405143, 1370101, 1333479, 1295913, 1258393, 1220816, 1182331, 1143264, 1105604, 1071003, 1039193, 1008985, 979723, 951026, 922188, 892974, 864236, 836735, 810165, 784389, 760664, 740252, 722381, 704999, 687160, 669442, 652402, 635947, 620040, 604796, 589979, 575342, 561275, 548244, 536092, 524868, 515661, 509140, 503743, 496867, 487708, 477562, 467532, 457555, 447689, 438628, 430568, 422947, 415728, 409634, 404645, 399561, 393691, 387877, 383105, 378876, 373685, 366667, 358421, 350656, 345185, 342627, 341882, 341316, 340347, 339337, 338178, 336076, 332799, 329186, 326151, 323919, 322325, 321106, 319782, 318056, 316480, 315967, 316492, 316924, 316183, 313930, 310295, 305819, 301646, 298777, 296961, 295136, 292964, 291047, 289583, 287812, 285028, 281286, 276934, 272289, 267955, 264593, 262164, 260104, 258379, 257579, 257875, 258640]
51831B58640O00K29k84q82j189j256j776k789l209k531j792j804j704n81O90O34
51815B40996o28j891k608k788k068m32R85J252R66R35O01m98r93M86K572K645
51799B39532O63q12l48Q82J464J472J343Q85J91O5Q80K102L277M480N418N229
51783B66723L641J594L03L03J419K967M003M024L453K870K085O94q46j652j725
51768B89856j861k379k737k451j753j242j199j239o65M29O56j018l281l596j613
51753B65907L24O22M27J113J950J783J210J180J059R5p49m29J36k66q52m62J04
51736B73152j73j19J460K769J478j087j890j227j760l176k458L74J519m41k117
51721B66304q57J198R98p51j424m51J022K350L031K017m18j846q19P82O12n91
$$ y = [258640, 259240, 259469, 259185, 258303, 257114, 255858, 254082, 251293, 248084, 245553, 243761, 241957, 240253, 239672, 240362, 240996, 240368, 238477, 235869, 233081, 231013, 230581, 231566, 232818, 233784, 234719, 235320, 234822, 233829, 234315, 236887, 239532, 240195, 239383, 239035, 239917, 241381, 242853, 244196, 245081, 245272, 245337, 246217, 248319, 251596, 256076, 261494, 266723, 270364, 271958, 272261, 272564, 273983, 276950, 280953, 284977, 288430, 291300, 293385, 294079, 293233, 291581, 289856, 287995, 285616, 282879, 280428, 278675, 277433, 276234, 274995, 274330, 274759, 275415, 274397, 271116, 267520, 265907, 266231, 266853, 267280, 268393, 270343, 272126, 273336, 274516, 275575, 275670, 274921, 274492, 274628, 274362, 273510, 273048, 273152, 272979, 272860, 274320, 277089, 278567, 277480, 275590, 274363, 272603, 269427, 266969, 267343, 268862, 268421, 266304, 265447, 266645, 267643, 266892, 265468, 265017, 266039, 268389, 271420, 273437, 273019, 271173, 270354, 271136, 271748, 271157]
51705B71157n08R98K144K276K335K740K997L154L785M533M191K436L40q61p39
51690C00978L06J333J478J048J522L719O410P646P040N874N246M990M426L481
51676C55497K820L129M389N996P550R119J0554J1256J1214J1478J2609J3478J2912
51663D72001J1678J1161J0808R044O307M732M618L787R83k388m659n783o019n025
51649E11245l385k788l402l150r84J155J242Q6n16n51p41l66J489L701M378L518
51633E10931K464J682R78J044K574M449M899M155L995M989O108O914Q188J0230
51619E73600J2065J2582J1324Q303M290J092J41O81N64j131l298m421l999k485
51605F09308q08J18K30M43J275K021K105K295L266L878K673N37k23P16J287K41
$$ y = [271157, 270649, 271647, 273791, 276067, 278402, 281142, 284139, 287293, 291078, 295611, 299802, 302238, 302578, 301717, 300978, 301284, 302617, 304095, 305143, 306665, 310384, 316794, 324440, 331480, 337354, 342600, 347590, 352016, 355497, 358317, 361446, 365835, 371831, 379381, 388500, 399054, 410310, 421524, 433002, 445611, 459089, 472001, 483679, 494840, 505648, 514692, 520999, 525731, 530349, 534136, 535119, 532731, 528072, 522289, 516270, 511245, 507860, 505072, 501670, 498520, 497536, 498691, 499933, 500019, 499503, 498952, 498211, 497845, 499334, 503035, 507413, 510931, 513395, 515077, 516055, 517099, 519673, 524122, 529021, 533176, 537171, 542160, 548268, 555182, 563370, 573600, 585665, 598247, 609571, 617874, 622164, 623256, 623397, 624078, 624642, 623511, 620213, 615792, 611793, 609308, 608500, 608618, 608848, 609291, 610566, 612587, 614692, 616987, 620253, 624131, 626804, 627341, 627118, 627834, 629121, 629362]
51589F29362j190j535j258j691l110m894o664q208q914q298o898n986o360p733
51575E56623r127r631q937p340n512m277m482o357q793r925q986p091n617m501
51561D56047k966j284o16j311k565l802n258o858p521o324l843j728j066j495
51547D09410j899j698j324j489k180k750k789k493k126j710j388j437j701j663
51533C82763j292j101j058k36J821M104N152M563L018J474P45J221K275K606J778
51518D07833R03J220K628M139N015M882L629J973J254J822K431K055J356J196
51504D42336R08n67k515l168k236j217j246k075l012l655l657k870j813j179j017
51489D13017j136j826l013l289j262K218M588M559L269K388K376K931L960N371
$$ y = [629362, 628172, 626637, 625379, 623688, 620578, 615684, 609020, 600812, 591898, 583600, 576702, 570716, 564356, 556623, 547496, 537865, 528928, 521588, 516076, 511799, 507317, 500960, 492167, 482242, 473256, 466165, 460548, 456047, 453081, 451797, 451181, 449870, 447305, 443503, 438245, 431387, 423866, 417542, 413699, 411971, 410905, 409410, 407511, 405813, 404489, 403000, 400820, 398070, 395281, 392788, 390662, 388952, 387564, 386127, 384426, 382763, 381471, 380370, 379312, 379076, 380897, 385001, 390153, 394716, 397734, 399208, 399953, 401174, 403449, 406055, 407833, 408736, 409956, 412584, 416723, 421738, 426620, 430249, 432222, 433476, 435298, 437729, 439784, 441140, 442336, 443244, 442677, 440162, 436994, 434758, 433541, 432295, 430220, 427208, 423553, 419896, 417026, 415213, 414034, 413017, 411881, 410055, 407042, 403753, 402491, 404709, 409297, 413856, 417125, 419513, 421889, 424820, 428780, 434151]
51475D34151O557O754N713M015K917L479N226O186M963K381J94j142k184k706
51461D76504j910l34K80n54j289o04Q09J487J214Q71Q86P54J0q58p06Q67K583
51444D80010K556N61j614k598l067l982m517l553k224k646m452n068l770k907
51430D42729m253o398p129o508n956n572m291k009N1Q63M84m44j220j315p39L7
51414C98330P80J555K011J584Q78J625M334P021P518O191N054M810M414L457L155
51399D52717M478O538P670P524P264P991R470J0517J0305R158P973P140O333N373
51385E60451M673M536M519M064L334K767K111P23j199k572k794k347j677l58J859
51370E78090L844M166L183K801L864M963M616L532L432M274M312K858J388J286
$$ y = [434151, 440708, 447462, 453175, 457190, 460107, 463586, 468812, 474998, 479961, 482342, 482536, 481394, 479210, 476504, 474594, 474260, 474540, 473986, 472697, 472093, 472902, 474389, 475603, 476474, 477360, 478114, 478124, 477266, 476560, 477427, 480010, 482566, 483127, 481513, 478915, 475848, 471866, 467349, 463796, 461572, 458926, 454474, 449406, 445636, 442729, 438476, 432078, 424949, 418441, 412485, 406913, 402622, 400613, 400664, 401527, 402011, 401567, 400347, 399032, 398293, 398330, 399110, 400665, 402676, 404260, 405138, 406763, 411097, 418118, 425636, 431827, 436881, 441691, 446105, 449562, 452717, 457195, 463733, 471403, 478927, 486191, 494182, 503652, 514169, 524474, 533632, 541605, 548745, 555078, 560451, 565124, 569660, 574179, 578243, 581577, 584344, 586455, 587178, 585979, 583407, 580613, 578266, 576589, 576231, 578090, 581934, 586100, 589283, 592084, 595948, 600911, 605527, 609059, 612491, 616765, 621077, 623935, 625323, 626609]
51356F26609J953K047J437P46j93j908l718m045k581r88j127l197n888p637p539
51341E93971n728l331j726j425j835k141k174k234k427k389j777p66qJ17o6j15
51325E65946j89o33j105j050r63j985l869m796l871k531k355k755k337j517j952
51310E34038l813n577o443p261q654r895j0167r864r912j0610j1551j2115j1827
51297D16349j0749r507q550p634o697o437p079p292n867l855l211l609k863o89
51283C32310L94j301m125n494n031l997l080k317k062k440k603j901j137j345
51269B95871j965j693o38j89q42j510j152m9P44M69q24k248k521j053J269K870
51253B86539L007K199J417J267J813K696L400L699L745L592L072K361K116K592
$$ y = [626609, 628562, 630609, 632046, 632792, 632599, 630691, 626973, 622928, 620347, 619359, 618232, 615035, 609147, 601510, 593971, 588243, 584912, 583186, 581761, 579926, 577785, 575611, 573377, 570950, 568561, 566784, 566018, 566010, 566127, 566061, 565946, 565757, 565124, 564019, 562969, 562006, 560021, 556152, 551356, 547485, 544954, 542599, 539844, 537507, 535990, 534038, 530225, 524648, 518205, 510944, 502290, 492395, 482228, 472364, 462452, 451842, 440291, 428176, 416349, 405600, 396093, 387543, 379909, 373212, 366775, 359696, 352404, 346537, 342682, 339471, 335862, 332999, 332310, 332704, 331403, 327278, 321784, 316753, 312756, 309676, 307359, 305297, 302857, 300254, 298353, 297216, 295871, 293906, 292213, 291575, 291386, 290544, 289034, 287882, 287833, 288577, 289046, 288222, 285974, 283453, 282400, 283669, 286539, 289546, 291745, 293162, 294429, 296242, 298938, 302338, 306037, 309782, 313374, 316446, 318807, 320923, 323515]
51239C23515L145L217L360M414N949O451N199L217J930J391L14k144n093o680
51225C48185o110m477l429l443l881m310m902n621n998n939n961o182n957m989
51211B76986m114m302n316n984n626m501l248k255j595j157r24j140j958k833
51197B32033k815j641q7J004J475J378M31j464l539m669m364k944j004Q95K274
51182B16963K866K746K206J649J476J675J588P06l49l95O47J486J178K16m50n62
51166B33646k53N44J618K183J784J011N93M01m4o89j298j950k434j885o8J606
51150B34765J536K2j215j224m64M24J125J149K58o01j67J137J502M35l53M29J653
51133B40411J548M38K8O12P03m05j439j100J8M03k68j091j525j863k217k160j652
$$ y = [323515, 326660, 329877, 333237, 337651, 343600, 350051, 355250, 358467, 360397, 361788, 362102, 359958, 354865, 348185, 342075, 337598, 334169, 330726, 326845, 322535, 317633, 312012, 306014, 300075, 294114, 287932, 281975, 276986, 272872, 268570, 263254, 257270, 251644, 247143, 243895, 241640, 240045, 238888, 237964, 236824, 234866, 232033, 229218, 227577, 227490, 228494, 229969, 231347, 231778, 230314, 226775, 222106, 217742, 214798, 213794, 214689, 216963, 219829, 222575, 224781, 226430, 227906, 229581, 231169, 231875, 231526, 231131, 231778, 233264, 234442, 234658, 234208, 233646, 233393, 233937, 235555, 237738, 239522, 240533, 241126, 241527, 241483, 240794, 239496, 237546, 235112, 233227, 233159, 234765, 236301, 236323, 235108, 233884, 233420, 233844, 234969, 236118, 236376, 235775, 235608, 236745, 238247, 238682, 238329, 238758, 240411, 241959, 242397, 242425, 243037, 243740, 243335, 241896, 240796, 240814, 241217, 240949, 239858, 238333, 236470, 234253, 232093, 230441]
51116B30441j321j371j109j63O12L69k59q1P11P54l25j256q96L60J316J292L18
51099B29392j175k398k660k237k074k317j942m04J151J188k30j514j398j39R34
51084B14177P34n24j476j234p06j431l179l969k874j415j277j957j906r43j07
51069A91913K35N85J025J115Q07L71k64q53j79K380M967M875K110n72j424j462
51053B05629j774j305J083M078N422N082M940N651N765M165J736q4j060j798k421
51038B35109k573k201j520m85R84K347K718J979J050Q55J424K208K840L231L223
51023B51189K653J680O86L0O3J034K478K998J511j275l300l257j641L80K225L574
51007B61028L736K319K02j105j109o97q54j550k080k061j692j255o87J62R47Q95
$$ y = [230441, 229120, 227749, 226640, 226477, 227089, 227458, 227199, 227118, 227829, 228583, 228258, 227002, 226106, 226466, 227782, 229074, 229392, 228217, 225819, 223159, 220922, 218848, 216531, 214589, 214185, 215336, 216524, 216294, 214780, 213382, 213243, 214177, 214911, 214387, 212911, 211677, 210971, 209540, 206361, 202392, 199518, 198103, 196826, 194869, 192963, 192020, 191913, 192148, 192733, 193758, 194873, 195680, 196051, 195787, 194934, 194755, 197135, 202102, 206977, 209087, 208515, 207091, 205629, 203855, 202550, 203633, 207711, 213133, 218215, 223155, 228806, 234571, 238736, 240472, 240388, 239328, 237530, 235109, 232536, 230335, 228815, 228330, 229314, 231661, 234379, 236358, 237408, 238263, 239687, 241895, 244735, 247966, 251189, 253842, 255522, 256208, 256238, 256301, 257335, 259813, 262811, 264322, 263047, 259747, 256490, 254849, 255229, 257454, 261028, 264764, 267083, 267285, 266180, 265071, 264374, 263520, 261970, 259890, 257829, 256137, 254882, 254195, 254357, 255304, 256199]
50991B56199l46k096l235l205k120j89K211M043M172K697R84J00k2L73J566L436
50975B64568M814M775L950L520L507L161K631K843L771M239L682K984L007L284
50961C14736K894J925J329J703K801M006M685M338L111K051K214L285L711K569
50947C55358Q62L53J463K960L845M521N756P269Q169Q386Q661R306R834R874R719
50932D46336R908J0932J3130J6034J8006J7790J6494J6623J8768K0814K1168K1194
50920F47197K3121K6756K9998L1828L3152L5005L7530M0733M4704M8865N2310
50909A051199N5299N9323O5118P1471P6640Q0369Q3882Q8186R2993R7304J00558
50898A922342J02879J04282J04202J02180R8664R4313Q8735Q0901P0925O0177
$$ y = [256199, 255853, 253757, 250522, 247317, 245197, 245008, 247219, 251262, 255434, 258131, 259115, 259215, 259193, 259566, 261132, 264568, 269382, 274157, 278107, 281627, 285134, 288295, 290926, 293769, 297540, 301779, 305461, 308445, 311452, 314736, 317630, 319555, 320884, 322587, 325388, 329394, 334079, 338417, 341528, 343579, 345793, 349078, 352789, 355358, 356220, 356573, 358036, 360996, 364841, 369362, 375118, 382387, 390556, 398942, 407603, 416909, 426743, 436617, 446336, 456244, 467176, 480306, 496340, 514346, 532136, 548630, 565253, 584021, 604835, 626003, 647197, 670318, 697074, 727072, 758900, 792052, 827057, 864587, 905320, 950024, 998889, 1051199, 1106498, 1165821, 1230939, 1302410, 1379050, 1459419, 1543301, 1631487, 1724480, 1821784, 1922342, 2025221, 2129503, 2233705, 2335885, 2434549, 2528862, 2617597, 2698498, 2769423, 2829600]
50888B829600M9366L8000K6340J6238Q668J891o047j4158j9871k2872k5221k7927
50876B854007k9764k9878k9391k9632l0583l1896l3843l6415l8839m0984m4027
50865B478755m8775n4450n9968o5283p0508p4890p7698p9197p9718p8787p6333
50854A713148p3712p2107p0693o7795o3259n8101n2481m5811l8733l3147k9954
50843A107355k8101k6210k3900k1242j8287j5632j4197j3716j2512r551n916l363
50831I14728k172j359m41J71L62Q31K227M415O739Q628R831J0484J1075J2088
50817I77607J3653J5620J7816J9964K1690K2967K4413K6538K8895L0536L1424
50806A231123L2742L5526L9449M3286M6352M9260N3304N9140O5962P2221P7436
$$ y = [2829600, 2878966, 2916966, 2943306, 2959544, 2968212, 2970103, 2964056, 2949898, 2930027, 2907155, 2881934, 2854007, 2824243, 2794365, 2764974, 2735342, 2704759, 2672863, 2639020, 2602605, 2563766, 2522782, 2478755, 2429980, 2375530, 2315562, 2250279, 2179771, 2104881, 2027183, 1947986, 1868268, 1789481, 1713148, 1639436, 1567329, 1496636, 1428841, 1365582, 1307481, 1255000, 1209189, 1170456, 1137309, 1107355, 1079254, 1053044, 1029144, 1007902, 989615, 973983, 959786, 946070, 933558, 924007, 918091, 914728, 912556, 911197, 910756, 910927, 911289, 912120, 914347, 918762, 925501, 934129, 943960, 954444, 965519, 977607, 991260, 1006880, 1024696, 1044660, 1066350, 1089317, 1113730, 1140268, 1169163, 1199699, 1231123, 1263865, 1299391, 1338840, 1382126, 1428478, 1477738, 1531042, 1590182, 1656144, 1728365, 1805801]
50795A805801Q3022R0746J00667J11447J22439J34261J47046J59480J70374J80152
50785C105435J89807J99263K07909K15901K23539K29656K32103K29832K23321
50776E056766K12868J97796J77702J53499J26667R8281O9140M0197J2513j2814
50766F132615l4550n1733o4283p2576p6571p6123p2177o6617o0751n4942m9938
50755E452354m7422m8740n3852o2088p3056q6280j00698j15107j28778j41499
50745D594834j53486j65179j76254j84822j88789j88169j84886j80085j73065
50736C000099j63265j51811j40244j29070j18388j08716j00077r1512q2439p3576
50726A841001o5535n7756m9952m3339l8962l5732l1708k6690k2136j9072j7367
$$ y = [1805801, 1888823, 1979569, 2080236, 2191683, 2314122, 2448383, 2595429, 2754909, 2925283, 3105435, 3295242, 3494505, 3702414, 3918315, 4141854, 4371510, 4603613, 4833445, 5056766, 5269634, 5467430, 5645132, 5798631, 5925298, 6023579, 6092719, 6132916, 6145429, 6132615, 6098065, 6046332, 5982049, 5909473, 5832902, 5756779, 5684602, 5617985, 5557234, 5502292, 5452354, 5404932, 5356192, 5302340, 5240252, 5167196, 5080916, 4980218, 4865111, 4736333, 4594834, 4441348, 4276169, 4099915, 3915093, 3726304, 3538135, 3353249, 3173164, 3000099, 2836834, 2685023, 2544779, 2415709, 2297321, 2188605, 2088528, 1997016, 1914577, 1841001, 1775466, 1717710, 1667758, 1624419, 1585457, 1549725, 1518017, 1491327, 1469191, 1450119, 1432752]
50715A432752j6497j5732j4093j1308q429o547n517m881m984n849o114m722k867
50702A325212k409l066l042j879o69K82J789L895N554O593Q182J0995J4256J6964
50688A382657J8897K0366K2121K5366L0493L6086M0599M4636M9913N6306O2058
50677A789498O6819P2245P9204Q6507R3120R9729J07258J15411J23453J31097
50667B764341J38018J43739J48398J52065J53123J49238J40485J29606J18276
50658D037289J05001Q7695O6576M3376J9540l525k4011m1216n6135o9148p8479
50647D086963q2581q2663q1059p8060p2504o4707n6640m9512m3275l8652l7536
50636C399774m0593m5992n1521n7184o4686p4768q5897r5644j02735j07428j10298
$$ y = [1432752, 1416255, 1400523, 1386430, 1375122, 1366693, 1360146, 1354629, 1349748, 1344764, 1338915, 1332801, 1328079, 1325212, 1322803, 1319737, 1316695, 1314816, 1314147, 1314429, 1316218, 1320113, 1325667, 1332260, 1340442, 1351437, 1365693, 1382657, 1401554, 1421920, 1444041, 1469407, 1499900, 1535986, 1576585, 1621221, 1671134, 1727440, 1789498, 1856317, 1928562, 2007766, 2094273, 2187393, 2287122, 2394380, 2509791, 2633244, 2764341, 2902359, 3046098, 3194496, 3346561, 3499684, 3648922, 3789407, 3919013, 4037289, 4142290, 4229985, 4296561, 4339937, 4359477, 4355952, 4331941, 4290725, 4234590, 4165442, 4086963, 4004382, 3921719, 3840660, 3762600, 3690096, 3625389, 3568749, 3519237, 3475962, 3437310, 3399774, 3359181, 3313189, 3261668, 3204484, 3139798, 3065030, 2979133, 2883489, 2780754, 2673326, 2563028]
50625B563028j11194j09665j05745j00017r3221q6268p9978p4187o7736o0207
50615A674810n3001m7513m2895l7260l0630k4810k0347j5663r741l838L67K856
50603A392335M735O782R297J2279J5232J7774K0629K4616K8639L0512L0259L0477
50591A623566L2730L5752L8222M0979M4851M8533N0654N2306N5333N9477O3310
50580B145713O6854P1027P5332P8382Q0209Q2106Q4391Q6135Q6806Q6557Q5221
50569C028733Q2480P8717P4375O8964O2121N4956M8732M2778L5393K6445J7317
50558C621011Q853J135n057q646j0103j0946j1345j0106p144m118k223j075j70
50545C560066K00m6n75k109o473j4289k3935l3620m3355n3914o4976p5332q4137
$$ y = [2563028, 2451834, 2342169, 2236424, 2136407, 2043186, 1956918, 1876940, 1802753, 1735017, 1674810, 1621809, 1574296, 1531401, 1494141, 1463511, 1438701, 1418354, 1402691, 1392950, 1389112, 1389479, 1392335, 1397070, 1403852, 1413149, 1425428, 1440660, 1458434, 1479063, 1503679, 1532318, 1562830, 1593089, 1623566, 1656296, 1692048, 1730270, 1771249, 1816100, 1864633, 1915287, 1967593, 2022926, 2082403, 2145713, 2212567, 2283594, 2358926, 2437308, 2517517, 2599623, 2684014, 2770149, 2856955, 2943512, 3028733, 3111213, 3189930, 3264305, 3333269, 3395390, 3450346, 3499078, 3541856, 3577249, 3603694, 3621011, 3629864, 3630999, 3625942, 3617296, 3607193, 3596247, 3584902, 3574796, 3567652, 3563534, 3561311, 3560236, 3560066, 3560266, 3560220, 3559645, 3557536, 3551063, 3536774, 3512839, 3479219, 3435864, 3381950, 3316974, 3241642, 3157505]
50532C157505r1044r5701r8054r8755r8541r7514r5559r3056r0520q7648q3342
50521B127771p6868o8893o1242n5509n1822m9041m6127m2913l9525l5705l1233
50510A568893k6514k2133j8157j4326j0480o402j780L078P174J0172J3084J6713
50498A519322K0152K1985K2445K3218K5414K8855L2842L6489L8642L8924L8667
50487A846955L9613M1794M3899M5468M7360N0006N2669N4608N5793N6357N6533
50476B391055N7242N9585O3617O8619P4500Q1622Q9330R6125J01647J07189J13901
50465C304432J21645J29844J38177J46127J53001J58749J63615J66872J67219
50456D649681J64656J60328J54259J44863J31350J14862R6444P5587N2011K7253
$$ y = [3157505, 3066461, 2970760, 2872706, 2773951, 2675410, 2577896, 2482337, 2389281, 2298761, 2211113, 2127771, 2050903, 1982010, 1920768, 1865259, 1813437, 1764396, 1718269, 1675356, 1635831, 1600126, 1568893, 1542379, 1520246, 1502089, 1487763, 1477283, 1470881, 1469101, 1472179, 1479353, 1489525, 1502609, 1519322, 1539474, 1561459, 1583904, 1607122, 1632536, 1661391, 1694233, 1730722, 1769364, 1808288, 1846955, 1886568, 1928362, 1972261, 2017729, 2065089, 2115095, 2167764, 2222372, 2278165, 2334522, 2391055, 2448297, 2507882, 2571499, 2640118, 2714618, 2796240, 2885570, 2981695, 3083342, 3190531, 3304432, 3426077, 3555921, 3694098, 3840225, 3993226, 4151975, 4315590, 4482462, 4649681, 4814337, 4974665, 5128924, 5273787, 5405137, 5519999, 5616443, 5692030, 5744041, 5771294]
50446E771294K959k1269m6479p1598r3627j10413j21978j29280j32849j32742
50436D914018j28988j21758j11361r8048q1981o3899m5717k9439j5343k288R732
50425D224928J8603K2246K0504J3969K360j4571l5287n7100p8024r7017j13099
50414C907512j25658j35096j41948j45711j45828j43213j39408j34600j28141
50405B667909j20624j13580j07000r9221q9766q0372p2407o5100n7445n0226m4483
50394A767685l9264l2903k5801j9879j5474j0893n383n11K322M172P064J1239
50382A642374J5274J8272K0566K2664K4803K7453L0803L3789L4960L4687L5188
50371A940833L7728M0965M2856M3058M2507M1573M0035L8328L7343L6961L5932
$$ y = [5771294, 5774253, 5752984, 5706505, 5634907, 5541280, 5430867, 5308889, 5179609, 5046760, 4914018, 4785030, 4663272, 4551911, 4453863, 4371882, 4307983, 4262266, 4232827, 4217484, 4215196, 4224928, 4243531, 4265777, 4286281, 4300250, 4302610, 4288039, 4252752, 4195652, 4117628, 4020611, 3907512, 3781854, 3646758, 3504810, 3359099, 3213271, 3070058, 2930650, 2796050, 2667909, 2547285, 2433705, 2326705, 2227484, 2137718, 2057346, 1984939, 1919839, 1862394, 1812168, 1767685, 1728421, 1695518, 1669717, 1649838, 1634364, 1623471, 1618088, 1617577, 1619899, 1624071, 1631135, 1642374, 1657648, 1675920, 1696486, 1719150, 1743953, 1771406, 1802209, 1835998, 1870958, 1905645, 1940833, 1978561, 2019526, 2062382, 2105440, 2147947, 2189520, 2229555, 2267883, 2305226, 2342187, 2378119]
50360B378119L3444L0058K7014K5191K4803K5371K6087K6780K8327L1438L5465
50349B692097L9260M2904M7268N2011N5492N6980N7522N8060N7999N6511N3978
50338C270082N0929M6514L9515L0462K1264J2642L163q849k3301l8644n3412o6855
50326C283510p8520q7913r4682r8729j00028r8460r3972q6911p8108o8629n9280
50315B338278n0292m1287l1694k1286j0569p47O740J0955J2033J1074R101N902
50303B238208K63q320j8621k8838l8179m6427n2521n5183n5295n5780n8089n9977
50291A761241n8220n2733m6640m2715m1142m0459l9218l6535l2409k8048k5036
50280A318086k3722k2857k0955j7654j3738j0385q244o776m780k048J21Q45J437
$$ y = [2378119, 2411563, 2441621, 2468635, 2493826, 2518629, 2544000, 2570087, 2596867, 2625194, 2656632, 2692097, 2731357, 2774261, 2821529, 2873540, 2929032, 2986012, 3043534, 3101594, 3159593, 3216104, 3270082, 3321011, 3367525, 3407040, 3437502, 3458766, 3471408, 3474571, 3465722, 3442421, 3403777, 3350365, 3283510, 3204990, 3117077, 3022395, 2923666, 2823638, 2725178, 2631206, 2544295, 2466187, 2397558, 2338278, 2287986, 2246699, 2215005, 2193719, 2183150, 2182403, 2189143, 2200098, 2212131, 2223205, 2232306, 2238208, 2238471, 2230151, 2211530, 2182692, 2144513, 2098086, 2045565, 1990382, 1935087, 1879307, 1821218, 1761241, 1703021, 1650288, 1603648, 1560933, 1519791, 1479332, 1440114, 1403579, 1371170, 1343122, 1318086, 1294364, 1271507, 1250552, 1232898, 1219160, 1208775, 1200531, 1193755, 1188975, 1186927, 1187048, 1187893, 1189330]
50267A189330L914Q211J2328J5088J6989J8309J8289J7018J6362J7832K0554K2497
50255A376721K2900K2493K2027K1728K1783K2377K3233K3802K3791K3280K2498
50244A626633K1676K0726J9063J6217J2793R949P853N603K990J093L90m93k972
50231A741521o354q856j0202j1639j3614j5129j5756j6676j8833k1103k1553k0045
50219A561761j8403j8024j8484j8765j8916j9606k0663k1200k1045k0999k1415
50208A344241k1415k0142j7944j5813j4235j3194j2696j2474j1738r972p605n279
50196A181734l045r51L34N61Q42K271M164N011M707M293L799K186n01k681l307
50181A199417k914k301j684j518k580m550n943o093n965o412p024p367p913q869
$$ y = [1189330, 1193244, 1201455, 1213783, 1228871, 1245860, 1264169, 1282458, 1299476, 1315838, 1333670, 1354224, 1376721, 1399621, 1422114, 1444141, 1465869, 1487652, 1510029, 1533262, 1557064, 1580855, 1604135, 1626633, 1648309, 1669035, 1688098, 1704315, 1717108, 1727057, 1734910, 1740513, 1743503, 1744596, 1744986, 1744493, 1741521, 1735167, 1726311, 1716109, 1704470, 1690856, 1675727, 1659971, 1643295, 1624462, 1603359, 1581806, 1561761, 1543358, 1525334, 1506850, 1488085, 1469169, 1449563, 1428900, 1407700, 1386655, 1365656, 1344241, 1322826, 1302684, 1284740, 1268927, 1254692, 1241498, 1228802, 1216328, 1204590, 1194618, 1187013, 1181734, 1178689, 1177738, 1178072, 1178633, 1179475, 1181746, 1185910, 1190921, 1195628, 1199921, 1203720, 1205906, 1205405, 1202724, 1199417, 1196503, 1194202, 1192518, 1191000, 1188420, 1183870, 1177927, 1171834, 1165869, 1159457, 1152433, 1145066, 1137153, 1128284]
50167A128284r347q692p419o155m879l986m548o322o964m709p23K512M110M686
50153A075848M616M049L798M443N148M892M267M348M533L373J129n62j339k451
50139A116092m274n635n941o188p040p706p615p695q756r793r250p398o138o692
50125A015971q323r299q604o772n455n902p608q763q351p283p002p574p931p555
50111I09549o971o552n972n083m555m851n214m512k869j631j795l166n070p001
50097H44307q332q521q053q408j0209j2173j2701j1848j0773r914q975q135p820
50084G18445p457o020l870k537k455k413j646r79j134j378p96J83N93L53o7o07
50068F88215j218j225j03J572K967M261O145Q418J0048J0512J0274J0009J0078
$$ y = [1128284, 1118937, 1110245, 1102826, 1096671, 1091792, 1087806, 1083258, 1076936, 1069972, 1065263, 1064540, 1067052, 1071162, 1075848, 1080464, 1084513, 1088311, 1092754, 1097902, 1102794, 1107061, 1111409, 1115942, 1119315, 1120444, 1119882, 1118543, 1116092, 1111818, 1106183, 1100242, 1094054, 1087014, 1079308, 1071693, 1063998, 1055242, 1045449, 1036199, 1028801, 1022663, 1015971, 1007648, 998349, 989745, 982973, 977518, 971616, 964008, 955245, 946894, 939611, 932609, 925035, 917104, 909549, 902578, 896026, 890054, 884971, 880416, 875565, 870351, 865839, 862970, 861339, 859544, 856378, 851308, 844307, 835975, 827454, 819401, 810993, 800784, 788611, 775910, 764062, 753289, 743375, 734400, 726265, 718445, 710988, 704968, 701098, 698561, 696106, 693693, 692047, 691068, 689934, 688556, 687760, 687943, 688536, 688889, 688822, 688215, 686997, 685772, 685669, 687241, 690208, 694469, 700614, 709032, 719080, 729592, 739866, 749875, 759953]
50055G59953J0663J1690J2534J2293J0704Q683P769Q774J0918J2541J2850J2457
50043H91829J2025J1244R883Q850Q879Q958P780O159O029P326Q133P900P964Q512
50029A011471P845N723M590N857P519P440O810P790R732J0489J0148J0507J1620
50016A117541J1760J0544R585R924J1028J2442J4496J7075J9339K0889K1814K1694
50004A298131K0069J7910J7125J8436K0768K2687K3311K2254K0092J8515J8575
49993A517873J9057J8050J5640J3460J1994J0222P698N096K734M17j286j645j720
49980A617590l597p381j0857j2577j3338j4060j4417j4349j4939j6561j7842j7692
49968A459980j6856j6356j5784j4449j2966j2229j1876j1081j0094r620r313q179
$$ y = [759953, 770616, 782306, 794840, 807133, 817837, 826520, 834289, 843063, 853981, 866522, 879372, 891829, 903854, 915098, 924981, 933831, 942710, 951668, 959448, 965607, 971636, 978962, 987095, 994995, 1002959, 1011471, 1019316, 1025039, 1029629, 1035486, 1043005, 1050445, 1057255, 1065045, 1074777, 1085266, 1095414, 1105921, 1117541, 1129301, 1139845, 1149430, 1159354, 1170382, 1182824, 1197320, 1214395, 1233734, 1254623, 1276437, 1298131, 1318200, 1336110, 1353235, 1371671, 1392439, 1415126, 1438437, 1460691, 1480783, 1499298, 1517873, 1536930, 1554980, 1570620, 1584080, 1596074, 1606296, 1613994, 1619090, 1621824, 1622241, 1620955, 1619310, 1617590, 1613993, 1606612, 1595755, 1583178, 1569840, 1555780, 1541363, 1527014, 1512075, 1495514, 1477672, 1459980, 1443124, 1426768, 1410984, 1396535, 1383569, 1371340, 1359464, 1348383, 1338289, 1328669, 1319356, 1311177]
49956A311177o100l848j944n10Q9m34j466j908j549j233j609k251k315j680j087
49941A283332j263k206l422m674o040p340q149q612r530j1153j2659j3434j4037
49928A180813j4916j5091j3448j0789q978q353p536n768l723j805N84L506N762
49915A100258O595O997Q370J0542J1917J1187Q573N702M254M242L885J938m04
49902A184056j104l02oq94j548j249j450l438o426r246j2340j6502k0849k3865
49888A084837k5668k7487k9320k9820k8504k6591k5286k4368k3063k1482k0317
49877H02931j9537j8206j5854j3430j2183j1841j0872q699o652n986o030n417
49865F68224m252l560l190k095n61j72j255k118j531m09k41j090j995k256j559
$$ y = [1311177, 1305077, 1301229, 1299285, 1298775, 1298864, 1298430, 1296964, 1295056, 1293507, 1292274, 1290665, 1288414, 1286099, 1284419, 1283332, 1282069, 1279863, 1276441, 1271767, 1265727, 1258387, 1250238, 1241626, 1232096, 1220943, 1208284, 1194850, 1180813, 1165897, 1150806, 1137358, 1126569, 1117591, 1109238, 1101702, 1095934, 1092211, 1090406, 1090990, 1094496, 1100258, 1106853, 1113850, 1122220, 1132762, 1144679, 1155866, 1164439, 1170141, 1174395, 1178637, 1182522, 1184460, 1184056, 1182952, 1182650, 1182644, 1181750, 1180202, 1178953, 1177503, 1174065, 1167639, 1158393, 1146053, 1129551, 1108702, 1084837, 1059169, 1031682, 1002362, 972542, 944038, 917447, 892161, 867793, 844730, 823248, 802931, 783394, 765188, 749334, 735904, 723721, 711880, 701008, 692309, 685657, 679671, 673641, 668224, 663972, 660412, 657222, 655127, 654566, 654394, 653139, 651021, 649490, 649081, 648840, 647750, 645755, 643499, 641940]
49850F41940J69K208L205K609J233r7j490l066m071l730k273n62O56Q99K12k79
$$ y = [641940, 642109, 644317, 647522, 650131, 651364, 651267, 649777, 646711, 642640, 638910, 636637, 636075, 636731, 637630, 637842, 637563]
$$ [...]
##END NTUPLES=NMR SPECTRUM
##END=
