
##TITLE=AC1212_MSMAH12043_7154923_BGRbu6JN0Y
##JCAMPDX= 6.0         $$ Bruker NMR JCAMP-DX V2.0
##DATA TYPE= NMR SPECTRUM
##DATA CLASS= NTUPLES
##ORIGIN= BRUKER
##OWNER= Administrator
$$ 1.72 TOPSPIN		Version 2.1
$$ 2012-12-01 21:14:48.131 -0500  Administrator@X
$$ Compression mode = diff/dup
##.OBSERVE FREQUENCY= 400.02188249412
##.OBSERVE NUCLEUS= ^1H
##.ACQUISITION MODE= SIMULTANEOUS (DQD)
##.ACQUISITION SCHEME= undefined
##.AVERAGES= 8
##.DIGITISER RES= 22
##SPECTROMETER/DATA SYSTEM= spect
##.PULSE SEQUENCE= zg30
##.SOLVENT NAME= COFFEE_meoh
##.SHIFT REFERENCE= INTERNAL, COFFEE_meoh, 1, 14.98509
##AUDIT TRAIL= $$ (NUMBER, WHEN, WHO, WHERE, PROCESS, VERSION, WHAT)
$$ ##TITLE= Audit trail, TOPSPIN		Version 2.1
$$ ##JCAMPDX= 5.01
$$ ##ORIGIN= Bruker BioSpin GmbH
$$ ##OWNER= Administrator
$$ $$ E:\/data/COFFEE/nmr/AC1212_MSMAH12043_7154923_BGRbu6JN0Y/10/pdata/1/auditp.txt
$$ ##AUDIT TRAIL=  $$ (NUMBER, WHEN, WHO, WHERE, PROCESS, VERSION, WHAT)
(   1,<2012-12-01 21:14:39.788 -0500>,<Administrator>,<X>,<go>,<TOPSPIN 2.1>,
      <created by zg
	started at 2012-12-01 21:13:31.631 -0500,
	POWCHK enabled, PULCHK disabled,
       configuration hash MD5:
       86 BA 57 50 F2 9D 5C 9B 26 00 A9 28 5F 66 2E 89
       data hash MD5: 64K
       06 CE C8 35 47 83 51 43 44 22 15 F3 00 44 D3 9A>)
(   2,<2012-12-01 21:14:42.913 -0500>,<Administrator>,<X>,<proc1d>,<TOPSPIN 2.1>,
      <Start of raw data processing
       efp LB = 0 FT_mod = 6 PKNL = 1 PHC0 = 0 PHC1 = 0 SI = 32K 
       data hash MD5: 32K
       CD 7E DA 38 F6 D3 27 67 E3 5D 10 3A 06 E5 60 88>)
(   3,<2012-12-01 21:14:43.397 -0500>,<Administrator>,<X>,<proc1d>,<TOPSPIN 2.1>,
      <pk PHC0 = 99.41528 PHC1 = 0 
       data hash MD5: 32K
       C2 5F 68 15 86 FD 56 FF 01 C2 04 2C A6 82 08 06>)
(   4,<2012-12-01 21:14:43.616 -0500>,<Administrator>,<X>,<proc1d>,<TOPSPIN 2.1>,
      <abs ABSG = 1 
       data hash MD5: 32K
       CF 7E BC 3F BD F8 80 3B 4E 81 04 A3 53 EB 72 2E>)
(   5,<2012-12-01 21:14:43.756 -0500>,<Administrator>,<X>,<proc1d>,<TOPSPIN 2.1>,
      <abs ABSG = 2 
       data hash MD5: 32K
       A6 EB A7 99 C9 22 B0 D3 BA 46 D9 80 19 74 18 A0>)
(   6,<2012-12-01 21:14:43.897 -0500>,<Administrator>,<X>,<proc1d>,<TOPSPIN 2.1>,
      <abs ABSG = 3 
       data hash MD5: 32K
       53 02 04 38 AD 1D C6 AE 70 36 94 19 E3 F6 42 9C>)
(   7,<2012-12-01 21:14:44.069 -0500>,<Administrator>,<X>,<proc1d>,<TOPSPIN 2.1>,
      <abs ABSG = 4 
       data hash MD5: 32K
       4F 87 93 11 59 CA 28 2C 14 DB 03 1A 88 B8 EF 50>)
(   8,<2012-12-01 21:14:44.225 -0500>,<Administrator>,<X>,<proc1d>,<TOPSPIN 2.1>,
      <abs ABSG = 5 
       data hash MD5: 32K
       B2 A6 2C DF 46 90 A2 93 30 FD 12 EB 3A DE 3C CC>)
$$ ##END=
$$ 
$$ $$ hash MD5
$$ $$ 7C 9C 6C A1 4D C8 E5 8E 63 58 14 30 4F 3A EF FD
##$RELAX= 
##$RELAX= 
##$RELAX= 
##$RELAX= 
##$RELAX= 
##$RELAX= 
##$RELAX= 
$$ Bruker specific parameters
$$ --------------------------
##$DU= <E:\>
##$EXPNO= 10
##$NAME= <AC1212_MSMAH12043_7154923_BGRbu6JN0Y>
$$ [...]
150 150 150 150 150 150 150 150
##$TP07= 0
##$TPNAME0= <>
##$TPNAME1= <>
##$TPNAME2= <>
##$TPNAME3= <>
##$TPNAME4= <>
##$TPNAME5= <>
##$TPNAME6= <>
##$TPNAME7= <>
##$TPOAL= (0..7)
0.5 0.5 0.5 0.5 0.5 0.5 0.5 0.5
##$TPOFFS= (0..7)
0 0 0 0 0 0 0 0
##$TUNHIN= 0
##$TUNHOUT= 0
##$TUNXOUT= 0
##$USERA1= <user>
##$USERA2= <user>
##$USERA3= <user>
##$USERA4= <user>
##$USERA5= <user>
##$V9= 5
##$VALIST= <valist>
##$VCLIST= <CCCCCCCCCCCCCCC>
##$VD= 0
##$VDLIST= <DDDDDDDDDDDDDDD>
##$VPLIST= <PPPPPPPPPPPPPPP>
##$VTLIST= <TTTTTTTTTTTTTTT>
##$WBST= 1024
##$WBSW= 4
##$XGAIN= (0..3)
0 0 0 0
##$XL= 0
##$YL= 0
##$YMAX_a= 625465
##$YMIN_a= -535182
##$ZGOPTNS= <>
##$ZL1= 120
##$ZL2= 120
##$ZL3= 120
##$ZL4= 120
##$ABSF1= 14.98509
##$ABSF2= -5.573092
##$ABSG= 5
##$ABSL= 3
##$ALPHA= 0
##$AQORDER= 0
##$ASSFAC= 0
##$ASSFACI= 0
##$ASSFACX= 0
##$ASSWID= 0
##$AUNMP= <proc_prof1d_extract_pilot.lims>
##$AXLEFT= 0
##$AXNAME= <>
##$AXNUC= <1H>
##$AXRIGHT= 0
##$AXTYPE= 0
##$AXUNIT= <>
##$AZFE= 0.1
##$AZFW= 0.1
##$BCFW= 0
##$BC_mod= 0
##$BYTORDP= 0
##$COROFFS= 0
##$CY= 15
##$DATMOD= 1
##$DC= 0
##$DFILT= <>
##$DTYPP= 0
##$F1P= 0
##$F2P= 0
##$FCOR= 0.5
##$FTSIZE= 32768
##$FT_mod= 6
##$GAMMA= 0
##$GB= 0
##$INTBC= 1
##$INTSCL= 1
##$ISEN= 128
##$LB= 0
##$LEV0= 0
##$LPBIN= 0
##$MAXI= 10000
##$MC2= 0
##$MEAN= 0
##$ME_mod= 0
##$MI= 0
##$NCOEF= 0
##$NC_proc= -8
##$NLEV= 6
##$NOISF1= 0
##$NOISF2= 0
##$NSP= 0
##$NTH_PI= 0
##$NZP= 0
##$OFFSET= 14.98509
##$PC= 1
##$PHC0= 99.41528
##$PHC1= 0
##$PH_mod= 1
##$PKNL= yes
##$PPARMOD= 0
##$PPDIAG= 0
##$PPIPTYP= 0
##$PPMPNUM= 2147483647
##$PPRESOL= 1
##$PSCAL= 4
##$PSIGN= 0
##$PYNMP= <proc.py>
##$REVERSE= no
##$SF= 400.02
##$SI= 32768
##$SIGF1= 0
##$SIGF2= 0
##$SINO= 400
##$SIOLD= 32768
##$SPECTYP= <>
##$SREGLST= <1H.CDCl3>
##$SSB= 0
##$STSI= 32768
##$STSR= 0
##$SW_p= 8223.68421052631
##$SYMM= 0
##$S_DEV= 0
##$TDeff= 65536
##$TDoff= 0
##$TI= <>
##$TILT= no
##$TM1= 0
##$TM2= 0
##$TOPLEV= 0
##$USERP1= <user>
##$USERP2= <user>
##$USERP3= <user>
##$USERP4= <user>
##$USERP5= <user>
##$WDW= 1
##$XDIM= 32768
##$YMAX_p= 462684529
##$YMIN_p= -709243
##$CURPLOT= <Network HP LaserJet P1505>
##$CURPRIN= <$Network HP LaserJet P1505>
##$DFORMAT= <normdp>
##$LAYOUT= <+/1D_H.xwp>
##$LFORMAT= <normlp>
##$PFORMAT= <normpl>
##$SURQMSG= 1
$$ End of Bruker specific parameters
$$ ---------------------------------
##NTUPLES= NMR SPECTRUM
##VAR_NAME=  FREQUENCY,     SPECTRUM/REAL,   SPECTRUM/IMAG
##SYMBOL=    X,             R,               I
##VAR_TYPE=  INDEPENDENT,   DEPENDENT,       DEPENDENT
##VAR_FORM=  AFFN,          ASDF,            ASDF
##VAR_DIM=   32768,         32768,           32768
##UNITS=     HZ,            ARBITRARY UNITS, ARBITRARY UNITS
##FACTOR=    0.250966925370066, 1,           1
##FIRST=     8223.43324360094, -56096,       -104195
##LAST=      0,             200761,          -54272
##MIN=       0,             -709243,         0
##MAX=       8223.43324360094, 462684529,    0
$$ Real data points
##PAGE= N=1
##DATA TABLE= (X++(R..R)), XYDATA
$$ [...]
19569C8485i8155j52666O2074A01532J60224F8184f0192A21358h1195c9646r0393
19558a30039B38155c8026k72670a628l32801a32951A38281K37695c12207h1480
19547g5947l71716a43853J6984e0456H3481b15110G2951K39393h5295k79782J07387
19536b57690J27893k03467r7422A31971a26859A14460b77637A1842c7906A08687
19525A32755E0520J24882a31551E6495a79691c3095l0135A00343r437A495R8154
19514I9649C1460J98360a91716Q7955F8784b95692A83439J6327D6132a82797i952
19502H6341g1232j05544L2863e9049G7512b2036k37245B82597j25236a83829N0646
19491a33183j092b6003l6595k56319b4573H8345P4407a15215H1938l6294P0818
$$ y = [38485, -98155, -250821, -188747, 101532, 261756, 68184, -60192, 121358, -81195, -39646, -130039, 238155, -38026, -310696, -1628, -334429, -132951, 138281, 375976, -312207, -81480, -75947, -447663, -143853, -126869, -50456, 83481, -215110, 72951, 312344, -85295, -365077, -257690, -129797, -333264, -430686, 131971, -126859, 114460, -277637, 11842, -37906, 108687, 132755, 50520, 175402, -131551, 56495, -179691, -33095, -63230, 100343, 90906, 1495, 99649, 31460, 229820, -191716, -103761, 68784, -295692, 183439, 199766, 46132, -182797, -9952, 86341, -71232, -176776, -143913, -59049, 77512, -22036, -259281, 282597, 157361, -183829, -133183, -134275, -26003, -62598, -318917, -24573, 88345, 162752, -115215, 81938, 45644, 116462]
19480A16462a49298e4065I1828a72843B05850I5670a679p0386F5845d77305A62
19468f4321A40082B2403Q9967h74p6945m0656m1316b0839o9018j14032k72972
19457d76861f5272B84672a14328k15072n7357A70654p5520f7991j00224L5370
19447a32845B14415j01223b78656G5677O458a59996b8764D0014f0198M328j75814
19436b31684N3493D2438k168L7749J18263O7918i6368n5208G9475A0867b18597
19424D5384O627B4370K6974B0392e08245i6167C8194K5248a23768b2485B6114
19412g8810J2993j92349d9567j00948d1629A1120a26909e2401k48579G9380J07188
19401A86568h5077B30888b60172j40276F6084c52819Q2407Q1266f6174k53496
$$ y = [116462, -149298, -54065, 91828, -172843, 205850, 95670, -1679, -72065, 65845, -477305, 162, -64321, 140082, 22403, 112370, -874, -77819, -118475, -159791, -20839, -89857, -203889, -476861, -65272, 284672, -114328, -329400, -386757, 170654, 95134, -67991, -168215, -132845, 214415, 113192, -278656, 75677, 82135, -159996, -28764, 40014, -60198, -55870, -231684, -178191, 42438, 40270, 78019, 196282, 264200, -96368, -151576, 79475, 10867, -218597, 45384, 52011, 24370, 51344, 20392, -508245, -96167, 38194, 63442, -123768, -22485, 26114, -78810, -65817, -258166, -49567, -150515, -41629, 11120, -126909, -52401, -300980, 79380, 186568, -85077, 230888, -260172, -400448, 66084, -352819, -270412, -189146, -66174, -319670]
19391c19670g5716i685j26655d7407H9307A9570b26822d5556m2040m8441j74376
19380c10413J46186d0697k78083b2378r9801e019k08061R8965K1497m4643p6889
19369b14150G9516K69093B8298b14156A23884J60434b22042O1677G9674a39326
19358a40640O6957j67930c1469k80390C6402L2895a4854A73919a26480j31527
19348b58007e2444A26386b3811q246r0028M6160j8405M3149m78586E1660a0964
19336B29328F5485D398c4251m7603D3477a9582k34966b5910l66159H6778i4426
19324C48925a98230N7030j04244E7998M8629e77461h2177c4322j3131j28822E9076
19312f5332l0950B2119p706K8014a738A3437c32210Q8031D984K66733b10433c6932
$$ y = [-319670, -75716, -9685, -136340, -47407, 89307, 19570, -226822, -45556, -87596, -136037, -310413, -164227, -40697, -318780, -22378, -122179, -5019, -213080, -114115, -92618, -137261, -214150, 79516, 348609, 28298, -214156, 123884, 284318, -222042, -160365, 79674, -139326, -140640, -73683, -241613, -31469, -311859, 36402, 69297, -14854, 173919, -126480, -258007, -52444, 126386, -23811, -32057, -122085, -75925, -94330, -51181, -529767, 51660, -10964, 229328, 65485, 4398, -34251, -81854, 43477, -19582, -254548, -25910, -392069, 86778, -94426, 348925, -198230, -141200, -245444, 57998, 106627, -577461, -82177, -34322, -47453, -176275, 59076, -65332, -96282, 22119, 14413, 42427, -1738, 13437, -332210, -244179, 4984, 271717, -210433, -36932]
19299h773o0536J5427a2446k27059Q1284a3451o5125q1653o6352h326j20951b2511
19286d0002o0712M1305B77275b18005j93245d2242j53542A07648A7713Q6103R289
19275A13105r715P2419g5337Q590A73219J04641d46500C223J29375E2542c57913
19263a5188i61k0394l21772J06031d894A95228a02437B8848J4530J49161b13360
19251g3109a2257A62522n0530b12184A51442f586k10972q767o690B2402b16918
19239a00280A21508b47918c6304A78935g3479l38470B12739e7226c890I1315D3342
19227g3859k19148F8983a20566o5583k0064d9632j19584A1777O7702d1297A36865
19215c7811A85242a79350A59525l028a58465G678c23013a58056N2004n894A56967
$$ y = [-8773, -69309, -53882, -12446, -239505, -158221, -13451, -78576, -160229, -226581, -8326, -129277, -22511, -40002, -100714, -59409, 277275, -218005, -411250, -42242, -195784, 107648, 17713, 103816, 113105, 103390, 175809, -75337, -66747, 173219, 277860, -446500, 3223, 132598, 52542, -357913, -15188, -961, -21355, -343127, -237096, -4894, 195228, -102437, 28848, 43378, 192539, -213360, -73109, -12257, 162522, 111992, -212184, 151442, -6586, -217558, -226325, -233015, 22402, -216918, -100280, 121508, -247918, -36304, 178935, -73479, -411949, 212739, -57226, -3890, 91315, 43342, -73859, -293007, 68983, -120566, -186149, -206213, -49632, -169216, 11777, 79479, -41297, 136865, -37811, 185242, -179350, 159525, 156497, -158465, 7678, -323013, -158056, -106052, -111946, 156967]
19203b50146b0134G0931a84252M1813f8962A89733l5600b14194e027n6325B0979
19191C6569J62346G0672c02086B04785a11617A55439a95717A35048a64699P9552
19181h5147c3057k32787J4661A8835e4156k28478J18674C19042b72474l5837C03840
19169a68766q1840K2282C23837h7825g19r7190j82568E4647a49827B07001C5282
19157a1440A85885a63742K8080D9855J8532B9271h417k30662j10753J13873H3559
19145a18105A2991a87761A33099a06215F6238b50687A1878h8589q7744N741A42206
19133G3657J66907a40314e2423o6465M4069l54949a21359F6732a52794b6927d65
19121a21199L4491r1928E0194b2894I1878b65279f3633H8716k0544J38613m0782
$$ y = [-250146, -20134, 70931, -184252, -142439, -68962, 189733, 154133, -214194, -5027, -61352, 20979, 36569, 198915, 70672, -302086, 204785, -111617, 155439, -195717, 135048, -164699, -85147, -33057, -265844, -251183, 18835, -54156, -282634, -163960, 319042, -272474, -308311, 303840, -168766, -250606, -228324, 323837, -87825, -719, -97909, -280477, 54647, -149827, 207001, 35282, -11440, 185885, -163742, -135662, 49855, 68387, 29271, -8417, -239079, -349832, -235959, 83559, -118105, 12991, -187761, 133099, -106215, 66238, -250687, 11878, -88589, -176333, -170592, 142206, 73657, 240564, -140314, -52423, -118888, -74819, -429768, -121359, 66732, -152794, -26927, -465, -121199, -86708, -178636, 50194, -22894, 91878, -265279, -63633, 88716, 68172, 206785, 166003]
19110A66003c215k96793C37272i9893n9364d3986o192j94579k74222a39229B30302
19098G9196N0286i0648B41876b5529f255j00319A36453f6994I6271b5873J1844
19087a4029m5721I7645d5163A27709n533L7939a99968L6288p6479A0237a37154
19075b85434C970b2532k96306A02987a62408C11574a04942j03149j36118B78051
19064h3983r3628h18G437J09346a06206J2225A47085b70356A85641a30292A13377
19052c9200A21885c50800A19337h4098B81661j28070a92299A17545a76380n7899
19042b34279e3300o7142j46204A87887b98504c0707C49510c64569g2443C4564
19031A41253K1032d6655j04090A17415b09009b3800B42784k1054d1271A20493
$$ y = [166003, -3215, -300008, 337272, -99893, -159257, -43986, -50178, -244757, -518979, -139229, 230302, 79196, 129482, -90648, 241876, -25529, -6255, -106574, 136453, -66994, 96271, -25873, -14029, -59750, 97645, -45163, 127709, 122176, 160115, -199968, -163680, -240159, 10237, -137154, -285434, 3970, -22532, -318838, 102987, -162408, 311574, -104942, -208091, -344209, 278051, -83983, -177611, -818, 7437, 116783, -106206, -93981, 147085, -270356, 185641, -130292, 113377, -39200, 121885, -350800, 119337, -84098, 281661, 153591, -192299, 117545, -176380, -234279, -53300, -120442, -266646, 187887, -298504, -30707, 349510, -364569, -72443, 34564, 141253, 162285, -46655, -150745, 117415, -209009, -23800, 242784, 221730, -41271, 120493]
19020A76242P398a55652B37121F3662L7355a81883a9661A76677f6250l5525a0896
19008d1441k50340i3794A38084e92915A14204m2502e50359B3502b70528J11513
18998a59015C0666c19687a47086D7283c11640A2175J9969b22072B64430A13432
18987a77728n5794c7121j29568q1041L4473B80953a91253A44278F9443K7567J59769
18976B56779a66558q5942j80154K08020k46039a16084C5594P4462l9238c77219
18965B34124c6980B63133o6000i3913A01867A2514c7610j85929B96775A095d1177
18953A55249a83784d2347k58057p6471a02388c6820l00214E3630h8610D5370d2892
18941b80284A74061R1875B8891b06653O5641o9922G8898M7045c2140B31447g5828
$$ y = [176242, 183640, -155652, 237121, 63662, 101017, -181883, -19661, 176677, -66250, -101775, -10896, -41441, -291781, -93794, 138084, -592915, 114204, 71702, -550359, 23502, -270528, -159015, 30666, -319687, -147086, 47283, -311640, 12175, 32144, -222072, 264430, 113432, -177728, -233522, -37121, -166689, -247730, -213257, 280953, -191253, 144278, 69443, 97010, 256779, -166558, -252500, -432654, -224634, -470673, -116084, 35594, 110056, 70818, -377219, 234124, -36980, 263133, 197133, -93913, 101867, 12514, -37610, -223539, 296775, 1095, -41177, 155249, -183784, -42347, -300404, -376875, -102388, -36820, -337034, 53630, -88610, 45370, -42892, -280284, 174061, 265936, 28891, -206653, -141012, -210934, 78898, 125943, -32140, 231447, -75828]
18929A34951g0920B74601e5259L564B52215P6846a15559j5686A07326i3239j5654
18918a08893A0079J36888i4923A30380g1652k3702D6755a46543C6765J30530H2645
18906b41588f6166F4502P5047a16881p42l24994B67012a27360j60484A789a9574
18894a9326B88936f6129N133D5899a41863C66048C8008b20641A66422D1251K8834
18883G0085d63885F5208b29375O6170e7381F5853k3497a1393m51464K26578n0165
18872b86444J39520j17804e5386i083r4530A5426g987l134j46434f2379A36834
18860A49801b3584o0816k00914G2094b15963j10011A30510a66766D2210b09115
18849c85201a55273C21734A9916J22794d79656A38543o6077a9573A7323L28282
$$ y = [134951, -70920, 274601, -55259, -51695, 252215, 329061, -115559, -131245, 107326, -93239, -108893, 10079, 146967, -94923, 130380, -71652, -95354, 46755, -146543, 36765, 167295, 82645, -241588, -66166, 64502, 139549, -116881, -117623, -442617, 267012, -127360, -287844, 1789, -19574, -19326, 288936, -66129, -60996, 45899, -141863, 366048, 38008, -220641, 166422, 41251, 70085, -463885, 65208, -229375, -163205, -57381, 65853, 42356, -11393, -462857, -236279, -286444, -146924, -264728, -55386, -9083, -103613, 15426, -7987, -11121, -157555, -62379, 136834, 149801, -23584, -84400, -285314, 72094, -215963, -325974, 130510, -166766, 42210, -209115, -385201, -155273, 321734, 19916, 142710, -479656, 138543, 72466, -19573, 17323, 345605]
18839C45605A36693a69238k29322A3609J3166h7111k080l83163A96046B2988a74821
18827a4739G3053K9364A0061a77935j98818A77662a66244l4421a2512B66062I8661
18815B8831L7926r715K30660m4734b23951C74486A40391B3089J70534C6189a32824
18803C4628b33995A37784d3463j530A05769K6385a80710j956g0653b6534q6835
18792a13369k2652m3186a0721j06535A14658l8640G608J9556a15294J5184M7635
18781e2475A26806c50165i6602D45061a13649E1095a02422k01235A37796j9671
18771A18125K7525a20692F7049b14347Q0132n3792N9162j64783C60257a50910
18760D4099a27630j6379D1960a05523l8861c4537l70399a08511B17924q8424C507
$$ y = [345605, 136693, -169238, -398560, 13609, 26775, -87111, -89191, -472354, 196046, 22988, -174821, -14739, 73053, 102417, 10061, -177935, -376753, 177662, -166244, -200665, -12512, 266062, 98661, 28831, 66757, 57042, 287702, 242968, -223951, 374486, 140391, 23089, 193623, 36189, -132824, 34628, -233995, 137784, -43463, -44993, 105769, 132154, -180710, -182666, -70653, -26534, -113369, -136021, -179207, -10721, -117256, 114658, 76018, 7608, 27164, -115294, -100110, -52475, 126806, -350165, -96602, 445061, -113649, 51095, -102422, -303657, 137796, 118125, 145650, -120692, 67049, -214347, -134215, -188007, -128845, -293628, 360257, -150910, 44099, -127630, -144009, 41960, -105523, -144384, -34537, -404936, -108511, 217924, 129500, 3507]
18748e902j22790a3744B07463C3783c48135b9414q5315B62231b1729j15878j06076
18737b43683G7036b39494G3057a42803I0164a78356g5881K1266F1874a74975L9788
18726a35187b5818k3670q4252B87452a13088E3519J17675h8300q8953f5407A26573
18714A49908a41837B5098K4632a1610C9032N7084k672a71402P5841k87382B9629
18702b54923F070K7028b08896A21815K6857a99339B10143a36956I1021a33018
18691g4209A27918c05667A0542a87630d3075p6399d1649o2355A07735g6073o8655
18680a44728A58916b60823F7999R520c59634c6139a1925j23071L9722p4461A08564
18668a65186G1321a27545H3636a2075B4752d8994G2680K8445O5251K1617d24069
$$ y = [-5902, -128692, -13744, 207463, 33783, -348135, -29414, -114729, 262231, -21729, -137607, -243683, 77036, -239494, 73057, -142803, 90164, -178356, -75881, -54615, 61874, -174975, -135187, -25818, -49488, -133740, 287452, -113088, 53519, 171194, -88300, -177253, -65407, 126573, 149908, -141837, 25098, 49730, -11610, 39032, 96116, 93444, -171402, -95561, -382943, 29629, -254923, 6070, 33098, -208896, 121815, 148672, -199339, 210143, -136956, 91021, -133018, -74209, 127918, -305667, 10542, -187630, -43075, -119474, -41649, -104004, 107735, -76073, -144728, 158916, -260823, 67999, 77519, -359634, -36139, -11925, -134996, -95274, -169735, 108564, -165186, 71321, -127545, 83636, -12075, 24752, -48994, 72680, 101125, 166376, 187993, -424069]
18656D9663b02924E5697a81151G0236B2126c77576A66069a30543K5572j14259
18646b19230K5867F1754d38611A05500L464g0699K3896q5953m275A02281a67565
18634a27264j02528I6185b4886D7408i5425J1211j58080g4726N470l9090c9497
18622g7608E4457K38277c13171a36021p8943j427i4095d5072A11646a67762J8778
18611a48984G523f5994H5073a34118F108L0203g6067r6027A22983j4755J01797
18600B10025R5863C1583c3680j8009A47444a55013q2164J08090F9811c27513a56458
18588a93923B13757b22855f9241D71645A61099a27228d9626j63000J9625j6874
18578b09875a6438j1862n5856l25375f2318i582l00011a46038A20051a02938B87121
$$ y = [49663, -202924, 55697, -181151, 70236, 22126, -377576, 166069, -130543, -104971, -219230, -193363, 61754, -438611, 105500, 108964, -70699, -46803, -132756, -137031, 102281, -167565, -127264, -229792, 96185, -24886, 47408, -95425, -84214, -242294, -74726, -69256, -108346, -39497, -77608, 54457, 292734, -313171, -136021, -214964, -216391, -94095, -45072, 111646, -167762, -148984, 7523, -65994, 85073, -134118, 6108, 36311, -76067, -172094, 122983, 108228, 210025, 305888, 31583, -33680, -51689, 147444, -155013, -237177, -129087, 69811, -327513, -156458, -193923, 213757, -222855, -69241, 471645, 161099, -127228, -49626, -212626, -193001, -209875, -16438, -28300, -84156, -409531, -62318, -9582, -309593, -146038, 120051, -102938, 287121]
18566I7761b36544J13778l3431j42851a03085c7722J8395j65104B1369j910a26124
18554a98582O3990k05599g7860D0408d53757a17795A60201a92180j6120I0325
18543A48884A7510a19134m7635h1945A49901g6578B43530I1968g9674o3108A86153
18531g6974H1878b95103e552A69504g1214k24114A80302b83315F9833Q7257g6163
18519B0956c13662A07099D3797J14309b55819I5076j1638K10332b43248J03240
18509a40008B71509b91862H2648a75084F3036a91952J4480A78706a26006f2157
18498a57232k9235M0445p260M5513B44863I1191J23205I2535c562A51246a75232
18486H6591f0072Q355l13976A79323i2572P987n8474G4272E951P6542J03674g8098
$$ y = [97761, -236544, -122766, -156197, -299048, -103085, -37722, -19327, -184431, 21369, 19459, -126124, -198582, -134592, -340191, -77860, 40408, -453757, -117795, 160201, -192180, -208300, 90325, 148884, 17510, -119134, -166769, -81945, 149901, -76578, 243530, 91968, -79674, -142782, 186153, -76974, 81878, -295103, -5552, 169504, -71214, -295328, 180302, -283315, 69833, 157090, -76163, 20956, -313662, 107099, 43797, 158106, -255819, 95076, 83438, 293770, -243248, -140008, 271509, -291862, 82648, -175084, 63036, -191952, -177472, 178706, -126006, -62157, -157232, -186467, -146022, -153282, -107769, 244863, 91191, 214396, 92535, -3562, 151246, -175232, 86591, -60072, -51717, -365693, 179323, -92572, -84585, -143059, 74272, 5951, 82493, 186167, -78098]
18473A56729K9738D8618b07051A32838A6965a83735N0406O4443p4817j72180A83561
18461B04368E9396a3933j76345l16949b26568F3738J12500a03512j53931B3985
18450F2561a10005K9775D145J1500P6717J00372K0252k2936D1351a27873H6413
18438G7465b72780d5268m334k86672a55633r0123a6788k55685A5851L1357h2980
18426A11957a71293c2743A03456j3297a93894A67359f6717l4249b6894l578k4847
18415e5319H961J80298a04739r7973j30179A83951g2040B51655c46632P2170B78579
18403C09326A52662a01262q6369b4859a1654k27251L4144j02601a21337A36736
18392g6449q8907I9637K69178b8634r1757j19011F5698h3981A65136e3858D2492
$$ y = [156729, 186467, 48618, -207051, 132838, 16965, -183735, -133329, -68886, -143703, -315883, 183561, 204368, 59396, -13933, -190278, -507227, -226568, 63738, 176238, -103512, -257443, 23985, 62561, -110005, -80230, 4145, 15645, 92362, 192734, 212986, 190050, 41351, -127873, 86413, 77465, -272780, -45268, -49602, -336274, -155633, -245756, -16788, -272473, 15851, 47208, -82980, 111957, -171293, -32743, 103456, 90159, -193894, 167359, -66717, -100966, -26894, -30472, -55319, 8961, 189259, -104739, -202712, -332891, 183951, -72040, 251655, -346632, -274462, 278579, 309326, 152662, -101262, -187631, -24859, -11654, -238905, -204761, -307362, -121337, 136736, -76449, -165356, 99637, 368815, -28634, -120391, -239402, 65698, -83981, 165136, -53858, 42492]
18380A31920d28090A58794D5081J57640J77929A42102b85462J32246B78274I4652
18369e2795B0196A330h9081p5442A08536D6537c26597a6263D9007a9145A44047
18357D2926h2088o0672C1825O192a64864J3080A2014L11163j42466a40794A51182
18345H2403b43277J02090F9471J37886F3384b61j71395p2670c9357B36250A00766
18333a16263A0015b22913n0019Q6732K9388I0588b66960P8831A00237k7672j672
18322G0893a527l3156B05418a81301k31859A26590B0750e3950f177j04886G9588
18310A04883L6288a59981A67195j7474A3960h0451C5564b1243G1880Q0418B1241
18298g8700A74379F2468a22479e9005a5735m25709A20167L3269l81e33751a48878
$$ y = [131920, -428090, 158794, 45081, 202721, 380650, 142102, -285462, -153216, 278274, 94652, -52795, 20196, 1330, -89081, -164523, 108536, 46537, -326597, -16263, 49007, -19145, 144047, 42926, -82088, -142760, 31825, 38017, -164864, -151784, 12014, 323177, 180711, -140794, 151182, 82403, -243277, -141187, 69471, 207357, 63384, -261, -171656, -244326, -39357, 236250, 100766, -116263, 10015, -222913, -272932, -186200, -156812, 90588, -266960, -188129, 100237, 72565, 70893, -1527, -34683, 205418, -181301, -413160, 126590, 20750, -53950, -6177, -111063, 79588, 104883, 141171, -159981, 167195, 149721, 13960, -80451, 35564, -21243, 71880, 152298, 21241, -78700, 174379, 62468, -122479, -59005, -15735, -441444, 120167, 153436, 153055, -533751, -148878]
18286b39503o5568a40541M1822A59076a54314A86831A4510i7277J9075j37512
18276b15714A59168a18453c450n1409J7253C19217G999a97313O3435O2671I2222
18264A72712e0258I6619a60292O2813j71294j9530H3740l3235a483m191j05034
18253a10708n4169C1033K09900C3227K61954c6840C18730b60631a0950o001l86
18242a7337l32194B50017m0128h6047j60283i9980B67277b75918g5025A4897M0931
18231E5828c2214G6428b58525b4496A3324g8342E930J28719b02030E293a06252
18219c79438A57821c49201A7468p044b12797N4341c8210j29945k66704A5725d0762
18207i5945A47322L6176c6588C44306h9532j11634m7901R4866j711j70650C04903
$$ y = [-239503, -305071, -140541, -98719, 159076, -154314, 186831, 14510, -97277, -78202, -215714, 159168, -118453, -3450, -54859, -37606, 319217, 7999, -197313, -133878, -71207, 92222, 172712, -50258, 96619, -160292, -97479, -268773, -288303, 83740, 50505, -1483, -5674, -110708, -164877, 31033, 240933, 33227, 295181, -36840, 318730, -260631, -10950, -16951, -17337, -349531, 250017, 209889, -86047, -246330, -99980, 267277, -275918, -75025, 14897, 55828, -32214, 76428, -258525, -24496, 13324, -78342, 5930, 134649, -202030, 5293, -106252, -379438, 157821, -349201, 17468, 10424, -212797, -158456, -38210, -168155, -434859, 15725, -40762, -95945, 147322, 183498, -36588, 344306, -89532, -201166, -249067, -154201, -155912, -326562, 304903]
18195a0112j29264F1812b95954g8876A2322i5023H9693K36035E2003a80291A58635
18183g379m7493j70598g4621B39962B8451J13234o0094b15250h9538L2781A01779
18171b0559r5081j43136A73162a8045G7398K23865a48865l7765i79E1922a63041
18159c9803B39280E4603a61670g7822j07710e9593j89666B90439g418B39121c75069
18147b6479D98813g2018L1877A39404N4176Q3542G3039N6791d74549a46795I0320
18135B48114b01398I8966J950c4260A41027d5735j07589j70321A47238D8129c12191
18123e5309j57895C7751e6761k28210B0263i4541A61588d69065b1028E1899a4711
18111d04552a2869B39242j13529b04254A37712b12721k4185b5961A42009a78360
$$ y = [-10112, -139376, 61812, -295954, -78876, 12322, -95023, 89693, 325728, 52003, -180291, 158635, -7379, -54872, -225470, -74621, 239962, 28451, 141685, 81591, -215250, -89538, -56757, 101779, -20559, -115640, -258776, 173162, -18045, 77398, 301263, -148865, -186630, -979, 51922, -163041, -39803, 239280, 54603, -161670, -77822, -185532, -59593, -249259, 290439, -7418, 239121, -375069, -26479, 498813, -72018, -40141, 139404, 193580, 277122, 73039, 129830, -474549, -146795, 90320, 248114, -201398, 98966, 100916, -34260, 141027, -45735, -153324, -323645, 147238, 48129, -312191, -55309, -213204, 37751, -56761, -284971, 20263, -94541, 161588, -469065, -21028, 51899, -14711, -404552, -12869, 239242, 125713, -204254, 137712, -212721, -236906, -25961, 142009, -178360]
18100b72799j58264c3886C21334g847I4146b24554D0250L9010J37732k1559a82715
18088a75370G76a24344A31372c07540I0978b04984D5743b42504f0444m1505j54593
18077b56542J07188P4366k12136A17438N0222a22004G7964a93395L1744c0816
18066a08292E4746i0484j58088F0084d073k7011r4529c6308A82103K4049L009
18055B09161a25484J7243L9474B8956b49308J19614C47454A30473H315R5717b0192
18043I3436b26771M2086G1846K4178l6344a34180e9948m3489n5472j30823h0774
18031A16872n0942R3023A4641J3687J9044a31100a0460B36621J45718b3928j80906
18020b04834M7889a1990j11276H1497g5765B016d01628E654a31541k34573b5405
$$ y = [-272799, -431063, -33886, 321334, -7847, 94146, -224554, 40250, 79260, 216992, 195433, -182715, -175370, 776, -124344, 131372, -307540, 90978, -204984, 45743, -242504, -60444, -101949, -256542, -149354, -74988, -287124, 117438, 167660, -122004, 77964, -193395, -161651, -30816, -108292, 54746, -90484, -248572, 60084, -4073, -31084, -125613, -36308, 182103, 206152, 209161, -125484, -108241, -68767, 28956, -249308, -129694, 347454, 130473, 8315, 104032, -20192, 93436, -226771, -184685, 71846, 96024, 59680, -134180, -59948, -103437, -158909, -289732, -80774, 116872, 65930, 158953, 14641, 28328, 47372, -131100, -10460, 236621, 382339, -23928, -204834, -156945, -11990, -123266, 81497, -75765, 2016, -401628, 5654, -131541, -366114, -25405]
18008a58827D20081H6489f4290C65982b1550j36803P1235j38589A37489d27555
17997H0119f5397o0472j3229L7450O398B2380b08865q8628D8009K22839A17532
17985a11572k16775j6536F8330c5284A27282F3633a32952k3748c917D13743h4960
17973b23484A99038e6723l5870I9452a67002C84342a67177P9574l2796c1127H4072
17961h5594k36722C3278b82237J32908C27754C9704k100J4387G039b71956a03832
17949a26657G9337A7185i0769C1072f013E0144a55821F7927O8980I511b2341k19096
17937b41437A18129B9330J55031b17127q051A61513b76696E7727a92635I3019
17926b290j71294A72208k369E8030d5140i208m5983o3049l4583o2585B5711J89808
$$ y = [-158827, 420081, 86489, -64290, 365982, -21550, -158353, -87118, -225707, 137489, -427555, 80119, -65397, -125869, -139098, -101648, -95250, 22380, -208865, -297493, 48009, 270848, 117532, -111572, -328347, -344883, 68330, -35284, 127282, 63633, -132952, -156700, -3917, 413743, -84960, -223484, 199038, -56723, -92593, 99452, -167002, 384342, -167177, -87603, -120399, -31127, 84072, -85594, -322316, 33278, -282237, -149329, 327754, 39704, 37604, 51991, 7039, -271956, -103832, -126657, 79337, 17185, -90769, 31072, -6013, 50144, -155821, 67927, 136907, 9511, -22341, -241437, 118129, 29330, 184361, -217127, -225178, 161513, -276696, 57727, -192635, 93019, -2290, -173584, 172208, 169839, 58030, -45140, -9208, -55191, -118240, -152823, -215408, 25711, 215519]
17914B15519l3320D7773e708B0871J29912D7646j9791h3678r4429g8959o0549
17903a39508k0535q1478j27927B16703C498J59328o9531l6437L62941e4096k36018
17892b90114e4435j68266A3217a91760j09716D3863b58804A457c79082B70951
17881c0255i300k4187H6584h727j22274C5117J6036a44178l1838k71387D4480
17869I9905P8675i8915b2055B26760j2501I2186a16749j10023B02716a15283B62283
17857E9678i102l21960J33817C24808J39906g7287k59079h5718A80715q1857a71800
17845a28483m9717f1576K4851H709M4065j2243a30463b7342k8768A94441g1724
17833B25282a05692j14760C03324C3125d6149F2926l916B3363J2486N45D894O0796
$$ y = [215519, 182199, 47773, -5708, 20871, 150783, 47646, 27855, -83678, -178107, -78959, -139508, -160043, -241521, -369448, 216703, 3498, 162826, 93295, 56858, 419799, -54096, -290114, -54435, -222701, 13217, -191760, -301476, 43863, -258804, 1457, -379082, 270951, -30255, -9300, -33487, 86584, -8727, -131001, 35117, 51153, -144178, -176016, -447403, 44480, 99905, 178580, -98915, -22055, 226760, 214259, 92186, -116749, -226772, 202716, -115283, 262283, 59678, -9102, -331062, -197245, 324808, 464714, -77287, -336366, -85718, 180715, 98858, -171800, -128483, -178200, -61576, -36725, 8709, 52774, 40531, -130463, -27342, -56110, 194441, -71724, 225282, -105692, -220452, 303324, 33125, -46149, 62926, 59010, 23363, 35849, 36394, 4894, 65690]
17821F5690a78590A93982R7767A31062K5257b49585C03585l8608c28846a04591
17810D642J6773K755N4362a48043A683K86782k1886a66435j51941Q2209B16428
17798a78938C6311b60417g2445b6644B8862a50631A86782g1319D83582a1662A08367
17786a1868r4708j80842a10543A49455G3600b01152i9198H1736D340J36806i3258
17774c26294J35834B2016J92467l0641b85635B13017b49775C30762a29601N9382
17764g0219B3585a42402J236A27314O8861j5521g8920B4658c7965A0949i5062
17752C67525E2712J08094a80822O2187A1263b2096C41621a42927K0499f1102A41066
17740A01063a75227d7035B08690i6011A00549C5707R6829g2132B23329N8263c8875
$$ y = [65690, -178590, 193982, 291749, 131062, 156319, -249585, 303585, 264977, -328846, -104591, 4642, 21415, 24170, 78532, -148043, 1683, 288465, 266579, -166435, -318376, -236167, 216428, -178938, 36311, -260417, -72445, -26644, 28862, -150631, 186782, -71319, 483582, -11662, 108367, -11868, -106576, -287418, -110543, 149455, 73600, -201152, -99198, 81736, 4340, 141146, -93258, -326294, -190460, 22016, 214483, 183842, -285635, 213017, -249775, 330762, -129601, -70219, 23585, -142402, -141166, 127314, 196175, 180654, -78920, 24658, -37965, 10949, -95062, 367525, 52712, 160806, -180822, -118635, 11263, -22096, 341621, -142927, -122428, -61102, 141066, 101063, -175227, -47035, 208690, -96011, 100549, 35707, 132536, -72132, 223329, 281592, -38875]
17728b92078A75099a66775B59314a51017B1872e3728j44589R0713a962A54905
17717b43066g1770A76040D8211P0097i2316B94568a20299k12376A23247b77850
17706a55157C40479d09646h9617M1075j16051K8709E8310c45096J12985A32947
17695F0996b24883A45710e0028B2863J15423k4870a0130j16033p9211F5948N8165
17684A24113a02444l20169F6067a10430D8320a879r2898j03610a1227q9260k80795
17673c81282A47831F0179c75899J80722B16316F115J27105n4394g0724j04497
17663a75221B59360q8387K4143G7750J69968I1740J62759a44164b5360A77270
17652a9195A94489J5304a60816D9988J14661b08007L6565A04187h1231j66335
$$ y = [-292078, 175099, -166775, 259314, -151017, 21872, -53728, -198317, -107604, -1962, 154905, -243066, -71770, 176040, 48211, 118308, -92316, 294568, -120299, -332675, 123247, -277850, -155157, 340479, -409646, -89617, -48542, -164593, -135884, 58310, -345096, -232111, 132947, 60996, -224883, 145710, -50028, 22863, 138286, 113416, -10130, -126163, -205374, 65948, 124113, -102444, -422613, 66067, -110430, 48320, -1879, -94777, -198387, -11227, -100487, -381282, 147831, 60179, -375899, -195177, 216316, 6115, 133220, 78826, -70724, -175221, 259360, 170973, 195116, 77750, 247718, 91740, 254499, -144164, -25360, 177270, -19195, 194489, 209793, -160816, 49988, 164649, -208007, -171442, 104187, -81231, -247566]
17642b47566d7470F0450g742o8689D35749A7680a10533e3206D9189B0089L3466
17631E3555c33358a9956j9569B8308O0497A5142K70583a45505o2917E21945A26499
17619a77157P865O4127C41537b59050C14113a11744N4893a426j69497k42360a15109
17607D06708g1853A8324J58573a85705I8991G772N8685c7118k12433A53202j7028
17596A36174h7929M3725F114h9790c9234B2145a0428D02352a47528A89201l6627
17585A52574f5563A23882J86165H1748P0029d7143D6944J63491a42450l3761B2339
17573B5206F22b55989A43411a57994E1281K476a86668D1044b0736B05671G6695
17561B26842q7058B985a06630D57202C3321h2164a3981B30638B6697R157a49202
$$ y = [-247566, -47470, 60450, -7742, -76431, 435749, 17680, -110533, -53206, 49189, 20089, 53555, -333358, -19956, -39525, 28308, 88805, 15142, 285725, -145505, -208422, 521945, 126499, -177157, -169292, -105165, 341537, -259050, 314113, -111744, -56851, -1426, -170923, -413283, -115109, 406708, -71853, 18324, 176897, -185705, 98991, 7772, 66457, -37118, -249551, 153202, 136174, -87929, -44204, 6114, -89790, -39234, 22145, -10428, 402352, -147528, 189201, 152574, -65563, 123882, 310047, 81748, 151777, -47143, 46944, 210435, -142450, -176211, 22339, 25206, 622, -255989, 143411, -157994, 51281, 53757, -186668, 41044, -20736, 205671, 76695, 226842, 139784, 2985, -106630, 457202, 33321, -82164, -13981, 230638, 26697, 35854, -149202]
17549B10660n1659a22411C63473j70388k192a68622K1671J2783D02236M3765a6614
17537C38871j47312J86690G2011A1223a63152b7309A22383N6742a14359A74485
17526A90719f6847j98166B45367M7733B7170a99820a7808F0048g246A18799b76267
17514a9819j47532o3382f4367k51061A36257c4533B8140b28416A42036n0506j4058
17503G7472K19694h7325E6217K04754o6376c02955B7533P2935O5474a82261g3783
17491b41717A45605A4827a47075G9528J03130G8645B9386J05062F742K89405j47540
17480A48607J78920a57149B96462c0607k15287B52406j24545h881C5533R5413
17470A30946q512m8302a85797A05133N8845m4435b9460I7610a31520D33152A65673
$$ y = [210660, 159001, -122411, 363473, 193085, 190893, -168622, -146951, -134168, 402236, 446001, -16614, 338871, 191559, 378249, 72011, 11223, -163152, -27309, 122383, 179125, -114359, 174485, 190719, -66847, -265013, 245367, 293100, 27170, -199820, -17808, 60048, -7246, 118799, -276267, -19819, -167351, -230733, -64367, -315428, 136257, -34533, 28140, -228416, 142036, 91530, 77472, 297166, -87325, 56217, 260971, 194595, -302955, 27533, 100468, 165942, -182261, -73783, -241717, 145605, 14827, -147075, 79528, 182658, 78645, 29386, 134448, 6742, 296147, 148607, 327527, -157149, 296462, -30607, -245894, 252406, 127861, -8881, 35533, 130946, 122434, 74132, -185797, 105133, 163978, 119543, -29460, 97610, -131520, 433152, 165673]
17458A26515d47C79131A2494K29074A2270a07661A57466g0174G76326A11904J18172
17447B30076O4977M5046K3798n8537j37963E6680d8743j2714H0347O5561A5920
17435B721J39947D0249j5054K9423J66315o1120K04580C931J73282J44884j56173
17424A65924J74367j13I582d3869r6312A77154k8489n5341A0014R5308K3104j8991
17412A09435N55D9798K13084j25574E2968c2289j40538A3828O201K42731G0557
17400b04384A84574R0132I5604B899b6903D60452a0737j5274F2658K32621J53723
17389D49002a58385A73507a53565B23128N7893c32786A80445B4294J76105L5528
17379B35927a68885a410l0578D16647j62130G1210N7334C7669K4551K51894G3954
$$ y = [126515, -447, 379131, 12494, 241568, 12270, -107661, 157466, -70174, 776326, 111904, 230076, 295053, 340099, 363897, 305360, 167397, 56680, -48743, -61457, 80347, 145908, 15920, 2721, 142668, 40249, 25195, 54618, 220933, 159813, 364393, 3931, 177213, 322097, 165924, 340291, 340178, 9582, -43869, -140181, 177154, 148665, 93324, 10014, 105322, 128426, 109435, 109990, 49798, 262882, 137308, 52968, -32289, -172827, 13828, 20029, 262760, 70557, -204384, 184574, 274706, 95604, 2899, -26903, 460452, -10737, -26011, 62658, 295279, 449002, -158385, 173507, -153565, 223128, 281021, -332786, 180445, 24294, 200399, 235927, -168885, -1410, -31988, 416647, 254517, 71210, 128544, 37669, 62220, 314114, 73954]
17367B32066e23918A47324P3511H2701L91826k17258j17294J48968p9861E6263
17356i3996A95806c4923D33039E5826B3946b1396h523A53284A6461g7120B3146
17344A08342n1345J07745O5154o3360k2529Q5652A03182P8563a92002F7858J55972
17333B23830e2575B82613r0797k3234J08861E213P0015f16A01332L00612A66530
17321A43884J58447R336g7245C30964a42209F8315a20261n9698Q0905A4491K6424
17310D0915M4929e9466A05702D5631c7365B06839n7091A2693O4714J9222a00389
17298A50225a64314L5386n3301A0345K14192G6086c8177p8886B31535E9040L6826
17287I5866K58675D454f852E6708R0744K2534K65647a07406C9796h4726c3765
$$ y = [232066, -523918, 147324, 220835, 82701, 474527, 257269, 139975, 288943, 209082, 56263, -93996, 195806, -34923, 433039, 55826, 23946, -21396, -8523, 153284, 16461, -77120, 23146, 108342, 56997, 164742, 229896, 166536, 144007, 229659, 103182, 181745, -192002, 67858, 223830, -52575, 282613, 191816, 168582, 277443, 5213, 75228, -616, 101332, 401944, 166530, 143884, 302331, 311667, -77245, 330964, -142209, 68315, -120261, -179959, -99054, 14491, 40915, 85844, -59466, 105702, 45631, -37365, 206839, 149748, 12693, 77407, 96629, -100389, 150225, -164314, -128928, -182229, 10345, 224537, 76086, -38177, -117063, 231535, 59040, 95866, 354541, 4454, -6852, 56708, 147452, 169986, 435633, -107406, 39796, -84726, -33765]
17275C32927a47221R66C05661A02230J22847I8404r396c79972h780A18206E3934
17263B01957q5632p672g239C6416L609L95771c3210A55100o8226b06496A48904
17251C7079K93572r6831d8426B75233J1514J02984I7398K95151A39295e484A85626
17239B56438k5521K26961j67470F9216L72437e5049n6574D92459A59165G801i429
17227A36060m9721P737K6026K8377J76568k546i528j73522b6242C70314a68863
17215A40592g7791E2228K87497a42723B19296a6770I8943L1615L99824A11030
17204C19285J20581k19507o1209B2240a53062d0065m8019b2859A39839j7172J60935
17193B83602A29751E4852L46982E2493K50361R2523A53688M552P7337I4701N7425
$$ y = [332927, -147221, -146255, 305661, 102230, 225077, 98404, 89008, -379972, -8780, 118206, 53934, 201957, 116325, 108653, -7239, 36416, 40025, 435796, -33210, 155100, 86874, -206496, 148904, 37079, 330651, 233820, -48426, 275233, 286747, 389731, 97398, 392549, 139295, -5484, 185626, 256438, 230917, 457878, 290408, 69216, 441653, -55049, -111623, 492459, 159165, 7801, -9429, 136060, 86339, 94076, 120102, 148479, 325047, 322501, -9528, -183050, -26242, 370314, -168863, 140592, -77791, 52228, 339725, -142723, 219296, -16770, 98943, 130558, 530382, 111030, 319285, 439866, 220359, 159150, 22240, -153062, -40065, -88084, -22859, 139839, 122667, 283602, 129751, 54852, 401834, 52493, 302854, 395377, 153688, 158240, 235577, 94701, 152126]
17182A52126J46112o8790o303K02824A2966e7829A05002P7613e6221A12099M18340
17171E30439j46268A79472a7288B00657K44594f251E25852B42932K49552j56326
17161C36158O5246j63106A17679J41164p6249j8142N0803M18095A40073J52532
17151B92605J68130k9776A74655J02354A02579a38879A00974K47650A36944N00581
17141F37525A25815L93850B52851A19603L54010g6373E41923A84531J25541j08713
17131B01359P3701A00105K55393j65074r760N1986J69003A1376O39733k54442
17121C96667G6200J96399K4282J14603r7045H3343L09573q1094K20545k07202
17111C25165m7544j11155J60171E2354J72258K49940A39004Q4033H6714J27718
$$ y = [152126, 298238, 229448, 223145, 425969, 12966, -57829, 105002, 182615, -56221, 112099, 530439, 384171, 179472, -17288, 200657, 445251, -6251, 525852, 242932, 492484, 336158, 401404, 238298, 117679, 258843, 182594, 164452, 215255, 633350, 140073, 292605, 460735, 430959, 174655, 277009, 102579, -138879, 100974, 348624, 136944, 637525, 125815, 519665, 252851, 119603, 473613, -76373, 541923, 184531, 310072, 201359, 275060, 100105, 355498, 190424, 180664, 232650, 401653, 11376, 651109, 396667, 76200, 272599, 296881, 411484, 314439, 83343, 392916, 311822, 532367, 325165, 277621, 166466, 326637, 52354, 224612, 474552, 139004, 223037, 86714, 214432]
17101B14432K04640A72640J38910j02414E7745J6900K66136J12949j46521o0145
17091B47064M0128m8929D7171K28155K92674B44729J21270j49765C8237K97265
17081C35502K8061K10602A61336L10963M7385j74117J26779j55537R9242m7775
17071C68276J96143o8914J12224r9496K09731j97020j04061J11969A39496J40905
17061B80401J89886m7483J04637k16816A51846K27966A39617K63902J1690J20040
17051E35249j90798J51116k14037L83919B87651k588J58740j7584M28544k32929
17041F21834k36486l5274P2509p8491M44364B35702L18569N3111O8593k06500
17031D69475r1949M08825l60371R1294k7197O002A80019N27718C49900J4212Q5724
$$ y = [214432, 419072, 172640, 311550, 209136, 57745, 74645, 340781, 453730, 307209, 247064, 287192, 238263, 47171, 275326, 568000, 244729, 365999, 216234, 38237, 335502, 363563, 574165, 161336, 472299, 519684, 345567, 472346, 316809, 416051, 368276, 564419, 495505, 607729, 508233, 717964, 520944, 416883, 528852, 139496, 280401, 470287, 422804, 527441, 310625, 151846, 379812, 139617, 403519, 415209, 535249, 344451, 495567, 281530, 665449, 287651, 285063, 443803, 426219, 854763, 621834, 385348, 350074, 422583, 344092, 788456, 235702, 554271, 607382, 675975, 469475, 377526, 786351, 425980, 517274, 490077, 496079, 180019, 707737, 349900, 364112, 449836]
17020D49836Q5230L31171k44951R6053j99634j44224K30466K22493l09003q4306
17010D33131J03642K66989K5458m01480r2709Q9126o0768L32283j96691k32221
17000B66760P455M61947j39152K52746l28845m194L23109l76306J88362M2698
16990F94580j40024p8860K01707K99661j64777k63391k31398K07253M84948l50687
16980F59012m8163J13061K68063k00726k69953J12667L32185k15097r0912J7848
16970F77985J47016k68487p487k9969J95393J17764p4064k98893L32569k41108
16960E50719M19514C98818M31357J67931m04547K2729L60541l76058L30791p4879
16950H56683Q4013m8271k19621P7327L3824M7189J40877p678l55249M66270k16458
$$ y = [449836, 535066, 866237, 621286, 717339, 517705, 373481, 603947, 826440, 517437, 433131, 536773, 803762, 829220, 427740, 335031, 424157, 363389, 695672, 498981, 266760, 274215, 736162, 597010, 849756, 520911, 516717, 839826, 463520, 651882, 694580, 554556, 475696, 677403, 977064, 812287, 548896, 317498, 524751, 1009699, 659012, 610849, 723910, 991973, 791247, 521294, 633961, 966146, 751049, 660137, 677985, 825001, 556514, 549027, 519058, 714451, 832215, 758151, 459258, 791827, 550719, 970233, 398818, 830175, 998106, 593559, 616288, 976829, 600771, 931562, 856683, 940696, 892425, 672804, 750131, 783955, 831144, 972021, 964343, 609094, 1075364, 858906]
16939H58906j04126L81047j20177N838J26809l00144J30030J05508o2194N5116
16929A076613k03875K62433P239m7870j7879Q0872l23132L46574r2396j1128J76085
16918A253536q721R7557m32866K1681P4532J99044K3537l2325K40537l27984J95239
16907A303767J56641j76995k07562L34677m48202L31181j40169L05959k4508R2322
16897A527111l08770n751J80624N719K19202L75438p39093N3832L85987p4507
16887A619792J33773j80065J16314j6392L84670n81361P8063l8106M94708j31644
16877A879752l8494J03520p0396q2909J5048J95995L6517r998L3465J1742q4236
16866A990006j35808M85334k10168q43L184L91945j72216P2136l22564J49737
$$ y = [858906, 754780, 1135827, 1015650, 1021488, 1148297, 848153, 978183, 1083691, 1021497, 1076613, 872738, 1135171, 1142410, 1094540, 1076661, 1157533, 834401, 1180975, 1088579, 1077451, 1253536, 1244815, 1342372, 909506, 931187, 1005719, 1204763, 1228300, 1195975, 1436512, 1108528, 1303767, 1460408, 1283413, 1075851, 1410528, 962326, 1293507, 1153338, 1459297, 1434789, 1527111, 1218341, 1212590, 1393214, 1398933, 1618135, 1993573, 1254480, 1308312, 1694299, 1619792, 1753565, 1573500, 1689814, 1673422, 2058092, 1476731, 1554794, 1516688, 2011396, 1879752, 1841258, 1944778, 1874382, 1791473, 1806521, 2002516, 2039033, 2029035, 2062500, 2074242, 1990006, 1854198, 2339532, 2129364, 2128521, 2131705, 2523650, 2351434, 2423570, 2101006, 2250743]
16856B250743J09591j14161L23101P5244k36498K31708j47351k91891K27656J50262
16846B578404K89824k20295M7560M26281J13588k0604k97409J06666m4646M95066
16836C474435l56496l9710O85481k48800L6773o7948q8282M18078K92246j36309
16826C969468N0049q4238p6952L58210k12364Q6186L15900j26297M92228m76639
16816D295551M34847l841R2451J67532J62681p0422M01997m58354L24865k47836
16806E099471K68243L80093o2538M75591q3585K50597M9334K52969K79948j68124
16796F741999N20924j3230K12624J01340J69560m484M69522P1459K04736K43274
16786H717724M38033j00912L61078L69513J77030O51867K76881j47380M38044
$$ y = [2250743, 2360334, 2246173, 2569274, 2644518, 2408020, 2639728, 2492377, 2200486, 2428142, 2578404, 2868228, 2647933, 2695493, 3121774, 3235362, 3214758, 2917349, 3024015, 2979369, 3474435, 3117939, 3078229, 3763710, 3514910, 3551683, 3483735, 3395453, 3813531, 4105777, 3969468, 4019517, 3935279, 3858327, 4216537, 4004173, 4090359, 4406259, 4279962, 4772190, 4295551, 4730398, 4726557, 4819008, 4986540, 5149221, 5078799, 5480796, 5022442, 5347307, 5099471, 5367714, 5747807, 5685269, 6160860, 6077275, 6327872, 6377206, 6630175, 6910123, 6741999, 7262923, 7249693, 7462317, 7563657, 7733217, 7728733, 8198255, 8269714, 8474450, 8717724, 9155757, 9054845, 9415923, 9785436, 9962466, 10614333, 10891214, 10743834, 11181878]
16777A1181878O08237L01635K71371M27939M30032K09826N20060Q82390N9175
16768A4892543L63676J217769K18248P11060O07190M40569J516608M45372Q57914
16759B1270949P13963O33185J326393R06095J011914J127378J076793J729128
16751B9795798J626155J724233J228367J807963J762533K293078K192771K076750
16743D4507648K400215K721011L015257L326908L013538M126839L875156M269492
16735G1256064M936270M763015N639457O056959O486027O834461P481913P701335
16727A21155501Q595522Q495763Q888494R298043Q897720Q999674Q608198P896924
16719A90835839O746826N366145M016389K457721R45040r64211k675033m582684
$$ y = [11181878, 11790115, 12091750, 12363121, 12791060, 13221092, 13430918, 13950978, 14833368, 14892543, 15256219, 16473988, 16692236, 17403296, 18010486, 18451055, 19967663, 20413035, 21270949, 21984912, 22618097, 23944490, 24850585, 25862499, 26989877, 28066670, 29795798, 31421953, 33146186, 34374553, 36182516, 37945049, 40238127, 42430898, 44507648, 46907863, 49628874, 52644131, 55971039, 58984577, 63111416, 66986572, 71256064, 76192334, 80955349, 86594806, 92651765, 99137792, 105972253, 113454166, 121155501, 129751023, 138246786, 147135280, 156433323, 165331043, 174330717, 182938915, 190835839, 197582665, 202948810, 206965199, 209422920, 210367960, 209403749, 206728716, 202146032]
16711B02146032n324088p139568p386363r071009q802715r181109r225085q759155
16703A37256940q893853q309826p840259p637301p026976o366558o150112n194577
16695G9837478n559019m631997m368807m463594l251127l794349l024935k749383
16687D7994267k887125k298112k707686j745429k158890j887336j714201j442710
16679C1152778j613753j563635j278100j271909q86935j106213r40668j034113
16671B1457452r91610q67248p27503r14793p45400o33183n29554n53798o14110
16662A4880253n36269o18227k88263l59888o09577m8181l55348n10933k81142
16653A1272425m71111q13690J01117k59195k02571m28772l15734j98521m89055
$$ y = [202146032, 196821944, 189682376, 182296013, 173225004, 164422289, 155241180, 146016095, 137256940, 128363087, 120053261, 112213002, 104575701, 97548725, 91182167, 85032055, 79837478, 74278459, 69646462, 65277655, 60814061, 57562934, 53768585, 50743650, 47994267, 45107142, 42809030, 40101344, 38355915, 36197025, 34309689, 32595488, 31152778, 29539025, 27975390, 26697290, 25425381, 24538446, 23432233, 22491565, 21457452, 20465842, 19598594, 18871091, 17956298, 17210898, 16577715, 16048161, 15494363, 14880253, 14343984, 13725757, 13437494, 13077606, 12468029, 12419848, 12064500, 11553567, 11272425, 10801314, 9987624, 10088741, 9829546, 9626975, 9198203, 8882469, 8683948, 8194893]
16644H194893m65989J42331m14100n8362j6440n38213K65062k76974m51810J30332
16634F510730p4982m41706l7533k24200o1752k86179k63194O6334k49470l09500
16624D628548J04994j07706r0908j20858j24483k46485j2937J47117j97339J20357
16614D100300k0936j14451k99265n5833l19422L50083o5960R3933m59163J82586
16604C391872m2839l42353n8101J6853M6158k44656J8489O0417k04740R0370Q5373
16593B816843k50446P9936l8488j56959k24743J08728P4333k98227L4948J36163
16583B282088J1196J9955k47023M21428k36833L967l13941N00405l54596j50713
16573A935933j50136J86403j8638l07366K69224k3059p9478P5513k24452j80562
$$ y = [8194893, 7728904, 7871235, 7457135, 7398773, 7382333, 6844120, 7109182, 6832208, 6380398, 6510730, 6435748, 5994042, 5956509, 5732309, 5670557, 5384378, 5121184, 5187518, 4938048, 4628548, 4733542, 4625836, 4534928, 4414070, 4289587, 4043102, 4030165, 4177282, 3979943, 4100300, 4079364, 3964913, 3665648, 3609815, 3290393, 3640476, 3574516, 3668449, 3209286, 3391872, 3349033, 3006680, 2948579, 2965432, 3011590, 2766934, 2785423, 2845840, 2641100, 2731470, 2816843, 2566397, 2646333, 2607845, 2450886, 2226143, 2334871, 2409204, 2110977, 2145925, 2282088, 2293284, 2313239, 2066216, 2487644, 2250811, 2254778, 1940837, 2441242, 2086646, 1935933, 1785797, 1972200, 1953562, 1646196, 1915420, 1892361, 1812883, 1888396, 1663944, 1483382]
16563A483382p6819J87735K3239J34607M6392l84745L1828J71916l13430K23660
16553A527765o4186j80790P2330J15866k57927K88504L593k64201j9548O747j21061
16542A107092J40500J73369l41490K50564j23317K30899m55970J5322O22901n19212
16532A100658n4344k8369L7410o1206K03705j28322L3740k67241p1171L11029
16522A075889j27482j29518J24839l74487M04662q2466J27785l31135L61185j59205
16512H90067o8207K25509m32361L04104J91956l25871N8116l12210L74688k73306
16502F32485J0597M08249l25318p0307q8412M39721l22732O9297J33065j15932
16492G70713l04107K79176k07855L47404k49767k82234K65280O7964R1493L8806
$$ y = [1483382, 1406563, 1594298, 1617537, 1752144, 1798536, 1413791, 1445619, 1617535, 1304105, 1527765, 1463579, 1282789, 1355119, 1470985, 1213058, 1501562, 1505155, 1240954, 1221406, 1228153, 1107092, 1247592, 1420961, 1079471, 1330035, 1206718, 1437617, 981647, 996969, 1619870, 1100658, 1046314, 1017945, 1055355, 994149, 1197854, 1069532, 1103272, 836031, 764860, 1075889, 948407, 818889, 943728, 569241, 973903, 891437, 1019222, 688087, 1049272, 890067, 821860, 1047369, 615008, 919112, 1111068, 785197, 843313, 531103, 905791, 632485, 643082, 1051331, 726013, 655706, 567294, 1007015, 684283, 753580, 886645, 770713, 466606, 745782, 537927, 885331, 635564, 353330, 618610, 686574, 778067, 816873]
16482H16873O450l23987O6982l9845N01039m72877J07939l8183J26538C70118
16471I04007m01500K53229C55706N81417l83960m2281k2757E6912N84489C02040
16460A78572L01483J7001j07874N4698m6157p8076A40614O59606C14179J37755
16450D51934j16924N805K6720k036m1755K19412l1319J65916B36321R9064K32602
16439E67987j23515j70347J58853r349j6513L20479A27661K83759A53909M254
16429A58163J98499L33791l11959L6657j02104A29519K17492K07647k21357K48937
16419E82238k63937A30339J93477O3176o6106o2181q271j07233m3686L50397j72494
16408B77418j17608L09206J2272J9238K0571p2735A90850J79313j77282L19371
$$ y = [816873, 823323, 499336, 566318, 526473, 1027512, 554635, 662574, 624391, 750929, 370118, 904007, 502507, 755736, 355706, 937123, 553163, 510882, 488125, 56912, 641401, 302040, 178572, 480055, 497056, 389182, 443880, 397723, 319647, 140614, 800220, 314179, 451934, 335010, 340815, 367535, 365499, 323744, 543156, 511837, 677753, 236321, 335385, 567987, 444472, 274125, 432978, 423629, 407116, 727595, 127661, 411420, 153909, 158163, 356662, 690453, 378494, 415151, 313047, 129519, 347011, 554658, 333301, 582238, 318301, 130339, 323816, 386992, 320886, 258705, 250434, 143201, 99515, 449912, 277418, 159810, 469016, 481288, 500526, 521097, 448362, 190850, 370163, 192881, 512252]
16398E12252q7673j37074j12970A6885L10121R600q9504I9209K09434A39214J72869
16387C12083J17553A76702J07902K0717o1485b66350B39721A09029L35139A5753
16376C08438k8295r5105J91374r0402j16326J39088p2190Q0398j8729r0591J43366
16365C51026A55663K36376A44796b05279A97701k6789K51091A63259k9288K20232
16355C54203r6174N9367m2519o6294d6332A82259J86584o9295j07141H6502L70964
16344D57466A77368k9350J1423o0493K518R4807B3313P4253J18162m5095k199
16333A68434E6535L35691F2543b26328K4488A1366K67523A27712J94301q1675
16323B40338l71p8958C7309O2350Q4575J17391e6874E04560n7956j91069J22571
$$ y = [512252, 424579, 287505, 174535, 16885, 327006, 336606, 247102, 99209, 308643, 139214, 312083, 429636, 176702, 284604, 305321, 243836, -266350, 239721, 109029, 444168, 15753, 308438, 280143, 185038, 376412, 286010, 169684, 308772, 236582, 316980, 298251, 207660, 351026, 155663, 392039, 144796, -205279, 197701, 170912, 422003, 163259, 133971, 354203, 258029, 317396, 274877, 208583, -46332, 182259, 368843, 299548, 192407, 86502, 457466, 177368, 148018, 159441, 98948, 101466, 196273, 23313, 97566, 215728, 170633, 168434, 56535, 392226, 62543, -226328, -201840, 11366, 278889, 127712, 322013, 240338, 239967, 161009, 37309, 99659, 184234, 301625, -56874, 504560, 446604, 255535, 378106]
16312C78106A11872e2458E20855A09445B9361N9614P1925Q6776e667A66925L1723
16301A98648O6004J6107a84987A79313K24588c3371A43120i529B06719J42604
16291C49323p6525a91257C78710I7388J48874k1114j06781f8848b7083B29121
16280f3087C29733a76182D8165Q7450L0054J82258C6244A5141L86433B5365b23191
16268h9108K7007I4507O9297L0112h9197a7833B43136F1893Q8983J95750e6732
16256H8028J92114c4610A98592p4576J71259A5441L13980A44550D4451L2117L91949
16245D68517A94129P390k8620O2196b9531A74644a49713a3190E95131C2405b36962
16233C10158a34782m1368j06820a35192c0733p5125C06600m3970F6116a28681
$$ y = [378106, 111872, -52458, 520855, 109445, 29361, 88975, 160900, 247676, -5667, 166925, 198648, 264652, 280759, -184987, 179313, 403901, -33371, 143120, -9529, 206719, 349323, 272798, -191257, 378710, 97388, 246262, 225148, 118367, -68848, -27083, 229121, -63087, 329733, -176182, 48165, 135615, 165669, 347927, 36244, 15141, 401574, 25365, -223191, -89108, -62101, 94507, 163804, 193916, -89197, -17833, 243136, 61893, 150876, 346626, -56732, 88028, 280142, -34610, 198592, 124016, 295275, 15441, 329421, 144550, 44451, 76568, 468517, 194129, 201519, 172899, 235095, -29531, 174644, -149713, -13190, 595131, 32405, -236962, 310158, -134782, -176150, -282970, -135192, -30733, -105858, 306600, 262630, 66116, -128681]
16222B26007b9492A00338J5716L21085a29361f192D15673A5295P2005h4672B18347
16210H8914J35978c6506F0810J41075e5554E1168k0724J41498Q269c0211G2082
16198b54387l5001C61152b40882A88918B0437a77545g5279A34581K07790A61186
16187C87132h8725B22834G0325h8058B13928G4528g1869A1367c39672a22201e2196
16175A68766P4586h0798j4891B89364a66423f6908B22232E3086J37981H7266J62630
16164B49896d1760J7543P45A04201a2639k60026B17855D224L29887g4384j3923
16153h8307B09649I4112J30502o7542K20445j69268K1600I2868c14086a50409
16142A10973i6408B06097j00501R2253b3140r5821K9124c1328A943h6362A95248
$$ y = [226007, -29492, 100338, 116054, 437139, -129361, -6192, 415673, 15295, 87300, -84672, 218347, 88914, 224892, -36506, 60810, 201885, -55554, 51168, 30444, 171942, 180211, -30211, 72082, -254387, -289388, 361152, -240882, 188918, 20437, -177545, -75279, 134581, 342371, 161186, 387132, -88725, 222834, 70325, -88058, 213928, 74528, -71869, 11367, -339672, -122201, -52196, 168766, 243352, -80798, -95689, 289364, -166423, -66908, 222232, 53086, 191067, 87266, 249896, -41760, -24217, -23472, 104201, -12639, -272665, 217855, 4224, 334111, -74384, -88307, 209649, 94112, 224614, 157072, 377517, 208249, 229849, 92868, -314086, -150409, 110973, -96408, 206097, 105596, 197849, -23140, -118961, -89837, -31328, 1943, -86362, 195248]
16130a60464N4694M1858j57845A91039G4060c6367j24771G3018L216l0217a95072
16118H2009b1037B1454L8976a15665b8153A91713C4172c7686G4811a6225j1470
16107b7695j51063G3151b40267J19071D7064n285N1185Q138C0161L64667j79451
16096B15377c01922B29634D729b1573E2362c9672j06298F3241j04R2100D3324
16084b68961B52893a27126G0609h9708A16016d4362A38910g0319l8550M2184B68070
16072A41189b93330H8489J8927J7531A0810f2099I8309O7526d4892A87376a6132
16060A04212a66595O4857J6267A91490a98989R499N3478B58136K08880e3961H051
16048a30583k10767i647F5205a425B91437a03609L799B45166K94090b30648J10688
$$ y = [-160464, -105770, -63912, -221757, 191039, 74060, -36367, -161138, 73018, 76234, 46017, -195072, 82009, -21037, 21454, 60430, -115665, -28153, 191713, 34172, -37686, 74811, -16225, -27695, -178758, 73151, -240267, -121196, 47064, 41779, 92964, 101102, 30161, 394828, 215377, -301922, 229634, 4729, -21573, 52362, -39672, -145970, 63241, 63137, 155237, 43324, -268961, 252893, -127126, 70609, -89708, 116016, -44362, 138910, -70319, -108869, -66685, 268070, 141189, -293330, 88489, 107416, 124947, 10810, -62099, 98309, 165835, -44892, 187376, -16132, 104212, -166595, -101738, -85471, 191490, -198989, -189490, -136012, 258136, 467016, -53961, 8051, -130583, -341350, -9647, 65205, -1425, 291437, -103609, -99810, 245166, 539256, -230648, -119960]
16037a19960B74444h3823H5730A6825N206f6096K768J6436C8278M04050b50884
16025A4079L0457g474j03657C1347b34479h8668l4617M8032I6421c31027J02670
16014b28357l4328k0955A12730d81686c0177A94138H4136i8587B9941a97776F0395
16002b6810A47695G2327h4096j70688J04057p9477L1065A28344a18219C1207J34944
15991A66151l6979M2325a46401A71457f3843j28481c611k15866C58455B7977j1504
15980A6473O8193M5749b47514b302B5792a00169o0804A24291e3595G1493c7057
15968a7759B65295A0530J19934b0789A05318f0223A76991l8581c29821a53636
15957a8708k33914a640B99988Q1640c6236a8099k17352d3344j28165A40898i5801
$$ y = [-119960, 274444, -83823, 85730, 16825, 22031, -66096, -63328, -46892, 38278, 442328, -250884, 14079, 44536, -7474, -111131, 31347, -234479, -88668, -123285, -75253, 96421, -331027, -228357, -262685, -283640, 112730, -481686, -30177, 194138, 84136, -98587, 29941, -197776, 60395, -26810, 147695, 72327, -84096, -254784, -150727, -230204, -199139, 128344, -118219, 31207, 166151, 129172, 171497, -146401, 171457, -63843, -192324, -3611, -219477, 358455, 27977, 16473, 84666, 130415, -247514, -2302, 25792, -100169, -160973, 124291, -53595, 71493, -37057, -17759, 265295, 10530, 130464, -20789, 105318, -60223, 176991, 138410, -329821, -153636, -18708, -252622, -1640, 299988, 381628, -36236, -18099, -235451, -43344, -171509, 140898, -95801]
15945b0110r6375B98989g5277A14651b28757j61037A55539B296e74397B33885
15934b53267B1980a37126A51225a00221j13920C9575c446k76017P1706g2462A69381
15922c03337B34961a44233B6781K4248b29672P6285j03278F3499o439a07100k430
15911a09530r8458A2708R1369f8954A01876d8410b29j10378q9309R8259D8447
15899a91294f4442B1486b54364G9418i9757M6044l7378j24874j58758e2015q9613
15888a41628J3967A99131a3963B8993d6253r4330A36762e4543B87739j01859M6834
15877B32714a7535l09226B80957C4139a65080k1407B95015b5891k9782q4959A01864
15865C65803a67424g1590B27743D9542Q2685l5487J5490i396l01357D3213b02253
$$ y = [-20110, -116485, 298989, -75277, 114651, -228757, -389794, 155539, 2296, -574397, 233885, -253267, 21980, -137126, 151225, -100221, -214141, 39575, -3446, -279463, -207757, -72462, 169381, -303337, 234961, -144233, 26781, 51029, -229672, -153387, -256665, 63499, 57060, -107100, -109530, -207988, 12708, 104077, -68954, 101876, -48410, -229, -110607, -199916, -101657, 48447, -191294, -64442, 21486, -254364, 79418, -99757, -53713, -91091, -215965, -374723, -52015, -141628, -127661, 199131, -13963, 28993, -46253, -140583, 136762, -54543, 287739, 185880, 232714, -17535, -326761, 280957, 34139, -165080, -186487, 295015, -25891, -55673, -140632, 101864, 365803, -167424, -71590, 227743, 49542, 132227, 96740, 112230, -9396, -310753, 43213, -202253]
15853a00640d0867k48605B57536a92784P726G8991a88912G4629h6355r7160D7887
15841c01411A15940a42050j43706D1469a10977A12073Q373i2693A52629A4268
15830a10656B8608d6618n3661c3087M326l40120a09357m1934P1282k20072n2056
15819c52137A29913c5221j79109c2765p1387L123H1397J32411q2971a12214j33832
15808b46046H072J65559a36881A04744j0170K1687c6042r1616k0155A19808b19219
15796C22093m0458A1325a64109K7893B67107k4279E6824J19869c70680J45683
15786b24997A8192a49647A551a12359b4099j7849A34024c97119a76478K5867j08519
15775b59130J6447n2810e8389A68679C2103a58442A04527d961r0327K5543j92240
$$ y = [-100640, -40867, -289472, 257536, -192784, -185058, 78991, -188912, 74629, -86355, -183515, 47887, -301411, 115940, -142050, -285756, 41469, -110977, 112073, 120446, -92693, 152629, 14268, -110656, 28608, -46618, -100279, -33087, -28761, -368881, -109357, -151291, -80009, -300081, -352137, 129913, -35221, -214330, -32765, -104152, -101029, 81397, 213808, 130837, -112214, -246046, 8072, 173631, -136881, 104744, 94574, 116261, -36042, -127658, -147813, 119808, -219219, 322093, 281635, 11325, -164109, -136216, 267107, 242828, 56824, 176693, -370680, -224997, 18192, -149647, 1551, -112359, -24099, -41948, 134024, -397119, -176478, -150611, -259130, -242683, -295493, -58389, 168679, 32103, -158442, 104527, -4961, -95288, -69745, -261985]
15764b61985B2839c4879j24859N7057A16136a98176h5891A73806c9158G5977L19892
15753C95869E1849Q2897a09078o1039J6719E0757d689j14158j9951C7157K5237
15742F2394c1427n5608B07886h8247D6139L1658b18082D4157J76066F028c30504
15730f7448K864B11603b09145A76303J70022h0080k43081H8580a34933q8011q4903
15719c07847E7588P4373b60466Q6852A66904E8547J5473a2419j41262r1455H3819
15707h0562l47757a11969e2442j73466E6708a39132a9051k02274i7547J1959E0890
15695c3919B05263j0480b54019N3808C26926b22814b4336B15575C7811a67232
15684d6506B73125A1474J49945R9024I4658l1647d24536B5029a01053a3009k17605
$$ y = [-261985, 22839, -34879, -159738, -102681, 116136, -198176, -85891, 173806, -39158, 75977, 395869, 51849, 134746, -109078, -170117, -153398, 50757, -4689, -118847, -138798, 37157, 62394, -31427, -87035, 207886, -88247, 46139, 77797, -218082, 44157, 220223, 6028, -330504, -67448, -64584, 211603, -209145, 176303, 346325, -80080, -323161, 88580, -134933, -222944, -307847, 57588, 131961, -260466, -173614, 166904, 58547, 74020, -12419, -153681, -245136, 83819, -80562, -428319, -111969, -52442, -225908, 56708, -139132, -19051, -221325, -97547, -85588, 50890, -33919, 205263, 194783, -254019, -200211, 326926, -222814, -24336, 215575, 37811, -167232, -46506, 273125, 11474, 161419, 260443, 94658, 63011, -424536, 25029, -101053, -13009, -230614]
15673b30614f1951B27459d9920m0493G5203b42468c2475A59282e7003r920q9486
15662a56409P4180L1097A54075K27957H9233c33098a05923l980F2701c34004J60812
15651a73192q617k8422D8031a08635E5720a34918A40346a44422B66828l3529h1435
15639b01609H8242a48699A49704p2239b92628e4842E1457b59155K9192C42737
15628a37042q8427a09512A04945k7749G056e2214p1195B95318p9686a33296M2873
15617i0423A06460l2731J35412a30861a9200B85392b60296D0378M6493m1737O2629
15606A07763l3941K05553a55350A47400a52867N58k0999j20373a00077j34928
15596b35005m7075H7417b27443j7123L5286G2318d5011k64098C71359A267J24868
$$ y = [-230614, -61951, 227459, -49920, -90413, 75203, -242468, -32475, 159282, -57003, -66923, -156409, -82229, -51132, 154075, 382032, 89233, -333098, -105923, -109903, 62701, -334004, -173192, -181809, -210231, 48031, -108635, 55720, -134918, 140346, -144422, 266828, 233299, -81435, -201609, 88242, -148699, 149704, 77465, -292628, -54842, 51457, -259155, -229963, 342737, -137042, -225469, -109512, 104945, 77196, 7056, -52214, -123409, 295318, 215632, -133296, -90423, 106460, 73729, 209141, -130861, -19200, 285392, -260296, 40378, 86871, 45134, 107763, 73822, 279375, -155350, 147400, -152867, -152309, -173308, -293681, -100077, -235005, -282080, 87417, -227443, -244566, -209280, 72318, -45011, -309109, 371359, 1267, 126135]
15585A26135N0281o6229a14273K0464j24697A47754c49607B62627b19991a3431
15574A5394K19785j07893a49717j88125a12431I820a523j37075m3110d8105A43375
15562A13344a4154j69047H0598a57740E8236J3795J36485a95793G087g9440j47370
15551b26810p616H8909l1811a12004G1585J8517b53899B541L08363b67346f8656
15539A77242Q8056k8349a52712D11483b2440k95373e8828D5047d3890n7430A50330
15527C6658b40044G3819J11645d092m8625j03037k0972A76157L5247a91230A07584
15515C34626o3056g060o4838j79622A56491a14800E7216b0327l1019l08226i2124
15503c591o1103j42341K164b7241o6356M3886A13194a32071A92867A2931c49208
$$ y = [126135, 176416, 110187, -114273, -93809, -218506, 147754, -349607, 262627, -219991, -13431, 15394, 235179, 127286, -149717, -337842, -112431, 9820, -1523, -138598, -181708, -48105, 143375, 113344, -14154, -183201, 80598, -157740, 58236, 72031, 208516, -195793, 7087, -79440, -226810, -234426, 88909, 57098, -112004, 71585, 90102, -253899, 2541, 310904, -267346, -68656, 177242, 265298, 236949, -152712, 411483, -22440, -317813, -58828, 45047, -43890, -101320, 150330, 36658, -240044, 73819, 185464, -4092, -52717, -155754, -176726, 176157, 211404, -191230, 107584, 334626, 271570, -7060, -71898, -251520, 156491, -114800, 57216, -20327, -51346, -359572, -92124, -3591, -64694, -207035, -204871, -27241, -93597, -49711, 113194, -132071, 192867, 12931, -349208]
15491F4000N7970J57345d0808q4366p6740A25196h9599B27633F9359a99254O9608
15480a29646k94603C02227a08958A56865h0894A95314a98803L0104e3209o9816
15470a23025l21402B64283c36342b2721B20254b45509f6169j8568A45113a1933
15459c7089I470e907A25363a71989N7514A94623C9988b03473G0367a78473C612
15447A27116K82614j51692e3968o4878j62842C47373j47027b37149A89754a16419
15436a7149A31508b30669A42692C0957b32666r7838J7632a22171E3923K4597e7064
15424G9019i2775B98749a45964j38414A00281d3967K235j43292E8166O0781J0025
15413A28972J43139C3701b94681a40596B911J25752C4641e02561A06245k5044
$$ y = [64000, 121970, 279315, -40808, -125174, -201914, 125196, -89599, 227633, 69359, -199254, -129646, -424249, 302227, -108958, 156865, -80894, 195314, -198803, -168699, -53209, -123025, -444427, 264283, -336342, -22721, 220254, -245509, -66169, -84737, 145113, -11933, -37089, 9470, -5907, 125363, -171989, -114475, 194623, 39988, -203473, 70367, -178473, 3612, 127116, 409730, 258038, -53968, -118846, -281688, 347373, 200346, -237149, 189754, -116419, -17149, 131508, -230669, 142692, 30957, -232666, -330504, -312872, -122171, 53923, 78520, -57064, 79019, -92775, 298749, -145964, -284378, 100281, -43967, -41732, -185024, 58166, 118947, 128972, 272111, 33701, -294681, -140596, 2911, 128663, 34641, -502561, 106245, 81201]
15403H1201b50694b438q5933j12158F943R026J29146A8732L52J46534E3791K09236
15391B63027c62127g7228q534A7991O0371c91812C5209J8894a60065a7403q106
15380b5509H1332b06195C36066D1121a96447B21095b46720i5349l450A06704f7659
15368d4192E1904a9926j70462P4082d1196j87449O8799C86929e6549A5289J23137
15357A38426b37037o9234A46149k3654c6968A50506J93897b28062d9502K2298
15347b7204j16796f0114A15032n617B5610J98714a68576f1649K9078j30403g2602
15335d9720G478J05013a72758O3784A66934j3089c63218p2339H1095h2647o568
15324h9215n0648D57413j62805c09260A20123J82412a57359N5685p3002A41500
$$ y = [81201, -250694, -2438, -88371, -200529, 6943, 15969, 145115, 18732, 19084, 165618, 53791, 263027, -362127, -77228, -85762, 17991, 78362, -391812, 35209, 54103, -160065, -17403, -25509, 81332, -206195, 336066, 41121, -196447, 221095, -246720, -95349, -98799, 106704, -67659, -44192, 51904, -19926, -190388, -116306, -41196, -228645, -159846, 386929, -56549, 15289, 138426, -237037, -306271, 146149, 122495, -36968, 150506, 344403, -228062, -49502, -27204, -144000, -60114, 115032, 109415, 25610, 224324, -168576, -61649, -32571, -162974, -72602, -49720, 7478, 112491, -172758, -108974, 166934, 153845, -363218, -435557, 81095, -82647, -89215, -139863, 457413, 294608, -309260, 120123, 302535, -157359, -101674, -174676, 141500]
15313b61701a28347k57370f5142m3771F8690a41380O8083k9162B41095E501b55997
15301a70861B45506g1370A09933L16580a0904B4864a15349n1610P046B683K03789
15290B06472I4915j836N1369J60502Q1135C0356a89032A29251J98362K2764r7855
15279B52522a11182E8754b5722C7799K29802J0043n2880J63982A20096g8659j77919
15268b56578c1813A54800m9786K67016a070l03201A06781J70831a01801C43190
15257h5046b4110j82338G7289L5729K36180R5929k14675L28666R2725N60790k66796
15246I45837N91596o22646k49069C09911A34346a48360B29581J5040I7896d9470
15235B45542F6167M27786c9587I8219a91723D44037B02744m7591a2157k11656
$$ y = [-261701, -128347, -385717, -65142, -108913, 68690, -141380, -73297, -102459, 241095, 5501, -255997, -170861, 245506, -71370, 109933, 426513, -10904, 24864, -115349, -166959, -159913, 2683, 206472, 94915, 93079, 144448, 304950, 386085, 30356, -189032, 129251, 327613, 350377, 252522, -111182, 58754, -25722, 37799, 267601, 277644, 224764, 388746, 120096, -78659, -256578, -31813, 154800, 105014, 372030, -1070, -304271, 106781, 277612, -101801, 343190, -85046, -24110, -206448, 77289, 113018, 349198, 445127, 230452, 559118, 651843, 1212633, 945837, 1537433, 914787, 665718, 309911, 134346, -148360, 229581, 244621, 97896, -49470, 245542, 66167, 493953, -39587, 98219, -191723, 444037, 202744, 155153, -12157, -223813]
15225b23813A4698R5167d0092o4882H2806B1234n955h410A90184r0317O5402K1601
15213A86870A1338P7795A8778j344K29888C0144b6995j80918g6417A40030F6210
15201A12821D482J25556n622M194o1584c01539B00540a20336J9506j42341d02
15189c35487i0763B065K46396q674g1599k10233O4482B83329b03260I511J38269
15178A47780c1807B17798c28201J13363A35280a10104C4874d9861k25261D6941
15167c21566E5535b86716c0554j64356A02943j3210K0752C6921a1792j16043m2366
15156a70201A64044a45112L8501A6436c6962j2583B28922F9535P589J08352K04549
15145C90025h4341A36627e6207k2225B5696a9957A53218d9205A95379E5065L2166
$$ y = [-223813, 14698, 109865, -40092, -104974, 82806, 21234, 15279, -8410, 190184, 99867, 165269, 186870, 11338, 89133, 18778, 17434, 247322, 30144, -26995, -207913, -76417, 140030, 66210, 112821, 4482, 130038, 124416, 128610, 67026, -301539, 200540, -120336, -100830, -243171, -402, -335487, -90763, 2065, 248461, 239787, -71599, -281832, -217350, 283329, -203260, 9511, 147780, -31807, 217798, -328201, -214838, 135280, -110104, 34874, -49861, -275122, 46941, -321566, 55535, -286716, -30554, -194910, 102943, 89733, 110485, 36921, -11792, -127835, -170201, 164044, -145112, -106611, 16436, -36962, -49545, 228922, 69535, 77124, 185476, 390025, -84341, 136627, -56207, -78432, 25696, -19957, 153218, -49205, 195379, 55065, 87231]
15134H7231P7423m2303B5653e9887j16183G4741J03108P0245H4204D387R2469
15123I6856J400C7425Q8683Q4130a92672C40871J61414o8164j71672J2523K7265
15112C02237a47552A17192f0570A12325m9121c43922C64915I3667c1956G4583
15101a6213A78137p9587c6669B09973a01975A99714F4160J44239a38328I92L15699
15090C16691A36262L2942O9791l4500o1784d1033A75846E4319M1523J12967J09920
15079C18729a67532A05155c5531p3951B60255D3099K70316A18931j2722k1275
15069H4934h1813K5271A06829a28071d3346A07325M1976a05463A71443c7027D80340
15057C68873H3319a52165d8090D16142A75773a830B80114a45093B95498f7929
$$ y = [87231, 164654, 122351, 25653, -59887, -176070, 74741, 177849, 248094, 84204, 4387, 96856, 98256, 37425, 126108, 210238, -192672, 340871, 502285, 434121, 262449, 274972, 302237, -147552, 117192, -60570, 112325, 63204, -343922, 364915, 93667, -31956, 74583, -16213, 178137, 98550, -36669, 209973, -101975, 199714, 64160, 208399, -138328, 992, 316691, 136262, 169204, 238995, 204495, 142711, -41033, 175846, 54319, 95842, 208809, 318729, -167532, 105155, -35531, -109482, 260255, 43099, 313415, 118931, 106209, 84934, -81813, -56542, 106829, -128071, -43346, 107325, 149301, -105463, 171443, -37027, 480340, 368873, 83319, -152165, -48090, 416142, 175773, -1830, 280114, -145093, 295498, -67929]
15046A76321l0232n6849L20841j07580J41588K6648d1305B78680j13612J06659
15036B71727N4676C2914O5342L7586E5151d7047A68748a66896B30239j4569G0179
15024a02883h963A61087K2085K03548C8498J09396d862C27494c7599A65923b4555
15012D91949a50605C25355i3404C64675n3947A44989J24741M9481N4921r7024
15002B77108L1049N3804k9722d6369D49863O1848A35656m5000L8198C2317R8015
14991A30332J19713B0383K18607L82983F5520B3301L08865A8369a4737B55974
14980A82645l9048k3494J36002c72313A70378M7886J26227j55257e0983C5263
14969C61363d4593B85750K35605H4270J08424j2112d7298E04520A16358K95817
$$ y = [176321, 146089, 89240, 410081, 302501, 444089, 470737, -41305, 278680, 165068, 271727, 326403, 32914, 98256, 135842, 55151, -47047, 168748, -166896, 230239, 215670, 70179, -102883, -8963, 161087, 183172, 386720, 38498, 147894, -4862, 327494, -37599, 165923, -24555, 491949, -150605, 325355, -93404, 364675, 310728, 144989, 269730, 319211, 374132, 277108, 308157, 361961, 332239, -46369, 449863, 511711, 135656, 90656, 128854, 32317, 130332, 250045, 20383, 238990, 621973, 65520, 23301, 332166, 18369, -14737, 255974, 182645, 143597, 120103, 256105, -372313, 170378, 218264, 344491, 189234, -50983, 35263, 361363, -44593, 285750, 521355, 84270, 192694, 180582, -47298, 504520, 116358, 412175]
14959D12175j89905E5072L54428j57192r9964o4033J94048A17483K74819A79051
14948B77225M0156I6383R0448L5434D9016L82367b7459C17594j11453J22756j09348
14937B19549D0511L59110q4194K10512j59288j2782m0636P6471A58630n3775K96879
14926D01734B4355M81085A83664f6418B19966M42500A70018k6097J39994D8188
14915C65305r6134Q8285J36557B29404J02541b1399B63366j14656K17882j54129
14905B12463D1264L46535p0119k9749O3853k361J3521O2106A72739A9461J97020
14894B16481J04555K44236B31250K29053C2266J48342J16376l7623L28280k00608
14884C87033j34956f5854C32043j06554J74461m2759H5502N8101F7849L71689
$$ y = [412175, 222270, 55072, 409500, 252308, 152344, 88311, 282359, 117483, 392302, 179051, 277225, 317381, 96383, 186831, 222265, 49016, 431383, -27459, 317594, 206141, 328897, 219549, 40511, 399621, 315427, 525939, 366651, 353869, 313233, 389704, 158630, 104855, 401734, 24355, 505440, 183664, -66418, 219966, 662466, 170018, 143921, 283915, 48188, 365305, 269171, 357456, 494013, 229404, 331945, -21399, 263366, 148710, 366592, 212463, 41264, 387799, 317680, 287931, 351784, 349423, 362944, 425050, 172739, 19461, 216481, 321036, 565272, 231250, 460303, 32266, 180608, 296984, 259361, 587641, 387033, 252077, -65854, 332043, 225489, 399950, 357191, 85502, 143603, 67849, 439538]
14874D39538r7197m7280p4859J17720j11336m1622k0775L58530k48941j33810
14864A39968O7444a05046B78090j27653M5194P0261J68711l6819M3437j98374
14854B42847K90326j91307j26104L03511B48442J69160o8391Q8481p2967N1942
14844D16667j35445J80876k13069q6317B9728L10506j69519L04143q4028A80325
14833A6927L07942J76840A92515K53353J36832J25298C30080K0292M14999C38641
14822C41082m0262J20831A97412N89374k55179j94218K77368j44668m5343A59605
14811B12747J6714J42465J59204j37838A51201L45145K97713B65616A12047O15949
14801G27996n1177n5190j27059l0314r1524m8228A01534M09295O560B44494J47035
$$ y = [439538, 342341, 295061, 220202, 337922, 226586, 184964, 164189, 522719, 273778, 139968, 207412, -105046, 278090, 150437, 195631, 265892, 434603, 397784, 441221, 242847, 533173, 341866, 215762, 519273, 248442, 417602, 349211, 437692, 364725, 416667, 281222, 462098, 249029, 162712, 29728, 340234, 170715, 474858, 390830, 180325, 16927, 324869, 501709, 192515, 445868, 582700, 707998, 330080, 350372, 765371, 338641, 341082, 300820, 421651, 197412, 786786, 531607, 337389, 614757, 470089, 424746, 159605, 212747, 229461, 371926, 531130, 393292, 151201, 496346, 794059, 265616, 112047, 727996, 676819, 621629, 494570, 464256, 372732, 324504, 101534, 510829, 517389, 244494, 391529]
14790C91529p2309k3776L00195J24429B21838M58438j66372m3579J86994j96179
14780D61140P9361R8102r8321A85876L24494n9767L24825l00548B20831M10490
14770F31321o7138M88738E19425M2490j15625K04342J06489j28692k2013m8947
14760E57469j36743K69484q2188J00726q9277K830B94251K22969M3349L18156
14750H78725l08939J45716j69395J03364K07702j62127r7751m59O2591J61252
14740H20679k78326J3795j24469L05076n5614J37486k68430L6855l1101k57923
14730B98028L22648P108o3086L6771J54164j42960k7559L06118k02327m4299K57402
14719I02008l47862J8722L15551m35345K83143j47467L55727j67435P5463C64459
$$ y = [391529, 319220, 295444, 595639, 720068, 221838, 680276, 513904, 470325, 657319, 461140, 540501, 638603, 540282, 185876, 510370, 450603, 775428, 474880, 220831, 631321, 564183, 1052921, 519425, 561915, 446290, 650632, 757121, 628429, 606416, 557469, 420726, 690210, 608022, 708748, 619471, 622301, 294251, 517220, 560569, 878725, 569786, 715502, 546107, 649471, 857173, 695046, 597295, 596836, 659427, 820679, 542353, 556148, 431679, 736755, 681141, 818627, 550197, 587052, 555951, 298028, 620676, 627784, 564698, 601469, 755633, 612673, 585114, 891232, 688905, 644606, 902008, 554146, 572868, 888419, 453074, 736217, 588750, 944477, 777042, 852505, 364459]
14708H28323r1052J4446J44839l01434L31482K52044n66136o8694N66356D85597
14697E46405J18999J26681K434R3350M4158N7884k53975j1482L58007k29660j5001
14686H37800k05645m020Q54821m18975j73020j07323M03592k30425l934p7639
14676H75232p9273L76962k67546J59855k81977J86616j61033L97294n60992K67091
14666I12229j63799M75956Q613k03247J62658j25729p415J58219l87871M84886
14656A314500n87845L02506j31163j29249Q3859J97930l2447J62640J9471j32015
14646A068187L52303l66138J70024n06059J59498J97537O8681K34822q3112l42172
14636I53571K68485J02544m83588N69491k42262K75891j09027J43437m89214J58146
$$ y = [828323, 737271, 751717, 896556, 595122, 926604, 1178648, 612512, 543818, 1110174, 485597, 546405, 665404, 792085, 794519, 887869, 932027, 989911, 735936, 724454, 1082461, 852801, 837800, 632155, 628135, 1482956, 1063981, 890961, 783638, 1187230, 956805, 952871, 875232, 795959, 1172921, 905375, 1065230, 783253, 969869, 808836, 1206130, 645138, 912229, 748430, 1224386, 1232999, 1029752, 1192410, 1066681, 1059266, 1217485, 829614, 1314500, 726655, 1029161, 897998, 768749, 852608, 1050538, 1018091, 1180731, 1200202, 1068187, 1420490, 1054352, 1224376, 718317, 877815, 1075352, 1144033, 1378855, 1295743, 953571, 1222056, 1324600, 841012, 1410503, 1168241, 1444132, 1335105, 1478542, 989328, 1147474]
14626A147474j83713M15292p3107J60632m53j92687K28030j06034j90229K36830
14616A442035k16678K66307j76439J43645n1987J19348l03321P09749q53025J97882
14606A277516P9048k807M2099M10507j54044j70696J04046n53713N78780j39574
14596A471162j85254L60340K9148j56881J11897k59511L03539r0076K27354l26434
14586A485284K66679j2308L91085l40979k31971J15551K29854J0611j37017j98875
14576A577914J69249L73278k68215j01094M41555l39492J74132N2040K0070k55681
14566A843756K43074O1985L6660O8839J11627O6797l28128K12693j72714M36216
14556B580805K26665k00566M68589O93921K67190K78874N13819K383836M522606
$$ y = [1147474, 963761, 1379053, 1305946, 1466578, 1466125, 1273438, 1501468, 1395434, 1205205, 1442035, 1225357, 1491664, 1315225, 1458870, 1406883, 1526231, 1222910, 1932659, 1079634, 1277516, 1356564, 1353757, 1395856, 1806363, 1652319, 1481623, 1585669, 1031956, 1610736, 1471162, 1285908, 1646248, 1675396, 1518515, 1630412, 1370901, 1674440, 1584364, 1811718, 1485284, 1751963, 1739655, 2130740, 1789761, 1557790, 1673341, 1903195, 1913806, 1776789, 1577914, 1747163, 2120441, 1852226, 1751132, 2192687, 1853195, 2027327, 2079367, 2099437, 1843756, 2086830, 2148815, 2185475, 2254314, 2365941, 2432738, 2104610, 2317303, 2144589, 2580805, 2807470, 2606904, 3075493, 3769414, 4036604, 4315478, 4829297, 7213133, 11735739]
14547A1735739P856241J0585415P266162j0631831A3153339F265016k340208j034859
14539B889949n35921j63964n2695l11506M57696m72321J98925K8818k90325R7650
14529A846306J43012j8486N7627N4350J47733R3355l61019O8859m0227J37327
14519B128837n4169P0928K43332j55760J78824L2485q0977L95369l51314k50267
14509B157288M89324o5847O7746k60182O5885K13965k32566K18313q4110K341
14499B572157N16559l56023K08707n6544J00775J08731N3404p3379j87522k21921
14489B664944M35913q5886M50760N8583k03656q8631P8265j3809K54695J00359
14479C651537q7871p0909O3755J31837j48032L9980L97023j85644L39157k51857
$$ y = [11735739, 19591980, 30177395, 37443557, 26811726, 13153339, 6265016, 3924808, 2889949, 2354028, 2190064, 2137369, 1825863, 2283559, 1811238, 2010163, 2038981, 1748656, 1846306, 1989318, 1970832, 2028459, 2082809, 2230542, 2323897, 1962878, 2031737, 1991510, 2128837, 2074668, 2145596, 2388928, 2233168, 2411992, 2444477, 2363500, 2758869, 2407555, 2157288, 2646612, 2580765, 2648511, 2388329, 2454214, 2668179, 2435613, 2653926, 2569816, 2572157, 3088716, 2732693, 2941400, 2884856, 2985631, 3094362, 3147766, 3074387, 2886865, 2664944, 3100857, 3014971, 3465731, 3524314, 3320658, 3232027, 3310292, 3296483, 3551178, 3651537, 3563666, 3492757, 3556512, 3688349, 3540317, 3580297, 3977320, 3791676, 4130833, 3878976]
14469C878976N0196K5757J06397Q4349N2256Q4709P9803r7890J52679j04045L42209
14458D655396n1346K23064k08331J68374k81277K97663j54520m2074M44717n4354
14448D997312J37542O9833K62499k38924j46689K5771L80503j71326q6719N66911
14438E796713j59059j57066O3777O84747j91015j45063J17808R4857L2045M16866
14428F554610k72095K07069k6648o0466M65928k50228L47088L2903j98795M13495
14418G212861J95858j20076L03921m1537M52842k67472K88020K2198K28142L9935
14408H314692M63099J11941j31872P6703M60583j19046J87508O1957J46404q6164
14398I485805L37847M08970j67593N02356J52593J18129Q8921M89691j97040M45138
$$ y = [3878976, 3929172, 3954929, 4061326, 4145675, 4197931, 4282640, 4362443, 4264553, 4417232, 4313187, 4655396, 4604050, 4827114, 4618783, 4787157, 4505880, 4803543, 4649023, 4606949, 5051666, 4997312, 5134854, 5204687, 5467186, 5228262, 5081573, 5107344, 5487847, 5316521, 5229802, 5796713, 5637654, 5480588, 5544365, 6229112, 6038097, 5893034, 6010842, 6105699, 6137744, 6554610, 6282515, 6489584, 6462936, 6402470, 6868398, 6618170, 6965258, 6998161, 6799366, 7212861, 7408719, 7288643, 7592564, 7551027, 8003869, 7736397, 8024417, 8046615, 8274757, 8314692, 8777791, 8889732, 8757860, 8834563, 9295146, 9176100, 9363608, 9425565, 9571969, 9485805, 9823652, 10232622, 10065029, 10567385, 10719978, 10838107, 10927028, 11416719, 11219679, 11664817]
14388A1664817K67011Q6230L77795k48037M66355M1249M96020L0317M23183m1418
14378A3563522J83331M96716J96860M00078L47509J27373N94008K90312L05548
14369A6505257O0475L12898K02419N69446L72379K91308M39015P34865N28266
14360B0016328j46627O37088L71790M68862K91968M95870Q52769M89948M21908
14351B3899904O23057N80923N86968O88714P19040P92427M4254R53354J283613
14342C0172254L98098Q71392R43424R81531O44500J022912J239801J007450J017127
14333C8298489J135064J269753J047438J425182J325357J478684R95183J794054
14325D8769204J927003J596526J999081J779390J658022K426906J922849J926688
$$ y = [11664817, 11931828, 12018058, 12395853, 12147816, 12614171, 12655420, 13151440, 13181757, 13604940, 13563522, 13746853, 14243569, 14440429, 14840507, 15188016, 15315389, 15909397, 16199709, 16505257, 16565732, 16878630, 17081049, 17650495, 18022874, 18314182, 18753197, 19488062, 20016328, 19869701, 20506789, 20878579, 21347441, 21639409, 22135279, 22988048, 23477996, 23899904, 24522961, 25103884, 25690852, 26379566, 27098606, 27891033, 27935287, 28888641, 30172254, 30570352, 31441744, 32385168, 33366699, 34011199, 35034111, 36273912, 37281362, 38298489, 39433553, 40703306, 41750744, 43175926, 44501283, 45979967, 46975150, 48769204, 50696207, 52292733, 54291814, 56071204, 57729226, 60156132, 62078981, 64005669]
14317F4005669L121485K173946K759155K896195K668289L151065L700872L434055
14309H7910731L849660L717692M257736M390622M971279M763367M930097O200572
14301A24991756N313242O434847O660155P221920P750038Q384747Q349883R204300
14293A84310888R630830J0609282J0811200J1783122J1984118J3003380J3557427
14286B65690247J4452432J4622522J5719854J5792777J6090420J6599571J6242824
14279C75210647J6256507J5242907J4896452J3911668J1844828R814942N506578
14272D62684529l13566k439654j597097P53991k591376l469198m522821q483392
14264D40021416j0596248j1575236j2488668j4378396j4709083j6121257j6540344
$$ y = [64005669, 67127154, 69301100, 72060255, 74956450, 77624739, 80775804, 84476676, 87910731, 91760391, 95478083, 99735819, 104126441, 109097720, 113861087, 118791184, 124991756, 130304998, 136739845, 143400000, 150621920, 158371958, 166756705, 175106588, 184310888, 193941718, 204551000, 215362200, 227145322, 239129440, 252132820, 265690247, 280142679, 294765201, 310485055, 326277832, 342368252, 358967823, 375210647, 391467154, 406710061, 421606513, 435518181, 447363009, 457177951, 462684529, 462370963, 459931309, 458334212, 459088203, 456496827, 453027629, 448504808, 440021416, 429425168, 417849932, 405361264, 390982868, 376273785, 360152528, 343612184]
14257C43612184j6412557j5947419j5092417j4953145j4323905j3616878j3517645
14250B39748218j2470974j1739321j1037278j0633322r606283r338310q319422
14243A66603308q030414q050238p216429o859602o166268n964449n365299n364188
14235A13586421n207791m814417m125066m422893l707953l487246l871908l395490
14227H0553657l070964k964520k679417k705865k418119k613203j984538k585933
14219E9531098j633597j791674k334483j798897j140539j419012j835235j079125
14211D6498536j576055j641538j490317j218448p01201q82034j084235j301871
14203C6602837j031499r76849j154723k63175q62880q95635j551307l54257q05137
$$ y = [343612184, 327199627, 311252208, 296159791, 281206646, 266882741, 253265863, 239748218, 227277244, 215537923, 204500645, 193867323, 184261040, 174922730, 166603308, 158572894, 150522656, 143306227, 136446625, 130280357, 124315908, 118950609, 113586421, 108378630, 103564213, 99439147, 95016254, 91308301, 87821055, 83949147, 80553657, 77482693, 74518173, 71838756, 69132891, 66714772, 64101569, 62117031, 59531098, 57897501, 56105827, 53771344, 51972447, 50831908, 49412896, 47577661, 46498536, 44922481, 43280943, 41790626, 40572178, 39870977, 38988943, 37904708, 36602837, 35571338, 34594489, 33439766, 33176591, 32313711, 31418076, 29866769, 29512512, 28707375]
14194B8707375l51862o89108r23742n65581p28400p79090q64326m12876m01471
14185B2990919q34932j6172r43610l23334j86889o62066k41470p90537q5402j67385
14175A8739122p37593n4930p44053j31407o43740k15907k31175p34202K76374
14166A5522489j60653m13589n04620m20455J42237p31323J4288m8870l52385n29368
14156A2517751R7675M9647p07470P773j97166j90087j05655k29234l0584q6234
14146A1126416l36075N2090m59087N7764m93297k32500j10752k16942J97928l34705
14136I250840j69474R3001k69401j55580R8734J94790o09321n9827O8712m53221
14126G989253J04562K71485n48773m45778K54693l7135l43523L98185p49143L19303
$$ y = [28707375, 28355513, 27666405, 26742663, 26177082, 25448682, 24669592, 23805266, 23392390, 22990919, 22155987, 22139815, 21196205, 20872871, 20685982, 20023916, 19782446, 18991909, 18906507, 18739122, 18001529, 17946599, 17202546, 17071139, 16427399, 16211492, 15980317, 15246115, 15522489, 15361836, 14948247, 14443627, 14023172, 14165409, 13434086, 13448374, 13399504, 13047119, 12517751, 12615426, 12665073, 11957603, 11965376, 11768210, 11578123, 11472468, 11243234, 11212650, 11126416, 10790341, 10842431, 10383344, 10441108, 9947811, 9715311, 9604559, 9387617, 9585545, 9250840, 9081366, 9174367, 8904966, 8749386, 8848120, 9042910, 8433589, 8373762, 8442474, 7989253, 8093815, 8365300, 7816527, 7370749, 7625442, 7588307, 7244784, 7642969, 6893826, 7213129]
14116G213129k45712j02416j51564j11743L2843j52979J26737m49741l1875J77820
14106F304499k11862j22173o2797P5504J33029k97970Q6117k58764p2018k97120
14096E276445N84980l63349j53740j80595Q9371l35845q1871M46999l53121q3498
14086D845776j49544N9426N7446n0178j45226n125k7520J69570m25195J05696
14076D435126r25l18368K60820k73134j14239J40251o6234L14536m09663J67254
14066D135424j19728K71039l98637k3471M81777m38097m64061Q1441L75176j04261
14056C796602m01148M07952l98344j6947K94235j40513l54306K4860P6573k58149
14046C030815K74958K54949j82313r3764j80641K60974l30084l78045M28965k32418
$$ y = [7213129, 6967417, 6865001, 6713437, 6601694, 6634537, 6481558, 6608295, 6158554, 6126679, 6304499, 6092637, 5970464, 5907667, 5983171, 6116200, 5818230, 5904347, 5645583, 5573565, 5276445, 5861425, 5498076, 5344336, 5163741, 5253112, 4917267, 4835396, 5282395, 4929274, 4845776, 4696232, 4755658, 4813104, 4762926, 4617700, 4612575, 4585055, 4754625, 4329430, 4435126, 4434201, 4115833, 4376653, 4103519, 3989280, 4129531, 4063297, 4377833, 3968170, 4135424, 4015696, 4286735, 3888098, 3864627, 4346404, 3908307, 3444246, 3525687, 3900863, 3796602, 3395454, 3803406, 3405062, 3388115, 3682350, 3541837, 3187531, 3212391, 3288964, 3030815, 3305773, 3560722, 3378409, 3284645, 3104004, 3364978, 3034894, 2656849, 3085814, 2853396]
14036B853396L4496K0688j8655j35540l4403j9386M23237p1293j1609k02978k33041
14025B604912o1920L58086j75796r8757J71064m92581K87273m377J05642j12520
14015B581026j02084j23047J28899K48432o10509k60251O15297m14038M63540
14006B527265l92206k38226K16345o0606J55436j64313j87434K97187m47819O3272
13996A768901J00183L84418K7486p6925J89922j5612K37570J029118L713671O908218
13986A4266950J0471005J0283714o370880j1839288o959723l145922j111876r15387
13978D678593r52571m62706N9227j46331k84337L9383m81977M63356l33881k98521
13968B280235N069l19661L13735n1172J43461m66197P4554K4789O867J42024J3614
$$ y = [2853396, 2887892, 2908580, 2889925, 2754385, 2719982, 2700596, 3123833, 3052540, 3040931, 2837953, 2604912, 2542992, 2901078, 2725282, 2626525, 2797589, 2305008, 2592281, 2587904, 2693546, 2581026, 2478942, 2355895, 2484794, 2733226, 2122717, 1862466, 2477763, 2063725, 2527265, 2135059, 1896833, 2113178, 2052572, 2208008, 2043695, 1856261, 2153448, 1705629, 1768901, 1869084, 2253502, 2280988, 2204063, 2393985, 2378373, 2615943, 3645061, 7358732, 14266950, 24737955, 35021669, 28650789, 16811501, 9851778, 6705856, 5593980, 4678593, 3726022, 3263316, 3322543, 3176212, 2891875, 2931258, 2449281, 2912637, 2578756, 2280235, 2285304, 1965643, 2279378, 2228206, 2371667, 1905470, 1980024, 2004813, 2011680, 2153704, 2167318]
13957B167318K2092l04658P9233k7222k23476K08409p4227q4516O0092J37104
13947A960149l31265Q5919k61082J05475N43026o09691J63406p3117J44778J43782
13937A871380k14447n55139N14566O9222j94027k0614M987J77994j93045J17181
13927A578058J2618Q6878q9453R0857o51879M22333j16104K41626l71121J96336
13917A400149j31628J89390R9263m3894j12295j87955K32538j68223j74282L24346
13907A427409j84896R9163P5511k61911J43344K493J2440J82392m7950k66541
13897A181454p6624J17189q9949L08715l51243N97439o31579M72818k67331M3538
13887A304427k54681j08618J72517J05263R9637k7400p0057k09658K23212l29770
$$ y = [2167318, 2189410, 1884752, 1963985, 1936763, 1713287, 1921696, 1847469, 1762953, 1823045, 1960149, 1628884, 1714803, 1453721, 1559196, 2102222, 1492531, 1655937, 1582820, 1727598, 1871380, 1656933, 1101794, 1616360, 1685582, 1491555, 1470941, 1475928, 1653922, 1460877, 1578058, 1590676, 1677554, 1588101, 1678958, 1027079, 1449412, 1333308, 1574934, 1203813, 1400149, 1268521, 1457911, 1557174, 1513280, 1400985, 1213030, 1445568, 1277345, 1103063, 1427409, 1242513, 1341676, 1417187, 1155276, 1298620, 1301113, 1313553, 1495945, 1447995, 1181454, 1104830, 1222019, 1132070, 1440785, 1089542, 1686981, 1055402, 1528220, 1260889, 1304427, 1049746, 941128, 1113645, 1218908, 1318545, 1291145, 1221088, 1011430, 1234642, 904872]
13877I04872K64753k66125L07910j26598l83969M97871n0228j29417p7557m852
13867I36660N3295l7284L51220L2421m11254M64669n80019L82651j34324l1229
13857A026806M32205m73296J53777r7043M5630l22853K14533j6263j344K59168
13847A221320q8048l48967J57466L48076m64620o9898K24150j9598j05263L63448
13837A218066m40812J47739l6437M3730p4064K22301j36606J30967k16402J17489
13827I75971M0948o8776k62170J75036n0640K17295j51993J54178m1636J84263
13817A172476k27768J20163k21150J01037l7978N053Q823m20032N3183O71751
13807A225558n59352J18678j56239K52608m0047k53146P8055N905k19289K67174
$$ y = [904872, 1169625, 903500, 1211410, 1084812, 700843, 1198714, 1148486, 1019069, 941512, 936660, 989955, 952671, 1303891, 1336312, 925058, 1389727, 809708, 1192359, 1058035, 1026806, 1459011, 985715, 1139492, 1042449, 1088079, 765226, 979759, 963496, 962152, 1221320, 1133272, 784305, 941771, 1289847, 825227, 755329, 979479, 959881, 854618, 1218066, 777254, 924993, 888556, 932286, 858222, 1080523, 943917, 1074884, 858482, 975971, 1016919, 948143, 685973, 861009, 810369, 1027664, 875671, 1029849, 988213, 1172476, 944708, 1064871, 843721, 944758, 906780, 911833, 920656, 500624, 553807, 1225558, 666206, 784884, 628645, 881253, 841206, 588060, 666115, 672020, 452731, 719905]
13797G19905k09492M85079k57170J36271m01519K21174K19368l76268J90938L1967
13787G60253k99159m5319K16132j15621N24400l19470J79833l92350N48980l85903
13777F71776j89796l3041J71107N54143j51449m59923j19480J68941M4322K6842
13767F83442j97581L39856l04538L29120k72496B83418N92870j12765n0097L2612
13757G46038M4309k3421o7352l07338J76930L7763K35991j95051N623k08718o8349
13746C76425K51854j16626J03818J3375j22981n9153L00356k45807J53959j2136
13736F43084j45513L61910k78551n9248O9064O032L8519M841j12589j37028n1588
13725C38933M10719k03427r9348P5605K5687M7511J18653k31322M4522J40783
$$ y = [719905, 510413, 995492, 738322, 874593, 473074, 694248, 913616, 537348, 728286, 760253, 461094, 415775, 631907, 516286, 1040686, 721216, 901049, 508699, 1057679, 671776, 481980, 448939, 620046, 1174189, 1022740, 562817, 443337, 612278, 656600, 683442, 485861, 825717, 521179, 850299, 577803, 283418, 876288, 763523, 713426, 746038, 790347, 766926, 699574, 392236, 569166, 606929, 842920, 647869, 653492, 444774, 376425, 628279, 511653, 615471, 628846, 505865, 446712, 747068, 501261, 655220, 643084, 497571, 859481, 580930, 521682, 590746, 596778, 635297, 640138, 527549, 390521, 338933, 749652, 546225, 446877, 522482, 548169, 595680, 714333, 483011, 527533, 668316]
13715F68316k19938J48869r1857m9886J31494O2824j04795J8552m5458N4601k26678
13704C46044K81422l03806J15352K47896B79758J004M43822o3796l24243K81972
13694F18517J4941j28607K57279C49352J03535K91830l52090j88597K26250L00082
13684G30362k01028k9731p9801N7775l953N3236l98E5519M68513j06749L17136
13673G34419k72412I7056L06783J15988m4635K66097l43400j71410K37336J08811
13663E72626k0590k71775j28229N02466l18775K2703J05875J56641j86736o7377
13653C66829l3261J32666p1109J23032j28240A75445M10678r6628A87278J62533
13643C49811j28140J61832E4876N87846k47712j6630J8502L40945B41034L91883
$$ y = [668316, 448378, 597247, 505390, 455504, 586998, 649822, 545027, 563579, 518121, 572722, 346044, 627466, 323660, 439012, 686908, 279758, 280762, 724584, 660788, 336545, 618517, 633458, 504851, 762130, 349352, 452887, 744717, 392627, 204030, 430280, 730362, 529334, 499603, 419802, 477577, 473624, 526860, 526462, 55519, 524032, 417283, 734419, 462007, 97056, 403839, 519827, 475192, 741289, 397889, 226479, 463815, 572626, 552036, 280261, 152032, 654498, 335723, 358426, 464301, 620942, 434206, 366829, 333568, 466234, 395125, 518157, 389917, 175445, 586123, 489495, 187278, 349811, 221671, 383503, 54876, 642722, 395010, 378380, 396882, 737827, 241034, 632917]
13633F32917J5982j07568A86124R0841K30879r5229K79311C13848J98796k50943
13623B61701O9923J3173K84500q7264k27892j1703D0827M84047A68626J92327
13613C60953j50438J63244q468r9033Q9536R169J73573F7394N48338k09216j71247
13602B35269j4955L3355L04511A63702K46830K6063j23221K29034j99318j04979
13592B38111p8435l4175M21851B67936J8757J94629k35581B7562K3546J0570L51241
13581D12919j70685K8781J28193J70118r2986A29322B5707L39468A58998R0236
13571B49234J25809K47045k87596R5607A47644K53905A5921a78446B35191Q4497
13561C19688K3389K03622A25773K19148K11264p2817A44578M8343l3547O152N77642
$$ y = [632917, 648899, 541331, 186124, 276965, 507844, 412615, 691926, 313848, 512644, 261701, 331624, 344797, 629297, 542033, 314141, 302438, 40827, 524874, 168626, 360953, 210515, 373759, 365291, 266258, 355794, 364963, 538536, 67394, 615732, 406516, 235269, 220314, 253669, 558180, 163702, 410532, 436595, 313374, 542408, 343090, 238111, 159676, 125501, 547352, 267936, 286693, 481322, 245741, 27562, 51108, 61678, 412919, 242234, 271015, 399208, 569326, 476340, 129322, 25707, 365175, 158998, 249234, 375043, 622088, 334492, 430099, 147644, 401549, 15921, -178446, 235191, 319688, 343077, 546699, 125773, 344921, 556185, 483368, 144578, 192921, 159374, 165526, 743168]
13550G43168B075N02435a6098A84037J4648N27598B03727E1874J02209A3472Q1168
13539I4640Q4579K61763A63009K5180n6845G331M93241k4077A05751K69317j22082
13528B52986J2226O4350j14553h8790A66965k552K01820q898R448K17654A37831
13516D28769B03607b27479B55872R2208o1287l2103K3987J35374A17473K19534
13506C37007K7629D0286J06491F1075B8810L01530e2416B85141J92236j78105
13496B99272C8020K46805r2474J16647J69282j54337m341b04603D87044r3315
13486C93729k7073k6210J21698D8243K03568j18238K77056A07689N21441j73516
13476D55614j48052q6865K1387L6412J61568a3714A72331J572L05161j83030p1390
$$ y = [743168, 2075, 504510, -16098, 184037, 198685, 726283, 203727, 51874, 154083, 13472, 94640, 179219, 440982, 163009, 188189, 131344, 7331, 500572, 476495, 105751, 375068, 252986, 265212, 329562, 215009, -88790, 166965, 164413, 366233, 357335, 366783, 584437, 137831, 428769, 203607, -227479, 255872, 348080, 286793, 254690, 278677, 414051, 117473, 337007, 364636, 40286, 146777, 61075, 28810, 330340, -52416, 285141, 477377, 299272, 38020, 284825, 192351, 308998, 478280, 323943, 319602, -204603, 487044, 393729, 366656, 340446, 462144, 48243, 251811, 133573, 410629, 107689, 629130, 455614, 307562, 220697, 242084, 278496, 440064, -13714, 172331, 173903, 479064, 296034, 224644]
13465B24644K27643j24325O3684c4093B09622m9303p6140O6002Q5881a15519A45163
13453D6195J68077b72568D26083k04612f8440D32025A00767a9785I6197M2422
13443A38619M976L858K86039j17947K51171A14821K39303J47193B08041a91148
13432B60198r0530N2210H2427M23680B40538Q2281C1547M02715A28017P5420f2240
13420D38201j59319A37569L33714j65120J18180A33748n4590L38555n7952j61061
13410A98700J38142A33143n9002a08163A3486K84680Q1328E8643K80319J94322
13400E33284k04855E2679K8555M03501j94855A01113a39585D49660j39109j2346
13390B98205A48769J65102j17524J71986d4617D25936j24686Q3463e913B06357
$$ y = [224644, 452287, 327962, 391646, -34093, 209622, 160319, 84179, 150181, 236062, -115519, 145163, 46195, 214272, -272568, 426083, 221471, -68440, 432025, 100767, -19785, 96197, 138619, 143595, 147453, 433492, 315545, 566716, 114821, 354124, 501317, 208041, -191148, 260198, 169668, 221878, 82427, 506107, 240538, 322819, 31547, 434262, 128017, 203437, -62240, 438201, 278882, 137569, 471283, 306163, 424343, 133748, 79158, 417713, 359761, 198700, 336842, 133143, 74141, -108163, 13486, 298166, 379494, 58643, 338962, 533284, 328429, 52679, 81234, 484735, 289880, 101113, -139585, 449660, 310551, 298205, 148769, 313871, 196347, 368333, -44617, 425936, 301250, 384713, -5913, 206357]
13379C6708M1797a12504B22686R609n3030m4921g9515C48041H5774J99277J24114
13368D09165A20600J9919M17014A78187J66104j47879I0057k5002m048J74467
13358B35474O0003l7433j23871j0229m43J79508j06799J08368G6620B675O30882
13347F33557k12328A13631J15513K47207a0383B53221l7346I6206b6367A54657
13336d8517A27309k909J61188j04703J1430L14572A98839R7230K6470b42377C16335
13324A88163k0979O8310k7875G1200J08299l0354A596b9168C1902a652E59193
13312D17224j97856K1682m7478E6226J39096K48904A79640P2665B6868K6926j0175
13301D3619e1013A48173M3226P3426j2828A21379L53077H0747K66341g1043C93846
$$ y = [36708, 78505, -112504, 222686, 232295, 179265, 134344, -79515, 348041, 85774, 285051, 409165, 120600, 140519, 557533, 178187, 344291, 196412, 90057, 65055, 61007, 235474, 295477, 258044, 134173, 123944, 123501, 303009, 196210, 304578, 76620, 2675, 633557, 421229, 113631, 229144, 476351, -10383, 253221, 215875, 96206, -26367, 154657, -48517, 127309, 124400, 285588, 180885, 192315, 506887, 198839, 296069, 322539, -242377, 316335, 188163, 167184, 235494, 207619, 71200, 179499, 149145, 1596, -29168, 31902, -1652, 559193, 417224, 219368, 241050, 193572, 56226, 195322, 444226, 179640, 252305, 26868, 53794, 43619, -51013, 148173, 191399, 264825, 251997, 121379, 474456, 80747, 347088, -71043, 393846]
13289a86499D04847A64553J19117l8871I2779O515J58765j05826B7275P1723K58971
13278C57969F9842A3512J63911N9152J11472e2069A60947G8421J52339I9770a85257
13266B04848A2338O598L24630A39971J14447r3195F9134Q3254m5886e8870A08538
13254C72101A54501K71061B10718K38050q9560I2019D4490Q897K8187o925k2447
13243E2202j0472J06213a21780J0097E66934d902E6577b5760C59280a51245C42537
13231a74486A85942k420a01925B49813b96922B16493K22975B13081q4214A4573
13220A71191H2289J27488a71323B85492c4028n1813k11299J48456A9414K19374
13210B38788g987k9122C47038F2592R7209G06d4207l6610B14483B1327M0635i90
$$ y = [-186499, 404847, 164553, 283670, 244799, 92779, 99294, 258059, 152233, 27275, 98998, 357969, 69842, 13512, 177423, 236575, 348047, -52069, 160947, 78421, 230760, 99770, -185257, 204848, 12338, 18936, 343566, 139971, 254418, 161223, 69134, 152388, 106502, -58870, 108538, 372101, 154501, 425562, 210718, 448768, 359208, 92019, 44490, 53387, 81574, 74649, 52202, 41730, 147943, -121780, -111683, 566934, -4902, 56577, -25760, 359280, -151245, 342537, -174486, 185942, 183522, -101925, 249813, -296922, 216493, 439468, 213081, 128867, 14573, 171191, 82289, 209777, -171323, 285492, -34028, -85841, -297140, -148684, 19414, 238788, -7987, -37109, 347038, 62592, 159801, 706, -44207, -80817, 214483, 21327, 61962, -990]
13197b3301m32110A42951o933O1757a48809I5913D7629d0039B28929R9305C5732
13185B63150J55563a75645j22222D35923A43796K4398c436k18053d7494A6982
13174A37261h6514B34866f3792N949j484C06900H1139g8550B51259o3750J48052
13163C35561q2222g0478C32446m2229K10329B42577b9787C29762A4861K28315
13153B43176G4707b14511B06947b45151A0876M04854p9799r2262a2395A03971
13142i7608B40085L03943A3515P3403N0510a60235P4937A89761e3118A08461A0459
13130C52817f5547E1774L68244K7003D2508J34727J03188G7458k6804d357A60053
13118F2437f478C04034M4413i3483L1526b8609A63962e1149A98601l8931C981
$$ y = [-23301, -455411, 142951, 136018, 197775, -148809, 95913, 47629, -40039, 228929, 328234, 35732, 263150, 418713, -175645, -297867, 435923, 143796, 168194, -3436, -221489, -47494, 16982, 137261, -86514, 234866, -63792, -57843, -59327, 306900, 81139, -78550, 251259, 187509, 335561, 253339, -70478, 332446, 290217, 500546, 242577, -29787, 329762, 14861, 243176, 74707, -214511, 206947, -245151, 10876, 415730, 335931, 243669, -12395, 103971, -97608, 240085, 544028, 13515, 86918, 137428, -160235, -85298, 189761, -53118, 108461, 10459, 352817, -65547, 51774, 420018, 447021, 42508, 177235, 280423, 77458, 50654, -4357, 160053, 62437, -6478, 304034, 348447, -93483, -61957, -28609, 163962, -51149, 198601, 159670, 3981]
13106D51601k07144d2152A51486p2746B5117J30369J06008b2711n9705j82623
13096b65039H7792A0435L18545a07649F2957a1641F3205G667J24149K99474A54287
13084A50236k3552a55265A3694a64229A07352K02009j48459F6262b3454B76887
13073d60918i92E7921N97942C2943K48785H7884J6053e1015M013j43177B34775
13061A15808L0476J02111q0442M6647a37393j4041o3620h0744B36290A0477a23791
13049f8135B27071I7974a59509a0997B08137K20136q8240a94603C05940a39497
13038a23032e8495B07528K7969O9385o9527c36960A7533K25171I9406f6945A51039
13026I0041B7187c18593A71532g2429B17675L2431C1282i7805A48062J33337p8150
$$ y = [451601, 244457, -42152, 151486, 78740, 25117, 155486, 261494, -22711, -82416, -265039, 87792, 10435, 328980, -107649, 62957, -11641, 63205, 7667, 131816, 431290, 154287, 150236, 126684, -155265, 13694, -164229, 107352, 309361, 160902, 66262, -23454, 276887, -460918, -992, 57921, 655863, 32943, 281728, 87884, 103937, -51015, -47002, -190179, 234775, 115808, 146284, 248395, 167953, 214600, -137393, -151434, -215054, -80744, 236290, 10477, -123791, -68135, 227071, 97974, -159509, -10997, 208137, 428273, 340033, -194603, 305940, -139497, -123032, -58495, 207528, 235497, 304882, 235355, -336960, 17533, 242704, 99406, -66945, 151039, 90041, 27187, -318593, 171532, -72429, 217675, 250106, 31282, -97805, 148062, 281399, 203249]
13015B03249a10702G9434k7005J00755K6128Q1145N9338M0186p2567M6165C1891
13003A2408K45025q5927g4817I594b50350H6010C7229J5124a78302C78729C0805
12991C8552i021B98378b45370B00677o126k1924K70619A52204J3830P371q882
12980A64523G9299e8768D53234a0960C5622L51403A51305i1072A40724j4925l7195
12969H8604k500c60981d2511A06684a56616q9893I6376b169A14651C221P7675
12958H0896B0507J50709F9103a24462A80173f7191A36267J01411E3280a40212
12947B63927r8681b96130B05169k2759b04172B89468C2188b11183A82820J3273
12937A96093a37913J4404A90968j2502a32984A51938K96674b09036e2899l2682
$$ y = [203249, -110702, 79434, 52429, 153184, 179312, 260457, 319795, 359981, 287414, 333579, 31891, 12408, 257433, 171506, -74817, 9594, -250350, 86010, 37229, 52353, -178302, 378729, 30805, 38552, -9021, 298378, -245370, 200677, 194551, 172627, 443246, 152204, 166034, 173405, 164523, 79299, -58768, 453234, -10960, 35622, 387025, 151305, -91072, 140724, 125799, 88604, 86104, -360981, -42511, 106684, -156616, -246509, 96376, -2169, 114651, 3221, 80896, 20507, 171216, 69103, -124462, 180173, -67191, 136267, 237678, 53280, -140212, 263927, 165246, -296130, 205169, 182410, -204172, 289468, 32188, -211183, 182820, 196093, -137913, -123509, 190968, 178466, -132984, 151938, 448612, -209036, -52899, -85581]
12927h5581C6354b07026E5245H671f1889G00R4271L3334n2320J07325b07060D9661
12914g1160A907R9893k2229C7203a24115E09877a5909k9880n9239m5042A51728
12902d67532C5484a75834B35011H6470D929d23116E5967a36510a0693A15734D2175
12890G3244q455f0504G5180b2653A91990j7735J11772A14115J14032a87206B26980
12878D3208J77670M7832D2717J0376b26091g5665A36217a33330D2399M3071L8810
12867A24280n6290e8823D6954a54600F6806C1348m249b651A14997J93063a74561
12855b9818B56680b66554A69658k2641l2862J55108b09321j08993a9659R672q2996
12844i2983B41725a54199A50929a19828H3528a3779j25786F2894i5117o6580A64406
$$ y = [-85581, 36354, -207026, 55245, 8671, -61889, 700, 94971, 128305, 75985, 183310, -207060, 49661, -71160, 1907, 101800, 79571, 37203, -124115, 509877, -15909, -45789, -105028, -150070, 151728, -467532, 35484, -175834, 235011, 86470, 4929, -423116, 55967, -136510, -10693, 115734, 42175, 73244, 64789, -60504, 75180, -22653, 191990, 174255, 286027, 114115, 228147, -187206, 226980, 43208, 220878, 268710, 42717, 53093, -226091, -75665, 136217, -133330, 42399, 85470, 124280, 67990, -58823, 46954, -154600, 66806, 31348, 27099, -2651, 114997, 308060, -174561, -29818, 256680, -266554, 169658, 147017, 114155, 269263, -209321, -318314, -19659, -9987, -92983, 241725, -154199, 150929, -119828, 83528, -13779, -139565, 62894, -95117, -161697, 164406]
12832a04191d046j84925C73725a62020m6587C21311d7243j6419B76299b5715A42431
12820A43754k6080a41691C5181b91580a34711d1277j86123A10511b4806B15426
12809C35725C6682A5320J88774F6779J46311l5544b18547A96N3403a85478i600
12797A16665h5312a5975j33502a5049j93692R3529H0214a54851O1166D7045a51514
12785A03876N1585b11251r7469A9764J87983A3703f3073A88342b1530k0287B918
12773A78631K7117c739q7924A05673b58555Q770g7951A46489i5717A08890d1905
12761a915A02252g3078J769A24735C2325Q1161b19410A44691a77151j7892a5647
12749C32672b14420E5015M10089A89829D4080c7074A85632c8810d153A89446d3673
$$ y = [-104191, -4046, -188971, 373725, -162020, -208607, 321311, -47243, -63662, 276299, -25715, 142431, 143754, 117674, -141691, 35181, -291580, -134711, -41277, -227400, 110511, -24806, 215426, 335725, 36682, 15320, 204094, 66779, 213090, 177546, -218547, 196, 53599, -185478, -9600, 116665, -85312, -15975, -149477, -15049, -208741, -115212, 80214, -154851, -93685, 47045, -151514, 103876, 155461, -211251, -308720, 19764, 207747, 13703, -63073, 188342, -21530, -41817, 2918, 178631, 205748, -3739, -91663, 105673, -258555, -249785, -77951, 146489, -95717, 108890, -41905, -1915, 102252, -73078, -71309, 124735, 32325, 113486, -219410, 144691, -177151, -195043, -15647, 332672, -214420, 55015, 465104, 189829, 44080, -37074, 185632, -38810, -4153, 189446, -43673]
12737B04562M3861A04126c369j37012A06143l8822f3008B6716K95509H2259c56036
12725A9121b16807A98967C0691J11174a28874B92998K4710m777f9188B73936I434
12713a59622a5018C6692J01537C8437Q039J18030D2947a19959C29865k5830a9825
12701C49472I3755k8542k7397a90069D8220a9464B23683a37474D65200H6727b83305
12689a47328l3382D8460a73349C49891B3077c63103B50174o1554K41812A63749
12678D40524F3185b21236B16204Q9839A08951d1021A35905b43458C5285f9458
12667A4466c6282k96847B79666Q1348I6680N5509F1982J6289M2460a97366Q5121
12656a12245A41830O9079g0166c3385C27350D2939A5879c6789A26536a63726A09102
$$ y = [204562, 248423, 104126, -3369, -140381, 106143, 67321, -63008, 26716, 322225, 82259, -356036, 19121, -216807, 198967, 30691, 141865, -128874, 292998, 317708, 312931, -69188, 273936, 9434, -159622, -15018, 36692, 138229, 38437, 46476, 164506, 42947, -119959, 329865, 304035, -19825, 349472, 93755, 65213, 37816, -190069, 48220, -19464, 223683, -137474, 465200, 86727, -283305, -147328, -180710, 48460, -173349, 349891, 23077, -363103, 250174, 188620, 430432, 163749, 440524, 63185, -221236, 216204, 306043, 108951, -41021, 135905, -243458, 35285, -69458, 14466, -36282, -333129, 279666, 361014, 96680, 152189, 61982, 78271, 120731, -197366, -112245, 141830, 210909, -70166, -33385, 327350, 42939, 15879, -36789, 126536, -163726, 109102]
12644h5757C35312A40760o0848e8464I9226a63148D4851b6462D40776b9518F2118
12632a67453B19840J57950j64893q0080K80073A98495M8535A8352J32170m2380
12622A08142K35596a82806A21219L21225d7989A52115n5699L02341a37029A449
12611F4005b14097C862a01080j91871Q3943e03D45682A91234H4866A8863L1792
12600E0655a5777A97072A0808L59260p9252A00866g2958A37556Q6694l1511P8140
12589B70879b50742A28572P0586n0133a57080H5938J7829J7700d8229A31376m9646
12578H1730a72791A02348c07694j08860B2170k825c69866H0206a75309C00599
12567c33311A51918e5098r8512I0095k8543N7352M1168o1776C8013a4838k6358
$$ y = [-85757, 335312, 140760, 79912, -58464, 99226, -163148, 44851, -26462, 440776, -29518, 62118, -167453, 219840, 377790, 212897, 132817, 412890, 198495, 247030, 18352, 150522, 108142, 343738, -182806, 121219, 442444, -47989, 152115, 96416, 398757, -137029, 1449, 64005, -214097, 3862, -101080, -292951, -209008, -503, 445682, 191234, 84866, 18863, 50655, -15777, 197072, 10808, 370068, 290816, 100866, -72958, 137556, 224250, 192739, 270879, -250742, 128572, 199158, 149025, -157080, 85938, 103767, 121467, -48229, 131376, 81730, -172791, 102348, -307694, -416554, 22170, 19345, -369866, 80206, -175309, 300599, -333311, 151918, -55098, -153610, 90095, 61552, 118904, 160072, 98296, 38013, -14838, -41196]
12556d1196A67287j1507l1295a40408O6822E8996A6440K31185A08108K55240j51637
12545B11711j3300f1650A2143N8299a93323j85361A01900a72105A01567a28604
12534A8578J81738b62006m361B69035F0654J05882R1744a9546A07863h5274H4848
12522f0498l1893H5704j8421J5553K00767A37588r720A9756N836j667f1379K0948
12510d0431B9020J30206l3328g5070E2763h0760c8459A15732j4017h5060n550
12499i0610k1245j1122r8802J1366D4251R316d684A35651a42961L7966G198h6668
12486f7571j79055R6288p7090o828d5929q9797A99786r4593b39786M3000q2701
12475b79487A08740c2840j21006C6603b1868j42910A50226K21431j83675o9571
$$ y = [-41196, 167287, 155780, 124485, -140408, -73586, 58996, 16440, 247625, 108108, 363348, 211711, 198411, -61650, 12143, 70442, -193323, -378684, 101900, -172105, 101567, -128604, 18578, 200316, -262006, -266367, 269035, 60654, 166536, 258280, -19546, 107863, -85274, 84848, -60498, -92391, 85704, 67283, 82836, 283603, 137588, 127868, 19756, 25592, 23925, -61379, -40431, 29020, 159226, 125898, -75070, 52763, -80760, -38459, 115732, 101715, -85060, -90610, -111855, -122977, -221779, -210413, 44251, 53567, -4684, 135651, -142961, -104995, 7198, -86668, -67571, -246626, -150338, -227428, -234256, -45929, -135726, 199786, 105193, -239786, -196786, -279487, 108740, -32840, -153846, 36603, -21868, -164778, 150226, 371657, 187982, 118411]
12465A18411R9962b30670B23077b74419a27841I7248h7547B87893a1042A4429
12454F9324k0937b0361j72921c0242A35342n0643A6088o431b07353L3503f7975
12442a95257F3996J23983O3456f2621C52327d4258E7822c5060j37364q6792B98384
12430A72499f7376j47902B58803F0032B7485d2438A7491K3794q968G064a62951
12418h9849a5973j58995O8619A5171O0922Q3432a55871K1604j03940D6756Q1287
12407A28043f0585B45164N314E8945F361J68056k3811a54686A70258a52022d1200
12395a46584A74661i0326k84985D3080J67564g4260H1394M52a14133n035D6003
12383a26726A97137B7838M5285J954R16O1263b24162c847B57146a36225k7077
$$ y = [118411, 218373, -230670, 223077, -274419, -127841, 97248, -87547, 287893, -11042, 14429, 69324, 48387, -20361, -193282, -30242, 135342, 84699, 16088, 9657, -207353, -173850, -67975, -195257, 63996, 187979, 251435, -62621, 352327, -44258, 57822, -35060, -172424, -259216, 298384, 172499, -67376, -215278, 258803, 60032, 27485, -42438, 17491, 41285, 32317, 7064, -162951, -89849, -15973, -174968, -106349, 15171, 76093, 159525, -155871, -134267, -238207, 46756, 128043, -60585, 245164, 250478, 58945, 6361, 174417, 150606, -154686, 170258, -152022, -41200, -146584, 174661, -90326, -375311, 43080, 210644, -74260, 81394, 81846, -114133, -119168, 46003, -126726, 197137, 27838, 73123, 75077, 75993, 137256, -224162, -3847, 257146, -136225, -163302]
12372a63302A42741E6915M966i4926r0652I5634Q2677q2594j0144N37c19515h0629
12359B44337b499B26066a12468C35440h308D6181N6747a16833I9530h2182j12452
12348a94634D05998A29617n0908i5997R351k68279A10885h8172A43639B052L57835
12337C59887b46084M0032B03375b28231a4931A89245a04667b923q7745A59629
12326g7607a6149B8845a09434e450l3723B13783g1972m582j66611A25815a76020
12314C50673H6942J36544p0785O4588q2118a43922B4751J60932o5596a6805B62218
12302f0715r4151j51958c0090j96948K0646A24459C6648K6794K97227j12139r0583
12291A57947e7208k93680B18258a54170j84093a02012o3694D04394a44678M8520
$$ y = [-163302, 142741, 56915, 61881, -94926, -185578, 95634, 178311, 95717, 85573, 86110, -319515, -80629, 244337, -2499, 226066, -112468, 335440, -8308, 46181, 102928, -116833, 99530, -82182, -194634, 405998, 129617, 78709, -95997, -86646, -354925, 110885, -88172, 143639, 2052, 359887, -246084, -206052, 203375, -228231, -14931, 189245, -104667, -2923, -90668, 159629, -77607, -16149, 28845, -109434, -5450, -39173, 213783, -71972, -76554, -243165, 125815, -176020, 350673, 86942, 223486, 152701, 217289, 135171, -143922, 24751, 185683, 120087, -16805, 262218, -60715, -154866, -306824, -30090, -227038, -206392, 124459, 36648, 63442, 360669, 248530, 157947, -57208, -350888, 218258, -154170, -338263, -102012, -165706, 404394, -144678, -96158]
12281i6158p5623A48336a28240j1977A53719b43858a6580j09773d6520B49424
12270D20561E5054F055M5505f7756A03622K16261E5029b54653H6279a7644k07807
12259b25451A38302a47724B50941F6979N4850j5799h3583B81505A4481L89838
12249D04319i9940B00830P3184a5525j12190F6411J10935D1383L08320a73715
12238a8598B94884j756j35370g886j26318B93934H0172J06970N8989c9827C4087
12226D16309m4019k3068p9716K72383n0505h981A22590J22236Q4519m3098j8439
12215B67808a1522E6610L39148A23398n4350L6147k0091f0976a2153j10872I8426
12203A56187P8671o8414P991e7141A00093B3332J2198J2354k1286K72006e8623
$$ y = [-96158, -171781, 148336, -128240, -140217, 153719, -243858, -16580, -126353, -46520, 249424, 420561, 55054, 6055, 51560, -67756, 103622, 319883, 55029, -254653, 86279, -17644, -225451, 138302, -147724, 250941, 66979, 121829, 106030, -83583, 281505, 14481, 404319, -99940, 200830, 274014, -15525, -127715, 66411, 177346, 41383, 349703, -173715, -18598, 294884, 293128, 157758, -7886, -134204, 293934, 80172, 187142, 246131, -39827, 34087, 416309, 372290, 349222, 269506, 541889, 491384, -8981, 122590, 244826, 329345, 286247, 267808, -11522, 56610, 395758, 123398, 69048, 105195, 85104, -60976, -12153, -123025, 98426, 156187, 234858, 166444, 174435, -57141, 100093, 23332, 35530, 47884, 26598, 298604, -58623]
12191d1860N470A97509H6802j5233J17070N1030G1971O5343m800N2414c9215m6881
12179h6096C6958b44637f4999m112a6965A4217a64091m925c8393A60876M8776
12168B09652e8205A65142G0217b12955Q1652j9991D3399I24K61542j18604L7348
12157A81210d80668C21003a32846D36643a4478I425N9122J65370k5235C5043K07301
12146B42344D4322f1981b8247B66048Q7363a90585d4852j88503C18435a26411
12135a18883p6029E2477a10924A57418O0930a4990C2925J26205l2485g4903k73405
12124c48308D9729L08477A11196K6854c4471m7567B65899f6407A30713b0515E4008
12112B92583m4053k9724E882a73007A73816H1178C0643b80434a02624D8275M418
$$ y = [-41860, -36390, 197509, 86802, 71569, 188639, 239669, 71971, 137314, 132514, 184928, -39215, -86096, 36958, -244637, -64999, -69111, -16965, 14217, -164091, -169016, -38393, 160876, 209652, -58205, 165142, 70217, -212955, -131303, -151294, 43399, 924, 262466, 143862, 181210, -480668, 321003, -132846, 436643, -14478, 9425, 68547, 233917, 208682, 35043, 242344, 44322, -61981, -28247, 266048, 353411, -190585, -44852, -233355, 318435, -126411, -118883, -194912, 52477, -110924, 157418, 218348, -14990, 32925, 159130, 126645, -74903, -348308, 49729, 358206, 111196, 138050, -34471, -82038, 265899, -66407, 130713, -20515, 54008, 292583, 248530, 218806, 5882, -173007, 173816, 81178, 30643, -280434, -102624, 48275, 52693]
12101E2693h5261A43476b21418A39868f8759j17722C926M01190A66343l9263D2543
12089b7996B9445b8446j51972g5577d429B7232N0994J26518A2534d4572j02887
12078a47459B20826a74564j26696J45536A18615a7650D03816L91086o6198K79468
12068A008172D99430H6760h551j35824C72005b34873p5176a2197j24107B74865
12057B21660b4372F5313G210c28461D28353A45900a79410C19106h0268j56640
12047b36908Q8646E847Q6438b31181A39438l7201N7726d1808j17850K3803N6249
12036g9606b5538B59576k9993c49457e1721C4628C660h044A29494b73588A87862
12024H8863a05467j33308C4272d04762a05863J9842I1847J11915F4114C1678P7966
$$ y = [52693, -85261, 143476, -221418, 139868, -68759, -186481, 3926, 405116, 166343, 127080, 42543, -27996, 29445, -28446, -180418, -75577, -4429, 27232, 78226, 204744, 12534, -44572, -147459, 220826, -174564, -301260, -155724, 118615, -17650, 403816, 794902, 728704, 1008172, 499430, 86760, -8551, -144375, 372005, -234873, -310049, -12197, -136304, 274865, 221660, -24372, 65313, 7210, -328461, 428353, 145900, -179410, 319106, -80268, -236908, -148262, 5847, 92285, -231181, 139438, 102237, 159963, -41808, -159658, -135855, -79606, -25538, 259576, 229583, -349457, -51721, 34628, 3660, -8044, 129494, -273588, 187862, 88863, -105467, -238775, 34272, -404762, -105863, -86021, 91847, 203762, 64114, 31678, 109644]
12013A09644m6203c10180P0605a15869B07084B6785c29958h2415l9002k31744
12003c53161A64890d68271g0634C8404L4749c1060G9493a62184P7579L5702l5406
11992h4309k0795A90255b98503J11394j2108A9138E099J8249a21053b1478n1244
11981g2722A14731D9126a03586B12890H1970b10380C04833c24435a1506n8469
11971f9975A84758a50422o43C81305M2576f5525n0137C40890B3027a36332e6203
11959a01995A22691b5844l1251q340K8559I8765a54650F7822a0723j42349A47949
11947g2516k97582c9416m5794p1063m3006N5791A97442H1487a80307o3255I0932
11935D7507j2063b45129c5477o0577o2363d6898E6174Q9814n6373b43953A12563
$$ y = [109644, 63441, -310180, -239575, -115869, 207084, 26785, -329958, -82415, -121417, -353161, 164890, -468271, -70634, 38404, 73153, -31060, 79493, -162184, -84605, -48903, -84309, -105104, 190255, -298503, -187109, -199217, 19138, 5099, 23348, -121053, -21478, -72722, 114731, 49126, -103586, 212890, 81970, -210380, 304833, -324435, -11506, -69975, 184758, -150422, -151065, 381305, 423881, -65525, -115662, 340890, 23027, -136332, -56203, -101995, 122691, -25844, -57095, -65435, -36876, 98765, -154650, 67822, -10723, -153072, 147949, -72516, -370098, -39416, -85210, -156273, -199279, -143488, 197442, 81487, -180307, -243562, 90932, 47507, 35444, -245129, -35477, -96054, -158417, -46898, 56174, 145988, 89615, -243953, 112563]
11923C80939A05585J70554i8909d3289p4000c1262j11590C66568A63542a63168
11912i880B69265j8452p8767B4939b33639a00397k88618a83735j31931F0439h7429
11900B33091d09565J51465F832c71296J82678N0938A36054a53034P030f9542p2790
11889a42332B00922b13510A76481F2486c6094j46170b485j43442C8784a22387
11878d55468A02552K3107C913b58536A68975a59754A84480C6480C167c17514a14416
11866a32842A53712b21313j7267B93195h6158A5208d3742j05288C17434D5050
11855i802H0805a62856A58605K0948F8199a76786A00849e32A41259b11829d4290
11843c34418d9121j24875A42214b46598f4844J5222k88331A30594a11982B013
$$ y = [380939, 105585, 276139, -98909, -43289, -117289, -31262, -142852, 366568, 163542, -163168, -9880, 269265, 250813, 172046, 24939, -233639, -100397, -389015, -183735, -315666, 60439, -87429, 233091, -409565, -258100, 6832, -371296, -188618, -137680, 136054, -153034, -146004, -69542, -142332, 200922, -213510, 176481, 62486, -36094, -182264, -2485, -145927, 38784, -122387, -455468, 102552, 125659, 3913, -258536, 168975, -159754, 184480, 36480, 3167, -317514, -114416, -132842, 153712, -221313, -238580, 293195, -86158, 15208, -43742, -149030, 317434, 45050, -9802, 80805, -162856, 158605, 179553, 68199, -176786, 100849, -532, 141259, -211829, -44290, -334418, -49121, -173996, 142214, -246598, -64844, -49622, -337953, 130594, -111982, 2013]
11832B289e7612D55890j02786d8392B22406o2446N7394d8671j71395A98505c29684
11820c83304A78717h729B07229q5337c74943A3273h5647j41441b0711k37751h9915
11808B22380c14689h5866N192J56B75804c21073F5478d85822D6833e7281l0001
11797h7282I3352J93156j42396h9297I484h86B27057I4416ik87299e1094A87018
11784a57954C33462a45787N3036k15194B87641A21218f2280I6458J91478E7321
11773b21360d7715D946d0855k75655a21982F0019i8645j40501J03399j37693R0182
11762a83258G3230i8934L5886C6896i0219j29001N2256P6444F9953r226P3261
11751A33988i1156r8333e2108D6339K18719j25999b00963A62532a59141A81526
$$ y = [2289, -57612, 455890, 353104, -48392, 222406, 159960, 217354, -48671, -220066, 198505, -329684, -383304, 178717, -8729, 207229, 121892, -374943, 13273, -85647, -227088, -20711, -258462, -89915, 222380, -314689, -85866, -80674, -80518, 275804, -321073, 65478, -485822, 46833, -57281, -87282, 93352, 286508, 144112, -89297, 9484, -886, 227057, 94416, -9, -287308, -51094, 187018, -157954, 333462, -145787, -92751, -307945, 287641, 121218, -62280, 96458, 287936, 57321, -221360, -47715, 4946, -40855, -316510, -121982, 60019, -98645, -239146, -135747, -273440, -183258, 73230, -98934, -63048, 36896, -90219, -219220, -166964, -90520, 69953, 60727, 133988, -91156, -189489, -52108, 46339, 265058, 139059, -200963, 162532, -159141, 181526]
11740b28883b0020B18519a49387c8765H6327K2265O0083E3174B2a25094O0653
11729f4441k85186i5188A9944h7845J5500A86780C1863e8837L450a7426A50650
11717I0814K14373d8488C6244a48652A10093J12370A122a17468o9932n5441A09828
11705a35352A09608K1766J77457d1313B38198b8972j51162A73235O8883a04811
11694a68208E6280J15432J96032a80013A24312b26493A01314i4709B65717D186
11683b46480A85718C2675a36304A19938k7746h0157C4361K11919c2232C25623
11672b23605A15218K30094I730K69538f0913A02863K1587a1105l0561C23254k4695
11661B98559c26H0709a14518B21300E228a19205D59472b21281e0352m0844A91795
$$ y = [-228883, -20020, 218519, -149387, -38765, 86327, 108592, 168675, 53174, 22, -125094, -64441, -349627, -95188, 19944, -87845, -72345, 186780, 31863, -58837, -55387, -17426, 150650, 90814, 305187, -48488, 36244, -148652, 110093, 222463, 1122, -117468, -187400, -242841, 109828, -135352, 109608, 131374, 308831, -41313, 238198, -28972, -180134, 173235, 242118, -104811, -168208, 56280, 171712, 367744, -180013, 124312, -226493, 101314, -94709, 265717, 4186, -246480, 185718, 32675, -136304, 119938, 92192, -80157, 34361, 246280, -32232, 325623, -223605, 115218, 345312, 9730, 279268, -60913, 102863, 124450, -11105, -41666, 323254, 298559, -326, 80709, -114518, 221300, 5228, -119205, 459472, -221281, -50352, -91196, 191795]
11649A76396F0790a00681A8268K12362f8907n5237K5741A47298a6347j07036C84377
11637b787m10058f7170H7275a74659J697B22016a49107m2987A03067J09695r2143
11626A20619J41548O0945A12295l4228b26931d6275j57823G927b40101B01598
11615A66720J49148c09585f9887l2341A89347A6090N7057b39818E9942J08833
11605A68775H1325a68407j8524I6381b589B46964A02011K31704G3842c12229a35416
11593A1318g1290J1660m14160A14069a02688B38184A02630b70576J30246A76509
11582a38308A094d4472A09686a6601B05924G7604a26221A85815h6618J9024E229
11570c4561B14523a18766A80437a96510A07326e7661H6544M4148K3013a14487
$$ y = [176396, 60790, -100681, 18268, 230630, -68907, -124144, -98403, 147298, -16347, -123383, 384377, -2787, -412845, -67170, 87275, -174659, -172962, 222016, -149107, -192094, 103067, 212762, 120619, 262167, 323112, 112295, 78067, -226931, -46275, -204098, 7927, -240101, 201598, 166720, 315868, -309585, -69887, -102228, 189347, 16090, 73147, -239818, 59942, 168775, 81325, -168407, -186931, 96381, -2589, 246964, 102011, 333715, 73842, -312229, -135416, 11318, -71290, -59630, -473790, 114069, -102688, 238184, 102630, -270576, -140330, 176509, -138308, 1094, -44472, 109686, -16601, 205924, 77604, -126221, 185815, -86618, -67594, 5229, -34561, 214523, -118766, 180437, -196510, 107326, -57661, 86544, 130692, 153705, -114487]
11559D99540A07753a7461A47625J77956a37634b4471A55044f8357B85887H345
11548e3118C29606j25421f8371A41596e7259A35849J80073E0086J86651b18240
11537a34169B97744D9246c02811a36G8227L23036j98917c03554B89597O1401G4636
11525e7156j77778A49830K48606a35963B09860b31066C03182B4973Q6661h3233
11514C2782e6296B36619a53305A77654F6208J43174H2726J04133p4103m2829a7969
11502B3532K69215O8726G8125L64831A79757K85259a8440q8951M4839A16433J7329
11491A33762R1585B6236a65477B64160j19604K0591i893C19920A08617J24184
11481B32801B1791Q396O8682J11799Q7489A21702M1505E6108J48023n8597a39387
$$ y = [499540, 107753, -17461, 147625, 325581, -137634, -24471, 155044, -68357, 285887, 8345, -53118, 329606, 204185, -68371, 141596, -57259, 135849, 315922, 50086, 236737, -218240, -134169, 297744, 49246, -302811, -136, 78227, 401263, 202346, -303554, 289597, 350998, 74636, -57156, -234934, 149830, 398436, -135963, 209860, -231066, 303182, 24973, 111634, -83233, 32782, -56296, 236619, -153305, 177654, 66208, 209382, 82726, 186859, 112756, 69927, -17969, 23532, 292747, 361473, 78125, 442956, 179757, 465016, -18440, -107391, -62552, 116433, 133762, 225347, 26236, -165477, 264160, 144556, 165147, -9893, 319920, 108617, 232801, 21791, 30187, 98869, 210668, 298157, 121702, 163207, 56108, 204131, 145534, -139387]
11469A77686d7596C27588O162A51376O9618a68846g6442n8296C11744c36518D11787
11457D9434k1082g0788D70939E9559O4836E5430e9468A85950f1298A76976M4036
11446B21012a62422B45945f552j2302h593F8040h2518B43060b3998D28850a29262
11434I5658j1584a61109A19450f5764C44399D767K856J00715m5756b95215h6300
11422I4499R0360b7338m9299B48134j08462C4099a76083B10595A7446e2949A89470
11410B986a82196m0927b0798k92212I6378L42752k11516n0676H7208m2765J17290
11399A61733a46152b1120A67771O7419a79972C52797A48692C5667J96185f2666
11388F5689k9687K6929b27074H1937b7924j03643D006a11354C06665A02249B4548
$$ y = [177686, -47596, 327588, 333750, 151376, 220994, -168846, -76442, -134738, 311744, -336518, 411787, 49434, 28352, -70788, 470939, 59559, 124395, 55430, -59468, 185950, -61298, 176976, 221012, -162422, 245945, -6552, -18854, -8593, 68040, -82518, 243060, -23998, 428850, -129262, 95658, 84074, -161109, 119450, -65764, 344399, 4767, 7623, 108338, 62582, -295215, -86300, 94499, 184859, -27338, -76637, 248134, 139672, 34099, -176083, 210595, 17446, -52949, 189470, 2986, -182196, -223123, -20798, -313010, 96378, 439130, 227614, 176938, 87208, 44443, 161733, -146152, -21120, 167771, 235190, -179972, 352797, 148692, 35667, 231852, -62666, 65689, 36002, 62931, -227074, 81937, -27924, -131567, 4006, -111354, 306665, 102249, 24548]
11376F1003a25395C6922N6144D5393L13892j21272L1276b153k18754l0346P0746
11365a80507N2335R055l61133C90487b64496J15109O6540A86609a55841D8459
11354f4916B33106a6721A3530J12728a59436E393L08255a26346A18934i8272A74433
11342A86223n4652A4432Q1752i5000E7585a05419e1039l6162A61714k6662c24121
11330b82773r2890A88021f9785b8577A5568L2917P2150g613C9755M6265f5315
11318B63427A08438a58519A52815a5906n0574a4962j35166E6818a22985N9640
11308f3345q212B92611d78651A2361a09822j46802B54455d2339B78568B4296b19352
11296g2608A70089n3361a87879F038K50808C687b4956j70891a1451j53534H762
$$ y = [61003, -125395, 36922, 93066, 45393, 359285, 238013, 269289, -2153, -220907, -251253, -180507, -128172, -119117, -480250, 390487, -264496, -149387, -82847, 186609, -155841, 48459, -64916, 233106, -16721, 13530, 126258, -159436, 5393, 313648, -126346, 118934, -98272, 174433, 186223, 131571, 14432, 96184, -95000, 57585, -105419, -51039, -87201, 161714, 135052, -324121, -282773, -375663, 188021, -69785, -28577, 15568, 48485, 120635, -7613, 39755, 86020, -65315, 263427, 108438, -158519, 152815, -15906, -66480, -14962, -150128, 56818, -122985, -63345, -71557, 292611, -478651, 12361, -109822, -256624, 254455, -42339, 278568, 24296, -219352, -72608, 170089, 116728, -187879, 6038, 256846, 3687, -24956, -195847, -11451, -164985, 8762]
11284B21523f5492b4971B7964a9449H4567P002d4438A2462J69e1755k90512b5842
11271H6801K08721a09111A94319a6400r8279K2592K9898k69048D60b38344A36870
11259A06019m7840c50805G9090c9520k81703J36277A05523J73489g6604D63716
11248a01396b5410r6033j11672B68628E1861E171c79226D2914K96801d0761H0190
11236a66200A03382J60512r3731b20984n8583F992J29182D887P58a32283A76074
11224b89608Q4997B46744g0878j56633B08135B4367J90904G7435c47986a46724
11213g4630n56436B3141H572h2639k02599B84144a57189j27969J20218K2716A32395
11201H5982O1142e6050B26030b24729R1906r5772j8661Q9163b5373k09004k4127
$$ y = [221523, -65492, -24971, 27964, -19449, 84567, 91569, -44438, 12462, 12631, -51755, -342267, -25842, 86801, 295522, -109111, 194319, -16400, -114679, -92087, -62189, -331237, 460, -238344, 136870, 106019, 58179, -350805, 79090, -39520, -321223, -184946, 105523, 279012, -76604, 463716, -101396, -25410, -121443, -233115, 268628, 51861, 5171, -379226, 42914, 339715, -40761, 80190, -166200, 103382, 263894, 170163, -220984, -279567, 6992, 136174, 4887, 5645, -132283, 176074, -289608, -204611, 246744, -70878, -227511, 208135, 24367, 215271, 77435, -347986, -146724, -74630, -631066, 23141, 8572, -82639, -285238, 284144, -157189, -285158, -164940, -142224, 132395, 85982, 147124, -56050, 226030, -224729, -132823, -228595, -247256, -158093, -25373, -234377, -258504]
11190b58504P0004C678Q6051b5587m0638A04141L8921N8166G5760b09951a01889
11178C2257A5969c28134h6966J3806l0809B7324b0995j4780C5067a39933n4857
11167a94790A03664b11643Q3856N6187j19585F7255j1179K4506b45008j91778
11157d36786A40470a75442j10270A3224b62319A03700D7942O8658k1090a91917
11146e7286m3200B11657a72516C988b43294K2220C0658L02544A06576a40472m4363
11135a84835g6730n494B31937e220C11166h1739I478Q5519J87758F2733L8053
11124A00786a95719G1011K33644d4656B49280a24133A260a89030h120B28997A4646
11112h4177E2238L74111A52819b2553B55543a72383B28377K0876H7333B1305B461
$$ y = [-258504, -188500, 3678, 89729, -25587, -66225, 104141, 143062, 201228, 75760, -209951, -101889, 32257, 15969, -328134, -86966, -73160, -103969, 27324, -20995, -35775, 35067, -139933, -194790, 103664, -211643, -127787, -71600, -191185, 67255, 56076, 80582, -245008, -436786, 140470, -175442, -285712, 13224, -262319, 103700, 47942, 116600, 95510, -191917, -57286, -100486, 211657, -172516, 3988, -243294, -221074, 30658, 333202, 106576, -140472, -184835, -76730, -82224, 231937, -5220, 311166, -81739, 9478, 94997, 282755, 62733, 100786, -195719, 71011, 304655, -44656, 249280, -124133, 1260, -189030, -8120, 228997, 14646, -84177, 52238, 426349, 152819, -22553, 255543, -172383, 228377, 249253, 87333, 21305, 2461]
11100B21302C8136R8874K80251j14419b7979A03845J32491r4417Q563J61772l0724
11089B81530D2757a4273A83885q6740b25656B80222K1987C0292a70546d2303o5071
11078a07374B22250M1734K48452k4490O5144B47474b7542E92880B74197K21713
11068D95910k22055J08823o9393M28372k17304j65974L02092l08923Q0331J36343
11058E68222q4489K9475R6037k22084K10369P8207n4954k74045J04184M58008
11048I08930k64076q2300J09649j33684n4743L4740P294Q7293M33770l15699K85755
11037A016929Q3312m51959l8041j13522K53751p74l23227M88377M1694C54328
11026F44087l4463J96924k83916k08637N26693k97535J58897L2972o3310N6332
$$ y = [221302, 38136, 137010, 417261, 302842, -27979, 103845, 236336, 141919, 150482, 312254, 281530, 42757, -14273, 183885, 97145, -225656, 280222, 302209, 30292, -170546, -42303, -107374, 222250, 263984, 512436, 487946, 553090, 247474, -27542, 592880, 274197, 495910, 273855, 382678, 313285, 741657, 524353, 358379, 660471, 351548, 431879, 568222, 483733, 513208, 609245, 387161, 597530, 675737, 620783, 346738, 450922, 908930, 644854, 562554, 672203, 538519, 483776, 518516, 525810, 613103, 1046873, 731174, 1016929, 1100241, 648282, 610241, 496719, 750470, 749696, 426469, 914846, 956540, 354328, 644087, 609624, 806548, 522632, 313995, 840688, 543153, 702050, 735022, 671712, 728044]
11016G28044l32468M71970l95642L40595m4047k04085j55689J31116K6387j01473
11006D64708p331L03949r5633o1836j94507K5123M56353l59845J51767k26074
10996D56674J07278K40998J14164k20518N7751k34886J87438R5926j53309M22424
10986A073940k3323j95754q5169O4847R2365L8295L77504o6606L28745J27282
10976A732126N85419k66450j3168O83649p4534k29372R9882k20765p2361l41204
10966A883222K0041m38018m7353R5180o9381K43954l43999M09618r0956K98344
10956A960652o06884M1746l56168k9311R8195j95017l42905j60350K57412j76583
10946D90787j04475A74926K67046j31629G1234J68101p4734C6661q434K43713
$$ y = [728044, 395576, 867546, 471904, 812499, 768452, 564367, 408678, 539794, 566181, 464708, 457377, 761326, 665693, 603857, 409350, 434473, 890826, 530981, 682748, 456674, 563952, 804950, 919114, 698596, 756347, 521461, 708899, 804825, 651516, 1073940, 1050617, 854863, 769694, 834541, 926906, 965201, 1342705, 1276099, 1604844, 1732126, 2317545, 2051095, 2037927, 2721576, 2647042, 2417670, 2517552, 2296787, 2224426, 1883222, 1903263, 1465245, 1417892, 1513072, 1443691, 1687645, 1343646, 1753264, 1662308, 1960652, 1353768, 1395514, 1039346, 1010035, 1108230, 913213, 570308, 409958, 667370, 490787, 386312, 174926, 441972, 310343, 71234, 239335, 164601, 36661, 28227, 271940]
10936B71940d5802E3082a5972k57616e599k56171D393J60556K2266b00608e2938
10924C58018c426E2844h4461B97735A9403J14556K43188j02009E6852b6787I4196
10912H5430b5440I4568b18517e4232E3758K29433D3412a11882K2492B22955K33267
10901D56222b7414j40202l0459A30668e0104A68085H1866M2280J31254J91885
10891D47285a82769O3080C04859a06767j43535B8805g4976k1019j77096j04282
10881c77373B33343m3733q5277d1794k3620l10553E8594P4363e9879A25790j5218
10870A10572f3690J904j55012P3361M2639A63790k7433J18424d2310B1671J03975
10859A25646g0867A4857J00656a62799l4352e6313A67887E2262J80505j07937
$$ y = [271940, -45802, 53082, -15972, -273588, -5599, -261770, 4393, 164949, 187215, -200608, -52938, 358018, -3426, 52844, -84461, 297735, 19403, 133959, 377147, 275138, 56852, -26787, 94196, 85430, -25440, 94568, -218517, -54232, 53758, 283191, 43412, -111882, -89390, 222955, 456222, -27414, -167616, -198075, 130668, -50104, 168085, 81866, 124146, 255400, 447285, -182769, -119689, 304859, -106767, -250302, 28805, -74976, -95995, -273091, -377373, 233343, 189610, 104333, -41794, -65414, -375967, 58594, 132957, -59879, 125790, 110572, -63690, -61786, -216798, -143437, -100798, 163790, 136357, 254781, -42310, 21671, 125646, -70867, 14857, 115513, -162799, -197151, -56313, 167887, 52262, 232767, 124830]
10849A24830b12817A70960A0312E74d8734j80067P26d3727A21501D9651k3516
10838B6135a49180P3925H3430a86701C66874e79715A22064C5085J17652d4993
10827A23720c25824M4451m8809J06841g8786K7254j49784a679j80896B80489a56831
10815c3666B31311a47945A86219a38415D1688C333h8978a3216l85036a70642J2615
10804a58027b151B09366f6797A66983H664a87304C0930Q7895J26082C7603a2688
10792B06958G0096l1739J51353a7373E6265b82204A26014e0681A87282d23683
10781B6942a45794B68870c29041B06613i0319k62473a11731A71696N1147r4402
10771A28441e1007o82A11217k8463K3812b19691g3822J1021D6244b06985O7302
$$ y = [124830, -212817, 170960, 10312, 574, -48734, -228801, -228075, -43727, 121501, 49651, 26135, -149180, -75255, 83430, -186701, 366874, -579715, 122064, 35085, 152737, -44993, 123720, -325824, -281373, -330182, -223341, -78786, -51532, -201316, -1679, -182575, 280489, -156831, -33666, 231311, -147945, 186219, -138415, 41688, 3333, -88978, -13216, -398252, -170642, -158027, -2151, 209366, -66797, 166983, 8664, -187304, 30930, 118825, 244907, 37603, -12688, 206958, 70096, 38357, 189710, -17373, 56265, -282204, 126014, -50681, 187282, -423683, 26942, -145794, 268870, -329041, 206613, -90319, -352792, -111731, 171696, 222843, 128441, -51007, -51689, 111217, 82754, 106566, -219691, -73822, -62801, 46244, -206985, -139683]
10760a39683A8409K453e16975a2097F2674f0752q8692L2630I4594g4609K9474
10749d5135B7065a0131m9114l02506J68844A84315a43582e1195j98146A54690
10738i9872k28154J10861A93520b15091h0595k45287J39581k1255D163b22670
10727a26088m4957P1535A5469c0731C74011a35949c8901l24111d659A4212a7477
10715G1414c4932K514o1861b6971B03925j01467E0662b3436M418k48662J23644
10704a44036H8546e518q7030B57033a34485J0110C0674a259A72549h3381o4173
10693a47554c4345A41251g4740j06738P2043E2339b09900O5323o7187A86598G235
10681a34530K449B8404J61102b81138A51145e5882b2906A82162G0422g2757l8843
$$ y = [-139683, 18409, 20862, -516975, -12097, 62674, -60752, -149444, -116814, 94594, -74609, -45135, 27065, -10131, -59245, -361751, -192907, 184315, -143582, -51195, -249341, 154690, -99872, -328026, -217165, 193520, -215091, -80595, -325882, -186301, -207556, 4163, -222670, -126088, -171045, -99510, 15469, -30731, 374011, -135949, -38901, -363012, -4659, 14212, -17477, 71414, -34932, -32418, -94279, -26971, 203925, 102458, 50662, -23436, -19018, -267680, -144036, 88546, -5518, -92548, 257033, -134485, -124375, 30674, -1259, 172549, -83381, -147554, -34345, 141251, -74740, -181478, -109435, 52339, -209900, -144577, -211764, 186598, 7235, -134530, -132081, 28404, 189506, -281138, 151145, -55882, -22906, 182162, 70422, -72757, -111600]
10670a11600B01665F1471b9201l7376C5676J68041e8471D42716E1754c36120O1261
10659b74859i6901j47832A19028b54733E5575a33908D4842O4893b81222Q9144
10649a92078A6329g0277a6579I4970g5876A9215b31959g1935A81075D9569d82833
10637H3730Q7739a56252m7901B2478b07230E5261h5339d1644D1579d60464I650
10625E5618E548a6668A18374f7034p3129o6436I7532a82069p0679F8080c99090
10613a78707A52781c3475j99696a11933l42877B6336J28207c37398A00942f1489
10602A56249l1156e5239A40696a3695o2484A36233a75040j38481J38154A31327
10591b13539k2522d6138A91718H804Q007a89094B20639a49759A94996q8882a03470
$$ y = [-111600, 201665, 61471, -29201, -66577, 35676, 203717, -58471, 442716, 51754, -336120, -274859, -96901, -244733, 119028, -254733, 55575, -133908, 44842, 109735, -281222, -192078, 16329, -70277, -16579, 94970, -75876, 19215, -231959, -71935, 181075, 49569, -482833, 83730, 171469, -156252, -204153, 22478, -207230, 55261, -85339, -41644, 41579, -460464, 9650, 55618, 5548, -16668, 118374, -67034, -140163, -206599, 97532, -182069, -252748, 68080, -399090, -178707, 152781, -33475, -233171, -111933, -454810, 26336, 154543, -337398, 100942, -61489, 156249, 125093, -55239, 140696, -13695, -76179, 136233, -175040, -313521, -175367, 131327, -213539, -236061, -46138, 191718, 8804, 16811, -189094, 220639, -149759, 194996, 106114, -103470]
10579A87311o2070L6862J69902b81516d1367D11723C2693g1432C65550a52763
10568c56325b5048P06m5625k53157A22862a14103c7191j57409h048A4660c5257
10556e1633A3902J66083G6706B1561a28647E07392B28637a23714o951j25896E0910
10544C02139g6440k26249D7458a84757b1490m17172A75927D2315e5135b1A14264
10532a67972f5654G958b65372H8493Q2797o1638K39394j13066N0135d2762j0107
10521e2869H3200a75754o2142h255j62670a8455F8900A2959b58088h7625A14083
10509f036B59995F6949e2367A40312a51086k710e0937A07289b76671A59041a3622
10497D17194c39274A87329a85311B35566d7328I8788k2962b60635e6784I3229
$$ y = [187311, 125241, 162103, 332005, -281516, -41367, 411723, 32693, -71432, 365550, -152763, -356325, -25048, -24342, -69967, -323124, 122862, -114103, -37191, -194600, -8048, 14660, -35257, -51633, 13902, 179985, 76706, 21561, -128647, 507392, 228637, -123714, -130665, -256561, 50910, 302139, -76440, -302689, 47458, -184757, -21490, -438662, 175927, 42315, -55135, -21, 114264, -167972, -65654, 7958, -265372, 88493, 171290, 109652, 349046, 235980, 286115, -42762, -52869, 83200, -175754, -237896, -8255, -170925, -18455, 68900, 12959, -258088, -87625, 114083, -6036, 259995, 66949, -52367, 140312, -151086, -153796, -50937, 107289, -276671, 159041, -13622, 417194, -339274, 187329, -185311, 235566, -47328, 98788, 75826, -260635, -56784, 93229]
10486b45138N0611o9587C39835K6993J21232M9811P9038K136I3162K18870A09833
10474g2115H8844h3491E7052b0488j25366A80304b14055d2460A99992E2534a17661
10462A5607b3156j59919J9514j42311e8270j11034g0721k38698f9759a6272k33870
10451b50142A65118e0350F0563b04778c6947p6672H8231J77446B6229L1400O8337
10440A25966B7636J77461C2838a53897A75113H4090Q8418G7067i6903j20895A555
10428E9838a58834j35550B4174J16591a46849j23329C49191o4017F8818c9922
10417E1848b468r1493o2193M0048a8503j71390k5107j6580J14108m6041B08542
10405b17096A45396Q7300a36546k11073A2332K03612d7316J8864A50811C6252
$$ y = [-245138, -194527, -264114, 339835, 366828, 488060, 537871, 616909, 619045, 93162, 312032, 109833, -72115, 88844, -83491, 57052, -20488, -145854, 180304, -214055, -42460, 199992, 52534, -117661, 15607, -23156, -183075, -163561, -305872, -58270, -169304, -70721, -309419, -69759, -16272, -250142, 165118, -50350, 60563, -204778, -36947, -113619, 88231, 265677, 26229, 57629, 125966, 27636, 205097, 32838, -153897, 175113, 84090, 172508, 77067, -96903, -217798, 1555, 59838, -158834, -294384, 24174, 140765, -146849, -270178, 349191, 285174, 68818, -39922, 51848, -2468, -93961, -156154, -116106, -18503, -189893, -215000, -231580, -117472, -163513, 208542, -217096, 145396, 232696, -136546, -347619, 12332, 215944, -47316, -28452, 150811, 36252]
10394I755a7186k1799C10958j00339K4796a42526D7536J42312H3679a15654A98212
10382a58349c8849n299A21895N5301Q4947b51564B00724J86287a9599C07936M0075
10371C48011j53494E148h9803D56306M2211p1338K65626b7374A77841a21574B63035
10359D43838A06440J7557m7227k9742K23017I0518K20733N2336J98669l9856Q0122
10348F02522E2783L07487A40567P5631K63027m620A85650q0526J91114J944L6300
10337C34482j43474M77839A39378L6947C4574K26313c5412D12410c13187A37276
10326h9553C84864A73802f3736B46046q5072M5752a25885A03547K96923B6731
10315B35866g6917C03359m4157a57934A39925P0325b01403C32515b69604P3775
$$ y = [9755, -17186, -38985, 310958, 210619, 235415, -142526, 47536, 189848, 83679, -115654, 198212, -158349, -38849, -44148, 121895, 177196, 262143, -251564, 200724, 387011, -19599, 307936, 348011, 194517, 5148, -89803, 456306, 498517, 427179, 692805, -27374, 177841, -121574, 263035, 443838, 106440, 123997, 76770, 47028, 270045, 90518, 311251, 363587, 562256, 522400, 602522, 52783, 360270, 140567, 216198, 479225, 474605, 185650, 105124, 296238, 298182, 334482, 191008, 668847, 139378, 176325, 34574, 260887, -35412, 412410, -313187, 137276, -89553, 384864, 173802, -63736, 246046, 160974, 206726, -125885, 103547, 400470, 26731, 235866, -76917, 303359, 259202, -157934, 139925, 210250, -201403, 332515, -269604, -195829]
10305a95829A6044L42523A38693m458a00335i599j57893f5805B05998a12139D25486
10293H9064K45587g2788k00594A27508b48468r3923C9346a82699N0248j61360
10283b93811A30179b23028h8983A30287b74261A88311K7588f1940j35825c8846
10272a50590B40320A3919O810d2915G2428J2982b43893B01564D7113K24807O6586
10261C38506M553f6516C90616c1952C98790j39555m4839c2864B63805N1347d8763
10249A12562a33726A12851a28030e008A51967n9572c26525a07530A84292L0285
10239B14577r8620a72001C56192a4636j23486A95670d5614j88589e1686j17189
10229a68875j2608B0132b5569j08277j17593b9696j33317l4707e6480j776A53057
$$ y = [-195829, 16044, 358567, 138693, 134235, -100335, -9599, -167492, -65805, 205998, -112139, 425486, 89064, 334651, -72788, -273382, 127508, -248468, -342391, 39346, -182699, -132451, -293811, 130179, -223028, -88983, 130287, -274261, 188311, 215899, -61940, -197765, -38846, -150590, 240320, 13919, 20729, -42915, 72428, 85410, -243893, 201564, 47113, 271920, 338506, 343059, -66516, 390616, -31952, 398790, 259235, 214396, -32864, 263805, 315152, -48763, 112562, -133726, 112851, -128030, -5008, 151967, 92395, -326525, -107530, 184292, 214577, 115957, -172001, 356192, -14636, -138122, 195670, -45614, -234203, -51686, -168875, -181483, 20132, -25569, -133846, -251439, -29696, -163013, -197720, -56480, -58256, 153057]
10217d8630B24697q787h2203j00803C8275K18753E584K39785b94998R2598f1571
10205E5441b13635P4785p5754C5213c36504B26740q0163C1915R3972b2632I0571
10193b44454a14352A10617d8961A90097G7150J09088B260a03050b3636j3665l06268
10182c43569A55018c876A57499b53960N6412j48884J03579A46249A3945J92327
10172B06272C190h8164K2751N061a5372l707k52927J1706A36656B0654b11148
10160d528p884F01i5886q8170B38178q2372b69121J02994l13350A88405c12249
10148f0759j4751A11810C3599c10002d7814C773a64061n0115Q0198B51208b9882
10136d154A62390h6704k15674B92290C1086a99349C03907b2688k64251n7903a10066
$$ y = [-48630, 224697, 215910, -82203, -183006, 38275, 257028, 5584, 245369, -294998, -202400, -61571, 55441, -213635, -138850, -214604, 35213, -336504, 226740, 146577, 31915, 125887, -22632, 90571, -244454, -114352, 110617, -48961, 190097, 77150, 186238, 2260, -103050, -23636, -37301, -343569, 155018, -3876, 157499, -253960, -197548, -346432, -242853, 146249, 13945, 206272, 3190, -88164, -65413, -60352, -15372, -19079, -272006, -260300, 136656, 20654, -211148, -4528, -12412, 601, -95886, -184056, 238178, 155806, -269121, -166127, -479477, 188405, -312249, -60759, -75510, 111810, 33599, -310002, -47814, 3773, -164061, -214176, -133978, 251208, -29882, -4154, 162390, -86704, -302378, 292290, 31086, -199349, 303907, -22688, -286939, -344842, -110066]
10124F522i0101q0128p3748f1577C60725b39786G4825d95025A46320c29650a53757
10112G5079N0297a49006c5431j8789A2253c86616a39892j1653H3781k1677J20673
10101A82777d5991K0934C0173K99126a34075L1682P020C79736a22146k49171J66712
10090b04605B26425g7828A59549R2019b50983i7135B38045E113i0501H5939B5278
10078g6621H3661l0937K13425a5887j97471k0868o4966A24461P0099E8278c56124
10066c61002A1244d9032j27306J9360H1225g5243C50267a24687e7717j8664k1281
10055i7662D6752J01017b21125B03193B7946c6568G3785h1753H7747a09382B20776
10043b10047D346P0879b43597P7988n3297j35005b1647A68838a76324d1244H852
$$ y = [6522, -90101, -170229, -243977, -61577, 360725, -239786, 74825, -495025, 146320, -329650, -153757, 75079, 125376, -149006, -35431, -54220, 12253, -386616, -139892, -151545, 83781, 62104, 182777, -45991, -25057, 30173, 329299, -134075, -102393, -95373, 379736, -122146, -371317, -204605, 226425, -77828, 159549, 251568, -250983, -97135, 238045, 5113, -90501, 85939, 25278, -76621, 83661, 52724, 266149, -15887, -213358, -234226, -299192, 124461, 194560, 58278, -356124, -361002, 11244, -49032, -176338, -156978, 81225, -75243, 350267, -124687, -57717, -76381, -97662, 46752, 147769, -221125, 203193, 27946, -36568, 73785, -81753, 87747, -109382, 220776, -210047, 4346, 75225, -243597, -165609, -218906, -353911, -21647, 168838, -176324, -41244, 8852]
10031A42487A7765L4559c04904J35269o675j10456J08257C2749b17812P0357H1069
10019c06920O684A69868a48602J8286C89816b12919k6165r7456J30969r9592J00411
10008b04752J1084a8341l78395A06673h6057b114r2409a0475l556D5403c10588
9996B11888h4907k0771A19082a00632k77087d3560B82016c03855g5388k11176
9986b86564a3944A96262a94092B92183a89172A96324a92052B83013F6154a54557
9975a44085j0935C18823b02069R8453B39160d17485G4427a57362P8276B1572F266
9963a66487B38846a25161d5290G8158b44831a13246d7054A09050l166c73045D3677
9951G6548M14442b9293a1029A00209d86409a20649k7652K0543c3479r9830m1492
$$ y = [142487, 17765, 52324, -304904, -169635, -176310, -286766, -178509, 32749, -217812, -147455, 81069, -306920, -300236, 169868, -148602, -130316, 389816, -212919, -239084, -336540, -205571, -305163, -204752, -193668, -18341, -396736, 106673, -86057, -2114, -94523, -10475, -14031, 45403, -310588, 211888, -84907, -105678, 119082, -100632, -377719, -43560, 282016, -303855, -75388, -286564, -13944, 196262, -194092, 292183, -189172, 196324, -192052, 283013, 66154, -154557, -144085, -155020, 318823, -202069, -103616, 239160, -417485, 74427, -157362, -79086, 21572, 6266, -166487, 238846, -125161, -45290, 78158, -244831, -113246, -47054, 109050, 105884, -373045, 43677, 76548, 490990, -29293, -11029, 100209, -486409, -120649, -148301, -127758, -33479, -133309, -174801]
9940a74801A97965n4197a55134B41206A6543i4393k0331C840j801J55471R0217
9929B47727a60792j30260d805A8834K68180g6630r7326n1220A13a98990J5218
9918a83772a8710p0405M2870k21518J21188A77098R3853b56960B07148d86656
9907a93455j72682a55205n7345I5196K6921j2836a05156k2297L4869l9544G1318
9895a85736G1194E774e7642j44716m0324K8116j2597A08532a57521E0693M8981
9884I9674b25684J11333A01727b20497J6168j6818J02596A97487a42478m3309
9874a85787d3492j02699j48862I8521h5549H7685a40980I1973c38555b8086k80872
9863c08958A60666b78793f5355k21932B06206m6151g6952A87677b55829A97756
$$ y = [-174801, 197965, 143768, -155134, 241206, 16543, -94393, -114724, 3840, 2039, 157510, 247727, -160792, -291052, -4805, 18834, 287014, -76630, -173956, -225176, 113, -198990, -183772, -18710, -89115, -46245, -267763, -146575, 177098, 270951, -256960, 207148, -486656, -193455, -366137, -155205, -212550, 95196, 122117, 109281, -105156, -127453, -92584, -132128, 71318, -185736, 71194, 5774, -57642, -202358, -242682, -214566, -227163, 108532, -157521, 50693, 99674, -225684, -114351, 101727, -220497, -204329, -221147, -118551, 197487, -142478, -185787, -43492, -146191, -295053, 98521, -85549, 87685, -140980, 91973, -338555, -28086, -308958, 160666, -278793, -65355, -287287, 206206, 160055, -76952, 187677, -255829, 197756]
9852D62K83338b31373I0271B2538b98208c0486A24125J49078j28386c68473c0742
9840a02935l0503k10092J54177A5125K21090A9599b0354j98018O8772O696A6553
9828b63598C9372b25198H015a01998A70208b6027I0048a05674r2031b7262A32475
9816c53792A8984b53299J23113q745k06431a60265g5422K8726k4957A04431c88073
9804I1328b1734a0266n5678m6279l336e6745I8534i8955k31314h0449a8819H6870
9791d520E6351O1b46384M4899h6000j07897C1265c8817F5574c6323E9873K35670
9779B95543J83132A03928b7869p4693A98228a65873o440f2912B18234J55432b88909
9767A56023n2692J45879c2226j38967f7045r5951J0148C395g4140p9931m350A53349
$$ y = [462, 283800, -231373, 90271, 22538, -298208, -30486, 124125, 273203, 144817, -368473, -30742, -102935, -133438, -343530, -189353, 15125, 236215, 19599, -20354, -218372, -149600, -142904, 16553, -263598, 39372, -225198, 8015, -101998, 170208, -26027, 90048, -105674, -197705, -27262, 132475, -353792, 18984, -253299, -130186, -138931, -345362, -160265, -75422, -46696, -71653, 104431, -388073, 91328, -21734, -10266, -65944, -112223, -115559, -56745, 98534, -98955, -330269, -80449, -18819, 86870, -4520, 56351, 56412, -246384, -201485, -86000, -193897, 31265, -38817, 65574, -36323, 59873, 295543, 478675, 103928, -27869, -102562, 198228, -165873, -172313, -62912, 218234, 373666, -288909, 156023, 103331, 249210, -32226, -171193, -67045, -162996, -152848, 3395, -74140, -154071, -158421, 153349]
9754E1191c23812b6639B16067D5665b56609C61797c89078b7789p5426A27432D6497
9742E8738a07300C2492i4713n9452O4670D29630d74063a46167e4082b5269E8255
9730C5491a58647k14733a28923n9980I9510b2433A92449g7663D4304k0787K3485
9719D7002a60422B72631G1601a51702l8267L5102b1167r9156j58457a6321j76054
9708a92375h5213k7830K1095A7267g0118F8259K8010c18440e7696j00686k29824
9697c88206g4789A20331c6760o7149A47205b49954c2475I1169c71835b8351j78942
9686b07293g2736B11840d0708j10202g0644B3374a45656q022A08567i6776c9958
9674A49401i908j33055B0174c45316J63572q8835N8026N8683k01222B0717a37768
$$ y = [51191, -323812, -26639, 216067, 45665, -256609, 361797, -389078, -27789, -103215, 127432, 46497, 58738, -107300, 32492, -94713, -154165, -89495, 429630, -474063, -146167, -54082, -25269, 58255, 35491, -158647, -373380, -128923, -188903, 99510, -22433, 192449, -77663, 44304, 23517, 47002, -160422, 272631, 71601, -151702, -189969, -154867, -21167, -120323, -278780, -16321, -192375, -85213, -113043, -91948, 17267, -70118, 68259, 96269, -318440, -57696, -158382, -388206, -74789, 120331, -36760, -103909, 147205, -249954, -32475, 91169, -371835, -28351, -207293, -72736, 211840, -40708, -150910, -70644, 23374, -145656, -153678, 108567, -96776, -39958, 149401, -9908, -142963, 20174, -345316, -181744, -270579, -212553, -153870, -355092, 20717, -137768]
9662b40944B00364C2814b28570M9139N4426j41621b5752k05749B35904a98534
9651d33773J62298c6325j81979O4071k3682A12169i6924o1566f9317A37810e65426
9639F863e0888l12481A6586e8270a2151k9444A38566a42834M5285l40274C77274
9627d5295e525k54215a18209N5594b6839B13075a33546O0756j42530L3319g4903
9615a75744A04804f7638k98022i4836r9587j12322d6923A91998c35344A81132
9604D7506Q1506b6916l11515j83490G7876a09163q4992h9355A26033f894o470
9593a3364C00806A29050M5333J6053M6846D0499J673J78457c03415B29507a41120
9581c1957B12064j0384d34102h0818m6849m2645D6944a80163R483A29568a3470
$$ y = [-240944, 200364, 32814, -228570, -179431, -125005, -266626, -25752, -231501, 235904, -198534, -433773, -271475, -36325, -218304, -154233, -177915, 112169, -96924, -158490, -69317, 137810, -565426, 6863, -50888, -363369, 16586, -58270, -12151, -41595, 138566, -142834, -97549, -437823, 377274, -45295, -5525, -259740, -118209, -62615, -26839, 213075, -133546, -72790, -215320, -182001, -74903, -175744, 104804, -67638, -365660, -94836, -194423, -306745, -46923, 191998, -335344, 181132, 47506, 129012, -26916, -338431, -521921, 77876, -109163, -194155, -89355, 126033, -6894, -13364, 300806, 129050, 174383, 190436, 237282, 40499, 42172, 220629, -303415, 229507, -141120, -31957, 212064, 201680, -434102, -80818, -127667, -170312, 46944, -180163, -170680, 129568, -13470]
9569a61399A01722i7205C6490b37985a00918D8747g4825j8070D8117a0831j03419
9558a14250p9136q8736n425E9791K93779I9793b1178p6246c2014C9863a30681
9546A11885b95831I6337J95658c2520D977a45676F8100a76294d2803j418A08727
9534A54014b2734p6362A8111R2916h9346C66091b7160k57674a09709m1953H5375
9522f3451q3300j2534I4804a05055q2773G1797b38389I7779e28234B518b59735
9510a5889A1611K43988a66646B92641e9390j05125b5135j74125N4763L4981O502
9499a03014j19203j39981A70411H4782L8919d724m04301a80982a7446j23436G4547
9487B77307o2130c23818i7634F5447a69803j09806B3004J81365l0653a25071A51693
$$ y = [-161399, 101722, -97205, 36490, -237985, -100918, 48747, -74825, -92895, 48117, -10831, -114250, -193386, -282122, -287547, 59791, 353570, 99793, -21178, -97424, -32014, 39863, -130681, 111885, -295831, 96337, 291995, -32520, 4977, -145676, 68100, -176294, -42803, -44221, 108727, 154014, -22734, -99096, 18111, 111027, -89346, 366091, -27160, -284834, -109709, -151662, 85375, -63451, -146751, -159285, 94804, -105055, -187828, 71797, -238389, 97779, -528234, 2518, -259735, -15889, 11611, 255599, -166646, 292641, -59390, -164515, -25135, -199260, -144497, -109516, -103014, -222217, -362198, 170411, 84782, 123701, -4724, -409025, -180982, -17446, -140882, 74547, 277307, 215177, -323818, -97634, 65447, -169803, -279609, 23004, 204369, 173716, -125071, 151693]
9475A36769h839o4241D1546a22255I4342e5267c169j63028A72494g7721A89818
9463a56295F340a95756I3150a44875G9822e843k4043A03811b00293L2217n5207
9452b23283Q1504g694B16743a26726j33824B0504c26192k9326A42657E8043c7813
9440e3499j74045q2817j5260e5617l37856J27285G0736c15236i6896H4579K9804
9429A14383a19956k456c0496D1690g7529l08810a25674K3230L2758j3230A63768
9417A25920c9047E8652M8694a48627C84272I7851b36036i9926F1263c39967F5541
9405g0059k24337A12834h6160b2166j68699j8433e7315k1517j8292j21144A43986
9393d356A02673a48385A00202a48515B76567e45811c4455B0149a4792r4729e2940
$$ y = [136769, -8839, -73080, 41546, -122255, 94342, -55267, -3169, -166197, 172494, -77721, 189818, -156295, 6340, -195756, 93150, -144875, 79822, -5843, -29886, 103811, -200293, -168076, -223283, -141779, -7694, 216743, -126726, -260550, 20504, -326192, -355518, 142657, 58043, -37813, -53499, -227544, -310361, -325621, -55617, -393473, -266188, 70736, -315236, -96896, 84579, 114383, -119956, -122412, -30496, 41690, -77529, -386339, -125674, -102444, -69686, -82916, 163768, 125920, -39047, 58652, 107346, -148627, 384272, 97851, -236036, -99926, 61263, -339967, 65541, -70059, -294396, 112834, -86160, -22166, -190865, -209298, -57315, -78832, -97124, -218268, 143986, -4356, 102673, -148385, 100202, -148515, 276567, -545811, -34455, 20149, -14792, -109521, -52940]
9381C10854A38663l3074b6453n7516Q819j09619J865B53520b95279i7344L821
9370i3523A55893b3522o6357K5315b7254p6063r154j43111E5926c28890a52162
9358i361p5625G854M3043f1893q0733i943k06782B26995J60295c1243B40322a06285
9345H2479i2592k49006a47312A10392N0048c09776I811a6612k10397r3418d9395
9333b54178j54668c662A48495b35078H3544a65508l28171F7691J36237H0266b3238
9321h6781J8504I1941l0600a72682j13577B46108a55396j10413J00261A86487
9310A45528f6276P402j72947C5151a87108E1127b22515l9760a19835d9086j13658
9299a62744j09796r5052C18009e3992B5332L9125a85439k19236R7301m7155a32972
$$ y = [310854, 138663, 105589, -26453, -83969, -75150, -184769, -182904, 253520, -295279, -97344, -93523, 155893, -23522, -89879, -64564, -27254, -103317, -112471, -255582, 55926, -328890, -152162, -9361, -84986, 7854, 50897, -61893, -142626, -9943, -216725, 226995, 387290, -31243, 240322, -106285, 82479, -92592, -341598, -147312, 110392, 160440, -309776, 9811, -16612, -227009, -320427, -49395, -254178, -408846, -3662, 148495, -235078, 83544, -165508, -493679, 67691, 203928, 80266, -23238, -86781, -68277, 91941, 61341, -172682, -286259, 246108, -155396, -265809, -165548, 186487, 145528, -66276, -58874, -231821, 35151, -187108, 51127, -222515, -262275, -119835, -49086, -162744, -272540, -367592, 318009, -53992, 25332, 64457, -185439, -404675, -307374, -354529, -132972]
9287h4810A13754d3721j9657R224J6156l27073J75234P1118k10577a06000A79683
9275c08056c1835l9029k4050A6444b29461N5784A26647D1811J08444b51839E2836
9263a27346q7077P1911D67460b71035B41256o9013g9678A42846b6298P004H6733
9251F7228J98508A30003e2017j31152A00947O7957e5403j0301A00527h2195B827
9239h2864C05278b415j56584G4409b47028k51404b13394M7009B94840b56779d4420
9227f9k756l53801g202k19369m9174J27910B946K52141c17287B7503R6371J43564
9215B67438a57979e9117J8017j19032a8791k37343A14960m1368a35150p9305g4059
9203E2214c09794A56662h3360A33213g7701q3134c5938j73443Q4227k8541A32213
$$ y = [-84810, 113754, -43721, -63378, -54154, -37998, -365071, -189837, -118719, -329296, -106000, 179683, -308056, -31835, -70864, -94914, 16444, -229461, -173677, 126647, 41811, 150255, -251839, 52836, -127346, -214423, -142512, 467460, -271035, 241256, 172243, -79678, 142846, -26298, -19294, 86733, 67228, 265736, 130003, -52017, -183169, 100947, 168904, -55403, -65704, 100527, -82195, 2827, -82864, 305278, -2415, -158999, 74409, -247028, -498432, -213394, -166385, 294840, -256779, -44420, -69, -2825, -356626, -7202, -226571, -275745, -147835, 2946, 255087, -317287, 27503, 123874, 267438, -157979, -59117, -41100, -160132, -18791, -256134, 114960, 73592, -135150, -214455, -74059, 52214, -309794, 156662, -83360, 133213, -77701, -160835, -35938, -209381, -125154, -153695, 132213]
9191E6034c36877g2831B1375J5374a9418B2640J11963j9096b98812M2129a16016
9179i5649L5271k12560I613a92678k36712A09943K16349A07960Q7062b07427A29667
9167A94812f4478o5475d429E9963J58003a22574D646K12638a77530A62363R7276
9156B59639f5434k17168N0856j51060F3760j7997c5196q4564A61602F0041a62774
9144A76793i3131j53932J08739B4496a61135A97591C4901a8481A03357i3686q5386
9133a79072B5387h1420k7909F4712c37167A57216a29308B10811e05p6053m08878
9122d85436K10933N892e2878j86612A6813g4182A42538a68752B79781J88691i320
9110C10551b82795j50109G4162I309Q3287B395L3794F257i4651B0370a38252B8066
$$ y = [56034, -336877, -72831, 21375, 36749, -19418, 22640, 134603, 115507, -298812, -256683, -116016, -95649, -60378, -272938, 9613, -192678, -429390, 109943, 326292, 107960, 195022, -207427, 129667, 194812, -64478, -129953, -4429, 59963, 217966, -122574, 4646, 217284, -177530, 162363, 259639, -65434, -282602, -231746, -382806, 63760, 45763, -35196, -119760, 161602, 60041, -162774, 176793, -93131, -247063, -138324, 24496, -161135, 197591, 34901, -18481, 103357, -93686, -179072, 25387, -81420, -109329, 64712, -337167, 157216, -129308, 210811, -505, -76558, -485436, -274503, -268611, -52878, -239490, 16813, -74182, 142538, -168752, 279781, 468472, -9320, 310551, -282795, -432904, 74162, 9309, 92596, 2395, 36189, 6257, -94651, 20370, -138252, 28066]
9097F9704d1688k429m22799J22415J37916m8594B47520c75644f6804E03a57336
9085a03479d3092A97255a54985p401G6848b95368j44549b13527g9296k20648C4951
9073d6179A5022b66321a22148N268j09809a00234M8660H3446k1600a29568j3012
9062a42580O5343A25105e930j42838A4246J16676a19768b0496k49283b2005j19958
9051a41963J4613n464e1291p331n8191j0901O2255k35912a36576B7831K54804
9040B82635A19402J3425h7718D3406b44990R6326e7211D7351J16844d2427A73837
9028f5172A14074e8397j36646Q0844k92954f3415b4739A12797a12371A42867b66772
9016A00356C208J88771b6949k48871O5674j28708J15736d8331K0478m18855A08592
$$ y = [69704, -41688, -44117, -466916, -344501, -206585, -255179, 247520, -375644, -66804, 503, -157336, -103479, -43092, 197255, -154985, -162386, 76848, -295368, -439917, -213527, -79296, -299944, 34951, -46179, 15022, -266321, -122148, -116880, -226689, -100234, -51574, 83446, 61846, -129568, -142580, -77237, 125105, -5930, -148768, 14246, 130922, -119768, -20496, -269779, -22005, -141963, -127350, -132814, -51291, -58622, -116813, -127714, -65459, -301371, -136576, 27831, 282635, 119402, 132827, -87718, 43406, -244990, -148664, -57211, 47351, 164195, -42427, 173837, -65172, 114074, -58397, -195043, -114199, -407153, -63415, -24739, 112797, -112371, 142867, -266772, 100356, 3208, 191979, -26949, -275820, -210146, -338854, -223118, -48331, -27853, -446708, 108592]
9004a9104F0258d46876D7285J45903a36459A02291K30878c2960D853c58658a60087
8992A82633G0500d1125p7324j1402H1616l6439h8073a8681m17772c4536n6269
8981i0805c9675C5917j7386b2968a0391l4081C24969g5367A05073j4387a03403
8969A32837f5171k52525O5764J20108i02r6402k12847M7596d397B27306c42890
8957A06606h6374c3962j56883J8994I1066L4985a98562a0118k68199A49995K7957
8946A77952a0096l6980p3047C3774f9716j70616g1330j25706f4298j55524R3484
8935a26338B34363f3637A05962B1395a22182G192P1275J1622l3722J84879J10572
8924C51818J233158K476031L850164r71565B892664I61318l43060B07122M8820
$$ y = [-19104, 60258, -446876, 47285, 193188, -136459, 102291, 333169, -32960, 4853, -358658, -160087, 182633, 70500, -41125, -118449, -129851, 81616, 45177, -88073, -18681, -436453, -34536, -90805, -39675, 35917, 18531, -22968, -10391, -44472, 324969, -75367, 105073, 90686, -103403, 132837, -65171, -317696, -251932, -131824, -902, -97304, -310151, -262555, -4397, 227306, -342890, 106606, -86374, -33962, -190845, -171851, 91066, 126051, -198562, -10118, -278317, 149995, 177952, -10096, -47076, -120123, 33774, -69716, -240332, -71330, -197036, -64298, -219822, -126338, 234363, -63637, 105962, 21395, -122182, 7192, 78467, 90089, 56367, 241246, 351818, 1584976, 4061007, 7911171, 6939606, 2892664, 961318, 618258, 207122, 255942]
8915B55942J00022b4851B5373L40017e7891C3433Q782h5415A84566a7094o7487
8904h4581k17518F3248b96155b0591q6927J632A01932O4686a73298D7965K416
8893E0381a26631A85717J23475C1575e8020B75642l6865e4396I3123J06519D2672
8881b97641J44421O9396D51726b31415e3675k27918a10000D1584K29711a0012
8870d8783B20681a35946F9528g1638j9503B44279p9492K3809R501p9500i2287
$$ y = [255942, 355964, -24851, 25373, 365390, -57891, 33433, 42215, -85415, 184566, -17094, -84581, -302099, 63248, -296155, -20591, -107518, -105886, 101932, 166618, -173298, 47965, 50381, -126631, 185717, 309192, 31575, -58020, 275642, 238777, -54396, 93123, 199642, 42672, -297641, -153220, -83824, 451726, -231415, -53675, -281593, -110000, 41584, 271295, -10012, -48783, 220681, -135946, 69528, -71638, -91141, 244279, 164787, 188596, 198097, 118597, -92287]
$$ [...]
##END NTUPLES=NMR SPECTRUM
##END=
