
##TITLE=AC1212_MSMAH12043_7154923_BGRbu6JN0Y
##JCAMPDX= 6.0         $$ Bruker NMR JCAMP-DX V2.0
##DATA TYPE= NMR SPECTRUM
##DATA CLASS= NTUPLES
##ORIGIN= BRUKER
##OWNER= Administrator
$$ 1.72 TOPSPIN		Version 2.1
$$ 2012-12-01 21:27:53.319 -0500  Administrator@X
$$ Compression mode = diff/dup
##.OBSERVE FREQUENCY= 400.02188249412
##.OBSERVE NUCLEUS= ^1H
##.ACQUISITION MODE= SIMULTANEOUS (DQD)
##.ACQUISITION SCHEME= undefined
##.AVERAGES= 64
##.DIGITISER RES= 22
##SPECTROMETER/DATA SYSTEM= spect
##.PULSE SEQUENCE= noesygpps1d.comp
##.SOLVENT NAME= COFFEE_meoh
##.SHIFT REFERENCE= INTERNAL, COFFEE_meoh, 1, 14.96081
##AUDIT TRAIL= $$ (NUMBER, WHEN, WHO, WHERE, PROCESS, VERSION, WHAT)
$$ ##TITLE= Audit trail, TOPSPIN		Version 2.1
$$ ##JCAMPDX= 5.01
$$ ##ORIGIN= Bruker BioSpin GmbH
$$ ##OWNER= Administrator
$$ $$ E:\/data/COFFEE/nmr/AC1212_MSMAH12043_7154923_BGRbu6JN0Y/12/pdata/1/auditp.txt
$$ ##AUDIT TRAIL=  $$ (NUMBER, WHEN, WHO, WHERE, PROCESS, VERSION, WHAT)
(   1,<2012-12-01 21:27:47.506 -0500>,<Administrator>,<X>,<go>,<TOPSPIN 2.1>,
      <created by zg
	started at 2012-12-01 21:16:17.428 -0500,
	POWCHK enabled, PULCHK disabled,
       configuration hash MD5:
       86 BA 57 50 F2 9D 5C 9B 26 00 A9 28 5F 66 2E 89
       data hash MD5: 64K
       BC 0B 43 EA A5 74 2A 0E EA 00 E6 EB 5D BD B0 14>)
(   2,<2012-12-01 21:27:50.553 -0500>,<Administrator>,<X>,<proc1d>,<TOPSPIN 2.1>,
      <Start of raw data processing
       efp LB = 0.3 FT_mod = 6 PKNL = 1 PHC0 = 0 PHC1 = 0 SI = 128K 
       data hash MD5: 128K
       F4 70 E6 7A 8F 38 A8 D3 32 7C FF 61 FD 0C 1A E6>)
(   3,<2012-12-01 21:27:51.631 -0500>,<Administrator>,<X>,<proc1d>,<TOPSPIN 2.1>,
      <pk PHC0 = -78.49182 PHC1 = 0 
       data hash MD5: 128K
       12 35 6A D4 A6 EE 13 7F 60 D3 ED C7 CA A7 09 B4>)
(   4,<2012-12-01 21:27:52.319 -0500>,<Administrator>,<X>,<proc1d>,<TOPSPIN 2.1>,
      <abs ABSG = 1 
       data hash MD5: 128K
       52 18 DF BD 6C 01 E5 33 E9 BF 3B 22 48 64 86 51>)
(   5,<2012-12-01 21:27:52.506 -0500>,<Administrator>,<X>,<proc1d>,<TOPSPIN 2.1>,
      <abs ABSG = 2 
       data hash MD5: 128K
       74 8A BF 26 3F 82 27 89 19 E4 4D 88 72 52 A5 FF>)
(   6,<2012-12-01 21:27:52.647 -0500>,<Administrator>,<X>,<proc1d>,<TOPSPIN 2.1>,
      <abs ABSG = 3 
       data hash MD5: 128K
       BB B9 BE 1B 69 C2 C9 47 8F D0 DD 7D 19 35 E5 44>)
(   7,<2012-12-01 21:27:52.788 -0500>,<Administrator>,<X>,<proc1d>,<TOPSPIN 2.1>,
      <abs ABSG = 4 
       data hash MD5: 128K
       7D D2 52 0F 3D 53 82 2D BF DC 1A 9F CB 1F 96 41>)
(   8,<2012-12-01 21:27:52.959 -0500>,<Administrator>,<X>,<proc1d>,<TOPSPIN 2.1>,
      <abs ABSG = 5 
       data hash MD5: 128K
       BE E1 95 39 CA AA B5 12 D3 7E FA E7 59 DA F0 E2>)
$$ ##END=
$$ 
$$ $$ hash MD5
$$ $$ C1 C7 82 07 F5 8B 7A 94 7B 6B F3 04 DD B7 E2 55
##$RELAX= 
##$RELAX= 
##$RELAX= 
##$RELAX= 
##$RELAX= 
##$RELAX= 
##$RELAX= 
##$RELAX= 
$$ Bruker specific parameters
$$ --------------------------
##$DU= <E:\>
##$EXPNO= 12
$$ [...]
##$TP07= 0
##$TPNAME0= <>
##$TPNAME1= <>
##$TPNAME2= <>
##$TPNAME3= <>
##$TPNAME4= <>
##$TPNAME5= <>
##$TPNAME6= <>
##$TPNAME7= <>
##$TPOAL= (0..7)
0.5 0.5 0.5 0.5 0.5 0.5 0.5 0.5
##$TPOFFS= (0..7)
0 0 0 0 0 0 0 0
##$TUNHIN= 0
##$TUNHOUT= 0
##$TUNXOUT= 0
##$USERA1= <user>
##$USERA2= <user>
##$USERA3= <user>
##$USERA4= <user>
##$USERA5= <user>
##$V9= 5
##$VALIST= <valist>
##$VCLIST= <CCCCCCCCCCCCCCC>
##$VD= 0
##$VDLIST= <DDDDDDDDDDDDDDD>
##$VPLIST= <PPPPPPPPPPPPPPP>
##$VTLIST= <TTTTTTTTTTTTTTT>
##$WBST= 1024
##$WBSW= 4
##$XGAIN= (0..3)
0 0 0 0
##$XL= 0
##$YL= 0
##$YMAX_a= 5698373
##$YMIN_a= -11719227
##$ZGOPTNS= <>
##$ZL1= 120
##$ZL2= 120
##$ZL3= 120
##$ZL4= 120
##$ABSF1= 14.96081
##$ABSF2= -5.597372
##$ABSG= 5
##$ABSL= 3
##$ALPHA= 0
##$AQORDER= 0
##$ASSFAC= 0
##$ASSFACI= 0
##$ASSFACX= 0
##$ASSWID= 0
##$AUNMP= <proc_prof1d_extract.lims>
##$AXLEFT= 0
##$AXNAME= <>
##$AXNUC= <1H>
##$AXRIGHT= 0
##$AXTYPE= 0
##$AXUNIT= <>
##$AZFE= 0.1
##$AZFW= 0.1
##$BCFW= 0
##$BC_mod= 0
##$BYTORDP= 0
##$COROFFS= 0
##$CY= 15
##$DATMOD= 1
##$DC= 0
##$DFILT= <>
##$DTYPP= 0
##$F1P= 0
##$F2P= 0
##$FCOR= 0.5
##$FTSIZE= 131072
##$FT_mod= 6
##$GAMMA= 0
##$GB= 0
##$INTBC= 1
##$INTSCL= 1
##$ISEN= 128
##$LB= 0.3
##$LEV0= 0
##$LPBIN= 0
##$MAXI= 10000
##$MC2= 0
##$MEAN= 0
##$ME_mod= 0
##$MI= 0
##$NCOEF= 0
##$NC_proc= -2
##$NLEV= 6
##$NOISF1= 0
##$NOISF2= 0
##$NSP= 0
##$NTH_PI= 0
##$NZP= 0
##$OFFSET= 14.96081
##$PC= 1
##$PHC0= -78.49182
##$PHC1= 0
##$PH_mod= 1
##$PKNL= yes
##$PPARMOD= 0
##$PPDIAG= 0
##$PPIPTYP= 0
##$PPMPNUM= 2147483647
##$PPRESOL= 1
##$PSCAL= 4
##$PSIGN= 0
##$PYNMP= <proc.py>
##$REVERSE= no
##$SF= 400.020009713691
##$SI= 131072
##$SIGF1= 0
##$SIGF2= 0
##$SINO= 400
##$SIOLD= 131072
##$SPECTYP= <>
##$SREGLST= <1H.CDCl3>
##$SSB= 0
##$STSI= 131072
##$STSR= 0
##$SW_p= 8223.68421052631
##$SYMM= 0
##$S_DEV= 0
##$TDeff= 65536
##$TDoff= 0
##$TI= <>
##$TILT= no
##$TM1= 0
##$TM2= 0
##$TOPLEV= 0
##$USERP1= <user>
##$USERP2= <user>
##$USERP3= <user>
##$USERP4= <user>
##$USERP5= <user>
##$WDW= 1
##$XDIM= 131072
##$YMAX_p= 338522100
##$YMIN_p= -10917
##$CURPLOT= <Network HP LaserJet P1505>
##$CURPRIN= <$Network HP LaserJet P1505>
##$DFORMAT= <normdp>
##$LAYOUT= <+/1D_H.xwp>
##$LFORMAT= <normlp>
##$PFORMAT= <normpl>
##$SURQMSG= 1
$$ End of Bruker specific parameters
$$ ---------------------------------
##NTUPLES= NMR SPECTRUM
##VAR_NAME=  FREQUENCY,     SPECTRUM/REAL,   SPECTRUM/IMAG
##SYMBOL=    X,             R,               I
##VAR_TYPE=  INDEPENDENT,   DEPENDENT,       DEPENDENT
##VAR_FORM=  AFFN,          ASDF,            ASDF
##VAR_DIM=   131072,        131072,          131072
##UNITS=     HZ,            ARBITRARY UNITS, ARBITRARY UNITS
##FACTOR=    0.0627417313425164, 1,          1
##FIRST=     8223.62146879497, -908,         -50473
##LAST=      0,             -102,            -51330
##MIN=       0,             -10917,          0
##MAX=       8223.62146879497, 338522100,    0
$$ Real data points
##PAGE= N=1
##DATA TABLE= (X++(R..R)), XYDATA
$$ [...]
63998B69144k131k983l953m054l055j738j039j020r48l14N45J056J287J856L008
$$ 269144 267013 264030 260077 256023 252968 251230 250191 249171 248223 247909 248454 249510 250797 252653 255661
63983B55661M211M781M581L967L360L144L683M947O239O725O341N892O136P002
$$ 255661 259872 264653 269234 273201 276561 279705 283388 288335 294574 301299 307640 313532 319668 326670
63969C26670P873Q353Q555Q791R239R907J0704J1466J2088J2696J3636J5194J7343
$$ 326670 334543 342896 351451 360242 369481 379388 390092 401558 413646 426342 439978 455172 472515
63956D72515J9795K2247K4618K7125L0171L4055L8708M3845M9471N6085O4149
$$ 472515 492310 514557 539175 566300 596471 630526 669234 713079 762550 818635 882784
63945H82784P3423Q3119R2715J02287J12007J21681J30931J39491J46981J52757
$$ 882784 956207 1039326 1132041 1234328 1346335 1468016 1598947 1738438 1885419 2038176
63935B038176J56372J58009J57935J55641J50033J40570J27788J12501R4876P4639
$$ 2038176 2194548 2352557 2510492 2666133 2816166 2956736 3084524 3197025 3291901 3366540
63925C366540N2000K8090M341j8487m0618o2516q3806j03171j19427j32403j42429
$$ 3366540 3418540 3446630 3450971 3432484 3391866 3329350 3245544 3142373 3022946 2890543 2748114
63914B748114j49406j52943j53281j51316j47597j41980j34405j25419j15664
$$ 2748114 2598708 2445765 2292484 2141168 1993571 1851591 1717186 1591767 1476103
63905A476103j05447r5166q5514p6750o8198n9179n0185m2553l7040l3212l0134
$$ 1476103 1370656 1275490 1189976 1113226 1045028 985849 935664 893111 856071 822859 792725
63894G92725k7247k4558k2341k0726j9442j8112j6790j5952j5672j5236j3973
$$ 792725 765478 740920 718579 697853 678411 660299 643509 627557 611885 596649 582676
63883E82676j2151j0523r206p612n432l083j158K43J513L200N568Q218J0280J1370
$$ 582676 570525 560002 550796 543184 537752 534669 533511 533754 535267 538467 544035 552253 562533 573903
63869E73903J2179J3660J5796J7708J8901J9650K0184K0196J9463J8310J7091
$$ 573903 586082 599742 615538 633246 652147 671797 691981 712177 731640 749950 767041
63858G67041J5715J4032J2289J0679Q854O346L318M40j889l844n805p995j0439
$$ 767041 782756 796788 809077 819756 828610 834956 838274 838714 836825 832981 827176 819181 808742
63845H08742j2939j5128j6777j8097j9461k0860k1872k2297k2522k3046k3724
$$ 808742 795803 780675 763898 745801 726340 705480 683608 661311 638789 615743 592019
63834E92019k3933k3390k2496k1668k0729j9345j7813j6842j6540j6236j5496
$$ 592019 568086 544696 522200 500532 479803 460458 442645 425803 409263 393027 377531
63823C77531j4638j3962j3081j1568r785q443p634o964o433o427o883p136o726
$$ 377531 362893 348931 335850 324282 314497 306054 298420 291456 285023 278596 271713 264577 257851
63810B57851n830m904m310m260m551m465l499k155j361j235j109p71p68j374k108
$$ 257851 252021 247117 242807 238547 233996 229531 226032 223877 222516 221281 220172 219401 218633 217259 215151
63795B15151k564k857k940k417j461r97j394j829j586j193j398j826j641r82o55
$$ 215151 212587 209730 206790 204373 202912 201915 200521 198692 197106 195913 194515 192689 191048 190066 189411
63780A89411q03r05q78j076j363j158m71N7J56J08p7o95j393j242j12Q79Q68M22
$$ 189411 188608 187703 186825 185749 184386 183228 182757 182814 182970 183078 183001 182306 180913 179671 179559 180438 181306 181728
63762A81728N34J107J141K27q85j175m20O49J044M64l80n38N7N63L83o0K5P04
$$ 181728 182262 183369 184510 184737 183852 182677 182257 182906 183950 184414 184034 183496 183553 184116 184499 184439 184464 185168
63744A85168J260J040J18q07r95k75P86J402J329J008R68J340J926K429K519K104
$$ 185168 186428 187468 187586 186779 185784 185509 186295 187697 189026 190034 191002 192342 194268 196697 199216 201320
63728B01320J677J974L028L946L935L235K666K580K732K921L222L553L582L201
$$ 201320 202997 204971 207999 211945 215880 219115 221781 224361 227093 230014 233236 236789 240371 243572
63714B43572K795K783L121L373L162K414J257j76j724l042l600l138k094j369
$$ 243572 246367 249150 252271 255644 258806 261220 262477 262301 260577 257535 253935 250797 248703 247334
63700B47334j447j966k314k407k497k461j764k37J485K587K864K725K551K410
$$ 247334 245887 243921 241607 239200 236703 234242 232478 232241 233726 236313 239177 241902 244453 246863
63686B46863K256K142K106K063J946J854J918K079K100J871J534J301J148P95
$$ 246863 249119 251261 253367 255430 257376 259230 261148 263227 265327 267198 268732 270033 271181 271976
63672B71976K8r44j505j210l28L89N83P17J365K284K643K098J133L25k22n45n58
$$ 271976 272004 271060 269555 268345 268017 268406 268989 269706 271071 273355 275998 278096 279229 279554 279332 278787 278229
63655B78229n45j301l132n046n643m719l319k370j961j987k563l452l759k844
$$ 278229 277684 276383 273251 268205 262562 257843 254524 252154 250193 248206 245643 242191 238432 235588
63641B35588j200L0K75o6k51J05R00J749K361K762L148L531L718L652L539L577
$$ 235588 234388 234418 234693 234627 234376 234481 235381 237130 239491 242253 245401 248932 252650 256302 259841 263418
63625B63418L836M448N523O776P606P805P841Q257R055R931J0778J1642J2503
$$ 263418 267254 271702 277225 284001 291607 299412 307253 315510 324565 334496 345274 356916 369419
63612C69419J3388J4492J5870J7335J8869K0760K3002K4959K6169K7072K8339
$$ 369419 382807 397299 413169 430504 449373 470133 493135 518094 544263 571335 599674
63601E99674K9720L0189K9092K6545K2852J8314J3656R760O717L706K24l186n744
$$ 599674 629394 659583 688675 715220 738072 756386 770042 779802 786519 790225 790449 787263 781519
63588G81519p460q848j0121j1239j2466j4207j6353j8321j9823k1085k2218k2840
$$ 781519 774059 765211 755090 743851 731385 717178 700825 682504 662681 641596 619378 596538
63576E96538k2604k1753k0851k0051j8965j7219j4866j2188r351o458l821j918
$$ 596538 573934 552181 531330 511279 492314 475095 460229 448041 438690 432232 428411 426493
63564D26493r48n09J60J544L412N028N861O166O696P856R275J0443J1493J2978
$$ 426493 425545 425036 425196 426740 430152 435180 441041 447207 453903 461759 471034 481477 492970 505948
63550E05948J4952J6791J8125J9442K1426K4027K6619K8875L1002L3157L5057
$$ 505948 520900 537691 555816 575258 596684 620711 647330 676205 707207 740364 775421
63539G75421L6166L5897L3613K8845K1850J3749N915p41n877r370j1217j1732
$$ 775421 811587 847484 881097 909942 931792 945541 951456 950715 944838 935468 924251 912519
63527I12519j1632j1642j2060j2796j3836j5454j7843k0693k3496k6099k8617
$$ 912519 900887 889245 877185 864389 850553 835099 817256 796563 773067 746968 718351
63516G18351l0821l2102l2202l1541l0572k9197k7191k4837k2674k0809j8925
$$ 718351 687530 655428 623226 591685 561113 531916 504725 479888 457214 436405 417480
63505D17480j6872j4817j3008j1669j0966j0644r876p998n420l337k547k809l339
$$ 417480 400608 385791 372783 361114 350148 339504 329628 321630 316210 312873 310326 307517 304178
63492C04178l555l353k970k627k150j153K05J100J133J015J482K011J629O49M50
$$ 304178 300623 297270 294300 291673 289523 288370 288575 289675 290808 291823 293305 295316 296945 297594 298044
63477B98044J460K646L225L591M044L934K915J996K214K959K814J536P9r88j926
$$ 298044 299504 302150 305375 308966 313010 316944 319859 321855 324069 327028 329842 331378 331457 330469 328543
63462C28543k836l369l543l870m402m501l850l006k536k234j566n26L86P60N99
$$ 328543 325707 322338 318795 314925 310523 306022 302172 299166 296630 294396 292830 292304 292690 293450 294049
63447B94049K58K74J068K584M326N773O703P188P584Q408R896J1654J3105J4251
$$ 294049 294307 294581 295649 298233 302559 308332 315035 322223 329807 338215 348111 359765 372870 387121
63433C87121J5693J7886K0704K3709K6432K8277K8645K7413K5038K2036J8628
$$ 387121 402814 420700 441404 465113 491545 519822 548467 575880 600918 622954 641582
63422F41582J4990J1568Q894P269O807P551R469J2451J6307K0635K4676K7698
$$ 641582 656572 668140 677034 684303 691110 698661 708130 720581 736888 757523 782199 809897
63410H09897K9597L0779L1357L0838K8773K5302K0762J5200Q732K135l452p450
$$ 809897 839494 870273 901630 932468 961241 986543 1007305 1022505 1031237 1033372 1029920 1022470
63398A022470j0137j2043j3452j4548j5716j7412j9750k2411k4936k7124k9122
$$ 1022470 1012333 1000290 986838 972290 956574 939162 919412 897001 872065 844941 815819
63387H15819l1119l2980l4152l4053l2539l0076k7485k5356k3583k1527j8752
$$ 815819 784700 751720 717568 683515 650976 620900 593415 568059 544476 522949 504197
63376E04197j5571j2682j0337q154n787l425j484j9J295K724M302N992P823R776
$$ 504197 488626 475944 465607 457453 451666 448241 446757 446738 448033 450757 455059 461051 468874 478650
63362D78650J1748J3665J5591J7616J9692K1655K3472K5366K7596L0044L2233
$$ 478650 490398 504063 519654 537270 556962 578617 602089 627455 655051 685095 717328
63351G17328L3774L4679L5088L4790L3307L0417K6406K1779J6915J1998P130K401
$$ 717328 751102 785781 820869 855659 888966 919383 945789 967568 984483 996481 1003611 1006012
63339A006012k023n861q866j1004j2470j3550j4576j5851j7515j9579k2122k5178
$$ 1006012 1003989 998128 989262 978258 965788 952238 937662 921811 904296 884717 862595 837417
63327H37417k8232l0242l0636l0010k9300k8477k6739k3921k0857j8129j5247
$$ 837417 809185 778943 748307 718297 688997 660520 633781 609860 589003 570874 555627
63316E55627j1591p653m749l759m578o564r085j1727j4314j6714j8534j9253j8745
$$ 555627 544036 536383 531634 527875 523297 516733 507648 495921 481607 464893 446359 427106 408361
63303D08361j7363j5414j2962j0386q502p627p052n952m546l715l794m352m899
$$ 408361 390998 375584 362622 352236 343734 336107 329055 323103 318557 314842 311048 306696 301797
63290C01797n161m830l806k638k042j956j798j534j723k383k700k244j609j448
$$ 301797 296636 291806 288000 285362 283320 281364 279566 278032 276309 273926 271226 268982 267373 265925
63276B65925j493j127m12R3K13K57M23O31P73P61M53o2l49j20L51O60Q85J323
$$ 265925 264432 263305 262893 262986 263199 263456 263879 264510 265283 266044 266497 266435 266086 265966 266317 266977 267862 269185
63258B69185J924K417K799L154L229K851K617L329M693N407M835L889L833M751
$$ 269185 271109 273526 276325 279479 282708 285559 288176 291505 296198 301605 306440 310329 314162 318913
63244C18913N818O570P278Q275R570J1045J2517J3634J4122J4253J4651J5598
$$ 318913 324731 331301 338579 346854 356424 367469 379986 393620 407742 421995 436646 452244
63232D52244J6820J7976J9045K0088K0968K1495K1685K1769K2002K2472K2973
$$ 452244 469064 487040 506085 526173 547141 568636 590321 612090 634092 656564 679537
63221F79537K3126K2844K2559K2670K2780K1965J9976J7751J6395J5859J5001
$$ 679537 702663 725507 748066 770736 793516 815481 835457 853208 869603 885462 900463
63210I00463J2729Q883M081q14n162q839j2274j6023k0155k4034k6708k7582k6864
$$ 900463 913192 922075 926156 925342 920180 911341 899067 883044 862889 838855 812147 784565 757701
63197G57701k5414k3973k2516k0513j7907j5356j3254j0973p650l496L19L069
$$ 757701 732287 708314 685798 665285 647378 632022 618768 607795 600145 596649 596968 600037
63185F00037N106P040Q953J0748J2647J4776J6630J7484J7359J7050J7287J8072
$$ 600037 605143 612183 621136 631884 644531 659307 675937 693421 710780 727830 745117 763189
63173G63189J8869J9109J8542J7360J6066J4980J3878J2255R902P006L670l17
$$ 763189 782058 801167 819709 837069 853135 868115 881993 894248 904150 911156 914826 914509
63161I14509n013r841j3984j7236k0184k3381k6549k8874k9952l0118k9799k8968
$$ 914509 909496 899655 885671 868435 848251 824870 798321 769447 739495 709377 679578 650610
63149F50610k7509k5771k4309k3193k2016k0500j8742j6809j4670j2580j1066
$$ 650610 623101 597330 573021 549828 527812 507312 488570 471761 457091 444511 433445
63138D33445j0205r326p829o029m741m225l994l542k882k258j741j249p78l94
$$ 433445 423240 413914 406085 400056 395315 391090 387096 383554 380672 378414 376673 375424 374646 374252
63124C74252q5K39O23R98J290J562K012K698L356L630L454L113K867K742K681
$$ 374252 374167 374406 375029 376027 377317 378879 380891 383589 386945 390575 394029 397142 400009 402751 405432
63109D05432K670K690K725K834L024L098K901K694K872L261L224K556J799J374
$$ 405432 408102 410792 413517 416351 419375 422473 425374 428068 430940 434201 437425 439981 441780 443154
63095D43154J008M16j8J95Q25J258J364J395J366J100P96P85R02P52N11O84J161
$$ 443154 444162 444578 444560 444755 445580 446838 448202 449597 450963 452063 452859 453644 454546 455298 455809 456493 457654
63078D57654J279R61R60J689K615L174L639M556N856P077Q110R153J0160J0878
$$ 457654 458933 459894 460854 462543 465158 468332 471971 476527 482383 489460 497570 506723 516883 527761
63064E27761J1358J2062J3386J5271J7162J8432J9079K0058K2397K5857K8988
$$ 527761 539119 551181 564567 579838 597000 615432 634511 654569 676966 702823 731811
63053G31811L0910L2462L5037L8661M2042M4358M6157M8302N0697N2518N3305
$$ 731811 762721 795183 830220 868881 910923 955281 1001438 1049740 1100437 1152955 1206260
63042A206260N3401N3317N3091N2432N1386N0593N0665N1395N1879N1406M9956
$$ 1206260 1259661 1312978 1366069 1418501 1469887 1520480 1571145 1622540 1674419 1725825 1775781
63031A775781M7727M4534M0036L4341K7916K0985J3295M555n150j5376k5579l5264
$$ 1775781 1823508 1868042 1908078 1942419 1970335 1991320 2004615 2009170 2004020 1988644 1963065 1927801
63019A927801m4072n1691n7721o1726o3551o3468o1777n8496n3690m7939m2033
$$ 1927801 1883729 1832038 1774317 1712591 1649040 1585572 1523795 1465299 1411609 1363670 1321637
63008A321637l6210l0114k3570j6992j0787m770J420P538J2883J7156K0714K3867
$$ 1321637 1285427 1255313 1231743 1214751 1203964 1199194 1200614 1208152 1221035 1238191 1258905 1282772
62996A282772K6397K8124K9537L1321L3348L4680L4655L3511L1794K9718K7425
$$ 1282772 1309169 1337293 1366830 1398151 1431499 1466179 1500834 1534345 1566139 1595857 1623282
62985A623282K5306K3448K1037J7034J1337M696k466j0337j8747k6739l3570l9546
$$ 1623282 1648588 1672036 1693073 1710107 1721444 1726140 1723674 1713337 1694590 1667851 1634281 1594735
62973A594735m5329n0849n5379n8374n9724n9463n7825n5468n3043n0571m7605
$$ 1594735 1549406 1498557 1443178 1384804 1325080 1265617 1207792 1152324 1099281 1048710 1001105
62962A001105m4024m0241l6685l3461l0556k7980k5671k3578k1806k0351j8800
$$ 1001105 957081 916840 880155 846694 816138 788158 762487 738909 717103 696752 677952
62951F77952j6745j4625j3527j3899j4825j4974j4049j2918j2449j2606j2716
$$ 677952 661207 646582 633055 619156 604331 589357 575308 562390 549941 537335 524619
62940E24619j2281j1348j0196q993p794o822o467o837p455p598o966n848m636
$$ 524619 512338 500990 490794 481801 474007 467185 460718 453881 446426 438828 431862 426014 421378
62927D21378l470k431j835j980k690l342l408k832j884r08k86l56j056j759j813
$$ 421378 417908 415477 413642 411662 408972 405630 402222 399390 397506 396598 396312 395956 394900 393141 391328
62912C91328j309r30j060j329j266r68p80o68m47l88j005k157l027l105k698k297
$$ 391328 390019 389089 388029 386700 385434 384466 383686 383018 382571 382183 381178 379021 375994 372889 370191 367894
62896C67894j942j516j173j024p32J8R56J476J417J160J087J259J567J851J857
$$ 367894 365952 364436 363263 362239 361507 361525 362481 363957 365374 366534 367621 368880 370447 372298 374155
62881C74155J388N58k18n33l03J23J68l71r23p11J79P63M00m28q58o48n8P26J411
$$ 374155 375543 376101 375883 375350 375047 375170 375338 374967 374044 373333 373512 374275 374675 374247 373389 372741 372683 373409 374820
62862C74820J387M45o11q32m07k52n84p99o88p48j111j154n44J88N21O87J051
$$ 374820 376207 376652 376041 375209 374802 374550 373966 373167 372479 371731 370620 369466 368922 369110 369631 370318 371369
62845C71369J395J361J130J097J208J090O33Ko45j156j297j014n27j6M89Q40P32
$$ 371369 372764 374125 375255 376352 377560 378650 379283 379285 378640 377484 376187 375173 374646 374630 375119 375959 376691
62828C76691K03l01n11m82q9R83K347K896K254J538J820K528K381J457J094J877
$$ 376691 376894 376593 376082 375600 375511 376494 378841 381737 383991 385529 387349 389877 392258 393715 394809 396686
62812C96686K884L217L162L420L967M287M222M057M080M413N028N737O381P108
$$ 396686 399570 402787 405949 409369 413336 417623 421845 425902 429982 434395 439423 445160 451541 458649
62798D58649Q117R129R649R844J0580J2240J4150J5585J6855J8715K1164K3523
$$ 458649 466766 475895 485544 495388 505968 518208 532358 547943 564798 583513 604677 628200
62786F28200K5596K8009L1303L5296L9500M3744M8175N2897N7842O2837O7609
$$ 628200 653796 681805 713108 748404 787904 831648 879823 932720 990562 1053399 1121008
62775A121008P1890P5577P8653Q0873Q1688Q0632P7622P2825O6306N7968M7741
$$ 1121008 1192898 1268475 1347128 1428001 1509689 1590321 1667943 1740768 1807074 1865042 1912783
62764A912783L5760K2421Q366n593j8751l0774m1711n1674o0542o7963p3616p7320
$$ 1912783 1948543 1970964 1979330 1973737 1954986 1924212 1882501 1830827 1770285 1702322 1628706 1551386
62752A551386p8982p8618p6616p3823p1001o8150o4633o0130n5213n0707m6772
$$ 1551386 1472404 1393786 1317170 1243347 1172346 1104196 1039563 979433 924220 873513 826741
62741H26741m2990l9169l5571l2343k9188k5847k2545j9671j7326j5397j3837
$$ 826741 783751 744582 709011 676668 647480 621633 599088 579417 562091 546694 532857
62730E32857j2548j1252r754q202o822n570m335l272k528j798o03J054K745M211
$$ 532857 520309 509057 499303 491101 484279 478709 474374 471102 468574 466776 466173 467227 469972 474183
62716D74183N395O086O198O386P582R709J1661J2933J4382J6821J9666K1950K4014
$$ 474183 479578 485664 491862 498248 505830 515539 527200 540133 554515 571336 591002 612952 636966
62703F36966K7074L1325L5661L9329M2799M6663N0689N4450N8104O1840O5121
$$ 636966 664040 695365 731026 770355 813154 859817 910506 964956 1023060 1084900 1150021
62692A150021O7164O7857O7582O6332O3635N9226N3275M5953L7312K7604J7240
$$ 1150021 1217185 1285042 1352624 1418956 1482591 1541817 1595092 1641045 1678357 1705961 1723201
62681A723201O298n512j8021l0134m0548m8923n5916o2086o7080p0132p1012p0150
$$ 1723201 1729499 1723987 1705966 1675832 1635284 1586361 1530445 1468359 1401279 1331147 1260135 1189985
62669A189985o8015o4851o1104n7483n4282n0973m6962m2506l8468l5235l2402
$$ 1189985 1121970 1057119 996015 938532 884250 833277 786315 743809 705341 670106 637704
62658F37704k9483k6491k3686k1177j8983j7126j5473j3684j1572r473q068p826
$$ 637704 608221 581730 558044 536867 517884 500758 485285 471601 460029 450556 442488 434662
62646D34662q482r059q587p027n303m237l720l231k782k788l237l604l526k961
$$ 434662 426180 417121 408534 401507 396204 391967 388247 385016 382234 379446 376209 372605 369079 366118
62632C66118j892n14M28L63j14P5P60O80m27j149m70P36J131Q20O68O71L05r3
$$ 366118 364226 363712 364140 364503 364389 364464 365224 365904 365477 364328 363858 364594 365725 366545 367213 367884 368189 368096
62614C68096K73J173J670J804K586M299O019P120Q010R098J0088J0800J1672J2909
$$ 368096 368369 369542 371212 373016 375602 379901 385920 393040 401050 410148 420236 431036 442708 455617
62600D55617J4019J4855J6262J8940K2228K4828K6394K7655K9308L1407L3695
$$ 455617 469636 484491 500753 519693 541921 566749 593143 620798 650106 681513 715208
62589G15208L5900L7708L8804L8955L7849L5096L0664K5120J9117J2896O475M4
$$ 715208 751108 788816 827620 866575 904424 939520 970184 995304 1014421 1027317 1033792 1033836
62577A033836o202j2354j8513k4328k9172l2639l4658l5409l5447l5562l6051
$$ 1033836 1027634 1015280 996767 972439 943267 910628 875970 840561 805114 769552 733501
62566G33501l6226l5150l2802l0027k7446k4926k2186j9446j7169j5507j4214
$$ 733501 697275 662125 629323 599296 571850 546924 524738 505292 488123 472616 458402
62555D58402j3002j1738j0394q966p475o082n109m800m919m752l760k195q65k99
$$ 458402 445400 433662 423268 414302 406827 400745 395636 390836 385917 381165 377405 375210 374345 374046
62541C74046l32m75m42k71m4K56P28J358J891J978J585J157J221J822K522L038
$$ 374046 373714 373239 372797 372526 372482 372738 373466 374824 376715 378693 380278 381435 382656 384478 387000 390038
62525C90038L650M836O624Q488R953J1181J2826J5308J8320K1099K3149K4660
$$ 390038 393688 398524 405148 413636 423589 434770 447596 462904 481224 502323 525472 550132
62513E50132K6198K8152L0467L2839L4981L6702L7828L8158L7591L6189L4006
$$ 550132 576330 604482 634949 667788 702769 739471 777299 815457 853048 889237 923243
62502I23243L0846K6425K0816J4569Q226J932m346j0341j5576j9762k2818k4606
$$ 923243 954089 980514 1001330 1015899 1024125 1026057 1021711 1011370 995794 976032 953214 928608
62490I28608k5050k4463k3324k1678j9226j6117j3084j0516p819m212J41M264
$$ 928608 903558 879095 855771 834093 814867 798750 785666 775150 767331 763119 763260 767524
62478G67524P553J0383J3489J7037K0373K2603K3343K3003K2195K0950J8756J5366
$$ 767524 775077 785460 798949 815986 836359 858962 882305 905308 927503 948453 967209 982575
62466I82575J1179O616J608l902r349j4033j8004k1875k5815k9326l2037l4139
$$ 982575 993754 1000370 1001978 998076 988727 974694 956690 934815 909000 879674 847637 813498
62454H13498l5820l6759l6490l4999l2760l0350k8131k6025k3604k0588j7342
$$ 813498 777678 740919 704429 669430 636670 606320 578189 552164 528560 507972 490630
62443D90630j4506j2198r997p787o018m881l846k472j165n40l88L4Q91J598J756
$$ 490630 476124 463926 453929 446142 440124 435243 431397 428925 427760 427220 426832 426866 427757 429355 431111
62428D31111J530J060J54j165k375l127l766m703n685o132o023n923o177o483
$$ 431111 432641 433701 433855 432690 430315 427188 423422 418719 413034 406902 400879 394956 388779 382296
62414C82296o382n793m980m263l900l998m321m346l697k565j612j451k170l224
$$ 382296 375914 370121 365141 360878 356978 352980 348659 344313 340616 338051 336439 334988 332818 329594
62400C29594l721l063j470J26Q63O50J23o1K06N85Q09R73J320J830K186K179K015
$$ 329594 325873 322810 321340 321466 322329 322979 323102 323041 323247 323832 324641 325614 326934 328764 330950 333129 335144
62383C35144K057K334K484K256J859J774K246L106L999M733N395O138O910P466
$$ 335144 337201 339535 342019 344275 346134 347908 350154 353260 357259 361992 367387 373525 380435 387901
62369C87901P693P884Q521R839J1646J3546J5236J6662J8065J9858K2296K5224
$$ 387901 395594 403478 411999 421838 433484 447030 462266 478928 496993 516851 539147 564371
62357E64371K8329L1511L4823L8121M1106M3798M6501M9163N1108N1691N0869
$$ 564371 592700 624211 659034 697155 738261 782059 828560 877723 928831 980522 1031391
62346A031391M8885M5664M0935L4755K7533J9635J1289K840n266j2703j9306k4932
$$ 1031391 1080276 1125940 1166875 1201630 1229163 1248798 1260087 1262927 1257661 1244958 1225652 1200720
62334A200720k9558l3453l6902l9820m1826m2681m2419m1156l9070l6510l3763
$$ 1200720 1171162 1137709 1100807 1060987 1019161 976480 934061 892905 853835 817325 783562
62323G83562l0791k7472k4084k1185j9018j7379j6108j5337j5157j5336j5468
$$ 783562 752771 725299 701215 680030 661012 643633 627525 612188 597031 581695 566227
62312E66227j5225j4461j3380j2570j2528j3036j3285j2720j1518j0257r357q898
$$ 566227 551002 536541 523161 510591 498063 485027 471742 459022 447504 437247 427890 418992
62300D18992q582p868o454m780l630l222k946k144q47L81R76P41J3m01R5J232
$$ 418992 410410 402542 396088 391308 387678 384456 381510 379366 378519 378900 379876 380617 380630 380229 380324 381556
62284C81556K168K465K330J998J558J401K075L319M077L858L453L712M339M620
$$ 381556 383724 386189 388519 390517 392075 393476 395551 398870 402947 406805 410258 413970 418309 422929
62270D22929M753N505O888Q103Q753R313J0288J1636J3151J4892J7064J9783K2989
$$ 422929 427682 433187 440075 448178 456931 466244 476532 488168 501319 516211 533275 553058 576047
62257E76047K6338K9374L2117L5231L9164M3345M6819M9459N1809N3821N4577
$$ 576047 602385 631759 663876 699107 738271 781616 828435 877894 929703 983524 1038101
62246A038101N3376N0424M6235M0902L4204K6029J6588O640k502r891j5987k2173
$$ 1038101 1091477 1141901 1188136 1229038 1263242 1289271 1305859 1312499 1309997 1300106 1284119 1261946
62234A261946k9044l5816m1565m6176m9696n1656n1782n0777m9471m7654m4573
$$ 1261946 1232902 1197086 1155521 1109345 1059649 1007993 956211 905434 855963 808309 763736
62223G63736m0358l6060l2328k8846k5182k1513j8283j5722j3867j2619j1510
$$ 763736 723378 687318 654990 626144 600962 579449 561166 545444 531577 518958 507448
62212E07448r937p873n954m559l294j705j74N33L71J05L34R78J831K966M276N047
$$ 507448 497511 489638 483684 479125 475831 474126 473952 474485 474856 474961 475295 476273 478104 481070 485346 490393
62196D90393M607L250K092J939K642L534M068M059L642L210L093L189L162L131
$$ 490393 495000 498250 500342 502281 504923 508457 512525 516584 520226 523436 526529 529718 532880 536011
62182E36011L665M927O213O796O756O572O251N566M845M731N159N366N183N465
$$ 536011 539676 544603 550816 557612 564368 570940 577191 582757 587602 592333 597492 602858 608041 613506
62168F13506O934R170J1388J3665J6727K0802K5300K9521L3072L5652L7067L7606
$$ 613506 620440 629610 640998 654663 671390 692192 717492 747013 780085 815737 852804 890410
62156H90410L7792L7522L5848L2061K6602K0562J4498Q278J922m032r188j3845
$$ 890410 928202 965724 1001572 1033633 1060235 1080797 1095295 1103573 1105495 1101463 1092275 1078430
62144A078430j8488k3021k6885k9778l1859l3299l3953l3609l2234k9930k6901
$$ 1078430 1059942 1036921 1010036 980258 948399 915100 881147 847538 815304 785374 758473
62133G58473k3541k0285j7288j4439j1756r395p267n066k815r31M70J838L412
$$ 758473 734932 714647 697359 682920 671164 661769 654502 649436 646621 645690 646160 647998 651410
62120F51410M721N342N648O135O423N741M206K726J681O41o13j698k528l627n076
$$ 651410 656131 661473 667121 673256 679679 685420 689626 692352 694033 694674 694061 692363 689835 686208 681132
62105F81132n994n734m998n006n960p063p661p602o742m997k918j462q15q7J533
$$ 681132 675138 669404 664406 659400 653440 646377 638716 631114 624372 619375 616457 614995 614180 614093 615626
62090F15626L712N396O092O322O867P829Q555Q508Q044Q149R266J0727J1560J1740
$$ 615626 619338 624734 630826 637148 644015 651844 660399 668907 676951 685100 694366 705093 716653 728393
62076G28393J2132J3261J4620J5501J6047J7049J8814K0721K1980K2391K2190
$$ 728393 740525 753786 768406 783907 799954 817003 835817 856538 878518 900909 923099
62065I23099K1485K0365J9424J9591K1205K3500K5330K6209K6393K6167K5479
$$ 923099 944584 964949 984373 1003964 1025169 1048669 1073999 1100208 1126601 1152768 1178247
62054A178247K4183K2207J9381J5473J0554N094m19n759j0819j5490j9848k4161
$$ 1178247 1202430 1224637 1244018 1259491 1270045 1275139 1274720 1268961 1258142 1242652 1222804 1198643
62042A198643k8525l2719l6565m0110m3144m4919m4824m3328m1672m0566l9489
$$ 1198643 1170118 1137399 1100834 1060724 1017580 972661 927837 884509 842837 802271 762782
62031G62782l7514l4470l1015k7795k4928k2305j9994j8087j6421j4747j3094
$$ 762782 725268 690798 659783 631988 607060 584755 564761 546674 530253 515506 502412
62020E02412j1663j0395r068p838p271p527p949p810p260p005p159p007n991m462
$$ 502412 490749 480354 471286 463448 456177 448650 440701 432891 425631 418626 411467 404460 398469 394007
62006C94007l219k570k094j225R6J319J890J959K273L182M116M395M216M307M761
$$ 394007 390788 388218 386124 384899 384995 386314 388204 390163 392436 395618 399734 404129 408345 412652 417413
61991D17413M959M607M005L234J874m6j614k101j981k208k930l522l674l737m016
$$ 417413 422372 426979 430984 434218 436092 436046 434432 432331 430350 428142 425212 421690 418016 414279 410263
61976D10263m321m377m281m329m518m456l826k914k512l053l980m333l883l216
$$ 410263 405942 401565 397284 392955 388437 383981 380155 377241 374729 371676 367696 363363 359480 356264
61962C56264k740k236j559j116j208j403j064k41M67O83N52M45O72J299K024K438
$$ 356264 353524 351288 349729 348613 347405 346002 344938 344697 345164 345847 346399 346844 347516 348815 350839 353277
61946C53277K589K980L863M963N993O985P925Q673R530J1158J3438J5230J5810
$$ 353277 355866 358846 362709 367672 373665 380650 388575 397248 406778 417936 431374 446604 462414
61933D62414J5875J6317J6796J6439J5412J4583J3983J2831J0968R180P940O774
$$ 462414 478289 494606 511402 527841 543253 557836 571819 584650 595618 604798 612738 619512
61921F19512N078K804K38k185l826m339m260m479n125n643n778n624m815k832
$$ 619512 624590 627394 627632 625447 621621 617282 613022 608543 603418 597775 591997 586373 581558 578726
61907E78726j42K017L320M738O923R177J0556J1016J0957J0413R330P945O311
$$ 578726 578584 580601 583921 588659 595582 604759 615315 626331 637288 647701 657031 664976 671287
61894F71287M029R70k358n499q445j0903j2109j1969j1631j2070j2818j2878j2267
$$ 671287 675316 676286 673928 668429 659984 649081 636972 625003 613372 601302 588484 575606 563339
61881E63339j1738j1488j1074j0344r546q756p995p628p886q169p653o446n359
$$ 563339 551601 540113 529039 518695 509149 500393 492398 484770 476884 468715 461062 454616 449257
61868D49257m730m197l545k926k294j354j62R61K074L514N123O314O996P750Q942
$$ 449257 444527 440330 436785 433859 431565 430211 430049 431010 433084 436598 441721 448035 455031 462781 471723
61853D71723J0360J1815J3442J5243J6966J8718K0921K3393K5154K5649K5481
$$ 471723 482083 493898 507340 522583 539549 558267 579188 602581 627735 653384 678865
61842F78865K5460K5408K4569K2760K0402J7648J4208J0089N877K173q85l429
$$ 678865 704325 729733 754302 777062 797464 815112 829320 839409 845286 847459 846574 843145
61830H43145n542p233q463r001q523p051n119l271j506N36K878N045O614P615
$$ 843145 837603 830370 821907 812906 804383 797332 792213 788942 787436 787972 790850 795895 802509 810124
61816H10124Q096P604N564K172j603n040q344j2050j6128j9982k3104k5341k6662
$$ 810124 818220 825824 831388 833560 831957 826917 818573 806523 790395 770413 747309 721968 695306
61803F95306k7068k6716k5810k4429k2652k0745j8883j6878j4500j2046j0194
$$ 695306 668238 641522 615712 591283 568631 547886 529003 512125 497625 485579 475385
61792D75385r244q862q580q191p620o790n826n081m720m469l986l320k865k821
$$ 475385 466141 457279 448699 440508 432888 426098 420272 415191 410471 406002 402016 398696 395831 393010
61778C93010k869k449j395k75J24l10q65r24o76o46q64j003j136j648k367k485
$$ 393010 390141 387692 386297 386022 386146 385836 384971 384047 383371 382725 381861 380858 379722 378074 375707 373222
61762C73222j591k69O59J070J404J867K222K165J630Q26J76O7M73R80J297J513
$$ 373222 371631 371362 372021 373091 374495 376362 378584 380749 382379 383205 383381 383448 383921 384901 386198 387711
61746C87711J663J421N31o70j587k049k307k435k227j660j070o92m09j26j03n99
$$ 387711 389374 390795 391326 390656 389069 387020 384713 382278 380051 378391 377321 376629 376220 376094 375991 375392
61730C75392j351j739j505r45l47M78J745K999L335K495J326Q42J097J396J403
$$ 375392 374041 372302 370797 369852 369505 369983 371728 374727 378062 380557 381883 382725 383822 385218 386621
61715C86621J489J943K463K638K508K279J888J208M78P9nj44n70j159j702k132
$$ 386621 388110 390053 392516 395154 397662 399941 401829 403037 403515 403594 403589 403445 402875 401716 400014 397882
61699C97882k484k846l286l639l567l077k748l027l455l127j977j032j217k273
$$ 397882 395398 392552 389266 385627 382060 378983 376235 373208 369753 366626 364649 363617 362400 360127
61685C60127l178l238k529j606j074j203j615j594r33l28n28j380k155k548k811
$$ 360127 356949 353711 351182 349576 348502 347299 345684 344090 343157 342829 342301 340921 338766 336218 333407
61670C33407k955k568j597p30n94r55j059n79J38N98N85J86l39o73o84n02l07
$$ 333407 330452 327884 326287 325557 324963 324008 322949 322370 322508 323106 323691 323877 323538 322865 322181 321679 321372
61653C21372r3K08N34P14O65M24J89L20J057K058K592K443K298K840L755M103
$$ 321372 321279 321487 322021 322735 323400 323824 324013 324333 325390 327448 330040 332483 334781 337621 341376 345479
61637C45479L511K497J743J519J751K077J929J032j38r17j412k254l455m245m201
$$ 345479 348990 351487 353230 354749 356500 358577 360506 361538 361400 360483 359071 356817 353362 349117 344916
61622C44916l711l111k248j304j104j889k596k178j130o52q60q90n49n77j293
$$ 344916 341205 338094 335846 334542 333438 331549 328953 326775 325645 324993 324133 323243 322694 322117 320824
61607C20824k059k437k826l510l959l698l222l323l859l976l370k731k823l521
$$ 320824 318765 316328 313502 309992 306033 302335 299113 295790 291931 287955 284585 281854 279031 275510
61593B75510l973l533k437j548j427j812k059j982j917k012j934j424p96o20r96
$$ 275510 271537 268004 265567 264019 262592 260780 258721 256739 254822 252810 250876 249452 248656 248036 247040
61578B47040j466j563j307j095j154j229r49m84m72j119j726j490n64J70K45l5
$$ 247040 245574 244011 242704 241609 240455 239226 238277 237793 237321 236202 234476 232986 232422 232592 232837 232802
61562B32802k91m87o19n30k32J0J35L29N52N02K59L89J099J800J880J454R97O59
$$ 232802 232511 232024 231405 230875 230643 230653 230788 231117 231669 232171 232430 232819 233918 235718 237598 239052 240049 240708
61544B40708L25M6j04j79p3N35J537K153J816R85M80L86K70R8J69K75r3p38q09
$$ 240708 241033 241079 240975 240796 240723 241258 242795 244948 246764 247749 248229 248615 248885 248983 249152 249427 249334 248596 247787
61525B47787o9O42N92J33kJ61j4p23j377j341o95j79m13j136j364m71R14J539
$$ 247787 247718 248360 248952 249085 249083 249244 249230 248507 247130 245789 245094 244915 244502 243366 242002 241531 242445 243984
61507B43984J075M59M74O01o7j209j496m22Q83J114L37m23p37j090j741k091j542
$$ 243984 245059 245518 245992 246593 246526 245317 243821 243399 244282 245396 245733 245310 244573 243483 241742 239651 238109
61490B38109m29L76M41m6p48j326j336o25K13L81J6J13J123K258K546K017J379
$$ 238109 237680 238056 238497 238451 237703 236377 235041 234416 234629 235010 235026 235139 236262 238520 241066 243083 244462
61473B44462R66O79N44O96R18Q49O07O50R93J181R77O40L69P0k65l96k75j77k09
$$ 244462 245428 246107 246651 247347 248265 249114 249721 250371 251364 252545 253522 254162 254531 254601 254336 253940 253665 253488 253279
61454B53279r9K54M90L74K62O06J228J558J401J040P06L18j63n16n13k26Q0K38
$$ 253279 253180 253434 253924 254298 254560 255166 256394 257952 259353 260393 261099 261417 261254 260738 260225 259999 260079 260317
61436B60317K98M46Q50J549K389L079L293K942K391K216K554K812K336J334O78
$$ 260317 260615 261061 261911 263460 265849 268928 272221 275163 277554 279770 282324 285136 287472 288806 289484
61421B89484P39Q82M50j82j03P83J570J558J116J015J331J481J152O57L55J80
$$ 289484 290223 291105 291555 291373 291270 292053 293623 295181 296297 297312 298643 300124 301276 301933 302288 302468
61405C02468n8j91Q9O93J120J019N35M2k68m60p29j236j924k450k500k168j814
$$ 302468 302410 302219 302308 303001 304121 305140 305675 305717 305449 304989 304260 303024 301100 298650 296150 293982 292168
61388B92168j472q67r3J50n05j354j334m26L23J68m50n85N2Q64J107O19o9k81
$$ 292168 290696 289829 289736 289886 289381 288027 286693 286267 286590 286758 286308 285723 285775 286639 287746 288365 288296 288015
61370B88015R0M70L98K62P80J818K376J923J181J162J871K463K390J852J250Q11
$$ 288015 288105 288575 288973 289235 290015 291833 294209 296132 297313 298475 300346 302809 305199 307051 308301 309112
61354C09112P30J198K036K734L053L355M066M991N460N157M541M324M650N006
$$ 309112 309842 311040 313076 315810 318863 322218 326284 331275 336735 341892 346433 350757 355407 360413
61340C60413M937M599M465M668M876M794M478M108L783L601L712L972L841K904
$$ 360413 365350 369949 374414 379082 383958 388752 393230 397338 401121 404722 408434 412406 416247 419151
61326D19151J406M3q06j328j810k173k112j533p56k48j92l07j53L95J000J304
$$ 419151 420557 420600 419794 418466 416656 414483 412371 410838 410082 409834 409642 409335 409182 409577 410577 411881
61310D11881J442J937L084M565N764O402O726P062P347P295O882O430O158N894
$$ 411881 413323 415260 418344 422909 428673 435075 441801 448863 456210 463505 470387 476817 482975 488869
61296D88869N399M699L880K787J240n91k324l763m850n415n420n348n775o585
$$ 488869 494268 498967 502847 505634 506874 506283 503959 500196 495346 489931 484511 479163 473388 466803
61282D66803p105p051o800o671o511o151n641m824l410j749p75p17o76o2M05K6
$$ 466803 459698 452647 445847 439176 432665 426514 420873 416049 412639 410890 410115 409398 408722 408660 409065 409091
61266D09091l58N89K577L926L876L348L293L548L701L976M611N271N687O161O792
$$ 409091 408733 409322 411899 415825 419701 423049 426342 429890 433591 437567 442178 447449 453136 459297 466089
61251D66089O920O020M648L734L420L296L331L767M285M139L190K130J594J474
$$ 466089 473009 479029 483677 487411 490831 494127 497458 501225 505510 509649 512839 514969 516563 518037
61237E18037J208L93q60j953k299k019j900k404k982k863k190j718j679j605j169
$$ 518037 519245 519638 518778 516825 514526 512507 510607 508203 505221 502358 500168 498450 496771 495166 493997
61222D93997n17K35J143J986K394K521K963L813M472M598M601M861N086M824M146
$$ 493997 493480 493715 494858 496844 499238 501759 504722 508535 513007 517605 522206 527067 532153 536977 541123
61207E41123L391K726K274K207K321K076J500J419K206K895K477J549J709L416
$$ 541123 544514 547240 549514 551721 554042 556118 557618 559037 561243 564138 566615 568164 569873 573289
61193E73289N453O564O779O856P217P766Q199Q185P649P008O741O605N860M402
$$ 573289 578742 585306 592085 598941 606158 613924 622123 630308 637957 644965 651706 658311 664171 668573
61179F68573L054K413K059J336L89j66k22k44n07q46j102j414j984k795l533l739
$$ 668573 671627 674040 676099 677435 677824 677658 677436 677192 676685 675839 674737 673323 671339 668544 665011 661272
61163F61272l228k505k460l398m716n716o403p106p745q044q202q682r434r824
$$ 661272 658044 655539 653079 649681 644965 639249 632846 625740 617995 609951 601749 593067 583633 573809
61149E73809r442q517p475o549n835n401n213n182n296n454n316m705m046l950
$$ 573809 564367 555850 548375 541826 535991 530590 525377 520195 514899 509445 504129 499424 495378 491428
61135D91428m328m399l735k832k458k664k749k074p67M00Q58R47J527K853M261
$$ 491428 487100 482701 478966 476134 473676 471012 468263 466189 465422 465822 466680 467627 469154 472007 476268
61120D76268N251O263P834R534J0635J1431J2815J4626J5739J5959J6517J8143
$$ 476268 481519 487782 495616 505150 515785 527216 540031 554657 570396 586355 602872 621015
61108F21015J9806K0285J9936J9945K0430K0559K0022J9299J8537J7246J5219
$$ 621015 640821 661106 681042 700987 721417 741976 761998 781297 799834 817080 832299
61097H32299J2973J1011R253P306M895K039q70l274n109p022r439j1803j3349
$$ 832299 845272 856283 865536 872842 877737 879776 878906 875632 870523 863501 854062 842259 828910
61084H28910j4298j5396j6519j6816j6254j5847j6086j6229j5688j5084j5130
$$ 828910 814612 799216 782697 765881 749627 733780 717694 701465 685777 670693 655563
61073F55563j5328j4730j3467j2505j2063j1348r845q100o926o405n980n115l656
$$ 655563 640235 625505 612038 599533 587470 576122 566277 558177 551251 544846 538866 533751 530095
61060E30095j877m11K26K55N20J553K902L787M120M536N451O601P609Q598R856
$$ 530095 528218 527807 528033 528288 528808 530361 533263 537050 541170 545706 551157 557758 565367 573965 583821
61045E83821J1232J2321J3173J4331J6105J8164J9978K1320K2322K3367K5034
$$ 583821 595053 607374 620547 634878 650983 669147 689125 710445 732767 756134 781168
61034G81168K7661L0776L3425L5282L6968L9008M1030M2500M3653M5067M6759
$$ 781168 808829 839605 873030 908312 945280 984288 1025318 1067818 1111471 1156538 1203297
61023A203297M8529N0847N4492N9421O4951P1074P8757Q8756J00963J15308J32891
$$ 1203297 1251826 1302673 1357165 1416586 1481537 1552611 1631368 1720124 1821087 1936395 2069286
61012B069286J55946J86842K26819K74979L28869L86893M50145N21137O01254
$$ 2069286 2225232 2412074 2638893 2913872 3242741 3629634 4079779 4600916 5202170
61003E202170O90984P92027R06359J031427J157136J267484J342455J357475J287428
$$ 5202170 5893154 6685181 7591540 8622967 9780103 11047587 12390042 13747517 15034945
60994A5034945J121103Q76693O00294L44281J43942J1006n8992q2146q9737j26435
$$ 15034945 16156048 17032741 17633035 17977316 18121258 18132264 18073272 17991126 17901389 17774954
60984A7774954k32121m17581o56693r02922j113996j264287j342407j346632j285483
$$ 17774954 17542833 17125252 16468559 15565637 14451641 13187354 11844947 10498315 9212832
60975I212832j177837j046454r09461p77657o57319n52128m62602l86732l22807
$$ 9212832 8034995 6988541 6079080 5301423 4644104 4091976 3629374 3242642 2919835
60966B919835k70555k29177j96056j68475j45540j27267j12696j00143q8816p8973
$$ 2919835 2649280 2420103 2224047 2055572 1910032 1782765 1670069 1569926 1481110 1402137
60956A402137p0646o3159n5982m9284m3409l8355l3929l0118k7018k4580k2513
$$ 1402137 1331491 1268332 1212350 1163066 1119657 1081302 1047373 1017255 990237 965657 943144
60945I43144k0431j8151j5823j3657j1467q868o007l761k840k918k952k283j047
$$ 943144 922713 904562 888739 875082 863615 854747 848740 844979 842139 839221 836269 833986 832939
60932H32939K21R94Q76j11j136r55Q79L300M648M328L269K675K705K682K293K001
$$ 832939 833160 834154 835030 834919 833783 832828 833707 837007 841655 845983 849252 851927 854632 857314 859607 861608
60916H61608K241K744K919K573J949J289O35j37j304l055n025o402o836o933p483
$$ 861608 863849 866593 869512 872085 874034 875323 875958 875821 874517 871462 866437 860035 853199 846266 838783
60901H38783q482r382r971j0431j0798j0972j1103j1325j1269j0561r655r395
$$ 838783 830301 820919 810948 800517 789719 778747 767644 756319 745050 734489 724834 715439
60889G15439r817j0133r992r821r888r878r671r641r856r830r429r218r434r533
$$ 715439 705622 695489 685497 675676 665788 655910 646239 636598 626742 616912 607483 598265 588831 579298
60875E79298r209r022r257r138q008o574n964o100o010n366m676m255l967l834
$$ 579298 570089 561067 551810 542672 534664 528090 522126 516026 510016 504650 499974 495719 491752 487918
60861D87918l953l942l335k464k116k381k699k904l307l758l699l259l318m122
$$ 487918 483965 480023 476688 474224 472108 469727 467028 464124 460817 457059 453360 450101 446783 442661
60847D42661m819m714m186l881l805l697l579l381k728j792j650k991m893n825
$$ 442661 437842 433128 428942 425061 421256 417559 413980 410599 407871 406079 404429 401438 396545 390720
60833C90720n552n207n512n896n528m491l495k857k303j547o34K60J016J465J356
$$ 390720 385168 379961 374449 368553 363025 358534 355039 352182 349879 348332 347698 347958 348974 350439 351795
60818C51795O79r4m08k61j46k77k52K63R12J117R22Q93J253J691J892J771J197
$$ 351795 352474 352380 351972 351711 351565 351288 351036 351299 352211 353328 354250 355143 356396 358087 359979 361750 362947
60801C62947J49q60j098n76p4l9j27n2j81p78j278j061m67l23p39j104j163j311
$$ 362947 363096 362236 361138 360562 360488 360449 360322 360270 360089 359311 358033 356972 356505 356182 355443 354339 353176 351865
60783C51865j778k191k178j933j904k277k934l647m119m045l387k439j561r20
$$ 351865 350087 347896 345718 343785 341881 339604 336670 333023 328904 324859 321472 319033 317472 316552
60769C16552n01k36l2J69K95K05q9l73m43k40J91P31J113R83K55o39r98n42K40
$$ 316552 316051 315815 315783 315952 316247 316452 316363 315990 315547 315307 315498 316229 317342 318325 318580 317941 316943 316401 316641
60750C16641N44J88p7O29K292L921M545M127L461L312L617L515K180j31k057k433
$$ 316641 317185 317373 317296 317925 320217 324138 328683 332810 336271 339583 343200 346715 348895 348764 346707 344274
60734C44274j567q88j341k621l922m873n422n417m915m526m832n512n583m570
$$ 344274 342707 341819 340478 337857 333935 329062 323640 318223 313308 308782 303950 298438 292855 288285
60720B88285k991j691r90o98o47r55j715k557k740j893n94J22l4l71k46M1j10
$$ 288285 285294 283603 282613 281915 281268 280313 278598 276041 273301 271408 270814 270936 270902 270531 270285 270326 270216
60703B70216n83p58n42m74q03j017n30N49J562J939J587Q38J52k19l04j35L71
$$ 270216 269633 268875 268333 267859 267056 266039 265509 266058 267620 269559 271146 271984 272136 271917 271613 271478 271849
60686B71849J088J547J497J352J617K056K031J572J439K087L120L995M578M814
$$ 271849 272937 274484 275981 277333 278950 281006 283037 284609 286048 288135 291255 295250 299828 304642
60672C04642M451L544K717K510K793L162L525L810L622K665J332K77l39p02p44
$$ 304642 309093 312637 315354 317864 320657 323819 327344 331154 334776 337441 338773 339050 338711 338009 337265
60657C37265l54l0n33j727k477k037r27j20J56K47J84l77j274j673j049K3M25
$$ 337265 336911 336881 336348 334621 332144 330107 329180 329060 329216 329463 329647 329270 327996 326323 325274 325297 325722
60640C25722k70j449k301k660k858l043l037k820k714k885k981k661k245k361
$$ 325722 325452 324003 321702 319042 316184 313141 310104 307284 304570 301685 298704 296043 293798 291437
60626B91437k900k907j793j99P47P75N42N13M41P7k38p8L89O83P20P25O72L44
$$ 291437 288537 285630 283837 283638 284385 285160 285702 286215 286656 286733 286495 286417 286806 287489 288209 288934 289606 289950
60608B89950n5K9P09J352J350Q17L17K16M81Q72J082R40O87P86J321J882K148
$$ 289950 289895 289924 290633 291985 293335 294152 294469 294685 295166 296038 297120 298060 298747 299533 300854 302736 304884
60591C04884K235K244J944J303P87P27P31L10l74r14j388j929j957q64P12J398
$$ 304884 307119 309363 311307 312610 313397 314124 314855 315165 314791 313877 312489 310560 308603 307739 308451 309849
60575C09849R32M72Q91J844K825M015N447O374O363O206O806P697P747O882O075
$$ 309849 310781 311253 312144 313988 316813 320828 326275 332649 339012 345218 352024 359721 367468 374350 380425
60560C80425N748N272M072K323M28j474l204m378m809m666m129l328k573k087
$$ 380425 386173 391445 395517 397840 398268 396794 393590 389212 384403 379737 375608 372280 369707 367620
60546C67620j450N3K302M228N105N428O100P261Q389R155R615R757R438Q776Q104
$$ 367620 366170 366223 368525 372753 377858 383286 389386 396647 405036 414191 423806 433563 443001 451777 459881
60531D59881P433O372M690K697R29m15j494k436l154l605l951m270m336l978l538
$$ 459881 467314 473686 478376 481073 482002 481587 480093 477657 474503 470898 466947 462677 458341 454363 450825
60516D50825l505l663l153j707k66K09O7M65J731L063L845M427N369O654Q057
$$ 450825 447320 443657 440504 438797 438531 438740 438807 439272 441003 444066 447911 452338 457707 464361 472418
60501D72418R729J1847J4178J6462J8915K1823K4844K7234K8663K9386K9600K9112
$$ 472418 482147 493994 508172 524634 543549 565372 590216 617450 646113 675499 705099 734211
60489G34211K7633K5136K1746J7492J2238N849j461q955j5718k1316k5904k9594
$$ 734211 761844 786980 808726 826218 838456 844305 842844 833889 818171 796855 770951 741357
60477G41357l2074l3044l2717l1553k9787k7558k5224k3098k1037j8807j6670
$$ 741357 709283 676239 643522 611969 582182 554624 529400 506302 485265 466458 449788
60466D49788j5048j3760j2157j0077q127o827o098n625n279m925m411l984m128
$$ 449788 434740 420980 408823 398746 390619 383792 377694 372069 366790 361865 357454 353470 349342
60453C49342m662m589l345j739r92j203j492j424j432j810k127j898j276o98l49
$$ 349342 344680 340091 336746 335007 334015 332812 331320 329896 328464 326654 324527 322629 321353 320655 320306
60438C20306k58n37j116j629j900k179k556k529j710o38j86l08j52N42R37L30
$$ 320306 320048 319511 318395 316766 314866 312687 310131 307602 305892 305254 305068 304760 304608 305150 306087 306417
60422C06417p54j280j063p66p31n36K44J347K164K413K225J814J312Q58O04O03
$$ 306417 305663 304383 303320 302554 301823 301287 301531 302878 305042 307455 309680 311494 312806 313664 314268 314871
60406C14871P14O90L22l50r84j106m52P80K002K577K316J685J389J640J981J935
$$ 314871 315585 316275 316597 316247 315263 314157 313705 314485 316487 319064 321380 323065 324454 326094 328075 330010
60390C30010J641J572J786J895J707J525J659K027K366K587K658K380J613N83
$$ 330010 331651 333223 335009 336904 338611 340136 341795 343822 346188 348775 351433 353813 355426 356009
60376C56009k92q01r78p56J18J683L388M334M001K776J656J315J503J558J281
$$ 356009 355717 354916 353938 353182 353300 354983 358371 362705 366706 369482 371138 372453 373956 375514 376795
60361C76795J055J139J326J416J582J984K348K398K399K867L796M621M984N148
$$ 376795 377850 378989 380315 381731 383313 385297 387645 390043 392442 395309 399105 403726 408710 413858
60347D13858N545O172O596O361N355L867K377J136k9j393k907m256n257n956o358
$$ 413858 419403 425575 432171 438532 443887 447754 450131 451267 451238 449845 446938 442682 437425 431469 425111
60332D25111o275n582m456l334k692k757l240l431k885k012j663k072k518k229
$$ 425111 418836 413254 408798 405464 402772 400015 396775 393344 390459 388447 386784 384712 382194 379965
60318C79965j289m14K9L38R48J850K700L315L866M623N709P116Q788J0550J2045
$$ 379965 378676 378262 378291 378629 379577 381427 384127 387442 391308 395931 401640 408756 417544 428094 440139
60303D40139J3051J3841J4847J5851J5919J4407J1742Q750N504J441l460q275
$$ 440139 453190 467031 481878 497729 513648 528055 539797 548547 554051 555492 552032 543757
60291E43757j2096j4793j6610j7425j6956j5420j3581j2075j0914r582p612n190
$$ 543757 531661 516868 500258 482833 465877 450457 436876 424801 413887 404305 396693 391503
60279C91503l199k377k394k148j132r8k1p93j406j263p67o11q93j142j010p15
$$ 391503 388304 385927 383533 381385 380253 380155 380134 379341 377935 376672 375905 375294 374401 373259 372249 371534
60263C71534p51j226j602j353p38n41r91j454j413j244j567k207k430j985j279
$$ 371534 370783 369557 367955 366602 365864 365323 364332 362878 361465 360221 358654 356447 354017 352032 350753
60248C50753o48l5O00J094J416J672J731J328O45L62Q46J663K090J830J102L69
$$ 350753 350105 350070 350670 351764 353180 354852 356583 357911 358556 358918 359764 361427 363517 365347 366449 366818
60232C66818J39O30J453J883J686J359J382J563J406Q26J57k84m30l52k20j47
$$ 366818 366957 367587 369040 370923 372609 373968 375350 376913 378319 379145 379302 379018 378588 378236 378016 377869
60216C77869L0O25J518K104K080J967K397L208L700L692L675M028M535M817M795
$$ 377869 377899 378524 380042 382146 384226 386193 388590 391798 395498 399190 402865 406893 411428 416245 421040
60201D21040M585M360M365M719N061M780L836L012L010L632M126M154L970L776
$$ 421040 425625 429985 434350 439069 444130 448910 452746 455758 458768 462400 466526 470680 474650 478426
60187D78426L408K779K214K017J867J042o71k520l466l211k437k058k450l385
$$ 478426 481834 484613 486827 488844 490711 491753 491082 488562 485096 481885 479448 477390 474940 471555
60173D71555m406n068n093m518l724l144k882k783k744k804k970l138l184l000
$$ 471555 467149 462081 456988 452470 448746 445602 442720 439937 437193 434389 431419 428281 425097 422097
60159D22097k430j427l21K78j6r09j558j208J07J400J524L93p22n00Q69J913J759
$$ 422097 419667 418240 417919 418197 418181 417272 415714 414506 414613 416013 417537 417930 417208 416708 417577 419490 421249
60142D21249J185J417K374K826K169J278J333K337L229L285K907L062M185N715
$$ 421249 422434 423851 426225 429051 431220 432498 433831 436168 439397 442682 445589 448651 452836 458551
60128D58551O583O186M918L764L305L220K881K162J377O63j21q61j066n42K74
$$ 458551 465134 471320 476238 480002 483307 486527 489408 491570 492947 493610 493489 492628 491562 491020 491294
60113D91294Q81J306J698J810J414J041J460K502L037K404J226M71K31q6p10j237
$$ 491294 492175 493481 495179 496989 498403 499444 500904 503406 506443 508847 510073 510544 510775 510689 509979 508742
60097E08742j285r73p73j071j833k572k810k630k491k406j828o45L52N30M05Q10
$$ 508742 507457 506484 505711 504640 502807 500235 497425 494795 492304 489898 488070 487425 487777 488307 488712 489522
60081D89522J519J606J011O25P96P83J06o19p02n07p99j617k499l371m370n081
$$ 489522 491041 492647 493658 494283 495079 495862 495968 495349 494647 494140 493341 491724 489225 485854 481484 476403
60065D76403m870l961l415l846m739n294n377n358n380n222m781m301m065l993
$$ 476403 471533 467572 464157 460311 455572 450278 444901 439543 434163 428941 424160 419859 415794 411801
60051D11801l708k972j942r38j12M78O52L51PK34R85J525J485J407J917K792L419
$$ 411801 408093 405121 403179 402241 402129 402607 403259 403610 403617 403851 404836 406361 407846 409253 411170 413962 417381
60034D17381L723L953L856K923J474O54J040J879K063J382M14m18j189k035k831
$$ 417381 421104 425057 428913 431836 433310 433964 435004 436883 438946 440328 440742 440324 439135 437100 434269
60019D34269l360l602l750m021m409m658m585m393m491n001n605n872n619m964
$$ 434269 430909 427307 423557 419536 415127 410469 405884 401491 397000 391999 386394 380522 374903 369939
60005C69939m208l687l539l565l425k934k089j045k56k92j097j656j004N11J587
$$ 369939 365731 362044 358505 354940 351515 348581 346492 345447 345191 344899 343802 342146 341142 341653 343240
59990C43240J604J212J171J383J436J377J427J473J420J556K007K304K101J905
$$ 343240 344844 346056 347227 348610 350046 351423 352850 354323 355743 357299 359306 361610 363711 365616
59976C65616K285K734K245Q92j59k98j74n33j164j538j707j938j975j435o29l18
$$ 365616 367901 370635 372880 373772 373613 373315 373141 372608 371444 369906 368199 366261 364286 362851 362222 361904
59960C61904o83j078q94k18M75R23J139J117P79K16j66M1P13J111N49q07j988
$$ 361904 361221 360143 359249 359031 359506 360429 361568 362685 363464 363680 363514 363555 364268 365379 365928 365121 363133
59943C63133k166j393l34M72Q78R02O02K62L59J110K048K281J342j99j169q89
$$ 363133 360967 359574 359240 359712 360590 361492 362094 362356 362715 363825 365873 368154 369496 369297 368128 367239
59927C67239K21J231J673J747J745J742J834K221K905L614M158M505M416L561
$$ 367239 367460 368691 370364 372111 373856 375598 377432 379653 382558 386172 390330 394835 399251 402812
59913D02812K272J616K211L320L726L219K535K065J423L70o51j194j378j439j254
$$ 402812 405084 406700 408911 412231 415957 419176 421711 423776 425199 425569 424918 423724 422346 420907 419653
59898D19653p50l73n67j098j326r94l64K61P37R52R53J140J913L074L897L934
$$ 419653 418903 418530 417963 416865 415539 414545 414181 414442 415179 416131 417084 418224 420137 423211 427108 431042
59882D31042L544L492M175N222N797N448M724M640N317N560M299K095N81M16O32
$$ 431042 434586 438078 442253 447475 453272 458720 463444 468084 473401 478961 483260 485355 485936 486352 486984
59867D86984P3j220k448l142l295k945k252j760j943k585l064l105k766j916l27
$$ 486984 487057 485837 483389 480247 476952 474007 471755 469995 468052 465467 462403 459298 456532 454616 454289
59852D54289J634L079L541L478L606M133M803N311N334M476K669N50r39j362j067
$$ 454289 455923 459002 462543 466021 469627 473760 478563 483874 489208 493684 496353 496903 495964 494602 493535
59837D93535p55r38j753k956m002m444m355m261m471m612m119l052k134j810j636
$$ 493535 492780 491842 490089 487133 483131 478687 474332 470071 465600 460988 456869 453817 451683 449873 448237
59822D48237r35J23N65j78j485k234k040j460j185j370j728j973k034j989j905
$$ 448237 447302 447425 447990 447812 446327 444093 442053 440593 439408 438038 436310 434337 432303 430314 428409
59807D28409j768j560j492j916k868l763l894l211k389k086k308k531k273j466
$$ 428409 426641 425081 423589 421673 418805 415042 411148 407937 405548 403462 401154 398623 396350 394884
59793C94884m60K69M93L30p2p18j458j757j206k32K24k18r87j409j391j127n79
$$ 394884 394424 394693 395186 395516 395444 394726 393268 391511 390305 390073 390297 390079 389092 387683 386292 385165 384586
59776C84586K74J031J270J130J065J075P27o1o68m51M50J208J164M83m3J58Q85
$$ 384586 384860 385891 387161 388291 389356 390431 391158 391097 390429 389978 390428 391636 392800 393283 393240 393398 394283
59759C94283J536J868K116K379K337J808J116O30K87qJ47J189K768M008M503M490
$$ 394283 395819 397687 399803 402182 404519 406327 407443 408073 408360 408352 408499 409688 412456 416464 420967 425457
59743D25457M092L195K206K141L375M880N304M472L326K590K179J763J261O41
$$ 425457 429549 432744 434950 437091 440466 445346 450650 455122 458448 461038 463217 464980 466241 466882
59729D66882j89j012j295q62k51q1k74l35k09k97o41o67m1O38N40k72r44j015
$$ 466882 466693 465681 464386 463524 463273 463192 462918 462583 462374 462077 461436 460769 460728 461366 461906 461634 460690 459675
59711D59675q92j025j196r90n31k55j75N8N16R07J092J189J167P86J15l79m02
$$ 459675 458783 457758 456562 455572 455041 454786 454611 454669 455185 456092 457184 458373 459540 460326 460441 460062 459660
59694D59660j83j7J70O35J397K214K704K402J131m63j226p30J34K79k42n82n29
$$ 459660 459477 459460 459630 460265 461662 463876 466580 468982 470113 469650 468424 467694 467828 468107 467865 467283 466754
59677D66754p46j549k277k259j881k069k990l789l694k945k470k772l444l718
$$ 466754 466008 464459 462182 459923 458042 455973 452983 449194 445500 442555 440085 437313 433869 430151
59663D30151l367k838k565k449k190j830j639j537j105k38N70Q08O14N76R90J587
$$ 430151 426784 423946 421381 418932 416742 414912 413273 411736 410631 410393 410963 411771 412385 412961 413951 415538
59647D15538J839J493Q13M43Q21J637K001J362J74o63q71r92j513k188k435k119
$$ 415538 417377 418870 419683 420126 420947 422584 424585 425947 426121 425458 424587 423595 422082 419894 417459 415340
59631D15340j642j327j078o76k12L0mk9K44P47J106J008M12m24j089j245r46p41
$$ 415340 413698 412371 411293 410617 410405 410435 410431 410402 410646 411393 412499 413507 413919 413495 412406 411161 410215 409474
59613D09474j205k244l070l027k337j794j762j766j150M0J106J513J458J472J682
$$ 409474 408269 406025 402955 399928 397591 395797 394035 392269 391119 391159 392265 393778 395236 396708 398390
59598C98390J695J239N87J66n8m51r90j197q25k40K15P64J643K340K075R16k08
$$ 398390 400085 401324 401911 402077 402019 401568 400578 399381 398556 398316 398531 399295 400938 403278 405353 406269 406061
59581D06061p03r19j336j761j791j573j602j929k138j999j732j632j769k018k107
$$ 406061 405358 404439 403103 401342 399551 397978 396376 394447 392309 390310 388578 386946 385177 383159 381052
59566C81052j708q03J03M57K93J21K10L97N37P19R50J037Q73N85K69q3l25j47
$$ 381052 379344 378541 378644 379101 379394 379515 379725 380122 380659 381378 382328 383365 384238 384823 385092 385009 384684 384537
59548C84537N05J358K209L057L733L903L637L565M128N047N891O725P843R192
$$ 384537 385042 386400 388609 391666 395399 399302 402939 406504 410632 415679 421570 428295 436138 445330
59534D45330J0514J1682J2424J2012R919O648L296M21k111m253n513n699n243
$$ 445330 455844 467526 479950 491962 501881 508529 511825 512246 510135 505882 500369 494670 489427
59521D89427m498l352j787l28M86P37Q66J056J174J090O94j00j158k102k770l502
$$ 489427 484929 481577 479790 479462 479948 480685 481551 482607 483781 484871 485565 485465 484307 482205 479435 475933
59505D75933m588n751o426o494o290o066n794n443n055m556l824l016k525k468
$$ 475933 471345 465594 459168 452674 446384 440318 434524 429081 424026 419470 415646 412630 410105 407637
59491D07637k463k032j176l64n7k52m64k14M75J098J277J181J261J717K373L002
$$ 407637 405174 403142 401966 401602 401545 401293 400829 400615 401090 402188 403465 404646 405907 407624 409997 412999
59475D12999L482L731L714L562L502L592L697L705L668L642L502L020K099R99
$$ 412999 416481 420212 423926 427488 430990 434582 438279 441984 445652 449294 452796 455816 457915 458914
59461D58914K21O2K72L57K87N72J490K579L249L575M061M839N628O315P002P493
$$ 458914 459135 459197 459469 459826 460113 460685 462175 464754 468003 471578 475639 480478 486106 492421 499423 506916
59445E06916P396O863O551O595O240M827K668M77j536l425m861n436n417n492
$$ 506916 514312 521175 527726 534321 540561 545388 548056 548533 546997 543572 538711 533275 527858 522366
59431E22366n875o239o463o691o653n758m101k706k283k286j690k06J799M176
$$ 522366 516491 510252 503789 497098 490445 484687 480586 477880 475597 473311 471621 471415 473214 477390
59417D77390P058J0109J2489J3780J4506J5494J6972J8535J9777K0573K0725J9583
$$ 477390 484448 494557 507046 520826 535332 550826 567798 586333 606110 626683 647408 666991
59405F66991J6381J1158N126j87m194p270r556j0305q873n864k724m68N37j35
$$ 666991 683372 694530 699656 699469 695275 688005 678449 668144 659271 653407 650683 650215 650752 650617
59391F50617k866p031j1063j4000j6270j8492k0156k0177j8316j5293j1846q503
$$ 650617 647751 640720 629657 615657 599387 580895 560739 540562 522246 506953 495107 486604
59379D86604o036n004m806m079k465j089q50j078o09M86J181J153J106J502J955
$$ 486604 480568 475564 470758 466679 464214 463125 462275 461197 460588 461074 462255 463408 464514 466016 467971
59364D67971K127K306K675K797K525K716M140O051O874O298N652N955O596O564
$$ 467971 470098 472404 475079 477876 480401 483117 487257 493308 500182 506480 512132 518087 524683 531247
59350E31247O151O429P519Q459Q760R013R670J0166R897R397R708J0853J1688
$$ 531247 537398 543827 551346 559805 568565 577578 587248 597414 607311 616708 626416 637269 648957
59337F48957J1340J0109Q830P772O534M777K661O32j067k557m072n676p303q939
$$ 648957 660297 670406 679236 687008 693542 698319 700980 701612 700545 697988 693916 688240 680937 671998
59323F71998j0525j1680j1907j1230j0352r882r644r092q117p097o270n531m777
$$ 671998 661473 649793 637886 626656 616304 606422 596778 587686 579569 572472 566202 560671 555894
59310E55894m003l079j854m32R97K588M535O356P208P098P086P796Q279O988L579
$$ 555894 551891 548812 546958 546526 547523 550111 554646 561002 568210 575308 582394 590190 598469 605457 609036
59295F09036p88m727p638r589j0887j1805j2342j2146j0915q983p167o053n620
$$ 609036 608248 603521 595883 586294 575407 563602 551260 539114 528199 519216 512049 505996 500376
59282E00376n541n470n037l964k390q60J41N36N64O31J211K545M229N426N769
$$ 500376 494835 489365 484328 480364 477974 477114 477255 477791 478355 478986 480197 482742 486971 492397 498166
59267D98166N784O212P145Q117Q801R176R085Q190O554M782L280J670n52k927
$$ 498166 503950 510162 517307 525424 534225 543401 552486 560676 567230 572012 575292 576962 576410 573483
59253E73483m300m333m166n050o698p622p077n910n278n174m746l666k501j770
$$ 573483 569183 564850 560684 555634 548936 541314 534237 528327 523049 517875 513129 509463 506962 505192
59239E05192j245m14P31J716K211K371K523K755K882K766K507K231J873J415J219
$$ 505192 503947 503533 504264 505980 508191 510562 513085 515840 518722 521488 523995 526226 528099 529514 530733
59224E30733J718K603K806J723J10p90q36j063k076l140l294k746k502k917l361
$$ 530733 532451 535054 537860 539583 539693 538903 538067 537004 534928 531788 528494 525748 523246 520329 516968
59209E16968l285k992l032l394l650l573l213k584j730r91p79j035j311j353j279
$$ 516968 513683 510691 507659 504265 500615 497042 493829 491245 489515 488524 487745 486710 485399 484046 482767
59194D82767j060m17N17R68M21n88j179j287j447j616j109J21J040Q37J5l52R
$$ 482767 481707 481290 481807 482775 483196 482608 481429 480142 478695 477079 475970 476091 477131 477968 477983 477631 477640
59177D77640N82J063J594K153K447K473K598K978L365L585L811M146M393M442
$$ 477640 478222 479285 480879 483032 485479 487952 490550 493528 496893 500478 504289 508435 512828 517270
59163E17270M598N142N874O366O541O728P132P466P163N924M043K212R83L69m5
$$ 517270 521868 527010 532884 539250 545791 552519 559651 567117 574280 580204 584247 586459 587442 587811 587766
59148E87766p19j892l475n080o253o895p337p819q035p529o445n534n365n816
$$ 587766 587047 585155 581680 576600 570347 563452 556115 548296 540261 532732 526287 520753 515388 509572
59134E09572o415o819o862o421n582m745m299m196l994l349k367j477r28n39Q9
$$ 509572 503157 496338 489476 483055 477473 472728 468429 464233 460239 456890 454523 453046 452118 451579 451668
59119D51668J074K159L063L761M299M622M801N191N969O688O747O231N879O100
$$ 451668 452742 454901 457964 461725 466024 470646 475447 480638 486607 493295 500042 506273 512152 518252
59105E18252O422O129N167M208L921M302M668M334L424K744K729K796K157J069
$$ 518252 524674 530803 535970 540178 544099 548401 553069 557403 560827 563571 566300 569096 571253 572322
59091E72322N12P65J022O15o3k95r8l4l51q54j358j823k202k504k946l702m623
$$ 572322 572834 573599 574621 575236 575173 574878 574780 574746 574395 573541 572183 570360 568158 565654 562708 559006 554383
59074E54383n458o090o393o172n541n034m944m902m514m071m077m324m162l578
$$ 554383 548925 542835 536442 530270 524729 519695 514751 509849 505335 501264 497187 492863 488701 485123
59060D85123l259l516l819l617l075k680k547k446k232j882j381q20m94o14j016
$$ 485123 481864 478348 474529 470912 467837 465157 462610 460164 457932 456050 454669 453849 453355 452741 451725
59045D51725j338j349j020l84L98R83J020M54m18j123j244o60K67R01Q79M82L25
$$ 451725 450387 449038 448018 447634 448032 449015 450035 450489 450071 448948 447704 447044 447311 448212 449091 449573 449898
59028D49898O93J329J922K585L666N074O136O306N944O016O999Q328R099R084
$$ 449898 450591 451920 453842 456427 460093 465167 471303 477609 483553 489569 496568 504896 513995 523079
59014E23079Q756Q511Q185P428O216M893L819L081K444J547K47j117j897j640
$$ 523079 531835 540346 548531 555959 562175 567068 570887 573968 576412 577959 578206 577089 575192 573552
59000E73552m82R02J803K009J918K050K479K855K980L082L337L418K859J752P62
$$ 573552 573070 573972 575775 577784 579702 581752 584231 587086 590066 593148 596485 599903 602762 604514 605276
58985F05276L78M62N91N57L48j26j046k295l259l217k094o49K70O76J326K636
$$ 605276 605654 606116 606707 607264 607612 607486 606440 604145 600886 597669 595575 594926 595196 595872 597198 599834
58969E99834M085M952N237N523O124O877P578Q134Q339Q065P650P593P750P363
$$ 599834 603919 608871 614108 619631 625755 632632 640210 648344 656683 664748 672398 679991 687741 695104
58955F95104O092M493L233K244J068l93j902l429n168p070q708r674r900r706
$$ 695104 701196 705689 708922 711166 712234 711841 709939 706510 701342 694272 685564 675890 665990 656284
58941F56284r645j0102j0786j0849r868q483p698p656p578o889n874n084m591
$$ 656284 646639 636537 625751 614902 605034 596551 588853 581197 573619 566730 560856 555772 551181
58928E51181m121l573l049k577k076j532r63k90N41J302J518Q77l89j574k040
$$ 551181 547060 543487 540438 537861 535785 534253 533290 533000 533541 534843 536361 537238 536849 535275 533235
58913E33235j776j341j139q83o5J158K025K200K264K893L980M954N610O163O764
$$ 533235 531459 530118 528979 528096 528031 529189 531214 533414 535678 538571 542551 547505 553115 559278 566042
58898E66042P442Q361R516J0372J0421J0002R884J0029R685Q893Q873J0349J2321
$$ 566042 573484 581845 591361 601733 612154 622156 632040 642069 651754 660647 669520 679869 692190
58885F92190J3313J3226J3060J3281J3518J3613J3862J4072J3403J1488Q926O385
$$ 692190 705503 718729 731789 745070 758588 772201 786063 800135 813538 825026 833952 840337
58873H40337L868J213j335l494n387p200q872j0427j2050j3534j4155j3634j2640
$$ 840337 844205 845418 844083 840589 835202 828002 819130 808703 796653 783119 768964 755330 742690
58860G42690j1836j0975r640q360q093q784r379r282q966r021r343r550r502r115
$$ 742690 730854 719879 710239 701879 693786 685002 675623 666341 657375 648354 639011 629461 619959 610844
58846F10844q197o928o031o048o664p111o970o344n494m735m426m639m890m626
$$ 610844 602647 595719 589688 583640 576976 569865 562895 556551 551057 546322 541896 537257 532367 527741
58832E27741l968l595l837m307m531m531m491m158l172j826r91j010j156n41P41
$$ 527741 523773 520178 516341 512034 507503 502972 498481 494323 491151 489325 488334 487324 486168 485627 486368
58817D86368J803K114K010K024K216K306K144J875J853K449L601M525M203K461
$$ 486368 488171 490285 492295 494319 496535 498841 500985 502860 504713 507162 510763 515288 519491 521952
58803E21952L43p78l80Q99J825J495M0j470k168k354k890l740l976l399l063l637
$$ 521952 522295 521517 521137 522036 523861 525356 525396 523926 521758 519404 516514 512774 508798 505399 502336 498699
58787D98699m191l547k144j386j488j264l6J386J937J650J377J699K476L072K875
$$ 498699 494508 490961 488817 487431 485943 484679 484643 486029 487966 489616 490993 492692 495168 498240 501115
58772E01115J878Q12L43K10l19j379k415l146l785m307m317l823l450l533l708
$$ 501115 502993 503805 504148 504358 504039 502660 500245 497099 493314 489007 484690 480867 477417 473884 470176
58757D70176l641l483l290k680j558n63k49l31j86L10R07J491J953K039J833J986
$$ 470176 466535 463052 459762 457082 455524 454961 454712 454381 454195 454505 455412 456903 458856 460895 462728 464714
58741D64714K833L683L598K691K014K283L219M140M639M696M491M249M086M020
$$ 464714 467547 471230 474828 477519 479533 481816 485035 489175 493814 498510 503001 507250 511336 515356
58727E15356M108M372M483M049L334L208L994M879M938M351L974M133M485M800
$$ 515356 519464 523836 528319 532368 535702 538910 542904 547783 552721 557072 561046 565179 569664 574464
58713E74464N125N300N081M744M889N539O015N806N090M259L410K475J391Oj852
$$ 574464 579589 584889 589970 594714 599603 605142 611157 616963 622053 626312 629722 632197 633588 633594 631742
58698F31742l991n897p265q306r367j0461j1278j1584j1518j1524j1854j2119
$$ 631742 627751 621854 614589 606283 596916 586455 575177 563593 552075 540551 528697 516578
58686E16578j1648j0475r430q912q118o232l972k933l494m384m437l810l097k280
$$ 516578 504930 494455 485025 476113 467995 461763 457791 454858 451364 446980 442543 438733 435636 433356
58672D33356j153o7N40Q70J316J765J973K303L219M355M949N075N567O577P115
$$ 433356 432203 432136 432676 433546 434862 436627 438600 440903 444122 448477 453426 458501 464068 470645 477760
58657D77760O355M686L030J711N60l91j005j569k457l347l464k714j990k047k602
$$ 477760 484115 488801 491831 493542 494102 493711 492706 491137 488680 485333 481869 479155 477165 475118 472516
58642D72516k893k695k334k003j585j071o13j78M72J337K082K454K520K405K121
$$ 472516 469623 466928 464594 462591 461006 459935 459322 459144 459616 460953 463035 465489 468009 470414 472535
58627D72535J837J911K394K738K396J542Q67O60N24P3m19l45L72J104J262R69
$$ 472535 474372 476283 478677 481415 483811 485353 486220 486880 487404 487477 487058 486713 487085 488189 489451 490420
58611D90420P88R60J259J572K136K982L600L505K858K153J539R39N23M50L12m31
$$ 490420 491208 492168 493427 494999 497135 500117 503717 507222 510080 512233 513772 514711 515234 515684 515996 515565
58595E15565j474j922j617j394j737k045j679j000o49m34K61J352K157K492K922
$$ 515565 514091 512169 510552 509158 507421 505376 503697 502697 502048 501614 501875 503227 505384 507876 510798
58580E10798L896N217O377P052P214P103P039P055O880O493O383O896P644Q054
$$ 510798 514694 519911 526288 533340 540554 547657 554696 561751 568631 575124 581507 588403 596047 604101
58566F04101Q167Q456R075R844J0760J1935J3124J3919J4353J4854J5652J6634
$$ 604101 612268 620724 629799 639643 650403 662338 675462 689381 703734 718588 734240 750874
58554G50874J7540J7862J6904J4554J1740R398P290M645J664o84k244l828n632
$$ 750874 768414 786276 803180 817734 829474 838872 846162 850807 852471 851787 849543 845715 840083
58541H40083o705o534o085o550p862r117r851j0174j0263j0435j1231j2663j3693
$$ 840083 833378 826844 820759 814209 806347 797230 787379 777205 766942 756507 745276 732613 718920
58528G18920j3282j1708j0177r368q950q392p491o179m487k820j755j386j259
$$ 718920 705638 693930 683753 674385 665435 657043 649552 643373 638886 636066 634311 632925 631666
58515F31666j010p16n66o07q83j468k160k434k001j235q49j139j737k081k025
$$ 631666 630656 629940 629374 628767 627884 626416 624256 621822 619821 618586 617737 616598 614861 612780 610755
58500F10755j879j902j948j725j299j079j285j701j962j891j462p07J89R21J319
$$ 610755 608876 606974 605026 603301 602002 600923 599638 597937 595975 594084 592622 591915 592104 593025 594344
58485E94344J517J747K148K787L656M542N197N682O309P105P687P897Q160Q851
$$ 594344 595861 597608 599756 602543 606199 610741 615938 621620 627929 635034 642721 650618 658778 667629
58471F67629R575R511Q403O767N255M082L094J963L48j770l787m832m602l659
$$ 667629 677204 686715 695118 701885 707140 711222 714316 716279 716627 714857 711070 706238 701636 697977
58457F97977k750k043j186O7J596L112M358N125N431N748O608P726P865O067K913
$$ 697977 695227 693184 691998 692065 693661 696773 701131 706256 711687 717435 724043 731769 739634 745701 748614
58442G48614L2j633k529l401m228m666m917n371n720n175l591j763n07J37O70
$$ 748614 748646 747013 744484 741083 736855 732189 727272 721901 716181 711006 707415 705652 705145 705282 705952
58427G05952J541K824M102M710M480M179M689N853O731O975P156P560P533O475
$$ 705952 707493 710317 714419 719129 723609 727788 732477 738330 745061 752036 759192 766752 774285 780760
58413G80760M796L233J795M7j854l208l723l851m101m506m826m918m781m434l891
$$ 780760 785556 788789 790584 790631 788777 785569 781846 777995 773894 769388 764562 759644 754863 750429 746538
58398G46538l203k535k161k181k179j522j76J039J338R39P29J082J404R81l3p17
$$ 746538 743335 740800 738639 736458 734279 732757 732581 733620 734958 735897 736626 737708 739112 740093 740060 739343
58382G39343m17M88R96N79k35m53M23K106L953N331N853N642N339N516O089O620
$$ 739343 738926 739414 740410 740989 740754 740301 740724 742830 746783 752114 757967 763609 768948 774464 780553 787173
58366G87173P038P553Q055Q253Q346Q865R695J0046R664R323R686J0335J0489
$$ 787173 794211 801764 809819 818072 826418 835283 844978 855024 864688 874011 883697 894032 904521
58353I04521J0204J0150J0540J0842J0451R198P418N813N060N166N488N571N662
$$ 904521 914725 924875 935415 946257 956708 965906 973324 979137 984197 989363 994851 1000422 1006084
58340A006084O051O445O492O593P439Q936J0223J0787J1015J1541J2480J3437
$$ 1006084 1012135 1018580 1025072 1031665 1039104 1048040 1058263 1069050 1080065 1091606 1104086 1117523
58328A117523J3992J4014J3663J3183J2747J2435J2355J2484J2509J1994J0845
$$ 1117523 1131515 1145529 1159192 1172375 1185122 1197557 1209912 1222396 1234905 1246899 1257744
58317A257744R352P815O483N736N835O356O525O236O186O788P632Q409R590J1563
$$ 1257744 1267096 1274911 1281394 1287130 1292965 1299321 1305846 1312082 1318268 1325056 1332688 1341097 1350687 1362250
58303A362250J3643J4773J4919J4995J5585J6409J7099J7834J8961K0381K1516
$$ 1362250 1375893 1390666 1405585 1420580 1436165 1452574 1469673 1487507 1506468 1526849 1548365
58292A548365K1815K1264K0430K0003K0296K1236K2572K3905K4720K4887K5035
$$ 1548365 1570180 1591444 1611874 1631877 1652173 1673409 1695981 1719886 1744606 1769493 1794528
58281A794528K5873K7259K8515K9425L0264L1000L1473L2239L4108L6667L8502
$$ 1794528 1820401 1847660 1876175 1905600 1935864 1966864 1998337 2030576 2064684 2101351 2139853
58270B139853L9206L9933M1465M3000M3596M3653M4191M5582M7804N0871N4178
$$ 2139853 2179059 2218992 2260457 2303457 2347053 2390706 2434897 2480479 2528283 2579154 2633332
58259B633332N6497N7615N8960O1641O4915O7620O9976P2641P5114P6698P8128
$$ 2633332 2689829 2747444 2806404 2868045 2932960 3000580 3070556 3143197 3218311 3295009 3373137
58248C373137Q0647Q4014Q7113Q9993R3701R8419J03375J08440J14324J21129
$$ 3373137 3453784 3537798 3624911 3714904 3808605 3907024 4010399 4118839 4233163 4354292
58238D354292J28088J34811J41820J49852J59316J70221J81972J93766K05849
$$ 4354292 4482380 4617191 4759011 4908863 5068179 5238400 5420372 5614138 5819987
58229E819987K19555K35345K51949K68478K86156L06604L29702L54669L82067
$$ 5819987 6039542 6274887 6526836 6795314 7081470 7388074 7717776 8072445 8454512
58220H454512M12911M46982M83901N24855N71355O23502O81509P47690Q24780
$$ 8454512 8867423 9314405 9798306 10323161 10894516 11518018 12199527 12947217 13771997
58211A3771997R13667J015214J133047J272079J436022J629453J861132K142920
$$ 13771997 14685664 15700878 16833925 18106004 19542026 21171479 23032611 25175531
58203B5175531K488241K916083L454422M133381M972772N976642P136040Q433093
$$ 25175531 27663772 30579855 34034277 38167658 43140430 49117072 56253112 64686205
58195F4686205R847509J1368399J3000758J4756137J6638307J8635872K0705043
$$ 64686205 74533714 85902113 98902871 113659008 130297315 148933187 169638230
58188A69638230K2724239K4450354K5528310K5550500K4116801K0895847J5747193
$$ 169638230 192362469 216812823 242341133 267891633 292008434 312904281 328651474
58181C28651474Q891311R79315p063040j4336844k0199519k4311180k6580807
$$ 328651474 337542785 338522100 331459060 317122216 296922697 272611517 246030710
58174B46030710k7128321k6261847k4408118k2000045j9388950j6817800j4432331
$$ 246030710 218902389 192640542 168232424 146232379 126843429 110025629 95593298
58167I5593298j2301675j0443743q851384p506772o383378n448736m672112m027933
$$ 95593298 83291623 72847880 63996496 56489724 50106346 44657610 39985498 35957565
58159C5957565l492779l044537k665963k345349k072853j839274j638386j466466
$$ 35957565 32464786 29420249 26754286 24408937 22336084 20496810 18858424 17391958
58151A7391958j318661j188904j073730r72802q84948q06704p35400o70749o12503
$$ 17391958 16073297 14884393 13810663 12837861 11952913 11146209 10410809 9740060 9127557
58142I127557n59265n10538m67343m29744l95948l64803l37004l12908k91194
$$ 9127557 8568292 8057754 7590411 7160667 6764719 6399916 6062912 5750004 5458810
58133E458810k70763k52038k35278k19427k03772j89181j76436j64851j53670
$$ 5458810 5188047 4936009 4700731 4481304 4277532 4088351 3911915 3747064 3593394
58124C593394j43504j35031j27403j19353j11065j03760r7927r3066q8703q4692
$$ 3593394 3449890 3314859 3187456 3068103 2957038 2853278 2755351 2662285 2573582 2488890
58114B488890q0843p6956p3123o9543o6304o3552o1375n9345n6746n3602n0866
$$ 2488890 2408047 2331091 2257968 2188425 2122121 2058569 1997194 1937849 1881103 1827501 1776635
58103A776635m9221m8334m7501m6442m5032m3012m0510l8252l6701l5454l3938
$$ 1776635 1727414 1679080 1631579 1585137 1540105 1497093 1456583 1418331 1381630 1346176 1312238
58092A312238l2288l0929k9715k8142k6160k4236k2650k1239j9837j8630j7875
$$ 1312238 1279950 1249021 1219306 1191164 1165004 1140768 1118118 1096879 1077042 1058412 1040537
58081A040537j7512j7216j6866j6831j7467j8358j8442j7217j5444j4175j3458
$$ 1040537 1023025 1005809 988943 972112 954645 936287 917845 900628 885184 871009 857551
58070H57551j2669j1849j1821j2814j3844j3791j2614j1133j0067r595r492r395
$$ 857551 844882 833033 821212 808398 794554 780763 768149 757016 746949 737354 727862 718467
58058G18467r130q957r232r765r913r459q971r047r540r835r583q870p895o828
$$ 718467 709337 700380 691148 681383 671470 662011 653040 643993 634453 624618 615035 606165 598270 591442
58044E91442n939n522n634n980o125n864n404n135n255n681o258o856p247p254
$$ 591442 585503 579981 574347 568367 562242 556378 550974 545839 540584 534903 528645 521789 514542 507288
58030E07288p106p192p364p028o188n755o243o858o690o202o490p427p799p243
$$ 507288 500182 492990 485626 478598 472410 466655 460412 453554 446864 440662 434172 426745 418946 411703
58016D11703o720o738o436n131l705l495m386n039m688l853l296l084k896k674
$$ 411703 404983 398245 391809 386678 382973 379478 375092 370053 365365 361512 358216 355132 352236 349562
58002C49562k585k601k376j657o65M6J60p0j60J03N94J110J418J291Q44O60J098
$$ 349562 346977 344376 342000 340343 339678 339724 339884 339814 339654 339757 340351 341461 342879 344170 345014 345674 346772
57985C46772J579J112m30k099l021l250l393l841m517n029m840l709k149j070
$$ 346772 348351 349463 349033 346934 343913 340663 337270 333429 328912 323883 319043 315334 313185 312115
57971C12115q44j064j280j480j673j531q30J13Q15J119J141R70P20N76N31K83
$$ 312115 311271 310207 308927 307447 305774 304243 303413 303526 304341 305460 306601 307571 308291 308867 309398 309681
57955C09681l56j157j744j953j854j655j670k049k395k040q29O42J678K035J782
$$ 309681 309325 308168 306424 304471 302617 300962 299292 297243 294848 292808 291979 292621 294299 296334 298116
57940B98116J129N71O93J553K613L441M078M577M790M848N174N645N438M264L050
$$ 298116 299245 299816 300509 302062 304675 308116 312194 316771 321561 326409 331583 337228 342666 346930 349980
57925C49980K739K940K635J743R62L72p08k350l599l765l346l175l246l042k577
$$ 349980 352719 355659 358294 360037 360999 361371 360663 358313 354714 350949 347603 344428 341182 338140 335563
57910C35563k468k989l605l652l111k540k335k352k250k006j914k175k729l326
$$ 335563 333095 330106 326501 322849 319738 317198 314863 312511 310261 308255 306341 304166 301437 298111
57896B98111l639l420k826k417k484k539j991j169r60j393j477p10J25K18J3M37
$$ 298111 294472 291052 288226 285809 283325 280786 278795 277626 276666 275273 273796 273086 273211 273429 273442 273879
57880B73879J403J937J532N50m76j232j469j222j080j507k051j906j180p44q62
$$ 273879 275282 277219 278751 279301 278825 277593 276124 274902 273822 272315 270264 268358 267178 266434 265572
57865B65572q16j74M74L87l22j009j301j234j024r44j093j034j68J392K741L244
$$ 265572 264756 264582 265056 265443 265121 264112 262811 261577 260553 259609 258516 257482 257314 258706 261447 264691
57849B64691L083K604J814R41O94J276J641O61j290k732k918k465k210k283k520
$$ 264691 267774 270378 272192 273133 273827 275103 276744 277405 276115 273383 270465 268000 265790 263507 260987
57834B60987l001l637l863l253k163j317r51q45r68j464k006j793n28J017J800
$$ 260987 257986 254349 250486 247233 245070 243753 242802 241957 240989 239525 237519 235726 235198 236215 238015
57819B38015J631J209J180J529J851J782J225M07j94l48n15j398k974m393m934
$$ 238015 239646 240855 242035 243564 245415 247197 248422 248829 248635 248287 247772 246374 243400 239007 234073
57804B34073m653l961l099k332k062k267k299j761j149r92q53j3J183J709J417
$$ 234073 229420 225459 222360 220028 217966 215699 213400 211639 210490 209498 208645 208632 209815 211524 212941
57789B12941J191J437J502R40M14P27J756K856L637L847L199J954J060J008J134
$$ 212941 214132 215569 217071 218011 218425 219152 220908 223764 227401 231248 234447 236401 237461 238469 239603
57774B39603P51L96R60K049K369J664J066J358J872J576M88o13j348k036k995
$$ 239603 240354 240750 241710 243759 246128 247792 248858 250216 252088 253664 254152 253539 252191 250155 247160
57759B47160l936m194l430k165j416j587j958j633q09m44p98j024m60M67R58Q99
$$ 247160 243224 239030 235600 233435 232019 230432 228474 226841 226032 225588 224790 223766 223306 223773 224731 225630
57743B25630O91N77O10R34J492J735J250M26j7n5k45o87p62j06P53J044O42j8
$$ 225630 226321 226898 227508 228442 229934 231669 232919 233345 233328 233273 233028 232341 231579 231473 232226 233270 233912 233894
57725B33894n92j018j246j182r17o95o34o12n62o77j209k044k632k492j767j144
$$ 233894 233302 232284 231038 229856 228939 228244 227610 226998 226436 225759 224550 222506 219874 217382 215615 214471
57709B14471j130j563j968k192k447k777k901k677k316k029j735j423j416j831
$$ 214471 213341 211778 209810 207618 205171 202394 199493 196816 194500 192471 190736 189313 187897 186066
57695A86066k062j377l2Q42O86K30L61P95N21o98j998k587k555k261j601l95R78
$$ 186066 184004 182627 182595 183437 184123 184353 184714 185509 186030 185332 183334 180747 178192 175931 174330 173935 174913
57678A74913J942K611L690N496P534R166J0277J1174J2210J3765J6236J9614K3223
$$ 174913 176855 179466 183156 188652 196186 205352 215629 226803 239013 252778 269014 288628 311851
57665C11851K6083K7480K6973K4178J8908J1497K766o362j4914k1713k5691k6649
$$ 311851 337934 365414 392387 416565 435473 446970 449736 443374 428460 406747 381056 354407
57653C54407k5464k3391k1233j9189j7101j4701j1887r100p143o287n758m604
$$ 354407 328943 305552 284319 265130 248029 233328 221441 212341 205198 198911 193153 188549
57641A88549k938j745j445j293n70L15M80o5m52k52O3K0k47n14r93j741k153j697
$$ 188549 185611 183866 182421 181128 180558 180873 181353 181288 180836 180584 180647 180667 180420 179906 178913 177172 175019 173322
57623A73322q38n30r16j252j127r87j269j697j843j849k074k414k438j998j307
$$ 173322 172484 171954 171038 169786 168659 167672 166403 164706 162863 161014 158940 156526 154088 152090 150783
57608A50783o02o4J41R2J48L86L16l46r84q36k08j03p06j109p22l8L15L98L41
$$ 150783 150181 150117 150258 150350 150498 150884 151200 150854 149870 149034 148826 148723 148017 146908 146186 146148 146463 146861 147202
57589A47202k06j285k010j721j194j626k798l307k612j656j294j212q63m97n94
$$ 147202 146996 145711 143701 141980 140786 139160 136362 133055 130443 128787 127493 126281 125418 124921 124327
57574A24327r50j087j101j412j913k049j622r49l65L1J70M8j43k12k35l63m66
$$ 124327 123377 122290 121189 119777 117864 115815 114193 113244 112879 112910 113080 113128 112985 112773 112538 112175 111709
57557A11709l61j53kK55Q05J317J252O81K48K87M98N56N19M93M17L54N30Q60Q79
$$ 111709 111348 111195 111193 111448 112253 113570 114822 115503 115751 116038 116536 117092 117611 118104 118521 118875 119405 120265 121144
57538A21144N09L62R23J756K042J618J072R14J102J210Q12j79j248j544q30J06
$$ 121144 121653 122015 122938 124694 126736 128354 129426 130340 131442 132652 133464 133285 132037 130493 129663 129769
57522A29769L09k11p55j046j402j806j639o44M67Q16M98L39P58J303J290O09k14
$$ 129769 130078 129867 129112 128066 126664 124858 123219 122575 123042 123858 124356 124695 125453 126756 128046 128655 128441
57505A28441n99m66k54l89q15j154j240j240j253j143q52n84n03n53o91r99j351
$$ 128441 127842 127376 127122 126733 125918 124764 123524 122284 121031 119888 119036 118452 117949 117396 116705 115706 114355
57488A14355j329p88k01n1j62j6M30P37O19K04l20q01r80p15l64m30p84p82k06
$$ 114355 113026 112238 112037 111986 111824 111808 112238 112975 113594 113798 113478 112677 111697 110982 110618 110188 109404 108622 108416
57469A08416M42P72J003J327J309M77q37j779j903j428o76K66J309K084K074J038
$$ 108416 108858 109630 110633 111960 113269 113746 112909 111130 109227 107799 107123 107389 108698 110782 112856 113894
57453A13894n55j647j501n89p9l99q15p64o89j061j303o79L21N79O1k39J3J03
$$ 113894 113339 111692 110191 109602 109523 109124 108309 107545 106856 105795 104492 103813 104134 104713 104774 104535 104548 104651
57435A04651k29k32L89P10P3o56l75M28L44q30j788j525m05O62J275J469J330
$$ 104651 104422 104190 104579 105289 105362 104706 104331 104759 105103 104273 102485 100960 100555 101217 102492 103961 105291
57418A05291J023Q26P81O08J49l70o04m75j57Q7Q5p2o2K31M66L35O0M2J51p6o33
$$ 105291 106314 107140 107921 108529 108678 108308 107704 107229 107072 107159 107244 107172 107110 107341 107807 108142 108202 108244 108395 108319 107686
57397A07686r61p78m04j86j20j89m89q09n93L29J421K111K363K349K045J602J564
$$ 107686 106725 105947 105543 105357 105237 105048 104559 103750 103157 103486 104907 107018 109381 111730 113775 115377 116941
57380A16941K168K775K618J827J148P46J32q69j696j821j401q89m81k13k52p13
$$ 116941 119109 121884 124502 126329 127477 128223 128355 127486 125790 123969 122568 121679 121198 120985 120733 120020
57364A20020j323j573j174l33M05N54R2m64n22l5N10P09O43O41Q05R73R77P54
$$ 120020 118697 117124 115950 115617 116022 116576 116668 116204 115682 115647 116157 116866 117509 118150 118955 119928 120905 121659
57346A21659L59j8p2L68J085J623J649J239P51N08N16N11K97K7O1M35O90M39o4
$$ 121659 122018 122000 121928 122296 123381 125004 126653 127892 128643 129151 129667 130178 130475 130502 130563 130998 131688 132127 132063
57327A32063j93J64L89k6p32j024q08n62m15J1P13R34K61n32m36L06N76N6l57
$$ 132063 131870 132034 132423 132397 131665 130641 129833 129271 128856 128867 129580 130514 130775 130243 129807 130113 130689 130745 130388
57308A30388OO34P76N36M73O78Q40Q17N74n3r09j229n33M88P37J95k20j70k98
$$ 130388 130394 131028 131804 132340 132813 133491 134331 135148 135722 135669 134760 133531 132998 133486 134223 134418 134198 134028 133730
57289A33730r90j675j770j567j660k025k231k156k003j896j837j815j671j127
$$ 133730 132740 131065 129295 127728 126068 124043 121812 119656 117653 115757 113920 112105 110434 109307
57275A09307k61M52Q17J254K052K727K703K231K033K309K719L137L725M337M495
$$ 109307 109046 109498 110315 111569 113621 116348 119051 121282 123315 125624 128343 131480 135205 139542 144037
57260A44037M035L242K389J663J437K021L039L724L857L855L878L587K972K547
$$ 144037 148072 151314 153703 155366 156803 158824 161863 165587 169444 173299 177177 180764 183736 186283
57246A86283K497K342J887J656J909J994J417Q20R91J498J376P65O73J211J317
$$ 186283 188780 191122 193009 194665 196574 198568 199985 200805 201796 203294 204670 205435 206108 207319 208636
57231B08636M87l46j13R63J890K146J965J721J612J633J619J464J427J842K488
$$ 208636 209123 208777 208664 209627 211517 213663 215628 217349 218961 220594 222213 223677 225104 226946 229434
57216B29434K791K741K934L436L382K282R73O20J247K002K427K745L077L210L085
$$ 229434 232225 234966 237900 241336 244718 247000 247973 248593 249840 251842 254269 257014 260091 263301 266386
57201B66386K971L115L592M306M834M582L603K802K781K963K630K257K802M032
$$ 266386 269357 272472 276064 280370 285204 289786 293389 296191 298972 301935 304565 306822 309624 313656
57187C13656M822M924N157N747N884N278M877N373O132O319O178O384O896P270
$$ 313656 318478 323402 328559 334306 340190 345468 350345 355718 361850 368169 374347 380731 387627 394897
57173C94897P447P532P378P054P138P850Q519Q562Q289Q094P663O926O815P900
$$ 394897 402344 409876 417254 424308 431446 439296 447815 456377 464666 472760 480423 487349 494164 502064
57159E02064R032Q849Q044Q441J0132J1274J0909J0185J0309J0872J1066J1208
$$ 502064 511096 519945 527989 536430 546562 557836 568745 578930 589239 600111 611177 622385
57147F22385J2044J3421J4620J5411J6032J6685J7691J9463K1710K3280K3608
$$ 622385 634429 647850 662470 677881 693913 710598 728289 747752 769462 792742 816350
57136H16350K3753K5101K7544K9845L1494L3089L4984L6629L7588L8387L9891
$$ 816350 840103 865204 892748 922593 954087 987176 1022160 1058789 1096377 1134764 1174655
57125A174655M2318M5322M8708N2557N6714O0668O4178O7810P2481P8433Q5002
$$ 1174655 1216973 1262295 1311003 1363560 1420274 1480942 1545120 1612930 1685411 1763844 1848846
57114A848846R1662R8935J07849J18677J30777J43747J58098J74712J94132K16784
$$ 1848846 1940508 2039443 2147292 2265969 2396746 2540493 2698591 2873303 3067435 3284219
57104C284219K43521K75739L15246L64206M24917M99454N89635O97233Q23725
$$ 3284219 3527740 3803479 4118725 4482931 4907848 5407302 5996937 6694170 7517895
57095G517895R69420J132850J310743J498260J689600J879248K063372K241001
$$ 7517895 8487315 9620165 10930908 12429168 14118768 15998016 18061388 20302389
57087B0302389K415451K594384K783542K973428L130140L205010L160845K992287
$$ 20302389 22717840 25312224 28095766 31069194 34199334 37404344 40565189 43557476
57079D3557476K721305K374828J968513J509190J006153M75937o2263n92712j104396
$$ 43557476 46278781 48653609 50622122 52131312 53137465 53613402 53551139 52958427 51854031
57070E1854031j587914k031656k420377k737179k967593l103248l143626l096074
$$ 51854031 50266117 48234461 45814084 43076905 40109312 37006064 33862438 30766364
57062C0766364k974292k795541k577777k338218k092773j854648j632605j430971
$$ 30766364 27792072 24996531 22418754 20080536 17987763 16133115 14500510 13069539
57054A3069539j251464j094437r58623q41171p38990o49857n72179n04636m46603
$$ 13069539 11818075 10723638 9765015 8923844 8184854 7534997 6962818 6458182 6011579
57045F011579l98114l58690l26621k99839k76947k56962k38711k21205k04140
$$ 6011579 5613465 5254775 4928154 4628315 4351368 4094406 3855695 3634490 3430350
57036C430350j87374j70410j52940j35513j18851j02882q7087p1494n6721m3512
$$ 3430350 3242976 3072566 2919626 2784113 2665262 2562380 2475293 2403799 2347078 2303566
57026B303566l3163k8054l0452m0300n4782p0282q4194r4897j01035j01829r7948
$$ 2303566 2270403 2242349 2211897 2171597 2116815 2046533 1962339 1867442 1766407 1664578 1566630
57015A566630r1413q4323p7699p1414o5047n8629n2584m7155m2260l7905l4359
$$ 1566630 1475217 1390894 1313195 1241781 1176734 1118105 1065521 1018366 976106 938201 903842
57004I03842l1755k9888k8634k8046k7800k7022k5292k3437k2575k2618k2396
$$ 903842 872087 842199 813565 785519 757719 730697 705405 681968 659393 636775 614379
56993F14379k1177j9315j7352j5304j3034j0668q297n790l285j440p11p13p03
$$ 614379 593202 573887 556535 541231 528197 517529 509232 503442 500157 498717 498006 497293 496590
56980D96590n06o37j686l824o745r762j2094j3400j4003j4348j4325j3403j1405
$$ 496590 496084 495447 493761 489937 483192 473430 461336 447936 433933 419585 405260 391857 380452
56967C80452q920o791n301l960k052O07L475N840P503Q850J0289J1734J2639J2387
$$ 380452 371532 364741 359440 355480 353428 354035 357510 363350 370853 379703 389992 401726 414365 426752
56953D26752J0604P323L011j610n857r327j1960j3888j5164j5544j4677j2670
$$ 426752 437356 444679 447690 446080 440223 430896 418936 405048 389884 374340 359663 346993
56941C46993j0283q262o521m299j175K419N760Q594J1180J3812J6487J8801J9885
$$ 346993 336710 328448 321927 317628 316453 318872 324632 333226 344406 358218 374705 393506 413391
56928D13391J8741J4990R301K902l354r249j4688j9290k2526k4091k4054k2815
$$ 413391 432132 447122 456423 459325 455971 446722 432034 412744 390218 366127 342073 319258
56916C19258k0902j8723j6457j4253j2432j1257j0559r810q688p386o241n271
$$ 319258 298356 279633 263176 248923 236491 225234 214675 204865 196177 188791 182550 177279
56904A77279m242l090k000j111l39M35J182J830K491L473N041P187R526J1456
$$ 177279 173037 169947 167947 166836 166497 166932 168114 169944 172435 175908 180949 188136 197662 209118
56890B09118J2558J2987J3415J4424J5945J7312J7811J7064J5013J1788P746L446
$$ 209118 221676 234663 248078 262502 278447 295759 313570 330634 345647 357435 365181 368627
56878C68627n78m038o838q889j0019j0028q783o400l387m28K211M987Q519J2763
$$ 368627 368049 364011 357173 348284 338265 328237 319454 313054 309667 309239 311450 316437 324956 337719
56864C37719J6998K0716K4236K8135L2235L5503L6892L5986L2755K7184J9472
$$ 337719 354717 375433 399669 427804 460039 495542 532434 568420 601175 628359 647831
56853F47831J0429J130p747j5894k2617k6663k7232k4807k0584j5289r021k119
$$ 647831 658260 659390 651643 635749 613132 586469 559237 534430 513846 498557 489536 487417
56841D87417M587J0640J6566K3169L0424L7476M3624M8813N3121N5999N6247N2624
$$ 487417 492004 502644 519210 542379 572803 610279 653903 702716 755837 811836 868083 920707
56829I20707M4497L2104J6528m99j7039l1506m3011n1080n5189n4935n0789m4296
$$ 920707 965204 997308 1013836 1013337 996298 964792 921781 870701 815512 760577 709788 665492
56817F65492l7045k9587k1698j3470n542J750Q757J5820K2640K8639L3508L6977
$$ 665492 628447 598860 577162 563692 558150 559900 568657 584477 607117 635756 669264 706241
56805G06241L8360L6765L1622K2936J1332j893j5108k7054l7024m4266m7888m7749
$$ 706241 744601 781366 812988 835924 847256 845363 830255 803201 766177 721911 674023 626274
56793F26274m4957m0846l5836k9844k3338j7210j1763o695j939K224N912R626
$$ 626274 581317 540471 504635 474791 451453 434243 422480 415785 413846 416070 421982 431608
56781D31608J3337J6238J7638J7422J5499J1483N343k121r812j6941k2945k7308
$$ 431608 444945 461183 478821 496243 511742 523225 528568 526447 516635 499694 476749 449441
56769D49441k9794l0520k9720k7769k5431k3393k1434j8775j5463j2589j0822
$$ 449441 419647 389127 359407 331638 306207 282814 261380 242605 227142 214553 203731
56758B03731r617q386p476p221o919n862m667m442m921m782l594k321j721j457
$$ 203731 194114 185728 178252 171031 164112 158250 153583 149141 144220 139438 135844 133523 131802 130345
56744A30345j048p22q42j262j643j881j853j378p46o44j190j607j235l98J72K75
$$ 130345 129297 128575 127733 126471 124828 122947 121094 119716 118970 118326 117136 115529 114294 113896 114068 114343
56728A14343J59l5k47l21k78m25p60o93J61J263J820J814J758J709J297N98K11
$$ 114343 114502 114467 114220 113899 113621 113196 112436 111743 111904 113167 114987 116801 118559 120268 121565 122163 122374
56711A22374M03Q10J063J167J181J073R87J088J056L35q62j473r17J03N81M91
$$ 122374 122777 123587 124650 125817 126998 128071 129058 130146 131202 131537 130675 129202 128285 128388 128969 129460
56695A29460M90O95N58j16p30o63n3M64M66L0m92q14q77q37q32q00n76j56K69
$$ 129460 129950 130645 131203 131087 130357 129694 129641 130105 130571 130601 130109 129295 128418 127581 126749 125949 125373 125217 125486
56676A25486N13N05K88K6l7K17O00Q19Q36Q46R40J032J110J312J678K012K114
$$ 125486 125999 126504 126792 126818 126781 126998 127598 128417 129253 130099 131039 132071 133181 134493 136171 138183 140297
56659A40297K031J965K080K334K476K197J535J009J063J400J320P79N84J197J894
$$ 140297 142328 144293 146373 148707 151183 153380 154915 155924 156987 158387 159707 160486 161070 162267 164161
56644A64161J670O66m2N2K79j46j008j472j121l32K08R0n15r37n89L30Q63L45
$$ 164161 165831 166497 166455 166507 166786 166640 165632 164160 163039 162707 162915 163005 162490 161553 160964 161294 162157 162502
56626A62502q28j768k171k381k537k260j356l27J99K08R7L9j03l35m25k42R7M29
$$ 162502 161674 159906 157735 155354 152817 150557 149201 148874 149073 149281 149378 149417 149314 148979 148554 148312 148409 148838
56608A48838N88L17n34j613k279k276j895j392p25l3J20n18j329j518j074n08
$$ 148838 149426 149743 149209 147596 145317 143041 141146 139754 139029 138996 139116 138598 137269 135751 134677 134169
56592A34169Q1R15J701J726R75L00K52M60N53R10J897K940L131K359J250K67m15
$$ 134169 134250 135165 136866 138592 139567 139867 140119 140579 141132 142042 143939 146879 150010 152369 153619 153886 153471
56575A53471m74K33J056J085M20J65R73K295L251L610L629L495L387L631M367
$$ 153471 152997 153230 154286 155371 155791 155956 156929 159224 162475 166085 169714 173209 176596 180227 184594
56560A84594N249N883O307O822P497Q080Q245P733O520M988L746L036K523J756
$$ 184594 189843 195726 202033 208855 216352 224432 232677 240410 246930 251918 255664 258700 261223 262979
56546B62979O61n09j496k135k411k496k540k427k018j603j674k162k508k543k665
$$ 262979 263640 263131 261635 259500 257089 254593 252053 249626 247608 246005 244331 242169 239661 237118 234453
56531B34453k945k839k229j906k383k871k389j381j126j831k414k180j652j472
$$ 234453 231508 228669 226440 224534 222151 219280 216891 215510 214384 212553 210139 207959 206307 204835
56517B04835j482j348j268j483j704j612j490j760k208k216j615q54l65j51M3
$$ 204835 203353 202005 200737 199254 197550 195938 194448 192688 190480 188264 186649 185795 185430 185279 185322
56502A85322M00Q74J175R66K18p17j469j933k094j850j197m34Q0L11M34M31N8
$$ 185322 185722 186596 187771 188737 188955 188238 186769 184836 182742 180892 179695 179261 179341 179652 180086 180517 180575
56485A80575p44j582j879j434o25k2K38M64Q41J111J030Q21P73O50Q2n86n42L17
$$ 180575 179831 178249 176370 174936 174311 174289 174527 174991 175832 176943 177973 178794 179567 180217 180299 179713 179171 179488
56467A79488J127J242J022J096J415J551J393J041M09m07p94k81O50J133J120
$$ 179488 180615 181857 182879 183975 185390 186941 188334 189375 189784 189377 188583 188302 188952 190085 191205
56452A91205J285J828K133J716Q58P2m61p14n68n7M47N78K70l10q70r43k65P16
$$ 191205 192490 194318 196451 198167 199025 199097 198636 197922 197354 197297 197744 198322 198592 198282 197412 196469 196204 196920
56434A96920J136P51K36K56O70R35Q68O65M54K94L17N26O34M29J26O5J92J32l33
$$ 196920 198056 198807 199043 199299 199969 200904 201772 202437 202891 203185 203502 204028 204662 205091 205217 205282 205474 205606 205273
56415B05273j033j509j298l44P90J473J793K321K983K857J542Pn32p9N39R83J480
$$ 205273 204240 202731 201433 201089 201879 203352 205145 207466 210449 213306 214848 214855 214323 214244 214783 215766 217246
56398B17246J921J919J649J688J995J892J245P66Q80J094Q09J36m64p85q55p37
$$ 217246 219167 221086 222735 224423 226418 228310 229555 230321 231201 232295 233104 233240 232776 231991 231136 230399
56382B30399o58p62o74J35J373J984J549Q44O66P75N34m3n22q07r99r15m03J68
$$ 230399 229741 228979 228305 228440 229813 231797 233346 234190 234856 235631 236165 236122 235600 234793 233794 232879 232476 232644
56364B32644L82M80R97J863K429K282J654J093R51J081Q81N4o66j74J320K223
$$ 232644 233026 233506 234503 236366 238795 241077 242731 243824 244775 245856 246737 246791 246125 245951 247271 249494
56348B49494J666P78R41J667J423N0j036q70O1Q98J352J427J195J076J552K400
$$ 249494 251160 251938 252879 254546 255969 256019 254983 254113 254174 255072 256424 257851 259046 260122 261674 264074
56332B64074K984L264L786M540M842M391L624K889K150J662J885K515K580J830
$$ 264074 267058 270322 274108 278648 283490 287881 291505 294394 296544 298206 300091 302606 305186 307016
56318C07016J060P75N42O5k12j06k26p97r85k08P86J011O77N86Q41J068J308J740
$$ 307016 308076 308851 309393 309458 309246 309140 308914 308117 307132 306924 307710 308721 309398 309984 310825 311893 313201 314941
56300C14941K052K028K212K979L564L090K161K148L181M061M074L661L274K774
$$ 314941 316993 319021 321233 324212 327776 330866 333027 335175 338356 342417 346491 350152 353426 356200
56286C56200K198K033K471L098L664M244M611M380L997M579O293P868Q227P783
$$ 356200 358398 360431 362902 366000 369664 373908 378519 382899 386896 391475 397768 405636 413863 421646
56272D21646P448P270O916O856P918R913J1726J2773J3509J4425J5383J6219J7279
$$ 421646 429094 436364 443280 450136 458054 467967 479693 492466 505975 520400 535783 552002 569281
56259E69281J8894K0775K2521K4414K7146L0863L4995L9080M3239M7799N2855
$$ 569281 588175 608950 631471 655885 683031 713894 748889 787969 831208 879007 931862
56248I31862N8452O4719P1456P8025Q4047Q9872R5815J01229J04970J06637J06649
$$ 931862 990314 1055033 1126489 1204514 1288561 1378433 1474248 1575477 1680447 1787084 1893733
56237A893733J05131J01561R5590Q7486P7441O5195N0737L4854J8509K153j3987
$$ 1893733 1998864 2100425 2196015 2283501 2360942 2426137 2476874 2511728 2530237 2532390 2518403
56226B518403k9416m3601n6361o7560p6855q4027q9231r2521r3646r2663r0350
$$ 2518403 2488987 2445386 2389025 2321465 2244610 2160583 2071352 1978831 1885185 1792522 1702172
56215A702172q7510q4310q0639p6711p2765o8620o4007n9075n4172m9515m5359
$$ 1702172 1614662 1530352 1449713 1373002 1300237 1231617 1167610 1108535 1054363 1004848 959489
56204I59489m1968l9023l5728l1951k8561k6053k3682k0820j8243j6964j6418
$$ 959489 917521 878498 842770 810819 782258 756205 732523 711703 693460 676496 660078
56193F60078j5156j2953j0879r515q472p612p335p363o615m848l318l141l824
$$ 660078 644922 631969 621090 611575 603103 595491 588156 580793 574178 569330 566012 562871 559047
56180E59047m068l387k289j316n89j02R2N7P9M89J316K135K453K357K413K844
$$ 559047 554979 551592 549303 547987 547398 547296 547388 547445 547524 548013 549329 551464 553917 556274 558687 561531
56164E61531L301L671M404N509O039N386M439M475N433O363P113Q259R646J0448
$$ 561531 564832 568503 572907 578416 584455 589841 594280 598755 604188 610551 617664 625923 635569 646017
56150F46017J0747J1713J3886J6495J8823K1257K4503K8568L2972L7324M1421
$$ 646017 656764 668477 682363 698858 717681 738938 763441 792009 824981 862305 903726
56139I03726M5408M9900N5298O0934O5522O8307O9036O7213O2644N6638N1240
$$ 903726 949134 999034 1054332 1115266 1180788 1249095 1318131 1385344 1447988 1504626 1555866
56128A555866M7072M3123L8791L4749L1348K7697K3014J7752J2567P201J150n417
$$ 1555866 1602938 1646061 1684852 1719601 1750949 1778646 1801660 1819412 1831979 1839180 1840330 1834913
56116A834913j2081j8731k5130l0824l6026m1694m8052n3864n7796n9669n9748
$$ 1834913 1822832 1804101 1778971 1748147 1712121 1670427 1622375 1568511 1510715 1451046 1391298
56105A391298n7805n3819m8794m3831l8895l3371k7475k2210j8189j5139j2443
$$ 1391298 1333493 1279674 1230880 1187049 1148154 1114783 1087308 1065098 1046909 1031770 1019327
56094A019327r668o825m364k717j708p58L21J302K196L223M213M914N778P385
$$ 1019327 1009659 1002834 998470 995753 994045 993287 993608 994910 997106 1000329 1004542 1009456 1015234 1022619
56080A022619R059R404Q441P862Q635R771J0085R884J0019J0457J0760J1138J1964
$$ 1022619 1031678 1041082 1049523 1057385 1066020 1075791 1085876 1095760 1105779 1116236 1126996 1138134 1150098
56067A150098J2979J3696J4116J4421J4652J4987J5639J6277J6441J6620J7662
$$ 1150098 1163077 1176773 1190889 1205310 1219962 1234949 1250588 1266865 1283306 1299926 1317588
56056A317588J9094J9530J9049J9333K0904K2175K2100K1833K2563K3533K3699
$$ 1317588 1336682 1356212 1375261 1394594 1415498 1437673 1459773 1481606 1504169 1527702 1551401
56045A551401K3678K4454K5532K5997K6135K6515K6730K6573K7147K9154L1281
$$ 1551401 1575079 1599533 1625065 1651062 1677197 1703712 1730442 1757015 1784162 1813316 1844597
56034A844597L2071L2236L3371L5391L7158L8606M0315M1842M2419M2688M3825
$$ 1844597 1876668 1908904 1942275 1977666 2014824 2053430 2093745 2135587 2178006 2220694 2264519
56023B264519M5594M6965M8065M9687N1545N2783N3759N5587N8346O1310O4423
$$ 2264519 2310113 2357078 2405143 2454830 2506375 2559158 2612917 2668504 2726850 2788160 2852583
56012B852583O7988P1499P4353P7160Q0893Q5340Q9751R4275R9354J04610J09698
$$ 2852583 2920571 2992070 3066423 3143583 3224476 3309816 3399567 3493842 3593196 3697806 3807504
56001C807504J15276J21653J27770J33057J38937J46733J55558J64134J73106
$$ 3807504 3922780 4044433 4172203 4305260 4444197 4590930 4746488 4910622 5083728
55992E083728J83425J94171K04492K16066K30927K48188K65739K83896L04459
$$ 5083728 5267153 5461324 5665816 5881882 6112809 6360997 6626736 6910632 7215091
55983G215091L27499L52061L78862M09232M42562M77916N16968N62261O13885
$$ 7215091 7542590 7894651 8273513 8682745 9125307 9603223 10120191 10682452 11296337
55974A1296337O71172P36115Q11736Q98731R97589J112346J248423J408898J597669
$$ 11296337 11967509 12703624 13515360 14414091 15411680 16524026 17772449 19181347 20779016
55965B0779016J824688K103784K448280K874915L409848M082717M912845N903612
$$ 20779016 22603704 24707488 27155768 30030683 33440531 37523248 42436093 48339705
55957D8339705P046527Q325172R720267J1221005J2830788J4555796J6391973
$$ 48339705 55386232 63711404 73431671 84652676 97483464 112039260 128431233
55950A28431233J8326301K0327678K2297902K4015630K5137733K5257080K3960108
$$ 128431233 146757534 167085212 189383114 213398744 238536477 263793557 287753665
55943B87753665K0887783J5870716R118409J289978o683643j3915787j9778406
$$ 287753665 308641448 324512164 333630573 334920551 328236908 314321121 294542715
55936B94542715k3924767k6238255k6820046k5980198k4155957k1783239j9209180
$$ 294542715 270617948 244379693 217559647 191579449 167423492 145640253 126431073
55929A26431073j6674088j4324142j2227531j0399147q830006p502535o390910
$$ 126431073 109756985 95432843 83205312 72806165 63976159 56473624 50082714
55922E0082714n463553m691400m050316l516745l067872k686891k363263k087548
$$ 50082714 44619161 39927761 35877445 32360700 29292828 26605937 24242674 22155126
55914B2155126j850092j644374j466954j313687j179561j061968r60464q72996
$$ 22155126 20305034 18660660 17193706 15880019 14700458 13638490 12678026 11805030
55906A1805030p95505p25237o61745o04627n52898n06298m64793m27051l91606
$$ 11805030 11009525 10284288 9622543 9017916 8465018 7958720 7493927 7066876 6675270
55897F675270l59067l30793l06018k82615k60247k40319k23117k07326j92219
$$ 6675270 6316203 5985410 5679392 5396777 5136530 4896211 4673094 4465768 4273549
55888D273549j78201j65296j53067j41902j32644j25065j18319j12568j08546
$$ 4273549 4095348 3930052 3776985 3635083 3502439 3377374 3259055 3146487 3037941
55879C037941j05866j03444j01105r9174r6888r3022q7823q2683p8099p3544o9032
$$ 3037941 2932075 2828631 2727526 2628352 2531464 2438442 2350619 2267936 2189837 2116293 2047261
55868B047261o5247o2289n9685n7447n5761n3958n1244m8111m5678m3990m2280
$$ 2047261 1982014 1919725 1860040 1802593 1746832 1692874 1641630 1593519 1547841 1503851 1461571
55857A461571m0509l9132l7780l5744l3471l2015l1204k9872k7730k5615k4002
$$ 1461571 1421062 1381930 1344150 1308406 1274935 1242920 1211716 1181844 1154114 1128499 1104497
55846A104497k2761k2176k2650k3513k3553k2751k2084k1683k0686j8942j7374
$$ 1104497 1081736 1059560 1036910 1013397 989844 967093 945009 923326 902640 883698 866324
55835H66324j6468j5720j4796j3985j3364j2708j2242j2347j2452j1595j0046
$$ 866324 849856 834136 819340 805355 791991 779283 767041 754694 742242 730647 720601
55824G20601r047q911q792q538r183j1112j3148j4084j3944j3186j1897j0391
$$ 720601 711554 702643 693851 685313 676130 665018 651870 637786 623842 610656 598759 588368
55812E88368r556r764j0260j0156r383q239o897n741n308n383m986l806k729k394
$$ 588368 578812 569048 558788 548632 539249 531010 524113 518372 513064 507681 502695 498889 496160 493766
55798D93766k149j146L16J361J753J806J581J078P43R61J336J290J119J595K610
$$ 493766 491617 490471 490787 492148 493901 495707 497288 498366 499109 500070 501406 502696 503815 505410 508020
55783E08020L058K237P20n75j608l089n357p856r761j0775j1059j0699r593p864
$$ 508020 511078 513315 514035 513460 511852 508763 503406 495550 485789 475014 463955 453256 443663 435799
55769D35799n972m280k809j648j246j986l659n585p187q236q813r216r637r711
$$ 435799 429827 425547 422738 421090 419844 417858 414199 408614 401427 393191 384378 375162 365525 355814
55755C55814q745o721m681l642l469l324k963k934l612m626n361n606n572n530
$$ 355814 347069 340348 335667 332025 328556 325232 322269 319335 315723 311097 305736 300130 294558 289028
55741B89028n485n146m354l452k947k717k177j369j143j787k271j646n69m51j507
$$ 289028 283543 278397 274043 270591 267644 264927 262750 261381 260238 258451 256180 254534 253965 253514 252007
55726B52007k715l469m118m782m805l878k826k723l590m420m230k941j318k26
$$ 252007 249292 245823 241705 236923 232118 228240 225414 222691 219101 214681 210451 207510 206192 205966
55712B05966J82M57R87J562J996K593L493L970L303J910P84K2j089k609l653l806
$$ 205966 206148 206605 207592 209154 211150 213743 217236 221206 224509 226419 227203 227225 226136 223527 219874 216068
55696B16068l803m340n024n112m643m174l862l423k830k448k449k481k083j257
$$ 216068 212265 207925 202901 197789 193146 188972 185110 181687 178857 176409 173960 171479 169396 168139
55682A68139m94k07k03J20J087K394L393L612K991J972J332J388J396L08j688
$$ 168139 167645 167438 167235 167355 168442 170836 174229 177841 180832 182804 184136 185524 186920 187228 185540
55667A85540l173l313k779k415j957r50J3J18k85k81R0J84K00Q58J834J960J060
$$ 185540 182367 179054 176275 173860 171903 170953 170966 171084 170799 170518 170608 170792 170992 171850 173684 175644 176704
55650A76704J97o5k92p82q89k38N54R85J407K033K251J627P90M87M92J68n11j248
$$ 176704 176901 176836 176544 175762 174873 174635 175189 176174 177581 179614 181865 183492 184282 184769 185261 185429 184918 183670
55632A83670k194l562m924n619n647n522n418n094m426l614k856k240j828j600
$$ 183670 181476 177914 172990 167371 161724 156202 150784 145690 141264 137650 134794 132554 130726 129126
55618A29126j394j115q42o46n63p08j149j563j497j011o49p17j037j440j955k388
$$ 129126 127732 126617 125775 125129 124566 123858 122709 121146 119649 118638 117989 117272 116235 114795 112840 110452
55602A10452k330j808j316j004m55M38J024O86l72j446k012j838r99q9J34l36
$$ 110452 108122 106314 104998 103994 103539 103977 105001 105687 105315 103869 101857 100019 99020 98931 99065 98729
55586I8729o89m24P8L85O63J084J256Q72L78L76P78J146J407J732K102K512L153
$$ 98729 98040 97616 97694 98079 98742 99826 101082 101954 102332 102708 103486 104632 106039 107771 109873 112385 115538
55569A15538L821L700K450J073Q97J905K805K593J362k67j744k643k738k306j937
$$ 115538 119359 123059 125509 126582 127479 129384 132189 134782 136144 135877 134133 131490 128752 126446 124509
55554A24509k020k519l167l517l196k384j838j952k199j925j371j203j379j277
$$ 124509 122489 119970 116803 113286 110090 107706 105868 103916 101717 99792 98421 97218 95839 94562
55540I4562q26o36r09j074p59l92m06m29J36J084J555J218O97P26J155J187N05
$$ 94562 93736 93100 92191 91117 90358 89966 89560 89131 89267 90351 91906 93124 93821 94547 95702 96889 97394
55523I7394k54l45N9J35l93r24r48q12j073j572j636j052l31m2l45j133k215l233
$$ 97394 97140 96795 96854 96989 96596 95672 94724 93912 92839 91267 89631 88579 88248 88206 87861 86728 84513 81280
55505H1280l677l250k170j065n84r09j572j840j436p70l91l64m09l92l71l09r5
$$ 81280 77603 74353 72183 71118 70534 69625 68053 66213 64777 64007 63616 63252 62843 62451 62080 61771 61676
55488F1676J54J40j32j95L25J135J532J211O17K73J01k60o24l69N37J233J073
$$ 61676 61830 61970 61838 61643 61968 63103 64635 65846 66463 66736 66837 66577 65953 65584 66121 67354 68427
55471F8427M50L0k50p12r73m72L37L63n30j308j244o55oO57J132R59L81K92P73
$$ 68427 68877 68907 68657 67945 66972 66500 66837 67200 66670 65362 64118 63463 63457 64114 65246 66205 66586 66878 67651
55452F7651P31l21j244r66j75j48p39q47l85k45n99o58j58J63j20m95m72l25m19
$$ 67651 68382 68061 66817 65851 65676 65528 64789 63942 63557 63312 62713 62055 61897 62060 61940 61445 60973 60648 60229
55433F0229n48l50J56P36J228J428J214Q86R40J330J468J078N54L28L69M66M76
$$ 60229 59681 59331 59487 60223 61451 62879 64093 64979 65919 67249 68717 69795 70349 70677 71046 71512 71988
55416G1988K16m66j148r97K41J763K548K396J817J217N76j80q77j234j184r82
$$ 71988 72204 71738 70590 69593 69834 71597 74145 76541 78358 79575 80151 79971 79094 77860 76676 75694
55400G5694r61j174j310j150q18n06j23L65N33k2q68j048l34M20M44O3J01P18
$$ 75694 74733 73559 72249 71099 70281 69775 69652 70017 70550 70528 69660 68612 68278 68698 69142 69205 69306 70024
55382G0024J286J312R27N09J78j79o01r50j061r41q28j001j446j837j905j824
$$ 70024 71310 72622 73549 74058 74236 74057 73456 72506 71445 70504 69676 68675 67229 65392 63487 61663
55366F1663j989k385k427j689n97J9L3K26J128K214K663K513K348K177J453K65
$$ 61663 59674 57289 54862 53173 52576 52595 52628 52854 53982 56196 58859 61372 63720 65897 67350 67615
55350F7615m68k34L26L92Lk94l17k09QL00M18K55J24K18K58P0N3M87P90K61q10
$$ 67615 67147 66913 67239 67631 67634 67340 67023 66814 66822 67122 67540 67795 67919 68137 68395 68465 68518 69005 69795 70056 69246
55329F9246j480j439j166r84p29l69k33m24o08m63n3L95O74O42L87K82N39Q41
$$ 69246 67766 66327 65161 64177 63448 63079 62846 62422 61814 61351 61298 61693 62367 63009 63396 63678 64217 65058
55311F5058P85L84j19o69j091q78J00J026J081N61K91K37j84p18m66N22J134R44
$$ 65058 65843 66227 66108 65439 64348 63470 63570 64596 65677 66238 66529 66766 66582 65864 65398 65920 67054 67998
55293F7998P89J152J243M53m10l13L90O63M32M04O01L14n33j064p46j90k18p17
$$ 67998 68787 69939 71182 71635 71225 70912 71302 71965 72397 72801 73402 73716 73183 72119 71373 71183 70965 70248
55275G0248r82p38l92l35m71m72j96L43J112J887K132J519N20rN7l0o78j270j179
$$ 70248 69266 68528 68136 67801 67330 66858 66662 67005 68117 70004 72136 73655 74175 74166 74223 74193 73515 72245 71066
55256G1066q00q33r96m75O24J326J269J054J001O45j55o07j32O80Q38J52q75j770
$$ 71066 70266 69433 68437 67962 68586 69912 71181 72235 73236 73881 73726 73119 72987 73667 74505 74657 73782 72012
55238G2012k134j562k07R69J185P46M28L26j6n96r21q52q46j155j374r44J54J360
$$ 72012 69878 68316 68109 69078 70263 71009 71437 71763 71747 71151 70230 69378 68532 67377 66003 65059 65213 66573
55220F6573J980J657O56l28p32n03L2M96O01K48k95n58l45M7K82L47L67L53L20
$$ 66573 68553 70210 70866 70538 69806 69303 69335 69831 70432 70680 70385 69827 69482 69529 69811 70158 70525 70878 71198
55201G1198L92N27M59J40o6N6J35k35q28j023o49q5K97M77N75O07M90R8n79j155
$$ 71198 71590 72117 72576 72716 72650 72706 72841 72606 71778 70755 70106 70021 70318 70795 71370 71977 72467 72565 71986 70831
55181G0831r50K48J629K013J080k86j000q56m95n09q18r68p92n67n06m03lM96
$$ 70831 69881 70129 71758 73771 74851 74565 73565 72709 72214 71705 70887 69919 69127 68560 68054 67651 67648 68144
55163F8144O48M09J68J84L62O01R57J326J400J116P52M58N1m74p32n29k70l96
$$ 68144 68792 69201 69369 69553 69915 70516 71473 72799 74199 75315 76067 76525 76576 76102 75370 74841 74571 74175
55145G4175o87o09j33K31J23k97o63p56n53j35L89Q94J237J246R06M95L70N53
$$ 74175 73488 72879 72746 72977 73100 72803 72140 71384 70831 70696 71085 71979 73216 74462 75368 75863 76233 76786
55127G6786P36P23O19N84O72R33J311J426Q68k86j482k274k489j946o39P47J205
$$ 76786 77522 78245 78864 79448 80120 81053 82364 83790 84658 84372 82890 80616 78127 76181 75542 76289 77494
55110G7494N27m65j030j169j036m42N71J327J305Q44N31L85J23j42j48MQ2J67
$$ 77494 78021 77556 76526 75357 74321 73879 74450 75777 77082 77926 78457 78842 78965 78823 78675 78679 78761 78928
55092G8928M02O23P03Q14R34O21j69o51k48N05P88O76O21L22p60k070k320j164
$$ 78928 79330 79953 80656 81470 82404 83025 82856 82205 81957 82462 83250 83926 84547 84869 84109 82039 79719 78555
55074G8555M88J759K396K189R78n50j160n71J73K31k9P2M10M89L08J76J19k6j75
$$ 78555 79043 80802 83198 85387 86365 85815 84655 84084 84257 84488 84459 84531 84941 85430 85738 85914 86033 86007 85832
55055H5832j59q7k30o70j179j342p66L84J148O51p03j535j212n55n00q33p26n1
$$ 85832 85673 85586 85356 84686 83507 82165 81399 81783 82931 83582 82879 81344 80132 79577 79077 78244 77518 77467
55037G7467O17R11R68R54Q45O69N12L53K01K54N97Q97P23J19m97r09j191j312
$$ 77467 78084 78995 79963 80917 81762 82431 82943 83296 83497 83751 84348 85245 85968 86087 85590 84681 83490 82178
55019H2178j039l72K80N02K87j43o60j227j609j427n88M63J100J065N87M8k75
$$ 82178 81139 80767 81047 81549 81836 81693 81033 79806 78197 76770 76182 76645 77745 78810 79397 79445 79170
55002G9170j70M27J217J623J370P71L01O7n3o5P5K33L27N57J038J368J086M62
$$ 79170 79000 79427 80644 82267 83637 84408 84709 84776 84723 84658 84733 84966 85293 85850 86888 88256 89342 89804
54984H9804K69P05J002L80r47j994k007j125j09M41O17Q49J122R31J15o82q22
$$ 89804 90073 90778 91780 92160 91213 89219 87212 86087 85978 86419 87036 87885 89007 89938 90053 89371 88549
54967H8549n00k15J58R97J847J709M97o27o58J73R93J296J077N10n5k13L7L18
$$ 88549 88049 87834 87992 88989 90836 92545 93042 92415 91757 91930 92923 94219 95296 95806 95751 95538 95575 95893
54949I5893M78P07R12N95k79r50q34l04o9k78o59j049j224p31M03J238R66Q9k47
$$ 95893 96371 97078 97990 98585 98306 97356 96522 96218 96149 95871 95212 94163 92939 92208 92611 93849 94815 94904 94657
54930I4657J21L45K9j79K76J014J398J405J340J183P78M29O14J267J794J947K096
$$ 94657 94778 95123 95152 94973 95249 96263 97661 99066 100406 101589 102367 102796 103410 104677 106471 108418 110514
54913A10514K493K677K116J214J063K017L120L281K589J931J600J041m7j197j978
$$ 110514 113007 115684 117800 119014 120077 122094 125214 128495 131084 133015 134615 135656 135609 134412 132434
54898A32434k656l576m397m472l751k816k132j682j260p91m06l38o98j216j413
$$ 132434 129778 126202 121805 117333 113582 110766 108634 106952 105692 104901 104495 104157 103459 102243 100830
54883A00830j157p92o04m90l72m96r15j069l69J016K368L206L419K995K173J718
$$ 100830 99673 98881 98277 97787 97415 96919 96004 94935 94566 95582 97950 101156 104575 107570 109743 111461
54867A11461K270L395L912L268K052J062M50N4p7R2J91k16j050j847k326k644
$$ 111461 113731 117126 121038 124306 126358 127420 127870 127924 127847 127939 128130 127914 126864 125017 122691 120047
54851A20047l045l513l726l332k389j510j344j813k116j673q02k76l75p32r70
$$ 120047 117002 113489 109763 106431 104042 102532 101188 99375 97259 95586 94784 94508 94133 93401 92431
54836I2431j101j245j269r53l73J12K96L84O92J163J341Q79K1n72m88J9L54K62
$$ 92431 91330 90085 88816 87863 87490 87602 87898 88282 88974 90137 91478 92357 92378 91806 91318 91337 91691 91953
54818I1953Q0K12N27N28J42n4L45P73L18r33j731j185J02Q41O79L85N59Q75P94
$$ 91953 92033 92245 92772 93300 93442 93388 93733 94506 94824 93891 92160 90975 91077 91918 92597 92982 93541 94416 95210
54799I5210M11J97J97N7k90m14m8M60N54K33L0K67O09N70K25J04M21P41N70Kl85
$$ 95210 95621 95818 96015 96072 95782 95368 95320 95780 96334 96567 96597 96864 97473 98043 98268 98372 98793 99534 100104 100106 99721
54778I9721j71N51J343J747J565R92N03M50P87J258J734K195K563K748K843K968
$$ 99721 99550 100101 101444 103191 104756 105748 106251 106701 107488 108746 110480 112675 115238 117986 120829 123797
54762A23797K946K465J664J232J730K910L966M301L888K959J718M08o13j103j234
$$ 123797 126743 129208 130872 132104 133834 136744 140710 145011 148899 151858 153576 153984 153371 152268 151034
54747A51034j403j834k440l110l853m582m956m671l880l092k609k220j555n97
$$ 151034 149631 147797 145357 142247 138394 133812 128856 124185 120305 117213 114604 112384 110829 110232
54733A10232K32N09K34j63k63n0J06n1l84n79n49m16k04J75O74J087J324J489
$$ 110232 110464 110973 111207 111044 110781 110731 110837 110786 110402 109823 109274 108858 108654 108829 109503 110590 111914 113403
54715A13403J677J939K476L435M434M600L521J857O78K91J09m20j160j641j699
$$ 113403 115080 117019 119495 122930 127364 131964 135485 137342 138020 138311 138420 138000 136840 135199 133500
54700A33500j578j593j884k350k719k774k635k674l006l173k592j295n9L42j05
$$ 133500 131922 130329 128445 126095 123376 120602 117967 115293 112287 109114 106522 105227 105168 105510 105405
54685A05405p32r18n72qM22M85J08n68j207j452j106k27Q31J482J291M23m16o74
$$ 105405 104673 103755 103183 103175 103597 104082 104190 103622 102415 100963 99857 99630 100461 101943 103234 103657 103241 102567
54667A02567m38j13J07K76L99M14K99M3l80p76p69l72j70n00q22m52L50P88P85
$$ 102567 102129 102016 102123 102399 102798 103212 103511 103554 103174 102398 101629 101257 101087 100587 99765 99313 99663 100451 101236
54648A01236R70J359J133k0j206j473r57l59J3J67k6m55n23NL88j57j193j599
$$ 101236 102206 103565 104698 104678 103472 101999 101042 100683 100696 100863 100837 100382 99859 99864 100252 100095 98902 97303
54630I7303j116n24l61l21k5L71N44M31J43j64j92K37P52P25P7o10q25n75j20
$$ 97303 96187 95663 95302 94981 94956 95327 95871 96302 96445 96281 96089 96326 97078 97803 97880 97270 96445 95870 95750
54611I5750L43O39P17P98J017J037M85k84n30k20m6k57k85J80O32P17R23J604
$$ 95750 96093 96732 97449 98247 99264 100301 100786 100502 99972 99752 99706 99449 99164 99344 99976 100693 101616 103220
54593A03220K028J322m5o80j07P09P24q1j053j676j723j163k74M35P22P67P32
$$ 103220 105248 106570 106525 105845 105738 106447 107171 107090 106037 104361 102638 101475 101201 101636 102358 103125 103857
54576A03857M93K1l22k39N5J24r4l10m20n61p23o28j48M23O84N58L03J52J32J36
$$ 103857 104350 104371 104049 103810 103865 103989 103895 103585 103165 102604 101881 101253 101105 101528 102212 102770 103073 103225 103357 103493
54556A03493O0j11k95l43j57K46P48J141J191Q58M34K94M92P51R07J078J261J129
$$ 103493 103553 103442 103147 102804 102647 102893 103641 104782 105973 106831 107265 107559 108051 108802 109709 110787 112048 113177
54538A13177N29q7j71J85M41L83K83K74J61r9k00qJ91J51J8l3r4k09j85k4j55
$$ 113177 113706 113619 113448 113633 114074 114457 114740 115014 115175 115076 114876 114868 115059 115210 115228 115195 115101 114892 114707 114683 114528
54517A14528q12j503j546q98p6N29Q05O82K20j88k34j19k31m82n07l41l67o01
$$ 114528 113716 112213 110667 109769 109693 110222 111027 111709 111929 111741 111507 111388 111157 110675 110168 109827 109460 108859
54499A08859o54l98k00l33o25q07q16o18j92K27K76k7k39q2K76O32R86J256J176
$$ 108859 108205 107807 107607 107274 106649 105842 105026 104408 104216 104443 104719 104692 104453 104371 104647 105279 106265 107521 108697
54480A08697P27L21L20O13Q87R92Q95N99L28M38Q86J089O23k03p18o54k46J92
$$ 108697 109424 109745 110065 110678 111565 112557 113452 114051 114379 114817 115703 116792 117415 117212 116494 115840 115594 115786
54462A15786N11O60O33M58J54j76k19K76R66J046J79r66j448j081m29J5K02K30
$$ 115786 116297 116957 117590 118048 118202 118026 117807 118083 119049 120095 120274 119308 117860 116779 116350 116365 116567 116797
54444A16797J21n9j03J04M69P43O96K25m76j014j140r28m99J55Q74J077L05r94
$$ 116797 116918 116859 116756 116860 117329 118072 118768 118993 118517 117503 116363 115435 114936 115091 115965 117042 117347 116353
54426A16353j688j110K54J437K017K185K050J363J28r88j245o97p2K36N65J199
$$ 116353 114665 113555 113809 115246 117263 119448 121498 122861 122989 122001 120756 120059 119987 120223 120788 121987
54410A21987J639J201M8q62r05m03k2k6k25k93J0O29J088Q90J87k89j46K30L55
$$ 121987 123626 124827 124875 124013 123108 122705 122683 122657 122432 122139 122149 122778 123866 124756 124943 124654 124508 124738 125093
54391A25093L64O70J246J671J718J520J255J006Q42P18M34m9m41n37n98r33j256
$$ 125093 125457 126127 127373 129044 130762 132282 133537 134543 135385 136103 136537 136488 136047 135510 134912 133979 132723
54374A32723j049m25r2l16m97n7O76R11M24k43n30m15j77Q8M87J019J430J470
$$ 132723 131674 131249 131157 130841 130344 130287 130963 131874 132298 132055 131525 131110 130933 131021 131508 132527 133957 135427
54356A35427J163P88O36Q34J314J856K172K098J728J305R67P20N93O60P99P05
$$ 135427 136590 137378 138014 138848 140162 142018 144190 146288 148016 149321 150288 151008 151601 152261 153060 153765
54340A53765K12n78j567k748l866m243l447k006j054j132j659j724j127m08rJ68
$$ 153765 153977 153399 151832 149084 145218 140975 137528 135522 134468 133336 131677 129953 128826 128418 128409 128577
54324A28577L90O13N95K98o5l52n68o58n16k94l54o50n71K66J250J402O44j23
$$ 128577 128967 129580 130175 130473 130408 130056 129488 128830 128314 128020 127666 127016 126445 126711 127961 129363 130007 129884
54306A29884k22O8J75K7j87n51j200j808j843j204k92M76Q92Q20K87l10m78k24
$$ 129884 129662 129730 129905 129932 129745 129194 127994 126186 124343 123139 122847 123323 124215 125035 125322 125012 124534 124310
54288A24310l0j93l97j78M09Q24O94K30J0L64J086J658J647R87qp69q58l77J05
$$ 124310 124280 124087 123690 123512 123921 124745 125439 125669 125679 126043 127129 128787 130434 131421 131413 130644 129786 129409 129514
54269A29514J89N7M8J26J02J43M93Q20N17k61n75%O98O44M0j98L22J191J831J921
$$ 129514 129703 129760 129808 129934 130036 130179 130672 131492 132009 131748 131173 131173 131871 132515 132555 132357 132679 133870 135701 137622
54249A37622J381M45l68p31q68j028r34k38O60Q40J2j093j597j397j064j117j471
$$ 137622 139003 139448 139080 138349 137481 136453 135519 135281 135941 136781 136793 135700 134103 132706 131642 130525 129054
54232A29054j552r52L0O50N67J54j87m98q29q43l52J99L60L84O98J023Q26L71
$$ 129054 127502 126550 126580 127230 127797 127951 127764 127266 126437 125594 125242 125441 125801 126185 126883 127906 128732 129103
54214A29103M00Q87J043O11J75L4k75r63j413j126n41k77k30qK59K23Q3K96P45
$$ 129103 129503 130390 131433 132044 132219 132253 131978 131015 129602 128476 127935 127658 127428 127420 127679 127902 127985 128281 129026
54195A29026Q28K94m63r20q28k70L50M77k6n66m57K25P57O94L26J08Q7Nk05k61
$$ 129026 129854 130148 129685 128765 127937 127667 128017 128494 128468 127902 127445 127670 128427 129121 129447 129555 129642 129647 129442 129181
54175A29181O6N05M80j81q20o46K17P76M61j47j66M21R46J091J140J222R46P1
$$ 129181 129247 129752 130232 130051 129231 128585 128802 129578 130039 129892 129726 130147 131093 132184 133324 134546 135492 135563
54157A35563q49r11L4R99P92o18j966k031r92n9Q8q1M9K99K24JJ49N98P53M48
$$ 135563 134714 133803 133837 134836 135628 135010 133044 131013 130021 129962 130050 129969 130018 130317 130541 130542 130691 131289 132042 132490
54137A32490J91L96Q35J010P18J28m41p36q10r74j290j275n69K55K42m94o84L66
$$ 132490 132681 133077 133912 134922 135640 135768 135327 134591 133781 132807 131517 130242 129673 129928 130170 129676 128992 129358
54119A29358J643J702N94l08j75M82Q85J002J123J118P45K87K53N36N05l1m43
$$ 129358 131001 132703 133297 132989 132814 133296 134181 135183 136306 137424 138169 138456 138709 139245 139750 139719 139276
54102A39276k6J111K154K321J386j90j464j627p86j7k61j255j819j240lQ98J063
$$ 139276 139250 140361 142515 144836 146222 146032 144568 142941 142155 142138 141877 140622 138803 137563 137560 138458 139521
54085A39521Q75Q29R27P72J29o50q77k88N65Q78N18J20K63Q13J239J290J158J197
$$ 139521 140396 141225 142152 142924 143053 142403 141526 141238 141803 142681 143199 143319 143582 144395 145634 146924 148082 149279
54067A49279J589K227K754K854K681K726L194L659L668L452L619M222M548L967
$$ 149279 150868 153095 155849 158703 161384 164110 167304 170963 174631 178083 181702 185924 190472 194439
54053A94439K723J603J036P28J96o41j465k006k208k034j403n08R9J20O6P56K222
$$ 194439 197162 198765 199801 200529 200725 200084 198619 196613 194405 192371 190968 190460 190559 190679 190745 191501 193723
54036A93723L530L915L637L453L613L803L846L888L992L944L587K996K302J636
$$ 193723 197253 201168 204805 208258 211871 215674 219520 223408 227400 231344 234931 237927 240229 241865
54022B41865J189J081J073P33l4q50j339j443j271q66l29N9jo23j737l115m353
$$ 241865 243054 244135 245208 245941 245907 245057 243718 242275 241004 240138 239809 239868 239867 239244 237507 234392 230039
54005B30039n067n229n119m917m507l803l001k358j947j744j735j795j731j599
$$ 230039 224972 219743 214624 209707 205200 201397 198396 196038 194091 192347 190612 188817 187086 185487
53991A85487j762k326k815k697k021j232n15K67J120J770J972J672Q84k03j097
$$ 185487 183725 181399 178584 175887 173866 172634 172119 172386 173506 175276 177248 178920 179804 179601 178504
53976A78504j359j049n48jO29J119J161R87J162J623J700J309J300K083K745K287
$$ 178504 177145 176096 175548 175547 176176 177295 178456 179443 180605 182228 183928 185237 186537 188620 191365 193652
53960A93652J193Q02J381J881J536P52K12p0m49r78j427j545j116j26R98J689
$$ 193652 194845 195647 197028 198909 200445 201197 201409 201339 200890 199912 198485 196940 195824 195698 196696 198385
53944A98385J864J824J630J192R24J524K878M007M411M651N134N257M496L544
$$ 198385 200249 202073 203703 204895 205819 207343 210221 214228 218639 223290 228424 233681 238177 241721
53930B41721L430M021M412M346M337M604M886N197N869O796P499P892Q270Q616
$$ 241721 245151 249172 253584 257930 262267 266871 271757 276954 282823 289619 297118 305010 313280 321896
53916C21896Q735R003J0083J1788J3106J3484J3197J2324J0320P018L165m77l777
$$ 321896 330631 339634 349717 361505 374611 388095 401292 413616 423936 430954 434119 433642 429865
53903D29865o605q414r049r214r503r567q908p850p081o688o399o287o572p064
$$ 429865 423260 414846 405797 396583 387080 377513 368605 360755 353674 346986 340587 334300 327728 320664
53889C20664p423p617p597p045o059n565o146o983o843n787m864m380l706k718
$$ 320664 313241 305624 298027 290982 284923 279358 273212 266229 259386 253599 248735 244355 240649 237931
53875B37931k261k780l552l700l227k601k047j699j861k535l110l051k525k037
$$ 237931 235670 232890 229338 225638 222411 219810 217763 216064 214203 211668 208558 205507 202982 200945
53861B00945j733j446j160j057j200j484j735j779j618j569j885k258k124j550
$$ 200945 199212 197766 196606 195549 194349 192865 191130 189351 187733 186164 184279 182021 179897 178347
53847A78347j237j416j409o67L08P09N43L88L34Mn47p42l99m0n7j96j28m5k81
$$ 178347 177110 175694 174285 173618 173926 174635 175178 175566 175900 175904 175357 174615 174216 174176 174119 173923 173795 173750 173469
53828A73469o47o41q0P85J631K168K054J222K44q3L02O36M06N9K92R19J123O99
$$ 173469 172822 172181 172101 172886 174517 176685 178739 179961 180205 180122 180424 181060 181466 181525 181817 182736 183859 184558
53810A84558M33J065K404L647M257M221L833L496L501L679L581L202L155L724
$$ 184558 184991 186056 188460 192107 196364 200585 204418 207914 211415 215094 218675 221877 225032 228756
53796B28756M233L937L132K709K779K628J984J420J284J090M17k54k32L40P41
$$ 228756 232989 236926 240058 242767 245546 248174 250158 251578 252862 253952 254369 254115 253883 254223 254964
53781B54964O67L97J11l82j252k379l458m122m110l584l147l232l564l555l125
$$ 254964 255631 256028 256139 255757 254505 252126 248668 244546 240436 236852 233705 230473 226909 223354 220229
53766B20229k771k848l146l232k957k534k286k330k403k068j268n43m98j100j757
$$ 220229 217458 214610 211464 208232 205275 202741 200455 198125 195722 193654 192386 191843 191345 190245 188488
53751A88488j950j570p85RK08n25j668k131j405j13Q08J100J110R94N53j75o46
$$ 188488 186538 184968 184183 184192 184400 183875 182207 180076 178671 178558 179366 180466 181576 182570 183123 182948 182302
53734A82302m04L27R29J141J247J523J812J821J579J383J338J296J217J266J446
$$ 182302 181898 182225 183154 184295 185542 187065 188877 190698 192277 193660 194998 196294 197511 198777 200223
53719B00223J456J150Q99J103J551J587R99L44K90Q76J620K133K377K443K332
$$ 200223 201679 202829 203728 204831 206382 207969 208968 209312 209602 210478 212098 214231 216608 219051 221383
53704B21383K066J799J710J807J911J911J921K102K401K627K781L033L327L233
$$ 221383 223449 225248 226958 228765 230676 232587 234508 236610 239011 241638 244419 247452 250779 254012
53690B54012K519J658J353J609J620P92m50j173j011m89k51l13k17K35O81O79
$$ 254012 256531 258189 259542 261151 262771 263563 263113 261940 260929 260440 260189 259876 259659 259894 260575 261254
53674B61254K64j13k24l31p63j373j677j475j064q83j095j560j968j976j461p02
$$ 261254 261518 261405 261181 260850 260087 258714 257037 255562 254498 253615 252520 250960 248992 247016 245555 244853
53658B44853j41J31L74O39N20k50j162j361n91N31J214J157N64j52n79n13j55
$$ 244853 244712 244843 245217 245856 246376 246126 244964 243603 243012 243543 244757 245914 246478 246326 245747 245234 245079
53641B45079N1l5l1N43J678K778L161K629J727J323J794K602K925K637K297K217
$$ 245079 245130 245095 245064 245607 247285 250063 253224 255853 257580 258903 260697 263299 266224 268861 271158 273375
53625B73375K033J484J065J411K378L293L921M501M953M832M146L603L655L892
$$ 273375 275408 276892 277957 279368 281746 285039 288960 293461 298414 303246 307392 310995 314650 318542
53611C18542L756L405L389L839M402M810N015M996M776M567M426L976K882J464
$$ 318542 322298 325703 329092 332931 337333 342143 347158 352154 356930 361497 365923 369899 372781 374245
53597C74245L79j80m40m03M2L43m71k402m079m320l561l105l357l589l266k716
$$ 374245 374624 374444 374004 373601 373643 373986 373515 371113 367034 362714 359153 356048 352691 349102 345836 343120
53581C43120k400k241k000j796j839j975j849j381p73k51j3k56q84j347j141m83
$$ 343120 340720 338479 336479 334683 332844 330869 329020 327639 326866 326615 326602 326346 325462 324115 322974 322491
53565C22491q5k09l30O3O98R10N94L14M15N91M75K85N14J201J918K368K624K756
$$ 322491 322406 322197 321867 321930 322628 323538 324132 324446 324861 325452 325927 326212 326726 327927 329845 332213 334837 337593
53547C37593K685K480K454K710K937K923K966L483M402N323O061O623O818O451
$$ 337593 340278 342758 345212 347922 350859 353782 356748 360231 364633 369956 376017 382640 389458 395909
53533C95909N857N678O005O353O624P442R110J0833J1686J1889J2376J3323J4014
$$ 395909 401766 407444 413449 419802 426426 433868 442978 453811 465497 477386 489762 503085 517099
53520E17099J4149J4371J5190J6155J6612J6700J7027J7763J8643J9590K0718
$$ 517099 531248 545619 560809 576964 593576 610276 627303 645066 663709 683299 704017
53509G04017K1869K2711K3245K3698K3996K3835K3296K2864K2693K2389K1674
$$ 704017 725886 748597 771842 795540 819536 843371 866667 889531 912224 934613 956287
53498I56287K0829K0219J9812J9384J8933J8544J8166J7764J7494J7442J7428
$$ 956287 977116 997335 1017147 1036531 1055464 1074008 1092174 1109938 1127432 1144874 1162302
53487A162302J7273J7120J7150J7222J6987J6326J5413J4485J3699J3019J2049
$$ 1162302 1179575 1196695 1213845 1231067 1248054 1264380 1279793 1294278 1307977 1320996 1333045
53476A333045J0269P703N120L198J696q3k190m022n358o853r131j1869j4104j5318
$$ 1333045 1343314 1351017 1356137 1359335 1361031 1360948 1358758 1354736 1349378 1342525 1333394 1321525 1307421 1292103
53462A292103j5781j5982j6041j5861j5635j5895j6944j8408j9533j9940j9829
$$ 1292103 1276322 1260340 1244299 1228438 1212803 1196908 1179964 1161556 1142023 1122083 1102254
53451A102254j9504j9070j8617j8316j8054j7370j6074j4623j3470j2374j0865
$$ 1102254 1082750 1063680 1045063 1026747 1008693 991323 975249 960626 947156 934782 923917
53440I23917r117p688o551n200l684k727k497k056n12J752L613M595N113N635
$$ 923917 914800 907112 900561 895361 891677 888950 886453 884397 883885 885637 889250 893845 898958 904593
53426I04593O196O769P542Q724J0307J2179J4205J6154J7735J8827J9576K0268
$$ 904593 910789 917558 925100 933824 944131 956310 970515 986669 1004404 1023231 1042807 1063075
53414A063075K1224K2705K4758K7057K9077L0528L1597L2733L4213L5973L7850
$$ 1063075 1084299 1107004 1131762 1158819 1187896 1218424 1250021 1282754 1316967 1352940 1390790
53403A390790L9801M1817M3674M5124M6356M7967N0206N2484N3950N4449N4469
$$ 1390790 1430591 1472408 1516082 1561206 1607562 1655529 1705735 1758219 1812169 1866618 1921087
53392A921087N4303N3755N2779N1766N0990N0113M8635M6504M4013M1394L8792
$$ 1921087 1975390 2029145 2081924 2133690 2184680 2234793 2283428 2329932 2373945 2415339 2454131
53381B454131L6356L3959L0999K6979K2194J7477J3251R151M699l5m635r028j3698
$$ 2454131 2490487 2524446 2555445 2582424 2604618 2622095 2635346 2644497 2649196 2649161 2644526 2635498 2621800
53368B621800j9142k5287l1502l7169m2031m5968m8803n0532n1603n2542n3333
$$ 2621800 2602658 2577371 2545869 2508700 2466669 2420701 2371898 2321366 2269763 2217221 2163888
53357B163888n3476n2634n0973m8880m6787m5176m4261m3533m2207m0284l8664
$$ 2163888 2110412 2057778 2006805 1957925 1911138 1865962 1821701 1778168 1735961 1695677 1657013
53346A657013l7966l7806l7524l6987l6200l4759l2365k9576k7263k5580k4051
$$ 1657013 1619047 1581241 1543717 1506730 1470530 1435771 1403406 1373830 1346567 1320987 1296936
53335A296936k2466k0998j9640j8223j6916j6016j5250j4044j2514j1497j1429
$$ 1296936 1274470 1253472 1233832 1215609 1198693 1182677 1167427 1153383 1140869 1129372 1117943
53324A117943j1841j2131j2182j1924j1011r364p560o274n633n377n229m823l729
$$ 1117943 1106102 1093971 1081789 1069865 1058854 1049490 1041930 1035656 1030023 1024646 1019417 1014594 1010865
53311A010865k005l11R34K144L878N985P922R609J1364J3165J4604J5557J6408
$$ 1010865 1008860 1008549 1009483 1011627 1015505 1021490 1029412 1039021 1050385 1063550 1078154 1093711 1110119
53298A110119J7528J8983K0710K2563K4151K5117K5602K6013K6280K5909K4897
$$ 1110119 1127647 1146630 1167340 1189903 1214054 1239171 1264773 1290786 1317066 1342975 1367872
53287A367872K3940K3355K2371K0177J7278J5031J3798J2404R719O131K946O81
$$ 1367872 1391812 1415167 1437538 1457715 1474993 1490024 1503822 1516226 1525945 1532076 1535022 1535703
53275A535703j406m172p598j1040j4028j6500j8535k0179k1492k2580k3600k4747
$$ 1535703 1534297 1530125 1522527 1511487 1497459 1480959 1462424 1442245 1420753 1398173 1374573 1349826
53263A349826k6044k7089k7374k7042k6955k7640k8454k8330k7240k6259k6138
$$ 1349826 1323782 1296693 1269319 1242277 1215322 1187682 1159228 1130898 1103658 1077399 1051261
53252A051261k6368k6009k4960k3976k3654k3874k4103k3958k3420k2788k2356
$$ 1051261 1024893 998884 973924 949948 926294 902420 878317 854359 830939 808151 785795
53241G85795k2050k1441k0234j8640j7063j5613j4204j2989j2264j1876j1131
$$ 785795 763745 742304 722070 703430 686367 670754 656550 643561 631297 619421 608290
53230F08290r613p859o937p339q466r223r133q781r158j0537j2079j2701j2242
$$ 608290 598677 590818 583881 576542 568076 558853 549720 540939 531781 521244 509165 496464 484222
53217D84222j1541j1386j1706j1938j1799j1300j0310q736p128o459o996p871
$$ 484222 472681 461295 449589 437651 425852 414552 404242 395506 388378 381919 374923 367052
53205C67052q143p901p751p694p197o314n806n994o216n801n006m478m303m096
$$ 367052 358909 351008 343257 335563 328366 322052 316246 310252 304036 298235 293229 288751 284448 280352
53191B80352l756l534l497l498l450l304k901k307k059k452k852k410j316n36
$$ 280352 276596 273062 269565 266067 262617 259313 256412 254105 252046 249594 246742 244332 243016 242480
53177B42480l14qM75J65j361k826k670j093K45J99r77k436l401l187j637K22Q47
$$ 242480 242166 242158 242633 242798 241437 238611 235941 234848 235093 235292 234315 231879 228478 225291 223654 223876 224723
53160B24723m4j058q93J13P06L58l76q60r37p32m92o18j313k125k259j474l41
$$ 224723 224679 223621 222728 222841 223547 223905 223529 222669 221732 221000 220508 219890 218577 216452 214193 212719 212378
53143B12378M54P44P46O74O35O18M42m8o31q06m08J31L21J49j05k54j80K34P86
$$ 212378 212832 213576 214322 214996 215631 216249 216691 216643 216012 215206 214798 214929 215250 215399 215294 215040 214860 215094 215880
53124B15880R47N54K09M77R07O49j53l85M32J414J628J326J299J550J411P18P9
$$ 215880 216827 217381 217590 218067 218974 219623 219470 219085 219517 220931 222559 223885 225184 226734 228145 228863 228942
53107B28942l9J20M5m73j289k092k554k551k266j906j435q42m87p27j302j548
$$ 228942 228903 229023 229068 228595 227306 225214 222660 220109 217843 215937 214502 213660 213173 212446 211144 209596
53091B09596j217o91l65k46k12j82M9O74J413J658J310R74J073J213Q33O4n07
$$ 209596 208379 207688 207323 207077 206865 206683 206732 207406 208819 210477 211787 212761 213834 215047 215880 215944 215437
53074B15437o72p05p26n39j16J65l7o12j156j423j494j561j673j653j322p34j43
$$ 215437 214765 214060 213334 212795 212679 212844 212807 212195 211039 209616 208122 206561 204888 203235 201913 201179 201036
53057B01036J94J91r8m94p39o84m56k96k17NN22J254J974K358K030R75j60o17
$$ 201036 201230 201421 201323 200829 200090 199406 198950 198654 198437 198442 198964 200218 202192 204550 206580 207555 207395 206778
53039B06778m73n09j035j382r52j51K25J54K21N28M88j72q57q47j90M94Q76J184
$$ 206778 206305 205796 204761 203379 202427 202276 202501 202655 202876 203404 203892 203720 202863 202016 201826 202320 203196 204380
53021B04380J619J857J389K33r51j585j676j457q20K91J238J148J63n74m26j6
$$ 204380 205999 207856 209245 209478 208527 206942 205266 203809 202989 203280 204518 205666 205829 205255 204829 204813
53005B04813m1j48K83R31J022O35M99O57M50k43o75m31J4K43N06R98J269Q74M1
$$ 204813 204772 204624 204907 205838 206860 207495 207994 208651 209101 208858 208183 207752 207766 208009 208515 209513 210782 211656 211697
52986B11697q21j626k191j901n29J097J978K094K010J737R43O1O4R94J683J321
$$ 211697 210876 209250 207059 205158 204629 205726 207704 209798 211808 213545 214488 214549 214613 215607 217290 218611
52970B18611N45M93J325K291K817K927K812K520K053J412O40N7J74R77J518Q22
$$ 218611 219156 219649 220974 223265 226082 229009 231821 234341 236394 237806 238446 238503 238677 239654 241172 241994
52954B41994q54k248k651k605k828l149k946k212j483r94n47j26r3n95j311j832
$$ 241994 241140 238892 236241 233636 230808 227659 224713 222501 221018 220024 219477 219351 219258 218663 217352 215520
52938B15520k036j911j516j116r53p88j57P04Q12k98j726k197j498m52K60N50
$$ 215520 213484 211573 210057 208941 207988 207200 207043 207747 208559 208261 206535 204338 202840 202388 202648 203198
52922B03198M67M6l12m7P83J447J458J044O03K14l3J02M59K73q15j963k036j111
$$ 203198 203665 203711 203399 203352 204135 205582 207040 208084 208687 208901 208868 208970 209429 209702 208887 206924 204888 203777
52904B03777l62l99n57r9N78N72r9m44Q2Q08P90K0o84p58l43K20Q00J215J103
$$ 203777 203415 203016 202459 202360 202938 203510 203411 202967 203049 203857 204647 204667 203983 203225 202882 203102 203902 205117 206220
52885B06220L77m26o42k56J86L12K77L94O83R23R53Q25O69M98K17j13q5O26J587
$$ 206220 206597 206171 205529 205273 205459 205771 206048 206442 207125 208048 209001 209826 210495 210993 211210 211097 211012 211638 213225
52866B13225J816J002R3J52R10J141M06m06m51m1M6k15k28J48L70L6n59q67q02
$$ 213225 215041 216043 216136 216288 217198 218339 218745 218339 217888 217847 217893 217678 217450 217598 217968 218004 217445 216578 215776
52847B15776q16j299k076k557k392j837j381j198j152j188j338j507j618j887
$$ 215776 214960 213661 211585 209028 206636 204799 203418 202220 201068 199880 198542 197035 195417 193530
52833A93530k478k939k561j436m15J33P85J883K687K400J432Q03O57L00m92j114
$$ 193530 191052 188113 185552 184116 183701 183834 184619 186502 189189 191589 193021 193824 194481 194781 194289 193175
52817A93175j128p95m75j67J14J53l0o9J94M55M98N23P01Q72R31J089J387J393
$$ 193175 192047 191252 190777 190610 190724 190877 190847 190778 190972 191427 191925 192448 193149 194021 194952 196041 197428 198821
52799A98821Q12R6p1K47K76m52j467j831j160p1L65l25j541k282k195j691j141
$$ 198821 199633 199729 199658 199905 200181 199729 198262 196431 195271 195200 195565 195240 193699 191417 189222 187531 186390
52782A86390m72K91P26N40R9j8K37M99O00O85Q07Q13O01K04l18q18j054r51p48
$$ 186390 185918 186209 186935 187475 187574 187556 187793 188292 188892 189577 190384 191197 191798 192002 191684 190866 189812 188861 188113
52763A88113n88k67L56Q70P74K54o3k1k0j71k8O65J529K108K375K366J852Q74
$$ 188113 187525 187258 187614 188484 189258 189512 189449 189428 189408 189237 189209 189874 191403 193511 195886 198252 200104 200978
52745B00978J10J44N87N35j44o55l65L83Q18O62K99K35O70J452K190K479K239
$$ 200978 201088 201232 201819 202354 202210 201555 201190 201573 202391 203053 203352 203587 204257 205709 207899 210378 212617
52728B12617J806J580J551J259L61q80j739j769j263r06j015j289j305j035q10
$$ 212617 214423 216003 217554 218813 219174 218294 216555 214786 213523 212617 211602 210313 209008 207973 207163
52713B07163q76j157j388j339r99o21m77m96l07K15O24M24k06n39k13L53N70M26
$$ 207163 206287 205130 203742 202403 201404 200783 200306 199810 199503 199718 200342 200766 200560 200021 199808 200161 200731 201157
52695B01157L56N50P17N39J26j04J10O40J178J521J631J457R29J56m46m92l5M36
$$ 201157 201513 202063 202780 203319 203445 203341 203451 204091 205269 206790 208421 209878 210807 210963 210517 210025 209990 210426
52677B10426M76L7n74r55p78qR26J317Q24j04n86k21N23Q39L78n32j367j802j669
$$ 210426 210902 210939 210365 209410 208632 208624 209550 210867 211691 211587 211001 210780 211303 212142 212520 211988 210621 208819 207150
52658B07150q80L08J125R44J76K4J065K419K855K363J945K020J845Q48l34p30
$$ 207150 206270 206578 207703 208647 208823 208847 209912 212331 215186 217549 219494 221514 223359 224207 223873 223143
52642B23143m46m49j157k001k363k237j844j249o32m04o42p72k79N83J218J546
$$ 223143 222697 222248 221091 219090 216727 214490 212646 211397 210765 210361 209719 208947 208668 209251 210469 212015
52626B12015J951K465K591K059J241O00J07n07j162j464j241p52l99m02o85q90
$$ 212015 213966 216431 219022 221081 222322 222922 223029 222522 221360 219896 218655 217903 217504 217102 216417 215527
52610B15527o08J79R35J091O97K43q7n81j255j464o76O18J358J221R30J130J446
$$ 215527 214919 215098 216033 217124 217821 218064 217977 217396 216141 214677 214001 214619 215977 217198 218128 219258 220704
52593B20704J072L0p42n07L82R49O34k77j077j213m99Q69K285K914K274P90m05
$$ 220704 221776 221806 221064 220557 220939 221888 222522 222245 221168 219955 219456 220325 222610 225524 227798 228588 228183
52576B28183m80K61P34K97n59q64l62K53K93r7k86j01ml09o99p29m65k50m4M87
$$ 228183 227703 227964 228698 228995 228436 227572 227210 227463 227756 227659 227373 227272 227268 226959 226260 225531 225066 224816 224772 225259
52556B25259J208J390N64q09j800j943j405n16M89J277J423P80k55j070j362j334
$$ 225259 226467 227857 228421 227612 225812 223869 222464 221948 222437 223714 225137 225917 225662 224592 223230 221896
52540B21896j330j388j229p08m9N00J061J807K391K179J144R2l00j47J29M03N92
$$ 221896 220566 219178 217949 217241 217192 217692 218753 220560 222951 225130 226274 226366 226066 225919 226048 226451 227043
52523B27043L37m38j047r05n00p28j388j329j45J139J411P29l9k25L14J347K344
$$ 227043 227380 226942 225895 224990 224490 223762 222374 221045 220900 222039 223450 224179 224140 223915 224229 225576 227920
52506B27920K836K944L138L308K733J256k12p76n89l17k15k80p14j509k073j967
$$ 227920 230756 233700 236838 240146 242879 244135 243923 243147 242558 242241 242026 241746 241032 239523 237450 235483
52490B35483j693j920k335k095j164k98K04P60J442J607Q96j32p06p15n15l18
$$ 235483 233790 231870 229535 227440 226276 225978 226182 226942 228384 229991 230887 230755 230049 229334 228819 228501
52474B28501p3L41R82J686K005J661J008O76P09N83J57K6O51J610K083J806J261
$$ 228501 228428 228769 229751 231437 233442 235103 236111 236787 237496 238079 238236 238262 238913 240523 242606 244412 245673
52457B45673J093J581K402K803K201P97o18j482j908k203k369k240j843j379j044
$$ 245673 246766 248347 250749 253552 255753 256550 255932 254450 252542 250339 247970 245730 243887 242508 241464
52442B41464r58j109j312j401j560k068k720k784j822k99Q42J078O38J21o9m4
$$ 241464 240506 239397 238085 236684 235124 233056 230336 227552 225730 225431 226273 227351 227989 228110 228041 227997
52426B27997k02o62r89o70K63J313K108K592K695K292J553R58Q23J128J740K522
$$ 227997 227795 227133 226144 225474 225737 227050 229158 231750 234445 236737 238290 239248 240071 241199 242939 245461
52410B45461L146L308L190L420M377N828P230Q102Q154P462O531N731M658K634
$$ 245461 248607 251915 255105 258525 262902 268730 275960 284062 292216 299678 306209 311940 316598 319232
52396C19232k37l038n124o545p289o994n749m415l661l240k730k339k321k198
$$ 319232 318995 315957 310833 304288 296999 290005 284256 279841 276180 272940 270210 267871 265550 263352
52382B63352j350o8P41P28M00L38O35J129J705K365L174M048M562M330L699L583
$$ 263352 262002 261934 262675 263403 263803 264141 264776 265905 267610 269975 273149 277197 281759 286089 289788 293371
52366B93371M247M820M473L529K837K484J960J221P37N48J22p12j388j346o95
$$ 293371 297618 302438 306911 310440 313277 315761 317721 318942 319679 320227 320349 319637 318249 316903 316208
52351C16208M7N33P49R11J235J717K179K628L286M086M495M256L948M327N380
$$ 316208 316255 316788 317537 318448 319683 321400 323579 326207 329493 333579 338074 342330 346278 350605 355985
52336C55985O533P580Q781J0194J1500J2453J3045J3368J3699J4567J6172J7896
$$ 355985 362518 370098 378879 389073 400573 413026 426071 439439 453138 467705 483877 501773
52324E01773J8910J9103J9004J9025J9375K0309K1678K2468K1760K0047J8702
$$ 501773 520683 539786 558790 577815 597190 617499 639177 661645 683405 703452 722154
52313G22154J8178J7681J6688J5664J4962J4054J2467J0649R267Q246P166O079
$$ 722154 740332 758013 774701 790365 805327 819381 831848 842497 851764 860010 867176 873255
52301H73255N309M762M026K909J505l7j472k463k955l302l787m314m759n236n762
$$ 873255 878564 883326 887352 890261 891766 891729 890257 887794 884839 881537 877750 873436 868677 863441 857679
52286H57679o107o216o347o456n978m644l048j776m01J953N242Q286J0060J0613
$$ 857679 851572 845356 839009 832553 826575 821931 818883 817107 816706 818659 823901 832187 842247 852860
52272H52860J0775J1240J2058J2778J3058J3168J3734J4817J5568J5113J3564
$$ 852860 863635 874875 886933 899711 912769 925937 939671 954488 970056 985169 998733
52261I98733J1781J0288Q889P327N828M834M399M127L621K885K163J504O01q08
$$ 998733 1010514 1020802 1029691 1037018 1042846 1047680 1052079 1056206 1059827 1062712 1064875 1066379 1066980 1066172
52247A066172k559m241n691o966q028q795r497j0434j1359j1621j1082j0390j0102
$$ 1066172 1063613 1059372 1053681 1046715 1038687 1029892 1020395 1009961 998602 986981 975899 965509 955407
52234I55407r990r563q820q099p523o985o395n596m408l052k153j899j561m47
$$ 955407 945417 935854 927034 918935 911412 904427 898032 892436 888028 884976 882823 880924 879363 878916
52220H78916R81J634J273Q22J167K160L042L364L373L671M609N861O641O525N959
$$ 878916 879897 881531 882804 883626 884793 886953 889995 893359 896732 900403 905012 910873 917514 924039 929998
52205I29998N685N841N947N653N082M434L671K747J834J216J107J538K233K638
$$ 929998 935683 941524 947471 953124 958206 962640 966311 969058 970892 972108 973215 974753 976986 979624
52191I79624K395J803J497J601J568R75J63j99lJ38l49j348k258k703k803k821
$$ 979624 982019 983822 985319 986920 988488 989463 989626 989427 989424 989562 989213 987865 985607 982904 980101 977280
52175I77280k791k718k887l629m784n724o001n690n071m293l447k690k017j208
$$ 977280 974489 971771 968884 965255 960471 954747 948746 943056 937985 933692 930245 927555 925538 924330
52161I24330k03O96J205J464J833K409K984L338L401L212K835K213J179j77j216
$$ 924330 924127 924823 926028 927492 929325 931734 934718 938056 941457 944669 947504 949717 950896 950719 949503
52146I49503j284n93m4KK19J274K822L998M536M812N133N468N755O020O361P067
$$ 949503 948219 947626 947582 947584 947803 949077 951899 955897 960433 965245 970378 975846 981601 987621 993982 1001049
52130A001049Q502J0507J2318J3498J4547J6119J8087J9936K1681K3607K5417
$$ 1001049 1009551 1020058 1032376 1045874 1060421 1076540 1094627 1114563 1136244 1159851 1185268
52119A185268K6478K6798K6945K7128K7059K6623K5845K4299K1521J8120J5446
$$ 1185268 1211746 1238544 1265489 1292617 1319676 1346299 1372144 1396443 1417964 1436084 1451530
52108A451530J3827J2035Q980N107J569j269l850o329q321r539j0207j0764j1458
$$ 1451530 1465357 1477392 1486372 1491479 1493048 1491779 1487929 1481600 1473279 1463740 1453533 1442769 1431311
52095A431311j2161j2485j2177j1404j0479r396q041o730o005n834n588m984m418
$$ 1431311 1419150 1406665 1394488 1383084 1372605 1363209 1355168 1348438 1342433 1336599 1331011 1326027 1321609
52082A321609m179l937l331k435j278N20L070N677P536Q648R595J0727J2008J3365
$$ 1321609 1317430 1313493 1310162 1307727 1306449 1306969 1310039 1315716 1323252 1331900 1341495 1352222 1364230 1377595
52068A377595J4569J5076J4558J3466J2614J2248J1971J1370J0341Q878P048N082
$$ 1377595 1392164 1407240 1421798 1435264 1447878 1460126 1472097 1483467 1493808 1502686 1509734 1514816
52056A514816L151J073j381l996o295q138r835j1637j3454j5058j6274j7060j7534
$$ 1514816 1517967 1519040 1517659 1513663 1507368 1499230 1489395 1477758 1464304 1449246 1432972 1415912 1398378
52043A398378j7940j8383j8757j9043j9420j9882k0051j9699j9148j8748j8245
$$ 1398378 1380438 1362055 1343298 1324255 1304835 1284953 1264902 1245203 1226055 1207307 1189062
52032A189062j7143j5517j3917j2510j0932q973p017n644n133n335n759n830n468
$$ 1189062 1171919 1156402 1142485 1129975 1119043 1110070 1103053 1097409 1092276 1086941 1081182 1075352 1069884
52019A069884n331o121p667r104r907j0275j0503j0534j0335j0245j0619j1421
$$ 1069884 1064553 1058432 1050765 1041661 1031754 1021479 1010976 1000442 990107 979862 969243 957822
52007I57822j2405j3457j4545j5545j6284j6715j6903j6955j6981j6992j6879
$$ 957822 945417 931960 917415 901870 885586 868871 851968 835013 818032 801040 784161
51996G84161j6557j6094j5553j4885j4149j3563j3061j2195j0822r550q910q444
$$ 784161 767604 751510 735957 721072 706923 693360 680299 668104 657282 647732 638822 630378
51984F30378p401o055n386n475n327m521l941m332n159n590n851o652p878q737
$$ 630378 622977 616922 611536 606061 600734 596213 592272 587940 582781 577191 571340 564688 556810 548073
$$ [...]
##END NTUPLES=NMR SPECTRUM
##END=
