
##TITLE=AC1212_MSMAH12043_7160485_mURdhBHiU7
##JCAMPDX= 6.0         $$ Bruker NMR JCAMP-DX V2.0
##DATA TYPE= NMR SPECTRUM
##DATA CLASS= NTUPLES
##ORIGIN= BRUKER
##OWNER= Administrator
$$ 1.72 TOPSPIN		Version 2.1
$$ 2012-12-01 05:04:44.450 -0500  Administrator@X
$$ Compression mode = diff/dup
##.OBSERVE FREQUENCY= 400.02188249412
##.OBSERVE NUCLEUS= ^1H
##.ACQUISITION MODE= SIMULTANEOUS (DQD)
##.ACQUISITION SCHEME= undefined
##.AVERAGES= 8
##.DIGITISER RES= 22
##SPECTROMETER/DATA SYSTEM= spect
##.PULSE SEQUENCE= zg30
##.SOLVENT NAME= COFFEE_meoh
##.SHIFT REFERENCE= INTERNAL, COFFEE_meoh, 1, 14.98509
##AUDIT TRAIL= $$ (NUMBER, WHEN, WHO, WHERE, PROCESS, VERSION, WHAT)
$$ ##TITLE= Audit trail, TOPSPIN		Version 2.1
$$ ##JCAMPDX= 5.01
$$ ##ORIGIN= Bruker BioSpin GmbH
$$ ##OWNER= Administrator
$$ $$ E:\/data/COFFEE/nmr/AC1212_MSMAH12043_7160485_mURdhBHiU7/10/pdata/1/auditp.txt
$$ ##AUDIT TRAIL=  $$ (NUMBER, WHEN, WHO, WHERE, PROCESS, VERSION, WHAT)
(   1,<2012-12-01 05:04:36.075 -0500>,<Administrator>,<X>,<go>,<TOPSPIN 2.1>,
      <created by zg
	started at 2012-12-01 05:03:28.243 -0500,
	POWCHK enabled, PULCHK disabled,
       configuration hash MD5:
       86 BA 57 50 F2 9D 5C 9B 26 00 A9 28 5F 66 2E 89
       data hash MD5: 64K
       DF 57 98 4B 37 E6 4C 75 B7 CD 82 5E E0 A9 C9 3D>)
(   2,<2012-12-01 05:04:39.200 -0500>,<Administrator>,<X>,<proc1d>,<TOPSPIN 2.1>,
      <Start of raw data processing
       efp LB = 0 FT_mod = 6 PKNL = 1 PHC0 = 0 PHC1 = 0 SI = 32K 
       data hash MD5: 32K
       BA B1 66 98 11 36 FE 05 04 0E 48 F4 A1 00 4C A7>)
(   3,<2012-12-01 05:04:39.716 -0500>,<Administrator>,<X>,<proc1d>,<TOPSPIN 2.1>,
      <pk PHC0 = 96.71265 PHC1 = 0 
       data hash MD5: 32K
       32 08 26 E7 B8 FB 4F F1 74 75 30 9E 8F 58 0B 38>)
(   4,<2012-12-01 05:04:39.982 -0500>,<Administrator>,<X>,<proc1d>,<TOPSPIN 2.1>,
      <abs ABSG = 1 
       data hash MD5: 32K
       94 70 AE D8 DF FB A3 DC 20 C8 8A 1F 7A FD CE A8>)
(   5,<2012-12-01 05:04:40.154 -0500>,<Administrator>,<X>,<proc1d>,<TOPSPIN 2.1>,
      <abs ABSG = 2 
       data hash MD5: 32K
       CF A8 BE F1 32 4C 32 30 E7 9D F1 24 96 1D F7 EE>)
(   6,<2012-12-01 05:04:40.294 -0500>,<Administrator>,<X>,<proc1d>,<TOPSPIN 2.1>,
      <abs ABSG = 3 
       data hash MD5: 32K
       3D A1 1B 8A 58 3A 4A 91 28 0D 1D E7 2F AE 28 D9>)
(   7,<2012-12-01 05:04:40.497 -0500>,<Administrator>,<X>,<proc1d>,<TOPSPIN 2.1>,
      <abs ABSG = 4 
       data hash MD5: 32K
       82 DF B4 4A A7 76 26 7A D2 1B 08 66 9B 36 E0 4C>)
(   8,<2012-12-01 05:04:40.669 -0500>,<Administrator>,<X>,<proc1d>,<TOPSPIN 2.1>,
      <abs ABSG = 5 
       data hash MD5: 32K
       20 62 84 40 B3 02 76 62 E4 08 20 8D B1 D4 1A 36>)
$$ ##END=
$$ 
$$ $$ hash MD5
$$ $$ 4A 06 5E 37 E9 91 8C 07 64 93 94 62 B2 19 F3 86
##$RELAX= 
##$RELAX= 
##$RELAX= 
##$RELAX= 
##$RELAX= 
##$RELAX= 
##$RELAX= 
$$ Bruker specific parameters
$$ --------------------------
##$DU= <E:\>
##$EXPNO= 10
##$NAME= <AC1212_MSMAH12043_7160485_mURdhBHiU7>
$$ [...]
150 150 150 150 150 150 150 150
##$TP07= 0
##$TPNAME0= <>
##$TPNAME1= <>
##$TPNAME2= <>
##$TPNAME3= <>
##$TPNAME4= <>
##$TPNAME5= <>
##$TPNAME6= <>
##$TPNAME7= <>
##$TPOAL= (0..7)
0.5 0.5 0.5 0.5 0.5 0.5 0.5 0.5
##$TPOFFS= (0..7)
0 0 0 0 0 0 0 0
##$TUNHIN= 0
##$TUNHOUT= 0
##$TUNXOUT= 0
##$USERA1= <user>
##$USERA2= <user>
##$USERA3= <user>
##$USERA4= <user>
##$USERA5= <user>
##$V9= 5
##$VALIST= <valist>
##$VCLIST= <CCCCCCCCCCCCCCC>
##$VD= 0
##$VDLIST= <DDDDDDDDDDDDDDD>
##$VPLIST= <PPPPPPPPPPPPPPP>
##$VTLIST= <TTTTTTTTTTTTTTT>
##$WBST= 1024
##$WBSW= 4
##$XGAIN= (0..3)
0 0 0 0
##$XL= 0
##$YL= 0
##$YMAX_a= 618549
##$YMIN_a= -523246
##$ZGOPTNS= <>
##$ZL1= 120
##$ZL2= 120
##$ZL3= 120
##$ZL4= 120
##$ABSF1= 14.98509
##$ABSF2= -5.573092
##$ABSG= 5
##$ABSL= 3
##$ALPHA= 0
##$AQORDER= 0
##$ASSFAC= 0
##$ASSFACI= 0
##$ASSFACX= 0
##$ASSWID= 0
##$AUNMP= <proc_prof1d_extract_pilot.lims>
##$AXLEFT= 0
##$AXNAME= <>
##$AXNUC= <1H>
##$AXRIGHT= 0
##$AXTYPE= 0
##$AXUNIT= <>
##$AZFE= 0.1
##$AZFW= 0.1
##$BCFW= 0
##$BC_mod= 0
##$BYTORDP= 0
##$COROFFS= 0
##$CY= 15
##$DATMOD= 1
##$DC= 0
##$DFILT= <>
##$DTYPP= 0
##$F1P= 0
##$F2P= 0
##$FCOR= 0.5
##$FTSIZE= 32768
##$FT_mod= 6
##$GAMMA= 0
##$GB= 0
##$INTBC= 1
##$INTSCL= 1
##$ISEN= 128
##$LB= 0
##$LEV0= 0
##$LPBIN= 0
##$MAXI= 10000
##$MC2= 0
##$MEAN= 0
##$ME_mod= 0
##$MI= 0
##$NCOEF= 0
##$NC_proc= -8
##$NLEV= 6
##$NOISF1= 0
##$NOISF2= 0
##$NSP= 0
##$NTH_PI= 0
##$NZP= 0
##$OFFSET= 14.98509
##$PC= 1
##$PHC0= 96.71265
##$PHC1= 0
##$PH_mod= 1
##$PKNL= yes
##$PPARMOD= 0
##$PPDIAG= 0
##$PPIPTYP= 0
##$PPMPNUM= 2147483647
##$PPRESOL= 1
##$PSCAL= 4
##$PSIGN= 0
##$PYNMP= <proc.py>
##$REVERSE= no
##$SF= 400.02
##$SI= 32768
##$SIGF1= 0
##$SIGF2= 0
##$SINO= 400
##$SIOLD= 32768
##$SPECTYP= <>
##$SREGLST= <1H.CDCl3>
##$SSB= 0
##$STSI= 32768
##$STSR= 0
##$SW_p= 8223.68421052631
##$SYMM= 0
##$S_DEV= 0
##$TDeff= 65536
##$TDoff= 0
##$TI= <>
##$TILT= no
##$TM1= 0
##$TM2= 0
##$TOPLEV= 0
##$USERP1= <user>
##$USERP2= <user>
##$USERP3= <user>
##$USERP4= <user>
##$USERP5= <user>
##$WDW= 1
##$XDIM= 32768
##$YMAX_p= 476791888
##$YMIN_p= -721162
##$CURPLOT= <Network HP LaserJet P1505>
##$CURPRIN= <$Network HP LaserJet P1505>
##$DFORMAT= <normdp>
##$LAYOUT= <+/1D_H.xwp>
##$LFORMAT= <normlp>
##$PFORMAT= <normpl>
##$SURQMSG= 1
$$ End of Bruker specific parameters
$$ ---------------------------------
##NTUPLES= NMR SPECTRUM
##VAR_NAME=  FREQUENCY,     SPECTRUM/REAL,   SPECTRUM/IMAG
##SYMBOL=    X,             R,               I
##VAR_TYPE=  INDEPENDENT,   DEPENDENT,       DEPENDENT
##VAR_FORM=  AFFN,          ASDF,            ASDF
##VAR_DIM=   32768,         32768,           32768
##UNITS=     HZ,            ARBITRARY UNITS, ARBITRARY UNITS
##FACTOR=    0.250966925370066, 1,           1
##FIRST=     8223.43324360094, -86010,       -150165
##LAST=      0,             169725,          -32328
##MIN=       0,             -721162,         0
##MAX=       8223.43324360094, 476791888,    0
$$ Real data points
##PAGE= N=1
##DATA TABLE= (X++(R..R)), XYDATA
$$ [...]
19506c59540b2356l5299j04007J9395O3777a4594j8273A61745p9790a72795m47380
$$ -359540 -22356 -57655 -161662 -142267 -78490 -14594 -32867 161745 81955 -172795 -620175
19495f20175B00318i2091j29667B4133a68225B09384a193l2200j74772h893k3559
$$ -620175 200318 -92091 -221758 24133 -168225 209384 -1193 -33393 -208165 -8893 -32452
19484c2452k3687C9347J18203E3413O5480a85632e0430a8014l16494J8840a06460
$$ -32452 -56139 39347 157550 53413 118893 -185632 -50430 -18014 -334508 -315668 -106460
19472I5359b10212E4425d6473B52235a8057j05971L4778B0616i3973n0932n5385
$$ 95359 -210212 54425 -46473 252235 -18057 -124028 -89250 20616 -93973 -144905 -200290
19461b00290B813M03553d75778i1294c3920a040A04514h6759B29069D5225b48862
$$ -200290 2813 406366 -475778 -91294 -33920 -1040 104514 -86759 229069 45225 -248862
19449b07358Q2437j31275h120H7730f7478n2479d5834b778j59317k4202H5703
$$ -207358 -124921 -256196 -8120 87730 -67478 -119957 -45834 -2778 -162095 -186297 85703
19437a28044A66027h5674q188d5528k76724J59659A0699g8033j09971j16756G8979
$$ -128044 166027 -85674 -93862 -45528 -322252 -162593 10699 -78033 -188004 -304760 78979
19425A00283O2254l1939i7585A07991D5278M6206j8750b91291d7023G955e6172
$$ 100283 162537 130598 -97585 107991 45278 91484 72734 -291291 -47023 7955 -56172
19413b29488k01513a5948B14153b73431J00224q50a0808H2696b06899D9666c8924
$$ -229488 -431001 -15948 214153 -273431 -173207 -174057 -10808 82696 -206899 49666 -38924
19401a89380N6788A09837a55769g2464o6481B2775I798J95504p7557a302l61377
$$ -189380 -132592 109837 -155769 -72464 -138945 22775 9798 205302 127745 -1302 -362679
19390c62679I0120a21931A7544d6411j45232A55090c08285C13382b00851A07355
$$ -362679 90120 -121931 17544 -46411 -191643 155090 -308285 313382 -200851 107355
19379B68586e82974B00688e4395D5194c54341a48733j88532a67777j39E9627f0433
$$ 268586 -582974 200688 -54395 45194 -354341 -148733 -337265 -167777 -167916 59627 -60433
19367a10136F5354b49447h3138D2945b2845j73181A53108a27319c9463j07442
$$ -110136 65354 -249447 -83138 42945 -22845 -196026 153108 -127319 -39463 -146905
19357a46905c4480j55451B37161c16682H812K10486A5851a04210A97005B0692
$$ -146905 -34480 -189931 237161 -316682 8812 219298 15851 -104210 197005 20692
19346b34309D612J76469m6695a4790j29718G8874a40854C9282b57635G1764c58651
$$ -234309 4612 181081 134386 -14790 -144508 78874 -140854 39282 -257635 71764 -358651
19334c15522L9341a4748B23802h836j48371C3776K32510b29370N7096B74097A04270
$$ -315522 -276181 -14748 223802 -8836 -157207 33776 266286 -229370 -172274 274097 104270
19322a68630g4631K2608D689a50617d3444o7887M8286A25310a09646A17206b41117
$$ -168630 -74631 -52023 4689 -150617 -43444 -111331 -63045 125310 -109646 117206 -241117
19310A90687B5115a37790O2617p9282j89363J16660p5299a08989L6008D4040d7626
$$ 190687 25115 -137790 -75173 -154455 -343818 -227158 -302457 -108989 -72981 44040 -47626
19298a26294B52460E1717b67180L3278A09536g9721p5084a8655j41112g970j75455
$$ -126294 252460 51717 -267180 -233902 109536 -79721 -154805 -18655 -159767 -7970 -183425
19287a83425e949o9265A37506a78853A71934d64189b17976A09331C5198d6702
$$ -183425 -5949 -75214 137506 -178853 171934 -464189 -217976 109331 35198 -46702
19276a85926K3327n0841J2824c2369I9266a92843B44385a97878e1687A3008i3328
$$ -185926 -162599 -213440 -200616 -32369 99266 -192843 244385 -197878 -51687 13008 -93328
19264c66958l9741a68704c6870k19730D2736g3666q2271K5564m3377j9097B16657
$$ -366958 -406699 -168704 -36870 -256600 42736 -73666 -155937 -130373 -173750 -192847 216657
19252E3895d71904A84749a49106N6517k96608C05624b53394K2505I6902A5570
$$ 53895 -471904 184749 -149106 -92589 -389197 305624 -253394 -230889 96902 15570
19241b7157B17237d16337a68615a9826I3789J88957H4477f2638j33832a436k22067
$$ -27157 217237 -416337 -168615 -19826 93789 282746 84477 -62638 -196470 -1436 -223503
19230b23503H6769a03258m9918c0505E1953P8593a49780A7034c59482a17408N510
$$ -223503 86769 -103258 -153176 -30505 51953 130546 -149780 17034 -359482 -117408 -111898
19219a11898k3611O2348q9596H0764e0297A31015c586H153c40466h2323r231J4262
$$ -111898 -135509 -73161 -162757 80764 -50297 131015 -3586 8153 -340466 -82323 -91554 -77292
19207g7292j53680N0246B76827b63781q900J27334n844N4863d328B27681F911
$$ -77292 -230972 -180726 276827 -263781 -272681 -145347 -151191 -96328 -4328 227681 6911
19195a01221h684E690J400R9053k3480c43723b0572p8100M8058j29504h2255j40647
$$ -101221 -8684 5690 7090 106143 82663 -343723 -20572 -98672 -50614 -180118 -82255 -222902
19183b22902h0580A08003a42686b0461j53932O3178n2323a2090j95468A53751
$$ -222902 -80580 108003 -142686 -20461 -174393 -111215 -163538 -12090 -207558 153751
19172C04599B2169H28b59364a02304k93351I8872a96203j51640A59645C1035K57596
$$ 304599 22169 828 -259364 -102304 -395655 98872 -196203 -347843 159645 31035 288631
19161B88631a63571g6708j72512R4570a8176m1191l4859h699A48567J22745f4655
$$ 288631 -163571 -76708 -249220 -154650 -18176 -59367 -94226 -8699 148567 271312 -64655
19149b45211G1819R1470E5751a02825A84990d2445p4722E4684a27738k89568a64411
$$ -245211 71819 163289 55751 -102825 184990 -42445 -117167 54684 -127738 -417306 -164411
19137d8900G2996b0887k78572j6463a22378C380a43289j38912P7895B58605a49450
$$ -48900 72996 -20887 -299459 -315922 -122378 3380 -143289 -282201 -204306 258605 -149450
19125c10124b3300h198j94657o514Q8440E8194K15435a15683A86551b03469A26608
$$ -310124 -23300 -8198 -202855 -209369 -120929 58194 273629 -115683 186551 -203469 126608
19113e1486I0196P5988b36384H5620b57995J03628a2699n256j45945C13791c59543
$$ -51486 90196 166184 -236384 85620 -257995 -154367 -12699 -17955 -163900 313791 -359543
19101C099K46099F1332J71911l3696c72358f3043j42858F7581B7094g3478k26181
$$ 3099 249198 61332 233243 199547 -372358 -63043 -205901 67581 27094 -73478 -299659
19090b99659G9228J01565d3412m6142K7257a035k55581F5848a60468a5151D9285
$$ -299659 79228 180793 -43412 -89554 -62297 -1035 -256616 65848 -160468 -15151 49285
19078h3344j58788h8236k3008m5734j36047A96510K5091a8175A07444K01606L8683
$$ -83344 -242132 -88236 -111244 -156978 -293025 196510 221601 -18175 107444 309050 347733
19067C47733c00976j147a26961o0437A6314b36776J11649j75305A70563b63528
$$ 347733 -300976 -302123 -126961 -187398 16314 -236776 -125127 -300432 170563 -263528
19056a86101C52244i6716l148o9749I2983a03444n602l3125A0004c524p1300f663
$$ -186101 352244 -96716 -99864 -169613 92983 -103444 -109046 -142171 10004 -3524 -74824 -6663
19043D2825J98135A02007b01837a7735m4134j9083m4921j0860A61893g2098A41740
$$ 42825 240960 102007 -201837 -17735 -61869 -80952 -125873 -136733 161893 -72098 141740
19031a28813A9231g9275c3210B05660c37647C2407a06219A81570b13146A98245
$$ -128813 19231 -79275 -33210 205660 -337647 32407 -106219 181570 -213146 198245
19020I396e5922B52914R8163a82489O3488B24114F148b39721i8154j1428j0997
$$ 9396 -55922 252914 351077 -182489 -119001 224114 6148 -239721 -98154 -109582 -120579
19009a20579j07591e596B36660C3996L08191A28269j1234A6813J30278b9852G8692
$$ -120579 -228170 -5596 236660 33996 342187 128269 117035 16813 147091 -29852 78692
18997a24240A00787a45246B5466h6597d627E1066h9367j8691M6717q2776j46853
$$ -124240 100787 -145246 25466 -86597 -4627 51066 -89367 -108058 -61341 -144117 -290970
18986b90970C01684P4733c5093F2440b94515a3345A950J97300a96999h6380K1277
$$ -290970 301684 376417 -35093 62440 -294515 -13345 1950 199250 -196999 -86380 -65103
18975f5103H0880J1425l9015J15864K02022J39851j71439P4686a51335M8641d8459
$$ -65103 80880 92305 53290 169154 371176 511027 339588 414274 -151335 -102694 -48459
18963C12911a39220A42634j6072e7546j06263A47417p2760Q7711C6613a53541
$$ 312911 -139220 142634 126562 -57546 -163809 147417 74657 162368 36613 -153541
18952a35536d1713j8840A46477F9635i2662j27991E6531a82132J4074f2793J742
$$ -135536 -41713 -60553 146477 69635 -92662 -220653 56531 -182132 -168058 -62793 -61051
18941f1051A58108R537h459l51436G6126f9191I9485g4258o3864n7741M3796n6479
$$ -61051 158108 167645 -8459 -359895 76126 -69191 99485 -74258 -138122 -195863 -152067 -208546
18929b08546m0916B25190d16584C40210b00206B8190Q49c03439A62567K37598
$$ -208546 -249462 225190 -416584 340210 -200206 28190 29039 -303439 162567 400165
18919D00165A91822o3419F3624a71367j92867a62379C38058A57685c25243E9308
$$ 400165 191822 128403 63624 -171367 -364234 -162379 338058 157685 -325243 59308
18908E7238j3108M44177K212j59657m5469b38066D26161h3876j65884H9805b24546
$$ 57238 44130 488307 490519 330862 285393 -238066 426161 -83876 -249760 89805 -224546
18896F6090i2918M2874F1092a41264D35818b68605A5156O3784e8534F2807d1577
$$ 66090 -92918 -50044 61092 -141264 435818 -268605 15156 78940 -58534 62807 -41577
18884b52810F371a85207B49070p4860g9490j91187O4608j26763J59404A97976
$$ -252810 6371 -185207 249070 174210 -79490 -270677 -206069 -332832 -173428 197976
18873A71975e7760k46085j12770a41660l8338p416C3b44271F2947Q5928J17538
$$ 171975 -57760 -303845 -416615 -141660 -179998 -187414 33 -244271 62947 148875 266413
18862B66413e5087j05234b459j26925G5725g5631o5657A85510b88442b0029j67878
$$ 266413 -55087 -160321 -2459 -129384 75725 -75631 -141288 185510 -288442 -20029 -187907
18851a87907b5523K316j6031r6381N3091E8375b45233A9281b00520j40571B63155
$$ -187907 -25523 -23207 -39238 -135619 -82528 58375 -245233 19281 -200520 -341091 263155
18839c58931B44582A18385f5683k34763J16159A33490d09988B0583h9071j50261
$$ -358931 244582 118385 -65683 -300446 -184287 133490 -409988 20583 -89071 -239332
18829b39332A69433E5750b79851G8303j1701l2394K70965A43493a72747J8474
$$ -239332 169433 55750 -279851 78303 66602 34208 305173 143493 -172747 -154273
18819a54273c0663k43929C62800a10394F2375A1060a21622L7920a7347o7272B37414
$$ -154273 -30663 -274592 362800 -110394 62375 11060 -121622 -83702 -17347 -84619 237414
18807E6585N8215K59543j62841A8690h3268q263B28074a11768A93890E4726B1285
$$ 56585 114800 374343 211502 18690 -83268 -91531 228074 -111768 193890 54726 21285
18795b87632i3844k92015g6373r8812B28022a09302K2369B63283b9951B4619B351
$$ -287632 -93844 -385859 -76373 -175185 228022 -109302 -86933 263283 -29951 24619 2351
18783c49604J58638D8276a09358N3166j58439E8764R6182D4812K67084h6166G4898
$$ -349604 -190966 48276 -109358 -56192 -214631 58764 154946 44812 311896 -86166 74898
18771b10883C4783a99592C7334O0431c90175a90750M3104J6983A65364c70924
$$ -210883 34783 -199592 37334 97765 -390175 -190750 -147646 -130663 165364 -370924
18760b10571L6014k13555a48393c2007k842B41452R0728d0312j35872O1075J8705
$$ -210571 -174557 -388112 -148393 -32007 -34849 241452 332180 -40312 -176184 -115109 -96404
18749i6404o3675B06243b97830F6435N141J37953J15288b82660C2932J69757h8110
$$ -96404 -160079 206243 -297830 66435 71576 209529 324817 -282660 32932 202689 -88110
18737b44537Q4303c8884j70770l2198M2361B78899R391c42348A22551d7391A56053
$$ -244537 -160234 -38884 -209654 -241852 -199491 278899 288290 -342348 122551 -47391 156053
18725A8957b38280H4234d88974a58588A53390a39000B9725a84609B25487e97704
$$ 18957 -238280 84234 -488974 -158588 153390 -139000 29725 -184609 225487 -597704
18714B0512b51505A62391b66668d7699j33905B4437b9342j44390Q6082j82777
$$ 20512 -251505 162391 -266668 -47699 -181604 24437 -29342 -173732 -87650 -270427
18704b70427a7310B32437e2770H7008j1090d7287B64731b31072C049e2618A88769
$$ -270427 -17310 232437 -52770 87008 75918 -47287 264731 -231072 3049 -52618 188769
18692B08852b96605G8740K6521c11383B5112J27506j2392n4609h6409k77983B58180
$$ 208852 -296605 78740 105261 -311383 25112 152618 140226 85617 -86409 -364392 258180
18680b44317j17826A09443K1634b83987a3722j95731M5453A61531C792a14905
$$ -244317 -362143 109443 131077 -283987 -13722 -209453 -164000 161531 3792 -114905
18669B06173j7230c9351G0322J38898G5406j2121J05298a39660f4949l2460k09541
$$ 206173 188943 -39351 70322 209220 75406 63285 168583 -139660 -64949 -97409 -306950
18658c06950a5338p8327H545J91008a96755l7244j14146A26552h3899c476l0707
$$ -306950 -15338 -93665 8545 199553 -196755 -233999 -348145 126552 -83899 -3476 -34183
18647c4183k11305J9985g044A10026n1129a20791A63773a55971g1322F9800b40760
$$ -34183 -245488 -225503 -7044 110026 58897 -120791 163773 -155971 -71322 69800 -240760
18635b92238o0396e8910K6289i061j34155g0669A24024b02572a0633A10027b55748
$$ -292238 -352634 -58910 -32621 -9061 -143216 -70669 124024 -202572 -10633 110027 -255748
18623b13349g3768k4157B35059a95757d8999m5123r6470G4527b8072k00082H1968
$$ -213349 -73768 -97925 235059 -195757 -48999 -94122 -190592 74527 -28072 -228154 81968
18611b2428A08870O03a9376l2948A62435f2848A03859a58883O9400H6270J20834
$$ -22428 108870 109473 -19376 -52324 162435 -62848 103859 -158883 -89483 86270 207104
18600B07104g727G0281J15660A316a57714j10918L6041I7312b4956B47989h830
$$ 207104 -7727 70281 185941 1316 -157714 -268632 -232591 97312 -24956 247989 -8830
18588d2937A22387a17215E5763a9102l0187A23022a67799m79720L15478J52862
$$ -42937 122387 -117215 55763 -19102 -49289 123022 -167799 -647519 -332041 -179179
18578a79179F1087A2443a72715D5386N1655b8453B3004c2778h353B24415h5641
$$ -179179 61087 12443 -172715 45386 97041 -28453 23004 -32778 -8353 224415 -85641
18566a91734d3042A05481e0028k1666A60805J65736B7380f6077p5527q9312f4772
$$ -191734 -43042 105481 -50028 -71694 160805 326541 27380 -66077 -141604 -230916 -64772
18554d9702n8692A4913a26650j455n102F628J1852a41161L5030B4232J71887i5435
$$ -49702 -108394 14913 -126650 -128105 -133207 6628 18480 -141161 -106131 24232 196119 -95435
18541d724I5623c1789k62853F0529N4206l0112J07640a49183A04770C3789b389
$$ -4724 95623 -31789 -294642 60529 114735 84623 192263 -149183 104770 33789 -2389
18529d4543k08309O0095B5258d31574c9314j18154a6375j72503K7635r48p8676
$$ -44543 -252852 -192757 25258 -431574 -39314 -157468 -16375 -188878 -161243 -162191 -240867
18518b40867A17116a21515H78b82146J01568K4172B22449a83519g1872B41887
$$ -240867 117116 -121515 878 -282146 -180578 -156406 222449 -183519 -71872 241887
18507A12536a26129A5689a6061j7916l2167j44440A18290l3361j8863Q5635A6006
$$ 112536 -126129 15689 -16061 -33977 -66144 -210584 118290 84929 66066 151701 16006
18495c35827B8258b03995B47732a5268o2720K0883C30991f2757a3654j84669d1235
$$ -335827 28258 -203995 247732 -15268 -77988 -57105 330991 -62757 -13654 -198323 -41235
18483G6514f4771j2341B33311o2007i4658k73225f1433A97948n5980j3695a35810
$$ 76514 -64771 -77112 233311 171304 -94658 -367883 -61433 197948 141968 128273 -135810
18471A95968a39964j856M5248m3490A25017c70889A27089e3320A16688a35450
$$ 195968 -139964 -141820 -96572 -140062 125017 -370889 127089 -53320 116688 -135450
18460g6956C17861b86562B7160f4033B55941p5806a67256d9767i290l49437i7126
$$ -76956 317861 -286562 27160 -64033 255941 180135 -167256 -49767 -9290 -358727 -97126
18448i9212b8117I9959i5057j9226c0139k16117L5121H4932k1405K0630L04057
$$ -99212 -28117 99959 -95057 -114283 -30139 -246256 -211135 84932 63527 84157 388214
18437C88214j69259A1260a69495b1441k65661J18895B00340R9599a50352m176
$$ 388214 218955 11260 -169495 -21441 -287102 -168207 200340 299939 -150352 -154528
18427a54528O7321A41426g4554m4908B4608a74045Q5420k06437j01949g2221j03303
$$ -154528 -87207 141426 -74554 -119462 24608 -174045 -88625 -295062 -397011 -72221 -175524
18416a75524Q0114A91709q562J53274a68854A65848a23088M6378A71668d2955
$$ -175524 -95410 191709 183147 336421 -168854 165848 -123088 -76710 171668 -42955
18405b52211A06087J69317a77701f7356B7229g2962B6528c712A57193a94903m0674
$$ -252211 106087 275404 -177701 -67356 27229 -72962 26528 -3712 157193 -194903 -235577
18394b35577k7619J31005a562k6082I322J15194c27642B02819h01l26977a61911
$$ -235577 -263196 -132191 -1562 -27644 9322 124516 -327642 202819 -801 -327778 -161911
18382D457a63610r4318i1930D9060j1337A7685J21947e6095G0562J91127j01399
$$ 4457 -163610 -257928 -91930 49060 37723 17685 139632 -56095 70562 261689 160290
18371A60290i7910G7017J26735F7085a07743o8253B62764a97261A07102f5212
$$ 160290 -97910 77017 203752 67085 -107743 -175996 262764 -197261 107102 -65212
18360a26815r1423C4918L55069A33329j6113a39687J7505k75120B33434p0118
$$ -126815 -218238 34918 389987 133329 117216 -139687 -122182 -397302 233434 163316
18350A63316a93124B08421a1235j2419J0495B10906K8348D7002a75742A58675
$$ 163316 -193124 208421 -11235 -23654 -13159 210906 239254 47002 -175742 158675
18339D0286J80336r7780c25762g9523A32309i1841j35344J04086a4994p2130j16814
$$ 40286 220622 122842 -325762 -79523 132309 -91841 -227185 -123099 -14994 -87124 -203938
18328b03938h4452A56597O3083l7942a43792J2125A08279a40230B03711H5219
$$ -203938 -84452 156597 219680 181738 -143792 -131667 108279 -140230 203711 85219
18317B01483J6727G0163a2188C38252a40206A11652e573j1620H5898J20463I7488
$$ 201483 218210 70163 -12188 338252 -140206 111652 -5573 -17193 85898 206361 97488
18305g9538L6731j70106A47636e198l27838B15952B3316K56364b08017b2367j69128
$$ -79538 -42807 -212913 147636 -5198 -333036 215952 23316 279680 -208017 -22367 -191495
18294a91495M5126B64067C3203a47545H7190L7622P2667h8212n49956h7310L2149
$$ -191495 -146369 264067 33203 -147545 87190 124812 197479 -88212 -638168 -87310 -55161
18283e5161A86034b37291i7227M5149j975C24278B9927P5671c2023n20379K67348
$$ -55161 186034 -237291 -97227 -52078 -54053 324278 29927 105598 -32023 -552402 -285054
18272b85054J31883D7328a14500R994M6388A39920O2187b01463a00468m0828O4412
$$ -285054 -153171 47328 -114500 -104506 -58118 139920 202107 -201463 -100468 -141296 -76884
18261g6884c30k42789e5231q7283D4120a60979j8987A35740i9606L1979b153q133
$$ -76884 -330 -243119 -55231 -142514 44120 -160979 -179966 135740 -99606 -67627 -2153 -10286
18249a0286F1702J03159c12429A35673F4225K06333f3325G5241a45675f6772r1249
$$ -10286 61702 164861 -312429 135673 64225 270558 -63325 75241 -145675 -66772 -158021
18238a58021f5177k62483A16351b00719g4678B4157L65704b50361J15302F5874
$$ -158021 -65177 -327660 116351 -200719 -74678 24157 389861 -250361 -135059 65874
18227B24300h7308E9976a73232f1635B85713A25402a73486p5407G2505N7058R0129
$$ 224300 -87308 59976 -173232 -61635 285713 125402 -173486 -248893 72505 129563 219692
18216B19692g8137j12661e352k53742p9629J07690A01908b35690b4190D24483
$$ 219692 -78137 -190798 -5352 -259094 -338723 -231033 101908 -235690 -24190 424483
18205d19548B23985A01238c94064C17382b61474g6558K4918G6501B1502g8230
$$ -419548 223985 101238 -394064 317382 -261474 -76558 -51640 76501 21502 -78230
18194f8825A83126f5516G3030b53408b8136j37358B13380a55342b1609B2551b1739
$$ -68825 183126 -65516 73030 -253408 -28136 -165494 213380 -155342 -21609 22551 -21739
18182A52468J35983a34227A10975b8146A300g0716F4271i5129j59619c1967B36488
$$ 152468 288451 -134227 110975 -28146 1300 -70716 64271 -95129 -254748 -31967 236488
18170C22648A04548A3637c26833B6617a5028j39256b8381k64617A48013b87340
$$ 322648 104548 13637 -326833 26617 -15028 -154284 -28381 -292998 148013 -287340
18159B07124l42j9124a38532M7379D896a65598g866D6831a20830J4191r2386L4839
$$ 207124 206782 187658 -138532 -91153 4896 -165598 -7866 46831 -120830 -106639 -199025 -164186
18147a64186a8940k32570A83997b91827A30063g6723A4922b0964d440G1594c66097
$$ -164186 -18940 -251510 183997 -291827 130063 -76723 14922 -20964 -4440 71594 -366097
18135g46A53587E5894J25379c7318B95061J8161a52805B3936K3224R7974a96927
$$ -746 153587 55894 181273 -37318 295061 313222 -152805 23936 47160 145134 -196927
18123b94523a43702B89718l8907b99185P1659C2862K35414m5282E4974K77388
$$ -294523 -143702 289718 250811 -299185 -227526 32862 268276 222994 54974 332362
18113C32362q4404a32632F0045P1661n1119J6212D0517J44779a05404j67743a01200
$$ 332362 247958 -132632 60045 131706 80587 96799 40517 185296 -105404 -273147 -101200
18101a47061E3223k3292K40227b483l1900k91391B8682L86782a87927A01390e84744
$$ -147061 53223 29931 270158 -2483 -34383 -325774 28682 415464 -187927 101390 -584744
18089a83868M2912m0015A48440m9443i276m2598E3220J22383E8893M2344C5427
$$ -183868 -140956 -180971 148440 98997 -9276 -51874 53220 175603 58893 101237 35427
18077F9161b8475j02445d6346A50448K4445D934J76293a23112j39425B05219o3187
$$ 69161 -28475 -130920 -46346 150448 174893 4934 181227 -123112 -262537 205219 142032
18066A42032a45986C1359K19230c2292k1432j4088r0002A3559a8168A81248J16091
$$ 142032 -145986 31359 250589 -32292 -53724 -67812 -157814 13559 -18168 181248 297339
18055B97339b92623C4144b12995A63472b9836k34184C36602A5652a69106F1721
$$ 297339 -292623 34144 -212995 163472 -29836 -264020 336602 15652 -169106 61721
18044F4591a45723I6186b35627B51568F7485J82889a6289D01603a01307j5945
$$ 64591 -145723 96186 -235627 251568 67485 250374 -16289 401603 -101307 -117252
18034a17252j2037H8623b58169C9114P7385Q4974A734c8538j86194A24053a088
$$ -117252 -129289 88623 -258169 39114 116499 201473 1734 -38538 -224732 124053 -1088
18022B45921g9967B49856b1278l4976n8339D1102N7463a97596P6291A44549e7976
$$ 245921 -79967 249856 -21278 -56254 -114593 41102 98565 -197596 -121305 144549 -57976
18010B6261I481K8405b24000A4893J63384J78663a71648g4846I6710L3745a37888
$$ 26261 9481 37886 -224000 14893 178277 356940 -171648 -74846 96710 130455 -137888
17998a29207B15035G6289b43112b3043F9534a4677G1182K29578c33811F294K39833
$$ -129207 215035 76289 -243112 -23043 69534 -14677 71182 300760 -333811 6294 246127
17987B46127a43422p9520B7833K1122a45537B06324d22763B69063g7830B37948
$$ 246127 -143422 -222942 27833 48955 -145537 206324 -422763 269063 -77830 237948
17976A24732J51237A3075L09631a05890q390F2378i2140J8805m3846M1959l96581
$$ 124732 275969 13075 322706 -105890 -114280 62378 -92140 -73335 -117181 -75222 -471803
17965d71803B50274n1966i292q2572A56043B4123b48312J19933E4180b80167I0573
$$ -471803 250274 198308 -9292 -91864 156043 24123 -248312 -128379 54180 -280167 90573
17953b4636A68813b83894e4664J7596B81301j29356k9823b83146J13682N3799
$$ -24636 168813 -283894 -54664 -37068 281301 151945 122122 -283146 -169464 -115665
17943a15665j22326A7750J47505k1583R4595B219c3534A99440F7949h4564A62516
$$ -115665 -237991 17750 165255 143672 238267 2219 -33534 199440 67949 -84564 162516
17931a29412G2149Q6487L2758c2995A46654N4426a87501b0798j27359f0596J0388
$$ -129412 72149 158636 191394 -32995 146654 201080 -187501 -20798 -148157 -60596 -50208
17920e0208J8293j43475B3504L16662C3548L21244b6784J0478j73386B7325a1279
$$ -50208 -31915 -175390 23504 340166 33548 354792 -26784 -16306 -189692 27325 -11279
17908b77251A79569m2623k0327a05993l3299L5237c6535A45394c92716i399A9847
$$ -277251 179569 136946 116619 -105993 -139292 -104055 -36535 145394 -392716 -9399 19847
17896A94412l0391b44388B93955o7415E7262i7549F6782Q132R631M90893C3325
$$ 194412 164021 -244388 293955 226540 57262 -97549 66782 74914 84545 575438 33325
17884A82562d05396a10365K581h266m7884b2363l01981A55680R3212l9194q3304
$$ 182562 -405396 -110365 -107784 -8266 -56150 -22363 -324344 155680 248892 209698 126394
17873A26394c7650F6855h2065b1272A39000A4350b1088B15721B597J73102j2251
$$ 126394 -37650 66855 -82065 -21272 139000 14350 -21088 215721 2597 175699 163448
17862A63448D964c9402a1074D2582L0474h1938C5563i6563A02407b14892B98319
$$ 163448 4964 -39402 -11074 42582 73056 -81938 35563 -96563 102407 -214892 298319
17850b19105A57185L24073e0413k89606I3607J30671a10077A53645J11036J4500
$$ -219105 157185 481258 -50413 -340019 93607 224278 -110077 153645 264681 279181
17840B79181A12855k0338L05928B9015g2011K5769l6265A49164m4008b60576G5815
$$ 279181 112855 92517 398445 29015 -72011 -46242 -82507 149164 105156 -260576 75815
17828A85084N242R8542a3858A81994R2337H2518b02663b848e6F6599c23517a42521
$$ 185084 190326 288868 -13858 181994 274331 82518 -202663 -2848 -56 66599 -323517 -142521
17815e035A39709l9410a44107C34523A16473d7283b2704C94307h7970B45543b7943
$$ -5035 139709 100299 -144107 334523 116473 -47283 -22704 394307 -87970 245543 -27943
17803D1675a54090M1368A98750b5466C4636b06873B31769m0833a78940h910o5934
$$ 41675 -154090 -112722 198750 -25466 34636 -206873 231769 190936 -178940 -8910 -74844
17792g4844n061o595B47759h1784A75050q5606K24251H5132l6626J48819a2115
$$ -74844 -79905 -86500 247759 -81784 175050 89444 313695 85132 48506 197325 -12115
17780E162h9668A1667Q7102R346K1624J92763b23432A9130a34119E1618A8732
$$ 5162 -89668 11667 98769 108115 129739 322502 -223432 19130 -134119 51618 18732
17768a55643I2952e986C92779I5352b12019I0437b20281G7411b4000N119l4546
$$ -155643 92952 -5986 392779 95352 -212019 90437 -220281 77411 -24000 -18881 -53427
17757e3427j79771Q9377A65193C0824J5375a32254J9318j23298p0395i5959q7059
$$ -53427 -233198 -143821 165193 30824 46199 -132254 -112936 -236234 -306629 -95959 -183018
17746a83018j4942A50379B4453h9651A18573m3986a43736B85898Q7208j21937
$$ -183018 -197960 150379 24453 -89651 118573 74587 -143736 285898 373106 251169
17736B51169C6371P5299D1279J79352I26M8709P3270b0220k54331A58131f5709
$$ 251169 36371 111670 41279 220631 926 49635 122905 -20220 -274551 158131 -65709
17724b11611h83B15213C0673K9730a76341B43007G6690h0973D18113G5733J88232
$$ -211611 -883 215213 30673 60403 -176341 243007 76690 -80973 418113 75733 263965
17713B63965c1100k87125d0044B57618D3776M4822k2258b4907C07393A07297R4111
$$ 263965 -31100 -318225 -40044 257618 43776 88598 66340 -24907 307393 107297 201408
17702B01408e1606q4742D30690D3051a85197F4219J1429B0192b9951C1709R3687
$$ 201408 -51606 -136348 430690 43051 -185197 64219 75648 20192 -29951 31709 125396
17691A25396n7473J2357b34528c7199r3070b4699C04894d1994B7950J47004K06561
$$ 125396 67923 80280 -234528 -37199 -130269 -24699 304894 -41994 27950 174954 381515
17680C81515A7138b63137C54233A61229a24085I0434K41244j16097G3622b06638
$$ 381515 17138 -263137 354233 161229 -124085 90434 331678 215581 73622 -206638
17669E4673R9512M6134i5403j22264C06397A31321a52714A85678o6870l6449J16106
$$ 54673 154185 200319 -95403 -217667 306397 131321 -152714 185678 118808 82359 198465
17658A98465e5605H8181J69878n9314H4432J30271h5097B7014d4882F8307b16026
$$ 198465 -55605 88181 258059 198745 84432 214703 -85097 27014 -44882 68307 -216026
17646i0085l3982E6031A9239O3933d2782A35397e5294A11982J22154I2448h6396
$$ -90085 -124067 56031 19239 83172 -42782 135397 -55294 111982 234136 92448 -86396
17634h3308C45395j60697E0623J8672a43130b6350i423l90928A54646D1721J45739
$$ -83308 345395 184698 50623 69295 -143130 -26350 -9423 -400351 154646 41721 187460
17623A87460p2296L8185K54427A53276a04946A35000n7554Q8481a39237K3360
$$ 187460 115164 153349 407776 153276 -104946 135000 77446 165927 -139237 -115877
17613a15877C52196f4704J1666C98988f0351m9827E8450b25049C47781a83697
$$ -115877 352196 -64704 -53038 398988 -60351 -110178 58450 -225049 347781 -183697
17602B3288a92411A02036d2148k51730C14046K02411k25568A15602M2742a68511
$$ 23288 -192411 102036 -42148 -293878 314046 516457 290889 115602 158344 -168511
17591A43726a30145a6845B61381a17774B449L19426p7362a9360H699N2887J88027
$$ 143726 -130145 -16845 261381 -117774 2449 321875 244513 -19360 8699 61586 249613
17580B49613K8416J44555j17028I5454m1110J0121L34261F1904J05874E3546d337
$$ 249613 278029 422584 305556 95454 54344 64465 398726 61904 167778 53546 -4337
17568B79423E0855J55437J59188k4891D3771J29651e7677A29490h6001B50917
$$ 279423 50855 206292 365480 340589 43771 173422 -57677 129490 -86001 250917
17557i1874A22129J09548M9014C9191L45901A70744K46762j18779j07747H5018
$$ -91874 122129 231677 280691 39191 385092 170744 417506 298727 190980 85018
17546D51140A60756L36622a79185A41825J32924j33711a05482B28309J35340l9453
$$ 451140 160756 497378 -179185 141825 274749 141038 -105482 228309 363649 324196
17536C24196I0228P8111C1321K42347J7650J82381o0350m3439j81449J64385n8951
$$ 324196 90228 168339 31321 273668 291318 473699 413349 369910 188461 352846 293895
17525B93895K38410K65444P7007L0457o8164j28640k41782K26036A98013J15040
$$ 293895 532305 797749 874756 905213 837049 708409 466627 692663 198013 313053
17515C13053D2941K99994L73548A40305J87679K66812J2048M60846k73313N8405
$$ 313053 42941 342935 716483 140305 327984 594796 606844 1067690 794377 852782
17505H52782k93061k25206n7102j3329J39599A34865K00816F9404L06060j43238
$$ 852782 559721 334515 277413 264084 403683 134865 335681 69404 375464 232226
17495B32226L5154a61767C62629A8505L45793A51930J91205J28367j96437a1966
$$ 232226 267380 -161767 362629 18505 364298 151930 343135 471502 275065 -11966
17484F2036K89943I1384L76125a14382C35332Q1988A66054J33851j18384l5343
$$ 62036 351979 91384 467509 -114382 335332 417320 166054 299905 181521 146178
17474A46178a93961B46499A5943N12683A067L65441j7095j9967J89729a42069
$$ 146178 -193961 246499 15943 528626 1067 366508 349413 329446 519175 -142069
17463E31976l0166C9034O7954O5183h503C69130P0572J58202B85683Q3681j41463
$$ 531976 501810 39034 106988 172171 -8503 369130 439702 597904 285683 369364 227901
17452B27901J88262j71517J08029j47402f8073E68509A95098L81530j81540n411
$$ 227901 416163 244646 352675 205273 -68073 568509 195098 576628 395088 389677
17442C89677Q2799J20374A26064J55662j10722J14919j10479J85464K44212k18549
$$ 389677 472476 592850 126064 281726 171004 285923 175444 360908 605120 386571
17432C86571a34952B06776p5604M90998I3847P0807J06831j27705N02638B99045
$$ 386571 -134952 206776 131172 622170 93847 164654 271485 143780 646418 299045
17421B69590K36299A90079L25347B34290K40297A60579J41743N4179J91584Q5645
$$ 269590 505889 190079 515426 234290 474587 160579 302322 356501 548085 633730
17411F33730M6570k12966H7514N04640k48126l0216E266b51903C67892Q366j32657
$$ 633730 680300 467334 87514 592154 344028 313812 5266 -251903 367892 376258 243601
17400B43601K6052D1253K09096q7759Q8227p3137J72149m4607p5024J28116j57681
$$ 243601 269653 41253 250349 162590 250817 177680 349829 305222 230198 358314 200633
17389B00633N263j317j515K13616b7824A67973K75841J27135k71213I8980J55144
$$ 200633 205896 204579 203064 416680 -27824 167973 443814 570949 299736 98980 254124
17378B54124O6526j55694K76667j58214k5632I2640a33947A61353m1534O0633
$$ 254124 320650 164956 441623 283409 257777 92640 -133947 161353 119819 180452
17368A80452K11871j67054M7315Q5379j76439J3323c9968D79524H8206J75595
$$ 180452 392323 225269 272584 357963 181524 194847 -39968 479524 88206 263801
17358B63801M4136j22454J23702A2758J34001O8014M9926a75216E90747A80051
$$ 263801 307937 185483 309185 12758 146759 214773 264699 -175216 590747 180051
17347A16685b7176C26109A61586K47642p1143Q314j7685J07708j83259K24614
$$ 116685 -27176 326109 161586 409228 338085 346399 328714 436422 253163 477777
17337D77777B09676K51821F3335J95033n7272J41106a08124B13984D7053K31182
$$ 477777 209676 461497 63335 258368 201096 342202 -108124 213984 47053 278235
17327B78235P1418q3031K21200B00577r67b74015G6991i0718B32241J61770n1768
$$ 278235 349653 266622 487822 200577 199610 -274015 76991 -90718 232241 394011 342243
17316C42243r7210Q207K45221A8857J18720K87131k03250a82971A54556J73228
$$ 342243 245033 253240 498461 18857 137577 424708 221458 -182971 154556 327784
17306C27784j24344J5536o1896L46271j35362A77966Q392L73730j80633j49149
$$ 327784 203440 218976 157080 503351 367989 177966 186358 560088 379455 230306
17296B30306P2271J53093j85080a98587E76531a56670C26649n5533A02341O5601
$$ 230306 302577 455670 270590 -198587 576531 -156670 326649 271116 102341 167942
17286A67942J68726J31795N6516B59178B2197L60055A71002J47749K66966j14808
$$ 167942 336668 468463 524979 259178 22197 382252 171002 318751 585717 470909
17276D70909J63946l7068j25725A97755K20678K3525A88214J31130K1324B3402
$$ 470909 634855 597787 472062 197755 418433 441958 188214 319344 340668 23402
17265D37670B8978J63092K4602F1045J83110K69014B40280F6590L80835j58717
$$ 437670 28978 192070 216672 61045 244155 513169 240280 66590 447425 288708
17255B88708J73119j75609L42447p5984o9784B28378p1117B4131K39850J49752
$$ 288708 461827 286218 628665 552681 482897 228378 157261 24131 263981 413733
17245D13733j36421n6142J385O1929r46N44736A83549K20667J2858p5544P7863
$$ 413733 277312 221170 222555 284484 283538 828274 183549 404216 417074 341530 419393
17234D19393A60257K76500L2092K786j69215q5991K56356B16397L54679j57000
$$ 419393 160257 436757 468849 471635 302420 216429 472785 216397 571076 414076
17224D14076j30033L95837l35450j04167J02606Q5102m4929m6771L80050B98015
$$ 414076 284043 679880 344430 240263 342869 427971 383042 336271 716321 298015
17213I2286L87172j88923K69095j10802j26978l2541m0220L14023A96363L12400
$$ 92286 479458 290535 559630 448828 321850 289309 249089 563112 196363 508763
17203E08763J05302B00204J00091e9994B88532J39090J05541B43211K85918B42809
$$ 508763 614065 200204 300295 -59994 288532 427622 533163 243211 529129 242809
17192A95588K44069j49655L5248A59315K04215K07464q1818p1710k05079f6956
$$ 195588 439657 290002 325250 159315 363530 570994 489176 417466 212387 -66956
17181B68016L47982I7340L02826r2909N234J6734B408L95742A0756P13912G9854
$$ 268016 615998 97340 400166 307257 312491 329225 2408 398150 10756 724668 79854
17169B46354K66938j09487P3683j58334J81032J07792k74287K51437j45563R566
$$ 246354 513292 403805 477488 319154 500186 607978 333691 585128 439565 449131
17159D49131j51786L85428k32107p994o9248p6337j31114M32257J3887K43890
$$ 449131 297345 682773 450666 442672 373424 297087 165973 598230 612117 856007
17149H56007l78874P0891j38656P1789j98139N88397B96615K6615j02224m3637
$$ 856007 477133 548024 409368 481157 283018 871415 296615 323230 221006 177369
17139A77369L61164k01559M23636l06040p2881N9790M2781j60383N13020C67176
$$ 177369 538533 336974 760610 454570 381689 441479 484260 323877 836897 367176
17128F48009j12359o4820m9356j8073J95637j2748R9387B74311J66814j08539
$$ 648009 535650 470830 421474 403401 599038 586290 685677 274311 441125 332586
17118C32586j0748K17749L67558m51345j02021O3649L97108l78188J69866k4255
$$ 332586 321838 539587 907145 455800 353779 417428 814536 436348 606214 581959
17108E81959l8101K99183B81151M71798j67342k6322k56846K89270K69627k10708
$$ 581959 543858 843041 281151 752949 585607 559285 302439 591709 861336 650628
17098F50628L6628N8288j64619k29048J89342J58742J8A84988H8812N97630L945
$$ 650628 687256 745544 580925 351877 541219 699961 699979 184988 88812 686442 690387
17087F90387R95M2136j94586M02488j28006K67987k75328K7574l93085K55031
$$ 690387 691382 733518 538932 941420 813414 1081401 806073 833647 440562 695593
17077F95593j57407J76967L51402k72062M8353m2385R2678n7756J02912j45753
$$ 695593 538186 715153 1066555 794493 842846 800461 893139 835383 938295 792542
17067G92542k54339J83247j143K06308l43282K64134k41149K39331j0301J53750
$$ 792542 538203 721450 720307 926615 583333 847467 606318 845649 835348 989098
17057I89098l85355J36154k87532L69159l8197n0956K0006j67025L42437j23213
$$ 989098 603743 739897 452365 821524 783327 732371 752377 585352 927789 804576
17047H04576P3975j58319r826O0056J59524l5471n9714J35699l9362J08993m16650
$$ 804576 878551 720232 710406 770462 929986 894515 834801 970500 931138 1040131 623481
17036F23481N56815n72485M17790j98604K67553l30584L30408j34578j42104j66746
$$ 623481 1180296 607811 1025601 826997 1094550 763966 1094374 959796 817692 650946
17026F50946L66942r8871J77045j481l44702J30230P6163j2481K28832l74897
$$ 650946 1017888 919017 1096062 1094581 749879 880109 956272 943791 1172623 797726
17016G97726O4572J94063k8507k57627J59376L52965k85896m06286O26983m8931
$$ 797726 862298 1056361 1027854 770227 929603 1282568 996672 590386 1217369 1168438
17006A168438q6894j9660P8534j432K10308k45764m2989r6355K38100J9727Q5047
$$ 1168438 1081544 1061884 1140418 1138986 1349294 1103530 1060541 964186 1202286 1222013 1307060
16995A307060k79647L24753j84705j59992M4885O3769O9792k41668M66979j96483
$$ 1307060 1027413 1352166 1167461 1007469 1052354 1116123 1185915 944247 1411226 1214743
16985A214743r0409j21870K28210R7997O4716n9719j31587Q1480L6839j531l99215
$$ 1214743 1124334 1002464 1230674 1328671 1393387 1333668 1202081 1283561 1320400 1318869 919654
16974I19654P63162m12629J41247k3639j28578l533O9470j30387M58043l81965
$$ 919654 1682816 1270187 1411434 1387795 1259217 1255684 1325154 1194767 1652810 1270845
16964A270845J80032J75528l20808K49499q2812O0737j80495K22018L00868j33933
$$ 1270845 1450877 1626405 1305597 1555096 1472284 1533021 1352526 1574544 1875412 1741479
16954A741479l62820K71981K20484k34106j559K79201l77759J37619J31799K09800
$$ 1741479 1378659 1650640 1871124 1637018 1635459 1914660 1536901 1674520 1806319 2016119
16944B016119j27455k37103j7126J1560L10821m09210N74090j85870K21286m75020
$$ 2016119 1888664 1651561 1634435 1645995 1956816 1547606 2121696 1935826 2157112 1682092
16934A682092K00089K0780q3830j19719J79785M17636m52394J50561J23525r2845
$$ 1682092 1882181 1902961 1819131 1699412 1879197 2296833 1844439 1995000 2118525 2025680
16924B025680L942J07727K12225l4733j92701M5382O4494r1906j70210k4758M40342
$$ 2025680 2029622 2137349 2349574 2314841 2122140 2167522 2232016 2140110 1969900 1945142 2385484
16913B385484l09924L38492o4253M34493o76106J78918J77857j80136K70169J90718
$$ 2385484 2075560 2414052 2349799 2784292 2108186 2287104 2464961 2284825 2554994 2745712
16903B745712j80182J24821o2112q072L7016p6037K85895k11110P6277K94789
$$ 2745712 2565530 2690351 2628239 2620167 2657183 2581146 2867041 2655931 2732208 3026997
16893C026997p9994j07107p1286j68921J55840N3455K49728j87690l060L39247
$$ 3026997 2947003 2839896 2768610 2599689 2755529 2808984 3058712 2871022 2867962 3207209
16883C207209J62826j62961k56916K51308P7036j42565L71318J07034k31966O3356
$$ 3207209 3370035 3207074 2950158 3201466 3278502 3135937 3507255 3614289 3382323 3445679
16873C445679K44135l09979J48852l5796J81030J552L39057j99602K59362J10727
$$ 3445679 3689814 3379835 3528687 3492891 3673921 3675473 4014530 3814928 4074290 4185017
16863D185017k63425L52790j06215J25748K11089k06346r386J72678K23624k12403
$$ 4185017 3921592 4274382 4168167 4293915 4505004 4298658 4289272 4461950 4685574 4473171
16853D473171L44103k19845N61499k63612J96900l45604J52855L2746N47538l59427
$$ 4473171 4817274 4597429 5158928 4895316 5092216 4746612 4899467 4932213 5479751 5120324
16843E120324O9916o7900O36731m51874K10403K00231K76087M0867k5374l1835
$$ 5120324 5190240 5122340 5759071 5307197 5517600 5717831 5993918 6034785 6009411 5977576
16833E977576L46505K27246o5164L49738J63794m7897o4004L30093J14892j28784
$$ 5977576 6324081 6551327 6486163 6835901 6999695 6951798 6887794 7217887 7332779 7203995
16823G203995Q4292K71576l6257M87053N7687j7322K73095R7884K36872L56631
$$ 7203995 7288287 7559863 7523606 8010659 8068346 8051024 8324119 8422003 8658875 9015506
16813I015506J75249L36048L34257l65231L24699J73684K80138L83664K97159
$$ 9015506 9190755 9526803 9861060 9495829 9820528 9994212 10274350 10658014 10955173
16804A0955173j16771L33539M11891M7106O25808M2180M45700j32303N74030M87500
$$ 10955173 10838402 11171941 11583832 11630938 12256746 12298926 12744626 12612323 13186353 13673853
16794A3673853L88701Q9643N82216M7189M49076L40763N06737K06410K99685P55407
$$ 13673853 14062554 14152197 14734413 14781602 15230678 15571441 16078178 16284588 16584273 17339680
16784A7339680K51937O00393O95726K62747J109786L35370K77879Q92905R49201
$$ 17339680 17591617 18192010 18887736 19150483 20260269 20595639 20873518 21766423 22715624
16775B2715624K20763J070082Q33418M54091O51779J282318N04383J353894N34917
$$ 22715624 22936387 24006469 24839887 25293978 25945757 27228075 27732458 29086352 29621269
16766B9621269J262967J068212R62762J212558J407190J058726J474014J236609
$$ 29621269 30884236 31952448 32915210 34127768 35534958 36593684 38067698 39304307
16758C9304307J584258J423361J659112J817715J496965K013095J905415K185694
$$ 39304307 40888565 42311926 43971038 45788753 47285718 49298813 51204228 53389922
16750E3389922K053170K352717K514668J945685K536257K450293K387271L272834
$$ 53389922 55443092 57795809 60310477 62256162 64792419 67242712 69629983 72902817
16742G2902817K767200K552836L487567K758225L254877L342648L285350K877539
$$ 72902817 75670017 78222853 81710420 84468645 87723522 91066170 94351520 97229059
16734I7229059L200180L058651K843337K931919L182522J959519K418367K209891
$$ 97229059 100429239 103487890 106331227 109263146 112445668 114405187 116823554 119033445
16726A19033445J841939J353772J172659O97272L90005j95545j95768j138002
$$ 119033445 120875384 122229156 123401815 124099087 124489092 124293547 124097779 122959777
16718A22959777q91704j418485j832672j868883k714818k604167k705512k456367
$$ 122959777 122068073 120649588 118816916 116948033 114233215 111629048 108923536 106467169
16710A06467169l663362k519549l372961l139302l549493l428086k951949l119538
$$ 106467169 102803807 100284258 96911297 93771995 90222502 86794416 83842467 80722929
16702H0722929k994735l024338k643583k905859k744915k702552k474859k456923
$$ 80722929 77728194 74703856 72060273 69154414 66409499 63706947 61232088 58775165
16694E8775165k265028j958102k448239j890015j880116k036417j584822j752244
$$ 58775165 56510137 54552035 52103796 50213781 48333665 46297248 44712426 42960182
16686D2960182j758450j511415j419705j503135j204618j202164j391906q32671
$$ 42960182 41201732 39690317 38270612 36767477 35562859 34360695 32968789 32136118
16678C2136118j044285j265140r84898j050118j005021r28644j009020n80454
$$ 32136118 31091833 29826693 28841795 27791677 26786656 25858012 24848992 24268538
16670B4268538p09547o54770j028278j64635j301159K7268r05789o38555m00836
$$ 24268538 23558991 22904221 21875943 21711308 20410149 20437417 19531628 18893073 18492237
16661A8492237m64131n73261n56460j41884q07350k03749o59117n70894r3901
$$ 18492237 18028106 17454845 16898385 16756501 15949151 15745402 15086285 14515391 14421490
16652A4421490o63274p2873m39935j62088m79107l8580n76953L0373n18372l90624
$$ 14421490 13758216 13685343 13245408 13083320 12604213 12565633 11988680 12019053 11500681 11110057
16642A1110057j91791j90250k31076j50167l27549o5102l90781l95709k40955
$$ 11110057 10918266 10728016 10496940 10346773 10019224 9954122 9563341 9167632 8926677
16633H926677m6276j68698j0961k43673j74961m75177Q5599m6091m76806j42536
$$ 8926677 8880401 8711703 8700742 8457069 8282108 7806931 7892530 7846439 7369633 7227097
16623G227097K18576k53896j01585m6496m19071m4780q6127q292j44344l85399
$$ 7227097 7445673 7191777 7090192 7043696 6624625 6579845 6493718 6485426 6341082 5955683
16613E955683J24012j13339L4908l36590J61306m35828j36363L9697J1989l43040
$$ 5955683 6079695 5966356 6001264 5664674 5825980 5390152 5253789 5293486 5305475 4962435
16603D962435m4436K56536l40175k07828K37898k18608J1103j20558r8195k23098
$$ 4962435 4917999 5174535 4834360 4626532 4864430 4645822 4656925 4536367 4438172 4215074
16593D215074O9463r2400Q6732k68467j0512J36090m13936K04420q7560l73371
$$ 4215074 4284537 4192137 4278869 4010402 3999890 4135980 3722044 3926464 3838904 3465533
16583C465533J73061j19633J54387j5790k58773J07425j29033k3450K75695l13081
$$ 3465533 3638594 3518961 3673348 3657558 3398785 3506210 3377177 3353727 3629422 3316341
16573C316341k8097j89630o27852O81914K35954l01490q1019j40223j27938J61888
$$ 3316341 3288244 3098614 2470762 3152676 3388630 3087140 3006121 2865898 2737960 2899848
16563B899848k61441r9816N51350o06044M24065m33543J1321j2587J84325k84931
$$ 2899848 2638407 2538591 3089941 2483897 2907962 2474419 2485740 2473153 2657478 2372547
16553B372547J11065J72466m6750j48751O9092m03633M37099k08807r1279k82525
$$ 2372547 2483612 2656078 2609328 2460577 2529669 2126036 2563135 2354328 2263049 1980524
16543A980524J31684J5834k5309r5364J62464l91916M27185l68620J50995K48518
$$ 1980524 2112208 2128042 2102733 2007369 2169833 1777917 2205102 1836482 1987477 2235995
16533B235995l24841j24010J63985N3672k59884J45354o4021N8673k37634J20426
$$ 2235995 1911154 1787144 1951129 2004801 1744917 1890271 1826250 1884923 1647289 1767715
16523A767715j27162P3418k83823M21702k12546j32049P2421J95565k32077J81805
$$ 1767715 1640553 1713971 1430148 1851850 1639304 1507255 1579676 1775241 1543164 1724969
16513A724969j30959n39931O85555o6000l21231N18999m90829J08586J78229j87946
$$ 1724969 1594010 1054079 1739634 1673634 1352403 1871402 1380573 1489159 1667388 1479442
16503A479442j9132k06837m3992L02548j70619J19648l01948k014R9424j35697
$$ 1479442 1460310 1253473 1209481 1512029 1341410 1461058 1159110 1157096 1256520 1120823
16493A120823J97237m23520K38665k39433N50308k10164m991N4917K49046j60708
$$ 1120823 1318060 894540 1133205 893772 1444080 1233916 1228925 1283842 1532888 1372180
16483A372180j64896j51227Q4932R4137L1517n4553k31191M7116K50688l96100
$$ 1372180 1207284 1056057 1140989 1235126 1266643 1212090 980899 1028015 1278703 882603
16473H82603q0870M50149m06160M63686p7302j11801k72225L65468j60960L50403
$$ 882603 801733 1251882 845722 1309408 1232106 1120305 848080 1213548 1052588 1402991
16463A402991j20512m92347K99871L9876j11144j46356o7607j49139J88224j58911
$$ 1402991 1282479 790132 1090003 1129879 1018735 872379 804772 655633 843857 684946
16453F84946K61306n036j75601J45790k71642K55083j28094K61364k34686O38878
$$ 684946 946252 941216 765615 911405 639763 894846 766752 1028116 793430 1432308
16443A432308n22636k11477M01328k56995N2174J2352l03496J70130K27226N4682
$$ 1432308 909672 698195 1099523 842528 894702 907054 603558 773688 1000914 1055596
16433A055596m62461J29960K55635D52346K54569J19430n6724J39313m37868L17327
$$ 1055596 593135 723095 978730 452346 706915 826345 769621 908934 471066 788393
16423G88393k11736J03910J37633J48342l74922K04998k99808l4504J02553O8208
$$ 788393 576657 680567 818200 966542 591620 796618 496810 462306 564859 633067
16413F33067J03979L4638j8928J50057m45883J08561k56324P3178j2309M65138
$$ 633067 737046 771684 752756 902813 456930 565491 309167 382345 370036 835174
16403H35174j71680k26411J05739K2573L81435l43835j3642K51341l13186m0384
$$ 835174 663494 437083 542822 565395 946830 602995 589353 840694 527508 487124
16393D87124A73270N39924j69719J67137l39229K78048m7967k83620P3503J66501
$$ 487124 173270 713194 543475 710612 371383 649431 601464 317844 391347 557848
16383E57848J99326k96464J8246K31994k13110J00224m996r3391p86r0544J82151
$$ 557848 757174 460710 478956 710950 497840 598064 593068 499677 498891 408347 590498
16372E90498J277l8846q976j8021B57427M26487p3909j36055J07648j54779J72599
$$ 590498 591775 552929 543953 525932 257427 683914 610005 473950 581598 426819 599418
16361E99418k98550R1731L094J10796j21479L2628J75080O2609j47497E6066L35717
$$ 599418 300868 392599 395693 506489 385010 417638 592718 655327 507830 56066 391783
16350C91783n232l0545K10686j53610K82199k08309A48268J73219K58789k55622
$$ 391783 386551 356006 566692 413082 695281 486972 148268 321487 580276 324654
16340C24654J14223J25282n9911A97505M20189l0975A01857O8137M53454r5198
$$ 324654 438877 564159 504248 197505 617694 586719 101857 169994 623448 528250
16330E28250M111l9057j67749M6063j6943m6124K18241j33027D0257L26170m0082
$$ 528250 532361 493304 325555 371618 354675 308551 526792 393765 40257 366427 326345
16319C26345C3567L05865n5329R6456M4972I5039J65025J08424J15112K1206B32843
$$ 326345 33567 339432 284103 380559 425531 95039 260064 368488 483600 504806 232843
16307D39602A39612L88933j83276K20400B79249A17079c4598C00523j00585L70717
$$ 439602 139612 528545 345269 565669 279249 117079 -34598 300523 199938 570655
16297E70655A39032J22328r5342J87613M8476A48511K19438O7742f281G18849
$$ 570655 139032 261360 166018 353631 402107 148511 367949 435691 -6281 718849
16286A84824N46140k97660p7977E8279J79172J25088M4305m3035A69279J77498
$$ 184824 730964 433304 355327 58279 237451 362539 406844 363809 169279 346777
16276C46777C1619N66225k87622D9867K71693K8692A09198Q6801c539B49261J73379
$$ 346777 31619 597844 310222 49867 321560 350252 109198 195999 -3539 249261 422640
16265D22640j08784j01089J04490K99358C4511N91517A69447P5199j09860A3356
$$ 422640 313856 212767 317257 616615 34511 626028 169447 244646 134786 13356
16254A32060j3312J50141F6668P3920b232D42733B00003a01898C18003m4148j06709
$$ 132060 118748 268889 66668 140588 -2232 442733 200003 -101898 318003 273855 167146
16243A67146q0999R4260K5064L4283j9195j09365J39835A3887L3026O270M00844
$$ 167146 86147 180407 205471 239754 220559 111194 251029 13887 46913 53183 454027
16232D54027k06604I9453J12861J7967I3198L20493r3120j31508a08254E39545
$$ 454027 247423 99453 212314 230281 93198 413691 320571 189063 -108254 539545
16221B42286l0232J69030l8570c0998E11253A46097J08626J1068q7049G1524M10789
$$ 242286 212054 381084 342514 -30998 511253 146097 254723 265791 178742 71524 482313
16210D82313B25781P805g0494B7345J08885K43748A46312g384k07554C36176b8385
$$ 482313 225781 233586 -70494 27345 136230 379978 146312 -7384 -214938 336176 -28385
16198G3529J10392K29220H4012l3820J08067J55914a85890I3754a15717J3600
$$ 73529 183921 413141 84012 50192 158259 314173 -185890 93754 -115717 -102117
16188a02117A9933K43293i7219B55735r4084G4929a22797A09488j1293K7770C6734
$$ -102117 19933 263226 -97219 255735 161651 74929 -122797 109488 98195 125965 36734
16176A69788G650K76645e037F4767k1574h084B07205k6995J9993D1054R0028e7850
$$ 169788 7650 284295 -5037 64767 43193 -8084 207205 180210 200203 41054 131082 -57850
16163C49346I0148L56137p1132G5143B8341J13332i8066I6954a3339A29378R8258
$$ 349346 90148 446285 375153 75143 28341 141673 -98066 96954 -13339 129378 227636
16152B27636H2274a00628C7653J58996n0266C0337b3439l4790A58896A2939J9334
$$ 227636 82274 -100628 37653 196649 146383 30337 -23439 -58229 158896 12939 32273
16141C2273J24455J29841j12246L0075q3958C3888L1558g9345D3205a42850A39825
$$ 32273 156728 286569 174323 204398 120440 33888 65446 -79345 43205 -142850 139825
16129I9592g5275F0699j5249j5255a33238e9604B16971i4020A24093K61437A24187
$$ 99592 -75275 60699 45450 30195 -133238 -59604 216971 -94020 124093 385530 124187
16117a35426A51499l3035D6320N1869d1826O209D8312a29694h560B75426n528
$$ -135426 151499 118464 46320 98189 -41826 -35617 48312 -129694 -8560 275426 269898
16106B69898B6480D143J03503a67641B38110b11276C04702a14564p6696A00908
$$ 269898 26480 4143 107646 -167641 238110 -211276 304702 -114564 -191260 100908
16095g9167h62l32127D5877K6794i5686N588A38120L77144I53a95592G0929J56019
$$ -79167 -862 -332989 45877 72671 -95686 -90098 138120 515264 953 -195592 70929 226948
16083B26948b14617P920I7353L5152A3354K59001d3008G7891H247d74081J48294
$$ 226948 -214617 -206697 97353 132505 13354 272355 -43008 77891 8247 -474081 -325787
16072c25787H3706J22927d5075A70312d92245E3656g0339D7312L67062D7835a7621
$$ -325787 83706 206633 -45075 170312 -492245 53656 -70339 47312 414374 47835 -17621
16060a36134a871F8346a13845C85511d5738A58933g7354E6742J57578I8972J53446
$$ -136134 -1871 68346 -113845 385511 -45738 158933 -77354 56742 214320 98972 252418
16049B52418J47130A50928D3848P4989n0299K35887B3533a37650o7951G7810k1633
$$ 252418 399548 150928 43848 118837 68538 304425 23533 -137650 -205601 77810 56177
16038E6177a17459D6098a8270E0980K5043A6257d1450k886j2103b5536F3654L35031
$$ 56177 -117459 46098 -18270 50980 76023 16257 -41450 -44336 -56439 -25536 63654 398685
16026C98685j90442a65723G3769Q8374l213a38298E8374a41149M5522D8957b2230
$$ 398685 208243 -165723 73769 162143 158930 -138298 58374 -141149 -95627 48957 -22230
16014H6943a0290D2028c1462j19242A56396J12104j01842c50j7336B0230P4073
$$ 86943 -10290 42028 -31462 -150704 156396 268500 166658 -350 -17686 20230 94303
16003I4303M3345a86440A71144Q4298H7127a08009M1928j57694B18233a04684
$$ 94303 137648 -186440 171144 255442 87127 -108009 -66081 -223775 218233 -104684
15992B06458a1486A89617o3545B1290K87387J51855K23593L61011j2150j21386
$$ 206458 -11486 189617 126072 21290 308677 460532 684125 1045136 1032986 911600
15982I11600N1950l00342k87297J68981B28463b1873l5177A89346K5006a0533
$$ 911600 963550 663208 375911 544892 228463 -21873 -57050 189346 214352 -10533
15971C1627L38096a25116F2872q867c22815j05942E6555b730p3104c3988p123
$$ 31627 369723 -125116 62872 54005 -322815 -428757 56555 -2730 -75834 -33988 -41111
15960d1111B91596F5262b82282B24430e6268P765l3773B03170K50861D6974b14077
$$ -41111 291596 65262 -282282 224430 -56268 -48503 -82276 203170 454031 46974 -214077
15948b44936b1216j94625A56465Q727a99697A01369h7389E7034a8769I2571e1064
$$ -244936 -21216 -215841 156465 165192 -199697 101369 -87389 57034 -18769 92571 -51064
15936b054B11087a75245l4348h9761L5933n03330C42615F9121J22599a46323I2869
$$ -2054 211087 -175245 -209593 -89761 -53828 -557158 342615 69121 191720 -146323 92869
15924h6103o3807f4679A78776a130j8420j64748P5435j8175B0534c46408f4899
$$ -86103 -149910 -64679 178776 -1130 -19550 -184298 -108863 -127038 20534 -346408 -64899
15912D4271A9176a62136G1709b32775L9287e0708A27770M9683c7301B47272c42385
$$ 44271 19176 -162136 71709 -232775 -193488 -50708 127770 177453 -37301 247272 -342385
15900g3561A97572b56837B5947j1330g8658D3595J20040K3504a48471I9099a4691
$$ -73561 197572 -256837 25947 14617 -78658 43595 163635 187139 -148471 99099 -14691
15888A85062a34772j9608M342p9240b0566m4726J8813j9012A30106e5757j15209
$$ 185062 -134772 -154380 -150038 -229278 -20566 -65292 -46479 -65491 130106 -55757 -170966
15877a70966B04779n5829B6891K12355d9142B33059c63648k6025c6074M274k9211
$$ -170966 204779 148950 26891 239246 -49142 233059 -363648 -389673 -36074 -31800 -61011
15866f1011A7892J05489A2135J26550B0694b8128B132L99934m0164C309a95284
$$ -61011 17892 123381 12135 138685 20694 -28128 2132 402066 361902 3309 -195284
15854C2158P3119D7029J64624n8180F7515h4062a4124D3247K58553A7180J2082
$$ 32158 105277 47029 211653 153473 67515 -84062 -14124 43247 301800 17180 29262
15843B9262K69645C1661b50982B04238G3990J1268L02516f1159k13394h9600l8936
$$ 29262 298907 31661 -250982 204238 73990 85258 387774 -61159 -274553 -89600 -128536
15832a28536j5997j17731A02208b59447i366k14220A81672F1116G894J25721E8735
$$ -128536 -144533 -262264 102208 -259447 -9366 -223586 181672 61116 7894 133615 58735
15820a2976m37526K02433H9423J40586c57078A79590a42404r9318A48640g2284
$$ -12976 -450502 -248069 89423 230009 -357078 179590 -142404 -241722 148640 -72284
15809A6204N1140N6409d37906e0742k50175d0833j22422A9909J36199a2214A39652
$$ 16204 67344 123753 -437906 -50742 -300917 -40833 -163255 19909 156108 -12214 139652
15797b32523B753J97087L7593j12609a09972G8025b80816C51752b44505A11872
$$ -232523 2753 199840 237433 124824 -109972 78025 -280816 351752 -244505 111872
15786i5057j4078L088A7354f951L018A4370J08014c2187B5170i4299k5201C2099
$$ -95057 -109135 -106047 17354 -6951 -3933 14370 122384 -32187 25170 -94299 -119500 32099
15773D9124Q5780O34M8322p0186O0232o8170b0379K931j09625j78311A75088A4065
$$ 49124 134904 135538 183860 113674 173906 105736 -20379 -17448 -127073 -305384 175088 14065
15760A36993a78747N8610F123Q6099C6290h8319C18284C851a4957j9645j97779
$$ 136993 -178747 -120137 6123 92222 36290 -88319 318284 3851 -14957 -34602 -232381
15749b32381i9713k6979k03423H0021i7610B68589j05295b96236d2802B02696
$$ -232381 -99713 -126692 -330115 80021 -97610 268589 163294 -296236 -42802 202696
15738a7177F4710d67550a38516j15196A16913b59486Q7231D3599O6118b20322
$$ -17177 64710 -467550 -138516 -253712 116913 -259486 -172255 43599 109717 -220322
15727a82389e8263j33217d7480F0860j1359b1364G1968b26760e5711B10388f1993
$$ -182389 -58263 -191480 -47480 60860 49501 -21364 71968 -226760 -55711 210388 -61993
15715b02532p755A58671c31479P3715a3639r9364K3028L7012k99367J05946a04459
$$ -202532 -210287 158671 -331479 -257764 -13639 -113003 -89975 -52963 -352330 -246384 -104459
15703A09911b45499e3507A21927d09036I9108l0360c11306A7452N8534B1851L10079
$$ 109911 -245499 -53507 121927 -409036 99108 68748 -311306 17452 75986 21851 331930
15692C31930D7077J88879o0924F3389j7427M6087G151d8324r0039I9908K726l8065
$$ 331930 47077 235956 175032 63389 45962 92049 7151 -48324 -138363 99908 102634 64569
15680F4569a85513H7690a5512A25166E2722a13850d7110l0299k54280a43577A75192
$$ 64569 -185513 87690 -15512 125166 52722 -113850 -47110 -77409 -331689 -143577 175192
15668d0292a4052m2832H6214K395j6860f3332m6567A73a37720A60501j3644M0752
$$ -40292 -14052 -56884 86214 88609 71749 -63332 -109899 173 -137720 160501 146857 187609
15656A87609b62296B91252A13810B7384L7844b25388i1633E07354D2037a12638
$$ 187609 -262296 291252 113810 27384 65228 -225388 -91633 507354 42037 -112638
15645c7837j37933n2579n0279C81153a06914A12233K07354H3124C4729m105f7451
$$ -37837 -175770 -228349 -278628 381153 -106914 112233 319587 83124 34729 30624 -67451
15633C7455j5347K02670b61755H8029J38771a8891n5649j4695E202J67446b1881
$$ 37455 22108 224778 -261755 88029 226800 -18891 -74540 -89235 5202 172648 -21881
15621a13388C6941b65383A03411E376a85040F3668B3398b11031B32655E9158J01083
$$ -113388 36941 -265383 103411 5376 -185040 63668 23398 -211031 232655 59158 160241
15610A60241B5614g6667a5611j59109j41483D0068e0388F832c34286J40162A943
$$ 160241 25614 -76667 -15611 -174720 -316203 40068 -50388 6832 -334286 -194124 1943
15598c83403D1438f1210q9605P1294H253J68831j4h6471c9558A89829c47720g1078
$$ -383403 41438 -61210 -150815 -79521 8253 177084 177070 -86471 -39558 189829 -347720 -71078
15585D6719n904K57323a69836r0851E537e7765G1243g9453E8651a155p207A59247
$$ 46719 40815 298138 -169836 -260687 5537 -57765 71243 -79453 58651 -1155 -8362 159247
15572G8055J2659J85458b40128e7017k5581j1976p3302J6630G6580a89191B6942
$$ 78055 90714 276172 -240128 -57017 -82598 -94574 -167876 -151246 76580 -189191 26942
15560a34519M11B36100G3243a58259B1725a64105a5302C7495K6060K1020K4985
$$ -134519 -134108 236100 73243 -158259 21725 -164105 -15302 37495 63555 84575 109560
15549A09560d0613L450n8176K7279D8539a96484C6208b19602E1023b6264A97367
$$ 109560 -40613 -37163 -95339 -68060 48539 -196484 36208 -219602 51023 -26264 197367
15537A87153a95011d5204n8759A14440a12124M396E5696c8575h817B33624b07050
$$ 187153 -195011 -45204 -103963 114440 -112124 -107728 55696 -38575 -8817 233624 -207050
15525b99480J37306A28482m9540J09986G2049M4909Q604l4156J54712c3892E8563
$$ -299480 -162174 128482 78942 188928 72049 116958 125562 91406 246118 -33892 58563
15513B15344o3047J609J07501j13315h1283B91026A03876Q8465J60338j49311
$$ 215344 152297 153906 261407 148092 -81283 291026 103876 192341 352679 203368
15503B03368n8069K78231D044K6352K3156M48679D9198Q7581K62256j73249A05516
$$ 203368 145299 423530 4044 30396 53552 502231 49198 136779 399035 225786 105516
15491B04055d0725g730j90952g9056C5202c484j24651H1513k9918a4440o1012
$$ 204055 -40725 -7730 -198682 -79056 35202 -3484 -128135 81513 51595 -14440 -75452
15480g5452C9289J14636a30378p7623B85436K02046K47219l46207K69377k09423
$$ -75452 39289 153925 -130378 -208001 285436 487482 734701 388494 657871 448448
15470D48448j36840O6680J86917f3883H7123a11197b0535C14772K5597c4456a14
$$ 448448 311608 378288 565205 -63883 87123 -111197 -20535 314772 340369 -34456 -114
15458a6998B39087j8947A09783g774A27341J52093c20845d6078l9700j10544J5587
$$ -16998 239087 220140 109783 -7774 127341 279434 -320845 -46078 -85778 -196322 -180735
15447a80735B81729p3832n2336k2226K32052J84009j32212M88336L84018j77211
$$ -180735 281729 207897 155561 133335 365387 549396 417184 905520 1289538 1112327
15437A112327D74391A89560n8918a12909N5055A89339i4128B13701E012J36416
$$ 1112327 474391 189560 130642 -112909 -57854 189339 -94128 213701 5012 141428
15427A41428n4297a3697j27156A73761b5j05677C9438M213d1016A43143a25772
$$ 141428 87131 -13697 -140853 173761 -25 -105702 39438 43651 -41016 143143 -125772
15415F7669c11545A01444b2615j75796j41834a08713m0774p472B66221l0466d4872
$$ 67669 -311545 101444 -22615 -198411 -340245 -108713 -149487 -156959 266221 235755 -44872
15403G349c6399j0029m9316f285l93241E8065J20063C7023a11149K3483I8290
$$ 7349 -36399 -46428 -95744 -6285 -399526 58065 178128 37023 -111149 -87666 98290
15391A74494m8485A9961K94108a39067N2773A97888D8384A3456e0444A7472L6690
$$ 174494 126009 19961 314069 -139067 -86294 197888 48384 13456 -50444 17472 54162
15380E4162a15103B37999K60749f4514I9329B5436k291L8542K52359j32774A5981
$$ 54162 -115103 237999 498748 -64514 99329 25436 23145 61687 314046 181272 15981
15368D04308a63794B51375A18175J70543f0497A1096a7647D54960A81242J94556
$$ 404308 -163794 251375 118175 288718 -60497 11096 -17647 454960 181242 375798
15358C75798l1880j38121G1532J09299k9979c07516f5275I2679i3306j51692B77705
$$ 375798 343918 205797 71532 180831 150852 -307516 -65275 92679 -93306 -244998 277705
15346A89340L818b79015A50462J20674Q475J84324r5609D0786M92841g1453G0908
$$ 189340 193158 -279015 150462 271136 279611 463935 368326 40786 533627 -71453 70908
15334A03814J94030C1792M61196E5579Q1412Q3196b018A27980J2587L2113E0158
$$ 103814 297844 31792 492988 55579 136991 220187 -2018 127980 140567 172680 50158
15322c5402C30716g028j67601C86625A48645a00065d557m2229p7682l3322D108
$$ -35402 330716 -7028 -174629 386625 148645 -100065 -4557 -46786 -124468 -157790 4108
15310I0295a39181c6335k9312G5787a98554B58187k8230a33237A82810a49363
$$ 90295 -139181 -36335 -65647 75787 -198554 258187 229957 -133237 182810 -149363
15299C48109E4825k2471f5980n5444A06394E3013J41795a79419E7648J68909R0979
$$ 348109 54825 32354 -65980 -121424 106394 53013 194808 -179419 57648 226557 317536
15288C17536I3720J47688j643g5416A5852a64957A21180L4350a25183L3740A66528
$$ 317536 93720 241408 239765 -75416 15852 -164957 121180 155530 -125183 -91443 166528
15276B49498b0235G6424K8334J08916Q6690a49048A92687L3532I9311b10393a2805
$$ 249498 -20235 76424 104758 213674 300364 -149048 192687 226219 99311 -210393 -12805
15264g6256A8938b7063C81109f5528A59072g6736j33285E2233C018d78625b34803
$$ -76256 18938 -27063 381109 -65528 159072 -76736 -210021 52233 3018 -478625 -234803
15252B8332J84692F8009a38071L6366A17253B3278i9062C06845E8711L24917P14567
$$ 28332 213024 68009 -138071 -101705 117253 23278 -99062 306845 58711 383628 1098195
15241A098195R32322q26415L29498l72140n54177k44332n7117a5429F667a01722
$$ 1098195 2030517 1204102 1533600 1161460 607283 362951 305834 -15429 6667 -101722
15230C46648E4869P6646K25332a06637j83108a13191A65456f2595k7596A99526
$$ 346648 54869 131515 356847 -106637 -289745 -113191 165456 -62595 -90191 199526
15219A5866b7339k9868E4109a9558C09168H715a04121K9826C5057N24340A37464
$$ 15866 -27339 -57207 54109 -19558 309168 8715 -104121 -74295 35057 559397 137464
15207A74756e1706J0578H4103i764C436d90950E4197a0894j04750j22425A3636
$$ 174756 -51706 -41128 84103 -9764 3436 -490950 54197 -10894 -115644 -238069 13636
15195A20199D5831c9053B85291i5330m3967C0250M09172a31992G2629J61606K5148
$$ 120199 45831 -39053 285291 -95330 -139297 30250 439422 -131992 72629 234235 259383
15184B59383E1342O59825a25813E04663k31408Q9891a12281A4709N0317a12586
$$ 259383 51342 711167 -125813 504663 273255 363146 -112281 14709 65026 -112586
15173c0894G1893A949L3565b2230F7153a60035A52352Q4003N8346h2252F2096
$$ -30894 71893 1949 35514 -22230 67153 -160035 152352 236355 294701 -82252 62096
15161E599L42692p1988a47550F2132a15914A56321I705a75652D2768K02383m7569
$$ 5599 348291 276303 -147550 62132 -115914 156321 9705 -175652 42768 245151 197582
15150A97582D5086Q5481i6479h098C3664b0622j88065A11713O5522A5721J68347
$$ 197582 45086 130567 -96479 -8098 33664 -20622 -208687 111713 177235 15721 184068
15139A84068R7897n4106p7625l0354J10773a78569g194A73422n9524m1802J90868
$$ 184068 281965 227859 150234 119880 230653 -178569 -7194 173422 113898 72096 262964
15128B62964P8768a12139B28365c6442H3977l6219O2J60338E2902K1215M52961
$$ 262964 341732 -112139 228365 -36442 83977 47758 47820 208158 52902 74117 527078
15117E27078K54422k01152B58305n9126a22887I078d8084C5607J57961b76518
$$ 527078 781500 580348 258305 199179 -122887 9078 -48084 35607 193568 -276518
15106C13462g8610G6092C2180D450L56686a92681A50810k4648l9445g1135a6233
$$ 313462 -78610 76092 32180 4450 361136 -192681 150810 126162 86717 -71135 -16233
15094C71045J07346a005B18634G7660R969L5653J37952L4353A15563R5296B4253
$$ 371045 478391 -1005 218634 77660 87629 123282 261234 295587 115563 210859 24253
15082B24750f0187H5384J37086b21297D13637A61632J77019j59794K53047E1088
$$ 224750 -60187 85384 222470 -221297 413637 161632 338651 178857 431904 51088
15071B97667A0876O506J37661a68141B61182J48604J7284K07429g61A69146J57902
$$ 297667 10876 17382 155043 -168141 261182 409786 427070 634499 -761 169146 327048
15060C27048A15164O09498B30886b4151E99799k80377q5557o2703L00991A00691
$$ 327048 115164 724662 230886 -24151 599799 319422 233865 171162 472153 100691
15049B18963r2820J50673M0357N2565j0102g3660B90999d2992E0255O0474J43462
$$ 218963 126143 276816 317173 369738 359636 -73660 290999 -42992 50255 110729 254191
15038B54191q9007k5132J57623J20564l7105q6254K73603j56876N16585l70104
$$ 254191 165184 140052 297675 418239 381134 294880 568483 411607 928192 558088
15028E58088J28624j51130O111n9772j99225k1010o5079L57757l7167B25711j1424
$$ 558088 686712 535582 541693 481921 282696 261686 196607 554364 517197 225711 214287
15017B14287F7621P12782l03817j48752L3096q2208K38840B28521r8101M64273
$$ 214287 67621 780403 476586 327834 360930 278722 517562 228521 130420 594693
15007E94693l370B12889J36127J23498j09080P1588j46341o5615J25810K25443
$$ 594693 591323 212889 349016 472514 363434 435022 288681 223066 348876 574319
14997E74319n330J28927k84576A63902P3659a97126A57957J32932L37148j74975
$$ 574319 568989 697916 413340 163902 237561 -197126 157957 290889 628037 453062
14987D53062Q7847k52092K60046L6278k46038M0643J48913R0341K85457m20079
$$ 453062 540909 288817 548863 585141 339103 379746 528659 619000 904457 484378
14977D84378p3003P9682k39639K41223P7403J12327j09596k84100K61085k48174
$$ 484378 411375 491057 251418 492641 570044 682371 572775 288675 549760 301586
14967C01586J34771J08289k34590J40581o5608A85757n8266l8142L43754j55431
$$ 301586 436357 544646 310056 450637 385029 185757 127491 89349 433103 277672
14957B77672L19020k92871L4042O4475A02883K58748j4126J54780j35448j4770
$$ 277672 596692 303821 337863 402338 102883 361631 347505 502285 366837 352067
14947C52067r3338A02480L22989k9114K2853L61067L28229C18453K27486k71385
$$ 352067 258729 102480 425469 396355 419208 780275 1108504 318453 545939 274554
14937B74554M29797B84319m9637K46048n8809L08998j55705j16159O86242j36595
$$ 274554 704351 284319 234682 480730 421921 730919 575214 459055 1145297 1008702
14927A008702J13668P8760O32324n27787K19536K04285l24897P828j01123M9578
$$ 1008702 1122370 1201130 1833454 1305667 1525203 1729488 1404591 1412419 1311296 1360874
14917A360874K60289L83725R2926j66268k44392n51928Q791K7319l17430k90507
$$ 1360874 1621163 2004888 2097814 1931546 1687154 1135226 1144017 1171336 853906 563399
14907E63399J16363B58470L46955A88703M24231J92101C73581K3940j3830E9988
$$ 563399 679762 258470 605425 188703 612934 805035 373581 397521 383691 59988
14896D63392k25240L46969A70109H3055J50070L50245A58375N02217o0786P5528
$$ 463392 238152 585121 170109 83055 233125 583370 158375 660592 599806 675334
14886F75334j44365j14930K34268J95294j38375N5438j4423k57339M82767J20991
$$ 675334 530969 416039 650307 845601 707226 762664 748241 490902 973669 1094660
14876A094660l15991j47558p6239r2284j55167r3848C2182O6875K79416N29114
$$ 1094660 778669 631111 554872 462588 307421 213573 32182 99057 378473 907587
14866I07587l47076L9087M3767j48784K12902k47811n2671K37579B64108K7877
$$ 907587 560511 599598 643365 494581 707483 459672 407001 644580 264108 291985
14856B91985J73494l3889J16663H3742K66827K26042k09997J77367j04894m4848
$$ 291985 465479 431590 548253 83742 350569 576611 366614 543981 439087 394239
14846C94239L75856C70401J10442K95965K4122J30597K9381j92785J79361j42302
$$ 394239 770095 370401 480843 776808 800930 931527 960908 768123 947484 805182
14836H05182j64746j07536J85865j89674K28133l77193n7532M01778j14379j28961
$$ 805182 640436 532900 718765 529091 757224 380031 322499 724277 609898 480937
14826D80937j10063L93610l56349L20828Q9760l69290m9346L54520C45946K39367
$$ 480937 370874 764484 408135 728963 818723 449433 400087 754607 345946 585313
14816E85313K62684C10349K80002j03386K75808k63549R4814K07703k87285O43183
$$ 585313 847997 310349 590351 486965 762773 499224 594038 801741 514456 1157639
14806A157639D83471K05689Q0431J01283J42584m20127k9820M3975K1036k85194
$$ 1157639 483471 689160 769591 870874 1013458 593331 563511 607486 628522 343328
14796C43328K01713n8848j24756L84081k83156j2520m7325O38213n01594O3580
$$ 343328 545041 486193 361437 745518 462362 449842 402517 1040730 539136 602716
14786F02716j18851K66898k32359J94754l08405K63895R376L04885k84975L13617
$$ 602716 483865 750763 518404 713158 404753 668648 678024 982909 697934 1011551
14776A011551k52158o436O4220j30838l1269K10066j83533j82796J54995j34593
$$ 1011551 759393 752957 817177 686339 655070 865136 681603 498807 653802 519209
14766E19209Q1176n9330j94648J58689J71123B20805K81702L11172C81415n1547
$$ 519209 600385 541055 346407 505096 676219 220805 502507 813679 381415 329868
14756C29868M52806j03431K8434j07878J28005j93017J07535k00664K72K54556
$$ 329868 782674 679243 707677 599799 727804 534787 642322 441658 441930 696486
14746F96486r3353k7043k72647N39472k42940J43113J10117l31290K03814P423
$$ 696486 603133 576090 303443 842915 599975 743088 853205 521915 725729 733152
14736G33152J02757r6712R5952k29848K62682J93337N0557n7907L54634o5564
$$ 733152 835909 739197 835149 605301 867983 1061320 1111877 1053970 1408604 1343040
14726A343040M38008J0577m33601K41972m32701J18786j25266l24348l3564l6338
$$ 1343040 1781048 1791625 1358024 1599996 1167295 1286081 1160815 836467 802903 766565
14716G66565j30172K52115m7814k93078j26046N74560o8791D32027M58500j39845
$$ 766565 636393 888508 840694 547616 421570 996130 927339 432027 890527 750682
14706G50682K73540J95131k89237N614O7571L20099L30355M022l13011R7909l31368
$$ 750682 1024222 1219353 930116 935730 1003301 1323400 1653755 1657777 1344766 1442675 1111307
14695A111307R5253j23107n8435k40513L992J54239C92504O60994k16659K48045
$$ 1111307 1206560 1083453 1025018 784505 788497 942736 392504 1053498 836839 1084884
14685A084884k08362K73047m46947K90146m6314M8273J42523m95197J80529L40336
$$ 1084884 876522 1149569 702622 992768 946454 994727 1137250 642053 822582 1162918
14675A162918m97307M14018k93438K93137r2681L1761j42560k7313L22499l47191
$$ 1162918 665611 1079629 786191 1079328 986647 1018408 875848 848535 1171034 823843
14665H23843J61661j1040j9665K54767j86650J6167k10311j1713K88767o9361
$$ 823843 985504 974464 954799 1209566 1022916 1039083 828772 817059 1105826 1036465
14655A036465m21380K78825k893L51736l02721K21307J68754k82322J20693n2338
$$ 1036465 615085 893910 891017 1242753 940032 1161339 1330093 1047771 1168464 1116126
14645A116126J03096k49413n9350k57013M45035j26920J95714P0592J1004o5903
$$ 1116126 1219222 969809 910459 653446 1098481 971561 1167275 1237867 1248871 1182968
14635A182968R113k50275j17686L42169r1643p7322J48015k6274k7427J65556
$$ 1182968 1192081 941806 824120 1166289 1074646 997324 1145339 1119065 1091638 1257194
14625A257194N4889j61338k04695K46015O3448J0890k15176k3086K71058k0399
$$ 1257194 1312083 1150745 946050 1192065 1255513 1266403 1051227 1028141 1299199 1278800
14615A278800q7538q53J08092M6891J96673l76632Q3094J85008R6799l63106J99128
$$ 1278800 1191262 1190409 1298501 1345392 1542065 1165433 1248527 1433535 1530334 1167228 1366356
14604A366356j05294R8754j48265O1057J72084K26907l40635Q39l744K62478j65381
$$ 1366356 1261062 1359816 1211551 1272608 1444692 1671599 1330964 1331803 1328059 1590537 1425156
14593A425156o2080L41914j28383L92189m69059K19501M3902q1830j62470J30508
$$ 1425156 1363076 1704990 1576607 1968796 1499737 1719238 1763140 1681310 1518840 1649348
14583A649348j9023J27760l05737K72838j75347K02526k13766j9423O8678J99874
$$ 1649348 1630325 1758085 1452348 1725186 1549839 1752365 1538599 1519176 1587854 1787728
14573A787728k15133J30145J62425J82396j68326L31419k35996Q099J87481M6161
$$ 1787728 1572595 1702740 1865165 2047561 1879235 2210654 1974658 1982757 2170238 2216399
14563B216399N0646k28268J93281J02420O2175m9319N6490J86899O6394j24967
$$ 2216399 2267045 2038777 2232058 2334478 2396653 2347334 2403824 2590723 2657117 2532150
14553B532150M20057M06117L23243Q57747J438952L373839Q297810J7026253J4921367
$$ 2532150 2952207 3358324 3681567 4539314 5978266 9352105 17649915 34676168 49597535
14544D9597535B1714553G801262C650401p81900p43983K23209J124966J948686
$$ 49597535 21714553 7801262 3650401 2868501 2124518 2347727 3472693 5421379
14536E421379j781179j412641o20888K04530K00300m09065K48982L1144J42013
$$ 5421379 3640200 2227559 1606671 1811201 2011501 1602436 1851418 1882562 2024575
14527B024575J21181l7083k99662M10617j96126K68857m39426M66919k84502K76264
$$ 2024575 2145756 2108673 1809011 2219628 2023502 2292359 1852933 2319852 2035350 2311614
14517B311614m0495j56469J76001J77345j15702j8830j8710O2184K01850J7110
$$ 2311614 2271119 2114650 2290651 2467996 2352294 2333464 2314754 2376938 2578788 2595898
14507B595898l58582N50569k06434m6094k47663M52284J89904k75486L29546l63314
$$ 2595898 2237316 2787885 2581451 2535357 2287694 2739978 2929882 2654396 2983942 2620628
14497B620628L27652m1017M7496m2894m5137J15726L36640l73634Q7036j61321
$$ 2620628 2948280 2907263 2954759 2911865 2866728 2982454 3319094 2945460 3032496 2871175
14487B871175K77838P406k84682L84986J85104q9962n5800J28499L3680L2791
$$ 2871175 3149013 3156419 2871737 3256723 3441827 3351865 3296065 3424564 3458244 3491035
14477C491035j27629K77761J88584j53662K71097r8149K54651n39650K74917L22902
$$ 3491035 3363406 3641167 3829751 3676089 3947186 3849037 4103688 3564038 3838955 4161857
14467D161857l07804o6145M80011l68559Q5602K19961n918l5095P1257K26681
$$ 4161857 3854053 3787908 4267919 3899360 3984962 4204923 4199005 4163910 4235167 4461848
14457D461848n02379M65223j16485L81331L7228j94754k15346K51403J80080j75326
$$ 4461848 3959469 4424692 4308207 4689538 4726766 4532012 4316666 4568069 4748149 4572823
14447D572823K01969j37966M25297K8489K45044m34723K56192J56704J37984o3869
$$ 4572823 4774792 4636826 5062123 5090612 5335656 4900933 5157125 5313829 5451813 5387944
14437E387944K21696j17498n2299M09732j08417K06912j68396K20733L89020j06130
$$ 5387944 5609640 5492142 5439843 5849575 5741158 5948070 5779674 6000407 6389427 6283297
14427F283297o2709J12193N29449l33665j29333N16012J22917n8396N69614n2415
$$ 6283297 6220588 6332781 6862230 6528565 6399232 6915244 7038161 6979765 7549379 7496964
14417G496964L47467l02177Q4239P2370J48786J57241k98143J17943K07379K06579
$$ 7496964 7844431 7542254 7626493 7698863 7847649 8004890 7706747 7824690 8032069 8238648
14407H238648j5537K40947J62881J94877J65760M65421m595N2342k22173O1832
$$ 8238648 8223111 8464058 8626939 8821816 8987576 9452997 9448402 9500744 9278571 9340403
14397I340403L92700K67113O1416J15908K60477J46564K02110O1123M47181p8642
$$ 9340403 9733103 10000216 10061632 10177540 10438017 10584581 10786691 10847814 11294995 11216353
14387A1216353N42926m6461K96185p8034N38689K66861J75277L40758L64524M2016
$$ 11216353 11759279 11712818 12009003 11930969 12469658 12736519 12911796 13252554 13617078 13659094
14377A3659094p4254L90446K80749J88760O01555j79225M22992N77158l16781
$$ 13659094 13584840 13975286 14256035 14444795 15046350 14867125 15290117 15867275 15550494
14368A5550494J142056J25200K86264J49812Q03699J8831J42781P51017L73445
$$ 15550494 16692550 16817750 17104014 17253826 18057525 18076356 18219137 18970154 19343599
14359A9343599M9788P08787L88123N38020N28536J86290N26680M17461P65627
$$ 19343599 19393387 20102174 20490297 21028317 21556853 21743143 22269823 22687284 23452911
14350B3452911O08035O69779M29366M86408P84290R92255Q18082K96878J156119
$$ 23452911 24060946 24730725 25160091 25646499 26430789 27423044 28241126 28538004 29694123
14341B9694123L90991J002992O87202J212361Q98051Q35028J188167J026939J253091
$$ 29694123 30085114 31088106 31775308 32987669 33885720 34720748 35908915 36935854 38188945
14332C8188945Q69969J464317J123238J387341J132552J514267J641619J177003
$$ 38188945 39058914 40523231 41646469 43033810 44166362 45680629 47322248 48499251
14324D8499251K123252J687105J931604K048169J877649K336018K210465K546327
$$ 48499251 50622503 52309608 54241212 56289381 58167030 60503048 62713513 65259840
14316F5259840K274637K579837K401191L545700K685834L369934L303355L944896
$$ 65259840 67534477 70114314 72515505 76061205 78747039 82116973 85420328 89365224
14308H9365224L757073M494085M267585M572720M755228N356661N878941O122095
$$ 89365224 93122297 97616382 101883967 106456687 111211915 116568576 122447517 128569612
14300A28569612O592166O667300P232527P964397Q506278Q913430R484141R901952
$$ 128569612 135161778 141829078 149061605 157026002 165532280 174445710 183929851 193831803
14292A93831803J0862889J1429533J2027934J3266673J3263880J4434323J4801604
$$ 193831803 204694692 216124225 228152159 241418832 254682712 269117035 283918639
14285B83918639J6067688J6075396J6735500J7266033J7192183J7368706J6808457
$$ 283918639 299986327 316061723 332797223 350063256 367255439 384624145 401432602
14278D01432602J6069608J5354494J3895236J2058304R925783O578020J477841
$$ 401432602 417502210 432856704 446751940 458810244 468736027 475314047 476791888
14271D76791888k658231k048655j901293m977879l745156q219928j1304950j2764533
$$ 476791888 474133657 472085002 470183709 465205830 461460674 453240746 441935796 429171263
14263D29171263j4134116j5917239j7171818j7059136j7536397j7031782j6665257
$$ 429171263 415037147 399119908 381948090 364888954 347352557 330320775 313655518
14256C13655518j6287113j5718398j4702818j4535525j3291069j3192678j2371821
$$ 313655518 297368405 281650007 266947189 252411664 239120595 225927917 213556096
14249B13556096j1351001r509460r294395r763079r283008p751006q004830p371264
$$ 213556096 202205095 192695635 183401240 173638161 164355153 156604147 148599317 141228053
14241A41228053o790615o277917o437893n192962n011880m948648n238838m497361
$$ 141228053 134437438 128159521 121721628 116528666 111516786 106568138 101329300 96831939
14233I6831939m231186l538329l253195l356030m016157k906376l127737k701111
$$ 96831939 92600753 89062424 85809229 82453199 78437042 75530666 72402929 69701818
14225F9701818k595303k444746k543934k239875j991684j621838k017903k052515
$$ 69701818 67106515 64661769 62117835 59877960 57886276 56264438 54246535 52194020
14217E2194020k092815j437208j473680j471118j190079j456653j403153j643488
$$ 52194020 50101205 48663997 47190317 45719199 44529120 43072467 41669314 40025826
14209D0025826r86397j245595m0122j465239j029519j088136j358963o67677o12731
$$ 40025826 39039429 37793834 37753712 36288473 35258954 34170818 32811855 32144178 31531447
14200C1531447n17706j222281m60877j044426p57341m56617q55156m89191r08325
$$ 31531447 31013741 29791460 29330583 28286157 27528816 27072199 26217043 25727852 24819527
14191B4819527l92685q51100o54662p04266j09316p07464m75915m90758j71252
$$ 24819527 24426842 23575742 22921080 22216814 22107498 21400034 20924119 20433361 20262109
14182B0262109m69361p71370j23287o74550j15062m32601m79165L0892j001231
$$ 20262109 19792748 19021378 18898091 18223541 18108479 17675878 17196713 17227605 16226374
14173A6226374j8842j48526l64848j73695n89407k45147l11181j87519K5747m82460
$$ 16226374 16207532 16059006 15694158 15520463 14931056 14685909 14374728 14187209 14212956 13730496
14163A3730496o1473m95823k0377n11553n47704j57813J12977l07385k46738j88350
$$ 13730496 13669023 13173200 13152823 12641270 12093566 11935753 12048730 11741345 11494607 11306257
14153A1306257Q85j93808j04231l65822j95022o2726m40646m8133L46518n04851
$$ 11306257 11307142 11113334 11009103 10643281 10448259 10385533 9944887 9896754 10243272 9738421
14143I738421k88404L52773n52274k34172k42977K01681j95166m5225n24659K0171
$$ 9738421 9450017 9802790 9250516 9016344 8773367 8975048 8779882 8734657 8209998 8230169
14133H230169J94208k76014N2343m78722O4672k34953l38042N30J22252j24731
$$ 8230169 8424377 8148363 8200706 7721984 7786656 7551703 7213661 7214191 7336443 7211712
14123G211712j88993J28941m00537O5978J45636k31419m82503K68085p8628k47989
$$ 7211712 7022719 7151660 6751123 6817101 6962737 6731318 6248815 6516900 6438272 6190283
14113F190283o3458J19592N033r7459l74702K53446P4518k93219r0459K13680
$$ 6190283 6126825 6246417 6251450 6153991 5779289 6032735 6107253 5814034 5723575 5937255
14103E937255m25512k82741m5824K15292m7680j59911r8558k9896M30110n58123
$$ 5937255 5511743 5229002 5183178 5398470 5350790 5190879 5092321 5062425 5492535 4934412
14093D934412j4189o5866j11893J78245l44475L10762m98202K41364J24943m33274
$$ 4934412 4920223 4854357 4742464 4920709 4576234 4886996 4388794 4630158 4755101 4321827
14083D321827M4231Q3361j82878J99756m64445K63824l36346m0293L0748m5504
$$ 4321827 4366058 4449419 4266541 4466297 4001852 4265676 3929330 3889037 3919785 3874281
14073C874281m0984J22869r3035k29464Q4782k95676n2293N98643n20526L33003
$$ 3874281 3833297 3956166 3863131 3633667 3718449 3422773 3370480 3969123 3448597 3781600
14063C781600k52432L61871m09069K15707p0357k76420J51747k12083J35575l51744
$$ 3781600 3529168 3891039 3481970 3697677 3627320 3350900 3502647 3290564 3426139 3074395
14053C074395J56035n0539j26100R2281K56592m67942p0123K66032j71008M53864
$$ 3074395 3230430 3179891 3053791 3146072 3402664 2934722 2864599 3130631 2959623 3413487
14043C413487q27751O4089L73878l46678r4571P9091K32687j79885k94257M06142
$$ 3413487 2585736 2649825 3023703 2677025 2582454 2661545 2894232 2714347 2420090 2826232
14033B826232k19614K30754j09409k569M3252k11917J83236p673n10485K96034
$$ 2826232 2606618 2837372 2727963 2725394 2768646 2556729 2739965 2732292 2221807 2517841
14023B517841m03916K65041P0454j04289p5515L01427k60337k57029j69204J05612
$$ 2517841 2113925 2378966 2449420 2345131 2269616 2571043 2310706 2053677 1884473 1990085
14013A990085M09848k68227o92J29408l04074K93719j26268J12132R3946l92848
$$ 1990085 2399933 2131706 2131014 2260422 1956348 2250067 2123799 2235931 2329877 1937029
14003A937029J7634j1431k91537N15316m51745J96662l35593J5967n6774Q171
$$ 1937029 1954663 1943232 1651695 2167011 1715266 1911928 1576335 1592302 1535528 1543699
13993A543699j09996K01374K27394L82436K34725K051745O811241J5071398K3703771
$$ 1543699 1433703 1635077 1862471 2244907 2479632 4531377 11342618 26414016 50117787
13984E0117787k0886668A3467259n894934k105179j445718q09827J97805n19312
$$ 50117787 29231119 13467259 7572325 5467146 4021428 3211601 3409406 2890094
13976B890094k4718j13154k42021j05108l47106L37695J1548l67402M21895l02119
$$ 2890094 2865376 2752222 2510201 2405093 2057987 2395682 2407230 2039828 2461723 2159604
13966B159604K14873J10532k51633k48430r3035J19584J2470n7878q1174p3505
$$ 2159604 2374477 2485009 2233376 1984946 1891911 2011495 2023965 1966087 1884913 1811408
13956A811408q5416l7806N4899j67577L82608r4290m68517L53298j42334K23929
$$ 1811408 1725992 1688186 1743085 1575508 1958116 1863826 1395309 1748607 1606273 1830202
13946A830202n37550O85249m11486J68441J47557l30736j14407l156l0800o9655
$$ 1830202 1292652 1977901 1566415 1734856 1882413 1551677 1437270 1434114 1403314 1333659
13936A333659J80612N1488n048j42814L18319j27441l34631J10978m7618L26258
$$ 1333659 1514271 1565759 1560711 1417897 1736216 1608775 1274144 1385122 1337504 1663762
13926A663762k28051K08779q8913j18240J4370N9693k94484K97725j56287j50354
$$ 1663762 1435711 1644490 1555577 1437337 1451707 1511400 1216916 1514641 1358354 1208000
13916A208000j47994K55314j92155J92216m5831l3598J70151k46882L80088m85219
$$ 1208000 1060006 1315320 1123165 1315381 1269550 1235952 1406103 1159221 1539309 1054090
13906A054090K91137k25248N0055O9551J29891l78490K69058m23019L38287j92979
$$ 1054090 1345227 1119979 1170034 1239585 1369476 990986 1260044 837025 1175312 982333
13896I82333K73763k5990k39858K92068l4037l41430L45994k83245K15151k13965
$$ 982333 1256096 1230106 990248 1282316 1248279 906849 1252843 969598 1184749 970784
13886I70784j14341M80417m18604J98K93126j91452k500j38653K12393K79711
$$ 970784 856443 1336860 918256 918454 1211580 1020128 1017628 878975 1091368 1371079
13876A371079k79998l05994K81879J83254j57783k06436L31739j669m79175K7395
$$ 1371079 1091081 785087 1066966 1250220 1092437 886001 1217740 1216071 736896 764291
13866G64291K09530m280K90854m30490K27504j88801k098m3824M02780k40199
$$ 764291 973821 969541 1260395 829905 1057409 868608 866510 822686 1225466 985267
13856I85267q0317O7798j99063J50943D14336J58067L35468J68917m80202M46093
$$ 985267 904950 972748 773685 924628 414336 572403 907871 1076788 596586 1042679
13846A042679k57773L11519k67720j84131K67811j05706j56175n554J12928k46763
$$ 1042679 784906 1096425 828705 644574 912385 806679 650504 644950 757878 511115
13836E11115L08938j01560M61375m94366j48056J50255J56968o7869K06396B79330
$$ 511115 820053 718493 1179868 685502 537446 687701 844669 776800 983196 279330
13825G22015J52902j27218q9330K57058j73969p2866L0548J89112l7284l77385
$$ 722015 874917 747699 658369 915427 741458 668592 699140 888252 850968 473583
13815D73583J49210O7497l433M288l639K5902K74079j91749k96610K74770n8177
$$ 473583 622793 690290 686857 691145 687506 713408 987487 795738 499128 773898 715721
13804G15721K00794k68028j28153K20911l45723K20983J87314J95658l98925K29262
$$ 715721 916515 648487 520334 741245 395522 616505 803819 999477 600552 829814
13794H29814k27266K4909m0706j64961J47474O0473k05745L93739j66590N3911
$$ 829814 602548 627457 586751 421790 569264 629737 423992 817731 651141 705052
13784G05052Q12k93017M40800r3120l35927J58285j10653N33701m54338P8345
$$ 705052 705864 412847 853647 760527 424600 582885 472232 1005933 551595 629940
13774F29940n5735j29381M20186q9903B21500J07666K29018K45920l05967J3247
$$ 629940 574205 444824 865010 775107 221500 329166 558184 804104 498137 511384
13764E11384P6449n7151Q8833m8656p0886K61330l45752L26367J89200l57557
$$ 511384 587833 530682 619515 570859 499973 761303 415551 741918 931118 573561
13754E73561k08212J11110r1328M5356P6362M1031J38841r010l08918K58536q8373
$$ 573561 365349 476459 385131 430487 506849 547880 686721 677711 368793 627329 538956
13743E38956A98729J35270e9703F02772l0929B85227L39482j99730K59826j94112
$$ 538956 198729 333999 -59703 602772 571843 285227 624709 424979 684805 490693
13733D90693j03297J48706J20898B20265J49211K376K74566k07862p9333J39160
$$ 490693 387396 536102 657000 220265 369476 371852 646418 438556 359223 498383
13723D98383N7225J75971k01069j79681L84019l29770L28881k62120j72586q9835
$$ 498383 555608 731579 530510 350829 734848 405078 733959 471839 299253 209418
13713B09418L86565B09048J71356P36042D77467j26837L76201C58866O1645L47824
$$ 209418 595983 209048 380404 1116446 477467 350630 726831 358866 420511 768335
13703G68335l66946j30629H4029O11114j29507J18556C40522j0428J4799A56206
$$ 768335 401389 270760 84029 695143 565636 684192 340522 330094 344893 156206
13692D66122M8450Q621j43363K06082j98521j16891K55728A65398K38586j45298
$$ 466122 514572 523193 379830 585912 387391 270500 526228 165398 403984 258686
13682B58686M43318m6396j99003j37665K80068j56363J5088j6076m4016j49779
$$ 258686 702004 655608 456605 318940 599008 442645 457733 441657 397641 247862
13672B47862J44374J99460k49916N7102L34332B07002M09329k85911A43874M30057
$$ 247862 392236 591696 341780 398882 733214 207002 616331 330420 143874 573931
13662E73931p8302k04574J24398K4537K08386k07513p285M1865B14136L69617
$$ 573931 495629 291055 415453 439990 648376 440863 433578 475443 214136 583753
13652E83753A33060K40351j14682J90151J9375k08334L24269B66910A27312L49373
$$ 583753 133060 373411 258729 448880 468255 259921 584190 266910 127312 476685
13642D76685j42806L2994J58733A90871J04409K71592k38016H3776M41202k39313
$$ 476685 333879 366873 525606 190871 295280 566872 328856 83776 524978 285665
13632B85665P817K12735j74048c0990C69723A62733J39301J87419q2694K3069
$$ 285665 293482 506217 332169 -30990 369723 162733 302034 489453 406759 429828
13622D29828j47286L72769I7526a22467I1895L68464j58695A0969P95399A70247
$$ 429828 282542 655311 97526 -122467 91895 460359 301664 10969 806368 170247
13611B12369J09282A40285J75048N3389K3308A67517M5577J5987L07435B18806
$$ 212369 321651 140285 315333 368722 392030 167517 213094 229081 536516 218806
13600A18849a62921D53678j91844r7357M1146P3305K05536k29612P9361A17786
$$ 118849 -162921 453678 261834 164477 205623 278928 484464 254852 334213 117786
13589A86898m7213N39827j31698k11565b54673B70766H4060K42366J00272L0684
$$ 186898 139685 679512 547814 336249 -254673 270766 84060 326426 426698 457382
13579D57382j56630o9648n410N0528k0000L05604B42708G4110B9065J88808R3010
$$ 457382 300752 231104 225694 276222 256222 561826 242708 74110 29065 217873 310883
13568C10883n6199j6227k943L96829b5747G8193K06182P0798a2083B8074L64910
$$ 310883 254684 238457 235514 632343 -25747 78193 284375 355173 -12083 28074 392984
13557C92984q9203p2773K30746A34437J25023J03166c0203E44834A36152Q0086
$$ 392984 303781 231008 461754 134437 259460 362626 -30203 544834 136152 216238
13547B16238J14980j06369H0318L09666J11039A64912q1732m0869M53917l4879
$$ 216238 331218 224849 80318 389984 501023 164912 83180 42311 496228 461349
13537D61349H5916J90302J25879j33348D5394L26082K21037B34092a74485C02624
$$ 461349 85916 276218 402097 268749 45394 371476 592513 234092 -174485 302624
13526d4100A77220b3876k44304C9161L02342J79665B31493N2404J26313e4349
$$ -44100 177220 -23876 -268180 39161 341503 521168 231493 283897 410210 -54349
13515A59184R0289j2412A5233K86417n9971K91829B1586p346J06631K13438G7531
$$ 159184 249473 237061 15233 301650 241679 533508 21586 14240 120871 334309 77531
13503A44433a60815B66838L7816m3005A17794A3616d7544E2044e6358D44100N9831
$$ 144433 -160815 266838 304654 261649 117794 13616 -47544 52044 -56358 444100 503931
13492E03931a47416A65695k5584J07509a55798A88742J7594c3331J3779C69658
$$ 503931 -147416 165695 140111 247620 -155798 188742 206336 -33331 -19552 369658
13481B53189b8002B65838F0361K79095B4962L79577j37035R0758D7077L55005
$$ 253189 -28002 265838 60361 339456 24962 404539 267504 358262 47077 402082
13471D02082a29100B3863P6190J09003C0575M39883m7472c3158C21804H3803L17836
$$ 402082 -129100 23863 100053 209056 30575 470458 422986 -33158 321804 83803 401639
13460D01639p1848a58327g2288A32398K65731j77528K01773A01479R3600L1064
$$ 401639 329791 -158327 -72288 132398 398129 220601 422374 101479 195079 226143
13450B26143K03423k09021l3113E5567J55487r5322a03046A91125a64768C63763
$$ 226143 429566 220545 187432 55567 211054 115732 -103046 191125 -164768 363763
13439B78810q7011J39222m6936J491O4031l1010b33547D18264d3050B94228R5481
$$ 278810 191799 331021 284085 285576 349607 318597 -233547 418264 -43050 294228 389709
13428C89709a13755C00068A39294l5299J0625i0789B73596p861c6035A01969b8094
$$ 389709 -113755 300068 139294 103995 114620 -90789 273596 265735 -36035 101969 -28094
13416A28135K33284f3733B38484j14949E5316K82065r6413l5108M385l4960J5330
$$ 128135 361419 -63733 238484 123535 55316 337381 240968 205860 210245 175285 190615
13405A90615L6741a00698L573A56481Q2030F0120K45527c3106k22462C04485A5772
$$ 190615 227356 -100698 -97125 156481 238511 60120 305647 -33106 -255568 304485 15772
13393F0510b68992H9235K3174J25817d9965C97496j74962H2548b37571e6277r1705
$$ 60510 -268992 89235 112409 238226 -49965 397496 222534 82548 -237571 -56277 -147982
13382a47982I7282k3724B4388K36242G5587K1580O7727M4225K5846L6230K5328
$$ -147982 97282 73558 24388 260630 75587 97167 164894 209119 234965 271195 296523
13371B96523B8631M13850j44264J12010J52225A28668l2387J35824J56875j46519
$$ 296523 28631 442481 298217 410227 562452 128668 96281 232105 388980 242461
13361B42461d9775C65267H7118J91968J09169j72346k654K57277A53953G2881
$$ 242461 -49775 365267 87118 279086 388255 215909 213255 470532 153953 72881
13350g5839b8292B65010K83128j03369E4798J4246a1230C42494j15709J35821
$$ -75839 -28292 265010 548138 444769 54798 69044 -11230 342494 226785 362606
13340C62606K3735o3632R6920r1633q5475J17077Q4822b20660A21980R3171d331
$$ 362606 386341 322709 419629 327996 242521 359598 444420 -220660 121980 215151 -4331
13328B16741k4519n309E0204J58865n3920J48245A45267Q8837L7117J57831q7099
$$ 216741 192222 186913 50204 209069 155149 303394 145267 234104 271221 429052 341953
13317C41953A2147L19754n6280j13792J18521l0748A23239J41458a93865a4806
$$ 341953 12147 331901 275621 161829 280350 249602 123239 264697 -193865 -14806
13306a15151D41012k8624a38552D60658g5657D24662k2667a59616A52881d0346
$$ -115151 441012 412388 -138552 460658 -75657 424662 401995 -159616 152881 -40346
13295d3329C6737h6606G5205f0452C3336M16363a47293c6098D17721c56905C08773
$$ -43329 36737 -86606 75205 -60452 33336 449699 -147293 -36098 417721 -356905 308773
13283e70B48254M1328m8515f877C26869a09703A33874E238a01020k1522A7521
$$ -570 248254 289582 241067 -6877 326869 -109703 133874 5238 -101020 -122542 17521
13271B7386a37985a1589A85605c12065A37094O0820k5129a7612B15996E637J04789
$$ 27386 -137985 -11589 185605 -312065 137094 197914 172785 -17612 215996 5637 110426
13260A10426P3845B9103J70477b7489A0112K06013r3763j5206K50520C0575K65553
$$ 110426 184271 29103 199580 -27489 10112 216125 122362 107156 357676 30575 296128
13249B96128p1119I1366d7885B59591H1232C8052a76244l1492G0997g6529q4772
$$ 296128 225009 91366 -47885 259591 81232 38052 -176244 -207736 70997 -76529 -161301
13238a61301g1472B9059R0641f2626r2594K4378b5315A59282a85003L9188B73266
$$ -161301 -71472 29059 119700 -62626 -155220 -130842 -25315 159282 -185003 -145815 273266
13226B89533a48283C85214e9202n1519B16992a7671A94112n5866h6006H8522j8259
$$ 289533 -148283 385214 -59202 -110721 216992 -17671 194112 138246 -86006 88522 70263
13215G0263K16493o8266j07938J95858b84623o7287A30496J40820A13103N2624
$$ 70263 286756 218490 110552 306410 -284623 -351910 130496 271316 113103 165727
13205A65727a19053B23528b44453p5700F3449b04064A46938g8961A92078a79040
$$ 165727 -119053 223528 -244453 -320153 63449 -204064 146938 -78961 192078 -179040
13194A77653o3319J29945A04738a68264f6418A57142J01094J01199B0235J66828
$$ 177653 114334 244279 104738 -168264 -66418 157142 258236 359435 20235 187063
13184A87063k246b05716N9873E9281R297a57300A74572e1815B10664a33866D56188
$$ 187063 184817 -205716 -145843 59281 68578 -157300 174572 -51815 210664 -133866 456188
13172a89592l3173C47827A9194K69793D9441M1541J6953h2016D4680L6279j1800
$$ -189592 -222765 347827 19194 288987 49441 90982 107935 -82016 44680 80959 69159
13161F9159a93251A24213m4201j6249b0384C31213b5477A17384K47531j61095
$$ 69159 -193251 124213 80012 63763 -20384 331213 -25477 117384 364915 203820
13151B03820D3405A2595a38602J706G4038a87519F2614a02929o5872j45654g9125
$$ 203820 43405 12595 -138602 -136896 74038 -187519 62614 -102929 -168801 -314455 -79125
13139A02021a60263C73369d51748F4086K52157g2205G1466a82487C06264A25090
$$ 102021 -160263 373369 -451748 64086 316243 -72205 71466 -182487 306264 125090
13128A99786A3003a05412C56098I0670f2660C28344b37289B44936L2463c4475
$$ 199786 13003 -105412 356098 90670 -62660 328344 -237289 244936 277399 -34475
13117C5028b45096B88352A28618n7505j7653b058H8319j0983a5877l331I004a9385
$$ 35028 -245096 288352 128618 71113 53460 -2058 88319 77336 -15877 -19208 9004 -19385
13104B75686H9534i9022j44205C25129o7270b53738R9177C2883J6512A8202a73927
$$ 275686 89534 -99022 -243227 325129 257859 -253738 -154561 32883 49395 18202 -173927
13092a35116B73329A19902c845B80432d279k975j87833N4288C08841F8576a1343
$$ -135116 273329 119902 -3845 280432 -4279 -7254 -195087 -140799 308841 68576 -11343
13080B6018O6928a5594A43053L47559b10823b0849j05084A62964L0276a59678
$$ 26018 92946 -15594 143053 490612 -210823 -20849 -125933 162964 193240 -159678
13069B3581J57604k6842b0225B66467F8060b66277D08948D5200g3055j3911I3038
$$ 23581 181185 154343 -20225 266467 68060 -266277 408948 45200 -73055 -86966 93038
13057A605b58467C95076f2671E7842R4521l7011P717a23050B62645j14424a6538
$$ 1605 -258467 395076 -62671 57842 152363 115352 123069 -123050 262645 148221 -16538
13045c01349O4234a03744A09099f983A64340A1299O1186N16521c04445B08210
$$ -301349 -237115 -103744 109099 -6983 164340 11299 72485 589006 -304445 208210
13034H6485c7680B4391f0465A83769m0756e6128A29569o0202p010R987J39050
$$ 86485 -37680 24391 -60465 183769 143013 -56128 129569 69367 62357 72344 211394
13023B11394J62402B3646J26421Q0529q3690c3689C57087b74499B66009p2592
$$ 211394 373796 23646 150067 230596 146906 -33689 357087 -274499 266009 193417
13013A93417B4497f2321G2526a77429i523j08245A38393n5881b23941j15339D6351
$$ 193417 24497 -62321 72526 -177429 -9523 -117768 138393 82512 -223941 -339280 46351
13001A22769e459B4274l23a91917j36015d317B33613j09311l5801R896a83818
$$ 122769 -5459 24274 23951 -191917 -327932 -4317 233613 124302 88501 98397 -183818
12989a54928p7746n2337c7529k16939j27938A04271B4040b22387M8011D05782
$$ -154928 -232674 -285011 -37529 -254468 -382406 104271 24040 -222387 -174376 405782
12978A96165O2481o0375L5087o7525a92963j31471A57608a75728F1802k4067Q4847
$$ 196165 258646 198271 233358 165833 -192963 -324434 157608 -175728 61802 37735 122582
12967A22582A0341J31411b92226a36889B70105D9274O2638c96040D00227a21895
$$ 122582 10341 141752 -292226 -136889 270105 49274 111912 -396040 400227 -121895
12956A77781E8580J05293j4733N6700a74637B38266a70446c0773q3205j80207
$$ 177781 58580 163873 149140 205840 -174637 238266 -170446 -30773 -113978 -294185
12946b94185C68711H2893l2469P0589e2852P197a3582k26235D1907J33474E9502
$$ -294185 368711 82893 50424 121013 -52852 -45655 -13582 -239817 41907 175381 59502
12934a30075A47843g0187B81356h6204k06025A44293a26706B3956J23640J83144
$$ -130075 147843 -70187 281356 -86204 -292229 144293 -126706 23956 147596 330740
12924C30740c17635d7910k98537C13441j43217o7909D4702k0519P6408a07523
$$ 330740 -317635 -47910 -346447 313441 170224 102315 44702 24183 100591 -107523
12913b00732H1617a89081B7280M02704A10907c19278A06769b37533A0912J45899
$$ -200732 81617 -189081 27280 429984 110907 -319278 106769 -237533 10912 156811
12903A56811a44161j76982B6914J23562E8111P3150a075k6992k75721C6377b69133
$$ 156811 -144161 -321143 26914 150476 58111 131261 -1075 -28067 -303788 36377 -269133
12891A85349C8700A4971K63661I725J12984P9387a7038B36154e1831A85638F8633
$$ 185349 38700 14971 278632 9725 122709 202096 -17038 236154 -51831 185638 68633
12879A04668L2828n0256B3236b10079B19342R7381b91337m8920a01666D232a071
$$ 104668 137496 87240 23236 -210079 219342 316723 -291337 -340257 -101666 4232 -1071
12867I7337a31998e4967f912G5176M1552N6892n7919a5768j2342I663c0220a4750
$$ 97337 -131998 -54967 -6912 75176 116728 173620 115701 -15768 -28110 9663 -30220 -14750
12854B06404a27351j15614k1293a457k7365A06419b23907B17902a61316g1112
$$ 206404 -127351 -242965 -264258 -1457 -28822 106419 -223907 217902 -161316 -71112
12843E6421a5271j53066m8293K1562C8967K83256c82764A05481a35503K2304q1059
$$ 56421 -15271 -168337 -216630 -195068 38967 322223 -382764 105481 -135503 -113199 -194258
12832a94258B3168J54480q4055J28191a90901F8436c94416a17457d0653l11049
$$ -194258 23168 177648 93593 221784 -190901 68436 -394416 -117457 -40653 -351702
12822c51702A58672B7597a93857A31577c59443b1451A5195O294J47357A8764O3868
$$ -351702 158672 27597 -193857 131577 -359443 -21451 15195 21489 168846 18764 82632
12811H2632J5023e1628A2478e4105B17528m9820h9464A17527l1479M42575a81896
$$ 82632 97655 -51628 12478 -54105 217528 167708 -89464 117527 86048 528623 -181896
12799b91333A75342n8879a74647P6291D3327Q9235a50603M9106F8983e3578A9518
$$ -291333 175342 116463 -174647 -98356 43327 132562 -150603 -101497 68983 -53578 19518
12787g7182I2060m5923a37306A22467c16436a12017B28526A07964a08334j32115
$$ -77182 92060 46137 -137306 122467 -316436 -112017 228526 107964 -108334 -240449
12777b40449k630c6750C6061a9101B8750O1297e4520p5159q93B6896Q8800J08378
$$ -240449 -243079 -36750 36061 -19101 28750 90047 -54520 -129679 -130572 26896 115696 224074
12765B24074c11133J7115J8418C01489i075A46067a51724B85362a53474D06955
$$ 224074 -311133 -294018 -275600 301489 -9075 146067 -151724 285362 -153474 406955
12754a22957k86401a41982f9935I3378I921d5195A24551B1936c6006B50456b86046
$$ -122957 -409358 -141982 -69935 93378 9921 -45195 124551 21936 -36006 250456 -286046
12742a80689B63410A24787a72738a2279k78194L2268A96257A7974b26799i4769
$$ -180689 263410 124787 -172738 -12279 -290473 -258205 196257 17974 -226799 -94769
12731B6403b31416H8904b84668c3984r8374E982R9810a71074C4642a26377c5656
$$ 26403 -231416 88904 -284668 -33984 -132358 5982 105792 -171074 34642 -126377 -35656
12719A04165J54980F9135e6254D8202J26771n8448M0303N3758r8697a66860d1861
$$ 104165 259145 69135 -56254 48202 174973 116525 156828 210586 111889 -166860 -41861
12707A44255a96217B81978L8286j56496K03276j64392b20187A93081H8304b19451
$$ 144255 -196217 281978 320264 163768 367044 202652 -220187 193081 88304 -219451
12696B81636A038b1685A42882c7599A48680N1012m9596D0884a59924B21605j00832
$$ 281636 1038 -21685 142882 -37599 148680 199692 150096 40884 -159924 221605 120773
12685A20773f8173G3460J88679H9671P0623L69074a1264D1339R973h5209B26554
$$ 120773 -68173 73460 262139 89671 160294 529368 -11264 41339 51312 -85209 226554
12673b42316A01814a36584B0644g175j33560m7370E2906L12442k4479K73561A26548
$$ -242316 101814 -136584 20644 -7175 -140735 -188105 52906 365348 340869 614430 126548
12661a37767L8843A73448J93108j46233J91140E1301J4840K28606D0335d3659
$$ -137767 -98924 173448 366556 220323 411463 51301 66141 294747 40335 -43659
12650i9722A21257j0907g2086B01675f2714A7940i8116A93500a03223M2237B05050
$$ -99722 121257 110350 -72086 201675 -62714 17940 -98116 193500 -103223 -60986 205050
12638a21658k04960b3239p9127B3422a36915B85320b07540C93408j71280P6664
$$ -121658 -326618 -23239 -102366 23422 -136915 285320 -207540 393408 222128 298792
12628B98792A33447J40346Q9435A2251Q8628a77496J6984A74090l5031L8477M3224
$$ 298792 133447 273793 363228 12251 100879 -177496 -160512 174090 139059 177536 220760
12617B20760a101B25034b71397F8121R2425a37981o2816c4674A23392L40093G8769
$$ 220760 -1101 225034 -271397 68121 160546 -137981 -200797 -34674 123392 463485 78769
12605b16743D4410c8924C7522C87i04B03402J52012a80398A4398N10045e5646
$$ -216743 44410 -38924 37522 387 -904 203402 355414 -180398 14398 524443 -55646
12593a70673q6009a13645A08043l449f6488J5005J7502A17156a49839A36452P9333
$$ -170673 -256682 -113645 108043 104594 -66488 -51483 -33981 117156 -149839 136452 215785
12582B15785b87911J38369a7676q9500G849g8557a5770A81065J35119J8232j33744
$$ 215785 -287911 -149542 -17676 -107176 7849 -78557 -15770 181065 316184 334416 200672
12571B00672o7430b51005I8867a65576A07429d0571E6073R4202b015k9245j33308
$$ 200672 133242 -251005 98867 -165576 107429 -40571 56073 150275 -2015 -31260 -164568
12560a64568A58423a69681L1551H6565a80121l5166h5303k4356A11214c07151
$$ -164568 158423 -169681 -138130 86565 -180121 -215287 -85303 -109659 111214 -307151
12549a9485l6769k14723c7344l0152k0371E8402a38955A97870a0031A23381L2461
$$ -19485 -56254 -270977 -37344 -67496 -87867 58402 -138955 197870 -10031 123381 155842
12538A55842h8941B05880c12523J30364J5740K2416J9666B04289a13231A25969
$$ 155842 -88941 205880 -312523 -182159 -166419 -144003 -124337 204289 -113231 125969
12527A81230D9107k3710c43651a07497j58818O0407b9306A5516b5237B19116D1223
$$ 181230 49107 25397 -343651 -107497 -266315 -205908 -29306 15516 -25237 219116 41223
12515E8728O4055D297i0479K2393K7399B33231l7929b61788G988O282J40511J41121
$$ 58728 122783 4297 -90479 -68086 -40687 233231 195302 -261788 7988 14270 154781 295902
12503B95902g9392A28013J51863h4483j35617m5457A1173Q9350B6705a89297e0664
$$ 295902 -79392 128013 279876 -84483 -220100 -265557 11173 100523 26705 -189297 -50664
12491A39474a42370B00907a42916m43096A48784k181a09598j09085A02353i5295
$$ 139474 -142370 200907 -142916 -586012 148784 146603 -109598 -218683 102353 -95295
12480a33134C8387J78327b19878b2841D17730A06417H574a61713G3771a99279
$$ -133134 38387 216714 -219878 -22841 417730 106417 8574 -161713 73771 -199279
12469e919k61016F2887K71322b47041e1339m5886n7051a1725k26412j19953a22432
$$ -5919 -266935 62887 334209 -247041 -51339 -97225 -154276 -11725 -238137 -358090 -122432
12457c76635D6744A7845K72578j40498k8494n2453a4687A55562a54682A70183
$$ -376635 46744 17845 290423 149925 121431 68978 -14687 155562 -154682 170183
12446b13115J03276B1374R0145a47754B64443A30759E3935e0934j06251J0884
$$ -213115 -109839 21374 111519 -147754 264443 130759 53935 -50934 -157185 -146301
12436a46301d0442j26969A12977h1842E936K14255b53974a23050o063L6139K3528
$$ -146301 -40442 -167411 112977 -81842 5936 220191 -253974 -123050 -129113 -92974 -69446
12425f9446B94286o8489a3005I4725c6178A37950J95157a37209E0323K10868i5102
$$ -69446 294286 225797 -13005 94725 -36178 137950 333107 -137209 50323 261191 -95102
12413A8552N9356B9431a19085L5609a4772q9680C7146g829l4554B02280I9549
$$ 18552 77908 29431 -119085 -83476 -14772 -104452 37146 -7829 -42383 202280 99549
12401d8003A739N8941J78255B3918f7700B09846D781J541J74807b0818A75922
$$ -48003 1739 60680 238935 23918 -67700 209846 4781 6322 181129 -20818 175922
12389a87348A56348L05233d3476J3818B8245J29462c9157n0781j7494E9721k9601
$$ -187348 156348 461581 -43476 -29658 28245 157707 -39157 -89938 -107432 59721 30120
12378C0120a70076E5398k1731o730L68950a1449j0823D4266f0203A6399c1154
$$ 30120 -170076 55398 33667 26937 395887 -11449 -22272 44266 -60203 16399 -31154
12366b8714j16553D2397L3884A4398f7022p0404j5870k5588j16213A99792a6696
$$ -28714 -145267 42397 76281 14398 -67022 -137426 -153296 -178884 -295097 199792 -16696
12354B30865Q5289j29999i0175b3146q9718k33742e6397j27033d9440A18012C8557
$$ 230865 316154 186155 -90175 -23146 -112864 -346606 -56397 -183430 -49440 118012 38557
12342c3970B26590a74971A85822L30812j80437a98121A04922a33625b1009G7261
$$ -33970 226590 -174971 185822 516634 336197 -198121 104922 -133625 -21009 77261
12331A58315c8679A8584K43679e6198E47231k4325c1334A65785i1641C48144j30213
$$ 158315 -38679 18584 262263 -56198 547231 522906 -31334 165785 -91641 348144 217931
12320B17931J49668D5978P5577L4724E0725A5027b77006i0888B46688l307A9254
$$ 217931 367599 45978 121555 156279 50725 15027 -277006 -90888 246688 243381 19254
12308a48402B55368J16155b81425A89696b122C40584a31375o9482G9870K06687
$$ -148402 255368 371523 -281425 189696 -2122 340584 -131375 -200857 79870 286557
12298B86557A6429a90094A50922C0350K8711g9321n2514f5890C22779g2741C18204
$$ 286557 16429 -190094 150922 30350 59061 -79321 -131835 -65890 322779 -72741 318204
12286C43667j28235b5630B23501l0311a54370n9685C21735e8542B38350J16935
$$ 343667 215432 -25630 223501 193190 -154370 -214055 321735 -58542 238350 355285
12276C55285F2618N0522L58422G055O4028K66962g7659A53177K50465b5869B66963
$$ 355285 62618 113140 471562 7055 71083 338045 -77659 153177 403642 -25869 266963
12264g7052D7292O886R4902K8403Q6434Q587G4335J61263A6098P9408B3020M48723
$$ -77052 47292 54178 149080 177483 263917 272504 74335 235598 16098 95506 23020 471743
12252D71743e6099A41713b3783A50654G1451K02637K14161j61801A02174I484
$$ 471743 -56099 141713 -23783 150654 71451 274088 488249 326448 102174 9484
12241C05422d1695B22450m910j1265G4801R6980B7170L64666f6006a3238D27760
$$ 305422 -41695 222450 217540 206275 74801 171781 27170 391836 -66006 -13238 427760
12229b1373A02120K7649b6535B29411F9407a66288B35343p2532o7070J24198a41507
$$ -21373 102120 129769 -26535 229411 69407 -166288 235343 162811 95741 219939 -141507
12217A76068J23423a06015A33392J55631m5699J78422l7453H0545J21905K20659
$$ 176068 299491 -106015 133392 289023 243324 421746 384293 80545 202450 423109
12207D23109b2252D8596b24109A34521a24328B25945J06853p1995A11806f4328
$$ 423109 -22252 48596 -224109 134521 -124328 225945 332798 260803 111806 -64328
12196A61470O63L5878K4916J38924N8707j77367N7285K28858A29852E9247J30740
$$ 161470 162133 198011 222927 361851 420558 243191 300476 529334 129852 59247 189987
12185A89987N4463E3756B088e1413I9626K22054L6144b0474A74958J70305a02480
$$ 189987 244450 53756 2088 -51413 99626 321680 357824 -20474 174958 345263 -102480
12173B94429a93846M8182D01964k0442j84151L0156J77198a83171C76588j43076
$$ 294429 -193846 -145664 401964 381522 197371 227527 404725 -183171 376588 233512
12163B33512k8017J93830j07504K8326A6806K967f1241A26246K68824i2390B69746
$$ 233512 205495 399325 291821 320147 16806 19773 -61241 126246 395070 -92390 269746
12151h0751C77275f0245m3493A82616d12405A5808M2056j3831J35499M4011c8928
$$ -80751 377275 -60245 -103738 182616 -412405 15808 57864 44033 179532 223543 -38928
12139E7627k1872a71788C5154J27347b66922A58019n1302C6216J89813J27158
$$ 57627 35755 -171788 35154 162501 -266922 158019 106717 36216 226029 353187
12129C53187a02228I6408f5085C6641K43497o1535g3075B10560J4590k3661K26030
$$ 353187 -102228 96408 -65085 36641 280138 218603 -73075 210560 225150 201489 427519
12118D27519a15034B31292F8776K19796A8637K01122b3759D8905a91522B35771
$$ 427519 -115034 231292 68776 288572 18637 219759 -23759 48905 -191522 235771
12107A50547J35200b29691O0138f1589A29896R0468k6876n4962F594J12989L27066
$$ 150547 285747 -229691 -169553 -61589 129896 220364 193488 138526 6594 119583 446649
12096D46649A18490j0502C757O4749c9853A7094M00590A6509b4538k8519C26802
$$ 446649 118490 107988 3757 68506 -39853 17094 417684 16509 -24538 -53057 326802
12084D64870a40463C11079A24996l5479N1504R3492A07839L18638a84141A92032
$$ 464870 -140463 311079 124996 89517 141021 234513 107839 426477 -184141 192032
12073A67858J6654N8269j11320j8994K00460C0935K88724H5582K9755J87150j45057
$$ 167858 184512 242781 131461 112467 312927 30935 319659 85582 115337 302487 157430
12062A57430P2967c11565a44027H6018l4071j5644a24207k0007J146e0434B57830
$$ 157430 230397 -311565 -144027 86018 51947 36303 -124207 -144214 -143068 -50434 257830
12050G7640a86544C07013g4596D2892J07715J869b0593D2377b8694G5374a06416
$$ 77640 -186544 307013 -74596 42892 150607 152476 -20593 42377 -28694 75374 -106416
12038A18036J09442G2171i2875A05178K74794E592a54033f3637j37512B3942Q9894
$$ 118036 227478 72171 -92875 105178 379972 5592 -154033 -63637 -201149 23942 113836
12027A13836J88311c49003g7167A019b18555D51768c4027k18966B33385b01991
$$ 113836 302147 -349003 -77167 1019 -218555 451768 -34027 -252993 233385 -201991
12016B42881r5699J82743E3374b42964J07433A63641c7426p4014A03381b5927
$$ 242881 147182 329925 53374 -242964 -135531 163641 -37426 -111440 103381 -25927
12005g6065A87696C9413b49516d1135J3964k02093k61051b0789A89274F1872K85293
$$ -76065 187696 39413 -249516 -41135 -27171 -229264 -490315 -20789 189274 61872 347165
11994C47165F9864i0846l65372A85458e8611A4320L26834b26355k98223a28600
$$ 347165 69864 -90846 -456218 185458 -58611 14320 341154 -226355 -524578 -128600
11983e5597a804G2910e0996C0984a05605j09103C2703P5458g3275A37440B8972
$$ -55597 -1804 72910 -50996 30984 -105605 -214708 32703 108161 -73275 137440 28972
11971A70833p9753l8112J3677c7875A52566J2271b52408H5130a51297k5119B2033
$$ 170833 91080 52968 66645 -37875 152566 164837 -252408 85130 -151297 -176416 22033
11959A47144e6702j04608B61592a87718F5084f404m4415j90850Q9142f5668r5907
$$ 147144 -56702 -161310 261592 -187718 65084 -6404 -50819 -241669 -152527 -65668 -161575
11948a61575K2671l33748E1960i1225I0739j3905O7438C3567a32818B18928g1513
$$ -161575 -138904 -472652 51960 -91225 90739 76834 144272 33567 -132818 218928 -71513
11936a11941B4219C864c8207j1670A7544K71813Q7100d5979a1925j85385l2860
$$ -111941 24219 3864 -38207 -49877 17544 289357 376457 -45979 -11925 -197310 -230170
11925b30170j57040G0694L8482c00744B7867J61756k4432K50515a31187c7372
$$ -230170 -387210 70694 109176 -300744 27867 189623 165191 415706 -131187 -37372
11914a29476A8429M1575d7869j54548Q2964j06277B6636g346j45373P3998K8039
$$ -129476 18429 60004 -47869 -202417 -119453 -225730 26636 -7346 -152719 -78721 -50682
11903e0682A86966n6214b93557A356N4818K79489g4444q4295N7503c8729A86323
$$ -50682 186966 130752 -293557 1356 56174 335663 -74444 -158739 -101236 -38729 186323
11891i5983E881a86288f4973F5752a71295G7862a09388R318H0616d6201D281J91732
$$ -95983 5881 -186288 -64973 65752 -171295 77862 -109388 -100070 80616 -46201 4281 196013
11879A96013C9649R0642k1937J69042q2904a47654a1468A73676c6093J0196l28359
$$ 196013 39649 130291 108354 277396 194492 -147654 -11468 173676 -36093 -25897 -354256
11868c54256C13787c13583A92538b01610m6789e1682A50171E6770g7824R234k3410
$$ -354256 313787 -313583 192538 -201610 -248399 -51682 150171 56770 -77824 -68590 -92000
11857i2000F535J46811c46198A96958c11142A68320a1387A61384a53443b2118
$$ -92000 6535 153346 -346198 196958 -311142 168320 -11387 161384 -153443 -22118
11846f5796l32753I8096l740D0321b6038C87570g8147A16013a23060m1113j30220
$$ -65796 -398549 98096 94356 40321 -26038 387570 -78147 116013 -123060 -164173 -294393
11835b94393a07037B68757a86016d1886j06789o0063J4886O4598A03963h1178
$$ -294393 -107037 268757 -186016 -41886 -148675 -208738 -193852 -129254 103963 -81178
11824a03382j98967N6747A49826o5331c57852i051M322k6548E6270q775k2103
$$ -103382 -302349 -245602 149826 84495 -357852 -9051 -4729 -31277 56270 47495 25392
11813B5392a71207h834D3164a939j82396k9275C1347c20374q8199A16342C4096
$$ 25392 -171207 -8834 43164 -1939 -184335 -213610 31347 -320374 -408573 116342 34096
11801a20030B87943k1262j13102a05294o4764B02752a68423h1239j01952B16823
$$ -120030 287943 266681 153579 -105294 -170058 202752 -168423 -81239 -183191 216823
11790b27811j22803I4396g4258j22102a8280k45846a08138r000a5723A49226F8987
$$ -227811 -350614 94396 -74258 -196360 -18280 -264126 -108138 -117138 -15723 149226 68987
11778c6892j0938o4322k02679A0591a27410m2191f0938r2101C2367J98109j05550
$$ -36892 -47830 -112152 -314831 10591 -127410 -169601 -60938 -153039 32367 230476 124926
11767A24926a74994Q1271B799K6845b55283h442k05232D34656e4205n0787B46127
$$ 124926 -174994 -93723 2799 29644 -255283 -8442 -213674 434656 -54205 -104992 246127
11755B78091A26003b35780M6897i2709A54596E7611k7470d8540A74068J54323
$$ 278091 126003 -235780 -188883 -92709 154596 57611 30141 -48540 174068 328391
11745C28391A44635J54225I6646a86506K3206K6593M0691A38781d9784C48078
$$ 328391 144635 298860 96646 -186506 -163300 -136707 -96016 138781 -49784 348078
11734A28589a25302E0891a49140b4750p3310B8085K11390f5049I9997D5196a54904
$$ 128589 -125302 50891 -149140 -24750 -98060 28085 239475 -65049 99997 45196 -154904
11722A02467e0205I8549a32804E3613b14837A95358C4467L30560g3671B03352
$$ 102467 -50205 98549 -132804 53613 -214837 195358 34467 365027 -73671 203352
11711a40012f7339k06280I8012D8021J97488G5253b64864J26723j01560C3483
$$ -140012 -67339 -273619 98012 48021 245509 75253 -264864 -138141 -239701 33483
11700B42475J3695b30360A39122c1653j85101I4323J79098b70562A64490E6369
$$ 242475 256170 -230360 139122 -31653 -216754 94323 273421 -270562 164490 56369
11689a4638l1194B63378L801e4857j44992l373A31463Q4164P529n6748a09915
$$ -14638 -45832 263378 267179 -54857 -199849 -203222 131463 215627 223156 166408 -109915
11677f4682E6531d2162A91467b84992A85307G89K51007a2829A85944e9341k29444
$$ -64682 56531 -42162 191467 -284992 185307 789 251796 -12829 185944 -59341 -288785
11666b88785K9329E7708a77598A17993O2946d2745l5821A79012G1410A424J18320
$$ -288785 -259456 57708 -177598 117993 180939 -42745 -78566 179012 71410 1424 119744
11655A19744g7307c8383j57159D1132b72993J24697c946j08505B2325J69726g614
$$ 119744 -77307 -38383 -195542 41132 -272993 -148296 -3946 -112451 22325 192051 -7614
11643h5669a8056F9882a74413P9824M823A03774l5271j2338J24003Q7909a1224
$$ -85669 -18056 69882 -174413 -94589 -89766 103774 68503 56165 180168 268077 -11224
11631b328F0348i7506N595J3904B18096a60442j04959A2610N4871e8481J1898
$$ -2328 60348 -97506 -91911 -78007 218096 -160442 -265401 12610 67481 -58481 -46583
11620d6583C25314o0432i5973B68937r7034a7898j7952j49043k6482k09194J91650
$$ -46583 325314 264882 -95973 268937 171903 -17898 -35850 -184893 -211375 -420569 -228919
11609b28919A56968c21312A10030g8973H5005c16365D8456e5652G6295J12079
$$ -228919 156968 -321312 110030 -78973 85005 -316365 48456 -55652 76295 188374
11599A88374a95431B9639c4327q2826A15674b38367B49641J3042a61984J4794
$$ 188374 -195431 29639 -34327 -117153 115674 -238367 249641 262683 -161984 -147190
11589a47190N2724B64661h4863A95177F0895K79062C2554K09579b0126A38852
$$ -147190 -94466 264661 -84863 195177 60895 339957 32554 242133 -20126 138852
11578a55591O9819H028L7777b11595p2030F4591c3136k58561a40822D05712A96684
$$ -155591 -85772 8028 45805 -211595 -283625 64591 -33136 -291697 -140822 405712 196684
11566f9169A4296L3333A331K59975J04154A40430N8336M7746D6293N4847P7542
$$ -69169 14296 47629 1331 261306 365460 140430 198766 246512 46293 101140 178682
11555A78682d5594D8694a1702B05138o9927f1187A16722b62946A32841n4773o300
$$ 178682 -45594 48694 -11702 205138 135211 -61187 116722 -262946 132841 78068 71768
11544G1768j0449a29178l873B83831N725p2013a69527B17105J5941K07200d2372
$$ 71768 61319 -129178 -133051 283831 289556 217543 -169527 217105 233046 440246 -42372
11532B44424a5803j97454A99462K72681e1929C03107C2579J38366n941l7511b18865
$$ 244424 -15803 -213257 199462 472143 -51929 303107 32579 170945 165004 127493 -218865
11520E1442a97706A31299N6183e623k65484A66312P1213A12361m7261J30848o8252
$$ 51442 -197706 131299 187482 -5623 -271107 166312 237525 112361 65100 195948 127696
11509A27696h2312a4646C03872A50096J48360K45224A57881n12n6903j9634K8990
$$ 127696 -82312 -14646 303872 150096 298456 543680 157881 157369 100466 80832 109822
11498A09822B3907J17210B6809K50611r7755J96762C8816g3982b8077A49817a00334
$$ 109822 23907 141117 26809 277420 179665 376427 38816 -73982 -28077 149817 -100334
11486B14288r024F709L24306E9065d4203C27618A30029a52504C72113q4420j31895
$$ 214288 205264 6709 331015 59065 -44203 327618 130029 -152504 372113 287693 155798
11475A55798B1196L20091a2501B25735h391B1177M15247H3636J53772j1207G4771
$$ 155798 21196 341287 -12501 225735 -8391 21177 436424 83636 237408 226201 74771
11463B57927F3427f8571A07450J72976j32931J81122b17902B17713C3609J9340
$$ 257927 63427 -68571 107450 280426 147495 328617 -217902 217713 33609 52949
11453E2949h1082A62255J00878a8152E2165h9286b5099K458G3833K5922p582J99271
$$ 52949 -81082 162255 263133 -18152 52165 -89286 -25099 -22641 73833 99755 92173 291444
11441B91444a87075A35132Q0719I952b55433C04387G059K23203b42256B30666
$$ 291444 -187075 135132 215851 9952 -255433 304387 7059 230262 -242256 230666
11430b89129B55100b27887j14076E0335A1885a83825H3538a30026E0508M1576
$$ -289129 255100 -227887 -341963 50335 11885 -183825 83538 -130026 50508 92084
11420I2084D0140J55680J28099J65051A46935a691j17571C95757A49862g9507
$$ 92084 40140 195820 323919 488970 146935 -1691 -119262 395757 149862 -79507
11409c0475k72420J06205B07090f7094q7286C83978d4135G1780a49365k0493C0273
$$ -30475 -302895 -196690 207090 -67094 -154380 383978 -44135 71780 -149365 -169858 30273
11397b12974C74679B6418c12748B44856i7770l4423A04333g4270r1532k1213n2590
$$ -212974 374679 26418 -312748 244856 -97770 -132193 104333 -74270 -165802 -187015 -239605
11386b39605j6029G8033e204k8868k2930j93645C164P0063I176L46433G858J18368
$$ -239605 -255634 78033 -5204 -34072 -57002 -250647 3164 73227 9176 355609 7858 126226
11374A26226a97621R4841m5116j69538G71b08591d4924A75805e9097A47940p2188
$$ 126226 -197621 -102780 -147896 -317434 771 -208591 -44924 175805 -59097 147940 75752
11363G5752f1405j80375h689H7284N2994c21685k03800J64624a20521i215B33732
$$ 75752 -61405 -241780 -8689 87284 140278 -321685 -525485 -360861 -120521 -9215 233732
11351F0921a50015h091A27056f3688l50363e6497m4523A26871H761K83000C703
$$ 60921 -150015 -8091 127056 -63688 -414051 -56497 -101020 126871 8761 291761 3703
11339b87528f6252B20626a33048F676c19170A08216b80897a6895q6236j5497b4143
$$ -287528 -66252 220626 -133048 6676 -319170 108216 -280897 -16895 -103131 -118628 -24143
11327A10632N9331b01521C3108f085l9210n221A51267k2225E119a26949B169i8723
$$ 110632 169963 -201521 33108 -6085 -45295 -50516 151267 129042 5119 -126949 2169 -98723
11314a66402g3503k17180a9975m3941A44502K50c76389R310a1434j89500A0751
$$ -166402 -73503 -290683 -19975 -63916 144502 144752 -376389 -367079 -11434 -200934 10751
11302D7911a54485j78002J22608P754i4l35907a07795F7085J70504b80794J1505
$$ 47911 -154485 -332487 -209879 -202125 -94 -336001 -107795 67085 237589 -280794 -269289
11291b69289b2392D2373J9184a07977d4291n8236B43873d23370a58846G2724R1571
$$ -269289 -22392 42373 61557 -107977 -44291 -102527 243873 -423370 -158846 72724 164295
11280A64295e440k47053B52588c47864A6507J34636a18292q1206N7103i523D57242
$$ 164295 -5440 -252493 252588 -347864 16507 151143 -118292 -199498 -142395 -9523 457242
11268i7018d3113G3104J63957J50227G0933j6869R1067b20389K201E3796i7851
$$ -97018 -43113 73104 237061 387288 70933 54064 145131 -220389 -218188 53796 -97851
11256b53624q3658i2036B20862H8763b02287A60879J49038A3075a11467j16507
$$ -253624 -337282 -92036 220862 88763 -202287 160879 309917 13075 -111467 -227974
11246b27974c545B32873K9633a03069A72495D5246a25219j30008a14934C285b2730
$$ -227974 -3545 232873 262506 -103069 172495 45246 -125219 -255227 -114934 3285 -22730
11234b43253I5287a31047C52051q9966H3671J1709b08248p2218J27918q1309e5329
$$ -243253 95287 -131047 352051 262085 83671 95380 -208248 -280466 -152548 -233857 -55329
11222a52772A92443D1893P4810a75941B76960n142I3794R4308o0834E9564a2914
$$ -152772 192443 41893 116703 -175941 276960 271818 93794 188102 127268 59564 -12914
11210d9284k28951a15826k45101R980B15845q1878c7490j61864p3710i3993H4456
$$ -49284 -278235 -115826 -360927 -350947 215845 133967 -37490 -199354 -273064 -93993 84456
11198g2502j99156J4951e1541A68468b24866f421m77179B46388a37239k5689E8739
$$ -72502 -271658 -256707 -51541 168468 -224866 -6421 -483600 246388 -137239 -162928 58739
11186a47086E5229k5372K3917k2770K45295a57492I8961k0066A6376a30298l2764
$$ -147086 55229 29857 53774 31004 276299 -157492 98961 78895 16376 -130298 -163062
11175a63062E6151J18397F2475d7408J5131E2143B2034b66880M9868c5037A28867
$$ -163062 56151 174548 62475 -47408 -32277 52143 22034 -266880 -217012 -35037 128867
11163B22842I0972b20335q7178J27947A57160b24578e4635n0850j29296j54821
$$ 222842 90972 -220335 -307513 -179566 157160 -224578 -54635 -105485 -234781 -389602
11153c89602J84715A1282b1673C31824D4160e4712C6643c10143b6086k13736a6268
$$ -389602 -204887 11282 -21673 331824 44160 -54712 36643 -310143 -26086 -239822 -16268
11141d38601B15843c29324b3209j04900r1937A61033f4458B79244h833k6940A7720
$$ -438601 215843 -329324 -23209 -128109 -220046 161033 -64458 279244 -8833 -35773 17720
11129e5359A44560C7800f7731A91397L236a42431M7293G8765N3501F1777a79942
$$ -55359 144560 37800 -67731 191397 194633 -142431 -95138 78765 132266 61777 -179942
11117b69178B09924d7916Q597l4347j85223Q9090k8866A01684a8442A2838J61538
$$ -269178 209924 -47916 -39319 -73666 -258889 -169799 -198665 101684 -18442 12838 174376
11106A74376N8186j10217c013A9894b56857F3954J86542K31184k34990K8256J14600
$$ 174376 232562 122345 -3013 19894 -256857 63954 250496 481680 246690 274946 389546
11095C89546F4283A5877K59120j5184N2341p0909j02732J68371G4691J43569m0520
$$ 389546 64283 15877 274997 259813 312154 241245 138513 306884 74691 218260 177740
11084A77740K09663A88071J80691A73878J00749p498G2432R7481K64089A81501
$$ 177740 387403 188071 368762 173878 274627 267129 72432 169913 434002 181501
11073A8972J87434I3055K5116M7694L64262j22961K03286R338k29744k9421L2156
$$ 18972 206406 93055 118171 165865 530127 407166 610452 619790 390046 360625 392781
11062C92781l0238j65613J58347J54601R4232j03018K31682B36009L86538l5087
$$ 392781 362543 196930 355277 509878 604110 501092 732774 236009 622547 587460
11052E87460l3994J54023m1073k3356r819J39974Q3242j93708J43951j2526J2478
$$ 587460 553466 707489 666416 643060 633241 773215 856457 662749 806700 794174 806652
11041H06652L6209J45024k28837o3742K38118k99930K35480j6471K02325j67974
$$ 806652 842861 987885 759048 695306 933424 633494 868974 852503 1054828 886854
11031H86854K49628l14772L86168n59692O6884O8671K74356O5264j96658k8573
$$ 886854 1136482 821710 1207878 648186 715070 783741 1058097 1123361 926703 898130
11021H98130k97622j6227M35593D04682K68941k47892M14049j94704j18161J68268
$$ 898130 600508 584281 1019874 404682 673623 425731 839780 645076 526915 695183
11011F95183l13221M73734j31465j79669J49130r59j52308l6600q0470K26079
$$ 695183 381962 855696 724231 544562 693692 692733 540425 503825 423355 649434
11001F49434K21688K37621n08162k26549M45915K52787l63936o1250J37413k81636
$$ 649434 871122 1108743 600581 374032 819947 1072734 708798 647548 784961 503325
10991E03325K07321j17981K08544j01792p4730J799J01805Q0108j16691L83748
$$ 503325 710646 592665 801209 699417 624687 626486 728291 808399 691708 1075456
10981A075456j54130l2314J33893J29356L14152J8262K67184m72583N36080K5348
$$ 1075456 921326 889012 1022905 1152261 1466413 1484675 1751859 1279276 1815356 1840704
10971A840704M66898M23190k66M2426J01048J14218l0284j89453j62956l46062
$$ 1840704 2307602 2730792 2730526 2772952 2874000 2988218 2957934 2768481 2605525 2259463
10961B259463p6621n76749P091k24625K47791K8354m19914k14686L71274L64813
$$ 2259463 2182842 1606093 1613184 1388559 1636350 1664704 1244790 1030104 1401378 1766191
10951A766191k4420j21074n61860M8805j46345j68748l35276B00871K43345A33289
$$ 1766191 1741771 1620697 1058837 1107642 961297 792549 457273 200871 444216 133289
10940C95384j84360L0219p1064Q2425q3700K62143m2690a09221j05533F2563b28497
$$ 395384 211024 241243 170179 252604 168904 431047 388357 -109221 -214754 62563 -228497
10928A76350f2973a5115C37697D3044J27728e6463F7885f834B17780J22876a57736
$$ 176350 -62973 -15115 337697 43044 170772 -56463 67885 -6834 217780 340656 -157736
10916I1404i8105l8948A01469j6860c98906Q5442A50283j1183a9205r7790C2830
$$ 91404 -98105 -137053 101469 84609 -398906 -313464 150283 139100 -19205 -116995 32830
10904g5599B98555R691C8939a4246A53780m9430h4257B10125a55222A66675a94064
$$ -75599 298555 308246 38939 -14246 153780 104350 -84257 210125 -155222 166675 -194064
10892e4221E4890C130c58041B05812a08865k70773g436j71514I8329J86023c55285
$$ -54221 54890 3130 -358041 205812 -108865 -379638 -7436 -178950 98329 284352 -355285
10880E1906a36775l7209E3772f6184A00812c07135I7594a0198j58268F723b9615
$$ 51906 -136775 -173984 53772 -66184 100812 -307135 97594 -10198 -168466 6723 -29615
10868a47952c1778A22490a56419A37052a23177k27509B3170M5305f683l19847
$$ -147952 -31778 122490 -156419 137052 -123177 -350686 23170 68475 -6683 -326530
10858c26530a9000J704k84989a39324A10061D8996J20136d2402r2829D2578c4139
$$ -326530 -19000 -17296 -302285 -139324 110061 48996 169132 -42402 -135231 42578 -34139
10846D74954A84960J84148H1612c9837o8498a7751B63568c76213e5146B18193
$$ 474954 184960 369108 81612 -39837 -108335 -17751 263568 -376213 -55146 218193
10835C1664J64858b44370k12890a48887M8602A38239a74021h0273H6554A6335
$$ 31664 196522 -244370 -457260 -148887 -100285 138239 -174021 -80273 86554 16335
10824d39926B49081r0627O7648B3155J58846K4680a10207j68083B1262a06880
$$ -439926 249081 158454 226102 23155 182001 206681 -110207 -278290 21262 -106880
10813a80498j77411e6056J686a1793l2324G2534c3661l32I5375h3051j26839b5636
$$ -180498 -357909 -56056 -54370 -11793 -44117 72534 -33661 -33993 95375 -83051 -209890 -25636
10800c41916b0969l333F0064f1354B94240d1249B54063a64724l9578k39835o622
$$ -341916 -20969 -24302 60064 -61354 294240 -41249 254063 -164724 -204302 -444137 -450759
10789d50759E7650A5902d4680p4582A18592a60293a4569I8021a15911J8457o0983
$$ -450759 57650 15902 -44680 -119262 118592 -160293 -14569 98021 -115911 -97454 -158437
10778a58437d6297n8602j04837J8691C9059j1359b13355B47947a77183A37217
$$ -158437 -46297 -104899 -209736 -191045 39059 27700 -213355 247947 -177183 137217
10767A39925a45810D1330j6025a22077B3966g1671o5378A16245b40757I9658a34674
$$ 139925 -145810 41330 25305 -122077 23966 -71671 -137049 116245 -240757 99658 -134674
10755i3035C95557A97078a03239l20039H7010C1280N3491i7473L1358l7898l5702
$$ -93035 395557 197078 -103239 -423278 87010 31280 84771 -97473 -66115 -104013 -139715
10744a39715N3494Q464j3753A81174p2846h856P31j87070B40708c851B13144h4857
$$ -139715 -86221 -77757 -91510 181174 108328 -8856 -8125 -195195 240708 -3851 213144 -84857
10731H1055c10247G5630h3237k57757g1632E8386i7955C7037i725B33456a95775
$$ 81055 -310247 75630 -83237 -340994 -71632 58386 -97955 37037 -9725 233456 -195775
10719f1900r3914j22655o4353p8187N9108a8202k12899e8408n2157G2409L4825
$$ -61900 -155814 -278469 -342822 -421009 -361901 -18202 -231101 -58408 -110565 72409 107234
10708A07234N9620a59274P4456A71066f1559B07729D9156b50751a16024d9576
$$ 107234 166854 -159274 -84818 171066 -61559 207729 49156 -250751 -116024 -49576
10697b37787d6885p4979p00M173B51872f4605G639a57888k47147a98277D7180
$$ -237787 -46885 -121864 -122564 -118391 251872 -64605 7639 -157888 -405035 -198277 47180
10685b05003B26152k1944a66262A69254c0037k6862j00636K0563j55811P2331
$$ -205003 226152 204208 -166262 169254 -30037 -56899 -157535 -136972 -292783 -220452
10675b20452J08449j58342A96497F462a98095R8769m38706J40753e943j0072k04556
$$ -220452 -112003 -270345 196497 6462 -198095 -99326 -538032 -397279 -5943 -16015 -220571
10664b20571F8629b06568Q8629E8057P2598g2046m9227p629B54756q2638c01943
$$ -220571 68629 -206568 -117939 58057 130655 -72046 -121273 -128902 254756 172118 -301943
10652i9064l5708m8211A21520M1193C3807K06299d1102m09188J45377a48026G6223
$$ -99064 -134772 -182983 121520 162713 33807 240106 -41102 -450290 -304913 -148026 76223
10640H0084e2114r7377C1329a63680a9372j36490C8580J1500a59534A27751E8754
$$ 80084 -52114 -149491 31329 -163680 -19372 -155862 38580 50080 -159534 127751 58754
10628A99785C2337a54557B10192K80867F5414b70410D0837J25593l8626d55709
$$ 199785 32337 -154557 210192 491059 65414 -270410 40837 166430 127804 -455709
10617I8503A8806K37195e9636p9378C6032g8690C02279c3527A82860N6198H6432
$$ 98503 18806 256001 -59636 -139014 36032 -78690 302279 -33527 182860 239058 86432
10605c34750A36390a76975h4486k3027j16732e0721k18445e5447B3829b03736
$$ -334750 136390 -176975 -84486 -107513 -224245 -50721 -269166 -55447 23829 -203736
10594b08543R5933l8114j0747K0379A2141N0933J61593b25573O2146D3373d3677
$$ -208543 -112610 -150724 -161471 -141092 12141 63074 224667 -225573 -163427 43373 -43677
10582a82471l0599P0515H9188C2218a25018A22432j9584k9140e8383k21174b6359
$$ -182471 -213070 -142555 89188 32218 -125018 122432 102848 73708 -58383 -279557 -26359
10570B219b34692e1067B22468a32095A78110b2831A93954a36031B7798c32505
$$ 2219 -234692 -51067 222468 -132095 178110 -22831 193954 -136031 27798 -332505
10559B62826a42948d6798k8144n1938B14008A7648a23273A00059a64571e4253
$$ 262826 -142948 -46798 -74942 -126880 214008 17648 -123273 100059 -164571 -54253
10548a58735n2492A51817g1333k0282H8474a09479j67477C0412J13348K54746
$$ -158735 -211227 151817 -71333 -91615 88474 -109479 -276956 30412 143760 398506
10538C98506a15477L3697A36173O4626F2244a00885J3855k24216L9292Q4494A66515
$$ 398506 -115477 -81780 136173 200799 62244 -100885 -87030 -311246 -271954 -187460 166515
10526a37324d062j15772k89180B32444e03229F0847a68180A61493J6161n9065
$$ -137324 -4062 -119834 -409014 232444 -503229 60847 -168180 161493 177654 118589
10516A18589c12233P9708j79272A43697i1272l7978a9529k9551j98348B29064
$$ 118589 -312233 -232525 -411797 143697 -91272 -129250 -19529 -49080 -247428 229064
10505h3628H3299b90977g0341j702j3124o256E2597J44193e44711a61845o6884
$$ -83628 83299 -290977 -70341 -72043 -85167 -91423 52597 196790 -544711 -161845 -228729
10494b28729N6331f2287A80981b47615i1663B56932b10611p0676B40173q5671
$$ -228729 -172398 -62287 180981 -247615 -91663 256932 -210611 -281287 240173 154502
10484A54502a582H5969a67365D5535a1719r9582C22085j43664K71605J46251B62675
$$ 154502 -1582 85969 -167365 45535 -11719 -111301 322085 178421 450026 596277 262675
10472F04648A62471j2623J14654a31025d0122j55277Q7769j4320l0993i228l2911
$$ 604648 162471 149848 264502 -131025 -40122 -195399 -107630 -121950 -152943 -9228 -42139
10461d2139J3865j91542N275b5332R474j51661p9312Q909d5827B86813b29428
$$ -42139 -28274 -219816 -214541 -25332 -15858 -167519 -246831 -237922 -45827 286813 -229428
10449b63803H2438B3646f5581A93434B7459a59250q6656b8939M118A14284a38573
$$ -263803 82438 23646 -65581 193434 27459 -159250 -245906 -28939 -24821 114284 -138573
10437A35121f655B3368a0248j34103j4342a8898l90397A67638c84595J53661B9938
$$ 135121 -6655 23368 -10248 -144351 -158693 -18898 -409295 167638 -384595 -230934 29938
10425d08145G2170J86283E5017N5893E172J63873A6105Q0466m1673M7102a73267
$$ -408145 72170 258453 55017 110910 5172 169045 16105 96571 54898 102000 -173267
10413B30945M6450h9924K6043m9160j61195D0845J84894b2567k58523A34199n0571
$$ 230945 277395 -89924 -63881 -113041 -274236 40845 225739 -22567 -281090 134199 83628
10402H3628b55689h938l33561h5823o1140A08109a64380A12143O8439d0476H9341
$$ 83628 -255689 -8938 -342499 -85823 -146963 108109 -164380 112143 180582 -40476 89341
10390A51074M705R5998E815a63887A41711O3364B3866L06655H6740B2765J83147
$$ 151074 155779 251777 5815 -163887 141711 205075 23866 330521 86740 22765 205912
10379B05912l8039K11962k2196m5231J66600j87039e8315K8215D1574L63664A55821
$$ 205912 167873 379835 357639 312408 479008 291969 -58315 -30100 41574 405238 155821
10367B95423n8121K09022O8880j56016R7871K27183k64832A93193M36926b3820
$$ 295423 237302 446324 515204 359188 457059 684242 419410 193193 630119 -23820
10356C11799a2994A07960J65346l5060J25189K71448B34578J34033M07515J20423
$$ 311799 -12994 107960 273306 238246 363435 634883 234578 368611 776126 896549
10346H96549m40091j64581J94272A11584M33963A52519J29979P3944J0069j65135
$$ 896549 456458 291877 486149 111584 545547 152519 282498 356442 366511 201376
10336B01376Q2921j18506K2222P9730O3876J3623a6638B31782F4333b1399k75369
$$ 201376 284297 165791 188013 267743 331619 345242 -16638 231782 64333 -21399 -296768
10325b96768B3354J01074m3640N1655i0257E6888K66192A56036N3453a81389C8016
$$ -296768 23354 124428 80788 132443 -90257 56888 323080 156036 209489 -181389 38016
10313a9416A91807l7621f8581M61A16900a1028A83141A791a30327j44628A75045
$$ -19416 191807 154186 -68581 -68120 116900 -11028 183141 1791 -130327 -274955 175045
10301c9542A76854h7066A00269a89201H7805g6453b8227D6812b9594E0374e7971
$$ -39542 176854 -87066 100269 -189201 87805 -76453 -28227 46812 -29594 50374 -57971
10289a82358G5875a6920q4577C3309a58605b8002k65009c5137M851B9816a67655
$$ -182358 75875 -16920 -101497 33309 -158605 -28002 -293011 -35137 -30286 29816 -167655
10277A42518a2733o5241L042L2355A57194i4728B56866a26404k1161B6505e2963
$$ 142518 -12733 -77974 -74932 -42577 157194 -94728 256866 -126404 -147565 26505 -52963
10265e6850n0595A05816c198n1756k55481H0673J17434D3215Q248g145o692D33813
$$ -56850 -107445 105816 -3198 -54954 -310435 80673 198107 43215 51463 -7145 -13837 433813
10252C30153L60133k20129A25412Q1098p5966a42800A24220a33220A07060M5255
$$ 330153 690286 470157 125412 206510 130544 -142800 124220 -133220 107060 152315
10242A52315N4651C1957K9716J02202a77751P6217J2446a9055B50530g2228K5697
$$ 152315 206966 31957 61673 163875 -177751 -101534 -89088 -19055 250530 -72228 -46531
10231d6531m4613C5700a86787b7660N355j31111D7044a44536D9040c1773j54873
$$ -46531 -91144 35700 -186787 -27660 -22305 -153416 47044 -144536 49040 -31773 -186646
10220a86646C4684b18536e8723B2924g1404o6540j11671M2044j83248a87862A5810
$$ -186646 34684 -218536 -58723 22924 -71404 -137944 -249615 -207571 -390819 -187862 15810
10208a59280j48125B38374A11484a18794N3200H6044d59134g0725A21901k1365
$$ -159280 -307405 238374 111484 -118794 -65594 86044 -459134 -70725 121901 100536
10198A00536b12122I9724e4397B6737h5332L0625B72096B605O7633d90203f0569
$$ 100536 -212122 99724 -54397 26737 -85332 -54707 272096 2605 70238 -490203 -60569
10186C5458b52413b0049A42522d4818p9700j86564A93045a35826k10404B21786
$$ 35458 -252413 -20049 142522 -44818 -124518 -311082 193045 -135826 -346230 221786
10175b88066C28978A1310a84755M0641b3619n5052j27277N8928b6072p7873F8570
$$ -288066 328978 11310 -184755 -144114 -23619 -78671 -205948 -147020 -26072 -103945 68570
10163a68167q6431A74002b63226P5911k7453D3216B020a31570E0248A4041O3857
$$ -168167 -254598 174002 -263226 -187315 -214768 43216 2020 -131570 50248 14041 77898
10152G7898d2500r0522c8361Q543j32220C801c05305A13580a79404E6863a7160
$$ 77898 -42500 -133022 -38361 -29818 -162038 3801 -305305 113580 -179404 56863 -17160
10140g1558k54473B35461b30178a09111k73442a79228G2179a46543p3400L7638
$$ -71558 -326031 235461 -230178 -109111 -382553 -179228 72179 -146543 -219943 -182305
10130a82305N324F5331a67391A12792a32385r4551R3232j9275A82717a3986j56386
$$ -182305 -176981 65331 -167391 112792 -132385 -226936 -133704 -152979 182717 -13986 -170372
10119a70372d9971G8909b10486F669a07690C10271G3575k8120g1524I3813f7528
$$ -170372 -49971 78909 -210486 6669 -107690 310271 73575 45455 -71524 93813 -67528
10107b31994A4908M6466a33034J4904M0450H0102a92111j14033P3571p2635q5203
$$ -231994 14908 61374 -133034 -118130 -77680 80102 -192111 -306144 -232573 -305208 -390411
10096c90411A9332a22031A30889d63173K14922h916j4864n2133B04804b94356
$$ -390411 19332 -122031 130889 -463173 -248251 -8916 -23780 -75913 204804 -294356
10085b47999c7147G2285A5092m195J25395j9962b02812A8100N2183a55555A7386
$$ -247999 -37147 72285 15092 10897 136292 116330 -202812 18100 70283 -155555 17386
10073C4958J39529k7166g4734r3599C39834e6522E751b70190K996A66393a89260
$$ 34958 174487 147321 -74734 -168333 339834 -56522 5751 -270190 -267194 166393 -189260
10061A8894d27677J15411d872n0641j57595d7255D6151N0608a6913j52442E3572
$$ 18894 -427677 -312266 -4872 -55513 -213108 -47255 46151 96759 -16913 -169355 53572
10049A83812d39826J71092P3649C7643J38792d2633j96029C9689e1541a9173m87614
$$ 183812 -439826 -268734 -195085 37643 176435 -42633 -238662 39689 -51541 -19173 -506787
10038e06787K36918c9602G0663h7378M2487J5017A28450a46146E4858b3989j56380
$$ -506787 -269869 -39602 70663 -87378 -44891 -29874 128450 -146146 54858 -23989 -180369
10027a80369k3077p0666C2395f7484j6808k13533Q6622C8020a27753A41195b33378
$$ -180369 -203446 -274112 32395 -67484 -84292 -297825 -211203 38020 -127753 141195 -233378
10015A09489A4892b71675g1413j02445f3158l3855H8282j9620h1572l6830A42885
$$ 109489 14892 -271675 -71413 -173858 -63158 -97013 88282 68662 -81572 -118402 142885
10003a52064C40238H8295a1376n4301F4089b0559G8354D235d4353l29654F8375
$$ -152064 340238 88295 -11376 -65677 64089 -20559 78354 4235 -44353 -374007 68375
9991f1084E800c43304M4379a43003j59773l2259e8626b0912A08556a93050l25994
$$ -61084 5800 -343304 -298925 -143003 -302776 -335035 -58626 -20912 108556 -193050 -519044
9980e19044a31845E0257a061A2142J05469g7227A51499b24008B5172J78887d02984
$$ -519044 -131845 50257 -1061 12142 117611 -77227 151499 -224008 25172 204059 -402984
9968c25583G5865b90651h2906k8910m500C74182A48755b84807j32771g8968C6966
$$ -325583 75865 -290651 -82906 -111816 -116316 374182 148755 -284807 -417578 -78968 36966
9956a34110B2299d14575a02329j30590a1519F1722J1420b14888b4088p6460I3654
$$ -134110 22299 -414575 -102329 -232919 -11519 61722 73142 -214888 -24088 -100548 93654
9944A25821n9826a55012B5190K08243a33512M6674C40482b27451H0290a05550
$$ 125821 65995 -155012 25190 233433 -133512 -86838 340482 -227451 80290 -105550
9933c35586D3755Q1297C0300Q1054q279M7091b05297a7213n0699E3477a44015
$$ -335586 43755 125052 30300 111354 103075 150166 -205297 -17213 -67912 53477 -144015
9921G9908a68046A08065e7430j19467D8517b73780b5611I7326h8393F8921e8223
$$ 79908 -168046 108065 -57430 -176897 48517 -273780 -25611 97326 -88393 68921 -58223
9909a97557g494o4983j3733j17342B4531i7904H8699b0700A27359d24548C5117
$$ -197557 -7494 -72477 -86210 -203552 24531 -97904 88699 -20700 127359 -424548 35117
9897B53525c34141f8705A96036A5856b00218q8729G412J23111A8859J10888b37062
$$ 253525 -334141 -68705 196036 15856 -200218 -288947 7412 130523 18859 129747 -237062
9885B37004I8363b6555A51255c78974f2712l7014C72773F2028b19330p9580a38715
$$ 237004 98363 -26555 151255 -378974 -62712 -99726 372773 62028 -219330 -298910 -138715
9873b13018L0095j02608l4636a02842j84129a8041j35189j88412c4906r5660j32592
$$ -213018 -182923 -285531 -320167 -102842 -286971 -18041 -153230 -341642 -34906 -130566 -263158
9862b63158J00750L4536A62869h5725H6439K5393a25653B2133a58080q7200O8010
$$ -263158 -162408 -127872 162869 -85725 86439 111832 -125653 22133 -158080 -245280 -177270
9851a77270l2320A96337h9158k18440g4903m73047C501i7853A21064E9633d9875
$$ -177270 -209590 196337 -89158 -307598 -74903 -547950 3501 -97853 121064 59633 -49875
9839b38969n6450A92167f9425p4989a1152k28310H870a87566A3103g4229j9292
$$ -238969 -295419 192167 -69425 -144414 -11152 -239462 8870 -187566 13103 -74229 -93521
9828i3521J6043l74823F7626h6232q3554A07310a21488D9621b6624r5794d1609
$$ -93521 -77478 -452301 67626 -86232 -169786 107310 -121488 49621 -26624 -122418 -41609
9816e9378E0748j3707R0819b42994A18242b85079f4474F5658M8435J69455a87512
$$ -59378 50748 37041 127860 -242994 118242 -285079 -64474 65658 114093 283548 -187512
9804c91143P6054O4897B7777c57406a62448c9347a1953D3879J09892b28936Q1271
$$ -391143 -315089 -250192 27777 -357406 -162448 -39347 -11953 43879 153771 -228936 -147665
9793a47665k64159J71794C55i1033D6210b37716G3365a64150j11787L6742R5087
$$ -147665 -411824 -240030 355 -91033 46210 -237716 73365 -164150 -275937 -239195 -144108
9782a44108B6791a93242I9766a4876C0352L5815f1454A50520b83823C41773C3270
$$ -144108 26791 -193242 99766 -14876 30352 66167 -61454 150520 -283823 341773 33270
9770E2481g2344m841F5367c8960j61899A37177b8779l51591a88680j76838H0779
$$ 52481 -72344 -77185 65367 -38960 -200859 137177 -28779 -380370 -188680 -365518 80779
9758D1085f7066A35509a15070j7036j94448B63065G9292e7177K7977I8103A5103
$$ 41085 -67066 135509 -115070 -132106 -326554 263065 79292 -57177 -29200 98103 15103
9746G8745P2069d4779d388o3407a988r1747O863B31406f935p2826j62821i2100
$$ 78745 150814 -44779 -4388 -67795 -1988 -93735 -86872 231406 -6935 -79761 -242582 -92100
9733b4048j81756B123c9208l06088H7025b38282c037j04927c3628A67144b60171
$$ -24048 -205804 2123 -39208 -345296 87025 -238282 -3037 -107964 -33628 167144 -260171
9721f8188j39064n6936F8675K2941b37179B97633g1475G358O8258J40837G1508
$$ -68188 -207252 -264188 68675 91616 -237179 297633 -71475 7358 75616 216453 71508
9709a00319G6370b69976C906K2627h4669l4460j74310e2987A57040n4844a44818
$$ -100319 76370 -269976 3906 26533 -84669 -119129 -293439 -52987 157040 102196 -144818
9697f9055l08567a59478j58584N4189f6561A4650e9219m6578k1495B83242A3573
$$ -69055 -377622 -159478 -318062 -263873 -66561 14650 -59219 -105797 -127292 283242 13573
9685b5698C69590g4102c434r3411B13637b16096P635j07639e6122a3203j01129
$$ -25698 369590 -74102 -3434 -96845 213637 -216096 -208461 -316100 -56122 -13203 -114332
9674a14332A32142a62045G734b05651e3018i77D4288a09454k00997a39032j04854
$$ -114332 132142 -162045 7734 -205651 -53018 -977 44288 -109454 -310451 -139032 -243886
9663b43886E7468a40047j8995A60934G5263a46678o386F38L1843b04800D0214
$$ -243886 57468 -140047 -159042 160934 75263 -146678 -153064 638 32481 -204800 40214
9651E1276b40273Q0335A31786n5349b00045f1834A17654N6478n8308f0164A4879
$$ 51276 -240273 -159938 131786 76437 -200045 -61834 117654 174132 115824 -60164 14879
9639B5453R4856A480d5640j14743B85579a52068f1327D1531c49863A3977h1852
$$ 25453 120309 1480 -45640 -160383 285579 -152068 -61327 41531 -349863 13977 -81852
9627A63315a08736K64A17248b33764a11522J7455L4352n76443i7221a2922k73357
$$ 163315 -108736 -108472 117248 -233764 -111522 -94067 -59715 -636158 -97221 -12922 -286279
9616b86279P5567C77680C8428J71150b91521F1574J43477f9593r7686E324L8637
$$ -286279 -210712 377680 38428 209578 -291521 61574 205051 -69593 -167279 5324 43961
9605D3961d918k73501C8508j4716c44223k9496F4347J98911c7804I3191a24496
$$ 43961 -4918 -278419 38508 23792 -344223 -373719 64347 263258 -37804 93191 -124496
9593B356a5832j74813j09789N6967o7309B5277e6811l0743n1206r28I3129J85234
$$ 2356 -15832 -190645 -300434 -243467 -310776 25277 -56811 -87554 -138760 -139688 93129 278363
9581B78363a88077R2705j86526E104N6071M4250D2088d5066j75859k7792A04575
$$ 278363 -188077 -95372 -281898 5104 61175 105425 42088 -45066 -220925 -248717 104575
9569a4736j16517j34670J24774C7925f0449k46786J25215C13259a18773K4117
$$ -14736 -131253 -265923 -141149 37925 -60449 -307235 -182020 313259 -118773 -94656
9559i4656o3340j17222i1801j85861H4333J14098J66959i6516a7154j64084E4873
$$ -94656 -157996 -275218 -91801 -277662 84333 198431 365390 -96516 -17154 -181238 54873
9547B67147D3619J30729b13750i0106m5899j2984J5566j5049f6332b0204k65760
$$ 267147 43619 174348 -213750 -90106 -136005 -148989 -133423 -148472 -66332 -20204 -285964
9536b85964d7138C00678a55152M4270M253A73370a58612d9736a3171j92119O6298
$$ -285964 -47138 300678 -155152 -110882 -106629 173370 -158612 -49736 -13171 -205290 -138992
9525a38992p0141J2350B6158M54515a79709a312G8169b27179A90396a24897A82375
$$ -138992 -209133 -196783 26158 480673 -179709 -1312 78169 -227179 190396 -124897 182375
9513a24115F2850L8730e5951F0414b00441h5782B4811h1855B28451J28941C0989
$$ -124115 62850 101580 -55951 60414 -200441 -85782 24811 -81855 228451 357392 30989
9501i6841j0085j76803C3197O2176k2304a98331o9253C7093b18021f6093l965
$$ -96841 -106926 -283729 33197 95373 73069 -198331 -267584 37093 -218021 -66093 -70058
9490g0058j16423m485K8640b9223B20106h9387F2879d3721B53539a81574N7018
$$ -70058 -186481 -190966 -162326 -29223 220106 -89387 62879 -43721 253539 -181574 -124556
9479a24556m9332j6455B16791a59257B58523f4406A50133a56536B83768a44789
$$ -124556 -173888 -190343 216791 -159257 258523 -64406 150133 -156536 283768 -144789
9468C8007g042m1649j05703k18150H9354D2811g6903j01875A1046a05728m9382
$$ 38007 -7042 -48691 -154394 -372544 89354 42811 -76903 -178778 11046 -105728 -155110
9457a55110b1288j91950A28806n447c8358A06766Q5017a55741b574k43939M7885
$$ -155110 -21288 -213238 128806 123359 -38358 106766 191783 -155741 -2574 -246513 -198628
9446a98628g0608O322j27054E2844J03376b06349N0776N0671M8617j94712j48944
$$ -198628 -70608 -64286 -191340 52844 156220 -206349 -155573 -104902 -56285 -250997 -399941
9435c99941d9330k79347J07152a06349j43957R1109j7550a7662j31715k8437f3440
$$ -399941 -49330 -328677 -221525 -106349 -250306 -159197 -176747 -17662 -149377 -177814 -63440
9423a974A80936a21966n8847H5485d0410k83314J16104e0160j50466J9005C7574
$$ -1974 180936 -121966 -180813 85485 -40410 -323724 -207620 -50160 -200626 -181621 37574
9411a17686e7978K5720A17579J21251a64655e821A35446c15815J9312A65130a85324
$$ -117686 -57978 -32258 117579 238830 -164655 -5821 135446 -315815 -296503 165130 -185324
9399b90731A53980Q5862c1792E7534a10271J5405j34772A2115P9138a11190q0531
$$ -290731 153980 239842 -31792 57534 -110271 -94866 -229638 12115 91253 -111190 -191721
9388a91721R4083A13936g6018J3132A47778M1564a87105O2144b4723k4944j67119
$$ -191721 -97638 113936 -76018 -62886 147778 189342 -187105 -124961 -24723 -49667 -216786
9377b16786n0365N9861r7895J2373A35821J62805A04361a33650k60080B79441
$$ -216786 -267151 -207290 -305185 -292812 135821 298626 104361 -133650 -393730 279441
9366c98432J24787P7164j9559Q9083N3456J7999A080e8766j90275d3235J7113
$$ -398432 -273645 -196481 -216040 -126957 -73501 -55502 1080 -58766 -249041 -43235 -26122
9355b6122l66004E158d2913k08546j01908a36200a7142j64827C46594i9160k12270
$$ -26122 -392126 5158 -42913 -251459 -353367 -136200 -17142 -181969 346594 -99160 -311430
9344c11430J49763N9138b7704n4607L2872l0980p5390C7849f1518A65711g3603
$$ -311430 -161667 -102529 -27704 -82311 -49439 -80419 -155809 37849 -61518 165711 -73603
9332a3458j3385o2137n9479B6628a29500N7415j40969Q7085b963p3382k1884a753
$$ -13458 -26843 -88980 -148459 26628 -129500 -72085 -213054 -125969 -2963 -76345 -98229 -1753
9319B73490f0848m8801R062q643B34765c22407a43980P1326b414j9058j48018
$$ 273490 -60848 -109649 -100587 -109230 234765 -322407 -143980 -72654 -2414 -21472 -169490
9308a69490Q481c1671j51635N7164N4150B525P534b04411A15456a12225k37603
$$ -169490 -161009 -31671 -183306 -126142 -71992 2525 10059 -204411 115456 -112225 -349828
9297c49828e8763A32993K71700b74570C30996d2542D6121a67825J9634A91037
$$ -349828 -58763 132993 404693 -274570 330996 -42542 46121 -167825 -148191 191037
9286d7149j52910I6253i4880k2929j4928M8656H2868f7077K7358j1438E6633a89340
$$ -47149 -200059 96253 -94880 -117809 -132737 -84081 82868 -67077 -39719 -51157 56633 -189340
9273b98153A11986c7842k8574j71936M5653Q9216p1017j45827P0359d5591J0223
$$ -298153 111986 -37842 -66416 -238352 -192699 -103483 -174500 -320327 -249968 -45591 -35368
9262c5368j75507b557j14270A78044a32510d9921p2365l9503B56127A521c3383
$$ -35368 -210875 -2557 -116827 178044 -132510 -49921 -122286 -161789 256127 1521 -33383
9250b13388A7773J80229h1383A34612A2568c8116j58140A13342c02010c6392j01644
$$ -213388 17773 198002 -81383 134612 12568 -38116 -196256 113342 -302010 -36392 -138036
9239a38036a3544l2131C0424a26623A34754b3231j23602j83190f2819j27048f8450
$$ -138036 -13544 -45675 30424 -126623 134754 -23231 -146833 -330023 -62819 -189867 -68450
9227c8204B02294l9505a65588c4930I5325J41967a26089j76296L5016b6764C0387
$$ -38204 202294 162789 -165588 -34930 95325 237292 -126089 -302385 -267369 -26764 30387
9215C73381f3066k6325A53608c90302q4809a87972h2024A39296a9881B76891B9669
$$ 373381 -63066 -89391 153608 -390302 -475111 -187972 -82024 139296 -19881 276891 29669
9203a42428k3561B39391a69952q8238a11422J9774j32555c6518j00245I0279K0380
$$ -142428 -165989 239391 -169952 -258190 -111422 -91648 -224203 -36518 -136763 90279 110659
9192A10659a32836A49172e2149j79346A07701b76254C48491a68597j19427d7854
$$ 110659 -132836 149172 -52149 -231495 107701 -276254 348491 -168597 -288024 -47854
9181a96704Q1181J8224A90612F8503a25864j41036e2301j74017k3561J15304e0924
$$ -196704 -115523 -97299 190612 68503 -125864 -266900 -52301 -226318 -249879 -134575 -50924
9169d4339J803B58770a79830j965k35319A07174a73736j5777A5465D322a03090
$$ -44339 -42536 258770 -179830 -181795 -417114 107174 -173736 -189513 15465 4322 -103090
9157f4047j97738a02663L7840j26369j52459A16159J42562j27103J22059b99772
$$ -64047 -261785 -102663 -64823 -191192 -343651 116159 258721 131618 253677 -299772
9146d37908K15117A5642b47635O0066H3196M099b39750e2174A87419c92931A51436
$$ -437908 -222791 15642 -247635 -187569 83196 87295 -239750 -52174 187419 -392931 151436
9134a13502A26665a50114D6159r242J25335a75487j59476f442A3960O5226A3001
$$ -113502 126665 -150114 46159 36917 162252 -175487 -334963 -6442 13960 79186 13001
9122D6225a37911G2958a55074c4715q837l2344B94013k0911b42805J16755B64509
$$ 46225 -137911 72958 -155074 -34715 -43552 -75896 294013 273102 -242805 -126050 264509
9110c4616j07091b2567o0875k2249P778B44394c34751J09241d1304m0098C4236
$$ -34616 -141707 -22567 -83442 -105691 -97913 244394 -334751 -225510 -41304 -81402 34236
9098B0672c34767d7485J386j25542H2732Q7801C4875a05142F5677b40133D08866
$$ 20672 -334767 -47485 -46099 -171641 82732 170533 34875 -105142 65677 -240133 408866
9086a00254j11796i7723M8347j16762g0024D9712e4431E2740c02412J46638k64441
$$ -100254 -212050 -97723 -49376 -166138 -70024 49712 -54431 52740 -302412 -155774 -420215
9075d20215a00438B9436b12698B6505a5846m66422K12492k40670a11136e2457
$$ -420215 -100438 29436 -212698 26505 -15846 -482268 -269776 -510446 -111136 -52457
9064G0883b03064j61083a38395d6685F887A026K72577I8190b09813H1124a82993
$$ 70883 -203064 -364147 -138395 -46685 6887 1026 273603 98190 -209813 81124 -182993
9052b02928M3756I6449M7313f3998I1951c31797a11648B47560a1240m9148B91084
$$ -202928 -159172 96449 143762 -63998 91951 -331797 -111648 247560 -11240 -60388 291084
9040c22358A43657o8152a97367R3270a9028j47902M5153H7064b41874a03068L3039
$$ -322358 143657 75505 -197367 -104097 -19028 -166930 -121777 87064 -241874 -103068 -70029
9029g0029b3704B31512a30151q4844A10909q731a27423d6600j89953E1069P2523
$$ -70029 -23704 231512 -130151 -214995 110909 102178 -127423 -46600 -236553 51069 123592
9018A23592j1400b4161q0455p8811P43C13781c48307D1806P4593c31861A51956
$$ 123592 112192 -24161 -104616 -183427 -182684 313781 -348307 41806 116399 -331861 151956
9006g5181E9866N4590a64975j2317F7875b00370E5501c5703j68320L5705a3782
$$ -75181 59866 114456 -164975 -177292 67875 -200370 55501 -35703 -204023 -168318 -13782
8994C2974Q6979m1606M2180c82367E4932b83324a0305K701j73057G6172a87225
$$ 32974 119953 78347 120527 -382367 54932 -283324 -10305 -7604 -180661 76172 -187225
8982B18084a4483M38j6895k70831L3859a20087J892A4583a47141c5797j71040
$$ 218084 -14483 -14045 -30940 -301771 -267912 -120087 -118195 14583 -147141 -35797 -206837
8971b06837c1693B56L5627c41879C5774a93758P8552k0635N7066c4434E4587i4332
$$ -206837 -31693 256 35883 -341879 35774 -193758 -115206 -135841 -78775 -34434 54587 -94332
8958c3334m6724j79968H1155i4160q3080D2880K52875a48668p0929A61a83253
$$ -33334 -80058 -260026 81155 -94160 -177240 42880 295755 -148668 -219597 161 -183253
8946b24261J00834A92212B2969c13586k2995C9774b774o11j84396L4943e6541
$$ -224261 -123427 192212 22969 -313586 -336581 39774 -2774 -3385 -187781 -152838 -56541
8934d0248j88612a10096D36979e7597j5643b7010j78980a9275K210E2766J81124
$$ -40248 -228860 -110096 436979 -57597 -73240 -27010 -205990 -19275 -17065 52766 233890
8923B33890H5196N03458J179303L906100Q303687D221047A052265n22020r8116
$$ 233890 85196 588654 1767957 5674057 13977744 4221047 1052265 530245 432129
8914D32129H875d673j85558A14877K2766c34788f4585C44032n8601h0897B28475
$$ 432129 8875 -4673 -190231 114877 137643 -334788 -64585 344032 285431 -80897 228475
8902b38921c4190j10932M367B72836n8916a52740a2133k77006M4303E3377K98986
$$ -238921 -34190 -145122 -140755 272836 213920 -152740 -12133 -289139 -244836 53377 352363
8891C52363a78319A34099f13605E1230J44894a48504K0279A40345E7139a15860
$$ 352363 -178319 134099 -613605 51230 196124 -148504 -128225 140345 57139 -115860
8880a89834f6212k96044A26601f3890A42280a16798n0213M6748H7834A0567Q2662
$$ -189834 -66212 -362256 126601 -63890 142280 -116798 -167011 -120263 87834 10567 93229
8869I3229e1217C8984Q0359D2366a68269A64849b5754p0860j91581L0773B80865
$$ 93229 -51217 38984 119343 42366 -168269 164849 -25754 -96614 -288195 -257422 280865
$$ [...]
##END NTUPLES=NMR SPECTRUM
##END=
