
##TITLE=AC1213_BRAAS12064_5946111_s2P2xJQJUA
##JCAMPDX= 6.0         $$ Bruker NMR JCAMP-DX V2.0
##DATA TYPE= NMR SPECTRUM
##DATA CLASS= NTUPLES
##ORIGIN= BRUKER
##OWNER= Administrator
$$ 1.72 TOPSPIN		Version 2.1
$$ 2012-04-10 21:09:30.687 -0500  Administrator@TOPSPIN
$$ Compression mode = diff/dup
##.OBSERVE FREQUENCY= 400.13188235
##.OBSERVE NUCLEUS= ^1H
##.ACQUISITION MODE= SIMULTANEOUS (DQD)
##.ACQUISITION SCHEME= undefined
##.AVERAGES= 8
##.DIGITISER RES= 22
##SPECTROMETER/DATA SYSTEM= spect
##.PULSE SEQUENCE= zg30
##.SOLVENT NAME= COFFEE_meoh
##.SHIFT REFERENCE= INTERNAL, COFFEE_meoh, 1, 14.98061
##AUDIT TRAIL= $$ (NUMBER, WHEN, WHO, WHERE, PROCESS, VERSION, WHAT)
$$ ##TITLE= Audit trail, TOPSPIN		Version 2.1
$$ ##JCAMPDX= 5.01
$$ ##ORIGIN= Bruker BioSpin GmbH
$$ ##OWNER= Administrator
$$ $$ C:\Bruker\TOPSPIN/data/COFFEE/nmr/AC1213_BRAAS12064_5946111_s2P2xJQJUA/10/pdata/1/auditp.txt
$$ ##AUDIT TRAIL=  $$ (NUMBER, WHEN, WHO, WHERE, PROCESS, VERSION, WHAT)
(   1,<2012-04-10 21:09:23.671 -0500>,<Administrator>,<TOPSPIN>,<go>,<TOPSPIN 2.1>,
      <created by zg
	started at 2012-04-10 21:08:16.703 -0500,
	POWCHK enabled, PULCHK disabled,
       configuration hash MD5:
       1A 1E CE 29 27 FD 77 03 67 4E F0 E3 C4 B2 CB 90
       data hash MD5: 64K
       39 68 37 2A 5E 2B 3F 25 00 CE CE 69 CE 72 37 13>)
(   2,<2012-04-10 21:09:26.265 -0500>,<Administrator>,<TOPSPIN>,<proc1d>,<TOPSPIN 2.1>,
      <Start of raw data processing
       efp LB = 0 FT_mod = 6 PKNL = 1 PHC0 = 0 PHC1 = 0 SI = 32K 
       data hash MD5: 32K
       DE 6E DC 24 0C FE 19 DE 62 9F F4 60 C7 2F 80 50>)
(   3,<2012-04-10 21:09:26.671 -0500>,<Administrator>,<TOPSPIN>,<proc1d>,<TOPSPIN 2.1>,
      <pk PHC0 = 208.6743 PHC1 = 0 
       data hash MD5: 32K
       9E 7B B6 31 72 42 49 D6 8D 4B 80 AF 62 5C 0B 91>)
(   4,<2012-04-10 21:09:27.062 -0500>,<Administrator>,<TOPSPIN>,<proc1d>,<TOPSPIN 2.1>,
      <abs ABSG = 1 
       data hash MD5: 32K
       F7 59 F1 37 A5 70 D8 7F 8F 22 8B 89 F8 49 15 F5>)
(   5,<2012-04-10 21:09:27.093 -0500>,<Administrator>,<TOPSPIN>,<proc1d>,<TOPSPIN 2.1>,
      <abs ABSG = 2 
       data hash MD5: 32K
       A9 ED 3E 75 27 4A C5 3E A5 EF C2 C4 55 84 FA E5>)
(   6,<2012-04-10 21:09:27.125 -0500>,<Administrator>,<TOPSPIN>,<proc1d>,<TOPSPIN 2.1>,
      <abs ABSG = 3 
       data hash MD5: 32K
       F1 4B 03 74 77 0B AB D5 FF EB 54 83 2D 3D AE 61>)
(   7,<2012-04-10 21:09:27.156 -0500>,<Administrator>,<TOPSPIN>,<proc1d>,<TOPSPIN 2.1>,
      <abs ABSG = 4 
       data hash MD5: 32K
       5F 82 3E 9A 6A 81 FD E5 E4 59 EB DD 87 6B 90 FD>)
(   8,<2012-04-10 21:09:27.187 -0500>,<Administrator>,<TOPSPIN>,<proc1d>,<TOPSPIN 2.1>,
      <abs ABSG = 5 
       data hash MD5: 32K
       45 BC 87 29 A3 6E 3A 58 7D A8 EC 15 7C C5 58 D9>)
$$ ##END=
$$ 
$$ $$ hash MD5
$$ $$ 87 23 48 19 E7 CB E9 FA EF C7 6D 4D 42 99 78 01
##$RELAX= 
##$RELAX= 
##$RELAX= 
##$RELAX= 
##$RELAX= 
##$RELAX= 
##$RELAX= 
$$ Bruker specific parameters
$$ --------------------------
$$ [...]
##$TP= (0..7)
150 150 150 150 150 150 150 150
##$TP07= 0
##$TPNAME0= <>
##$TPNAME1= <>
##$TPNAME2= <>
##$TPNAME3= <>
##$TPNAME4= <>
##$TPNAME5= <>
##$TPNAME6= <>
##$TPNAME7= <>
##$TPOAL= (0..7)
0.5 0.5 0.5 0.5 0.5 0.5 0.5 0.5
##$TPOFFS= (0..7)
0 0 0 0 0 0 0 0
##$TUNHIN= 0
##$TUNHOUT= 0
##$TUNXOUT= 0
##$USERA1= <user>
##$USERA2= <user>
##$USERA3= <user>
##$USERA4= <user>
##$USERA5= <user>
##$V9= 5
##$VALIST= <valist>
##$VCLIST= <CCCCCCCCCCCCCCC>
##$VD= 0
##$VDLIST= <DDDDDDDDDDDDDDD>
##$VPLIST= <PPPPPPPPPPPPPPP>
##$VTLIST= <TTTTTTTTTTTTTTT>
##$WBST= 1024
##$WBSW= 4
##$XGAIN= (0..3)
0 0 0 0
##$XL= 0
##$YL= 0
##$YMAX_a= 516897
##$YMIN_a= -650314
##$ZGOPTNS= <>
##$ZL1= 120
##$ZL2= 120
##$ZL3= 120
##$ZL4= 120
##$ABSF1= 14.98061
##$ABSF2= -5.57192
##$ABSG= 5
##$ABSL= 3
##$ALPHA= 0
##$AQORDER= 0
##$ASSFAC= 0
##$ASSFACI= 0
##$ASSFACX= 0
##$ASSWID= 0
##$AUNMP= <proc_prof1d_extract_pilot.lims>
##$AXLEFT= 0
##$AXNAME= <>
##$AXNUC= <1H>
##$AXRIGHT= 0
##$AXTYPE= 0
##$AXUNIT= <>
##$AZFE= 0.1
##$AZFW= 0.1
##$BCFW= 0
##$BC_mod= 0
##$BYTORDP= 0
##$COROFFS= 0
##$CY= 15
##$DATMOD= 1
##$DC= 0
##$DFILT= <>
##$DTYPP= 0
##$F1P= 0
##$F2P= 0
##$FCOR= 0.5
##$FTSIZE= 32768
##$FT_mod= 6
##$GAMMA= 0
##$GB= 0
##$INTBC= 1
##$INTSCL= 1
##$ISEN= 128
##$LB= 0
##$LEV0= 0
##$LPBIN= 0
##$MAXI= 10000
##$MC2= 0
##$MEAN= 0
##$ME_mod= 0
##$MI= 0
##$NCOEF= 0
##$NC_proc= -8
##$NLEV= 6
##$NOISF1= 0
##$NOISF2= 0
##$NSP= 0
##$NTH_PI= 0
##$NZP= 0
##$OFFSET= 14.98061
##$PC= 1
##$PHC0= 208.6743
##$PHC1= 0
##$PH_mod= 1
##$PKNL= yes
##$PPARMOD= 0
##$PPDIAG= 0
##$PPIPTYP= 0
##$PPMPNUM= 2147483647
##$PPRESOL= 1
##$PSCAL= 4
##$PSIGN= 0
##$PYNMP= <proc.py>
##$REVERSE= no
##$SF= 400.13
##$SI= 32768
##$SIGF1= 0
##$SIGF2= 0
##$SINO= 400
##$SIOLD= 32768
##$SPECTYP= <>
##$SREGLST= <1H.CDCl3>
##$SSB= 0
##$STSI= 32768
##$STSR= 0
##$SW_p= 8223.68421052632
##$SYMM= 0
##$S_DEV= 0
##$TDeff= 65536
##$TDoff= 0
##$TI= <>
##$TILT= no
##$TM1= 0
##$TM2= 0
##$TOPLEV= 0
##$USERP1= <user>
##$USERP2= <user>
##$USERP3= <user>
##$USERP4= <user>
##$USERP5= <user>
##$WDW= 1
##$XDIM= 32768
##$YMAX_p= 459678718
##$YMIN_p= -671725
##$CURPLOT= <Network HP LaserJet P1505>
##$CURPRIN= <$Network HP LaserJet P1505>
##$DFORMAT= <normdp>
##$LAYOUT= <+/1D_H.xwp>
##$LFORMAT= <normlp>
##$PFORMAT= <normpl>
##$SURQMSG= 1
$$ End of Bruker specific parameters
$$ ---------------------------------
##NTUPLES= NMR SPECTRUM
##VAR_NAME=  FREQUENCY,     SPECTRUM/REAL,   SPECTRUM/IMAG
##SYMBOL=    X,             R,               I
##VAR_TYPE=  INDEPENDENT,   DEPENDENT,       DEPENDENT
##VAR_FORM=  AFFN,          ASDF,            ASDF
##VAR_DIM=   32768,         32768,           32768
##UNITS=     HZ,            ARBITRARY UNITS, ARBITRARY UNITS
##FACTOR=    0.250966925370066, 1,           1
##FIRST=     8223.43324360095, -137379,      -39736
##LAST=      0,             -71124,          71458
##MIN=       0,             -671725,         0
##MAX=       8223.43324360095, 459678718,    0
$$ Real data points
##PAGE= N=1
##DATA TABLE= (X++(R..R)), XYDATA
$$ [...]
$$ plain form
19446 -313673 -225748 -59309 -35916 -65110 -339854 41650 43333 -166055 -102321 -84700 195907
19434 2118 73349 -422539 -206771 116698 -176879 30349 -148190 218042 -124101 140558
19423 -209925 83264 75053 -262386 -143364 -50005 -210943 210979 29379 113021 56305 157561
19412 157561 -472073 -96005 245230 -15804 -479673 -169613 11257 -64003 13518 100916 69878
19401 69878 8756 -17080 -386680 -181740 -221955 -29001 -357918 158082 -306591 -111428 -286317
19390 -286317 -158232 -347705 -143965 55826 41375 -266819 -177031 -237480 -70493 132414
19379 -70314 129061 136411 -97744 -90648 -445503 -5308 1627 72565 -22358 -65619 5056 42884
19367 42884 117552 23764 -536404 -63808 -74496 -103288 -160289 -115004 -92188 -29031 -323052
$$ packed form
19446c13673Q7925e9309K3393k9194k74744D1650J683a66055O3734J7621A95907
19434B118P1231d22539b06771A16698a76879C0349a48190B18042a24101A40558
19423b09925H3264q211b62386J19022e0005j60938B10979B9379Q3642E6305J01256
19412A57561d72073i6005B45230a5804m63869a69613A1257f4003A3518Q7398l1038
19401F9878H756a7080l69600a81740m0215b9001l28917A58082c06591a11428j74889
19390b86317J28085j89473a43965E5826j4451b66819Q9788o0449g0493A32414
19379g0314A29061P350i7744P096l54855e308A627P0938b2358m3261E056L7828
19367D2884P4668B3764e36404f3808j0688k8792n7001M5285K2816b9031k94021
$$ plain form
19356 -323052 -75045 -240234 -113999 -179815 -118670 -52388 -68289 -275152 -209270 -281995 -299925
19345 -299925 -17335 -201917 57297 -145831 71657 -87873 -180301 151382 128149 -126073 47634
19333 -222024 51963 -64503 126 -306088 -82773 -145708 -380591 9321 199397 -76071 184545
19321 -88778 -200245 -300294 52657 387303 197804 -329100 -109518 -262743 95219 -115542
19310 25373 -226358 256424 196380 -192477 -191632 234835 -275790 -181381 326979 -16512 -212963
19299 -212963 -13162 -174105 99061 -74878 86250 -318179 -181789 -271492 76027 52965 -91947
19287 224861 -80732 42012 -356874 211466 57736 34078 -359563 11816 -150745 -260793
19277 -260793 -247175 -205031 -329038 -299418 -178457 -376792 -82246 10036 310022 160420
$$ packed form
19356c23052g5045j65189a13999o5816O1145e2388j5901k06863O5882p2725j7930
19345b99925a7335j84582E7297a45831G1657h7873r2428A51382k3233a26073D7634
19333b22024E1963f4503A26c06088h2773o2935k34883I321J90076g6071A84545
19321h8778j11467j00049E2657L34646j89499c29100a09518j53225I5219a15542
19310B5373b26358B56424o0044a92477Q45B34835b75790R4409C26979a6512j96451
19299b12963a3162j60943I9061g4878H6250c18179J36390q9703G6027k3062i1947
19287B24861h0732D2012c56874B11466E7736k3658c59563A1816a50745j10048
19277b60793J3618M2144j24007K9620J20961j98335h2246A0036K99986j49602
$$ plain form
19267 160420 -331419 106305 172010 -131095 -400245 -385204 -77988 174039 101651 -85124
19256 136088 132279 -183168 335394 183883 -4487 107700 -196210 -130007 -198806 -114997 112069
19244 24299 -67046 -10577 17094 -77701 -98638 116265 50996 -166761 -137903 147306 141875
19233 141875 15343 -30278 294502 37350 -171092 62023 53786 -9298 91417 -40749 92562
19221 -375564 -48367 -13624 -51931 -305822 80975 110266 52293 25904 -193962 39200 120240
19210 120240 -223722 -420975 -256267 -90054 59805 168536 -69475 -391210 -54432 -189384
19200 -189384 -28058 75316 -48556 -10759 -177158 -121547 56587 83427 -47962 -235472 -70508
19188 6365 -182999 -156649 -5001 -39440 -27278 9834 -224727 56102 -107552 -98055 -21096 -158229
$$ packed form
19267A60420c31419A06305O5705a31095k69150J5041g7988A74039p2388h5124
19256A36088l809a83168C35394j51511d487A07700a96210O6203o8799Q3809A12069
19244B4299f7046a0577A7094g7701k0937A16265E0996a66761K8858A47306n431
19233A41875A5343c0278B94502C7350a71092F2023q237i298I1417d0749I2562
19221c75564d8367a3624l8307k53891H0975K9291E2293B5904a93962C9200Q1040
19210A20240b23722j97253J64708i0054E9805J08731f9475l21735e4432j34952
19200a89384b8058G5316d8556a0759j66399N5611E6587K6840d7962j87510g0508
19188F365a82999K6350e001l4439J2162I834b24727E6102a07552R497b1096j37133
$$ plain form
19176 -158229 -143234 -241026 -146108 123392 225341 212211 45223 71302 -105831 176089 7873
19164 -281075 -105124 -41781 -292230 215781 -297948 228713 166898 -171431 222313 -79407
19153 -352227 -131918 -89045 -17334 -111659 -265482 2424 10033 -70160 180557 -352747 293984
19141 -71351 -267933 263859 -8569 -3776 -230156 34493 -191092 -454000 -173512 -60259 -175492
19130 -175492 -46152 -329401 15450 -84871 -961 -266554 -212463 -269275 -32067 105595 -70933
19118 115319 -563912 54556 -279218 -76651 -3653 -179457 212267 -267486 -203703 7113 18493
19107 18493 215521 -197008 -158703 93108 -118244 -236290 206778 121887 119836 -80970 -39353
19095 -7167 -256237 -34372 247005 -147301 -56572 -209660 1936 -71480 152235 30789 -124935
$$ packed form
19176a58229J4995r7792R4918A23392J01949j3130D5223K6079a05831A76089G873
19164b81075a05124d1781k50449B15781b97948B28713o1815a71431B22313g9407
19153c52227a31918M2873a7334r4325j53823B424P609g0160A80557c52747B93984
19141g1351j96582B63859h569c776k26380C4493a91092k62908a73512f0259j15233
19130a75492d6152k83249A5450h4871i61k65593N4091n6812c2067A05595g0933
19118A15319e63912E4556b79218g6651c653j75804B12267b67486O3783G113J1380
19107A8493J97028a97008L8305I3108a18244j18046B06778q4891k051h0970c9353
19095g167k49070c4372B47005a47301e6572j53088A936g1480A52235C0789a24935
$$ plain form
19083 40224 -59007 -4546 121401 -292882 -37688 145556 14224 13872 -424289 -272458 245257
19071 260318 -404732 -129062 174264 -226861 -98786 -132110 -18200 -143581 -23321 -379473
19061 -379473 -8653 -171430 234903 1505 -11870 -152684 348813 14103 -185607 97571 -127177
19049 147072 296553 178089 -142779 -259525 -194929 -234068 37729 -325808 -186452 -29186
19038 -252313 -297844 67264 262155 -59725 -540420 172885 -156760 -116226 -166684 -146389 -114137
19027 -114137 -55257 -254214 -47518 -232758 -149826 18696 -56467 -122403 -100416 -455217 -173794
19015 -19537 21443 -76084 -129831 11681 7306 92604 -53411 17191 -174821 -94405 115790
19003 -15451 -114714 -175557 -185721 155439 -84312 53460 -81029 -39398 -263671 53197 -16254
$$ packed form
19083D0224e9007d546A21401b92882c7688A45556A4224l52d24289J51831B45257
19071B60318d04732a29062A74264b26861i8786l3324a8200j25381b3321l56152
19061c79473h653j62777B34903A505a1870j40814C48813A4103a85607I7571a27177
19049A47072J49481j18464a42779j16746O4596l9139C7729c25808J39356b9186
19038b52313m5531F7264J94891e9725m80695A72885a56760M0534n0458K0295L2252
19027a14137e5257j98957d7518j85240Q2932A8696e6467o5936K1987l54801a73794
19015a9537B1443g6084n3747A1681m375Q5298e3411A7191a74821Q0416A15790
19003a5451r9263o0843j0164A55439h4312E3460h1029c9398k24273E3197a6254
$$ plain form
18991 -123021 56364 -275268 61421 91693 -145006 269904 152992 233890 -185972 33160
18980 -129623 -91449 96025 -263891 122761 -8184 -468122 -318567 302477 -105330 80946
18969 -111301 -56908 259598 -138577 61769 -79917 96310 86838 -32882 115360 367256 590128
18958 590128 608071 599164 97474 32419 -54293 185699 52621 -89102 139310 -86457 -139176
18947 -139176 -69244 -89156 -40992 -110058 -63917 -156150 -380039 -95092 -125233 -90295 -50380
18936 -50380 -245292 175920 -50784 201618 -196537 149734 -151641 -202443 79345 -397543
18925 116201 -63826 -83639 -212953 -109006 92083 224187 20069 99707 -386125 40607 46057
18914 46057 -204981 352520 179599 56024 80218 24148 -49909 -313581 81927 -564335 64652
$$ packed form
18991a23021E6364b75268F1421L0272a45006B69904j16912Q0898a85972C3160
18980a29623L8174I6025b63891A22761h184m59938J49555C02477a05330H0946
18969a11301N4393B59598a38577F1769g9917I6310r472c2882A15360K51896K22872
18958E90128J7943q907I7474C2419e4293A85699E2621h9102A39310h6457n2719
18947a39176f9244j9912d0992o9066M6141r2233k23889i5092l0141L4938L9915
18936e0380j94912A75920e0784B01618a96537A49734a51641n0802G9345c97543
18925A16201f3826j9813j29314J03947I2083J32104B0069P9638c86125D0607N450
18914D6057b04981C52520j72921E6024K4194B4148d9909k63672H1927e64335F4652
$$ plain form
18902 -6104 381747 44815 168798 -121984 315636 100768 90119 89664 255011 240798 159835
18891 159835 49856 -84904 -33976 -83767 -59647 20368 -67267 -128347 -86532 -142549 -32505
18879 -112823 103804 360255 40687 -190669 -269330 -35880 -46844 53301 -114801 222025
18868 -139319 -81329 -250608 -124064 -306976 237197 -121243 -89364 -129893 -22669 -251956
18858 -251956 64839 222492 288137 -141911 225379 -412507 -49053 184877 -127783 246886
18847 101148 -273608 -21551 -493374 8499 -435301 -26830 177642 -189505 -140967 -151683 222960
18835 -25933 -316343 76943 -14291 23800 122070 -109853 26176 13179 -44412 217710 -231875
18823 -61724 -269591 15813 45737 -186882 68135 -180856 77965 104138 22798 202872 -64207
$$ packed form
18902f104C81747D4815J23983a21984C15636A00768j0649m55J65347j4213q0963
18891A59835D9856h4904c3976m9791K4120B0368f7267o1080M1815n6017c2505
18879a12823A03804K56451D0687a90669p8661c5880j0964E3301a14801B22025
18868a39319N7990j69279a24064j82912B37197a21243L1879m0529b2669k29287
18858b51956F4839J57653O5645a41911B25379d12507d9053A84877a27783B46886
18847A01148b73608b1551m71823H499d35301b6830A77642a89505M8538j0716B22960
18835b5933k90410G6943a4291B3800R8270a09853B6176j2997d4412B17710b31875
18823f1724k07867A5813K9924a86882F8135a80856G7965K6173B2798J80074f4207
$$ plain form
18811 58789 -89848 81586 -37344 -140524 -142863 -137538 -312764 177132 89112 45958 -2554 136087
18798 178604 364919 -43373 420561 -149030 -117029 -103875 79717 -177635 -166472 73468 -175336
18786 138798 -92637 -44802 -235137 -180069 -192263 46996 -88803 78446 164038 -261047 30761
18774 -128210 -259057 -163731 -267120 -336587 -39900 40072 -53510 106790 -89703 -1029 201245
18762 95889 -21694 164411 -186992 262599 -33220 -33939 -290781 -97828 -219473 -242673 -413634
18751 -413634 -231669 5954 2163 -361909 3417 -105995 -536464 -65525 -399933 -66654 -40981
18740 -40981 -178417 91058 -54085 -94040 -9706 -77406 -64439 -301989 -333565 61912 132665
18729 132665 264714 209887 -1663 -264636 -133369 -257593 -30902 140569 -40534 -96516 86659
$$ packed form
18811E8789h9848H1586c7344j03180k339N325j75226A77132q8020m3154b554A36087
18798A78604J86315d3373D20561a49030L2001J3154G9717a77635J1163G3468a75336
18786A38798i2637d4802j90335N5068j2194D6996h8803G8446Q5592b61047C0761
18774a28210j30847R5326j03389o9467c9900D0072e3510A06790h9703a029B01245
18762I5889b1694A64411a86992B62599c3220p19k56842i7828j21645k3200j70961
18751d13634J81965E954B163c61909C417a05995m30469f5525l34408f6654K5673
18740d0981j37436I1058e4085l9955i706o7700J2967k37550l1576F1912P0753
18729A32665J32049n4827a663k62973J31267j24224c0902A40569d0534n5982H6659
$$ plain form
18717 -95960 -166784 109530 29278 -115745 -162298 -30605 -11520 -59183 -42866 -89950 -50625
18706 -50625 73240 -171257 -278170 -319265 -36646 -2698 -19661 -107839 -155250 -147437 75753 -372612
18693 -67500 -300469 158960 118185 -265040 47513 -411978 -229551 131793 -160498 219222
18682 -73537 119814 -183777 -101436 122350 2254 -130696 -220445 -182995 57228 39083 -116469
18670 167046 119850 44736 -155794 -95931 -88197 -263170 -37335 113811 -116294 26913 139887
18659 139887 313037 201703 162131 -46369 274460 -69430 -176758 20525 -293003 -129343
18648 -118384 -140173 60161 -249005 39969 66972 -62446 -196950 -164188 -194550 64277 2564
18636 -310347 -143230 -200539 -37717 115028 109348 -151381 398145 -20929 -35290 -8728 127206
$$ packed form
18717i5960p0824A09530B9278a15745m6553c0605a1520m7663J6317m7084L9325
18706e0625G3240a71257j06913m1095c6646b698j6963q8178m7411P813G5753c72612
18693f7500k32969A58960m0775b65040D7513d11978J82427A31793a60498B19222
18682g3537A19814a83777Q2341A22350B254a30696q9749L7450E7228j8145a16469
18670A67046m7196D4736a55794N9863P734j74973c7335A13811a16294B6913J12974
18659A39887J73150j11334l9572d6369B74460f9430j07328B0525b93003a29343
18648a18384k1789F0161b49005C9969K7003f2446j34504L2762l0362F4277B564
18636c10347a43230n7309c7717A15028n680a51381C98145b0929j4361h728A27206
$$ plain form
18624 181957 -66934 20626 -132707 -99489 41152 216218 -218823 -2180 -57258 -146224 -352247
18613 -352247 -59597 52391 75938 -136850 -179025 134045 50034 -89751 -5853 208811 190801
18602 190801 -166742 -198402 29605 -82123 -326937 -308753 -237210 -314824 -144246 91760 -243921
18590 -281817 -22519 -86675 106225 35573 151321 118863 -99565 237459 -170148 31856 -97379
18578 91527 -30464 359462 118071 -232329 -273653 -78146 -258001 -30351 -138782 265269
18567 -282585 188909 94868 -233778 85943 -97898 -80610 -119564 -314187 117604 66047 -22715
18555 -247663 -107410 -276212 134591 -219423 -131046 -138249 -188037 134117 -125488 -378136
18545 -378136 39094 50578 221459 7511 -119327 134884 -36009 -41017 77333 -17186 183363
$$ packed form
18624A81957f6934B0626a32707L3218D1152J75066b18823b180n5078q8966k06023
18613c52247e9597E2391K3547a36850m2175A34045E0034h9751e853B08811j8010
18602A90801a66742l1660B9605h2123k44814J8184P1543p7614a44246I1760b43921
18590b81817b2519o4156A06225C5573J15748l2458i9565B37459a70148C1856i7379
18578I1527c0464C59462A18071b32329m1324g8146j79855c0351j08431B65269
18567b82585A88909r4041b33778H5943i7898J7288l8954j94623A17604n1557b2715
18555b47663a07410j68802A34591b19423Q8377p203m9788A34117a25488k52648
18545c78136C9094J1484J70881G511a19327A34884c6009n008G7333a7186A83363
$$ plain form
18533 59368 -21614 -19266 354193 -176476 -80708 -10712 -196392 -60264 60010 131438 244421
18522 244421 -13324 27023 -84882 183039 -280792 223643 13378 46890 128258 -55244 -41397
18511 -41397 165177 -371611 -190455 85628 99178 141693 155372 102425 -461902 246495 -105235
18499 -75083 -117689 112952 -98064 109854 -322533 -149607 -91275 -15668 -380562 -94326 -101251
18488 -101251 -145310 82743 -103190 202279 -195826 144860 -209155 -133597 -299112 48670
18477 -102587 -40120 82016 -127117 -52564 -251311 22733 -193820 -100231 128211 124429 118116
18466 118116 7687 6433 -409070 -98109 123212 -83134 -88765 -111335 162338 186961 -195651
18454 61168 -336926 -79046 -53366 -38570 -201241 48668 -242128 -2391 -171657 -191280 -45142
$$ packed form
18533E9368b1614K348C54193a76476h0708a0712j85680f0264F0010P1428J12983
18522B44421a3324B7023h4882A83039b80792B23643A3378L3512Q1368e5244J3847
18511d1397A65177c71611J81156H5628J3550M2515J3679n2947d61902B46495a05235
18499g5083m2606A12952i8064A09854c22533a49607N8332a5668l64894i4326o925
18488a01251m4059H2743a03190B02279a95826A44860b09155P5558j65515D8670
18477a02587d0120H2016a27117e2564j98747B2733a93820R3589A28211l782o313
18466A18116G687j254d09070i8109A23212h3134n631k2570A62338K4623a95651
18454F1168c36926g9046K5680J4796j62671D8668b42128b391j69266j9623d5142
$$ plain form
18442 98733 -225536 -50391 -54823 70205 -120688 -448990 95836 -23586 -16821 -148706 -120598
18431 -120598 121646 -292732 260970 -80525 69055 84937 128555 139844 -34878 -7012 387707
18419 6346 -353472 -153873 59048 -86218 -96016 142499 -308055 -103498 -275753 140155 142141
18408 142141 98583 127311 -105458 -334100 51041 -67587 -74052 117501 938 113535 167201
18397 167201 -17904 174752 -371671 -137711 103963 -42196 109901 57385 135911 168892
18387 168892 -22104 -164024 32494 -413945 -106421 -199145 123236 -128648 -108094 332016
18376 -66295 25531 -23517 93514 191028 -223867 189334 -91394 54577 -64481 18592 -36223
18364 -34806 -112313 119103 -152200 5509 174563 -24778 -330536 -219480 -206477 70349 -385598
$$ packed form
18442I8733b25536e0391m432G0205a20688l28302I5836b3586O765j31885K8108
18431a20598A21646b92732B60970h0525F9055J5882M3618J1289c4878g012C87707
18419F346c53472a53873E9048h6218r798A42499c08055a03498j72255A40155J986
18408A42141m3558K8728a05458k28642E1041f7587o465A17501I38J12597N3666
18397A67201a7904A74752c71671a37711A03963d2196A09901n2516P8526L2981
18387A68892b2104j41920C2494d13945a06421r2724A23236a28648K0554C32016
18376f6295B5531b3517I3514R7514b23867A89334i1394E4577f4481A8592c6223
18364c4806p7507A19103a52200E509J69054b4778l05758J11056J3003G0349c85598
$$ plain form
18352 -88295 -198538 -74945 166499 324819 -51441 73554 132664 -233423 137001 164802 227681
18341 227681 93171 98150 -358414 -163180 147730 -80405 120516 -185759 -63808 12575 77163
18330 77163 -50506 -388933 -99044 -196104 60757 115733 66358 176166 -191038 -56225 -189586
18319 -189586 59909 384549 2167 102558 100995 83866 305712 -173042 146133 -394509 -15013
18307 103162 -57491 -206831 61344 49339 42555 -161351 -85720 -6480 -92442 243977 -47853
18295 -150433 -13463 -187725 51513 -188284 -93528 -51074 75762 84639 -355983 155105 116277
18284 116277 -119139 178832 283876 94242 -73241 -51869 -264005 138989 229615 -41813
18273 212584 -203887 -98848 -157408 9633 -73638 -96188 -230428 -191787 154426 -210932 206591
$$ packed form
18352h8295j10243g4945A66499J58320e1441G3554N9110b33423A37001K7801O2879
18341B27681I3171M979c58414a63180A47730h0405A20516a85759f3808A2575O4588
18330G7163e0506l38427i9044r7060F0757N4976m9375J09808a91038e6225j33361
18319a89586E9909L24640B167J00391j563j7129K21846a73042A46133c94509a5013
18307A03162e7491j49340F1344j2005o784a61351P5631f480q5962B43977d7853
18295a50433a3463j74262E1513a88284i3528M2454G5762Q877c55983A55105l8828
18284A16277a19139A78832J05044I4242g3241K1372k12136A38989R0626d1813
18273B12584b03887i8848n8560I633g3638k2550j34240L8641A54426b10932B06591
$$ plain form
18261 61818 -65839 -197444 118071 -5407 160891 -210455 -163150 188450 -306400 -141773
18250 28683 43454 284758 262105 72850 123536 -275873 -103964 17187 -81565 23733 -47167
18238 -132216 175572 -166657 186613 -145786 40049 208788 77207 88771 -240327 -258691
18228 -258691 -269990 -73769 277702 -50515 -48078 143490 8435 -171504 -144842 -177749 -203849
18217 -203849 285579 -2577 -18583 -314128 -224231 27284 -27701 119001 310228 -67445 247361
18205 194833 -51025 -17378 -101641 137527 159138 172904 74766 -86866 1462 167624 -290947
18193 -405145 -85400 -73929 272373 -144421 -40245 -190753 -6285 -17560 -218315 -187440 74986
18181 11786 94985 -103162 260412 -55566 16302 258341 -105595 120368 182341 -397775
$$ packed form
18261F1818f5839j31605A18071e407A60891b10455M7305A88450c06400a41773
18250B8683J4771K41304k2653G2850N0686b75873a03964A7187h1565B3733d7167
18238a32216A75572a66657A86613a45786D0049J68739G7207J1564b40327j8364
18228b58691j1299g3769B77702e0515K437A43490H435a71504K6662l2907k6100
18217b03849B85579b577j6006k95545Q9897B7284b7701A19001J91227f7445B47361
18205A94833e1025a7378q4263A37527K1611J3766G4766h6866A462J66162b90947
18193d05145h5400J1471B72373a44421d0245j50508f285j1275k00755L0875G4986
18181A1786Q3199a03162B60412e5566A6302K42039a05595A20368O1973c97775
$$ plain form
18170 -107918 -172055 -30102 36179 -151384 13609 -307266 -22611 32612 -288376 -161940 -128154
18159 -128154 195943 -350913 6290 -34362 -200127 -26681 12684 -231569 21362 -196928 165266
18147 -74955 256267 98483 -141336 51958 -65940 -40487 -1621 -389964 -281557 -56424 -55446
18136 -55446 -101404 -47806 -138581 311922 201836 190947 -23823 -350525 -65299 160742 -301641
18124 -13228 160259 -259390 162159 -148212 -173644 64028 81272 -91656 88487 -191685 -135609
18113 -135609 -64769 101056 -44221 -107949 -134392 403913 305741 -4570 -8586 -99385 -157236
18102 -157236 138372 -148084 -144224 74725 45285 -31328 41137 -151988 -36731 215434 -12200
18090 -21156 211295 -66903 114974 28157 84691 80353 -181315 -62932 115815 159626 134626
$$ packed form
18170a07918o4137c0102C6179a51384A3609c07266b2611C2612b88376J26436L3786
18159a28154A95943c50913F290c4362j65765b6681A2684b31569B1362a96928A65266
18147g4955B56267I8483a41336E1958f5940K5453a621l88343J08407e6424R78
18136e5446m5958d7806r0775C11922j10086j0889b3823l26702f5299A60742c01641
18124a3228A60259b59390A62159a48212k5432F4028J7244i1656H8487a91685N6076
18113a35609f4769A01056d4221o3728k6443D03913r8172d570m016r0799n7851
18102a57236A38372a48084L860G4725k9440c1328D1137a51988c6731B15434a2200
18090b1156B11295f6903A14974B8157N6534m338a81315f2932A15815M3811k5000
$$ plain form
18079 134626 -249470 473435 -129663 -146814 100503 -100413 110860 480581 -229577 -14199
18068 -167599 105405 -31897 345028 11021 -334687 45269 60727 -158453 83341 226200
18058 226200 12840 -101184 121470 148894 73716 -51848 25520 -149465 -143421 -71496 256034
18046 -138024 226737 -99208 -186025 298900 -119179 273141 -342601 27165 1409 -81216 -179247
18035 -179247 116861 171230 -292417 27403 -64515 -203046 -12220 -52059 117600 -103144
18024 9874 -156433 251277 -31039 201966 231420 123042 215989 -169165 171938 304392
18014 304392 6654 -109161 -63390 85772 83553 -39851 -153776 -193378 -167041 15 -288850 69721
18001 139195 -4234 -49818 -140511 44526 -18052 192807 -87551 -94323 302306 77989 208434
$$ packed form
18079A34626b49470D73435a29663j7151A00503a00413A10860L69721b29577a4199
18068a67599A05405c1897C45028A1021c34687D5269J5458a58453H3341J42859
18058B26200A2840a01184A21470K7424G3716e1848B5520a49465O044g1496B56034
18046a38024B26737i9208q6817B98900a19179B73141c42601B7165A409h1216r8031
18035a79247A16861N4369b92417B7403f4515j38531a2220l9839A17600a03144
18024I874a56433B51277c1039B01966K9454j08378R2947a69165A71938J32454
18014C04392F654a09161M5771H5772k219c9851j13925l9602K6337A5b88850F9721
18001A39195d234m5584r0693D4526a8052A92807h7551o772C02306G7989J30445
$$ plain form
17990 208434 276157 -96995 -204344 138819 -312107 42419 -105035 -79745 -303112 -159165
17980 -159165 149551 -168031 -34427 -159785 -214404 300433 -301572 149634 -257958 281957
17969 144702 56692 7813 -350109 -139584 -48965 20871 4877 123531 185090 97281 87631
17958 87631 -211562 47905 196548 -554771 -245266 122884 122046 45457 -264977 2066 -21226
17946 -87262 284977 307712 63288 -74580 -292408 -101779 -230230 237011 235162 -13331 -43658
17935 -43658 166462 -7653 -373675 -210890 -137607 -301294 141775 -189470 -152871 318007
17924 183183 305447 220648 -195707 189848 -82587 -213881 190725 -13887 -50642 96898
17913 137142 -13720 187257 -20714 20808 -130414 -21746 -53054 -118165 172141 -44763 16590
$$ packed form
17990B08434O7723i6995j07349A38819c12107D2419a05035K5290k23367J43947
17980a59165A49551a68031c4427j25358n4619C00433c01572A49634b57958B81957
17969A44702E6692G813c50109a39584d8965B0871D877J18654O1559q7809r650
17958H7631b11562D7905J48643e54771b45266A22884q38D5457b64977B066b1226
17946h7262B84977K2735F3288g4580k17828a01779j28451B37011j849a3331l0327
17935d3658A66462g653l66022J62785P3283j63687A41775a89470L6599C18007
17924A83183J22264q4799a95707A89848h2587j31294A90725a3887l6755I6898
17913A37142a3720A87257b0714B0808a30414b1746l1308o5111A72141d4763A6590
$$ plain form
17901 169730 163300 -3019 550150 18373 130396 -141179 -191529 357039 -191935 155954 -119330
17889 151675 384590 303707 -6560 -74887 124665 -46692 352264 -43882 -289850 139438 -205370
17877 -120882 312316 -2237 277479 -32862 -204402 127882 61891 32600 -136496 19905 158707
17866 158707 61214 -55406 -51057 60125 28159 206462 192322 124193 -96606 217529 -82808
17854 100305 -249035 161223 171855 -341182 -49764 -42848 -38719 55348 40565 1076 52290
17843 52290 26903 -129698 225363 -221794 92152 194267 385693 -333954 230555 88905
17832 -2317 502906 -63087 269434 118469 -13266 43097 -16787 -90863 -41159 205998 163133
17821 163133 198186 260807 312365 189969 232075 27879 -71645 -16561 -288664 -99604 323471
$$ packed form
17901A69730o430c019E50150A8373J12023a41179n0350C57039a91935A55954a19330
17889A51675K32915q0883f560o8327A24665d6692C52264d3882k45968A39438b05370
17877a20882C12316b237B77479c2862j71540A27882F1891k9291a36496A9905J38802
17866A58707F1214e5406M349F0125B8159J78303j4140o8129i6606B17529h2808
17854A00305b49035A61223J0632c41182d9764O916M129E5348j4783A076N1214
17843E2290k5387a29698B25363b21794I2152J02115J91426c33954B30555H8905
17832b317E02906f3087B69434A18469a3266D3097a6787p4076d1159B05998m2865
17821A63133L5053O2621N1558j22396M2106B7879g1645a6561k72103i9604C23471
$$ plain form
17809 92997 -75531 80342 -3954 -91912 174498 -147446 214310 -78895 150630 -371234 394660
17797 -51555 259041 -72062 -73508 29342 216910 35918 -127903 -234133 -9551 35590 -84162
17785 -39858 115948 -61151 90542 6043 -126607 227886 299078 -107470 402940 -46644 306614
17773 71127 179723 178860 -190659 201752 -57371 127633 -83908 264661 -87641 -4732 2985
17761 -191733 74447 -116764 -217417 165777 -18040 120041 24032 -71981 59189 237899
17751 237899 42040 243127 156226 -83380 35793 9953 -63385 -40542 255194 105265 166583
17740 166583 40765 220628 -47680 136327 284735 -266147 29186 261849 -299131 21895
17729 -39798 -109003 -47238 91496 -48322 -2011 -63651 -165475 251024 181531 144630 -187883
$$ packed form
17809I2997g5531H0342c954q7958A74498a47446B14310g8895A50630c71234C94660
17797e1555B59041g2062j446B9342J87568C5918a27903j06230i551C5590h4162
17785c9858A15948f1151I0542F043a26607B27886P1192a07470D02940d6644C06614
17773G1127J08596q63a90659B01752e7371A27633h3908B64661h7641d732B985
17761a91733G4447a16764j00653A65777a8040A20041B4032g1981E9189J78710
17751B37899D2040K01087q6901h3380C5793I953f3385K2843B55194A05265O1318
17740A66583D0765J79863d7680A36327J48408b66147B9186K32663b99131B1895
17729c9798o9205d7238I1496d8322b011o1640j01824B51024o9493l6901a87883
$$ plain form
17717 -14896 -395708 70387 86206 -121709 267905 52439 12335 -104627 160200 261887
17707 261887 122311 24858 -57380 203276 -55839 23122 218323 -259107 -266981 -187963 126888
17695 182168 93349 1730 124513 -311604 -189889 -84208 313810 -74154 -90427 -10902 -292066
17684 -292066 263088 172280 178418 117779 11091 65132 424736 125877 179150 -137993 68954
17672 -211290 112711 100070 34091 88278 82070 180804 -162666 109821 356222 215429 324578
17661 324578 65167 44823 -116764 -77253 84040 148451 -12626 60024 190826 32948 181597
17650 181597 -67856 62414 -131415 262357 -27991 210359 242592 12332 75437 268683 411078
17639 411078 219346 144169 104485 -176282 143424 70889 -158124 -82825 187447 156564
$$ packed form
17717a4896l80812G0387J5819a21709B67905E2439A2335a04627A60200J01687
17707B61887A22311B4858e7380B03276e5839B3122J95201b59107p874P9018A26888
17695A82168q8819A730J22783c11604J21715h4208C13810g4154j6273a0902k81164
17684b92066B63088r0808O138o0639A1091N4041L59604A25877N3273a37993F8954
17672b11290A12711j2641C4091N4187o208R8734a62666A09821K46401j40793J09149
17661C24578F5167k0344a16764L9511H4040O4411a2626F0024J30802C2948J48649
17650A81597f7856F2414a31415B62357b7991B10359L2233A2332O3105J93246J42395
17639D11078j91732p5177l9684a76282A43424G0889a58124P5299A87447l0883
$$ plain form
17629 156564 -273434 82846 212131 143380 240003 498693 -17432 11222 119534 -39880 195687
17617 -48064 189371 -137540 209201 -118404 203544 313476 265476 157272 28338 80547
17607 80547 205538 450096 205596 47854 -119919 126140 35775 -2303 33010 -8864 165208
17595 322351 115355 142130 87333 143252 380104 183885 472000 83820 226908 -157943
17584 110247 -202689 284186 238676 158638 -111271 344013 -4617 46193 155865 45428 -52106
17572 130680 316641 74124 -105114 -136179 114489 4756 699450 192339 16600 163279
17562 163279 -243302 -112140 235071 -17647 246832 177995 -84561 -114110 26919 209152
17552 209152 364014 339641 -12148 46830 220366 36035 287936 -119804 162319 238220
$$ packed form
17629A56564b73434H2846J29285o8751R6623K58690a7432A1222J08312c9880A95687
17617d8064A89371a37540B09201a18404B03544J09932m8000j08204B8338N2209
17607H0547J24991K44558B05596D7854a19919A26140C5775b303C3010h864A65208
17595C22351A15355K6775n4797N5919K36852A83885K88115H3820J43088a57943
17584A10247b02689B84186m5510q0038a11271C44013d617D6193J09672D5428e2106
17572A30680J85961G4124a05114l1065A14489D756O94694A92339A6600J46679
17562A63279b43302a12140B35071a7647B46832o8837h4561k9549B6919J82233
17552B09152J54862k4373a2148D6830J73536C6035K51901a19804A62319P5901
$$ plain form
17542 238220 201519 -43895 314872 315192 226708 417586 172757 -17108 101882 47219 135922
17531 135922 269544 162779 100166 66722 336204 169586 372915 534407 244363 324245
17521 324245 358995 250105 221788 405505 78092 366226 490262 308887 412589 846174
17511 846174 859181 488181 861122 748226 969873 387057 759189 481692 349477 142568
17500 375967 328779 262797 611206 531000 668357 1288837 609709 1065416 996124 396158
17489 759468 456643 185289 446174 211658 117985 230225 -292729 356985 479425 395252
17479 395252 9885 66727 374411 416970 452573 537272 155034 294411 634818 440882 367170
17468 367170 327778 560702 462374 137057 314365 -203426 441918 123789 367401 319473
$$ packed form
17542B38220l6701d3895C14872L20q8484J90878A72757a7108A01882D7219Q8703
17531A35922J33622j06765o2613l3444K69482j66618K03329J61492B44363P9882
17521C24245L4750j08890k8317J83717G8092K88134J24036j81375J03702M33585
17511H46174J3007l71000L72941j12896K21647C87057L72132k77497j32215A42568
17500C75967m7188o5982L48409q0206J37357O20480F09709M55707o9292C96158
17489G59468l02825A85289K60885B11658r3673J12240b92729C56985J22440q4173
17479C95252I885N6842L07684M2559L5603Q4699A55034J39377L40407j93936p3712
17468C67170l9392K32924r8328A37057J77308b03426D41918A23789K43612m7928
$$ plain form
17458 319473 356094 155771 520250 293333 367279 117680 -138321 310871 264154 170661
17448 170661 449561 35777 167944 129406 302223 304730 383692 437864 313833 451925 109752
17436 651531 182127 454713 123097 93639 395932 461374 263670 201489 321588 227221
17426 227221 350891 269372 141271 89278 34647 679122 267368 259898 150090 407451
17416 407451 184206 373676 645650 359789 247719 463917 56157 268220 290317 266978
17406 266978 482850 481483 217591 323835 279767 165284 165343 220953 337832 236467 324190
17395 324190 376044 204873 337664 133476 109843 411348 346282 313168 -277334 330533
17384 54665 173811 300949 384682 -13374 -47333 392527 292603 232292 75431 95534 164579
$$ packed form
17458C19473L6621A55771L64479k26917P3946A17680a38321C10871m6717r3493
17448A70661K78900C5777J32167l8538J72817K507P8962N4172j24031J38092A09752
17436F51531A82127K72586A23097k9458L02293O5442j97704o2181J20099r4367
17426B27221J23670q1519j28101n1993C4647O44475B67368p470j09808K57361
17416D07451A84206J89470K71974k85861j12070K16198E6157K12063K2097k3339
17406B66978K15872j367B17591J06244m4068j14483N9N5610J16879j01365Q7723
17395C24190N1854j71171J32791A33476k3633L01505o5066l3114b77334C30533
17384E4665J19146J27138Q3733a3374l3959C92527r9924o0311G5431K0103O9045
$$ plain form
17373 164579 312752 334520 187699 -42278 155499 231671 383618 432609 320517 9614 295722
17362 295722 369254 258579 443693 -63087 233319 527755 144018 289211 130708 493620
17352 493620 156505 181679 479038 46808 394761 532847 64021 201050 -47166 399273
17341 464983 223288 262277 -79493 174954 493095 288216 321125 94986 222864 268400
17331 268400 304470 452551 246481 239033 522403 305149 258845 361947 61056 294181
17321 294181 275528 347632 165468 166662 339921 438364 143185 509835 434399 96038 598007
17310 598007 571399 380364 242839 282141 164981 240412 121965 -1983 174797 129101 116879
17299 116879 -4123 247195 1299 449740 150271 81473 223035 504246 557245 328748 -164794
$$ packed form
17373A64579J48173K1768j46821d2278A55499P6172J51947M8991j12092I614K86108
17362B95722P3532j10675J85114f3087B33319K94436A44018J45193A30708L62912
17352D93620A56505K5174K97359D6808L47953J38086F4021J37029d7166C99273
17341D64983B23288L8989g9493A74954L18141k04879L2909I4986J27878M5536
17331B68400L6070J48081k06070p448K83370k17254m6304J03102F1056K33125
17321B94181j8653P2104A65468J194J73259R8443A43185L66650p5436I6038N01969
17310E98007k6608j91035j37525L9302j17160P5431j18447a983A74797m5696j2222
17299A16879d123B47195A299M48441A50271o8798J41562K81211N2999k28497a64794
$$ plain form
17287 198433 80101 264671 190969 500580 11043 110956 591587 477394 207797 258949
17277 258949 236919 226942 251854 499929 269774 337368 367806 879688 300201 288141 245052
17266 245052 403940 218913 146247 170140 310377 175238 470803 321428 -32278 438117
17255 450609 348601 293898 242538 139291 187393 112496 350182 463304 25653 417275
17245 417275 567794 319376 190669 615419 278119 162300 294264 285970 192311 319813
17235 319813 135089 215177 465789 211916 76418 414177 211635 673617 637634 529700
17225 529700 367723 215007 367537 521391 347771 363585 796007 579043 362810 86637
17214 336207 565138 426504 539917 918238 278406 503628 137083 295377 516895 192617
$$ packed form
17287A98433H0101J84570p3702L09611A1043R9913M80631j14193B07797N1152
17277B58949k2030r977K4912K48075k30155O7594L0438N11882C00201j2060m3089
17266B45052J58888j85027p2666K3893J40237j35139K95565j49375c2278D38117
17255D50609j02008n4703n1360j03247M8102p4897K37686J13122B5653L91622
17245D17275J50519k48418j28707M24750B78119j15819J31964q294r3659J27502
17235C19813A35089Q0088K50612B11916G6418L37759k02542M61982l5983j07934
17225E29700j61977j52716J52530J53854j73620J5814M32422k16964k16233H6637
17214C36207K28931j38634J13413L78321B78406K25222A37083J58294K21518A92617
$$ plain form
17203 80306 487825 443684 354460 365363 526773 730598 221637 183343 349561 484280
17193 484280 601176 445276 403606 622635 207643 536819 573506 133207 430303 428125
17183 428125 530520 450889 304451 455152 212275 248346 160014 657513 196002 458198
17173 458198 610232 545234 32809 343479 557420 375559 533920 580092 606089 198426
17162 652007 308460 398496 340662 461268 352811 558973 496991 523139 619105 583101 778432
17151 778432 686376 432640 556734 197874 455836 572722 615072 574247 366114 601132
17141 601132 551125 821280 428177 696604 633865 716295 572385 383607 555551 593576
17131 593576 427040 882285 406321 1000436 260066 439212 767388 372362 683360 682454
$$ packed form
17203H0306M07519m4141q9224J0903J61410K03825B21637l8294J66218J34719
17193D84280J16896j55900m1670K19029B07643L29176L6687A33207K97096k178
17183D28125J02395p9631j46438J50701B12275L6071q8332M97499A96002K62196
17173D58198J52034o4998C2809L10670K13941j81861J58361M6172K5997A98426
17162F52007C08460R0036n7834J20606j08457K06162o1982K6148R5966l6004J95331
17151G78432r2056k53736J24094A97874K57962J16886M2350m0825k08133K35018
17141F01132n0007K70155l93103K68427o2739Q2430j43910j88778J71944L8025
17131E93576j66536M55245D06321N94115B60066J79146L28176C72362L10998r06
$$ plain form
17121 682454 924002 733069 611937 797082 386656 764266 358530 663139 623537 789662
17111 789662 344030 584047 677838 607808 995775 586308 436214 524426 484486 468011
17101 468011 504492 742320 664281 916731 815969 643189 653431 615938 753306 427748
17091 427748 543161 642950 543878 540131 486663 537816 680053 687519 776825 920044 929919
17080 929919 839176 822955 461264 671629 508306 1026619 699660 618216 715505 882685
17070 882685 497287 492732 612744 625348 725449 649122 805119 650347 817419 644169
17060 644169 691865 789976 820725 509751 524622 547748 1145258 442830 1032685 989962 757678
17049 757678 860994 771227 920238 1000003 1048509 714372 778954 1023437 918171 992726
$$ packed form
17121F82454K41548j90933j21132J85145C86656L77610C58530L04609l9602J66125
17111G89662C44030K40017R3791p0030L87967m09467j50094Q8212l9940j6475
17101D68011L6481K37828p8039K52450j00762j72780J0242l7493J37368l25558
17091D27748J15413R9789r9072l747n3468N1153J42237P466Q9306J43219R875
17080I29919r0743j6221l61691K10365j63323N18313l26959q1444R7289J67180
17070H82685l85398m555J20012J2604J00101p6327J55997j54772J67072j73250
17060F44169M7696R8111L0749l10974J4871K3126N97510D42830N89855m2723k32284
17049G57678J03316q9767J49011P9765M8506l34137O4582K44483j05266P4555
$$ plain form
17039 992726 1151628 522466 563461 1056542 581273 925185 1024080 1022632 1339904 905273
17029 905273 988178 946648 740194 956997 742330 643556 950061 1088701 1071796 1201495
17019 1201495 903484 1166622 1122207 946102 918445 1021856 1017638 855429 913078 1346731
17009 1346731 1190874 916705 861979 932268 1336305 923687 1093772 1108791 1029794 1081290
16999 1081290 1043576 901380 1305196 1120872 1135383 1044812 1205659 1298469 1225020 1130215
16989 1130215 1171175 1266200 1384458 1181818 1349466 1308250 1304907 761214 1169039 1243630
16979 1243630 1341960 996794 1360432 1278975 1053600 1446266 1432864 1464420 1495287 1109239
16969 1109239 1590201 1568830 1213943 1254320 1181552 1400142 1181038 1528219 1639862 1081059
$$ packed form
17039I92726J58902E22466M0995M93081m75269L43912R8895j448L17272m34631
17029I05273Q2905m1530k06454K16803k14667r8774L06505J38640j6905J29699
17019A201495k98011K63138m4415j76105k7657J03411m218j62209N7649M33653
17009A346731j55857k74169n4726P0289M04037m12618J70085J5019p8997N1496
16999A081290l7714j42196M03816j84324J4511r0571J60847R2810p3449r4805
16989A130215M0960R5025J18258k02640J67648m1216l343n43693M07825P4591
16979A243630R8330l45166L63638q1457k25375L92666j3402L1556L0867l86048
16969A109239M80962k1371l54887M0377p2768K18590k19104L47181J11643n58803
$$ plain form
16959 1081059 1621288 1676969 1337790 1393891 1178281 1406731 1457215 1567518 1750167 1402958
16949 1402958 1314217 1541821 1686549 1556664 1738023 1482943 1904470 1915899 1969987 1841268
16939 1841268 1549645 1716209 2031061 1924947 1554077 1801808 1673259 1621326 1683473 1929413
16929 1929413 1866587 1851831 1814719 1842126 1910497 2084539 1884219 1826907 1996359 1912367 1987958
16918 1987958 2115465 2110460 1880719 2031627 2416033 2269043 2132213 2140393 2266283 2447797
16908 2447797 2213831 2333492 2516163 2127974 2554210 2583951 2455722 2285023 2704865 2740519
16898 2740519 2440797 2384190 2705185 2558836 2682518 2694086 2960685 3038552 2752189 3095458
16888 3095458 2848651 2538932 2994579 3100481 3130830 3061628 3306061 3144219 3031357 3148872
$$ packed form
16959A081059N40229N5681l39179N6101k15610K28450N0484J10303J82649l47209
16949A402958q8741K27604J44728j29885J81359k55080M21527J1429N4088j28719
16939A841268k91623J66564L14852j06114l70870K47731j28549n1933O2147K45940
16929A929413o2826j4756l7112K7407O8371J74042k00320n7312J69452q3992P5591
16918A987958J27507n005k29741J50908L84406j46990j36830Q180J25890J81514
16908B447797k33966J19661J82671l88189M26236K9741j28229j70699M19842L5654
16898B740519k99722n6607L20995j46349J23682J1568K66599P7867k86363L43269
16888C095458k46807l09719M55647J05902L0349o9202K44433j61842j12862J17515
$$ plain form
16878 3148872 3302670 3257594 3183225 3589102 3439024 3315358 3696531 3247345 3546459 3387660
16868 3387660 3531324 3879967 3819129 3584172 3818605 3956130 4177817 3684055 4007879 4066342
16858 4066342 3783386 4224277 4246213 4275885 4296031 4712680 4173703 4401776 4319350 4608194
16848 4608194 5148186 5026915 4790821 4719135 4951838 4711370 5065445 5258211 5068860 5283088
16838 5283088 5598022 5427826 5529771 5860774 5766564 5728015 6080518 6290274 6049219 6261510
16828 6261510 6465347 6842828 6032281 6634161 6773061 6802166 6602727 7058671 7559079 7244660
16818 7244660 7250127 7637987 7836203 7836740 8215547 8053643 8374963 8407140 8483814 8879222 8809356
16807 8809356 9204736 9248261 9577814 9634305 9941188 10012357 10183289 10369235 10576024 11067154
$$ packed form
16878C148872J53798m5076p4369M05877j50078j23666L81173m49186K99114j58799
16868C387660J43664L48643o0838k34957K34433J37525K21687m93762L23824N8463
16858D066342k82956M40891K1936K9672K0146M16649n38977K28073q2426K88844
16848D608194N39992j21271k36094p1686K32703k40468L54075J92766j89351K14228
16838E283088L14934j70196J01945L31003r4210l8549L52503K09756k41055K12291
16828F261510K03837L77481q10547O01880J38900K9105j99439M55944N00408l14419
16818G244660N467L87860J98216N37L78807j61904L21320L2177P6674L95408o9866
16807H809356L95380M3525L29553N6491L06883P1169J70932J85946K06789M91130
$$ plain form
16797 11067154 11076264 11406447 11417122 11799916 12364696 12333853 12508198 12839173 12936222 13382645
16787 13382645 14106452 13755254 14308972 14657271 14998561 15375939 15927120 16258951 16591517
16778 16591517 16976974 16947849 17983532 18413291 18811237 19308292 19871801 20104423 20909167
16769 20909167 21705844 22052865 22831963 23541251 23741482 24927310 25479944 26404709 27022466
16760 27022466 27668533 28684945 29517603 30450599 31273767 32363964 33556004 34668798 35604556
16751 35604556 36968932 38485026 39399408 40989348 42316525 43795738 45096250 47016006
16743 47016006 48410200 50458300 52030750 53879500 55934593 57909323 59905964 61740882
16735 61740882 64136187 66935662 68931323 71414594 73863455 76295514 78873691 81513916
$$ packed form
16797A1067154R110L30183J0675L82794N64780l0843J74345L30975R7049M46423
16787A3382645P23807l51198N53718L48299L41290L77378N51181L31831L32566
16778A6591517L85457k9125J035683M29759L97946M97055N63509K32622Q04744
16769B0909167P96677L47021P79098P09288K00231J185828N52634R24765O17757
16760B7022466O46067J016412Q32658R32996Q23168J090197J192040J112794R35758
16751C5604556J364376J516094R14382J589940J327177J479213J300512J919756
16743D7016006J394194K048100J572450J848750K055093J974730J996641J834918
16735F1740882K395305K799475J995661K483271K448861K432059K578177K640225
$$ plain form
16727 81513916 84118694 86775833 89601128 92490191 94809327 97701356 100084182 102700934
16719 102700934 105354615 107638240 109865250 111639220 113294423 115441420 116769196 117762222
16711 117762222 118776149 119172142 119801968 120048383 119708212 119147137 118669018 117376705 115732810
16702 115732810 114332213 112960816 110983491 108792069 106499128 103945124 101420074 98841957
16694 98841957 96400594 93629144 91061428 88398290 85675320 82523614 80127626 77580794
16686 77580794 74986424 72517269 69882205 67429980 65146209 62702526 60284846 58659236
16678 58659236 56509378 54329101 52741314 50597132 49314686 47400085 45674377 44237841
16670 44237841 42944114 41261657 39802590 38436363 37280766 35843713 35010646 33741516
$$ packed form
16727H1513916K604778K657139K825295K889063K319136K892029K382826K616752
16719A02700934K653681K283625K227010J773970J655203K146997J327776R93026
16711A17762222J013927L95993O29826K46415l40171n61075m78119j292313j643895
16702A15732810j400597j371397j977325k191422k292941k554004k525050k578117
16694I8841957k441363k771450k567716k663138k722970l151706k395988k546832
16686G7580794k594370k469155k635064k452225k283771k443683k417680j625610
16678E8659236k149858k180277j587787k144182j282446j914601j725708j436536
16670D4237841j293727j682457j459067j366227j155597j437053q33067j269130
$$ plain form
16662 33741516 32752802 31796521 30685836 29778287 28849640 27851176 27256633 26365022 25604290
16653 25604290 24966311 24148576 23552567 22637582 21898630 21326514 21066904 20667435 19773954
16644 19773954 19279414 19249800 18471473 17641558 17679970 16961686 16483100 16537914 16144800 15604991
16634 15604991 15297861 14494022 14549659 14228891 13804868 13428336 13506152 13056315 12881943 12235167
16624 12235167 12013308 11659765 11524839 11722438 11263308 10800832 10662387 10567796 10537289 9580283
16614 9580283 9557110 9565475 9424909 9057626 9329053 8841538 9109163 8465932 8393756 8512394
16604 8512394 8123944 8353498 7945794 7973525 7728752 7527311 7271988 7137477 7210702 6808707
16594 6808707 6794317 6719395 6822854 6583582 6381868 6383171 6288036 6591275 5887786 5970066
$$ packed form
16662C3741516r88714r56281j110685r07549r28647r98464n94543q91611p60732
16653B5604290o37979q17735n96009r14985p38952n72116k59610l99469q93481
16644A9773954m94540k9614p78327q29915L8412p18284m78586N4814l93114n39809
16634A5604991l07130q03839N5637l20768m24023l76532P7816m49837j74372o46776
16624A2235167k21859l53543j34926J97599m59130m62476j38445r4591l0507r57006
16614I580283k3173Q365j40566l67283K71427m87515K67625o43231p2176J18638
16604H512394l88450K29554m07704K7731k44773k01441k55323j34511P3225m01995
16594F808707j4390p4922J03459k39272k01714J303r5135L03239p03489Q2280
$$ plain form
16584 5970066 5918007 5604027 5527954 5801040 5424780 5378709 5337060 5451301 5214774 5273278
16574 5273278 4975798 5096290 4770835 4873524 5025992 4804730 5056837 4843735 4706761
16565 4706761 4190763 4593544 4658711 4319043 4269466 4129171 4223511 4090962 4073925 4017272
16555 4017272 3903204 3850304 4042612 3778847 3870871 3691110 3629205 3895829 3650794 3721377
16545 3721377 3589067 3551153 3345953 3277833 3469885 3306811 3137055 3071019 3088907 3023622
16535 3023622 3455760 3386483 3015824 3001442 2902325 3122042 3068192 2720784 2967362 2787017
16525 2787017 3024134 2589745 2693737 2382186 2618485 3049656 2586263 2421593 2545144
16516 2545144 2959529 2705488 2472070 2186883 2535653 2483261 2642243 2535776 2448169 2188865
$$ packed form
16584E970066n2059l13980p6073K73086l76260m6071m1649J14241k36527N8504
16574E273278k97480J20492l25455J02689J52468k21262K52107k13102j36974
16565D706761n15998M02781O5167l39668m9577j40295R4340j32549j7037n6653
16555D017272j14068n2900J92308k63765R2024j79761o1905K66624k45035P0583
16545C721377j32310l7914k05200o8120J92052j63074j69756o6036J7888o5285
16535C023622M32138o9277l70659j4382r9117K19717n3850l47408K46578j80345
16525B787017K37117m34389J03992l11551K36299M31171m63393j64670J23551
16516B545144M14385k54041k33418k85187L48770n2392J58982j06467q7607k59304
$$ plain form
16506 2188865 2375025 2046635 2116892 2227255 2335371 2482837 2465520 1939721 2224534 2311867
16496 2311867 2315937 2026255 2268434 2087267 2461511 2258794 2126606 2065971 1945381 1903713
16486 1903713 2023262 2244994 1671146 1978351 2162044 1932314 1623732 1567528 1630135 1815537
16476 1815537 1770244 1482856 1921165 1661969 1675222 1561775 1823959 1749794 1573792 1456698
16466 1456698 1668496 1809050 1568303 1872919 1732608 1779077 1502236 1701009 1464390 1294261
16456 1294261 1460508 1843793 1654968 1523446 1808544 1382690 1753471 1761082 1422137 1532382
16446 1532382 1800666 1546922 1338881 1617474 1509954 1328088 1680238 1285680 1554688
16437 1554688 1468151 1136543 1284496 1281342 1655974 1056316 802646 1463245 1521710 1356207
$$ packed form
16506B188865J86160l28390P0257J10363J08116J47466j7317n25799K84813Q7333
16496B311867M070k89682K42179j81167L74244k02717j32188o0635j20590m1668
16486A903713J19549K21732n73848L07205J83693k29730l08582n6204O2607J85402
16476A815537m5293k87388M38309k59196J3253j13447K62184p4165j76002j17094
16466A456698K11798J40554k40747L04616j40311M6469k76841J98773k36619j70129
16456A294261J66247L83285j88825j31522K85098m25854L70781P611l38945J10245
16446A532382K68284k53744k08041K78593j07520j81866L52150l94558K69008
16437A554688q6537l31608J47953l154L74632n99658k53670O60599N8465j65503
$$ plain form
16427 1356207 1007919 1611570 1400043 1188338 1310952 1033965 1392461 1540682 1249350
16418 1249350 1100597 1134394 1466898 1241197 1147120 1169915 1132992 1088167 964521 1115651
16408 1115651 1315319 1218369 1222503 1257617 1327215 1273355 942149 1021287 1156297 958385 1132646
16397 1132646 895389 1029084 1260771 921431 964130 913931 1022165 1051782 900425 984948
16387 984948 1207907 1000420 678945 937049 1007586 832870 1064616 1175062 996660 1099381
16377 1099381 946413 920960 1050016 922300 963579 971051 1063517 857026 1098990 786847
16367 786847 946123 909068 963417 1044943 883801 835528 913296 1358650 902058 756689
16357 756689 930855 757317 869987 881572 435261 895366 1233425 1017474 722057 663299
$$ packed form
16427A356207l48288O03651k11527k11705J22614k76987L58496J48221k91332
16418A249350j48753L3797L32504k25701r4077K2795l6923m4825j23646J51130
16408A115651J99668r6950M134L5114O9598n3860l31206P9138J35010j97912J74261
16397A132646k37257J33695K31687l39340M2699n0199J08234K9617j51357Q4523
16387I84948K22959k07487l21475K58104P0537j74716K31746J10446j78402J02721
16377A099381j52968k5453J29056j27716M1279P472R2466k06491K41964l12143
16367G86847J59276l7055N4349Q1526j61142m8273P7768M45354m56592j45369
16357G56689J74166j73538J12670J1585D35261M60105L38059k15951k95417n8758
$$ plain form
16347 663299 910921 997934 967220 643947 1089984 816654 699048 858581 705010 727683
16337 727683 1107740 670394 814768 775581 734932 688014 668626 280010 840895 768100
16327 768100 715674 867918 766961 542845 804542 683693 844316 719617 685849 757826
16317 757826 780279 760945 791952 769665 487279 682839 793000 862144 704356 727502 188682
16305 476519 496539 746019 329772 477422 751568 595156 476858 386608 460240 713069
16295 713069 536120 644572 606639 642467 687774 812804 637962 504695 909199 265062
16284 460199 583175 581988 373727 540052 350398 461065 523859 637265 795807 445749
16274 445749 695853 833183 128684 744262 468092 711045 433686 747675 436409 384951
$$ packed form
16347F63299K47622Q7013l0714l23273M46037k73330j17606J59533j53571K2673
16337G27683L80057m37346J44374l9187m0649m6918j9388B80010N60885p2795
16327G68100n2426J52244j00957k24116K61697j20849J60623j24699l3768P1977
16317G57826K2453j9334L1007k2287k82386J95560J10161O9144j57788K3146A88682
16305D76519K0020K49480C29772J47650K74146j56412j18298r0250P3632K52829
16295G13069j76949J08452l7933L5828M5307J25030j74842j33267M04504B65062
16284D60199J22976j187k08261J66325j89654J10667O2794J13406J58542l50058
16274D45749K50104J37330A28684O15578k76170K42953k77359L13989l11266n1458
$$ plain form
16264 384951 465258 697993 329373 380359 349163 510375 297033 695865 569379 500420
16254 500420 478580 488552 593300 731760 508823 720731 656254 220460 514908 510100 513330
16243 513330 435683 544876 431527 637523 379484 118340 460784 277539 2763 593086
16233 593086 423507 256876 426627 395163 315390 229958 745228 301520 577964 312000
16223 312000 613850 396157 310864 734988 417951 414662 449470 435517 169766 464056
16213 464056 357887 261522 79391 388076 359433 431609 264197 323842 276074 488603 422906
16202 422906 2244 230581 310922 99545 509130 272713 70685 554223 97021 433310 385414
16191 385414 414687 102557 165855 361131 372009 268211 385447 86491 152932 410251
$$ packed form
16264C84951Q0307K32735C29373N0986l1196J61212k13342L98832j26486o8959
16254E00420k1840R972J04748J38460k22937K11908o4477B20460K94448m808L230
16243E13330p7647J09193j13349K05996k58039A18340L42444j83245B763N90323
16233E93086j69579j66631J69751l1464p9773q5432N15270C01520K76444k65964
16223C12000L01850k17693q5293M24124l17037l289L4808j3953A69766K94290
16213D64056j06169r6365G9391L08685k8643P2176j67412N9645m7768K12529o5697
16202D22906B244K28337Q0341I9545M09585k36417G0685M83538I7021L36289m7896
16191C85414K9273A02557O3298J95276J0878j03798J17236H6491O6441K57319
$$ plain form
16181 410251 492150 342310 96350 434520 159513 94401 368273 293174 146037 325117
16171 325117 511282 480546 335472 210286 590862 289065 524164 260883 65538 50754
16161 50754 431455 211681 423288 371296 252622 -25863 124540 605951 197060 242940
16151 242940 120946 101451 197330 236953 375844 288906 301384 274789 184967 356020 622062
16140 622062 407202 32743 112555 195162 -18101 295036 381466 156387 -145418 438609
16129 55219 287058 183322 185836 520666 100657 479892 53125 770675 258391 385085
16119 385085 -102245 -158309 132242 -96565 215104 337962 169860 177071 453965 202589
16108 228789 116283 226805 -78369 344693 284213 27211 147577 282917 -138420 341337
$$ packed form
16181D10251Q1899j49840I6350L38170A59513o5112K73872p5099A46037J79080
16171C25117J86165l0736j45074j25186L80576B89065K35099B60883F5538j4784
16161E0754L80701B11681K11607n1992j18674b5863A24540M81411A97060M5880
16151B42940A20946j9495R5879L9623J38891q6938J2478k6595q9822J71053K66042
16140F22062k14860C2743P9812Q2607a8101B95036Q6430A56387a45418D38609
16129E5219K31839j03736K514L34830A00657L79235E3125P17550B58391J26694
16119C85085a02245n6064A32242i6565B15104J22858j68102P211K76894B02589
16108B28789j12506J10522g8369C44693o0480B7211J20366J35340a38420C41337
$$ plain form
16097 75643 402908 -7650 194414 465699 141704 24750 336919 66965 59693 430492 158660
16085 28847 310318 176400 -25231 139552 118657 34666 88028 415101 217435 74979 432242
16074 432242 361422 -161711 177748 237049 -23681 63810 81165 -180600 -54071 -61619 405720
16062 105366 258609 127610 84751 299892 -35562 -44319 80225 199338 112683 90287 -74779
16050 59332 90496 218217 211981 190074 133020 22274 42027 421423 271204 -5650 23050
16038 -37226 221965 -2178 82336 -224604 25108 175037 301292 400065 -87024 59295 251079
16027 251079 51880 143626 240074 138780 -82765 -371173 -64673 273156 203972 305665 -85441
16015 368482 435251 -334969 1689 -16802 123977 386989 113951 49529 89977 -67360 212890
$$ packed form
16097G5643L27265g650A94414K71285A41704B4750L12169F6965p272L70799A58660
16085B8847K81471j33918b5231A39552k0895C4666N3362L27073j97666G4979L57263
16074D32242p0820a61711A77748N9301b3681F3810J7355a80600e4071p548D05720
16062A05366J53243A27610m2859K15141c5562q757H0225J19113q6655k2396g4779
16050E9332L1164J27721o236k1907n7054B2274J9753L79396j50219e650B3050
16038c7226B21965b178H2336b24604B5108J49929J26255R8773h7024E9295J91784
16027B51079E1880R1746R6448j01294h2765k88408f4673B73156o9184J01693h5441
16015C68482O6769c34969A689a6802A23977K63012A13951D9529M0448f7360B12890
$$ plain form
16003 -116025 -135441 1130 -156541 -2713 223705 -73949 41620 9564 357321 -180230 148854
15991 -91007 48933 -95748 153818 -117917 365040 245463 280803 410105 73204 -1723 141082
15979 254185 122295 179268 407508 204590 207458 404196 457566 1121545 1114861 1418066 1267313
15968 1267313 991909 746323 473736 361708 -19408 399782 -135201 147530 4339 181984
15958 181984 110524 -33351 81619 -395290 24623 279843 -162039 164220 -162904 -185214
15948 -185214 53436 86370 -63329 -12276 -214445 145143 25725 -130385 -5220 -117135 47194
15936 126975 -168376 339448 13774 201673 -13643 -8810 -290305 115143 -202853 -65813
15925 -31274 -55367 350620 -184970 -161586 9961 45662 -151918 81580 -213854 119603 12397
$$ packed form
16003a16025j9416A130a56541b713B23705g3949D1620I564L47757a80230A48854
15991i1007D8933i5748A53818a17917C65040j19577L5340J29302G3204a723A41082
15979B54185A22295N6973K28240k02918K868J96738N3370O63979o684L03205j50753
15968A267313k75404k45586k72587j12028a9408C99782a35201A47530D339J77645
15958A81984p1460c3351H1619c95290B4623K55220a62039A64220a62904k2310
15948a85214E3436L2934f3329a2276k02169A45143B5725a30385e220j11915D7194
15936A26975a68376C39448A3774J87899a3643M833k81495A15143b02853f5813
15925c1274k4093C50620a84970K3384I961L5701a51918H1580b13854A19603A2397
$$ plain form
15913 -126956 -181419 -156624 22822 240766 267277 -185099 16442 102073 -89630 -253233 129198
15901 53700 -230119 34912 24842 -67708 -46524 254839 -150493 -134462 114619 -218391 -155718
15890 -155718 313986 -3556 -105939 146382 -138810 -2075 366972 11491 -39185 64387 259473
15879 259473 43932 -127538 57416 -197015 204749 70505 103022 -99274 37818 -188295 144793
15867 59597 134898 -23903 -27609 21211 -5950 113140 -336216 -65926 -401500 -193979 -241603
15856 -241603 161508 -259974 -139769 120228 169291 -63738 319248 89800 -138141 198092
15845 88504 455264 -33443 95652 -108168 -225855 -68718 -72993 -290376 -25210 124167 -13057
15833 -130153 -211328 127679 7224 -41315 -209121 12395 139302 74703 -142905 -68369 -72428
$$ packed form
15913a26956n4463K4795B2822K17944K6511a85099A6442Q5631h9630j63603A29198
15901E3700b30119C4912j0070f7708K1184B54839a50493J6031A14619b18391O2673
15890a55718C13986c556j02383A46382a38810b075C66972A1491c9185F4387J95086
15879B59473D3932a27538E7416a97015B04749G0505L2517i9274C7818a88295A44793
15867E9597P5301b3903l706B1211e950A13140c36216f5926l35574a93979m7624
15856b41603A61508b59974J20205A20228M9063f3738C19248H9800a38141A98092
15845H8504L66760c3443I5652a08168j17687f8718m275k17383b5210A24167a3057
15833a30153q1175A27679G224d1315j67806A2395J26907o4599a42905f8369m059
$$ plain form
15822 -72428 -118371 86782 -77746 -60204 44993 145839 -158474 -127476 -75992 32408 -209946
15810 -62019 231655 199072 -93701 -193656 231093 -112701 -370527 107970 -284184 -158872
15800 -158872 20038 -60261 -157848 13078 28448 -44102 89826 13676 -77342 136634 -18393
15788 -224398 151870 160786 228448 127609 -375052 -345048 -167167 -123197 -308116 -195352
15778 -195352 227398 16944 94949 -104112 147480 5006 72988 -164824 -93215 -219598 -74310
15766 125204 168742 -26046 38142 -114267 12529 -192914 107753 96565 143456 384946 -43468
15754 -314631 -215585 -130261 115859 142823 -89079 185025 147968 180617 168917 47249 168678
15743 168678 61930 145658 151399 -49145 -22679 53144 -138504 260033 560494 89801 309636
$$ packed form
15822g2428m5943H6782g7746J7542D4993J00846a58474L0998N1484C2408b09946
15810f2019B31655l2583i3701r9955B31093a12701k57826A07970b84184J25312
15800a58872B0038f0261r7587A3078J5370d4102H9826A3676g7342A36634a8393
15788b24398A51870Q916O7662j00839c75052L0004a67167M3970j84919J12764
15778a95352B27398A6944P8005a04112A47480E006O7982a64824P1609j26383g4310
15766A25204M3538b6046C8142a14267A2529a92914A07753j1188M6891K41490d3468
15754c14631R9046Q5324A15859K6964h9079A85025l7057L2649j1700D7249J21429
15743A68678F1930Q3728N741d9145b2679E3144a38504B60033L00461H9801K19835
$$ plain form
15732 309636 87908 323582 95935 61845 75225 -146729 -66620 -92249 -25272 -231766 5965
15720 -91617 -78919 -37729 4321 75962 -89296 73303 -45095 105477 112324 -55161 52134 191793
15708 191793 87064 -270604 140053 127947 -78198 192051 -4226 -92098 -128458 291060 112976
15696 -235466 -183251 54486 -372350 -205303 -240235 -275719 -65243 82463 -1468 -42328 35240
15684 -392318 -94191 445542 -206070 35988 17729 65729 -110799 166257 206267 7484 76109
15673 76109 -106611 17074 -32446 147408 -289895 -143688 35477 171552 52039 245469
15663 245469 -24581 -27054 51868 262082 -36520 149061 -120627 252238 198914 274613 -10479
15651 -89575 18412 96509 151964 -93159 19480 267490 -59763 -36430 -346527 -32391 -189960
$$ packed form
15732C09636H7908K35674I5935l4090J3380a46729f6620k5629b5272k06494E965
15720i1617J2698c7729D321P1641h9296G3303d5095A05477O847e5161E2134J39659
15708A91793H7064b70604A40053j2106g8198A92051d226q7872l6360B91060A12976
15696b35466N2215E4486c72350J67047l4932l5484f5243H2463a468m0860C5240
15684c92318i4191D45542b06070C5988A7729M8000a10799A66257M0010G484O8625
15673G6109a06611A7074c2446A47408b89895a43688C5477J36075E2039J93430
15663B45469b4581k473E1868K10214c6520A49061a20627B52238n3324P5699a0479
15651h9575A8412P8097N5455i3159A9480K48010e9763K3333l10097c2391j57569
$$ plain form
15640 -189960 -163451 133084 59501 -359349 186158 -331605 68970 236507 250965 -21522
15629 -120660 -142916 77099 -180906 -371997 -59228 -141155 38416 -128822 29847 -165924 -203186
15618 -203186 211984 -211951 -5112 -96343 -174273 103051 -167671 -116546 148569 -42911 292521
15606 70625 84523 -106368 95877 -13743 -161385 -7074 48665 -79712 -51383 -199143 -351300
15595 -351300 42147 134727 5509 -36713 -265757 191260 54760 -310737 -10147 -38707 -259477
15584 -259477 -70698 5332 13647 27398 263850 -304570 83821 131224 -270303 -118341 -22720
15572 212962 -95568 157072 332949 -159979 -2891 -139197 -119401 166490 -124860 -433290
15562 -433290 -74830 -73180 -54474 -235083 141796 -68165 71994 217144 -210585 -54995 -385185
$$ packed form
15640a89960K6509A33084E9501c59349A86158c31605F8970J67537J4458b1522
15629a20660k2256G7099a80906j91091e9228q1927C8416a28822B9847a65924l7262
15618b03186B11984b11951e112r1231p7930A03051a67671N1125A48569d2911B92521
15606G0625J3898a06368I5877a3743j47642g074D8665g9712K8329j47760j52157
15595c51300D2147R2580E509c6713k29044A91260E4760c10737a0147k8560k20770
15584b59477g0698E332Q315J3751K36452c04570H3821M7403b70303a18341b2720
15572B12962i5568A57072J75877a59979b891j36306J9796A66490a24860l08430
15562d33290g4830J650J8706j80609A41796f8165G1994J45150b10585e4995l30190
$$ plain form
15551 -385185 -43662 -144450 -200643 30219 -30074 222539 211042 -43900 30333 52396 -85441
15539 -57212 -461974 64667 -386243 -388984 -36552 255661 31722 401193 -60214 -98328 -114205
15528 -114205 90024 60760 250545 92215 317909 -124228 89494 899 108976 213716 87766
15516 34065 -75075 -53120 240731 -187892 166468 -80887 1105 -36156 -192368 526 178274
15505 178274 72544 24207 419717 73499 323075 168052 251968 123259 106476 307280
15495 307280 254680 99262 136644 224074 217528 -101655 152504 107880 30781 18001 212939
15484 212939 280745 287909 445653 346001 309409 -16739 92064 106880 79187 216677 224444
15473 224444 132588 220984 75836 -50020 -212645 181249 1908 -135667 -241786 33989 218519
$$ packed form
15551c85185d3662j00788n6193C0219c0074B22539j1497d3900C0333K2063h5441
15539e7212m04762F4667c86243k741c6552B55661C1722L69471f0214l8114j5877
15528a14205I0024k9264J89785I2215K25694a24228H9494H99J08077J04740H7766
15516C4065g5075K1955B40731a87892A66468h0887A105c6156j56212E26J77748
15505A78274G2544B4207L95510G3499K49576j55023Q3916A23259j6783K00804
15495C07280n2600I9262L7382Q7430o546a01655A52504m4624C0781j2780J94938
15484B12939O7806P164J57744r9652l6592a6739I2064J4816k7693J37490P767
15473B24444r1856Q8396G5836e0020j62625A81249A908a35667j06119C3989J84530
$$ plain form
15462 218519 385627 31506 400328 471993 563737 416552 277412 28462 13051 -19264 35145
15450 42694 -52791 -143565 -52489 134347 -259489 232953 230559 27448 -136765 -9211 77271
15438 335980 -12999 323763 -134336 -35412 202796 458902 287330 386385 676132 393401
15428 393401 406623 875202 731145 954944 441358 307773 516596 176413 215112 -25191
15417 361589 -166115 179372 -265864 -105203 124417 -222961 -233373 -117777 -29085 155947
15406 -77189 171247 75095 32326 -196426 101406 277284 -15211 -39285 -55879 -53068 56322
15394 -349647 -190149 -84914 -57204 -147205 118251 158672 78277 -71816 -26285 -66767 17643
15382 -167341 -25760 197609 -56282 -50824 313824 94297 -227625 66364 226114 -116954 -170583
$$ packed form
15462B18519J67108C1506L68822P1665R1744j47185j39140B8462A3051a9264C5145
15450D2694e2791r0774e2489A34347b59489B32953k394B7448a36765i211G7271
15438C35980a2999C23763a34336c5412B02796K56106j71572R9055K89747k82731
15428C93401J3222M68579j44057K23799D41358j33585K08823A76413L8699b5191
15417C61589a66115A79372b65864a05203A24417b22961j0412J15596b9085A55947
15406g7189A71247G5095C2326a96426A01406J75878a5211k4074j6594K811E6322
15394c49647J59498h4914K7710r0001A18251M0421G8277g1816b6285m0482A7643
15382a67341b5760A97609e6282N458C13824I4297b27625F6364J59750a16954n3629
$$ plain form
15371 -170583 36997 47727 -212765 -240634 -33071 150708 337110 -84269 185018 -20835 267488
15359 -93028 -1019 93658 141494 223790 378319 229794 56961 -85676 152303 197308 86889
15347 -80524 80741 129936 -88269 21559 162576 164839 1607 -50723 208077 23010 -24717 -246060
15335 -246060 297346 207954 407158 379167 2389 562436 403017 191553 323163 379428
15325 379428 477772 11006 287775 32750 227035 510038 97091 90814 -306561 280364 395680
15314 395680 -111971 81606 -68796 492998 -171812 252258 184116 -138392 47916 -166259
15303 158061 -218214 -201939 -5494 -44388 7616 -59148 152800 315936 68773 -122825 -178241
15292 -178241 558430 -29206 -1437 -196585 107996 296273 279879 216922 44808 256744 -38779
$$ packed form
15371a70583C6997J0730b12765k7869c3071A50708J86402h4269A85018b0835B67488
15359i3028a019I3658M7836Q2296J54529j48525E6961h5676A52303M5005H6889
15347h0524H0741M9195h8269B1559J41017K263A607e0723B08077B3010b4717k21343
15335b46060B97346q9392J99204k7991B389N60047j59419A91553J31610N6265
15325C79428R8344A1006K76769C2750J94285K83003I7091o277c06561B80364J15316
15314C95680a11971H1606f8796D92998a71812B52258o8142a38392D7916a66259
15303A58061b18214J6275e494l8894G616e9148A52800J63136F8773a22825n5416
15292a78241E58430b9206a437j95148A07996J88277j6394o2957D4808K11936c8779
$$ plain form
15280 -75424 152691 143736 157631 224161 142868 228069 -44075 -46254 17057 387350 260175
15269 260175 -225234 373145 53675 -190054 89665 46615 -269489 -66174 368548 -15710
15258 -26004 168506 166970 -14508 107145 161103 -33677 222576 62205 -150314 95273 61390
15247 61390 33212 291270 167460 -738 -141884 -168469 102227 214336 -304173 16928 -9233
15235 6764 179279 176443 404742 237291 285381 440166 770434 1674306 1151947 1274023
15225 1274023 1020498 884227 488285 72018 -58328 163668 112121 88220 71046 176814
15215 176814 -47309 -92267 274621 152505 52819 13982 -21706 -133246 227114 -124465
15204 -42926 215502 221663 -178603 -33065 -17419 170446 -35787 288791 203036 106007 44552
$$ packed form
15280g5424A52691q955J3895O6530q1293Q5201d4075k179A7057L70293j27175
15269B60175b25234C73145E3675a90054H9665m3050b69489f6174C68548a5710
15258b6004A68506j536a4508A07145N3958c3677B22576F2205a50314I5273l3883
15247F1390k8178K58058j23810g38j41146k6585A02227J12109c04173A6928i233
15235F764J72515k836K28299j67451M8090J54785L30268R03872n22359J22076
15225A274023k53525j36271l95942G2018e8328A63668n1547k3901j7174J05768
15215A76814d7309m4958B74621j22116E2819A3982b1706j11540B27114a24465
15204d2926B15502O161a78603c3065J5646A70446c5787B88791q5755r7029D4552
$$ plain form
15192 -10103 115165 34757 35280 242941 335191 19911 -59560 108603 -171477 190197 31267
15180 -362976 220477 352185 -17970 188052 273267 -25861 85605 498774 114280 348517
15170 348517 -25662 -86395 -255353 -104850 72797 84646 319964 44546 175223 -79308 103576
15158 13365 -206566 -118197 -62716 587556 156805 219722 18576 115224 68220 38378 379905
15147 379905 231182 254197 80196 177932 -208950 146809 49512 280218 67547 148383 245035
15136 245035 517465 -251639 253514 278442 271456 -188453 253886 286063 173511 -24109
15125 157592 271831 -215787 11512 108890 186623 208661 47378 134643 64107 149287 21587
15113 -162834 -44666 428952 63157 174547 361022 -165304 179919 445616 533746 230545
$$ packed form
15192a0103A15165C4757N23K07661R2250A9911e9560A08603a71477A90197C1267
15180c62976B20477J31708a7970A88052Q5215b5861H5605M13169A14280K34237
15170C48517b5662o0733j68958a04850G2797J1849K35318D4546J30677g9308A03576
15158A3365b06566Q8369N5481E87556A56805O2917A8576R6648m7004k9842L41527
15147C79905j48723K3015H0196R7736b08950A46809D9512K30706F7547Q0836R6652
15136B45035K72430b51639B53514K4928o986a88453B53886L2177j12552b4109
15125A57592J14239b15787A1512R7378P7733K2038D7378Q7265F4107Q5180B1587
15113a62834d4666D28952F3157J11390J86475a65304A79919K65697Q8130B30545
$$ plain form
15102 289080 376418 152554 176598 265638 475926 -49835 -4392 -268302 -34450 354323 358456
15091 358456 -72946 -135581 -95816 174878 394942 -120209 -332895 110878 156841 -36813
15080 102402 20325 106472 -102165 202596 130667 121384 68015 56953 226051 55045 -117404
15068 -19198 274717 284930 296334 -26716 288562 128321 216980 20435 38204 340087 270301
15057 270301 73302 168192 233700 -179928 252080 -86763 436774 371773 223517 203214 161962
15046 161962 303466 329804 46639 41686 300353 482111 45392 170715 440160 -84339 285545
15034 210270 479468 198820 461312 -25958 347084 221629 540254 396226 319955 255728
15024 255728 227466 459019 333395 311873 634956 294927 338120 411746 544879 761322
$$ packed form
15102B89080Q7338A52554K4044Q9040K10288d9835d392k63910c4450C54323M133
15091C58456g2946o2635L9765A74878K20064a20209k12686A10878M5963c6813
15080A02402B0325Q6147a02165B02596p1929r283n3369j1062J69098E5045a17404
15068a9198B74717J0213J1404b6716B88562A28321Q8659B0435J7769L01883o9786
15057B70301G3302R4890O5508a79928B52080h6763D36774o5001j48256k0303m1252
15046A61962J41504K6338D6639m953K58667J81758D5392J25323K69445h4339B85545
15034B10270K69198A98820K62492b5958C47084j25455L18625j44028p6271o4227
15024B55728k8262K31553j25624k1522L23083B94927M3193P3626J33133K16443
$$ plain form
15014 761322 877917 223786 491984 466463 451609 512579 55351 471177 539186 525612 511966
15003 511966 560389 326292 629632 462521 452877 -25254 619789 237007 211179 332984
14993 332984 389437 513885 587032 323577 305464 374332 270724 447360 579174 671747
14983 671747 309705 496116 475396 449592 521116 160471 454923 466328 399288 361867 342869
14972 342869 513994 829613 532102 441359 868105 304524 678355 755577 614445 652881
14962 652881 509907 678724 566995 731832 544701 649262 829637 553146 582905 394847
14952 394847 448916 331927 280000 441402 210038 448255 360651 347148 197433 348651
14942 348651 421382 141059 -22088 445053 419154 254974 471919 262278 443043 130712
$$ packed form
15014G61322J16595B23786K68198k5521j4854O0970E5351M15826O8009j3574j3646
15003E11966M8423k34097L03340j67111r644b5254F19789B37007k5828J21805
14993C32984N6453J24448P3147k63455j8113O8868j03608J76636J31814R2573
14983F71747C09705J86411k0720k5804P1524A60471K94452J1405o7040l7421j8998
14972C42869J71125L15619k97511r0743M26746C04524L73831P7222j41132L8436
14962F52881j42974J68817j11729J64837j87131J04561J80375k76491K9759j88058
14952C94847N4069j16989n1927J61402B10038K38217q7604j3503j49715J51218
14942C48651P2731A41059b2088D45053k5899j64180K16945k09641J80765A30712
$$ plain form
14931 498606 406111 678771 805925 452039 798190 264382 546858 485200 762225 550808
14921 550808 366070 602327 445390 893604 564876 826370 1200483 1184886 1449847 1332640
14911 1332640 1603434 1708941 1572927 1481847 1219253 1406787 1485167 1304308 1721713 1587624
14901 1587624 1949997 1757960 1470069 1136156 1211491 928699 608448 746753 622543 595490
14891 595490 669495 944495 545701 548549 392427 202343 493140 464368 361634 365583 278750
14880 278750 391942 528553 627384 619878 495869 516974 500186 652724 664994 881142 626799
14869 626799 554318 708033 879302 491517 729249 726984 603071 590161 499076 582159 830856
14858 830856 496413 604719 734111 553331 304878 355475 797277 561576 611629 760895
$$ packed form
14931D98606r2495K72660J27154l53886L46151B64382K82476o1658K77025k11417
14921E50808j84738K36257j56937M48214l28728K61494L74113j5597K64961j17207
14911A332640K70794J05507j36014r1080k62594J87534P8380j80859M17405j34089
14901A587624L62373j92037k87891l33913P5335k82792l20251J38305j24210k7053
14891E95490P4005K75000l98794K848j56122j90084K90797k8772j02734L949q6833
14880B78750J13192J36611R8831p506j24009K1105j6788J52538J2270K16148k54343
14869F26799p2481J53715J71269l87785K37732k265j23913j2910r1085Q3083K48697
14858H30856l34443J08306J29392j80780k48453N0597M41802k35701N0053J49266
$$ plain form
14848 760895 607518 547553 746256 563262 348591 626165 377669 199009 400818 692121
14838 692121 395601 574508 712902 502172 534831 367808 765438 304469 836039 964847
14828 964847 714437 896112 1367297 726662 833220 771702 844393 583527 982688 476419
14817 579057 318594 450852 741115 355503 405461 493237 505279 646227 436784 677471
14807 677471 761852 585679 671920 746799 926429 938296 629132 752768 588996 504852
14797 504852 750692 623171 865445 777312 640082 834316 702274 800995 595615 780321
14787 780321 778339 657171 784178 886284 609170 677458 376038 1027752 633424 903809
14777 903809 683469 352525 798863 530039 1043889 520336 671091 836472 710321 709881
$$ packed form
14848G60895j53377n9965J98703j82994k14671K77574k48496j78660K01809K91303
14838F92121k96520J78907J38394k10730L2659j67023L97630C04469N31570J28808
14828I64847k50410J81675M71185o40635J06558o1518P2691k60866L99161D76419
14817E79057k60463J32258K90263C55503M9958Q7776J2042J40948k09443K40687
14807F77471Q4381j76173Q6241P4879J79630J1867l09164J23636j63772q4144
14797E04852K45840j27521K42274q8133j37230J94234j32042R8721k05380J84706
14787G80321j982j21168J27007J02106k77114O8288l01420O51714l94328K70385
14777I03809k20340l30944M46338k68824N13850E20336J50755J65381j26151m40
$$ plain form
14767 709881 429937 906009 786304 125681 525581 950564 693473 718307 813412 998269
14757 998269 1176453 989648 299108 643934 412611 630426 841913 423440 689964 468155
14747 468155 471384 561719 532307 391334 420067 361239 530980 572534 638785 592384 512943
14736 512943 553468 551424 563768 459459 820124 729839 670805 558973 684959 457746 661268
14725 661268 756071 992148 644325 694703 766553 865497 1111007 696593 705660 1138583 854036
14714 854036 868929 1394107 1301045 1430858 1409397 1661213 1552410 1330271 1189181 923725
14704 923725 794070 942383 1218337 1139672 739666 950560 807211 914352 902796 777938
14694 777938 721646 916793 1102396 687382 1336202 1187089 1396464 1160446 1571233 1870284
$$ packed form
14767G09881k79944M76072j19705A25681L99900M24983k57091K4834R5105J84857
14757I98269J78184j86805B99108L44826k31323K17815K11487m18473K66524k21809
14747D68155L229R0335k9412j40973K8733n8828J69741M1554O6251m6401p9441
14736E12943M0525k044J2344j04309L60665r0285n9034j11832J25986k27213K03522
14725F61268R4803K36077l47823N0378P1850R8944K45510m14414R067M32923k84547
14714H54036J4893N25178r3062J29813k1461K51816j08803k22139j41090k65456
14704I23725j29655J48313K75954p8665m00006K10894j43349J07141j1556j24858
14694G77938n6292J95147J85603m15014O48820j49113K09375k36018M10787K99051
$$ plain form
14684 1870284 1774277 1524622 1180101 1601159 1243510 1242504 1165157 1192971 805546 934330
14674 934330 705068 1022016 1075209 503884 1173019 850104 753197 1174564 842915 889622
14664 889622 770745 930930 1006838 1152185 1327457 1007384 1023153 1159149 734732 1000965
14654 1000965 659222 908602 1315615 1233975 959990 1104105 1393425 1181130 1193710 1394960
14644 1394960 1189657 759540 1128333 1112632 1396557 1224577 848169 1468045 1349365 1271139
14634 1271139 1289523 1388702 1189653 1420070 1383400 1031742 1057899 1237403 1351126 1214915
14624 1214915 1154389 1311092 1173448 1040996 1121812 1209293 1443939 1662272 1282450 1463540
14614 1463540 1399096 1459831 1541852 1176175 1211051 1415708 1176454 912255 1150956 1269205
$$ packed form
14684A870284r6007k49655l44521M21058l57649j006p7347K7814l87425J28784
14674I34330k29262L16948N3193E03884O69135l22915r6907M21367l31649M6707
14664H89622j18877J60185P5908J45347J75272l20073J5769J35996m24417K66233
14654A000965l41743K49380M07013q1640k73985J44115K89320k12295J2580K01250
14644A394960k05303m30117L68793j5701K83925j71980l76408O19876j18680p8226
14634A271139J8384R9179j99049K30417l6670l51658K6157J79504J13723j36211
14624A214915o0526J56703j37644j32452Q0816Q7481K34646K18333l79822J81090
14614A463540o4444O0735Q2021l65677L4876K04657k39254k64199K38701J18249
$$ plain form
14604 1269205 1253873 1731135 1524528 1519251 1455585 1340698 1269493 1277827 1620044 1430334 1487649
14593 1487649 1540701 1916128 1321616 1577800 1736041 1354686 1931582 1698911 1740730 1817993
14583 1817993 1751513 1838268 1619385 1485160 1907780 1384105 1891624 1523070 1803588 1821370
14573 1821370 1973023 1711716 1796128 1898068 1771062 1427110 1957314 2115850 1775655 1927595
14563 1927595 1905572 2319007 1879178 1911819 2045769 2231886 1993292 2332624 2196188 2405385
14553 2405385 2331948 2383394 2342034 2321266 2579869 2488415 2553361 2852562 2952689 3191512
14543 3191512 3155574 3117001 3376600 3782482 4385134 4549827 5259238 6092786 7238920 9299202
14533 9299202 13476048 20159349 30697430 30971516 18480193 10592281 7044388 5256857
$$ packed form
14604A269205j5332M77262k06607n277o3666j14887p1205Q334L42217j89710N7315
14593A487649N3052L75427n94512K56184J58241l81355N76896k32671M1819P7263
14583A817993o6480Q6755k18883j34225M22620n23675N07519l68554K80518J7782
14573A821370J51653k61307Q4412J01940j27006l43952N30204J58536l40195J51940
14563A927595k2023M13435m39829L2641J33950J86117k38594L39332j36436K09197
14553B405385p3437N1446m1360k0768K58603r1454O4946K99201J00127K38823
14543C191512l5938l8573K59599M05882O02652J64693P09411Q33548J146134K060282
14533I299202M176846O683301J0538081K74086j2491323p887912l547893j787531
$$ plain form
14525 5256857 4967155 5430911 4109442 3463114 2967425 2418981 2427275 2703449 1872838 2312149
14515 2312149 2316453 2610519 2155098 2156118 2344788 2331885 2394107 2379037 2165996 2467809 2228368
14504 2228368 2433903 2625209 2363338 2809317 2980431 2581698 2678997 2616032 2879778 2798970
14494 2798970 2560608 3025539 3055455 2834627 2681188 2642821 2893930 2886238 3233481 3004299
14484 3004299 3186602 3613857 3039665 3341834 3278586 3339307 3313410 3135295 3521209 3500317
14474 3500317 3414326 3267785 3751084 3793167 3725792 3968817 3721676 3886733 3707520 4161739
14464 4161739 3700785 4301719 3861502 4060263 3935424 3940262 4190393 4137757 4254770 4351144
14454 4351144 4197842 4362571 4314523 4411384 4622790 4581411 4841815 4822615 4740706 4648533
$$ packed form
14525E256857k89702M63756j321469o46328m95689n48444Q294K76174q30611M39311
14515B312149M304K94066m55421J020J88670j2903O2222j5070k13041L01813k39441
14504B228368K05535J91306k61871M45979J71114l98733R7299o2965K63746q0808
14494B798970k38362M64931K9916k20828j53439l8367K51109p692L47243k29182
14484C004299J82303M27255n74192L02169o3248O0721k5897j78115L85914k0892
14474C500317q5991j46541M83299M2083o7375K43025k47141J65057j79213M54219
14464D161739m60954O00934m40217J98761j24839M838K50131n2636J17013R6374
14454D351144j53302J64729m8048R6861K11406m1379K60404j9200q1909r2173
$$ plain form
14444 4648533 4817788 4926783 5376399 5023537 5321895 5033974 5269948 5142338 5229598 5183016
14434 5183016 5194957 5386506 5792317 5480958 5562121 5923086 5806023 5929100 6326034 6039391
14424 6039391 6310832 6347725 6327790 6446172 6777617 6902295 6737311 6634781 6987300 7192677
14414 7192677 6948404 7009341 7342260 7320537 7774153 7673078 7744387 8040018 8403541 8497627
14404 8497627 8641352 8793188 8872610 9036482 8793801 8768618 8795610 9079616 9289329 8809378
14394 8809378 9065900 9554486 9573454 9605584 10563229 10441097 10513157 11115077 10535622 10935008
14384 10935008 10706298 10819738 11440582 11423115 11722553 11967216 11991210 12466101 12137300 12546471
14374 12546471 12937815 12994884 13549342 13463778 14085337 14067900 14049501 14498671 15159943 15399631
$$ packed form
14444D648533J69255J08995M49616l52862K98358k87921K35974j27610Q7260m6582
14434E183016J1941J91549M05811l11359Q1163L60965j17063J23077L96934k86643
14424F039391K71441L6893j9935J18382L31445J24678j64984j02530L52519K05377
14414G192677k44273O0937L32919k1723M53616j01075P1309K95631L63523R4086
14404H497627J43725J51836P9422J63872k42681k5183K6992K84006K09713m79951
14394H809378K56522M88586J8968L2130R57645j22132P2060O01920n79455L99386
14384A0935008k28710J13440O20844j7467K99438K44663K3994M74891l28801M09171
14374A2546471L91344N7069N54458q5564O21559j7437j8399M49170O61272K39688
$$ plain form
14364 15399631 15604863 15957684 16185417 16212800 16583585 17040612 17461196 17420676 17861222 18343177
14354 18343177 18776532 18864551 19605192 20213920 20817342 20900719 21358700 21495658 22307837 22694132
14344 22694132 22972864 23861809 24354962 24618483 25186186 25853354 26220285 26978460 27759258
14335 27759258 28493968 29144154 29820465 30998633 31490267 32486489 33311701 33810298 35171344
14326 35171344 36186553 37235763 38663165 39562158 40400445 41887104 43063834 44564468
14318 44564468 45740888 47339565 48590199 50433607 51841518 53472221 55482054 56982639
14310 56982639 59063777 60985008 63202452 65698969 67730788 70109107 73361877 75749644
14302 75749644 78595464 81576903 84498275 88264127 91886572 95484608 99765527 104048041
$$ packed form
14364A5399631K05232L52821K27733K7383L70785M57027M20584m0520M40546M81955
14354A8343177M33355Q8019P40641O08728O03422Q3377M57981J36958Q12179L86295
14344B2694132K78732Q88945M93153K63521N67703O67168L66931P58175P80798
14335B7759258P34710O50186O76311J178168M91634R96222Q25212M98597J361046
14326C5171344J015209J049210J427402Q98993Q38287J486659J176730J500634
14318D4564468J176420J598677J250634J843408J407911J630703K009833J500585
14310E6982639K081138J921231K217444K496517K031819K378319L252770K387767
14302G5749644K845820K981439K921372L765852L622445L598036M280919M282514
$$ plain form
14294 104048041 108740060 113192860 118085140 123806677 129785687 135373335 142300773 148824621
14286 148824621 156119876 163788227 172013643 180896255 189820598 199370296 209439304 220372228
14278 220372228 232028137 243933086 256329949 269734634 283310132 297315226 311401102
14271 311401102 325441541 339926253 353545094 367360311 380489947 392541825 403979616
14264 403979616 414764409 424565835 433165880 440908235 448212691 454212860 458340917 459347385
14256 459347385 459529884 459678718 455594852 448332153 442219402 432233448 421996806 408557233
14248 408557233 395800168 381684368 367020389 352907703 338996488 325225678 311278203
14241 311278203 297770355 284253557 270815244 258470183 245976617 234854736 224028388
$$ packed form
14294A04048041M692019M452800M892280N721537N979010N587648O927438O523848
14286A48824621P295255P668351Q225416Q882612Q924343R549698J0069008J0932924
14278B20372228J1655909J1904949J2396863J3404685J3575498J4005094J4085876
14271C11401102J4040439J4484712J3618841J3815217J3129636J2051878J1437791
14264D03979616J0784793R801426Q600045P742355P304456O000169M128057J006468
14256D59347385J82499J48834m083866p262699o112751r985954j0236642j3439573
14248D08557233j2757065j4115800j4663979j4112686j3911215j3770810j3947475
14241C11278203j3507848j3516798j3438313j2345061j2493566j1121881j0826348
$$ plain form
14234 224028388 214182739 203171954 192325647 182354418 173170875 164914838 156631319 148982885
14226 148982885 141827618 135325122 128916235 123190632 117957812 112505674 107368187 103066944
14218 103066944 98920052 94714609 90927904 87279803 83797215 80549853 77609167 74719742
14210 74719742 71948963 69149350 66720804 64123141 62101009 60186657 58238943 56244447
14202 56244447 54363363 52572372 50923028 49312299 48071259 46796077 45173035 43884951
14194 43884951 42671210 41375543 40813661 39367334 38264911 37441185 35770312 34961635
14186 34961635 34252327 33370851 32574034 31700755 30664465 29968807 29614266 28669705 27864366
14177 27864366 27311123 26592001 25810786 25369850 24807886 24224062 23495516 23196022 22715092
$$ packed form
14234B24028388r845649j1010785j0846307r971229r183543q256037q283519p648434
14226A48982885p155267o502496o408887n725603n232820n452138n137487m301243
14218A03066944m146892m205443l786705l648101l482588l247362k940686k889425
14210G4719742k770779k799613k428546k597663k022132j914352j947714j994496
14202E6244447j881084j790991j649344j610729j241040j275182j623042j288084
14194D3884951j213741j295667n61882j446327j102423q23726j670873q08677
14186C4961635p09308q81476p96817q73279j036290o95658l54541r44561q05339
14177B7864366n53243p19122p81215m40936n61964n83824p28546k99494m80930
$$ plain form
14168 22715092 22471160 21694830 21079781 20830866 20387556 19863056 19664396 19039231 19039732 18398338
14158 18398338 18126702 17432711 17295110 16918343 16500827 16624036 16196246 16071809 15384263
14149 15384263 15292512 14823789 15026911 14511616 14237518 14246001 13324627 13678601 13242719 12969994
14139 12969994 12856058 12953945 12184032 11946238 12010044 11600781 11664531 11513830 11116208 11334784
14129 11334784 10916490 10741534 10196866 10445336 10022970 10164875 9903878 10070535 9966709
14120 9966709 9468148 9472357 9253068 8955817 8940161 8831950 8773724 8775006 8443597 8465340 8010360
14109 8010360 8315024 7949454 7660199 7983307 7591044 7818929 7527970 7269082 7017423
14100 7017423 7198728 7183286 6773682 6804002 6877284 6908443 6712482 7124744 6525875 6780412
$$ packed form
14168B2715092k43932p76330o15049k48915m43310n24500j98660o25165N01o41394
14158A8398338k71636o93991j37601l76767m17516J23209m27790j24437o87546
14149A5384263r1751m68723K03122n15295k74098Q483r21374L53974m35882k72725
14139A2969994j13936R7887p69913k37794O3806m09263O3750j50701l97622K18576
14129A1334784m18294j74956n44668K48470m22366J41905k60997J66657j03826
14120I966709m98561M209k19289k97251j5656j08211n8226J282l31409K1743m54980
14109H010360L04664l65570k89255L23108l92263K27885k90959k58888k51659
14100G017423J81305j5442m09604L0320P3282L1159j95961M12262n98869K54537
$$ plain form
14090 6780412 6485059 6489495 6377973 6244419 6060197 5885510 5765776 6050934 5648199 5627436
14080 5627436 5717252 5462478 5321439 5349399 5411520 5110519 5156755 5558811 5115177 5118064
14070 5118064 5199603 5049561 5008322 4980804 4813896 4680975 4639428 5006615 4537268 4285658
14060 4285658 4399875 4409026 4444650 4388813 4534758 4282558 4207165 4352006 4519548 4128986
14050 4128986 4263773 4148245 4348397 3945944 4140349 4111730 4047649 3899200 3972091 3805612
14040 3805612 3967518 3570769 3633912 3720264 3807669 3318982 3408579 3954656 3565262 3163838
14030 3163838 3495582 3165152 3055778 3216218 3433822 3148725 3227874 3249082 2922889 2634940
14020 2634940 3158938 3140678 3348203 3365564 3044873 3371190 3193524 3126535 3350147 2891203
$$ packed form
14090F780412k95353M436j11522j33554j84222j74687j19734K85158m02735k0763
14080E627436Q9816k54774j41039K7960O2121l01001M6236M02056m43634K887
14070E118064Q1539j50042m1239k7518j66908j32921m1547L67187m69347k51610
14060D285658J14217R151L5624n5837J45945k52200p5393J44841J67542l90562
14050D128986J34787j15528K00152m02453J94405k8619o4081j48449P2891j66479
14040C805612J61906l96749O3143Q6352Q7405m88687Q9597N46077l89394m01424
14030C163838L31744l30430j09374J60440K17604k85097P9149K1208l26193k87949
14020B634940N23998j8260K07525J7361l20691L26317j77666o6989K23612m58944
$$ plain form
14010 2891203 2594049 2740143 3026695 2707491 2900133 2410418 2634511 2394544 2952106
14001 2952106 2805049 2592109 2185958 2790951 2461916 2809461 2597976 2626430 2510334 1993028
13991 1993028 1944994 2352545 2329119 2264794 2160697 2209054 2274374 2212485 2365504 2292751 2452398
13980 2452398 2599837 2754287 2860101 3438468 4009062 4547037 5961585 8916335 14807384
13971 14807384 25340910 32626626 22727301 14647354 9993053 7339555 5636504 4950260
13963 4950260 4722110 3763153 3718727 3226119 3074416 3043230 2991103 3011731 2648770 2711610
13953 2711610 2487272 2403611 2633230 2213007 2319107 2066825 2386881 2298886 2179552 2274419
13943 2274419 2494889 1943207 1878036 2099443 1783879 2032424 1968423 1852851 1875094 1933074
$$ packed form
14010B891203k97154J46094K86552l19204J92642m89715K24093k39967N57562
14001B952106j47057k12940m06151O04993l29035L47545k11485K8454j16096n17306
13991A993028m8034M07551k3426o4325j04097M8357O5320o1889J53019p2753J59647
13980B452398J47439J54450J05814N78367N70594N37975J414548K954750N891049
13971A4807384J0533526P285716r899325q079947m654301k653498j703051o86244
13963D950260k28150r58957m4426m92608j51703l1186n2127K0628l62961O2840
13953B711610k24338q3661K29619m20223J06100k52282L20056q7995j19334R4867
13943B274419K20470n51682o5171K21407l15564K48545o4001j15572K2243N7980
$$ plain form
13933 1933074 2144306 1992558 1951632 1892548 1981265 1838317 1664563 1961932 2049530 1782176
13923 1782176 1852930 1760544 1844632 1738873 1625730 1719988 1897614 1721290 1854441 1489468
13913 1489468 1731026 1700296 1609482 1590796 1635749 1537089 1338900 1556055 1699669 1536905
13903 1536905 1539909 1783967 1568786 1333361 1734421 1674469 1569693 1343519 1690338 1267405
13893 1267405 1465424 1408146 1382610 1357896 1589696 1492014 1304762 1391518 1187978 1422414
13883 1422414 1018494 1479961 1234147 1101083 1208132 829624 1241184 1346887 1383981 1419406
13873 1419406 1330066 1408521 980957 1204804 1122754 1303478 1448832 968748 987171 1199268
13863 1199268 1143823 1412188 1131768 1023163 1436153 1265182 1234440 1155973 1073168 985185
$$ packed form
13933A933074K11232j51748m0926n9084Q8717j42948j73754K97369Q7598k67354
13923A782176P0754r2386Q4088j05759j13143R4258J77626j76324J33151l64973
13913A489468K41558l0730r0814j8686M4953r8660j98189K17155J43614j62764
13903A536905L004K44058k15181k35425M01060n9952j04776k26174L46819m22933
13893A267405J98019n7278k5536k4714K31800r7682j87252Q6756k03540K34436
13883A422414m03920M61467k45814j33064J07049l78508M11560J05703L7094L5425
13873A419406q9340P8455m27564K23847q2050J80724J45354m80084J8423K12097
13863A199268n5445K68365k80420j08605M12990j70971l0742p8467q2805q7983
$$ plain form
13853 985185 1414263 888081 966323 1102447 1290598 1085199 1316399 1469969 1177165 1125217
13843 1125217 1157817 1340792 1083436 1147658 1434805 967103 1101744 932691 1116399 851960
13833 851960 1143023 822993 1212954 928111 1220597 822116 728354 1098154 761282 708409
13823 708409 1091540 745562 846239 847215 763558 900563 827699 846181 1087060 1091428 1008989
13812 1008989 749374 942256 795993 1009576 1147478 1139290 993895 647273 618804 881234
13802 881234 1044164 846433 1107211 739945 875906 979893 665913 860078 874776 1058398
13792 1058398 747040 859039 884447 819690 1109821 736536 943032 645080 737255 754625
13782 754625 891278 559145 628647 750230 974581 732796 749436 785775 579367 879680
$$ packed form
13853I85185M29078n26182P8242J36124J88151k05399K31200J53570k92804n1948
13843A125217L2600J82975k57356O4222K87147m67702J34641j69053J83708k64439
13833H51960K91063l20030L89961k84843K92486l98481r3762L69800l36872n2873
13823G08409L83131l45978J00677R76q3657J37005p2864J8482K40879M368q2439
13812A008989k59615J92882j46263K13583J37902q188j45395l46622k8469K62430
13802H81234J62930j97731K60778l67266J35961J03987l13980J94165J4698J83622
13792A058398l11358J11999K5408o4757K90131l73285K06496k97952R2175J7370
13782G54625J36653l32133O9502J21583K24351k41785J6640L6339k06408L00313
$$ plain form
13772 879680 984984 672248 700910 446597 867421 767832 748714 694723 821365 968190
13762 968190 891428 511291 886827 732138 491460 970629 668996 400201 753818 673457
13752 673457 735591 793651 641089 545105 943026 769260 827653 659844 609652 608406 916738
13741 916738 743972 420748 574387 640687 384956 856178 456572 627176 856581 595966
13731 595966 733798 773706 685776 648667 903707 416816 886640 781479 682801 236963
13720 945118 642465 641405 684571 321701 502590 725533 564657 520518 440532 321301
13710 321301 436226 412307 790917 668123 398710 436197 670307 714844 941348 535973
13700 535973 463475 356394 537592 553414 414279 482788 322907 363896 522501 657532
$$ packed form
13772H79680J05304l12736K8662k54313M20824r9589j9118n3991J26642J46825
13762I68190p6762l80137L75536j54689k40678M79169l01633k68795L53617q0361
13752F73457O2134N8060j52562r5984L97921j73766N8393j67809n0192j246L08332
13741I16738j72766l23224J53639O6300k55731M71222l99606J70604K29405k60615
13731E95966J37832L9908q7930l7109K55040D16816M69824j05161r8678B36963
13720I45118l02653j060M3166C21701J80889K22943j60876m4139p9986j19231
13710C21301J14925k3919L78610j22794k69413L7487K34110M4537K26504m05375
13700E35973p2498j07081J81198J5822j39135O8509j59881M0989J58605J35031
$$ plain form
13690 657532 527387 633536 396654 667594 671685 541632 480147 548867 317932 594734
13680 594734 340639 811824 301833 743858 562040 658254 562534 686202 692938 593898
13670 593898 325394 448188 433743 229603 339722 499979 785316 926217 706971 398608
13660 398608 559592 217387 410120 576061 600060 453934 412386 600252 289254 479322
13650 479322 160481 436566 671341 448145 353546 331409 360428 585396 397593 485235
13640 485235 380903 797365 432505 384693 368527 618099 211746 578725 412448 143806
13629 144779 551928 522033 575363 315950 504818 548912 230154 230191 557235 295252 478151
13618 478151 483485 362539 332489 591776 580541 357682 631808 553318 418213 241031
$$ packed form
13690F57532j30145J06149k36882K70940M091j30053o1485O8720k30935K76802
13680E94734k54095M71185C01833M42025j81818R6214r5720J23668O736r9040
13670E93898k68504J22794j4445k04140J10119J60257K85337J40901k19246l08363
13660C98608J60984B17387J92733J65941K3999j46126m1548J87866B89254J90068
13650D79322A60481K76085K34775k23196r4599k2137K9019K24968j87803Q7642
13640D85235j04332M16462l64860m7812j6166K49572B11746L66979j66277A43806
13629A44779M07149k9895N3330k59413J88868M4094B30154L7L27044k61983J82899
13618D78151N334j20946l0050K59287j1235k22859K74126p8490j35105j77182
$$ plain form
13608 241031 232881 558152 31385 430128 474308 257912 395142 293211 411861 182624
13597 297658 99870 145023 737848 508469 358332 631370 402881 332233 106525 355825
13587 355825 457456 546673 607272 440933 370747 470975 498157 498608 239911 195436 -45417
13575 303483 127500 329855 210939 244745 441418 425769 453185 104439 174191 362841
13565 362841 455099 185960 138551 374756 383311 291841 498142 462548 237811 232827 422900
13554 422900 229666 145632 161849 494236 360049 129320 384692 309047 287140 237301
13544 237301 631582 163186 524674 318285 486674 206191 378427 205656 210521 355851
13534 355851 396476 579304 51803 229113 353831 -111440 295683 306428 283738 390365
$$ packed form
13608B41031q150L25271C1385L98743M4180k16396J37230j01931J18650A82624
13597B97658I9870M5153N92825k29379j50137K73038k28489p0648A06525K49300
13587C55825J01631Q9217O0599j66339p0186J00228K7182M51B39911m4475d5417
13575C03483A27500K02355j18916L3806J96673j5649K7416A04439O9752J88650
13565C62841R2258A85960m7409K36205Q555r1470K06301l5594k24737m984J90073
13554D22900j93234q4034J6217L32387j34187A29320K55372p5645k1907m9839
13544B37301L94281A63186L61488k06389J68389B06191J72236j72771M865J45330
13534C55851M0625J82828E1803J77310J24718a11440B95683J0745k2690J06627
$$ plain form
13524 390365 438333 228574 -18001 498709 680315 281734 78931 287635 417106 365071
13514 365071 -6184 432188 517852 250856 235321 197896 -8999 89124 390795 525201 285869
13503 285869 52487 348169 78917 -33177 425452 145145 399840 12313 184814 310379
13493 310379 211464 147109 317082 248646 391505 51198 451667 438414 356176 345730 255182
13482 255182 70906 383999 324976 508175 339966 -95735 154823 184650 363431 397485
13472 397485 69486 48543 166424 187353 312489 518547 -79021 206394 230478 336495
13462 336495 196561 216208 71699 388864 300471 508635 279079 131741 554223 196417
13451 -41517 247007 146601 81307 349862 208732 261485 -122366 309847 151693 -59418
$$ packed form
13524C90365M7968k09759a8001D98709J81606B81734G8931K08704J29471n2035
13514C65071f184D32188Q5664B50856j5535l7425h999H9124L01671J34406k39332
13503B85869E2487K95682G8917c3177D25452A45145K54695A2313J72501J25565
13493C10379r8915o4355J69973o8436J42859E1198M00469j3253q2238j0446r0548
13482B55182G0906L13093n9023J83199j68209i5735A54823K9827J78781L4054
13472C97485F9486k0943J17881K0929J25136K06058g9021B06394K4084J06017
13462C36495j39934J9647G1699L17165q8393K08164k29556A31741M22482A96417
13451d1517B47007j00406o5294K68555j41130N2753a22366C09847A51693e9418
$$ plain form
13440 202445 202767 461636 136132 37569 -95573 -105287 308455 190378 -8035 268087 216247
13429 216247 286871 119158 203155 113961 152418 128377 138464 345438 327904 230840 88642
13417 257288 577234 144674 300788 271416 289978 -71001 65796 136235 195923 26301 484010
13406 484010 361377 435735 289008 -8236 74557 291541 -31071 260052 227463 231469 -32110
13394 104230 307371 -1954 210739 484889 193165 151209 98212 310809 71821 382093
13384 382093 218128 -113133 298349 95082 -25264 76843 198790 175812 365683 52066
13373 394693 388911 -180379 45015 134455 90342 11536 88254 18598 403280 392411 333825
13362 333825 149877 -63037 331626 -6385 595340 76425 462813 239206 327817 511268
$$ packed form
13440B02445L22K58869A36132C7569i5573r714C08455j18077h035B68087n1840
13429B16247P0624A19158Q3997q9194L8457k4041J0087K06974j7534r7064H8642
13417B57288L19946A44674J56114k9372J8562g1001F5796P0439N9688B6301M57709
13406D84010j22633P4358j46727h236G4557K16984c1071B60052l2589M006c2110
13394A04230K03141a954B10739K74150A93165m1956n2997K12597G1821L10272
13384C82093j63965a13133B98349I5082b5264G6843J21947k2978J89871E2066
13373C94693n782a80379D5015Q9440m4113A1536P6718A8598L84682j0869n8586
13362C33825A49877f3037C31626f385E95340G6425L86388k23607Q8611J83451
$$ plain form
13352 511268 172559 -66766 319266 277941 254031 149834 229990 278865 -13988 552934 -19791
13340 71888 69808 462797 308954 -60504 368634 204107 113657 104347 301473 223411 313896
13329 313896 240550 330085 54287 406131 217133 271288 209682 -4238 348563 188893 311512
13318 311512 100136 88921 406496 196421 460881 -5651 32024 -15745 115572 153506 -11424
13306 337066 -14576 38569 -211239 -7449 -1282 -289105 219245 258760 133900 275870 311830
13295 311830 197582 78943 320985 458069 -26894 121444 435841 201336 316445 307769
13285 307769 381922 -12870 264082 -147049 454946 272622 196373 242210 329074 365709 106042
13273 142948 57271 2022 141154 59842 397060 7847 98181 -151673 205478 120478 -174560
$$ packed form
13352E11268A72559f6766C19266m1325k3910j04197Q0156M8875a3988E52934a9791
13340G1888k080L92989j53843f0504C68634j64527r0450r310J97126p8062R0485
13329C13896p3346Q9535E4287L51844j88998N4155o1606d238C48563j59670J22619
13318C11512A00136j1215L17575A96421K64460e651C2024a5745A15572L7934a1424
13306C37066a4576C8569b11239g449a282k87823B19245L9515j24860J41970L5960
13295C11830j14248G8943K42042J37084b6894A21444L14397B01336J15109q676
13285C07769P4153a2870B64082a47049D54946j82324p6249M5837Q6864L6635A06042
13273A42948E7271B022J39132E9842L37218G847R0334a51673B05478q5000a74560
$$ plain form
13261 128773 232318 33038 5375 -55691 136554 57807 -90064 84529 -3671 193190 159325
13250 159325 338271 274982 277016 298609 162037 148710 -175777 76444 188775 22577 112703
13239 112703 111231 -109594 -12194 -24925 -90106 63955 133815 120727 276671 -190667 -39514
13227 179324 167470 394377 79852 66081 -71476 -23926 482492 366300 314277 117218 -93933
13215 -40492 159449 90908 -56979 -208828 61401 -38610 265128 246762 52005 197825 115088
13204 115088 400821 186364 275221 -14346 -176880 145738 216861 -96143 261977 410403
13194 410403 55459 72241 15421 39734 146699 409574 175246 -20907 352131 273721 27377
13182 218506 41441 -53708 42590 -389101 271403 134295 416606 189939 233325 156838
$$ packed form
13261A28773J03545C3038E375e5691A36554E7807i0064H4529c671A93190l3865
13250A59325J78946o3289K034K1593j36572j3327a75777G6444J12331B2577R0126
13239A12703j472a09594a2194j2731o5181F3955O9860j3088J55944a90667c9514
13227A79324j1854K26907G9852j3771g1476b3926D82492j16192n2023A17218i3933
13215d0492A59449o8541e6979j51849F1401c8610B65128j8366E2005J45820q2737
13204A15088K85733A86364Q8857a4346j62534A45738P1123i6143B61977J48426
13194D10403E5459J6782A5421K4313J06965K62875A75246b0907C52131p8410B7377
13182B18506D1441e3708D2590c89101B71403A34295K82311A89939M3386p6487
$$ plain form
13172 156838 -149330 113822 147166 -127283 -69070 369833 -205600 190169 468296 89533
13161 29138 -150739 112265 -200407 -42850 -55587 496541 110789 -11310 273434 -87632
13150 -26464 64103 261751 109190 -23844 -84531 63529 2059 -180856 16329 -129368 206905
13138 -183387 39152 -45530 185369 -243329 -11446 95300 -208767 -19088 191811 115318 -307812
13126 102331 158423 271836 -136348 -193874 284075 75359 158269 -63636 4205 -182784 -136867
13115 -136867 -135272 344287 97791 -422209 35990 -71063 -192438 -58149 200691 78073 173813
13104 173813 328856 57337 130031 70481 212874 211627 387538 184042 -36861 -70631 -10028
13092 335772 -86008 65008 12719 334975 87820 160029 42495 18984 -13123 130507 252582
$$ packed form
13172A56838a49330A13822L3344a27283N8213C69833b05600A90169K78127H9533
13161B9138a50739A12265b00407d2850j2737D96541A10789a1310B73434h7632
13150b6464F4103J97648A09190b3844o0687F3529B059a80856A6329a29368B06905
13138a83387C9152d5530A85369b43329a1446I5300b08767a9088A91811p6493c07812
13126A02331N6092J13413a36348n7526B84075G5359Q2910f3636D205a82784M5917
13115a36867J595C44287I7791d22209C5990g1063j21375e8149B00691G8073R5740
13104A73813J55043E7337P2694n9550J42393j247J75911A84042c6861l3770a0028
13092C35772h6008F5008A2719L22256H7820P2209D2495A8984a3123A30507J22075
$$ plain form
13081 252582 112538 124372 172206 -524099 -135264 112166 -1842 -33598 150045 89987 468819
13070 468819 7345 -291055 254576 286451 -139546 -59176 93769 348720 97776 42020 403822
13059 403822 -32931 -64503 230110 -94137 197736 -239669 78646 61245 270963 324876 18377
13047 157226 267105 -25964 281757 86926 106227 132786 191200 66492 -75900 383222 -78939
13035 -271451 -114205 153776 65346 1762 -50119 115960 217940 350736 54998 161843
13025 161843 -82505 299659 -7666 149529 514968 -36555 262631 131226 154209 -77166 -84616
13014 -84616 247119 -136240 23585 -103937 -91187 -63602 36860 116585 216293 114260 169279
13003 169279 43544 172417 92030 25060 168073 -42989 -221 44723 152101 2111 53766
$$ packed form
13081B52582A12538J1834M7834e24099a35264A12166a842l1756A50045o0058L78832
13070D68819G345b91055B54576L1875a39546e9176I3769K54951I7776D2020L61802
13059D03822c2931l1572B30110i4137A97736b39669G8646j7401K09718N3913A8377
13047A57226J09879b5964B81757H6926J9301K6559N8414F6492g5900C83222g8939
13035b71451a14205A53776F5346A762e0119A15960J01980J32796E4998J06845
13025A61843h2505B99659g666A49529L65439c6555B62631A31226K2983g7166p450
13014h4616B47119a36240B3585a03937J2750K7585C6860P9725R9708j02033N5019
13003A69279D3544J28873q0387B5060J43013d2989b21D4723J07378B111N1655
$$ plain form
12992 53766 83981 58091 313277 96946 133683 -12341 89377 -82829 139263 304444 115635
12980 -119519 73538 76391 116973 145184 111591 -5241 -260890 225864 115904 147981 222353
12969 222353 -158603 -155087 251983 -14441 60884 -113413 195233 287407 174110 198757 122239
12958 122239 72288 139986 78679 -115422 -140416 -266118 264955 57585 157210 119788 -343237
12946 109267 -167079 17932 -28790 146606 341219 27653 106472 65848 224465 114218
12936 114218 239175 216878 20070 2124 -79814 3598 -121410 76799 -12391 -257794 122807
12924 281486 -550280 137919 84757 -63380 -263228 46329 66780 -186058 101420 -26276
12913 92111 170042 27654 82671 13072 224632 48665 -272882 -140466 257178 171029 -76860
$$ packed form
12992E3766L0215k5890K55186I6946L6737a2341H9377h2829A39263J65181A15635
12980a19519G3538K853M0582K8211l3593e241k55649B25864j09960L2077P4372
12969B22353a58603L516B51983a4441F0884a13413A95233R2174j13297K4647p6518
12958A22239m9951O7698o1307a15422k4994j25702B64955E7585R9625l7422c43237
12946A09267a67079A7932b8790A46606J94613B7653P8819m0624J58617j10247
12936A14218J24957k2297B0070B124g9814C598a21410G6799a2391k45403A22807
12924B81486e50280A37919n3162f3380j99848D6329K0451a86058A01420b6276
12913I2111P7931B7654N5017A3072K11560D8665b72882J32416B57178q6149g6860
$$ plain form
12901 163167 -14721 354227 -58581 8471 -46563 -81345 -61894 -386858 457953 -14774 -317661
12890 -317661 -154922 -149889 343875 14844 -305831 62944 -200107 -251753 -144336 95026 -62841
12878 169527 86683 -183232 -33500 -47666 -266679 187126 160020 -27664 -56256 -361967 478518
12866 197346 -69153 -300854 165017 53159 304256 -11010 -185244 -75673 -240164 -83844
12855 -311239 22291 29483 -4411 -28139 209438 -28445 -10803 207936 64843 187647 199740
12844 199740 57120 105082 24045 -207544 137934 -21407 17304 106151 -20974 108524 475571
12833 475571 313256 -141054 149672 66095 121570 -178861 143228 -87568 -67934 33306
12822 -126752 340894 -116299 102172 130527 -110887 104366 -303240 276481 -258151 -187590
$$ packed form
12901A63167a4721C54227e8581H471d6563l4782J9451l24964D57953a4774l02887
12890c17661a54922N033C43875A4844c05831F2944b00107n1646J07417I5026f2841
12878A69527q2844a83232c3500j4166k19013A87126k7106b7664k8592l05711D78518
12866A97346f9153k31701A65017E3159K51097a1010j74234g5673j64491h3844
12855c11239B2291P192d411k3728B09438b8445a0803B07936F4843J22804J2093
12844A99740E7120M7962B4045b07544A37934b1407A7304Q8847b0974A08524L67047
12833D75571j62315a41054A49672F6095N5475a78861A43228h7568J9634C3306
12822a26752C40894a16299A02172K8355a10887A04366c03240B76481b58151P0561
$$ plain form
12812 -187590 -84641 116655 -53695 -23274 95186 414260 29155 78478 36268 -91557 -470848
12801 -470848 13506 -36556 -22930 -301813 -389118 399853 -129621 1034 -40178 236581 -31798
12789 38138 -182457 90086 -134502 147049 90081 131092 -173354 70037 -146158 -201520 -104779
12778 -104779 -25907 -78289 53984 49921 57112 268522 408806 -154127 3490 62410 55098 -226259
12765 230453 277485 -23954 -253998 58221 174992 -54837 205999 -208783 23778 -38876 -160022
12754 -160022 98873 158564 14836 -179261 228914 -247507 -181177 -40275 507693 322991
12744 322991 -34216 368922 -129900 2449 -395959 -12737 -159047 110110 -91375 97932 -300154
12732 88201 104461 20927 188578 -208716 -353006 251656 55174 20688 238777 321577 258781
$$ packed form
12812a87590h4641A16655e3695b3274I5186L19074B9155M9323C6268i1557l79291
12801d70848A3506c6556J3626k78883q7305C99853a29621A034d0178B36581c1798
12789C8138a82457I0086a34502A47049n6968M1011a73354G0037a46158n5362R6741
12778a04779b5907n2382E3984m063P191K11410J40284a54127C490N8920p312b26259
12765B30453M7032b3954k30044E8221J16771e4837B05999b08783B3778c8876j21146
12754a60022I8873N9691A4836a79261B28914b47507O6330d0275E07693j84702
12744C22991c4216C68922a29900B449c95959a2737j46310A10110i1375I7932c00154
12732H8201J6260B0927J67651b08716j44290B51656E5174B0688K18089Q2800o2796
$$ plain form
12721 258781 -38901 117241 454030 308675 254907 -114589 129601 -292888 -136920 62631
12710 47281 86826 -59338 -1972 -57979 -48601 8215 69134 -33970 -46093 -165274 -259420 116476
12697 -117056 -123021 303059 15086 -35365 385802 -7851 -141187 470517 53394 270316 289961
12686 289961 36341 271044 91194 99755 406903 -171491 17370 157333 -120707 93585 85030
12675 85030 169256 243938 -4147 -63495 51681 -131141 -110983 -146601 -211866 24546 -73069 -60093
12663 -60093 124424 391333 101635 -131077 32465 232574 261928 -241883 126594 -35648
12652 -164045 244866 -41041 -58269 82223 76639 16238 -201900 206722 -121141 102449 -112927
12640 -6051 426766 120304 1155 6614 -41485 -302672 -52360 157342 63098 -254025 -133331
$$ packed form
12721B58781c8901A17241L36789j45355n3768a14589A29601b92888a36920F2631
12710D7281L9545e9338a972n6007R378H215O0919c3970j2123j19181r4146A16476
12697a17056n965C03059A5086c5365C85802g851j33336D70517E3394K16922J9645
12686B89961C6341K34703I1194Q561L07148a71491A7370J39963a20707I3585q555
12675H5030Q4226P4682d147n9348E1681a31141K0158l5618o5265B4546g3069J2976
12663f0093A24424K66909A01635a31077C2465K00109K9354b41883A26594c5648
12652a64045B44866d1041j7228H2223n584A6238b01900B06722a21141A02449a12927
12640f051D26766A20304A155N459d1485k61187e2360A57342F3098b54025J20694
$$ plain form
12629 -133331 -2969 -240834 -110720 170729 113995 17988 37174 -257921 135768 -128130
12618 -109726 -411050 350399 39925 -252429 -91881 29376 336592 250775 198484 180854 37698
12606 258156 -203857 384662 237984 -86592 40524 26089 -22928 -101185 39491 -56728 343362
12594 210212 -64308 -224603 246693 5258 -9493 308931 -85449 45692 -276892 107104 104555
12583 104555 105094 386254 -70640 -1618 361255 204064 104428 32697 8464 -71270 -196942
12572 -196942 -190754 76409 127258 75720 -358278 11975 -113588 -159591 117137 -34861 -36297
12561 -36297 183668 -128 -8890 388377 36463 22959 57892 28133 -37854 -111587 20284 3366
12548 92937 6364 -9816 289289 35417 216620 -85633 -199863 90875 -30459 -288915 279873
$$ packed form
12629a33331b969k37865a10720A70729n6734A7988J9186b57921A35768a28130
12618a09726l01324C50399C9925b52429i1881B9376L07216q5817n2291j7630C7698
12606B58156b03857C84662j46678h6592D0524j4435b2928p8257C9491e6728C43362
12594B10212f4308j60295B46693E258i493C08931h5449D5692b76892A07104k549
12583A04555N39K81160g0640a618C61255j57191r9636C2697H464g1270j25672
12572a96942O188G6409N0849n1538c58278A1975a13588m6003A17137c4861j436
12561c6297A83668a28q762C88377C6463j3504L4933B8133c7854p3733B0284C366
12548I2937F364i816B89289C5417J81203h5633j14230I0875c0459k58456B79873
$$ plain form
12536 30869 -229507 18489 -334209 357143 -313450 -182488 20601 42548 22624 24448 7017
12524 -113353 -111794 -76287 -204159 -15143 12100 138012 106365 -49379 -96299 -85391 62055
12512 45632 -155644 350594 74058 -158784 -48696 237494 100404 -204924 -237607 -31746
12501 309192 442395 -80805 -305914 63102 -172769 199664 -136069 -268 165199 229617 236286
12490 236286 116047 125099 -66840 127923 269209 164910 -100873 164751 70787 134324
12480 134324 -83083 64811 155969 -317163 58427 250912 141009 -5231 -371710 48254 73320
12469 73320 -78973 219740 12763 2163 -255167 -241148 -26901 -83954 -120869 -166757 -264094
12458 -264094 -146857 4208 -244631 -18600 -130253 -130471 31814 -211096 -52903 -88083 154364
$$ packed form
12536C0869b29507A8489c34209C57143c13450J30962B0601K1947j9924J824G017
12524a13353J559L5507j27872a5143A2100J25912l1647d9379m6920J0908F2055
12512D5632a55644C50594G4058a58784d8696B37494A00404b04924l2683c1746
12501C09192J33203h0805k25109F3102a72769A99664a36069b68A65199O4418O669
12490B36286A16047R052f6840A27923J41286j04299a00873A64751G0787O3537
12480A34324h3083F4811R1158c17163E8427J92485j09903e231l66479D8254K5066
12469G3320g8973B19740A2763B163b55167J4019b6901n7053l6915m5888r7337
12458b64094J17237D208b44631a8600j11653k18C1814b11096e2903l5180A54364
$$ plain form
12446 -238716 132140 -223193 110036 -10330 117860 -138765 -72467 68194 -69917 -185664
12436 -185664 -177794 -55400 -36074 203698 -30918 -232863 11634 -186731 -321868 -335683 -116274
12424 -316424 18922 -80343 74814 32408 169280 -201726 -41052 -6162 66303 62959 -45699
12412 -143761 118594 90294 -89120 -155046 -18046 60222 4818 63299 365 -355307 -60916 -154948
12400 -154948 -7346 -275153 18134 -216597 35782 -40363 182524 -119757 10043 -38323 -116484
12389 -116484 239596 -188068 -132544 -12458 46498 -121079 -150704 94483 -15063 269760 152905
12378 152905 -189362 197468 6214 52727 325681 -182810 178708 48492 110511 30437 -79811
12366 240800 176911 298967 83810 100318 -105827 -46487 159329 7230 -268343 20844 -303057
$$ packed form
12446b38716A32140b23193A10036a0330A17860a38765O6298F8194f9917j15747
12436a85664P870e5400J9326B03698c0918k01945A1634a86731j35137j3815a16274
12424c16424A8922h0343G4814C2408J36872b01726d1052f162F6303l344d5699
12412a43761A18594k8300h9120o5926a8046F0222D818N8481C65c55307f0916r4032
12400a54948g346k67807A8134b16597C5782d0363A82524a19757A0043c8323p8161
12389a16484B39596a88068N5524a2458D6498a21079k9625I4483a5063B69760j16855
12378A52905a89362A97468F214M6513K72954a82810A78708D8492O2019C0437g9811
12366B40800o3889J22056H3810J6508a05827d6487A59329G230b68343B0844c03057
$$ plain form
12354 -108926 -125837 175743 55897 70548 -149766 -95036 -232659 12945 -60630 170729 -112736
12342 146219 168498 130035 -53279 157934 413659 235191 339464 -41449 115748 202941
12332 202941 -105432 -205189 115043 -10902 31958 120865 35728 75747 -180078 46784 -74395
12320 88964 81631 -112640 136834 37212 387869 392619 519755 170666 330989 371725 206076
12309 206076 75364 213980 98839 200074 74054 148690 226405 5350 48560 194723 230604
12298 230604 74517 184845 29452 250809 158595 136279 35435 205779 178477 -8730 101065
12286 96268 -66322 -200884 -109314 -6160 -15901 74633 86607 89343 -102842 23253 110771 288669
12274 288669 56597 91297 160679 130990 230768 256732 215423 -13385 -87417 131204 -187821
$$ packed form
12354a08926j6911A75743E5897J4651a49766N4730j37623A2945f0630A70729a12736
12342A46219K2279l8463e3279A57934K55725j78468J04273d1449A15748Q7193
12332B02941a05432r9757A15043a0902C1958Q8907C5728M0019a80078D6784g4395
12320H8964p333a12640A36834C7212L50657M750J27136A70666J60323M0736j65649
12309B06076G5364J38616I8839J01235G4054P4636P7715E350M3210J46163L5881
12298B30604G4517J10328B9452K21357r2214k2316C5435J70344k7302h730A01065
12286I6268f6322j34562R1570f160r741G4633J1974K736a02842B3253Q7518J77898
12274B88669E6597L4700O9382k9689R9778K5964m1309a3385p4032A31204a87821
$$ plain form
12262 97300 173660 -68676 -421281 79493 47551 114268 53913 -255153 611447 -21145 52073
12250 203335 262603 226169 73326 430130 232987 -19562 76206 56973 94182 330698 87237
12238 250453 408609 231834 101437 -146877 201348 122782 35376 111190 -137767 -59687
12227 193545 116765 163694 -68692 123411 133264 -189298 156449 11880 -1318 64749 132520
12216 132520 -109007 179158 -125220 178308 -10560 427228 -1009 139184 44342 149255
12206 149255 63868 206648 374904 338333 64183 146971 372750 158666 138088 14353 265010
12195 265010 437200 229978 -377037 86301 -148773 -205963 221401 186211 -55623 258827
12184 107143 174389 178673 296642 24750 216040 261392 149038 25481 -49882 -104100 100252
$$ packed form
12262I7300P6360f8676l52605G9493l1942O6717E3913b55153F11447b1145E2073
12250B03335N9268l6434G3326L56804j97143a9562G6206j9233L7209K36516H7237
12238B50453J58156j76775A01437a46877B01348p8566C5376P5814a37767e9687
12227A93545p6780M6929f8692A23411R853a89298A56449A1880a318F4749O7771
12216A32520a09007A79158a25220A78308a0560D27228a009A39184D4342J04913
12206A49255F3868J42780J68256l6571F4183Q2788K25779A58666k0578A4353K50657
12195B65010J72190k07222c77037H6301a48773n7190B21401l5190e5623B58827
12184A07143O7246M284J17969B4750J91290M5352j12354B5481d9882n4218A00252
$$ plain form
12172 80170 109795 -241329 -15548 266982 187308 -82928 -228647 181582 393796 473602 194193
12160 -29219 -146031 -55723 489591 139749 139728 -90025 79057 -170874 230432 127872 582249
12149 582249 388145 178370 420723 -9525 69822 -26377 90890 204621 -19005 118337 37965
12137 119244 -55759 198659 -114990 242280 96052 271302 225051 129387 -81698 5572 -109427
12125 234339 226075 36095 -373665 84583 121122 145341 -340262 424521 313966 -59936 237598
12113 261833 401908 7073 124274 122448 38747 79190 207470 53793 147839 114524 121352
12102 121352 383988 155084 114077 208238 -16688 32604 150499 -196156 121263 278736
12092 278736 -21592 2943 64869 108519 120095 140069 -148638 222546 -175747 -199025 -55425
$$ packed form
12172H0170K9625b41329a5548B66982p9674h2928j45719A81582K12214P9806A94193
12160b9219j16812e5723D89591A39749k1i0025G9057a70874B30432j02560M54377
12149E82249j94104A78370K42353i525F9822b6377I0890J13731a9005A18337C7965
12137A19244e5759A98659a14990B42280I6052J75250m6251r5664h1698E572a09427
12125B34339q264C6095c73665H4583L6539K4219c40262D24521j10555e9936B37598
12113B61833J40075G073J17201j826C8747M0443J28280E3793R4046l3315O828
12102A21352K62636A55084m1007R4161a6688C2604J17895a96156A21263J57473
12092B78736b1592B943O1926M3650J1576J9974a48638B22546a75747k3278e5425
$$ plain form
12080 -93947 -71674 199776 -172565 369869 177625 159245 31250 206245 -29378 -91486 -49171
12069 -49171 487266 -99143 34022 -40174 185399 258293 -170865 -7457 191683 -11732 -287519
12058 -287519 244915 203943 60074 76941 172910 102577 -6976 68964 43987 54783 -126055
12046 17138 294858 487076 48565 389227 335148 -2714 58159 114633 127988 164852 -18757
12034 -43124 208301 88282 -25565 87600 197201 98805 -77040 64642 -68504 -4992 145793
12022 179779 -155766 -202631 -69451 -84042 -29238 -53320 251286 39496 78231 -79444 66630
12010 -121974 64490 247452 -290188 8679 187898 -50625 -363908 -77958 22335 -130478 22827
11998 156478 470925 78511 10445 -74872 16401 -183888 -37841 115016 -132078 -116194 108321
$$ packed form
12080i3947K2273A99776a72565C69869A77625j8380C1250J74995b9378o2108M2315
12069d9171D87266i9143C4022d0174A85399P2894a70865g457A91683a1732k75787
12058b87519B44915m0972F0074J6867R5969p0333f976F8964k4977J0796a26055
12046A7138K77720J92218D8565L40662n4079b714E8159N6474J3355L6864a8757
12034d3124B08301H8282b5565H7600J09601r8396g7040F4642f8504d992A45793
12022A79779a55766m6865f9451j4591b9238k4082B51286C9496L8735g9444F6630
12010a21974F4490J82962b90188H679J79219e0625l13283g7958B2335a30478B2827
11998A56478L14447G8511A0445g4872A6401a83888c7841A15016a32078J5884A08321
$$ plain form
11986 155101 93813 -43142 -249075 -69109 289500 -64177 -17173 88375 -73809 -106832 -15611
11974 101411 9504 -105761 -28627 -23695 -10330 -234335 -120709 102394 -18461 -118092 61128
11962 219625 -182861 -167755 -23157 166683 -104859 53244 52728 68607 77747 -67858 47199
11950 -167440 -122814 140149 -47033 112976 -73903 -255212 -195853 72373 -26145 -304984 -173091
11939 -173091 195493 -108325 242374 3990 249840 -515784 -103543 -129513 16413 86848
11929 86848 26359 -102559 43321 -247385 36643 39594 391064 108035 177039 90678 -264623
11917 -236050 -4519 -62754 248348 32096 1846 -7163 -356193 272818 -47935 63146 -99894
11905 32632 281551 -93359 164170 -169005 -220164 232049 21894 185690 129536 155357 -270472
$$ packed form
11986A55101o1288d3142k05933f9109B89500f4177a7173H8375g3809l3023a5611
11974A01411I504a05761b8627M932a0330k24005J13626A02394a8461r9631F1128
11962B19625a82861J5106b3157A66683a04859E3244n16J5879R140f7858D7199
11950a67440M4626A40149d7033A12976g3903j81309N9359G2373b6145k78839J31893
11939a73091A95493a08325B42374C990K45850e15784a03543k5970A6413P0435
11929H6848B6359a02559D3321b47385C6643K951L51470A08035O9004q6361b64623
11917b36050d519n8235B48348C2096A846g163l49030B72818d7935F3146i9894
11905C2632K48919i3359A64170a69005n1159B32049B1894J63796n6154K5821b70472
$$ plain form
11893 216540 208948 -115668 2880 -48738 -300562 -40862 -111059 -150002 -152743 -7352 324523 -14196
11880 -216114 -408289 32085 57967 32539 -257474 -40810 48708 80814 -118568 -23478 143626
11868 149074 127184 191233 -280923 -156712 -27465 27768 86259 -261353 -40710 -118166 -16524
11856 -203033 279705 31864 6469 254263 -524447 34542 -2455 -128065 -197698 297304 -160650
11844 109513 365667 141272 -46976 -356394 34235 -82681 32022 -64619 -135547 -103891 -23004
11832 -79238 -47505 25309 32800 -30407 92437 -32994 89600 -56901 136175 119299 -287813
11820 286216 185590 -47981 88541 -181320 144695 -8411 158820 -253634 -1536 -258158 -387614
11809 -387614 8003 -84000 120346 74710 -166107 -124633 200865 48850 223786 67653 -4681
$$ packed form
11893B16540p592a15668B880d8738k51824d0862p0197l8943k741g352C24523a4196
11880b16114j92175C2085K5882k5428b57474d0810D8708L2106a18568b3478A43626
11868A49074k1890O4049b80923J24211b7465B7768N8491b61353d0710p7456a6524
11856b03033B79705C1864F469K47794e24447C4542b455j25610o9633B97304a60650
11844A09513K56154A41272d6976l09418C4235h2681C2022f4619p0928L1656b3004
11832g9238L1733B5309P491c0407I2437c2994H9600e6901A36175j6876b87813
11820B86216j00626d7981H8541a81320A44695h411A58820b53634a536k56622j29456
11809c87614H003h4000A20346m5636a66107M1474B00865D8850J74936F7653d681
$$ plain form
11797 -112330 -241578 -50577 -101412 95809 136024 153794 -159765 -5974 -5117 89806 -376622
11785 163609 -223711 -51546 -67076 46398 -385942 -160888 147087 -63867 -78403 -129646 -226890
11774 -226890 -164827 -178650 87942 442568 43102 -150496 -217049 -64437 39306 -53569 -90234
11763 -90234 51573 29841 -156489 145565 4150 -233751 105818 -141379 -128747 131145 4858
11751 -10691 -64910 -97365 -330645 -179925 -178501 167273 128307 -1814 109017 -30241 -122984
11740 -122984 14501 -150680 -215495 -327165 -86025 -95285 -187544 -135228 -101918 -320985 -36113
11728 57102 -147234 109934 -75365 62822 -79585 -225218 261594 59393 115152 182656 -99455
11716 -56138 14833 -31084 53171 -432922 174977 -13189 59585 56321 3337 35632 20953 23414
$$ packed form
11797a12330j29248e0577n0835I5809M0215J7770a59765e974Q57H9806c76622
11785A63609b23711e1546j5530D6398c85942a60888A47087f3867j4536n1243r7244
11774b26890O2063j3823H7942L54626D3102a50496o6553f4437C9306e3569l6665
11763i0234E1573k1732a56489A45565D150b33751A05818a41379J2632A31145D858
11751a0691n4219l2455k33280J50720J424A67273l8966a814A09017c0241r2743
11740a22984A4501a50680o4815j11670h6025r260r2259N2316L3310k19067c6113
11728E7102a47234A09934g5365F2822g9585j45633B61594E9393N5759O7504i9455
11716e6138A4833c1084E3171d32922A74977a3189E9585l264C337L2295j4679K461
$$ plain form
11704 23414 149645 146562 197852 -108680 -63403 234047 -174501 186097 -20754 150164 -51033
11692 115117 -80495 -87744 -248539 -16770 134598 -197375 57691 -139109 -181884 418588 -84316
11680 284423 -39362 437767 22161 81657 -17494 -72647 -421413 -361207 110432 4761 -62841
11668 250991 299387 192777 -172181 316061 254639 170675 -154983 74543 254465 46406
11657 162464 162104 222386 75032 -270819 104499 -76571 -16610 -216934 -266594 154108 193917
11646 193917 36471 -13708 -26941 -122176 -119486 -174436 -89482 848 -10738 65992 -187771 -85948
11633 7560 131399 -27330 -21969 80380 -322 -53417 -213473 203383 -216867 155025 -256115
11621 167994 -75103 -208716 -331026 116345 371166 -23892 172967 42874 -85555 -78442 -24855
$$ packed form
11704B3414J26231l083N1290a08680M5277B34047a74501A86097b0754A50164e1033
11692A15117h0495p249j60795a6770A34598a97375E7691a39109m2775D18588h4316
11680B84423c9362D37767B2161N9496a7494n5153l48766O0206A10432D761f2841
11668B50991M8396j06610a72181C16061o1422q3964a54983G4543J79922D6406
11657A62464l60O0282G5032b70819A04499g6571a6610k00324m9660A54108L9809
11646A93917C6471a3708j3233r5235K690n4950Q4954H48a0738F5992a87771h5948
11633G560J23839b7330N361H0380c22n3095j60056B03383b16867A55025b56115
11621A67994g5103j33613j22310A16345K54821b3892A72967D2874h5555P113b4855
$$ plain form
11609 -93076 157714 -18436 44701 -267655 -185494 230266 -79317 -181950 254348 -24251 107523
11597 -332556 137836 23462 15141 364043 57644 132070 28752 174276 81157 338534 184609
11586 184609 58925 -474 -151056 -47161 -35056 134150 28200 60557 -108391 -63231 83445
11574 31711 119166 -8414 24705 29539 352275 -220666 120183 96634 -44670 223037 250374
11563 250374 3786 88997 -6721 116025 137474 46338 81859 53609 -146210 -35326 -5541 109709
11550 309350 -53381 354618 -156797 243963 -135831 103818 218622 -188913 59455 299274
11540 299274 -70312 54097 69995 214206 206680 65294 -236206 77692 -157568 -15725 12299
11528 -198341 318567 163746 -10589 120583 -99005 236820 -16479 -177736 134318 68418
$$ packed form
11609i3076A57714a8436D4701b67655Q2161B30266g9317j02633B54348b4251A07523
11597c32556A37836B3462q321L48902E7644P4426B8752J45524H1157K57377j53925
11586A84609E8925d74j50582d7161J2105A34150B8200L2357a08391M5160H3445
11574C1711Q7455h414B4705M834L22736b20666A20183k3549d4670B23037K7337
11563B50374C786Q5211f721A16025K1449D6338L5521k8250a46210c5326e541A09709
11550C09350e3381C54618a56797B43963a35831A03818J14804a88913E9455K39819
11540B99274g0312E4097J5898J44211p526F5294b36206G7692a57568a5725A2299
11528a98341C18567j54821a0589A20583i9005B36820a6479j61257A34318o5900
$$ plain form
11518 68418 -132090 31354 202759 115634 82254 -11549 120590 56395 155309 169973 127762
11507 127762 134721 150924 471196 155426 271602 -37643 251363 -93020 490818 57535 491394
11496 491394 41589 16448 215920 278150 -121375 -86506 315794 -202490 -208695 14938 458329
11485 458329 343099 119782 304367 269394 -147588 68834 1992 87063 73888 142523 204453
11474 204453 130454 120945 -24705 43283 -23610 -143830 17592 332578 -34882 473349 -2384
11462 123425 -284703 -146166 287643 -176304 -14267 26164 -100351 45965 -100221 -287228
11452 -287228 141758 -154267 68173 -13443 -59622 -50383 166467 -222435 -69142 -54291 301982
11440 -245841 -191465 -18410 221627 155086 103496 102465 33972 58614 147950 255574 64217
$$ packed form
11518F8418a32090C1354J71405q7125l3380a1549A20590E6395R8914J4664m2211
11507A27762O959J6203L20272A55426J16176c7643B51363i3020D90818E7535M33859
11496D91394D1589A6448J99472O2230a21375L4869C15794b02490o205A4938M43391
11485D58329j15230A19782J84585l4973a47588F8834A992Q5071j3175O8635O1930
11474B04453p3999r509b4705D3283b3610j20220A7592L14986c4882D73349b384
11462A23425b84703J38537B87643a76304a4267B6164a00351D5965a00221j87007
11452b87228A41758a54267F8173a3443m6179R239A66467b22435f9142J4851C01982
11440b45841N4376a8410B21627o6541n1590j031C3972K4642Q9336J07624F4217
$$ plain form
11428 -269447 -94324 -178462 102615 7459 -78090 407868 114739 197495 284166 218464 -314995
11416 -211923 4446 -54778 -142060 -61600 24172 -1568 316675 -268740 122931 71527 -208844
11404 68990 -106321 -266416 1724 218548 -160505 9302 143596 31595 10949 221414 -84356
11392 -84634 -99767 -67400 -194573 -366135 -90259 245517 -39924 -11532 266466 -13270 -69649
11381 -69649 65606 -97198 -378629 -193326 -178484 -128225 236054 -71180 -324200 102372 -159528
11369 -170784 257800 1848 -3824 254344 -33873 -21016 243757 112939 -184691 -65823 150450
11357 129464 175983 -21540 102438 183079 70489 -97041 -378141 66933 74245 -69523 -296800
11346 -296800 -120832 226039 -48183 -241185 -43844 -65275 -136511 21831 -153021 34733 -149944
$$ packed form
11428b69447i4324q4138A02615G459g8090D07868A14739Q2756Q6671o5702c14995
11416b11923D446e4778q7282f1600B4172a568C16675b68740A22931n1404b08844
11404F8990a06321j60095A724K16824a60505I302J34294C1595A0949K10465h4356
11392h4634j5133L2367j27173j71562i0259B45517c9924a1532B66466a3270n6379
11381f9649F5606i7198k81431J85303J4842N0259B36054g1180k53020A02372a59528
11369a70784B57800A848c824B54344c3873J2857B43757A12939a84691f5823A50450
11357A29464M6519b1540A02438Q0641G0489i7041k81100F6933P312f9523k27277
11346b96800a20832B26039d8183j93002d3844k1431p1236B1831a53021C4733a49944
$$ plain form
11334 33581 -39260 22069 183776 -52256 -40470 170556 -72684 -98667 347094 82747 -49566
11322 51428 -24472 -224503 -21646 64861 13353 -184985 208290 6012 45754 241799 58085
11310 -89135 -135566 -67199 -176149 127320 64410 -303574 -228831 248511 146069 -30300 244380
11298 38059 -91480 159598 352274 160441 -10960 -139228 -167570 -422242 -41530 296541
11287 78942 -249495 -151636 -42248 -249495 -33377 -250246 -43610 -383652 101318 -318641
11276 -135566 -328065 17613 331688 276444 -67627 -213036 88962 63446 -173971 -227869 -75465
11264 100668 -361640 34536 -91180 40882 -183013 227658 -249619 72369 41492 84779 -467812
11252 68029 -37275 43163 130765 -46448 227215 5385 45258 -93712 -16844 37510 16050 76577
$$ packed form
11334C3581c9260B2069J61707e2256J1786A70556g2684k5983C47094H2747d9566
11322E1428b4472k00031b1646F4861A3353a84985B08290F012L9742J96045E8085
11310h9135m6431f7199j08950A27320o2910c03574P4743B48511j02442c0300B44380
11298C8059i1480A59598J92676A60441a0960j28268k8342k54672d1530B96541
11287G8942b49495R7859d2248k07247c3377k16869d3610l40042A01318c18641
11276a35566j92499A7613L14075n5244f7627j45409H8962k5516a73971n3898g5465
11264A00668c61640C4536i1180D0882a83013B27658b49619G2369l0877M3287d67812
11252F8029c7275D3163Q7602d6448B27215E385L9873i3712a6844C7510A6050O0527
$$ plain form
11240 76577 737 -33177 -343170 -69032 -184952 -167888 -274615 -216818 -180981 126553 -115591
11228 -158738 237959 -192989 -1887 -192609 -256804 24747 -150993 -145985 -114794 -155416 -7649
11216 -46500 -303022 223295 -3915 9583 56727 -243060 -105175 278994 -42052 -35507 -255117
11205 -255117 326615 -5492 58242 288175 -48743 84886 193133 -190668 -433079 -18642 -158576
11194 -158576 -289725 -166251 -51810 194019 -20855 -177193 55389 -9863 -124111 -248973
11184 -248973 306841 -121701 -138009 83917 76171 122224 239904 -274649 -54506 35579 -156305
11172 84505 24971 99603 -187977 -37186 38037 -454250 -237981 71299 -397271 187930 62923
11160 71609 -380376 35292 108200 180136 -181546 96719 308842 183408 59238 -55125 -59335
$$ packed form
11240G6577G37c3177l09993f9032j15920J7064j06727N7797L5837A26553a15591
11228a58738B37959a92989a887j90722o4195B4747a50993N008L1191m0622g649
11216d6500k56522B23295c915I583M7144b43060a05175B78994d2052O545k19610
11205b55117C26615e492E8242K29933d8743H4886J08247a90668k42411a8642j39934
11194a58576j31149J23474e1810A94019b0855j56338E5389i863j14248j24862
11184b48973C06841a21701j6308H3917p746M6053J17680b74649e4506C5579a56305
11172H4505B4971P4632a87977c7186C8037d54250K16269G1299c97271A87930F2923
11160G1609c80376C5292P2908P1936a81546I6719K12123j25434E9238e5125m210
$$ plain form
11149 -59335 -6824 73842 -35911 -301173 87582 -82402 -124716 17304 -396761 -249036 185841
11137 -100842 87908 -204276 -43076 -115110 -48019 -285578 -125405 -77153 281810 -56577 -216928
11126 -216928 415218 96415 145876 165294 -91563 -93914 39108 43309 -104942 -376257 63812
11114 -147934 -96053 18790 78695 56286 124058 273959 -141577 -184298 -62516 -129629 69141
11102 -266225 -282506 -5952 -119636 150015 90581 289197 -129288 215675 -14484 135327
11091 39668 -154030 146518 220575 172036 -304834 -175639 -63133 208407 9409 249180 403725
11080 403725 566310 -62709 319801 377471 -73927 -100833 131847 -58708 133021 38176 57493
11069 57493 203439 -89584 279948 259787 -60562 141856 256762 22230 288499 -344968
$$ packed form
11149e9335f824G3842c5911k65262H7582h2402m2314A7304c96761J47725A85841
11137a00842H7908b04276d3076p2034d8019k37559a25405M8252B81810e6577j60351
11126b16928D15218I6415M9461J9418i1563k351C9108M201a04942k71315F3812
11114a47934N1881A8790N9905k2409O7772J49901a41577m2721f2516o7113F9141
11102b66225j6281e952j13684A50015n9434J98616a29288B15675a4484A35327
11091C9668a54030A46518P4057m8539c04834J29195f3133B08407I409K39771J54545
11080D03725J62585f2709C19801N7670g3927k6906A31847e8708A33021C8176J9317
11069E7493J45946h9584B79948k0161f0562A41856J14906B2230K66269c44968
$$ plain form
11058 -8691 183113 237430 187994 229161 322308 354586 490934 370978 522462 374716 251492
11047 251492 306544 244571 197289 213142 -111351 658325 421343 254284 217140 226698 588072
11036 588072 435688 129586 444457 429457 560660 769058 704708 334038 426390 448567
11026 448567 332900 245854 419875 401065 425210 661810 307278 557686 537097 317586
11016 317586 522823 453211 428049 198621 697070 457154 660913 699504 323853 526795
11006 526795 557916 525399 404962 600357 407286 274361 673655 388236 499086 481334
10996 481334 533253 390901 442336 512104 397376 521790 348465 221906 283963 569928
10986 569928 572827 685860 703190 217909 713125 294594 203102 443852 66423 74565 535752
$$ packed form
11058h691A83113N4317m9436M1167R3147L2278J36348j19956J51484j47746j23224
11047B51492N5052o1973m7282J5853a11351F58325k36982j67059l7144R558L61374
11036E88072j52384A29586L14871j5000J31203K08398o4350C34038R2352K2177
11026D48567j15667q7046J74021j8810K4145K36600C07278K50408k0589k19511
11016C17586K05237o9612k5162A98621M98449k39916K03759L8591C23853K02942
11006E26795L1121l2517j20437J95395j93071j32925L99294k85419J10850j7752
10996D81334N1919j42352N1435O9768j14728J24414j73325j26559O2057K85965
10986E69928K899J13033J7330B17909M95216B94594r1492K40750F6423Q142M61187
$$ plain form
10975 535752 640497 570267 418341 796940 612846 632981 625524 500230 729512 729362 620973
10964 620973 952683 1004536 837157 1034376 1304779 1202888 1184778 1229958 1647500 1720700
10954 1720700 1649569 1812524 1850886 2011485 2152000 1805404 1936617 1775255 1632621 1525339
10944 1525339 1228725 1740970 1387032 1494087 1462431 1209547 1389189 1599241 1684934 1241261
10934 1241261 1617888 1474185 762962 814107 395729 377585 465603 416355 400373 324122
10924 324122 440049 439583 -71509 107887 164043 157140 -66921 183969 -140851 -10759 16417
10912 71017 -109609 22860 109822 -137921 68847 -85659 47582 39162 73537 -174794 32913
10900 -95869 -112857 109953 35020 -228113 -21358 -150039 -237848 90484 -106776 -47562 -40634
$$ packed form
10975E35752J04745p0230j51926L78599j84094K0135p457j25294K29282j50j08389
10964F20973L31710N1853j67379J97219K70403j01891j8110M5180M17542P3200
10954A720700p1131J62955L8362J60599J40515l46596J31213j61362j42634j07282
10944A525339k96614N12245l53938J07055l1656k52884J79642K10052Q5693m43673
10934A241261L76627j43703p11223N1145C95729j8144Q8018m9248j5982p6251
10924C24122J15927m66g1509A07887N6156o903f6921A83969a40851a0759A6417
10912G1017a09609B2860Q6962a37921F8847h5659D7582q420L4375a74794C2913
10900i5869j6988A09953C5020b28113b1358j28681q7809I0484a06776d7562O928
$$ plain form
10889 -40634 -50576 -39937 -58612 -134264 133936 -260 35569 -118298 -2673 76156 -83676 17046
10876 -40639 101183 -164723 -29517 -56177 117965 -24593 28615 189445 -66113 217982 -252106
10864 -216814 34423 -74798 -47155 -262480 3734 30062 -69411 -5589 -77942 57612 -23787 140075
10851 -21845 112058 32231 142036 -127834 211980 -294712 184690 -146723 -284608 18157
10840 -151016 -155455 109155 26080 -6632 -123689 -227237 -121446 3097 38314 155870 241309
10829 241309 118005 201455 -21315 -193919 60684 232372 42883 169721 -113343 -455865
10819 -455865 228165 150326 -227066 31009 209199 -126079 116170 -9505 -180932 -105372
10809 -105372 -13740 135897 -178033 -342075 234664 264183 -158596 103090 -382567 72427
$$ packed form
10889d0634r942J0639j8675p5652A33936b60C5569a18298b673G6156h3676A7046
10876d0639A01183a64723b9517k6660A17965b4593B8615J60830f6113B17982b52106
10864b16814C4423g4798K7643k15325C734K6328f9411e589p2353E7612b3787A40075
10851b1845A12058C2231J09805a27834B11980b94712A84690a46723j37885A8157
10840a51016m439A09155B6080f632j17057j03548J05791C097L5217J17556Q5439
10829B41309A18005Q3450b1315j72604F0684J71688D2883J26838a13343l42522
10819d55865B28165p7839b27066C1009J78190a26079A16170i505j71427P5560
10809a05372a3740A35897a78033j64042B34664K9519a58596A03090c82567G2427
$$ plain form
10798 -80273 243754 77025 243794 -243265 79676 -335335 -70565 46368 -332292 -76486 -111649
10787 -111649 -265079 -60757 48988 114441 -100342 -37385 -12403 -53931 -125043 -65382 97636
10775 -334650 -127135 -39415 -158456 -326269 213696 -181289 -51713 51361 -230430 -142473
10765 -142473 56652 -42030 -487840 -3843 205657 208539 -63134 44222 84745 -199855 -206404
10754 -206404 91875 -202319 -59927 157077 -408839 58075 318473 -248579 -53455 164542
10743 131850 -61923 -100826 13648 209535 -113641 -150318 -224709 84041 -2747 -231601 2562
10731 -132849 47258 205762 -32416 -193331 -15429 -286308 66995 89992 64001 -3425 -245820
10720 -245820 -25563 -132904 -3861 -162266 378897 51793 -63602 -267573 -110378 199562
$$ packed form
10798h0273B43754G7025J66769b43265G9676c35335g0565D6368c32292g6486l5163
10787a11649j53430f0757D8988O5453a00342c7385a2403m1528p1112N9661I7636
10775c34650a27135c9415j19041j67813B13696a81289e1713E1361b30430Q7957
10765a42473E6652d2030m45810c843B05657K882f3134D4222M0523a99855o549
10754b06404I1875b02319e9927A57077d08839E8075K60398b48579e3455A64542
10743A31850f1923l8903A3648J95887a13641l6677p4391H4041b747k28854B562
10731a32849D7258J58504c2416j60915a5429k70879F6995K2997k5991c425k42395
10720b45820b5563j07341c861j58405C78897E1793f3602k03971a10378A99562
$$ plain form
10709 30874 30540 -97663 -331540 92140 -200840 -156267 39141 50519 -319683 -159667 -170349
10698 -170349 150214 57307 178390 22849 -145046 106407 -304466 4319 64411 -349508
10687 -27713 -190329 -176841 -139435 186740 53505 45074 -119204 -129826 144973 -55618 -219767
10676 -219767 -58782 -157436 -184544 132903 -19927 -217172 -13320 52052 15998 127456 -207203
10664 -404835 -144281 -408564 41747 -175915 -305616 -132575 -33096 -223824 -112528 -174840
10654 -174840 293973 -170043 -6301 -298982 -120053 14762 152347 -160103 -232050 39123
10643 -233665 -18841 -284049 -96140 -96827 -306640 32887 131326 198428 39766 -61104 -69047 96986
10630 161395 -131926 -65939 -25792 -92577 -80949 39670 -78372 8342 30722 -168554 -141597
$$ packed form
10709C0874l34i7663k33877I2140b00840M4573C9141J1378c19683a59667j0682
10698a70349A50214E7307J21083B2849a45046A06407c04466D319O0092c49508
10687b7713j62616J3488L7406A86740E3505q431a19204j0622A44973e5618j64149
10676b19767e8782r8654k7108A32903a9927j97245a3320E2052A5998J11458b07203
10664d04835a44281k64283D1747a75915j29701a32575c3096j90728J11296o2312
10654a74840B93973a70043f301k92681a20053A4762J37585a60103p1947C9123
10643b33665a8841k65208i6140o87k09813C2887R8439O7102C9766f1104p943I6986
10630A61395a31926f5939b5792o6785J1628C9670g8372H342K2380a68554K6957
$$ plain form
10619 -141597 -151432 -87646 207294 -120822 41689 -61433 163129 -286274 353357 -176852
10608 -96443 112761 77815 217449 -217938 -125638 90445 33089 73103 -179209 45789 -202525
10596 137833 -111867 208489 131017 -144671 62887 205633 4201 -97812 -106928 -77387 151743
10584 -24106 -255006 46610 -415401 -92531 -197124 -118186 -215374 -151283 166361 -406182 110877
10572 -157205 31924 -218449 37048 -133605 -32949 -204983 -3214 51149 -165219 -77743 -10492
10560 -161101 -37476 17297 -293293 -227711 -103456 172394 18230 60569 -48174 -288118 181936
10548 -28418 -244382 343919 -269677 -163392 -156297 -320953 288489 34505 -163595 1325 95640
10537 95640 16864 -41480 -8851 275781 152029 -284153 338573 121987 282707 -141347
$$ packed form
10619a41597r835O3786B07294a20822D1689f1433A63129b86274C53357a76852
10608i6443A12761l4946J39634b17938R2300I0445C3089M0014a79209D5789b02525
10596A37833a11867B08489p7472a44671F2887J42746D201i7812r116K9541A51743
10584b4106k30900D6610d15401i2531j04593P8938r7188O4091A66361d06182A10877
10572a57205C1924b18449C7048a33605c2949j72034c214E1149a65219g7743a0492
10560a61101c7476A7297b93293O5582a03456A72394A8230M2339d8174k39944A81936
10548b8418k15964C43919b69677J06285P095j64656B88489C4505a63595A325R4315
10537I5640A6864d1480h851B75781j23752b84153C38573A21987J60720a41347
$$ plain form
10526 -88925 44780 -18644 211577 -4347 87861 429237 366562 -98171 78950 -438997 -66734
10514 -16396 215050 -266341 -157535 179981 23862 -235126 -45599 -254336 133492 105721
10504 105721 -10830 -78581 -127683 -144708 -267735 65551 -67462 -4845 62138 68440 141470 -14228
10491 -96212 4401 34024 303986 178234 81043 -5418 -230657 214312 -161131 -63378 -7371
10479 64483 302572 -137909 -53282 -215940 -12960 -375793 -130860 -211523 -362792 414372
10468 -103409 -385754 -10982 94225 -137564 -52003 -262322 -140246 134909 409652 273287
10458 273287 90996 136420 346031 -39479 268580 144016 8741 -26698 355619 -162620 133259
10446 -68890 172005 177689 3356 268745 -62558 -18410 -17588 -58222 214640 -144769 -131141 -98804
$$ packed form
10526h8925D4780a8644B11577d347H7861L41376o2675i8171G8950d38997f6734
10514a6396B15050b66341J08806A79981B3862b35126d5599k08737A33492k7771
10504A05721a0830o7751m9102j7025j23027F5551f7462d845F2138O302P3030a4228
10491i6212D401K9623K69962j25752H1043e418k25239B14312a61131f3378g371
10479F4483K38089a37909e3282j62658a2960l62833a30860q0663j51269D14372
10468a03409k82345a0982I4225a37564e2003k10319J22076A34909K74743j36365
10458B73287I0996M5424K09611c9479B68580j24564H741b6698C55619a62620A33259
10446f8890A72005N684C356K65389f2558a8410Q22m0634B14640a44769J3628L2337
$$ plain form
10434 -98804 64471 -74454 131757 156130 -34129 52152 -220246 -33979 -63204 -323320 -246294
10423 -246294 -141613 -114278 -101052 -248948 10652 -437600 -44873 -11003 -179150 -160168 -5230
10411 -242670 9707 -75460 -5576 -104300 -71093 -153547 -64492 -23441 13230 124892 65906 78602
10399 78602 -84028 -33899 -138273 43807 -158699 -181579 -12674 97916 34284 78981 -41069
10387 20802 -39792 -23316 11671 -29623 56279 131737 65558 106634 -114354 51624 63443
10376 63443 53266 10401 358485 37615 -214566 146058 5036 -247935 -80389 241741 192479
10365 192479 58069 -284667 -24602 -380926 221006 -78647 285744 -3189 155907 317062
10355 317062 287531 40125 295352 328540 62173 169751 49493 154734 254083 428761 132335
$$ packed form
10434i8804F4471g4454A31757K4373c4129E2152b20246c3979k9225k60116P7026
10423b46294J04681K7335J3226j47896A0652d37600d4873a1003j68147J8982e230
10411b42670I707g5460e576r8724L3207q2454f4492b3441A3230J11662n8986J2696
10399G8602h4028c3899j04374D3807a58699k2880a2674I7916C4284M4697d1069
10387B0802c9792J6476A1671b9623E6279P5458F5558M1076a14354E1624J1819
10376F3443j0177A0401L48084C7615b14566A46058E036b47935h0389B41741m9262
10365A92479E8069b84667b4602l56324B21006g8647B85744c189A55907J61155
10355C17062k9531D0125K55227L3188F2173J07578D9493J05241R9349J74678A32335
$$ plain form
10343 126944 22326 490341 314359 269999 379392 233719 4508 72729 505170 56112 477786
10332 477786 23600 496542 552561 471556 597822 290705 17378 282057 362624 328753 227210
10321 227210 76871 -36418 103937 -39750 34411 74885 345244 25629 -126464 122358 16887
10309 29705 366337 104645 58794 -118623 202853 101422 144765 -159730 -3418 182456
10298 170349 82579 -112706 -180590 1167 266854 179688 -89603 160248 41940 8894 -103542
10286 -216882 -242221 -46895 -56779 158216 -310083 -128213 -120607 188420 -156675 -44544 32193
10274 31932 -111350 -54901 -137243 53539 22327 64322 270863 -130625 -222115 214274 33014
10262 39461 47186 -201159 999 -13405 -35785 -314514 -99722 -167321 -55073 -195322 93706 -321135
$$ packed form
10343A26944B2326M68015j75982m4360J09393j45673D508O8221M32441E6112M21674
10332D77786B3600M72942N6019q1005J26266B90705A7378K64679Q0567l3871j01543
10321B27210G6871c6418A03937c9750C4411M0474K70359B5629a26464A22358A6887
10309B9705L36632A04645m5851a18623B02853A01422M3343a59730c418A82456
10298A70349H2579a12706o7884A167K65687q7166h9603A60248D1940H894a03542
10286b16882k5339d6895r884A58216c10083a28213P606A88420a56675d4544C2193
10274C1932a11350e4901q2342E3539B2327M1995K06541a30625r1490B14274C3014
10262C9461P725b01159I99a3405k2380k78729i9722o7599e5073j40249I3706c21135
$$ plain form
10249 9609 120500 -247685 13321 -251673 -132214 -44163 254160 382696 115269 191225
10239 191225 155972 146848 415192 413181 70875 161527 242214 217912 222598 77786 147989 243268
10227 243268 253528 -137903 -183676 -79046 -12919 91596 -156434 -155119 -151373 -47773 40465
10215 39637 -96498 68694 -107653 -172730 28536 75154 -203537 -33146 -86655 -183509 -316872
10204 -316872 -172932 16494 -293385 57338 -145244 54475 54707 -184266 -124482 944 -49645
10192 -53468 47956 -340067 -124967 21834 -154881 46336 -168068 18038 332057 -39459 228035
10180 -121964 424669 -46930 -42262 -182199 -138558 40258 -174295 -159041 -73657 286919 46797
10168 73890 -242552 -62572 6792 105739 61912 10076 217171 43710 24138 40993 -34599
$$ packed form
10249I609J10891b47685A3321b51673J19459d4163B54160J28536A15269P5956
10239A91225l5253r124K68344k011G0875R0652Q0687k4302M686G7786P0203R5279
10227B43268J0260a37903m5773g9046a2919I1596a56434J315L746d7773D0465
10215C9637i6498F8694a07653o5077B8536M6618b03537c3146n3509r6854j33363
10204c16872J43940A6494b93385E7338a45244E4475K32a84266N9784I44d9645
10192e3468D7956c40067a24967B1834a54881D6336a68068A8038L14019c9459B28035
10180a21964D24669d6930M668j39937M3641D0258a74295J5254g3657B86919D6797
10168G3890b42552f2572F792R8947m3827A0076K07095D3710j9572J6855c4599
$$ plain form
10156 -53912 227264 -379489 -145093 238185 -132488 -204361 31074 216763 -23974 -151925
10146 -151925 277393 117827 -205097 -50405 -181471 -31509 -195458 -10366 -11876 -313585
10136 -313585 -363933 1140 -116324 -124290 189904 -249619 -300183 -319875 -8771 -102081 597660
10124 -106399 65564 -378411 -220828 -163482 -47010 244921 -193818 210607 -12037 -8665 -228552
10113 -228552 -379046 -161906 -13702 -13848 -501882 -20126 134966 -296433 -74843 -708 -310705
10102 -310705 -404946 106309 -120674 -17224 83019 27781 -311224 -139044 172485 -197887
10091 -210782 -110089 171240 17707 -191455 180021 258897 -158304 -101190 195276 -57310
10080 -135670 -160238 156857 66587 -149753 104276 -179711 126377 -433596 -50278 25244
$$ packed form
10156e3912B27264c79489a45093B38185a32488p1873C1074J85689b3974j27951
10146a51925B77393A17827b05097e0405j31066c1509j63949a0366j510l01709
10136c13585n0348A140a16324p966A89904b49619n0564j9692h771r3310E97660
10124a06399F5564c78411J57583N7346d7010B44921a93818B10607a2037L372k19887
10113b28552j50494a61906a3702j46m88034b0126A34966b96433g4843g08l09997
10102c10705r4241A06309a20674a7224H3019B7781c11224a39044A72485a97887
10091b10782J00693A71240A7707a91455A80021P8876a58304N7114A95276e7310
10080a35670k4568A56857F6587a49753A04276a79711A26377d33596e0278B5244
$$ plain form
10069 75816 -280414 -40675 53034 -150987 262562 -136509 -228401 196053 -189851 -114977
10059 -114977 2383 -182566 -27757 -216700 -107235 -207180 -200132 -193974 -60260 399428 -87499
10047 -28754 -56277 184328 29920 -327372 96409 -29954 -80129 103377 -56947 59549 185779
10036 185779 -254702 -165069 -110512 3494 -170423 -121599 -54786 -240384 105079 251534 164244
10025 164244 19516 -138208 -149816 103079 162084 -195936 15806 -34978 -111207 -158082 -106278
10014 -106278 -193673 -146558 -307118 2386 -24316 -242924 -90126 48682 -170672 -614 75891
10002 -133116 -158972 -129453 -151434 -313864 77340 263987 -238218 96502 299757 129234
9991 -245379 -266233 -116408 106943 -249688 269274 327704 -87519 44327 -135421 -131063 -451497
$$ packed form
10069G5816b80414d0675E3034a50987B62562a36509r1892A96053a89851P4874
10059a14977B383a82566b7757j88943a07235r9945P048O158f0260C99428h7499
10047b8754k7523A84328B9920c27372I6409b9954n0175A03377e6947E9549J26230
10036A85779b54702Q9633N4557C494a70423M8824e4786j85598A05079J46455q7290
10025A64244A9516a38208j1608A03079N9005a95936A5806c4978p6229m6875N1804
10014a06278q7395M7115j60560B386b4316k18608i0126D8682a70672f14G5891
10002a33116k5856K9519k1981j62430G7340J86647b38218I6502K03255A29234
9991b45379k0854a16408A06943b49688B69274N8430h7519D4327a35421M358l20434
$$ plain form
9980 -451497 30442 -210307 39463 -275883 -48284 -214168 -47318 329345 -25965 33600 -199605
9968 63876 86367 141008 290413 -186570 95429 -47372 -45520 209558 -207444 -183750 47098
9956 10416 208701 -310610 -187823 -83340 23855 177359 -46620 -110553 -40992 -299496 -149964
9945 -149964 -433574 249406 3194 67726 -320028 -35727 202968 -88481 -115693 -160224 224362
9933 331987 -119480 -59338 -342135 -278574 -257035 49800 -187591 -90272 -31665 66069 -59259
9921 -56454 -308620 228885 172134 119566 22167 -105022 -241434 -96194 41605 -296896 -134193
9909 -166753 164194 -139529 -165466 21434 -63328 -308765 -130566 -8643 22661 -383433 233620
9897 -61883 -197852 -159777 105221 62535 -213558 -62630 -292069 -331774 53143 -286299 -187489
$$ packed form
9980d51497C0442b10307C9463b75883d8284j65884d7318C29345b5965C3600a99605
9968F3876K2491N4641J49405a86570I5429d7372J852B09558b07444K3694D7098
9956A0416J98285c10610J22787h3340B3855J53504d6620o3933d0992k58504J49532
9945a49964k83610B49406C194O4532c20028c5727B02968h8481k7212m4531B24362
9933C31987a19480e9338k82797O3561K1539D9800a87591i0272c1665F6069e9259
9921e6454k52166B28885n6751n2568B2167a05022j36412i6194D1605b96896a34193
9909a66753A64194a39529k5937B1434f3328k45437a30566h643B2661c83433B33620
9897f1883j35969L8075A05221m2686b13558f2630k29439l9705E3143b86299R8810
$$ plain form
9886 -187489 -139057 -28009 -206009 -147417 -137704 -116109 -181878 -375653 7827 -217984 12473
9874 -149866 173873 6415 -67256 71649 -196291 -274503 -17952 -124692 31404 -115384 91902
9862 -172171 -67530 168660 112817 -152795 70053 62528 -8111 -109576 37476 -246020 -12784
9850 -210837 -214235 -132151 -43788 152735 44602 -128526 401243 -227682 90174 -163216 -146021
9839 -146021 79818 47495 -46946 -81050 93474 -30718 -121060 -245476 53614 -82535 -245491
9828 -245491 10694 247267 145752 -106453 -212274 82723 135944 -338047 -183587 85321
9817 -371075 -176864 -63923 -78193 326686 -211833 -99878 -74011 23597 -11951 -113897 -191231
9806 -191231 111534 -78478 -30642 -155550 -69470 70927 -278747 161494 62993 -182843 -30214
$$ packed form
9886a87489M8432b8009j78000N8592R713K1595o5769j93775G827b17984A2473
9874a49866A73873F415f7256G1649a96291p8212a7952j06740C1404a15384I1902
9862a72171f7530A68660n5843a52795G0053p525h111j01465C7476b46020a2784
9850b10837l398Q2084d3788A52735D4602a28526D01243b27682I0174a63216J7195
9839a46021G9818l2323d6946l4104I3474c0718r0342j24416E3614h2535j62956
9828b45491A0694K36573j01515a06453j05821H2723N3221c38047J54460H5321
9817c71075a76864f3923j4270C26686b11833i9878K5867B3597a1951j01946p7334
9806a91231A11534g8478c0642j24908f9470G0927b78747A61494F2993a82843c0214
$$ plain form
9794 -15127 22678 112047 -124588 230376 -63175 -244698 32714 446665 -66049 -100097 -124005
9783 -124005 -50520 84327 25595 -348682 -90870 16111 69006 -15507 30811 -7774 -295173
9772 -295173 -30022 140344 -184912 -31174 -9762 -70660 -110667 -299596 34891 -163198 -256442
9761 -256442 -396111 -76400 -30315 -68579 -256495 -24762 -9982 50993 119225 -484855 -175141
9749 -7946 26065 -306453 173680 145423 -184377 -158923 -43091 -43602 60124 112533 198453 -103904
9736 -49798 -190737 18329 -180218 -86696 -269519 -249238 103366 -108627 117468 -158433
9725 -44002 70591 -254595 -413927 -270123 -282035 84699 -20484 -121517 -226315 -6669 -194556
9714 -194556 -18232 -123368 176491 -47953 -46864 191405 -206625 60420 -105600 -75869 -153272
$$ packed form
9794a5127B2678Q9369a24588B30376f3175j81523C2714M13951f6049l4048k3908
9783a24005e0520H4327B5595c48682i0870A6111N2895a5507C0811g774k87399
9772b95173c0022A40344a84912c1174i762o0898m0007j88929C4891a63198r3244
9761b56442j39669g6400c0315l8264j87916b4762i982E0993O8232d84855a75141
9749g946B6065c06453A73680k8257a84377K5454d3091n11F0124N2409Q5920a03904
9736d9798j40939A8329a80218h6696j82823K0281A03366a08627A17468a58433
9725d4002G0591b54595j59332J43804j1912H4699b0484j01033j04798f669j87887
9714a94556a8232j05136A76491d7953J089A91405b06625F0420a05600K9731p7403
$$ plain form
9703 -153272 -274077 59138 -97546 -91367 -254509 51651 -185802 -176623 -376686 -106047 -249851
9692 -249851 -381256 -79306 -236011 191343 -111681 -262643 -209773 -324488 -322882 -92238 218978
9680 193965 78049 138363 -171958 1888 -253022 -25704 -159499 141661 -151805 14106 43992
9669 43992 77231 171613 -123788 112357 141064 89188 -253889 -65657 -295965 -236205 108073
9657 -281136 -374697 -399844 -456162 -353899 261215 118212 -104856 42559 -25651 -297185 33768
9645 111287 88016 -149332 107075 225573 -7500 -134792 -180556 88854 -479265 -356258 149864
9633 -84865 194060 -96215 15527 -9706 111032 91375 -146035 -72404 22976 -213092 103407
9621 -299073 -162506 -91547 -171242 -118635 -401952 -1602 303775 -223866 -85848 -298029 164575
$$ packed form
9703a53272j20805E9138i7546O179j63142E1651a85802R179k00063a06047j43804
9692b49851j31405g9306j56705A91343a11681j50962N2870j14715J606i2238B18978
9680A93965G8049O0314a71958A888b53022b5704j33795A41661a51805A4106K9886
9669D3992L3239R4382a23788A12357K8707n1876b53889f5657k30308N9760A08073
9657b81136r3561k5147n6318J02263B61215A18212a04856D2559b5651k71534C3768
9645A11287k3271a49332A07075J18498g500j27292m5764H8854d79265J23007A49864
9633h4865A94060i6215A5527i706A11032j9657a46035g2404B2976b13092A03407
9621b99073J36567P0959p9695N2607k83317a602C03775b23866h5848k12181A64575
$$ plain form
9609 51228 -15073 316906 57437 -306346 -109176 135643 -328828 -316037 87829 -276036 -38275
9597 94786 -230953 -28772 235191 -1727 -890 -152319 133755 -45597 121198 -59359 -144149
9586 -144149 -247002 -7873 73876 -369260 -315379 197848 414106 90469 -73072 -193587 -228510
9575 -228510 9055 -128997 -102244 -259641 158158 -114708 -216440 -71260 -99678 -68193 -129160
9564 -129160 3254 -12537 -238159 -140486 -96558 -31051 99734 -15823 -115069 -323518 85934
9552 -342263 31494 -102764 23818 -80 -106464 79189 159316 -188437 35510 -50218 -101253 73192
9539 -55058 -323918 -349081 6023 -75555 -37389 -81314 -246804 -12668 16486 207722 297933
9528 297933 -209782 -164252 26315 -166810 -212168 251614 210693 -366322 -342687 -187741 -141100
$$ packed form
9609E1228a5073C16906E7437c06346a09176A35643c28828J2791H7829b76036c8275
9597I4786b30953b8772B35191a727Q37j51429A33755d5597A21198e9359q4790
9586a44149j02853g873G3876c69260N3881A97848K16258I0469g3072j20515l4923
9575b28510I055a28997K6753j57397A58158a14708j01732g1260k8418L1485o0967
9564a29160C254a2537k25622R7673M3928c1051I9734a5823r9246k08449H5934
9552c42263C1494a02764B3818h0j06384G9189Q0127a88437C5510e0218n1035G3192
9539e5058k68860k5163F023g5555c7389m3925j65490a2668A6486J91236R0211
9528B97933b09782M5530B6315a66810m5358B51614m0921c66322K3635J54946M6641
$$ plain form
9517 -141100 -42787 156363 299306 -261231 -115970 -22236 65101 -17953 -124610 -364500
9507 -364500 -183810 -220427 -152534 192013 -131397 93922 -55715 -23296 273622 148839 84814
9496 84814 266464 145118 -82437 308886 -261407 -48555 200936 -416560 -133191 -85004
9486 -85004 50613 -365120 -313668 29167 14828 216944 -160192 -62414 -183954 -258151 -58761
9474 -255206 -181365 -311365 66304 270683 -199814 67062 -191477 56582 -151478 142817
9463 54633 -25524 -55118 -202731 189917 -5038 -97342 -70637 96946 210411 -169633 -50288
9451 -30333 -123873 23960 -64596 -123349 -288889 174754 -299404 -200523 70596 48234 -171354
9439 -34030 158256 158202 -163831 -134396 28888 15164 -38064 -152563 -290332 -274207 -17659 152176
$$ packed form
9517a41100d2787A56363J42943b61231a15970b2236F5101a7953j06657k39890
9507c64500J80690l6617O7893A92013a31397I3922e5715b3296B73622j24783o4025
9496H4814J81650j21346h2437C08886b61407d8555B00936d16560a33191M8187
9486h5004E0613c65120N1452B9167j4339K02116a60192f2414j21540p4197e8761
9474b55206P3841j30000F6304K04379a99814F7062a91477E6582a51478A42817
9463E4633b5524k9594j47613A89917e038r2304K6705I6946J13465a69633e0288
9451c0333r3540B3960f4596n8753j65540A74754b99404R8881G0596k2362a71354
9439c4030A58256n4a63831K9435B8888j3724c8064j14499j37769J6125a7659A52176
$$ plain form
9426 34295 -56695 -26925 -107883 -4127 -374420 96069 -78867 -261895 -45887 -14307 -140546
9415 -140546 203830 -185104 -142211 -363271 -54408 899 27857 -145252 70563 166185 46420
9403 -93400 -12604 -44785 18339 -84702 -3430 -46978 -72126 -274523 128785 169192 -119157
9391 231180 7255 -78769 -95987 64681 -79069 28053 197320 86484 -82535 -19422 -121753
9380 -121753 -475329 239935 -213723 -234279 8821 -242958 -29537 9214 275426 -88194 -160602
9369 -160602 35949 -69055 207200 -234584 88024 -216107 -6060 -247823 -155772 107104 -60462
9357 -452587 327666 33688 -210835 -40628 265504 -87146 18451 77020 182083 -43876 -292159
9346 -292159 -132369 -430524 387710 -198910 -68869 -158273 -36355 -172586 -3509 -8869 -197191
$$ packed form
9426C4295e6695b6925q0958d127l70293I6069g8867j83028d5887a4307j26239
9415a40546B03830a85104M2893k21060e4408H99K6958a45252G0563R5622D6420
9403i3400a2604l2181A8339h4702c430m3548k5148k02397A28785M0407a19157
9391B31180G255g8769j7218F4681g9069B8053J69267H6484h2535a9422j02331
9380a21753l53576B39935b13723k0556H821b42958b9537I214K66212h8194p2408
9369a60602C5949f9055B07200b34584H8024b16107f060k41763R2051A07104f0462
9357d52587C27666C3688b10835d0628B65504h7146A8451N8569J05063d3876k48283
9346b92159a32369k98155C87710a98910f8869q9404c6355j36231c509n360j88322
$$ plain form
9335 -197191 -132860 53813 430809 -185264 324612 -36297 -203820 127314 94569 115507 -172573
9323 151380 -340680 272363 94516 -60044 -29363 -42890 -32813 -274666 -387758 -162197 -139215
9312 -139215 -165066 -267670 -86079 -115514 -106562 26723 16503 -45831 128414 -148923 -201867
9301 -201867 -2686 -202003 -40709 -266377 155114 -245092 -2752 -115185 -143807 -119779 -4160
9289 -127850 -61658 -338000 46807 -23977 -183624 -300055 142183 249194 -281513 -66564
9278 -149532 -295107 -231525 130622 126306 95614 -54117 363038 -302529 44807 -112605 267135
9266 9783 -131444 127117 -12332 -196340 221093 -233068 17294 -126410 -236891 90884 152058
9255 152058 129069 -361367 -98063 -30347 -131055 -160941 -185759 -176638 156072 121160 8980
$$ packed form
9335a97191O4331E3813L76996a85264C24612c6297j67523A27314l2745K0938a72573
9323A51380c40680B72363I4516f0044b9363j3527J0077k41853j13092a62197K2982
9312a39215k5851j02604h6079k9435Q952B6723j0220d5831A28414a48923n2944
9301b01867b686j99317d0709k25668A55114b45092b752j12433k8622K4028d160
9289a27850f1658k76342D6807b3977j59647j16431A42183J07011b81513f6564
9278a49532j45575O3582A30622m316l0692e4117C63038c02529D4807a12605B67135
9266I783a31444A27117a2332j84008B21093b33068A7294a26410j10481I0884O1174
9255A52058k2989c61367i8063c0347j00708k9886k4818R121A56072l4912H980
$$ plain form
9243 -88816 362676 -167652 110874 -39880 -133166 135739 -228831 -168517 239078 18899 169450
9232 169450 -263467 109836 -90518 -26731 -204802 -29527 -44947 -302711 -215543 -266657 -167565
9221 -167565 79545 -32436 247793 -81499 24007 -94054 -37070 -372828 -10351 -83135 -97110
9210 -97110 36785 -156102 -123564 528900 34422 -142051 -68215 -105684 -185486 -127020 -54139
9198 -65364 179365 -278866 175606 -104399 -28633 45103 300769 -157494 -281048 -203382
9188 -203382 254330 -31171 -116927 -52254 -300605 -99500 105889 -128585 -310856 -216660 1048
9176 125848 -26729 -1716 -170193 -152854 174658 8351 222919 321138 143953 -178417 45403
9164 64383 -245279 61987 -149701 -206477 -106611 -230035 -2231 14428 62327 129428 107511
$$ packed form
9243h8816C62676a67652A10874c9880r3286A35739b28831O0314B39078A8899J50551
9232A69450b63467A09836i0518b6731j78071b9527j5420k57764Q7168n1114R9092
9221a67565G9545c2436B47793h1499B4007i4054c7070l35758a0351p2784j3975
9210i7110C6785a56102L2538E28900C4422a42051f8215l7469p9802N8466e4139
9198f5364A79365b78866A75606a04399b8633D5103K55666a57494j23554P7666
9188b03382B54330c1171q5756e2254k48351i9500A05889a28585j82271R4196A048
9176A25848b6729a716j68477J7339A74658H351K14568R8219A43953a78417D5403
9164F4383b45279F1987a49701n6776R9866j23424b231A4428M7899O7101k1917
$$ plain form
9153 107511 293663 65039 -134262 221020 -131000 234470 119147 -299637 -90713 -81815
9143 -81815 -298585 -242678 -48956 42233 48873 -18381 -61905 -63730 182400 15 -285927 -7196
9130 -86887 -68211 -72645 -66692 -85459 -27692 61030 -257526 228551 13758 -281797 49311 142814
9118 142814 -151515 236223 -360050 -520183 243889 -112416 24902 -9575 -133401 -67785
9108 -67785 -273506 227948 -45121 -27100 53702 20355 -16178 -197489 -86437 -416125 -110428
9096 27235 -284557 106981 26746 -181477 264415 -116033 -357892 83151 -439482 -26223
9085 -142750 -121863 -249623 -140785 20593 -290567 -63416 -80974 -175737 -208934 49191 183503
9074 183503 -9830 -70214 -178443 27729 -280 -330872 -136522 -219348 229632 55503 181567
$$ packed form
9153A07511J86152F5039a34262B21020a31000B34470j15323b99637i0713Q898
9143h1815k16770N5907d8956D2233O640a8381m3524j825A82400A5b85927g196
9130h6887J8676m434N953j8767b7692F1030b57526B28551A3758b81797D9311R3503
9118A42814a51515B36223c60050j60133B43889a12416B4902i575j23826O5616
9108f7785k05721B27948d5121J8021E3702B0355a6178j81311h6437l29688a10428
9096B7235b84557A06981B6746a81477B64415a16033k41859H3151d39482b6223
9085a42750K0887j27760J08838B0593b90567f3416j7558r4763l3197D9191J34312
9074A83503i830o0384j08229B7729b80l30592a36522q2826B29632E5503J26064
$$ plain form
9063 181567 -138609 -109042 -48628 -2044 350293 118347 -8588 -139680 -289873 355359 -43395
9051 -89430 343912 -125313 -242574 -29454 -31901 -315326 -131104 13643 16913 -50828 -433962
9040 -433962 -210244 -101409 134354 -301394 -3605 -83472 -129771 159735 97025 92493 -71445
9028 126407 -200907 -48862 224375 -140545 141100 62616 -105202 -362007 -128709 -237464
9018 -237464 93720 -74103 -90059 -222997 -332995 -56525 -61213 -350995 -198347 220178 62920
9006 -184585 -78467 144463 72637 207101 23123 -8481 -91143 -71530 -268221 -112258 -63616
8995 -63616 -271084 -307227 129738 211152 271280 8069 -66080 254459 -225851 -256700 -81743
8983 -196267 195531 -387303 -74454 230062 5236 -206140 328329 -262845 -200464 -413013
$$ packed form
9063A81567a38609K9567d8628b044C50293A18347h588j31092j50193C55359d3395
9051h9430C43912a25313j17261b9454k447k83425a31104A3643L270e0828l83134
9040d33962b10244a01409A34354c01394c605p9867m6299A59735o2710m532g1445
9028A26407b00907d8862B24375a40545A41100F2616a05202k56805a28709j08755
9018b37464I3720g4103j5956j32938j09998e6525m688k89782J52648B20178F2920
9006a84585g8467A44463p1826J34464B3123h481q2662J9613j96691a12258M8642
8995f3616k07468l6143A29738Q1414O0128H069f6080B54459b25851l0849h1743
8983a96267A95531c87303g4454B30062E236b06140C28329b62845O2381k12549
$$ plain form
8973 -413013 -115768 -93682 -98804 27687 -156822 -199029 33891 177128 -83848 -343122 -85046
8961 166650 252292 -146694 44523 -192642 -160729 132657 -170983 220121 -44379 -245442
8951 -245442 483574 -240391 -122057 199901 -24269 130664 -185744 -302461 -239618 76250
8940 -208721 203013 -54904 12119 -58044 177265 -276725 395078 1926 47486 -254808 -36420
8928 33913 -180844 101684 48663 74877 -224265 -57797 231006 -118793 -114496 110467 -141219
8916 43275 148133 -157364 385627 75138 337460 469363 -4048 28489 425120 617395 1076668
8905 1076668 1634429 2721072 6638566 5233946 2812325 1367389 914414 463049 173135
8895 250126 130585 -190537 409208 501775 229289 61478 147562 115893 -41967 -90719 -221382
$$ packed form
8973d13013a15768K2086n122B7687a56822m2207C3891J43237h3848k59274h5046
8961A66650Q5642a46694D4523a92642L1913A32657a70983B20121d4379k01063
8951b45442D83574b40391J18334A99901b4269A30664a85744j16717O2843G6250
8940b08721B03013e4904A2119e8044A77265b76725C95078A926M5560b54808c6420
8928C3913a80844A01684D8663K6214b24265e7797B31006a18793M297A10467a41219
8916D3275J04858a57364C85627G5138K62322J31903d048B8489L96631J92275M59273
8905A076668N57761J086643L917494j404620k421621A367389m52975m51365A73135
8895B50126j19541a90537D09208R2567B29289F1478Q6084l1669d1967m8752j30663
$$ plain form
8884 -221382 -58792 -148411 17363 7916 71447 66148 -35369 4103 -101702 -399148 399648 50355
8871 143736 -107722 68674 -275193 282272 -126067 101642 87165 -186123 -302303 -219902
8861 -219902 91837 3794 140054 -148133 -176484 -184418 -347747 40077 -110016 -104673 -237132
8850 -237132 -44985 -147764 4795 67238 20813 -33927 -255534 2334 -129735 -230236 -73460
$$ packed form
8884b21382e8792q9619A7363G916O3531n299c5369D103a01702k97446C99648E0355
8871A43736a07722F8674b75193B82272a26067A01642j4477a86123j16180Q2401
8861b19902I1837C794J36260a48133k8351p934j63329D0077a10016N343j32459
8850b37132d4985j02779D795O2443B0813c3927k21607B334a29735j00501g3460
$$ [...]
##END NTUPLES=NMR SPECTRUM
##END=
