
##TITLE=AC1213_BRAAS12064_5946111_s2P2xJQJUA
##JCAMPDX= 6.0         $$ Bruker NMR JCAMP-DX V2.0
##DATA TYPE= NMR SPECTRUM
##DATA CLASS= NTUPLES
##ORIGIN= BRUKER
##OWNER= Administrator
$$ 1.72 TOPSPIN		Version 2.1
$$ 2012-04-10 21:23:05.546 -0500  Administrator@TOPSPIN
$$ Compression mode = diff/dup
##.OBSERVE FREQUENCY= 400.13188235
##.OBSERVE NUCLEUS= ^1H
##.ACQUISITION MODE= SIMULTANEOUS (DQD)
##.ACQUISITION SCHEME= undefined
##.AVERAGES= 64
##.DIGITISER RES= 22
##SPECTROMETER/DATA SYSTEM= spect
##.PULSE SEQUENCE= noesygpps1d.comp
##.SOLVENT NAME= COFFEE_meoh
##.SHIFT REFERENCE= INTERNAL, COFFEE_meoh, 1, 14.96863
##AUDIT TRAIL= $$ (NUMBER, WHEN, WHO, WHERE, PROCESS, VERSION, WHAT)
$$ ##TITLE= Audit trail, TOPSPIN		Version 2.1
$$ ##JCAMPDX= 5.01
$$ ##ORIGIN= Bruker BioSpin GmbH
$$ ##OWNER= Administrator
$$ $$ C:\Bruker\TOPSPIN/data/COFFEE/nmr/AC1213_BRAAS12064_5946111_s2P2xJQJUA/12/pdata/1/auditp.txt
$$ ##AUDIT TRAIL=  $$ (NUMBER, WHEN, WHO, WHERE, PROCESS, VERSION, WHAT)
(   1,<2012-04-10 21:23:00.671 -0500>,<Administrator>,<TOPSPIN>,<go>,<TOPSPIN 2.1>,
      <created by zg
	started at 2012-04-10 21:11:29.140 -0500,
	POWCHK enabled, PULCHK disabled,
       configuration hash MD5:
       1A 1E CE 29 27 FD 77 03 67 4E F0 E3 C4 B2 CB 90
       data hash MD5: 64K
       9B E2 C8 FC 2F E8 68 A0 0D F8 4C E5 4F 8B 68 55>)
(   2,<2012-04-10 21:23:03.468 -0500>,<Administrator>,<TOPSPIN>,<proc1d>,<TOPSPIN 2.1>,
      <Start of raw data processing
       efp LB = 0.3 FT_mod = 6 PKNL = 1 PHC0 = 0 PHC1 = 0 SI = 128K 
       data hash MD5: 128K
       A4 A6 61 25 5D 59 99 D3 C9 EB CE 0A 06 27 90 B1>)
(   3,<2012-04-10 21:23:04.781 -0500>,<Administrator>,<TOPSPIN>,<proc1d>,<TOPSPIN 2.1>,
      <pk PHC0 = 30.51453 PHC1 = 0 
       data hash MD5: 128K
       C3 20 92 BD FC 0B 3E 6F C4 F8 6F E6 78 EE E4 6B>)
(   4,<2012-04-10 21:23:05.015 -0500>,<Administrator>,<TOPSPIN>,<proc1d>,<TOPSPIN 2.1>,
      <abs ABSG = 1 
       data hash MD5: 128K
       F9 95 67 9E A8 AB 13 EC 9B C0 BD E1 87 77 B6 90>)
(   5,<2012-04-10 21:23:05.093 -0500>,<Administrator>,<TOPSPIN>,<proc1d>,<TOPSPIN 2.1>,
      <abs ABSG = 2 
       data hash MD5: 128K
       14 98 32 12 CE 78 BA 5C CA 7C 46 6E C1 32 1F B2>)
(   6,<2012-04-10 21:23:05.140 -0500>,<Administrator>,<TOPSPIN>,<proc1d>,<TOPSPIN 2.1>,
      <abs ABSG = 3 
       data hash MD5: 128K
       A5 4C EB B3 28 4F AE 05 62 42 D0 8D FB D5 B4 80>)
(   7,<2012-04-10 21:23:05.421 -0500>,<Administrator>,<TOPSPIN>,<proc1d>,<TOPSPIN 2.1>,
      <abs ABSG = 4 
       data hash MD5: 128K
       D4 2A 14 D8 23 17 8B F2 92 BD F6 6D F8 32 27 BF>)
(   8,<2012-04-10 21:23:05.468 -0500>,<Administrator>,<TOPSPIN>,<proc1d>,<TOPSPIN 2.1>,
      <abs ABSG = 5 
       data hash MD5: 128K
       AF 50 78 E6 1E 27 E2 86 FE A6 1B B3 AB 82 DA DC>)
$$ ##END=
$$ 
$$ $$ hash MD5
$$ $$ 9D 6F 6E 24 AE 82 72 55 DA 31 27 A2 16 54 64 63
##$RELAX= 
##$RELAX= 
##$RELAX= 
##$RELAX= 
##$RELAX= 
##$RELAX= 
##$RELAX= 
##$RELAX= 
$$ Bruker specific parameters
$$ [...]
##$TP07= 0
##$TPNAME0= <>
##$TPNAME1= <>
##$TPNAME2= <>
##$TPNAME3= <>
##$TPNAME4= <>
##$TPNAME5= <>
##$TPNAME6= <>
##$TPNAME7= <>
##$TPOAL= (0..7)
0.5 0.5 0.5 0.5 0.5 0.5 0.5 0.5
##$TPOFFS= (0..7)
0 0 0 0 0 0 0 0
##$TUNHIN= 0
##$TUNHOUT= 0
##$TUNXOUT= 0
##$USERA1= <user>
##$USERA2= <user>
##$USERA3= <user>
##$USERA4= <user>
##$USERA5= <user>
##$V9= 5
##$VALIST= <valist>
##$VCLIST= <CCCCCCCCCCCCCCC>
##$VD= 0
##$VDLIST= <DDDDDDDDDDDDDDD>
##$VPLIST= <PPPPPPPPPPPPPPP>
##$VTLIST= <TTTTTTTTTTTTTTT>
##$WBST= 1024
##$WBSW= 4
##$XGAIN= (0..3)
0 0 0 0
##$XL= 0
##$YL= 0
##$YMAX_a= 13922993
##$YMIN_a= -5793827
##$ZGOPTNS= <>
##$ZL1= 120
##$ZL2= 120
##$ZL3= 120
##$ZL4= 120
##$ABSF1= 14.96863
##$ABSF2= -5.5839
##$ABSG= 5
##$ABSL= 3
##$ALPHA= 0
##$AQORDER= 0
##$ASSFAC= 0
##$ASSFACI= 0
##$ASSFACX= 0
##$ASSWID= 0
##$AUNMP= <proc_prof1d_extract.lims>
##$AXLEFT= 0
##$AXNAME= <>
##$AXNUC= <1H>
##$AXRIGHT= 0
##$AXTYPE= 0
##$AXUNIT= <>
##$AZFE= 0.1
##$AZFW= 0.1
##$BCFW= 0
##$BC_mod= 0
##$BYTORDP= 0
##$COROFFS= 0
##$CY= 15
##$DATMOD= 1
##$DC= 0
##$DFILT= <>
##$DTYPP= 0
##$F1P= 0
##$F2P= 0
##$FCOR= 0.5
##$FTSIZE= 131072
##$FT_mod= 6
##$GAMMA= 0
##$GB= 0
##$INTBC= 1
##$INTSCL= 1
##$ISEN= 128
##$LB= 0.3
##$LEV0= 0
##$LPBIN= 0
##$MAXI= 10000
##$MC2= 0
##$MEAN= 0
##$ME_mod= 0
##$MI= 0
##$NCOEF= 0
##$NC_proc= -3
##$NLEV= 6
##$NOISF1= 0
##$NOISF2= 0
##$NSP= 0
##$NTH_PI= 0
##$NZP= 0
##$OFFSET= 14.96863
##$PC= 1
##$PHC0= 30.51453
##$PHC1= 0
##$PH_mod= 1
##$PKNL= yes
##$PPARMOD= 0
##$PPDIAG= 0
##$PPIPTYP= 0
##$PPMPNUM= 2147483647
##$PPRESOL= 1
##$PSCAL= 4
##$PSIGN= 0
##$PYNMP= <proc.py>
##$REVERSE= no
##$SF= 400.130004793491
##$SI= 131072
##$SIGF1= 0
##$SIGF2= 0
##$SINO= 400
##$SIOLD= 131072
##$SPECTYP= <>
##$SREGLST= <1H.CDCl3>
##$SSB= 0
##$STSI= 131072
##$STSR= 0
##$SW_p= 8223.68421052632
##$SYMM= 0
##$S_DEV= 0
##$TDeff= 65536
##$TDoff= 0
##$TI= <>
##$TILT= no
##$TM1= 0
##$TM2= 0
##$TOPLEV= 0
##$USERP1= <user>
##$USERP2= <user>
##$USERP3= <user>
##$USERP4= <user>
##$USERP5= <user>
##$WDW= 1
##$XDIM= 131072
##$YMAX_p= 500104933
##$YMIN_p= -173607208
##$CURPLOT= <Network HP LaserJet P1505>
##$CURPRIN= <$Network HP LaserJet P1505>
##$DFORMAT= <normdp>
##$LAYOUT= <+/1D_H.xwp>
##$LFORMAT= <normlp>
##$PFORMAT= <normpl>
##$SURQMSG= 1
$$ End of Bruker specific parameters
$$ ---------------------------------
##NTUPLES= NMR SPECTRUM
##VAR_NAME=  FREQUENCY,     SPECTRUM/REAL,   SPECTRUM/IMAG
##SYMBOL=    X,             R,               I
##VAR_TYPE=  INDEPENDENT,   DEPENDENT,       DEPENDENT
##VAR_FORM=  AFFN,          ASDF,            ASDF
##VAR_DIM=   131072,        131072,          131072
##UNITS=     HZ,            ARBITRARY UNITS, ARBITRARY UNITS
##FACTOR=    0.0627417313425165, 1,          1
##FIRST=     8223.62146879498, -1694,        -96787
##LAST=      0,             1196,            -98251
##MIN=       0,             -173607208,      0
##MAX=       8223.62146879498, 500104933,    0
$$ Real data points
##PAGE= N=1
##DATA TABLE= (X++(R..R)), XYDATA
$$ [...]
60728A112931J487J823J836K591M061N683P364R440J1800J3677J4438J4230J3817
60715A215178J4037J5195J6703J7443J6882J5586J4366J3411J2645J2287J2270
60704A376003J1714J0028Q152P433P501O631M386K566L003N270P194P110N168
60691A462159K855J521J280J326J291J654K432K440P92j676l609m973o340p184
60677A453968o759o121p099r366j0693j0348j0021j0953j2298j3045j3349j3068
60665A330848j1152p733m935m161m335m138m095m775m854l215j461j922m197o054
60651A263821p001q306r985j0480r570r068r829j0185q355m932j973p55j150k233
60637A169999k646j421P81J838M60k164l692l277k231k340m170o930r450j1045
$$ plain form
60728 1112931 1114418 1116241 1118077 1120668 1124729 1130412 1137776 1147216 1159016 1172693 1187131 1201361 1215178
60715 1215178 1229215 1244410 1261113 1278556 1295438 1311024 1325390 1338801 1351446 1363733 1376003
60704 1376003 1387717 1397745 1405897 1413330 1420831 1427462 1431848 1434414 1437417 1442687 1449881 1456991 1462159
60691 1462159 1465014 1466535 1467815 1469141 1470432 1472086 1474518 1476958 1477750 1476074 1472465 1467492 1461152 1453968
60677 1453968 1447209 1441088 1433989 1424623 1413930 1403582 1393561 1382608 1370310 1357265 1343916 1330848
60665 1330848 1319696 1311963 1307028 1302867 1298532 1294394 1290299 1285524 1280670 1277455 1275994 1274072 1269875 1263821
60651 1263821 1256820 1248514 1238529 1228049 1218479 1209411 1199582 1189397 1181042 1176110 1174137 1173382 1172232 1169999
60637 1169999 1167353 1165932 1166713 1168551 1169011 1166847 1163155 1159878 1157647 1155307 1151137 1144207 1134757 1123712
60623A123712j1673j1623j1261j0958j1026j1469j2060j2640j3125j3088j1900
60612I92889r624p319n904n084l947k316q22J97J017J746K056J938K051K802L572
60597I73252L477K598J902K070K969M265N832P276P757O922N637N032N022M561
60583A038572L342K264K064K460L064M099N557O623O886P296Q799J0745J1880
60570A113651J2326J3194J4682J5997J6996J8258J9516J9721J8937J8522J8882
60559A300682J8582J6625J4198J3108J3281J3018J1219Q452O064M820M339L587
60547A427975K010M5j835m068p144j0180j1673j1647j1690j2668j3753j3970j3385
60534A318017j2394j1136j0048r582q880o271j849J938L058K016M67o68q28P24
$$ plain form
60623 1123712 1112039 1100416 1089155 1078197 1067171 1055702 1043642 1031002 1017877 1004789 992889
60612 992889 983265 975946 970042 964958 961011 958695 957873 958070 959087 960833 962889 964827 966878 969680 973252
60597 973252 976729 979327 981229 983299 986268 990533 996365 1003641 1011398 1018320 1023957 1028989 1034011 1038572
60583 1038572 1041914 1044178 1046242 1048702 1051766 1055865 1061422 1068045 1074931 1082227 1091026 1101771 1113651
60570 1113651 1125977 1139171 1153853 1169850 1186846 1205104 1224620 1244341 1263278 1281800 1300682
60559 1300682 1319264 1335889 1350087 1363195 1376476 1389494 1400713 1409165 1415229 1420049 1424388 1427975
60547 1427975 1429985 1430030 1428195 1424127 1416983 1406803 1395130 1383483 1371793 1359125 1345372 1331402 1318017
60534 1318017 1305623 1294487 1284439 1274857 1265977 1259706 1257857 1259795 1262853 1264869 1265336 1264668 1263840 1264564
60520A264564L516N215M023Q85j878l179l233k186k99J341J880J937K543L441
60506A278570L806L872M472N513O337O960P593P586O426N204N442O832P786P984
60492A364383Q640J0366J2339J3775J4820J5907J7479K0350K5050L0711L5746
60481A569566L9681M3220M6780N0164N3456N6552N7903N5454M9061M0500L0719
60470B093056J8963N214q173j8508k5263k9441l1321l0196k5998k0135j4456r675
60458A904067m974P81P326J3036J7045K0612K5240L0122L3103L4043L5398L8894
60446B154693M3521M7759N2226N8705O7544P7550Q7850R8549J09908J22198J36147
60435C056650J52338J70045J87637K04269K20362K36381K52219K68140K85389
$$ plain form
60520 1264564 1268080 1273295 1277318 1278203 1276325 1273146 1269913 1267727 1267428 1268769 1270649 1272586 1275129 1278570
60506 1278570 1282376 1286248 1290720 1296233 1302570 1309530 1317123 1324709 1331135 1336339 1341781 1348613 1356399 1364383
60492 1364383 1373023 1383389 1395728 1409503 1424323 1440230 1457709 1478059 1503109 1533820 1569566
60481 1569566 1609247 1652467 1699247 1749411 1802867 1859419 1917322 1972776 2021837 2062337 2093056
60470 2093056 2112019 2117233 2109060 2090552 2065289 2035848 2004527 1974331 1948333 1928198 1913742 1904067
60458 1904067 1899093 1899874 1907200 1920236 1937281 1957893 1983133 2013255 2046358 2080401 2115799 2154693
60446 2154693 2198214 2245973 2298199 2356904 2424448 2501998 2589848 2688397 2798305 2920503 3056650
60435 3056650 3208988 3379033 3566670 3770939 3991301 4227682 4479901 4748041 5033430
60426E033430L05247L27884L52200L75524L92458L94908L75186L29760K59854
60417H146451J69293O3408m9998j60935k60150l41412m00889m36495m49596m45884
60407E833793m31895m10783l83185l51338l19481k90048k62317k35671k11512
60398B937563j90607j71216j51890j34132j20006j08659r7713q6885p7663p0170
60388A728622o3090n6415n1594m8790m6288m3043l9759l6945l4036l1039k9158
60377A248465k8678k7883k5259k1558j8568j6816j5547j4150j2632j1190j0091
60366A046093r482q918p679n981m952m884m499k790o62L64L99P98J894K640K603
60351A004944K937M489O008N526L219J614K476M618N596M817L692L173K800K448
$$ plain form
60426 5033430 5338677 5666561 6018761 6394285 6786743 7181651 7556837 7886597 8146451
60417 8146451 8315744 8379152 8329154 8168219 7908069 7566657 7165768 6729273 6279677 5833793
60407 5833793 5401898 4991115 4607930 4256592 3937111 3647063 3384746 3149075 2937563
60398 2937563 2746956 2575740 2423850 2289718 2169712 2061053 1963340 1876455 1798792 1728622
60388 1728622 1665532 1609117 1557523 1508733 1462445 1419402 1379643 1342698 1308662 1277623 1248465
60377 1248465 1219787 1191904 1166645 1145087 1126519 1109703 1094156 1080006 1067374 1056184 1046093
60366 1046093 1036611 1027693 1020014 1014033 1009081 1004197 999698 996908 996246 996610 997009 997807 999701 1002341 1004944
60351 1004944 1007881 1012370 1018378 1023904 1027123 1028737 1031213 1035831 1041427 1046244 1049936 1053109 1055909 1058357
60337A058357L278N801Q385R111Q311P746P761P012M975L050K584L000K631Q02
60323A132804j510k741k261j034p94k223m217n286n155m390l162j544n01j070
60309A096916k520k834j356M77J431K069L201M142L829K960L553O435J0142J2518
60295A140963J2690J1371R806Q801Q522Q824R551J0461J1073J0778R264O861M548
60282A263513L398L686M431M267K921J502J140J790K628L036K805J986J132J216
60268A299451K646M668O213O907O726N329K534q45l425m397l858k534j671k479
60254A315265m777o718o691n041l274k203j793j935k220j737l59M29n77k247k600
60239A273522j738j326j519o63J751L941M362L551K722K085J490J395K175L382
$$ plain form
60337 1058357 1061635 1067436 1075821 1084932 1093243 1100989 1108750 1115762 1120737 1123787 1126371 1129371 1132002 1132804
60323 1132804 1131294 1128553 1126292 1125258 1124464 1122241 1118024 1112738 1107583 1103193 1100031 1098487 1097986 1096916
60309 1096916 1094396 1091562 1090206 1090683 1092114 1094183 1097384 1101526 1105355 1108315 1111868 1118303 1128445 1140963
60295 1140963 1153653 1165024 1174830 1183631 1192153 1200977 1210528 1220989 1232062 1242840 1252104 1258965 1263513
60282 1263513 1266911 1270597 1275028 1279295 1282216 1283718 1284858 1286648 1289276 1292312 1295117 1297103 1298235 1299451
60268 1299451 1302097 1306765 1312978 1319885 1326611 1331940 1334474 1333629 1330204 1325807 1321949 1319415 1317744 1315265
60254 1315265 1310488 1303770 1297079 1292038 1288764 1286561 1284768 1282833 1280613 1278876 1278517 1278946 1278369 1276122 1273522
60239 1273522 1271784 1270458 1268939 1268276 1270027 1273968 1278330 1281881 1284603 1286688 1288178 1289573 1291748 1295130
60225A295130M433N312O164O975P992R451J0743J1026J0854J1815J4077J5788
60213A409760J5695J4959J5393J7134J9112K0812K2367K3706K4793K6219K8588
60202A638538L1649L4797L7926M1169M4268M6892M9247N1740N4589N8166O3184
60191B152165O9816P7119Q3940R0150R6465J03384J10734J18044J25088J32232
60181C159137J40104J48532J56116J61727J66223J71366J76839J79727J77502
60172D637273J70429J60418J48793J35987J22238J07399R0785P2310N3160L4524
60162E733316J6493p99j5767k6557l3216l7448m0313m1346l9801l5586k8721j8968
60150E431287o495P755K2796L8318N4318P0466Q6288J01850J17663J33647J48409
$$ plain form
60225 1295130 1299563 1304875 1311039 1318014 1326006 1335457 1346200 1357226 1368080 1379895 1393972 1409760
60213 1409760 1425455 1440414 1455807 1472941 1492053 1512865 1535232 1558938 1583731 1609950 1638538
60202 1638538 1670187 1704984 1742910 1784079 1828347 1875239 1924486 1976226 2030815 2088981 2152165
60191 2152165 2221981 2299100 2383040 2473190 2569655 2673039 2783773 2901817 3026905 3159137
60181 3159137 3299241 3447773 3603889 3765616 3931839 4103205 4280044 4459771 4637273
60172 4637273 4807702 4968120 5116913 5252900 5375138 5482537 5573322 5645632 5698792 5733316
60162 5733316 5749809 5749010 5733243 5706686 5673470 5636022 5595709 5554363 5514562 5478976 5450255 5431287
60150 5431287 5424792 5432547 5455343 5493661 5547979 5618445 5704733 5806583 5924246 6057893 6206302
60139F206302J60002J67437J71145J71823J69300J62754J51544J35487J15051
60130G610845R1796O7900M4317K0056n637l1072n3590p2692q9844j05198j16599
60119G360282j22374j23199j20268j13341j01939q7109p0513n2554l2792j1718
60109F524475R165K8783M7068O4277Q0364R4716J05996J12671J14342J12096J07046
60098G400999R9058Q7607P3360N8121M3418K9737J6987N236m833j2016j5377j5000
60086G767297j1463m509O880K2801M1787O2461Q5021J10330J38181J67257J96622
60075H582665K26479K57516K89862L22747L55123L86696M17915M48543M76665
60066A1764211N00069N18170N31426N39151N39465N31405N15391M91357M58223
$$ plain form
60139 6206302 6366304 6533741 6704886 6876709 7046009 7208763 7360307 7495794 7610845
60130 7610845 7702641 7770541 7814858 7834914 7829277 7798205 7744615 7671923 7582079 7476881 7360282
60119 7360282 7237908 7114709 6994441 6881100 6779161 6692052 6621539 6568985 6536193 6524475
60109 6524475 6533640 6562423 6609491 6673768 6754132 6848848 6954844 7067515 7181857 7293953 7400999
60098 7400999 7500057 7587664 7661024 7719145 7762563 7792300 7809287 7814523 7809690 7797674 7782297 7767297
60086 7767297 7755834 7751325 7758205 7781006 7822793 7885254 7970275 8080605 8218786 8386043 8582665
60075 8582665 8809144 9066660 9356522 9679269 10034392 10421088 10839003 11287546 11764211
60066 11764211 12264280 12782450 13313876 13853027 14392492 14923897 15439288 15930645 16388868
60057A6388868M15973L66553L11759K51703J86353J17074M5484k7733j01433j72767
60047A7781834k38854k98688l51799l96089m28862m49395m58782m57705m46171
60038A4255489m25054l96224l61180l20999k77575k33235j88987j44503j00055
60029A1807677n7228j7369J9314N2532Q0778J02169J15950J22595J22711J16242
60019A2465371J02683Q2062N5838K6666l090l2591o2115r1818j21095j48878j74048
60008A2098985j95895k14519k30655k44636k55690k62478k64028k60105k51144
59999I919835k38199k22530k04829j85047j62970j38626j12163q4117n5836k8720
59989H486798k728K3420N0125P5845R8653J17995J34390J48067J58417J64131
$$ plain form
60057 16388868 16804841 17171394 17483153 17734856 17921209 18038283 18083767 18056034 17954601 17781834
60047 17781834 17542980 17244292 16892493 16496404 16067542 15618147 15159365 14701660 14255489
60038 14255489 13830435 13434211 13073031 12752032 12474457 12241222 12052235 11907732 11807677
60029 11807677 11750449 11733080 11752394 11804926 11885704 11987873 12103823 12226418 12349129 12465371
60019 12465371 12568054 12650116 12705954 12732620 12729530 12696939 12634824 12543006 12421911 12273033 12098985
60008 12098985 11903090 11688571 11457916 11213280 10957590 10695112 10431084 10170979 9919835
59999 9919835 9681636 9459106 9254277 9069230 8906260 8767634 8655471 8571354 8515518 8486798
59989 8486798 8484070 8507490 8557615 8633460 8732113 8850108 8984498 9132565 9290982 9455113
59979I455113J63583J55821J41621J22849J00664P5196M6906J6804j4794m8037
59969A0215726q1391j11594j36769j57956j76383j90899j99487k01839j98732
59960H760676j90313j76969j60779j43914j26169j05987q3469o0469l7950j5094
59950G659563Q980L4155O0005Q6152J11882J36637J60808J84923K07998K27764
59940H878867K42453K51413K54124K49712K37632K18169J92387J62036J29055
59931A0815848R4495N8266K0371j8246n6453r3455j27914j57664j81319j98960
59921A0154969k10309k13588k07701j94348j76508j55852j33022j09125q4923
59912H669593n9567l2131l693K3893N0289P5743R8950J18310J34463J49020J61323
$$ plain form
59979 9455113 9618696 9774517 9916138 10038987 10139651 10214847 10261753 10278557 10263763 10215726
59969 10215726 10134335 10022741 9885972 9728016 9551633 9360734 9161247 8959408 8760676
59960 8760676 8570363 8393394 8232615 8088701 7962532 7856545 7773076 7712607 7674657 7659563
59950 7659563 7668543 7702698 7762703 7848855 7960737 8097374 8258182 8443105 8651103 8878867
59940 8878867 9121320 9372733 9626857 9876569 10114201 10332370 10524757 10686793 10815848
59931 10815848 10910343 10968609 10988980 10970734 10914281 10820826 10692912 10535248 10353929 10154969
59921 10154969 9944660 9731072 9523371 9329023 9152515 8996663 8863641 8754516 8669593
59912 8669593 8610026 8577895 8574202 8598095 8648384 8724127 8823077 8941387 9075850 9224870 9386193
59901I386193J69286J73019J74638J74328J69686J59604J46142J31624J16429
59892A0800949J00783Q6365P4546O4759N6131M9606M7252N0346N8951P2473R0181
59881A1552342J12026J39181J72519K10625K50797K92152L35755L81233M25387
59872A3872017M65179N00324N31436N56851N72698N75167N61612N30171M79820
59863A8645275M10830L24764K24338J13561k343j17474k25781l21798m02050m65599
59853A8183723n12494n42175n54583n52074n38291n15325m83682m44940m02159
59844A3638000l57234l10008k60741k11514j63997j17499p0643k3960K0389O0731
59834A2203524R6821J29089J57426J80336J95308K00609J96280J82503J57847
$$ plain form
59901 9386193 9555479 9728498 9903136 10077464 10247150 10406754 10552896 10684520 10800949
59892 10800949 10901732 10988097 11062643 11127402 11183533 11233139 11280391 11330737 11389688 11462161 11552342
59881 11552342 11664368 11803549 11976068 12186693 12437490 12729642 13065397 13446630 13872017
59872 13872017 14337196 14837520 15368956 15925807 16498505 17073672 17635284 18165455 18645275
59863 18645275 19056105 19380869 19605207 19718768 19716425 19598951 19373170 19051372 18649322 18183723
59853 18183723 17671229 17129054 16574471 16022397 15484106 14968781 14485099 14040159 13638000
59844 13638000 13280766 12970758 12710017 12498503 12334506 12217007 12146364 12122404 12142793 12203524
59834 12203524 12300345 12429434 12586860 12767196 12962504 13163113 13359393 13541896 13699743
59825A3699743J20929P3292J8518m1201j05180j70947k33615k89286l36614l74425
59815A2361214m00708m15280m20875m19834m12031l97682l79560l60054l38137
59806H817053l11990k83192k55521k30627k07486j85627j66322j50673j38543
59797F887072j29493j23082j18188j13387j08138j02569r6406q9242q1553p4372
59787E850642o8021o1904n5244m7800m0614l6362l7459m2812m8117n0645n2318
59776E309346n6254o1871o5679o5822o3190n8599n1679m2845l4039k6739k0818
59765D761811j5723j1186o427k68P475J6013K5258L5985M7810N8606O6729P2656
59753E058739P7750Q2394Q6173Q8856R0303R0131Q8296Q5431Q1877P6919O9773
$$ plain form
59825 13699743 13820672 13893964 13912482 13871281 13766101 13595154 13361539 13072253 12735639 12361214
59815 12361214 11960506 11545226 11124351 10704517 10292486 9894804 9515244 9155190 8817053
59806 8817053 8505063 8221871 7966350 7735723 7528237 7342610 7176288 7025615 6887072
59797 6887072 6757579 6634497 6516309 6402922 6294784 6192215 6095809 6006567 5925014 5850642
59787 5850642 5782621 5720717 5665473 5617673 5577059 5540697 5503238 5460426 5412309 5361664 5309346
59776 5309346 5253092 5191221 5125542 5059720 4996530 4937931 4886252 4843407 4809368 4782629 4761811
59765 4761811 4746088 4734902 4728475 4728207 4735682 4751695 4776953 4812938 4860748 4919354 4986083 5058739
59753 5058739 5136489 5218883 5305056 5393912 5484215 5574346 5662642 5748073 5829950 5906869 5976642
59742E976642O0972N2070M4243L7856L3288L1359L2650L6846M3152N1345O1974
59731F462397P5524R1665J09809J30087J53103J78733K05999K34513K65157K98634
59721H205621L34005L69585M04728M39426M71992M98075N12023N08271M81323
59712A2225049M26138L40795K29827J04673j9868j30862k20558k86385l28966
59703A2339843l50507l54297l44241l23840k95566k61581k24585j87224j50603
59694I847399j14142p7303m0999o884K4440N3894Q2726J11510J40451J69889J99903
59683A0390884K29849K59130K88324L18843L51361L85350M20217M56195M93841
59674A3593994N33574N76002O21754O70408P20382P70505Q20785Q71019R19686
$$ plain form
59742 5976642 6037614 6089684 6133927 6171783 6205071 6236430 6269080 6305926 6349078 6400423 6462397
59731 6462397 6537921 6629586 6739395 6869482 7022585 7201318 7407317 7641830 7906987 8205621
59721 8205621 8539626 8909211 9313939 9753365 10225357 10723432 11235455 11743726 12225049
59712 12225049 12651187 12991982 13221809 13326482 13306614 13175752 12955194 12668809 12339843
59703 12339843 11989336 11635039 11290798 10966958 10671392 10409811 10185226 9998002 9847399
59694 9847399 9733257 9655954 9614955 9608071 9632511 9686405 9769131 9880641 10021092 10190981 10390884
59683 10390884 10620733 10879863 11168187 11487030 11838391 12223741 12643958 13100153 13593994
59674 13593994 14127568 14703570 15325324 15995732 16716114 17486619 18307404 19178423 20098109
59665B0098109R64946J005500J039206J062290J071796J068051J052951J026787
59657B8389636R89417R44314Q98724Q58954Q27485Q05193P93944P95331Q08129
59648C6111127Q28408Q51333Q72068Q85866Q88513Q76459Q46393P95770P24224
59639D3680161O33738N27329M08884K84612J62880N1314m5367j24456j83558k20619
59629D5174918k34566k25132j92952j40405p1206J1570J06254K11022L23073M40020
59619D5402596N60643O83111Q03766R18503J023926J115593J186263J227338J231355
59610E4153094J191933J102623R58225P57837N06292K13540j06053m34418p51905
59601E7591168j040421j285928j479978j620075j708015j747260j742473j701561
$$ plain form
59665 20098109 21063055 22068555 23107761 24170051 25241847 26309898 27362849 28389636
59657 28389636 29379053 30323367 31222091 32081045 32908530 33713723 34507667 35302998 36111127
59648 36111127 36939535 37790868 38662936 39548802 40437315 41313774 42160167 42955937 43680161
59639 43680161 44313899 44841228 45250112 45534724 45697604 45748918 45703551 45579095 45395537 45174918
59629 45174918 44940352 44715220 44522268 44381863 44310657 44322227 44428481 44639503 44962576 45402596
59619 45402596 45963239 46646350 47450116 48368619 49392545 50508138 51694401 52921739 54153094
59610 54153094 55345027 56447650 57405875 58163712 58670004 58883544 58777491 58343073 57591168
59601 57591168 56550747 55264819 53784841 52164766 50456751 48709491 46967018 45265457
59593D5265457j636101j558135j477578j403774j347522j318144j317747j339579
59585C3866877j372222j404650j428162j436400j425696j395728j349200j290385
59577B2764434j223430j151491j077059j002322r28624q56132p85299p18316o57610
59568A4364151o02818n51158n01266m54836m13544l76345l41275l08339k78818
59559A0535752k52806k29225k07595j88297j71729j58425j49282j44357j42103
59550H891933j40955j41034j43116j46891j51435j56439j61468j64970j65571
59541G520054j63770j60777j56459j49983j41777j33008j23699j13083j01486
59532F276012r0049p8797o6753n3876m1294k9614j8570q265Q26R190J8040K7328
$$ plain form
59593 45265457 43629356 42071221 40593643 39189869 37842347 36524203 35206456 33866877
59585 33866877 32494655 31090005 29661843 28225443 26799747 25404019 24054819 22764434
59577 22764434 21541004 20389513 19312454 18310132 17381508 16525376 15740077 15021761 14364151
59568 14364151 13761333 13210175 12708909 12254073 11840529 11464184 11122909 10814570 10535752
59559 10535752 10282946 10053721 9846126 9657829 9486100 9327675 9178393 9034036 8891933
59550 8891933 8750978 8609944 8466828 8319937 8168502 8012063 7850595 7685625 7520054
59541 7520054 7356284 7195507 7039048 6889065 6747288 6614280 6490581 6377498 6276012
59532 6276012 6185963 6107166 6040413 5986537 5945243 5915629 5897059 5888794 5889620 5898810 5916850 5944178
59520E944178L5413M1143M5190M8913N2838N6736O0415O3955O7571P1584P6391
59509F564327Q2491R0474J00549J11967J23743J36050J49987J65658J81766J97623
59499G904635K14140K32075K50835K70127K91106L14391L38318L60734L81259
59490A0557620M00194M16684M29833M40278M48310M51620M47383M35856M19653
59481A4447431M00261L77677L52445L25026K93619K55928K13589J72154J36091
59472A6974221J06066Q1267O1633M7020L6813L1571L3156M2218N7260P6780J00194
59461A7648199J25581J48497J64486J71401J68139J52641J22673P7815J9764m8560
59451A8750636j23518k01415k79452l55481m26498m88492n38366n75149n98926
$$ plain form
59520 5944178 5979591 6020734 6065924 6114837 6167675 6224411 6284826 6348781 6416352 6487936 6564327
59509 6564327 6646818 6737292 6837841 6949808 7073551 7209601 7359588 7525246 7707012 7904635
59499 7904635 8118775 8350850 8601685 8871812 9162918 9477309 9815627 10176361 10557620
59490 10557620 10957814 11374498 11804331 12244609 12692919 13144539 13591922 14027778 14447431
59481 14447431 14847692 15225369 15577814 15902840 16196459 16452387 16665976 16838130 16974221
59472 16974221 17080287 17161554 17223187 17270207 17307020 17338591 17371747 17413965 17471225 17548005 17648199
59461 17648199 17773780 17922277 18086763 18258164 18426303 18578944 18701617 18779432 18799196 18750636
59451 18750636 18627118 18425703 18146251 17790770 17364272 16875780 16337414 15762265 15163339
59442A5163339o09677o07710n94414n72012n43125n10399m75445m38083l97839
59433A0414635l56250l16389k79821k45449k11709j78543j46657j16166q6736
59424H476915n8120k9914j633K6643N4456Q1912J09451J36696J62677J87343K11563
59413I357989K35509K58354K79586K99002L15079L25014L27094L21573L08527
59404A2027727K86342K53299K09657J57334R8420L4678l2208j00432j67432k29542
59394A2537843k83400l27957l63957l91472m09524m18253m19633m15313m05479
59385I102855l90643l72840l53897l33885l12458k90448k68878k47535k25868
59376F306403k04448j84347j65817j48569j32635j17852j03277q8348p4024o1525
$$ plain form
59442 15163339 14553662 13945952 13351538 12779526 12236401 11726002 11250557 10812474 10414635
59433 10414635 10058385 9741996 9462175 9216726 9005017 8826474 8679817 8563651 8476915
59424 8476915 8418795 8388881 8387248 8413891 8468347 8550259 8659710 8796406 8959083 9146426 9357989
59413 9357989 9593498 9851852 10131438 10430440 10745519 11070533 11397627 11719200 12027727
59404 12027727 12314069 12567368 12777025 12934359 13032779 13067457 13035249 12934817 12767385 12537843
59394 12537843 12254443 11926486 11562529 11171057 10761533 10343280 9923647 9508334 9102855
59385 9102855 8712212 8339372 7985475 7651590 7339132 7048684 6779806 6532271 6306403
59376 6306403 6101955 5917608 5751791 5603222 5470587 5352735 5249458 5161110 5087086 5025561
59366E025561n0452l9260k7464j6243o765J132Q471J5881K3122K9643L5565M1960
59354E041151M9732N7984O4017O5521O2867N9072N7495N9436O3892O9577P6933
59343E727677Q7648J02306J19333J36383J51693J63882J72202J78238J86032J98742
59333G224136K15961K35757K58287K85259L16586L50040L84240M19862M57717
59324A0147845M97715N40084N85688O34319O84019P32330P76917Q14949Q43522
59315A6257388Q61012Q66626Q58833Q36035P99011P50950O94953O33300N68967
59306B3127075N05487M44549L85529L27731K71261K15613J59526J02511M4285
59297B5583567j7347q5155j58315k32267l03520l71636m35518m91380n36751n73765
$$ plain form
59366 5025561 4975109 4935849 4908385 4892142 4885377 4886509 4894980 4910861 4933983 4963626 4999191 5041151
59354 5041151 5090883 5148867 5212884 5278405 5341272 5400344 5457839 5517275 5581167 5650744 5727677
59343 5727677 5815325 5917631 6036964 6173347 6325040 6488922 6661124 6839362 7025394 7224136
59333 7224136 7440097 7675854 7934141 8219400 8535986 8886026 9270266 9690128 10147845
59324 10147845 10645560 11185644 11771332 12405651 13089670 13822000 14598917 15413866 16257388
59315 16257388 17118400 17985026 18843859 19679894 20478905 21229855 21924808 22558108 23127075
59306 23127075 23632562 24077111 24462640 24790371 25061632 25277245 25436771 25539282 25583567
59297 25583567 25566220 25481065 25322750 25090483 24786963 24415327 23979809 23488429 22951678 22377913
59287B2377913o05802o33163o54602o71051o84645o95220p00727p00493o95609
59278A6336601o86403o71915o51799o26983n98493n66992n33364m98477m62527
59269A1039648m25570l88346l51848l16674k83422k52928k25254j99263j74027
59260H422316j49735j26706j04740q4114o5729m9335l3128j6251%J4652K8889
59249G836119M3600N6964O6749P3775Q0595Q7469R2120R3175R1608Q8715Q4558
59238H695447P8809P1668O3556N4854M6082L7690K9884K3270J9095J8153K0139
59227I158647K4777L2663M3938N7145P0779Q5283J01984J20596J39119J55857
59217I990788J70138J80963J86206J83595J72327J53923J31541J07678Q2366N4497
$$ plain form
59287 22377913 21772111 21138948 20484346 19813295 19128650 18433430 17732703 17032210 16336601
59278 16336601 15650198 14978283 14326484 13699501 13101008 12534016 12000652 11502175 11039648
59269 11039648 10614078 10225732 9873884 9557210 9273788 9020860 8795606 8596343 8422316
59260 8422316 8272581 8145875 8041135 7957021 7891292 7841957 7808829 7792578 7792578 7807230 7836119
59249 7836119 7879719 7936683 8003432 8077207 8157802 8245271 8337391 8430566 8522174 8610889 8695447
59238 8695447 8774256 8845924 8909480 8964334 9010416 9048106 9077990 9101260 9120355 9138508 9158647
59227 9158647 9183424 9216087 9260025 9317170 9387949 9473232 9575216 9695812 9834931 9990788
59217 9990788 10160926 10341889 10528095 10711690 10884017 11037940 11169481 11277159 11359525 11414022
59207A1414022K4799m095l0836n6336q0527j00316j12764j18661j20933j20731
59197A0693622j17348j10951j02888r3626q2645p0519n9269n0297m3338l7581
59187I925160l2763k8978k6316k4676k3399k1414j8211j4021q564n96J0563K4263
59175I761048M0239N9804Q3987J11716J41373J73195K08472K47056K87206L27206
59165A1441302L65645M00732M30942M55714M73940M82148M75624M51173M07896
59156A5385116L46328K68418J77749P8214k7329j36048k43564l44652m34897n10739
59146A4558596n69212o09261o32533o41312o36666o19999n94893n65171n32077
59137I157472m95602m57615m21136l87013l53899l21381k90753k62779k37071
$$ plain form
59207 11414022 11438821 11434726 11403890 11347554 11267027 11166711 11053947 10935286 10814353 10693622
59197 10693622 10576274 10465323 10362435 10268809 10186164 10115645 10056376 10006079 9962741 9925160
59187 9925160 9892397 9863419 9837103 9812427 9789028 9767614 9749403 9735382 9726818 9726222 9736785 9761048
59175 9761048 9801287 9861091 9945078 10056794 10198167 10371362 10579834 10826890 11114096 11441302
59165 11441302 11806947 12207679 12638621 13094335 13568275 14050423 14526047 14977220 15385116
59156 15385116 15731444 15999862 16177611 16255825 16228496 16092448 15848884 15504232 15069335 14558596
59146 14558596 13989384 13380123 12747590 12106278 11469612 10849613 10254720 9689549 9157472
59137 9157472 8661870 8204255 7783119 7396106 7042207 6720826 6430073 6167294 5930223
59128E930223k13684j93055j74243j55645j37708j22567j10450r8889q6275p4039
59118D563668o4114n6079m8086l9254k9903k0642j2356o110j785K573Q990J7378
59106D314280K5819L2766L8459M4243N0937N8104O4822P0878P6634Q1948Q6319
59095D945209R0376R5858J03199J10404J15496J19035J22621J25804J26405J23616
59085F078023J18884J13491J06928R8130Q7134P4924O2369M9720L6848K3844J1510
59074F861805R22p507j4018j8429k0097j9195j6720j2648n585M828J6609K7850
59062F797815L9159N2413O8199Q5781J04303J22726J39942J56442J74341J94062
59052G935183K12645K27470K40102K53900K69020K82591K92941L00616L05540
$$ plain form
59128 5930223 5716539 5523484 5349241 5193596 5055888 4933321 4822871 4723982 4637707 4563668
59118 4563668 4499554 4443475 4395389 4356135 4326232 4305590 4293234 4287124 4285339 4287912 4296902 4314280
59106 4314280 4340099 4372865 4411324 4455567 4506504 4564608 4629430 4700308 4776942 4858890 4945209
59095 4945209 5035585 5131443 5234642 5345046 5460542 5579577 5702198 5828002 5954407 6078023
59085 6078023 6196907 6310398 6417326 6515456 6602590 6677514 6739883 6789603 6826451 6850295 6861805
59074 6861805 6862727 6855220 6841202 6822773 6802676 6783481 6766761 6754113 6748528 6753356 6769965 6797815
59062 6797815 6836974 6889387 6957586 7043367 7147670 7270396 7410338 7566780 7741121 7935183
59052 7935183 8147828 8375298 8615400 8869300 9138320 9420911 9713852 10014468 10320008
59043A0320008L05958L00353K87943K67220K36324J95320J46363R1622L2749k7842
59033A2156018q7231j43533j95512k41128k78485l08011l31587l49611l61072
59024I859848l66364l67758l66766l63053l56282l47234l36808l25393l13377
59015F716813l00884k87239k72114k56743k42505k29040k15453k02440j91006
59006D519389j80068j67909j55373j44852j36567j28623j20363j12763j05648
58997C267223r7731q9390q2419p6812p0950o5154o1635o0387n8584n4978n1529
58986B497654m9470m7088m3062l8986l6536l4787l2198k9019k5858k2132j7905
58975B120613j5133j4894j5042j2808q487m551k213p35O31J860K923L963M873
$$ plain form
59043 10320008 10625966 10926319 11214262 11481482 11717806 11913126 12059489 12151111 12183860 12156018
59033 12156018 12068787 11925254 11729742 11488614 11210129 10902118 10570531 10220920 9859848
59024 9859848 9493484 9125726 8758960 8395907 8039625 7692391 7355583 7030190 6716813
59015 6716813 6415929 6128690 5856576 5599833 5357328 5128288 4912835 4710395 4519389
59006 4519389 4339321 4171412 4016039 3871187 3734620 3605997 3485634 3372871 3267223
58997 3267223 3169492 3080102 2997683 2920871 2849921 2784767 2723132 2662745 2604161 2549183 2497654
58986 2497654 2448184 2401096 2358034 2319048 2282512 2247725 2215527 2186508 2160650 2138518 2120613
58975 2120613 2105480 2090586 2075544 2062736 2054249 2049698 2047485 2046750 2047381 2049241 2052164 2056127 2061000
58962B061000N469N843O183O704P743R151R792Q751O898N920N990N978N721O202
58948B157345P522Q608R056R434R645R030Q001P549P160N647L968M449O990Q905
58934B263309R018Q956R721J0152R879J0600J2955J5007J5533J6110J8139K0411
58922B419790K1541K2428K4297K6451K8015K9849L2655L5109L6069L6810L9039
58911B752053M2138M4492M6142M8204N0931N4172N8349O3154O6558O7229O6951
58900C360373O8853P3731P9396Q3072Q3648Q2585Q3142Q7378R3440R7633R9583
58889D292834J02888J09842J18420J26095J33669J43008J53533J63667J73737
58880E517693J84653J95389K04846K14780K27903K43990K60687K77456K95760
$$ plain form
58962 2061000 2066469 2072312 2078495 2085199 2092942 2102093 2111885 2120636 2127534 2133454 2139444 2145422 2151143 2157345
58948 2157345 2164867 2173475 2182531 2191965 2201610 2210640 2218641 2226190 2233350 2238997 2242965 2247414 2254404 2263309
58934 2263309 2272327 2281283 2291004 2301156 2311035 2321635 2334590 2349597 2365130 2381240 2399379 2419790
58922 2419790 2441331 2463759 2488056 2514507 2542522 2572371 2605026 2640135 2676204 2713014 2752053
58911 2752053 2794191 2838683 2884825 2933029 2983960 3038132 3096481 3159635 3226193 3293422 3360373
58900 3360373 3429226 3502957 3582353 3665425 3749073 3831658 3914800 4002178 4095618 4193251 4292834
58889 4292834 4395722 4505564 4623984 4750079 4883748 5026756 5180289 5343956 5517693
58880 5517693 5702346 5897735 6102581 6317361 6545264 6789254 7049941 7327397 7623157
58871G623157L15764L35922L56143L78906M06236M37252M69545N01930N35207
58862A1360062N70785O09007O48976O90045P32991P78697Q25984Q72209R15831
58853A8004587R56481R92311J019581J035531J039183J028189R97424R42339Q61705
58844B6877331P55740O24268M69206K96908J15467o9003k51337m24445n80522
58835B7813613p14790q25974r13777r77782j018404j037262j036922j021092r94116
58826A9273494r59018r17058q69866q20421p70901p21485o72586o26282n83894
58817A2331983n44189n05853m69650m36207m03982l71997l42395l17371k95372
58808H644967k73558k52407k34184k17967k00224j80348j61884j47483j35530
$$ plain form
58871 7623157 7938921 8274843 8630986 9009892 9416128 9853380 10322925 10824855 11360062
58862 11360062 11930847 12539854 13188830 13878875 14611866 15390563 16216547 17088756 18004587
58853 18004587 18961068 19953379 20972960 22008491 23047674 24075863 25073287 26015626 26877331
58844 26877331 27633071 28257339 28726545 29023453 29138920 29069917 28818580 28394135 27813613
58835 27813613 27098823 26272849 25359072 24381290 23362886 22325624 21288702 20267610 19273494
58826 19273494 18314476 17397418 16527552 15707131 14936230 14214745 13542159 12915877 12331983
58817 12331983 11787794 11281941 10812291 10376084 9972102 9600105 9257710 8940339 8644967
58808 8644967 8371409 8119002 7884818 7666851 7466627 7286279 7124395 6976912 6841382
58799F841382j22866j08667r4541q2187p1828o2206n1788m0397k9157j8435o973
58788F152337O004J9225L1302M2838N5050O7640P9837R2127J05040J17448J28420
58777F897268J39595J53224J68688J83601J97724K13165K30866K49511K68077
58768H701719K87225L07683L29113L51235L74779M00846M30093M62496M97366
58759A2142555N33944N72534O14270O59145P05416P51674P98038Q44303Q88352
58750A8510231R27558R60096R83502R93758R87509R63428R19583Q51511P55367
58741B6852543O31854M85198L20019J41587m2650k24786l98833n59505p00406
58732B6505021q16587r07799r76443j023403j048600j054480j045525j024762
$$ plain form
58799 6841382 6718516 6609849 6515308 6433121 6361293 6299087 6247299 6206902 6177745 6159310 6152337
58788 6152337 6158341 6177566 6208868 6251706 6306756 6374396 6454233 6546360 6651400 6768848 6897268
58777 6897268 7036863 7190087 7358775 7542376 7740100 7953265 8184131 8433642 8701719
58768 8701719 8988944 9296627 9625740 9976975 10351754 10752600 11182693 11645189 12142555
58759 12142555 12676499 13249033 13863303 14522448 15227864 15979538 16777576 17621879 18510231
58750 18510231 19437789 20397885 21381387 22375145 23362654 24326082 25245665 26097176 26852543
58741 26852543 27484397 27969595 28289614 28431201 28388551 28163765 27764932 27205427 26505021
58732 26505021 25688434 24780635 23804192 22780789 21732189 20677709 19632184 18607422
58724A8607422r93509r53959r09092q60547q09377p58343p10472o65677o21761
58715A1324685n78554n38306n02174m69260m38998m11662l86392l61526l37260
58706G300553l15463k96521k78645k60556k42727k25863k10197j96269j84249
58697E090063j72666j59976j47221j36796j28740j20676j11467j02514r5171q9182
58687C825654q3984p9579p5673p1738o8080o5479o3888o2824o2325o2053o0584
58676C069447n7516n5149n5608n7446n7683n6188n5011n4248n2072m8528m5967
58665B474031m5455m5715m5795m5963m5843m4474m2415m1126m0217l8054l5129
58654B003845l3792l4378l4447l2511k9781k7772k6530k5743k5373k4850k3746
$$ plain form
58724 18607422 17613913 16659954 15750862 14890315 14080938 13322595 12612123 11946446 11324685
58715 11324685 10746131 10207825 9705651 9236391 8797393 8385731 7999339 7637813 7300553
58706 7300553 6985090 6688569 6409924 6149368 5906641 5680778 5470581 5274312 5090063
58697 5090063 4917397 4757421 4610200 4473404 4344664 4223988 4112521 4010007 3914836 3825654
58687 3825654 3741670 3662091 3586418 3514680 3446600 3381121 3317233 3254409 3192084 3130031 3069447
58676 3069447 3011931 2956782 2901174 2843728 2786045 2729857 2674846 2620598 2568526 2519998 2474031
58665 2474031 2428576 2382861 2337066 2291103 2245260 2200786 2158371 2117245 2077028 2038974 2003845
58654 2003845 1970053 1935675 1901228 1868717 1838936 1811164 1784634 1758891 1733518 1708668 1684922
58643A684922k3092k3804k4312k2478j9372j7853j7768j6248j3034j1596j3870
58632A481495j7360j8822j7982j6228j4222j2237j0710r343p442n594n028n137
58620A341390m110k145j275j700j310N48J861J325O4q97k056l364l463k155r57
58605A321756k36J609M933P505P721O753O193N788M891M084M134N037O963J0273
58591A397404J3956J6172J6961J8289K0894K3479K5580K8511L2524L5635L6638
58580A666043L7012L8653M1622M5159M9000N2867N6379O0086O4888P0271P5220
58569B257200Q0691Q8603R8323J07135J14463J22604J32790J43826J55306J68767
58559C469708J84416K00030K14479K29384K45779K61934K75923K87584K96454
$$ plain form
58643 1684922 1661830 1638026 1613714 1591236 1571864 1554011 1536243 1519995 1506961 1495365 1481495
58632 1481495 1464135 1445313 1427331 1411103 1396881 1384644 1373934 1364591 1357149 1351555 1346527 1341390
58620 1341390 1337280 1335135 1333860 1332160 1330850 1331398 1333259 1334584 1334648 1333751 1331695 1328331 1324868 1322713 1321756
58605 1321756 1321520 1323129 1328062 1335567 1343288 1350041 1356234 1362022 1366913 1370997 1375131 1380168 1387131 1397404
58591 1397404 1411360 1427532 1444493 1462782 1483676 1507155 1532735 1561246 1593770 1629405 1666043
58580 1666043 1703055 1741708 1783330 1828489 1877489 1930356 1986735 2046821 2111709 2181980 2257200
58569 2257200 2337891 2426494 2524817 2631952 2746415 2869019 3001809 3145635 3300941 3469708
58559 3469708 3654124 3854154 4068633 4298017 4543796 4805730 5081653 5369237 5665691
58550E665691L00413K97797K88278K70427K41338K00360J50681R5701L6498k5442
58540G521742q5689j39284j83911k19145k44742k61316k70845k74949k73988k68632
58530E299241k60272k49194k34645k17456k00310j84636j69768j55753j44031
58521C483176j34381j24274j12663j01630r3025q6156p9999p4805p0313o5135
58511B540795n9390n5047n2518m9814m6209m3547m2519m1093l8324l6341l6631
58500B039362l7514l7438l7461l8301l8095l5687l3188l2587l2435l0628k8103
58489A657925k7013k7112k6471k4347k1390j8512j6979j7657j8972j7956j4543
58478A426973j2194j2837j4120j3407j1528j0414r778q577p456p476q216q914
$$ plain form
58550 5665691 5966104 6263901 6552179 6822606 7063944 7264304 7414985 7510686 7547184 7521742
58540 7521742 7436053 7296769 7112858 6893713 6648971 6387655 6116810 5841861 5567873 5299241
58530 5299241 5038969 4789775 4555130 4337674 4137364 3952728 3782960 3627207 3483176
58521 3483176 3348795 3224521 3111858 3010228 2917203 2831047 2751048 2676243 2605930 2540795
58511 2540795 2481405 2426358 2373840 2324026 2277817 2234270 2191751 2150658 2112334 2075993 2039362
58500 2039362 2001848 1964410 1926949 1888648 1850553 1814866 1781678 1749091 1716656 1686028 1657925
58489 1657925 1630912 1603800 1577329 1552982 1531592 1513080 1496101 1478444 1459472 1441516 1426973
58478 1426973 1414779 1401942 1387822 1374415 1362887 1352473 1342695 1334118 1326662 1319186 1310970 1302056
58466A302056r669j0262r885r077r466j0848j1338j1053j2222j4812j5986j5161
58454A162277j5223j7068j7411j4335j0691r202q456o755n811p127q408p298n385
58441A029107m873m486k379k34o10k592l589l288k686j437P35K200J794Q99P00
58426A009261Rj815k642j042Q66P67m99j450k732m645n035k638L53J721K166K498
58410I95143J534o67j423j64k50l009m539k176N55j59k119j579J89J84l43J074
58394I82251K305k48n148q149q793r585j0621j0185q955q750q694p057n133n098
58380H88140n934n564m832n237n161k718PM8j430j497m12N5N45K062K722J094
58364H61888m5K080N154N631M604M904N598M673M021O146Q810Q767P874R651J2573
$$ plain form
58466 1302056 1292387 1282125 1272240 1263163 1253697 1242849 1231511 1220458 1208236 1193424 1177438 1162277
58454 1162277 1147054 1129986 1112575 1098240 1087549 1078347 1069891 1063136 1057325 1050198 1041790 1034492 1029107
58441 1029107 1024234 1019748 1017369 1017135 1016525 1013933 1010344 1007056 1004370 1002933 1003668 1005868 1007662 1008561 1009261
58426 1009261 1009270 1007455 1004813 1003771 1004637 1005404 1004905 1003455 1000723 996078 991043 988405 988758 990479 992645 995143
58410 995143 996677 996010 994587 994423 994173 991164 986625 984449 985004 984845 982726 981147 981336 981520 981177 982251
58394 982251 984556 984308 979160 971011 962218 952633 942012 931827 922872 914122 905428 898371 893238 888140
58380 888140 882206 876642 871810 866573 861412 858694 858701 858749 857319 855822 855410 855465 856010 858072 860794 861888
58364 861888 861843 863923 869077 874708 879312 884216 889814 894487 898508 904654 913464 922231 930105 939756 952329
58349I52329J2909J1515J1606J2344J1066R397J0475J2360J0896P119N144M683
58337A071843K589q7L18K797K972M96j356k142l671m528k142J146J013j229j002
58322A067017J024L50k602k934J53K802M049O337Q815P920M825M759Q347J0780
58308A121642J0095R254R585R123P996Q639R995Q297M254K902N508Q041Q219P939
58294A231489Q205P759P118Q117R392Q121N695N711P261O641M547M556N747M431
58280A324790K175L843Q349R707P067N379O124O041N166P339J1979J4084J3252
58267A425295J4247J7752J9191J7817J8198K1239K2426K0573J9890K1641K1990
58256A640259J9868J8953K0214K0450J9602K1352K5154K5954K3224K1996K3710
$$ plain form
58349 952329 965238 976753 988359 1000703 1011769 1021166 1031641 1044001 1054897 1062016 1067160 1071843
58337 1071843 1074432 1074345 1074663 1077460 1080432 1080928 1079572 1077430 1073759 1069231 1067089 1068235 1069248 1068019 1067017
58322 1067017 1068041 1068391 1065789 1062855 1063008 1065810 1069859 1076196 1085011 1092931 1097756 1102515 1110862 1121642
58308 1121642 1131737 1140991 1150576 1159699 1167695 1176334 1186329 1194626 1198880 1201782 1207290 1215331 1223550 1231489
58294 1231489 1239694 1247453 1254571 1262688 1272080 1280201 1285896 1291607 1298868 1305509 1310056 1314612 1320359 1324790
58280 1324790 1326965 1330808 1339157 1348864 1355931 1361310 1367434 1373475 1378641 1385980 1397959 1412043 1425295
58267 1425295 1439542 1457294 1476485 1494302 1512500 1533739 1556165 1576738 1596628 1618269 1640259
58256 1640259 1660127 1679080 1699294 1719744 1739346 1760698 1785852 1811806 1835030 1857026 1880736
58245A880736K4449K3456K4637K8341L0378L0451L2769L7115L8472L6694L7239
58234B224737M0944M2640M1206M1306M3707M3884M1681M2325M6246M8107M7386
58223B704169M9455N4698N7399N7077N9732O6132P0180P0713P3312P8715Q1411
58212C422993Q1586Q5818R3949R8287R7941J00576J07785J12818J15376J23611
58202D440740J38059J48951J53598J61001J74644J86376J92600K00743K13928
58193F010640K24850K31012K40515K56607K71928K83908K99701L20084L35440
58184H474685L44098L57314L79382M00729M17534M39355M69790M99010N23698
58175A2305595N54300N93734O29665O57480O89772P32822P75555Q12635Q55912
$$ plain form
58245 1880736 1905185 1928641 1953278 1981619 2011997 2042448 2075217 2112332 2150804 2187498 2224737
58234 2224737 2265681 2308321 2349527 2390833 2434540 2478424 2520105 2562430 2608676 2656783 2704169
58223 2704169 2753624 2808322 2865721 2922798 2982530 3048662 3118842 3189555 3262867 3341582 3422993
58212 3422993 3504579 3590397 3684346 3782633 3880574 3981150 4088935 4201753 4317129 4440740
58202 4440740 4578799 4727750 4881348 5042349 5216993 5403369 5595969 5796712 6010640
58193 6010640 6235490 6466502 6707017 6963624 7235552 7519460 7819161 8139245 8474685
58184 8474685 8818783 9176097 9555479 9956208 10373742 10813097 11282887 11781897 12305595
58175 12305595 12859895 13453629 14083294 14740774 15430546 16163368 16938923 17751558 18607470
58166A8607470R11223R67013J018629J080187J159025J242231J322011J409445
58158B7717234J509511J609148J705029J815416J949073K091333K236361K401480
58150D3034585K593134K793408K998542L233728L510765L813007M144690M550302
58142G0672161N060181N665444O372533P226229Q248431R418089J0746632J2299124
58134A35708824J4097842J6085203J8219732K0503782K2900196K5430404K8416604
58127B81362587L2186868L6008774L7448747L3566839K3346990Q926261n772763
58120D47074303j7594663k5465271k9835181l1560805l1389635k9956971k7781997
58113B53489780k5219438k2521440j9908258j7517032j5352230j3364115j1537602
$$ plain form
58166 18607470 19518693 20485706 21504335 22584522 23743547 24985778 26307789 27717234
58158 27717234 29226745 30835893 32540922 34356338 36305411 38396744 40633105 43034585
58150 43034585 45627719 48421127 51419669 54653397 58164162 61977169 66121859 70672161
58142 70672161 75732342 81397786 87770319 94996548 103244979 112663068 123409700 135708824
58134 135708824 149806666 165891869 184111601 204615383 227515579 252945983 281362587
58127 281362587 313549455 349558229 387006976 420573815 443920805 452847066 447074303
58120 447074303 429479640 404014369 374179188 342618383 311228748 281271777 253489780
58113 253489780 228270342 205748902 185840644 168323612 152971382 139607267 128069665
58106A28069665r864707q297577o796872n389957m131459l046333k166180j588320
58098H6788260j429502j710572k310830l030089l683242m162968m452046m583409
58090F1425602m582020m451021m207287l897992l567882l233905k905104k602123
58082C1978268k338721k105187j888835j694217j528029j382287j248848j134166
58074A8657978j043732r67117q93633q28197p76927p31190o80828o30201n86887
58065A1519266n46879n04701m66194m37463m12066l82241l52383l29366l10147
58056G777826k90888k77503k74661k74355k67724k58669k53970k49425k38125
58047E392506k23731k13383k05313j95002j85796j81888j78047j67655j54199
$$ plain form
58106 128069665 118204958 109907381 103110509 97720552 93589093 90542760 88376580 86788260
58098 86788260 85358758 83648186 81337356 78307267 74624025 70461057 66009011 61425602
58090 61425602 56843582 52392561 48185274 44287282 40719400 37485495 34580391 31978268
58082 31978268 29639547 27534360 25645525 23951308 22423279 21040992 19792144 18657978
58074 18657978 17614246 16647129 15753496 14925299 14148372 13417182 12736354 12106153 11519266
58065 11519266 10972387 10467686 10001492 9564029 9151963 8769722 8417339 8087973 7777826
58056 7777826 7486938 7209435 6934774 6660419 6392695 6134026 5880056 5630631 5392506
58047 5392506 5168775 4955392 4750079 4555077 4369281 4187393 4009346 3841691 3687492
58038C687492j44211j35698j24052j12645j06711j03012r6131q9158q7587q8193
58028B600094q4328p7284p2408o8826o2784n6695n5079n5581n2999m8483m6102
58017A919525m4376l9763l4641l3441l4386l3040l0259k9079k7731k3528j9615
58006A569666k0053k2098k0995j8401j8272j8736j6200j3454j5113j8621j8414
57995A369309j5720j5576j7048j5325j1266j0011j1781j2371j1349j1822j3182
57984A223858j1988r081q417r521q282m658k700l384l902l608m317n178l472l61
57970A144989J14k382m372m745n666p589q535q244q311q523p397n798n806o885
57956A060850p163p200q433r587q993q479j0274j2096j0501p095n961o719n942
$$ plain form
58038 3687492 3543281 3407583 3283531 3170886 3064175 2961163 2865032 2775874 2688287 2600094
58028 2600094 2515766 2438482 2366074 2297248 2234464 2177769 2122690 2067109 2014110 1965627 1919525
58017 1919525 1875149 1835386 1800745 1767304 1732918 1699878 1669619 1640540 1612809 1589281 1569666
58006 1569666 1549613 1527515 1506520 1488119 1469847 1451111 1434911 1421457 1406344 1387723 1369309
57995 1369309 1353589 1338013 1320965 1305640 1294374 1284363 1272582 1260211 1248862 1237040 1223858
57984 1223858 1211870 1202789 1194372 1184851 1176569 1171911 1169211 1165827 1161925 1158317 1154000 1148822 1145350 1144989
57970 1144989 1145103 1142721 1138349 1133604 1127938 1120349 1111814 1103570 1095259 1086736 1079339 1073541 1067735 1060850
57956 1060850 1053687 1046487 1038054 1028467 1019474 1010995 1000721 988625 978124 971029 965068 958349 952407
57943I52407l957m084o027o136l850k125j638j45K437L648L308L612M333K915
57929I44698m60k730l162m017n846o676o227o467p616p765o690o031n765m518
57915H70728l173l797n213m271j435l68j759k390j031l78k048m125n033n802o984
57900H22921o973n064l009k288k397k724l434l899k912q83O07J517K997M686N177
57885H04322M823M965M926L120O69J85J256R61j201k838l198m187o484q425r282
57870G89612r969j0228q864p056p475r577r956p966o679p301p047m184r73M02
57856F92739J131K868M688N193M989N092N255N375O240P571P787O877O843Q140
57842G70788Q425O263L382J724Q16l74j465k102l259n434p459q388q709q664p450
$$ plain form
57943 952407 948450 944366 938339 932203 928353 926228 924590 924445 926882 930530 933838 937450 941783 944698
57929 944698 944238 941508 938346 934329 928483 921807 915580 909113 901497 893732 887042 881011 875246 870728
57915 870728 867555 863758 858545 854274 852839 852471 850712 848322 847291 846913 844865 840740 835707 829905 822921
57900 822921 815948 810884 807875 805587 803190 800466 797032 793133 790221 789338 789945 791462 794459 799145 804322
57885 804322 809145 814110 819036 822156 822825 823010 824266 825227 824026 821188 817990 813803 807319 798894 789612
57870 789612 779643 769415 760551 753495 746020 736443 726487 718521 711842 704541 697494 693310 692337 692739
57856 692739 693870 696738 701426 706619 711608 716700 721955 727330 733570 741141 748928 755805 762648 770788
57842 770788 779213 785476 788858 790582 791398 791024 789559 787457 784198 778764 771305 762917 754208 745544 738094
57827G38094n166l450l136l305l421m235n598n755l952j609J5J209K148K287K294
57812G06420L913O822Q203O789M837M677N687O156N845N048L282N76j731k839
57798G63685l407l751l265k590l701o467p804o084l845m105o158p371p118o671
57784F91348o618o722p128p803p824o865o140o440o567n284l428k504k505k704
57770F12816l366n036p250r350j1419j3138j3141j0960q355p104o713n792m489
57757E06703l935m313m940n418n492m788l735l499l882k899K54L435M369L680
57743D75540L350L662L771M036N391P155P700P002O447O394N812M394L312L411
57729E47377L938L575K155Q41P39J491J512lj927k913l439m580n460m336k106
$$ plain form
57827 738094 732928 729478 726342 723037 719616 715381 709783 704028 700076 698467 698482 699691 701839 704126 706420
57812 706420 710333 717155 725358 732147 736984 741661 747348 753504 759349 764397 767679 768255 766524 763685
57798 763685 760278 756527 753262 750672 746971 740504 732700 726616 722771 718666 712508 705137 698019 691348
57784 691348 684730 678008 670880 663077 655253 648388 642248 635808 629241 623957 620529 618025 615520 612816
57770 612816 609450 604414 597164 587814 576395 563257 550116 539156 530801 523697 516984 511192 506703
57757 506703 502768 498455 493515 488097 482605 477817 474082 470583 466701 463802 464056 467491 471860 475540
57743 475540 478890 482552 486323 490359 495750 502905 510605 517607 524054 530448 536260 540654 543966 547377
57729 547377 551315 554890 557045 557886 558625 560116 561628 561625 559698 556785 553346 548766 543306 538970 536864
57714E36864j842m164o057n419l922l596l456j960l22m86j453o30K205N057O943
57699E17762Q446R607R738Q999Q142P086N510M319M583N666O312O856Q209R376
57685F20611Q477O108N192P162J0370J2635J3504J3484J2783J1500R991Q475P054
57672G47346O263O679Q080R732J1329J2878J4085J4816J5731J7454J9585K1380
57660I05358K2753K3705K3742K3115K3573K6273K9744L1657L1899L2135L3101
57649A207055L4363L6231L9572M3906M7806N1227N5398O0250O4221O7083P0814
57638A777926P6790Q3808Q9959R5166J00847J08173J17465J28564J40936J53802
57628B873436J66737J79874J93409K07170K20688K33269K44235K53195K59475
$$ plain form
57714 536864 535022 530858 524801 519382 515460 511864 508408 506448 506126 505640 504187 503557 505762 510819 517762
57699 517762 526208 535815 545553 554552 562694 569780 575290 579609 584192 589858 596170 603026 611235 620611
57685 620611 629088 635196 640388 647550 657920 670555 684059 697543 710326 721826 731817 740292 747346
57672 747346 753609 760288 768368 778100 789429 802307 816392 831208 846939 864393 883978 905358
57660 905358 928111 951816 975558 998673 1022246 1048519 1078263 1109920 1141819 1173954 1207055
57649 1207055 1241418 1277649 1317221 1361127 1408933 1460160 1515558 1575808 1640029 1707112 1777926
57638 1777926 1854716 1938524 2028483 2123649 2224496 2332669 2450134 2578698 2719634 2873436
57628 2873436 3040173 3220047 3413456 3620626 3841314 4074583 4318818 4572013 4831488
57619D831488K61010K54830K39357K15460J84738J48398J08862P0555L7132R111
57609F360941j4225l2771m8393o7839r8242j39185j82218k18518k44211k58629
57599E056710k61931k56246k45684k32611k15946j94892j72161j51439j33524
57590C192276j17064j01496q7143p3626o0396m8090l7539k8078j8337q172J496
57579B613831J0157J7788K4331L0412L7803M7693N8999O9723P9513Q9659J01027
57568C180936J13262J25654J37712J49113J59906J70372J79742J85883J87276
57559D589856J84488J78260J66811J46907J17567Q1142M0771j682m4702q5835
57549E373583j22435j53115j77665j96030k08085k14181k15258k12183k05416
$$ plain form
57619 4831488 5092498 5347328 5586685 5802145 5986883 6135281 6244143 6314698 6351830 6360941
57609 6360941 6346716 6313945 6265552 6197713 6099471 5960286 5778068 5559550 5315339 5056710
57599 5056710 4794779 4538533 4292849 4060238 3844292 3649400 3477239 3325800 3192276
57590 3192276 3075212 2973716 2886573 2812947 2752551 2704461 2666922 2638844 2620507 2612335 2613831
57579 2613831 2623988 2641776 2666107 2696519 2734322 2782015 2841014 2910737 2990250 3079909 3180936
57568 3180936 3294198 3419852 3557564 3706677 3866583 4036955 4216697 4402580 4589856
57559 4589856 4774344 4952604 5119415 5266322 5383889 5465031 5505802 5504120 5459418 5373583
57549 5373583 5251148 5098033 4920368 4724338 4516253 4302072 4086814 3874631 3669215
57540C669215j95688j84784j74851j66367j57476j46319j33798j22703j14021
57531B273208j05749r6145q6547p9401p4545o9383o2482n5166m9247m4757m0681
57520A509105l6826l3890l2134l0852k9085k6344k2709j8729j5345j3430j3012
57509A236749j3001j2078r948p479n497l820j729R78L869O495Q595R937J0576
57496A223647J1161J2355J4122J6222J9072K3176K7794L1319L3239L4809L7460
57485A484376M1338M5683M9848N3604N7145O1214O6541P2974P9696Q6350R3150
57474B191919R9981J06483J13163J21134J30326J39092J46041J51054J54058J54115
57464C507366J50478J43274J32242J15782R2398O2418K7890q348m3031p3336r8327
$$ plain form
57540 3669215 3473527 3288743 3113892 2947525 2790049 2643730 2509932 2387229 2273208
57531 2273208 2167459 2071314 1984767 1905366 1830821 1761438 1698956 1643790 1594543 1549786 1509105
57520 1509105 1472279 1438389 1406255 1375403 1346318 1319974 1297265 1278536 1263191 1249761 1236749
57509 1236749 1223748 1211670 1201722 1194243 1188746 1184926 1183197 1184175 1188044 1194539 1203134 1213071 1223647
57496 1223647 1234808 1247163 1261285 1277507 1296579 1319755 1347549 1378868 1412107 1446916 1484376
57485 1484376 1525714 1571397 1621245 1674849 1731994 1793208 1859749 1932723 2012419 2098769 2191919
57474 2191919 2291900 2398383 2511546 2632680 2763006 2902098 3048139 3199193 3353251 3507366
57464 3507366 3657844 3801118 3933360 4049142 4141540 4203958 4231848 4223500 4180469 4107133 4008806
57453D008806j18621j34063j43324j46468j46102j44450j40935j34362j26035
57444B774446j18383j11532j03576r3890q3929p4906o6683n9032n2200m5901l9328
57433A925086l2476k6276k1140j6535j2015p645l378R71N253R463J4349K0374
57421A856031K6505L1436L5674M0856M7143N3002N7766O2806O9724P8660Q8669
57410B448272R8641J07635J15361J22345J28704J32949J33319J29881J23506J12973
57400C653586R5343O9696L8568N142k9034o2614r2946j17732j36878j51268j60772
57389C111091j64998j65053j62854j59050j53021j44692j35128j25370j15786
57380A785139j06698r8623r1668q5272p8923p2717o7017o1869n7033n2427m8225
$$ plain form
57453 4008806 3890185 3756122 3612798 3466330 3320228 3175778 3034843 2900481 2774446
57444 2774446 2656063 2544531 2440955 2347065 2263136 2188230 2121547 2062515 2010315 1964414 1925086
57433 1925086 1892610 1866334 1845194 1828659 1816644 1808999 1805621 1806592 1811845 1821308 1835657 1856031
57421 1856031 1882536 1913972 1949646 1990502 2037645 2090647 2148413 2211219 2280943 2359603 2448272
57410 2448272 2546913 2654548 2769909 2892254 3020958 3153907 3287226 3417107 3540613 3653586
57400 3653586 3748929 3818625 3857193 3862335 3833301 3770687 3677741 3560009 3423131 3271863 3111091
57389 3111091 2946093 2781040 2618186 2459136 2306115 2161423 2026295 1900925 1785139
57380 1785139 1678441 1579818 1488150 1402878 1323955 1251238 1184221 1122352 1065319 1012892 964667
57369I64667m4514m1116l7960l5198l2659k9583k5758k2653k2040k3263k3320
57358F26603k0433j6267j3554j2781j2619j2472j2777j3418j3653j3389j2944
57347D72296j1883r713p433o674p317p555o429m842m009m157m817n220m609l200
57333C84438k383k716k741j361j63r90k330j202J954L746L156K722L788M329K938
57318C93185J518J925K886K511J590J929L296M278M712N260N857O284P076Q337
57304D50644R024Q750Q729R571R920Q984Q378R428J0510R576P770P767R518J0450
57290E79019R419P839P051O824O686O762O893O436N361M494M483N262O521P946
57276F70996R086R475Q899P561O449P085R801J2439J2479J0407R069R654J0636
$$ plain form
57369 964667 920153 879037 841077 805879 773220 743637 717879 695226 673186 649923 626603
57358 626603 606170 589903 576349 563568 550949 538477 525700 512282 498629 485240 472296
57347 472296 460413 450700 443267 436593 429276 421721 415292 410450 406441 402284 397467 392247 387638 384438
57333 384438 382055 379339 376598 375237 375074 374084 371754 370552 372506 376252 379408 382130 385918 390247 393185
57318 393185 394703 396628 399514 402025 403615 405544 408840 413118 417830 423090 428947 435231 442307 450644
57304 450644 459668 468418 477147 486718 496638 505622 514000 523428 533938 543514 551284 559051 568569 579019
57290 579019 588438 596277 603328 610152 616838 623600 630493 636929 642290 646784 651267 656529 663050 670996
57276 670996 680082 689557 698456 706017 712466 719551 729352 741791 754270 764677 773746 783400 794036
57263G94036J1120J2275J4390J5415J4220J2688J2601J2860J2026J1346J2611
57252I35588J4896J5990J5614J4875J4104J3605J4796J8064K0940K1045J9513
57241A119030J9032J9970K1005K2081K3811K5284K5389K5257K6610K8797L0224
57230A386490L1492L4035L6868L7922L7789L8838M1256M3065M3566M3630M3071
57219A818022M0839L7455L4327L1080K6241K0097J4005P660J01p342j2411j5552
57207A994522j8885k2147k3161k1930k0560j9373j6793j2967r716o903k655K462
57195A821894N410N486N589P875J1353J4556J7341J9390K0001K0068K1266K2969
57183A993198K3103K2400K4211K9314L4341L6384L6049L4939L3227L1016K9423
$$ plain form
57263 794036 805156 817431 831821 847236 861456 874144 886745 899605 911631 922977 935588
57252 935588 950484 966474 982088 996963 1011067 1024672 1039468 1057532 1078472 1099517 1119030
57241 1119030 1138062 1158032 1179037 1201118 1224929 1250213 1275602 1300859 1327469 1356266 1386490
57230 1386490 1417982 1452017 1488885 1526807 1564596 1603434 1644690 1687755 1731321 1774951 1818022
57219 1818022 1858861 1896316 1930643 1961723 1987964 2008061 2022066 2029726 2029827 2022485 2010074 1994522
57207 1994522 1975637 1953490 1930329 1908399 1887839 1868466 1851673 1838706 1828990 1822087 1819432 1821894
57195 1821894 1827304 1832790 1838379 1846254 1857607 1872163 1889504 1908894 1928895 1948963 1970229 1993198
57183 1993198 2016301 2038701 2062912 2092226 2126567 2162951 2199000 2233939 2267166 2298182 2327605
57172B327605K9129K9801L1483L4508L8042M1035M4134M8074N1002N0702M8705
57161B774220M8599N0934N3640N6570O1133O5949O7887O7358O7631O8847O8033
57150C450801O5246O3991O4802O4266O1582O0204O1307O1582N9555N8274N9279
57139D130889N9684N8105N7902O1241O4990O6015O5850O6692O7172O5588O3247
57128D827375O1445N9062N6014N4862N6127N6348N3604N0581M9431M8572M7609
57117E421030N0107N7626O5913P1049P4736P9361Q2549Q1249P7103P3198O9198
57106F203119O3881N8865N5798N3412N0957N0625N3127N5239N5359N6859O1886
57095F819127O6698O7422O5812O4781O3003N8432N2689M7252M0034L0187K1565
$$ plain form
57172 2327605 2356734 2386535 2418018 2452526 2490568 2531603 2575737 2623811 2674813 2725515 2774220
57161 2774220 2822819 2873753 2927393 2983963 3045096 3111045 3178932 3246290 3313921 3382768 3450801
57150 3450801 3516047 3580038 3644840 3709106 3770688 3830892 3892199 3953781 4013336 4071610 4130889
57139 4130889 4190573 4248678 4306580 4367821 4432811 4498826 4564676 4631368 4698540 4764128 4827375
57128 4827375 4888820 4947882 5003896 5058758 5114885 5171233 5224837 5275418 5324849 5373421 5421030
57117 5421030 5471137 5528763 5594676 5665725 5740461 5819822 5902371 5983620 6060723 6133921 6203119
57106 6203119 6267000 6325865 6381663 6435075 6486032 6536657 6589784 6645023 6700382 6757241 6819127
57095 6819127 6885825 6953247 7019059 7083840 7146843 7205275 7257964 7305216 7345250 7375437 7397002
57084G397002J6678J1967L503p661k0104l5909n4998p1779q3210r4325j10146
57073F951018j28278j45489j65013j90477k18759k46034k75029l09394l46666
57064D925879l83708m23006m66985n12688n58871o11242o73617E54141b57911
57054a147743r78022j070892j165239j268171j384398j507077j631236j763808
57046a1916586j908942k056500k197658k337552k478879k609197k720913k827333
57038c1053560k941185l056032l169449l304360l484160l707973l972690m287675
57030e8977084m635570m954347n196430n357091n399536n256578n061642n322359
57022a00160637o595008q819741j1091436j2266842j1807572r982859p371694
$$ plain form
57084 7397002 7413680 7425647 7429150 7421489 7401385 7365476 7310478 7238699 7155489 7061164 6951018
57073 6951018 6822740 6677251 6512238 6321761 6103002 5856968 5581939 5272545 4925879
57064 4925879 4542171 4119165 3652180 3139492 2580621 1969379 1295762 554141 -257911
57054 -1147743 -2125765 -3196657 -4361896 -5630067 -7014465 -8521542 -10152778 -11916586
57046 -11916586 -13825528 -15882028 -18079686 -20417238 -22896117 -25505314 -28226227 -31053560
57038 -31053560 -33994745 -37050777 -40220226 -43524586 -47008746 -50716719 -54689409 -58977084
57030 -58977084 -63612654 -68567001 -73763431 -79120522 -84520058 -89776636 -94838278 -100160637
57022 -100160637 -106755645 -115575386 -126666822 -138933664 -150741236 -160724095 -168095789
57015a68095789m365846j145573K095631N072952P510621R234666J0201738J0511598
57007a28980002J0379864J0036272R625484R202192Q784339Q375121P954922P496193
56999e7125615O991824O452996N889451N312369M747010M219955L737453L292256
56991a6482301K885218K523872K206088J922466J671635J458638J280807J128073
56983a405504d10754D69253P79769O88850O08536N42271M86434M33921L83622
56974D392656L38329K97047K57628K23245J97837J78188J58124J37336J18870
56965F299260J01679Q3307O6632N6281N0933M6012M1046L7613L3148K3871J1719
56954F851501J911m401r588j4166j7334k0410k4822k8930l0343k7830j8939l399
$$ plain form
57015 -168095789 -172461635 -173607208 -171511577 -166438625 -158928004 -149693338 -139491600 -128980002
57007 -128980002 -118600138 -108563866 -98938382 -89736190 -80951851 -72576730 -64621808 -57125615
56999 -57125615 -50133791 -43680795 -37791344 -32478975 -27731965 -23512010 -19774557 -16482301
56991 -16482301 -13597083 -11073211 -8867123 -6944657 -5273022 -3814384 -2533577 -1405504
56983 -1405504 -410754 469253 1249022 1937872 2546408 3088679 3575113 4009034 4392656
56974 4392656 4730985 5028032 5285660 5508905 5706742 5884930 6043054 6180390 6299260
56965 6299260 6400939 6484246 6550878 6607159 6658092 6704104 6745150 6782763 6815911 6839782 6851501
56954 6851501 6853412 6849011 6839423 6825257 6807923 6787513 6762691 6733761 6703418 6675588 6656649 6653250
56942F653250N792j6163q2638j77677k69604l38734l84109m09462m15694m06199
56932D158762l87898l64483l36027l05654k79105k57124k35216k11709j89655
56923A591891j70534j52623j36180j23889j15241j06303r6022q7291q1034p4469
56913D48305o6197n8056n1079m4241l7764l3105k9219k3396j6288j1475r619p489
56901F0377l299J439N841J0896J5955J8189J6439J2062N728k816j1769j8139k1764
56888H9139k4554k6032A4457e553j7640j7329j5579j1370p644n491k157L464Q402
56875g0897J0811J3057J7292g703A7853K8612L1058K9492K1470R560j563r857
56863A26625j5637j9053k0408k1107k2001F372a3881j7531j5264j3480j1457q856
$$ plain form
56942 6653250 6659042 6642879 6560241 6382564 6112960 5774226 5390117 4980655 4564961 4158762
56932 4158762 3770864 3406381 3070354 2764700 2485595 2228471 1993255 1781546 1591891
56923 1591891 1421357 1268734 1132554 1008665 893424 787121 691099 603808 522774 448305
56913 448305 382108 324052 272973 228732 190968 157863 128644 105248 88960 77485 67866 60377
56901 60377 57078 58517 64358 75254 91209 109398 125837 137899 143627 140811 129042 110903 89139
56888 89139 64585 38553 14457 -5553 -23193 -40522 -56101 -67471 -75115 -80606 -82763 -79299 -70897
56875 -70897 -60086 -47029 -29737 -7703 17853 46465 77523 107015 128485 138045 136482 126625
56863 126625 110988 91935 71527 50420 28419 6372 -13881 -31412 -46676 -60156 -71613 -80469
56851h0469n683k494p90j294k081p26J808K407Q57K06J657K992L085M035O866
56836f9624Q904P992O278O994R814J2141d346I602J5088J6495J8567K1192K2610
56823A03554K1119J7190J2575Q159M017O53j228j609j013P6J302K768N275R085
56809A81923J2725J4644J5843J8688K3289K7502L0649L4307L8907M2538M4033
56798D85048M4084M2049L4994K2079P133n406j4890k2572k7783k8868k6394k2605
56786D86869j8484j3497p520j180N184J1400J7051K2312K8223L5226M2574M9982
56774F58140N8041O5654O8785O3624N0107L1166R967j0743k8259m0903m8824n2700
56762H24055n2704m9439m4339l8110l0370k1748j4373q954l515L521J1090J7833
$$ plain form
56851 -80469 -86152 -88646 -89436 -90730 -92811 -93537 -91729 -89322 -88465 -88259 -86602 -83610 -80525 -76490 -69624
56836 -69624 -60720 -52728 -46450 -39456 -29642 -17501 -4346 9602 24690 41185 59752 80944 103554
56823 103554 124673 141863 154438 162597 166614 167267 166039 164430 163417 163493 164795 167563 172838 181923
56809 181923 194648 209292 225135 243823 267112 294614 325263 359570 398477 441015 485048
56798 485048 529132 571181 606175 628254 635387 629981 615091 592519 564736 535868 509474 486869
56786 486869 468385 454888 447368 446188 451372 462772 479823 502135 530358 565584 608158 658140
56774 658140 716181 781835 850620 914244 964351 995517 1005484 994741 966482 925579 876755 824055
56762 824055 771351 721912 677573 639463 609093 587345 572972 564018 560503 564024 575114 592947
56750E92947K4317L0982L6279L9118M0688M1170L7045K5271Q487p413j9767k9754
56738H19370l7822m2513m3761m3547m2717m0023l4901k8667k2570j6918j2311
56727D53620r300o584k007M281R834J3474J6404J9141J9803J6542R968K075n704
56714E41547j2580j7877k1410k3615k4937k5677k6171k6069k4061j9850j5832
56703C03468j4666j5568j5296j2848j0535r956r755q427o896o571o817o112m509
56690A75512l328l178l624m080m038l100j677r60j491k442k853k758k605k475
56676A36903k481k941l590l599k967k786l417l634k548j242j284k405k941k173
56662I8895j070q94j873l129l488k539j179p24j243j546r75l72o60j528k095k105
$$ plain form
56750 592947 617264 648246 684525 723643 764331 805501 842546 867817 876304 868891 849124 819370
56738 819370 781548 739035 695274 651727 609010 568987 534086 505419 482849 465931 453620
56727 453620 444320 437736 435729 440010 449844 463318 479722 498863 518666 535208 545176 547251 541547
56714 541547 528967 511090 489680 466065 441128 415451 389280 363211 339150 319300 303468
56703 303468 288802 273234 257938 245090 234555 224599 214844 206417 199521 192950 186133 180021 175512
56690 175512 172184 169006 165382 161302 157264 154164 152487 151527 150036 147594 144741 141983 139378 136903
56676 136903 134422 131481 127891 124292 121325 118539 115122 111488 108940 107698 106414 104009 101068 98895
56662 98895 97825 96931 95058 91929 88441 85902 84723 83999 82756 81210 80235 79863 79203 77675 75580 73475
56646G3475j714j028n92j369l189m130k806n09L49n16j274j024r49j967k951k401
56630D7405p33M03N43Q50K212M084N432N958N913N478M873M546M630M651M490
56615A00735N021O663P856O534L279J150J710K994K643J428J705L497M470L462
56601A53147J749O21k05j055j139P2J590K087J396O5j695l644m999n239m932m835
56585A32984m673l668k003q47r42j802k471k622k627k693k302r54O81J112l3j214
56569A05926r16L27R10N82N53J361K292K888L496L941L201J051j263k646l309
56554A18394l584k819m54K591M600M731L458J929J202J590K386K735K711K733
56540A42203K278O54j152j184N54J939J965K078L175L585J725r94k055j289l96
$$ plain form
56646 73475 71761 70733 70141 68772 65583 61453 58647 58138 58487 57971 56697 55673 54724 52757 49806 47405
56630 47405 46672 47075 47618 48468 50680 54764 60196 66154 72067 77545 82418 86964 91594 96245 100735
56615 100735 105756 112419 120275 126809 130088 131238 132948 135942 138585 140013 141718 145215 149685 153147
56601 153147 154896 155517 155312 154257 153118 153190 154780 156867 158263 158328 156633 152989 147990 142751 137819 132984
56585 132984 128311 124643 122640 121793 120851 119049 116578 113956 111329 108636 106334 105380 106061 107173 107140 105926
56569 105926 105010 105337 106247 106829 107382 108743 111035 113923 117419 121360 124561 125612 124349 121703 118394
56554 118394 114810 111991 111537 114128 118728 123459 126917 128846 130048 131638 134024 136759 139470 142203
56540 142203 144481 145135 143983 142799 143353 145292 147257 149335 152510 156095 157820 156826 154771 153482 153086
56525A53086j8N23J273J569J628K230K965K600J256N91J551L232M222M001K897
56510A83606J651J125J630K510K986L084L087K832K378K660M174N659N556M352
56496B27290L978N024O020N586L941K213J297J502K383K830K170J047N16O80R84
56481B67461J178R93k95k563l889k673k55M49j292l443m217l708k504p14J080
56466B45608J612M64j470l293m586m637k902n69J53j156k553k553j834j506j446
56451B19332j339j803l197m449m273k807j191k96l84j174j683r15P08J674J470
56436A99673J097J079N62q04j620o77J153K285K619L029L453L085J991J204J332
56421B19461K054K879L613M235M797N296N349M515L145K255K214K378K343K594
$$ plain form
56525 153086 153068 153591 154864 156433 158061 160291 163256 165856 167112 167703 169254 172486 176708 180709 183606
56510 183606 185257 186382 188012 190522 193508 196592 199679 202511 204889 207549 211723 217382 222938 227290
56496 227290 231268 236292 242312 247898 251839 254052 255349 256851 259234 262064 264234 265281 265797 266477 267461
56481 267461 268639 269632 269337 266774 262885 260212 259957 260406 259114 255671 251454 247746 245242 244528 245608
56466 245608 247220 247684 246214 242921 238335 233698 230796 230227 230380 229224 226671 224118 222284 220778 219332
56451 219332 217993 216190 212993 208544 204271 201464 200273 199977 199593 198419 196736 195821 196529 198203 199673
56436 199673 200770 201849 202411 201607 199987 199310 200463 202748 205367 208396 211849 214934 216925 218129 219461
56421 219461 221515 224394 228007 232242 237039 242335 247684 252199 255344 257599 259813 262191 264534 267128
56407B67128L387M056M226M652N870O903O402M538K679J660J366J557K136K676
56393C19236K626J979J191N42m3o30j099j188o55K36N96j90j410j728j042o77
56377C17744j478k708l309l212k819k135j268r76j731k691k505j081P4n40k729
56362B88636m628m674l506l112l868l783j683L70j35k046j993M78K206J245o06
56347B62901j124p17o34n53J54O90L08j9P33J619J183k57j404k023k544k755k398
56330B53160k119k363k308j239P5P46J240K067K424J821J606K863M102L340J476
56315B66891J191L009M855N215M562L739K982K676L315M509N426O069O845P175
56301C28459O158M398L594M206M914M428K735O60o67j47K177M544N029L607J830
$$ plain form
56407 267128 270515 274571 278797 283449 289319 296222 302624 307162 309841 311501 312867 314424 316560 319236
56393 319236 321862 323841 325032 325574 325531 324901 323802 322614 321959 322195 322791 322601 321191 319463 318421 317744
56377 317744 316266 313558 310249 307037 304218 302083 300815 299839 298108 295417 292912 291831 291905 291365 288636
56362 288636 284008 279334 275828 272716 268848 265065 263382 263752 263617 261571 259578 260056 262262 263507 262901
56347 262901 261777 261060 260426 259873 260027 260717 261025 261006 261739 263358 264541 264284 262880 260857 258313 255558 253160
56330 253160 251041 248678 246370 245131 245206 245952 247192 249259 251683 253504 255110 257973 262075 265415 266891
56315 266891 268082 271091 275946 281161 285723 289462 292444 295120 298435 302944 308370 314439 321284 328459
56301 328459 334617 339015 342609 346815 351729 356157 358892 359552 358885 358738 360915 365459 370488 374095 375925
56286C75925R16J152K564M732O319O181M897M229N048O644P817P921P104O295
56272D47744O438P340P836P396O647O000N190M701N858Q485J0272R717Q201P798
56258E49623Q706J0104J1678J2776J2042R682Q071Q263Q182O420N272O916R054
56245F66789Q062M748K905L417L956L800M656O703P930P924Q643J0717J2278J2406
56231G64934J2647J4123J5806J6763J7755J9609K1944K4269K6499K8090K8493
56220I90932K8801L0890L4782L8741M2076M5672M9723N3161N5625N8015O0991
56209A489409O4738O9992P7223Q5118R2112R9010J07694J17674J26790J34981
56199B464741J44366J55392J65793J73811J79850J84731J88757J92407J95326
$$ plain form
56286 375925 376841 377993 380557 385289 391608 397789 402686 406915 411963 418607 426424 434345 441449 447744
56272 447744 454182 461522 469358 476754 483401 489401 494591 499292 505150 513635 523907 533624 541825 549623
56258 549623 558329 568433 580111 592887 604929 614611 622682 630945 639127 645547 650819 657735 666789
56245 666789 674851 679599 682504 685921 689877 693677 698333 705036 712966 720890 729533 740250 752528 764934
56231 764934 777581 791704 807510 824273 842028 861637 883581 907850 934349 962439 990932
56220 990932 1019733 1050623 1085405 1124146 1166222 1211894 1261617 1314778 1370403 1428418 1489409
56209 1489409 1554147 1624139 1701362 1786480 1878592 1977602 2085296 2202970 2329760 2464741
56199 2464741 2609107 2764499 2930292 3104103 3283953 3468684 3657441 3849848 4045174
56190D045174J94678J87377J73978J57634J39610J19017R6547P4530N3075L0299
56180E271919P039j2713k7312l9643n2262o3970p2950p9987q6571r2587r7776
56169D653187j03097j09043j14754j19986j25703j31693j36172j38682j40817
56160C533240j43074j43829j42496j40787j39500j36954j31944j25640j19223
56151B309793j12244j04606r7479r1081q4130p6624p0406o5846o0935n4774m9032
56140A442636m4703m0513l5896l2432l0806k9343k7079k5287k4470k2922j9791
56129A109394j6537j3883j0504o361l882l936l950j934P62K728N081Q634J1567
56116A077179J2339J2123J2202J1856J0861J1017J3004J4728J4865J5011J6272
$$ plain form
56190 4045174 4239852 4427229 4601207 4758841 4898451 5017468 5114015 5188545 5241620 5271919
56180 5271919 5278958 5266245 5238933 5199290 5147028 5083058 5010108 4930121 4843550 4750963 4653187
56169 4653187 4550090 4441047 4326293 4206307 4080604 3948911 3812739 3674057 3533240
56160 3533240 3390166 3246337 3103841 2963054 2823554 2686600 2554656 2429016 2309793
56151 2309793 2197549 2092943 1995464 1904383 1820253 1743629 1673223 1607377 1546442 1491668 1442636
56140 1442636 1397933 1357420 1321524 1289092 1258286 1228943 1201864 1176577 1152107 1129185 1109394
56129 1109394 1092857 1078974 1068470 1062109 1058227 1054291 1050341 1048407 1049169 1051897 1056978 1065612 1077179
56116 1077179 1089518 1101641 1113843 1125699 1136560 1147577 1160581 1175309 1190174 1205185 1221457
56105A221457J6979J6122J5705J7228J8978J9356J9771K1650K3693K4727K6115
56094A441781K8821L1151L2213L4328L9141M4496M8357N2686O0085O9307P7505
56083A959871Q4653R2722J02688J15033J30789J49363J67583J83016J95583K04008
56073C385309K04327J94735J78881J61566J44301J27441J12833J01081Q9418P5461
56063D775353N9951M3192K2849j186k3487l8805m8229n6449o6158p8472r5112
56052D493447j15962j37125j54895j68893j78808j81896j77162j68099j57771
56043C052836j45073j29306j13939j01734r0494p8013o6935o0030n4977m8788
56033B163547m3275m0976l9588l5815l1042k7941k5150k0659j6666j5615j5008
$$ plain form
56105 1221457 1238436 1254558 1270263 1287491 1306469 1325825 1345596 1367246 1390939 1415666 1441781
56094 1441781 1470602 1501753 1533966 1568294 1607435 1651931 1700288 1752974 1813059 1882366 1959871
56083 1959871 2044524 2137246 2239934 2354967 2485756 2635119 2802702 2985718 3181301 3385309
56073 3385309 3589636 3784371 3963252 4124818 4269119 4396560 4509393 4610474 4699892 4775353
56063 4775353 4835304 4878496 4901345 4900159 4876672 4837867 4789638 4733189 4667031 4588559 4493447
56052 4493447 4377485 4240360 4085465 3916572 3737764 3555868 3378706 3210607 3052836
56043 3052836 2907763 2778457 2664518 2562784 2472290 2394277 2327342 2267312 2212335 2163547
56033 2163547 2120272 2079296 2039708 2003893 1972851 1944910 1919760 1899101 1882435 1866820 1851812
56022A851812j1759p910o557n807k678Q64J747K059N143Q989R894R333J0836J3271
56008A879237J3772J4067J7334K1709K3482K3817K5960K8709K9027K8096K8582
55997B133792K9232K8394K9079L3938L9136M0174L9770M2623M6522M6544M4356
55986B553560M5078M8293N0312N2020N6331O0980O1999O1311O3117O6056O6833
55975C185890O7788P2704P9075Q2774Q6067R2532R8950J01350J03994J12393J22557
55964D206074J27790J31132J39756J51842J60751J67769J78471J90704J98755
55955E653044K05424K17219K31333K40478K46943K58485K73989K86851K98855
55946G912621L16458L36818L52065L64296L81659M03119M22022M41132M68300
$$ plain form
56022 1851812 1840053 1832143 1825586 1819779 1817101 1817965 1819712 1821771 1826914 1835903 1845797 1855130 1865966 1879237
56008 1879237 1893009 1907076 1924410 1946119 1969601 1993418 2019378 2048087 2077114 2105210 2133792
55997 2133792 2163024 2191418 2220497 2254435 2293571 2333745 2373515 2416138 2462660 2509204 2553560
55986 2553560 2598638 2646931 2697243 2749263 2805594 2866574 2928573 2989884 3053001 3119057 3185890
55975 3185890 3253678 3326382 3405457 3488231 3574298 3666830 3765780 3867130 3971124 4083517 4206074
55964 4206074 4333864 4464996 4604752 4756594 4917345 5085114 5263585 5454289 5653044
55955 5653044 5858468 6075687 6307020 6547498 6794441 7052926 7326915 7613766 7912621
55946 7912621 8229079 8565897 8917962 9282258 9663917 10067036 10489058 10930190 11398490
55937A1398490N00783N29964N57978N93082O32304O66091O96541P33252P75119
55928A7083604Q14595Q55654R08043R68070J025283J083591J154889J236770J318604
55919B6449103J403760J502298J608263J710231J817848J950206K104290K263902
55911D0809901K432467K625413K838375L058123L297124L579854L904260M259017
55903F6804534M669924N183013N811138O547070P415692Q453211R648153J0973925
55895A25506660J2470517J4219891J6261098J8624492K1419608K4750620K8552557
55888B61805443L2647586L6848225M0575359M2204685L9310388L0318427J6186218
55881D99896331K08602j4032203k4571051l1274436l4851319l6040122l5458824
$$ plain form
55937 11398490 11899273 12429237 12987215 13580297 14212601 14878692 15575233 16308485 17083604
55928 17083604 17898199 18753853 19661896 20629966 21655249 22738840 23893729 25130499 26449103
55919 26449103 27852863 29355161 30963424 32673655 34491503 36441709 38545999 40809901
55911 40809901 43242368 45867781 48706156 51764279 55061403 58641257 62545517 66804534
55903 66804534 71474458 76657471 82468609 89015679 96431371 104884582 114532735 125506660
55895 125506660 137977177 152197068 168458166 187082658 208502266 233252886 261805443
55888 261805443 294453029 331301254 371876613 414081298 453391686 483710113 499896331
55881 499896331 500104933 486072730 461501679 430227243 395375924 359335802 323876978
55874C23876978l3666132l1118382k8155061k5074135k2136680j9480456j7111514
55867A47134618j5002296j3144461j1516210j0078089q819399p755269o869117
55860G3949777o106642n432346m846265m341293l890051l481196l127108k827055
55852C9897821k558877k313542k103380j929501j773418j627407j502656j400860
55844B4688180j306275j212616j131105j065600j004759r44468q93856q53383
55836A6276118q10117p60565p16243o81156o44832o03148n65521n35761n05236
55827A0453539m70614m39920m15577l89372l59466l35146l19409l03434k83407
55818G137194k66637k56163k45010k30696k20018k14551k06398j93300j83308
$$ plain form
55874 323876978 290210846 259092464 230937403 205863268 183726588 164246132 147134618
55867 147134618 132132322 118987861 107471651 97393562 88574163 80818894 73949777
55860 73949777 67843135 62410789 57564524 53223231 49333180 45851984 42724876 39897821
55852 39897821 37338944 35025402 32922022 30992521 29219103 27591696 26089040 24688180
55844 24688180 23381905 22169289 21038184 19972584 18967825 18023357 17129501 16276118
55836 16276118 15466001 14705436 13989193 13308037 12663205 12060057 11494536 10958775 10453539
55827 10453539 9982925 9543005 9127428 8738056 8378590 8043444 7724035 7420601 7137194
55818 7137194 6870557 6614394 6369384 6138688 5918670 5704119 5497721 5304421 5121113
55809E121113j79470j74282j64409j56762j54557j51014j42443j34600j30576
55800C733000j25088j16369j11203j12336j12713j08030j03650j03372j02380
55791B737859r7145r1814q9046q4500p5975o8444o4755o0736n4388n0413n0690
55780A949953m9563m3809l8265l6549l5004l0875k7934k8868l0110k8952k8101
55769A571923k8912k8032k4757k3577k5540k5521k1962k0480k3462k5159k2195
55758A302326j9960k2855k6492k5661k2480k0546j8201j3701j0342j0510j0657
55747A100921p731m635m176l741j073P20p72k199p10M29k266o495r160j1800j5913
55732A031399j8339j6753j4719j5893j7901j7230j5583j6111j7458j6634j4158
$$ plain form
55809 5121113 4941643 4767361 4602952 4446190 4291633 4140619 3998176 3863576 3733000
55800 3733000 3607912 3491543 3380340 3268004 3155291 3047261 2943611 2840239 2737859
55791 2737859 2640714 2548900 2459854 2375354 2299379 2230935 2166180 2105444 2051056 2000643 1949953
55780 1949953 1900390 1856581 1818316 1781767 1746763 1715888 1687954 1659086 1628976 1600024 1571923
55769 1571923 1543011 1514979 1490222 1466645 1441105 1415584 1393622 1373142 1349680 1324521 1302326
55758 1302326 1282366 1259511 1233019 1207358 1184878 1164332 1146131 1132430 1122088 1111578 1100921
55747 1100921 1093190 1088555 1084379 1080638 1079565 1080285 1079513 1077314 1076604 1077033 1074767 1068272 1059112 1047312 1031399
55732 1031399 1013060 996307 981588 965695 947794 930564 914981 898870 881412 864778 850620
55721H50620j1880r471p039p276j1044j4840j6201j7234j9385j9816j6929j4381
55709F85124j5169j6560j5388j3617j3953j4474j2582j0033r266q724o527m784
55697E44047n581o531m990k890k933l757l443l854o782r604r630r007j0512j2158
55683D52375j1063r191r892j1825j1583r536q057o633l775j200j239k369k006
55670C64006j191j946k705j246L95r51l849m754m162n085p147p391n687m386l724
55655C10177k215o66j193k965l181j593k34O25K450N008O554O818O736O116M441
55640C36878K874K551K285P67o52l81K50n18j260K9J695R35j124j128Q77J784
55624C45862N70r12j706k441k606q65J924L329K894K215J841R53j98m01J84K70
$$ plain form
55721 850620 838740 829269 822230 814954 803910 789070 772869 755635 736250 716434 699505 685124
55709 685124 669955 653395 638007 624390 610437 595963 583381 573348 564082 555358 548831 544047
55697 544047 538466 531935 526945 524055 521122 517365 513922 510068 503286 493682 484052 475045 464533 452375
55683 452375 441312 432121 422229 410404 398821 389285 381228 374595 370820 369620 368381 366012 364006
55670 364006 362815 360869 358164 356918 357313 356362 352513 347759 343597 338512 331365 323974 318287 313901 310177
55655 310177 307962 307296 306103 303138 299957 298364 298130 298755 301205 306213 312767 319585 326321 332437 336878
55640 336878 339752 342303 344588 345355 344703 344322 344572 344054 342794 342823 344518 345453 344329 343201 344078 345862
55624 345862 346432 345520 343814 341373 338767 337902 339826 343155 346049 348264 350105 351058 350860 350459 350643 350913
55608C50913k95o77q15r68l92J290K580K196J364J617J894O71o33M54L208M697
55592C67104M157L226K561J407J13j25N5j451m965q493j0470j1065j0861j0157
55578C21036r397q843q104p133o683o802o358n261n323p316r240r347q651q397
55564B14181p634n756m851o375p834o291l168j854k278j871m82j63q75n73P00
55549A64876O56j141k377j607lP92K94j257k975l423k449j952k942l442j734J99
55533A41515m67k726l517k812l006m221m287l011k405k683j964j99M23m29l21
55518A09890J809L895M238L866M139M570M391M184M684N410N521M950M291M384
55504A70222N802P641P497M173k73k942l718m564n980o598n829m662l879l406
$$ plain form
55608 350913 350618 349941 349126 348158 347766 349056 351636 353832 355196 356813 358707 359378 358745 359199 362407 367104
55592 367104 371261 374487 377048 378455 378568 378443 378498 377047 372082 363589 353119 342054 331193 321036
55578 321036 311639 302796 294692 287559 280876 274074 267716 262455 257132 249816 240576 231229 222578 214181
55564 214181 206547 200791 195940 189565 181731 175440 172272 170418 168140 166269 165787 165624 164749 164176 164876
55549 164876 165532 164391 162014 160407 160404 161196 161490 160233 157258 153835 151386 149434 146492 143050 141316 141515
55533 141515 141048 138322 134805 131993 128987 124766 120479 117468 115063 112380 110416 110217 110640 110211 109890
55518 109890 111699 115594 119832 123698 127837 132407 136798 140982 145666 151076 156597 161547 165838 170222
55504 170222 176024 183665 191162 195335 195062 192120 188402 183838 177858 171260 165431 160769 156890 153484
55490A53484l229l280k905k045k086l709n046m024j573j84l20n69l25J49J158
55475A25496K586K634L89j680p47K087L783M203N217O116M498J230n3J290J936
55460A58985K38j385q80M03O05M2n64j635l026l390k655k723m389n870n645m597
55444A23514m146m240m324m414m239l113j537j141k271l360l336k880k849l149
55430G8515l672m499m871l782j843p20n64j51M27l34k425l826l553k857k661k178
55414D1006r14J83M68N56P24L07o52j069p48o99j015m76J077K076J702J091J273
55397D4890J736J679J034k75k216l557k953j371j156k359k540p56J006J279J254
55382C5695K152K958K391R87k70j545k911l280k034k66Q36J386J695J404P05O64
$$ plain form
55490 153484 150255 146975 144070 142025 139939 136230 131184 127160 125587 125403 125083 124514 124189 124338 125496
55475 125496 128082 130716 131105 129425 128678 130765 134548 138751 143968 150084 154582 155812 155759 157049 158985
55460 158985 159223 157838 156958 157361 157966 158008 157444 155809 152783 149393 146738 144015 139626 133756 128111 123514
55444 123514 119368 115128 110804 106390 102151 99038 97501 96360 94089 90729 87393 84513 81664 78515
55430 78515 74843 70344 65473 61691 59848 59128 58564 58413 58840 58506 56081 52255 48702 45845 43184 41006
55414 41006 40092 40275 40743 41299 42023 42330 41678 40609 39861 39162 38147 37671 38748 40824 42526 43617 44890
55397 44890 46626 48305 49339 49064 46848 43291 40338 38967 37811 35452 32912 32156 33162 34441 35695
55382 35695 37847 40805 43196 44183 43913 42368 39457 36177 34143 33877 34713 36099 37794 39198 39903 40567
55366D0567J312J202j01q39L21K187K851K117R89J70K02J486L009K633nk380k162
55349E3559r0J589K185K510K906K975K694K427K164J612P20n03k016l243l329
55334F6160k438j927k700m079m761m245l044k022j660j477n50R10J390L36o85
55319C9208m79l82j775k974j609J046J665K52m0J405J431j363m009l863k427k201
55303B3885k861k943k822l378l715k650q88L54J348K610L296K666J629J026R4
55288A7651j575k265n81J926K817K187J754J579K15k368m265m011j887R51L277
55273A5405M040L030J285K4m64m09J92J188J928J977J510O40o89j786j486J82
55257B6567J793K400K279J580K4j650j984j219j273k599l254k233j262j703k079
$$ plain form
55366 40567 41879 43081 42980 42141 42462 44649 47500 49617 50606 50776 50978 52464 55473 58106 58101 55721 53559
55349 53559 53469 55058 57243 59753 62659 65634 68328 70755 72919 74531 75251 74748 72732 69489 66160
55334 66160 63722 61795 59095 55016 50255 46010 42966 40944 39284 37807 37257 38167 39557 39893 39208
55319 39208 38729 38347 36572 33598 31989 33035 34700 34952 34912 36317 37748 36385 32376 28513 26086 23885
55303 23885 21024 18081 15259 11881 8166 5516 4628 4982 6330 8940 12236 14902 16531 17557 17651
55288 17651 16076 13811 13230 15156 17973 20160 21914 23493 23708 21340 17075 13064 11177 12128 15405
55273 15405 19445 22475 23760 23784 23320 22911 23103 24291 26219 28196 29706 30346 29657 27871 26385 26567
55257 26567 28360 30760 33039 34619 34643 32993 31009 29790 28517 25918 22664 20431 19169 17466 15387
55242A5387n77J879L129K740J644L30o81k05J771L014J812m78j515j233j022j121
55226B4874r58r27j491j605k83J268J299M69P31K039K626K051J425R27l76k107
55210B9962k334l72K074L113K564J284J0p04m96K97Q24P25L25rj28O8M21L75l84
55191C7615j348j740j368o02jj30r93j516o65P71R01m21j252o88l10j232j759
55174B5262L0K890L845K224J98k56O94J561J014j160l516l916j921M17J114N53
55158B9033L67J058J976K630K669J511o57k309k258j120j20N96J363J905K098
55143C8742K625L558L579J932j39j300k047l094l448k144m63j99p91m51P60J371
55127C8491J232J376J693J049m08j187o28N00J363J529O47q00j215J8J059O7j869
$$ plain form
55242 15387 14810 16689 19818 22558 24202 24532 23851 23646 25417 28431 30243 29765 28250 27017 25995 24874
55226 24874 23916 22989 21498 19893 19610 20878 22177 22646 23377 25416 28042 30093 31518 32445 32069 29962
55210 29962 27628 27256 29330 32443 35007 36291 36301 35597 35101 35398 36222 36947 37272 37263 37135 37203 37624 37999 37615
55191 37615 36267 34527 33159 32557 32556 32426 31433 29917 29252 30023 30924 30503 29251 28563 28253 27021 25262
55174 25262 25292 28182 32027 34251 34449 34193 34887 36448 37462 36302 32786 28870 26949 27366 28480 29033
55158 29033 29400 30458 32434 35064 37733 39244 38587 36278 34020 32900 32780 33376 34739 36644 38742
55143 38742 41367 44925 48504 50436 50297 48997 46950 43856 40408 38264 37801 37602 36811 36360 37120 38491
55127 38491 39723 41099 42792 43841 43433 42246 41618 42118 43481 45010 45657 44857 43642 43660 44719 44786 42917
55110D2917k397j484r30j109r34m77q69j674j178N64J479O45o78j369j568j157
55094B9781L60K051K039M69l29N89J361N07o73l95P39Q88k31j244j281r12j019
55077C2700j491j236M65K623L295K177J349K290L388K242m36j675n93P54J067
55062D6919J585L252M539L642J208n62n28P68K131K469J379k53r90o61n82j585
55046F2731k867l250k575j220O88K828M286M324L162J517p8j274j832j845j493
55031F3102n51J140K839L436K913K287J978J314o4j392j901j899k097k427k154
55016F6524r07P11J573J169L16L98J539K172J036r87j950j223kL75k54r78o09
54999F8903J197L077K966P70r61j37K031K754J378l06r14o88j06Q97K039K526
$$ plain form
55110 42917 40520 39036 38106 36997 36063 35586 34717 33043 31865 32429 33908 34553 33875 32506 30938 29781
55094 29781 30141 32192 34231 34700 34371 34960 36321 36828 36155 35760 36499 37387 37156 35912 34631 33719 32700
55077 32700 31209 29973 30438 33061 36356 38533 39882 42172 45560 47802 47366 45691 45098 45852 46919
55062 46919 48504 51756 56295 59937 61145 60583 60055 60823 62954 65423 66802 66549 65559 64898 64316 62731
55046 62731 59864 56614 54039 52819 53507 56335 60621 64945 68107 69624 69546 68272 66440 64595 63102
55031 63102 62551 63691 66530 69966 72879 75166 77144 78458 78394 77002 75101 73202 71105 68678 66524
55016 66524 65617 66328 67901 69070 69386 69784 71323 73495 74531 73544 71594 70371 70369 70744 70490 69512 68903
54999 68903 70100 73177 76143 76913 75952 75815 77846 80600 81978 81672 80758 80070 79964 80861 82900 85426
54983H5426K141J416O15l59j178j288q84o05m62k5N63R19J327K159K778K310J147
54966I6000L99K32M2j85m2J44k54r93j451j729j954j412P3Q76l05j990j726K52
54948H5977J560J219L27l49q95q02M35J489O85j004j262m31q98k650k994j279
54932G9128q6p63j385n74J82j54J53K305M309M058K641K028J719L72j120r87M56
54915I2282J629K281K871K711J112n30k20J716L292L760L888M065M130M605O097
54900A33689P817Q448Q164Q197Q768R164R490J0618J2519J4193J5193J5935J6603
54887B78798J7032J7500J8198J7945J4846Q574R90n708j0629j3960j6025j6991
54875C10570j6992j6283j5348j4681j4245j3512j2210j0616q961p255n834n212
$$ plain form
54983 85426 87567 88983 89598 89239 88061 86773 85889 85284 84822 84797 85360 86279 87606 89765 92543 94853 96000
54966 96000 96399 96631 96673 96488 96446 96590 96336 95343 93892 92163 90209 88797 88870 89746 89441 87451 85725 85977
54948 85977 87537 88756 89083 88734 87839 87037 87472 88961 89646 88642 87380 86949 86051 83401 80407 79128
54932 79128 79042 78279 76894 76320 76502 76348 76501 78806 83115 87173 89814 91842 93561 93933 92813 91826 92282
54915 92282 93911 96192 99063 101774 102886 102356 102136 103852 107144 110904 114792 118857 122987 127592 133689
54900 133689 141506 149954 158118 166315 175083 184247 193737 204355 216874 231067 246260 262195 278798
54887 278798 295830 313330 331528 349473 364319 372893 373883 368175 357546 343586 327561 310570
54875 310570 293578 277295 261947 247266 233021 219509 207299 196683 187722 180467 174633 169421
54863A69421n032m265k848k029k283k101j1L179N394N932N815N965O432P219Q691
54848A99479J0839J2997J4567J5601J6430J6896J6107J3218Q686M334J466p32
54836C29888m006q483j2595j5286j6854j7465j6662j4900j3836j4130j4450j3582
54824A67639j2052j0619q713n795k984j734j819k105k408l138l879l887l381k930
54810A02195k152m90J245J614M74j218l027m935n954m655j304J869L010K215O73
54795H9560p06j480j443q02j01K15o6j069k544l562l253j927q13n14l19O74K062
54778G3912K367Q37j355k102o43J699L233L723L880L817L137K089J414J092N64
54763I7664Q3M80J506J863J210O60Q88J191R53N92N87R90K283M904P369P043L910
$$ plain form
54863 169421 164389 160124 157276 155247 152964 150863 150852 154031 159425 165357 171172 177137 183569 190788 199479
54848 199479 210318 223315 237882 253483 269913 286809 302916 316134 324820 329154 330620 329888
54836 329888 325882 317399 304804 289518 272664 255199 238537 223637 209801 195671 181221 167639
54824 167639 155587 144968 136255 130460 127476 125742 123923 121818 119410 116272 112393 108506 105125 102195
54810 102195 100043 99553 100798 102412 102886 101668 98641 93706 87752 83097 81793 83662 86672 88887 89560
54795 89560 88854 87374 85931 85129 85028 85243 85177 84108 81564 78002 74749 72822 72009 71495 71176 71850 73912
54778 73912 76279 77116 75761 73659 73016 74715 77948 81671 85551 89368 92505 94594 96008 97100 97664
54763 97664 97747 98227 99733 101596 102806 103466 104354 105545 106498 107090 107677 108667 110950 115854 123223 130266 134176
54746A34176J541K682N736P487P605Q079R452J0404J0595J1471J3874J6767J8770
54733B58639J9566J9379J8126J5570J1787P385L542J191l32l041p655j2092j3760
54720C18305j2825j1867j2546j3946j4150j2363r294o296m338l434l079l122l671
54707B07374m086l180r18J128J805J844K514L822N021N955O811P419P900R170
54693B52579J1633J4207J5723J6471J7249J7834J7654J6941J5774J2934P512J014
54681D17525l952o806r213j2375j5717j8142j9175j8802j7403j5878j4906j4210
54669B50946j3242j2183j1352j0348q881p791p973q819q979q149o827n106l048
54656A38248j697j903k676k431j337p45o18K62J592J307j357m353n267l902j798
$$ plain form
54746 134176 135717 138399 144135 151622 159227 167306 176758 187162 197757 209228 223102 239869 258639
54733 258639 278205 297584 315710 331280 343067 350452 353994 355185 354853 351812 344157 332065 318305
54720 318305 305480 293613 281067 267121 252971 240608 231314 225018 220680 217246 214167 211045 207374
54707 207374 203288 200108 199190 200318 202123 203967 206481 210303 215324 221279 228090 235509 243409 252579
54693 252579 264212 278419 294142 310613 327862 345696 363350 380291 396065 408999 416511 417525
54681 417525 413573 406767 397554 385179 369462 351320 332145 313343 295940 280062 265156 250946
54669 250946 237704 225521 214169 203821 194940 187149 179176 170357 161378 153229 146402 141296 138248
54656 138248 136551 134648 131972 129541 128204 127459 126841 127103 128695 130002 128645 124292 119025 115123 113325
54641A13325k43M40N16M94P73J236J419J069K45p59j297q09J47J93p73r76N93
54624A15593K180J584m06j017O28K692L490L153K354J353O64R68J930K579K937
54609A40682L797M818M683L423K714L311L972L700L312L806M611M696M308M350
54595A96183M727M488L268J740P86O87J052J273J153R99R52P60N75J325L367N509
54579B28844O523O980Q155R569R516P935O804P197P732O793M819L267K356R26
54565C17416j903n678q963j0435j0099r409r594j0018r079o720m816m788n914
54552B20000o487n737m142k515j386p81l03K64M30k82j295j553j243j846m015
54537A89109o174o106l563p92k87k284m705n576n069m659m803m711m272m406n036
$$ plain form
54641 113325 113082 113522 114038 114532 115305 116541 117960 119029 119274 118515 117218 116409 116556 116749 115976 115000 115593
54624 115593 117773 119357 118951 117934 118562 121254 124744 127897 130251 131604 132268 133236 135166 137745 140682
54609 140682 144479 149297 153980 157403 160117 163428 167400 171100 174412 178218 182829 187525 191833 196183
54595 196183 200910 205398 208666 210406 211192 211879 212931 214204 215357 216356 217308 218068 218643 219968 223335 228844
54579 228844 235367 242347 250502 260071 269587 277522 284326 291523 299255 306048 310867 314134 316490 317416
54565 317416 315513 309835 300872 290437 280338 270929 261335 251317 242238 235518 230702 225914 220000
54552 220000 213513 207776 203634 201119 199733 198952 198649 198913 199343 199061 197766 196213 194970 193124 189109
54537 189109 182935 176829 173266 172474 172187 169903 165198 159622 154553 149894 145091 140380 136108 131702 126666
54522A26666m525k269j84j08j192j643j586k140k782k111n54P7n91j344j690k134
54506A01890k407j748p91q61j455r09M86O59p19j569q58k6j85m54k06m45j637
54489H8765k413j922j366j619j295R61L914N286M687L336K076J303J692L289M579
54474A11273M116K512J529J818K806M078N468O224N572M030L004L079L537L541
54460A62587L127K884L123L402K801P59k289n259p256p866p068n432l949l112
54446A36452k527k058k363l363l402j532M08O3j845k566j438l50k94k70J06k43
54430A14778j462k129j809j667j902j213K41L22j327k030k78J652J480O08J384
54415A06648L020L126J698O04L45J35K51J547L082K798M91j851k586j743j37J316
$$ plain form
54522 126666 122141 119872 119688 119580 118388 116745 115159 113019 110237 108126 107572 107649 107058 105714 104024 101890
54506 101890 99483 97735 96944 96083 94628 93719 94205 94864 94145 92576 91718 91692 91507 91053 90847 90402 88765
54489 88765 86352 84430 83064 81445 80150 81111 85025 90311 94998 98334 100410 101713 103405 106694 111273
54474 111273 115389 117901 119430 121248 124054 128132 133600 139824 145396 149426 152430 155509 159046 162587
54460 162587 165714 168598 171721 175123 177924 178683 176394 171135 163879 156013 148945 143513 139564 136452
54446 136452 133925 131867 129504 126141 122739 121207 121615 121678 119833 117267 115829 115479 115185 114915 115021 114778
54430 114778 113316 111187 109378 107711 105809 104596 104837 105159 103832 101802 101524 103176 104656 105264 106648
54415 106648 109668 112794 114492 115096 115441 115576 115827 117374 120456 123254 123745 121894 119308 117565 117428 118744
54399A18744J735J106N71Q51J072K62r37j366j180j181j295j141j123j526j565
54384A13027p82k01n66p54K11R98K8j593j718p52p83j859k018q95l33j062j482
54367I9466n71M64M41J99J069K658L346K267J54j363j077O41K081K082J345J172
54351A14374J631J956K012K186K469K934M307O495P446N489K187P13J814L472
54337A59485M361N090N901N749M425L374L335L070J494m88j390j081l20M11O76
54322A94092j54j872l050k663j400o63j000k153l728n008m969l533k315l005n131
54307A53448o313m900j853K48K3j253j264M71K093K026J004O80J107J025Q7p07
54291A45922p67n32j32J002K666L323K050J28k72J364L443M116L091J648J165
$$ plain form
54399 118744 120479 121585 122156 123007 124079 124341 123404 122038 120858 119677 118382 117241 116118 114592 113027
54384 113027 112245 112044 111478 110724 110935 111933 111961 110368 108650 107898 107115 105256 103238 102343 102010 100948 99466
54367 99466 98895 99359 99800 99999 101068 103726 107072 109339 109493 108130 107053 107694 109775 111857 113202 114374
54351 114374 116005 117961 119973 122159 124628 127562 131869 138364 145810 151299 153486 154199 156013 159485
54337 159485 163846 168936 174837 180586 185011 188385 191720 194790 196284 195796 194406 193325 193005 193416 194092
54322 194092 193938 192066 189016 186353 184953 184290 183290 181137 177409 172401 167432 163899 161584 158579 153448
54307 153448 147135 142235 140382 140630 140653 139400 138136 138607 140700 142726 143730 144410 145517 146542 146629 145922
54291 145922 145155 144623 144491 145493 148159 151482 153532 153660 153388 154752 158195 162311 165402 167050 168215
54276A68215J785K495K355J377J41q40j149n40N36J046N77k99j299l072n590p153
54260A58585o470m827m393m929m271k002m17j279l439m644m355l720l686m071
54246A06082l963k603l26J208O37j236k168j323j68j59q88j264j302j598j959
54231H8970j798j311j055p13N71K558L768L234J600P6j012j970k565k159j007
54216H7187n13j482k736k397l33J634K034J308P00N65L85j42p11p88q1J031J443
54199H7104M85p89n22J332K591J793K01k09L81L14q42j812j577l84R77J837J753
54182I2633Q82J17Lj8n93j339j573j514j583j274PJ662K649K999L250L079J974
54165A01361O23N6j55j113k443k692j634m51K53Q00R55Pj485j930j042k29l04
$$ plain form
54276 168215 170000 172495 174850 176227 176368 175528 174379 173839 174375 175421 175998 175699 174400 171328 165738 158585
54260 158585 152115 147288 142895 137966 133695 131693 131276 129997 126558 121914 117559 113839 110153 106082
54246 106082 102119 99516 99190 100398 101035 99799 97631 96308 96140 95981 95093 93829 92527 90929 88970
54231 88970 87172 85861 84806 84093 84664 87222 90990 94224 95824 95900 94888 92918 90353 88194 87187
54216 87187 86674 85192 82456 80059 79726 81360 83394 84702 85402 85967 86352 86210 85499 84711 84630 85661 87104
54199 87104 87589 86800 86278 87610 90201 91994 92195 91986 92367 92681 91839 90027 88450 88066 89043 90880 92633
54182 92633 93515 93632 93635 93617 93024 91685 90112 88598 87015 85741 85748 87410 90059 93058 96308 99387 101361
54165 101361 101984 102040 101885 100772 98329 95637 94003 93552 93805 94605 95560 95567 94082 92152 91110 90881 90577
54148I0577l41O22K120L051K842J525k95j400j052r9J39j07L71J471J830J179
54132A02433P32R39O83p88k773m402n482n664m434k411j061o31N6J328J972J401
54116H1898O70N43K97n79j164o51K31M44J52J07N58J484K645L065J805j48m55
54099I0902J375L039K555O68r29j973k951l581l477l097k742j762j3J215J075
54084H0304O47R63R73p10k982l322j243J134J924J377Q17Q83J155Q78o8q30n67
54067H1333K73N04O5M1N00Qj918l430k759p08O61P08K45q8m7P00J821J906L41
54048H0156j198o85J353K534J811L18o78j102j197p63L02J553K371K391J673P53
54032H9592K30rn51j229j061N7Q43N62K29P81J367R03J37M57J376J190l17j614
$$ plain form
54148 90577 90236 90858 92978 96029 98871 100396 100101 98701 97649 97550 97689 97582 97953 99424 101254 102433
54132 102433 103165 104104 104787 103999 101226 96824 91342 85678 81244 78833 77772 77141 77197 78525 80497 81898
54116 81898 82568 83111 83408 82829 81665 81014 81245 81689 81841 81948 82506 83990 86635 89700 91505 91357 90902
54099 90902 92277 95316 97871 98539 97610 95637 92686 89105 85628 82531 79789 78027 78014 79229 80304
54084 80304 80951 81914 82887 82177 79195 75873 74630 75764 77688 79065 79882 80765 81920 82798 82730 81900 81333
54067 81333 81606 82110 82175 82216 82716 82724 80806 77376 74617 73909 74570 75278 75523 75435 75388 76088 77909 79815 80156
54048 80156 78958 78273 79626 82160 83971 84289 83611 82509 81312 80549 80851 82404 84775 87166 88839 89592
54032 89592 89822 89813 89262 88033 86972 87029 87872 88434 88663 89444 90811 91714 91851 92308 93684 94874 94557 92943
54014I2943j747j256p20J8Q91J167N65j86k12O34J902L002L514L492L364L211
53998A10582K516J072l14n47O53K632M214M136K072l65q69P43K262K307K173L224
53982A36491M265L362J158K20J723M551P240R119R889R725R479R428Q463N992
53968B21105L794M146O629Q795R543R766R987R602Q562P679O956N509L532K479
53954C18084K840L432L214K317R93p02j988j875j079j539l573n317n616n535o116
53939B97540o668o472o439p378q016o642l892k266l084n177o485o052m529l315
53925B21125l129l289k678j355m23l33m09l82j058k788m405m568l337j669j36
53910A91166J058J591J503J488J957K394K294K043J943J285m89k308k485r59P17
$$ plain form
54014 92943 91196 89940 89220 89238 90129 91296 91861 91675 91463 92097 93999 97001 100515 104007 107371 110582
53998 110582 113098 114170 113856 113309 113962 116594 120808 124944 127016 126651 125782 126525 128787 131094 133267 136491
53982 136491 140756 144118 145276 145496 147219 151770 159010 168129 178018 187743 197222 206650 215113 221105
53968 221105 224899 229045 235674 244469 254012 263778 273765 283367 291929 299608 306564 312073 315605 318084
53954 318084 320924 324356 327570 329887 330880 330178 328190 326315 325236 323697 320124 314807 309191 303656 297540
53939 297540 290872 284400 277961 270583 262567 255925 252033 249767 246683 241506 235021 228969 224440 221125
53925 221125 217996 214707 212029 210674 210251 209918 209509 209127 208069 205281 200876 196308 192971 191302 191166
53910 191166 192224 193815 195318 196806 198763 201157 203451 205494 207437 208722 208233 205925 203440 202481 203198
53895B03198J521J924K551L104L088K705K345J837R42L03R92L007M902N288M309
53880B42016L212K849L227M310O166Q207R282R078Q588Q512Q124O667M961M321
53866C29520M417L823K359J318J334J652J769K208L181L990M358M913N562M948
53852C75352K821J488L124O540Q506Q006P215Q073R650R792Q089N994M596L501
53838D62747K049O20J31N43N92q02l311n660p077p795q348q891r333r639r787
53823C96039r707r426r123q936q941r251r874j0431j0352r427q048o871o375o562
53809B72715o814o380n342m759n355o346o290m993l728l588m355n200n695n794
53795A98076n439m697l949l563l514l522l339k851k099j287o31k10j12m83j192
$$ plain form
53895 203198 204719 206643 209194 212298 215386 218091 220436 222273 223215 223518 224510 227517 232419 237707 242016
53880 242016 245228 248077 251304 255614 261780 269987 279269 288347 296935 305447 313571 320238 325199 329520
53866 329520 333937 337760 340119 341437 342771 344423 346192 348400 351581 355571 359929 364842 370404 375352
53852 375352 378173 379661 382785 389325 397831 405837 413052 421125 430775 440567 448656 454650 459246 462747
53838 462747 464796 465416 465547 466090 466682 465880 462569 456909 449832 442037 433689 424798 415465 405826 396039
53823 396039 386332 376906 367783 358847 349906 340655 330781 320350 309998 300571 292523 285652 279277 272715
53809 272715 265901 259521 254179 249420 244065 237719 231429 226436 222708 219120 214765 209565 203870 198076
53795 198076 192637 187940 183991 180428 176914 173392 170053 167202 165103 163816 163185 162975 162863 162380 161188
53780A61188j749j857j712j477r35k53k95j342k069j045J118K415K114J325R09
53765A56335M14m75r80n20K55O41R54J534J720R72K92J073K969M153L709K649
53749A75695K347K928L562L755L786M065M468M447L792L060L027L866N147O575
53735B30520Q190R711J0329R541P855O254N294M907M783M515L694K311J079Q39
53721C09822J521J874O71j840l869l800j835L74J474J144o14l650o720p815o479
53706B80258m714m310m303k728r6J069m5j513j735j409j733k547l266m062m905
53691B43961m848l425j768j099j192j387j916k914l212j842J23Q68L91N1Q7m93
53675B21385j606j717k01J549K132J871J678J382L56q39q00P14K116J716k35j824
$$ plain form
53780 161188 159439 157582 155870 154393 153458 153205 152910 151568 149499 148454 149572 151987 154101 155426 156335
53765 156335 156749 156274 155294 154774 155029 155670 156624 158158 159878 160850 161142 162215 165184 169337 173046 175695
53749 175695 178042 180970 184532 188287 192073 196138 200606 205053 208845 211905 214932 218798 223945 230520
53735 230520 238710 248421 258750 268291 276146 282400 287694 292601 297384 301899 305593 307904 308983 309822
53721 309822 311343 313217 313888 312048 308179 304379 302544 302918 304392 305536 304922 301272 294552 286737 280258
53706 280258 275544 271234 266931 264203 264107 265176 265131 263618 261883 260474 258741 256194 252928 248866 243961
53691 243961 239113 235688 233920 232821 231629 230242 228326 225412 222200 220358 220481 221349 221740 221791 221878 221385
53675 221385 219779 218062 217861 219410 221542 223413 225091 226473 226829 225990 225190 225904 228020 229736 229501 227677
53659B27677j703o01j79q90j730j978k065k296k012q77l1n20j313m62J960L805
53643B16785L893L446L829M437L993K793K124K044J337k41j038M95L680O269O840
53628B60686N929M899M339L943L455L097K979K729K120J686K076K885K890J652
53614C05365K51k5Q63K039K990L623L383J571j200k927k321l79Q92P05l23j608
53598C12899k992l858l259j312N30J154R44P81P04K25o13j289j470j016J85J751
53582C03364K639K224J145L89M2k69k44O01J600J485K58o26k43P19J205J148J085
53565C16522J226J537K133K960L474L220K565K435L328M707N325M334K297Q94
53551C56957J249K697L813M274M928N991O301M850K396Q92J489L558N609O822
$$ plain form
53659 227677 225974 225373 225194 224304 222574 220596 218531 216235 214223 213346 213315 212795 211482 211020 212980 216785
53643 216785 220678 224124 227953 232390 236383 239176 241300 243344 244681 244440 243402 243897 247577 253846 260686
53628 260686 266615 271514 275853 279796 283251 286348 289327 292056 294176 295862 297938 300823 303713 305365
53614 305365 305616 305591 306454 308493 311483 315106 318489 320060 318860 315933 313612 313233 314125 314830 314507 312899
53598 312899 309907 306049 302790 301478 302008 303162 304106 304887 305591 305816 305203 303914 302444 301428 301613 303364
53582 303364 306003 308227 309372 309761 309803 309534 309290 309891 311491 312976 313234 312608 312365 313084 314289 315437 316522
53565 316522 317748 319285 321418 324378 327852 331072 333637 336072 339400 344107 349432 353766 356063 356957
53551 356957 358206 360903 364716 368990 373918 379909 386210 391060 393456 394348 395837 399395 405004 411826
53537D11826P409P628P094N701M711N638P841Q730P127N028M709N470N028L261
53523D97201K328L287M769N111M107K427J016J168L404N982O406M789L775M539
53509E50309N107L684J505Q70J935L095L391L017K367J919K251L136L461K938
53495E88985K774L627M308L753K938L211L982L917L436L999N447O099N321M198
53481F45995L646L475L424L680M116M208L938L843M142M542M853N081N095M997
53467G05035N470O952Q871J0514J2024J3600J4395J3490J1560J0317J0553J1884
53455H34665J3922J6307J8025J8239J7716J8063J9552K1016K1688K1854K1835
53444A042882K1772K2377K4307K6806K8394K9051L0052L1575L2343L2038L2129
$$ plain form
53537 411826 419235 426863 433957 439658 444369 450007 457848 466578 473705 478733 483442 488912 493940 497201
53523 497201 499529 502816 507585 512696 516803 519230 520246 521414 524818 530800 537206 541995 545770 550309
53509 550309 555416 559100 560605 561475 563410 566505 569896 572913 575280 577199 579450 582586 586047 588985
53495 588985 591759 595386 599694 603447 606385 609596 613578 617495 620931 624930 630377 636476 641797 645995
53481 645995 649641 653116 656540 660220 664336 668544 672482 676325 680467 685009 689862 694943 700038 705035
53467 705035 710505 717457 726328 736842 748866 762466 776861 790351 801911 812228 822781 834665
53455 834665 848587 864894 882919 901158 918874 936937 956489 977505 999193 1021047 1042882
53444 1042882 1064654 1087031 1111338 1138144 1166538 1195589 1225641 1257216 1289559 1321597 1353726
53433A353726L3423L4550L4099L2909L2696L3409L3435L2024L0181K9309K9897
53422A709658L1506L3259L4208L3823L2383L0774K9782K9539K9598K9523K9377
53411B053430K9418K9251K7958K5491K3143K2045K1741K1132K0104J9004J7209
53400B309926J3919J0117P858P284O122K874j092l634m685n832p931j0432j2710
53387B311784j4783j6769j8491j9815k0919k2004k2920k3212k2698k1976k1954
53376B086243k2689k3225k3143k3502k5248k7364k7868k6422k4370k2405j9983
53365A820024j7323j6114j7120j8475j7573j3929r370o076n048n719o307n222
53353A681748k630p3J613K931M085M363L914M597P748J2189J5829J8177J9989
$$ plain form
53433 1353726 1387149 1421699 1455798 1488707 1521403 1554812 1588247 1620271 1650452 1679761 1709658
53422 1709658 1741164 1774423 1808631 1842454 1874837 1905611 1935393 1964932 1994530 2024053 2053430
53411 2053430 2082848 2112099 2140057 2165548 2188691 2210736 2232477 2253609 2273713 2292717 2309926
53400 2309926 2323845 2333962 2341820 2349104 2355226 2358100 2357008 2353374 2348689 2342857 2334926 2324494 2311784
53387 2311784 2297001 2280232 2261741 2241926 2221007 2199003 2176083 2152871 2130173 2108197 2086243
53376 2086243 2063554 2040329 2017186 1993684 1968436 1941072 1913204 1886782 1862412 1840007 1820024
53365 1820024 1802701 1786587 1769467 1750992 1733419 1719490 1710120 1704044 1698996 1693277 1686970 1681748
53353 1681748 1679118 1679045 1680658 1683589 1687674 1692037 1695951 1700548 1708296 1720485 1736314 1754491 1774480
53340A774480K1486K2606K4245K7301L0907L3337L4548L6171L8968M1927M4078
53329B130054M5671M7267M9002N1108N3841N6492N7769N7742N8171O0122O2424
53318B729663O3273O2471O1084N9864N8993N8675N8868N8738N7421N5115N2610
53307C376775N0087M7241M4294M1703L8939L4762K9000K3150J8748J5820J3254
53296C733773J0001N454n29p304j3554j8415k2213k5603k8433l0186l1148l2335
53284C539508l4326l6975m0110m3650m6948m8929m9223m8517m7537m6450m5454
53273C051389m5185m5937m7160m8192m8900m9128m8368m6683m5189m4645m4199
53262B537803m2635m0430l9213l9287l9054l7226l4356l1777k9996k8748k7790
$$ plain form
53340 1774480 1795966 1818572 1842817 1870118 1901025 1934362 1968910 2005081 2044049 2085976 2130054
53329 2130054 2175725 2222992 2271994 2323102 2376943 2433435 2491204 2548946 2607117 2667239 2729663
53318 2729663 2792936 2855407 2916491 2976355 3035348 3094023 3152891 3211629 3269050 3324165 3376775
53307 3376775 3426862 3474103 3518397 3560100 3599039 3633801 3662801 3685951 3704699 3720519 3733773
53296 3733773 3743774 3749228 3748699 3741395 3727841 3709426 3687213 3661610 3633177 3602991 3571843 3539508
53284 3539508 3505182 3468207 3428097 3384447 3337499 3288570 3239347 3190830 3143293 3096843 3051389
53273 3051389 3006204 2960267 2913107 2864915 2816015 2766887 2718519 2671836 2626647 2582002 2537803
53262 2537803 2495168 2454738 2415525 2376238 2337184 2299958 2265602 2233825 2203829 2175081 2147291
53251B147291k6925k5805k4351k3009k1998k0837j9227j7945j7929j8540j7838
53240A912887j4843j0885q041o785n811m013j729J69J660L443N820Q465J0999
53227A891336J3167J4553J5010J5398J7040K0139K3425K5583K6378K6215K5606
53216B113850K5398K6326K7661K7420K4924K2076K0929K0926K0029J7808J5628
53205B362975J4151J2599J0587Q787P369N386K518O4p52o15j275l462o311q511
53191B403510r592j0343j2154j5502j9200k1666k2683k3164k3455k3287k3258
53180B199206k4602k6929k7917k6296k3810k2951k3898k5035k5584k5937k5889
53169A920358k4441k1704j9515j9486k1177k2773k3011k2082k0969k0483k0809
$$ plain form
53251 2147291 2120366 2094561 2070210 2047201 2025203 2004366 1985139 1967194 1949265 1930725 1912887
53240 1912887 1898044 1887159 1879118 1872333 1866522 1862509 1860780 1860949 1862609 1866052 1871872 1880337 1891336
53227 1891336 1904503 1919056 1934066 1949464 1966504 1986643 2010068 2035651 2062029 2088244 2113850
53216 2113850 2139248 2165574 2193235 2220655 2245579 2267655 2288584 2309510 2329539 2347347 2362975
53205 2362975 2377126 2389725 2400312 2409099 2416468 2421854 2424372 2424436 2423684 2423069 2421794 2418332 2412021 2403510
53191 2403510 2393918 2383575 2371421 2355919 2336719 2315053 2292370 2269206 2245751 2222464 2199206
53180 2199206 2174604 2147675 2119758 2093462 2069652 2046701 2022803 1997768 1972184 1946247 1920358
53169 1920358 1895917 1874213 1854698 1835212 1814035 1791262 1768251 1746169 1725200 1704717 1683908
53158A683908k1671k2651k3298k3071k1544j8838j5702j3104j1865j2418j4462
53147A485284j6805j8154j8302j8176j8649j9699k0824k1627k1803k1222k0316
53136A269707j9878k0059k0120j9526j8686j8192j7814j6995j5932j5501j6175
53125A070829j7443j8404j8643j8581j8992k0007k0723k0138j8432j6761j5798
53114H66907j5215j4667j4444j4667j4765j4315j3782j3830j4378j4947j5339
53103G06558j5360j4514j2795j1249j0779j0704r645p743o812q004j0186j1306
53091E77461j0717r478q640q165p646p293p491p744p074n656n021n960p065o461
53077D73050m479l239l737m806n225n306n635n645m596l163k717l329l682k967
$$ plain form
53158 1683908 1662237 1639586 1616288 1593217 1571673 1552835 1537133 1524029 1512164 1499746 1485284
53147 1485284 1468479 1450325 1432023 1413847 1395198 1375499 1354675 1333048 1311245 1290023 1269707
53136 1269707 1249829 1229770 1209650 1190124 1171438 1153246 1135432 1118437 1102505 1087004 1070829
53125 1070829 1053386 1034982 1016339 997758 978766 958759 938036 917898 899466 882705 866907
53114 866907 851692 837025 822581 807914 793149 778834 765052 751222 736844 721897 706558
53103 706558 691198 676684 663889 652640 641861 631157 621512 613769 606957 598953 588767 577461
53091 577461 566744 557266 548626 540461 532815 525522 518031 510287 503213 497557 492536 486576 479511 473050
53077 473050 468571 465332 461595 456789 451564 446258 440623 434978 430382 427219 424502 421173 417491 414524
53063D14524j999k118l405m281l067J4K572K386p2k136j953j81J524K478K818
53048D07104K469J358P3o16o33k82M81J678K582K197M09j933l910n103n606n892
53032C94376o381o781o347n064m002l903m163l870l153k723k711k874l377m410
53018C34617n388n600n342n459o000o266n892m925l223q91Q82O85j370l774n414
53003B76640o107n535l258k08J343L21j670k388j705j215j632j976j346l54r3
52988B50817l86m0J329K549K404J115l01j623l282m820m871l189j464j237j941
52973B35060k086j591j641k572l396l404k993k591j849l89J427K869L402K627
52959B22873M43k346m141l925k302q20m33q08q87M2J625K656K166M88j008j321
$$ plain form
53063 414524 412525 410407 407002 402721 399654 399668 402240 404626 404554 402418 400465 400284 401808 404286 407104
53048 407104 409573 410931 411004 410388 409755 409473 409954 411632 414214 416411 416820 414887 410977 405874 400268 394376
53032 394376 387995 381214 374867 369803 365801 361898 357735 353865 350712 347989 345278 342404 339027 334617
53018 334617 329229 323629 318287 312828 306828 300562 294670 289745 286522 285631 286513 287198 285828 282054 276640
53003 276640 270533 264998 261740 261532 262875 263196 261526 259138 257433 256218 254586 252610 251264 250910 250817
52988 250817 250431 250391 251720 254269 256673 257788 257487 255864 252582 247762 242891 239702 238238 237001 235060
52973 235060 232974 231383 229742 227170 223774 220370 217377 214786 212937 212548 213975 216844 220246 222873
52959 222873 223316 220970 216829 212904 210602 209782 209349 208541 207654 207696 209321 211977 214143 214631 213623 212302
52943B12302q09o04j188j751j124P09K375K654J909J396J319O13j081k385j976
52928B12359m89M61O44J183K345K793J612j32o33L92J561J712J154Q92J234J676
52912B28764J980K567L567M128L454K223J962K970L945L951L711M259N264N599
52898B78344M926L892L148K976L443M069L840K304M17m44o5O97J084Q76R7q65
52882C08739j333j186j176j613j673r70q34k450m434m310k140n46r96k056k041
52867B80981j366j230j495j284o04p1K78P03Q77L90k90m46m25j166k438k638q06
52850B68970J851L097K095K32n33L14J745K686K898K362Q39j329k718k153k35
52835B80121J412K147K509K610J740p2j340p56J234L129M024L953L227K260J607
$$ plain form
52943 212302 211493 210889 209701 207950 206826 207535 209910 212564 214473 215869 217188 217801 216720 214335 212359
52928 212359 211870 212331 212975 214158 216503 219296 220908 220776 220143 220535 222096 223808 224962 225854 227088 228764
52912 228764 230744 233311 236878 241006 244460 246683 248645 251615 255560 259511 263222 267481 272745 278344
52898 278344 283270 287162 290310 293286 296729 300798 304638 306942 307359 306915 306850 307547 308631 309507 309604 308739
52882 308739 307406 306220 305044 303431 301758 300788 299954 297504 293070 288760 286620 286074 285078 283022 280981
52867 280981 279615 278385 276890 275606 275002 274931 275209 275912 276789 277179 276889 276443 276018 274852 272414 269776 268970
52850 268970 270821 273918 276013 276245 275712 276026 277771 280457 283355 285717 286556 285227 282509 280356 280121
52835 280121 281533 283680 286189 288799 290539 290467 289127 288371 289605 292734 296758 300711 303938 306198 307805
52820C07805J383Q66n54k132k307o64J362K109J536Q72P88P80M22L03J034K039
52804C15642K216J525Q97O90L76q7J55J435K768L170K757K004R43p3Q5J847L889
52787C40239M685M426M230M312M257M312M864N153M148K365J245R33L40p74j446
52772C83289j246p98n05k87o55k237m046m073k198p67j406k825k856j452n34j575
52756C55829m175o587p151n761m070l699m372m703m498m786n645n825m859l831
52742B85867l399k815j658q68j003r99M6J077M46j774m015m933m100j925J72N23
52726B60642q81k128j931j356j995l551m517m288l279j799k48L24o49k035k315
52711B29994j658j330j529j350p28p38j733k587k330j539j476k413l382l385k438
$$ plain form
52820 307805 309188 310054 309500 307368 305061 304397 305759 307868 309404 310276 311064 311844 312266 312569 313603 315642
52804 315642 317858 319383 320280 320970 321346 321259 321414 322849 325617 328787 331544 333548 334491 334418 334503 336350 340239
52787 340239 344924 349350 353580 357892 362149 366461 371325 376478 380626 382991 384236 385169 385509 384735 383289
52772 383289 382043 381245 380740 380453 379798 377561 373515 369442 367244 366477 365071 362246 359390 357938 357404 355829
52756 355829 351654 345067 337916 332155 328085 324386 320014 315311 310813 306027 300382 294557 289698 285867
52742 285867 282468 279653 277995 277127 276124 275125 275171 276248 276694 274920 270905 265972 261872 259947 260119 260642
52726 260642 259761 257633 255702 254346 252351 248800 244283 239995 236716 234917 234669 234993 234344 232309 229994
52711 229994 228336 227006 225477 224127 223399 222661 220928 218341 216011 214472 212996 210583 207201 203816 201378
52696B01378j438j073j116j075j150j899l045l602l313k973l090l232l017k620
52682A68735j909l76J459J883K03k061l068k733j965j129l64k17p29r11m05n05
52666A55908j984l133j918P77K108J017r45k239k868l157k820j702k48J087J949
52651A41832J841P33l53m83j43l28q08o38L8L86O42J742L367M098L585K902K629
52634A61042K335K055K469L268L183K141J670K493L264K598R99l0K94J786L534
52619A93101L875J660j853l767l054j811k099l209l360k672k653l644m523m455
52605A61536l534k079p30p13k463m269l951j882p91k155m302m803l470j912j047
52590A23435l59O13J277R06k58j340j929k199k110j163P73K837L822L297J858
$$ plain form
52696 201378 199940 198867 197751 196676 195526 193627 190582 186980 183667 180694 177604 174372 171355 168735
52682 168735 166826 166450 167909 169792 169995 167934 164866 162133 160168 159039 158675 158458 157729 156818 156413 155908
52666 155908 153924 150791 148873 149650 151758 152775 151830 149591 146723 143566 140746 139044 138796 139883 141832
52651 141832 143673 144406 144053 143570 143427 143099 142291 141653 141691 142077 142719 144461 147828 151926 155511 158413 161042
52634 161042 163377 165432 167901 171169 174352 176493 178163 180656 183920 186518 187517 187487 187781 189567 193101
52619 193101 196976 198636 196783 193016 189962 188151 186052 182843 179483 176811 174158 170514 165991 161536
52605 161536 158002 155923 155193 154480 152017 147748 143797 141915 141124 138969 134667 129864 126394 124482 123435
52590 123435 123076 123689 124966 125872 125614 124274 122345 120146 118036 116873 117646 120483 124305 127602 129460
52575A29460M82j42L2L42q2j290k177j676j03J208J485J152R43R72Q42K52o21
52558A31079j062l57J187K096J315l13r60k14N25J74n45l91N11Q91J67p60o52
52541A32691N59J672J654R15P55J449J717O81l56N73L055M342K789nj380q70j74
52524A50067m15p76N8K027L854M618M567M299L709K399R71Q98K519M064L715J988
52508A88562P74M31l77j786j715J173N008O749N702L555J670J00j007r58P1P10
52492B08662K70j47O06J772J739N60J3J022K293K158Q76P8N17J401J958K403L012
52475B29193L198K321P75m64r75r39m49M01J074J148J234K313M076M931M021K405
52459B54263J656J924K099J515P31O01J067J178J91j436k301j446N76K298K928
$$ plain form
52575 129460 129942 129800 129832 130174 130092 128802 126625 124949 124846 126054 127539 128691 129634 130606 131448 131700 131079
52558 131079 130017 129660 130847 132943 134258 133945 132985 132771 133296 133470 132925 132534 133045 133936 134103 133343 132691
52541 132691 133250 134922 136576 137491 138246 139695 141412 142093 141737 142310 145365 149707 152496 152491 151111 150241 150067
52524 150067 149652 148876 148934 150961 154815 159433 164000 168299 172008 174407 175378 176276 178795 182859 186574 188562
52508 188562 189336 189767 189390 187604 185889 187062 192070 198819 204521 208076 209746 209846 208839 207881 207952 208662
52492 208662 208932 208785 209391 211163 212902 213462 213475 214497 216790 218948 219824 219902 220419 221820 223778 226181 229193
52475 229193 232391 234712 235487 235023 234048 233109 232660 233061 234135 235283 236517 238830 242906 247837 251858 254263
52459 254263 255919 257843 259942 261457 262188 262789 263856 265034 265225 263789 261488 260042 260618 262916 265844
52444B65844K927K914K567J147j092k753k834k034j898k795l454k744j104L35
52430B55026J359K256K337N45k295l537j877Q22J921J178L53N08J150J536J432
52415B62714Q13p5n12j81J62j15j73J060K802L175J959Q93J134J966K386K326
52399B80334J835N80j053j723q55M56J018J031J243J616J794K125L127M407M925
52384C00860M107K312M83l17L79J832K690K422J528L78j171k760l249k104k52
52369C07138R62R45k65k160l356k327N93L021L265K251J794K036J970J543J661
52354C19071K389K662J863O03j47pP96J676K125K300K872L874M331L638K595K178
52338C52819J931P53j206k571k465j182N83K069K264Q07r11q89Q29J896O62j558
$$ plain form
52444 265844 268771 271685 274252 275399 274307 271554 268720 266686 264788 261993 258539 255795 254691 255026
52430 255026 256385 258641 260978 261523 259228 255691 253814 254636 256557 257735 258088 258596 259746 261282 262714
52415 262714 263527 263452 262940 262759 262921 262806 262633 263693 266495 269670 271629 272522 273656 275622 278008 280334
52399 280334 282169 282749 281696 279973 279118 279574 280592 281623 282866 284482 286276 288401 291528 295935 300860
52384 300860 304967 307279 307762 307445 307824 309656 312346 314768 316296 316674 315503 312743 309494 307390 307138
52369 307138 308100 309045 308780 306620 303264 300937 301530 304551 307816 310067 311861 313897 315867 317410 319071
52354 319071 321460 324122 325985 326588 326441 326434 327230 328906 331031 333331 336203 340077 344408 348046 350641 352819
52338 352819 354750 355503 354297 351726 349261 348079 348662 350731 352995 353802 352891 352002 352831 354727 355389 353831
52322C53831k122l14J961K545J342L5n6N63M55p33j633q16J376L127L102J628
52306C64291R7l18N65K118L607M803N741O045N088L109J441J097J542J714J796
52291D02736L037N680Q033Q131N842K977J403J440K118K752L722N493P269P555
52277D68188O073M290L690M207M828M970M729M297L980M339N551O940P752Q097
52263E41931Q418Q451P632O305N629O176P437Q731R916J1073J2103J3012J4088
52250F60902J5515J6973J7883J7974J7609J7468J7797J8094J7784J7163J7111
52239H52273J7994J9400K1001K2703K3995K4289K4292K5600K8169K9658K8456
52228A117830K6096K5031K5181K4618K2935K1678K1598K1719K1459K1583K2528
$$ plain form
52322 353831 351709 351395 353356 355901 357243 357278 357222 357785 358240 357507 355874 355058 356434 359561 362663 364291
52306 364291 364388 364070 364635 366753 370360 375163 380904 386949 392037 395146 396587 397684 399226 400940 402736
52291 402736 405773 411453 419486 427617 433459 436436 437839 439279 441397 444149 447871 453364 460633 468188
52277 468188 474261 478551 482241 486448 491276 496246 500975 505272 509252 513591 519142 526082 533834 541931
52263 541931 550349 558800 566432 572737 578366 584542 591979 600710 610626 621699 633802 646814 660902
52250 660902 676417 693390 711273 729247 746856 764324 782121 800215 817999 835162 852273
52239 852273 870267 889667 910668 933371 957366 981655 1005947 1031547 1059716 1089374 1117830
52228 1117830 1143926 1168957 1194138 1218756 1241691 1263369 1284967 1306686 1328145 1349728 1372256
52217A372256K3413K3512K3108K2207J9983J6494J3399J1849J0887R159P061N768
52205A559096N283M946N027N950O618N488L275K489L904N364M911L514L387M833
52191A624085O296O908P383Q428R713J0782J1912J3455J5003J5876J6022J5913
52179A761776J5926J6281J7248J8778K0085K0258J9267J7919J6894J6296J6055
52168A956783J6086J5989J5219J3789J2277J1022R868Q782Q079P651O707M767
52156B087019K414O56J2M40J458J970Q18j741l959m839n581p597r857r958p663
52141B043592n473n218n760m990k889j269j132j651j650j031m94n28j029j459
52127B009019j192L5J674K621K134N39j077j769j343k81N70M98m99j678k512l529
$$ plain form
52217 1372256 1395669 1419181 1442289 1464496 1484479 1500973 1514372 1526221 1537108 1546267 1553328 1559096
52205 1559096 1564379 1569325 1574352 1580302 1586920 1592408 1595683 1598172 1602076 1607440 1612351 1615865 1619252 1624085
52191 1624085 1630381 1637289 1644672 1653100 1662813 1673595 1685507 1698962 1713965 1729841 1745863 1761776
52179 1761776 1777702 1793983 1811231 1830009 1850094 1870352 1889619 1907538 1924432 1940728 1956783
52168 1956783 1972869 1988858 2004077 2017866 2030143 2041165 2051033 2059815 2067894 2075545 2082252 2087019
52156 2087019 2089433 2090089 2090101 2090541 2091999 2093969 2094787 2093046 2089087 2084248 2078667 2071070 2061213 2051255 2043592
52141 2043592 2038119 2032901 2027141 2022151 2019262 2017993 2016861 2015210 2013560 2012529 2012035 2011507 2010478 2009019
52127 2009019 2007827 2007862 2009536 2012157 2014291 2014830 2013753 2011984 2010641 2010360 2010930 2011428 2010929 2009251 2006739 2003210
52111B003210n456p420p348m916k861l882o996q766p856o210n561n250m444m222
52097A922022n621p334p494o627o497o870o003m110l683n823q514r519r064q473
52083A826390p834o578n303n287o490p472p317o610o329o429n885l973j416j88
52069A749279j795n601r128j0328r302p703o899o990p188o736n526m154l307l032
52055A661590k813k344j859j532j031J7J440K860M390O467Q906J0748J1366J1593
52041A709798J3080J6476K0600K3744K5443K6575K7977K9607L0914L1353L0574
52030A986141K8897K7639K8103K9876L1140L0944L0118K9432K8116K5254K1618
52019B297278J8828J7416J6838J6618J6217J4539J1187P726N987N388L747O08
$$ plain form
52111 2003210 1997754 1990334 1982986 1978070 1975209 1971327 1964331 1955565 1947709 1941499 1935938 1930688 1926244 1922022
52097 1922022 1916401 1909067 1901573 1894946 1888449 1881579 1875576 1871466 1867783 1861960 1853446 1843927 1834863 1826390
52083 1826390 1818556 1811978 1806675 1801388 1794898 1787426 1780109 1773499 1767170 1760741 1754856 1750883 1749467 1749279
52069 1749279 1747484 1741883 1732755 1722427 1713125 1705422 1698523 1691533 1684345 1677609 1672083 1667929 1664622 1661590
52055 1661590 1658777 1656433 1654574 1653042 1652011 1652028 1653468 1656328 1660718 1667185 1676091 1686839 1698205 1709798
52041 1709798 1722878 1739354 1759954 1783698 1809141 1835716 1863693 1893300 1924214 1955567 1986141
52030 1986141 2015038 2042677 2070780 2100656 2131796 2162740 2192858 2222290 2250406 2275660 2297278
52019 2297278 2316106 2333522 2350360 2366978 2383195 2397734 2408921 2416647 2422634 2428022 2431769 2432377
52007B432377k209l474m058m964n793o047o250o650o351n022m282n739q351r343
51993B353844p476m174j521k48K23O95J505K405K901K851K636K576K505K214J993
51978B362929K196K463J990O68n27o58k14q24l153n541n691l781k701m561q030
51963B334565j0245j0435j0121j0404j0955j1575j2723j4094j4446j3632j3265
51952B202670j4443j6267j7533j8703k0897k3888k6385k7679k7994k7784k7589
51941A953508k8178k9899l2222l4511l6657l8474l9373l9367l9514m0430m1156
51930A553727m0603l9384l8889l9170l9063l8087l6935l6191l5797l5661l5694
51919A138253l5233l3591l1282k9729k9500k9793k9737k9226k8223k6302k3590
$$ plain form
52007 2432377 2430168 2426694 2422636 2417672 2411879 2405832 2399582 2392932 2386581 2381559 2377277 2371538 2363187 2353844
51993 2353844 2346368 2342194 2340673 2340425 2340648 2341343 2342848 2345253 2348154 2351005 2353641 2356217 2358722 2360936 2362929
51978 2362929 2365125 2367588 2369578 2370246 2369719 2369061 2368847 2368023 2364870 2359329 2353638 2349857 2347156 2342595 2334565
51963 2334565 2324320 2313885 2303764 2293360 2282405 2270830 2258107 2244013 2229567 2215935 2202670
51952 2202670 2188227 2171960 2154427 2135724 2114827 2090939 2064554 2036875 2008881 1981097 1953508
51941 1953508 1925330 1895431 1863209 1828698 1792041 1753567 1714194 1674827 1635313 1594883 1553727
51930 1553727 1513124 1473740 1434851 1395681 1356618 1318531 1281596 1245405 1209608 1173947 1138253
51919 1138253 1103020 1069429 1038147 1008418 978918 949125 919388 890162 861939 835637 812047
51908H12047k1349k0822k1629k1977k0486j7523j4658j3025j2446j2201j2197
51897F23734j2808j3724j3813j2531j0680r290q290p056n795n501o500p748p743
51884E02255n973l563k559m130p163r068q351n989m050l565m151m851m775l573
51870D30494k110j986l564n097m898l631l171l768l824k487q23k26q04j848k746
51855C89511l092k757k326k624l473l731k934j987j818k198k515k900l764m658
51841C48734m558l167j353j97j2k38j39M21Q11L16r95k311k970l049k987l013
51825C25293l123l246l217k839k216j857k147k771k870j930n01J79m79j617j902
51810B94757j229p56j102j394p29L02N64K70N90J578J873P29p36r33L50J955K652
$$ plain form
51908 812047 790698 769876 748247 726270 705784 688261 673603 660578 648132 635931 623734
51897 623734 610926 597202 583389 570858 560178 550888 542598 535542 529747 524246 517746 509998 502255
51884 502255 496282 492719 490160 486030 478867 469799 461448 455459 451409 447844 443693 438842 434067 430494
51870 430494 428384 426398 422834 417737 412839 409208 406037 402269 398445 395958 395135 394909 394105 392257 389511
51855 389511 386419 383662 381336 378712 375239 371508 368574 366587 364769 362571 360056 357156 353392 348734
51841 348734 344176 341009 339656 339459 339447 339209 339070 339491 340302 340618 339623 337312 334342 331293 328306 325293
51825 325293 322170 318924 315707 312868 310652 308795 306648 303877 301007 299077 298576 298755 298276 296659 294757
51810 294757 293528 292772 291670 290276 289547 289849 290413 290683 291273 292851 294724 295453 294717 293784 294134 296089 298741
51793B98741K110J098R43K248M047M809M277L443K705J428k66p40R40L146L568
51778C32497K272J277J438J427J86j299j452l29O93Q41N82N43N47K9j056j901
51762C36295j524J78K051K744K151J395J325J671J959K406L114L085J315j252
51748C56913k323j161K95p8j924l221l010k063j183j89J191K504L115K949K308
51733C54123J556J186J551K127J766K79r26m50J120J841Q73n16o53O06K039K634
51717C69156K351J538L93p67j208l62J438L185M096M082L465K698K210J975J328
51702C95578r8j343r58Q48K066J477K74K16J293K363L156M002M356L436K122K261
51686D21049L991N498N655N186M952M913N280O771Q912R890R171Q506R193R964
$$ plain form
51793 298741 300851 301949 302892 305140 309187 313996 318273 321716 324421 325849 325583 324843 325783 328929 332497
51778 332497 334769 336046 337484 338911 339097 337798 336346 336017 336710 337551 338133 338676 339223 339252 338196 336295
51762 336295 334771 334949 337000 339744 341895 343290 344615 346286 348245 350651 353765 356850 358165 356913
51748 356913 354590 353429 353724 353646 351722 348501 345491 343428 342245 342056 343247 345751 348866 351815 354123
51733 354123 355679 356865 358416 360543 362309 362588 361662 361212 362332 364173 365046 364530 363877 364483 366522 369156
51717 369156 371507 373045 373438 372671 371463 371101 372539 375724 379820 383902 387367 390065 392275 394250 395578
51702 395578 395480 394137 393179 394027 396093 397570 397844 398060 399353 401716 404872 408874 413230 416666 418788 421049
51686 421049 425040 430538 436193 441379 446331 451244 456524 463295 472207 482097 491268 499774 508967 518931
51672E18931R072O911M881L076J005m45N3J976L445L658L190K420J451J172K442
51657E63238M247M537K971J163J77n25j392j824j412o17K32J250J885R84j285
51642E73629l069l139k385k086j901p97R36J867J343J37p55j144j346j411r01
51627E58978N59K530L821L673K739K419L095L634K709K62k364l552k809j387j195
51612E73112k589l723k786m68P53m30k859m474m218k436l04R96J372J978L577
51597E57501N066M766K879J377J358J819J247q20l964p340r634r886q780q027
51583E27562q153q135p408o827o982p148o604n745n077m460m130n030o938p723
51569D37202n973l231k109k906l831l886l720l822l672l067k848l638m695m756
$$ plain form
51672 518931 528003 534914 539795 542871 543876 543431 543484 545460 548905 552563 555753 558173 559624 560796 563238
51657 563238 567485 572022 574993 576156 576333 575808 574416 572592 571180 570563 570795 572045 573930 574914 573629
51642 573629 570560 567421 565036 562950 561049 560252 561188 563055 564398 564535 563780 562636 561290 559879 558978
51627 558978 559537 562067 565888 569561 572300 574719 577814 581448 584157 584419 582055 578503 575694 574307 573112
51612 573112 570523 566800 564014 563546 564299 563869 561010 556536 552318 549882 549578 550574 551946 553924 557501
51597 557501 562567 567333 570212 571589 572947 574766 576013 575193 571229 563889 554255 544369 535589 527562
51583 527562 519409 511274 503866 497039 490057 482909 476305 470560 465483 461023 456893 451863 444925 437202
51569 437202 431229 427998 425889 422983 419152 415266 411546 407724 404052 400985 398137 394499 389804 385048
51555C85048l544k011j254j508k197k700k842k548j573r2R21Q44N99J504L052
51540C71699L306J731l6q06j470k900l861k665R1K198K634K184J703J306J083
51525C76197J314J885K496L227M122M605M226L613L574L849L795L886N021O686
51511D28496P325O438M983L644K179O15l95p58j214j985k322j935j719k377l287
51496D37688l422k739k015j824k082k141j048J549M477N784M840L087K278K595
51482D47027L072L110K956K991L205L354L268L100L276L933M575M710M702N178
51468D98457N695M913K582K92l72K53N72k17j473k264k234j474j73J344K498K586
51452E10985J196j233l342l908l145k466k694l098k610j431p17j107k185l241
$$ plain form
51555 385048 381504 379493 378239 376731 374534 371834 368992 366444 364871 364779 365700 366544 367143 368647 371699
51540 371699 375005 376736 376700 375894 374424 371524 367663 364998 365089 367287 369921 372105 373808 375114 376197
51525 376197 377511 379396 381892 385119 389241 393846 398072 401685 405259 409108 412903 416789 421810 428496
51511 428496 435821 442259 447242 450886 453065 453680 453285 452527 451313 449328 447006 445071 443352 440975 437688
51496 437688 434266 431527 429512 427688 425606 423465 422417 423966 428443 434227 439067 442154 444432 447027
51482 447027 450099 453209 456165 459156 462361 465715 468983 472083 475359 479292 483867 488577 493279 498457
51468 498457 504152 509065 511647 511939 511567 511820 512392 512175 510702 508438 506204 504730 504557 505901 508399 510985
51452 510985 512181 510948 507606 503698 500553 498087 495393 492295 489685 488254 487537 486430 484245 481004
51438D81004l948m264m186l705k770j456k86k6p12j299r16j96n05j889k751j857
51422D50238O8J376J585J724K688L951M183K886J094L27J041K332L169L555M065
51407D84282M681M812M570N085O994R117R557P977O053N526O378P309P423O992
51393E76756O663O559O309N747N172M867M622M063L360L135L439L422K431J111
51379F37656O49J156J551J056Mr69j638j883j480o36N1M88J072J409K72k265m075
51362F32418l692k692l522n774o878o255o210q117j0157j0172q744p719p136n759
51348E39591l793k893l549m439m654m957o081o995n969k869M40J816O44j883l852
51333D90557m126l098k133k097k462j961j10K055K904J845j91j804k348k104j840
$$ plain form
51438 481004 477056 472792 468606 464901 462131 460675 460389 460363 459651 458352 457436 457240 456735 454846 452095 450238
51422 450238 450306 451682 453267 454991 457679 461630 465813 468699 469793 470120 471161 473493 476662 480217 484282
51407 484282 488963 493775 498345 503430 510424 519541 529098 537075 543128 548654 555032 562341 569764 576756
51393 576756 583419 589978 596287 602034 607206 612073 616695 620758 624118 627253 630692 634114 636545 637656
51379 637656 638305 639461 641012 642068 642072 641103 639465 637582 636102 635466 635517 636005 637077 638486 638758 636493 632418
51362 632418 628726 626034 622512 616738 609860 603605 597395 589278 579121 568949 560205 552486 545350 539591
51348 539591 535798 532905 529356 524917 520263 515306 509225 502230 496261 493392 493832 495648 496292 494409 490557
51333 490557 486431 483333 481200 479103 476641 474680 474570 476625 479529 481374 481183 479379 477031 474927 473087
51318D73087k529m805p979j0078r769p970o621o218n935n844p204r962j1722j0466
51304C65985p254m989n252p305r381r888p990m507j826j778l676n366n723n137
51290B85913l989k292p20m46j540k671k785k182j553r80l94j20l31n96o20r04
51274B63790j987l362l823k849j218j10P5n1L12J205J907J864J325R84J192J701
51258B60955K033J866J396J310K114L368M107M178M414N096N225M086K665K393
51244C05206L062L298K755K353K451K284J551J058J049J58k763o422p938o013
51230C02089k548q13k196m964o203m981l191l181m982o469n973l927k003j360
51216B49298j979l066l779l839l658l658l628l119k316j867j932k006j732j341
$$ plain form
51318 473087 470558 465753 457774 447696 437927 429957 423336 417118 411183 405339 398135 388173 376451 365985
51304 365985 358731 353742 348490 341185 331804 321916 313926 309419 307593 305815 302139 296773 291050 285913
51290 285913 281924 279632 278912 278466 276926 274255 271470 269288 267735 266755 266361 266241 265910 265314 264694 263790
51274 263790 261803 258441 254618 251769 250551 250441 250516 250465 250777 251982 253889 255753 257078 258062 259254 260955
51258 260955 262988 264854 266250 267560 269674 273042 277149 281327 285741 290837 296062 300148 302813 305206
51244 305206 308268 311566 314321 316674 319125 321409 322960 324018 325067 325225 322462 316040 308102 302089
51230 302089 299541 298728 296532 291568 285365 280384 277193 274012 269030 262561 256588 252661 250658 249298
51216 249298 247319 244253 240474 236635 232977 229319 225691 222572 220256 218389 216457 214451 212719 211378
51202B11378j171j223j234q20K71J499J537j41j951j653P58K798K572R55M2L28
51186B13945M39p06k418k993j585Q17K271J907P86M11Q06R08M78L75Q47J032O20
51169B17940O15J640K703K724K194K057J794K82j916k903k166j357j879l023l292
51154B15413k480j485p07J99J309K202K808L561M392M353K831O65o79q31p07j011
51138B29833j371j196o45k31n7J3j58o93j297j668j929k025j277M83J826J071
51122B20679j280k775k007k34M74l43j615k300k077j066K39J080J063M75l41j466
51106B08506k818l649l199j590M20K134K971K388N85j102j362m84pq09k131k705
51090A97148k231j398q21m17P0M53L47k5J24R34J281J14j878k749j580N95K248
$$ plain form
51202 211378 210207 208984 207750 206930 207201 208700 210237 210096 208145 206492 207250 210048 212620 213575 213617 213945
51186 213945 214384 213678 211260 208267 206682 207499 209770 211677 212463 212874 213680 214588 215066 215441 216288 217320 217940
51169 217940 218555 220195 222898 225622 227816 229873 231667 231949 230033 227130 224964 223607 221728 218705 215413
51154 215413 212933 211448 210741 210940 212249 214451 217259 220820 225212 229565 232396 233061 232382 231551 230844 229833
51138 229833 228462 227266 226621 226390 226333 226346 226188 225495 224198 222530 220601 218576 217299 217782 219608 220679
51122 220679 219399 216624 214617 214383 214857 214514 212899 210599 208522 207456 207695 208775 209838 210313 209972 208506
51106 208506 205688 202039 198840 197250 197670 199804 202775 205163 205748 204646 203284 202800 202793 201984 199853 197148
51090 197148 194917 193519 192698 192281 192351 192804 193151 193126 193250 194184 195465 195579 193701 190952 189372 189967 192215
51073A92215K891K802K212J381Q07O22L60j10n8Q66J643J179K16N17K214L321
51057B13078K366M10l57P08K309L069K871K285J556O20k68o20l45O7K09J63P9
51040B28200k48r22j362q27M87J581J971K224K945L776L917L137J822L37j024
51025B46014j760j492o65k74o78j085n31R50K427L192L275K991K421J752J503
51010B58040J840J915Q54o85j030Q2Q23j39j565j411J40J150R34O88J012Q79k20
50993B63307r54j80J099J226L82L5N83J092J151J368J955K129J454P30R66K089
50977B78432L222L810L947L827L317K218P44l81m42N69J922K905L449L791L788
50962C15118L056J783R52J327K472L124K635J612J009R98J291K068L581M877M305
$$ plain form
51073 192215 195106 197908 200120 201501 202308 202930 203290 203180 203122 203988 205631 206810 207026 207543 209757 213078
51057 213078 215444 215854 215497 216205 218514 221583 224454 226739 228295 228915 228647 228027 227682 227749 227958 228121 228200
51040 228200 227952 227030 225668 224841 225328 226909 228880 231104 234049 237825 241742 244879 246701 247038 246014
51025 246014 244254 242762 242097 241823 241145 240060 239529 240479 242906 246098 249373 252364 254785 256537 258040
51010 258040 259880 261795 262649 261964 260934 261016 261839 261700 260135 258724 258864 260014 260948 261636 262648 263527 263307
50993 263307 262353 262173 263272 264498 264880 264915 265498 266590 267741 269109 271064 273193 274647 275377 276343 278432
50977 278432 281654 285464 289411 293238 296555 298773 299517 299136 298694 299263 301185 304090 307539 311330 315118
50962 315118 318174 319957 320909 322236 324708 327832 330467 332079 333088 334086 335377 337445 341026 345903 350208
50947C50208K018O25K206N437P359P312P397R025J1024J1756J1446J1423J2158
50934D49394J3118J3773J3903J3551J3268J3894J5522J7358J8922K0533K2224
50923F25460K3235K3279K3300K4163K5714K7860L1317L5989L9824M1118M1374
50912I62633M3903M9599N5886O0121O2550O5182O8944P2998P6353P9092Q1784
50901A679045Q4232Q5399Q4788Q3388Q2571Q2226Q0885P7749P3530O8955O3630
50890B546398N7218N0596M4862L9982L5537L2050L0262K9585K8642K7048K5494
50879B947674K4271K2862K0914J8422J4990R949L274m523j3389k3528l4256m4183
50867B942477n2847o1249p0399p9966q8642r5223r9278j01261j02106j02164j00600
$$ plain form
50947 350208 352226 352851 355057 360494 367853 375165 382562 391587 402611 414367 425813 437236 449394
50934 449394 462512 476285 490188 503739 517007 530901 546423 563781 582703 603236 625460
50923 625460 648695 671974 695274 719437 745151 773011 804328 840317 880141 921259 962633
50912 962633 1006536 1056135 1112021 1172142 1234692 1299874 1368818 1441816 1518169 1597261 1679045
50901 1679045 1763277 1848676 1933464 2016852 2099423 2181649 2262534 2340283 2413813 2482768 2546398
50890 2546398 2603616 2654212 2699074 2739056 2774593 2806643 2836905 2866490 2895132 2922180 2947674
50879 2947674 2971945 2994807 3015721 3034143 3049133 3059082 3062356 3057833 3044444 3020916 2986660 2942477
50867 2942477 2889630 2828381 2757982 2678016 2589374 2494151 2394873 2293612 2191506 2089342 1988742
50856A988742r6482r0422q4381p9747p6133p2216o7196o1349n5527n0268m5276
50845A209745m0015l4841l0895k8493k6424k3601k0581j8402j6619j3807r809
50834I46258n975l289j407K45J634K631L436M204M900N593O281O609O615P413
50820I85148J0042J3707J6359J7208J7539J8776K0815K2717K4170K5680K7824
50809A199985L0620L3423L5413L6583L8080M1017M5344N0357N5703O1177O6344
50798A694046P1494P8097Q6821R5880J03167J09471J17286J26733J35323J42157
50788B760475J49596J59464J69924J77843J82595J85724J88031J88746J86884
50779D349282J81874J73359J61661J48071J33781J18931J03534Q8729P6095O6205
$$ plain form
50856 1988742 1892260 1801838 1717457 1637710 1561577 1489361 1422165 1360816 1305289 1255021 1209745
50845 1209745 1169730 1134889 1103994 1075501 1049077 1025476 1004895 986493 969874 956067 946258
50834 946258 940283 936994 935587 935832 937466 940097 943533 947737 952637 958230 964511 971120 977735 985148
50820 985148 995190 1008897 1025256 1042464 1060003 1078779 1099594 1122311 1146481 1172161 1199985
50809 1199985 1230605 1264028 1299441 1336024 1374104 1415121 1460465 1510822 1566525 1627702 1694046
50798 1694046 1765540 1843637 1930458 2026338 2129505 2238976 2356262 2482995 2618318 2760475
50788 2760475 2910071 3069535 3239459 3417302 3599897 3785621 3973652 4162398 4349282
50779 4349282 4531156 4704515 4866176 5014247 5148028 5266959 5370493 5459222 5535317 5601522
50769E601522N8678N3206M9802M8451M9260N2464N7478O2419O5303O5338O2364
50758F226285N5468M3166K4858J625k4519n1833p9502j07314j34667j60269j83166
50747E610132k03533k21392k35042k42397k43937k42462k39455k33489k23171
50738C525254k09763j95458j80645j64747j48608j34021j21382j09581r8024q7262
50728B075763p7764o9440o2298n6382n1002m5177l8892l3063k8264k4291k0997
50717A568193j8648j7390j6982j7050j7192j7065j6718j6459j6053j4682j2316
50706A387638j0282r661r806r421q362p290o238m833l400k424j231J347N110Q679
50692A329826J1546J4479J7783K0535K2066K3132K5055K8460L3053L8047M2563
$$ plain form
50769 5601522 5660200 5713406 5763208 5811659 5860919 5913383 5970861 6033280 6098583 6163921 6226285
50758 6226285 6281753 6324919 6349777 6351402 6326883 6275050 6195548 6088234 5953567 5793298 5610132
50747 5610132 5406599 5185207 4950165 4707768 4463831 4221369 3981914 3748425 3525254
50738 3525254 3315491 3120033 2939388 2774641 2626033 2492012 2370630 2261049 2163025 2075763
50728 2075763 1997999 1928559 1866261 1809879 1758877 1713700 1674808 1641745 1613481 1589190 1568193
50717 1568193 1549545 1532155 1515173 1498123 1480931 1463866 1447148 1430689 1414636 1399954 1387638
50706 1387638 1377356 1367695 1357889 1348468 1340106 1332816 1326578 1321745 1318345 1315921 1314690 1316037 1321147 1329826
50692 1329826 1341372 1355851 1373634 1394169 1416235 1439367 1464422 1492882 1525935 1563982 1606545
50681A606545M6270M9796N3948N8659O3341O8025P3364P9624Q6603R4177J01884
50670B382236J08157J11354J11708J11023J10262J08652J05338J00594R4829Q7583
50660C431736P8319O7340N5272M2480K9617J7982Q643J702l010n172m501j545
50648C718863K614P074J1244J4810J7931K0767K2410K0938J5177N817n825j9517
50636C832303l5806n4324p3341r0987j06287j19041j29201j36500j40397j40400
50626B806019j36701j30388j22824j14789j06400r7697q9015q0775p3056o5523
50616A788851n7921n0602m4225l8710l2850k5562j7360j0015m785j454R42L124
50604A509433N321P296Q552R084R820J1640J3976J5452J5973J6979J9252K1748
$$ plain form
50681 1606545 1652815 1702611 1756559 1815218 1878559 1946584 2019948 2099572 2186175 2280352 2382236
50670 2382236 2490393 2601747 2713455 2824478 2934740 3043392 3148730 3249324 3344153 3431736
50660 3431736 3510055 3577395 3632667 3675147 3704764 3722746 3731389 3733091 3730081 3724909 3720408 3718863
50648 3718863 3721477 3728551 3739795 3754605 3772536 3793303 3815713 3836651 3851828 3857645 3851820 3832303
50636 3832303 3796497 3742173 3668832 3577845 3471558 3352517 3223316 3086816 2946419 2806019
50626 2806019 2669318 2538930 2416106 2301317 2194917 2097220 2008205 1927430 1854374 1788851
50616 1788851 1730930 1680328 1636103 1597393 1564543 1538981 1521621 1511606 1506821 1505367 1506309 1509433
50604 1509433 1514754 1522050 1530602 1539686 1549506 1561146 1575122 1590574 1606547 1623526 1642778 1664526
50592A664526K3264K4178K5505K7312K9212L1581L4857L8172M0270M1484M3393
50581B023754M6503M9701N2193N4556N7347N9941O1482O1946O1536N9870N6738
50570B645567N2865M8911M4232L7814L0065K2600J6251J0341M084k245p894j2496
50558B890095j5788j7181j6307j3751j0635p657m996k882j678j283j035m47J29
50545B796584j80j855m529p550j0931j5444k1598k8829l6165m3509n1403n9427
50533B515164o5849o9526p1383p3032p4473p4399p2556p0317o8565o6346o2462
50522A746256n7402n2687m8757m4742m0173l5870l2746l0369k7322k2799j7430
50511A335959j2463q451m965j480J893M809P346R855J2381J4800J7284K0099K2970
$$ plain form
50592 1664526 1687790 1711968 1737473 1764785 1793997 1825578 1860435 1898607 1938877 1980361 2023754
50581 2023754 2070257 2119958 2172151 2226707 2284054 2343995 2405477 2467423 2528959 2588829 2645567
50570 2645567 2698432 2747343 2791575 2829389 2859454 2882054 2898305 2908646 2912730 2910485 2902591 2890095
50558 2890095 2874307 2857126 2840819 2827068 2816433 2808776 2803780 2800898 2799220 2797937 2796902 2796455 2796584
50545 2796584 2796404 2794549 2790020 2782470 2771539 2756095 2734497 2705668 2669503 2625994 2574591 2515164
50533 2515164 2449315 2379789 2308406 2235374 2160901 2086502 2013946 1943629 1875064 1808718 1746256
50522 1746256 1688854 1636167 1587410 1542668 1502495 1466625 1433879 1403510 1376188 1353389 1335959
50511 1335959 1323496 1315045 1310080 1308600 1310493 1315302 1322648 1332503 1344884 1359684 1376968 1397067 1420037
50498A420037K5254K6754K7738K8277K8432K9093L1552L5704L9701M2029M3156
50487A777727M4404M5938M6878M6968M6960M7449M8183M8666M8889M9353N0770
50476B302185N3646N7771O2285O6645P1219P6521Q2117Q7094R1430R6165J02066
50465C149144J08670J14797J19657J23221J25823J27411J27187J24149J18051
50456D238110J09610R9539Q7928P4736O0359M5095K8463R832j0345l0472m8961
50445D663894o5083p8877r0619j00307j07355j11022j11164j08152j01891r1872
50435C697552p8733o4782n1949l9843k7000j3583j518P736J4164J7864J8192J4856
50423C492956Q697N64r933k3731m0510n8104p3880q6608r6898j05670j12375j15425
$$ plain form
50498 1420037 1445291 1472045 1499783 1528060 1556492 1585585 1617137 1652841 1692542 1734571 1777727
50487 1777727 1822131 1868069 1914947 1961915 2008875 2056324 2104507 2153173 2202062 2251415 2302185
50476 2302185 2355831 2413602 2475887 2542532 2613751 2690272 2772389 2859483 2950913 3047078 3149144
50465 3149144 3257814 3372611 3492268 3615489 3741312 3868723 3995910 4120059 4238110
50456 4238110 4347720 4447259 4535187 4609923 4670282 4715377 4743840 4753672 4743327 4712855 4663894
50445 4663894 4598811 4519934 4429315 4329008 4221653 4110631 3999467 3891315 3789424 3697552
50435 3697552 3618819 3554037 3502088 3462245 3435245 3421662 3420144 3427880 3442044 3459908 3478100 3492956
50423 3492956 3501653 3502217 3492284 3468553 3428043 3369939 3296059 3209451 3112553 3006883 2894508 2779083
50411B779083j14524j11686j09132j06941j03664r8565r2086q4658p6536o8686
50401A812605o2287n7125n1743m5399l8790l2622k6723k1017j6129j2463r469
50390A438838o382k883J194N794R991J2543J3658J5086J7794K0727K2623K4016
50378A572999K6237K9271L1888L3466L4500L5502L6370L6867L6811L5869L3869
50367A943649L1409K9587K8998K9346K9978L0396L0293K9543K8338K7117K6307
50356B264961K6137K6667K7956L0169L3317L6851L9835M1916M3741M5944M8075
50345B665569M9235M9343M8868M7543M4599M0208L5336K9967K2775J3204K614
50334C049261p369j6753k6692l7937n0308o2731p3152p9571q2173q3506q5450
$$ plain form
50411 2779083 2664559 2552873 2443741 2336800 2233136 2134571 2042485 1957827 1881291 1812605
50401 1812605 1750318 1693193 1641450 1596051 1557261 1524639 1497916 1476899 1460770 1448307 1438838
50390 1438838 1432456 1429573 1430767 1436561 1446552 1459095 1472753 1487839 1505633 1526360 1548983 1572999
50378 1572999 1599236 1628507 1660395 1693861 1728361 1763863 1800233 1837100 1873911 1909780 1943649
50367 1943649 1975058 2004645 2033643 2062989 2092967 2123363 2153656 2183199 2211537 2238654 2264961
50356 2264961 2291098 2317765 2345721 2375890 2409207 2446058 2485893 2527809 2571550 2617494 2665569
50345 2665569 2714804 2764147 2813015 2860558 2905157 2945365 2980701 3010668 3033443 3046647 3049261
50334 3049261 3041892 3025139 2998447 2960510 2910202 2847471 2774319 2694748 2612575 2529069 2443619
50323B443619q6864q5275q0076p2755o4683n6217m7684l9676l2213k4767j7260
50312A836149j0192l835J838O430R276J0237R564P007K053m961j2794k0437k7438
50299A802897l3194l7049l9292m1094m2999m4313m4354m3448m2246m0683l8359
50288A355866l5433l2580l0274k8575k7332k6152k4382k1654j8418j5557j3284
50277A082225j0732p056k842O8N56k43p4J904M490O432Q020J0089J2367J3955
50263A119159J4847J5890J7284J8266J8300J7827J7651J8263J9735K1657K3192
50252A322071K3922K4456K5424K6158K5494K3667K2002K0549J7819J3572J0260
50241A555394J0160J2152J2910J0913P685N235L839K653J254j51j308k055k365
$$ plain form
50323 2443619 2356755 2271480 2191404 2118649 2053966 1997749 1950065 1910389 1878176 1853409 1836149
50312 1836149 1825957 1822122 1823960 1830390 1839666 1849903 1859467 1866474 1868527 1863566 1850772 1830335 1802897
50299 1802897 1769703 1732654 1693362 1652268 1609269 1564956 1520602 1477154 1434908 1394225 1355866
50288 1355866 1320433 1287853 1257579 1229004 1201672 1175520 1151138 1129484 1111066 1095509 1082225
50277 1082225 1071493 1064437 1061595 1061663 1062219 1061976 1061902 1063806 1068296 1074728 1082748 1092837 1105204 1119159
50263 1119159 1134006 1149896 1167180 1185446 1203746 1221573 1239224 1257487 1277222 1298879 1322071
50252 1322071 1345993 1370449 1395873 1422031 1447525 1471192 1493194 1513743 1531562 1545134 1555394
50241 1555394 1565554 1577706 1590616 1601529 1609214 1614449 1618288 1620941 1622195 1622044 1620736 1618681 1616316
50228A616316k591l343m859o858r116j1598j3866j5123j5345j5645j6793j7954
50216A483225j7862j6871j6637j7664j8392j7346j5218j3963j4266j4858j4183
50205A305965j1950q888n784l090j063K35J066J948L321N171O956P961P980P520
50191A317348P312P759Q832J0164J0954J0333Q269N950M639M270L700K146q2k223
50177A399371l757m408m152l513l329m012n276o756q413j0153j1407j1387r784
50164A313024p180m845l828l975m051l120j481J47J770L688N453O310O411O512
50150A314835O595O059N128M694M588L571J534J11L50J105P48p02k284l930o207
50135A336195q903j1098j2393j3157j3846j4725j5795j6439j5832j4366j3714
$$ plain form
50228 1616316 1613725 1610382 1605523 1598665 1589549 1577951 1564085 1548962 1533617 1517972 1501179 1483225
50216 1483225 1465363 1448492 1431855 1414191 1395799 1378453 1363235 1349272 1335006 1320148 1305965
50205 1305965 1294015 1285127 1279343 1276253 1275190 1275425 1276491 1278439 1281760 1286931 1293887 1301848 1309828 1317348
50191 1317348 1324660 1332419 1341251 1351415 1362369 1372702 1380971 1386921 1391560 1395830 1399530 1401676 1401594 1399371
50177 1399371 1395614 1391206 1387054 1383541 1380212 1376200 1370924 1364168 1355755 1345602 1334195 1322808 1313024
50164 1313024 1305844 1300999 1297171 1293196 1289145 1286025 1284544 1284691 1286461 1290149 1295602 1301912 1308323 1314835
50150 1314835 1321430 1327489 1332617 1337311 1341899 1345470 1347004 1347115 1347465 1348570 1349318 1348616 1346332 1342402 1336195
50135 1336195 1327292 1316194 1303801 1290644 1276798 1262073 1246278 1229839 1214007 1199641 1185927
50124A185927j4631j5599j4830j2842j1649j1945j2528j2213j1042r731q968r065
50112A040884r375q389n571k573j534k522l920m827n561o327p071q521j1436j4666
50098I48591j5822j4382j2464j1905j2219j2139j1633j1359j1356j1354j1404
50087H12554j1276j0159p933n912n263n441n163m336l962m561n695o689o940n814
50073G23410l193j78J588J363k03j814k370j403O71K779M191N161O292P469Q061
50058G51824Q036Q172Q964R732R389P901O649P036Q934J0817J1429J0994J0566
50045H70443J0687J1026J1022J0429R476Q874R305J0442J0909R811P910O602O277
50032I93213O604P803J0234J3057J4819J5477J6319J7636J8067J6691J4377J2396
$$ plain form
50124 1185927 1171296 1155697 1140867 1128025 1116376 1104431 1091903 1079690 1068648 1058917 1049949 1040884
50112 1040884 1031509 1023120 1017549 1014976 1013442 1010920 1007000 1002173 996612 990285 983214 974693 963257 948591
50098 948591 932769 918387 905923 894018 881799 869660 858027 846668 835312 823958 812554
50087 812554 801278 791119 783186 777274 772011 766570 761407 757071 753109 748548 742853 736164 729224 723410
50073 723410 720217 720039 721627 722990 722787 720973 718603 717200 717871 720650 724841 730002 736294 743763 751824
50058 751824 759860 768032 776996 786728 796117 804018 810667 817703 826637 837454 848883 859877 870443
50045 870443 881130 892156 903178 913607 923083 931957 941262 951704 962613 972424 980334 986936 993213
50032 993213 999817 1007620 1017854 1030911 1045730 1061207 1077526 1095162 1113229 1129920 1144297 1156693
50020A156693J1134J0878J2308J5070J7208J7410J6835J7368J8953K0100K0372
50009A334329K0604K0977K0630J9411J8535J8961K0165K1013K1190K1232K1630
49998A558677K2177K2173K1186J9772J9120J9696K0611K0730J9987J9010J8000
49987A781139J6721J5245J3741J1703Q339L856m51l557n550p051q468r966j1538
49974A804163j2787j3152j2699j2283j2680j3723j4487j4224j3066j1894j1409
49963A661759j1225j0176p738m826k744j710q90L08J776L458N753Q808J1926J4114
49949A668593J5079J5417J5911J6657J6979J6340J5362J5500J7329J9482J9888
49938A852537J8026J5491J4142J4065J3551J1034O827K781R9k092n464r943j3476
$$ plain form
50020 1156693 1167827 1178705 1191013 1206083 1223291 1240701 1257536 1274904 1293857 1313957 1334329
50009 1334329 1354933 1375910 1396540 1415951 1434486 1453447 1473612 1494625 1515815 1537047 1558677
49998 1558677 1580854 1603027 1624213 1643985 1663105 1682801 1703412 1724142 1744129 1763139 1781139
49987 1781139 1797860 1813105 1826846 1838549 1846888 1850744 1850293 1846736 1841186 1834135 1825667 1815701 1804163
49974 1804163 1791376 1778224 1765525 1753242 1740562 1726839 1712352 1698128 1685062 1673168 1661759
49963 1661759 1650534 1640358 1632620 1627794 1625050 1623340 1622450 1622758 1624534 1627992 1633745 1642553 1654479 1668593
49949 1668593 1683672 1699089 1715000 1731657 1748636 1764976 1780338 1795838 1813167 1832649 1852537
49938 1852537 1870563 1886054 1900196 1914261 1927812 1938846 1945673 1948454 1948553 1946461 1940997 1931054 1917578
49925A917578j4591j4198j4118j4676j4915j4609j4862j6704k0168k4762k9844
49914A724131l4439l7661l9699m1628m3868m5542m5685m4434m2540m0216l7170
49903A271249l3644l0789k9634k9762k9366k7067k3673k1487k1602k2496k2007
49892I79722j9951j7914j6918j6569j6310j6162j6033j5446j4355j3298j2360
49881H04406j0971r042p369o408n683m825m213l955l395k371j891k567l357l041
49867G35318k053j558j355l37J393K520K559K419K715K977K852K787K961K776
49853G55974K079J837K769M108M627M311M171M810N917O860P187O787O223O631
49839H24291Q604J1329J3343J4211J4844J6110J7678J8507J8313J8279K0119K4315
$$ plain form
49925 1917578 1902987 1888789 1874671 1859995 1845080 1830471 1815609 1798905 1778737 1753975 1724131
49914 1724131 1689692 1652031 1612332 1570704 1526836 1481294 1435609 1391175 1348635 1308419 1271249
49903 1271249 1237605 1206816 1177182 1147420 1118054 1090987 1067314 1045827 1024225 1001729 979722
49892 979722 959771 941857 924939 908370 892060 875898 859865 844419 830064 816766 804406
49881 804406 793435 784393 777024 770616 764933 760108 755895 751940 748545 746174 744283 741716 738359 735318
49867 735318 733265 731707 730352 730015 731408 733928 736487 738906 741621 744598 747450 750237 753198 755974
49853 755974 758053 759890 762659 766767 771394 775705 779876 784686 790603 797463 804650 811437 817660 824291
49839 824291 832895 844224 857567 871778 886622 902732 920410 938917 957230 975509 995628 1019943
$$ [...]
##END NTUPLES=NMR SPECTRUM
##END=
