
##TITLE=AC1213_BRAAS12064_6528106_XEsjp4Wcx4
##JCAMPDX= 6.0         $$ Bruker NMR JCAMP-DX V2.0
##DATA TYPE= NMR SPECTRUM
##DATA CLASS= NTUPLES
##ORIGIN= BRUKER
##OWNER= Administrator
$$ 1.72 TOPSPIN		Version 2.1
$$ 2012-07-15 11:09:57.593 -0500  Administrator@TOPSPIN
$$ Compression mode = diff/dup
##.OBSERVE FREQUENCY= 400.02188249412
##.OBSERVE NUCLEUS= ^1H
##.ACQUISITION MODE= SIMULTANEOUS (DQD)
##.ACQUISITION SCHEME= undefined
##.AVERAGES= 8
##.DIGITISER RES= 22
##SPECTROMETER/DATA SYSTEM= spect
##.PULSE SEQUENCE= zg30
##.SOLVENT NAME= COFFEE_meoh
##.SHIFT REFERENCE= INTERNAL, COFFEE_meoh, 1, 14.98509
##AUDIT TRAIL= $$ (NUMBER, WHEN, WHO, WHERE, PROCESS, VERSION, WHAT)
$$ ##TITLE= Audit trail, TOPSPIN		Version 2.1
$$ ##JCAMPDX= 5.01
$$ ##ORIGIN= Bruker BioSpin GmbH
$$ ##OWNER= Administrator
$$ $$ C:\Bruker\TOPSPIN/data/COFFEE/nmr/AC1213_BRAAS12064_6528106_XEsjp4Wcx4/10/pdata/1/auditp.txt
$$ ##AUDIT TRAIL=  $$ (NUMBER, WHEN, WHO, WHERE, PROCESS, VERSION, WHAT)
(   1,<2012-07-15 11:09:50.546 -0500>,<Administrator>,<TOPSPIN>,<go>,<TOPSPIN 2.1>,
      <created by zg
	started at 2012-07-15 11:08:44.000 -0500,
	POWCHK enabled, PULCHK disabled,
       configuration hash MD5:
       6B 1B 68 BB D9 2E 58 E2 7F 35 AD 54 07 DF 0E 41
       data hash MD5: 64K
       D4 0F 56 D7 7E 14 8A 38 E8 25 57 C8 58 E6 31 EB>)
(   2,<2012-07-15 11:09:53.359 -0500>,<Administrator>,<TOPSPIN>,<proc1d>,<TOPSPIN 2.1>,
      <Start of raw data processing
       efp LB = 0 FT_mod = 6 PKNL = 1 PHC0 = 0 PHC1 = 0 SI = 32K 
       data hash MD5: 32K
       71 62 40 02 B9 03 0F D1 92 81 D4 80 86 6E C3 6F>)
(   3,<2012-07-15 11:09:53.671 -0500>,<Administrator>,<TOPSPIN>,<proc1d>,<TOPSPIN 2.1>,
      <pk PHC0 = 176.2262 PHC1 = 0 
       data hash MD5: 32K
       FC 79 86 2B 6E 32 E3 39 DB 52 B0 80 4D 60 2A CB>)
(   4,<2012-07-15 11:09:53.734 -0500>,<Administrator>,<TOPSPIN>,<proc1d>,<TOPSPIN 2.1>,
      <abs ABSG = 1 
       data hash MD5: 32K
       67 39 38 D5 FA BE FE 76 38 82 AD 85 2D D7 8B DE>)
(   5,<2012-07-15 11:09:53.765 -0500>,<Administrator>,<TOPSPIN>,<proc1d>,<TOPSPIN 2.1>,
      <abs ABSG = 2 
       data hash MD5: 32K
       E4 88 18 B7 32 5F 62 78 02 F2 FD A9 19 EE 39 E7>)
(   6,<2012-07-15 11:09:53.796 -0500>,<Administrator>,<TOPSPIN>,<proc1d>,<TOPSPIN 2.1>,
      <abs ABSG = 3 
       data hash MD5: 32K
       B3 95 DF E2 EE 0E 0E 29 16 AB E7 B4 CB 9A F0 08>)
(   7,<2012-07-15 11:09:53.828 -0500>,<Administrator>,<TOPSPIN>,<proc1d>,<TOPSPIN 2.1>,
      <abs ABSG = 4 
       data hash MD5: 32K
       81 63 3F 14 D7 78 FA 98 54 E4 5C 8E F1 10 38 18>)
(   8,<2012-07-15 11:09:53.859 -0500>,<Administrator>,<TOPSPIN>,<proc1d>,<TOPSPIN 2.1>,
      <abs ABSG = 5 
       data hash MD5: 32K
       97 C0 AB A8 33 5C 16 DA F8 D0 76 63 74 99 68 6D>)
$$ ##END=
$$ 
$$ $$ hash MD5
$$ $$ 53 27 5A 69 40 C9 7F DF 1A 20 AC 18 39 2D 27 10
##$RELAX= 
##$RELAX= 
##$RELAX= 
##$RELAX= 
##$RELAX= 
##$RELAX= 
##$RELAX= 
$$ Bruker specific parameters
$$ --------------------------
$$ [...]
150 150 150 150 150 150 150 150
##$TP07= 0
##$TPNAME0= <>
##$TPNAME1= <>
##$TPNAME2= <>
##$TPNAME3= <>
##$TPNAME4= <>
##$TPNAME5= <>
##$TPNAME6= <>
##$TPNAME7= <>
##$TPOAL= (0..7)
0.5 0.5 0.5 0.5 0.5 0.5 0.5 0.5
##$TPOFFS= (0..7)
0 0 0 0 0 0 0 0
##$TUNHIN= 0
##$TUNHOUT= 0
##$TUNXOUT= 0
##$USERA1= <user>
##$USERA2= <user>
##$USERA3= <user>
##$USERA4= <user>
##$USERA5= <user>
##$V9= 5
##$VALIST= <valist>
##$VCLIST= <CCCCCCCCCCCCCCC>
##$VD= 0
##$VDLIST= <DDDDDDDDDDDDDDD>
##$VPLIST= <PPPPPPPPPPPPPPP>
##$VTLIST= <TTTTTTTTTTTTTTT>
##$WBST= 2048
##$WBSW= 25
##$XGAIN= (0..3)
0 0 0 0
##$XL= 0
##$YL= 0
##$YMAX_a= 511828
##$YMIN_a= -651993
##$ZGOPTNS= <>
##$ZL1= 120
##$ZL2= 120
##$ZL3= 120
##$ZL4= 120
##$ABSF1= 14.98509
##$ABSF2= -5.573092
##$ABSG= 5
##$ABSL= 3
##$ALPHA= 0
##$AQORDER= 0
##$ASSFAC= 0
##$ASSFACI= 0
##$ASSFACX= 0
##$ASSWID= 0
##$AUNMP= <proc_prof1d_extract_pilot.lims>
##$AXLEFT= 0
##$AXNAME= <>
##$AXNUC= <1H>
##$AXRIGHT= 0
##$AXTYPE= 0
##$AXUNIT= <>
##$AZFE= 0.1
##$AZFW= 0.1
##$BCFW= 0
##$BC_mod= 0
##$BYTORDP= 0
##$COROFFS= 0
##$CY= 15
##$DATMOD= 1
##$DC= 0
##$DFILT= <>
##$DTYPP= 0
##$F1P= 0
##$F2P= 0
##$FCOR= 0.5
##$FTSIZE= 32768
##$FT_mod= 6
##$GAMMA= 0
##$GB= 0
##$INTBC= 1
##$INTSCL= 1
##$ISEN= 128
##$LB= 0
##$LEV0= 0
##$LPBIN= 0
##$MAXI= 10000
##$MC2= 0
##$MEAN= 0
##$ME_mod= 0
##$MI= 0
##$NCOEF= 0
##$NC_proc= -8
##$NLEV= 6
##$NOISF1= 0
##$NOISF2= 0
##$NSP= 0
##$NTH_PI= 0
##$NZP= 0
##$OFFSET= 14.98509
##$PC= 1
##$PHC0= 176.2262
##$PHC1= 0
##$PH_mod= 1
##$PKNL= yes
##$PPARMOD= 0
##$PPDIAG= 0
##$PPIPTYP= 0
##$PPMPNUM= 2147483647
##$PPRESOL= 1
##$PSCAL= 4
##$PSIGN= 0
##$PYNMP= <proc.py>
##$REVERSE= no
##$SF= 400.02
##$SI= 32768
##$SIGF1= 0
##$SIGF2= 0
##$SINO= 400
##$SIOLD= 32768
##$SPECTYP= <>
##$SREGLST= <1H.CDCl3>
##$SSB= 0
##$STSI= 32768
##$STSR= 0
##$SW_p= 8223.68421052631
##$SYMM= 0
##$S_DEV= 0
##$TDeff= 65536
##$TDoff= 0
##$TI= <>
##$TILT= no
##$TM1= 0
##$TM2= 0
##$TOPLEV= 0
##$USERP1= <user>
##$USERP2= <user>
##$USERP3= <user>
##$USERP4= <user>
##$USERP5= <user>
##$WDW= 1
##$XDIM= 32768
##$YMAX_p= 473205413
##$YMIN_p= -726295
##$CURPLOT= <Network HP LaserJet P1505>
##$CURPRIN= <$Network HP LaserJet P1505>
##$DFORMAT= <normdp>
##$LAYOUT= <+/1D_H.xwp>
##$LFORMAT= <normlp>
##$PFORMAT= <normpl>
##$SURQMSG= 1
$$ End of Bruker specific parameters
$$ ---------------------------------
##NTUPLES= NMR SPECTRUM
##VAR_NAME=  FREQUENCY,     SPECTRUM/REAL,   SPECTRUM/IMAG
##SYMBOL=    X,             R,               I
##VAR_TYPE=  INDEPENDENT,   DEPENDENT,       DEPENDENT
##VAR_FORM=  AFFN,          ASDF,            ASDF
##VAR_DIM=   32768,         32768,           32768
##UNITS=     HZ,            ARBITRARY UNITS, ARBITRARY UNITS
##FACTOR=    0.250966925370066, 1,           1
##FIRST=     8223.43324360094, 40224,        -326607
##LAST=      0,             68904,           -27881
##MIN=       0,             -726295,         0
##MAX=       8223.43324360094, 473205413,    0
$$ Real data points
##PAGE= N=1
##DATA TABLE= (X++(R..R)), XYDATA
$$ [...]
19541g570A85759C0877b71016B35988a83505h4961k8606N6188j60011J20D6725
19529a72654C8869b2060j92456B48080E304b91406B7989g6141A56785n514c61544
19517a71337H4522a23770F4622a47200A5175a15083c1704l159j06006o4565M087
19506b01347C6637b41480A13569a51136A9971R4713a135E5058j2168a81966j89473
19495c71439a79211A62940h7548r0506g5893l17651J62445a01441l1827e7506
19484a47561k72411b03907G5732b74671C6300a41023k07184a7337A22522R5982
19474B18504a10690a1571D6239b19105l4335M6119H996b2152k22846k1747R0401
19463a76344d3444j23252r7485O1887R5299C02778b13890G721K04884b7168r8853
$$ plain form
19541 -7570 185759 30877 -271016 235988 -183505 -84961 -113567 -57379 -217390 -217270 46725
19529 -172654 38869 -22060 -214516 248080 5304 -291406 27989 -76141 156785 151271 -361544
19517 -171337 84522 -123770 64622 -147200 15175 -115083 -31704 -34863 -140869 -205434 -201347
19506 -201347 36637 -241480 113569 -151136 19971 114684 -1135 55058 42890 -181966 -371439
19495 -371439 -179211 162940 -87548 -178054 -75893 -393544 -231099 -101441 -133268 -57506
19484 -147561 -419972 -203907 75732 -274671 36300 -141023 -348207 -17337 122522 218504
19474 218504 -110690 -11571 46239 -219105 -253440 -207321 8996 -22152 -244998 -266745 -176344
19463 -176344 -43444 -166696 -264181 -202294 -106995 302778 -213890 7721 212605 -27168 -126021
19452a26021B48539a51753k0451B55848I8884R5152a3761j11641l4097B47178
19441h6682j88723C1321d2342n7140k05235c2980A43473F6575M6080a66390E103
19429A24773b5077C1112d4737a7153A57201J10105a34651a4090B1375b21413e0742
19417F7593d7712D135L6403Q9523c55900J71341K5195A87025a93390n1887i011
19405B6730J24164g2803A21208a48093B58818f819k37674O0673j08184A53761
19394A32164R7704f0170B25034c20076J35550A72979J41094q0914D1588c3657
19383G9303L3480b0642n2024E8013d6436k11842a16450j0500m7441I3145m5904
19372D7241G036K0080Q0190a00465C0225b22031A59690g988j32176A37924a83497
$$ plain form
19452 -126021 248539 -151753 -172204 255848 98884 194036 -13761 -125402 -159499 247178
19441 -86682 -275405 31321 -42342 -99482 -304717 -32980 143473 66575 112655 -166390 5103
19429 124773 -25077 31112 -44737 -17153 157201 267306 -134651 -14090 21375 -221413 -50742
19417 67593 -47712 4135 40538 130061 -355900 -184559 -159364 187025 -193390 -245277 -9011
19405 26730 150894 -72803 121208 -148093 258818 -6819 -244493 -183820 -292004 153761
19394 132164 229868 -60170 225034 -320076 -184526 172979 314073 233159 41588 -33657
19383 79303 112783 -20642 -72666 58013 -46436 -258278 -116450 -126950 -174391 93145 47241
19372 47241 7036 27116 107306 -100465 30225 -222031 159690 -7988 -140164 137924 -183497
19360c19888h0394j87140b7021E47a21171L1404l6710P184I9150b13085A61933
19348b4758k59k61013H5424i0612M2214j60227o8490c6180l43425a50248J8900
19337a31348A24000A5384f2847b617I9849a13227J8614l477I3841a38529D45669
19325f1850c531B6504b10439A39933D7802J13771f5407m2357l3088A02355N1863
19314A54218q271J81430D4641b97604c9772I6514a3011l06729M1204E550b00308
19302A4872J88933r108b81607b661k66529n3184B87573P3004h5397r970l9481
19291a34848k30906p4322f1523A13872e7612A51021b09968B96233b60864k19527
19281d80391a49159A3152c07210j2900i5777l3910C1390f3246j13662p4387P2391
$$ plain form
19360 -319888 -80394 -267534 -27021 547 -121171 -89767 -126477 -119293 99150 -213085 161933
19348 -24758 -25017 -286030 85424 -90612 -48398 -208625 -277115 -36180 -379605 -150248 -131348
19337 -131348 124000 15384 -62847 -2617 99849 -113227 -94613 -98090 93841 -138529 445669
19325 -61850 -3531 26504 -210439 139933 47802 161573 -65407 -107764 -140852 102355 154218
19314 154218 145947 327377 44641 -297604 -39772 96514 -13011 -319740 -278536 5550 -200308
19302 14872 203805 194697 -281607 -2661 -269190 -322374 287573 360577 -85397 -95367 -134848
19291 -134848 -365754 -440076 -61523 113872 -57612 151021 -209968 296233 -260864 -480391
19281 -480391 -149159 13152 -307210 -320110 -95777 -129687 31390 -63246 -176908 -251295 -178904
19270a78904K6245B17464A9521a21561j18186E6519J70618e8067K3522E4362J46670
19259B01032J8905b06482K1467f3073C9283e03600a5682A15657L5564p5368J61220
19248B37073b72815M8322K6225A69897b83964c0922C84209B2965M22566A0532
19237b6320o8842J3792j9545B78459a5611k23324k3058C15275l6412b41848r0801
19226c32649D995i2106O836j39457I4137l3101b52399m9170a03552B9898b82632
19214a25578r7473O9359c2850r102A13832f0476a5643j14280A58960p9227b05144
19202A67625J93410b4721k53950M2682A17673J24326a80202l17778A19728c66775
19191b86353J39619B25311a64532k17430C5801a49179B33476a58138q5514A63415
$$ plain form
19270 -178904 -152659 217464 19521 -121561 -239747 56519 227137 -58067 -34545 54362 201032
19259 201032 219937 -206482 -185015 -63073 39283 -503600 -15682 115657 151221 75853 237073
19248 237073 -272815 -224493 -198268 169897 -283964 -30922 384209 22965 445531 10532
19237 -26320 -95162 -81370 -100915 278459 -15611 -238935 -261993 315275 278863 -241848 -332649
19226 -332649 4995 -92106 -85270 -224727 94137 61036 -252399 -301569 -103552 29898 -282632
19214 -125578 -223051 -153692 -32850 -41952 113832 -60476 -15643 -129923 158960 79733 -205144
19202 167625 361035 -24721 -278671 -235989 117673 241999 -180202 -497980 119728 -366775
19191 -286353 -146734 225311 -164532 -381962 35801 -149179 233476 -158138 -243652 163415
19180B8315a06470A44259f8169A9306M9177M3450a03982k4246D1400i33j46113
19169a47046D11167i20A3156f32250H745K0172b19401L0737f132C07923E6039
19157i4199B5380c21387B89219f01940A42617J04184a63520Q1658B13739b97973
19146a5634k13659a10655l9787P2107E464R6683c28879j53346a07222r6961R5875
19135a08308j36606R4179g578j31243n4376C4964A2487e19678D9989q469i9138
19123A38481a25322l15944A55196a97621G0173R3649g6283C3560g7668n3492b0060
19111c52434a348A77265A8470Q4268e9519l30546I8894J50831N6262F5508L61123
19100D26631D0361b73233B39304c92708e3462l33094A6642Q0616c98215J81881
$$ plain form
19180 28315 -106470 144259 -68169 19306 68483 111933 -103982 -128228 41400 -933 -147046
19169 -147046 411167 -920 13156 -632250 8745 28917 -219401 -188664 -6132 307923 56039
19157 -94199 25380 -321387 289219 -601940 142617 246801 -163520 -81862 213739 -297973
19146 -15634 -229293 -110655 -150442 -78335 5464 102147 -328879 -482225 -107222 -204183 -108308
19135 -108308 -244914 -150735 -7578 -138821 -193197 34964 12487 -519678 49989 41520 -99138
19123 138481 -125322 -441266 155196 -197621 70173 163822 -76283 33560 -77668 -131160 -20060
19111 -352434 -1348 177265 18470 102738 -59519 -390065 98894 249725 305987 65508 426631
19100 426631 40361 -273233 239304 -392708 -53462 -386556 16642 97258 -398215 -216334
19090b16334M2093A64322o2595a81953J155q0191J19159b349j36129B88468J6869
19079C05337a64155q1408a09449k46359h1460j36870g2947A96236F1971e377A9861
19067B19066b82046A83612b78816C9938K63442h2437A58810a58966k3491a4672
19056b65763J17540K0872A78388e51875a81127e3755j37961r5122g1643B33240
19045b46284a13196A96254E4558d1214j68496q8702a36470B35055p9607J21643
19035B77091j06015c26980D6474M5043a0179B34972j0290A02325J85176i7410
19024C17300J30383A08958a53882f6518C40539a06509A39170h6576E156d3270
19013b007C5152J69273a67883I6029f5310k524n5628l5174B1084a26740A5599
$$ plain form
19090 -216334 -174241 164322 101727 -181953 -180798 -260989 -141830 -2349 -138478 288468 305337
19079 305337 -164155 -245563 -109449 -355808 -81460 -218330 -72947 196236 61971 -5377 19861
19067 219066 -282046 183612 -278816 39938 303380 -82437 158810 -158966 -182457 -14672
19056 -265763 -148223 -127351 178388 -551875 -181127 -53755 -191716 -286838 -71643 233240
19045 -246284 -113196 196254 54558 -41214 -209710 -298412 -136470 235055 155448 277091
19035 277091 171076 -326980 46474 91517 -10179 234972 224682 102325 287501 -97410
19024 317300 447683 108958 -153882 -66518 340539 -106509 139170 -86576 5156 -43270
19013 -2007 35152 204425 -167883 96029 -65310 -67834 -123462 -158636 21084 -126740 15599
19001I2598a97973f9389r2343L451P5687k15977b9945J11B77288H1740b3530B107
18988i7884C3146a5353A9912g0524L478m9090F0654Q8612h3584A39100D3664e30366
18975d29552C9102g0933j08358P5194C518b24294I842e733l9212l16995a23752
18963D5270b52053e0255B49180c60740J30777e1914A96025r5701a05095k20896
18953c25991a8374A61657j5642A0236b46532J10201j1098G8659n280c37611H2740
18941i2261A06633A2583a34181j97870G2962c7459E0396Q1722l2835a9780q2787
18930a02567B13198d8702n9882Q805B12370b00694B55063a80646A13847a30172
18919D79275h6258c0933A68806a68983A03886A709M221J13200b73631i5992n2744
$$ plain form
19001 92598 -197973 -69389 -161732 -158281 -82594 -298571 -29945 -29834 277288 81740 -23530 2107
18988 -97884 33146 -15353 19912 -70524 -67046 -116136 60654 149266 -83584 139100 43664 -530366
18975 -429552 39102 -70933 -179291 -104097 3518 -224294 9842 -5733 -44945 -361940 -123752
18963 45270 -252053 -50255 249180 -360740 -229963 -51914 196025 100324 -105095 -325991
18953 -325991 -18374 161657 146015 10236 -246532 -136331 -147429 78659 73379 -337611 82740
18941 -92261 106633 12583 -134181 -332051 72962 -37459 50396 132118 99283 -19780 -102567
18930 -102567 213198 -48702 -108584 -99779 212370 -200694 255063 -180646 113847 -130172
18919 479275 -86258 -30933 168806 -168983 103886 1709 5930 119130 -273631 -95992 -148736
18908a48736q9293P2004A53318b75321B29927j10903a13950l7757H7544K63528
18898C51072b48540B6794J01678Q6728m262J53b21116a4194j52440A87427d5924
18886h5945m1989K3221M9804p8856A76795C6513K81745a68970j37285C6468e090
18874C4163a86984q1435A3622b67239I3486J40537a42131n2834A25770b8133A2912
18862B6900a03580k88550G30b5722D49022d01897f6795b2652j22246p2652d6956
18850a98349Q4621k09983B2506K01882b51981E0357Q1094a90482B58739b4686
18839B53016K6083a70513E4159g6454A0634J5067J11643D6996f4841E7001H035
18827a11254B51126a16919A8485i3074p2458K251o0163K4661b8484j41165j2824
$$ plain form
18908 -148736 -238029 -166025 153318 -275321 229927 119024 -113950 -151707 87544 351072
18898 351072 -248540 26794 128472 215200 210938 211091 -221116 -14194 -166634 187427 -45924
18886 -85945 -127934 -104713 -54909 -133765 176795 36513 318258 -168970 -306255 36468 -5090
18874 34163 -186984 -268419 13622 -267239 93486 234023 -142131 -194965 125770 -28133 12912
18862 26900 -103580 -392130 730 -25722 449022 -401897 -66795 -22652 -144898 -217550 -46956
18850 -198349 -113728 -323711 22506 224388 -251981 50357 131451 -190482 258739 -24686
18839 253016 279099 -170513 54159 -76454 10634 25701 137344 46996 -64841 57001 8035
18827 -111254 251126 -116919 18485 -93074 -165532 -163281 -223444 -198783 -28484 -169649 -182473
18816a82473c17j82028B78692o9267j4967r3556M8331L24269p0460B1007F833
18804B43587g4310A43323f7160C1610c4366B60037N0733D041a72063A93965a03029
18792a3980j13362e6292a3939B75716j17529c51024A45411c9951j37842D5223
18781b33569A62951a73599J6918N7158l8646j34254A22724a26410c5806M174B87089
18769A80988i4735n4380C2963f5185B8504b16951A3648a87918k22314B2943K56224
18758B79167D8698b9569o1736C7252J10634m2141b10598D63364H6422c02385A21978
18746A70088m832b13157F0902e3046B40247a3194j1120r6480j12597R4075I6838
18734A2681a70488J8819H0619b21714G9868b2115l8463k26611E8136i8936M4856
$$ plain form
18816 -182473 -317 -182345 278692 209425 194458 100902 149233 473502 403042 21007 6833
18804 243587 -74310 143323 -67160 31610 -34366 260037 310770 4041 -172063 193965 -103029
18792 -13980 -127342 -56292 -13939 275716 158187 -351024 145411 -39951 -177793 45223
18781 -233569 162951 -173599 -156681 -99523 -138169 -272423 122724 -126410 -35806 -31632 287089
18769 180988 -94735 -149115 32963 -65185 28504 -216951 13648 -187918 -410232 22943 279167
18758 279167 48698 -29569 -91305 37252 147886 105745 -210598 463364 86422 -302385 121978
18746 170088 165256 -213157 60902 -53046 240247 -13194 -24314 -120794 -233391 -139316 96838
18734 12681 -170488 -151669 80619 -221714 79868 -22115 -60578 -287189 58136 -98936 -54080
18723e4080k8229C6264F002c12896A63005E3701a93776A78812a98734B6595b20887
18711b8762j91676Q6891j38797I920c4688A6906g0508c3319D6182h5147B15510
18699a08130G6324e9969B0753c67648J25737A03711a08949A39285f9242j8382
18689h7624l04443c4156a587M78k41013g255j44749B64612p3761b66343a31418
18677E1214b0124l69647H0040c41731h3080b7537h232o9024r7944a9958j88932
18666b08890K0874I9469a57198j29525A28459q432e7337j9671F0690b7658a0207
18654A992b09520E3814b38382A57259a49869A07181a90179H1912J07558g2756
18643d28723c2711p8426A21698e6922C89721b02369b3417k88650B78715P2523
$$ plain form
18723 -54080 -82309 36264 6002 -312896 163005 53701 -193776 178812 -198734 26595 -220887
18711 -28762 -220438 -133547 -272344 9920 -34688 16906 -70508 -33319 46182 -85147 215510
18699 -108130 76324 -59969 20753 -367648 -241911 103711 -108949 139285 -69242 -87624
18689 -87624 -392067 -34156 -1587 -1109 -242122 -7255 -152004 264612 190851 -266343 -131418
18677 51214 -20124 -389771 80040 -341731 -83080 -27537 -8232 -77256 -175200 -19958 -208890
18666 -208890 -188016 99469 -157198 -286723 128459 120027 -57337 -77008 60690 -27658 -10207
18654 1992 -209520 53814 -238382 157259 -149869 107181 -190179 81912 189470 -72756
18643 -428723 -32711 -111137 121698 -56922 389721 -202369 -23417 -312067 278715 351238
18633C51238a34313O0761E6112a1369r0960A50423p4882a6578p6283o9400A39066
18621B1262J95061a18479B75163j01369h2112j15336b1703A40471P6259r1159
18611A25571A5545J95718D8542d6817A65293D4193a19097j78948P384b1402k24407
18600b45809n6326B6886c3474r2661J7243A3038J80462l6404d79484K27468a14075
18588A01353b04088A6132a02852p2551A5729a16902e1469r3196H3767B0058L3288
18577E3346M8094a41728b3902H6325L9322K731B4636a76885p9796b872A76867
18565F1876h5918A29478b3778j25534c4470k72362M715A25643N2446J53567n2965
18554B78691b17877j9150J08085c4795B50687b63135C3878a47719A11225i1025
$$ plain form
18633 351238 -134313 -73552 56112 -11369 -102329 150423 75541 -16578 -92861 -162261 139066
18621 21262 216323 -118479 275163 173794 -82112 -197448 -21703 140471 216730 125571
18611 125571 15545 211263 48542 -46817 165293 44193 -119097 -298045 -290661 -21402 -245809
18600 -245809 -302135 26886 -33474 -126135 -108892 13038 193500 157096 -479484 -252016 -114075
18588 101353 -204088 16132 -102852 -175403 15729 -116902 -51469 -144665 83767 20058 53346
18577 53346 101440 -141728 -23902 86325 125647 128378 24636 -176885 -256681 -2872 176867
18565 61876 -85918 129478 -23778 -149312 -34470 -306832 -302117 125643 178089 331656 278691
18554 278691 -217877 -237027 -128942 -34795 250687 -263135 33878 -147719 111225 -91025
18543a11987l4099B22358F0344a01992j79451h9158k72228d4565o1225d424A03125
18531I4363e9268j63760e257G612K7939b11224A41681b16797j4185i4758c1187
18519B1913h1336L6981k33098F6849e2917G1730a7714e506r671k12478F0603e7208
18506E2190c9393j02020C07315m2707B6389a58704O1305E20114c54495a1841B55488
18494b20851a08349k41578a29113j35513k1227G796J5414b90098F6531A2177J00655
18483A12832a65682H704K05982G4224a63585H0003h857C1948a08090B30292r7383
18472A32909e3196k45555B6985L6944b81043A79339a50386A04099g6924I5492
18461a08960l0103j16106P6051C2912J4582a5599G9944c93761B6840c08481H5963
$$ plain form
18543 -111987 -146086 222358 60344 -101992 -281443 -89158 -361386 -44565 -105790 -4424 103125
18531 94363 -59268 -223028 -5257 7612 35551 -211224 141681 -216797 -230982 -94758 -31187
18519 21913 -81336 -44355 -277453 66849 -52917 71730 -17714 -5506 -15177 -227655 60603 -57208
18506 52190 -39393 -141413 307315 264608 26389 -158704 -97399 520114 -354495 -11841 255488
18494 -220851 -108349 -349927 -129113 -264626 -285853 7796 23210 -290098 66531 12177 112832
18483 112832 -165682 8704 214686 74224 -163585 80003 -8857 31948 -108090 230292 132909
18472 132909 -53196 -298751 26985 63929 -281043 179339 -150386 104099 -76924 95492
18461 -108960 -139063 -255169 -179118 32912 47494 -15599 79944 -393761 26840 -308481 85963
18449f8079l0267m0084B12257B181b15936r2365R2308B0483b85920C3391a29009
18437e38325H3612P7513h4735j59630A00618b83130i4449J6586A45893a38600
18426c05884I8799b64170i2865j01729O9960k68736R7021R2540D4585d9719A84357
18414c45k2188l1706A0693O1245l1159a76605I1495B6129p301d44262B10225a92748
18401A62689F7357O3380e7025A2905a74570O4023B35492D2582h6468k25326a4226
18389i1410A0924i7815o6311H6805a87697A53599n1426f8311l40264F8137a08294
18377i9832E2397c02909J22777A61520B9344c03431C0656a00303k4123J3455A35996
18365h2703I3274m1979a15370K4776m2246o0061d1144E917M3261a46288O8568
$$ plain form
18449 -68079 -98346 -138430 212257 2181 -215936 -308301 -215993 20483 -285920 33391 -129009
18437 -538325 83612 161125 -84735 -244365 100618 -283130 -94449 -77863 145893 -138600
18426 -305884 98799 -264170 -92865 -194594 -124634 -393370 -296349 -203809 44585 -49719 184357
18414 -345 -22533 -54239 10693 71938 40779 -176605 91495 26129 18828 -444262 210225 -192748
18401 162689 67357 130737 -57025 12905 -174570 -110547 235492 42582 -86468 -311794 -14226
18389 -91410 10924 -97815 -164126 86805 -187697 153599 102173 -68311 -408575 68137 -108294
18377 -99832 52397 -302909 -180132 161520 29344 -303431 30656 -100303 -124426 -110971 135996
18365 -82703 93274 51295 -115370 -90594 -132840 -192901 -41144 5917 49178 -146288 -77720
18354g7720p1515n518A43560j2608h4306D116d3832m8078A20132C5392P8232f8915
18341c4542j55718P4734L7270g982k61661c4035A08793f254B05908a18262M4977
18330g3285n4946A5825K49248a23798e7306K6813C03485h8930j40845A14293c87338
18318a81530A32380a50832j60978a21038C50537A05649J04927b78214r2927B6498
18307A73713a62900A70078g3075B60954a79519j1364E0060b58033g4731F2851
18296I2789a24334j47074O2828C0646J99452D0521b83834e8544q0526c1270F5323
18284a78492j67921h2810A37999g5422E4395g3531A69470E5990J40834a15963
18273i13n3394k76524B13168P0195c58400b6083j53395H6334h3846G042J5462
$$ plain form
18354 -77720 -149235 -154753 143560 130952 -84306 4116 -43832 -91910 120132 35392 113624 -68915
18341 -34542 -190260 -115526 -78256 -7982 -269643 -34035 108793 -6254 205908 -118262 -73285
18330 -73285 -128231 15825 265073 -123798 -57306 -30493 303485 -88930 -229775 114293 -387338
18318 -181530 132380 -150832 -311810 -121038 350537 105649 210576 -278214 -371141 26498
18307 173713 -162900 170078 -73075 260954 -179519 -190883 50060 -258033 -74731 62851
18296 92789 -124334 -271408 -208580 30646 230098 40521 -283834 -58544 -139070 -31270 65323
18284 -178492 -346413 -82810 137999 -75422 54395 -73531 169470 55990 196824 -115963
18273 -913 -54307 -330831 213168 283363 -358400 -26083 -179478 86334 -83846 7042 22504
18262B2504p85a66667P419b0242k45006A50649L9559B0118L13321a23612C5676
18250E3931g1658b6217n0575j8598I4544B4407b33905A91760a77861E072b44872
18238g4639l80587a541j50382H586a20238B88409B0591c5787m1396G9488a13719
18226a54816N945c2207j19149A23649E1026c840A90402f8722a411A0850L2839
18215D3689h7506j37299c4100A48574P1824a37156A7338P4457a96388N8652m6273
18204a84009a1366G4053C708d0080A06558D58a33454A20715E9540i4328M5853
18193d8475j17883A32755c70643B60377K06558a8459j37707m7050A3148a74509
18182a33857A74799b00230D592e9016k69063A73851b73920J02496B66185l302
$$ plain form
18262 22504 21719 -166667 -159248 -20242 -265248 150649 190208 20118 333439 -123612 35676
18250 53931 -71658 -26217 -76792 -95390 94544 24407 -233905 191760 -177861 5072 -244872
18238 -74639 -455226 -1541 -151923 8586 -120238 288409 20591 -35787 -77183 79488 -113719
18226 -154816 -148871 -32207 -151356 123649 51026 -3840 190402 -68722 -1411 10850 43689
18215 43689 -87506 -224805 -34100 148574 220398 -137156 17338 91795 -196388 -137736 -184009
18204 -184009 -11366 74053 3708 -40080 106558 458 -133454 120715 59540 -94328 -48475
18193 -48475 -166358 132755 -370643 260377 466935 -18459 -156166 -203216 13148 -174509
18182 -133857 174799 -200230 4592 -59016 -328079 173851 -273920 -171424 266185 262883
18172B62883c6017C1490K47508g7287j10193A21485B3965c41972a54326F0569
18161a30294j94201a51115B05392f0956G0240p465b8476A8887h6369j2728A58731
18149A73277C5723A4392c07165J0137j28316A07809I795e3772A01711P8723D7789
18137b824j85683h3688m0044B96276A2792a7527k8537E4791g2275H521a33000
18125A1137Q5399C6468a69082O0595B7582f259k07221j18094J42361L109B2029
18113b07938i3012C9980d186G7174k03J10443m1189h7887A23157b33787P2578
18102a61209j66001e3661j96347b0125r7701L5708C15644j897j14649I459c7842
18090C1506c13815I5077J77411E0473b31912G2888A50i8350F960a57033g6648
$$ plain form
18172 262883 -36017 31490 278998 -77287 -187480 121485 23965 -341972 -154326 60569
18161 -130294 -324495 -151115 205392 -60956 70240 62775 -28476 18887 -86369 -99097 158731
18149 173277 35723 14392 -307165 -297028 -425344 107809 9795 -53772 101711 180434 47789
18137 -2824 -188507 -83688 -123732 296276 12792 -17527 -46064 54791 -72275 8521 -133000
18125 11137 96536 36468 -169082 -108487 27582 -6259 -213480 -331574 -189213 -186104 22029
18113 -207938 -93012 39980 -4186 77174 76971 187414 146225 -87887 123157 -233787 -161209
18102 -161209 -327210 -53661 -250008 -20125 -117826 -82118 315644 313747 199098 9459 -37842
18090 31506 -313815 95077 272488 50473 -231912 72888 150 -98350 6960 -157033 -76648
18078C8778j246d79077a56407B18617M9400a14685e1641l83818B9514d4449q4338
18067a28787A43549e0850q199b3580A84464i8819B67054i8014A30281a243n3357
18056e4600A47865k8422e1494j91762H7800c14440a37914f8081C7005f4294o5633
18045a29927A92823c11336B12171a48567J7109I0681c3189A22993A5078J85360
18035B00438P4710B2160O987J8222b1291A23328E4314b13191H2420b33161g7547
18023E0934c7872A00032b19731J8901j10587B75979b2154H1915g4457B25982h6732
18011b2168A6634d3261G3171i4442F1903a62428d498n2036b8011G4705d8656G7049
17998h2559k0973b4041k01511R9795j5459j2697A56903i7988B72603i1746m1690
$$ plain form
18078 38778 37532 -479077 -156407 218617 268017 -114685 -51641 -435459 29514 -44449 -128787
18067 -128787 143549 -50850 -59049 -23580 184464 -98819 267054 -98014 130281 -1243 -54600
18056 -54600 147865 119443 -51494 -243256 87800 -314440 -137914 -68081 37005 -64294 -129927
18045 -129927 192823 -311336 212171 -148567 -131458 90681 -33189 122993 15078 200438
18035 200438 275148 22160 29147 47369 -21291 123328 54314 -213191 82420 -233161 -77547
18023 50934 -37872 100032 -219731 -200830 -311417 275979 -22154 81915 -74457 225982 -86732
18011 -22168 16634 -43261 73171 -94442 61903 -162428 -4498 -56534 -28011 74705 -48656 77049
17998 -82559 -103532 -24041 -225552 -125757 -141216 -153913 156903 -97988 272603 -91746 -133436
17987a33436G8531J34085a24107A019J63444e5136l8529C96994j78083A3999f3999
17975A91077a32271a1455j99622J0576A06683c63165a03770j06038l4863L0884
17965b13787B47933I141L1367b1184j57264J4021p8936h0063n25554a17922C1991
17953a36989A31826b22873A53523a14318o9460B11719H0140C1364i9836M9111
17943e0725D133R5671a14740E8588a85563A1856a47793A35146K15843B1470O2645
17932H4115M095k8615N429c40126p3501A78568a54269N4161r9852A38723a99694
17920G8238a10059G2275a93476A0918K8776g6022E8509b72645B6451g6386B47474
17908b92261A16341b9847r2660A11723a17679b5042i601H0508c23163f4707K6274
$$ plain form
17987 -133436 78531 212616 -124107 1019 164463 -55136 -93665 396994 218911 13999 -63999
17975 191077 -132271 -11455 -211077 -200501 106683 -363165 -103770 -209808 -244671 -213787
17965 -213787 247933 9141 40508 -21184 -178448 -164427 -243363 -80063 -605617 -117922 31991
17953 -136989 131826 -222873 153523 -114318 -183778 211719 80140 31364 -99836 -50725
17943 -50725 4133 99804 -114740 58588 -185563 11856 -147793 135146 350989 21470 84115
17932 84115 88210 59595 65024 -340126 -413627 178568 -154269 -100108 -199960 138723 -199694
17920 78238 -110059 72275 -193476 10918 39694 -76022 58509 -272645 26451 -76386 247474
17908 -292261 116341 -29847 -122507 111723 -117679 -25042 -9601 80508 -323163 -64707 -38433
17897c8433C2214a46682B11302F513d665A0261f7984B19707d48796a76691M4203
17886a32488d0332l85704D0945b69988L3269B55879b27374r2282A58955F2052
17875H8047b33786M7972M1753d2534L198a4854A30397a1913j6119m2559k96787
17864c67378A52053K55342l3783G6436a10866a8884c639E2713K655J1524a85170
17852A38862H726a06234K6299b0203n5452C8948Q2471m4848O0751k9086P0041
17841A78277J9341a13751A89818n6350a60163j99394A13849L1796e8561C0688
17830c02362K7252d6680A13002O3147k2578f2909k43100a36837j07223G3524j1061
17819F2463K43528J97271A83237b2435j25687B6516f6525j03464B16915b954o9082
$$ plain form
17897 -38433 32214 -146682 211302 6513 -4665 10261 -67984 219707 -448796 -176691 -132488
17886 -132488 -40332 -426036 40945 -269988 -236719 255879 -227374 -319656 158955 62052
17875 88047 -233786 -185814 -144061 -42534 -39336 -14854 130397 -11913 -28032 -70591 -367378
17864 -367378 152053 407395 373612 76436 -110866 -18884 -3639 52713 55368 66892 -185170
17852 138862 8726 -106234 -79935 -20203 -75655 38948 121419 76571 137322 108236 178277
17841 178277 197618 -113751 189818 133468 -160163 -359557 113849 145645 -58561 30688
17830 -302362 -275110 -46680 113002 176149 153571 -62909 -306009 -136837 -244060 73524 62463
17819 62463 305991 503262 183237 -22435 -148122 26516 -66525 -169989 216915 -2954 -72036
17808g2036p0455b3677D9584J48999F474c30526A39475R1595E5987i1884k43423
17797c35307D6652J269b48118j06548q8946E5164i1655c466H1540j2432a65835
17785D8928L8618C1027a16180B5169Q7296Q6974g9476D30128A21117B5672J9067
17774D4739b71479k0016a10250N1718k6964A20878h1749a1854F4860J15833a99943
17762b11965i3430A49513a75556B71472a04655A96496r7303H15K44741q027I8240
17750B84909a38733I8399f022p2619j2199B19080c07704A6127c00589A80653a5136
17738i5387j2258a4767J02p9162A19062a74491o8266A77624E9647j2996g3328
17726A4469L43261b35916b9270k7580j47919A56240P6026E7717a94534B68509
$$ plain form
17808 -72036 -142491 -23677 49584 198583 6474 -330526 139475 231070 55987 -91884 -335307
17797 -335307 46652 47921 -248118 -354666 -443612 55164 -91655 -3466 81540 69108 -165835
17785 48928 87546 31027 -116180 25169 112465 199439 -79476 430128 121117 25672 44739
17774 44739 -271479 -291495 -110250 -58532 -85496 120878 -81749 -11854 64860 180693 -199943
17762 -211965 -93430 149513 -175556 271472 -104655 196496 99193 815 245556 237529 98240
17750 284909 -138733 98399 -6022 -78641 -90840 219080 -307704 16127 -300589 180653 -15136
17738 -95387 -107645 -14767 -14665 -93827 119062 -174491 -242757 177624 59647 46651 -73328
17726 14469 357730 -235916 -29270 -56850 -204769 156240 232266 57717 -194534 268509
17715a2628A9693K45519j14337d5143r967k31463a00617A8201K97314A01085J08303
17704B09388m5272J1890J08223e6877o2964A3476J23955k5801a95168D74382B2538
17692a93363A07069k6333J23535G2967B3406J194a83405J4304k7473K227B48249
17680F0665J22531A4048K02777H1714i1344B51031c12073C49413f7127n595B12248
17668B81444j37489a55847a2933C70701j65217B2840b85212f9387j20417C876
17657i28B00769E9908a77565h2672j99033N5662j19449H3982B9566b63113B1124
17645h3952E3280a44711I6583i0834L5813B38419b1917j23545c9649H963d2158
17633B8673K52089c47477d2113A84101J45385a73812A1273K57981o8322p8871
$$ plain form
17715 -12628 19693 265212 150875 -45143 -55110 -286573 -100617 18201 315515 101085 209388
17704 209388 164116 176006 284229 -56877 -119841 13476 137431 111630 -195168 474382 22538
17692 -193363 107069 80736 204271 72967 23406 24600 -183405 -169101 -196574 -194347 248249
17680 60665 183196 14048 216825 81714 -91344 251031 -312073 349413 -67127 -72722 212248
17668 281444 143955 -155847 -12933 370701 205484 22840 -285212 -69387 -189804 3876
17657 -928 200769 59908 -177565 -82672 -281705 -226043 -345492 83982 29566 -263113 21124
17645 -83952 53280 -144711 96583 -90834 -55021 238419 -21917 -145462 -39649 8963 -42158
17633 28673 280762 -347477 -42113 184101 329486 -173812 11273 269254 200932 122061
17623A22061b2792l20206F5013b8811H7903a69444A6567e9252q8587N6531p7470
17612a68778H3820R012i7302l3460n5149b7147l3978j7305C24435A54147J18998
17601B73145q19a5754C9366K1008g7797l26710B13874b55819C7954J04097L4948
17590A76999J60534c80301A66898j7669e6340H4869i6059j21725H7399K05186
17580B92585F4289a55500j91883a09729a5478A46560J20515I8641B8166J5244
17570D3410Q9938a41683N8468A89072l4542m108D6103P8578l3191b3520H3084
17558f4611C9106J0289b82518C5860J11320d9782a5767C92855c188H5669a05663
17546B96978q8279F6821J7185e6374C23520F1054M6693l3265a3325A68203c28405
$$ plain form
17623 122061 -22792 -342998 65013 -28811 87903 -169444 16567 -59252 -147839 -91308 -168778
17612 -168778 83820 92832 -97302 -130762 -185911 -27147 -61125 -78430 324435 154147 273145
17601 273145 272326 -15754 39366 60374 -77797 -404507 213874 -255819 37954 142051 176999
17590 176999 337533 -380301 166898 149229 -56340 84869 -96059 -217784 87399 292585
17580 292585 64289 -155500 -347383 -109729 -15478 146560 267075 98641 28166 43410
17570 43410 133348 -141683 -83215 189072 154530 150422 46103 124681 91490 -23520 83084
17558 -64611 39106 49395 -282518 35860 147180 -49782 -15767 392855 -3188 85669 -105663
17546 296978 208699 66821 84006 -56374 323520 61054 107747 74482 -13325 168203 -328405
17534e2544B84091p791M31605F1626R039j3293k0268b50521J07863D59959a5441
17522A2368e3982B18402c7996j7541F70157E4043a84230d0157k3428k12700B45811
17510A25026j7537J0582D0427J52940A8301M0266B0590M2635B7356a35612B54736
17498D3993M69359j85549G6933P4723n8291l993Q7125J73517A07152D2860f3004
17486A25496J74603d9236G0685J66988J61257b42607H2565f9124K1408I5153m394
17475I0759J04628l3168i2394l4869A99578J03054K03404a55467A09026B4746
17464B09899a23413B55261A3257n027Q959b01186A78111n5719O8139i1671E0588
17452c0932A45944K06289j40647m8401J56743J19463l3144n9914A57376K59775
$$ plain form
17534 -52544 284091 276300 707905 61626 70665 57372 37104 -250521 -142658 459959 -15441
17522 12368 -53982 218402 -37996 -55537 670157 54043 -184230 -40157 -63585 -276285 245811
17510 125026 107489 118071 40427 193367 18301 58567 20590 63225 27356 -135612 254736
17498 43993 513352 327803 76933 151656 93365 89372 176497 350014 107152 42860 -63004
17486 125496 300099 -49236 70685 237673 398930 -242607 82565 -69124 -47716 95153 90759
17475 90759 195387 162219 -92394 -127263 199578 302632 506036 -155467 109026 24746
17464 209899 -123413 255261 13257 8230 17189 -201186 178111 122392 190531 -91671 50588
17452 -30932 145944 352233 211586 163185 319928 439391 406247 346333 157376 417151
17442D17151A31127N8958D8642J53702M5701K63245A81024k3366J66100j25345
17432A98413N7404o8498Q1691q7988b45413C60776j34251J89742I5726L90492
17422D86218C9434J90345a39018I7718J077a62546E09782p4364j89511K05868
17412D51775k10073J41585a845A99951O9030o2520f0490F4370P8075J10970J33018
17401C86433J66735A75629i9389C02297F2216a31463d692A05553C4986a34249
17390A55710K55748a28785j39619A10113a1602A8547K98685b54907M1268C33224
17379H2933J42998j12029C6531J66046M3879P3093d8117B11539a56965A814J12065
17368A13879k905g8532C09901a79820f7242B39665N8474a85263k6336B07812o6906
$$ plain form
17442 417151 131127 190085 48642 202344 248045 511290 181024 157658 323758 198413
17432 198413 255817 187319 269010 181022 -245413 360776 226525 416267 95726 486218
17422 486218 39434 229779 -139018 97718 98795 -162546 509782 435418 245907 451775
17412 451775 241702 383287 -1845 199951 268981 206461 -60490 64370 142445 253415 386433
17401 386433 553168 175629 -99389 302297 62216 -131463 -4692 105553 34986 -134249
17390 155710 411458 -128785 -268404 110113 -11602 18547 317232 -254907 -213639 333224
17379 82933 225931 113902 36531 202577 246456 319549 -48117 211539 -156965 1814 113879
17368 113879 110974 -78532 309901 -179820 -67242 239665 298139 -185263 -211599 207812 140906
17357A40906l1829K5537i424A79007f5879B22273J03328R35A27003m1463K57572
17346C43112i519B50859G4312J86212c3194k0397B83131L520r2147d4092A30645
17334A88190g6376B98829q7033D0729K63033A47051k3131J52425j6079P2751N0304
17323C83321A31110R8996K2447I1692K20919r2549d6978H6778b742B28152C8413
17311A54979L50147B30382B4764c6170g320l8610C5009L75129a35620D91726A96237
17299C0535a50196c9315B34268b73387i86C1741p360J72233O4789K7190C5687
17287G9386J02351B2504J02130J69397a48127A28812Q3453q4490Q3789b16094
17276f8292C18607L6060A47937g857C46480n0057N1189l1506j57339L9256J04939
$$ plain form
17357 140906 109077 134614 -9424 179007 -65879 222273 325601 326536 127003 85540 343112
17346 343112 -9519 250859 74312 260524 -33194 -53591 283131 286651 194504 -44092 130645
17334 188190 -76376 298829 211796 40729 303762 147051 123920 276345 260266 333017 383321
17323 383321 131110 230106 252553 91692 312611 220062 -46978 86778 -2742 228152 38413
17311 154979 505126 230382 24764 -36170 -7320 -45930 35009 410138 -135620 491726 196237
17299 30535 -150196 -39315 234268 -273387 -986 31741 24381 196614 261403 288593 35687
17287 79386 181737 22504 124634 294031 -148127 128812 212265 127775 211564 -216094
17276 -68292 318607 354667 147937 -7857 346480 296423 347612 316106 158767 198023 302962
17265C02962B7305L71992j70288i7304G6068h5269I9721J89388g0091B67448a36417
17253C7773J67845L64960k23524e3880B60231J77326a06130B04155I1979J63615
17243B55594G0799J71314O6920J35257A83353B731M7174L31313j87188e3419e476
17231B65473B0690J12459M841M9017A8713b14067A2249M35468j20215Q1576A32554
17219B63951a70467F5212K27808j02073m3238L50017g1335B37582Q405q3867K13475
17208C75595j09570o7012b7877E5525K52127R0133j04213j32909j2855E7936B7743
17196g3132C78529I2957K06453J17855d0666H3908b2049A98672k8895A6803L77091
17185C93894k0047A10784N3599K69346j14050j39722K64295j53457L29158k10917
$$ plain form
17265 302962 27305 399297 229009 -97304 76068 -85269 99721 289109 -70091 267448 -136417
17253 37773 205618 570578 347054 -53880 260231 437557 -106130 204155 91979 255594
17243 255594 70799 242113 309033 444290 183353 2731 49905 381218 194030 -53419 -5476
17231 265473 20690 133149 137990 187007 18713 -214067 12249 447717 327502 409078 132554
17219 263951 -170467 65212 293020 190947 147709 497726 -71335 237582 245987 162120 375595
17208 375595 266025 199013 -27877 55525 307652 397785 293572 160663 147808 57936 27743
17196 -73132 378529 92957 299410 417265 -40666 83908 -22049 198672 169777 16803 393894
17185 393894 373847 110784 164383 433729 319679 179957 444252 290795 619953 409036
17175D09036J66948A73128D1742Q6681L20188K50095k80120A95080O496J58780
17165C60356J37962A07314L10106n2736A58983J90711m3107J24051p3716Q1889
17155D38811b5892A03204K38609J03144M5935k03165E1187h871C65271J68618
17145E33889j7038j97173j58727K08571j07586K5618l003j7823a4184B45411K77740
17134E23151B17179N0934J21566j80815E9282K92752j15475K90224A3606L54083
17124C67689B5841L71650A44015J10146j06354A3644K18281J07908n4680I0355
17113C88815j89744O6005J95855p0355K20420k52134A15359K95245J61130n1844
17103E19890A64536J64731N5833q5212K73463E4585K00336J81895B09960K10735
$$ plain form
17175 409036 575984 173128 41742 128423 448611 698706 418586 195080 201576 360356
17165 360356 498318 107314 417420 364684 158983 349694 306587 430638 356922 438811
17155 438811 -25892 103204 341813 444957 490892 287727 51187 -8871 365271 533889
17145 533889 516851 319678 160951 369522 261936 287554 284551 266728 -14184 245411 523151
17134 523151 217179 268113 389679 208864 59282 352034 236559 526783 13606 367689
17124 367689 25841 397491 144015 254161 147807 13644 231925 339833 285153 90355
17113 388815 199071 265076 460931 390576 610996 358862 115359 410604 571734 519890
17103 519890 164536 329267 385100 299888 573351 54585 254921 436816 209960 420695
17093D20695J2649m0922j1027J60154k25466K58551B48977L5590R1547K59082
17083F35196l6776M1376k96210L718N790k0912a6219C91994K54673j64953j74170
17072C07544K31600k20825k7517M00770j7273q1201p5684J34205k94023Q3158
17062D40754J75838q891j88409j2095J01552o9405A94293J72829K89461o7686
17052E88897j53508j1874J80873j8440B73894L23944n1204P9462n9390k25015
17042C41691J76934k8545J00054j55370n9662J51465q9130M10495m16905L593
17032D34620K20842k4142k8057J82029C07888N01469k67659j08864K70460l26109
17022C77185K04168l522J40315P0055Q309C49172j0634M39571J04626k20746R111
$$ plain form
17093 420695 433344 392422 381395 541549 316083 574634 248977 284567 376114 635196
17083 635196 598420 639796 343586 347304 353094 332182 -16219 391994 646667 481714 307544
17072 307544 539144 318319 290802 691572 674299 593098 517414 651619 357596 440754
17062 440754 616592 607701 419292 407197 508749 439344 194293 367122 656583 588897
17052 588897 435389 423515 604388 585948 273894 597838 546634 626096 566706 341691
17042 341691 518625 490080 590134 434764 375102 526567 437437 847932 431027 434620
17032 434620 655462 631320 603263 785292 307888 809357 541698 432834 703294 377185
17022 377185 581353 577831 718146 788201 796510 349172 338538 778109 882735 661989 671100
17011F71100p8742j64814J02469J70610j1271n3005K5202B64900O93231o8762
17001H89369C07549M56112J79782C61124K65847j89160K74598J67313p3344j21152
16991F85226R2254q4469J4143p6649Q1217l969l05409M66886o6891l00251K64356
16980G66444Q0876N6571j34513k91280N74168m81046P3308L4035M97875l47091
16970H29347q382o4501J36156L82229l75572p5001M33046k06769k30244j74099
16960F46210K44718R5327r4375o0753K45709j5432k18064K85283k31101K65667
16950A163189m87692L93438j12019K72051m564j41480p3994J704k40702J83351
16940I53282L1885L67951k00127P2987j42913J37456r6075J87626m9585J8991
$$ plain form
17011 671100 592358 427544 530013 700623 689352 636347 661549 264900 958131 889369
17001 889369 307549 763661 943443 361124 626971 437811 712409 879722 806378 685226
16991 685226 777480 693011 707154 630505 711722 707753 402344 869230 802339 502088 766444
16980 766444 847320 903891 769378 478098 1052266 571220 644528 678563 1176438 829347
16970 829347 820965 756464 892620 1274849 899277 824276 1257322 1050553 820309 646210
16960 646210 890928 986255 891880 831127 1076836 1061404 843340 1128623 897522 1163189
16950 1163189 675497 1068935 956916 1228967 1224403 1082923 1008929 1010633 769931 953282
16940 953282 985167 1353118 1152991 1225978 1083065 1220521 1124446 1312072 1262487 1281478
16930A281478q9727k09288M57959o2755J19353l11635R1480j31621k20716J43796
16920A068324P5237M09774j36101j8341K18485l54437j70271N43496P8395l01904
16910A412657L1107P6083K11514n2994m60994L52653J09905m21257k17265L90549
16900A431958j51692M65888K3629M5990J68630l12847R8665K47383l0814l68852
16890A617938J67584N01924l85780j59966M41967Q9612l80410M7263J38732P6592
16880B155456o8952k35338N23496J26921l44594O3924L8226K04412m24187J47234
16870B186598R1556J36428L04377k61884M3857J11713k05263R5575J40592l22012
16860B321537L38660K46605j91990O6721J69138k95004P7295O9233K74593J73196
$$ plain form
16930 1281478 1191751 982463 1440422 1377667 1497020 1185385 1276865 1145244 924528 1068324
16920 1068324 1143561 1553335 1417234 1398893 1617378 1262941 1092670 1636166 1714561 1412657
16910 1412657 1443764 1519847 1731361 1678367 1217373 1570026 1679931 1258674 1041409 1431958
16900 1431958 1280266 1746154 1769783 1815773 1984403 1671556 1770221 2017604 1986790 1617938
16890 1617938 1785522 2287446 1901666 1741700 2183667 2273279 1892869 1940132 2078864 2155456
16880 2155456 2086504 1851166 2374662 2501583 2156989 2220913 2259139 2463551 2039364 2186598
16870 2186598 2278154 2414582 2718959 2457075 2500932 2612645 2407382 2502957 2643549 2321537
16860 2321537 2660197 2906802 2714812 2781533 2950671 2655667 2732962 2802195 3076788 3249984
16850C249984K08624p9001j12329L80779j22019q5901j33419K62375l9068P6301
16840C606326j3675K94906j79681J53663Q4118k11709K73272P9983J21012m8337
16830D159878N8356k12255M53857j07608j9796K51773J77756J17101j42736J56520
16820D892846J59838k453J48984R1646L46161j62667K12718J98344K5445K57271
16810F168133K65166j6430J31655L25152M909P9995J86074j1453J57428J80360
16800G470989j6260L03542L64829K18598J26592j87178M68385K51299J42671L42303
16790I485770K68728N26697q7223K42848K03964M15603N56192J5866N19487J85239
16780A2333171J45657M60542O56424O55748Q4242O75075K69640L68962M64209
$$ plain form
16850 3249984 3458608 3379607 3267278 3648057 3526038 3440137 3306718 3569093 3530025 3606326
16840 3606326 3592651 3887557 3707876 3861539 3945657 3733948 4007220 4087203 4208215 4159878
16830 4159878 4218234 4005979 4459836 4352228 4332432 4584205 4761961 4879062 4736326 4892846
16820 4892846 5052684 5050231 5199215 5290861 5637022 5474355 5687073 5885417 5910862 6168133
16810 6168133 6433299 6416869 6548524 6873676 6878585 6958580 7144654 7133201 7290629 7470989
16800 7470989 7454729 7758271 8123100 8341698 8468290 8281112 8749497 9000796 9143467 9485770
16790 9485770 9754498 10281195 10193972 10436820 10640784 11056387 11612579 11628445 12147932 12333171
16780 12333171 12478828 12939370 13595794 14251542 14335784 15010859 15280499 15649461 16113670
16771A6113670P55436N59507N90055O79077P17762M53575P56762J200619N51988
16762B2378451J178273N72183J071082P93109J417680J034283J071131J659401
16754C1175593J331235J366836J350303K027809J274021K104747K608024J923853
16746D5162421K400530K516735K782712K787016L241860L956399L341995L787833
16738F9977501M293066M614289N239630N300256N507819O323685O478791P229882
16730A14964919P718751P837912Q671389Q740131Q829745R044234R629263Q502683
16722A83939027Q666434Q231352O462169N670620M264515K790365J031971o88048
16714B20368405k455449l594235n732913o679021p930604q427827q762368r531825
$$ plain form
16771 16113670 16869106 17428613 18018668 18697745 19415507 19869082 20625844 21826463 22378451
16762 22378451 23556724 24128907 25199989 25993098 27410778 28445061 29516192 31175593
16754 31175593 32506828 33873664 35223967 37251776 38525797 40630544 43238568 45162421
16746 45162421 47562951 50079686 52862398 55649414 58891274 62847673 66189668 69977501
16738 69977501 74270567 78884856 84124486 89424742 94932561 101256246 107735037 114964919
16730 114964919 122683670 130521582 139192971 147933102 156762847 165807081 175436344 183939027
16722 183939027 192605461 200836813 207298982 212969602 217234117 220024482 221056453 220368405
16714 220368405 217912956 214318721 208585808 201906787 193976183 185548356 176785988 167254163
16706A67254163r088495r022819r408129q609628q407027p963619p541746o497320
16698A00715380o337560o057243n590193n061643m513996m921604l860737l680006
16690F0692398l577374l229871l124226k404709k930180k168066k343494k236685
16682C8677793j661559j703657k313995j617561q49308j535404j181579j303055
16674B6511675j006185j492391n84871j243665q59129j020541l79942p26679j058292
16665A8139980k72467r64895m29928n05702j016518k84928k01933m60985o91980
16656A3310644m75375l59941k01646m94787l82080n97424O0863p16476p6950l94550
16646I672278Q9297p29309j08197m9363l38915m45527j64194l19315n4134k27211
$$ plain form
16706 167254163 158165668 149142849 139734720 131125092 122718065 114754446 107212700 100715380
16698 100715380 94377820 88320577 82730384 77668741 73154745 68233141 64372404 60692398
16690 60692398 57115024 53885153 50760927 48356218 45426038 43257972 40914478 38677793
16682 38677793 37016234 35312577 32998582 31381021 30531713 28996309 27814730 26511675
16674 26511675 25505490 24013099 23428228 22184563 21325434 20304893 19924951 19198272 18139980
16665 18139980 17867513 16902618 16472690 15966988 14950470 14665542 14463609 14002624 13310644
16656 13310644 12835269 12475328 12273682 11778895 11396815 10799391 10860254 10143778 10066828 9672278
16646 9672278 9761575 9032266 8924069 8874706 8535791 8090264 7926070 7606755 7552621 7325410
16636G325410N9375j69132l26440M004l16695j38685r1171j03908r7668j55335
16626E989755l22453J98532k93081l59496J30634m6006r4540m57380K5948n3139
16616D718774K83643o19036Q5409j46547k19936k57802J32683M04642n09422j25219
16606C747189J13449k09154K9162n7160r4430k38188o9893j42591L07411j89279
16596C196516l53251K70869k13186K65750l12770l50910L98049q2532r5086k06162
16586B517287M4794j68560J9945K29843q9363n00665L18518j20778P1150K8100
16576B350271k83018Q5707M2069Q7700j39179O6977k39352K52696p9953L725k23709
16565A923934L0116n4039j68967K49022l70010j6464L34127r0943j79566O2285
$$ plain form
16636 7325410 7384785 7215653 6889213 6893217 6576522 6437837 6346666 6242758 6145090 5989755
16626 5989755 5667302 5865834 5572753 5213257 5343891 5297885 5203345 4745965 4771913 4718774
16616 4718774 5002417 4383381 4468790 4322243 4102307 3844505 3977188 4381830 3872408 3747189
16606 3747189 3860638 3651484 3680646 3623486 3529056 3290868 3220975 3078384 3385795 3196516
16596 3196516 2843265 3114134 2900948 3166698 2853928 2503018 2901067 2818535 2723449 2517287
16586 2517287 2562081 2393521 2413466 2643309 2553946 2053281 2371799 2251021 2322171 2350271
16576 2350271 2067253 2152960 2195029 2282729 2143550 2210527 1971175 2223871 2143918 2147643 1923934
16565 1923934 1954050 1900011 1731044 1980066 1610056 1593592 1927719 1836776 1657210 1719495
16555A719495k79002L19694J90978k23918j85877j67656J19690n7902k12255K56337
16545A479584k32837M33352J04759o91072J88087J4904J91259m52196J49941L11502
16535A497283j86149l98848M02059l06051N8177L04072k02208m50560L56494n19304
16525E54965O24921q0341L15818j71363m45595L42613J05248N8419r6443Q1071
16515A289313o2270l67388j76028K37295o0449q1067L04331Q3832j32007P0259
16505A105821l0009j64250k44625J19969J27254K5434l62560L05719k78215K04699
16495H09237k4789K38477m86986M49160j26326j00568m8439J0515j58697J22202
16485F83786l4638R6039O2L08847D13768K56415M8517O1951j68222J60194p6521
$$ plain form
16555 1719495 1440493 1760187 1951165 1727247 1541370 1373714 1493404 1435502 1223247 1479584
16545 1479584 1246747 1680099 1784858 1093786 1281873 1296777 1488036 1035840 1185781 1497283
16535 1497283 1311134 912286 1314345 1008294 1066471 1370543 1168335 717775 1074269 554965
16525 554965 1179886 1099545 1415363 1244000 798405 1141018 1246266 1304685 1208242 1289313
16515 1289313 1227043 859655 683627 920922 860473 779406 1083737 1167569 1035562 1105821
16505 1105821 1075812 911562 666937 786906 914160 939594 577034 882753 604538 809237
16495 809237 784448 1022925 535939 985099 858773 758205 709766 720281 561584 683786
16485 683786 649148 745187 745249 1054096 413768 670183 718700 780651 612429 772623 696102
16474F96102J70556j90271j76739M49642l32347M01690m14266k382q0556P7008
16464E98437k95860M57993j39396j76497K68003q8332K45735B36534L05990j1948
16454E30576A08603M26357j08194L25073j40129j91047K12554l00612J40582m8439
16444D24748R883P8561m6385J8845J06169A95202L10779k36338J97534K1810j15480
16433C73507R3233m8804J2994q4129G6410N88147B33060J41685k754l8988J61778
16422D94781j30828L5448A99062J55479M8351A86332K45999J7283n5713n28J03489
16411D96862l9242R7528B32592L23789j6235J32961A23073K0198K30493a01106
16400B93268o3000J640m8626N17952C43797J0340K09794r4309j78757J25691k4262
$$ plain form
16474 696102 866658 676387 499648 949290 616943 1018633 604367 601985 521429 598437
16464 598437 302577 760570 621174 444677 712680 624348 870083 236534 542524 530576
16454 530576 108603 534960 426766 751839 611710 420663 633217 332605 473187 424748
16444 424748 434631 513192 466807 485652 591821 195202 505981 269643 467177 488987 373507
16433 373507 466740 417936 430930 346801 76410 664557 233060 374745 371991 333003 494781
16422 494781 363953 399401 199062 354541 402892 186332 432331 449614 393901 393373 496862
16411 496862 457620 555148 232592 556381 540146 673107 123073 143271 373764 -101106
16400 293268 230268 231908 183282 701234 343797 354137 563931 469622 290865 416556 392294
16389C92294A00351L34982j01201D9973B1214N57896B02000Q6049Q6936n9503
16379C15482L2940j66179D8575M0795L78469k22764F8877J41280J3113d6941D09130
16367A40285J67153j40052J28931J257d2685C69631Q0392j90944k9915a9867B93658
16355C67934A45651J62678n7037a124E39125B29281j684o4664M078P5824N20477
16344G63312D1303L12141F1656M20391A43178k2468K26212I5986A3565K01800
16334B15365F0122J93647j03497J18790J23425a38279A19487M64121B83066E7360
16323b70536A14024J24880I3758c3449A8582f2817D52267b6482A38504K00441
16313C38945G408b1259F2675c3923G8373M16978E0699i733j2301j16400C9109
$$ plain form
16389 392294 100351 435333 334132 49973 21214 579110 202000 288049 374985 315482
16379 315482 348422 182243 48575 89370 467839 245075 68877 210157 223270 -46941 409130
16367 140285 307438 167386 296317 297574 -42685 369631 450023 259079 229164 -19867 293658
16355 367934 145651 308329 251292 -1124 539125 229281 227597 162933 167011 242835 763312
16344 763312 41303 353444 61656 482047 143178 120710 346922 95986 13565 215365
16334 215365 60122 253769 150272 269062 392487 -138279 119487 583608 283066 57360
16323 -270536 114024 238904 93758 -33449 18582 -62817 452267 -26482 138504 338945
16313 338945 7408 -21259 62675 -33923 78373 495351 50699 -9733 -22034 -138434 39109
16301b43524F0938R7571Q3683M1287m3792b6437C72493J7772o2074F1608K05615
16290B67223j6157l9387d4291C12526F2342e4132B53102J16117A13106B3996J64736
16279A88732p8225m8158M2604a60565B05727E6347n901K2355p144L9193K07392
16268C12242A38505b59997B43456C9144a74242A34029L5398E3082L04945D4576
16257B29901E4514J61468a3752B94948K4415A02874b33856h2042B21389K6612
16247B48001K2524A31251K75532j92391D6678a10217A85430K63202B22259k7711
16237A94548J41517b3160B28812q7671E0434l662a3752A07714a9279A60754k9960
16226A30794E6023L2423J15050b8993F4377K90207f1151o0680k9790A51275J32567
$$ plain form
16301 -243524 60938 158509 242192 283479 239687 -26437 372493 390265 328191 61608 267223
16290 267223 251066 211679 -44291 312526 62342 -54132 253102 369219 113106 23996 188732
16279 188732 110507 62349 104953 -160565 205727 56347 50446 72801 65657 104850 312242
16268 312242 138505 -259997 243456 39144 -174242 134029 169427 53082 358027 44576
16257 229901 54514 215982 -13752 294948 319363 102874 -233856 -82042 221389 248001
16247 248001 270525 131251 406783 214392 46678 -110217 185430 448632 222259 194548
16237 194548 336065 -23160 228812 141141 50434 46772 -13752 107714 -19279 160754 130794
16226 130794 56023 88446 203496 -28993 64377 354584 -61151 -121831 -151621 151275 283842
16215B83842a77666l134Q3051o6793B33577a2229C71664j34544d6466C9629e8538
16203A56097J40800d236r1430E8904J97669a59676b3182j87381C45278A40998
16192H5748f1459J3278k8660L931D5744a25480F0198H509Q7466J4041a26606D071
16179G4789K3563A8346Q7546D0318e9253K8282f316A37213b05187B49271b1806
16167F0239J12590K91724A08066a35326j85031A62673G7841B5886J72142e8818
16156a20296k2483l13712a21230B20981L1788D1866f3409n8283A09287g7149H4235
16144A15277a25687A21941r593g2182A54297a03544A99121d5084A81464c45876
16133b149B2282J79611H7546d9706j56312A2073c0605A40681e502m8180j965k07867
$$ plain form
16215 283842 -177666 -180800 -97749 -164542 233577 -12229 371664 237120 -46466 39629 -58538
16203 156097 296897 -4236 -95666 58904 256573 -159676 -23182 -210563 345278 140998
16192 85748 -61459 -48181 -76841 -72910 45744 -125480 60198 8509 95975 110016 -126606 4071
16179 74789 98352 18346 105892 40318 -59253 -30971 -6316 137213 -205187 249271 -21806
16167 60239 172829 464553 108066 -135326 -320357 162673 77841 25886 198028 -58818
16156 -120296 -142779 -456491 -121230 220981 252769 41866 -63409 -121692 109287 -77149 84235
16144 115277 -125687 121941 112348 -72182 154297 -103544 199121 -45084 181464 -345876
16133 -2149 22282 201893 87546 -49706 -206018 12073 -30605 140681 -5502 -53682 -55647 -263514
16121b63514J01652M5337B9646a13440H4853g4924g891A79064j1272P2919a42210
16109A33375J25221b96412g5793b2351k5442j62059A60320b65489C6235a94366
16098a54966I7406K9169a54824j85572a19079j08865j21943h7594j19012K6951
16088a79655B90384b1559j32763A56521n5094n050h7567A10181c50996B7346a83532
16076b6389p7451K7159E1649a59997B23570j05046E1735a5803B54750a08839j27054
16065b35893I4665a34916o8909B9125f2405B74989B6629P7949a93956F3969L5081
16054I9050J63653p6564a51132A26562b86039E0883a45214B35997b7019A12548
16043c39814J51361B31994q9388a30459m9831c9854k56217H5928b2281j33969
$$ plain form
16121 -263514 -161862 -116525 29646 -113440 84853 -74924 -7891 179064 167792 240711 -142210
16109 133375 258596 -296412 -75793 -22351 -47793 -209852 160320 -265489 36235 -194366
16098 -154966 97406 126575 -154824 -340396 -119079 -227944 -349887 -87594 -206606 -179655
16088 -179655 290384 -21559 -154322 156521 101427 96377 -87567 110181 -350996 27346 -183532
16076 -26389 -103840 -76681 51649 -159997 223570 118524 51735 -15803 254750 -108839 -235893
16065 -235893 94665 -134916 -203825 29125 -62405 274989 26629 104578 -193956 63969 99050
16054 99050 262703 186139 -151132 126562 -286039 50883 -145214 235997 -27019 112548
16043 -339814 -188453 231994 142606 -130459 -180290 -39854 -296071 85928 -22281 -156250
16033a56250A16703a1831c528C24334b35574A79781a09311A76812c16751i4364
16022b14483h5126G1335J29490n0322D2473J34823a77061h6132k8354K6254k12220
16011c00452K5898a16470k71907a22222C6179D496a87079b1914I5477b38482h057
15999b87606i0048D42e6613F5986N2427b64833J23696k8296M3376B4986j1749
15988A3237i3844M2578a9909q2098G5895J3357M10468j83183J0761q3776j515
15977B42007c6824D51111j66186e9309K4356l1535Q814F1449A5190c2176a403
15965A12280K406J08803C7238c5321B85041I9492K53176j15333B4385g3728B58743
15953B377K32340I8975J36659I2344a02754I6020h7962j72735G2542a30544j0968
$$ plain form
16033 -156250 116703 -11831 -3528 324334 -235574 179781 -109311 176812 -316751 -94364
16022 -214483 -85126 71335 200825 150503 42473 177296 -177061 -86132 -114486 -88232 -300452
16011 -300452 -274554 -116470 -388377 -122222 36179 4496 -187079 -21914 95477 -238482 -8057
15999 -287606 -90048 442 -56613 65986 118413 -264833 -141137 -169433 -126057 24986 13237
15988 13237 -93844 -51266 -19909 -102007 75895 89252 499720 316537 327298 243522 242007
15977 242007 -36824 451111 284925 -59309 -34953 -66488 -57674 61449 15190 -32176 -1403
15965 112280 114686 223489 37238 -35321 285041 99492 352668 237335 24385 -73728 258743
15953 2377 234717 98975 235634 92344 -102754 96020 -87962 -260697 72542 -130544 -141512
15942a41512D3600J89811n2884b33281l0871a15051j79586A79515M6614D3326
15931a48559d9802j86677a5682l37062Q5136G4615a98100m6739c3199I21a17904
15919b76277p323H3150L23608i2651A23067f1198j03159P694E57113b00795R651
15908a91144h3616C12355a68124j21300B14031I7807b26583c0342G2472a86765
15897A47188a95387a1681A16015a44716A64838b2651k3117J5430j19516l2387
15887a82241e2317C2096Q3099n0459a26265N444L2215c6094k12485n5828c4386
15875A45837j8796n0751C0645b33057q4919M0517a38352k66914m3007c1942j50706
15864a82648A20016m0024a61500p8379N5729B46803d05367c1202B66921b0125
$$ plain form
15942 -141512 43600 233411 180527 -233281 -264152 -115051 -294637 179515 226129 43326
15931 -148559 -49802 -236479 -15682 -352744 -267608 74615 -198100 -244839 -33199 921 -117904
15919 -276277 -283600 83150 406758 -92651 123067 -61198 -164357 -156663 557113 -200795 -191144
15908 -191144 -83616 312355 -168124 -289424 214031 97807 -226583 -30342 72472 -186765
15897 147188 -195387 -11681 116015 -144716 164838 -22651 -45768 -30338 -149854 -182241
15887 -182241 -52317 32096 115195 64736 -126265 -120821 -88606 -36094 -248579 -304407 -34386
15875 145837 127041 76290 30645 -233057 -317976 -277459 -138352 -405266 -448273 -31942 -182648
15864 -182648 120016 79992 -161500 -239879 -184150 246803 -405367 -31202 266921 -20125
15853I8647c54280K0173l14322H4717j0625E156K3357O1463a17509B7461c01652
15841b91407A87141a18906B621P3637h7159j54054p1383a15202D11279H9724b79259
15829g8352k48232a45825B6223J07781e0092j05934g4977A45062a99909N6869
15819a43040B99816b47963G2850B6250d6451j02507d945B11762i0937q1973G0430
15807a93489j50348O4673J23766a7406k5176k41619a30416I4647P2167K6044G5734
15795a27221A04606b6119l0303k45702a05505B32331c67972B76630A29283o2323
15785F6960J07185d8540B74700f5833j62736P5408o2143C2162M04315G5368M7752
15774A23120m6495L17764A0500J0471a69543A61149a90904P0702D6181a08439
$$ plain form
15853 98647 -354280 -334107 -648429 84717 74092 5156 28513 89976 -117509 27461 -301652
15841 -291407 187141 -118906 2621 76258 -87159 -241213 -312596 -115202 411279 89724 -279259
15829 -78352 -326584 -145825 26223 134004 -50092 -156026 -74977 145062 -199909 -143040
15819 -143040 299816 -247963 72850 26250 -46451 -148958 -4945 211762 -90937 -172910 70430
15807 -193489 -343837 -279164 -155398 -17406 -42582 -284201 -130416 94647 166814 192858 75734
15795 -127221 104606 -26119 -56422 -302124 -105505 232331 -367972 276630 129283 66960
15785 66960 174145 -48540 274700 -65833 -228569 -153161 -215304 32162 436477 75368 123120
15774 123120 76625 394389 10500 20971 -169543 161149 -190904 -120202 46181 -108439
15763c57931k1950a42975b7206j84605A50760J07907b0351j42583A92114g6279
15752H7833B7485M3836a56025o9082C6717J38821k2066J13695f059E9575i1308
15740A92185n9150b77047J4230J09068C7857a3377B4803f4173q1562A39228e176
15728a81598j36734A73122a85180A72796J05311f3595j45265j92878a00128I7848
15717A87247a80480d7876l8373k92022a35293c0258G657f0388G8147B5472b34490
15705d694l91995a43171G767J63146C6291a11308m5799D7831J60801O2309h7949
15693B14422c57476E1672O1711e1920q2560A08041C2814K295N2180P7353d8067
15681A56319J9683b21444b4746k53265C41843h7959A24065C2341P5184K0262c9267
$$ plain form
15763 -357931 -379881 -142975 -27206 -211811 150760 258667 -20351 -162934 192114 -76279
15752 87833 27485 71321 -156025 -225107 36717 175538 153472 267167 -6059 59575 -91308
15740 192185 133035 -277047 -262817 -153749 37857 -13377 24803 -64173 -145735 139228 -5176
15728 -181598 -318332 173122 -185180 172796 278107 -63595 -208860 -401738 -100128 97848
15717 187247 -180480 -47876 -86249 -378271 -135293 -30258 7657 -60388 78147 25472 -234490
15705 -4694 -396689 -143171 7767 170913 36291 -111308 -157107 47831 208632 270941 -87949
15693 214422 -357476 51672 113383 -51920 -134480 108041 32814 35109 87289 164642 -48067
15681 156319 176002 -221444 -24746 -278011 341843 -87959 124065 32341 107525 127787 -39267
15669c25395G8143J02634c6644A22881a44868l8247a3228m12585a22463l7523
15659a59986g0668A44647K07833c3110p5302A61739F6826B2915e5383B13148H2350
15647D7946L2803b27722C30331C0697e8553A27224a48627i410l00694H4945e7250
15635a44695L9074G4850L2730a09904B05048b65025M7313H0799j9240J68854e8853
15623A02407o21L091b24181D02734f6746k3887D0063c07047I4116e1820C1976
15611b25179F1485O2278o0025a00382D84550A56207F2676b90256a35141A02915
15600c64392b1730k77179J28254e7850A91932g0862k43794A53666J13706p2683
15590A94689g5988m4360B4550P6291a5818r5566B359b21592o6778a1536C43830
$$ plain form
15669 -325395 78143 180777 -36644 122881 -144868 -183115 -13228 -425813 -122463 -159986
15659 -159986 -70668 144647 352480 -33110 -108412 161739 66826 22915 -55383 213148 82350
15647 47946 80749 -227722 330331 30697 -58553 127224 -148627 -9410 -310104 84945 -57250
15635 -144695 -105621 74850 107580 -109904 205048 -265025 -217712 80799 61559 230413 -58853
15623 102407 101786 104877 -224181 402734 -66746 -90633 40063 -307047 94116 -51820 31976
15611 -225179 61485 123763 63738 -100382 484550 156207 62676 -290256 -135141 102915
15600 -364392 -21730 -298909 -170655 -57850 191932 -70862 -314656 153666 267372 194689
15590 194689 -75988 -120348 24550 100841 -15818 -111384 2359 -221592 -288370 -11536 343830
15578F5967f8720B63371A19125O7186b60675D6962d9350j50909J3766a8838k0705
15567c9543r5257C18366A11100e3490j65319B98498G4752P4591k3650d32385b10679
15555b3897j5819I8349a05488n4477I5397a66983B03429c15440b5544A48895K3913
15544A72808a01279M1856N066A87468F0440J10043a20122B05036H213d0163k11045
15533b51208E3302c46664a46147d6965C0565a04687D928O8019a97142P2070J9473
15522a05599L9424j49457F1910P2650j0979a23710E9616c02471I0787l4222Q1226
15511A37791h9704C61740a26588H1675B5619a10831l4200B48991r1505i8478A36358
15499c5094j93995A60000n6573J4434a00014j21470C4371c16189h863E8375c50140
$$ plain form
15578 65967 -68720 263371 119125 186311 -260675 46962 -49350 -200259 -186493 -18838 -39543
15567 -39543 -134800 318366 111100 -53490 -218809 298498 74752 149343 125693 -432385 -210679
15555 -23897 -39716 98349 -105488 -159965 95397 -166983 203429 -315440 -25544 148895 172808
15544 172808 -101279 -59423 -54357 187468 60440 170483 -120122 205036 8213 -40163 -251208
15533 -251208 53302 -346664 -146147 -46965 30565 -104687 4928 72947 -197142 -125072 -105599
15522 -105599 -66175 -215632 61910 134560 123581 -123710 59616 -302471 90787 56565 137791
15511 137791 -89704 361740 -126588 81675 25619 -110831 -145031 248991 157486 -98478 136358
15499 -35094 -229089 160000 103427 117861 -100014 -221484 34371 -316189 -8863 58375 -350140
15487f9055G6645h2149B2180Q8917j6704b88020G4488c9084o5202I3108e5837
15475B24791a14307F9644I544b24482c4347r6834E5337e6256J1q0684o7328B9001
15462c61661A05504C8524h9948B51916I3065O9660Q074G1745K49814a62402C847
15450H1357M5844f1531j54603A66353p7528A5456J35805F4919K2528d6403A79080
15438c7621J8631D0752b44061c0398D7655O3886n1789a12000d1713o8271F7415
15426A28432J67394l6696K1381c8795B10241a70872n7191L5240N8193B11706G0083
15414b89216A16192l2829E753K73817a82868B91543C1522M7789a77505j82858
15404c60363a69253b4176r2523C12776b356m7208l1201A3697J99560o2362h5781
$$ plain form
15487 -69055 76645 -82149 22180 111097 94393 -288020 74488 -39084 -104286 93108 -55837
15475 224791 -114307 69644 9544 -224482 -34347 -131181 55337 -56256 -56245 -136929 -204257 29001
15462 -361661 105504 38524 -89948 251916 93065 162725 170799 71745 321559 -162402 3847
15450 81357 127201 -61531 -216134 166353 88825 15456 151261 64919 87447 -46403 179080
15438 -37621 -18990 40752 -244061 -30398 47655 111541 59752 -112000 -41713 -109984 67415
15426 128432 295826 259130 280511 -38795 210241 -170872 -228063 -192823 -134630 211706 70083
15414 -289216 116192 83363 5753 279570 -182868 291543 31522 79311 -177505 -360363
15404 -360363 -169253 -24176 -116699 312776 -2356 -49564 -80765 13697 213257 150895 -85781
15392A58117d6445A06710a93537D7694A3123a59511d898D6358K6662K86702p5610
15381B84112A1585b13183b0032k33700a14476B70309a46613A1844a50724M8351
15371a02373b1631H6018J16963K42802a0277C86633j42049D5055j82K20169C3817
15359d67758c1403a4090k82350a4078B37601j09169n3447a04472E5953N9413L111
15348A18477a18950C01699c744k0814j09867j62631a949C83379D13K42545m4028
15337A98930P4031a60677D1115K66447c5107k5515A17993l0046h5305C73094a41253
15325I4046J36763A1865c1916j81727A36185a23933A41070P5149F1887N0045L20458
15314D32390k03194l1426b16516A40791a45717f6790B00228b32642B17800B5024
$$ plain form
15392 158117 -46445 106710 -193537 47694 13123 -159511 -4898 46358 73020 359722 284112
15381 284112 11585 -213183 -20032 -253732 -114476 270309 -146613 11844 -150724 -102373
15371 -102373 -21631 86018 202981 445783 -10277 386633 244584 45055 44873 265042 33817
15359 -467758 -31403 -14090 -296440 -14078 237601 128432 74985 -104472 55953 115366 118477
15348 118477 -118950 301699 -3744 -24558 -134425 -297056 -1949 383379 413 242958 198930
15337 198930 272961 -160677 41115 307562 -35107 -60622 117993 87947 -85305 373094 -141253
15325 94046 230809 11865 -31916 -213643 136185 -123933 141070 216219 61887 111932 432390
15314 432390 229196 197770 -216516 140791 -145717 -66790 200228 -232642 217800 25024
15303h6358j7672B59448A27885b781B13502r5929L8083A3916P0246k8117K88592
15292C44637H0124g9313l34636J81164a5536C4460L49749G6783j8017a70502f669
15280B96452A7732K5150e8454A04648j0143L70160A41907g6248D09851A30647
15269B72007B7066M12728b09753D04330A78341m3671d45A43947F1699A9377J06690
15258A26067a8589G0769b16252A64032a40663A02258J9408J24731J50493N8571
15248D55461J018347K06768o47884O84123p27919C71752A47816Q6534F1230P5911
15238A37141H22J68876j8484a27256k74325C7549a08119B6531J2206L11501A15617
15226A14309a62237C51365r9285a3224j63644B47772E0228J08214m9228L22725
$$ plain form
15303 -86358 -104030 259448 127885 -2781 213502 117573 155656 13916 84162 56045 344637
15292 344637 80124 -79313 -413949 -232785 -15536 34460 384209 76783 58766 -170502 -6669
15280 296452 17732 42882 -58454 104648 94505 464665 141907 -76248 409851 130647
15269 272007 27066 439794 -209753 404330 178341 134670 -445 143947 61699 19377 126067
15258 126067 -18589 70769 -216252 164032 -140663 102258 121666 246397 396890 455461
15248 455461 1473808 1680576 1032692 1716815 988896 371752 147816 234350 61230 137141
15238 137141 822 169698 151214 -127256 -401581 37549 -108119 26531 38737 350238 115617
15226 114309 -162237 351365 252080 -13224 -176868 247772 50228 158442 109214 431939
15216D31939B12580l4069B4181d9709D88788b4452A23975a88763B59470a3697
15205a0807F2728J35193H5147b93744A80731d5500G59862A8721b05050Q6688A42837
15193b5625B31247c6224I6036C5767J56620K72436k22953C9457J08578a27253
15182h7850G26J98294K76398D7158K40885a80683k1774A90798N2793L26215B24295
15170d66A94893H1479c1884r6559A83384b24265A88955L46820B47170j05458J18675
15159B60387a20204b1674B06356m9326l1836J81756j34777J01689a09109B68635
15148A72128p9925K14870j00347G2668K2892N9805l4948J04779k5652J9310H8039
15136A06728b09339A45669N6539H0718K95776B0275K69156I4251M72751a7355
$$ plain form
15216 431939 212580 178511 24181 -49709 488788 -24452 123975 -188763 259470 -13697
15205 -10807 62728 197921 85147 -293744 180731 -45500 759862 18721 -205050 -118362 142837
15193 -25625 231247 -36224 96036 35767 192387 464823 241870 39457 148035 -127253
15182 -87850 726 199020 475418 47158 288043 -180683 -202457 190798 243591 569806 224295
15170 -466 194893 81479 -31884 -128443 183384 -224265 188955 535775 247170 141712 260387
15159 260387 -120204 -21674 206356 157030 125194 306950 172173 273862 -109109 268635
15148 172128 92203 307073 206726 72668 95560 155365 120417 225196 199544 218854 88039
15136 106728 -209339 145669 202208 80718 376494 20275 289431 94251 567002 -17355
15125A67209P4541k5436o7198N558k73J65819c15478b506I0174J62217b76257
15113I3101O3128a59933A75883H0223O2908l4641j2572a88966H5772k5671N8795
15102A18896R3907J76450A03289J08107G6554f8987C93595c1644D3829R2623B3899
15090A1805a33578C32233M076A34923J42215B9977J63376l7214M1065J61063o04
15079C57663i4203F4164a28981B25813j4865a04466A53240J7678M4435L09744
15069E25097k46695D910J73880q4097a44517C23875d260E79048a9411A50304F9195
15057B69103K04875A60882B4298C276c6217D17744j1294l5660G2220a53436B9867
15045I1497J46905j6890j05512O0540N50116B37723I5073J68634F9067N1371m3682
$$ plain form
15125 167209 241750 216314 149116 154674 154401 320220 -315478 -2506 90174 252391 -276257
15113 93101 156229 -159933 175883 80223 143131 108490 95918 -188966 85772 60101 118896
15102 118896 212803 389253 103289 211396 76554 -68987 393595 -31644 43829 136452 23899
15090 11805 -133578 332233 336309 134923 277138 29977 193353 156139 197204 358267 357663
15079 357663 -94203 64164 -128981 225813 210948 -104466 153240 170918 215353 525097
15069 525097 278402 4910 178790 94693 -144517 323875 -4260 579048 -19411 150304 69195
15057 269103 473978 160882 24298 3276 -36217 417744 406450 370790 72220 -153436 29867
15045 91497 238402 221512 116000 176540 726656 237723 95073 263707 69067 120438 76756
15034G6756K03407j06664C4790O5605M9070K60025j90280d5588D04258A18728
15023E10792k51817I0753J99737j34332M0912O3244I7011J66850J19123G2344
15012C74996K7658G4533E872d3244B48519K16143B07917H3583J81355a08653A10916
15000D16947a7202A82846O2660I6858a10420B38729a057E41653r2861k08703K54215
14989D94304B19072K633b00892A73886L8528q8257J02688K84614k09229c03382
14978C88396a89954F486a25656l2337B42113I909J11363L3450n5271K29688b0283
14966C53053j62512K09523A89035m234J56053R9705A43046J23125P4340M8241
14956C88752m4038O1291K0783A25484L66699B05689q991P3589I3455m3832N2982
$$ plain form
15034 76756 280163 173499 34790 100395 149465 409490 219210 -45588 404258 118728
15023 510792 258975 90753 290490 156158 197070 260314 97011 263861 382984 72344
15012 374996 402654 74533 5872 -43244 248519 464662 207917 83583 264938 -108653 110916
15000 416947 -17202 182846 245506 96858 -110420 238729 -1057 541653 448792 240089 494304
14989 494304 219072 221705 -200892 173886 212414 124157 226845 511459 302230 -303382
14978 388396 -189954 6486 -125656 -157993 242113 9909 121272 154722 99451 329139 -20283
14966 353053 190541 400064 189035 184801 340854 440559 143046 266171 340511 388752
14956 388752 344714 406005 426788 125484 492183 205689 196698 270287 93455 49623 102605
14945A02605J87836I7331M6962J23477K58532A36891J71632d8694D08929g3709
14934C60813o0691J49434j59585J99521K15j36491B3200L0775N09538B40722R7380
14923C38102L2832K54402A70278J31093O9166n5343L07609H7057N33755B49943
14912D66413A48745L94330A03131L01181j48587l0522q2095R0065P8006M7010
14902C58189j06674L54239j69445K40079C34828A35594K71213j65007O6048K37140
14892E44988H5111K38844j55683J27941A46368g0305A54390q871J01891O1439
14882C08849K4105K54230j23015D1550K51529J79260J7581k3324o115k14390N5546
14871C01637r3912K38217j1757K64221A54987M02124j93077M6745J76771P1235
$$ plain form
14945 102605 290441 97331 144293 267770 526302 136891 308523 -48694 408929 -73709
14934 360813 300122 449556 289971 489492 489707 353216 23200 53975 563513 240722 338102
14923 338102 370934 625336 170278 301371 370537 315194 622803 87057 620812 249943
14912 466413 148745 543075 103131 404312 255725 225203 143108 233173 311179 358189
14902 358189 251515 605754 436309 676388 334828 135594 406807 241800 307848 544988
14892 544988 85111 323955 168272 296213 146368 -70305 154390 145519 247410 308849
14882 308849 332954 587184 464169 41550 293079 472339 489920 466596 460481 246091 301637
14871 301637 207725 445942 434185 698406 154987 557111 364034 410779 587550 658785
14861F58785A10520L17792J31128k33922D2633M43813P2106A91429J70341J15560
14851D77330k30881L96046j11235L2266q6537r8945K87787J09657B12353M87722
14841G00075L4032l16604K80485k66703p9775P5436k04282J25220K22631J18404
14831F88919B40251M54186P5397j31331j62825j77812K65785B26656J54857L30069
14821G11582p112k45294q6130J90415j3799K58250n1190p7436k5866n9455l9836
14810E54129j60324l3498K81384j28559J31131L0355R1326q3210j45069B31203
14799C65345M01136C52694R8800l9260J07434L11269j39339l03270L24948j43801
14789E69475L8179K72269l15351J29141m4822m3589B75160K84882L77827k24180
$$ plain form
14861 658785 110520 428312 559440 325518 42633 486446 558552 191429 361770 477330
14851 477330 246449 642495 531260 563526 476989 378044 665831 775488 212353 700075
14841 700075 734107 417503 697988 431285 351510 426946 222664 347884 570515 688919
14831 688919 240251 694437 769834 638503 475678 297866 563651 226656 381513 711582
14821 711582 704470 459176 373046 563461 549662 807912 756722 679286 653420 593965 554129
14810 554129 393805 360307 641691 513132 644263 674618 765944 682734 537665 231203
14799 365345 766481 352694 451494 412234 519668 830937 691598 388328 713276 569475
14789 569475 607654 879923 564572 693713 648891 605302 275160 560042 937869 713689
14779G13689k33005k01846M81072l16113L20961B99069O34423l64888m9455o6337
14769D52812J63313j2997O4860j58766L4122L29181k34213k4953j9653K98095
14759H91801D21084J80810J11382J73943j83207J74771C57071M41946P4461j6483
14749H56995K61699n29599L20612l18848J17137o8475J55329K4707k11037J32500
14739G41020j89532M57450k84417K54566l25121J80638p9392J93590l6203r9231
14729H13368q8428J18810K73981C71223M84328j41988r148J27725j43468j03890
14719E84782J87927L1441K9310j65373L16762k35389K08582k9839K31547k94862
14709H64888K17667p6102r0905j75070J50722R1033P05p4931K07109m73786N22083
$$ plain form
14779 713689 480684 278838 759910 443797 764758 299069 933492 568604 519149 452812
14769 452812 616125 603128 667988 509222 543344 872525 638312 613359 593706 891801
14759 891801 421084 601894 713276 887219 704012 878783 357071 799017 873478 856995
14749 856995 1118694 589095 909707 590859 707996 639521 794850 819557 608520 741020
14739 741020 551488 1008938 724521 979087 653966 834604 755212 948802 912599 813368
14729 813368 724940 843750 1117731 371223 855551 713563 704415 832140 688672 584782
14719 584782 772709 804150 833460 668087 984849 749460 958042 928203 1159750 864888
14709 864888 1082555 1006453 915548 740478 891200 982233 982938 908007 1115116 641330 1163413
14698A163413m22842M44253k25731n7194j33120K83158k22701J71392K29763j98848
14688A031543m54334O52030l28714L14652k20852J32598J904M9404j84k88292
14678H89755J88797j13544o8145l4227J00949N46013n31494R500M2493L15504
14668A345601j99398n6988q3086R6233O0846J26700m8141L01097m72233k2919
14658A047712J66400J74911k36409L06977G05456P48180l1446M507k2001m3923
14648A360773k78661J71010m5376J01805K12K09047k40554K12942q4073j40735
14638A266390K11768Q8412j75563M6801J8623P0386R0178j44793j26122K95507
14628A641587m24310K74640L03061j98655k34113N9391K66893l23150j3176K8276
$$ plain form
14698 1163413 740571 1184824 959093 901899 768779 1051937 829236 1000628 1230391 1031543
14688 1031543 577209 1229239 900525 1215177 994325 1126923 1128827 1178231 1178047 889755
14678 889755 1078552 965008 896863 862636 963585 1509598 978104 987604 1030097 1345601
14668 1345601 1146203 1089215 1006129 1102362 1163208 1289908 1241767 1542864 1070631 1047712
14658 1047712 1214112 1389023 1152614 1459591 705456 1453636 1422190 1426697 1404696 1360773
14648 1360773 1082112 1253122 1207746 1309551 1309763 1518810 1278256 1491198 1407125 1266390
14638 1266390 1478158 1566570 1391007 1437808 1456431 1526817 1616995 1472202 1346080 1641587
14628 1641587 1217277 1491917 1794978 1596323 1362210 1421601 1688494 1365344 1352168 1380444
14618A380444J62027J35576k32688j47121L95911m42161N01197j02463k03522
14609A447200K91196j46894j1495M36535k41227J48699l36169K97166P1975m44607
14599A512379J16392J04257n5519J66253K05259j67075K82236l16396L02619j42620
14589B007785k76768M33648k93686M8305K63341K7891k130M439r5464j96814j72900
14578A747647L96186K24134j14122J79091l1342l52017L54185J58153l4725l51528
14568B175662M45759j5670q3336L8971Q7858R8455O6190j4615K96933l30463O22954
14557C388698l31987J99316J56878J50725O46329M97249N36633J158584K523301
14548H925726M264898R151589J6520838P602107k1901283A1251671n614986k220230
$$ plain form
14618 1380444 1542471 1678047 1445359 1298238 1694149 1251988 1753185 1650722 1447200
14609 1447200 1738396 1591502 1580007 2016542 1775315 1924014 1587845 1885011 1956986 1512379
14599 1512379 1628771 1733028 1677509 1843762 2049021 1881946 2164182 1847786 2150405 2007785
14589 2007785 1731017 2164665 1870979 1919284 2182625 2210516 2208386 2212825 2117361 1920547 1747647
14578 1747647 2143833 2367967 2253845 2432936 2401594 2049577 2403762 2561915 2527190 2175662
14568 2175662 2621421 2605751 2522415 2561386 2649244 2747699 2813889 2799274 3096207 2765744 3388698
14557 3388698 3056711 3256027 3412905 3563630 4209959 4707208 5243841 6402425 8925726
14548 8925726 13190624 22342213 38863051 46465158 24563875 11251671 5636685 3416455
14540C416455q11310p0320K09704l47455k6458m59697L56486q7265J91534J34504
14530B506178P8430m3745j22572K20968k19473M54698l09141N3130L10145l19643
14520B608975J20027m0721M32139k68404J0064l54947N46190Q5234N7409k96555
14510B899411J98747j830j74992J91180Q2507J58418j04182J96183k73668M85140
14500C656914j10638K73554k26466j54277K625k1865K28230R3813k02025K8711
14490C568576M01194l70127L64114m95284K52956M34058K91742j09305k02402
14481D135522J39182j45536K13270Q5018K24999k09868J65439k95286N91401l85010
14471D519131K99163l27249K69004O3064j0315j60016M11449k1874M64474l50226
$$ plain form
14540 3416455 2605145 2534825 2744529 2397074 2370616 1910919 2267405 2180140 2371674 2506178
14530 2506178 2584608 2540863 2418291 2639259 2419786 2874484 2565343 2618473 2928618 2608975
14520 2608975 2729002 2688281 3120420 2852016 2862080 2507133 3053323 3138557 3195966 2899411
14510 2899411 3098158 3096328 2921336 3112516 3195023 3353441 3249259 3445442 3171774 3656914
14500 3656914 3546276 3819830 3593364 3439087 3441712 3419847 3648077 3741890 3539865 3568576
14490 3568576 3969770 3599643 3963757 3468473 3721429 4155487 4447229 4337924 4135522
14481 4135522 4274704 4129168 4342438 4427456 4652455 4442587 4608026 4312740 4904141 4519131
14471 4519131 4818294 4491045 4760049 4823113 4812798 4652782 5064231 5042357 5506831 5156605
14461E156605J19395J5977j34428J18721K64272Q1102j49412Q7759L24780J64740
14451F049511P7695l42201k7986L13362J55785R5923L9603J76846j06266J0211
14441F442483K81640p8169J02098K08913K35171j30067J18857O6478j23432L11696
14431G435668P0165p6006L05076r2740J31179j94099N27886N18411l21688M5805
14421H349657L56792Q2126j91162N30735k59633O64685K7120K005J00499M65270
14411A0128094j73907M4564q1581M53901L93272m637M03809k0450P7641r5524
14401A1125182L55070L05464R5704J88683K58715M24508l84564L01020M42476
14392A3112258L08267j68683M89877L29951K84370R5589K13926J36981M75702
$$ plain form
14461 5156605 5276000 5291977 5157549 5276270 5540542 5621644 5472232 5559991 5884771 6049511
14451 6049511 6127206 5785005 5757019 6070381 6226166 6322089 6361692 6538538 6432272 6442483
14441 6442483 6724123 6645954 6748052 6956965 7192136 7062069 7180926 7247404 7123972 7435668
14431 7435668 7505833 7429827 7734903 7642163 7773342 7579243 8107129 8625540 8303852 8349657
14421 8349657 8706449 8788575 8597413 9128148 8868515 9533200 9560320 9562325 9662824 10128094
14411 10128094 9954187 9998751 9917170 10371071 10764343 10759706 11163515 11143065 11220706 11125182
14401 11125182 11480252 11785716 11881420 12070103 12328818 12753326 12368762 12669782 13112258
14392 13112258 13420525 13251842 13741719 14071670 14356040 14451629 14665555 14802536 15278238
14383A5278238K10300J91302K84714L12584K55357M86760L51498L01078N72637
14374A8244468P5878P78340j03337L90564O24004J76557L06588O58744M26217
14365B1578023K30128N39122M61256P07474M27774N18573N07727N42474N19126
14356B6031677L83814Q60257N90255P77118N66288P70382P38948N61359J383400
14347C2663498K04918J032732R04054R93424R20860J103381Q34892P35529J481944
14338D0875232J055594J240663J068488J228257J548134J175725J561149J543744
14330E1296986J287366J803914K015111J684529J864637K346123J859433K070978
14322F6229077K102646K543757K357114K813840K631980K934508K948728L551006
$$ plain form
14383 15278238 15488538 15679840 15964554 16277138 16532495 17019255 17370753 17671831 18244468
14374 18244468 18320346 19098686 18995349 19385913 20009917 20186474 20493062 21151806 21578023
14365 21578023 21808151 22347273 22808529 23516003 23943777 24462350 24970077 25512551 26031677
14356 26031677 26415491 27275748 27866003 28643121 29209409 29979791 30718739 31280098 32663498
14347 32663498 32868416 33901148 34805202 35798626 36719486 37822867 38657759 39393288 40875232
14338 40875232 41930826 43171489 44239977 45468234 47016368 48192093 49753242 51296986
14330 51296986 52584352 54388266 56403377 58087906 59952543 62298666 64158099 66229077
14322 66229077 68331723 70875480 73232594 76046434 78678414 81612922 84561650 88112656
14314H8112656L008883L670206L729280M112111M025195M508182M518845N151688
14306A20837046N040765N692774N729835O014333O538415P003588P531891P353858
14298A71742505Q334318Q730536Q989334R224579J0487353J0680849J1338882
14291B39528356J1808864J2142480J3269234J3362177J3941399J4218457J4733674
14284C33004641J4749080J5141544J4819890J5141830J4363136J3630369J3111063
14277D33961553J2190428J0362290Q720590O188124J782428n88914j666444j177665
14269D69772390m33597m195182n987885q723203j0177837j1396011j2588413j3702914
14261D02567348j4301448j4661648j5199605j5532131j5388240j5223017j4439334
$$ plain form
14314 88112656 91121539 94791745 98521025 102633136 106658331 111166513 115685358 120837046
14306 120837046 125877811 131570585 137300420 143314753 149853168 156856756 164388647 171742505
14298 171742505 180076823 188807359 197796693 207021272 217508625 228189474 239528356
14291 239528356 251337220 263479700 276748934 290111111 304052510 318270967 333004641
14284 333004641 347753721 362895265 377715155 392856985 407220121 420850490 433961553
14277 433961553 446151981 456514271 465234861 471422985 473205413 472616499 470950055 469772390
14269 469772390 469338793 465143611 459155726 450432523 440254686 428858675 416270262 402567348
14261 402567348 388265900 373604252 358404647 342872516 327484276 312261259 297821925
14254B97821925j3255181j3606153j2864804j2846033j1974621j1198785j0405556
14247B11670792j0168400r785587q661697q301856q050898p642780p204651o860483
14239A44994440o263563n989893n212465n603888n112847m893287m328180m216639
14231A03373678l829457m006530l557401l488278l381660l169943l266332k755582
14223G5918495k766372k314764k523728j875706k316274k181016j839373k295582
14215E7805680j590267j752489j254749j956267j364316j597887j272950j046498
14207D5970257j079777j163951j267610j390917j130973j181613r48595n91327
14199C7215494r99115j003932j042396r30403q07565m25039n50205j185223p51734
$$ plain form
14254 297821925 284566744 270960591 258095787 245249754 233275133 222076348 211670792
14247 211670792 201502392 191716805 183055108 174753252 166702354 159059574 151854923 144994440
14239 144994440 138730877 132740984 127528519 121924631 116811784 111918497 107590317 103373678
14231 103373678 99544221 95537691 91980290 88492012 85110352 81940409 78674077 75918495
14223 75918495 73152123 70837359 68313631 66437925 64121651 61940635 60101262 57805680
14215 57805680 56215413 54462924 53208175 51251908 49887592 48289705 47016755 45970257
14207 45970257 44890480 43726529 42458919 41068002 39937029 38755416 37806821 37215494
14199 37215494 36216379 35212447 34170051 33239648 32432083 32007044 31456839 30271616 29519882
14190B9519882p20719m97867q48942p14215n37404m22167p18581n17324o16168
14181B3926495m53656o44463n43228m19722l19786m15121n49483m18965l75483
14172A9786588n27179K64394p05154q3049o09757m65390l83368m36724R2061m34101
14162A6498321p5547n09493M9754o70337j56985J17162o05958K6868m79177k08358
14152A3986250k79748k28390l02978j88725K23675l68819m38873l18691o9374
14143A2014327k86977k38529l45694J8443q101l0309k62802k58817k37226K3284
14133A0387599l32210Q2399r5836j17647n89690M10918o53264Q3907N3265l53139
14123H876302R3554J7383k52638l72344j88j75466m4415j8317o6591m20769Q7438
$$ plain form
14190 29519882 28799163 28301296 27452354 26738139 26200735 25778568 25059987 24542663 23926495
14181 23926495 23472839 22828376 22285148 21865426 21545640 21130519 20581036 20162071 19786588
14172 19786588 19259409 19523803 18818649 18735600 18125843 17660453 17277085 16840361 16932422 16498321
14162 16498321 16422774 15913281 15963035 15292698 15135713 15252875 14646917 14673785 14194608 13986250
14152 13986250 13706502 13478112 13175134 12986409 13210084 12841265 12402392 12083701 12014327
14143 12014327 11727350 11488821 11143127 11161570 11153469 11123160 10860358 10601541 10364315 10387599
14133 10387599 10055389 10137788 10041952 9924305 9334615 9745533 9092269 9176176 9229441 8876302
14123 8876302 8969856 8987239 8734601 8362257 8362069 8186603 8142188 8123871 8057280 7636511 7723949
14112G723949q1813q8556j03423J43829q7605l35683p0208N7711q7662r879n18303
14101F542357m1993l7177k49819K0058J71709J86819k70611N6777j98846Q691
14091F187965l4838M6381q32949O19124k04211j22286L63591n34268J0106l19614
14081E179001m60J47166j28066J37329k11971j00380r2384r030J58301k80135
14071D799371J41882r8438J28600l16971R9009r5772J4570j51413j99255K62144
14061D583727l722k76715M9751k8885q0660L37593l35681l35016M19882l22754
14051D007520Q0914k40305Q6147q4388j64419M622N3056O2641j54681P4959k71853
14040C454213O3113n7478K5166J9467J4673J10869n8872k36183j20625L59448
$$ plain form
14112 7723949 7642136 7553580 7450157 7593986 7506381 7170698 7100490 7158201 7070539 7060660 6542357
14101 6542357 6500364 6463187 6213368 6233426 6405135 6591954 6321343 6378120 6179274 6187965
14091 6187965 6153127 6199508 5366559 5985683 5781472 5659186 6022777 5488509 5498615 5179001
14081 5179001 5178541 5325707 5197641 5334970 5122999 5022619 4930235 4921205 5079506 4799371
14071 4799371 4941253 4842815 4971415 4654444 4753453 4657681 4672251 4520838 4321583 4583727
14061 4583727 4580005 4303290 4353041 4324156 4243496 4581089 4245408 3910392 4330274 4007520
14051 4007520 4088434 3848129 3934276 3849888 3685469 3690091 3743147 3805788 3651107 3726066 3454213
14040 3454213 3517326 3459848 3485014 3504481 3519154 3630023 3571151 3334968 3214343 3573791
14030C573791l00897l1392J97814k07885p0141n167L55092n09732j32421Q7976
14020B957038j92574m607J85534J58680j47189j63692k20476j58765N12097k09898
14010B716148j86174K57691j25462M221O1536l28866J31321k6114l6577K13873
14000B681597m39857J68140p6721J40991k75534K14312j68516k0507L87308k3447
13990B587766O07537J308177L099033P544650J6997623J4045459j8196924j3970596
13982A4022725n244608k211965j027738q76901k70190n91212k04916j06336o65971
13973B822888K88848k3177m38641J72171l99398L51751k58346M11639n98394r6964
13963B232377P2873J19277j48045l08519P07164k37383j45588l22707M13091j73519
$$ plain form
14030 3573791 3272894 3241502 3439316 3231431 3161290 3156123 3511215 3001483 2869062 2957038
14020 2957038 2764464 2759857 2945391 3104071 2956882 2793190 2572714 2413949 2926046 2716148
14010 2716148 2529974 2787665 2662203 2666424 2727960 2399094 2530415 2504301 2467724 2681597
14000 2681597 2241740 2409880 2333159 2474150 2198616 2412928 2244412 2223905 2611213 2587766
13990 2587766 3195303 4503480 7602513 15147163 32144786 46190245 27993321 14022725
13982 14022725 8778117 6566152 5538414 4661513 4391323 3800111 3595195 3488859 2822888
13973 2822888 3111736 3088559 2649918 2822089 2422691 2774442 2516096 2927735 2329341 2232377
13963 2232377 2305250 2424527 2276482 1967963 2675127 2437744 2292156 1969449 2382540 2209021
13953B209021q0r0546J63049k57581M00064k91587O5674n80211J99522J72789
13943A990114P142k07643j10502K82080M8156M5434j48078p4783J87311j87619
13933A831612j16007L54439m61579K32029m61385M81078M7342k66869K01416j10289
13923A731787k27838K69919j72836J75245j88661O285o4782j8936J74780l9742
13913A645221R6225k22728L09982l8485L5250n27159K02424J02433M2407j42640
13903A502930J58416k18348J99550k95489L22302l99727P09552I45202L11332
13894A256534o716J59986j5839J12391j39148k6828J98861k8059l10123M69374
13884A670433n10319K31385j02143k00916J45948M89859m78117k86781N33087
$$ plain form
13953 2209021 2208941 2118395 2281444 2023863 2423927 2132340 2198014 1617803 1817325 1990114
13943 1990114 1997256 1789613 1679111 1961191 2009347 2054781 1906703 1831920 2019231 1831612
13933 1831612 1715605 2070044 1608465 1840494 1379109 1860187 1907529 1640660 1842076 1731787
13923 1731787 1503949 1773868 1601032 1776277 1587616 1593901 1529119 1510183 1684963 1645221
13913 1645221 1741446 1518718 1828700 1790215 1825465 1298306 1500730 1603163 1645570 1502930
13903 1502930 1661346 1442998 1642548 1347059 1669361 1269634 1979186 945202 1256534
13894 1256534 1249818 1409804 1393965 1506356 1367208 1340380 1539241 1511182 1201059 1670433
13884 1670433 1160114 1391499 1289356 1088440 1234388 1724247 1246130 959349 1492436
13875A492436j26096j66922j12440q5217N62048p18531N18922j6142p0250J27909
13865A405717O9034j72497k67204L5444J29917j67600J07555J5988J42307j71684
13855A126977j79464K51423p2681o8765K71387l60860R7886Q103n920J23021j80155
13844A010952p0354M12691n65768L14999Q569k6853j937K6909J49743L1242j56309
13833A133884j89179k38835K25321M76953m06900J67487k42934n5043L55046m56430
13823G69370J29029L7758Q9405K63430O3437k62251J41999j88778O0479R6559
13813A200437l10757K29095n3016m24308L11970l59441L93528j368k46548p8579
13803F61013M28333l25226M67432l76207K50672j59382k62612M60280m24950q4411
$$ plain form
13875 1492436 1366340 1199418 1086978 1001761 1563809 845278 1364200 1348058 1277808 1405717
13865 1405717 1474751 1302254 1035050 1070494 1200411 1032811 1140366 1156354 1298661 1126977
13855 1126977 947513 1198936 1126255 1057490 1328877 968017 1065903 1074006 1068086 1191107 1010952
13844 1010952 940598 1353289 787521 1102520 1111089 1084236 1082299 1109208 1258951 1290193 1133884
13833 1133884 944705 705870 931191 1408144 1001244 1168731 925797 870754 1225800 769370
13823 769370 898399 936157 1025562 1288992 1352429 1090178 1232177 1043399 1103878 1200437
13813 1200437 889680 1118775 1065759 641451 953421 593980 987508 986140 739592 661013
13803 661013 1089346 764120 1231552 855345 1106017 946635 684023 1144303 719353 634942
13793F34942Q8965K23098K7719o0102j67790L34732l62061J08748j39529K06526
13783H95248K3800j80147K80138q5256K85958o02767j0535M09112N0555k76677
13773G89429j7418Q3136l62673L78853k49592M3907J29396J42698l45j39759O5947
13762H63579r1824J45157K1857j97366J06114l28320P499J7823J75886n0100K43805
13751I14110j96058J26469D02706O0162O1736N35713m47790J53718C23295N62893
13741H86188J1749k92317q9236m5263K23851M8916j67466p3160L42500r1120n6305
13730F98337l9075K39788j17729P2734l66872o0772J41588L4949q5314J49022
13720F66656k25909M20454J1939l20504j52368L09071j29315L59536m54413J34264
$$ plain form
13793 634942 723907 947005 974724 914622 746832 1081564 719503 828251 688722 895248
13783 895248 919048 738901 1019039 933783 1219741 616974 606439 1015551 1066106 789429
13773 789429 772011 855147 492474 871327 621735 665642 795038 937736 937391 797632 863579
13762 863579 771755 916912 938769 741403 847517 519197 526696 544519 720405 670305 914110
13751 914110 718052 844521 402706 462868 524604 1060317 612527 766245 323295 886188
13741 886188 897937 605620 516384 471121 694972 743888 576422 503262 845762 754642 698337
13730 698337 659262 899050 781321 854055 487183 426411 567999 602948 517634 666656
13720 666656 440747 861201 873140 552636 400268 709339 580024 939560 485147 619411
13710F19411j29908j0048K688K53181m727r493j81594J94075k89543p0325J57848
13699E31565M73561l72414l01741K82251l7079K25289C97716J349K17391k32785
13689C83671J19919J82878C12220m492J19979o1892l396j22922K8996J46804J31900
13678E47197k43880M44941k77900L07183j64213j19147J50881L8675j63097J56049
13668F76689N0743k96359M65569C15990L44688l28478M35247A74514J51205J48645
13658D74364P5310j36794J76141B48398m3094O81706l35521q3401j14104p952
13648C46032j22904L49822l1210j25156N7864J64895l4223j5676k68696J65032
13638D85780j80405K19237j11377K0161J91518k01482R7693K49739C53691r1416
$$ plain form
13710 619411 489503 479455 482143 735324 730597 721104 539510 733585 444042 373717 531565
13699 531565 1005126 632712 330971 613222 576143 801432 397716 399065 616456 383671
13689 383671 503590 686468 312220 307728 427707 365815 362419 239497 268493 415297 547197
13678 547197 303317 748258 470358 777541 613328 494181 645062 683737 520640 676689
13668 676689 727432 431073 896642 315990 660678 332200 767447 174514 325719 474364
13658 474364 549674 412880 589021 248398 205304 887010 551489 468088 353984 346032
13648 346032 223128 572950 541740 416584 474448 639343 605120 589444 320748 485780
13638 485780 305375 524612 413235 433396 624914 423432 521125 770864 353691 262275
13628B62275N44230k80929O073k43906K5405M63239l53019L5080P4811k14531
13618C18728L28896l16423k1110J70276B06557m3496M03468r9436m4705j39204
13608B83184A10164L33173M0145n6952j67425J02131j62475M54912Q3683C41659
13597F05445J49215B25586J31438A37483L67165m8255A52204C338J27640K60837
13587C91815K01296B88967K53132j5598J13723B89118K73210B19507n2068L51686
13577E19125j66626j24431M61112C32110r8272C2105M7582M89905G2348M53610
13567E25958l621o7149N7946A70556L51675B17520J80377L950p8839O5113j21947
13556B66174K02676j77629Q2100D9889K62674K85324j49143m8180c1134F38781
$$ plain form
13628 262275 806505 525576 531649 287743 313148 776387 423368 458448 533259 318728
13618 318728 647624 331201 310091 480367 206557 163061 566529 467093 422388 283184
13608 283184 110164 443337 483482 426530 259105 361236 198761 653673 737356 341659
13597 605445 754660 225586 357024 137483 504648 456393 152204 3338 130978 391815
13587 391815 593111 288967 542099 526501 640224 289118 562328 219507 167439 519125
13577 519125 352499 228068 689180 332110 233838 32105 79687 569592 72348 525958
13567 525958 522337 455188 513134 170556 522231 217520 397897 401847 323008 388121 266174
13556 266174 468850 291221 373321 49889 312563 597887 448744 400564 -31134 638781
13545A73156K40284A36161O80630k65757j5017I2381L08305R6142K38921k12750
13535E22999B16837J39067J14116D2882J50078D9623K39136O9035j29143K65434
13525D94085k16153K27994E6518K23404n2566k5r1537M41096B80833a41421e014
13513B96501N4135k7848h364A02255P6312Q2936J00287Q3279B2732O93913k19376
13502D97269R2028B11092N1760J77424A88940J57368J5783r7807a9685E7332N40457
13491E97789q4051j16766Q6082L401A78186K11442K93032j67891A02242k4422
13481G7820a3215m6667E67709A54206J25390P7486a474m7447C52007O2708a80004
13469D40918m8824j41057a61256D30324O119R4713B15411l542d5273B01598i9966
$$ plain form
13545 173156 413440 136161 816791 551034 536017 92381 400686 496828 735749 522999
13535 522999 216837 355904 470020 42882 192960 49623 288759 357794 228651 494085
13525 494085 277932 505926 56518 279922 227356 227331 135794 576890 280833 -141421 -5014
13513 296501 350636 322788 -8364 102255 178567 261503 361790 445069 22732 716645 497269
13502 497269 589297 211092 262852 440276 188940 346308 362091 264284 -19685 57332 597789
13491 597789 513738 396972 483054 486455 178186 389628 682660 514769 102242 77820
13481 77820 -13215 -59882 567709 154206 279596 357082 -1474 -48921 352007 414715 -180004
13469 440918 392094 251037 -161256 430324 436443 531156 215411 211869 -45273 201598 -99966
13457A29594K15511j62234J03829A15023O0999K79253j43024j47518K38823a59888
13446B29531E9498K41677k0254P0917j7771j27632F8636J66215J45743n4030A11915
13434B00264O1697q1717K09697A58623J06895k4157K32057F6603M32240j13895
13424C84948A5750R3780c9169C44263j70006A5492Q4799D6929r325K21598P9840
13413C39042b9075C83046p8148j1446m4463H4485J29005K26607j83236A00465
13402B55879K25847k23319a49833C8865c6310C010K05709K94204a73931B54225
13391B14451N9660A28026K2566M59931D8591B2860M44054g160B30123j14764a23709
13379E4105J67725m4402b3847C98880F7621J73899K40415A17036K29391A37013
$$ plain form
13457 129594 345105 182871 286700 115023 176022 455275 312251 164733 403556 -159888
13446 229531 59498 301175 280921 351838 334067 206435 68636 234851 380594 326564 111915
13434 200264 261961 180244 389941 158623 265518 241361 473418 66603 498843 384948
13424 384948 15750 109530 -39169 344263 174257 15492 100291 46929 37604 259202 339042
13413 339042 -29075 383046 304898 293452 248989 84485 213490 440097 256861 100465
13402 255879 481726 258407 -149833 38865 -36310 3010 208719 502923 -173931 254225
13391 214451 274111 128026 150592 610523 48591 22860 466914 -7160 230123 115359 -123709
13379 54105 221830 177428 -23847 398880 67621 241520 481935 117036 346427 137013
13368B13628J50367K7504N441j49768l8296q1034l7702L06630k5383E9045J49709
13357B08754J61343A41233Q1529L2472J79180l9936C4170J04363b918B16370F8621
13345B08550K89553j56703o7446j36640J69489p8938J36770p4408j0189J38581
13335D18619j99271F6334J11373K23283A11207J48587N0286L20493A27040m3535
13325H3505J43306m8363K27708A64750L46077A52837M8538J91231B5146L49272
13315C74418r9038n8557a39695D63106A00440A9595M2002P2543P1744K153D7668
13303C24312e4060A57064N0904K9361D7269M15491j93046j8101D8894i5993C10476
13291C887K96579m5540e973B79694h1520A0079J83139R2740n4718M8838K05779
$$ plain form
13368 213628 363995 391499 396940 247172 208876 127842 90140 396770 371387 59045 208754
13357 208754 370097 141233 222762 255234 434414 394478 34170 138533 -2918 216370 68621
13345 208550 498103 341400 273954 137314 306803 227865 364635 290227 280038 418619
13335 418619 219348 66334 177707 400990 111207 259794 310080 630573 127040 83505
13325 83505 226811 178448 406156 164750 510827 152837 201375 392606 25146 374418
13315 374418 275380 216823 -139695 463106 100440 19595 61597 134140 205884 208037 47668
13303 324312 -54060 157064 207968 237329 47269 462760 269714 251613 48894 -95993 310476
13291 3887 300466 254926 -5973 279694 -81520 10079 193218 285958 231240 280078 485857
13280D85857j87224j32181D6634J26025l6035J75033J8129j43436L05211f214
13269c0473B71435q2962K344F2914k0611L37194d3423o2990B32542I3213C9716
13257C31647r6368K10029j97757q4134o9010L25477F0327b59358A36977b71001
13246D14865A3725d0890G7673a26513C82285A75474K6906F8892J05289K1066h1503
13234F5250L77077k05999r1621K0331c1099m5532C73638c24557C23593j27831
13224A95762a12087A0799L01380q5259A8968K86829j34749H3327J99752j23391
13214A59688k2360J9027N1826o687a9642B39119R9965j54224b58343B44913D4605
13202D09618a02896A91498F1853K0832a2613j39191A08937a9524A22946J70095
$$ plain form
13280 485857 298633 166452 46634 172659 136624 311657 329786 186350 491561 -6214
13269 -30473 271435 188473 190817 62914 42303 379497 -43423 -106413 232542 93213 39716
13257 331647 235279 445308 247551 163417 94407 419884 60327 -259358 136977 -271001
13246 414865 13725 -40890 77673 -126513 382285 175474 202380 68892 174181 195247 -81503
13234 65250 442327 236328 144707 165038 -31099 -76631 373638 -324557 323593 195762
13224 195762 -112087 10799 312179 226920 18968 305797 171048 83327 283079 159688
13214 159688 137328 156355 208181 201494 -19642 239119 339084 184860 -258343 244913 44605
13202 409618 -102896 191498 61853 82685 -12613 -151804 108937 -19524 122946 293041
13192B93041F5678K3934d8874n83C02971J00112a14948N2966A29523n7725a6932
13180f2943j64969B56215M9215j17892a02785A61109J2069A2938B065O3386J53016
13169B18467j6463A4615L75018a06559B10719i0715b0810A09349J1270b02823
13158B66279F5128a60675A65985J33941j05973B2737L07291A09186K18450a44284
13147B1116a16439b5671K594k71651f5440N767C92519h864j27B19368J25927b7174
13134H9595J62292L3985M1450o0248i5048K527B80291J9147D8380K35721e1990
13122B41240n8038a9680A8515K34188G6750k2116P1561R3664r1766J18279o8163
13111A78209A0134b284q3677c1621A7971a483D19540a75452l07230B11294h1594
$$ plain form
13192 293041 65678 89612 -48874 -49457 302971 403083 -114948 -61982 129523 71798 -16932
13180 -62943 -227912 256215 305430 187538 -102785 161109 173178 12938 2065 65451 218467
13169 218467 202004 14615 389633 -106559 210719 -90715 -20810 109349 120619 -202823
13158 266279 65128 -160675 165985 299926 193953 22737 330028 109186 327636 -144284
13147 21116 -116439 -25671 -23077 -294728 -65440 -59673 392519 -8864 -8991 219368 345295 -27174
13134 89595 251887 285872 327322 267074 -95048 -92521 280291 299438 48380 284101 -51990
13122 241240 183202 -19680 18515 252703 76750 54634 126195 219859 128093 246372 178209
13111 178209 10134 -2284 -85961 -31621 17971 -1483 419540 -175452 -482682 211294 -81594
13099E8388c2169r1891C09592A48698A6626K43509A0678K16665b22159A7561J91321
13088B08882b9431B44727b49114F3684i9080j70513c3229n0434H675d6337I5012
13076F6759J56159E803J73685l5000e650B5893b54902q5106B03598E1280K92499
13065C43779Q1510H1390J31384O908F9751K44473m5241C3174J04347R5008J20283
13054C52812A57637M17080A21035J02501g5934k7029A04255M7478Q9139c0851
13043A00594K07070b1127B17682J20549A33637L0160G3269L08458H189L70724
13033C78913j43887a04447B68796j26841n4411J90567p8517F6331a56300C24196
13022B34423g7989L1835H4225l3663d7249E10390B19774J80342A43184n8059d1972
$$ plain form
13099 58388 -32169 -124060 309592 148698 16626 260135 10678 227343 -222159 17561 208882
13088 208882 -29431 244727 -249114 63684 -99080 -269593 -33229 -83663 8675 -46337 95012
13076 66759 222918 5803 179488 144488 -5650 25893 -254902 -340008 203598 51280 343779
13065 343779 425289 81390 212774 219682 69751 314224 268983 33174 137521 232529 352812
13054 352812 157637 574717 121035 223536 -75934 -102963 104255 151733 240872 -30851
13043 100594 307664 -21127 217682 338231 133637 163797 73269 381727 8189 378913
13033 378913 235026 -104447 268796 141955 87544 278111 199594 66331 -156300 324196
13022 234423 -77989 -46154 84225 50562 -47249 510390 219774 400116 143184 85125 -41972
13010B20637I7146L56474e6361A80365H8379L39702i768m8129B25243G3520R336
12999H2856J59087a25137N1492b2191C13909n1700M876a73315B11163J85523a24719
12987b89411m1606a01482B12497R9263c6287l48317J61066e2411o9401f208E7083
12975D0604J84638g0137l6h356H5728A2757K40042a80297C852c1902A34102a02105
12962f8966E1180f3443A15029J22759H4180f5051E4426i2094E3773P0607l3160
12951I1220k9958r208n402J8358b98360A92642G320J10679C2003a14333j5743
12940a30076N1444A45768K0824k3468b64869A37576M4704b16799I7325L8652J01187
12929B37164a5453A39947J6814h5626A8805K65982b10598l6737n1652B8557K071
$$ plain form
13010 220637 97146 453620 -56361 180365 88379 428081 -9768 -57897 225243 73520 82856
12999 82856 241943 -125137 -73645 -22191 313909 262209 267085 -173315 211163 396686 -124719
12987 -289411 -331017 -101482 212497 311760 -36287 -384604 -223538 -52411 -121812 -6208 57083
12975 40604 225242 -70137 -70173 -8356 85728 12757 252799 -180297 3852 -31902 134102 -102105
12962 -68966 51180 -63443 115029 237788 84180 -65051 54426 -92094 53773 124380 91220
12951 91220 61262 52054 46652 65010 -298360 192642 7320 117999 32003 -114333 -130076
12940 -130076 -78632 145768 166592 143124 -264869 137576 182280 -216799 97325 135977 237164
12929 237164 -15453 139947 156761 -85626 18805 284787 -210598 -247335 -298987 28557 30628
12918C0628K28794L9418f0246k0155B20926J49207A31681J21951b6876o1495D3889
12906C4106K27450b1009A49974J93485H1687c97323f1090j07708H0425b70406
12895a86341D51779G6311b23847C38185G8374c0224E9539h7835C88913a50699
12884A27163j3814A7803c2419A60197q885f1076B51654G3484R790C4409j2621
12873B1788R0497P626E1296P0382a12452G6007K0367J62181m3946b45328B07874
12861B6713b57745L55i9398j51844B32865P5166L3946E1640J16500d9746i147
12849b04092N8989C86917c2802a2587k5028j60695H2427d3951C8583J67611L8370
12838B44564R9187H7733P5765b23405A1948L55297d16893a743p3876k2629j84310
$$ plain form
12918 30628 259422 298840 -60246 -80401 220926 370133 131681 253632 -26876 -88371 43889
12906 34106 261556 -21009 149974 343459 81687 -397323 -61090 -168798 80425 -270406
12895 -186341 451779 76311 -223847 338185 78374 -30224 59539 -87835 388913 -150699
12884 127163 113349 17803 -32419 160197 151312 -61076 251654 73484 83274 34409 21788
12873 21788 112285 119911 51296 121678 -112452 76007 96374 258555 214609 -245328 207874
12861 26713 -257745 -257390 -99398 -251242 232865 308031 341977 51640 168140 -49746 -9147
12849 -204092 -145103 386917 -32802 -12587 -37615 -198310 82427 -43951 38583 206194 244564
12838 244564 343751 87733 163498 -223405 11948 367245 -416893 -1743 -75619 -98248 -282558
12827b82558A00263J61335c1708p7874k35527J71181B32088c57716H1701A8225
12816D68014a4549j462q8555B9757f9648j21515H0254a95421j41914B37288a00908
12804B72182A12268c6445A51856k2920B8438K090J6771a883E2848d71724B0829
12792b6062C742J59178L8482A9372N3802J05557L3753e34604a07257a9816j59314
12781a79130H5800a29435A50559A9665b36641P331A24532K76080b78816e3990
12770h1847D2699h4076A28406J61826F2193B8821K32688r5294g0990D8964R8897
12759A47861K7939b6943G9743b96139G9290J4492B684J2318a15879A88777D5973
12747H7770Q5830a49521Q932C35312A56551g8393B77078a15312A99306o6328a187
$$ plain form
12827 -282558 100263 261598 -31708 -109582 -345109 -173928 232088 -357716 81701 18225
12816 468014 -14549 -16011 -104566 29757 -69648 -191163 80254 -195421 -337335 237288 -100908
12804 272182 112268 -36445 151856 128936 28438 30528 47299 -1883 52848 -471724 20829
12792 -26062 3742 162920 201402 19372 73174 178731 212484 -534604 -107257 -19816 -179130
12781 -179130 85800 -129435 150559 19665 -236641 -229310 124532 400612 -278816 -53990
12770 -81847 42699 -84076 128406 290232 62193 28821 261509 166215 -70990 48964 147861
12759 147861 175800 -26943 79743 -296139 79290 93782 2684 15002 -115879 188777 45973
12747 87770 173600 -149521 -140589 335312 156551 -78393 277078 -115312 199306 132978 -1187
12735H0943M1268M17221R4937B41686a07257D61480b4528j7001C08066B2485b52159
12723a56238N4909A70287a85183F5471a13234B04785j4442c50655h7014B03236
12712a7060A80454g5313I8755J68566a60495B08968J33923A08773L26397B02893
12701E05801k10181r7476r4745B5968h0867G3263P3694c6308n5487k98126C37976
12689F4475e7817n3605m9664A93272b16923B40110b89024J35918N5270C9410b3571
12677A47085L9834J36842e7573a7400A46423K6716m0660R2429j06459E861e99181
12665D71646b46774b2991B07538j4770A4328J19708k036f422C55232j62359b86470
12653c50368I1137a10355j55405C0955a13037B7124c2934q2467e703A72412C9266
$$ plain form
12735 80943 122211 539432 634369 241686 -107257 461480 -24528 -41529 308066 22485 -252159
12723 -156238 -101329 170287 -185183 65471 -113234 204785 190343 -350655 -87014 203236
12712 -17060 180454 -75313 98755 267321 -160495 208968 342891 108773 435170 202893
12701 505801 295620 198144 103399 25968 -80867 73263 146957 -36308 -91795 -389921 337976
12689 64475 -57817 -111422 -161086 193272 -216923 240110 -289024 -153106 -97836 39410 -23571
12677 147085 186919 323761 -57573 -17400 146423 173139 132479 224908 118449 5861 -599181
12665 471646 -246774 -22991 207538 192768 14328 134036 132000 -6422 355232 192873 -286470
12653 -350368 91137 -110355 -265760 30955 -113037 27124 -32934 -115401 -5703 172412 39266
12641B07066J7305B1984J68576P6872a57367B61202d810l8937B82444o6636a12864
12629C14590q5271P2765n6247M181b07570B47366q3576J05066j28772d0140A3256
12617a45069A04477M2526f5817F5767c5464F3403Q7110J1526p0269A4811N3377
12606F8188L2605l4453K30935o5116P6647A49221E5615M46521a73256B92298j19766
12595A72532b7569B44202p9668G1465L44866G1582O824J50726k3681j01740l9482
12584F4229l1340i4600B31885b12814I2621Q4723J3114c3420q1370j40369H6670
12572E6805K5465A4167M884L41095j45959B9645J82427C7111c03394A2015g2704
12560D03387A27852C8799q012K84266A0213O1428N4299K6549J07249E3147d0329
$$ plain form
12641 207066 224371 21984 190560 267432 -157367 261202 -4810 -43747 282444 215808 -112864
12629 314590 229319 302084 245837 250018 -207570 247366 163790 268856 140084 -40140 13256
12617 -145069 104477 147003 -65817 65767 -35464 63403 150513 162039 91770 14811 68188
12606 68188 100793 66340 297275 232159 308806 149221 55615 502136 -173256 292298 172532
12595 172532 -27569 244202 164534 71465 416331 71582 78406 229132 205451 103711 64229
12584 64229 32889 -94600 231885 -212814 92621 177344 190458 -33420 -114790 -255159 86670
12572 56805 82270 14167 19051 360146 214187 29645 212072 37111 -303394 12015 -72704
12560 403387 127852 38799 30787 315053 10213 71641 125940 152489 259738 53147 -40329
12548a59759G4788a10770E1967Q0447A3961b76075g7901o672C9155M75582A23284
12536A98059o0203J87897d76166D43103c07944B952c95914a85205E2279A3539
12525B13520h4732j19702a5600G2058g5942a147A80608p4052e3792D03423j96324
12514B07099k4011h4445l1168B8284b57109B00379C6961a27031A14640P307d6556
12502e4131k27245J26830j4913J9909A32362c81065C3489P2216C2622J09137N5602
12491A97361p7262b46437d4732j5167a7973k243F0429A6318K23427a91100M6372
12480a44728E6590b04781B3820K94068G7749J51683j14423a75754B3741a2727
12469B29822I1448k4709a49070l1392i06H6007J16550g4217A88435A7754K6894
$$ plain form
12548 -159759 74788 -110770 51967 132414 13961 -276075 -77901 -84573 39155 514737 123284
12536 198059 137856 325753 -476166 443103 -307944 2952 -395914 -185205 52279 13539
12525 213520 -84732 -204434 -15600 72058 -75942 -1147 180608 106556 -53792 403423 207099
12514 207099 183088 -84445 -115613 28284 -257109 200379 36961 -127031 114640 121947 -46556
12502 -54131 -281376 -154546 -169459 -149550 132362 -381065 33489 105705 32622 141759 197361
12491 197361 120099 -246437 -44732 -59899 -17973 -20216 60429 16318 239745 -191100 -144728
12480 -144728 56590 -204781 23820 317888 77749 229432 115009 -175754 23741 -12727
12469 229822 91448 66739 -149070 -180462 -906 86007 202557 -74217 188435 17754 44648
12458D4648f615j44307l3496A59061B5969M9230K1587a86855A12580c8035C45983
12446a87537C13537e0730j37830k5344A06946A6367c20267A1366h8192C52177
12435C56114d09126a43264B70681c15397A11263c77208a21589a9009k13395N9490
12425a72914D03442E5716a76645E449a84524D307a25009c3022A25807b61755G2371
12413B05670a38410A02205b59678j4467A82555b63136B19821p8205i1463I639
12402B6131J47572F6187K34551h2771A37478R8779q9915p1304a65005C1067a99506
12390a51062A51749c7596A11407P7339b5129j66437j42231f3566B16240C7986
12379i7683l28889A78304k3599J79698a22023k33696b0257G2714d2822B16446
$$ plain form
12458 44648 -6615 -150922 -184418 159061 25969 75199 96786 -186855 112580 -38035 345983
12446 -187537 313537 -50730 -188560 -213904 106946 16367 -320267 11366 -88192 352177
12435 356114 -409126 -143264 270681 -315397 111263 -377208 -121589 -19009 -232404 -172914
12425 -172914 403442 55716 -176645 5449 -184524 4307 -125009 -33022 125807 -261755 72371
12413 205670 -138410 102205 -259678 -274145 182555 -263136 219821 141616 -91463 9639
12402 26131 173703 66187 300738 -82771 137478 236257 146342 75038 -165005 31067 -199506
12390 -151062 151749 -37596 111407 188746 -25129 -191566 -333797 -63566 216240 37986
12379 -97683 -426572 178304 154705 334403 -122023 -355719 -20257 72714 -42822 216446
12368A34164B3939P6665a86270M0346A56490g2244c2909k0453A7462J23216l8308
12357A02370c3068p4652r426N0370C11621j39424c01031d5538j17C95032a93252
12345b19991H1676K1225h1775n343f660B39213a37290B08295E411a83612P5003
12334a08609E5184i3331F3901C512c0499m9512A72685j9142L0947a06651C0003
12322c1882l02122A98830d86548J15174A58116M567J34418I7686f33A46098B5841
12310I4965a16004M2761A19819O378c84721I7765b44804A52258b0671k36836A9584
12298a11170C92598A27824R2509i5263C47866C9057K12250M991j2363a36617B4647
12286A69304R8815q8171b02373B25092b47902B2232a41830F0479b8119H2076K05704
$$ plain form
12368 134164 23939 100604 -186270 -145924 156490 -72244 -32909 -53362 17462 140678 102370
12357 102370 -33068 -107720 -117146 -66776 311621 172197 -301031 -45538 -45655 395032 -193252
12345 -219991 81676 102901 -81775 -87118 -6660 239213 -137290 208295 5411 -183612 -108609
12334 -108609 55184 -93331 63901 3512 -30499 -80011 172685 153543 184490 -106651 30003
12322 -31882 -334004 198830 -486548 -371374 158116 162683 297101 97686 -633 146098 25841
12310 94965 -116004 -73243 119819 126197 -384721 97765 -244804 152258 -20671 -257507 19584
12298 -111170 392598 127824 220333 -95263 347866 39057 251307 256298 243935 -136617 24647
12286 169304 268119 179948 -202373 225092 -247902 22232 -141830 60479 -28119 82076 287780
12275B87780n4468I9222M18223k03515C009M51347C5485a95084j36744D6856K14956
12264B61812b28691e7100A81546N3392J76776A35626a9367B1034K26964k9610
12254B18388q13o1572o0361P872L70039G9763e0748A10651J56025a37620B15353
12242B81859A35282B6858J31174J95935a78193a0815H826P8881K88312C657a9808
12230A92933k0286D2076K11174B2064M08172j06077q7529k864J36359J04410a68294
12218B41530L6193l5203n7821R9489A01143l0075c1312A81283J13243R0383j39035
12207B45874F5555j9660J42933F7463K4727J01103e5727D04924j2893E5349J98117
12196B53466N395q631J20485F7947l1782R1778J45122C8769Q6349e3763B28018
$$ plain form
12275 287780 233312 99222 517445 313930 3009 454356 35485 -195084 -331828 46856 261812
12264 261812 -228691 -57100 181546 234938 411714 135626 -19367 21034 247998 218388
12254 218388 217575 156003 95642 103514 473553 79763 -50748 110651 266676 -137620 215353
12242 281859 135282 26858 158032 353967 -178193 -10815 8826 87707 376019 3657 -19808
12230 192933 172647 42076 253250 22064 430236 324159 236630 233766 370125 474535 -168294
12218 241530 277723 242520 184699 284188 101143 71068 -31312 181283 294526 384909 245874
12207 245874 65555 45895 188828 67463 92190 193293 -55727 404924 392031 55349 253466
12196 253466 258861 250230 370715 67947 36165 127943 273065 38769 125118 -53763 228018
12184B99287q9035G9044J48118c79411A21119L38870H7896c05678C1615K38087
12174B69702J36000j2704b03825B23072b0631A6123K02458m5826k3914j4678J19021
12163B53184b06280H5592M8608c83221B51282r2135i1029a6j343G7764B9361J51652
12151A81013b34380L0613b6025B41158j10957a7771j25535A93494n4926m8198
12141I0370b63765M9547H8121M115a085j56324A29019a16496j12731d9591B45692
12129B91960j38159a67582P3304F4009J5583J35925H8307a8942j63102A88860
12118A20705l1478J13463r5240N8125L1000n5544c88476A37258b00590A11737
12107A6955J62040g0129j72515c3048J5282K497A32497a45747G8755b00601a7050
$$ plain form
12184 299287 210252 79044 227162 -379411 121119 459989 87896 -305678 31615 269702
12174 269702 405702 392998 -203825 223072 -20631 16123 218581 172755 148841 134163 253184
12163 253184 -206280 85592 134200 -383221 251282 159147 -91029 -16 -1359 77764 29361 181013
12151 181013 -234380 -203767 -26025 241158 130201 -17771 -143306 193494 138568 90370
12141 90370 -263765 -214218 88121 92236 -1085 -157409 129019 -116496 -229227 -49591 245692
12129 291960 153801 -167582 -94278 64009 79592 215517 88307 -18942 -182044 188860
12118 120705 89227 202690 107450 165575 196575 141031 -388476 137258 -200590 111737
12107 16955 178995 -70129 -242644 -33048 -17766 -15269 132497 -145747 78755 -200601 -17050
12095C46715a93042n33253O3652a6375j89994d4373I4113b9245j79445B84954
12084F6798f6658j47589l01143B23320G1568c2119G7888J18041g0002j34479A68223
12072B31739D2524K66247A09598a79831B98066Q58608M49582p32522E4440J3982
12062F8422a57108A44508M6528q7511g2236B25280C0776a51629j5805B48017a73220
12050F1559K0119A3156P7324d2219a1507D676J263J83697Q6815b44822b6954k33827
12038b60781b9563k91428A50760a18883a3827k7491q1460B12977a15571j05372
12028b20943d8872j80649A03087b95336C3965K21169e4816l6664l1352M350c2971
12016b7578F4708R1634a14691F71i0661K3854J7817j81214J1218A82569O1015
$$ plain form
12095 346715 -193042 -726295 -662643 -16375 -206369 -44373 94113 -29245 -208690 284954
12084 66798 -66658 -214247 -515390 223320 71568 -32119 77888 195929 -70002 -204481 168223
12072 231739 42524 308771 109598 -179831 298066 1156674 1606256 873734 54440 68422
12062 68422 -157108 144508 191036 103525 -72236 225280 30776 -151629 -167434 248017 -173220
12050 61559 81678 13156 90480 -42219 -11507 4676 5939 189636 276451 -244822 -26954 -260781
12038 -260781 -29563 -320991 150760 -118883 -13827 -41318 -122778 212977 -115571 -220943
12028 -220943 -48872 -229521 103087 -295336 33965 255134 -54816 -91480 -122832 -118482 -32971
12016 -27578 64708 156342 -114691 671 -90661 -66807 -48990 -230204 -218986 182569 243584
12005B43584R3733a80764B122K7140L7559e4648K2707A4141J19353J17426c59150
11993C18893a393j01487B42932b00049A5387g3420A72088d36622B976a74369M932
11982a69437a1185A28534K79249h511j06542N3730j83270Q5221c3786A06598c94023
11970a07045C36925c3583j35330A57645d04856J19313F7182J78725B3956N3506
11960G7462O8948D1777c15615A83173L5098F5685c38817D1323M8017b24213R46
11949b23267Q4985d9454A12245a11957A39358k7169m0920J16470c37353a57031
11938b12430c1731A80781b0688E4049L24870c1335A01749N7242A2853R3136b6692
11926b21089E1081a80805k6708A16950a49575j26878o8d1618B50754c2134C6683
$$ plain form
12005 243584 337317 -180764 2122 29262 66821 -54648 -31941 14141 133494 250920 -359150
11993 318893 -1393 -102880 242932 -200049 15387 -73420 172088 -436622 2976 -174369 -169437
11982 -169437 -11185 128534 407783 -8511 -115053 -61323 -244593 -159372 -33786 106598 -394023
11970 -107045 336925 -33583 -168913 157645 -404856 -285543 67182 245907 23956 77462
11960 77462 146410 41777 -315615 183173 218271 65685 -338817 41323 89340 -224213 -223267
11949 -223267 -138282 -49454 112245 -111957 139358 112189 71269 187739 -337353 -157031
11938 -212430 -31731 180781 -20688 54049 378919 -31335 101749 158991 12853 105989 -26692
11926 -221089 51081 -180805 -207513 116950 -149575 -276453 -276521 -41618 250754 -32134 36683
11914a02340B09554J51814b25718l0258Q0555K9320A02327d1150r226E9773e653
11902c26551E3253c17785B86521a18402A17702J3904j0556d5727j4420A56504
11891a06364C58178A18250c54824a39294M6617k09540B3816K51643c6267B587
11880C20758E7412b69702J30727E1217J44116b45542A40001b33169d1262F835
11869a77279j02110F1175R3127F7295B6542P8979i9119A43462a43083C41929b19486
11857H0367P9816A733J77536H6386l9130R8637b93934A85394g6704G6202b07268
11845c43231J59932A03162b47692J13753f4803D6372a00635o1098I2160b45003
11834A54314F5294g8767I7062K1149d6143A3728b88213r3195J29413J21779c8281
$$ plain form
11914 -102340 209554 361368 -225718 -255976 -175421 -146101 102327 -41150 -50376 59773 -5653
11902 -326551 53253 -317785 286521 -118402 117702 131606 121050 -45727 -60147 156504
11891 -106364 358178 118250 -354824 -139294 -92677 -302217 23816 275459 -36267 2587
11880 320758 57412 -269702 -138975 51217 195333 -245542 140001 -233169 -41262 6835
11869 -177279 -279389 61175 154302 67295 26542 105521 -99119 143462 -143083 341929 -219486
11857 80367 160183 1733 179269 86386 47256 145893 -293934 185394 -76704 76202 -207268
11845 -343231 -183299 103162 -247692 -133939 -64803 46372 -100635 -161733 92160 -245003
11834 154314 65294 -78767 97062 118211 -46143 13728 -288213 -381408 -251995 -130216 -38281
11822h0916C953K61472a15145D6963a66343B19523d6547C9395d41712a78442a2600
11810a31589N7485l40774I0577a61240j2239J0283j3661A30263J1899B1913C425
11798D95410C7290a1073F5978a21407L9032B01196G5493b76566h0616j89124D28384
11786A08198a78848B47310C4974c6726B302L15521D5007M7380J38200n9331k973
11775A68283c8137k42244D0779i3726A2792E389b09901C6539b56520A28094e2880
11763a31543D3651a87444B34224e5944k62568a29237k9543l3786c4510o131j7816
11752e8457E1773J77524j03797b11581G6471b20248j29216L1670A10731j5974
11742I4757B5180a56037d438n2495j41915b0279B50814A18825K25565F1204c5407
$$ plain form
11822 -80916 3953 265425 -115145 46963 -166343 219523 -46547 39395 -441712 -178442 -12600
11810 -131589 -74104 -414878 90577 -161240 -173479 -163196 -176857 130263 142162 21913 3425
11798 495410 37290 -11073 65978 -121407 -82375 201196 75493 -276566 -80616 -269740 428384
11786 108198 -178848 247310 34974 -36726 2302 317823 45007 92387 230587 171256 168283
11775 168283 -38137 -280381 40779 -93726 12792 5389 -209901 36539 -256520 128094 -52880
11763 -131543 43651 -187444 234224 -55944 -318512 -129237 -158780 -192566 -34510 -40641 -58457
11752 -58457 51773 229297 125500 -211581 76471 -220248 -349464 -317794 110731 94757
11742 94757 25180 -156037 -4438 -56933 -198848 -20279 250814 118825 344390 61204 -35407
11730c13967J29917h6835k1088A73332a11725q0143h4393d1034l197j54653c3463
11718B92863k65C6801b10452j02246J46519C19818F4356a1119I4427a37709a8022
11706E0049b98566c3265e702D31873B1132J78563n2952a4487A33223l6822J41429
11695B37830b15532N037J0410a6832A308N3740i927B73494E7500j7620O8406b75900
11682A76343r505p2013J67338A6440J9861J82977G7769q012L37193a36366B72775
11670A69473H1080L12362r2423c76409F4589f5754k15906I6113f8640j9945j22823
11659b11408O712A28137a32380C3799J37465J8796a00020C33187h1887B2830M2509
11648F5339f7685B23966B6222J13867F2164c02198B4622K3577Q3759J72117j21792
$$ plain form
11730 -313967 -184050 -86835 -107923 173332 -111725 -191868 -84393 -41034 -44231 -198884 -33463
11718 292863 292598 36801 -210452 -312698 -166179 319818 64356 -11119 94427 -137709 -18022
11706 50049 -298566 -33265 -5702 431873 21132 199695 146743 -14487 133223 96401 237830
11695 237830 -215532 -210495 -200085 -16832 1308 55048 -9927 273494 57500 39880 108286 -275900
11682 176343 166838 94825 262163 16440 36301 219278 77769 69757 406950 -136366 272775
11670 169473 81080 393442 301019 -376409 64589 -65754 -281660 96113 -68640 -88585 -211408
11659 -211408 -204696 128137 -132380 33799 171264 190060 -100020 333187 -81887 22830 65339
11648 65339 -67685 223966 26222 140089 62164 -302198 24622 48199 131958 304075 182283
11637A82283R532Q0552H1772J62639a85502C8995L25158D2478J93053a7358B13150
11625A35709g6754B20993q0378J77134E9807J89590m9600i028A4238L17J7297
11614C1852c6236B01462a04480q5719L0795N2162l3972B64861d030j3801n0675
11603f8506q8368B49685f2534j07743Q1764A55594c1325C76647A10855a86445
11592A19644J37612b28067A80464E328J06209Q6102J09710j41736K20099a10621
11581B29691r0451o9135J6642Q8460a42356d6976C07150c05179P4316F8457J60705
11570B29162j07473B167f8960A51235E0829K72495A11938L28975A69955A7549
11559A87444J74204b70109a13362A80766J51137j57559e6295B10588D4054K09312
$$ plain form
11637 182283 191815 272367 81772 244411 -185502 38995 364153 42478 235531 -17358 213150
11625 135709 -76754 220993 140615 317749 59807 249397 199797 -9028 14238 14555 31852
11614 31852 -36236 201462 -104480 -190199 -159404 -107242 -141214 264861 -4030 -17831 -68506
11603 -68506 -156874 249685 -62534 -170277 -88513 155594 -31325 376647 110855 -186445
11592 119644 257256 -228067 180464 5328 111537 197639 307349 165613 385712 -110621
11581 229691 139240 70105 86747 175207 -142356 -46976 307150 -305179 -230863 68457 229162
11570 229162 121689 2167 -68960 151235 50829 323324 111938 440913 169955 17549
11559 187444 361648 -270109 -113362 180766 331903 174344 -56295 210588 44054 253366
11549B53366B1279D554Q2847J52771f7727c1898E0503J44317E8537L03393a82258
11537B69974F8198J50833j02328b1108B19599j9270P2240R104e4626B81890E5300
11525B5807M8069J81846j19448b66984F7097k9616M21433k00816a42700C15088
11514B61564K4975a33242c7667A61261C8119R3632n7542a58968B29412A8323R7931
11503A16254J979O6458o2899a69802O6178C43698j63462C1371K61229A17173a58139
11491A17289D3713b09386c8752C91181a4608A513J54065g1060B15784d893A03751
11479a83442A19270p789a63621a4873o5872D9490M76367J33986C4436b77796B45505
11467D47796B18605c06693c7993A67926l6120e8901B25235a71142C10683d7084
$$ plain form
11549 253366 21279 4554 87401 240172 -67727 -31898 50503 194820 58537 361930 -182258
11537 269974 68198 219031 116703 -21108 219599 200329 272569 281673 -54626 281890 55300
11525 25807 73876 255722 136274 -266984 67097 37481 458914 258098 -142700 315088
11514 261564 286539 -133242 -37667 161261 38119 131751 74209 -158968 229412 18323 116254
11503 116254 118233 184691 121792 -169802 -103624 343698 180236 31371 292600 117173 -158139
11491 117289 43713 -209386 -38752 391181 -14608 1513 155578 -71060 215784 -4893 103751
11479 -183442 119270 111481 -163621 -14873 -80745 49490 525857 659843 34436 -277796 245505
11467 447796 218605 -306693 -37993 167926 131806 -58901 225235 -171142 310683 -47084
11456B12315f336j83653P9461A13594b4042C0149a36183d7120F4058J25707M3521
11445B33286A05614f7941A36963Q0261p7026O76k2354c3451A18680K41775a443
11433A42993E646a99394C04999o1326b29711D7610J3098K40447F8934J35518N7078
11422B61530j9475g4703b442C9540J41507b78411e1775B77260o4543E8524f8243
11410c7194I999l582c1534j53245j08215g9265C1012f673j25617j21K5667L2037
11398g4707B34015a56640N6804B57039a5931k7416j17383A7245a29581j28920
11388b58501C04655o2986b7718A37854Q1424a46270A38173g5202A53939A4188
11377A680R9955i1021D999M4134M61868A72204J94332G1597Q6010F9386O7090
$$ plain form
11456 212315 -6336 -189989 -110528 113594 -24042 30149 -136183 -47120 64058 189765 233286
11445 233286 105614 -67941 136963 217224 140198 140874 118520 -33451 118680 360455 -1443
11433 142993 5646 -199394 304999 243673 -229711 47610 60708 301155 68934 204452 261530
11422 261530 242055 -74703 -2442 39540 181047 -278411 -51775 277260 212717 58524 -68243
11410 -37194 9999 6417 -31534 -184779 -292994 -79265 31012 -6673 -132290 -132411 -106744 -74707
11398 -74707 234015 -156640 -99836 257039 -15931 -43347 -160730 17245 -129581 -258501
11388 -258501 304655 241669 -27718 137854 219278 -146270 138173 -75202 153939 14188
11377 1680 101635 -91021 4999 49133 511001 172204 366536 71597 157607 69386 136476
11366A36476E3355a88692d9885j34675h160B17842L6489b46432N0451g1048A10470
11354b29602A17469J45637p8014g6920L3361E0968J00287l2608M5025c17805D4165
11342i9996B0531a71419g0749D52552A34452J03355j14595P2156a90339B146b11817
11330C9262a97253g4970C1072a66991A51885p0933h6142k65E7283i4543m52067
11319e46610h1977F0600a56624O6328j13751B863P3959h4452F6319c47220C4829
11307A3113b00354A90276o5635a5707j49679g1485o7409j47149O6857q856D4115
11295B08139c1714k80601J36809C1783M00442e3008k11468O3495b8057H3845l0250
11284E3595c38409q35B71273L7050d6511F2641A061a35126l2791Q243j4663O6808
$$ plain form
11366 136476 53355 -188692 -49885 -184560 -8160 217842 254331 -246432 -195981 -71048 110470
11354 -229602 117469 263106 185092 -76920 -43559 50968 151255 118647 163672 -317805 44165
11342 -99996 20531 -171419 -70749 452552 134452 237807 123212 195368 -190339 2146 -211817
11330 39262 -197253 -74970 31072 -166991 151885 80952 -86142 -86407 57283 -94543 -546610
11319 -546610 -81977 60600 -156624 -90296 -204047 2863 76822 -84452 66319 -347220 34829
11307 13113 -200354 190276 124641 -15707 -165386 -71485 -138894 -286043 -219186 -228042 44115
11295 208139 -31714 -312315 -175506 31783 432225 -53008 -264476 -200981 -28057 83845 53595
11284 53595 -338409 -339244 271273 308323 -46511 62641 1061 -135126 -167917 -159674 -174337 -107529
11272a07529B81755a99340m7638G3827a03148N0607J7703A6259O5360b33709A66377
11260E8252Q6345K2334f7752b868k79679a30683k35022B99126b69594m2571Q0487
11249b31678j25393a55398c5555n0499H1419J18083h256B36314e7002k50715I3012
11237c73568J55508h3744B01631a71850J8808D9617a01774A31001C3283N4586
11227H7869a65297m9455B98109I8164a85056c2399k9170b5714A22420b65619h9782
11215C4025b9028I8084q427J60466a35792d9983j88134L256A50314a43941A12545
11203A1873N2240j0045a06925C51498b84113c899l25229C7291b75562g130j14289
11192a21419g274k67622f4447A71663e8541A98598A0442a69629k46205e1916j47226
$$ plain form
11272 -107529 281755 -199340 -246978 73827 -103148 -52541 -34838 16259 81619 -233709 166377
11260 58252 144597 166931 -67752 -2868 -282547 -130683 -365705 299126 -269594 -312165 -231678
11249 -231678 -357071 -155398 -35555 -86054 81419 199502 -8256 236314 -57002 -307717 93012
11237 -373568 -218060 -83744 201631 -171850 -153042 49617 -101774 131001 33283 87869
11227 87869 -165297 -214752 298109 98164 -185056 -32399 -61569 -25714 122420 -265619 -89782
11215 34025 -29028 98084 89657 250123 -135792 -49983 -238117 -234861 150314 -143941 112545
11203 11873 64113 54068 -106925 351498 -284113 -3899 -329128 37291 -275562 -7130 -121419
11192 -121419 -7274 -274896 -64447 171663 -58541 198598 10442 -169629 -415834 -51916 -199142
11181a99142A36641a07097N1310A48085c70540b5243G8290b0625A53480a4715
11170b1048q0388k29076L3327a37889N2579P166b1950l7189k97784O0453A04231
11158b48509E8647a9288B4912J96792i3288B5163d3999r1282k60377A91494H0396
11146a58765A48244a28727j07577D3713b8858p3424k15256a40635B15680e4722
11135e7653a2973j68650D7369j2700P9561Q6715h0302C02631A12135D5691K13806
11124B59497F8863A7818a39224B192M8565J05492H390c5442A30470c648j22611
11113a26259A96195B0168K62889G8349O5569J30402D1270c980F4351Q758K30821
11102C03930m8121J57189A3832J30015K71845q7228g5682A86894O9367L35696
$$ plain form
11181 -199142 136641 -107097 -55787 148085 -370540 -25243 78290 -20625 153480 -14715
11170 -21048 -101436 -330512 -297185 -137889 -85310 -78144 -21950 -59139 -356923 -296470 104231
11158 -248509 58647 -19288 24912 221704 -93288 25163 -43999 -135281 -395658 191494 80396
11146 -158765 148244 -128727 -236304 43713 -28858 -102282 -317538 -140635 215680 -54722
11135 -57653 -12973 -181623 47369 34669 114230 200945 -80302 302631 112135 45691 259497
11124 259497 68863 17818 -139224 2192 50757 156249 8390 -35442 130470 -3648 -126259
11113 -126259 196195 20168 283057 78349 143918 274320 41270 -3980 64351 73109 303930
11102 303930 255809 412998 13832 143847 415692 328464 -75682 186894 256261 591957
11092E91957k26191L07490j3719A41990J97252j67849o9079L29953j78351K22528
11082D76444q0686a3708D8119J60728M0082I8122N38433j35219j95130J02203
11072D08409I9679J29488J04316M6455J48329A40758j2343L82658j05438L74610
11062G80245A46661K43504L8900o976L74173k08725m2095K10199j04638P5742
11052G26745K66416j50688P552j81797J07063j97493K13192J10926j78700p586
11042G15630o5424J11040J89927j85443k09604J35480J04527j0522l0669q5485
11032F69457K7903J30347l66424J33737N8718Q1824J42609l89650L48934J14552
11022I52007J3931k1784k22807n4178m6619J70727k28001L51321P2828C98793
$$ plain form
11092 591957 365766 673256 659537 141990 339242 171393 102314 432267 253916 476444
11082 476444 395758 -13708 48119 208847 248929 98122 636555 501336 306206 408409
11072 408409 99679 229167 333483 379938 528267 140758 128415 511073 405635 780245
11062 780245 146661 390165 429065 422089 796262 587537 545442 755641 651003 726745
11052 726745 993161 842473 850025 668228 775291 577798 790990 901916 723216 715630
11042 715630 650206 761246 951173 765730 556126 691606 796133 785611 754942 669457
11032 669457 697360 827707 461283 595020 653738 735562 878171 488521 837455 952007
11022 952007 965938 944154 721347 667169 620550 791277 563276 914597 987425 398793
11011E92281M4634n854J41731l04483J26828N1053K09470K75956D26781P9696
11001E06477J54538O9282j16550L38103r9710k14446M4262k43909R8971L15354
10991H52372B69039Q63221r4794k83854M06003K0494L9556k08230L93752n24085
10981H81102L74401J47309N5830j51711K32753N12422Q2838L79087K46858L66389
10971C127278m6758J22059m78515J36689m03053j63159m95160Q4786k54007L65563
10961A995723O6249j91386k2450K64421j35090l04820o0631N760k38154j76371
10951A203251j74841k14159j8420k11453M3410j45707j59072O9897q5234M7394
10941C55066r1723J33635O3501Q755A15090J83153a5711k9798B73785F4957b76947
$$ plain form
11011 592281 636915 631061 772792 468309 595137 646190 855660 1131616 426781 506477
11001 506477 661015 730297 613747 951850 852140 637694 681956 438047 537018 852372
10991 852372 269039 1132260 1037466 753612 1159615 1180109 1219665 1011435 1405187 881102
10981 881102 1255503 1402812 1458642 1306931 1539684 2052106 2134944 2514031 2760889 3127278
10971 3127278 3080520 3202579 2724064 2860753 2457700 2294541 1799381 1884167 1630160 1995723
10961 1995723 2061972 1870586 1848136 2112557 1977467 1672647 1612016 1617776 1379622 1203251
10951 1203251 1028410 814251 795831 584378 627788 482081 323009 392906 307672 355066
10941 355066 263343 396978 460479 469234 115090 298243 -15711 -45509 273785 64957 -276947
10929B88283m7165p8656a18638n9159L5368M5659A86253h0286C03651a95388B55426
10917H1221e8229q3806A63226G1696c7868j43173a0728B4192i5713B57318I1568
10905a85132A34410f1885A97568b0135A98343a74217B8941b58823h9885D5964
10894c5008j14067B38261a98533F3804a0610j09231B4355c8795G8390a26192l9495
10883a65687e8299l272C31109G6256R1469N5363b00205I42b0774H3596Q7545H3044
10870D5609P1528O5770a5861j3599G4314b81947A64974g7896n9292B6146a13488
10858I9484b11431P5711j11468J3290A27928a66668P8465B76766F6237L3114L425
10847A02776k7736J52799A8760d79E0946K5100f0060I5180N1945k4812D8984b71057
$$ plain form
10929 288283 241118 162462 -118638 -177797 -142429 -96770 186253 -80286 303651 -195388 255426
10917 81221 -58229 -142035 163226 71696 -37868 -181041 -10728 24192 -95713 257318 91568
10905 -185132 134410 -61885 197568 -20135 198343 -174217 28941 -258823 -89885 45964
10894 -35008 -149075 238261 -198533 63804 -10610 -119841 24355 -38795 78390 -126192 -165687
10883 -165687 -58299 -61571 331109 76256 167725 223088 -200205 942 -20774 83596 171141 83044
10870 45609 117137 182907 -15861 -29460 74314 -281947 164974 -77896 -137188 26146 -113488
10858 99484 -211431 -135720 -247188 -233898 127928 -166668 -88203 276766 66237 99351 102776
10847 102776 75040 227839 18760 -479 50946 76046 -60060 95180 147125 122313 48984 -271057
10834B17494B2441b7297j07109A54474r909d14616C21662j40000e2802A87866
10823A6749O2679j3892K00323b6194j27992C81136A3154P0954d1031k42670C0434
10811B8232J07521d49518A04620K37571a92408F4993b39219G0910M2624J57497
10801B71031j17652p3629K59692j33721a37105l15218B54678J18590j78606p9464
10791A15198a09290c5175C16208j34956R9775b1228H7410a00636E4674O5464j8123
10780A02015a29140A01409b78959g3585O76j02553Q1116j8495e1214B47538b18785
10768B95029A09530b56398B25206G6297H29h8841j99436A36573c62092O4009a32496
10756f3819B4744J44683a52992d3383a9330B8077R4629n8570m625b10112F5298
$$ plain form
10834 217494 22441 -27297 -134406 154474 144565 -414616 321662 181662 -52802 187866
10823 16749 79428 65536 265859 -26194 -154186 381136 13154 84108 -41031 -283701 30434
10811 28232 135753 -449518 104620 342191 -192408 64993 -239219 70910 113534 271031
10801 271031 153379 79750 339442 205721 -137105 -452323 254678 373268 194662 115198
10791 115198 -109290 -35175 316208 181252 281027 -21228 87410 -100636 54674 120138 102015
10780 102015 -129140 101409 -278959 -73585 -72909 -175462 -94346 -112841 -51214 247538 -218785
10768 295029 109530 -256398 225206 76297 829 -88841 -288277 136573 -362092 -298083 -132496
10756 -63819 24744 169427 -152992 -43383 -19330 28077 122706 64136 59511 -210112 65298
10744B15173a92767L5058b1867k05690B9350a48007M0555d990p4278j03107b8054
10732a55460a7304J649q4911A54061g3090j17145C2953c70180A80601a22027k8234
10721a50261j6728B7242g2097j01242k415H9292b5992A06363n1456f1161k12260
10710b73421J35077B61580a79225J873e5028j15183A34420I315a05517A48365
10699B77560a57019f5055A08044c01818e642q4382A08193b27191e966p8127a0062
10687G4816c9311D1340c34430J62870n3011B6801c3539B17829d9244j51486j88777
10676c89507J49947J18361G2960g176j76273Q9848k06719a19040j49806A55467
10665a71242g2052C5376i8274A54986f9766j9013q2780d2296A45885a60995B60448
$$ plain form
10744 215173 -192767 -157709 -21867 -227557 29350 -148007 -107452 -4990 -79268 -182375 -28054
10732 -155460 -17304 -15655 -100566 154061 -73090 -190235 32953 -370180 180601 -122027 -150261
10721 -150261 -166989 27242 -72097 -173339 -175754 89292 -25992 106363 54907 -61161 -273421
10710 -273421 -138344 261580 -179225 -177352 -55028 -170211 134420 9315 -105517 148365
10699 277560 -157019 -65055 108044 -301818 -5642 -90024 108193 -227191 -5966 -84093 -10062
10687 74816 -39311 41340 -334430 -171560 -224571 26801 -33539 217829 -49244 -200730 -389507
10676 -389507 -239560 -121199 72960 -7176 -183449 -93601 -300320 -119040 -268846 155467
10665 -171242 -72052 35376 -98274 154986 -69766 -88779 -171559 -42296 145885 -160995 260448
10653a93539C67091a5667r9459K4466B75989A19379c9235k7345j45592B3772Q3849
10642A07621c6566A04800d79769i1849A99689g4248q807j91747D98621F5141b14674
10630h4343n2633L2623A62426a23453J7429q3453k8866H6930d06532J58468J02257
10619a45807e7568k2105j4717k25121k834f0100A04884b51662A44155i3584k80975
10608c74559a64478A47143A5069a97313j04086L7047B3083O7882i7523G8951b60795
10596a74279a4113q1820B2020O0313Q5744p6206g2114A81081p4002i3460e387
10584C912b4815k87893f2755o3878b325A10644q688e8518q5523I357K18672P3194
10572C01223j36825b09600F5641b53804F2421e1954l38012J91835R1202J8712
$$ plain form
10653 -193539 367091 -15667 -115126 -90660 275989 119379 -39235 -66580 -212172 23772 107621
10642 107621 -36566 104800 -479769 -91849 199689 -74248 -83055 -274802 498621 65141 -214674
10630 -84343 -136976 -104353 162426 -123453 -106024 -189477 -218343 86930 -406532 -248064 -145807
10619 -145807 -57568 -79673 -94390 -319511 -322345 -60100 104884 -251662 144155 -93584 -374559
10608 -374559 -164478 147143 15069 -197313 -301399 -264352 23083 90965 -97523 78951 -260795
10596 -174279 -14113 -95933 22020 82333 168077 91871 -72114 181081 107079 -93460 -5387
10584 3912 -24815 -312708 -62755 -126633 -2325 110644 101956 -58518 -144041 9357 228029 301223
10572 301223 164398 -209600 65641 -253804 62421 -51954 -389966 -198131 -106929 -88217
10562h8217A76162a66773H931c60228C37439a99555B41078c20465a04945I2423
10551a71881l369O2688j50497G3504A1553K17514r1671R5492d7354k6235A10728
10539a2695A32872a87677g6120r7001N1051A28003a7306j58493G912e3391q5338
10528a38729G0761h0859k7253N2566l09887b7066A21126b56253P6687K412A4900
10516c07332B11736L2435G7689f1273j04312M932P7631A2477b99497A8517K23604
10505B42121b5303B63476n2917q4541E6134g5812q8492C17449A56599a89897c0151
10493c0116j34763A07701a13218k1475G6035C7766a24755A34607A1063J81002
10483A92065a72854C49951O868o4040A26351P9647e0609A80325M6730G6864c46159
$$ plain form
10562 -88217 176162 -166773 8931 -360228 337439 -199555 241078 -320465 -104945 92423
10551 -171881 -175250 -112562 -263059 73504 11553 229067 137396 232888 -47354 -73589 110728
10539 -12695 132872 -187677 -76120 -173121 -122070 128003 -17306 -175799 7912 -53391 -138729
10528 -138729 70761 -80859 -108112 -55546 -365433 -27066 121126 -256253 -179566 -177154 14900
10516 -307332 211736 244171 77689 -61273 -165585 -160653 -83022 12477 -299497 18517 242121
10505 242121 -25303 263476 210559 126018 56134 -75812 -164304 317449 156599 -189897 -30151
10493 -30116 -164879 107701 -113218 -134693 76035 37766 -124755 134607 11063 192065
10483 192065 -172854 349951 356819 292779 126351 205998 -50609 180325 227055 76864 -346159
10471a98078A97520e7775A73968n6219a40959j55406K2708G5839b60558B66647
10460A72109H919b0851A77337a51490j78200E2788h7100q4895J5316r5501e5625
10448b87164g912k4600k88417A18686b69293g1035K4483A2331e9328b5101m7692
10437g2793o6486A86321B2220d24453F0931c8417G816K12763o2241G5185P3800
10426A48985a12130A15395L9166b07254i1205a7869G1813A6988b5231j53010D07368
10414D6452a66401A3399J69011r0681b83609d7520C42503b876B91794f5799A72147
10402H1262b41490B9265e10962B71778a1931A57084b53352E05258b74777i9913
10391B99496a01167k40377C86288A75769b31338A8880L17973l6511l0316r8960
$$ plain form
10471 -198078 197520 -57775 173968 117749 -140959 -296365 -273657 75839 -260558 266647
10460 172109 8919 -20851 177337 -151490 -329690 52788 -87100 -171995 -156679 -252180 -55625
10448 -287164 -7912 -32512 -320929 118686 -269293 -71035 -46552 12331 -59328 -25101 -72793
10437 -72793 -139279 186321 22220 -424453 60931 -38417 7816 220579 158338 75185 148985
10426 148985 -112130 115395 154561 -207254 -91205 -17869 71813 16988 -25231 -178241 407368
10414 46452 -166401 13399 182410 91729 -283609 -47520 342503 -2876 291794 -65799 172147
10402 81262 -241490 29265 -510962 271778 -11931 157084 -253352 505258 -274777 -99913
10391 299496 -101167 -341544 386288 175769 -231338 18880 336853 300342 270026 171066
10381A71066n7684M236J06402L8579D869J76492O7016J84588A43711m0798L3623
10370A36536N40012A99325Q7155A30338P1556J93601j09501G9822l1828L28766
10360C76760J82982k28211A08640J39473E287J59929d9382D04685k5575K18639
10350E97749J17931j70642k0336j25006L1074A15208L52193j53472P8159A43976
10339C74064i3995C54984R9061I3164K08366j0602J05179j52513n2676J61623
10329C52541A25266h4529j62557h0184c6508E25013A89426f6450D04833A90957
10318A79552P7772k0356C2000b2486A95041a65332A03583b13965A65671G3190
10307B21092B5124R5434n8253K32401a25299A16347a98000C24632c51486C06409
$$ plain form
10381 171066 113382 117618 224020 262599 4869 181361 248377 432965 143711 102913 136536
10370 136536 676548 199325 286480 130338 201894 395495 285994 79822 47994 376760
10360 376760 559742 331531 108640 248113 5287 165216 -49382 404685 379110 597749
10350 597749 715680 545038 524702 399696 430770 115208 467401 313929 392088 143976
10339 374064 -93995 354984 454045 93164 301530 290928 396107 243594 190918 352541
10329 352541 125266 -84529 -247086 -80184 -36508 525013 189426 -66450 404833 190957
10318 179552 257324 236968 32000 -22486 195041 -165332 103583 -213965 165671 73190
10307 221092 25124 120558 62305 294706 -125299 116347 -198000 324632 -351486 306409
10296b50455B30490F8058b03208a256j40278K6105A29030n3150J53558a7651A8537
10284B62012b56363g142A01463k7905J5030b24137b1641p5224m6381K0144N7528
10273f5574D020M15380a06757M0073B04926a11933A52841d74A05119J51971A3370
10261c7609D19563J35588r1993M0940K5725A15186L47330F5750B1403b45706B33483
10249f226j35369G918i9058C46447b09362A82422D8225d607j4508A88026o9765
10238A18261J54703d10549M1057i7241r5702n9808a25981l6373d8006j65787O3991
10227a49802A18949A158a89362A68534b53241F8384O4878M9129j6143a35694A0475
10215A4698K58792a11810A09548j6857a98048j07604H2349l1300L8429a56004
$$ plain form
10296 -250455 230490 68058 -203208 -1256 -141534 -115429 129030 75880 229438 -17651 18537
10284 262012 -256363 -7142 101463 73558 88588 -224137 -21641 -96865 -143246 -123102 -65574
10273 -65574 4020 419400 -106757 -66684 204926 -111933 152841 -474 105119 257090 13370
10261 -37609 419563 555151 463158 504098 529823 115186 462516 65750 21403 -245706 233483
10249 -6226 -141595 7918 -99058 346447 -209362 182422 48225 -4607 -19115 188026 118261
10238 118261 272964 -410549 -369492 -97241 -192943 -252751 -125981 -162354 -48006 -213793 -149802
10227 -149802 118949 1158 -189362 168534 -253241 68384 133262 182391 166248 -135694 10475
10215 14698 273490 -111810 109548 92691 -198048 -305652 82349 51049 89478 -156004
10204A9876b50654A09026c29845a17784r345E9629c34328A31824d25559b0081
10193d1174A51011b72914B1730J06997a64519d5115D981L7786a18495j75758J20057
10182a74196m48160g13l16121a32152e6917r6527g6289D4962L5873A1468L46884
10171C58352i2519q335q9049g8813j49408j88433a4718k23292R4483M2635A30921
10159i6103k8227A99331B0845a30118J4683c2102O044f854p0693c4086j07325
10148a41411G1630j66J17415a83882o0588k19274A5866K1794n821J6975K778J11684
10136A63276G3551a99424B59844d95495g9461j51400J06719P508j67117r3243
10126c76994a31345k47789b1941k18167f3040B7521f68259b20341B50467D5500
$$ plain form
10204 19876 -250654 109026 -329845 -117784 -127129 59629 -334328 131824 -425559 -20081
10193 -41174 151011 -272914 21730 128727 -164519 -45115 4981 42767 -118495 -294253 -174196
10182 -174196 -622356 -713 -316834 -132152 -56917 -153444 -76289 44962 80835 11468 358352
10171 358352 -92519 -100854 -189903 -78813 -228221 -416654 -14718 -238010 -143527 -100892 130921
10159 -96103 -124330 199331 20845 -130118 -115435 -32102 -26058 -6854 -77547 -34086 -141411
10148 -141411 71630 71464 188879 -183882 -244470 -463744 15866 37660 31839 48814 51592 163276
10136 163276 73551 -199424 259844 -495495 -79461 -230861 -124142 -116634 -283751 -376994
10126 -376994 -131345 -379134 -21941 -240108 -63040 27521 -668259 -220341 250467 45500
10115a40098m1881B14807D0966L1631a39303j2287F5695i0563B90805b50567J24006
10104a26561m7054B30128A13446J50c96629J97487L478A48184a02734A59354P3411
10093B32765e1412j42074A7127g3821j23058c4888q4178A28906b91119P3914A89486
10081F812h9363k00490A56854b36896m7701a7552D842J50980F939b1601j84759
10070b06360b5717j38205B37072a25519k3358F3781a20214n6510A50473E507a13343
10058i1365J1467c4286n938l5010j53482O4784k60496J38916a05832k3785c2510
10046C11674A677b94841K3488C68762b10634C0923a13425B43576I7502a2286j84994
10035a97280i5297j01421p3678P3620P7545A96740G7531a31426K4054N377I7862
$$ plain form
10115 -140098 -181979 214807 40966 72597 -139303 -151590 65695 -90563 290805 -250567 -126561
10104 -126561 -173615 230128 113446 113596 -396629 -199142 -195664 148184 -102734 159354 232765
10093 232765 -51412 -193486 17127 -73821 -196879 -34888 -119066 128906 -291119 -217205 189486
10081 6812 -89363 -289853 156854 -236896 -284597 -17552 4842 155822 6939 -21601 -206360
10070 -206360 -25717 -163922 237072 -125519 -148877 63781 -120214 -176724 150473 5507 -113343
10058 -91365 -79898 -34286 -40224 -75234 -228716 -163932 -424428 -285512 -105832 -129617 -32510
10046 311674 1677 -294841 -271353 368762 -210634 30923 -113425 243576 97502 -12286 -197280
10035 -197280 -95297 -196718 -270396 -196776 -119231 196740 77531 -131426 -107372 -101995 97862
10023a48867L8840A37713L2535a92576R0130p3249M0c7908j52736D5863b39144
10011D020d2996A498Q6302R0613b14314A04106b98083j7273h4462j21959C08223
9999g5291B54901a68776k4960j64297j24214A62303A677c71149E1883P497b2989
9987c85103e9971G1844I319M28373h6534j04620j6764b8697j69327H0196b80707
9975g5065k96168J50191A43986b51648l7655b5376k0208A41481a47692i27m53351
9964d54278H2606h6982b4908r4776E7730b52602D8666a46730D8295a34476r3829
9953b28305A21939b31588M8476N1292J8716q0960K0700A75270b12303R7728E2585
9941b35037A21829b15412a0099k32984b1737j6550j9619j85300o6761J44979M389
$$ plain form
10023 -148867 -110027 137713 170248 -192576 -102446 -175695 -175655 -37908 -190644 45863 -239144
10011 4020 -42996 1498 87800 178413 -214314 104106 -298083 -315356 -84462 -206421 308223
9999 -75291 254901 -168776 -193736 -358033 -482247 162303 1677 -371149 51883 59380 -22989
9987 -385103 -59971 71844 9319 437692 -86534 -191154 -207918 -28697 -198024 80196 -280707
9975 -75065 -371233 -221042 143986 -251648 -289303 -25376 -45584 141481 -147692 -927 -454278
9964 -454278 82606 -86982 -24908 -119684 57730 -252602 48666 -146730 48295 -134476 -228305
9953 -228305 121939 -231588 -183112 -131820 -113104 -194064 -173364 175270 -212303 -114575 52585
9941 -235037 121829 -215412 -10099 -243083 -21737 -38287 -57906 -243206 -309967 -164988 -160599
9930a60599A61365f07674A46784c7953D9325P3459a95415B6740a19905K4960j7798
9919a12743l9280L5972A64095B7688b24173j6999F8066b83113E1219c4675j6124
9908e0799B7565A2359a92245M2128l33303a99709A03126a36057a3597A42042a95602
9896A62407B34O9760J9971O1233C9628P8427J07389p6295b38620i5465k31741
9885c27206a28341H0287j2397b34976J3139A07819i5238B81537c38442f097G8612
9873b77586d9344B2295J75986f684D2050Q5348c72513R0015D3907a31949A622
9861a32151j10284a08491k72444d6873n617f359q2559C5418a83300M0452D8718
9849A34321a65863A15525K5721d27334a60804B3523c77572A14499L8545F8645
$$ plain form
9930 -160599 161365 -607674 146784 -37953 49325 122784 -195415 26740 -119905 -94945 -112743
9919 -112743 -152023 -116051 164095 27688 -224173 -241172 68066 -283113 51219 -34675 -50799
9908 -50799 27565 12359 -192245 -150117 -483420 -199709 103126 -136057 -13597 142042 -195602
9896 162407 234 69994 89965 151198 39628 118055 225444 149149 -238620 -95465 -327206
9885 -327206 -128341 80287 67890 -234976 -221837 107819 -95238 281537 -338442 -6097 78612
9873 -277586 -49344 22295 198281 -6684 42050 127398 -372513 -282498 43907 -131949 1622
9861 -132151 -242435 -108491 -380935 -46873 -52490 -6359 -88918 35418 -183300 -142848 48718
9849 134321 -165863 115525 141246 -427334 -160804 23523 -377572 114499 153044 68645
9838d5545M458A67803m3370b04086R1988H7501a99288c6744j47868p5251A08668
9826A99155b78521a1201j06848N5997j0960A02250b19636g0342L2179j05317A13165
9814G0375a33360q075J4046d343F5789P0575N982i1067k09984a24785N0929j60875
9802b34731J09996m80884A24470b98815J03604e6206O940J1990F1747K9663e0397
9790d2445j46465n5097j51670C9291a25877j06884M1626j96639e8973n7394k8934
9779a45301f4496e268r3994l55007b2265C18463c02677A79731a1301m3281j45484
9768b00066q4909c0972j62633j97894e6782J9091l4408j51276A34460a42723B40070
9756a01886A46473a32098A36410c5492A21754a55699j38232Q8322O7076j95019
$$ plain form
9838 -45545 -41087 167803 124433 -204086 -112098 87501 -199288 -36744 -184612 -259863 108668
9826 199155 -278521 -11201 -118049 -62052 -73012 102250 -219636 -70342 -38163 -143480 113165
9814 70375 -133360 -141435 -127389 -4343 65789 136364 142346 -91067 -301051 -124785 -73856 -234731
9802 -234731 -124735 -605619 124470 -298815 -195211 -56206 -49266 -37276 61747 91410 -50397
9790 -42445 -188910 -244007 -395677 39291 -125877 -232761 -191135 -387774 -58973 -116367 -145301
9779 -145301 -64496 -5268 -99262 -454269 -22265 318463 -302677 179731 -11301 -54582 -200066
9768 -200066 -284975 -30972 -193605 -391499 -56782 -37691 -72099 -223375 134460 -142723 240070
9756 -101886 146473 -132098 136410 -35492 121754 -155699 -293931 -205609 -138533 -333552
9746c33552J55251e8442j05616l25756g6376G1839a59973p4254J06451B5574a16759
9734b56642D00442A55780b80968p8991J07571D4628d5313j35658C7211b46309
9723c31679g1597j2690j89168B65570b66246O5937A13853j5749i4574A4142K63078
9712B77220h2545a2970j47200B56038g0325j11453q6570A04517b57515n0355c6483
9700H1599a70308h3941B22161a14678E9911f335m2041k41572J05604j28463a8231
9688B8026J12899e06338A84326b78247k6884D5061B2154h8808j113H2105b27341
9676H9240b86787J35168A11039N3973j1688F6893i354k83309D95882a59868E3897
9664a46485j12628G7130e555D6292c33959i1478B2906K79178c98098a09251K554
$$ plain form
9746 -333552 -178301 -58442 -164058 -489814 -76376 71839 -159973 -234227 -127776 25574 -116759
9734 -256642 400442 155780 -280968 -359959 -252388 44628 -45313 -180971 37211 -246309
9723 -331679 -71597 -84287 -273455 265570 -266246 -200309 113853 98104 -94574 14142 277220
9712 277220 -82545 -12970 -160170 256038 -70325 -181778 -268348 104517 -257515 -307870 -36483
9700 81599 -170308 -83941 222161 -114678 59911 -6335 -48376 -289948 -184344 -312807 -18231
9688 28026 140925 -506338 184326 -278247 -305131 45061 22154 -88808 -89921 82105 -227341
9676 89240 -286787 -151619 111039 165012 153324 66893 -9354 -292663 495882 -159868 53897
9664 -146485 -259113 77130 -5555 46292 -333959 -91478 22906 302084 -398098 -109251 -106697
9653a06697L2443n1298p1189E4921b52237R0312B1834b42719K6638Q968O6948
9642a40165j15080c1519q0744A5734c640m038k2117A53810d1490m91758a09773
9630a672j48262M8523G1749J76635e2591A24736A1195K14604N441C0931R5331
9619A26262B7373f7814K9239k40773L9117M5092L21A40428c51767F5757a60329
9607C7750K38543c0172j07698A10901k6613a5105l2177r5575k73025a36895A07499
9595A13024K0068j3913d2903D40061B1170b0165j32586E1711a76956j13882a9460
9583d2812k21766A5137b07606Q9305N1244E0006b76758k55434i7432r9074j42008
9572c38514a04249b9199l24040G9344K41514a11873C03931c72836I4373b01223
$$ plain form
9653 -106697 -74254 -125552 -196741 54921 -252237 -161925 21834 -242719 -216081 -207113 -140165
9642 -140165 -255245 -31519 -112263 15734 -3640 -7678 -29795 153810 -41490 -533248 -109773
9630 -1672 -149934 -101411 71749 248384 -52591 124736 11195 225799 231240 30931 126262
9619 126262 27373 -67814 -38575 -279348 -240231 -195139 -194818 140428 -351767 65757 -160329
9607 37750 276293 -30172 -137870 110901 84288 -15105 -47282 -142857 -415882 -136895 107499
9595 113024 133092 119179 -42903 440061 21170 -20165 -152751 51711 -176956 -290838 -19460
9583 -42812 -264578 15137 -207606 -118301 -67057 50006 -276758 -532192 -97432 -196506 -338514
9572 -338514 -104249 -29199 -353239 79344 320858 -111873 303931 -372836 94373 -201223
9561h3494A25968n9035h5074B1056J13070o3183J92933a7374j60715j6812B22319
9549B1052i2341B36931i990A52241Q3220d0471p7538G8096N2560h0194o8817B86781
9536g0535j15892A8993L34123b78696A54943A0055J42273l2237m2217a68619m8712
9525b17331R7692k15070B81383b00662Q4025j42193J13810A0893J58067i0850
9514C4004a14489A27879b50145e2899j09512J5293j39768C0917e7234I6535a25883
9502G0881a05930j27602I884K71364a01927j51659L5431A16263C206M4515a90052
9490a67082j31112B0227a65361j25960I4489b54471j57748a67280C3515a65810
9479g4577j98509J09312o4152K2686A08552B3162j091P0239M01532a02811K8199
$$ plain form
9561 -83494 125968 66933 -85074 21056 134126 70943 263876 -17374 -178089 -194901 222319
9549 21052 -92341 236931 -9990 152241 235461 -40471 -118009 78096 130656 -80194 -149011 286781
9536 -70535 -186427 18993 353116 -278696 154943 10055 152328 120091 77874 -168619 -217331
9525 -217331 -119639 -334709 281383 -200662 -116637 -258830 -145020 10893 168960 -90850
9514 34004 -114489 127879 -250145 -52899 -162411 -147118 -286886 30917 -57234 96535 -125883
9502 70881 -105930 -233532 9884 281248 -101927 -253586 -218155 116263 3206 47721 -190052
9490 -167082 -298194 20227 -165361 -291321 94489 -254471 -412219 -167280 33515 -165810
9479 -74577 -273086 -163774 -227926 -205240 108552 23162 22071 92310 493842 -102811 -74612
9468g4612K6974r2505N6810N585q4371B21311b34021B41729i4456j2715q2700
9457a89871h5960A94318d27987A58904G1199k7030A2197a887j46708f7711b3227
9445i4273n0873j1338C40710a46167j49891A14249a38786j09975a11873p3561
9435a85434Q4725k3717N1109j54960i4948A06578j9958H796c91559a80449A40784
9423b85944c3894I2796b0730D2048L1402P3988A0587a29961h077r9142j94989
9412c02208Q7472d822m4760H3548N103a98333r5880J32484k76875i9396A0903
9400H8807Q0103o6656l6488J30738b43334J7917B9879J29154l2489a48069q5768
9389b33837b0044j71075M549A65625b62404J5017a05435d3030j42592o1542H821
$$ plain form
9468 -74612 -47638 -140143 -83333 -77748 -162119 221311 -234021 241729 -94456 -107171 -189871
9457 -189871 -85960 194318 -427987 158904 71199 44169 12197 -1887 -148595 -67711 -23227
9445 -94273 -145146 -156484 340710 -146167 -296058 114249 -138786 -248761 -111873 -185434
9435 -185434 -100709 -124426 -73317 -228277 -94948 106578 86620 8796 -391559 -180449 140784
9423 -285944 -33894 92796 -20730 42048 73450 147438 10587 -129961 -8077 -107219 -302208
9412 -302208 -214736 -4822 -49582 83548 88651 -198333 -294213 -161729 -438604 -99396 10903
9400 88807 168910 102254 65766 196504 -243334 -225417 29879 159033 126544 -148069 -233837
9389 -233837 -20044 -191119 -186570 165625 -262404 -247387 -105435 -43030 -185622 -247164 8821
9377a49786C0575Q2322d9046A46427J99348j05843a05781H061c57285J43543C2097
9365A336c28329G7652M170A9099c03597h2626H0601K39614D8799d0134J3509k62418
9353b89043a18032m8307A80495d54328C3688L29633e4206j64178k20874B79829
9342A47991a2773j81042j20994P1419a8690k81911b7638k72133q5925J56318A61067
9330I8564b12349h2935o7424e2534B06549a59808L4588k16151B06569E4893k3893
9319C1000L9827J14310k7165a04969A67279b27134N449A83380c98632A85702a04395
9307a21706B7435a25736q4784A83754m8610a16967r1099m8384j99316I2297K75026
9296C67323A58507a29164E5591R8078b85074c8245k55771F3343a7339l31642C44526
$$ plain form
9377 -149786 30575 112897 -49046 146427 345775 239932 -105781 8061 -357285 -213742 32097
9365 1336 -328329 77652 81822 19099 -303597 -82626 80601 320215 48799 -40134 -26625 -289043
9353 -289043 -118032 -166339 180495 -454328 33688 363321 -54206 -218384 -439258 279829
9342 147991 -12773 -193815 -314809 -243390 -18690 -300601 -27638 -299771 -385696 -229378 161067
9330 98564 -212349 -82935 -150359 -52534 206549 -159808 -125220 -341371 206569 54893 31000
9319 31000 70827 185137 157972 -104969 167279 -227134 -221685 183380 -398632 185702 -104395
9307 -121706 27435 -125736 -210520 183754 135144 -116967 -208066 -256450 -455766 92297 367323
9296 367323 158507 -129164 55591 153669 -285074 -38245 -294016 63343 -17339 -348981 344526
9284f7924B8612b10725D7481J31507a70065B16420b12031B35017G6516b96149
9273a03355j88779g4231F274f0724k2347A00346a90650e1294A47864b9479o154
9262c5633k70718b9484j0636C3777Q8176a65776A56179f3522A43662b0655k14478
9251b35133e8779n51062G7189a50596j6033k2326g7916A65322a82285J2532H8580
9239a61842C9682M36403h1200k06301B4746K19484F7574a76414i580q1864k50597
9228c42041A08020N8419b281k74305g5669G1037G6J69394h8533m5365k33N0068
9216h4063n9252E6024a16422j95103B1186f9016q9586k16979a43486L3647d7177
9204C3426a27846L5708A3245b05110A04344b8412F163b55359F4204J34311A8466
$$ plain form
9284 -67924 28612 -210725 47481 178988 -170065 216420 -212031 235017 76516 -296149
9273 -103355 -292134 -74231 6274 -60724 -83071 100346 -190650 -51294 147864 -29479 -35633
9262 -35633 -306351 -29484 -40120 33777 121953 -165776 156179 -63522 143662 -20655 -235133
9251 -235133 -58779 -609841 77189 -150596 -166629 -188955 -77916 165322 -182285 -169753 88580
9239 -161842 39682 476085 -81200 -287501 24746 244230 67574 -176414 -9580 -91444 -342041
9228 -342041 108020 166439 -2281 -276586 -75669 71037 76 169470 -88533 -133898 -134131 -84063
9216 -84063 -143315 56024 -116422 -311525 21186 -69016 -158602 -375581 -143486 -109839 -47177
9204 33426 -127846 -92138 13245 -205110 104344 -28412 6163 -255359 64204 198515 18466
9192b0420j40319A52411i3396L4506A99035G2272b37995a09287c9553j13485l0378
9181a83416f9844G2482a3971C16132A50322F3829O4613a14123G0400b76250g8867
9169a2653I6449a93119h3982B5864b58267P1136a2940k7014C41710a4728l46344
9158c61072a42962j23406l5142c7558k6352j22355g7438A07262q148a91932j2158
9147b04090C89175C7552c26169J10626r4566J8189e3495j63876P1676A25921b91891
9135g0110m8195n8870m7006O358d2955j75891N5477j4361m22952d2609j30714
9124a73323A08894a98024Q2448j12708P8258H6290j3310A688h9620A98001a45644
9112a20429N3813j02344M0153j65287B42643a21700C13210b50236a21666k12968
$$ plain form
9192 -20420 -160739 152411 -93396 -58890 199035 72272 -237995 -109287 -39553 -153038 -183416
9181 -183416 -69844 72482 -13971 316132 150322 63829 128442 -114123 70400 -276250 -78867
9169 -12653 96449 -193119 -83982 25864 -258267 -187131 -12940 -39954 341710 -14728 -361072
9158 -361072 -142962 -266368 -301510 -37558 -63910 -186265 -77438 107262 99114 -191932 -204090
9147 -204090 389175 37552 -326169 -215543 -310109 -291920 -53495 -217371 -145695 125921 -291891
9135 -70110 -118305 -177175 -224181 -217823 -42955 -218846 -163369 -177730 -600682 -42609 -173323
9124 -173323 108894 -198024 -115576 -228284 -150026 86290 72980 1688 -89620 198001 -145644
9112 -120429 -66616 -168960 -128807 -294094 242643 -121700 313210 -250236 -121666 -334634
9102c34634B16299a54323B79399b2718j50546I712b15643N7053J7815C15558a6647
9090A8014a96795h5796k4149B20113C0594d2239A43654m5281b43615L4818B01154
9078i6430l07213A31704c22464B25886G2422r900h4112A30842f9418l65151a97102
9066c8083A74612F3278a9782m2472k66954J60124C07881g1709E7021a042m5124
9055d6166B3713a55427f2202H1492M0292C7329c2195l0460q291L1401Q469j65996
9043a97072I051b50538o3095j69343b2116E4764f5899j72380A96560a08978A58316
9031a9131A9220A376a01039J435E4941c09263f0102A24622a83368h5105n5991
9020a41096c1920j58722D4606a33122k35616B4110K7110a34610B0480g8731b2018
$$ plain form
9102 -334634 216299 -154323 279399 -22718 -173264 9712 -215643 -158590 -140775 315558 -16647
9090 18014 -196795 -85796 -109945 220113 30594 -42239 143654 98373 -243615 -208797 201154
9078 -96430 -403643 131704 -322464 225886 72422 62522 -84112 130842 -69418 -434569 -197102
9066 -38083 174612 63278 -19782 -62254 -329208 -169084 307881 -71709 57021 -1042 -46166
9055 -46166 23713 -155427 -62202 81492 121784 37329 -32195 -62655 -70946 -39545 -31076 -197072
9043 -197072 9051 -250538 -313633 -482976 -22116 54764 -65899 -238279 196560 -108978 158316
9031 -19131 19220 1376 -101039 -99604 54941 -309263 -60102 124622 -183368 -85105 -141096
9020 -141096 -31920 -190642 44606 -133122 -368738 24110 51220 -134610 20480 -78731 -22018
9008a57335a939j13030q1334A72310b62918c6942A49458B6071A953J19443E8070
8996A07679b69107F7281J04319b46546E0910A3573A374e4040k83631J07245C6010
8984a5634H1662c12143p896a39567a1738k16564B15449a1390l1871j82760d2840
8972A05997D6951i384j17690q8186I2967h6025m8143a2070E3246a42312A87864
8960c39260a22124A6322L2551a14263N4764C2520c23897A54854o5070A9997e4488
8948a91477A50728k3517n1506d931m7501a397A46510a13758j01954P7515e7949
8936a99060C22022c1628j22594D0482M182J72644f1964q8341e7245C28881j21460
8925B07421J49770M21472K107581N574837j519107A228187B45380K16063j94864
$$ plain form
9008 -157335 -1939 -114969 -196303 172310 -262918 -36942 149458 26071 1953 121396 58070
8996 107679 -269107 67281 171600 -246546 50910 13573 1374 -54040 -337671 -230426 36010
8984 -15634 81662 -312143 -320039 -139567 -11738 -228302 215449 -11390 -43261 -226021 -42840
8972 105997 46951 -9384 -127074 -215260 92967 -86025 -134168 -12070 53246 -142312 187864
8960 -339260 -122124 16322 48873 -114263 -59499 32520 -323897 154854 89784 19997 -54488
8948 -191477 150728 127211 75705 -4931 -52432 -1397 146510 -113758 -215712 -138197 -57949
8936 -199060 322022 -31628 -154222 40482 44664 217308 -61964 -150305 -57245 328881 207421
8925 207421 357191 778663 2886244 8461081 6941974 1228187 245380 461443 266579
8916B66579A25835n9576j6999c54784a0527E5587a3941l8755B84216j20998d7967
8904d4306j00823B18629a9709A37355L1532h3742p4731H9475a18514j63237a31543
8892e0422j2495m7903B96092a72794C3512a40888A68530b68911o2172i556k40066
8881b49622a23969j6748A90727a80999a7126l48682B15306a3945o4093k80107
8871c58145a13867N0348j4872D9592P7517D0963L6208a94634B26466H9936M3564
$$ plain form
8916 266579 125835 66259 49260 -354784 -10527 55587 -13941 -52696 284216 163218 -47967
8904 -44306 -145129 218629 -19709 137355 168887 -83742 -158473 89475 -118514 -281751 -131543
8892 -50422 -62917 -110820 296092 -172794 33512 -140888 168530 -268911 -331083 -9556 -249622
8881 -249622 -123969 -140717 190727 -180999 -17126 -365808 215306 -13945 -78038 -358145
8871 -358145 -113867 -63519 -78391 49592 127109 40963 77171 -194634 226466 89936 133500
$$ [...]
##END NTUPLES=NMR SPECTRUM
##END=
