
##TITLE=AC1213_BRAAS12064_6528106_XEsjp4Wcx4
##JCAMPDX= 6.0         $$ Bruker NMR JCAMP-DX V2.0
##DATA TYPE= NMR SPECTRUM
##DATA CLASS= NTUPLES
##ORIGIN= BRUKER
##OWNER= Administrator
$$ 1.72 TOPSPIN		Version 2.1
$$ 2012-07-15 11:23:04.328 -0500  Administrator@TOPSPIN
$$ Compression mode = diff/dup
##.OBSERVE FREQUENCY= 400.02188249412
##.OBSERVE NUCLEUS= ^1H
##.ACQUISITION MODE= SIMULTANEOUS (DQD)
##.ACQUISITION SCHEME= undefined
##.AVERAGES= 64
##.DIGITISER RES= 22
##SPECTROMETER/DATA SYSTEM= spect
##.PULSE SEQUENCE= noesygpps1d.comp
##.SOLVENT NAME= COFFEE_meoh
##.SHIFT REFERENCE= INTERNAL, COFFEE_meoh, 1, 14.96079
##AUDIT TRAIL= $$ (NUMBER, WHEN, WHO, WHERE, PROCESS, VERSION, WHAT)
$$ ##TITLE= Audit trail, TOPSPIN		Version 2.1
$$ ##JCAMPDX= 5.01
$$ ##ORIGIN= Bruker BioSpin GmbH
$$ ##OWNER= Administrator
$$ $$ C:\Bruker\TOPSPIN/data/COFFEE/nmr/AC1213_BRAAS12064_6528106_XEsjp4Wcx4/12/pdata/1/auditp.txt
$$ ##AUDIT TRAIL=  $$ (NUMBER, WHEN, WHO, WHERE, PROCESS, VERSION, WHAT)
(   1,<2012-07-15 11:22:59.515 -0500>,<Administrator>,<TOPSPIN>,<go>,<TOPSPIN 2.1>,
      <created by zg
	started at 2012-07-15 11:11:29.203 -0500,
	POWCHK enabled, PULCHK disabled,
       configuration hash MD5:
       6B 1B 68 BB D9 2E 58 E2 7F 35 AD 54 07 DF 0E 41
       data hash MD5: 64K
       69 04 49 9F 75 F4 35 D3 64 41 B2 DD B5 93 9C DA>)
(   2,<2012-07-15 11:23:02.375 -0500>,<Administrator>,<TOPSPIN>,<proc1d>,<TOPSPIN 2.1>,
      <Start of raw data processing
       efp LB = 0.3 FT_mod = 6 PKNL = 1 PHC0 = 0 PHC1 = 0 SI = 128K 
       data hash MD5: 128K
       CE 9C CC 54 F1 BB B6 28 35 3D 3E CE 3D 19 CF 0E>)
(   3,<2012-07-15 11:23:03.500 -0500>,<Administrator>,<TOPSPIN>,<proc1d>,<TOPSPIN 2.1>,
      <pk PHC0 = -1.73584 PHC1 = 0 
       data hash MD5: 128K
       3D 65 8D A2 37 1D E2 F5 D7 63 CB 75 03 83 EB 8B>)
(   4,<2012-07-15 11:23:04.015 -0500>,<Administrator>,<TOPSPIN>,<proc1d>,<TOPSPIN 2.1>,
      <abs ABSG = 1 
       data hash MD5: 128K
       F8 2A A2 B9 2C A3 4F 1B 68 5C 13 A4 4F AB FD B4>)
(   5,<2012-07-15 11:23:04.093 -0500>,<Administrator>,<TOPSPIN>,<proc1d>,<TOPSPIN 2.1>,
      <abs ABSG = 2 
       data hash MD5: 128K
       5A ED E1 41 E2 44 0E 2A 1E 2C 15 04 DE 73 70 3D>)
(   6,<2012-07-15 11:23:04.140 -0500>,<Administrator>,<TOPSPIN>,<proc1d>,<TOPSPIN 2.1>,
      <abs ABSG = 3 
       data hash MD5: 128K
       E0 E0 21 55 89 00 67 AC 1B EF 3B 67 9F 40 71 7C>)
(   7,<2012-07-15 11:23:04.203 -0500>,<Administrator>,<TOPSPIN>,<proc1d>,<TOPSPIN 2.1>,
      <abs ABSG = 4 
       data hash MD5: 128K
       17 01 0B 16 54 7A 28 B8 92 D1 0B 49 38 5F F3 23>)
(   8,<2012-07-15 11:23:04.250 -0500>,<Administrator>,<TOPSPIN>,<proc1d>,<TOPSPIN 2.1>,
      <abs ABSG = 5 
       data hash MD5: 128K
       8C 31 F3 74 26 ED A5 F8 35 1D BA CE E3 F0 16 0A>)
$$ ##END=
$$ 
$$ $$ hash MD5
$$ $$ C9 0F 6E 3F 12 99 95 13 96 06 EC AD EE 08 6E 0A
##$RELAX= 
##$RELAX= 
##$RELAX= 
##$RELAX= 
##$RELAX= 
##$RELAX= 
##$RELAX= 
##$RELAX= 
$$ Bruker specific parameters
$$ [...]
##$TP07= 0
##$TPNAME0= <>
##$TPNAME1= <>
##$TPNAME2= <>
##$TPNAME3= <>
##$TPNAME4= <>
##$TPNAME5= <>
##$TPNAME6= <>
##$TPNAME7= <>
##$TPOAL= (0..7)
0.5 0.5 0.5 0.5 0.5 0.5 0.5 0.5
##$TPOFFS= (0..7)
0 0 0 0 0 0 0 0
##$TUNHIN= 0
##$TUNHOUT= 0
##$TUNXOUT= 0
##$USERA1= <user>
##$USERA2= <user>
##$USERA3= <user>
##$USERA4= <user>
##$USERA5= <user>
##$V9= 5
##$VALIST= <valist>
##$VCLIST= <CCCCCCCCCCCCCCC>
##$VD= 0
##$VDLIST= <DDDDDDDDDDDDDDD>
##$VPLIST= <PPPPPPPPPPPPPPP>
##$VTLIST= <TTTTTTTTTTTTTTT>
##$WBST= 2048
##$WBSW= 25
##$XGAIN= (0..3)
0 0 0 0
##$XL= 0
##$YL= 0
##$YMAX_a= 11659844
##$YMIN_a= -9441511
##$ZGOPTNS= <>
##$ZL1= 120
##$ZL2= 120
##$ZL3= 120
##$ZL4= 120
##$ABSF1= 14.96079
##$ABSF2= -5.597392
##$ABSG= 5
##$ABSL= 3
##$ALPHA= 0
##$AQORDER= 0
##$ASSFAC= 0
##$ASSFACI= 0
##$ASSFACX= 0
##$ASSWID= 0
##$AUNMP= <proc_prof1d_extract.lims>
##$AXLEFT= 0
##$AXNAME= <>
##$AXNUC= <1H>
##$AXRIGHT= 0
##$AXTYPE= 0
##$AXUNIT= <>
##$AZFE= 0.1
##$AZFW= 0.1
##$BCFW= 0
##$BC_mod= 0
##$BYTORDP= 0
##$COROFFS= 0
##$CY= 15
##$DATMOD= 1
##$DC= 0
##$DFILT= <>
##$DTYPP= 0
##$F1P= 0
##$F2P= 0
##$FCOR= 0.5
##$FTSIZE= 131072
##$FT_mod= 6
##$GAMMA= 0
##$GB= 0
##$INTBC= 1
##$INTSCL= 1
##$ISEN= 128
##$LB= 0.3
##$LEV0= 0
##$LPBIN= 0
##$MAXI= 10000
##$MC2= 0
##$MEAN= 0
##$ME_mod= 0
##$MI= 0
##$NCOEF= 0
##$NC_proc= -2
##$NLEV= 6
##$NOISF1= 0
##$NOISF2= 0
##$NSP= 0
##$NTH_PI= 0
##$NZP= 0
##$OFFSET= 14.96079
##$PC= 1
##$PHC0= -1.73584
##$PHC1= 0
##$PH_mod= 1
##$PKNL= yes
##$PPARMOD= 0
##$PPDIAG= 0
##$PPIPTYP= 0
##$PPMPNUM= 2147483647
##$PPRESOL= 1
##$PSCAL= 4
##$PSIGN= 0
##$PYNMP= <proc.py>
##$REVERSE= no
##$SF= 400.020009721533
##$SI= 131072
##$SIGF1= 0
##$SIGF2= 0
##$SINO= 400
##$SIOLD= 131072
##$SPECTYP= <>
##$SREGLST= <1H.CDCl3>
##$SSB= 0
##$STSI= 131072
##$STSR= 0
##$SW_p= 8223.68421052631
##$SYMM= 0
##$S_DEV= 0
##$TDeff= 65536
##$TDoff= 0
##$TI= <>
##$TILT= no
##$TM1= 0
##$TM2= 0
##$TOPLEV= 0
##$USERP1= <user>
##$USERP2= <user>
##$USERP3= <user>
##$USERP4= <user>
##$USERP5= <user>
##$WDW= 1
##$XDIM= 131072
##$YMAX_p= 418377682
##$YMIN_p= -11811
##$CURPLOT= <Network HP LaserJet P1505>
##$CURPRIN= <$Network HP LaserJet P1505>
##$DFORMAT= <normdp>
##$LAYOUT= <+/1D_H.xwp>
##$LFORMAT= <normlp>
##$PFORMAT= <normpl>
##$SURQMSG= 1
$$ End of Bruker specific parameters
$$ ---------------------------------
##NTUPLES= NMR SPECTRUM
##VAR_NAME=  FREQUENCY,     SPECTRUM/REAL,   SPECTRUM/IMAG
##SYMBOL=    X,             R,               I
##VAR_TYPE=  INDEPENDENT,   DEPENDENT,       DEPENDENT
##VAR_FORM=  AFFN,          ASDF,            ASDF
##VAR_DIM=   131072,        131072,          131072
##UNITS=     HZ,            ARBITRARY UNITS, ARBITRARY UNITS
##FACTOR=    0.0627417313425164, 1,          1
##FIRST=     8223.62146879497, -513,         -62741
##LAST=      0,             525,             -62050
##MIN=       0,             -11811,          0
##MAX=       8223.62146879497, 418377682,    0
$$ Real data points
##PAGE= N=1
##DATA TABLE= (X++(R..R)), XYDATA
$$ [...]
$$ plain form
63900 1381755 1285120 1200561 1126625 1062333 1007152 960350 920583 886233 855991 829082 805121
63889 805121 783874 764926 747489 730717 714322 698699 684400 671795 661294 653405 648234 645291
63877 645291 644154 645069 648499 654521 663230 675385 691779 711948 734262 757476 781589 807016 833558
63864 833558 860522 887262 913259 938133 961943 985097 1007514 1028306 1046623 1062356 1075542
63853 1075542 1085593 1091783 1094165 1093223 1088833 1080402 1067927 1052046 1032888 1009829 982859 953493
63841 953493 923633 893881 863513 831840 798993 765538 731969 698788 666627 635980 606902
63830 606902 579087 552219 526248 501461 478317 457130 437893 420395 404423 389733 376013
63819 376013 363063 350999 340059 330200 321090 312539 304710 297792 291699 286264 281505 277389 273441
$$ packed form
63900A381755r6635q4559p3936o4292n5181m6802l9767l4350l0242k6909k3961
63889H05121k1247j8948j7437j6772j6395j5623j4299j2605j0501p889n171k943
63877F45291j137R15L430O022Q709J2155J6394K0169K2314K3214K4113K5427K6542
63864H33558K6964K6740K5997K4874K3810K3154K2417K0792J8317J5733J3186
63853A075542J0051O190K382r42m390q431j2475j5881j9158k3059k6970k9366
63841I53493k9860k9752l0368l1673l2847l3455l3569l3181l2161l0647k9078
63830F06902k7815k6868k5971k4787k3144k1187j9237j7498j5972j4690j3720
63819C76013j2950j2064j0940r859r110q551p829o918o093n435m759m116l948
$$ plain form
63806 273441 269064 264337 260168 257344 255648 254205 252565 251040 249984 249143 247966 246304 244487 242791
63792 242791 241058 238832 235749 231812 227478 223450 220244 217833 215811 213850 211935 210159 208492 206878
63778 206878 205437 204420 203903 203623 203176 202400 201532 200994 201002 201429 202012 202641 203355 204037 204227 203390 201507 199315
63760 199315 197808 197441 197918 198776 199887 201243 202503 203189 203289 203314 203630 204071 204337 204527 205056 206212 207891
63743 207891 209595 210606 210470 209533 208773 208902 209849 211298 213366 216375 220184 224237 228130 231739 234901
63728 234901 237442 239519 241559 243875 246692 250369 255027 259990 264309 268032 272291 277761 283639 288658
63714 288658 292624 296326 300201 303748 306214 307275 306965 305472 303144 300402 297433 294180 290698 287329
63700 287329 284425 282116 280449 279541 279372 279508 279233 278077 276207 274308 273114 273089 274501 277562 282192 287703
$$ packed form
63806B73441m377m727m169k824j696j443j640j525j056q41j177j662j817j696
63792B42791j733k226l083l937m334m028l206k411k022j961j915j776j667j614
63778B06878j441j017n17k80m47p76q68n38QM27N83O29P14O82J90q37j883k192
63760A99315j507l67M77Q58J111J356J260O86J00K5L16M41K66J90N29J156J679
63743B07891J704J011j36r37p60J29R47J449K068L009L809M053L893L609L162
63728B34901K541K077K040K316K817L677M658M963M319L723M259N470N878N019
63714B88658L966L702L875L547K466J061l10j493k328k742k969l253l482l369
63700B87329k904k309j667r08j69J36k75j156j870j899j194k5J412L061M630N511
$$ plain form
63684 287703 293016 297390 300807 303603 305959 307863 309290 310180 310446 310259 310111 310276 310361 309786 308646 307733
63668 307733 307704 308568 310050 312086 314746 317880 321062 323788 325676 326593 326619 325769 323720 320047 314822 308786
63652 308786 302788 297180 291858 286725 281936 277769 274393 271753 269599 267674 265968 264726 264168 264238 264700
63637 264700 265469 266717 268605 270968 273426 275879 278761 282575 287245 292246 297401 303147 309710 316451
63623 316451 322529 328053 334010 341039 348855 357022 365707 375323 385835 396919 408646 421576 436217
63610 436217 452684 470894 490861 512743 536700 562673 590217 618749 648101 678574 710120
63599 710120 741482 770497 795310 815106 829750 839132 843151 842097 836789 828340 817941 806773
63587 806773 795788 785369 775206 764530 752396 737791 719803 698171 673778 648294 623094
$$ packed form
63684B87703N313M374L417K796K356J904J427Q90K66j87j48J65Q5n75j140r13
63668C07733k9Q64J482K036K660L134L182K726J888R17K6q50k049l673n225o036
63652C08786n998n608n322n133m789m167l376k640k154j925j706j242n58P0M62
63637B64700P69J248J888K363K458K453K882L814M670N001N155N746O563O741
63623C16451O078N524N957P029P816Q167Q685R616J0512J1084J1727J2930J4641
63610D36217J6467J8210J9967K1882K3957K5973K7544K8532K9352L0473L1546
63599G10120L1362K9015K4813J9796J4644R382M019j054n308q449j0399j1168
63587H06773j0985j0419j0163j0676j2134j4605j7988k1632k4393k5484k5200
$$ plain form
63576 623094 598641 575041 552853 532898 515453 500154 486801 475763 467361 461302 457046 454457
63564 454457 453752 455014 458097 462805 468801 475497 482439 489766 497882 506762 515991 525540 536028 548074
63550 548074 561707 576621 592763 610480 630346 653074 679466 710225 745777 786131 830504
63539 830504 876755 921464 960994 992652 1014960 1027339 1030119 1024910 1014390 1001234 987155 972955
63527 972955 959216 946593 935350 924812 913488 899806 882722 861700 836392 806662 773021
63516 773021 736838 699904 663735 629271 597066 567452 540473 515894 493580 473784 456849
63505 456849 442552 429972 418172 406887 396406 386910 378225 370238 363199 357403 352780 349024 345949
63492 345949 343448 341275 339225 337550 336829 337288 338455 339587 340262 340492 340593 341124 342667 345295 348357 351048
$$ packed form
63576F23094k4453k3600k2188j9955j7445j5299j3353j1038q402o059m256k589
63564D54457p05J262L083M708N996O696O942P327Q116Q880R229R549J0488J2046
63550E48074J3633J4914J6142J7717J9866K2728K6392L0759L5552M0354M4373
63539H30504M6251M4709L9530L1658K2308J2379K780n209j0520j3156j4079j4200
63527I72955j3739j2623j1243j0538j1324j3682j7084k1022k5308k9730l3641
63516G73021l6183l6934l6169l4464l2205k9614k6979k4579k2314j9796j6935
63505D56849j4297j2580j1800j1285j0481r496q685p987p039n796m623l756l075
63492C45949k501k173k050j675p21M59J167J132O75K30J01N31J543K628L062K691
$$ plain form
63476 351048 353181 355251 357860 361375 366015 371829 378311 384282 388429 390056 389335 386918 383315 378573
63462 378573 372548 365589 358768 353184 349082 345984 343644 342359 342152 342215 341719 340833 340335 340358 340266 339826 339816
63445 339816 341134 343895 347828 353036 359694 367281 374854 382145 389851 398749 409057 420835 434555
63432 434555 450962 470707 494328 522167 553768 587385 620428 650407 675433 694305 706825
63421 706825 714184 718615 722377 727136 734117 744318 758296 776128 797953 824300 855416 890339
63409 890339 927059 963640 998695 1030686 1057380 1076656 1087732 1091200 1088006 1079027 1065670 1050065
63397 1050065 1034028 1018079 1001890 985316 968321 949994 928491 902414 871967 838583 803801
63386 803801 768787 734501 701757 671010 642362 615815 591418 569266 549528 532387 517866
$$ packed form
63476C51048K133K070K609L515M640N814O482N971M147J627p21k417l603m742
63462C78573o025o959o821n584m102l098k340j285k07O3m96q86m98K3r2m40j0
63445C39816J318K761L933N208O658P587P573P291P706Q898J0308J1778J3720
63432D34555J6407J9745K3621K7839L1601L3617L3043K9979K5026J8872J2520
63421G06825P359M431L762M759O981J0201J3978J7832K1825K6347L1116L4923
63409H90339L6720L6581L5055L1991K6694J9276J1076L468l194q979j3357j5605
63397A050065j6037j5949j6189j6574j6995j8327k1503k6077l0447l3384l4782
63386H03801l5014l4286l2744l0747k8648k6547k4397k2152j9738j7141j4521
$$ plain form
63375 517866 505873 496484 489902 485952 483915 483242 484196 487347 492593 499207 506879 516172 527769 541685
63361 541685 557468 574816 593678 613959 635564 658744 684109 712193 743074 776464 812100
63350 812100 849906 889603 930105 969384 1005118 1035510 1059533 1076633 1086520 1089244 1085330 1075867
63338 1075867 1062603 1047703 1032913 1018746 1004594 989566 972971 954157 932442 907501 879555
63327 879555 849072 816609 783106 749915 718272 688923 662424 639360 619957 603918 591170
63316 591170 582492 578611 578549 579310 577469 570910 559162 542771 522843 500979 479009 458429 439996
63303 439996 423899 410169 398794 389410 381161 373218 365521 358746 353415 349237 345504 341925 338738
63290 338738 336140 333937 331816 329707 327724 325834 323700 320972 317782 314805 312586 310867 308936 306722
$$ packed form
63375E17866j1993r389o582l950k037o73R54L151N246O614P672R293J1597J3916
63361E41685J5783J7348J8862K0281K1605K3180K5365K8084L0881L3390L5636
63350H12100L7806L9697M0502L9279L5734L0392K4023J7100R887K724l914r463
63338A075867j3264j4900j4790j4167j4152j5028j6595j8814k1715k4941k7946
63327H79555l0483l2463l3503l3191l1643k9349k6499k3064j9403j6039j2748
63316E91170q678l881o2P61j841o559j1748j6391j9928k1864k1970k0580j8433
63303D39996j6097j3730j1375r384q249p943p697o775n331m178l733l579l187
63290C38738k598k203k121k109j983j890k134k728l190k977k219j719j931k214
$$ plain form
63276 306722 305026 304389 304240 303660 302703 302301 303020 304517 306219 307873 309250 309925 309727 309143 308908 309364 310317
63259 310317 311339 312117 312754 313822 315862 318767 321941 325135 328694 332857 337236 341359 345397 349967 355411
63244 355411 361587 368235 375281 382854 391265 400855 411659 423280 435269 447521 460239 473775 488635
63231 488635 505330 523843 543448 563317 583175 603129 623168 643161 663136 683175 703150
63220 703150 722940 742657 762315 781521 800080 818738 838577 859575 880289 899129 915329
63209 915329 928481 937802 942399 941998 937000 927955 915218 898913 879057 856028 831181 806650 784118
63196 784118 763939 745777 729862 717111 708132 702643 700008 699973 702824 709141 719510 734122 752420
63183 752420 773369 796334 821534 849395 879575 910983 942766 974899 1007591 1040414 1072440
$$ packed form
63276C06722j696o37j49n80r57m02P19J497J702J654J377O75j98n84k35M56R53
63259C10317J022P78O37J068K040K905L174L194L559M163M379M123M038M570N444
63244C55411O176O648P046P573Q411R590J0804J1621J1989J2252J2718J3536J4860
63231D88635J6695J8513J9605J9869J9858J9954K0039J9993J9975K0039J9975
63220G03150J9790J9717J9658J9206J8559J8658J9839K0998K0714J8840J6200
63209I15329J3152R321M597m01m998r045j2737j6305j9856k3029k4847k4531k2532
63196G84118k0179j8162j5915j2751q979n489k635l5K851O317J0369J4612J8298
63183G52420K0949K2965K5200K7861L0180L1408L1783L2133L2692L2823L2026
$$ plain form
63172 1072440 1103200 1133039 1162324 1190685 1217351 1241947 1264427 1284265 1300191 1310808 1315145
63161 1315145 1312566 1302621 1285285 1261055 1230548 1194263 1152843 1107266 1058528 1007581 955890 905556
63149 905556 858252 814219 772816 733877 697965 665495 636442 610976 589584 572128 557366
63138 557366 543904 531301 519868 509744 500709 492711 486067 481071 477657 475408 473658 471740 469462
63125 469462 467380 466315 466559 467742 469473 471852 475207 479501 484162 488483 492175 495577 499263 503438
63111 503438 507748 511756 515473 519247 523181 526922 530112 532855 535538 538249 540603 542236 543314 544317
63097 544317 545340 545932 545791 545350 545412 546332 547958 550184 553034 556095 558494 559769 560347 560788 560921 560282 559067
63080 559067 558009 557424 556992 556612 556810 558068 560224 562858 565921 569660 574232 579762 586582 594958 604667
$$ packed form
63172A072440L0760K9839K9285K8361K6666K4596K2480J9838J5926J0617M337
63161A315145k579r945j7336k4230l0507l6285m1420m5577m8738n0947n1691n0334
63149I05556m7304m4033m1403l8939l5912l2470k9053k5466k1392j7456j4762
63138E57366j3462j2603j1433j0124r035p998o644m996l414k249j750j918k278
63125D69462k082j065K44J183J731K379L355M294M661M321L692L402L686M175
63111E03438M310M008L717L774L934L741L190K743K683K711K354J633J078J003
63097E44317J023N92j41m41O2R20J626K226K850L061K399J275N78M41J33o39j215
63080E59067j058n85m32l80J98J258K156K634L063L739M572N530O820Q376R709
$$ plain form
63065 604667 615115 625935 637236 649316 662363 676462 691723 708375 726823 747596 771084
63054 771084 797307 826085 857389 891419 928356 968265 1011179 1057001 1105171 1154659 1204506
63043 1204506 1254286 1303907 1353152 1401731 1449718 1497569 1545599 1593777 1642157 1691194 1741222
63032 1741222 1791760 1841659 1889805 1935305 1977060 2013640 2043687 2065999 2079121 2081421 2072080 2051701
63020 2051701 2021629 1982943 1936504 1883652 1826335 1766762 1707437 1651193 1600280 1555293 1515731
63009 1515731 1481803 1455061 1436972 1427610 1426226 1432436 1446267 1467467 1495583 1530508 1572239 1619982
62997 1619982 1672046 1726689 1782790 1839789 1897498 1956035 2015448 2075234 2134456 2192434 2248930
62986 2248930 2303625 2355700 2404042 2447469 2484562 2513668 2533363 2542654 2540420 2524991 2494840 2449820
$$ packed form
63065F04667J0448J0820J1301J2080J3047J4099J5261J6652J8448K0773K3488
63054G71084K6223K8778L1304L4030L6937L9909M2914M5822M8170M9488M9847
63043A204506M9780M9621M9245M8579M7987M7851M8030M8178M8380M9037N0028
63032A741222N0538M9899M8146M5500M1755L6580L0047K2312J3122K300r341k0379
63020B051701l0072l8686m6439n2852n7317n9573n9325n6244n0913m4987l9562
63009A515731l3928k6742j8089r362j384O210J3831K1200K8116L4925M1731M7743
62997A619982N2064N4643N6101N6999N7709N8537N9413N9786N9222N7978N6496
62986B248930N4695N2075M8342M3427L7093K9106J9695R291k234j5429l0151m5020
$$ plain form
62974 2449820 2391341 2321177 2240467 2150259 2052872 1952072 1851476 1752950 1657002 1564591 1477825
62963 1477825 1398576 1326906 1261442 1201063 1145665 1095440 1050113 1009078 971766 937590 905941
62952 905941 876518 849380 824393 800919 778338 756614 736023 716510 697730 679592 662373
62941 662373 646228 630954 616296 602254 588972 576478 564686 553566 543153 533386 523947 514439
62929 514439 504872 495993 488887 484071 481038 478765 476550 474292 472255 470804 470178 470139 469949 469063 467837
62914 467837 467142 467187 467120 466005 463848 461368 459044 456823 454619 452563 450659 448545 445878 442752 439568
62899 439568 436647 434088 431802 429502 426865 424058 421946 421318 421859 422346 422099 421752 422245 423436 424330 424509
62883 424509 424547 424861 424825 423575 421343 419456 419063 420208 422117 424011 425573 426867 427983 428723 428693 427759 426311
$$ packed form
62974B449820n8479p0164q0710r0208r7387j00800j00596r8526r5948r2411q6766
62963A477825p9249p1670o5464o0379n5398n0225m5327m1035l7312l4176l1649
62952I05941k9423k7138k4987k3474k2581k1724k0591j9513j8780j8138j7219
62941F62373j6145j5274j4658j4042j3282j2494j1792j1120j0413r767r439r508
62929E14439r567q879p106m816l033k273k215k258k037j451o26l9j90q86j226
62914D67837o95M5o7j115k157k480k324k221k204k056j904k114k667l126l184
62899D39568k921k559k286k300k637k807k112o28N41M87k47l47M93J191Q94J79
62883D24509L8L14l6j250k232j887l93J145J909J894J562J294J116P40l0r34j448
$$ plain form
62866 426311 424861 423498 421990 420386 419159 418686 418807 419029 418970 418514 417728 416846 416257 416342 417306 419110 421444
62849 421444 423762 425602 427009 428499 430443 432600 434426 435745 436852 437958 438747 438613 437238 434890 432228
62834 432228 429928 428414 427786 427831 428105 428232 428231 428541 429528 431001 432358 433229 433756 434185 434476 434531 434678 435582 437656
62815 437656 440685 444035 447108 449629 451731 453878 456604 460201 464559 469259 473808 477965 481987 486497
62801 486497 491943 498201 504833 511677 518897 526540 534398 542567 551788 562805 575347 588214 600642
62788 600642 613465 628567 647184 668971 692932 718991 748272 781949 820384 863603 912108
62777 912108 966611 1027095 1092626 1162192 1235337 1311836 1391032 1471558 1551369 1627918 1698673
62766 1698673 1761733 1815792 1859365 1890435 1907265 1909453 1897897 1873831 1838139 1791493 1734852
$$ packed form
62866D26311j450j363j508j604j227m73J21K22n9m56p86q82n89Q5R64J804K334
62849D21444K318J840J407J490J944K157J826J319J107J106P89j34j375k348k662
62834D32228k300j514o28M5K74J27jL10R87J473J357Q71N27M29K91N5J47R04K074
62815D37656L029L350L073K521K102K147K726L597M358M700M549M157M022M510
62801D86497N446O258O632O844P220P643P858Q169R221J1017J2542J2867J2428
62788F00642J2823J5102J8617K1787K3961K6059K9281L3677L8435M3219M8505
62777I12108N4503O0484O5531O9566P3145P6499P9196Q0526P9811P6549P0755
62766A698673O3060N4059M3573L1070J6830K188j1556k4066l5692m6646n6641
$$ plain form
62755 1734852 1669875 1599022 1525143 1450580 1376545 1303461 1231795 1162399 1096220 1034080 976677
62744 976677 924445 877244 834385 795093 758868 725517 695079 667813 644020 623794 606937
62733 606937 592967 581091 570408 560490 551645 544293 538274 533222 529384 527369 527068 527547 528305 529937
62719 529937 533156 537794 543348 550047 558650 569365 581643 595049 609847 626698 646232 668955
62707 668955 695172 724804 757558 793402 832812 876633 925872 981474 1043939 1113183 1188983
62696 1188983 1271464 1360836 1456799 1558594 1665559 1777070 1891730 2007041 2120117 2228409
62686 2228409 2329473 2420323 2497487 2557770 2598821 2619055 2617422 2593621 2548639 2484834 2405156
62675 2405156 2312229 2208356 2096322 1979615 1861500 1744286 1629910 1520776 1419134 1325593
$$ packed form
62755A734852o4977p0853p3879p4563p4035p3084p1666o9396o6179o2140n7403
62744I76677n2232m7201m2859l9292l6225l3351l0438k7266k3793k0226j6857
62733F06937j3970j1876j0683r918q845p352o019n052l838k015l01M79P58J632
62719E29937L219M638N554O699Q603J0715J2278J3406J4798J6851J9534K2723
62707F68955K6217K9632L2754L5844L9410M3821M9239N5602O2465O9244P5800
62696A188983Q2481Q9372R5963J01795J06965J11511J14660J15311J13076J08292
62686B228409J01064R0850P7164O0283M1051K0234j633k3801m4982o3805p9678
62675B405156r2927j03873j12034j16707j18115j17214j14376j09134j01642r3541
$$ plain form
62665 1325593 1239020 1158221 1083216 1014690 952845 897339 847863 804098 765252 730276 698655
62654 698655 670530 645918 624169 604447 586429 570172 555427 541495 527924 515026 503335
62643 503335 492759 482676 472906 464089 456889 451222 446572 442660 439351 436220 432884 429681 427385 426236
62629 426236 425773 425661 426033 426786 427135 426311 424402 422187 420397 419293 418636 417900 416797 415807 415829 417183 419328
62612 419328 421682 424207 426974 429839 433015 437437 443842 451786 460146 468403 476929 486256 496660 508329
62598 508329 521375 535762 551746 570236 592132 617272 644602 673425 704059 737217 773174
62587 773174 811481 850883 889387 924990 956623 984090 1007039 1024449 1035328 1039354 1036560 1026777
62575 1026777 1009818 986101 956832 923692 888415 852373 816322 780655 745955 713004 682158
$$ packed form
62665A325593q6573q0799p5005o8526o1845n5506m9476m3765l8846l4976l1621
62654F98655k8125k4612k1749j9722j8018j6257j4745j3932j3571j2898j1691
62643E03335j0576j0083r770q817p200n667m650l912l309l131l336l203k296j149
62629D26236m63j12L72P53L49q24j909k215j790j104o57p36j103r90K2J354K145
62612D19328K354K525K767K865L176M422O405P944Q360Q257Q526R327J0404J1669
62598E08329J3046J4387J5984J8490K1896K5140K7330K8823L0634L3158L5957
62587G73174L8307L9402L8504L5603L1633K7467K2949J7410J0879M026k794r783
62575A026777j6959k3717k9269l3140l5277l6042l6051l5667l4700l2951l0846
$$ plain form
62564 682158 653080 625434 599631 576577 556754 539740 524654 510946 498759 488584 480550 474107
62552 474107 468504 463418 458861 454621 450267 445751 441582 438176 435387 432964 431151 430491 431177 432810 434751
62537 434751 436549 438216 440240 443148 446851 450602 453791 456643 459919 464063 468903 474051 479437 485562
62523 485562 493445 504171 518150 534804 553211 573130 595278 620690 650041 683626 721763 764936
62511 764936 813416 866800 924143 984721 1048418 1114962 1182781 1249102 1311334 1367913 1417572
62500 1417572 1458405 1488435 1506932 1514504 1511842 1498957 1475888 1443701 1404478 1360623 1314498 1268480
62488 1268480 1224842 1185311 1150768 1121394 1097107 1078026 1064678 1057854 1058177 1065688 1079726 1099169
62476 1099169 1122904 1150231 1180792 1214003 1248518 1282246 1312847 1338193 1356573 1366914 1368987
$$ packed form
62564F82158k9078k7646k5803k3054j9823j7014j5086j3708j2187j0175q034o443
62552D74107n603n086m557m240m354m516m169l406k789k423j813o60O86J633J941
62537D34751J798J667K024K908L703L751L189K852L276M144M840N148N386O125
62523D85562P883J0726J3979J6654J8407J9919K2148K5412K9351L3585L8137M3173
62511G64936M8480N3384N7343O0578O3697O6544O7819O6321O2232N6579M9659
62500A417572M0833L0030J8497P572k662j2885k3069l2187l9223m3855m6125m6018
62488A268480m3638l9531l4543k9374k4287j9081j3348o824L23P511J4038J9443
62476A099169K3735K7327L0561L3211L4515L3728L0601K5346J8380J0341K073
$$ plain form
62465 1368987 1363302 1350471 1330570 1303103 1267644 1224533 1175042 1120965 1064190 1006513 949506
62454 949506 894230 841188 790869 744327 702833 666835 635650 608452 585194 566155 550857
62443 550857 538039 526718 516797 508580 502186 497693 495323 495072 496306 498128 500044 502029 504038 505847
62429 505847 507288 508316 508755 508227 506431 503256 498598 492386 485021 477481 470570 464061 456944 448662 439856
62414 439856 431729 424856 418883 413288 408086 403669 400242 397641 395605 393916 392279 390356 388095 385876
62400 385876 384115 382790 381551 380221 378995 378089 377517 377315 377757 379067 381019 383136 385247 387639 390611
62385 390611 394123 397912 401725 405299 408372 410929 413339 416115 419638 424249 430365 438228 447542 457588
62371 457588 467717 477631 487302 496882 506683 516990 527805 538984 550766 564071 580067 599368
$$ packed form
62465A368987n685j2831j9901k7467l5459m3111m9491n4077n6775n7677n7007
62454I49506n5276n3042n0319m6542m1494l5998l1185k7198k3258j9039j5298
62443E50857j2818j1321r921q217o394m493k370k51J234J822J916J985K009J809
62429E05847J441J028M39n28j796l175m658o212p365p540o911o509p117q282q806
62414D39856q127o873n973n595n202m417l427k601k036j689j637j923k261k219
62400C85876j761j325j239j330j226r06n72k02M42J310J952K117K111K392K972
62385C90611L512L789L813L574L073K557K410K776L523M611O116P863R314J0046
62371D57588J0129R914R671R580R801J0307J0815J1179J1782J3305J5996J9301
$$ plain form
62359 599368 621709 646485 673688 704200 739048 778450 821902 869143 920448 975645 1033275
62348 1033275 1091255 1148061 1202603 1253074 1296770 1331393 1356097 1371098 1376792 1373619 1362351 1343984
62336 1343984 1319468 1289766 1255919 1218778 1178871 1136813 1093640 1050454 1007965 966756 927784
62325 927784 892239 860881 833746 810295 789588 770529 752374 734962 718166 701321 683675
62314 683675 665270 646782 628423 609614 589981 570157 551208 533584 517110 501797 488171
62303 488171 476721 467360 459562 452861 447130 442491 439019 436499 434448 432494 430767 429809 430013 431239
62289 431239 433038 435137 437438 439651 441317 442452 443853 446377 449985 453918 457766 461871 466550 471434
62275 471434 475974 480281 485021 490550 496542 502429 507951 513246 518675 524629 531422 539310 548663 559959
$$ packed form
62359E99368K2341K4776K7203L0512L4848L9402M3452M7241N1305N5197N7630
62348A033275N7980N6806N4542N0471M3696L4623K4704J5001N694l173j1268j8367
62336A343984k4516k9702l3847l7141l9907m2058m3173m3186m2489m1209l8972
62325I27784l5545l1358k7135k3451k0707j9059j8155j7412j6796j6845j7646
62314F83675j8405j8488j8359j8809j9633j9824j8949j7624j6474j5313j3626
62303D88171j1450r361p798o701n731m639l472k520k051j954j727r58K04J226
62289D31239J799K099K301K213J666J135J401K524L608L933L848M105M679M884
62275D71434M540M307M740N529N992N887N522N295N429N954O793P888R353J1296
$$ plain form
62261 559959 573550 589598 608340 630252 655814 685358 719289 758099 801858 849987 901922
62250 901922 957644 1017054 1078969 1141298 1202004 1259291 1310945 1354361 1387555 1409752 1420991
62239 1420991 1421764 1413183 1396685 1373091 1342397 1304816 1261363 1213044 1160148 1103156 1043887 984904
62227 984904 927981 873884 823411 777624 736884 700486 667617 638090 611879 588605 567921
62216 567921 549896 534444 520799 508166 496659 486936 478968 471763 464462 457177 450584 445047 440462
62203 440462 436663 433687 431670 430697 430685 431354 432456 434118 436804 440768 445734 451286 457461 464697 473338
62188 473338 483446 495001 507913 521797 536128 550811 566331 583089 600758 618504 635768
62177 635768 652594 669255 685722 701483 715731 727801 737623 745877 753652 761932 771369 782393
$$ packed form
62261E59959J3591J6048J8742K1912K5562K9544L3931L8810M3759M8129N1935
62250I01922N5722N9410O1915O2329O0706N7287N1654M3416L3194K2197J1239
62239A420991P73q581j6498k3594l0694l7581m3453m8319n2896n6992n9269n8983
62227I84904n6923n4097n0473m5787m0740l6398l2869k9527k6211k3274k0684
62216E67921j8025j5452j3645j2633j1507r723p968p205p301p285o593n537m585
62203D40462l799k976k017r73j2O69J102J662K686L964M966N552O175P236Q641
62188D73338J0108J1555J2912J3884J4331J4683J5520J6758J7669J7746J7264
62177F35768J6826J6661J6467J5761J4248J2070R822Q254P775Q280R437J1024
$$ plain form
62165 782393 795377 810747 829086 851130 877492 908322 943252 981598 1022405 1064198 1104838
62154 1104838 1141861 1173119 1197223 1213543 1222042 1223251 1218207 1208024 1193281 1173882 1149591 1120563
62142 1120563 1087325 1050528 1011070 970332 929944 891294 855402 823047 794619 769955 748799
62131 748799 731359 717908 707926 700303 694487 690685 688797 688009 687883 688950 691541 694837 698051 701988
62117 701988 708280 717298 727791 738357 748166 756248 761387 763193 762486 760235 756896 753062 749779 747522
62103 747522 745523 742780 739221 735237 730519 724190 716044 707132 699074 693049 689327 687518 687330 689050
62089 689050 692948 698299 703727 708828 714740 722586 732028 742074 752743 764941 778911 793904 809513
62076 809513 826461 845663 867098 890017 913864 938576 964115 990015 1015413 1039519 1062149
$$ packed form
62165G82393J2984J5370J8339K2044K6362L0830L4930L8346M0807M1793M0640
62154A104838L7023L1258K4104J6320Q499J209n044j0183j4743j9399k4291k9028
62142A120563l3238l6797l9458m0738m0388l8650l5892l2355k8428k4664k1156
62131G48799j7440j3451r982p623n816l802j888p88j26J067K591L296L214L937
62117G01988O292R018J0493J0566R809Q082N139J806p07k251l339l834l283k257
62103G47522j999k743l559l984m718o329q146q912q058o025l722j809j88J720
62089F89050L898N351N428N101N912P846R442J0046J0669J2198J3970J4993J5609
62076H09513J6948J9202K1435K2919K3847K4712K5539K5900K5398K4106K2630
$$ plain form
62065 1062149 1083787 1105081 1126355 1147727 1169507 1192228 1216391 1242373 1270397 1300196 1330699
62054 1330699 1360243 1387090 1409721 1427018 1438585 1444698 1445576 1440830 1430039 1413615 1392544 1367296
62042 1367296 1337554 1303039 1264097 1221439 1175895 1128625 1081042 1034138 988202 943454 900630
62031 900630 860736 824514 792354 764350 740083 718657 699377 682287 667706 655321 644062
62020 644062 632920 621711 611067 601760 593984 587095 580087 572383 564142 555830 547676 539696 532010
62007 532010 524935 518812 513896 510330 508064 506849 506490 507055 508744 511605 515483 520154 525318 530558 535514
61992 535514 540092 544288 547770 549836 549929 548097 544872 540731 535778 529830 522707 514445 505336 495825 486313
61977 486313 477045 468165 459828 452153 445116 438605 432608 427208 422385 418002 414097 410898 408291 405522
$$ packed form
62065A062149K1638K1294K1274K1372K1780K2721K4163K5982K8024K9799L0503
62054A330699K9544K6847K2631J7297J1567O113Q78m746j0791j6424k1071k5248
62042A367296k9742l4515l8942m2658m5544m7270m7583m6904m5936m4748m2824
62031I00630l9894l6222l2160k8004k4267k1426j9280j7090j4581j2385j1259
62020F44062j1142j1209j0644r307p776o889p008p704q241q312q154p980p686
62007E32010p075o123m916l566k266j215l59N65J689K861L878M671N164N240M956
61992E35514M578M196L482K066R3j832l225m141m953n948p123q262r109r511r512
61977D86313r268q880q337p675p037o511n997n400m823m383l905l199k607k769
$$ plain form
61963 405522 401874 397615 393794 391056 389124 387609 386770 386960 387718 388076 387769 387615 388599 390883 393856 396865
61947 396865 399772 403007 407183 412533 418745 425490 433083 442350 453713 466672 480375 494573 509789
61934 509789 526544 544503 562492 579420 595207 610712 626670 642779 657922 671167 682390
61923 682390 692048 700495 707488 712158 713556 711472 706718 700442 693201 684922 675735 666547 658662 653016
61909 653016 649893 649279 651319 656325 664346 674853 687045 700449 714917 729973 744557 757707 769198
61896 769198 779112 787050 792222 794160 792832 788184 780209 769587 757698 745658 733645 721315 708585
61883 708585 695882 683897 673205 663792 654849 645338 634921 624068 613184 602021 590108 577322
61871 577322 563787 549682 535619 522911 512882 505800 500670 496167 491712 487832 485591 485598 487424 490047
$$ packed form
61963D05522l648m259l821k738j932j515q39J90P58L58l07j54R84K284K973L009
61947C96865K907L235M176N350O212O745P593R267J1363J2959J3703J4198J5216
61934E09789J6755J7959J7989J6928J5787J5505J5958J6109J5143J3245J1223
61923F82390R658Q447O993M670J398k084m754o276p241q279r187r188p885n646
61909F53016l123o14K040N006Q021J0507J2192J3404J4468J5056J4584J3150J1491
61896G69198R914P938N172J938j328m648p975j0622j1889j2040j2013j2330j2730
61883G08585j2703j1985j0692r413q943r511j0417j0853j0884j1163j1913j2786
61871E77322j3535j4105j4063j2708j0029p082n130m503m455l880k241PJ826K623
$$ plain form
61857 490047 492909 496406 501428 508609 518018 529271 541917 556087 572775 593014 616605 642091
61845 642091 668162 694625 721768 749371 776790 803498 828878 851744 870724 885065 894675 899540
61833 899540 899603 895108 886621 874792 860592 845709 832108 821009 812656 807096 804802 806405 812156
61820 812156 821748 834376 848819 863702 877828 890138 899508 904839 905369 900629 890243 874234 853573
61807 853573 829989 804965 779163 752859 726552 700952 676723 654497 634824 617796 602875
61796 602875 589439 577417 567109 558426 550622 542914 535225 528213 522535 518079 513860 508719 502240
61783 502240 495044 488230 482542 478028 474347 471177 468255 465234 461850 458412 455824 454738 454693 454447 453240
61768 453240 451442 449859 448858 448403 448542 449382 450739 452224 453595 454725 455451 455911 456892 459279 463111 467627
$$ packed form
61857D90047K862L497N022P181R409J1253J2646J4170J6688K0239K3591K5486
61845F42091K6071K6463K7143K7603K7419K6708K5380K2866J8980J4341R610M865
61833H99540O3m495q487j1829j4200j4883j3601j1099q353n560k294J603N751
61820H12156R592J2628J4443J4883J4126J2310R370N331N30m740j0386j6009k0661
61807H53573k3584k5024k5802k6304k6307k5600k4229k2226j9673j7028j4921
61796F02875j3436j2022j0308q683p804p708p689p012n678m456m219n141o479
61783E02240p196o814n688m514l681l170k922l021l384l438k588j086m5k46j207
61768D53240j798j583j001m55J39Q40J357J485J371J130P26M60R81K387L832M516
$$ plain form
61752 467627 472275 477128 482125 486514 489482 491068 491987 492683 492859 491898 489485 485828 481468 476970 472727
61737 472727 468992 465909 463388 461044 458538 455972 453695 451741 449816 447947 446773 446920 448245 449946
61723 449946 451277 451995 452352 452914 454267 456595 459515 462542 465680 469369 473833 478630 482947 486261 488654
61708 488654 490460 491658 491752 490351 487718 484505 481009 477059 472678 468438 464888 461890 458855 455439 451717
61693 451717 447842 443958 440423 437677 435737 434068 432140 429915 427687 425626 423687 421862 420281 419020
61679 419020 417944 416803 415487 414174 413184 412668 412398 411888 410767 409139 407534 406453 405925 405617 405437 405824
61663 405824 407175 409042 410293 410245 409390 408736 408645 408660 408394 408160 408542 409642 411018 412201 413095 413846 414600 415396
61645 415396 416189 416919 417620 418487 419762 421544 423799 426497 429571 432664 435166 436685 437356 437443 436757 434800
$$ packed form
61752D67627M648M853M997M389K968J586R19O96J76r61k413l657m360m498m243
61737D72727l735l083k521k344k506k566k277j954j925j869j174J47J325J701
61723D49946J331P18L57N62J353K328K920L027L138L689M464M797M317L314K393
61708D88654J806J198R4j401k633l213l496l950m381m240l550k998l035l416l722
61693D51717l875l884l535k746j940j669j928k225k228k061j939j825j581j261
61679D19020j076j141j316j313r90n16k70n10j121j628j605j081n28l08j80L87
61663D05824J351J867J251m8q55o54r1J5k66k34L82J100J376J183Q94P51P54P96
61645D15396P93P30P01Q67J275J782K255K698L074L093K502J519O71Q7o86j957
$$ plain form
61629 434800 431499 427517 423732 420631 418319 416805 416018 415686 415437 414928 413775 411635 408687 405901 404413
61614 404413 404505 405367 405849 405299 403819 402004 400443 399150 397345 394038 388944 382714 376258 370022 363931
61599 363931 357752 351448 345354 340045 335861 332477 329175 325587 321940 318589 315598 312904 310509 308277
61585 308277 305829 302990 300173 298027 296725 295839 294834 293478 291785 289840 287788 285908 284520 283763 283389
61570 283389 282881 281905 280672 279709 279262 279064 278657 277729 276188 274215 272373 271317 271217 271738 272687 274300 276560
61553 276560 278601 279425 279125 278913 279806 281622 283422 284632 285482 286474 287695 288767 289400 289803 290401 291265 292066
61536 292066 292630 293242 294211 295396 296392 297057 297600 298213 298806 299089 298843 298204 297687 297719 298046 297893 296865 295386
61518 295386 294049 292922 291757 290478 288988 286919 284210 281664 280163 279488 278753 277988 278298 280123 282250
$$ packed form
61629D34800l301l982l785l101k312j514p87l32k49n09j153k140k948k786j488
61614D04413R2Q62M82n50j480j815j561j293j805l307n094o230o456o236o091
61599C63931o179o304o094n309m184l384l302l588l647l351k991k694k395k232
61585C08277k448k839k817k146j302q86j005j356j693j945k052j880j388p57l74
61570B83389n08r76j233r63m47j98m07r28j541j973j842j056j00N21R49J613K260
61553B76560K041Q24l00k12Q93J816J800J210Q50R92J221J072O33M03N98Q64Q01
61536B92066N64O12R69J185R96O65N43O13N93K83k46o39n17L2L27j53j028j479
61518B95386j337j127j165j279j490k069k709k546j501o75p35p65L10J825K127
$$ plain form
61503 282250 283210 282973 282537 282291 281675 280332 278748 277575 276892 276359 275720 274872 273782 272609 271784 271730 272490
61486 272490 273652 274610 274884 274367 273405 272609 272509 273289 274785 276636 278466 280004 281160 282047 282942 284133
61470 284133 285656 287196 288365 289164 290059 291438 293085 294302 294593 294130 293536 293276 293292 293143 292472 291370 290327
61453 290327 289802 289742 289586 288875 287919 287684 288769 290601 291960 292324 292361 292926 293959 294762 295050 295270 295955 297320
61435 297320 299467 302452 305914 309137 311810 314405 317461 320729 323443 325248 326511 327752 329152 330557
61421 330557 331631 331962 331365 330274 329590 329968 331323 333127 335039 337068 339250 341402 343248 344630 345430
61406 345430 345440 344501 342837 341030 339496 338123 336568 334802 333113 331644 330244 328823 327552 326571 325748
61391 325748 324895 324027 323208 322359 321484 320964 321343 322785 324852 326810 328110 328764 329369 330604 332558 334675
$$ packed form
61503B82250R60k37m36k46o16j343j584j173o83n33o39q48j090j173q25n4P60
61486B72490J162R58K74n17r62p96j00P80J496J851J830J538J156Q87Q95J191
61470B84133J523J540J169P99Q95J379J647J217K91m63n94k60J6j49o71j102j043
61453B90327n25o0j56p11r56k35J085J832J359L64L7N65J033Q03K88K20O85J365
61435B97320K147K985L462L223K673K595L056L268K714J805J263J241J400J405
61421C30557J074L31n97j091o84L78J355J804J912K029K182K152J846J382Q00
61406C45430J0r39j664j807j534j373j555j766j689j469j400j421j271r81q23
61391C25748q53q68q19q49q75n20L79J442K067J958J300O54O05J235J954K117
$$ plain form
61375 334675 336503 338243 340324 342728 345068 347169 349143 350934 352250 352981 353297 353313 353033 352694 352751 353286
61359 353286 353857 354174 354644 355897 358013 360533 363129 365944 369304 373368 378060 383205 388708 394665 401258
61344 401258 408388 415567 422268 428292 433649 438287 442205 445688 449043 452132 454547 456365 458352 461124
61330 461124 464351 467090 468818 469805 470472 470694 469940 467963 465162 462226 459577 457267 455351 454180 454164 455294
61314 455294 457092 459128 461399 464063 467009 470084 473755 479061 486584 495757 505606 516038 527863 541453
61300 541453 555860 569507 581396 591232 598684 603133 604220 602310 598301 593158 587633 582118 576645
61287 576645 571190 565931 560967 555816 549670 542378 534787 527805 521452 515221 509167 504108 500770 499212
61273 499212 499145 500338 502485 505050 507646 510449 513937 518270 523112 528010 532667 536886 540499 543542 546351
$$ packed form
61375C34675J828J740K081K404K340K101J974J791J316P31L16J6k80l39N7N35
61359C53286N71L17M70J253K116K520K596K815L360M064M692N145N503N957O593
61344D01258P130P179O701O024N357M638L918L483L355L089K415J818J987K772
61330D61124L227K739J728R87O67K22p54j977k801k936k649k310j916j171j6J130
61314D55294J798K036K271K664K946L075L671N306P523R173R849J0432J1825J3590
61300E41453J4407J3647J1889R836P452M449J087j910m009n143n525n515n473
61287E76645n455n259m964n151o146p292p591o982o353o231o054n059l338j558
61273D99212o7J193K147K565K596K803L488M333M842M898M657M219L613L043K809
$$ plain form
61258 546351 549384 552973 557316 562548 568657 575333 582051 588365 594054 598909 602536 604565 605140 605025 605063
61243 605063 605500 605913 605766 604887 603354 601131 598062 594255 590185 586263 582427 578379 574221 570636 568293
61228 568293 567210 566841 566756 567114 568463 571148 574950 579243 583479 587524 591545 595608 599493 602979 606281
61213 606281 610108 615222 621838 629356 636708 643119 648591 653534 657977 661455 663784 665583 667667 670139
61199 670139 672574 674952 677888 681831 686638 692195 699008 707756 718540 730932 744502 758826 773079
61186 773079 786147 797246 806191 813039 817754 820353 821138 820698 819722 818757 817976 817131 815805 813659 810385
61171 810385 805743 799923 793681 787694 781890 775767 769233 762575 755680 747910 738980 729399 719753 710058
61157 710058 700194 690442 681017 671425 660969 649845 639220 630199 623124 617835 614175 612160 611866 613046
$$ packed form
61258E46351L033L589M343N232O109O676O718O314N689M855L627K029N75j15L8
61243F05063M37M13j47q79j533k223l069l807m070l922l836m048m158l585k343
61228E68293j083l69q5L58J349K685L802M293M236M045M021M063L885L486L302
61213F06281L827N114O616P518P352O411N472M943M443L478K329J799K084K472
61199F70139K435K378K936L943M807N557O813Q748J0784J2392J3570J4324J4253
61186G73079J3068J1099Q945O848M715K599P85m40r76r65p81q45j326k146l274
61171H10385m642n820o242n987n804o123o534o658o895p770q930r581r646r695
61157G10058r864r752r425r592j0456j1124j0625r021p075n289l660k015k94J180
$$ plain form
61143 613046 614607 614712 612066 607043 601001 594458 586619 576881 566027 555542 546395 538981 533627 530303
61129 530303 528179 526331 524871 524671 525999 528237 531054 535081 541012 548675 557508 567508 579172 592751
61115 592751 608100 625118 643827 664091 685663 708450 732378 757015 781738 806288 830785
61104 830785 855216 879276 902783 925761 947873 968128 985442 999336 1009888 1017183 1020972 1020731
61092 1020731 1015991 1006928 994706 980932 966496 951146 934344 916156 896963 876753 855366 833375
61080 833375 812055 792267 773686 755343 736710 718162 700572 684644 670510 657872 646485
61069 646485 636387 627568 619673 612371 605861 600644 596772 593734 591090 588899 587497 587279 588705 592011
61055 592011 596699 601734 606579 611703 617848 625224 633756 643669 655231 668169 681925 696448 712230
$$ packed form
61143F13046J561J05k646n023o042o543p839r738j0854j0485r147p414n354l324
61129E30303k124j848j460k00J328K238K817M027N931P663Q833J0000J1664J3579
61115E92751J5349J7018J8709K0264K1572K2787K3928K4637K4723K4550K4497
61104H30785K4431K4060K3507K2978K2112K0255J7314J3894J0552P295L789k41
61092A020731m740r063j2222j3774j4436j5350j6802j8188j9193k0210k1387k1991
61080H33375k1320j9788j8581j8343j8633j8548j7590j5928j4134j2638j1387
61069F46485j0098q819p895p302o510n217l872l038k644k191j402k18J426L306
61055E92011M688N035M845N124O145P376Q532R913J1562J2938J3756J4523J5782
$$ plain form
61042 712230 729527 748126 767980 789527 813057 838174 864346 891826 921548 954033 988760
61031 988760 1024874 1062348 1102125 1145113 1191311 1240048 1290744 1343061 1396456 1450115 1503621
61020 1503621 1557582 1613597 1673771 1740274 1814956 1899140 1993798 2099895 2218390 2350344 2497935
61009 2497935 2665862 2861488 3093588 3371600 3706183 4109433 4593918 5172868 5863546
61000 5863546 6691622 7693071 8913095 10401311 12196654 14296074 16617131 18982282
60992 18982282 21148081 22873912 23998752 24493352 24471825 24160155 23825955 23686072 23826453
60983 23826453 24171725 24518140 24610150 24225919 23244604 21679985 19670848 17429161 15168192
60974 15168192 13046576 11151259 9512393 8126335 6971470 6017456 5232553 4588506
$$ packed form
61042G12230J7297J8599J9854K1547K3530K5117K6172K7480K9722L2485L4727
61031I88760L6114L7474L9777M2988M6198M8737N0696N2317N3395N3659N3506
61020A503621N3961N6015O0174O6503P4682Q4184R4658J06097J18495J31954J47591
61009B497935J67927J95626K32100K78012L34583M03250M84485N78950O90678
61000E863546Q28076J001449J220024J488216J795343K099420K321057K365151
60992A8982282K165799J725831J124840M94600k1527l11670l34200j39883J40381
60983B3826453L45272L46415R2010l84231r81315j564619k009137k241687k260969
60974A5168192k121616j895317j638866j386058j154865r54014p84903o44047
$$ plain form
60966 4588506 4061108 3628655 3271633 2973643 2721698 2505656 2317836 2152784 2006599
60957 2006599 1876241 1759409 1654603 1560762 1476949 1402472 1336904 1279562 1229117 1183940 1142575
60946 1142575 1103705 1066085 1028973 992505 957407 924426 894101 866610 841543 818190 796295
60935 796295 776253 758277 741908 726679 712770 700377 688856 677233 665423 654247 644232
60924 644232 634977 625844 616833 608624 601990 597120 593232 588929 583261 576403 569127 561934 555096 549112
60910 549112 544336 540235 535800 530863 526365 523154 521068 519436 517911 516531 515389 514559 513988 513303 512188
60895 512188 511148 511369 513385 516376 519183 521598 524117 526892 529735 532936 537119 542078 546434 548903
60881 548903 549549 549528 549945 551314 553787 557297 561464 565808 570277 575389 581715 589416 598364 608472 619563
$$ packed form
60966D588506n27398m32453l57022k97990k51945k16042j87820j65052j46185
60957B006599j30358j16832j04806r3841q3813p4477o5568n7342n0445m5177m1365
60946A142575l8870l7620l7112l6468l5098l2981l0325k7491k5067k3353k1895
60935G96295k0042j7976j6369j5229j3909j2393j1521j1623j1810j1176j0015
60924F44232r255r133r011q209o634m870l888m303n668o858p276p193o838n984
60910E49112m776m101m435m937m498l211k086j632j525j380j142q30n71o85j115
60895E12188j040K21K016K991K807K415K519K775K843L201M183M959M356K469
60881E48903O46k1M17J369K473L510M167M344M469N112O326P701Q948J0108J1091
$$ plain form
60866 619563 631052 642150 652546 662697 673391 685243 698696 714063 731130 748896 766183
60855 766183 782620 798724 815001 831282 847073 862193 876768 890783 903953 916017 926924
60844 926924 936656 944994 951511 955805 957741 957481 955201 950750 943691 933835 921641 907966 893337 877622
60830 877622 860443 841857 822486 803056 783926 765110 746592 728556 711392 695504 680935
60819 680935 667092 653071 638536 624172 610986 599233 588376 578006 568321 559573 551489 543581
60807 543581 535708 528047 520783 514114 508373 503782 500184 497223 494647 492303 490138 488407 487508 487249 486663
60792 486663 484970 482436 479778 477122 474255 471569 469766 468623 467005 464436 461799 459987 458607 456657
60778 456657 453966 451217 448836 446593 444222 441748 439079 435823 431798 427462 423530 420317 417613 415118
$$ packed form
60866F19563J1489J1098J0396J0151J0694J1852J3453J5367J7067J7766J7287
60855G66183J6437J6104J6277J6281J5791J5120J4575J4015J3170J2064J0907
60844I26924R732Q338O517M294J936k60k280m451p059r856j2194j3675j4629j5715
60830H77622j7179j8586j9371j9430j9130j8816j8518j8036j7164j5888j4569
60819F80935j3843j4021j4535j4364j3186j1753j0857j0370r685q748q084p908
60807E43581p873p661p264o669n741m591l598k961k576k344k165j731q99k59n86
60792D86663j693k534k658k656k867k686j803j143j618k569k637j812j380j950
60778D56657k691k749k381k243k371k474k669l256m025m336l932l213k704k495
$$ plain form
60764 415118 412793 410676 408568 406133 403320 400406 397522 394433 391091 388082 386029 384574 382549 379298
60750 379298 375486 372395 370746 370380 370730 371323 372026 373041 374622 376768 379301 382138 385090 387451 388335
60735 388335 387649 386294 385073 383836 382016 379653 377392 375725 374725 374340 374431 374483 373710 371662 368649 365475
60719 365475 362811 360689 358538 355829 352729 349943 347817 345892 343515 340560 337322 334005 330658 327393
60705 327393 324265 321108 317877 315027 313129 312140 311408 310455 309432 308718 308389 308206 307971 307748 307793 308280 309078
60688 309078 309863 310490 311094 311713 312063 311916 311616 311950 313435 315810 318196 319759 320424 321040 322642 325441 328718
60671 328718 331786 334739 338107 342159 346775 351649 356229 359787 361988 363234 364049 364400 364075 363470 363399 364151
60655 364151 365247 366145 366776 367425 368563 370788 374402 378941 383448 387260 390234 392387 393847 395085 396445
$$ packed form
60764D15118k325k117k108k435k813k914k884l089l342l009k053j455k025l251
60750C79298l812l091j649l66L50N93P03J015J581K146K533K837K952K361Q84
60735C88335o86j355j221j237j820k363k261j667j000l85R1N2p73k048l013l174
60719C65475k664k122k151k709l100k786k126j925k377k955l238l317l347l265
60705C27393l128l157l231k850j898r89p32r53j023p14l29j83k35k23M5M87P98
60688C09078P85O27O04O19L50j47l00L34J485K375K386J563O65O16J602K799L277
60671C28718L068K953L368M052M616M874M580L558K201J246Q15L51l25o05p1P52
60655C64151J096Q98O31O49J138K225L614M539M507L812K974K153J460J238J360
$$ plain form
60640 396445 397297 396353 393167 388760 384368 380118 375446 370361 365578 361559 358070 354777 351763 349263 347187
60625 347187 345172 342975 340713 338712 337178 335974 334768 333507 332665 332824 333905 334966 334984 333851 332431
60610 332431 331574 331265 330951 330478 330329 330883 331857 332693 333254 333893 334985 336605 338547 340468 342073 343275 344078
60593 344078 344354 344089 343847 344488 346090 347642 348228 348117 348208 348741 349228 349373 349365 349340 349269 349402 350225 351876 354082
60574 354082 356612 359273 361636 363528 365871 370182 376965 385286 394202 403854 414817 427026 439919
60561 439919 453082 466161 478467 489128 497396 502497 503706 501094 495847 489331 482084 474197 466293
60548 466293 459467 454410 451236 450115 451446 455183 460542 466748 473920 482980 494687 508888 524769
60535 524769 541654 559211 576715 592579 605193 614131 619893 622568 621591 617055 610348 602931 595147
$$ packed form
60640C96445Q52r44l186m407m392m250m672n085m783m019l489l293l014k500k076
60625C47187k015k197k262k001j534j204j206j261q42J59J081J061J8j133j420
60610C32431q57l09l14m73j49N54R74Q36N61O39J092J620J942J921J605J202Q03
60593C44078K76k65k42O41J602J552N86j11R1N33M87J45qk5p1J33Q23J651K206
60574C54082K530K661K363J892K343M311O783Q321Q916R652J0963J2209J2893
60561D39919J3163J3079J2306J0661Q268N101J209k612n247o516p247p887p904
60548D66293o826n057l174j121J331L737N359O206P172R060J1707J4201J5881
60535E24769J6885J7557J7504J5864J2614Q938N762K675r77m536o707p417p784
$$ plain form
60522 595147 586842 578525 571067 564649 558808 553350 548485 544248 540494 537352 535018 533257 531827 531282
60508 531282 532561 535700 539764 544193 549432 556054 564113 573862 586405 602923 623629 648114 676517
60495 676517 709711 748267 791602 838265 886802 936253 985869 1034470 1080088 1120268 1152619
60484 1152619 1175074 1185960 1184282 1170012 1143894 1107048 1061068 1008400 952095 894960 839092
60473 839092 786137 737426 693620 654621 620148 590158 564484 542401 522954 505608 490368
60462 490368 477368 466506 457361 449314 441922 435338 430116 426362 423228 419522 414682 409022 403218 397853
60448 397853 393281 389500 386097 382592 378961 375689 373315 372039 371673 371749 371663 371020 369987 369175 369062 369576
60432 369576 370269 370744 370833 370469 369611 368354 366977 365746 364656 363509 362300 361401 361205 361685 362513 363522 364743
$$ packed form
60522E95147q305q317p458o418n841n458m865m237l754l142k334j761j430n45
60508E31282J279L139M064M429N239O622Q059R749J2543J6518K0706K4485K8403
60495F76517L3194L8556M3335M6663M8537M9451M9616M8601M5618M0180L2351
60484A152619K2455J0886j678j4270k6118l6846m5980n2668n6305n7135n5868
60473H39092n2955m8711m3806l8999l4473k9990k5674k2083j9447j7346j5240
60462D90368j3000j0862r145q047p392o584n222l754l134l706m840n660n804n365
60448C97853m572l781l403l505l631l272k374j276l66P6q6o43j033q12j13N14
60432C69576O93M75Q9l64q58j257j377j231j090j147j209q99j96M80Q28J009J221
$$ plain form
60415 364743 365968 366703 366794 366793 367332 368312 369138 369622 370181 371063 371857 372080 371949 372204 373259 374815 376265 377303
60397 377303 378141 379323 381288 383946 386686 388999 391020 393232 395708 397975 399771 401559 403964 406937
60383 406937 409851 412312 414494 416653 418758 420768 422942 425552 428431 431163 433654 436272 439317 442598
60369 442598 445655 448294 450762 453408 456297 459191 461824 464065 465827 466936 467248 466903 466302 465771 465273
60354 465273 464613 463946 463974 465460 468486 472295 476103 480060 485258 492683 502169 512387 521734 529290 535193
60339 535193 540223 544769 548024 548445 545332 539806 533931 528989 524888 521016 517072 513043 508929 504751
60325 504751 500561 496241 491542 486451 481267 476301 471741 467779 464436 461293 457937 454769 452731 452036
60311 452036 451851 451635 452147 454568 459190 465611 473705 483556 494850 507349 521883 539788 561049 583735
$$ packed form
60415C64743J225P35R1jN39R80Q26M84N59Q82P94K23j31K55J055J556J450J038
60397C77303Q38J182J965K658K740K313K021K212K476K267J796J788K405K973
60383D06937K914K461K182K159K105K010K174K610K879K732K491K618L045L281
60369D42598L057K639K468K646K889K894K633K241J762J109L12l45o01n31m98
60354D65273o60o67K8J486L026L809L808L957N198P425R486J0218R347P556N903
60339E35193N030M546L255M21l113n526n875m942m101l872l944m029m114m178
60325E04751m190m320m699n091n184m966m560l962l343l143l356l168k038o95
60311D52036j85k16N12K421M622O421Q094R851J1294J2499J4534J7905K1261K2686
$$ plain form
60297 583735 605518 625137 642018 655122 662798 663650 657289 644500 626938 606556 585100 564058
60285 564058 544715 527785 513056 499999 488807 480264 474474 470375 466891 463999 462158 461145 460134
60272 460134 458644 456766 454578 452009 449350 447206 445663 443900 441082 437390 433845 431200 429281 427416
60258 427416 425214 422812 420548 418590 416831 414998 412890 410631 408643 407242 406320 405579 405013 404795 404722 404295
60242 404295 403541 403260 403974 405069 405590 405663 406357 408101 410024 411126 411555 412300 414066 416823 420215 423908
60226 423908 427660 431383 435128 438804 441965 444093 445124 445573 446172 447405 449280 451438 453530 455524 457624
60211 457624 460009 462826 466360 470931 476578 483065 490193 497838 505680 513249 520380 527292 534081 540440
60197 540440 546089 551216 556240 561312 566249 570759 574566 577488 579623 581326 582853 584151 585092 585708 586015
$$ packed form
60297E83735K1783J9619J6881J3104P676Q52o361j2789j7562k0382k1456k1042
60285E64058j9343j6930j4729j3057j1192q543n790m099l484k892j841j013j011
60272D60134j490j878k188k569k659k144j543j763k818l692l545k645j919j865
60258D27416k202k402k264j958j759j833k108k259j988j401r22p41n66k18p3m27
60242D04295p54k81P14J095N21P3O94J744J923J102M29P45J766K757L392L693
60226D23908L752L723L745L676L161K128J031M49N99J233J875K158K092J994K100
60211D57624K385K817L534M571N647O487P128P645P842P569P131O912O789O359
60197E40440N649N127N024N072M937M510L807K922K135J703J527J298R41O16L07
$$ plain form
60182 586015 585756 584465 581737 577475 572096 566468 561270 556321 550929 545003 539341 534595 530449 526222
60168 526222 521891 518031 515048 512917 511410 510017 507858 504367 500100 496360 493838 492031 490102 487904
60154 487904 486014 485017 485026 485776 487026 488808 491242 494068 496546 497996 498354 498116 497934 498387 499821 502091
60138 502091 504626 507114 509971 513771 518405 523197 527696 531888 535795 539417 543076 547177 551497 555225
60124 555225 557898 559831 561456 562682 563261 563411 563746 564849 567077 570436 574339 577863 580684 583496 587132
60109 587132 591450 595514 598702 601155 603205 604872 606022 606549 606272 604987 602904 600679 598710 596583 593559
60094 593559 589505 584974 580425 575763 570857 566184 562605 560541 559627 559112 558409 557320 556064 555170 555095 555765
60078 555765 556713 557733 559056 560583 561310 560134 557258 554231 552285 550905 548382 543650 537284 530722 524806
$$ packed form
60182E86015k59j291k728m262n379n628n198m949n392n926n662m746m146m227
60168E26222m331l860k983k131j507j393k159l491m267l740k522j807j929k198
60154D87904j890r97RP50J250J782K434K826K478J450L58k38j82M53J434K270
60138E02091K535K488K857L800M634M792M499M192L907L622L659M101M320L728
60124E55225K673J933J625J226N79J50L35J103K228L359L903L524K821K812L636
60109E87132M318M064L188K453K050J667J150N27k77j285k083k225j969k127l024
60094E93559m054m531m549m662m906m673l579k064r14n15p03j089j256q94p5O70
60078E55765R48J020J323J527P27j176k876l027j946j380k523m732o366o562n916
$$ plain form
60063 524806 519240 513320 506917 500602 494944 489922 485177 480655 476754 473773 471421 468994 466034 462704
60049 462704 459580 457131 455461 454457 454049 454217 454865 455908 457541 460171 463952 468537 473511 478932 485123
60034 485123 491952 498637 504446 509351 513734 517607 520474 522020 522582 522606 521830 519444 515137 509602 503759
60019 503759 497836 491538 484853 478152 471604 465086 458791 453362 449137 445726 442653 440010 438081 436638
60005 436638 435060 432961 430302 427095 423466 419911 417022 414987 413715 413334 414060 415516 416721 417008 416739
59990 416739 416891 418099 420168 422409 424391 426445 429335 433312 437702 441704 445384 449415 453901 458001
59976 458001 460845 462390 463157 463489 463367 462679 461367 459403 456855 453987 451179 448767 446931 445683 444969
59961 444969 444831 445335 446276 447175 447856 448789 450513 452907 455450 458030 460897 463839 466134 467539 468758 470558
$$ packed form
60063E24806n566n920o403o315n658n022m745m522l901k981k352k427k960l330
60049D62704l124k449j670j004m08J68O48J043J633K630L781M585M974N421O191
60034D85123O829O685N809M905M383L873K867J546N62K4p76k386m307n535n843
60019E03759n923o298o685o701o548o518o295n429m225l411l073k643j929j443
60005D36638j578k099k659l207l629l555k889k035j272l81P26J456J205K87k69
59990D16739J52J208K069K241J982K054K890L977M390M002L680M031M486M100
59976D58001K844J545P67L32j22o88j312j964k548k868k808k412j836j248p14
59961D44969j38N04R41Q99O81R33J724K394K543K580K867K942K295J405J219J800
$$ plain form
59945 470558 472848 474937 476353 477124 477569 478162 479309 480883 482145 482394 481588 480181 478584 476933 475040
59930 475040 472392 468575 463998 459847 456987 455216 453908 452981 452739 453094 453617 454295 455658 458114 461583
59915 461583 465783 470527 475621 480788 485770 490370 494544 498710 503792 510469 518350 526181 532885 538117
59901 538117 541865 543961 544146 542400 539127 535144 531386 528291 525496 522388 518945 515834 513825 513397 514698
59886 514698 517312 520128 522118 523497 525631 529536 534783 540084 544500 547863 550490 552981 555986 559691
59872 559691 563607 567152 570206 572720 574054 573289 570246 565755 560800 555738 550474 545076 539938 535497
59858 535497 531983 529382 527521 526213 525396 525126 525522 526798 529325 533495 539476 547194 556489 567112 578539
59843 578539 589933 600333 608732 614047 615469 613208 608820 604536 602107 602102 603861 605804 606076 603536 598319
$$ packed form
59945D70558K290K089J416P71M45N93J147J574J262K49q06j407j597j651j893
59930D75040k648l817m577m151k860j771j308r27k42L55N23O78J363K456L469
59915D61583M200M744N094N167M982M600M174M166N082O677P881P831O704N232
59901E38117L748K096J85j746l273l983l758l095k795l108l443l111k009m28J301
59886E14698K614K816J990J379K134L905N247N301M416L363K627K491L005L705
59872E59691L916L545L054K514J334p65l043m491m955n062n264n398n138m441
59858E35497l514k601j861j308q17k70L96J276K527M170N981P718R295J0623J1427
59843E78539J1394J0400Q399N315J422k261m388m284k429nJ759J943K72k540n217
$$ plain form
59828 598319 591256 582820 573034 562386 552198 543691 537011 531526 526739 522446 518247 513601 508488 503548
59814 503548 499362 495906 492895 490390 488828 488593 489697 491772 494287 496851 499278 501298 502399 502295 501418
59799 501418 500513 499682 498318 496034 493172 490187 487064 483629 479962 476124 471934 467550 463840 461533 460239
59784 460239 458916 457149 455333 453729 452028 449942 447554 444939 442005 438948 436370 434667 433658 433033
59770 433033 432807 433099 433855 434979 436442 437994 439163 439823 440443 441493 442881 444319 445983 448429 451924
59755 451924 456132 460283 463571 465691 467350 469912 474120 479348 484532 489580 495277 501895 508625 514605
59741 514605 519930 525251 530676 535505 539001 541088 542312 543313 544434 545677 546859 547766 548249 548366 548448
59726 548448 548769 549072 548720 547586 546573 546763 548061 549134 548908 547798 547203 547979 549687 551231 551946 552052
$$ packed form
59828E98319p063q436r786j0648j0188q507o680n485m787m293m199m646n113m940
59814E03548m186l456l011k505j562k35J104K075K515K564K427K020J101j04q77
59799E01418r05q31j364k284k862k985l123l435l667l838m190m384l710k307j294
59784D60239j323j767j816j604j701k086k388k615k934l057k578j703j009o25
59770D33033k26K92P56J124J463J552J169O60O20J050J388J438J664K446L495
59755D51924M208M151L288K120J659K562M208N228N184N048N697O618O730N980
59741E14605N325N321N425M829L496K087J224J001J121J243J182R07M83J17Q2
59726E48448L21L03l52j134j013J90J298J073k26j110n95P76J708J544P15J06
$$ plain form
59710 552052 552274 553198 554902 557030 559049 560533 561419 562161 563493 565873 569205 573252 578054 583594 589178
59695 589178 593785 597248 600595 604791 609481 613489 616367 618820 621482 623849 624827 624014 622063 619878 617897
59680 617897 616151 614643 613394 612314 611265 610156 608758 606528 602942 598122 592852 587808 582979 578026
59666 578026 572979 568226 563897 559710 555513 551613 548408 545979 544293 543517 543805 544880 546149 547264 548394
59651 548394 549995 552464 555957 560292 564925 569215 572808 575717 578033 579629 580145 579241 576894 573444 569224
59636 569224 564100 557638 549920 541989 535151 529867 525591 521602 517674 514034 511060 509132 508318 508030 507257
59621 507257 505433 502904 500431 498387 496534 494344 491390 487716 483959 480781 477981 474513 469731 464402
59607 464402 460058 457570 456767 457210 458675 460779 462754 463993 464618 465176 465907 466502 466516 465848 464840 463942 463305
$$ packed form
59710E52052K22R24J704K128K019J484Q86P42J332K380L332M047M802N540N584
59695E89178M607L463L347M196M690M008K878K453K662K367R78q13j951k185j981
59680F17897j746j508j249j080j049j109j398k230l586m820n270n044m829m953
59666E78026n047m753m329m187m197l900l205k429j686p76K88J075J269J115J130
59651E48394J601K469L493M335M633M290L593K909K316J596N16r04k347l450m220
59636E69224n124o462p718p931o838n284m276l989l928l640k974j928q14k88p73
59621E07257j824k529k473k044j853k190k954l674l757l178k800l468m782n329
59607D64402m344k488q03M43J465K104J975J239O25N58P31N95J4o68j008q98o37
$$ plain form
59590 463305 462708 461919 461064 460537 460596 461112 461635 461612 460724 459221 457851 457163 456863 456085 454302 451730 448916 446229
59572 446229 443823 441743 439820 437709 435227 432616 430352 428698 427493 426245 424531 422435 420585 419557
59558 419557 419316 419453 419841 420677 421930 423263 424587 426188 428104 429953 431682 433952 437215 440835 443826
59543 443826 446237 449088 453029 457835 463371 470247 479146 490108 503106 518848 538086 560018 581875
59530 581875 600310 612913 618529 616947 609157 597730 586058 576593 569897 565482 563233 563572 566447
59517 566447 570757 574993 578184 580079 580716 580122 578341 575474 571627 566829 560989 554015 546090 537731 529312
59502 529312 520603 511207 501513 492740 485711 479984 474631 469573 465581 463079 461488 459880 457840 455591
59488 455591 453636 452454 452268 452835 453605 454229 454815 455656 456895 458563 460766 463666 467326 471603 476155 480575
$$ packed form
59590D63305n97p89q55n27N9N16N23k3q88j503j370o88l00p78j783k572k814k687
59572D46229k406k080j923k111k482k611k264j654j205j248j714k096j850j028
59558D19557k41J37L88Q36J253J333J324J601J916J849J729K270L263L620K991
59543D43826K411K851L941M806N536O876Q899J0962J2998J5742J9238K1932K1857
59530E81875J8435J2603N616j582p790j1427j1672r465o696m415k249L39K875
59517E66447M310M236L191J895O37n94j781k867l847m798n840o974p925q359q419
59502E29312q709r396r694q773p029n727n353n058l992k502j591j608k040k249
59488D55591j955j182j86N67P70O24N86Q41J239J668K203K900L660M277M552M420
$$ plain form
59472 480575 484650 488498 492246 495632 498131 499573 500397 501165 501983 502535 502568 502148 501563 501166 501295 502169 503815
59455 503815 506151 509166 512999 517840 523772 530683 538321 546447 554886 563442 571865 579931 587391 593744
59441 593744 598239 600388 600399 598781 595600 590524 583659 575919 568289 561024 553882 546890 540470 534827 529659
59426 529659 524587 519765 515918 513803 513553 514541 516068 518327 522442 529374 539043 550813 564510 580340
59412 580340 597994 616761 636815 659579 685938 714292 740850 761667 774042 776616 769453 754504
59400 754504 735292 715516 698108 685542 679976 682006 689416 697915 703289 702692 694455 678007 654616
59387 654616 627549 600602 576257 555307 537825 523917 513540 506129 500759 496618 493268 490610
59375 490610 488741 487803 487811 488567 489753 491132 492641 494279 495995 497755 499660 501852 504311 506953 510009
$$ packed form
59472D80575M075L848L748L386K499J442Q24P68Q18N52L3m20n85l97J29Q74J646
59455E03815K336L015L833M841N932O911P638Q126Q439Q556Q423Q066P460O353
59441E93744M495K149J1j618l181n076o865p740p630p265p142o992o420n643n168
59426E29659n072m822l847k115k50R88J527K259M115O932R669J1770J3697J5830
59412E80340J7654J8767K0054K2764K6359K8354K6558K0817J2375K574p163j4949
59400G54504j9212j9776j7408j2566n566K030P410Q499N374n97q237j6448k3391
59387F54616k7067k6947k4345k0950j7482j3908j0377p411n370m141l350k658
59375D90610j869r38QP56J186J379J509J638J716J760J905K192K459K642L056
$$ plain form
59360 510009 514063 519489 525951 532651 539002 544923 550673 556684 563430 571155 579707 588921 599044 610517
59346 610517 623397 637397 652451 668772 686250 704310 722512 740899 759452 777658 794948
59335 794948 811177 826202 839182 848873 854709 857318 857835 856790 853696 847672 838493 826984 814300
59322 814300 800974 786959 772400 757881 743845 730384 717748 706476 696630 687431 678131 668922
59310 668922 660538 653332 647265 642461 639169 637287 636416 636337 637099 638862 642077 647642 656367 668371 683213
59295 683213 700118 717438 732279 741658 744247 740586 731833 719133 704142 689085 675635 664109
59283 664109 654098 645510 638773 634337 632268 632083 632877 633848 634818 636066 637760 640004 643323 648441 655390
59268 655390 663358 671683 680545 690350 700817 710987 719913 727045 732129 735033 735760 734563 731986 728491
$$ packed form
59360E10009M054N426O462O700O351N921N750O011O746P725Q552R214J0123J1473
59346F10517J2880J4000J5054J6321J7478J8060J8202J8387J8553J8206J7290
59335G94948J6229J5025J2980R691N836K609N17j045l094o024r179j1509j2684
59322H14300j3326j4015j4559j4519j4036j3461j2636j1272r846r199r300r209
59310F68922q384p206o067m804l292j882q71p9P62J763L215N565Q725J2004J4842
59295F83213J6905J7320J4841R379K589l661q753j2700j4991j5057j3450j1526
59283F64109j0011q588o737m436k069j85P94R71R70J248J694K244L319N118O949
59268F55390P968Q325Q862R805J0467J0170Q926P132N084K904P27j197k577l495
$$ plain form
59254 728491 723792 716872 707095 695137 682334 669374 656334 643762 632776 623832 616248 609290 603067
59241 603067 597967 593881 590503 587914 586338 585686 585761 586576 588037 589625 590785 591431 591860 592469 593659 595523
59225 595523 597360 598007 597008 595012 592720 589954 586145 581209 575459 569100 562316 555452 548688 541936 535448
59210 535448 530061 526362 524144 523137 523583 525405 527486 528746 529487 530735 532583 534207 535295 536364 537682
59195 537682 538948 540162 541878 544383 547423 550929 555206 560162 565167 570003 575204 581045 586889 592013
59181 592013 596512 600911 605393 609909 614592 619530 624453 629106 633632 638115 642058 644841 646596 648130
59167 648130 650050 652308 654536 656452 658043 659760 662528 667099 673147 679260 684064 687318 689806 692260
59153 692260 694542 695841 695459 693251 689423 684107 677344 669426 661124 653444 647051 641829 637064 632145
$$ packed form
59254G28491m699o920r777j1958j2803j2960j3040j2572j0986q944p584o958o223
59241F03067n100m086l378k589j576o52P5Q15J461J588J160O46M29O09J190J864
59225E95523J837O47r99j996k292k766l809m936n750o359o784o864o764o752o488
59210E35448n387l699k218j007M46J822K081J260P41J248J848J624J088J069J318
59195E37682J266J214J716K505L040L506M277M956N005M836N201N841N844N124
59181E92013M499M399M482M516M683M938M923M653M526M483L943K783J755J534
59167F48130J920K258K228J916J591J717K768M571O048O113M804L254K488K454
59153F92260K282J299l82k208l828n316o763p918q302p680o393n222m765m919
$$ plain form
59139 632145 627082 622280 617956 614066 610705 608183 606581 605579 604901 604563 604520 604444 604162 604030 604500 605563
59123 605563 606939 608530 610393 612530 615130 618719 623614 629475 635899 643171 651776 661313 670570 678732
59109 678732 685981 692864 699588 706001 711763 716466 720058 723144 726358 729419 731377 731898 731640 731206 730399
59094 730399 728845 726750 724536 722188 719473 716549 713886 711695 709780 707892 705962 704024 702055 699810
59080 699810 696796 692579 687154 680805 673595 665296 655894 645907 636104 627104 619222 612358 605966 599486
59066 599486 592866 586349 579864 573155 566562 560997 556829 553276 549310 544712 539943 535393 531211 527556
59052 527556 524517 521891 519391 516975 514791 512944 511450 510177 508763 507007 505498 505274 506469 507775
59038 507775 507811 506696 505718 505756 506714 508313 510639 513675 516894 519685 521954 524106 526604 529750 533746 538818
$$ packed form
59139F32145n063m802m324l890l361k522j602j002o78l38m3p6k82j32M70J063
59123F05563J376J591J863K137K600L589M895N861O424P272Q605R537R257Q162
59109F78732P249O883O724O413N762M703L592L086L214L061J958N21k58m34q07
59094G30399j554k095k214k348k715k924k663k191j915j888j930j938j969k245
59080F99810l014m217n425o349p210q299r402r987r803r000p882o864o392o480
59066E99486o620o517o485o709o593n565m168l553l966m598m769m550m182l655
59052E27556l039k626k500k416k184j847j494j273j414j756j509k24J195J306
59038E07775L6j115r78L8R58J599K326L036L219K791K269K152K498L146L996N072
$$ plain form
59022 538818 545201 553028 562261 572781 584422 596756 608998 620555 631694 643185 655095 666342
59010 666342 675719 682912 688108 691080 691368 689302 686278 683918 683159 684003 685743 687497 688871 690202 691965
58995 691965 694177 696578 699133 701863 704374 706098 706953 707216 706754 704994 701826 697999 694236 690305 685336
58980 685336 678902 671512 664136 657512 651989 647846 645563 645582 647794 651559 656401 662498 670179 679145 688591
58965 688591 698070 707769 717871 728059 737887 747304 756567 765796 774791 783145 790376 796059 799915 801735
58951 801735 801168 797755 791205 781547 769079 754459 738857 723664 709774 697192 685382 673903
58939 673903 662777 652497 643770 637004 631902 627784 624317 621541 619090 615931 611297 605653 600279 596088
58925 596088 593212 591445 590485 589761 588691 587347 586392 586082 585763 584697 583055 581677 581086 581151 581571 582125 582496
$$ packed form
59022E38818O383P827R233J0520J1641J2334J2242J1557J1139J1491J1910J1247
59010F66342R377P193N196K972K88k066l024k360p59Q44J740J754J374J331J763
58995F91965K212K401K555K730K511J724Q55K63m62j760l168l827l763l931m969
58980F85336o434p390p376o624n523m143k283J9K212L765M842O097P681Q966R446
58965F88591R479R699J0102J0188R828R417R263R229Q995Q354P231N683L856J820
58951H01735n67l413o550r658j2468j4620j5602j5193j3890j2582j1810j1479
58939F73903j1126j0280q727o766n102m118l467k776k451l159m634n644n374m191
58925E96088k876j767r60p24j070j344r55l10l19j066j642j378n91O5M20N54L71
$$ plain form
58908 582496 582417 582271 583106 585663 589585 593953 598545 604165 611636 620832 630983 641766 653624 666879
58894 666879 680934 694757 707972 720958 733834 746042 757344 768767 781882 797312 814469
58883 814469 832560 851148 869675 887275 903394 918041 931012 941369 948129 951112 950687 947051
58871 947051 940259 930686 918925 905351 890258 874277 858232 842662 827797 813805 800726 788477
58859 788477 777285 767754 759884 752403 743865 734260 724798 716185 707984 699667 691294 682949 674371 665635
58845 665635 657436 650241 643806 637987 633317 630091 627383 623734 618606 612578 606422 600605 595460 591108
58831 591108 587076 582558 577302 571958 567489 564410 562625 561747 561478 561773 562653 563861 564870 565390 565770 566780
58815 566780 568979 572274 575955 579225 581896 584534 587675 591053 593977 596411 599087 602346 605436 607329
$$ packed form
58908E82496p9j46Q35K557L922M368M592N620P471R196J0151J0783J1858J3255
58894F66879J4055J3823J3215J2986J2876J2208J1302J1423J3115J5430J7157
58883H14469J8091J8588J8527J7600J6119J4647J2971J0357O760K983m25l636
58871I47051o792r573j1761j3574j5093j5981j6045j5570j4865j3992j3079j2249
58859G88477j1192r531p870p481q538r605r462q613q201q317q373q345q578q736
58845F65635q199p195o435n819m670l226k708l649n128o028o156n817n145m352
58831E91108m032m518n256n344m469l079j785q78k69K95Q80J208J009N20L80J010
58815E66780K199L295L681L270K671K638L141L378K924K434K676L259L090J893
$$ plain form
58801 607329 607892 607879 607991 608236 607995 606519 603561 599703 595837 592290 588751 585065 581539 578307 575006 571428
58785 571428 568064 565596 564264 564071 565184 567745 571631 576757 583226 590840 598929 607074 615499 624229
58771 624229 632236 637983 640464 639321 634486 626438 616485 606071 595893 586124 577088 569089 561937 555365
58757 555365 549636 545009 540972 536918 533335 531336 530964 530999 530642 530495 531516 533651 536032 538028 539749
58742 539749 541827 544962 549475 555147 561625 568854 576822 585069 592944 600266 607254 613913 620120 626206
58728 626206 632694 639338 645104 649336 652322 654449 655397 654612 652200 648967 645774 643083 640906 638944 636952
58713 636952 635122 633978 633926 635049 637273 640410 644121 648092 652099 655635 657710 657601 655642 652727 649085
58698 649085 644131 637432 629136 619407 608230 596024 583819 572392 561693 551351 541356 531998 523537
$$ packed form
58801F07329N63j3J12K45k41j476k958l858l866l547l539l686l526l232l301l578
58785E71428l364k468j332j93J113K561L886N126O469P614Q089Q145Q425Q730
58771F24229Q007N747K481j143m835q048r953j0414j0178r769r036p999p152o572
58757E55365n729m627m037m054l583j999l72L5l57j47J021K135K381J996J721
58742E39749K078L135M513N672O478P229P968Q247P875P322O988O659O207O086
58728F26206O488O644N766M232K986K127R48p85k412l233l193k691k177j962j992
58713F36952j830j144n2J123K224L137L711L971M007L536K075j09j959k915l642
58698F49085m954o699q296r729j1177j2206j2205j1427j0699j0342r995r358q461
$$ plain form
58685 523537 516192 510113 505173 501012 497370 494081 490782 487102 483220 479785 477198 475403 474320 473942
58671 473942 473984 474079 474544 476392 480384 486485 494258 503198 512642 522042 531533 541540 551616 560323 566515
58656 566515 570003 570818 568745 564101 558098 551765 545073 537710 530094 522952 516437 510384 504978 500488
58642 500488 496727 493408 490691 488690 486837 484451 481675 479170 477169 475559 474616 474841 476102 477744 479595
58627 479595 482203 485972 490586 495331 499460 502254 503369 503308 503080 503259 503790 504753 506648 509627 512976 515875
58611 515875 518460 521654 525998 530960 535499 539088 542073 545103 548387 551554 554086 555708 556450 556597 556621
58596 556621 556856 557151 557083 556659 556493 557082 558093 558658 558241 557030 555672 554977 555836 559100 565235 573970 584233
58579 584233 594601 604105 612722 620967 629070 636800 643994 650879 657730 664561 671303 677997 684684 691437
$$ packed form
58685E23537p345o079m940m161l642l289l299l680l882l435k587j795j083l78
58671D73942M2R5M65J848L992O101P773Q940R444R400R491J0007J0076Q707O192
58656E66515L488Q15k073m644o003o333o692p363p616p142o515o053n406m490
58642E00488l761l319k717k001j853k386k776k505k001j610r43K25J261J642J851
58627D79595K608L769M614M745M129K794J115o1k28J79N31R63J895K979L349K899
58611E15875K585L194M344M962M539L589K985L030L284L167K532J622P42J47K4
58596E56621K35K95o8m24j66N89J011N65m17j211j358o95Q59L264O135Q735J0263
58579E84233J0368R504Q617Q245Q103P730P194O885O851O831O742O694O687O753
$$ plain form
58565 691437 698654 707001 716922 728523 742105 758408 777923 800213 824225 849118 874508 900018
58553 900018 924820 947633 967145 982582 993920 1001470 1005423 1006074 1004192 1000566 995287 988209 980119
58540 980119 972463 965509 957605 946907 933248 917618 900378 880912 858901 835199 811405 789015
58528 789015 768887 750986 734643 719397 705636 694199 685495 679281 675055 672280 670352 668738 667191
58515 667191 665675 664187 662784 661599 660604 659511 658055 656280 654491 653139 652600 652650 652265 650645 648554
58500 648554 647766 648814 650023 649387 646732 643465 640867 639428 639219 639886 640511 640487 640509 641941 645140 649073
58484 649073 652684 656092 660383 666598 674962 684772 695148 706104 718617 733348 749687 766537 783541
58471 783541 800759 817439 831961 843032 850285 853767 853553 849905 843215 833758 822090 809722 798719
$$ packed form
58565F91437P217Q347R921J1601J3582J6303J9515K2290K4012K4893K5390K5510
58553I00018K4802K2813J9512J5437J1338P550L953O51j882l626n279p078q090
58540I80119p656o954p904j0698j3659j5630j7240j9466k2011k3702k3794k2390
58528G89015k0128j7901j6343j5246j3761j1437q704o214m226k775j928j614j547
58515F67191j516j488j403j185r95j093j456j775j789j352n39N0l85j620k091
58500F48554p88J048J209o36k655l267k598j439k09O67O25k4K2J432L199L933
58484F49073L611L408M291O215Q364R810J0376J0956J2513J4731J6339J6850J7004
58471G83541J7218J6680J4522J1071P253L482k14l648o690r457j1668j2368j1003
$$ plain form
58458 798719 790353 784558 780769 778833 778979 781368 785936 792437 800535 810001 820769 832484 844072 854017
58444 854017 860983 864019 862573 856917 848444 838909 829251 819425 809296 799233 789897 781915 775841 772004
58430 772004 770267 770216 771588 774292 778134 782851 788397 794934 802613 811549 821797 833062 844628 855873
58416 855873 866563 876273 883849 888019 888432 885622 880199 872631 863710 854525 845800 837650 830042 823192
58402 823192 817406 812779 809070 805778 802492 799344 796916 795598 795309 796002 798012 801536 806175 811309 816563
58387 816563 821592 825876 829195 831925 834423 836568 838256 839886 841851 844051 846439 849498 853618 858500
58373 858500 863681 869067 874369 878814 882256 885901 891047 897646 905024 913300 922914 933320 943504 953528
58359 953528 964340 976239 988710 1001673 1015686 1030871 1046585 1062106 1076763 1089594 1099889
$$ packed form
58458G98719q366n795l789j936J46K389M568O501Q098R466J0768J1715J1588R945
58444H54017O966L036j446n656q473r535r658r826j0129j0063r336p982o074l837
58430G72004j737n1J372K704L842M717N546O537P679Q936J0248J1265J1566J1245
58416H55873J0690R710P576M170M13k810n423p568q921r185q725q150p608o850
58402H23192n786m627l709l292l286l148k428j318k89O93K010L524M639N134N254
58387H16563N029M284L319K730K498K145J688J630J965K200K388L059M120M882
58373H58500N181N386N302M445L442L645N146O599P378Q276R614J0406J0184J0024
58359I53528J0812J1899J2471J2963J4013J5185J5714J5521J4657J2831J0295
$$ plain form
58348 1099889 1107913 1114147 1118201 1119694 1119835 1120706 1123055 1126239 1130306 1136438 1145026 1154831 1164704 1174943
58334 1174943 1186333 1198926 1212404 1226745 1241852 1257248 1272686 1288561 1305287 1322659 1339930
58323 1339930 1356047 1369918 1381182 1390734 1399794 1408530 1416282 1422850 1428715 1434229 1439653 1445819 1453620
58310 1453620 1462894 1472891 1483678 1495889 1509237 1522685 1536187 1550922 1567645 1585986 1605512 1626173
58298 1626173 1647575 1669042 1690589 1712670 1734967 1756702 1778168 1800472 1823736 1847050 1870331
58287 1870331 1894524 1919787 1945269 1971103 1998790 2028980 2060506 2092394 2125237 2159696 2195077
58276 2195077 2230431 2265947 2302466 2340517 2380420 2422400 2466133 2511130 2557762 2606885 2658443
58265 2658443 2711743 2767031 2825251 2886331 2949505 3015323 3085303 3159337 3235582 3313304 3393639
$$ packed form
58348A099889Q024O234M054J493J41Q71K349L184M067O132Q588R805R873J0239
58334A174943J1390J2593J3478J4341J5107J5396J5438J5875J6726J7372J7271
58323A339930J6117J3871J1264R552R060Q736P752O568N865N514N424O166P801
58310A453620R274R997J0787J2211J3348J3448J3502J4735J6723J8341J9526K0661
58298A626173K1402K1467K1547K2081K2297K1735K1466K2304K3264K3314K3281
58287A870331K4193K5263K5482K5834K7687L0190L1526L1888L2843L4459L5381
58276B195077L5354L5516L6519L8051L9903M1980M3733M4997M6632M9123N1558
58265B658443N3300N5288N8220O1080O3174O5818O9980P4034P6245P7722Q0335
$$ plain form
58254 3393639 3477020 3562125 3648076 3735446 3824262 3913321 4002597 4094255 4190248 4290901 4396733
58243 4396733 4509505 4630317 4758713 4894691 5039603 5194130 5357513 5529719 5712100
58234 5712100 5905105 6107823 6320742 6546373 6786235 7040117 7309386 7597807 7907639
58225 7907639 8238119 8589515 8965598 9370438 9806081 10275309 10783373 11334993 11933127
58216 11933127 12582908 13293445 14073622 14929993 15871279 16911285 18065358 19348743 20781808
58207 20781808 22393173 24215823 26286285 28652473 31378940 34542978 38233247 42557508
58199 42557508 47646144 53644741 60712626 69037328 78847232 90411753 104051308 120170956
58191 120170956 139284654 161985760 188845452 220209585 255842783 294470869 333483043
$$ packed form
58254C393639Q3381Q5105Q5951Q7370Q8816Q9059Q9276R1658R5993J00653J05832
58243D396733J12772J20812J28396J35978J44912J54527J63383J72206J82381
58234E712100J93005K02718K12919K25631K39862K53882K69269K88421L09832
58225G907639L30480L51396L76083M04840M35643M69228N08064N51620N98134
58216A1933127O49781P10537P80177Q56371R41286J040006J154073J283385J433065
58207B0781808J611365J822650K070462K366188K726467L164038L690269M324261
58199D2557508N088636N998597P067885Q324702R809904J1564521J3639555J6119648
58191A20170956J9113698K2701106K6859692L1364133L5633198L8628086L9012174
$$ plain form
58184 333483043 369120068 397228723 414302328 418377682 409476097 389472829 361452912
58177 361452912 328800693 294413253 260346559 227897497 197866129 170751063 146817144
58170 146817144 126106458 108462108 93583914 81103500 70651669 61893823 54535885
58163 54535885 48324381 43051066 38551015 34690332 31357281 28462999 25939902 23731929
58155 23731929 21788051 20065409 18531628 17159422 15922611 14799958 13778191 12847397
58147 12847397 11996538 11215986 10500595 9846795 9249226 8702780 8205014 7753701 7344108
58138 7344108 6970830 6629883 6316851 6025448 5750303 5489327 5241667 5005682 4780831
58129 4780831 4569140 4372488 4190106 4020426 3863250 3718149 3582643 3454062 3331724
$$ packed form
58184C33483043L5637025K8108655J7073605M075354q901585k0003268k8019917
58177C61452912l2652219l4387440l4066694l2449062l0031368k7115066k3933919
58170A46817144k0710686j7644350j4878194j2480414j0451831q757846p357938
58163E4535885o211504n273315m500051l860683l333051k894282k523097k207973
58155B3731929j943878j722642j533781j372206j236811j122653j021767r30794
58147A2847397q50859p80552p15391o53800n97569n46446m97766m51313m09593
58138G344108l73278l40947l13032k91403k75145k60976k47660k35985k24851
58129D780831k11691j96652j82382j69680j57176j45101j35506j28581j22338
$$ plain form
58120 3331724 3215675 3105035 2999231 2899070 2804798 2714746 2627628 2544530 2466840 2393761
58110 2393761 2323724 2256760 2193628 2133898 2076689 2022083 1970066 1919284 1868660 1819295 1773000
58099 1773000 1729816 1688445 1648253 1609358 1571580 1534704 1499001 1464216 1429055 1393032 1357910
58088 1357910 1325924 1297388 1271220 1246818 1223991 1202049 1180540 1160185 1141621 1123866 1105427
58077 1105427 1086276 1067393 1048980 1030558 1012275 994697 977646 960458 943122 926061 909262
58066 909262 892640 876797 862311 848787 835651 823383 812769 803423 794228 784864 775722 766596
58054 766596 756654 745576 733776 721656 709516 697992 687649 678245 669185 660557 653097 647325 643227
58041 643227 640374 637798 634246 629235 623434 617498 611198 604335 597650 591841 586292 579812 572162 563909
$$ packed form
58120C331724j16049j10640j05804j00161r4272r0052q7118q3098p7690p3079
58110B393761p0037o6964o3132n9730n7209n4606n2017n0782n0624m9365m6295
58099A773000m3184m1371m0192l8895l7778l6876l5703l4785l5161l6023l5122
58088A357910l1986k8536k6168k4402k2827k1942k1509k0355j8564j7755j8439
58077A105427j9151j8883j8413j8422j8283j7578j7051j7188j7336j7061j6799
58066I09262j6622j5843j4486j3524j3136j2268j0614r346r195r364r142r126
58054G66596r942j1078j1800j2120j2140j1524j0343r404r060q628p460n772m098
58041F43227k853k576l552n011n801n936o300o863o685n809n549o480p650q253
$$ plain form
58027 563909 555265 546025 536266 526183 515631 504695 494286 485283 477512 470449 464348 459625 455647
58014 455647 451384 446991 443547 441349 439568 437532 435359 433260 431127 428843 426346 423462 420313 417601
58000 417601 415782 414291 412379 410340 409044 408620 408547 408635 408879 408673 407416 405758 405020 405387 405838 405883 406090
57983 406090 406612 406416 404518 401152 397242 393396 389791 386452 383271 380154 377364 375324 374052 373222 372695
57968 372695 372441 372057 371031 369469 367966 366856 366226 366443 367782 369627 370999 371939 373360 375380 376797
57953 376797 376637 375306 373731 372074 369894 367054 363955 361204 359464 359259 360571 362839 365577 368753 372566
57938 372566 377222 383004 390118 398388 407493 417464 428443 439868 450563 459781 467667 474531 480213
57925 480213 484332 486591 486604 484026 479191 473087 466310 458470 449066 438540 427979 417957 408145 398021
$$ packed form
58027E63909q644r240r759j0083j0552j0936j0409r003p771p063o101m723l978
58014D55647m263m393l444k198j781k036k173k099k133k284k497k884l149k712
58000D17601j819j491j912k039j296m24p3Q8K44k06j257j658p38L67M51M5K07
57983D06090N22j96j898l366l910l846l605l339l181l117k790k040j272q30n27
57968C72695k54l84j026j562j503j110o30K17J339J845J372R40J421K020J417
57953C76797j60j331j575j657k180k840l099k751j740k05J312K268K738L176L813
57938C72566M656N782P114Q270R105R971J0979J1425J0695R218P886O864N682
57925D80213M119K259J3k578m835o104o777p840r404j0526j0561j0022r812j0124
$$ plain form
57911 398021 387666 377804 369236 362246 356554 351801 347939 345006 342743 340756 338972 337602 336641 335658
57897 335658 334119 331842 329359 327937 328781 331727 335029 336977 337520 337836 338750 340368 342906 346713 351344
57882 351344 355621 358937 361700 364164 365685 365616 364212 362053 359124 355110 350187 344903 339579 334378 329696
57867 329696 325900 322750 319557 315895 311834 307587 303299 299270 296014 293916 292946 292794 293295 294686 297384
57852 297384 301483 306582 312140 317828 323384 328406 332602 336018 338677 340188 340248 339352 338382 337419 335609
57837 335609 332402 328394 324658 321675 319236 317006 314832 312717 310841 309486 308810 308776 309333 310438 311922
57822 311922 313637 315788 318795 322734 327151 331519 335572 339250 342714 346438 350790 355315 358838 360457
57808 360457 360147 358307 355163 350764 345157 338354 330499 322236 314526 307898 302299 297808 294844 293330
$$ packed form
57911C98021j0355r862q568o990n692m753l862k933k263j987j784j370r61r83
57897C35658j539k277k483j422Q44K946L302J948N43L16R14J618K538L807M631
57882C51344M277L316K763K464J521o9j404k159k929m014m923n284n324n201m682
57867C29696l796l150l193l662m061m247m288m029l256k098r70j52N01J391K698
57852B97384M099N099N558N688N556N022M196L416K659J511O0q96r70r63j810
57837C35609l207m008l736k983k439k230k174k115j876j355o76l4N57J105J484
57822C11922J715K151L007L939M417M368M053L678L464L724M352M525L523J619
57808C60457l10j840l144m399n607o803p855q263p710o628n599m491k964j514
$$ plain form
57794 293330 292211 290406 287937 285560 283595 281676 279528 277389 275598 274230 273286 272924 273356 274645 276718
57779 276718 279500 282994 287196 291905 296715 301390 306247 311872 318366 325096 331294 336616 341018 344418
57765 344418 346710 347906 347979 346777 344327 341074 337556 333837 329493 324178 318178 312432 307962 305078 303126
57750 303126 301237 299340 298157 298142 298812 299369 299714 300420 301789 303311 304227 304456 304676 305414 306268 306323 305277
57733 305277 303732 302324 301084 299992 299526 299980 300639 300492 299664 299241 299684 300342 300757 301465 302953 304586 305271
57716 305271 304745 303579 302290 301018 299832 298773 297736 296722 296006 295654 295061 293479 290946 288302 286301
57701 286301 285033 284193 283603 283409 283929 285372 287648 290478 293627 296860 299744 301872 303272 304161 304165 302289
57685 302289 298006 292092 286112 281326 278296 277151 277875 280491 285191 292108 300956 311372 323850 339918
$$ packed form
57794B93330j119j805k469k377j965j919k148k139j791j368r44l62M32J289K073
57779B76718K782L494M202M709M810M675M857N625O494O730O198N322M402L400
57765C44418K292J196P3j202k450l253l518l719m344n315o000n746m470k884j952
57750C03126j889j897j183j5O70N57L45P06J369J522R16K29K20P38Q54N5j046
57733C05277j545j408j240j092m66M54O59j47q28m23M43O58M15P08J488J633O85
57716C05271n26j166j289j272j186j059j037j014p16l52n93j582k533k644k001
57701B86301j268q40n90j94N20J443K276K830L149L233K884K128J400Q89Mj876
57685C02289m283n914n980m786l030j145P24K616M700O917Q848J0416J2478J6068
$$ plain form
57671 339918 361046 387840 420641 460494 509028 567380 635091 709104 783062 847985 894691
57660 894691 916400 910122 877194 823451 757884 689362 623749 563875 511308 467094 431116 401985
57648 401985 378066 358216 341687 328005 317096 308945 302965 298187 294088 290758 288215 286147 284450
57635 284450 283508 283616 284474 285451 286167 286698 287363 288333 289263 289488 288742 287487 286244 284976 283502 282108 281140
57618 281140 280312 279121 277758 276780 276062 274934 273340 271916 270794 269281 267057 264825 263295 262284 261304
57603 261304 260383 259732 259166 258455 257809 257410 256826 255502 253569 251648 250085 248800 247643 246395 244599 241972
57587 241972 238953 236436 234874 233886 232664 230644 227953 225419 223921 223482 223232 222464 221425 220745 220470 220134
57571 220134 219487 218581 217299 215440 213292 211584 210696 210265 209706 208809 207800 207056 206844 207089 207385 207530 208001
$$ packed form
57671C39918K1128K6794L2801L9853M8534N8352O7711P4013P3958O4923M6706
57660H94691K1709o278l2928n3743o5567o8522o5613n9874n2567m4214l5978k9131
57648D01985k3919j9850j6529j3682j0909q151n980m778m099l330k543k068j697
57635B84450r42J08Q58R77P16N31O65R70R30K25p46j255j243j268j474j394r68
57618B81140q28j191j363r78p18j128j594j424j122j513k224k232j530j011r80
57603B61304r21o51n66p11o46l99n84j324j933j921j563j285j157j248j796k627
57587B41972l019k517j562r88j222k020k691k534j498m39k50p68j039o80k75l36
57571B20134o47r06j282j859k148j708q88m31n59q97j009p44k12K45K96J45M71
$$ plain form
57554 208001 209527 212130 215013 217499 219736 222242 225138 228142 231029 233652 235529 235841 234044 230492
57540 230492 226466 223527 222571 223224 224186 224388 223895 223628 224323 225926 227901 229794 231413 232695 233633 234223
57524 234223 234367 233960 233231 232847 233409 234859 236601 238262 240071 242423 245320 248443 251644 255144 259220
57509 259220 263851 268648 273098 276845 279766 281820 282961 283332 283443 283871 284726 285648 286346 286873 287226 287028
57493 287028 285875 283807 281216 278570 276507 275904 277272 280062 282909 284685 285195 285058 285239 286501 288820
57478 288820 291286 292958 293864 294813 296286 297896 299011 299399 299146 298422 297537 296829 296202 295203 293798 292712
57462 292712 292680 293671 295178 296909 298747 300345 301330 301849 302482 303663 305473 307873 310669 313287 315114 316165
57446 316165 317076 318321 319796 321225 322595 324015 325510 327186 329299 331852 334349 336295 337805 339442
$$ packed form
57554B08001J526K603K883K486K237K506K896L004K887K623J877L12j797l552
57540B30492m026k939r56O53R62K02m93k67O95J603J975J893J619J282R38N90
57524B34223J44m07p29l84N62J450J742J661J809K352K897L123L201L500M076
57509B59220M631M797M450L747K921K054J141L71J11M28Q55R22O98N27L53j98
57493B87028j153k068k591k646k063o03J368K790K847J776N10j37J81J262K319
57478B88820K466J672R06R49J473J610J115L88k53p24q85p08o27r99j405j086
57462B92712l2R91J507J731J838J598R85N19O33J181J810K400K796K618J827J051
57446C16165R11J245J475J429J370J420J495J676K113K553K497J946J510J637
$$ plain form
57432 339442 341513 343850 346239 348652 351013 353105 354999 357307 360667 365004 369548 373560 376832 379539
57418 379539 381939 384337 387066 390218 393486 396458 399036 401451 403953 406628 409460 412372 415144 417509
57404 417509 419402 421119 423160 425863 429097 432312 435041 437439 440180 443694 447675 451541 455233 459323
57390 459323 464323 470075 475801 480644 484375 487857 492648 499690 508282 516647 523632 529666 536044 543505
57376 543505 551543 558824 564222 567747 570555 573825 577594 580905 583058 584339 585505 587074 589236 591945
57362 591945 594796 597288 599573 602580 606948 612210 617457 622468 627640 633113 638627 644150 649903 655757
57348 655757 661260 666489 672290 679337 687301 695222 702396 708726 714577 720534 727018 733819 740277 746177
57334 746177 752120 758742 765918 773198 780660 788686 797044 805016 812582 820703 830022 839885 849190 857827
$$ packed form
57432C39442K071K337K389K413K361K092J894K308L360M337M544M012L272K707
57418C79539K400K398K729L152L268K972K578K415K502K675K832K912K772K365
57404D17509J893J717K041K703L234L215K729K398K741L514L981L866L692M090
57390D59323N000N752N726M843L731L482M791P042Q592Q365O985O034O378P461
57376E43505Q038P281N398L525K808L270L769L311K153J281J166J569K162K709
57362E91945K851K492K285L007M368N262N247N011N172N473N514N523N753N854
57348F55757N503N229N801P047P964P921P174O330N851N957O484O801O458N900
57334G46177N943O622P176P280P462Q026Q358P972P566Q121R319R863R305Q637
$$ plain form
57320 857827 866615 876071 885887 895586 904996 913935 922071 929437 936598 944026 951738 959867 969029 979600
57306 979600 990909 1001867 1012148 1022193 1032200 1041923 1051565 1062019 1073788 1086134 1097772 1108172
57294 1108172 1117834 1127602 1137983 1148988 1160265 1171492 1182809 1194715 1207497 1220982 1234895 1249003
57282 1249003 1262751 1275396 1287038 1299017 1312539 1327101 1341043 1353671 1366089 1379760 1394860
57271 1394860 1410343 1425151 1438978 1452230 1465683 1479993 1495136 1510342 1524821 1538550 1552195
57260 1552195 1566410 1581391 1596991 1612928 1628858 1644436 1659521 1674318 1689282 1704824 1721042
57249 1721042 1737672 1754334 1770809 1787117 1803345 1819553 1835806 1852147 1868504 1884822 1901306
57238 1901306 1918342 1936046 1954057 1971953 1989759 2007783 2026058 2044201 2061863 2079121 2096341
$$ packed form
57320H57827Q788R456R816R699R410Q939Q136P366P161P428P712Q129R162J0571
57306I79600J1309J0958J0281J0045J0007R723R642J0454J1769J2346J1638J0400
57294A108172R662R768J0381J1005J1277J1227J1317J1906J2782J3485J3913J4108
57282A249003J3748J2645J1642J1979J3522J4562J3942J2628J2418J3671J5100
57271A394860J5483J4808J3827J3252J3453J4310J5143J5206J4479J3729J3645
57260A552195J4215J4981J5600J5937J5930J5578J5085J4797J4964J5542J6218
57249A721042J6630J6662J6475J6308J6228J6208J6253J6341J6357J6318J6484
57238A901306J7036J7704J8011J7896J7806J8024J8275J8143J7662J7258J7220
$$ plain form
57227 2096341 2113836 2131695 2149732 2167467 2184356 2200250 2215554 2230705 2245618 2259864 2273378
57216 2273378 2286716 2300568 2315217 2330605 2346630 2363175 2379980 2396719 2413214 2429399 2445146
57205 2445146 2460319 2475036 2489755 2505018 2521116 2537918 2554975 2571845 2588351 2604506 2620206
57194 2620206 2635211 2649401 2662820 2675326 2686570 2696565 2705936 2715164 2723816 2731093 2737050 2742643 2748467
57181 2748467 2754062 2758747 2762610 2766237 2769841 2773146 2775984 2778547 2781072 2783573 2785899 2787882 2789480 2790964
57167 2790964 2792910 2795811 2799675 2804080 2808553 2812858 2817053 2821370 2825971 2830746 2835521 2840473 2846078 2852550
57153 2852550 2859588 2866838 2874345 2882310 2890696 2899308 2908045 2916778 2925250 2933402 2941550 2949866 2957970 2965532
57139 2965532 2973079 2981598 2991304 3001360 3010900 3019794 3028247 3036259 3043830 3051332 3059267 3067966 3077955 3090378
$$ packed form
57227B096341J7495J7859J8037J7735J6889J5894J5304J5151J4913J4246J3514
57216B273378J3338J3852J4649J5388J6025J6545J6805J6739J6495J6185J5747
57205B445146J5173J4717J4719J5263J6098J6802J7057J6870J6506J6155J5700
57194B620206J5005J4190J3419J2506J1244R995R371R228Q652P277N957N593N824
57181B748467N595M685L863L627L604L305K838K563K525K501K326J983J598J484
57167B790964J946K901L864M405M473M305M195M317M601M775M775M952N605O472
57153B852550P038P250P507P965Q386Q612Q737Q733Q472Q152Q148Q316Q104P562
57139B965532P547Q519R706J0056R540Q894Q453Q012P571P502P935Q699R989J2423
$$ plain form
57125 3090378 3106486 3126591 3149967 3175897 3204520 3236430 3271749 3309945 3350543 3393666 3439846
57114 3439846 3489679 3544008 3604400 3673154 3752753 3845390 3952931 4077122 4219826 4383417
57104 4383417 4571292 4788226 5040589 5336769 5687744 6107217 6611027 7216227 7940307
57095 7940307 8800434 9812528 10990200 12343666 13878736 15596129 17491242 19553879
57087 19553879 21767485 24107851 26541075 29019668 31477191 33825584 35960640 37776184
57079 37776184 39181007 40111600 40537754 40461375 39909535 38924456 37555459 35856312 33886130
57070 33886130 31709312 29393114 27004734 24608866 22264687 20022167 17919450 15982219
57062 15982219 14224217 12648488 11249951 10018702 8942186 8005698 7192902 6487396
$$ packed form
57125C090378J6108K0105K3376K5930K8623L1910L5319L8196M0598M3123M6180
57114C439846M9833N4329O0392O8754P9599R2637J07541J24191J42704J63591
57104D383417J87875K16934K52363K96180L50975M19473N03810O05200P24080
57095G940307Q60127J012094J177672J353466J535070J717393J895113K062637
57087A9553879K213606K340366K433224K478593K457523K348393K135056J815544
57079C7776184J404823R30593M26154p6379n51840r85079j368997j699147j970182
57070C3886130k176818k316198k388380k395868k344179k242520k102717j937231
57062A5982219j758002j575729j398537j231249j076516r36488q12796p05506
$$ plain form
57054 6487396 5874149 5339747 4872140 4460861 4097275 3774195 3485323 3225170 2989246
57045 2989246 2774111 2577321 2397223 2232312 2080685 1940450 1810588 1690866 1580785
57036 1580785 1479273 1385635 1300220 1223820 1157000 1100373 1054748 1020365 996487 982666 980210
57025 980210 991596 1018044 1057615 1104904 1151540 1186970 1200346 1183862 1136135 1063276 976356
57014 976356 886513 801007 722807 652874 591883 539886 495584 457066 423093 393224 366994
57003 366994 343653 322563 303340 285655 269323 254524 241485 230025 219790 210762 203062 196378
56991 196378 190184 184550 180226 177875 177704 179890 184764 192253 201516 211437 221208 230106 236974 240358
56977 240358 239303 233944 225364 214983 204046 193481 183945 175740 168731 162643 157609 154258 153126
$$ packed form
57054F487396o13247n34402m67607m11279l63586l23080k88872k60153k35924
57045B989246k15135j96790j80098j64911j51627j40235j29862j19722j10081
57036A580785j01512r3638q5415p6400o6820n6627m5625l4383k3878j3821k456
57025I80210J1386K6448L9571M7289M6636L5430J3376j6484m7727p2859q6920
57014I76356q9843q5506p8200o9933o0991n1997m4302l8518l3973k9869k6230
57003C66994k3341k1090j9223j7685j6332j4799j3039j1460j0235r028p700o684
56991A96378o194n634m324k351j71K186M874P489R263R921R771Q898O868L384
56977B40358j055n359q580j0381j0937j0565r536q205p009o088n034l351j132
$$ plain form
56964 153126 154221 157332 162527 170065 180062 192607 208012 226383 246875 267533 285860 299372
56952 299372 306038 304964 296927 283949 268195 251393 235000 220183 207434 196660 187939 181751
56940 181751 178265 176895 177084 179227 184311 192813 204540 219575 238712 262429 289521 317004 341248
56927 341248 359143 368561 368497 359254 342362 319975 294261 267349 241400 218095 197928 180451
56915 180451 165411 153242 144177 137337 131204 124921 118786 113570 109675 106858 104473 102037 99746 98304
56901 98304 98009 98285 98496 98929 100397 103096 106576 110800 116441 123907 132809 142841 154548 168675 185112
56886 185112 203021 221654 240415 258193 273221 283727 288560 287345 280540 269440 255857 241626
56874 241626 228382 217451 209549 204706 202862 204493 210213 219865 232646 248332 267848 292338 322142
$$ packed form
56964A53126J095L111N195P538R997J2545J5405J8371K0492K0658J8327J3512
56952B99372O666j074q037j2978j5754j6802j6393j4817j2749j0774q721o188
56940A81751l486j370J89K143N084Q502J1727J5035J9137K3717K7092K7483K4244
56927C41248J7895R418o4r243j6892k2387k5714k6912k5949k3305k0167j7477
56915A80451j5040j2169r065o840o133o283o135n216l895k817k385k436k291j442
56901I8304k95K76K11M33J468K699L480M224N641P466Q902J0032J1707J4127J6437
56886A85112J7909J8633J8761J7778J5028J0506M833j215o805j1100j3583j4231
56874B41626j3244j0931p902m843j844J631N720R652J2781J5686J9516K4490K9804
$$ plain form
56861 322142 357110 397338 442639 491091 538572 579835 609907 624957 623231 606067 577744 543568
56849 543568 507895 473802 443833 419943 402656 391167 384834 384268 390737 404847 426270 454532
56837 454532 489740 532717 584743 646818 718273 795433 871542 938238 987618 1013788 1013737 987856
56825 987856 940086 877239 807249 737079 671535 613475 564534 525289 495161 473059 458499
56814 458499 451790 453093 461925 478040 502317 536070 579511 631066 687636 744587 795550 833333
56802 833333 852121 849322 825809 785143 732656 674404 615736 560225 509748 465331 427679 397075
56790 397075 373239 355617 343754 337297 335799 338839 346438 359039 376795 398952 424093 450643
56778 450643 476515 498258 511394 512404 500587 478025 448061 413954 378352 343180 309697 278762
$$ packed form
56861C22142L4968M0228M5301M8452M7481M1263L0072J5050j726j7164k8323l4176
56849E43568l5673l4093k9969k3890j7287j1489o333n66O469J4110K1423K8262
56837D54532L5208M2977N2026O2075P1455P7160P6109O6696M9380K6170n1k5881
56825I87856m7770o2847o9990p0170o5544n8060m8941l9245l0128k2102j4560
56814D58499o709J303Q832J6115K4277L3753M3441N1555N6570N6951N0963L7783
56802H33333J8788k799k3513m0666n2487n8252n8668n5511n0477m4417l7652l0604
56790C97075k3836j7622j1863o457j498L040P599J2601J7756K2157K5141K6550
56778D50643K5872K1743J3136J010j1817k2562k9964l4107l5602l5172l3483l0935
$$ plain form
56766 278762 250998 226691 205737 187913 173020 160658 150170 141082 133320 126767 120977 115623
56754 115623 110827 106632 102565 98248 94076 90644 87793 84933 82134 80118 79190 78832 78333 77260 75427
56739 75427 73124 71300 70652 70567 69807 68311 67301 67401 67722 67285 66336 65552 64881 64098 63829 64927 67125
56722 67125 69244 70647 71741 73085 74719 76390 77832 78724 78934 78935 79598 81361 83768 85867 86890 86691
56706 86691 85807 85078 85026 85615 86660 88212 90311 92617 94565 95752 96033 95540 94831 94610 94911 94915 94074 93071
56688 93071 93039 94010 94901 94989 94663 94575 94703 94653 94386 94213 94339 94759 95491 96582 97981 99542 101055 102134 102290
56669 102290 101394 99998 98896 98264 97502 96061 94244 92911 92496 92748 93504 95203 98189 101855 105126 107724
56653 107724 110356 113561 117042 120395 123926 128212 133199 138217 142741 146697 150139 152958 154901 155717
$$ packed form
56766B78762k7764k4307k0954j7824j4893j2362j0488r088p762o553n790n354
56754A15623m796m195m067m317m172l432k851k860k799k016r28l58m99j073j833
56739G5427k303j824o48q5p60j496j010J00L21m37r49p84o71p83k69J098K198
56722F7125K119J403J094J344J634J671J442Q92K10JO63J763K407K099J023j99
56706H6691q84p29n2N89J045J552K099K306J948J187K81m93p09k21L01Mq41j003
56688I3071l2R71Q91Q8l26q8J28n0k67j73J26M20P32J091J399J561J513J079J56
56669A02290q96j396j102o32p62j441j817j333m15K52P56J699K986L666L271K598
56653A07724K632L205L481L353L531M286M987N018M524L956L442K819J943Q16
$$ plain form
56639 155717 155455 154774 154642 155437 156540 157085 156851 156166 155291 154364 153661 153366 153199 152741 152042 151453 150909 149913
56621 149913 148283 146441 144803 143264 141475 139383 137312 135603 134218 132673 130512 127988 126019 125203
56607 125203 125081 124763 124079 123611 123704 124016 124122 124092 124240 124659 125187 125631 125947 126338 127128 128225 128848 128149 126195
56588 126195 123972 122380 121578 121303 121352 121545 121654 121638 121674 121763 121579 120932 120107 119570 119614 120492 122477 125396 128343
56569 128343 130365 131407 132257 133615 135673 138607 142903 148776 155597 162431 169138 176482 185066 194598
56555 194598 204380 213929 222536 228646 230633 228367 223417 217525 211549 206049 201927 199634 198246 196248
56541 196248 193123 189539 186167 183066 180180 177654 175486 173499 171873 171159 171466 172071 172123 171391 170153 168702
56525 168702 167210 165754 164273 162758 161652 161641 162771 164057 164361 163423 161758 159762 157406 154774 152396
$$ packed form
56639A55717k62o81j32P95J103N45k34o85q75r27p03k95j67m58o99n89n44r96
56621A49913j630j842j638j539j789k092k071j709j385j545k161k524j969q16
56607A25203j22l18o84m68R3L12J06l0J48M19N28M44L16L91P90J097O23o99j954
56588A26195k223j592q02k75M9J93J09j6L6Q9j84o47q25n37M4Q78J985K919K947
56569A28343K022J042Q50J358K058K934M296N873O821O834O707P344Q584R532
56555A94598R782R549Q607O110J987k266m950n892n976n500m122k293j388j998
56541A96248l125l584l372l101k886k526k168j987j626p14L07O05N2p32j238j451
56525A68702j492j456j481j515j106j1J130J286L04r38j665j996k356k632k378
$$ plain form
56510 152396 150753 149671 148567 147265 146232 145865 145868 145730 145643 146312 147760 148989 149206 148847 148854 149372 149810 149879
56492 149879 149780 149474 148627 147387 146493 146368 146696 147151 147917 149161 150469 151259 151448 151370 151321 151445 151835 152446 153131
56473 153131 153933 155070 156418 157323 157259 156557 156193 156918 158740 161082 163245 164811 165758 166287 166601 166927 167524
56456 167524 168403 169164 169425 169328 169262 169246 169082 169007 169561 170722 171851 172650 173498 174615 175614 176316 177309 179040 180891
56437 180891 181832 181674 180896 179550 177227 174170 171621 170657 171096 171845 172068 171753 171343 171109 170902 170421 169676
56420 169676 169153 169428 170611 172164 173297 173530 172998 172252 171784 171708 171907 172342 173061 173939 174630 174812 174443 173811
56402 173811 173443 173816 174926 176220 177146 177663 178018 178203 178037 177682 177697 178533 180271 182776 185733 188601 190955
56385 190955 192883 194710 196496 198239 200332 203132 206117 208276 209466 210602 212285 214016 215107 215586
$$ packed form
56510A52396j643j082j104j302j033l67Lj38q7O69J448J229K17l59PN18M38O9
56492A49879r9l06q47j240q94j25L28M55P66J244J308P90J89p8m9J24L90O11O85
56473A53131Q02J137J348R05o4p02l64P25J822K342K163J566R47N29L14L26N97
56456A67524Q79P61K61r7o6j6j64p5N54J161J129P99Q48J117R99P02R93J731J851
56437A80891R41j58p78j346k323l057k549r64M39P49K23l15m10k34k07m81p45
56420A69676n23K75J183J553J133K33n32p46m68p6J99M35P19Q78O91J82l69o32
56402A73811l68L73J110J294R26N17L55J85j66l55J5Q36J738K505K957K868K354
56385A90955J928J827J786J743K093K800K985K159J190J136J683J731J091M79
$$ plain form
56371 215586 215705 215202 213754 211690 209730 208285 207502 207568 208484 209819 211160 212507 213887 214966 215549 216063
56355 216063 216932 217796 218012 217771 218077 219584 221930 224232 225880 226859 227595 228485 229415 229855 229640 229397 229853
56338 229853 230949 231997 232651 233387 235017 237868 241413 244703 247357 250056 253716 258148 262168 265155 267822
56323 267822 271107 274910 278461 281340 283522 284893 285484 285929 286986 288633 290105 290737 290330 288975 287033
56308 287033 285231 284301 284529 285820 287864 289984 291302 291655 292049 293626 296439 299742 303159 306864 310814
56293 310814 314580 318004 321374 324829 328038 330648 332765 334953 337923 342062 347064 352212 357262 362723
56279 362723 369011 375731 382196 388314 394471 400901 407653 414863 422558 430471 438594 447605 458226 470427
56265 470427 483761 498140 513759 530581 548470 567520 587835 609444 632978 659756 690505
$$ packed form
56371B15586J19n03j448k064j960j445p83O6R16J335J341J347J380J079N83N14
56355B16063Q69Q64K16k41L06J507K346K302J648R79P36Q90R30M40k15k43M56
56338B29853J096J048O54P36J630K851L545L290K654K699L660M432M020K987K667
56323B67822L285L803L551K879K182J371N91M45J057J647J472O32m07j355j942
56308B87033j802r30K28J291K044K120J318L53L94J577K813L303L417L705L950
56293C10814L766L424L370L455L209K610K117K188K970M139N002N148N050N461
56279C62723O288O720O465O118O157O430O752P210P695P913Q123R011J0621J2201
56265D70427J3334J4379J5619J6822J7889J9050K0315K1609K3534K6778L0749
$$ plain form
56254 690505 724680 761926 803489 850981 904406 962925 1027212 1099355 1180343 1269200 1364842
56243 1364842 1467216 1576004 1689661 1806564 1925931 2046628 2165840 2279895 2385755
56234 2385755 2480892 2562344 2627030 2672914 2699186 2705508 2691836 2659028 2609067 2544456 2467604
56223 2467604 2380812 2286484 2187122 2084981 1981792 1878898 1777648 1679451 1585364 1495979
56213 1495979 1411886 1333814 1261998 1195752 1134141 1076774 1023569 974243 928618 886985 849463
56202 849463 815328 783714 754630 728473 704887 683037 662759 644413 627762 612119 597577
56191 597577 585014 574738 566156 558874 553071 548604 544799 541474 539148 537845 536646 534881 532931 531420
56177 531420 530393 529738 529626 530038 530517 530870 531556 533062 535453 538779 543182 548242 552944 556780 560339 564455
$$ packed form
56254F90505L4175L7246M1563M7492N3425N8519O4287P2143Q0988Q8857R5642
56243A364842J02374J08788J13657J16903J19367J20697J19212J14055J05860
56234B385755R5137Q1452O4686M5884K6272O322j3672l2808m9961o4611p6852
56223B467604q6792r4328r9362j02141j03189j02894j01250r8197r4087q9385
56213A495979q4093p8072p1816o6246o1611n7367n3205m9326m5625m1633l7522
56202H49463l4135l1614k9084k6157k3586k1850k0278j8346j6651j5643j4542
56191E97577j2563j0276q582p282n803m467l805l325k326j303j199j765j950j511
56177E31420j027o55j12M12M79L53O86J506K391L326M403N060M702L836L559M116
$$ plain form
56161 564455 569315 574701 580546 586877 593739 601437 610417 620714 632062 644605 658919 675237 693333
56148 693333 713267 735614 760893 789537 822447 860826 905434 956825 1016262 1085412 1165014
56137 1165014 1254708 1353935 1461644 1574841 1688656 1798095 1898904 1987270 2060982 2121673
56127 2121673 2174237 2222882 2268658 2310942 2349273 2382528 2408012 2423175 2427580 2422244 2408173 2386565
56115 2386565 2359003 2325580 2283349 2228141 2157788 2072954 1975908 1870095 1760432 1652378 1550309
56104 1550309 1457153 1374953 1304774 1246285 1198288 1159538 1128711 1104184 1084550 1068889 1056166
56093 1056166 1045172 1035629 1028419 1023935 1021051 1018501 1016335 1015102 1014572 1014421 1015293 1017939 1021914 1026323
56079 1026323 1031284 1037450 1044558 1051641 1058397 1065332 1072880 1081281 1090984 1102250 1114673 1127791 1141769
$$ packed form
56161E64455M860N386N845O331O862P698Q980J0297J1348J2543J4314J6318J8096
56148F93333J9934K2347K5279K8644L2910L8379M4608N1391N9437O9150P9602
56137A165014Q9694R9227J07709J13197J13815J09439J00809Q8366P3712O0691
56127B121673N2564M8645M5776M2284L8331L3255K5484J5163M405n336j4071k1608
56115B386565k7562l3423m2231n5208p0353q4834r7046j05813j09663j08054j02069
56104A550309r3156q2200p0179n8489m7997l8750l0827k4527j9634j5661j2723
56093A056166j0994r543p210m484k884k550k166j233n30j51Q72K646L975M409
56079A026323M961O166P108P083O756O935P548Q401R703J1266J2423J3118J3978
$$ plain form
56066 1141769 1156843 1172664 1188879 1205763 1223586 1242031 1260872 1280465 1300921 1321707 1342795
56055 1342795 1365164 1389261 1414102 1438820 1463953 1490030 1516097 1541066 1565503 1590588 1616128
56044 1616128 1641052 1665139 1688885 1712477 1736261 1761416 1788687 1817157 1845717 1874958 1906211
56033 1906211 1939539 1974258 2010651 2049453 2090280 2132143 2175023 2219386 2264831 2310745 2357743
56022 2357743 2406931 2458366 2511657 2567351 2626159 2687573 2750856 2816699 2886350 2959857 3036638
56011 3036638 3116885 3200816 3287623 3376891 3470070 3568777 3672776 3781402 3895645 4016745
56001 4016745 4144086 4276847 4416491 4565139 4722621 4887714 5061185 5244925 5439139
55992 5439139 5643183 5858243 6086396 6328041 6583144 6854010 7143835 7453599 7783524
$$ packed form
56066A141769J5074J5821J6215J6884J7823J8445J8841J9593K0456K0786K1088
56055A342795K2369K4097K4841K4718K5133K6077K6067K4969K4437K5085K5540
56044A616128K4924K4087K3746K3592K3784K5155K7271K8470K8560K9241L1253
56033A906211L3328L4719L6393L8802M0827M1863M2880M4363M5445M5914M6998
56022B357743M9188N1435N3291N5694N8808O1414O3283O5843O9651P3507P6781
56011C036638Q0247Q3931Q6807Q9268R3179R8707J03999J08626J14243J21100
56001D016745J27341J32761J39644J48648J57482J65093J73471J83740J94214
55992E439139K04044K15060K28153K41645K55103K70866K89825L09764L29925
$$ plain form
55983 7783524 8136518 8516902 8926912 9367941 9844151 10361251 10922891 11532218 12195990
55974 12195990 12923223 13721128 14596935 15562975 16635719 17831221 19166728 20666397 22361448
55965 22361448 24287180 26486836 29019315 31959970 35397522 39437648 44208361 49855759
55957 49855759 56538007 64433402 73755293 84756898 97736487 113064825 131217758
55950 131217758 152764836 178282721 208172315 242335047 279718217 317934521 353304558
55943 353304558 381513278 398685634 402426338 392426503 370466688 339848422 304460541
55936 304460541 267842625 232605675 200328146 171756819 147068469 126080512 108416076
55929 108416076 93629564 81277578 70947343 62275006 54959941 48760687 43478264
$$ packed form
55983G783524L52994L80384M10010M41029M76210N17100N61640O09327O63772
55974A2195990P27233P97905Q75807R66040J072744J195502J335507J499669J695051
55965B2361448J925732K199656K532479K940655L437552M040126M770713N647398
55957D9855759O682248P895395R321891J1001605J2979589J5328338J8152933
55950A31217758K1547078K5517885K9889594L4162732L7383170L8216304L5370037
55943C53304558K8208720J7172356L740704r999835k1959815l0618266l5387881
55936C04460541l6617916l5236950l2277529k8571327k4688350k0987957j7664436
55929A08416076j4786512j2351986j0330235q672337p315065o199254n282423
$$ plain form
55922 43478264 38947910 35039934 31653981 28706755 26127137 23858713 21857512 20085044
55914 20085044 18507048 17097163 15835504 14703205 13682292 12759712 11926365 11172089
55906 11172089 10485484 9858027 9284223 8757999 8272642 7823870 7409351 7025519 6668090
55897 6668090 6335173 6026484 5740001 5472568 5223177 4992340 4778688 4579500 4394203
55888 4394203 4223940 4067768 3922497 3786413 3660182 3543968 3436512 3337233 3246300 3162050
55878 3162050 3080773 2999610 2917759 2834798 2750128 2664325 2579051 2495365 2413774 2335588 2262020
55867 2262020 2191995 2123055 2054562 1988044 1924506 1863644 1805755 1752067 1702728 1656508 1612909
55856 1612909 1572612 1535472 1500012 1465429 1432297 1400748 1369731 1338694 1308386 1279262 1250513
$$ packed form
55922D3478264m530354l907976l385953k947226k579618k268424k001201j772468
55914B0085044j577996j409885j261659j132299j020913r22580q33347p54276
55906A1172089o86605o27457n73804n26224m85357m48772m14519l83832l57429
55897F668090l32917l08689k86483k67433k49391k30837k13652j99188j85297
55888D394203j70263j56172j45271j36084j26231j16214j07456r9279r0933q4250
55878C162050q1277q1163q1851q2961q4670q5803q5274q3686q1591p8186p3568
55867B262020p0025o8940o8493o6518o3538o0862n7889n3688m9339m6220m3599
55856A612909m0297l7140l5460l4583l3132l1549l1017l1037l0308k9124k8749
$$ plain form
55845 1250513 1221320 1191864 1162586 1133649 1105578 1079376 1055500 1033630 1013513 995042 977515
55834 977515 960012 942554 925774 909585 893527 878291 865240 854269 843730 832751 822033
55823 822033 811914 801311 789365 776771 764603 752797 740636 727890 714881 702028 689800
55812 689800 678499 667893 657700 648458 640992 634991 629146 622891 616964 612039 607888 604312 601780
55799 601780 600593 600221 599983 599697 599279 598361 596758 594776 592810 591015 589440 587995 586362 584542 583312
55784 583312 583466 584817 586636 588668 590604 590879 587355 579307 567697 553596 537627 521019 505669
55771 505669 492646 481673 472422 465254 460328 457077 454983 453839 452907 450921 447460 443411 439658 436168
55757 436168 432662 429163 425540 421583 417898 415565 414362 412471 408530 402939 396510 389139 380720 372231
$$ packed form
55845A250513k9193k9456k9278k8937k8071k6202k3876k1870k0117j8471j7527
55834I77515j7503j7458j6780j6189j6058j5236j3051j0971j0539j0979j0718
55823H22033j0119j0603j1946j2594j2168j1806j2161j2746j3009j2853j2228
55812F89800j1301j0606j0193r242p466o001n845o255n927m925m151l576k532
55799F01780j187l72k38k86m18r18j603j982j966j795j575j445j633j820j230
55784E83312J54J351J819K032J936K75l524q048j1610j4101j5969j6608j5350
55771E05669j3023j0973r251p168m926l251k094j144r32j986l461m049l753l490
55757D36168l506l499l623l957l685k333j203j891l941n591o429p371q419q489
$$ plain form
55743 372231 364681 357744 350560 343305 336838 331249 325942 320948 317135 315031 314175 313640 312664 310855 308312
55728 308312 305577 303067 300548 297434 293505 289113 284770 280730 276877 272869 268504 263949 259540 255536
55714 255536 252325 250552 250492 251493 252638 253877 255868 258804 262116 265273 268087 270269 271556 272327 273174
55699 273174 273678 272571 269369 264921 260106 254987 249662 244898 241215 238121 234907 231563 228415 225495
55685 225495 222866 220960 220046 219914 220500 222203 225050 228243 231074 233752 236748 239874 242552 244495 245635
55670 245635 245829 245125 243848 242035 239346 235928 232746 230609 229460 229004 229296 230125 230596 230080 229076 228559
55654 228559 228944 230156 232071 234288 236087 237179 237885 238091 236922 234147 231014 228726 226837 224235 221001
55639 221001 218066 215565 212854 209842 206950 203865 199639 194211 188693 183917 179694 175787 172695 170953
$$ packed form
55743C72231p550o937p184p255o467n589n307m994l813k104q56n35r76j809k543
55728C08312k735k510k519l114l929m392m343m040l853m008m365m555m409m004
55714B55536l211j773o0J001J145J239J991K936L312L157K814K182J287P71Q47
55699B73174N04j107l202m448m815n119n325m764l683l094l214l344l148k920
55685B25495k629j906r14j32N86J703K847L193K831K678K996L126K678J943J140
55670B45635J94p04j277j813k689l418l182k137j149m56K92Q29M71n16j004n17
55654B28559L85J212J915K217J799J092P06K06j169k775l133k288j889k602l234
55639B21001k935k501k711l012k892l085m226n428n518m776m223l907l092j742
$$ plain form
55625 170953 170294 169957 169490 168961 168644 168644 168656 168172 167172 166371 166378 166826 166826 166066 164884 163395 161270 158449 155505
55606 155505 153100 151415 150176 148993 147678 146469 145794 145633 145391 144659 143729 142900 141778 139878 137631 136060
55590 136060 135542 135530 135403 135022 134510 134078 134055 134643 135696 137064 138906 141232 143556 145580 147887 151183 155251
55573 155251 159532 164484 171231 179863 189207 198522 208345 219177 230201 239912 247354 252178 254060 252808
55559 252808 248802 242762 235173 226306 216652 206976 197881 189510 181651 174128 167146 161209 156556 152816
55545 152816 149416 146194 143253 140441 137495 134686 132739 131928 131732 131544 131365 131496 131971 132597 133418 134799
55529 134799 137049 140005 142939 144928 145505 144978 144033 143104 142214 141156 139550 136899 133035 128482 124015
55514 124015 119888 115833 111785 108217 105688 104350 103966 104168 104692 105465 106448 107340 107736 107752 108062 108902 109458
$$ packed form
55625A70953o59l37m67n29l17%J2m84j000q01PM48%p60j182j489k125k821k944
55606A55505k405j685j239j183j315j209o75j61k42p32r30q29j122j900k247j571
55590A36060n18j2j27l81n12m32k3N88J053J368J842K326K324K024K307L296M068
55573A55251M281M952O747Q632R344R315R823J0832J1024R711P442M824J882j252
55559B52808m006o040p589q867r654r676r095q371p859p523o982n937m653l740
55545A52816l400l222k941k812k946k809j947q11j96j88j79J31M75O26Q21J381
55529A34799K250K956K934J989N77n27r45r29q90j058j606k651l864m553m467
55514A24015m127m055m048l568k529j338l84K02N24P73R83Q92L96J6L10Q40N56
$$ plain form
55497 109458 108846 107383 106257 106106 106663 107590 108742 109548 109080 107178 104888 103370 102825 102739 102642 102306 101652
55480 101652 100839 100159 99613 98929 98134 97631 97495 97206 96459 95805 96013 97039 98054 98361 97943 97203 96456 95735
55462 95735 94962 94258 93963 94229 94719 94990 95020 95007 94806 94149 93364 93202 93773 94312 94373 94658 96136 98658 100980
55443 100980 101972 101452 99947 98064 96148 94365 92984 92385 92602 93002 92888 92379 92173 92407 92385 91635 90579
55426 90579 89778 89177 88634 88633 89681 91318 92522 93002 93392 94086 94523 93931 92391 90871 90345 90978 92047 92603
55408 92603 92321 91723 91533 91900 92389 92588 92480 92276 92097 91915 91656 91304 90919 90542 90131 89666 89293 89169 89202
55389 89202 89139 89021 89288 90293 91853 93401 94439 94806 94696 94562 94778 95287 95701 95825 95901 96322 97301 98815
55371 98815 100506 101599 101378 100015 98556 97802 97508 96927 95768 94231 92470 90513 88569 86964 85841
$$ packed form
55497A09458o12j463j126j51N57R27J152Q06m68j902k290j518n45q6r7l36o54
55480A01652q13o80n46o84p95n03j36k89p47o54K08J026J015L07m18p40p47p21
55462I5735p73p04k95K66M90K71L0j3k01o57p85j62N71N39O1K85J478K522K322
55443A00980R92n20j505j883j916j783j381n99K17M00j14n09k06K34k2p50j056
55426I0579q01o01n43jJ048J637J204M80L90O94M37n92j540j520n26O33J069N56
55408I2603k82n98j90L67M89J99j08k04j79j82k59l52l85l77m11m65l73j24L3
55389H9202o3j18K67J005J560J548J038L67j10j34K16N09M14J24P6M21R79J514
55371I8815J691J093k21j363j459p54k94n81j159j537j761j957j944j605j123
$$ plain form
55356 85841 85248 85322 85977 86569 86438 85792 85523 86047 86794 87084 87095 87583 88851 90333 91247 91401 91275 91426 91898
55337 91898 92283 92250 91909 91602 91442 91184 90530 89463 88274 87277 86527 85889 85396 85379 86029 86953 87439 87194 86565
55318 86565 86067 85944 86186 86551 86521 85686 84388 83566 83728 84485 85388 86646 88484 90206 90690 89718 88175 86937
55300 86937 86185 85835 85948 86349 86373 85463 83846 82329 81530 81514 82039 82925 84145 85634 87055 87895 88001 87900
55282 87900 88306 89248 89974 89809 88821 87588 86624 86237 86591 87587 88819 89909 90811 91586 92100 92236 92268 92599
55264 92599 93168 93465 93192 92510 91569 90234 88550 87047 86172 85724 85318 85216 86026 87564 88678 88496 87303
55247 87303 85860 84412 82884 81627 81182 81415 81648 81688 82074 83089 84157 84606 84568 84647 85036 85411 85531 85457
55229 85457 85308 85242 85650 86900 88698 90039 90104 89093 87960 87372 87141 86746 86164 85870 86068 86304 86125 85846
$$ packed form
55356H5841n93P4O55N92j31o46k69N24P47K90J1M88J268J482R14J54j26J51M72
55337I1898L85l3l41l07j60k58o54j067j189r97p50o38m93j7O50R24M86k45o29
55318H6565m98j23K42L65l0q35j298q22J62P57R03J258J838J722M84r72j543j238
55300H6937p52l50J13M01K4r10j617j517p99j6N25Q86J220J489J421Q40J06j01
55282H7900M06R42P26j65r88j233r64l87L54R96J232J090R02P75N14J36L2L31
55264I2599N69K97k73o82r41j335j684j503q75m48m06j02Q10J538J114j82j193
55247H7303j443j448j528j257m45K33K33M0L86J015J068M49l8P9L89L75J20p4
55229H5457j49o6M08J250J798J341O5j011j133n88k31l95n82k94J98K36j79k79
$$ plain form
55211 85846 86189 87243 88259 88629 88604 88780 89174 89231 88587 87452 86270 85262 84395 83647 83177 83213 83741 84401
55193 84401 84864 85305 86238 87761 89235 89935 89805 89364 89008 88659 88036 87002 85728 84669 84375 85133 86712
55176 86712 88504 89831 90225 89711 88961 88871 89678 90641 90858 90267 89574 89372 89722 90505 91648 92857 93501 93189
55158 93189 92347 91972 92727 94307 95675 95946 95137 94119 93795 94264 94788 94538 93296 91469 89587 87971 86820
55141 86820 86364 86712 87678 88987 90643 92748 94905 96267 96499 96385 97016 98546 100220 101441 102203 102470
55125 102470 101891 100431 98777 97692 97269 97080 96782 96310 95746 95257 94916 94456 93514 92293 91569 91800 92625
55108 92625 93463 94163 94720 94902 94613 94261 94241 94334 94079 93474 92857 92449 92453 93194 94606 95986 96917 98048 100135
55089 100135 102600 103978 103692 102507 101311 100401 100056 100691 102059 103173 103615 104189 105748 107893 109415 109615
$$ packed form
55211H5846L43J054J016L70k5J76L94N7o44j135j182j008q67p48m70L6N28O60
55193H4401M63M41R33J523J474P00j30m41l56l49o23j034j274j059k94P58J579
55176H6712J792J327L94n14p50r0Q07R63K17n91o93k02L50P83J143J209O44l12
55158I3189q42l75P55J580J368K71q09j018l24M69N24k50j242j827j882j616j151
55141H6820m56L48R66J309J656K105K157J362K32j14O31J530J674J221P62K67
55125A02470n79j460j654j085m23j89k98m72n64m89l41m60r42j221p24K31Q25
55108I2625Q38P00N57J82k89l52k0R3k55o05o17m08MP41J412J380R31J131K087
55089A00135K465J378k86j185j196r10l45O35J368J114M42N74J559K145J522K00
$$ plain form
55073 109615 108716 107387 106359 106198 106862 107617 107803 107556 107519 108004 108758 109383 109654 109567 109309 109129 108939 108197 106409
55054 106409 103761 101138 99503 99179 99598 99808 99470 99284 100050 101468 102368 102144 101306 100476 99637 98780 98489
55037 98489 99143 100044 100228 99890 100114 101239 102332 102470 101808 101045 100396 99697 99173 99397 100410 101404 101617 101283
55019 101283 101255 101699 101722 100582 98842 97738 97677 98014 98295 98813 99679 100153 99549 98272 97287 96905 96781 96810 97256
55000 97256 98074 98884 99755 101302 103703 106148 107631 107996 107882 107843 107889 107794 107620 107794 108624 109753 110291 109706
54982 109706 108481 107596 107437 107541 107407 107147 107177 107559 107922 107913 107564 107284 107567 108585 109938 110872 110875 110111 109290
54963 109290 109043 109376 109716 109590 109172 108950 108887 108391 107303 106437 106609 107495 108063 107994 107964 108497 109242 109631 109665 109672
54943 109672 109757 109875 110107 110434 110565 110388 110339 110877 111695 111869 110841 109015 107447 107109 108240 110148 111754
$$ packed form
55073A09615q99j329j028j61O64P55J86k47l7M85P54O25K71q7k58j80j90p42j788
55054A06409k648k623j635l24M19K10l38j86P66J418R00k24q38q30q39q57k91
55037I8489O54R01J84l38K24J125J093J38o62p63o49o99n24K24J013R94K13l34
55019A01283k8M44K3j140j740j104o1L37K81N18Q66M74o04j277r85l82j24K9M46
55000I7256Q18Q10Q71J547K401K445J483L65j14l9M6r5j74J74Q30J129N38n85
54982A09706j225q85j59J04j34k60L0L82L63rl49k80K83J018J353R34Lp64q21
54963A09290k47L33L40j26m18k22o3m96j088q66J72Q86N68o9l0N33P45L89L4P
54943A09672Q5J18K32L27J31j77m9N38Q18J74j028j826j568l38J131J908J606
$$ plain form
54926 111754 112651 113529 115273 117812 120264 122070 123515 125096 126983 129308 132537 137147 143144 150159 157883
54911 157883 166073 174277 181867 188346 193425 196761 197906 196612 193093 187897 181653 175011 168635 162964
54897 162964 157869 152730 147117 141358 136267 132310 129310 126995 125467 124828 124644 124279 123693 123423 123725 124219
54881 124219 124541 124910 125716 126935 128345 130050 132277 134869 137483 140287 143932 148749 154431 160612 167233
54866 167233 174063 180286 185020 188032 189550 189546 187726 184269 180080 176054 172282 168202 163377 157900 152132
54851 152132 146372 140899 136114 132280 129099 125823 122039 118196 115138 113176 111917 110980 110485 110640 111139
54836 111139 111303 110766 109726 108576 107523 106612 105923 105621 105833 106452 107042 107048 106310 105318 104761 104842 105140 105195 105037
54817 105037 105104 105762 106954 108179 108791 108464 107502 106638 106414 106826 107586 108615 110075 111935 113670 114601 114536
$$ packed form
54926A11754Q97Q78J744K539K452J806J445J581J887K325L229M610N997P015P724
54911A57883Q190Q204P590O479N079L336J145j294l519n196o244o642o376n671
54897A62964n095n139n613n759n091l957l000k315j528o39j84l65n86k70L02M94
54881A24219L22L69Q06J219J410J705K227K592K614K804L645M817N682O181O621
54866A67233O830O223M734L012J518mj820l457m189m026l772m080m825n477n768
54851A52132n760n473m785l834l181l276l784l843l058j962j259r37m95J55M99
54836A11139J64n37j040j150j053r11o89l02K12O19N90Op38r92n57Q1K98N5j58
54817A05037O7O58J192J225O12l27r62q64k24M12P60J029J460J860J735R31o5
$$ plain form
54800 114536 113995 113712 113926 114237 114189 113897 113956 114703 115674 115980 115244 114022 113164 112937 113041 113387 114356 116006 117518
54781 117518 117959 117492 117210 117749 118595 118916 118619 118284 118476 119426 121074 123053 124856 126312 127734 129387 131126
54764 131126 132849 134999 138210 142708 148419 155351 163340 171704 179720 187246 194261 199999 203372 204271
54750 204271 203577 201678 197866 191686 184181 177043 170905 165113 159003 152814 147358 143241 140484 138599
54736 138599 136960 135234 133451 131640 129620 127325 125142 123622 122883 122470 121895 121258 121355 123074 126521 130731
54720 130731 134484 137497 140575 144567 149462 154657 159797 165029 170542 176125 181173 184996 187174 187693
54706 187693 186707 184263 180397 175389 169644 163390 156863 150700 145665 141884 138810 136031 133633 131568
54692 131568 129358 126776 124291 122358 120776 119247 118120 117922 118499 119272 120008 120611 120477 119015 116808 115326
$$ packed form
54800A14536n41k83K14L11m8k92N9P47R71L06p36j222q58k27J04L46R69J650J512
54781A17518M41m67k82N39Q46L21k97l35J92R50J648J979J803J456J422J653J739
54764A31126J723K150L211M498N711O932P989Q364Q016P526P015N738L373Q99
54750B04271o94j899l812o180p505p138o138n792o110o189n456m117k757j885
54736A38599j639j726j783j811k020k295k183j520p39m13n75o37R7J719L447M210
54720A30731L753L013L078L992M895N195N140N232N513N583N048L823K178N19
54706A87693r86k444l866n008n745o254o527o163n035l781l074k779k398k065
54692A31568k210k582k485j933j582j529j127j98N77P73P36O03j34j462k207j482
$$ plain form
54676 115326 115181 115415 114847 113509 112294 111712 111503 111180 110474 109419 108373 107858 108052 108529 108727 108631 108732 109342
54658 109342 110183 110750 110912 111021 111474 112302 113265 114230 115252 116269 116935 116945 116356 115510 114769 114497 115046 116476
54640 116476 118357 120057 121148 121392 120635 119106 117601 116904 117001 117234 117140 116738 116101 115227 114433 114269 114731 115013
54622 115013 114432 113294 112491 112450 112834 113164 113317 113423 113592 113869 114329 115083 116117 117117 117529 116961 115620 114249
54604 114249 113575 113837 114776 115936 116922 117518 117663 117357 116703 116087 116065 116776 117591 117683 116976 116235 116160 116703 117334
54585 117334 117648 117539 117083 116484 116036 115931 116168 116675 117354 117951 118144 117870 117455 117293 117540 118117 118846 119535 120147
54566 120147 120928 122170 123745 125127 125923 126176 126058 125576 124729 123700 122666 121643 120657 119878 119413 119171 119140
54549 119140 119500 120313 121286 122133 122967 124040 125239 126144 126561 126753 127128 127817 128558 128948 128894 128802 129217 130233
$$ packed form
54676A15326j45K34n68j338j215n82k09l23p06j055j046n15J94M77J98r6J01O10
54658A09342Q41N67J62J09M53Q28R63R65J022J017O66J0n89q46p41k72N49J430
54640A16476J881J700J091K44p57j529j505o97R7K33r4m02o37q74p94j64M62K82
54622A15013n81j138q03m1L84L30J53J06J69K77M60P54J034J000M12n68j341j371
54604A14249o74K62R39J160R86N96J45l06o54o16k2P11Q15R2p07p41p5N43O31
54585A17334L14j09m56n99m48j05K37N07O79N97J93k74m15j62K47N77P29O89O12
54566A20147P81J242J575J382P96K53j18m82q47j029j034j023r86p79m65k42l1
54549A19140L60Q13R73Q47Q34J073J199R05M17J92L75O89P41L90n4r2M15J016
$$ plain form
54531 130233 131477 132635 133703 134636 135155 135133 134821 134461 133978 133321 132746 132397 131973 131251 130636 130625 130955 130859 130072
54512 130072 129023 128074 127210 126545 126544 127477 129103 131058 133066 134620 135023 134153 132765 131628 130668 129411 127929
54495 127929 126776 126169 125819 125583 125695 126147 126358 125848 124947 124447 124655 125155 125494 125742 126255 127154 128233 129225
54477 129225 129956 130350 130538 130896 131709 132787 133657 134187 134726 135480 136112 136199 135897 135801 136306 137394 138929 140757
54459 140757 142555 143980 145054 146038 146873 147111 146612 145979 145931 146468 146922 146683 145623 143956 142081 140536 139698
54442 139698 139422 139167 138589 137812 137109 136569 136248 136372 137125 138269 139234 139602 139387 138859 138259 137704 137223 136845
54424 136845 136699 137005 137804 138708 139131 138867 138394 138467 139444 140953 142108 142095 140887 139496 139280 140691 142836
54407 142836 144460 145130 145174 144703 143340 141079 138838 137778 138262 139795 141734 143676 145274 146162 146294 146114
$$ packed form
54531A30233J244J158J068R33N19k2l12l60m83o57n75l49m24p22o15j1L30r6p87
54512A30072j049r49q64o65jR33J626J955K008J554M03q70j388j137r60j257j482
54495A27929j153o07l50k36J12M52K11n10r01n00K08N00L39K48N13Q99J079R92
54477A29225P31L94J88L58Q13J078Q70N30N39P54O32Q7l02r6N05J088J535J828
54459A40757J798J425J074R84Q35K38m99o33m8N37M54k39j060j667j875j545q38
54442A39698k76k55n78p77p03n40l21J24P53J144R65L68k15n28o00n55m81l78
54424A36845j46L06P99R04M23k64m73P3R77J509J155j3j208j391k16J411K145
54407A42836J624O70M4m71j363k261k241j060M84J533J939J942J598Q88J32j80
$$ plain form
54391 146114 146191 146714 147503 148406 149469 150623 151412 151337 150500 149649 149353 149348 148912 147776 146359 145195 144481 144207
54373 144207 144312 144593 144777 144864 145165 145851 146719 147571 148516 149618 150534 150827 150510 150019 149801 150093 150884 151826 152392
54354 152392 152437 152436 152854 153522 154003 154310 154728 155089 154842 153896 152804 151999 151366 150809 150743 151711 153777 156535 159409
54335 159409 161744 162978 163087 162693 162462 162506 162499 162125 161166 159441 157012 154406 152348 151251 151060 151409 151799
54318 151799 151752 150999 149507 147383 144960 142917 141871 141630 141314 140480 139687 139590 139938 140052 139926 140067 140402 140223
54300 140223 139341 138549 138633 139495 140491 141171 141384 141205 141155 141995 143822 145701 146682 146900 147199 147953 148801 149343 149483
54281 149483 149159 148319 147278 146620 146631 147133 147872 148598 148849 148272 147322 147017 147643 148245 147825 146648 145759 145525
54263 145525 145325 144643 143797 143358 143333 143262 142942 142680 142903 143706 144856 146127 147487 148962 150490 152000 153485
$$ packed form
54391A46114P7N23P89R03J063J154P89p5q37q51k96nm36j136j417j164p14k74
54373A44207J05K81J84Q7L01O86Q68Q52R45J102R16K93l17m91k18K92P91R42N66
54354A52392M5jM18O68M81L07M18L61k47r46j092q05o33n57o6R68K066K758K874
54335A59409K335J234J09l94k31M4pl74r59j725k429k606k058j097j91L49L90
54318A51799m7p53j492k124k423k043j046k41l16q34p93r7L48J14j26J41L35j79
54300A40223q82p92Q4Q62R96O80K13j79n0Q40J827J879R81K18K99P54Q48N42J40
54281A49483l24q40j041o58J1N02P39P26K51n77r50l05O26O02m20j177q89k34
54263A45525k00o82q46m39k5p1l20k62K23Q03J150J271J360J475J528J510J485
$$ plain form
54246 153485 154759 155265 154588 153150 151957 151436 150988 150020 148956 148666 149221 149890 150181 150207 150019 149311 148003
54229 148003 146554 145435 144742 144464 144579 144644 143932 142476 141421 141714 142765 143093 142097 140561 139529 139322 139683
54212 139683 140200 140408 140006 139301 139061 139711 140919 142097 142954 143381 143221 142501 141612 140916 140379 139924 139850 140463
54194 140463 141456 142142 142294 142274 142311 142188 141834 141704 142156 142815 143016 142738 142608 143048 143828 144427 144453 143746 142550
54175 142550 141617 141590 142097 142007 140884 139681 139525 140360 141376 142310 143410 144310 143995 142192 140000 138684 138370
54158 138370 138326 138065 137705 137553 137779 138324 138862 139043 138937 138839 138459 136938 134236 131944 131876 134008 136578 138222
54140 138222 139243 140590 142331 143609 143747 142934 141959 141530 141797 142342 142655 142587 142324 142043 141824 141833 142257 143023
54122 143023 143799 144315 144480 144261 143760 143428 143801 144919 146300 147639 149201 151288 153587 155268 155640 154636
$$ packed form
54246A53485J274N06o77j438j193n21m48r68j064k90N55O69K91K6j88p08j308
54229A48003j449j119o93k78J15O5p12j456j055K93J051L28r96j536j032k07L61
54212A39683N17K08m02p05k40O50J208J178Q57M27j60p20q89o96n37m55p4O13
54194A40463R93O86J52k0L7j23l54j30M52O59K01k78j30M40P80N99K6p07j196
54175A42550r33k7N07r0j123j203j56Q35J016R34J100R00l15j803k192j316l14
54158A38370m4k61l60j52K26N45N38J81j06r8l80j521k702k292o8K132K570J644
54140A38222J021J347J741J278J38q13r75m29K67N45L13o8k63k81k19RM24P66
54122A43023P76N16J65k19n01l32L73J118J381J339J562K087K299J681L72j004
$$ plain form
54106 154636 152893 151497 151372 152572 154253 155453 155835 155600 154900 153671 151983 150271 149112 148813 149248 150064
54090 150064 151011 152032 153052 153885 154468 155068 155976 157029 157713 157750 157339 156859 156566 156605 156954 157300 157388 157592 158678
54071 158678 160730 162774 163945 164672 166144 168710 171411 173154 173810 173969 174081 174205 174367 174693 175203 175735
54055 175735 176235 176970 178315 180331 182662 184880 186872 188832 190978 193386 196073 199095 202501 206324 210754
54040 210754 216277 223523 232851 243992 256057 267936 278785 288140 295685 301161 304663 306820 308374
54027 308374 309575 310244 310336 310184 310162 310410 310972 311870 312914 313740 314175 314324 314125 313120 310982 308059 305068
54010 305068 302291 299262 295216 289703 282924 275644 268654 262180 255889 249624 243848 239103 235247 231621
53996 231621 227929 224584 222100 220518 219542 218940 218554 218044 216915 214862 212068 209100 206499 204404 202525
$$ packed form
54106A54636j743j396j25J200J681J200L82k35p00j229j688j712j159k99M35Q16
54090A50064R47J021J020Q33N83O00R08J053O84L7m11m80k93L9L49L46Q8K04J086
54071A58678K052K044J171P27J472K566K701J743O56J59J12J24J62L26N10N32
54055A75735N00P35J345K016K331K218J992J960K146K408K687L022L406L823M430
54040B10754N523P246R328J1141J2065J1879J0849R355P545N476L502K157J554
54027C08374J201O69R2j52k2K48N62Q98J044Q26M35J49j99j005k138k923k991
54010C05068k777l029m046n513o779p280o990o474o291o265n776m745l856l626
53996B31621l692l345k484j582r76o02l86n10j129k053k794k968k601k095j879
$$ plain form
53981 202525 200450 197958 195145 192426 190444 189700 190037 190567 190395 189462 188504 188117 188073 187747 187137 187097 188308
53964 188308 190211 191410 191274 190724 191063 192341 193482 193926 194344 195535 197319 199094 200971 203587 206948
53949 206948 210202 212699 214749 217065 219871 222890 225983 229415 233462 237969 242453 246599 250543 254631
53935 254631 259010 263692 268858 274755 281152 287237 292261 296094 298941 300910 302257 303848 306777 311432
53921 311432 317261 323518 329958 336741 343939 351354 358757 366256 374427 383978 395224 407932 421614
53908 421614 435620 448808 459649 467184 471706 474052 474416 472375 467904 461780 454968 448185 442081 437174
53894 437174 433300 429635 425545 421134 416820 412805 409195 406269 404358 403741 404734 407392 410882 413530 413769
53879 413769 410735 403951 393171 379050 363386 348021 333714 320486 308582 298416 289850 282251
$$ packed form
53981B02525k075k492k813k719j982p44L37N30j72r33r58l87m4l26o10m0J211
53964A88308J903J199j36n50L39J278J141M44M18J191J784J775J877K616L361
53949B06948L254K497K050K316K806L019L093L432M047M507M484M146L944M088
53935B54631M379M682N166N897O397O085N024L833K847J969J347J591K929M655
53921C11432N829O257O440O783P198P415P403P499Q171R551J1246J2708J3682
53908D21614J4006J3188J0841P535M522K346L64k041m471o124o812o783o104m907
53894D37174l874l665m090m411m314m015l610k926j911o17R93K658L490K648K39
53879D13769l034o784j0780j4121j5664j5365j4307j3228j1904j0166q566p599
$$ plain form
53867 282251 275221 268701 262478 256222 250013 244318 239388 235170 231748 229291 227557 226004 224471 223168
53853 223168 221923 220150 217762 215425 213520 211504 208822 205927 203751 202512 201645 200720 199840 199219 198912
53838 198912 198950 199238 199344 198868 198095 197823 198366 199112 199271 198784 198198 197845 197464 196681 195694 195306 196169 197991 199723
53819 199723 200663 201157 201968 203188 204170 204526 204730 205547 207159 209031 210502 211447 212548 214906 219108 224616
53803 224616 230327 235721 241104 246747 252410 257958 263801 270196 276529 281932 286374 290522 294682 298567
53789 298567 302041 305391 308629 311217 312834 313987 315428 317231 318799 319520 319144 317734 315658 313453 311305
53774 311305 308652 304568 298620 291256 283463 276184 269941 264771 260453 256838 253873 251278 248430 244837
53760 244837 240645 236450 232626 229048 225430 221764 218398 215756 213960 212682 211476 210339 209735 209919 210458
$$ packed form
53867B82251p030o520o223o256o209n695m930m218l422k457j734j553j533j303
53853B23168j245j773k388k337j905k016k682k895k176j239q67r25q80o21l07
53838A98912L8K88J06m76p73k72N43P46J59m87n86l53l81p83r87l88Q63J822J732
53819A99723R40M94Q11J220R82L56K04Q17J612J872J471R45J101K358M202N508
53803B24616N711N394N383N643N663N548N843O395O333N403M442M148M160L885
53789B98567L474L350L238K588J617J153J441J803J568P21l76j410k076k205k148
53774C11305k653m084n948p364p793p279o243n170m318l615k965k595k848l593
53760B44837m192m195l824l578l618l666l366k642j796j278j206j137o04J84N39
$$ plain form
53745 210458 210695 210490 210167 209882 209514 209189 209381 210264 211344 212040 212389 212864 213644 214371 214574 214064 212953 211569
53727 211569 210440 210103 210718 211975 213488 215215 217357 219910 222524 224837 226731 228208 229243 229965 230795
53712 230795 232063 233546 234694 235374 236041 237106 238504 240064 241931 244299 246968 249562 252039 254639 257418
53697 257418 260263 263332 267026 271349 275621 279068 281598 283832 286402 289290 291857 293545 294502 295321 296137
53682 296137 296352 295553 294325 293639 293559 293182 291881 290021 288269 286740 285196 283674 282474 281716 281244 280851
53666 280851 280353 279560 278478 277455 276918 276979 277353 277509 276872 275185 272908 271031 270200 270123 270045 269626 269107 268825
53648 268825 268971 269749 271290 273313 275119 276104 276204 275854 275759 276596 278610 281289 283674 285173 285990 286658 287329
53631 287329 287724 287748 287855 288656 290235 292062 293667 295226 297320 300183 303481 306890 310531 314640 318999
$$ packed form
53745B10458K37k05l23k85l68l25J92Q83J080O96L49M75P80P27K03n10j111j384
53727B11569j129l37O15J257J513J727K142K553K614K313J894J477J035P22Q30
53712B30795J268J483J148O80O67J065J398J560J867K368K669K594K477K600K779
53697B57418K845L069L694M323M272L447K530K234K570K888K567J688R57Q19Q16
53682B96137K15p99j228o86q0l77j301j860j752j529j544j522j200p58m72l93
53666B80851m98p93j082j023n37O1L74J56o37j687k277j877q31p7p8m19n19k82
53648B68825J46P78J541K023J806R85J00l50r5Q37K014K679K385J499Q17O68O71
53631B87329L95K4J07Q01J579J827J605J559K094K863L298L409L641M109M359
$$ plain form
53616 318999 323055 326521 329554 332407 335252 338434 342507 347695 353487 359029 363894 368234 372267 375922
53602 375922 379064 381817 384432 386984 389446 391928 394540 396973 398609 399215 399326 399645 400233 400593 400499 400391
53586 400391 400888 402119 403631 404817 405352 405336 405067 404637 403863 402684 401402 400243 398785 396268 392468 387958
53570 387958 383486 379525 376401 374303 372899 371458 369727 368295 367744 367805 367762 367319 366586 365562 364297 363373
53554 363373 363525 364758 366428 368245 370535 373351 375940 377536 378247 378846 379924 381602 383768 386196 388599
53539 388599 390947 393715 397470 402220 407449 412850 418775 425824 434146 443312 452841 462701 473210 484536
53525 484536 496443 508610 521049 534085 547927 562385 577046 591668 606442 621909 638597
53514 638597 656653 675844 695935 716903 738732 761220 784255 808138 833242 859279 885259
$$ packed form
53616C18999M056L466L033K853K845L182M073N188N792N542M865M340M033L655
53602C75922L142K753K615K552K462K482K612K433J636O06J11L19N88L60r4j08
53586D00391M97J231J512J186N35j6k69m30p74j179j282j159j458k517l800m510
53570C87958m472l961l124k098j404j441j731j432n51O1m3m43p33j024j265r24
53554C63373J52J233J670J817K290K816K589J596P11N99J078J678K166K428K403
53539C88599K348K768L755M750N229N401N925P049Q322R166R529R860J0509J1326
53525D84536J1907J2167J2439J3036J3842J4458J4661J4622J4774J5467J6688
53514F38597J8056J9191K0091K0968K1829K2488K3035K3883K5104K6037K5980
$$ plain form
53503 885259 910319 934364 957773 980736 1003196 1025273 1047366 1069681 1091879 1113389 1134044
53492 1134044 1154189 1174097 1193458 1211725 1228905 1245704 1262717 1279795 1296428 1312498 1328242
53481 1328242 1343706 1358753 1373666 1389072 1404915 1419891 1432379 1441861 1449114 1455028 1459568 1461930
53469 1461930 1461450 1458143 1452414 1444480 1434250 1421821 1407912 1393594 1379567 1365845 1352126 1338215
53457 1338215 1323914 1308672 1291609 1272113 1250452 1227782 1205394 1183821 1162722 1141656 1120761
53446 1120761 1100506 1081025 1062149 1044089 1027609 1013359 1001280 990835 981510 972993 965200 958429
53434 958429 953224 949817 947804 946615 946136 946669 948502 951753 956447 962390 969131 976364 984317 993544 1004452
53419 1004452 1017323 1032496 1050034 1069286 1089374 1110218 1132579 1156961 1182991 1210187 1238784
$$ packed form
53503H85259K5060K4045K3409K2963K2460K2077K2093K2315K2198K1510K0655
53492A134044K0145J9908J9361J8267J7180J6799J7013J7078J6633J6070J5744
53481A328242J5464J5047J4913J5406J5843J4976J2488R482P253N914M540K362
53469A461930m80l307n729p934j0230j2429j3909j4318j4027j3722j3719j3911
53457A338215j4301j5242j7063j9496k1661k2670k2388k1573k1099k1066k0895
53446A120761k0255j9481j8876j8060j6480j4250j2079j0445r325q517p793o771
53434I58429n205l407k013j189m79N33J833L251M694N943O741P233P953R227J0908
53419A004452J2871J5173J7538J9252K0088K0844K2361K4382K6030K7196K8597
$$ plain form
53408 1238784 1269291 1301578 1335103 1370024 1407446 1448303 1492348 1538497 1585900 1634333 1683751
53397 1683751 1733940 1784802 1836638 1889839 1944298 1999355 2054345 2109011 2163328 2217112 2269988
53386 2269988 2321647 2371956 2420820 2468020 2513131 2555529 2594664 2630536 2663791 2694931 2723371
53375 2723371 2747620 2766572 2780364 2789765 2795011 2795570 2790841 2780544 2764443 2742124 2713380 2678615
53363 2678615 2638714 2594652 2547322 2497579 2446208 2393900 2341352 2289270 2238205 2188461 2140246
53352 2140246 2093660 2048441 2004018 1960191 1917490 1876388 1836220 1795453 1753190 1709986 1667055
53341 1667055 1625169 1584625 1545789 1509077 1474581 1442207 1412106 1384504 1359180 1335565 1313445
53330 1313445 1293159 1274963 1258447 1242620 1226366 1208876 1190137 1171096 1152975 1136267 1120708
$$ packed form
53408A238784L0507L2287L3525L4921L7422M0857M4045M6149M7403M8433M9418
53397A683751N0189N0862N1836N3201N4459N5057N4990N4666N4317N3784N2876
53386B269988N1659N0309M8864M7200M5111M2398L9135L5872L3255L1140K8440
53375B723371K4249J8952J3792R401N246N59m729j0297j6101k2319k8744l4765
53363B678615l9901m4062m7330m9743n1371n2308n2548n2082n1065m9744m8215
53352B140246m6586m5219m4423m3827m2701m1102m0168m0767m2263m3204m2931
53341A667055m1886m0544l8836l6712l4496l2374l0101k7602k5324k3615k2120
53330A313445k0286j8196j6516j5827j6254j7490j8739j9041j8121j6708j5559
$$ plain form
53319 1120708 1106216 1093269 1082095 1072126 1062825 1054686 1048811 1045690 1044957 1046147 1049026 1053147 1057777
53306 1057777 1062561 1067886 1074393 1082428 1092138 1103720 1117291 1132740 1149916 1168787 1189284 1211210
53294 1211210 1234487 1259234 1285398 1312540 1340237 1368423 1396967 1425044 1451340 1474933 1495770
53283 1495770 1514384 1531454 1547564 1562914 1577039 1588999 1598016 1603866 1606649 1606462 1603406 1597695 1589512
53270 1589512 1578884 1565902 1550947 1534455 1516471 1496638 1474679 1450777 1425499 1399491 1373269
53259 1373269 1347139 1321149 1295109 1268681 1241564 1213737 1185696 1158373 1132570 1108341 1085016
53248 1085016 1061859 1038559 1015072 991247 966840 941782 916243 890375 864210 837883 811872
53237 811872 786941 763761 742530 722962 704766 688130 673546 661085 650113 639918 630350 621443
$$ packed form
53319A120708j4492j2947j1174r969r301q139n875l121p33J190K879M121M630
53306A057777M784N325O507Q035R710J1582J3571J5449J7176J8871K0497K1926
53294A211210K3277K4747K6164K7142K7697K8186K8544K8077K6296K3593K0837
53283A495770J8614J7070J6110J5350J4125J1960R017N850K783j87l056n711q183
53270A589512j0628j2982j4955j6492j7984j9833k1959k3902k5278k6008k6222
53259A373269k6130k5990k6040k6428k7117k7827k8041k7323k5803k4229k3325
53248A085016k3157k3300k3487k3825k4407k5058k5539k5868k6165k6327k6011
53237H11872k4931k3180k1231j9568j8196j6636j4584j2461j0972j0195r568q907
$$ plain form
53225 621443 612614 602811 591638 579869 568519 557649 546398 533990 520419 506276 492232 478733
53213 478733 465961 453950 442712 432216 422311 412910 404331 397137 391354 386119 380433 374115 367631
53200 367631 361109 354090 346368 338600 331728 326012 320904 315821 310828 306506 303182 300330 296913 292494
53186 292494 287870 284277 281993 280083 277593 274533 271546 269035 266984 265318 264012 262986 262185 261639 261157
53171 261157 260195 258461 256514 255274 254950 254868 254386 253498 252415 251132 249708 248550 247962 247603 246851 245661
53155 245661 244685 244450 244665 244472 243293 241367 239495 238319 237881 237850 238048 238501 239025 239139 238569 237661 237036 236987
53137 236987 237381 237964 238473 238581 238125 237442 237131 237383 237757 237740 237354 237128 237537 238527 239552 240069 240140 240418 241392
53118 241392 242724 243576 243528 242822 241748 240280 238475 236815 235812 235584 236038 237172 238811 240346 241248 241667
$$ packed form
53225F21443q829r803j1173j1769j1350j0870j1251j2408j3571j4143j4044j3499
53213D78733j2772j2011j1238j0496r905r401q579p194n783n235n686o318o484
53200C67631o522p019p722p768o872n716n108n083m993m322l324k852l417m419
53186B92494m624l593k284j910k490l060k987k511k051j666j306j026q01n46m82
53171B61157r62j734j947j240l24q2m82q88j083j283j424j158n88l59p52j190
53155B45661r76k35K15j93j179j926j872j176m38l1J98M53N24J14n70r08o25m9
53137B36987L94N83N09J08m56o83l11K52L74j7l86k26M09R90J025N17P1K78R74
53118B41392J332Q52m8p06j074j468j805j660j003k28M54J134J639J535R02M19
$$ plain form
53102 241667 242021 242106 241246 239377 237366 235942 234833 233392 231688 230446 230006 229905 229528 228814 228142 227807 227801
53085 227801 227969 228127 228064 227608 226848 226200 226128 226697 227489 228037 228274 228440 228651 228842 229119 229772 230723 231296 230893
53066 230893 229796 228910 228813 229380 230294 231389 232336 232556 231819 230665 229787 229201 228463 227531 226845 226459 225697 224062
53048 224062 222118 221044 221389 222574 223525 223563 222733 221593 220751 220381 220113 219559 218879 218644 219076 219684 219754 219068
53030 219068 218033 217230 216909 216854 216684 216311 216084 216430 217454 219010 220927 222855 224107 224270 223961 224314 225444
53013 225444 226055 225052 223006 221375 220667 220219 219576 219207 219631 220646 221788 222996 224358 225553 226054 225784
52997 225784 225292 225306 226208 227768 229295 230227 230561 230528 229977 228610 226863 225945 226662 228650 231077 233550 235842
52980 235842 237325 237485 236823 236489 237027 238068 239187 240333 241382 242085 242787 244513 247803 251879 255463 258085
$$ packed form
53102B41667L54Q5q60j869k011j424j109j441j704j242m40j01l77p14o72l35o
53085B27801J68J58o3m56p60o48p2N69P92N48K37J66K11J91K77O53R51N73m03
53066B30893j097q86r7N67R14J095R47K20p37j154q78n86p38r32o86l86p62j635
53048B24062j944j074L45J185R51L8q30j140q42l70k68n54o80k35M32O08P0o86
53030B19068j035q03l21n5j70l73k27L46J024J556J917J928J252J63l09L53J130
53013B25444O11j003k046j631p08m48o43l69M24J015J142J208J362J195N01k70
52997B25784m92J4R02J560J527R32L34l3n51j367j747r18P17J988K427K473K292
52980B35842J483J60o62l34N38J041J119J146J049P03P02J726L290M076L584K622
$$ plain form
52964 258085 260066 261479 261859 261019 259661 258882 259238 260414 261530 261690 260466 258188 255725 253777 252287
52949 252287 250671 248615 246543 245188 244809 244938 244907 244457 243863 243581 243853 244542 245285 245874 246517 247586 249045
52932 249045 250318 250823 250498 249659 248562 247289 245879 244254 242143 239465 236717 234689 233715 233470 233446 233309
52916 233309 232794 231749 230449 229481 229057 228772 228310 228092 228822 230563 232541 233754 233540 231766 228943 226128
52900 226128 224299 223654 223644 223686 223607 223440 223210 223080 223476 224742 226686 228555 229473 228984 227338 225344 223817
52883 223817 223062 222931 223298 224244 225677 227010 227556 227286 227041 227813 229796 232157 233832 234594 235270 236877 239589
52866 239589 242710 245482 247637 249144 249851 249726 249222 249004 249321 249895 250373 250531 250021 248438 245983 243720
52850 243720 242681 242772 242948 242475 241601 240851 240151 238982 237118 234717 231816 228329 224691 221914 220522 219705
$$ packed form
52964B58085J981J413L80q40j358p79L56J176J116J60j224k278k463j948j490
52949B52287j616k056k072j355l79J29l1m50n94k82K72O89P43N89O43J069J459
52932B49045J273N05l25q39j097j273j410j625k111k678k748k028r74k45k4j37
52916B33309n15j045j300r68m24k85m62k18P30J741J978J213k14j774k823k815
52900B26128j829o45j0M2p9j67k30j30L96J266J944J869R18m89j646j994j527
52883B23817p55j31L67R46J433J333N46k70k45P72J983K361J675P62O76J607K712
52866B39589L121K772K155J507P07j25n04k18L17N74M78J58n10j583k455k263
52850B43720j039R1J76m73q74p50p00j169j864k401k901l487l638k777j392q17
$$ plain form
52834 219705 218138 215675 213717 213632 215126 216466 216181 214268 211872 210176 209634 209934 210467 210873 211240 211750
52818 211750 212247 212368 212108 211908 212046 212229 212050 211656 211608 212203 213176 214058 214539 214546 214292 214280 214916 216037 217078
52799 217078 217744 218173 218368 217934 216638 214878 213224 211715 210013 208035 206007 204011 201980 200195 199278
52784 199278 199447 200071 200285 199879 199396 199428 200046 200867 201578 202282 203339 204856 206440 207616 208432 209405 210772
52767 210772 212064 212643 212539 212432 212729 212955 212315 210747 209082 208084 207646 207164 206468 205964 205916 206065 206122 206185 206422
52748 206422 206622 206421 205756 204814 203760 202886 202849 204249 206938 210097 213004 215471 217640 219802 222395 225640
52732 225640 229007 231421 232279 232013 231545 231469 231871 232592 233393 234128 234917 235951 236965 237283 236559 235195 233799
52715 233799 232559 231414 230449 229689 228768 227297 225490 223996 223146 222681 222141 221235 219936 218563 217701 217684 218176
$$ packed form
52834B19705j567k463j958q5J494J340k85j913k396j696n42L00N33M06L67N10
52818B11750M97J21k60k00J38J83j79l94m8N95R73Q82M81Pk54j2O36J121J041
52799B17078O66M29J95m34j296j760j654j509j702j978k028j996k031j785r17
52784A99278J69O24K14m06m83L2O18Q21P11P04J057J517J584J176Q16R73J367
52767B10772J292N79j04j07K97K26o40j568j665r98m38m82o96n04m8J49N7O3K37
52748B06422K00k01o65r42j054q74l7J400K689L159K907K467K169K162K593L245
52732B25640L367K414Q58k66m68p6M02P21Q01P35P89J034J014L18p24j364j396
52715B33799j240j145r65p60r21j471j807j494q50m65n40r06j299j373q62j7M92
$$ plain form
52698 218176 218623 219051 219977 221509 223018 223863 224044 223951 223830 223780 223981 224579 225473 226515 227810 229542 231514
52681 231514 233154 234056 234365 234524 234714 234663 234016 232835 231691 231224 231594 232386 233030 233320 233536 234052 234812 235272
52663 235272 234957 234074 233392 233503 234321 235338 236165 236697 236949 236974 236878 236761 236722 236995 237933 239693 242042 244584
52645 244584 246970 248737 249253 248237 246226 244168 242605 241518 240718 239927 238614 236418 233860 232066 231562
52630 231562 231779 231943 231930 231942 231925 231890 232413 234064 236466 238569 239910 240954 242002 242433 241580 239959 238923
52613 238923 239035 239404 238946 237859 237293 237750 238511 238844 239141 240290 242273 244110 245194 245996 247272 249107
52597 249107 251058 252843 254448 255854 257097 258455 260123 261772 262776 262905 262579 262393 262627 263166 263668 263749
52581 263749 263296 262697 262663 263657 265449 267228 268151 267918 266929 265877 265193 264906 264962 265376 266007 266489 266607 266483
$$ packed form
52698B18176M47M28R26J532J509Q45J81r3j21n0K01N98Q94J042J295J732J972
52681B31514J640R02L09J59J90n1o47j181j144m67L70P92O44K90K16N16P60M60
52663B35272l15q83o82J11Q18J017Q27N32K52K5r6j17l9K73R38J760K349K542
52645B44584K386J767N16j016k011k058j563j087q00p91j313k196k558j794n04
52630B31562K17J64j3J2j7l5N23J651K402K103J341J044J048M31q53j621j036
52613B38923J12L69m58j087n66M57P61L33K97J149J983J837J084Q02J276J835
52597B49107J951J785J605J406J243J358J668J649J004J29l26j86K34N39N02Q1
52581B63749m53n99l4R94J792J779R23k33r89j052o84k87N6M14O31M82J18j24
$$ plain form
52563 266483 266165 265317 263713 261860 260648 260363 260406 260096 259391 258688 258183 257685 256953 256055 255364 255164 255249 255033
52545 255033 254221 253256 252895 253428 254500 255560 256135 255807 254434 252548 251116 250667 250931 251419 251992 252613 252929
52528 252929 252564 251704 251011 250927 251311 251759 252048 252218 252375 252513 252513 252340 252208 252448 253168 254173 255249 256429 257895
52509 257895 259793 262189 265042 268148 271303 274559 278068 281505 283982 284780 283986 282157 279625 276532 273348
52494 273348 270807 269210 268135 266936 265293 263234 260949 258722 256798 255178 253713 252449 251651 251378 251301
52479 251301 251162 251221 251997 253628 255728 257805 259612 261050 261990 262366 262360 262325 262512 263032 264107 266163 269385
52462 269385 273276 276960 280052 282952 286132 289398 292126 294000 295099 295390 294594 292630 289824 286558 282943
52447 282943 278984 274800 270592 266592 263129 260470 258532 257014 255887 255404 255502 255605 255271 254677 254125 253483
$$ packed form
52563B66483l18q48j604j853j212k85M3l10p05p03n05m98p32q98o91k00Q5k16
52545B55033q12r65l61N33J072J060N75l28j373j886j432m49K64M88N73O21L16
52528B52929l65q60o93q4L84M48K89J70J57J38%j73j32K40P20J005J076J180J466
52509B57895J898K396K853L106L155L256L509L437K477P98p94j829k532l093l184
52494B73348k541j597j075j199j643k059k285k227j924j620j465j264p98k73p7
52479B51301j39N9P76J631K100K077J807J438R40L76ol5J87N20J075K056L222
52462B69385L891L684L092K900L180L266K728J874J099K91p96j964k806l266l615
52447B82943l959m184m208m000l463k659j938j518j127m83R8J03l34n94n52o42
$$ plain form
52431 253483 252554 251669 251274 251089 250357 249015 247920 247705 247963 247940 247611 247620 248424 249960 252008 254404 256891 259174
52413 259174 261201 263120 264895 266215 266989 267732 269332 272513 277595 284514 292829 301801 310755 319403 327667
52398 327667 335147 340906 343890 343511 339873 333696 326144 318520 311808 306353 301997 298432 295407 292761
52384 292761 290486 288770 287810 287587 287869 288453 289302 290541 292409 295123 298577 302250 305600 308581 311582
52369 311582 314923 318604 322506 326585 330862 335447 340469 345640 349965 352392 352902 352512 352043 351430 350476
52354 350476 349683 349716 350455 351230 351771 352326 353004 353659 354409 355617 357281 359041 360931 363593 367489 372361 377707
52337 377707 383346 389274 395339 401425 407703 414523 422288 431594 442987 456284 470566 485260 500926
52324 500926 518469 537856 558195 578923 600287 622581 645522 668561 691358 713610 734777
$$ packed form
52431B53483r29q85l95j85p32j342j095k15K58k3l29RQ04J536K048K396K487K283
52413B59174K027J919J775J320P74P43J600L181N082O919Q315Q972Q954Q648Q264
52398C27667P480N759K984l79l638o177p552p624o712n455m356l565l025k646
52384B92761k275j716r60k23K82N84Q49J239J868K714L454L673L350K981L001
52369C11582L341L681L902M079M277M585N022N171M325K427N10l90m69o13r54
52354C50476p93L3P39P75N41N55O78O55P50J208J664J760J890K662L896M872N346
52337C77707N639N928O065O086O278O820P765R306J1393J3297J4282J4694J5666
52324E00926J7543J9387K0339K0728K1364K2294K2941K3039K2797K2252K1167
$$ plain form
52313 734777 754430 772772 790502 808124 825546 842384 858455 873827 888457 901985 914058
52302 914058 924843 934999 945021 954709 963397 970587 976239 980591 983976 986750 989026 990314 989658 986411
52288 986411 980837 973770 965792 956993 947550 938224 930072 923735 919199 916150 914345 913708 914372 916787 921593
52273 921593 929113 939018 950518 962821 975422 988231 1001614 1016112 1031891 1048522 1065375 1081984
52261 1081984 1097829 1112193 1124726 1135996 1146970 1157958 1168485 1178126 1186959 1195197 1202993 1210722
52249 1210722 1218847 1227250 1235140 1241839 1247113 1250531 1251208 1248732 1243904 1237990 1231590 1224660 1217178 1209167
52235 1209167 1200423 1191061 1182191 1175264 1170662 1167499 1164776 1162189 1159808 1157743 1156300 1155805 1155940 1155823 1155146
52220 1155146 1154860 1156230 1159461 1163608 1167700 1171644 1176095 1181721 1188607 1196214 1203906 1211520 1219381 1227821
$$ packed form
52313G34777J9653J8342J7730J7622J7422J6838J6071J5372J4630J3528J2073
52302I14058J0785J0156J0022R688Q688P190N652M352L385K774K276J288o56l247
52288I86411n574p067p978q799r443r326q152o337m536l049j805o37O64K415M806
52273I21593P520R905J1500J2303J2601J2809J3383J4498J5779J6631J6853J6609
52261A081984J5845J4364J2533J1270J0974J0988J0527R641Q833Q238P796P729
52249A210722Q125Q403P890O699N274L418O77k476m828n914o400o930p482q011
52235A209167q744r362q870o927m602l163k723k587k381k065j443m95J35j17o77
52220A155146k86J370L231M147M092L944M451N626O886P607P692P614P861Q440
$$ plain form
52206 1227821 1236841 1246200 1255594 1264691 1273234 1281252 1288988 1296596 1304047 1311339 1318517 1325384 1331490 1336572
52192 1336572 1340839 1344734 1348625 1352800 1357519 1362741 1367943 1372386 1375595 1377545 1378517 1378847 1378687 1377838 1375809
52177 1375809 1372095 1366402 1358707 1349226 1338408 1326884 1315453 1305029 1296273 1289033 1282307 1275164 1267700
52164 1267700 1260829 1255265 1251068 1248091 1246408 1246077 1246897 1248586 1250994 1254003 1257414 1260982 1264340 1266875
52150 1266875 1267977 1267440 1265380 1261876 1257195 1252317 1248539 1246185 1244231 1241569 1238253 1235160 1232890 1231482
52136 1231482 1230869 1230970 1231472 1232037 1232760 1234090 1236354 1239623 1244077 1250269 1258981 1270875 1286044 1303852
52122 1303852 1323489 1344835 1368523 1394964 1423721 1454007 1485334 1517267 1549007 1579802 1609445
52111 1609445 1637791 1664097 1687507 1708009 1726155 1741862 1754230 1762664 1767546 1769606 1769217 1766541
$$ packed form
52206A227821R020R359R394R097Q543Q018P736P608P451P292P178O867O106N082
52192A336572M267L895L891M175M719N222N202M443L209J950R72L30j60q49k029
52177A375809l714n693p695r481j0818j1524j1431j0424q756p240o726p143p464
52164A267700o871n564m197k977j683l31Q20J689K408L009L411L568L358K535
52150A266875J102n37k060l504m681m878l778k354j954k662l316l093k270j408
52136A231482o13J01N02N65P23J330K264L269M454O192Q712J1894J5169J7808
52122A303852J9637K1346K3688K6441K8757L0286L1327L1933L1740L0795K9643
52111A609445K8346K6306K3410K0502J8146J5707J2368Q434M882K060l89k676
$$ plain form
52099 1766541 1761950 1756089 1749859 1744373 1740421 1737775 1735421 1732602 1729225 1725178 1719879 1712855 1704297 1694688
52085 1694688 1684236 1673039 1661420 1649723 1638059 1626655 1616162 1607293 1600437 1596001 1594753 1597261
52073 1597261 1603141 1611371 1621234 1632496 1644873 1658017 1672072 1687571 1704526 1722041 1739131 1755526
52061 1755526 1771376 1786496 1800260 1812087 1821696 1829008 1834071 1836983 1837709 1836047 1832031 1826201 1819179
$$ packed form
52099A766541m591n861o230n486l952k646k354k819l377m047n299p024q558r609
52085A694688j0452j1197j1619j1697j1664j1404j0493q869o856m436j248K508
52073A597261N880Q230R863J1262J2377J3144J4055J5499J6955J7515J7090J6395
52061A755526J5850J5120J3764J1827R609P312N063K912P26j662m016n830p022
$$ [...]
##END NTUPLES=NMR SPECTRUM
##END=
