
##TITLE=AC1213_BRAAS12064_6528106_XEsjp4Wcx4
##JCAMPDX= 6.0         $$ Bruker NMR JCAMP-DX V2.0
##DATA TYPE= NMR SPECTRUM
##DATA CLASS= NTUPLES
##ORIGIN= BRUKER
##OWNER= Administrator
$$ 1.72 TOPSPIN		Version 2.1
$$ 2012-12-11 20:19:20.439 -0500  Administrator@X
$$ Compression mode = diff/dup
##.OBSERVE FREQUENCY= 400.02188249412
##.OBSERVE NUCLEUS= ^1H
##.ACQUISITION MODE= SIMULTANEOUS (DQD)
##.ACQUISITION SCHEME= undefined
##.AVERAGES= 8
##.DIGITISER RES= 22
##SPECTROMETER/DATA SYSTEM= spect
##.PULSE SEQUENCE= zg30
##.SOLVENT NAME= COFFEE_meoh
##.SHIFT REFERENCE= INTERNAL, COFFEE_meoh, 1, 14.98509
##AUDIT TRAIL= $$ (NUMBER, WHEN, WHO, WHERE, PROCESS, VERSION, WHAT)
$$ ##TITLE= Audit trail, TOPSPIN		Version 2.1
$$ ##JCAMPDX= 5.01
$$ ##ORIGIN= Bruker BioSpin GmbH
$$ ##OWNER= Administrator
$$ $$ E:\/data/COFFEE/nmr/AC1213_BRAAS12064_6528106_XEsjp4Wcx4/20/pdata/1/auditp.txt
$$ ##AUDIT TRAIL=  $$ (NUMBER, WHEN, WHO, WHERE, PROCESS, VERSION, WHAT)
(   1,<2012-12-11 20:19:11.892 -0500>,<Administrator>,<X>,<go>,<TOPSPIN 2.1>,
      <created by zg
	started at 2012-12-11 20:18:05.658 -0500,
	POWCHK enabled, PULCHK disabled,
       configuration hash MD5:
       86 BA 57 50 F2 9D 5C 9B 26 00 A9 28 5F 66 2E 89
       data hash MD5: 64K
       02 57 8D A7 31 F3 85 90 7F 74 40 1E F0 DB A9 48>)
(   2,<2012-12-11 20:19:15.111 -0500>,<Administrator>,<X>,<proc1d>,<TOPSPIN 2.1>,
      <Start of raw data processing
       efp LB = 0 FT_mod = 6 PKNL = 1 PHC0 = 0 PHC1 = 0 SI = 32K 
       data hash MD5: 32K
       F8 B9 8A A2 BE 88 45 89 51 58 ED B6 B0 64 3A 3B>)
(   3,<2012-12-11 20:19:15.627 -0500>,<Administrator>,<X>,<proc1d>,<TOPSPIN 2.1>,
      <pk PHC0 = 96.36658 PHC1 = 0 
       data hash MD5: 32K
       85 47 64 F6 C3 ED 92 55 11 FB C9 C9 68 47 4E CD>)
(   4,<2012-12-11 20:19:15.877 -0500>,<Administrator>,<X>,<proc1d>,<TOPSPIN 2.1>,
      <abs ABSG = 1 
       data hash MD5: 32K
       C1 8F CB 32 C3 5F 0E 9C D9 0D 73 8C 7B DA 23 72>)
(   5,<2012-12-11 20:19:16.049 -0500>,<Administrator>,<X>,<proc1d>,<TOPSPIN 2.1>,
      <abs ABSG = 2 
       data hash MD5: 32K
       66 29 5A 5E EC 6F 7E 2E 4E 7A 85 9D D4 96 E9 8B>)
(   6,<2012-12-11 20:19:16.220 -0500>,<Administrator>,<X>,<proc1d>,<TOPSPIN 2.1>,
      <abs ABSG = 3 
       data hash MD5: 32K
       06 99 E0 0A 29 67 86 13 0E 1F AF 63 AD 87 3C CB>)
(   7,<2012-12-11 20:19:16.408 -0500>,<Administrator>,<X>,<proc1d>,<TOPSPIN 2.1>,
      <abs ABSG = 4 
       data hash MD5: 32K
       67 DE 1E EF 0D 1E 14 70 0A 12 A9 B7 84 59 79 FA>)
(   8,<2012-12-11 20:19:16.580 -0500>,<Administrator>,<X>,<proc1d>,<TOPSPIN 2.1>,
      <abs ABSG = 5 
       data hash MD5: 32K
       39 96 31 1E 30 2A 86 A8 07 2C F0 A2 2B 52 D4 8B>)
$$ ##END=
$$ 
$$ $$ hash MD5
$$ $$ D2 BF 51 F0 48 25 7B B2 FC 4F 4B 0C 17 31 A8 03
##$RELAX= 
##$RELAX= 
##$RELAX= 
##$RELAX= 
##$RELAX= 
##$RELAX= 
##$RELAX= 
##$RELAX= 
$$ Bruker specific parameters
$$ --------------------------
##$DU= <E:\>
##$EXPNO= 20
$$ [...]
150 150 150 150 150 150 150 150
##$TP07= 0
##$TPNAME0= <>
##$TPNAME1= <>
##$TPNAME2= <>
##$TPNAME3= <>
##$TPNAME4= <>
##$TPNAME5= <>
##$TPNAME6= <>
##$TPNAME7= <>
##$TPOAL= (0..7)
0.5 0.5 0.5 0.5 0.5 0.5 0.5 0.5
##$TPOFFS= (0..7)
0 0 0 0 0 0 0 0
##$TUNHIN= 0
##$TUNHOUT= 0
##$TUNXOUT= 0
##$USERA1= <user>
##$USERA2= <user>
##$USERA3= <user>
##$USERA4= <user>
##$USERA5= <user>
##$V9= 5
##$VALIST= <valist>
##$VCLIST= <CCCCCCCCCCCCCCC>
##$VD= 0
##$VDLIST= <DDDDDDDDDDDDDDD>
##$VPLIST= <PPPPPPPPPPPPPPP>
##$VTLIST= <TTTTTTTTTTTTTTT>
##$WBST= 2048
##$WBSW= 25
##$XGAIN= (0..3)
0 0 0 0
##$XL= 0
##$YL= 0
##$YMAX_a= 664722
##$YMIN_a= -563907
##$ZGOPTNS= <>
##$ZL1= 120
##$ZL2= 120
##$ZL3= 120
##$ZL4= 120
##$ABSF1= 14.98509
##$ABSF2= -5.573092
##$ABSG= 5
##$ABSL= 3
##$ALPHA= 0
##$AQORDER= 0
##$ASSFAC= 0
##$ASSFACI= 0
##$ASSFACX= 0
##$ASSWID= 0
##$AUNMP= <proc_prof1d_extract_pilot.lims>
##$AXLEFT= 0
##$AXNAME= <>
##$AXNUC= <1H>
##$AXRIGHT= 0
##$AXTYPE= 0
##$AXUNIT= <>
##$AZFE= 0.1
##$AZFW= 0.1
##$BCFW= 0
##$BC_mod= 0
##$BYTORDP= 0
##$COROFFS= 0
##$CY= 15
##$DATMOD= 1
##$DC= 0
##$DFILT= <>
##$DTYPP= 0
##$F1P= 0
##$F2P= 0
##$FCOR= 0.5
##$FTSIZE= 32768
##$FT_mod= 6
##$GAMMA= 0
##$GB= 0
##$INTBC= 1
##$INTSCL= 1
##$ISEN= 128
##$LB= 0
##$LEV0= 0
##$LPBIN= 0
##$MAXI= 10000
##$MC2= 0
##$MEAN= 0
##$ME_mod= 0
##$MI= 0
##$NCOEF= 0
##$NC_proc= -8
##$NLEV= 6
##$NOISF1= 0
##$NOISF2= 0
##$NSP= 0
##$NTH_PI= 0
##$NZP= 0
##$OFFSET= 14.98509
##$PC= 1
##$PHC0= 96.36658
##$PHC1= 0
##$PH_mod= 1
##$PKNL= yes
##$PPARMOD= 0
##$PPDIAG= 0
##$PPIPTYP= 0
##$PPMPNUM= 2147483647
##$PPRESOL= 1
##$PSCAL= 4
##$PSIGN= 0
##$PYNMP= <proc.py>
##$REVERSE= no
##$SF= 400.02
##$SI= 32768
##$SIGF1= 0
##$SIGF2= 0
##$SINO= 400
##$SIOLD= 32768
##$SPECTYP= <>
##$SREGLST= <1H.CDCl3>
##$SSB= 0
##$STSI= 32768
##$STSR= 0
##$SW_p= 8223.68421052631
##$SYMM= 0
##$S_DEV= 0
##$TDeff= 65536
##$TDoff= 0
##$TI= <>
##$TILT= no
##$TM1= 0
##$TM2= 0
##$TOPLEV= 0
##$USERP1= <user>
##$USERP2= <user>
##$USERP3= <user>
##$USERP4= <user>
##$USERP5= <user>
##$WDW= 1
##$XDIM= 32768
##$YMAX_p= 470807206
##$YMIN_p= -793842
##$CURPLOT= <Network HP LaserJet P1505>
##$CURPRIN= <$Network HP LaserJet P1505>
##$DFORMAT= <normdp>
##$LAYOUT= <+/1D_H.xwp>
##$LFORMAT= <normlp>
##$PFORMAT= <normpl>
##$SURQMSG= 1
$$ End of Bruker specific parameters
$$ ---------------------------------
##NTUPLES= NMR SPECTRUM
##VAR_NAME=  FREQUENCY,     SPECTRUM/REAL,   SPECTRUM/IMAG
##SYMBOL=    X,             R,               I
##VAR_TYPE=  INDEPENDENT,   DEPENDENT,       DEPENDENT
##VAR_FORM=  AFFN,          ASDF,            ASDF
##VAR_DIM=   32768,         32768,           32768
##UNITS=     HZ,            ARBITRARY UNITS, ARBITRARY UNITS
##FACTOR=    0.250966925370066, 1,           1
##FIRST=     8223.43324360094, -142830,      46451
##LAST=      0,             -26346,          -209168
##MIN=       0,             -793842,         0
##MAX=       8223.43324360094, 470807206,    0
$$ Real data points
##PAGE= N=1
##DATA TABLE= (X++(R..R)), XYDATA
$$ [...]
19527a43331C7513b34846J09178j85308A63454F7639a33910A29451a89722A52701
19516a8731j87960A54032a26062B61158q8522a59900j03773e2282j0931k87774
19506c50987h2060P378k34177J53683D2796d43643A28479M3163A4317b97913J00268
19495a97645A28105g063k40061d1083j04816F5362b39726e9703A22140a21637
19484h1288l78033P0094a40017p5275A25960a74950d5749A63568n5349c11081
19473A7663O0462P1699a14245m0623G3268B4520c41581B333c36416k04961H9186
19461C0890K6549a14597k44684A51034e6131j35426D33611a18240B26884I1649
19450F0843j0760R2403M8081c43454I4954b99347j6069C49957f4731q9214j8332
$$ y = [-143331, 37513, -234846, -125668, -310976, 163454, 67639, -133910, 129451, -189722, 152701, -18731, -206691, 154032, -126062, 261158, 172636, -159900, -263673, -52282, -63213, -350987, -82060, -74682, -308859, -155176, 42796, -443643, 128479, 171642, 14317, -297913, -197645, 128105, -7063, -247124, -41083, -145899, 65362, -239726, -59703, 122140, -121637, -81288, -459321, -389227, -140017, -215292, 125960, -174950, -45749, 163568, 108219, -311081, 17663, 78125, 149824, -114245, -154868, 73268, 24520, -341581, 2333, -336416, -541377, 89186, 30890, 57439, -114597, -359281, 151034, -56131, -191557, 433611, -118240, 226884, 91649, 60843, 50083, 142486, 190567, -343454, 94954, -299347, -315416, 349957, -64731, -153945, -172277]
19439a72277j09538a4234r4945B4507i071j39293j4705B40925o8471e7024r7896
19428a54920P4334k10743A15756a58375B04334a80826I5464B6076d9285D9028
19417C0566b07778A26780b20437i7852n1602D2751a72255K3771B11575a630o8858
19406g0488k17394b2834r5703I9015J6003k8721J87529A4228J03737a80135M6563
19395a33572H1298a11840B3675b23757K2116h7883g115F2675i8391A5492b72486
19383b0211G9824a39658j2449j1526N6605a3986B38873F0949B755b93127B49387
19371b97614p2142r5276J71752l10116i906m9676j00015G6343D239a06336h759
19359c32368q0237a11589q5888g0369E0722a64199A83353a92398j79771A99326
$$ y = [-172277, -281815, -14234, -109179, 24507, -9071, -148364, -163069, 240925, 172454, -57024, -154920, -80586, -291329, 115756, -158375, 204334, -180826, 95464, 26076, -49285, 49028, 30566, -207778, 126780, -220437, -97852, -149454, 42751, -172255, -148484, 211575, -1630, -70488, -287882, -22834, -118537, 99015, 115018, 86297, 273826, 14228, 117965, -180135, -133572, 81298, -111840, 23675, -223757, -201641, -87883, -7115, 62675, -98391, 15492, -272486, -20211, 79824, -139658, -152107, -163633, -107028, -13986, 238873, 60949, 2755, -293127, 249387, -297614, -369756, -465032, -293280, -603396, -9906, -59582, -159597, 76343, 4239, -106336, -8759, -332368, -412605, -111589, -197477, -70369, 50722, -164199, 183353, -192398, -372169, 199326]
19348b11879H2408b09970k00609a87566A20588c18766c5042j24697N5759j42992
19338b46972C75423d7892o6792G5372J67817e51601a48759i175M404o748o6419
19327g7938k72540a36152e6115H683C340c76966A45805b03239F930b7415I1078
19315B2877f4043j22878A73900A9370J79204J5834a04312A96164a27905D00389
19304c30789J3605a10653E1916b07731R975D154N0078a17145j72800I2281c8006
19292C9667b83383e0091m14598B4533A126J5958c5993k58465a00665L4263A40428
19280c88283A06493b19392j7097a2676A33528b65506r7069C58128A48083N2440
19270B00523E3001i045G6262i9803l19356a64829n1981D9764b0395G9943N2639
$$ y = [-211879, 82408, -209970, -410579, -187566, 120588, -318766, -35042, -159739, -103980, -246972, 375423, -47892, -114684, 75372, 243189, -551601, -148759, -9175, -4771, -11519, -77938, -350478, -136152, -56115, 8683, 3340, -376966, 145805, -203239, 6930, -27415, 91078, 22877, -64043, -186921, 173900, 19370, 198574, 214408, -104312, 196164, -127905, 400389, -330789, -317184, -110653, 51916, -207731, -197756, 4154, 54232, -117145, -289945, 92281, -38006, 39667, -283383, -50091, -464689, 24533, 1126, 17084, -35993, -294458, -100665, -66402, 140428, -388283, 106493, -219392, -236489, -12676, 133528, -265506, -362575, 358128, 148083, 200523, 53001, -9045, 76262, -99803, -419159, -164829, -216810, 49764, -20395, 79943, 132582]
19259A32582b41238f2284p1294H8978h0642k46914A06209c05286L7834A05988
19248H2359e1379G334c85467f3857q13A4173a9895k45460A01345K53992d13294
19236c74461A82889n9103b90480c612I6291m1008P4706n8972a71846P9052B14273
19224b21752J6804A0393a58138A5181b90832N8059A51364b49889l1892o0789D1965
19212a03735J547j69791J3920h0568c2909N899D6551e48680a3479D455a42716
19200g0292C85645C2419N035c08358a04274B19094b45914j20537f561j35335c9512
19188A2808e9780A38593a59537f2516G7344J17380l7393a50727p9902A72782G7403
19176a5735j43606J4052E4642b4450m2051Q695b6295A4492J64811A633a8379F2886
$$ y = [132582, -241238, -62284, -133578, 88978, -80642, -327556, 106209, -305286, -267452, 105988, 82359, -51379, 7334, -385467, -63857, -64670, 14173, -19895, -265355, 101345, 355337, -413294, -374461, 182889, 123786, -290480, -3612, 96291, 55283, 129989, 71017, -171846, -92794, 214273, -221752, -204948, 10393, -158138, 15181, -290832, -232773, 151364, -249889, -281781, -342570, 41965, -103735, -102188, -271979, -258059, -80568, -32909, -27010, 46551, -548680, -13479, 4455, -142716, -70292, 385645, 32419, 37454, -308358, -104274, 219094, -245914, -366451, -6561, -141896, -39512, 12808, -59780, 138593, -159537, -62516, 77344, 194724, 157331, -150727, -230629, 172782, 77403, -15735, -159341, -145289, 54642, -24450, -66501, -57806, -26295, 14492, 179303, 1633, -18379, 62886]
19163C6000a07809E7686a62465E8622c41884a09287m0381K9261A09266K7478b12821
19151c40321B3584a53789I4002C5109a1545G4494c66915J50586G3545a7605A08502
19139b14455Q0431N1118A78048m9816a68607e0053A67252p8004b63731A36600
19128a96263O1650j01414A9527M952e3896k61l7457a5560F6770J73832a93834
19116a84951B69852f5086I9593l5609J7490A0606a5613p0361A51102g8288k2198
19105a00486o0597A15978b79544G6705b74587F221j93L24503a77779O8417C3508
19093B5818d99165a54249k173b7037j71509k76422a50765A47432c0305j38636
19083a68941K8237M6625A10675f4260k20930A07051R040b14449L7744l90995a72499
$$ y = [36000, -107809, 57686, -162465, 58622, -341884, -109287, -149668, -120407, 109266, 136744, -212821, -340321, 23584, -153789, 94002, 35109, -11545, 74494, -366915, -216329, 73545, -17605, 108502, -214455, -134024, -82906, 178048, 128232, -168607, -50053, 167252, 89248, -263731, 136600, -196263, -134613, -236027, 19527, 24479, -53896, -54157, -91614, -15560, 66770, 240602, -193834, -184951, 269852, -65086, 99593, 63984, 81474, 10606, -15613, -85974, 151102, -78288, -100486, -161083, 115978, -279544, 76705, -274587, 6221, 6028, 330531, -177779, -109362, 33508, 25818, -499165, -154249, -156422, -27037, -198546, -474968, -150765, 147432, -30305, -168941, -140704, -94079, 110675, -64260, -285190, 107051, 116091, -214449, -176705, -567700, -172499]
19071i6393E5481l673a04804j68298A39063i4736p4744k6651A61639c0347j57093
19060a87440C1712K7648a17661r7720e4351j44293P4649K1161L4655j65930g4348
19048a2989q0974C9356i7010l24306a56583a7209n0133B0176b83126O7404J03240
19037a12482B621a98030D324a12360E7741b75437A35423l28Q064a67069B49832
19025B49245J49092j12152a27276j10970J627B37106I4228a18508B41126B4669
19014A62427A1158c9363n4593A80026a41211D5034a56318b2459A41700l359L8181
19003A76522b31759a07485j4173C0637K46824a46635k00244A12016Q8735c77978
18992B04579g2j60262A1204R3283c14912F6170J19783e7319I598a05658H9726
$$ y = [-96393, 55481, 51808, -104804, -273102, 139063, -94736, -169480, -196131, 161639, -30347, -187440, 31712, 59360, -117661, -215381, -54351, -198644, -123995, -102834, -68179, -234109, -74348, -12989, -93963, 39356, -97010, -421316, -156583, -17209, -67342, 20176, -283126, -215722, -112482, 2621, -198030, 4324, -112360, 57741, -275437, 135423, 135095, 143159, -167069, 249832, 249245, 398337, 286185, -127276, -238246, -236619, 237106, 94228, -118508, 241126, 24669, 162427, 11158, -39363, -93956, 180026, -141211, 45034, -156318, -22459, 141700, 138341, 176522, -231759, -107485, -121658, 30637, 277461, -146635, -346879, 112016, 200751, -377978, 204579, -72, -160334, 11204, 104487, -314912, 66170, 185953, -57319, 9598, -105658, 89726]
18980F1156J47734B430a18903k70804F8145c17601J39216r4833B49344F636A492
18968a21033i020B73001f1791A5252O7045N896b05575c6458b139A16704c19231
18956c82718a01417j07463E2694b15693A8837D570K6373K50406b5763l5424A69835
18944D298a96680h6120F9816a20084d0985A11657a572j169j32700n4630A38471
18932I0791a0913L153p7594k76836P4768c003k4161A50382l4547F615b30958A57629
18919i5010H236b82189A4774J00104a61741A79083G1090K84823b380k93379A10565
18907F6044b18976d0097B01199i4115A91359a29308A02279A9392h6625C06841
18896h6258J3479o2846j38640A34117N0035b22450E347f7878A32310a79238B54026
$$ y = [61156, 208890, 2430, -118903, -389707, 68145, -317601, -178385, -273218, 249344, 6636, 1492, -121033, -9020, 273001, -61791, 15252, 82297, 88193, -205575, -36458, -2139, 116704, -319231, -382718, -101417, -208880, 52694, -215693, 18837, 4570, 30943, 281349, -25763, -61187, 169835, 4298, -196680, -86120, 69816, -120084, -40985, 111657, -1572, -2741, -135441, -190071, 138471, 90791, -10913, -7760, -85354, -362190, -287422, -3003, -27164, 150382, 115835, 6615, -230958, 157629, -95010, 8236, -282189, 14774, 114878, -161741, 179083, 71090, 355913, -2380, -295759, 110565, 66044, -218976, -40097, 201199, -94115, 191359, -129308, 102279, 19392, -86625, 306841, -86258, -72779, -135625, -274265, 134117, 184152, -222450, 5347, -67878, 132310, -179238, 254026]
18884c22924K6330N6725M0701P2466r357j29767j16470a73771q0964a04589k00625
18873c05214a4770p2422B67737a66299k11613B01481B3346d8213m08417a73628
18862d3954j71974o618A7692J8202J35985C5552J03221D9728g3687k6368a8243
18850a07909i108G2501B8522b87835B63747o3422b69138K371a464l12525B02928
18838A60405P8574A12099a85467E5918f7287B80702d07423J47944C1123a51336
18827b02412A48075a92604l1857l374R2534f6169B4634M621K48253C4201K9321
18816F3522L92876a4836D04123H6829g9666A13139E6129c93814J95887A08295
18805G9472H144a49680n8809A18427n2268b16913D0233Q9584b11999a6772l16706
$$ y = [-322924, -296594, -239869, -199168, -126702, -136059, -265826, -382296, -173771, -254735, -104589, -305214, -14770, -87192, 267737, -166299, -377912, 201481, 23346, -48213, -456630, -173628, -43954, -215928, -222546, 17692, 35894, 171879, 35552, 138773, 49728, -73687, -100055, -18243, -107909, -9108, 72501, 28522, -287835, 263747, 200325, -269138, -266767, -1464, -313989, 202928, 160405, 238979, 112099, -185467, 55918, -67287, 280702, -407423, -259479, 31123, -151336, -202412, 148075, -192604, -224461, -227835, -135301, -66169, 24634, 29255, 277508, 34201, 63522, 456398, -14836, 404123, 86829, -79666, 113139, 56129, -393814, -197927, 108295, 79472, 8144, -149680, -208489, 118427, 66159, -216913, 40233, 129817, -211999, -16772, -333478]
18794c33478B03074G2332O8302a27521k5598M4626B33196I7504c5436A36717c48929
18782A6518h989A09148b01914j15315M7381h9180m1421M0326A86828b62906B60192
18770d22853F8617a16557B6623b93264B06934c2210k40222g5666r9593k93549
18760d68808J8710a34363b5252k96381a27984K8899B8744a56786M4267B43541
18749A18441C0825a10110E6572c06358A90497c1822j82389k72682J23713A60839
18738i428k07353b1551j63670f2235j45072b9496o5722E5965d8632l66032A57853
18726a15771k53006j7092A68672a75041n5805b9820j47983g0489j85555B32754
18715a82180B1435L5038a11485M2848J8211m971r9184D4419c3643p2387B58226
$$ y = [-333478, 203074, 72332, 140634, -127521, -153119, -108493, 233196, 97504, -35436, 136717, -348929, 16518, -8989, 109148, -201914, -317229, -269848, -89180, -130601, -90275, 186828, -262906, 260192, -422853, 68617, -116557, 26623, -293264, 206934, -32210, -272432, -75666, -175259, -468808, -450098, -134363, -25252, -321633, -127984, -99085, 28744, -156786, -112519, 243541, 118441, 30825, -110110, 56572, -306358, 190497, -31822, -214211, -486893, -363180, 160839, -9428, -216781, -21551, -185221, -62235, -207307, -29496, -95218, 55965, -48632, -414664, 157853, -115771, -368777, -385869, 168672, -175041, -230846, -29820, -177803, -70489, -256044, 232754, -182180, 21435, 56473, -111485, -68637, -50426, -55397, -154581, 44419, -33643, -106030, 258226]
18703B80516A8797J7863B091a64875j1362B74700M097B4987a05994A16066Q1611
18692A97677d79534a54328A76053c04538a02224A036a30677D5304a72749F8989
18681A58134b21889H746J83378a83606C8711R1240b41485I2020M3479n2595L48182
18670D31086H794J63309c66875J37440d8407p4854j25973A70420c3823j1133k9865
18659g4821m942k95841h1941F1780a65280g0215j20569a0075j10247M2440p4251
18648a52133P0729m8700N1814n1267b7422l45171e1657A08466d78490d0102A31112
18636A09285J51759A22692j5574b54339e6730k71152J55360b1721j16864j82562
18626c21147K4941R9541Q3026o230o5296D11467b57387b3843E2535J28902a87164
$$ y = [280516, 18797, 36660, 2091, -164875, -176237, 274700, 278797, 24987, -105994, 116066, 197677, -479534, -154328, 176053, -304538, -102224, 1036, -130677, 45304, -172749, 68989, 158134, -221889, 8746, 192124, -183606, 38711, 129951, -241485, 92020, 135499, 82904, 431086, 8794, 172103, -366875, -229435, -48407, -123261, -249234, 170420, -33823, -44956, -74821, -79763, -375604, -81941, 61780, -165280, -70215, -190784, -10075, -120322, -77882, -152133, -81404, -130104, -78290, -129557, -27422, -372593, -51657, 108466, -478490, -40102, 131112, 109285, 261044, 122692, 107118, -254339, -56730, -327882, -172522, -21721, -138585, -321147, -296206, -196665, -113639, -119869, -185165, 411467, -257387, -23843, 52535, 181437, -187164]
18614a11026A7619a96813a6415D58a98402b1908A06583a72804b7284j72665H5585
18602A53707b90213a16714r9733j9258G7431A9745K41149n0815c7677j33563m0193
18591b11433A26582e4136n6726A04501f5356G1789b2362A47734c9310H3426j7642
18580F5784a89651N1824E4515b42115A08319A1533b52116C5536L1803f9661j10972
18569a80633A45328b73693L6978D8604i1017d1491D6755c9714b486m796k36264
18558b43546C0332a95460A98750c60715J29197q5557A32889j5772b74770J35278
18548a39492O4180k92643A07001i8548B71139A12170b82336H3556j8039a5862
18537E5960l922f9175B09325k1460a50575A07180i5750D9358i9000l3645H7436
$$ y = [-111026, 17619, -196813, -16415, 458, -198402, -21908, 106583, -172804, -27284, -199949, 85585, 153707, -290213, -116714, -216447, -235705, 77431, 19745, 260894, 210079, -37677, -171240, -211433, 126582, -54136, -110862, 104501, -65356, 71789, -22362, 147734, -39310, 83426, 65784, -189651, -137827, 54515, -242115, 108319, 11533, -252116, 35536, 67339, -69661, -180633, 145328, -273693, -236715, 48604, -91017, -41491, 46755, -39714, -2486, -7282, -243546, 30332, -195460, 198750, -360715, -231518, -317075, 132889, 117117, -274770, -139492, -75312, -367955, 107001, -98548, 271139, 112170, -282336, 83556, 65517, -15862, 55960, 52038, -69175, 209325, 187865, -150575, 107180, -95750, 49358, -99000, -132645, 87436]
18525h5504p8190g4911k92674h357A45631b70600I337b33607B71836c05560J14072
18514a91488q9683m3320b6881k39891C05731B8096a15384j48797A44109a74399
18503C7351a08001A23838j0493g5658o8694e4616o4526j19022c3635k21759l8158
18492b93552C5051b37149k18009J99207C5054P9133b60087f6530o8909J4671k9425
18481a50193O8025H6512i2248k35803F9302g1997n6635k38677G564i8136A76849
18469b09408K0919N9107A78559j4035E7494a49945B01857a59215j14498k81080
18459e54793a07789A12393C5734h4226E8314e0324A05690Q0238R1242A31381f5916
18447G3714c1458A29866n7635J03313Q0205r2437D377b98215B23688f8545A29488
$$ y = [-85504, -163694, -74911, -367585, -8357, 145631, -270600, 9337, -233607, 271836, -305560, -191488, -281171, -324491, -26881, -266772, 305731, 28096, -115384, -264181, 144109, -174399, 37351, -108001, 123838, 113345, -75658, -144352, -54616, -119142, -238164, -33635, -255394, -293552, 35051, -237149, -455158, -255951, 35054, 114187, -260087, -66530, -135439, -120768, -150193, -82168, 86512, -92248, -328051, 69302, -71997, -128632, -367309, 7564, -98136, 176849, -209408, -188489, -129382, 178559, 164524, 57494, -149945, 201857, -159215, -273713, -554793, -107789, 112393, 35734, -84226, 58314, -50324, 105690, 185928, 277170, 131381, -65916, 73714, -31458, 129866, 72231, 175544, 255749, 163312, 4377, -298215, 223688, -68545, 129488]
18435b26166f2064j55148K9921j77995g4735b0434j10353B91746a94978k29999
18425d24977a63247j26467J00170o1344D9528g8464B37282d7856j01519P2031
18415g7344l1339e2435m8771l89029I9572a28474A55171Q734J52828a26061j09181
18404b35242B28665a05613k70634A77204a65867d7397B05980b21263h5311A66116
18393D2667L95846G4220c88955A38120D1172b23864B36080B3766J56645a33942
18382C97157F3548a77702Q4490j28222D8166d44261C7918g2568B01091m268E465
18370F3564c0271n04401A99993b26001J03382C71528a07807D5484A6623c85535
18359b71121b8110E3861a38781k9804g9511k991A78975C6154a31899j68583C9337
$$ y = [-226166, -62064, -217212, -187291, -365286, -74735, -20434, -130787, 291746, -194978, -424977, -163247, -289714, -189544, -250888, 49528, -78464, 237282, -47856, -149375, -77344, -108683, -52435, -101206, -490235, 99572, -128474, 155171, 163905, 316733, -126061, -235242, 228665, -105613, -376247, 177204, -165867, -47397, 205980, -221263, -85311, 166116, 42667, 438513, 74220, -388955, 138120, 41172, -223864, 236080, 23766, 180411, -133942, 397157, 63548, -177702, -93212, -221434, 48166, -444261, 37918, -72568, 201091, 196823, 5465, 63564, -30271, -534672, 199993, -226001, -122619, 371528, -107807, 45484, 16623, -385535, -271121, -28110, 53861, -138781, -168585, -79511, -82502, 178975, 36154, -131899, -300482, 39337]
18347A93520C2689j1440a3389q1721j83280C38378D2012b07321b5811j42902A11453
18335a79373l1265p8164i1347m3249e3383j13928e5176F5393a7576l42443i701
18323A90656a63853A96180a75802d2220C9929J08685J33400i5053j98158B08177
18312a17828A41067a23476j40984E0431b39573H0051i167A14895b17994P5214
18302a42780j01011f2103k04592J04030O3913K6253k96162J70351b287n5253B21612
18290a75192G3199g8460K2632k85850A81334c13214f9660p4153B74972a01993
18279c1727A14849a21968N3128k7059A63120D7713b17538C74813B7438b07527
18268d8396A70976C9229c37816a0218l63201b065C78821a89226l7256e3454A44093
$$ y = [193520, 32689, 21249, -13389, -95110, -278390, 338378, 42012, -207321, -25811, -168713, 111453, -179373, -210638, -288802, -91347, -134596, -53383, -167311, -55176, 65393, -17576, -360019, -9701, 190656, -163853, 196180, -175802, -42220, 39929, 148614, 282014, -95053, -293211, 208177, -117828, 141067, -123476, -264460, 50431, -239573, 80051, -9167, 114895, -217994, -142780, -243791, -62103, -266695, -162665, -98752, -72499, -368661, -198310, -2287, -57540, 221612, -175192, 73199, -78460, -55828, -341678, 181334, -313214, -69660, -143813, 274972, -101993, -31727, 114849, -121968, -68840, -95899, 163120, 47713, -217538, 374813, 27438, -207527, -48396, 170976, 39229, -337816, -10218, -373419, -2065, 378821, -189226, -226482, -53454, 144093]
18256D4954d6229j4955r6339a4848G2361B809R481d45577B97373b58493d392l83162
18244c87554A47487J74091G850Q2546a65280F6814c86524B27936a35230C6387
18233a84155f1398A11851P6560H2749B9469J22945c5686B30132b30584p7240I1750
18221I5917a70746f5940B60900A21063C4237J39432g2577G1254a96494L7984O9070
18210h9440j74109d6884A13268L6395i7030k85377E47011e1345H6576h4607o4205
18199a48812D58J70365B3077K63050b15118k06348e7548j87393C99426A16496
18188C7241L8575d5846A29707o4329a33288G6347a84986A11780i239F6329a35642
18176A35799C065a99538i8256D671J59157g4052j66142B64541b35051B94295c3201
$$ y = [44954, -46229, -61184, -157523, -14848, 72361, 2809, 12290, -445577, 297373, -258493, -4392, -387554, 147487, 321578, 7850, 90396, -165280, 66814, -386524, 227936, -135230, 36387, -184155, -61398, 111851, 188411, 82749, 29469, 152414, -35686, 230132, -230584, -307824, 91750, 95917, -170746, -65940, 260900, 121063, 34237, 173669, -72577, 71254, -196494, -158510, -89440, -263549, -46884, 113268, 149663, -97030, -382407, 547011, -51345, 86576, -84607, -148812, 458, 170823, 23077, 286127, -215118, -421466, -57548, -244941, 399426, 116496, 37241, 75816, -45846, 129707, 65378, -133288, 76347, -184986, 111780, -9239, 66329, -135642, 135799, 3065, -199538, -98256, 4671, 163828, -74052, -240194, 264541, -235051, 294295, -33201]
18164A68415F2578a3927j14996j94785A7274b80905e8241k4215C12398j6702c0599
18152B7079c05780Q3257A1089d5539p5682A25118B0959E584f1814l05967B79d23696
18139C6165c2007j05438n0848B85979a98571j83423b8702G5658f8363K0881A22770
18127h7143H2222f9561l07117g6655H1453J76420c63268h5205p8105B7507I46
18115b31490O2660k63565a71413K6212l4350d0485A75813a29966c6828r100l04361
18104c50289A1308a1912A99922a49590R67e2169K090i6l80154D08399A66297a08681
18091B1334a47107K7111n5519B9032J89740b48572Q3468f60k66181M5374A5338
18079e9744r7248D14114c60052D9915A4039K46284a33334r6516g4863A5088b11607
$$ y = [168415, 62578, -13927, -128923, -323708, 17274, -280905, -58241, -82456, 312398, 295696, -30599, 27079, -305780, -222523, 11089, -45539, -121221, 125118, 20959, 5584, -61814, -367781, 279, -423696, 36165, -32007, -137445, -188293, 285979, -198571, -381994, -28702, 75658, -68363, -47482, 122770, -87143, 82222, -69561, -376678, -76655, 81453, 257873, -363268, -85205, -163310, 27507, 946, -231490, -168830, -432395, -171413, -145201, -179551, -40485, 175813, -129966, -36828, -45928, -350289, 11308, -11912, 199922, -149590, -148623, -52169, -50079, -96, -380250, 408399, 166297, -108681, 21334, -147107, -119996, -175515, 29032, 218772, -248572, -165104, -660, -266841, -221467, 15338, -59744, -156992, 414114, -360052, 49915, 14039, 260323, -133334, -229850, -74863, 15088, -211607]
18067D0196b64469c7793C67329b40516D24754b24432j19581m7473J35483N42k59253
18056e14714A07591b73309a1248k704o6866C3855c16074l0060e4932l48079A79379
18044c6924A99035b30528F795b07411q6389B66644k2814a7554H7421a66585N8014
18033a08571E1972m875J21062F871b65667j1972J30421j7969d5569C454d9268
18021B81959a37439E6442J53445b12496A89893p6319f7756k34875E3417e63137
18010g7016e777k51818C03665a45180c3323n7700j37307C3570a07120B66713a69376
17998A53986K98876a61997k55754J68968A72822J75897a40822k13671F5798a84217
17987c890C8643a0894j08488K0161d6226C01854J41621D3049O5221B5606K56885
$$ y = [40196, -264469, -37793, 367329, -240516, 424754, -224432, -344013, -391486, -256003, -255461, -514714, 107591, -273309, -11248, -13952, -80818, 33855, -316074, -346134, -54932, -403011, 179379, -36924, 199035, -230528, 6795, -207411, -293800, 266644, 243830, -17554, 87421, -166585, -108571, 51972, 47097, 168159, 6871, -265667, -277639, -147218, -165187, -45569, 3454, -49268, 281959, -137439, 56442, 209887, -212496, 189893, 113574, -67756, -302631, 53417, -563137, -77016, -5777, -257595, 303665, -145180, -33323, -91023, -228330, 33570, -107120, 266713, -169376, 153986, 452862, -161997, -417751, -248783, 172822, 348719, -140822, -354493, 65798, -184217, -3890, 38643, -10894, -119382, -99221, -46226, 301854, 443475, 43049, 108270, 25606, 282491]
17976B82491b55106F9745j1699K8276J23841c065k6412l5554B4172m652J21218
17965A40738a2889B5445Q5315k7855J23173b69550C23769C3618c2384k22853E8418
17953H3790a28461A02910d2544k05074O8518a1048j76069Q7828m4504A45114J74706
17942C19820j09805o7592D2504f9294G0400a60229A26274B3353a38501I5656a94460
17930F0109a35809b9557k89421A9120J79369B4549L4142c582A634R4048b49723
17918B28258b17304P7511k17478h7204c881q5004J3842A13847C6762P0327f8453
17906a9230r368B40832a77095b9285D17263h9844m8952B29161n6796R5870d9528
17894a98705P3216j40232A12507a23153l7066n9329M3697k04534a02192H1372
$$ y = [282491, -255106, 69745, 58046, 86322, 210163, -3065, -29477, -65031, 24172, 19520, 140738, -12889, 25445, 110760, 82905, 206078, -269550, 323769, 33618, -32384, -255237, 58418, 83790, -128461, 102910, -42544, -247618, -179100, -11048, -187117, -99289, -143793, 145114, 319820, 210015, 142423, 42504, -69294, 70400, -160229, 126274, 23353, -138501, 95656, -194460, 60109, -135809, -29557, -318978, 19120, 198489, 24549, 58691, -3582, 1634, 95682, -249723, 228258, -217304, -139793, -357271, -87204, -3881, -88885, -75043, 113847, 36762, 107089, -68453, -19230, -28598, 240832, -177095, -29285, 417263, -89844, -138796, 229161, 172365, 268235, -49528, -198705, -125489, -265721, 112507, -123153, -160219, -219548, -175851, -380385, -102192, 81372]
17883b27534B93934F7868C0127K36393J30981b57814B26049H0541a02823m56503
17873e59326B76575a04353k8443F0923b81398B28044A0157K33191n3334l9929
17863A50085c24901C30329a30095A00107c35181a6286p5852A15976a30158q1337
17853b11495A60663E7870O6110J14755d8116C75982F6748c67032j13017c6380
17842c3839j46963G6006P7336k8983a14968j36257a15325k2339d3110A00363b01198
17830A78459g3733m9468c522l21163F7571c00437C06055j52783J37329c36784
17819C9834b0108A51105e0430q6874c6757q1171q9879I0562Q6321E5113a94021
17807e0564A54515m3226a64664F8622K1796r517b24756D1007g9090B4089b12815
$$ y = [-227534, 293934, 67868, 30127, 266520, 397501, -257814, 226049, 80541, -102823, -559326, 276575, -104353, -132796, 60923, -281398, 228044, 10157, 243348, 190014, 150085, -324901, 330329, -130095, 100107, -335181, -16286, -92138, 115976, -130158, -211495, 160663, 57870, 123980, 238735, -48116, 375982, 66748, -367032, -480049, -36380, -33839, -180802, 76006, 153342, 124359, -114968, -251225, -115325, -137664, -43110, 100363, -201198, 178459, -73733, -123201, -3522, -324685, 67571, -300437, 306055, 153272, 290601, -336784, 39834, -20108, 151105, -50430, -137304, -36757, -117928, -207807, 90562, 176883, 55113, -194021, -50564, 154515, 111289, -164664, 68622, 90418, 80901, -224756, 41007, -79090, 24089, -212815]
17795b75655Q4336D86330H0186a54294B9904K80774a55968j88553C40987a62683
17784c00636I1522a95934p5793J08325E2270K90026j26327a27653f340A75542
17773a13800A4821i0562A08020J76115C8598i8420B39676C2670A5382K2918J80809
17762B19109b8840j2428D6346K53335b78498G245a96392h5558j44499a9676A35661
17750a96738B2059a50317c6414j43200l3182a79C5405d57648a54787M5776d2194
17738H3606P6151D3185a26406B67976b58746f6358l57545a52049A09363a51410
17727B32121G9608a48642A25140J48579A27291d4695B84420a81604E7590m915
17717E2675B3554O6017J84476F6497K730C1155b27278B04967i9366k07377C3160
$$ y = [-275655, -191319, 486330, 80186, -154294, 29904, 310678, -155968, -344521, 340987, -162683, -300636, 91522, -195934, -271727, -163402, 52270, 342296, 215969, -127653, -6340, 175542, -113800, 14821, -90562, 108020, 284135, 38598, -98420, 239676, 32670, 15382, 38300, 219109, -28840, -41268, 46346, 299681, -278498, 7245, -196392, -85558, -230057, -19676, 135661, -196738, 22059, -150317, -36414, -179614, -212796, -179, 35405, -457648, -154787, -109011, -42194, 83606, 159757, 43185, -126406, 267976, -258746, -66358, -423903, -152049, 109363, -151410, 232121, 79608, -148642, 125140, 273719, 127291, -44695, 284420, -181604, 57590, 52675, 23554, 89571, 274047, 66497, 69227, 31155, -227278, 204967, -99366, -306743, 33160]
17705f56736a65279E9441d2031j59741A76518h6297A5597L6688A2449j816L67891
17694C78524A7114b7936A35775j7020b36078E1637R0431E4562M00949a87704o5479
17683b53183d3176j41102G2361a91761B2207O8858M12514C2272K45617J32554
17673D10443b8512j17671c7785j28066H452K34242A6943K93887B9387K18228o6998
17662A80617M7251m7281q9330l7302K1510J24230b8993A56127d9556F4791a88474
17650d4936J7698L299o7178G4596J62465E4289i1878A6490J00051h5348A7978
17638B96826e0103A8206d21251B46393I2268M7959c79747D10316a81140j28161
17628c09301M4622A31845n9516b61452A43675o5613a32194A74110n926b26184
$$ y = [-656736, -165279, 59441, -42031, -201772, 176518, -86297, 15597, 52285, 12449, 10633, 378524, 17114, -27936, 135775, 118755, -236078, 51637, 142068, 54562, 455511, -187704, -253183, -43176, -184278, 72361, -191761, 22207, 91065, 503579, 32272, 277889, 410443, -28512, -146183, -37785, -165851, 8452, 242694, 16943, 310830, 29387, 247615, 180617, 227868, 180587, 91257, 53955, 75465, 199695, -28993, 156127, -49556, 64791, -188474, -44936, -27238, -23939, -91117, 74596, 237061, 54289, -91878, 16490, 116541, -85348, 17978, 296826, -50103, 18206, -421251, 246393, 92268, 140227, -379747, 410316, -181140, -309301, -264679, 131845, 72329, -261452, 143675, 78062, -132194, 174110, 168184, -226184]
17617A51647a31715B12981a33859K5143B30447b12503A24763R8403j6505l310
17607B03351J69096G6226b94040A614R3373K68938C3152b30585B4625P5608h6172
17595C39414G9997K98439D825c3952I6957a88784l6121L8556e5729A57309b10054
17583I1475K47542j5251E2010a86847A18366d3345E9723a81064A65690d89520
17572a52682r6004C551M8087L79816a74609D04605a2250j82099A61537F9743J55884
17561B25627c45251B17724K17521i4858l4740A50632B662K08999l2877i3344C2118
17549B06931a83015O7497j87973C66931A55907k2441N5557o5301L6167i8914F3666
17537A71636m2057I701d7542A27897A8164J6853K11022A01197a28830L8416A01284
$$ y = [151647, -131715, 212981, -133859, -108716, 230447, -212503, 124763, 223166, 206661, 203351, 372447, 76226, -294040, 1614, 94987, 363925, 33152, -230585, 24625, 100233, -86172, 339414, 79997, 378436, 4825, -33952, 96957, -188784, -224905, -186349, -55729, 157309, -210054, 91475, 339017, 323766, 52010, -186847, 118366, -43345, 59723, -181064, 165690, -489520, -152682, -248686, 3551, 51638, 431454, -174609, 404605, -12250, -194349, 161537, 69743, 225627, -345251, 217724, 435245, -94858, -129598, 150632, 2662, 211661, 178784, -93344, 32118, 206931, -183015, -115518, -303491, 366931, 155907, 133466, 189023, 123722, 159889, -98914, 63666, 171636, 129579, 9701, -47542, 127897, 18164, 35017, 246039, 101197, -128830, -90414, 101284]
17525B35080p0178e9109a6053A53408p0420k0867L50077B6498L93547a55160E2548
17513C1258a0427D3916a37975A33193L84334d831j3365B05039D5843R284K61832
17502C16959A43534i5347C07200J36498A82626m0727j7409c6077B31066J54671
17492C85737A35707N310A5156L0582J66684d8180B916b01036A79750a22823C7152
17480A37999n0400K5563L10108A2025K44937a77258B10488B8888e0034H540J63242
17469A71782F0115b27041i3040B84978A19541b58381E2837Q9372J09109j09938
17459A41380P3311a16793D06237O599A01524B5720J13813a93692B02590L29959
17449E32549A14838a8747D83505B17466b1527C37083a3987B43927L5408J28370
$$ y = [235080, 164902, -59109, -16053, 153408, 82988, 62121, 412198, 26498, 420045, -155160, 52548, 31258, -10427, 43916, -137975, 133193, 517527, -4831, -18196, 205039, 45843, 55127, 316959, 143534, -95347, 307200, 443698, 182626, 141899, 124490, -36077, 231066, 385737, 135707, 141017, 15156, 45738, 212422, -48180, 2916, -201036, 179750, -122823, 37152, 137999, 87599, 113162, 423270, 12025, 256962, -177258, 210488, 28888, -50034, 8540, 171782, 60115, -227041, -93040, 284978, 119541, -258381, 52837, 142209, 251318, 141380, 214691, -116793, 406237, 412836, 101524, 25720, 139533, -193692, 202590, 532549, 114838, -18747, 483505, 217466, -21527, 337083, -13987, 243927, 279335, 407705]
17439D07705D2221K93437A3426L82497M5878G256L86775E5379J90869J35571b51066
17427F286J37807N01311k30276j30387k6269J92410j23443j16705H2735K35513
17417C18248H8934J04184L38994m6970m9475J04117A19044L33119g9240B40894
17406A28836b3628B05368E2670K99045A63391J11839o9351c6982B31881a07628
17395B04934f2434m4510B25254j12213b83120C62216j04425J45476p9535q8900
17385B34832q520p1841F5976m772a19336C48048j37466a9399k96691B58261o7509
17374A90752l4047J08688I9633K08075J14752H6118K72158j66975J24338R9822
17364D15461j87683E1241K9513f7670p8470D5537J07908K4124H8692Q2511m3994
$$ y = [407705, 42221, 335658, 13426, 395923, 441801, 7256, 394031, 55379, 246248, 381819, -251066, 6286, 144093, 645404, 415128, 284741, 258472, 450882, 327439, 210734, 82735, 318248, 88934, 193118, 532112, 485142, 435667, 539784, 119044, 452163, -79240, 240894, 128836, -23628, 205368, 52670, 351715, 163391, 275230, 205879, -36982, 231881, -107628, 204934, -62434, -106944, 225254, 113041, -283120, 362216, 257791, 403267, 323732, 234832, 226312, 154471, 65976, 61204, -119336, 348048, 210582, -19399, -316090, 258261, 190752, 156705, 265393, 99633, 307708, 422460, 86118, 358276, 191301, 315639, 415461, 227778, 51241, 80754, -67670, -146140, 45537, 153445, 177569, 88692, 171203, 127209]
17353A27209N6448K13472A20723B1463a904A27072E4369P1438a20564B45132J59542
17342D04674A66085J56685r053F6870f2070C14655K443H9095n658N8324J21510
17331B63271J43611j45075m9088b26954D10530A93035l7079C8877J34181C9716
17320C11252a0750H1036L28230A61548C477L00526o6553D5311i0421o7946K9949
17309a28418D3685J50840M9446p0077Q0450N7262C2009N6939O1815Q1261O8879
17298C00903A14152J38710N6090j4938e9755G0141J62081b62737C18184A35343
17287b2670m6884j972n5562I0609J37900I3911J81933j195K02593A38911K1136
17276A60047M5953J1974I5777K12554o4343Q2469o313A52969B5305J78488O8902
$$ y = [127209, 183657, 397129, 120723, 21463, -1904, 127072, 54369, 125807, -120564, 245132, 404674, 166085, 322770, 313717, 66870, -62070, 314655, 317098, 89095, 83437, 141761, 263271, 406882, 261807, 212719, -226954, 410530, 193035, 155956, 38877, 173058, 39716, 311252, -10750, 81036, 409266, 161548, 3477, 304003, 237450, 45311, -90421, -158367, -128418, 43685, 194525, 243971, 173894, 254344, 311606, 32009, 88948, 150763, 232024, 300903, 114152, 252862, 308952, 294014, -59755, 70141, 232222, -262737, 318184, 135343, -22670, -69554, -71526, -127088, 90609, 228509, 93911, 275844, 274649, 477242, 138911, 160047, 206000, 217974, 95777, 308331, 243988, 326457, 320144, 152969, 25305, 203793, 272695]
17265B72695e8806e489B85912A6533a7542B2363a24222I6842l3274L85862j63960
17254B85470M19397G0646K29987j16988G6456a02694B27379d6883A04640P7804
17244A82444f3677A02639K12840J20289j30737O0427j02653J28517j65843q8864
17234A36615O2907m7232b6967n3221A32587J57510j14389P6910Q3696o2500G8343
17222B01277J78654Q8406B13862J02027j03948G1107N1148J09652h9595B96261
17211A86735M2915j6584a3384C79520A39550l1027C4534P0893J62785Q0743n9277
17200B89678J98248A79689J73661A53991K28515j66679l8212O17111B43904j20033
17190A23871J74615Q0970j80925Q819j01347J82541b2618B80151K28151B29760
$$ y = [272695, -58806, -5489, 285912, 16533, -17542, 22363, -124222, 96842, 63568, 449430, 285470, 704867, 70646, 300633, 183645, 76456, -102694, 227379, -46883, 104640, 182444, -63677, 102639, 315479, 435768, 305031, 365458, 262805, 391322, 225479, 136615, 199522, 152290, -26967, -80188, 132587, 290097, 175708, 252618, 336314, 273814, 78343, 201277, 379931, 468337, 213862, 315889, 211941, 71107, 122255, 231907, -89595, 296261, 186735, 229650, 213066, -13384, 379520, 139550, 108523, 34534, 105427, 268212, 348955, 289678, 487926, 179689, 353350, 153991, 382506, 215827, 177615, 794726, 243904, 123871, 298486, 379456, 198531, 207350, 106003, 288544, -22618, 280151, 508302, 229760]
17179b0736E98855B79953Q1988A78111K00346L7835G9384B7666M96943E5842O30695
17168F86537A84997M40932A39186K30351L11200A31726K4984L33262B20362M46344
17158F66706j89304j86812A16810K36108j38309O7627M0140A35266K33112M534
17148C72912j67003K5792K94596f4661C42605J56617j74100J29305L9317o3327
17138D30417K5244j38049j9149M38595A69378J33415N2058J8330H7392O46147
17128G33539C01296o444J3883K24722o6925A36772L73305q4961J56358J5871L8690
17117F36035j06866j59332N6006A70538L64605M2967j24280k08795Q693J90572
17107D44300k4496j76448K73718A23206J07984M82742k28339J72364k05455J17841
$$ y = [-20736, 598855, 279953, 361941, 178111, 378457, 416292, 79384, 27666, 524609, 55842, 686537, 184997, 625929, 139186, 369537, 680737, 131726, 156710, 489972, 220362, 666706, 477402, 290590, 116810, 352918, 214609, 282236, 322376, 135266, 368378, 372912, 205909, 231701, 526297, -64661, 342605, 499222, 325122, 454427, 493744, 430417, 455661, 317612, 298463, 737058, 169378, 302793, 354851, 373181, 87392, 733539, 301296, 294852, 308735, 533457, 466532, 136772, 510077, 425116, 581474, 597345, 636035, 529169, 369837, 425843, 170538, 535143, 578110, 453830, 245035, 253728, 444300, 419804, 243356, 517074, 123206, 231190, 713932, 485593, 657957, 452502, 570343]
17097E70343j75151j52103L00891o5023j23395L90043A86926L24617j68895M42147
17087G84795l27740m3976J97592k43184L50053k61470n462L42746j57423k42775
17077C93156l085l6917K84599q1972J19952j44225j41776K65758q2334M2813B01713
17065D61786m4230Q674R6716k02712N29454j42894C14947L17653J58995M9203
17055H40798C96957Q2452N1582k00321L94951j79794l9719r47m797j9838j12188
17044C68338K69812k10188J94896l3351Q5950k14883K76661k45453l626Q6964
17034E75120K65362J34852k38293k50834L55434n1371k01247K15848J7352L8997
17024H61220l33749M94940j49752K06005O3338l52689j64224J46198n5654j5197
$$ y = [570343, 395192, 243089, 543980, 478957, 355562, 745605, 186926, 511543, 342648, 784795, 457055, 413079, 610671, 367487, 717540, 456070, 450608, 793354, 635931, 393156, 390071, 353154, 637753, 555781, 675733, 531508, 389732, 655490, 573156, 615969, 201713, 461786, 417556, 426230, 522946, 320234, 849688, 706794, 314947, 632600, 791595, 840798, 396957, 479409, 530991, 330670, 725621, 545827, 506108, 505161, 500364, 480526, 368338, 638150, 427962, 622858, 589507, 675457, 460574, 737235, 491782, 488156, 575120, 840482, 975334, 737041, 486207, 841641, 790270, 589023, 804871, 822223, 861220, 527471, 1022411, 872659, 1078664, 1142002, 789313, 625089, 771287, 715633, 700436]
17014G00436J58496K02602l66981k5648j40360K40367R5512j08865J17001l81972
17004D90588M42891n254D31765O88631n20872M15K56932J3106o4632K26377k19407
16993H12315R3687K43251n1092l01699K74104M0164j1441J4842j15071J4212j35248
16982H78024l5785Q9903K43975l14945N7194l0277J08583m7968M36590k39427
16972A145867l33553L82786J986l87636L61400n8528m1776K40803k10950J75756
16962A276155n19009M88369J64309j72273k87721J24927r5517K17039K21527l4794
16952A383012n7428j21501r3711O9387J37717k58791M11293j44612k79743M56194
16942A501817k60873J05440L58505m77807J55830O165j41575L02039l26010J48258
$$ y = [700436, 858932, 1061534, 694553, 668905, 528545, 768912, 864424, 755559, 872560, 490588, 933479, 928225, 431765, 1120396, 599524, 599939, 856871, 869977, 805345, 1031722, 812315, 906002, 1149253, 1098161, 796462, 1070566, 1110730, 1099289, 1114131, 999060, 1013272, 878024, 842239, 932142, 1176117, 861172, 918366, 888089, 996672, 948704, 1385294, 1145867, 812314, 1195100, 1197086, 809450, 1170850, 1112322, 1070546, 1311349, 1100399, 1276155, 757146, 1245515, 1409824, 1237551, 949830, 1074757, 979240, 1196279, 1417806, 1383012, 1325584, 1204083, 1110372, 1179759, 1317476, 1058685, 1469978, 1325366, 1045623, 1501817, 1240944, 1346384, 1704889, 1227082, 1382912, 1389077, 1247502, 1549541, 1223531, 1371789]
16932A371789l0672j23153L72382l12278J54441m2527L61225m03303J57915K87542
16922A793361M8928k97100k9801K20711j23889k0213L92816j77639l44147N81743
16912B044770k17340k01927L42960k2067k79323K06915O8163P082L40559l10360
16902A979432k5366J60327j65154J99066k8703o0541o6949R401Q0739L46426n1886
16891B376792l57207l1946M34547l02279J69703k42522J79377J81817j27139M99696
16881B780839k49518j31025J58524J57671r9127N3000J9776k38337J32932J75467
16871B760202j97254K83895J77148m14077L59223N1736l97410M68145k53388J36591
16861B974811J49440K01682L17846j30177k04357m94416N22983K3484K63216k24235
$$ y = [1371789, 1341117, 1217964, 1590346, 1278068, 1432509, 1389982, 1751207, 1347904, 1505819, 1793361, 1842289, 1545189, 1515388, 1736099, 1612210, 1591997, 1984813, 1807174, 1463027, 2044770, 1827430, 1625503, 1968463, 1946396, 1667073, 1873988, 1942151, 1949233, 2289792, 1979432, 1954066, 2114393, 1949239, 2148305, 2119602, 2059061, 1992112, 2001513, 2082252, 2428678, 2376792, 2019585, 1987639, 2422186, 2119907, 2289610, 2047088, 2226465, 2408282, 2281143, 2780839, 2531321, 2400296, 2558820, 2716491, 2617364, 2670364, 2690140, 2451803, 2584735, 2760202, 2562948, 2846843, 3023991, 2609914, 2969137, 3020873, 2623463, 3091608, 2838220, 2974811, 3124251, 3325933, 3643779, 3513602, 3309245, 2814829, 3337812, 3361296, 3624512, 3400277]
16851C400277L55534P2529j32252j59783O9042K50746j66228L00391K32401m31814
16841C790843J53169K68637J3608K72886m61202L85414Q3003M37995l55571J98506
16831D787288j57139K18759L68611r9530K09462k54292J82539M1789N07120m28158
16821E376449L20719p9155J92478K33662N0968K93790q0520k135N88693q6293
16811F808656n4464L45594K59017j51126M78651P130J33395R6551J6883K38768
16801H179055J83917L33275j717N4939O23929k96091L54563K70749N99149m5372
16791A0256396J23736M46968K97573K62121K51619L14069J56727M47733K73772
16782A2830714K53628M98133Q16139k11973N49882L97182N67927K24252M17741
$$ y = [3400277, 3755811, 3828340, 3696088, 3536305, 3605347, 3856093, 3689865, 3990256, 4222657, 3790843, 3944012, 4212649, 4226257, 4499143, 4037941, 4423355, 4506358, 4944353, 4588782, 4787288, 4630149, 4848908, 5217519, 5117989, 5327451, 5073159, 5255698, 5297487, 5804607, 5376449, 5697168, 5618013, 5810491, 6044153, 6095121, 6388911, 6308391, 6306256, 6894949, 6808656, 6754192, 7099786, 7358803, 7207677, 7686328, 7693458, 7826853, 7923404, 7940287, 8179055, 8362972, 8696247, 8694530, 8749469, 9373398, 9077307, 9431870, 9702619, 10301768, 10256396, 10380132, 10827100, 11124673, 11386794, 11638413, 11952482, 12109209, 12556942, 12830714, 13084342, 13582475, 14398614, 14186641, 14736523, 15133705, 15701632, 15925884, 16343625]
16773A6343625Q59202L03429Q62869J29585N29190Q61363P75319K63811R74425
16764B1902818J005021O48009Q40238Q57801P14282J176646R67720J154922J381648
16755C0649105J188491J372214J474587J507731J384180J472804K026140J842660
16747D2917912J908695K413003K150821K131340L042405K783646L006877K938008
16739F3292707L691073L738172L775633M245967M510405M561250N601656N452647
16731I8869510N635355O298240O578879O841058O766800P272944P594319P372426
16723A53229531P733765P659077O446662O356117N574458M543035L416844K408526
16715A97368015Q46478m54516k064657l117360m297346n790338n842630p209389
$$ y = [16343625, 17202827, 17506256, 18369125, 18498710, 19027900, 19889263, 20664582, 20928393, 21902818, 22907839, 23555848, 24396086, 25253887, 25968169, 27144815, 28112535, 29267457, 30649105, 31837596, 33209810, 34684397, 36192128, 37576308, 39049112, 41075252, 42917912, 44826607, 47239610, 49390431, 51521771, 54564176, 57347822, 60354699, 63292707, 66983780, 70721952, 74497585, 78743552, 83253957, 87815207, 93416863, 98869510, 104504865, 110803105, 117381984, 124223042, 130989842, 138262786, 145857105, 153229531, 160963296, 168622373, 175069035, 181425152, 186999610, 191542645, 194959489, 197368015, 198214493, 197759977, 195695320, 192577960, 188280614, 182490276, 176647646, 169438257]
16707A69438257p320675p594126p697254q032988p686277p095948p876593o568447
16699A09565949o493853o524715n565333n458466n117962m716080m855697m283427
16691F6550416l742597l604900k934277l262859l367753k336808k621549k346855
16683D2332818k024995j800987j842346j756244j693718j678167j214692j533457
16675B8788212j168474j309136r59398j123849m77669j433419r91780r16956n29125
16666A9878406q70749m32054q90255o16887q65092k63270p24294m38649o13539
16657A4163617o2339r19936k80793m96626l08717n10928o1572l32728m17864l97967
16647A0374147j16257l07353n79785j82256J58031r80945K69916j30452o80774
$$ y = [169438257, 162117582, 154523456, 146826202, 138793214, 131106937, 124010989, 116134396, 109565949, 103072096, 96547381, 90982048, 85523582, 80405620, 75689540, 70833843, 66550416, 62807819, 59202919, 56268642, 53005783, 49638030, 47301222, 44679673, 42332818, 40307823, 38506836, 36664490, 34908246, 33214528, 31536361, 30321669, 28788212, 27619738, 26310602, 25351204, 24227355, 23749686, 22316267, 21324487, 20407531, 19878406, 19007657, 18575603, 17685348, 17068461, 16203369, 15940099, 15215805, 14777156, 14163617, 14101278, 13181342, 12900549, 12403923, 12095206, 11584278, 11522706, 11189978, 10772114, 10374147, 10257890, 9950537, 9370752, 9188496, 9346527, 8365582, 8635498, 8505046, 7824272]
16638G824272R2389l00515j91107k32910k29961p3802j13141l94114L00856n22852
16628F159115R488l23425M535j08908k53709k41J7295l82752R3897n2880l78096
16617D784319j4188j48264L26991l09833k20191K8155k0264j82855q2907j6102
16607D144861n5468k72789j36188k88054N28289j79532l13400K04877k12807j7593
16597C402196L85989n40005R4110J2719k78515j49351m8960K72492m27056K90913
16587C014532k50122J22495k54569p2684K31112K09650o5548m75607k28660Q7081
16577B317680k0059o0625P3815L0568j07108O7272L8408k26164j59066j30985
16567A823736O8701J12099K25777m29994L92214l21684J77406o76347M10667K34647
$$ y = [7824272, 7916661, 7616146, 7425039, 7192129, 6962168, 6888366, 6775225, 6381111, 6681967, 6159115, 6168603, 5845178, 5849713, 5740805, 5487096, 5486855, 5504150, 5121398, 5215295, 5162415, 4784319, 4770131, 4621867, 4948858, 4639025, 4418834, 4446989, 4426725, 4243870, 4160963, 4144861, 4089393, 3816604, 3680416, 3392362, 3920651, 3741119, 3427719, 3632596, 3419789, 3402196, 3788185, 3248180, 3342290, 3355009, 3076494, 2927143, 2878183, 3150675, 2723619, 3014532, 2764410, 2886905, 2632336, 2559652, 2790764, 3000414, 2934866, 2459259, 2230599, 2317680, 2297621, 2236996, 2310811, 2341379, 2234271, 2301543, 2339951, 2113787, 1954721, 1823736, 1892437, 2004536, 2230313, 1800319, 2192533, 1870849, 2048255, 1371908, 1782575, 2017222]
16557B017222p1731j11986J16254k49514j25492J95306J66546j05115j58467O7259
16547A740282j96198j2304L93895l25198J82864k97830j15832O5697L5395K4609
16537A495380j59853J98401m73286J14225P8200L29415j53169o3316L0360k39456
16527A156901k95511J14733J07276M29788n70646L05521j68059J51514j78073
16518A053444J4695K32692l41079L53677j68744k51320L33212j30860J1150l66869
16508G39998k06932N00107o102J24607l05662J36844j88650J60604j43919J1727
16498H22622Q0166j03869p5761j58215L81308j60462k98115L75495J16878j26843
16488H53204j34876k37070l9538K7627K79525p5959J87389l2340j42775J62270
$$ y = [2017222, 1945491, 1833505, 1949759, 1700245, 1574753, 1770059, 1936605, 1831490, 1673023, 1740282, 1544084, 1531780, 1925675, 1600477, 1783341, 1485511, 1369679, 1435376, 1470771, 1495380, 1335527, 1533928, 1060642, 1174867, 1253067, 1582482, 1429313, 1365997, 1396357, 1156901, 861390, 976123, 1083399, 1513187, 942541, 1248062, 1080003, 1231517, 1053444, 1068139, 1300831, 959752, 1313429, 1144685, 893365, 1226577, 1095717, 1106867, 739998, 533066, 1033173, 1027071, 1151678, 846016, 982860, 794210, 954814, 810895, 822622, 902788, 798919, 723158, 564943, 946251, 785789, 487674, 863169, 980047, 853204, 718328, 481258, 441720, 469347, 748872, 672913, 860302, 827962, 685187, 847457]
16478H47457l74923K77224k77932O3213l4551L10497j01780M3510k00037O12015
16468A164693n33201j96884K37607B67344M08634m7297r0357j25722M8464J20803
16458E81869A73639K84576K06904j77313K05841k57952L58197k75323A92198L02612
16448D94810m5758L8577Q8640J23098r5423n4160A24876M86341Q2916C27651K4025
16437C51676K25097p9804j26137J68945k28195N09768j62942J99867k18907A44079
16426D07622A61174J14869l5195K69125k41949N87551C92313P3118j76187J94974
16416D84218L96977C55779K93172K9878M273J41425j80321M2989C27637j4780
16406C12857r0545M4761J84376J22520j07429B12763R1638K34859j65335O2604
$$ y = [847457, 472534, 749758, 471826, 535039, 500488, 810985, 709205, 752715, 552678, 1164693, 631492, 434608, 672215, 267344, 675978, 628681, 538324, 412602, 461066, 581869, 173639, 458215, 665119, 487806, 693647, 435695, 793892, 518569, 192198, 494810, 449052, 487629, 576269, 699367, 603944, 549784, 124876, 611217, 694133, 327651, 351676, 576773, 496969, 370832, 539777, 311582, 821350, 658408, 858275, 639368, 144079, 407622, 161174, 276043, 240848, 509973, 268024, 855575, 392313, 465431, 289244, 484218, 881195, 355779, 648951, 678829, 683102, 824527, 644206, 687195, 327637, 312857, 222312, 267073, 451449, 573969, 466540, 212763, 304401, 539260, 373925, 436529]
16396D36529l3987j69226M07792l00558M2240N4553L46224A47207L17521R855
16386D74583j44490J25252j4765j20762J06351l1554Q7819B00944M33773k45203
16376C89514J04627k10276P5481c5663C78089j67046K14771j49811M70028B23007
16365A58750J48023K50795j91921A68252P0189K15430G2383L64417c3228B54781
16354B88458r6284j3927K8468r1376e302B66862J58804E4851L0707K02253a01271
16342D07985D6148a12935B54006r8199J8185J72151A59899B0925K24940n0695
16332A95170a15296I6826R4187j560K19488j37839N1145j0387L611j22644l0419
16321A62408A9245K66753D1303j0202f0012H7195K66142d5732E11788D0821a3836
$$ y = [436529, 402542, 233316, 641108, 340550, 382790, 437343, 783567, 147207, 464728, 474583, 330093, 455345, 440580, 319818, 426169, 394615, 482434, 200944, 634717, 389514, 494141, 283865, 359346, -35663, 378089, 211043, 425814, 276003, 746031, 223007, 158750, 306773, 557568, 365647, 168252, 238441, 453871, 72383, 436800, -33228, 254781, 288458, 192174, 178247, 206715, 115339, -5302, 266862, 425666, 54851, 85558, 287811, -101271, 407985, 46148, -112935, 254006, 155807, 173992, 346143, 159899, 20925, 245865, 195170, -115296, 96826, 191013, 189453, 408941, 271102, 322247, 311860, 315471, 192827, 162408, 19245, 285998, 41303, 31101, -60012, 87195, 353337, -45732, 511788, 40821, -13836]
16309B06685J88987A88091P0617f2905C07466f9222B18452E6138L730J23226J21607
16298C04701j32987Q6601j27582f9589I9642f1960A00362l1597a17635L9499O034
16287g2102A16112M60995j17726A57227L5601b21846B86797A06872N7932K47635
16277D12439a982E8119L46473j73608h8884L7403B04237A2709K11476A3309J09635
16266A22944J51622c16205A18831N4083f6942B46581d1343I5001R9014N9883M5239
16255B99137J296d3142E18340A50034b46210A70857a53160B54643J0205r9455
16245A65393J43077j35696J26122J36642g2371A78110C8970K0134a41632L3250
16235a08382B37628r0602C5733K07436J2530a02385A64869a30242o0667j15016
$$ y = [206685, 395672, 188091, 258708, -62905, 307466, -69222, 218452, 56138, 59868, 183094, 304701, 171714, 258315, 130733, -69589, 99642, -61960, 100362, 68765, -117635, -78136, -72102, 116112, 577107, 459381, 157227, 192828, -221846, 286797, 106872, 164804, 412439, -1982, 58119, 404592, 230984, -88884, -51481, 204237, 12709, 224185, 13309, 122944, 274566, -316205, 118831, 172914, -66942, 246581, -41343, 95001, 194015, 253898, 299137, 300433, -43142, 518340, 150034, -246210, 170857, -153160, 254643, 264848, 165393, 308470, 172774, 298896, 435538, -72371, 178110, 38970, 59104, -141632, -108382, 237628, 147026, 35733, 243169, 255699, -102385, 164869, -130242, -190909, -305925]
16225c05925H3361K54923b04272H6167e6387m84I5877L91990F8546b34108C3746
16213I7478b14987A57433J16567n4169j4901a30988B0822b06690B76409b3006
16202b72502A74273n3664a07649d0543B20740r4638J0512K99783i3417E3655O0757
16191A14412N1113J16653A10719K74525b59771C94424C2485b97051E4967a01354
16180A47311R5074p8444J70037A0545J20526j5371M0094g130B57755a23609B50183
16168B08110a38759F4071a33883A60532a47243k3075d1453G3601a731A63072h8463
16156c6065j06219K2187I761R1870R1263A0109a9875A06762b53006c4681m7341
16145h2022B34919j0843I2552O3508J56575A16786K30450e2949A23390N263O352
$$ y = [-305925, 83361, 338284, -204272, 86167, -56387, -56871, 95877, 487867, 68546, -234108, 33746, 97478, -214987, 157433, 274000, 219831, 204930, -130988, 20822, -206690, 276409, -23006, -272502, 174273, 120609, -107649, -40543, 220740, 126102, 136614, 436397, -93417, 53655, 114412, 165525, 282178, 110719, 385244, -259771, 394424, 32485, -297051, 54967, -101354, 147311, 242385, 163941, 333978, 10545, 131071, 115700, 155794, -7130, 257755, -123609, 250183, 208110, -138759, 64071, -133883, 160532, -147243, -170318, -41453, 73601, -1731, 163072, -88463, -36065, -142284, -120097, 9761, 101631, 192894, 10109, -19875, 106762, -253006, -34681, -82022, 234919, 224076, 92552, 156060, 312635, 116786, 347236, -52949, 123390, 128653, 135005]
16134A35005P5245g4860A0283M56656B03573e2308A92123b08849l3991Q8842M7216
16123a06782B11642K04753I1780a42460C70J0000a02039j59965A4688J81306h2499
16111a27E5392a17627D6762i5990A6825K08727c9907j32599j09061A02824c3740
16099B52610C3100e3438E5813O3455a07351m2837A83884a19130B29187l499M2316
16088B68004C7716L2901b16530O8085j13746A0576c78867a80322A10318h3719
16077I6531b75343h8200l846A34009b41180m6053a10783B1392L72574k7585E9873
16065c63553B03214K4329a98253E0114O6132m9903A801M6027h8438G7842B8234
16053c71833B76364a51245j24549E6131c83754i2110C58528e7980k60066C82130
$$ y = [135005, 210250, -74860, 10283, 466939, 203573, -52308, 192123, -208849, -242840, -153998, -106782, 211642, 416395, 91780, -142460, 370, 10370, -102039, -262004, 14688, 195994, -82499, -127, 55392, -117627, 46762, -95990, 16825, 225552, -39907, -172506, -281567, 102824, -33740, 252610, 33100, -53438, 55813, 119268, -107351, -150188, 183884, -119130, 229187, 225688, 268004, 37716, 70617, -216530, -148445, -262191, 10576, -378867, -180322, 110318, -83719, 96531, -275343, -88200, -92046, 134009, -241180, -287233, -110783, 21392, 393966, 366381, 59873, -363553, 203214, 227543, -198253, 50114, 116246, 66343, 1801, 47828, -88438, 77842, 28234, -371833, 276364, -151245, -275794, 56131, -383754, -92110, 358528, -57980, -318046, 382130]
16042a44483n7976B31032q0665b3863G2620a47179A09006n1762K22014H4470l5854
16031D8616J15373J56604B6099P5723a40230A33723P2284Q5650G1542a80476e255
16019a39804q9740R5909j68564P052a43480A88323e9423D4912r466n463c40790
16007A37703b05726K3119A58754f8404n5730G0732a42742D6250k1024J97891I3286
15995d17145c0805p9632A70240g9299G315i680A40177a5126C7769a36045A91968
15983A07463J73591J06583F0501J50380b39547A49737l4633J40599j08656i6842
15972G5813R389e4574k18020f1547n2141N0690D48557h7281B31583G4821a38167
15960d02075B5387f0553k49544B57193c35288A66838o4623M8911b18811m3733
$$ y = [-144483, -202459, 231032, 150367, -23863, 72620, -147179, 109006, 57244, 279258, 84470, 48616, 163989, 320593, 26099, 101822, -140230, 133723, 206007, 291657, 71542, -180476, -5255, -139804, -229544, -133635, -302199, -295147, -143480, 188323, -59423, 44912, 35446, 29983, -340790, 137703, -205726, -182607, 158754, -68404, -124134, 70732, -142742, 46250, 25226, 223117, 93286, -417145, -30805, -110437, 170240, -79299, 7315, -9680, 140177, -15126, 37769, -136045, 191968, 107463, 281054, 387637, 60501, 210881, -239547, 149737, 115104, 255703, 147047, -96842, 75813, 85202, -54574, -272594, -61547, -113688, -62998, 448557, -87281, 231583, 74821, -138167, -402075, 25387, -60553, -310097, 257193, -335288, 166838, 102215, 151126, -218811, -262544]
15950b62544a13449D12907j69740A02991D9062a42220j11786B02985k3107e7777
15939i8264n6003A43930g9633C8548b11445g7424F837L8130f2958B24895f4531
15927b01835C67970j55326a54003P19B12846l8568i2128A78566J49103a1602p4731
15916h6333B4179e1310A99979g4199N863l27450C72852A20272b11081k1996h8561
15904E5712d3680l26247J07449g215k82472A26296o2908q9c44979i5597j82081
15893b77678N6379a7321E6099A9046J33989K2386E617a90553c835G6022a70678
15881b45513F904J2966d6680j13298A43178Q4363g3336K656E7598c48805b3442
15869A42450o4645d19980a58640N6436j05636i5028c0860H1541c3266k63452P641
$$ y = [-262544, -113449, 412907, 243167, 102991, 49062, -142220, -254006, 202985, 179878, -57777, -98264, -154267, 143930, -79633, 38548, -211445, -77424, 6837, 44967, -62958, 224895, -64531, -201835, 367970, 212644, -154003, -153284, 212846, 174278, -92128, 178566, 327669, -11602, -86333, 24179, -51310, 199979, -74199, -68336, -395786, 372852, 120272, -211081, -233077, -88561, 55712, -43680, -369927, -262478, -7215, -289687, 126296, 63388, 63299, -344979, -95597, -277678, -221299, -17321, 56099, 19046, 153035, 175421, 5617, -190553, -3835, 76022, -170678, -245513, 6904, 19870, -46680, -159978, 143178, 227541, -73336, -70680, 57598, -348805, -23442, 142450, 77805, -419980, -158640, -102204, -207840, -95028, -30860, 81541, -33266, -296718, -289077]
15858b89077R3414A3260a73552l26729h5917G5081L03808a19201C7001b93385
15847B13538B0740K24023b8331q1412n2347n8463C63373D5585a23550j05109j34087
15836c62746g1354j58640A43969e5960A65154a517k61637K5753d7415B2452H875
15824a46424f2466m5610k44430J43409b1507j02537F7622a56012O5755L3004C01218
15812G491K4466f4717j0273F7504N15a14893r3767B49478c35324A01124J34141
15801B35265G8472a10110B06315H894a03523C41137a20090c4800q9584j4129B547
15789A55924M0490a25579M3070B54415b60313B2058l694J5376J97717j03870a117
15777a28489A34824B3317e698j33853I7451J41003i9469j53045j8925b6986j24219
$$ y = [-289077, -195663, 13260, -173552, -500281, -85917, 75081, 378889, -119201, 37001, -293385, 213538, 20740, 244763, -28331, -109743, -162090, -220553, 363373, 45585, -123550, -228659, -362746, -71354, -229994, 143969, -55960, 165154, -1517, -263154, -237401, -47415, 22452, 8875, -146424, -62466, -108076, -352506, -209097, -21507, -124044, 67622, -156012, -90257, -57253, 301218, 7491, 31957, -64717, -74990, 67504, 68019, -114893, -208660, 249478, -335324, 101124, 235265, 78472, -110110, 206315, 8894, -103523, 341137, -120090, -34800, -124384, -138513, 2547, 155924, 196414, -125579, -82509, 254415, -260313, 22058, 18364, 33740, 231457, 127587, -1117, -128489, 134824, 23317, -5698, -139551, 97451, 238454, -99469, -252514, -271439, -26986, -151205]
15766a51205J9389C66710d226k40828A70448g4927r7215e5311G5417b48459b0309
15754a65125b6137A52132d6160j37709P6717C89249G2233J37659a7811l2534C2813
15742b9354C3086j1851b36776A06803C8518a94690n7637J02658O5519A43112a14850
15730C7108a7466q6750j61026H4022b59442G171a3711D501b03457M1767n9386
15719b21076B47880a71265c6378d794k24767O3818K3095E75334I0703J9731a25187
15707b42595F3451k4641a76069G366a21324m26704A59320a10337B35305a49328
15696g9153A97J45294a08249i615F6156K59037A52825a86526m965C59500I0976
15684b94601a27793A6081a03109b8082A01939J44253b6815o9884C84786b9454
$$ y = [-151205, -131816, 366710, -4226, -245054, 170448, -74927, -172142, -55311, 75417, -248459, -20309, -165125, -26137, 152132, -46160, -183869, -107152, 389249, 72233, 209892, -17811, -50345, 32813, -29354, 33086, 21235, -236776, 106803, 38518, -194690, -252327, -149669, -84150, 143112, -114850, 37108, -17466, -104216, -265242, 84022, -259442, 7171, -13711, 4501, -203457, -161690, -221076, 247880, -171265, -36378, -4794, -229561, -165743, -142648, 575334, 90703, 110434, -125187, -242595, 63451, 38810, -176069, 7366, -121324, -548028, 159320, -110337, 235305, -149328, -79153, 197, 145491, -108249, -9615, 66156, 325193, 152825, -186526, -191491, 359500, 90976, -294601, -127793, 16081, -103109, -28082, 101939, 246192, -26815, -96699, 384786, -29454]
15673F0750a49162C717c05478C67880A74317L1450m671I5497B3380J48134d33216
15661A34133o5199b12895K9642I7176b89155f6207B8523K48429E382R2804c83789
15649c61044l684P7142f2567j60270P9638A027J68459c39379J44904A48559a78861
15637H4812l8639b26010B244a08264B24309a30120L4528g199o9330C4770e4705
15625b00949H60K23201m5552P659A2671c67581B69058a4329A69498d3536j46190
15614a89726k0354A15604H450J46046c62611J76582B5999d985G7589K03642a91531
15602c02699A90832b83788a19815j90038A24714P6005a31104A80729n289G9811
15591b38069i8419j35515A03898N3885a22696A60771a0188G2363d1974D566g1865
$$ y = [60750, -149162, 3717, -305478, 367880, 174317, 205767, 201096, 95497, 23380, 171514, -433216, 134133, 68934, -212895, -183253, 97176, -289155, -66207, 28523, 276952, 5382, 98186, -383789, -361044, -364728, -287586, -62567, -222837, -143199, 1027, 169486, -339379, -194475, 148559, -178861, 84812, 46173, -226010, 2244, -108264, 224309, -130120, -95592, -7199, -76529, 34770, -54705, -200949, 860, 224061, 178509, 186168, 12671, -367581, 269058, -14329, 169498, -43536, -189726, -210080, 115604, 8450, 154496, -362611, -186029, 25999, -4985, 77589, 281231, -191531, -302699, 190832, -283788, -119815, -309853, 124714, 200719, -131104, 180729, 175440, 79811, -238069, -98419, -233934, 103898, 157783, -122696, 160771, -10188, 72363, -41974, 4566, -71865]
15579D1243b42850e4821A38663J34801a77609b6309D4190J86325I1250D75e8988
15567a50552E1178L25849b56j01134A44804O5430C4667K6767d794A59288a39937
15555e3236A3839a98865a4410k52826J00516l4958A74864K8107d86214J43195
15545c43019f1972I5275a60419r9432B60716a51558G0887a08027j57030B34395
15534b83420C4153c28299h529j12649b9710k05740e2836A6636J6840f38E67336
15522H2218b61112J22219I3790b8780o5893A07749O6645c49788G3234J82365b9132
15510H3727a75838A2998K45844a28409E5347a75311F0402b31450q1540A60409
15499D3056b0686j12566D4543A1402f0806b5243j25451H5180b930q7054B8181
$$ y = [41243, -242850, -54821, 138663, 273464, -177609, -26309, 44190, 230515, 91250, 475, -58988, -150552, 51178, 377027, -256, -101390, 144804, 210234, 34667, 61434, -4794, 159288, -139937, -53236, 13839, -198865, -14410, -267236, -166720, -201678, 174864, 202971, -486214, -343019, -61972, 95275, -160419, -259851, 260716, -151558, 70887, -108027, -265057, 234395, -283420, 34153, -328299, -8529, -121178, -29710, -235450, -52836, 16636, 33476, -638, 567336, 82218, -261112, -138893, 93790, -28780, -94673, 107749, 174394, -349788, 73234, 255599, -29132, 83727, -175838, 12998, 258842, -128409, 55347, -175311, 60402, -231450, -312990, 160409, 43056, -20686, -133252, 44543, 11402, -60806, -25243, -150694, 85180, -2930, -89984, 28181]
15487A08271a32557H090O4447h125m0814A35192L7167h6896M2057C10197h9866
15475H2658g3672D0733L0801m109A5265c738j54197D305e7599j99304J28262j71608
15463c00249d3289m0485K0538B60408f1450B96698l4641a03976A94399D2915a34059
15451c1111m64k49349B00663I4142d8037r0026C13024A02190M5021a99854j87981
15440c87835H6740C9040J13393K26087b35365h7783B54182c58910A01260J97645
15430B98905j05734b42118A54316m0309h6949a8356C6181b04645b9394C7317b738
15418i8128C69932j75620m4526d06500I514K53986c02335I4069a31801A80379
15407b29796L4484I8765C5925J98134b80777D03580j69516n1619E7806J7107b74149
$$ y = [108271, -132557, 8090, 72537, -8125, -48939, 135192, 172359, -86896, -44839, 310197, -89866, 82658, -73672, 40733, 71534, 67425, 15265, -3738, -157935, 4305, -57599, -256903, -128641, -300249, -43289, -83774, -63236, 260408, -61450, 296698, 262057, -103976, 194399, 42915, -134059, -31111, -31575, -280924, 200663, 94142, -48037, -138063, 313024, 102190, 147211, -199854, -387835, 86740, 39040, 152433, 378520, -235365, -87783, 254182, -358910, 101260, 298905, 193171, -242118, 154316, 114007, -86949, -18356, 36181, -204645, -29394, 37317, -2738, -98128, 369932, 194312, 149786, -406500, 9514, 263500, -302335, 94069, -131801, 180379, -229796, -195312, 98765, 35925, 234059, -280777, 403580, 234064, 182445, 57806, 74913, -274149]
15395d07507g8257b7398a988A14898J27420a6770F4584k4147a47740g2844b5770
15383a00240G1705b36302b079m55385A00183m8432b08721C12751b36671e2045
15372C8395C870a30427k40034A63099J00492c6408m0811k25058c9926k2915o7838
15361a30679b2506O106k10098F4038k0479L510J0756P9186a21683G8632a10103
15349c3946B3453R9057D6929i3342D248r1O4969f7033j03703j78500e5070G1893
15336C7984J23383D5205J07787N7832a4528j70669A77152R2822q3779a06264A98818
15324a73711A40059f0324B16860A00647B6314M1029j4971J26668J33601b1309
15313C77744A23855h1164E3055L69L4616a93703f7185B24990B7232R0049c78592
$$ y = [-407507, -78257, -27398, -1988, 114898, 242318, -16770, 64584, 40437, -147740, -72844, -25770, -100240, 71705, -236302, -2079, -457464, 100183, 51751, -208721, 312751, -236671, -52045, 38395, 3870, -130427, -370461, 163099, 263591, -36408, -77219, -302277, -39926, -62841, -130679, -22506, -16400, -226498, 64038, 43559, 47069, 57825, 137011, -121683, 78632, -110103, -33946, 23453, 122510, 46929, -93342, 4248, 4157, 69126, -67033, -170736, -349236, -55070, 71893, 37984, 161367, 45205, 152992, 210824, -14528, -185197, 177152, 269974, 186195, -106264, 198818, -173711, 140059, -60324, 216860, 100647, 26314, 67343, 52372, 179040, 312641, -21309, 377744, 123855, -81164, 53055, 53424, 88040, -193703, -67185, 224990, 27232, 117281, -378592]
15301h2934B70799a20224A16383E6874J46940o4578b14097D01880j31778o2522
15291B07580I9160h7262A78949K8271M1844j17938a09898B20088G8660J06014
15281A84674k3185a02921C24584A16204E6460M8353j0748d11330H7085O7403g4393
15269B42599J14596J2365j21179F2708R92J0072J89136G3550l0015c3292i918
15257D228e0156D73152F8310b3034c158F5506M6153K24305N53625K74288J19802
15246A283679m2754q988E14020Q9370B69021b0918j72814O9636j17094N2473H4124
15234f3096I6486i0633A79533J3510J79801A250K38647L2649p0008i4754j499
15223i6253A01646O448c18891B11708A6917b12269d0598A03238k7068A7031M06532
$$ y = [-82934, 270799, -120224, 116383, 56874, 203814, 139236, -214097, 401880, 270102, 207580, 99160, -87262, 178949, 207220, 249064, 131126, -109898, 220088, 78660, 184674, 161489, -102921, 324584, 116204, 56460, 104813, 94065, -411330, 87085, 154488, -74393, 242599, 357195, 369560, 248381, 62708, 63700, 73772, 262908, 73550, 43535, -33292, -9918, 4228, -50156, 473152, 68310, -23034, -3158, 65506, 111659, 335964, 889589, 1163877, 1283679, 1240925, 1231937, 514020, 603390, 269021, -20918, -193732, -124096, -241190, -188717, 84124, -63096, 96486, -90633, 179533, 193043, 372844, 1250, 239897, 272546, 202538, -94754, -96253, 101646, 108094, -318891, 211708, 16917, -212269, -40598, 103238, 76170, 17031, 423563]
15212D23563b7328j79997A09979J23001h1479B99680j9593A01367A4044K37558
15202B51602B6170L20480g6505C44695D9119K60923a0029B8330K85704A18692
15191D9328J01944i4375A87431F2746A1257K24751M0434j21277j2255c2008j52810
15180a84818C97498A14581J33237J15211i8806B55060b28567F7427N4473d6381
15169G0774J10739c77512E405K5341b3891G0338J29290j2773g7608A69804J92175
15158C61979j21977h262j9995j05254b6969E265e8098E7222f7202B10585b9640
15146B75135o6131o3521c367G9173C8214c1216A07085a5898B58717Q305m492D1350
15133B14463e3588D9171L78729E6838M97075f7893C46677A12592J17851a54250
$$ y = [423563, -27328, -207325, 109979, 232980, -81479, 299680, 280087, 101367, 14044, 251602, 26170, 346650, -76505, 344695, 49119, 310042, -10029, 28330, 314034, 118692, 49328, 151272, -94375, 187431, 62746, 11257, 236008, 276442, 155165, 142910, -32008, -184818, 397498, 114581, 247818, 363029, -98806, 255060, -228567, 67427, 121900, -46381, 70774, 181513, -377512, 5405, 30746, -23891, 70338, 199628, 186855, -77608, 169804, 361979, 240002, -8262, -28257, -133511, -26969, 5265, -58098, 57222, -67202, 210585, -29640, 275135, 209004, 145483, -3367, 79173, 38214, -31216, 107085, -15898, 258717, 267022, 262530, 41350, 214463, -53588, 49171, 427900, 56838, 553913, -67893, 346677, 112592, 230443, -154250]
15122E0496j0084J69247C7196K09204G2483J1213K11565F173J20111J46367K8699
15111C01350p6726E4120J21124j3815N412J63196D5234J80342a49256C12041h2633
15099C54747d8987A98738I3504Q0396M2065K4838m4453i532k01935B59729r4158
15088A65571J43700J68514o5903A53788a3566j18011C43855A30926L31695A23708
15077H2697K37888J10A47482J20610p0160m5237K59253A80367m6663C5378J22437
15066A57815K26016j12495H7644J43495M4888M5149C6671O251K08739R6342J14679
15055D62682C968K85781J47022C9719J43348L24359j03962j42902K3862D0622
15044B43247A1097J23374J58855K50243j13396B07236r5074L61903i0884B91003
$$ y = [50496, 40412, 209659, 37196, 246400, 72483, 83696, 295261, 6173, 126284, 272651, 301350, 224624, 54120, 175244, 161429, 166841, 330037, 45234, 225576, -149256, 312041, -82633, 354747, -48987, 198738, 93504, 173900, 215965, 240803, 196350, -9532, -211467, 259729, 165571, 309271, 477785, 411882, 153788, -13566, -131577, 343855, 130926, 462621, 123708, 82697, 320585, 320695, 147482, 268092, 197932, 152695, 411948, 180367, 133704, 35378, 157815, 383831, 271336, 87644, 231139, 276027, 321176, 36671, 42922, 251661, 348003, 462682, 3968, 289749, 436771, 39719, 183067, 507426, 403464, 260562, 284424, 40622, 243247, 11097, 134471, 293326, 543569, 430173, 207236, 112162, 474065, -90884, 291003]
15033F16979H4785j3298a0168D08386j05707A0214L57947I0278J50752I6752a38694
15021D82657c4696B7073K21064A04200Q6730J19342j9686J82296F9356J33094
15011B02450L71604j76214A20110K92820A77051E0018J24128P7478B3062K58146
15001B81208C7067K94939J57086A1113K09987Q8568P9805a62551E22728A79653
14990D98898n3942I6847c300C67894Q96r3836H2298e1670D80397A49864f0097
14978A15437M94734k28807e5412A62135a50224B29184J8000K10301f0258D09520
14967A70352K15059K64280C7998M03131m8137A88394J61789k1806o2324F0819
14956B68764r674i3423b0061D46519m4288j1542l9960K87590G9341M44915A14823
$$ y = [616979, 84785, 71487, -10168, 408386, 302679, 10214, 368161, 90278, 241030, 96752, -138694, 482657, -34696, 27073, 248137, 104200, 190930, 310272, 290586, 472882, 69356, 202450, 574054, 397840, 120110, 412930, 177051, 50018, 174146, 251624, 23062, 281208, 37067, 332006, 489092, 11113, 221100, 309668, 389473, -162551, 522728, 179653, 498898, 444956, 96847, -3300, 367894, 368790, 274954, 82298, -51670, 480397, 149864, -60097, 115437, 610171, 381364, -55412, 162135, -150224, 229184, 247184, 457485, -60258, 409520, 170352, 385411, 649691, 37998, 441129, 392992, 188394, 350183, 328377, 266053, 60819, 268764, 259090, -93423, -20061, 446519, 402231, 390689, 350729, 638319, 79341, 524256, 114823]
14944f8659C25975I5196J92265K07494F3601N09885Q6621k87255A25551o1643
14934F3908N73242l08245R6651A17358L92816B00465I6302M96868k28590P6727
14924D41307H8204L65831k305j80156p8420O11341C67378K30424B38493K50343
14914D88836J39135J06624k75591k19891K90692K06315C37329d0150E18892j20545
14904C98347B2510K49094K65292j86134j36219K68326j46013G1178P85299I1910
14893A091436D86759J93541k77103L92865j11149l22522N0407n3452L76481B81681
14882C6117K70181a5673E65048j25799k7744q3316J26972J0489A83999L06698
14872D90697B15365Q4059J45705j31884n5999J90762k4844j45605L7775J01963
$$ y = [-68659, 325975, 95196, 287461, 494955, 63601, 573486, 660107, 372852, 125551, 63908, 637150, 328905, 425556, 117358, 510174, 200465, 96302, 593170, 364580, 441307, 88204, 454035, 451730, 271574, 193154, 804495, 367378, 597802, 238493, 488836, 627971, 734595, 459004, 239113, 529805, 736120, 337329, -40150, 518892, 398347, 22510, 271604, 536896, 350762, 214543, 482869, 336856, 71178, 856477, 91910, 1091436, 486759, 680300, 403197, 796062, 684913, 362391, 412798, 359346, 735827, 281681, 36117, 306298, -15673, 565048, 439249, 411505, 328189, 455161, 465650, 183999, 490697, 215365, 299424, 445129, 313245, 257246, 448008, 423164, 277559, 315334, 417297]
14862D17297M13524C00246K42131k63047K36283j83168J45273J37834R8293C21104
14851D27838J26104k8659j8422L54209D18193K09354J26354l65402J21924k50465
14841B59958K38594R7612J19553k23453J24111j36039j5871Q9684K60013r7985
14831G16177k64179J45599j6938n1964j19664C9360O82259J16002R461C63843
14820F25203J44821j33117K17186B23562L00256J55464k4716J7425Q0327l6019
14810G16299Q6218l45566K13320J02026j04970k6831j85959O6359Q7462J73823
14800G82181l66273K35891Q7124J26697j17285N3773o4069k40732Q7349K19192
14790H03848j31427k59514N61114o2938J6721j73165R5174k00656L0881R3851
$$ y = [417297, 830821, 300246, 542377, 279330, 515613, 332445, 477718, 615552, 713845, 321104, 427838, 553942, 525283, 506861, 861070, 418193, 627547, 753901, 388499, 510423, 259958, 498552, 596164, 715717, 492264, 616375, 480336, 464465, 554149, 814162, 716177, 451998, 597597, 580659, 528695, 409031, 39360, 721619, 837621, 847082, 363843, 625203, 770024, 636907, 854093, 223562, 523818, 679282, 654566, 671991, 752318, 716299, 802517, 456951, 670271, 772297, 667327, 640496, 454537, 520896, 608358, 782181, 415908, 651799, 738923, 865620, 748335, 802108, 738039, 497307, 584656, 803848, 672421, 412907, 974021, 911083, 927804, 754639, 849813, 649157, 680038, 773889]
14780G73889J90360l21322o5447K8K82215k70788B61278N59056k51848R8197j95550
14769D71133K24366j32371K48871k864m558k67291J56049n8452K41206k49713
14759F26376K55099l53024K82354J14427k72060K94046p8368j66815Q3300L14256
14749A099591m11381L34287l3014j95324R479q2678j1113J14448k12537N01433
14739A113191o7524j25952Q1833J86799l68050K67578K81270m05313J63733j0945
14729A116620n3110j69220p9980k42333M78017j23297P6235J06227J4769K3846
14719A147774L3661k29881q4915J89951l49939M34552l1520N2468R2691m60206
14709G94636j21357L93451k89610L36140J59086m11288M93122k94354R47J5442
$$ y = [773889, 964249, 642927, 577480, 577508, 859723, 588935, 261278, 820334, 568486, 666683, 471133, 695499, 563128, 811999, 809135, 804577, 537286, 693335, 634883, 876089, 626376, 881475, 528451, 810805, 925232, 653172, 947218, 868850, 702035, 785335, 1099591, 688210, 1022497, 989483, 794159, 803638, 720960, 709847, 824295, 611758, 1113191, 1045667, 919715, 1001548, 1188347, 820297, 1087875, 1369145, 963832, 1127565, 1116620, 1063510, 894290, 814310, 571977, 1049994, 926697, 1002932, 1109159, 1123928, 1147774, 1181435, 951554, 866639, 1056590, 706651, 1141203, 1109683, 1162151, 1254842, 794636, 673279, 1066730, 777120, 1113260, 1272346, 861058, 1354180, 1059826, 1060773, 1076215]
14699A076215P7057j41000K75826k37134L03012j57947q5034J39867j84418J85632
14689A252076j4433Q9537m11652N15980o4293J46545m74715M3821J48947m8279
14679A183534n4893L125K90985l50423L76545k06580j05464K73522l98644J8639
14669A030346M84505j96529K57477j76993L44499o50909J62559O57014l58908
14660A553061M2981l16556J24727k16130M46119m28376M4693J80480j77324j5500
14650A238175k0920J39483J02376J59599k9602l22046J26029k10350N29602k15540
14640A496806K06048M89252m70096o4797J26525m53212N6704J35332K55983k84577
14630A493968J82916R0331j42050L2407K16254k15645K13585P6579j63288K20002
$$ y = [1076215, 1153272, 1012272, 1288098, 1050964, 1353976, 1196029, 1110995, 1250862, 1066444, 1252076, 1237643, 1327180, 915528, 1431508, 1367215, 1513760, 1039045, 1082866, 1231813, 1183534, 1128641, 1131766, 1422751, 1072328, 1448873, 1242293, 1136829, 1410351, 1011707, 1030346, 1514851, 1318322, 1575799, 1398806, 1743305, 1092396, 1254955, 1911969, 1553061, 1596042, 1279486, 1404213, 1188083, 1634202, 1205826, 1250519, 1430999, 1253675, 1238175, 1217255, 1356738, 1459114, 1618713, 1589111, 1267065, 1393094, 1182744, 1712346, 1496806, 1702854, 2192106, 1722010, 1657213, 1783738, 1330526, 1387230, 1522562, 1778545, 1493968, 1676884, 1767215, 1625165, 1657572, 1873826, 1658181, 1871766, 1948345, 1785057, 2005059]
14620B005059k48800j87706J58041L12942k25188m6864J14147J1817K46335j51408
14610A988375l35168L93985m46796l2486k1280O51790k95869J2551L28155j1109
14600B232148n7970k22543N4359O54973n74768R2205j12390K69562l99956N52833
14590B488453j11094k05498K75887k57993j11015K70142j9515l2738O8854j73876
14580B191607L30483J15263K5767N039l46248K97156m6875M44285l75204j91238
14570B450035K41495J25728J77987k71716K41486L44836j25355J05706K37815
14561C528017j56775P3332L7772k01524K01386P51315l54271O48927K15860N17239
14551E261278N94962J041337J504383L185834Q244348J3376315K045274j0133479
$$ y = [2005059, 1756259, 1568553, 1726594, 2039536, 1814348, 1767484, 1881631, 1893448, 2139783, 1988375, 1653207, 2047192, 1600396, 1567910, 1546630, 2198420, 1902551, 1915102, 2243257, 2232148, 2174178, 1951635, 2005994, 2660967, 2086199, 2178404, 2066014, 2335576, 1935620, 2488453, 2377359, 2171861, 2447748, 2189755, 2078740, 2348882, 2329367, 2296629, 2365483, 2191607, 2522090, 2637353, 2663120, 2668159, 2321911, 2619067, 2572192, 3016477, 2641273, 2450035, 2691530, 2817258, 2995245, 2723529, 2965015, 3309851, 3184496, 3290202, 3528017, 3371242, 3444574, 3482346, 3280822, 3482208, 4233523, 3879252, 4528179, 4744039, 5261278, 5856240, 6897577, 8401960, 11587794, 19832142, 33208457, 35253731, 25120252]
14543B5120252j0834094o253621k660439j631885k71614l82435j35808l63415
14535B586941N06585j18488L7785J08279l93983L58670n3922j07260J45764J89614
14525C259985l00447K71410j57097J90284J34926l32665L75388j52786J4241k34056
14515C069183L98032J15802L4380J3896o8270M0497K63815j44397j81532J62271
14505C703677J34304M6086n59j81194Q4456q7549J04505P2230K03319J61348O0062
14494D300685k31993L88734l15325O5434L02577q4580K3197J49972J97451m26017
14484D370135L51651j00563J96290k0928L4324K60068j00517O2796k02602O80426
14474E531080l04549j10078K12065j58784J98161j72869L62847J47916r1723K32159
$$ y = [25120252, 14286158, 8032537, 5372098, 3740213, 3468599, 3086164, 2950356, 2586941, 3093526, 2975038, 3012823, 3121102, 2727119, 3085789, 3031867, 2924607, 3070371, 3259985, 2959538, 3230948, 3073851, 3264135, 3399061, 3066396, 3441784, 3288998, 3303239, 3069183, 3467215, 3583017, 3617397, 3631293, 3563023, 3603520, 3867335, 3722938, 3541406, 3703677, 3837981, 3884067, 3883508, 3702314, 3786770, 3699221, 3803726, 3875956, 4079275, 4240623, 4300685, 4068692, 4457426, 4142101, 4207535, 4510112, 4425532, 4448729, 4598701, 4796152, 4370135, 4721786, 4621223, 4817513, 4796585, 4830909, 5090977, 4990460, 5053256, 4850654, 5531080, 5226531, 5116453, 5328518, 5169734, 5367895, 5195026, 5557873, 5705789, 5614066, 5846225]
14464E846225N2946m65813K16492L73451K35994l93320J67302K26716L58021k05300
14454F412714j78654M65161K3813k49961L33376o7426j58937N17707n1210K89462
14444G336045O7175m40025O28081j5671L24443k69153l7518J03828o4343J33131
14434G765993L63826L74162n931k22277N29932k44658J09919K54557L9301K39107
14424I203931k23528K08281N87063k69147Q6211j16211O22059j48723K64482R4492
14414A0308910Q6588J49450J20468j7392N54287k99366K53156M50909J48790m44049
14404A1311751N47135L34825j65684J32623M50784k58918M33933K80548M83734
14395A3550731J52851L476K75819N18959P0592M17596K9550L74229K99234l4499
$$ y = [5846225, 5899171, 5433358, 5649850, 6023301, 6259295, 5865975, 6033277, 6259993, 6618014, 6412714, 6234060, 6699221, 6723034, 6473073, 6806449, 6739023, 6580086, 7097793, 7046583, 7336045, 7403220, 6963195, 7591276, 7575605, 7900048, 7630895, 7593377, 7697205, 7632862, 7765993, 8129819, 8503981, 8498050, 8275773, 8805705, 8561047, 8670966, 8925523, 8964824, 9203931, 8980403, 9188684, 9775747, 9506600, 9592811, 9476600, 10098659, 9949936, 10214418, 10308910, 10395498, 10544948, 10665416, 10648024, 11202311, 10902945, 11156101, 11607010, 11755800, 11311751, 11858886, 12193711, 12028027, 12160650, 12611434, 12352516, 12786449, 13066997, 13550731, 13703582, 13707058, 13982877, 14501836, 14572428, 14990024, 15019574, 15393803, 15693037, 15658538]
14385A5658538M60926k8417K16703N98944N31194m03470R71215J87237K22733
14376A8415603N44290N09771o9390Q14694K43587J1031M74691K35054O73680N32518
14366B2385529J10533M06013L78317R75316K40168N89664M84513P16896j74130
14357B6112819R09865P28287N63674P70714Q15323P32174Q00075M80658O49154
14348C2562743Q53552N27621R89513O02289J277306P82800Q43832R90038R06768
14339D0336462R88893J484016P96137J457561J277081J275531J420573J056560
14331E0092814J381627J729851J719677J424335J775683J652299K064653J596399
14323F3437338K503519J619972K567235K086095K738225K450419K710617K614709
$$ y = [15658538, 16119464, 16091047, 16307750, 16906694, 17437888, 17034418, 18005633, 18192870, 18415603, 18959893, 19469664, 19400274, 20214968, 20458555, 20469586, 20944277, 21179331, 21853011, 22385529, 22496062, 22902075, 23280392, 24255708, 24495876, 25085540, 25570053, 26286949, 26112819, 27022684, 27750971, 28314645, 29085359, 29900682, 30632856, 31432931, 31913589, 32562743, 33416295, 33943916, 34933429, 35535718, 36813024, 37595824, 38439656, 39429694, 40336462, 41325355, 42809371, 43605508, 45063069, 46340150, 47615681, 49036254, 50092814, 51474441, 53204292, 54923969, 56348304, 58123987, 59776286, 61840939, 63437338, 65940857, 67560829, 70128064, 72214159, 74952384, 77402803, 80113420, 82728129]
14315H2728129L152825L099713L142121L473999L774338L954125M106801M199663
14307A11631714M509951M120133N855113N173270N522707O029852O346284O693210
14299A55882234O914905P215225P637597Q098707Q826370R132519R727731R991302
14291B23426590J0956000J1035357J1844141J2006906J3060990J3424988J3676153
14284C09431125J4102956J5010104J4443260J4750826J5060643J4405521J3715255
14277D10919690J3132603J1823816J0882068R987898Q396822N664309j46356k434468
14269D68226382m343532l810531n606244o015751q897006j2105714j3991579j4532218
14261C98923807j4861463j4707587j4830172j4392611j4707464j4348123j4141306
$$ y = [82728129, 85880954, 88980667, 92122788, 95596787, 99371125, 103325250, 107432051, 111631714, 116141665, 120261798, 126116911, 131290181, 136812888, 142842740, 149189024, 155882234, 162797139, 170012364, 177649961, 185748668, 194575038, 203707557, 213435288, 223426590, 234382590, 245417947, 257262088, 269268994, 282329984, 295754972, 309431125, 323534081, 338544185, 352987445, 367738271, 382798914, 397204435, 410919690, 424052293, 435876109, 446758177, 456746075, 465142897, 470807206, 470660850, 468226382, 463882850, 460072319, 454466075, 448450324, 439553318, 427447604, 413456025, 398923807, 384062344, 369354757, 354524585, 340131974, 325424510, 311076387, 296935081]
14254B96935081j3621697j4227153j4026588j3449860j2705698j1797819j1165093
14247B05941173j0733153r537767r104196q860461q004261p535805o986981o799610
14239A38378939o264313n781297n420536n400327n160641m584675m432334m076487
14231I7258329l826222l255403l993798l116924l152694l154399k538296l039830
14223G1180763k410746k488384k114513j911885k207067j857120k219315j774432
14215E4197301j640668j470881j757938j552741j246133j512614j297783r59759
14207D2758784q39704j005510j621945j011853j210661p13080j150011r88139
14199C4217881n86032j053419o24372r23604j063530m89428j043570n19263o59577
$$ y = [296935081, 283313384, 269086231, 255059643, 241609783, 228904085, 217106266, 205941173, 195208020, 185670253, 176566057, 167705596, 159701335, 152165530, 145178549, 138378939, 132114626, 126333329, 120912793, 115512466, 110351825, 105767150, 101334816, 97258329, 93432107, 90176704, 86182906, 83065982, 79913288, 76758889, 74220593, 71180763, 68770017, 66281633, 64167120, 62255235, 60048168, 58191048, 55971733, 54197301, 52556633, 51085752, 49327814, 47775073, 46528940, 45016326, 43718543, 42758784, 41919080, 40913570, 39291625, 38279772, 37069111, 36356031, 35206020, 34217881, 33631849, 32578430, 31954058, 31030454, 29966924, 29477496, 28433926, 27914663, 27255086]
14190B7255086o96625p51504k53047j037670j31135p38504m69579o50973m25521
14181B2100528p22205k01735k53423m16543o42524k86730p74237P2875k38405
14172A8637601o95064o500p87740J48966m40805m64239l22993k24677j90481n08872
14162A5145196J22095j85655k30519o93258j19943p8761m00862j38104j55682
14153A3264507k21692j96805l49565m23481J20315l01846R3719l43655l51695
14144A1289802m6629k24684K81940m91561m3658m92170n0591l20201J75702l78814
14134I699136n8751R2094l73533l30699J25063J20229l44785o74143N56699k35120
14124H576190l15750J54123l29495j23522L17219r6097m18200J01763k08812k78825
$$ y = [27255086, 26558461, 25806957, 25553910, 24516240, 24385105, 23646601, 23177022, 22526049, 22100528, 21378323, 21176588, 20923165, 20506622, 19864098, 19577368, 18803131, 18876006, 18637601, 17942537, 17936037, 17148297, 17297263, 16856458, 16392219, 16069226, 15844549, 15654068, 15145196, 15267291, 15081636, 14851117, 14157859, 14037916, 13959155, 13558293, 13420189, 13264507, 13042815, 12846010, 12496445, 12072964, 12193279, 11891433, 11985152, 11641497, 11289802, 11243173, 11018489, 11300429, 10808868, 10765210, 10273040, 10222449, 9902248, 10077950, 9699136, 9640385, 9732479, 9358946, 9028247, 9153310, 9273539, 8928754, 8254611, 8811310, 8576190, 8260440, 8414563, 8085068, 7961546, 8278765, 8182668, 7764468, 7866231, 7657419, 7378594]
14114G378594k34871L58905j27351K19607n80178q308l74258K24996l28026N5755
14104F584865k1173l97259K18581O9233j07072j08901R8743j78461l15991J83434
14094F025999q2523L1560p9747q6095o2039k53139J71621p01086L81419k29073
14084E116897k16218m520K21926r0190J50157j10606q6915l07059O6622K84456
14074E024550l43056K06819j44125j27899k4632L2979j03424j72660j65632P9997
14064D262917L9898j00479L1910p3755k19374K86179J94768n11827J71894l57654
14054C724477M85104k26205j16430m00222J15016M1660j92268M18977r3257j55030
14044C601822j28472r6352J62659m36643K8409N38809l36094n4250Q8709j55767
$$ y = [7378594, 7143723, 7502628, 7375277, 7594884, 7014706, 7006398, 6632140, 6857136, 6529110, 6584865, 6563692, 6166433, 6385014, 6454247, 6347175, 6238274, 6337017, 6158556, 5842565, 6025999, 5943476, 5975036, 5895289, 5809194, 5747155, 5494016, 5665637, 4964551, 5345970, 5116897, 4900679, 4896159, 5118085, 5027895, 5178052, 5067446, 4980531, 4673472, 4740094, 5024550, 4681494, 4888313, 4744188, 4616289, 4591657, 4624636, 4521212, 4348552, 4182920, 4262917, 4302815, 4202336, 4234246, 4160491, 3941117, 4227296, 4422064, 3910237, 4082131, 3724477, 4209581, 3983376, 3866946, 3466724, 3581740, 3623400, 3431132, 3850109, 3756852, 3601822, 3473350, 3376998, 3539657, 3103014, 3131423, 3670232, 3334138, 3279888, 3368597, 3212830]
14034C212830j00455j00604J60153K92548k29517Q453J10040k08827k87669m4757
14024B812195M99537k31039j12435l52216J40839J08198Q0646j17423j09171j79548
14014B539583K74868k28789K43753m32880M95347l7001j12120m7712m79581M63014
14004B678482j71782r1961j72812J74735K9277m4412K6138L37932n3062j14410
13994B598125k10495K18311K57194K71770N89968Q57507K348380O462284J3445513
13985B6838557P916239q834868r475709o292589k674593k033908o35155k91410
13977D516564q35688j44655J40165j45872m38518l04639J24529l69865K44489
13968B786510l23941K09692l26572R2829j11879R4560j84955j37980j56029K34664
$$ y = [3212830, 3112375, 3011771, 3171924, 3464472, 3234955, 3243408, 3353448, 3144621, 2856952, 2812195, 3311732, 3080693, 2968258, 2616042, 2756881, 2865079, 2945725, 2828302, 2719131, 2539583, 2814451, 2585662, 2829415, 2396535, 2891882, 2854881, 2742761, 2695049, 2215468, 2678482, 2506700, 2414739, 2241927, 2416662, 2445939, 2401527, 2427665, 2765597, 2712535, 2598125, 2387630, 2605941, 2863135, 3134905, 3724873, 4582380, 6930760, 13393044, 26838557, 34754796, 25919928, 16444219, 10151630, 7477037, 5443129, 4807974, 4516564, 3680876, 3536221, 3676386, 3530514, 3091996, 2787357, 2911886, 2542021, 2786510, 2462569, 2672261, 2345689, 2438518, 2326639, 2421199, 2236244, 2098264, 1942235, 2176899]
13958B176899j0188j60420K22405m12883K76143k31268M10428k7243k6906j32689
13948B084278j00871k45L47360q2597n27974K91056K61557m18269M1538j32935
13938A762898R9194q434K52579k99964l5332m9594j36212n5264O14475k81413
13928A862933R4422K7371m40459L96825k00613N839L12397l62072q0059j6927
13918A599657m8324J56698p6284P5870k7885j21055J90819k13020K78719k70575
13908A544620k77735J78240J05456k65050K19089l02483K41068J70977j39214
13899A474968j30333N95627k00210j78653k3507k31248L06657n83056L23206m8388
13889A305063L27547j72868O1716M5631j45700l5331L4958k35402k0144L67977
$$ y = [2176899, 2166711, 2006291, 2228696, 1815813, 2091956, 1860688, 2271116, 2243873, 2216967, 2084278, 1983407, 1983162, 2330522, 2247925, 1719951, 2011007, 2272564, 1854295, 1895833, 1762898, 1862092, 1853658, 2106237, 1806273, 1770941, 1721347, 1585135, 1529871, 2144346, 1862933, 1957355, 1984726, 1544267, 1941092, 1740479, 1746318, 2058715, 1696643, 1616584, 1599657, 1551333, 1708031, 1631747, 1707617, 1679732, 1558677, 1749496, 1536476, 1815195, 1544620, 1266885, 1445125, 1550581, 1285531, 1504620, 1202137, 1443205, 1614182, 1474968, 1344635, 1940262, 1740052, 1561399, 1537892, 1306644, 1613301, 1030245, 1353451, 1305063, 1632610, 1459742, 1521458, 1567089, 1421389, 1386058, 1421016, 1185614, 1165470, 1533447]
13879A533447j38988j24366r0147j27681Q7456L13427m3405m54322K20770Q3087
13869A259278M1495P8088j18514o9757n3736m6971K49510Q6950m88464k796Q9450
13858A024533J71207l7258k0216j81947R4214J61794l6188j10317k45066P0574
13848H91330M49589k85372q2548P2000K37706k29234j67270L77768k36270O2648
13838A090347L3441Q5699q1265J51007o5293m31511Q6539K32519J18472l26679
13828H93276K59854P8299l25888J23816j47755K05045k5200j22195o6864K7521
13818H99909j16419k14796O17894m23254J17066K16125l38526L9543K3739R5172
13808I16453k79044J03547R6759K61993l39539J23937k76758K73876m8112O3393
$$ y = [1533447, 1394459, 1270093, 1179946, 1052265, 1139721, 1453148, 1409743, 955421, 1176191, 1259278, 1300773, 1378861, 1260347, 1190590, 1136854, 1089883, 1339393, 1426343, 937879, 935083, 1024533, 1195740, 1158482, 1138266, 956319, 1050533, 1212327, 1176139, 1065822, 820756, 891330, 1340919, 1055547, 972999, 1044999, 1282705, 1053471, 886201, 1263969, 1027699, 1090347, 1123788, 1209487, 1128222, 1279229, 1213936, 782425, 868964, 1101483, 1219955, 893276, 1153130, 1231429, 905541, 1029357, 881602, 1086647, 1061447, 939252, 872388, 899909, 783490, 568694, 1186588, 763334, 880400, 1096525, 757999, 797542, 821281, 916453, 637409, 740956, 837715, 1099708, 760169, 884106, 607348, 881224, 833112, 896505]
13798H96505j01808J88791M8202k54135m8642p9542J68908K4652J39701k66819
13788G15813K66655k04067n5716n1659J57855J43040R7182k76685k1346K27175
13778I98247l41554N229j9855L63433k22734P448J00775r0097j94450L36529l38325
13767F04646K19986j25583k98218K56312K39934j57362q7668L22868j86879k07465
13757E80571m7462j28061L29710j6543j7412J29778j71861K62246q7332j28215
13747G05419J40834n0139J12303k8565k64645J41342M2010o9708J02801j32128
13737F99524L0026l7427k71439J50561M16018k89333r6550K61409n686M0097J4701
13726I11901L6260k71910l37307L51066J85893j63855O404k06095K4564j34912
$$ y = [896505, 794697, 983488, 1031690, 777555, 728913, 649371, 818279, 842931, 982632, 715813, 982468, 778401, 722685, 671026, 828881, 971921, 1069103, 792418, 771072, 998247, 656693, 661922, 642067, 1005500, 782766, 790214, 890989, 800892, 606442, 942971, 604646, 824632, 699049, 400831, 657143, 897077, 739715, 652047, 974915, 788036, 580571, 533109, 405048, 734758, 718215, 700803, 830581, 658720, 920966, 833634, 705419, 846253, 796114, 908417, 879852, 615207, 756549, 798559, 728851, 831652, 699524, 729550, 692123, 420684, 571245, 987263, 697930, 601380, 862789, 857103, 897200, 911901, 948161, 676251, 338944, 690010, 875903, 712048, 718452, 512357, 536921, 402009]
13716D02009j0681R2063R9807K91400B14083K08206M9097J50639j10094K98677
13706H10608k59954J32743k02537K75941k22365N2937k86763L94214k24263j42879
13696C27682J24399K6348J02942K40394l10088K39848j91321q1655K05659r6053
13686E88155K04001k94708j10468N1488m8936M4888j44796M51419j6412j18192
13676F06439R711o5201k29168J91818n1555r4625p998J39491j24027r4096J06794
13665C87583J97124j25312j53482O1459M01504q1061k70342L60880C85273J56154
13655E41427k00073L42127j81832j71440n2518L20591q05j87543p2727K7531K36644
13644F01382j39231k13310K45665j62372J33018l1569L7602J43598B33530K55445
$$ y = [402009, 391328, 483391, 583198, 874598, 214083, 422289, 471386, 622025, 511931, 810608, 550654, 683397, 480860, 756801, 534436, 587373, 300610, 694824, 470561, 327682, 452081, 478429, 581371, 821765, 511677, 751525, 560204, 478549, 684208, 588155, 792156, 497448, 386980, 438468, 389532, 434420, 289624, 741043, 724631, 606439, 616150, 550949, 321781, 513599, 462044, 367419, 359421, 498912, 374885, 280789, 387583, 584707, 459395, 305913, 367372, 768876, 687815, 417473, 778353, 385273, 541427, 341354, 683481, 501649, 330209, 277691, 598282, 597477, 409934, 337207, 364738, 601382, 462151, 248841, 494506, 332134, 465152, 433583, 471185, 614783, 233530, 488975]
13634D88975J94908A83481J50467l7384R2355r7821M74108E3646L99022A77452
13623A98277L28083O6095j29382J28719B94081J33423q2098N3225l8744J82727
13613E42614k13230p0261K92355B5468J00132L39746M7885k12988l6568p096L50168
13602F06747N7155C26270J95286k34995J10064j05250N23965C41573J44974J43486
13592F30033q5972J84852C49173A48986J42751J07906M7981L56517B13804M2304
13582B56108J33615Q0581J21716B85575Q3113p6823K1255j03934l6064D1638J86552
13571B28190J36866K10925a16914B12684N9260R1080o1608j32504K81585N8139
13561E08636B33189K88046j72219J11196A67994L08605A39878K61225A84728M47724
$$ y = [488975, 683883, 183481, 333948, 296564, 388919, 291098, 765206, 53646, 452668, 177452, 198277, 526360, 592455, 463073, 591792, 294081, 427504, 345406, 398631, 359887, 542614, 329384, 259123, 551478, 25468, 125600, 465346, 513231, 300243, 263675, 256579, 606747, 663902, 326270, 521556, 286561, 396625, 291375, 815340, 341573, 486547, 630033, 544061, 728913, 349173, 148986, 291737, 399643, 447624, 804141, 213804, 256108, 389723, 470304, 592020, 285575, 368688, 291865, 313120, 209186, 173122, 41638, 228190, 365056, 575981, -116914, 212684, 271944, 363024, 301416, 168912, 450497, 508636, 233189, 521235, 349016, 460212, 167994, 476599, 139878, 401103, 184728, 632452]
13551F32452q0300A05163J26391q3444m8423K50904J65270h580A94651J03630
13541B98281L00848k23086j87639K01691e15E30968k11646E0116N39795J05142
13531F95053B04848N0480a27590D62525A97701K87192j72642L13669j79021p5452
13521C71447p7872J76380k14227K16189k35901J18038J96392j12121j27595o4026
13511B46704J32373N085A36173K81789j34656L4337A30910O5124M06617k60789
13501C41862N764A69607o6958M394J17588J04659J45183r833j52589J18912j12368
13490C18595D0722O84895B7732L31177J24561j17396N0660A35975K29734A72674
13479A27245F2772a028A17221N13947C14192k5457H5610P1113K81409k01521d6133
$$ y = [632452, 552152, 105163, 231554, 148110, 99687, 350591, 515861, -8580, 194651, 298281, 599129, 376043, 188404, 390095, -515, 530968, 319322, 50116, 589911, 695053, 204848, 255328, -127590, 462525, 197701, 484893, 312251, 625920, 446899, 371447, 293575, 469955, 255728, 471917, 236016, 354054, 550446, 438325, 310730, 246704, 379077, 384162, 136173, 417962, 283306, 317643, 130910, 196034, 602651, 341862, 347626, 169607, 102649, 107043, 224631, 329290, 474473, 464640, 312051, 430963, 318595, 40722, 725617, 27732, 358909, 483470, 366074, 416734, 135975, 365709, 172674, 127245, 62772, -1028, 117221, 631168, 314192, 288735, 85610, 156723, 438132, 236611, -46133]
13467A95895J01732I0892K74006j25055K28084A06626L19832A68485K69464r3800
13457C44149F8513M62726A31017K43573J27442B5182J59443Q3081j25366j9872
13447A22468K35456K45281j82328J02490B60375p3245J21352j09569K39757A38257
13436F5755f8293q9929B91686o8707J26328K5133a17319A31345J86210A26816
13425C59521a20263A33481J46553a13909D43440d4920I6541l370J18180J88323
13415C99674A39273j8794J13082J91418k9299N4162A03220J61151j9664A5101
13404i1261E3801K72281J72141i1176C06195c0233A84369D9201Q3036J80510J6455
13393C29202g297C78762k6836j75743K59568F3067L84567A99957p26a37560C40473
$$ y = [195895, 297627, 90892, 364898, 239843, 467927, 106626, 426458, 168485, 437949, 344149, 68513, 531239, 131017, 374590, 502032, 25182, 184625, 267706, 142340, 122468, 357924, 603205, 420877, 523367, 260375, 187130, 308482, 198913, 438670, 138257, 65755, -68293, -158222, 291686, 222979, 349307, 374440, -117319, 131345, 317555, 126816, 359521, -120263, 133481, 280034, -113909, 443440, -44920, 96541, 93171, 211351, 399674, 139273, 120479, 233561, 424979, 395680, 449842, 103220, 264371, 244707, 15101, -91261, 53801, 326082, 498223, -91176, 306195, -30233, 184369, 49201, 132237, 312747, 329202, -7297, 378762, 351926, 176183, 435751, 63067, 447634, 199957, 199231, -137560, 340473]
13381B24460R4260o1803A07494K22340J1042A58699p7021J67006Q3287j55762
13371A76209M78941j87970H5391c3742D59549A74238J02381b61819C14576A51441
13360a3223B60225l2454G3149L77163k10211D2880K45581l1025K18393A93803
13349C31498N6328J09967j00J53824A92607K20147K9088p3364A01302L91216r1434
13338D01084D3255J61134K75517a7643A16780J91161R0062L33086C51031A67099
13327E12962k31872K9296j1330p1599a1511l7982A57914k6336J38338j0313A24022
13315B88332K52873a05396B45237A00323J54817J4460J51797A40260Q358R8173
13305B46791J2399p2734f9332j55555C77075J25177k48466a2171H3382R4954n314
$$ y = [224460, 318720, 256917, 107494, 329834, 340876, 158699, 81678, 248684, 331971, 176209, 655150, 467180, 85391, -33742, 459549, 174238, 276619, -261819, 314576, 151441, -13223, 260225, 227771, 73149, 450312, 240101, 42880, 288461, 257436, 475829, 193803, 331498, 387826, 497793, 497693, 651517, 192607, 412754, 441842, 368478, 101302, 492518, 401084, 43255, 204389, 479906, -17643, 116780, 307941, 398003, 731089, 351031, 167099, 512962, 281090, 310386, 299056, 227457, -11511, -49493, 157914, 131578, 269916, 259603, 124022, 288332, 541205, -105396, 245237, 100323, 255140, 269600, 421397, 140260, 148618, 246791, 259190, 186456, -69332, -224887, 377075, 502252, 253786, -12171, 83382, 178336, 173022]
13294A73022c6015A58048L00910I0191L42844j92437m465C4683L33390j67726
13284B00347K0469L535c9096F8905K04549A17673K7533M7348L72218G1537Q3008
13273A54545K0580L0196a83325C01305m8328a09767C45586A37655N3761K47171
13263D38587d9330B97874m7343B8502L6712J96659J51845k9178A58092B5459k7
13252B5432K30949Q6554A43616n9991L91282B30818d1638C39916j10966a40716
13241B12970J49836j61094p2103a20979C71800A29573c08959B15472L5357I032
13230B25846D4291J62553R300B1339O6722e1909j42280C43312k1673H3279g4369
13218C54231j67392L03936B11763p7285K06020e5662B63898A08887J87933J56388
$$ y = [173022, -36015, 158048, 458958, 90191, 433035, 240598, 236133, 34683, 368073, 200347, 220816, 224351, -39096, 68905, 273454, 117673, 145206, 192554, 564772, 71537, 154545, 175125, 205321, -183325, 301305, 252977, -109767, 345586, 137655, 191416, 438587, -49330, 297874, 250531, 28502, 65214, 261873, 413718, 384540, 158092, 25459, 25432, 256381, 342935, 143616, 83625, 474907, 230818, -41638, 339916, 228950, -140716, 212970, 362806, 201712, 129609, -120979, 371800, 129573, -308959, 215472, 250829, 9032, 225846, 44291, 206844, 216144, 21339, 88061, -51909, -194189, 343312, 321639, 83279, -74369, 354231, 186839, 490775, 211763, 134478, 340498, -55662, 263898, 108887, 296820, 453208]
13208D53208b867A42306A234K35944K1589c6503A29055O9025K7276J00020H8119
13196A73505o8518e4990d800B25571A04937l7673f2655A7314K02971D3748J81186
13185B24934I0652J33808i2637A72513N3937Q8417j14595b3498A57011m9705L0149
13174A37455R567R402O0686G4224c3089H2471O3764Q1140J78113c1079o0121A11523
13161a46530A26464b5424G0569N1998P1976b2814B46828K27289E7419L21967a24790
13149A69745o8142K18809J4678C3913J20899J41827j03054j8982e5951l05979
13139c61930e8342C38427J8211G9413a36544j22267e51B13145C1804c34491c5274
13127A07740C7919e7117A26314B0642e6018j22511C4460d2304j41533d5557A31951
$$ y = [453208, -2867, 142306, 1234, 237178, 258767, -36503, 129055, 198080, 225356, 325376, 88119, 173505, 104987, -54990, -4800, 225571, 104937, 67264, -62655, 17314, 220285, 43748, 224934, 90652, 224460, -92637, 172513, 226450, 314867, 200272, -23498, 157011, 107306, 137455, 147022, 156424, 217110, 74224, -33089, 82471, 146235, 227375, 405488, -31079, -91200, 111523, -146530, 126464, -25424, 70569, 122567, 194543, -22814, 246828, 474117, 57419, 379386, -124790, 169745, 101603, 320412, 335090, 33913, 154812, 296639, 193585, 174603, -55951, -361930, -58342, 338427, 356638, 79413, -136544, -258811, -551, 213145, 31804, -334491, -35274, 107740, 37919, -57117, 126314, 20642, -56018, -178529, 34460, -42304, -183837, -45557, 131951]
13115B55374L1199J6063A20789C292K09098J55552E2987P2829M9390j4812p5004
13104H5390l3024d6394j25865F3600j44Q667Q1805e1173j42778a23C7542M8746
13092H6288J59501m7924e3609C05868N8506A36320n087a78871B67231r1975K18487
13081C93743A5855b9953j47689E42006a50944e6258B67377P5107j37801n2729
13071A51954J38722a69421G3019b56426A17195A4031R3549E0601J34566k5235
13061A59932l9020C6494c22716B13335J96104e9856A32116J47662j04318g7458
13050c2264E1881L4584a42045A04600M24232F4595k0537L8021C1280b14249E44305
13038E69576d3852n0363B88803K9013l0629Q9103g9269E1574D303J04961C1539
$$ y = [255374, 286573, 302636, 120789, 3292, 212390, 367942, 52987, 125816, 175206, 160394, 85390, 52366, -46394, -172259, 63600, 63456, 72123, 153928, -51173, -193951, -123, 37542, 86288, 245789, 197865, -53609, 305868, 364374, 136320, 131233, -178871, 267231, 175256, 393743, 15855, -29953, -177642, 542006, -150944, -56258, 267377, 342484, 204683, 151954, 290676, -169421, 73019, -256426, 117195, 14031, 107580, 50601, 185167, 159932, 120912, 36494, -322716, 213335, 409439, -59856, 132116, 279778, 175460, -77458, -32264, 51881, 86465, -142045, 104600, 528832, 64595, 44058, 82079, 31280, -214249, 544305, 569576, -43852, -94215, 288803, 317816, 287187, 376290, -79269, 51574, 4303, 109264, 31539]
13026A81775a9523B75739N9790E1712K00974d3465A82525J15608j29603h0587
13015C00365b4049j10081C3598K99829a16127D7050L38608j44846r3639C3942
13004I3525a46592A02338a57056A99103C7426j7370K53562j33988l3424l2971
12994G3235A2887J0472N044J59802l1724a4602B86445n6306c0147k88297A35491
12982B94682a65073m935C44554A38634J5664K1857B5832j2467K35b55413A00104
12970D07498C525M57858E8234J35714P7948j21352a37968A88284M1994a05332
12959H7954J60197I5274j9978a14721e4938j62695d6597A07359d1071E149a44634
12947f4793k27780e7783A84272a3583m2929B3976d65443e564C75562g5648m2510
$$ y = [181775, -19523, 275739, 335529, 51712, 252686, -43465, 182525, 298133, 168530, -80587, 300365, -24049, -134130, 33598, 333427, -116127, 47050, 385658, 240812, 147173, 33942, 93525, -146592, 102338, -157056, 199103, 37426, 20056, 273618, 139630, 106206, 73235, 12887, 23359, 28403, 188205, 156481, -14602, 286445, 230139, -30147, -318444, 135491, 294682, -165073, -170008, 344554, 138634, 154298, 176155, 25832, 13365, 13600, -255413, 100104, 407498, 3525, 461383, 58234, 193948, 271896, 150544, -137968, 188284, 230278, -105332, 87954, 248151, 95274, 75296, -114721, -54938, -217633, -46597, 107359, -41071, 5149, -144634, -64793, -292573, -57783, 184272, -13583, -56512, 23976, -465443, -5564, 375562, -75648, -118158]
12936a18158k8334C22217j14722E0279f0792C48673A23971E9713J64727l6034
12926A88406J4268Q5441g7701K4854C75855a01473p4259A22164a62083A2147c9778
12914I1623J97199f6918A02250P0739h9302D189a09898A25932J74979H5753K63743
12903C49496B3453J26936e5864o0619j05097C9138K90979a40749A23706R9255
12893B22961g4367j74988A94946B5577P0040c3938A49274l8217a40627j68243
12883c08870b0063A19193L6885J83576r1346p1942b07186e5298F38399E335f5526
12871D8268M9153h4678B14115m7929J08593j0052m3728a05210C01182H8815c01422
12859B3617M30125I2440M3011D1337K15770A3321K35347j9635c9655A73169C4385
$$ y = [-118158, -146492, 322217, 207495, 50279, -60792, 348673, 123971, 59713, 224440, 188406, 202674, 288115, -77701, -52847, 375855, -101473, -175732, 122164, -162083, 12147, -39778, 91623, 288822, -66918, 102250, 172989, -89302, 4189, -109898, 125932, 300911, 85753, 349496, 23453, 150389, -55864, -116483, -221580, 39138, 330117, -140749, 123706, 222961, -74367, -249355, 194946, 25577, 95617, -33938, 149274, 111057, -140627, -308870, -20063, 119193, 156078, 339654, 248308, 176366, -207186, -55298, 638399, 5335, -65526, 48268, 97421, -84678, 214115, 166186, 274779, 264727, 220999, -105210, 301182, 88815, -301422, 23617, 453742, 92440, 135451, 41337, 257107, 13321, 248668, 229033, -39655, 173169, 34385]
12847a84770A4518J64228j4144F8192M22731a50932A69557a06001C0079J48417
12837A78496J17362F677J03032b20295p7537B42750F9913O2011M42753k56315
12827C18362c29578E03231A67648a16511B28573Q2147h9395j11716g1727m2597
12817a14324M8016I9517P838A4088P422a25062m1857C21765I1631e4825A65033
12805B47642j13977C0708J99861I8358a22492j45054J08346n0316A50381p2237
12795G8144a1427C2444K90103g9941C11879c31622B56360A1437d3466C02725a67869
12783c0997A42746J20306B4631b44952h4591D7733B2433K03377p4547q518a6792
12771b78705h4431D35208F4598b28267A19383B5586J56811H4718a29792A67362
$$ y = [-184770, 14518, 178746, 164602, 68192, 490923, -150932, 169557, -106001, 30079, 178496, 295858, 6677, 109709, -220295, -297832, 242750, 69913, 131924, 574677, 318362, -329578, 503231, 167648, -116511, 228573, 310720, -89395, -201111, -71727, -114324, -66308, 99517, 107355, 14088, 21510, -125062, -166919, 321765, 91631, -54825, 165033, 247642, 133665, 30708, 230569, 98358, -122492, -267546, -159200, -209516, 150381, 78144, -11427, 32444, 322547, -79941, 311879, -331622, 256360, 11437, -43466, 302725, -167869, -30997, 142746, 263052, 24631, -244952, -84591, 47733, 22433, 225810, 151263, 142745, -16792, -278705, -84431, 435208, 64598, -228267, 119383, 25586, 182397, 84718, -129792, 167362]
12760a45217I8162a16254j06440o2385A15645k0283b71022a6681o0694j80798
12750b58173B20851C6499J11207p043b30872J5566B064a26355P102b9267A67859
12738B4349f8517C86914j73987c59095J16018A56923a25317L5491C0917O6112
12728I7029b93091C6203J8345a93106B19540a88228Q544N3588A79419J21429a35729
12716b53005i0029D0433K25900J77896a11663D76075F6504J34522a1402D89692
12705B74331l7358p4996K9737M498K03810k978m4008I1882J261a50614A7038L54740
12693C71778j78627H686J06312a04630B00621M670b35528A45214D0693c3642A59627
12681A23456a59000A6177b42734A33898K39283C4426J5909P0618B9969K42564
$$ y = [-145217, 98162, -116254, -222694, -285079, 115645, 95362, -271022, -16681, -77375, -258173, 220851, 36499, 147706, 140663, -230872, -215306, 2064, -126355, -119253, -29267, 167859, 24349, -68517, 386914, 212927, -359095, -243077, 156923, -125317, -89826, 30917, 97029, -293091, 36203, 54548, -193106, 219540, -188228, -179684, -126096, 179419, 300848, -135729, -253005, -90029, 40433, 266333, 444229, -111663, 476075, 66504, 201026, -11402, 489692, 274331, 236973, 161977, 191714, 196212, 400022, 397044, 353036, 91882, 93143, -150614, 17038, 371778, 193151, 8686, 114998, -104630, 200621, 205291, -235528, 145214, 40693, -33642, 159627, 123456, -159000, 16177, -242734, 133898, 373181, 34426, 50335, 120953, 29969, 272533]
12671B72533p0635o106F1803h4066B87109h2344o7782K9606L897D25727a32596
12659B27984a81733A35603j401J71298A43813J5466P8023J67223j60598m6901
12649A97026I1448c9075B2000b50036A37761R0828R7551j18713p0502b03340R4782
12638a08558k9695B8887K5009C898L9386J43930a2325A18025a49703A86724P3295
12627B60019j6375J66170A90066K31587g1588E2468L37115A75615b07663D0790
12616A34832J11238b27594B42698F5700b03865E0349J85217r9758P9306q7142
12606A27972C1505d2842A92955q0025J24469R5553A01999e8725C06536m8121E3014
12594i9017D4368k1938K76756b69267B38154n5226P9461h0357C24249E7475J91603
$$ y = [272533, 201898, 195792, 61803, -84066, 287109, -82344, -150126, -120520, -116623, 425727, -132596, 227984, -181733, 135603, 134202, 305500, 143813, 159279, 237302, 404525, 243927, 197026, 91448, -39075, 22000, -250036, 137761, 228589, 326140, 207427, 136925, -203340, -108558, -138253, 28887, 53896, 3898, 43284, 187214, -12325, 118025, -149703, 186724, 260019, 243644, 409814, 190066, 421653, -71588, 52468, 389583, 175615, -207663, 40790, 134832, 246070, -227594, 242698, 65700, -203865, 50349, 235566, 135808, 215114, 127972, 31505, -42842, 192955, 112930, 237399, 332952, 101999, -58725, 306536, 258415, 53014, -99017, 44368, 22430, 299186, -269267, 238154, 182928, 262389, -80357, 324249, 57475, 249078]
12583B49078J68353b03198A43431N629K16D9162K96694m2500e8626b6656k8000
12572e4656k30232i76n5196A62533a14591k5004m038A84761G0087a58185M7976
12561a10209A6634a60184M9659A92079b32283A50412H166b34605i2721j80014
12551b72735G2584A7296e987C59940A45188b44357n128e9322A01070j7803a59386
12539A14842i3151l52461i5654B06606p816a17412A69638o1480i4160j02652C00551
12527a43484A09802C6429b0133A12165K21361c2381m6123r5822a5101j33657C01291
12515A86815i3478H3552B3391P8974J88283J51925A1582P9404a2630B95493R1797
12504C87290i3762c2109F6725k3066f5558G1701K26361c16484f6351A92778D5786
$$ y = [249078, 417431, -203198, 143431, 149060, 149276, 49162, 345856, 303356, -58626, -26656, -54656, -284888, -976, -56172, 162533, -114591, -139595, -143633, 184761, 70087, -158185, -110209, 16634, -160184, -110525, 192079, -232283, 150412, 8166, -234605, -92721, -272735, 72584, 17296, -5987, 359940, 145188, -244357, -249485, -59322, 101070, 83267, -159386, 114842, -93151, -445612, -95654, 206606, 198790, -117412, 169638, 108158, -94160, -196812, 300551, -143484, 109802, 36429, -20133, 112165, 333526, -32381, -78504, -174326, -15101, -148758, 301291, 186815, -93478, 83552, 23391, 102365, 290648, 442573, 11582, 90986, -12630, 295493, 387290, -93762, -32109, 66725, 43659, -65558, 71701, 298062, -316484, -66351, 192778, 45786]
12492C14199B4404N57286i0340e827q2752m2901j16075C91125K3961a39353A45627
12480A37656L3393j5188M11621e8672n8369C86623A00996g07m39j07225d5031
12468B30410a69451I8226N9983a85673k12872B70813b84330J28686B36141A08021
12457B85237a59611p43A30373a1144j86290A88833a21215j78570I9476a31216
12446A70223e2698B65671r4846d23616F7775b6957C03773b02960H9082b95348
12435a5543D2518L739J05194p2511a82258g9218A06064j3260K1583D246K30484
12424B34730c55316B60230f5033A48252D1440O5J6142c1934A2104a3558j89658
12413b03216h2041A45249a97796A45617A9853c28124g5390B16856o2958b2900
$$ y = [314199, 24404, 581690, -90340, -5827, -88579, -131480, -247555, 391125, 415086, -139353, 145627, 137656, 171049, 155861, 567482, -58672, -117041, 386623, 100996, -707, -1146, -108371, -45031, 230410, -169451, 98226, 158209, -185673, -398545, 270813, -284330, -155644, 236141, 108021, 285237, -159611, -160354, 130373, -11144, -197434, 188833, -121215, -299785, 99476, -131216, 170223, -52698, 265671, 170825, -423616, 67775, -26957, 303773, -202960, 89082, -295348, -15543, 42518, 46257, 151451, 78940, -182258, -79218, 106064, 92804, 114387, 4246, 234730, -355316, 260230, -65033, 148252, 41440, 41505, 57647, -31934, 12104, -13558, -203216, -82041, 145249, -197796, 145617, 19853, -328124, -75390, 216856, 153898, -22900]
12402a96081k39907f0600K1964k54490A98576b4503Q416F0735a71314j50750A54841
12390a3530A6854J60627b05522C76040a82567f8605G7144Q9170E3535j9468P441
12379D1508J62960R8834b05403A16124e4482e71m30452a1393D4663P7207e7377
12367C83547a8277p2085l70974F7396d0192q2319B03505a27796F0a69146B71703
12355h2262I532a54772g5638A52828b6074I6355A5782f0411A00528D2082L78823
12344D20905d3067C99774j45366a59028C46613H8201B6843J35113A9647b71658
12333e2642l4812g544C471J27403I933R2491c52659A03003j0299K13728a5139
12321B24071J97906k04572K469k0042O1543C4375A5908Q5042j8893m0668a27025
$$ y = [-196081, -435988, -60600, -38636, -293126, 198576, -24503, -16087, 60735, -171314, -322064, 154841, -13530, 16854, 177481, -205522, 376040, -182567, -68605, 77144, 166314, 53535, 34067, 41508, 204468, 303302, -205403, 116124, -54482, -571, -431023, -11393, 44663, 121870, -57377, 383547, -18277, -90362, -461336, 67396, -40192, -122511, 203505, -127796, 60, -169146, 271703, -82262, 9532, -154772, -75638, 152828, -26074, 96355, 15782, -60411, 100528, 42082, 420905, -43067, 399774, 254408, -159028, 346613, 88201, 26843, 161956, 19647, -271658, -52642, -87454, -7544, 3471, 130874, 9933, 102424, -352659, 103003, 92704, 306432, -15139, 224071, 421977, 217405, 219874, 199832, 261375, 34375, 15908, 100950, 82057, 41389, -127025]
12309c17046B61171a1922A60936A9936C051L7094L13319i1418D4374A1749K32674
12298B44423B9578L76176j73368a97416A80107b64678C32771h4832A8179d07664
12287I3127K7755C1017D669O8176K44250l5904h2766A25138e0698D628J02935
12276A07563e5071A99263J8457j6517F9838J04497c645B05700b51682E9209a37312
12264c84807B22242H3204B9859J51187m5183m1116N7179c87266a70308g9219G6247
12252E2849b42335D55553B10420R9847D088J33679O7720B6063J97405H1195A4787
12240g0708A68237l7734a1737F1330J48789d6795C2641a11435F0607K1550K9658
12229A11815J9289m5352E454K97844A44129J78501a34259A89076I2646J29266
$$ y = [-317046, 261171, -11922, 160936, 19936, 3051, 40145, 353464, -91418, 44374, 11749, 244423, 29578, 405754, 232386, -197416, 180107, -264678, 332771, -84832, 18179, -407664, 93127, 120882, 31017, 4669, 72845, 317095, 281191, -82766, 125138, -50698, 4628, 107563, -55071, 199263, 217720, 201203, 69838, 174335, -3645, 205700, -251682, 59209, -137312, -384807, 222242, 83204, 29859, 181046, 135863, 94747, 151926, -387266, -170308, -79219, 76247, 52849, -242335, 455553, 210420, 310267, 4088, 137767, 205487, 26063, 223468, 81195, 14787, -70708, 168237, 130503, -11737, 61330, 210119, -46795, 32641, -111435, 60607, 82157, 111815, 131104, 85752, 5454, 303298, 144129, 322630, -134259, 189076, 92646, 221912]
12219B21912l8503k4723O5157a6218A64606a35587F317K25080M5659G9150k6119
12208E3031K89544F2647K38759A36599L7150f2262B16465a35728A40933M2106
12198A83039J9102J29681j24953F3794K23997a3725G0476d9444K3929C99384r0019
12187C09365m2658O8270m1683J11391p4751m3635q4049J08642C0972K30250j20417
12176A40805K56764G8635J18320R6788N1209K1057G9045L53883B06130j01158
12166A04972r77k0495l2410O8002J47325m7175p9012O0206a61113B41880E5381
12154d0949k29024A57379D9138A6893J00745C7653b51479C90385H5087L40392
12144D25479A51404k1533f3255C866K76490A1931J6410K45536H508a74718A08079
$$ y = [221912, 183409, 158686, 223843, -16218, 164606, -135587, 6317, 231397, 277056, 79150, 53031, 342575, 62647, 301406, 136599, 173749, -62262, 216465, -135728, 140933, 183039, 202141, 331822, 206869, 63794, 287791, -13725, 70476, -49444, -25515, 399384, 309365, 266707, 334977, 293294, 404685, 329934, 286299, 202250, 310892, 30972, 261222, 140805, 397569, 78635, 196955, 293743, 344952, 366009, 79045, 432928, 206130, 104972, 103995, 83500, 51090, 119092, 266417, 219242, 140230, 200436, -161113, 241880, 55381, -40949, -269973, 157379, 49138, 16893, 117638, 37653, -251479, 390385, 85087, 425479, 151404, 129871, -63255, 3866, 280356, 11931, 28341, 273877, 8508, -174718, 108079]
12132F4864a0543A24121A8612K59865b38272i9582H3131J86951J05254c09418
12121B72875B7760e766I5452o629b29662G4736k5957J56052b32627L3647C1925
12109a53488p5270h8809j34425B08401a83274A64977b76910h022k58711O9193
12099a97540B27726d37650b07653A45965a44953n2107H9107h0171q8758e8611
12088B6542b19120P1458r8979A3574J18307l4629R0779m5254c88287J84781j3283
12077b16789C8166a45088c7712B85505a99850d52B10626L40998P08987l0457D51877
12065B25119D368J98798m5966o2375f8628a6624C03662J3602A1993a10679j1850
12054a22529d1196A50386g5134B87472a6548A3935L43067F2030J26999a54827
$$ y = [64864, -10543, 124121, 18612, 278477, -238272, -99582, 83131, 270082, 375336, -309418, 272875, 27760, -5766, 95452, 88823, -229662, 74736, 48779, 204831, -232627, -198980, 31925, -153488, -228758, -88809, -223234, 208401, -183274, 164977, -276910, -8022, -266733, -197540, 227726, -437650, -207653, 145965, -144953, -197060, 89107, -80171, -168929, -58611, 26542, -219120, -147662, -246641, 13574, 131881, 97252, 188031, 142777, -388287, -203506, -216789, 38166, -145088, -37712, 285505, -199850, -452, 210626, 551624, 1260611, 1230154, 451877, 225119, 4368, 203166, 157200, 94825, -68628, -16624, 303662, 317264, 11993, -110679, -122529, -41196, 150386, -75134, 287472, -16548, 13935, 357002, 62030, 189029, -154827]
12043B35141a81682A46691b42458B28873Q4593K7359c8560B50473j625a99036
12032D8080J80613A06460O6870k6921a31405b8397E9655i8597J7150j8366R910
12021h9903A90186c85781A88011r2018d55024A45395R2926d9570C38072D2628
12010B54939a2345B51746j02080a4792C56948c13405G4090k147O6275p633e3874
11998B44598j7752a27470a2543F1522a19432A18677a88786G6983a86589A2996
11987a43016A83449i6272o760j16312C3293a84377p5475K0472C1699a7909p8838
11976i6747j71239A20000b51555n7048A7322a79286Q1943I1363j4735e4631B14937
11964a30157c9059q5630j9077A11816E5234a61624d4955B48008M4368C3170L18014
$$ y = [235141, -181682, 146691, -242458, 228873, 313466, 340825, -38560, 250473, 248848, -199036, 48080, 228693, 106460, 173330, 146409, -131405, -28397, 59655, -98597, -81447, -99813, -89903, 190186, -385781, 188011, 95993, -455024, 145395, 238321, -49570, 338072, 42628, 254939, -12345, 251746, 149666, -14792, 356948, -313405, 74090, 71943, 138218, 130585, -53874, 244598, 226846, -127470, -12543, 61522, -119432, 118677, -188786, 76983, -186589, 12996, -143016, 183449, -96272, -103032, -219344, 33293, -184377, -259852, -239380, 31699, -17909, -96747, -267986, 120000, -251555, -308603, 17322, -179286, -97343, 91363, 76628, -54631, 214937, -130157, -39059, -124689, -143766, 111816, 55234, -161624, -44955, 248008, 292376, 33170, 351184]
11953C51184A56730J30042f8072n9288b516j49307H2698C0968J70096j00497a76376
11941c4682k1406k41965D7123d1586k1524p3742M9047C5905b0370A4850a57838
11929i9395j25266N5095A66880f8320C35835a71104P9306A51497l7829K21957
11919C35625d5764A04618c07843H2714A5590a19098n5521l8626d8506A84825N2848
11908B37673a26748C45225b87942c2902C24746a52915k62305a95576e2821n2961
11898a05782M3626A16245a82504a8901l8464l35598i7396C759f6351J330B3118
11886a78008H3430c00241Q2542B28672p5453C9358a58356e1388A21511a8131J199
11875a6932k14049J10359C01549a6767q6580D5706A7243b1311m3606r7293F7802
$$ y = [351184, 156730, 286772, -68072, -127360, -2516, -151823, 82698, 30968, 201064, 100567, -176376, -34682, -56088, -298053, 47123, -41586, -63110, -136852, -87805, 35905, -20370, 14850, -157838, -99395, -224661, -169566, 166880, -68320, 335835, -171104, -91798, 151497, 113668, 335625, -45764, 104618, -307843, 82714, 15590, -119098, -174619, -213245, -48506, 184825, 237673, -126748, 345225, -287942, -32902, 324746, -152915, -415220, -195576, -52821, -105782, -62156, 116245, -182504, -18901, -57365, -392963, -97396, 3759, -66351, -65021, 23118, -178008, 83430, -300241, -217699, 228672, 153219, 39358, -158356, -51388, 121511, -18131, -16932, -230981, -120622, 301549, -16767, -103347, 45706, 17243, -21311, -64917, -162210, 67802]
11863F9054K8680K9167m5526R380K4593a06808B95315c2334B94112I9255B5438
11851F378e3304G3781f3355F0511a3043l39237A03684b01988Q465A57145b5634
11839a15310B68137c7665G6667b18041M6938L2709A05893J03585F1273e211j13438
11828a18649D5590M605a13133A26014P1088o9363g1371j27398A97147H4515J31053
11817B15568B2899K20412p2818R2611G1236a95205R0955H0222e1500A07420o550
11806A00870i3649A56430b63693a12847D9189e6041A83743b60557J02192C315
11795b27195o5398H3708g396r4476A60511a65120k16467a21986b4388A11069b00330
11783b9333a0187k8619q6533j94596F8182b74084a16692H4750b449j97759j09318
$$ y = [69054, 97734, 126901, 81375, 90755, 115348, -106808, 295315, -32334, 294112, 99255, 25438, 6378, -53304, 73781, -63355, 60511, -13043, -352280, 103684, -201988, -193523, 157145, -25634, -115310, 268137, -37665, 76667, -218041, -171103, -138394, 105893, 209478, 61273, -5211, -118649, 45590, 50195, -113133, 126014, 197102, 127739, -71371, -198769, 197147, 84515, 215568, 22899, 243311, 170493, 263104, 71236, -195205, -104250, 80222, -51500, 107420, 100870, -93649, 156430, -263693, -112847, 49189, -56041, 183743, -260557, -158365, 3315, -227195, -292593, 83708, -7396, -101872, 160511, -165120, -381587, -121986, -24388, 111069, -200330, -29333, -10187, -38806, -125339, -319935, 68182, -274084, -116692, 84750, -2449, -200208, -309526]
11772c09526E9616N1398O9416p8996J0878P1405l985C6605a01587c8884l19268
11761c58152b2248E3024a83113J3365k62180A09826C4333J2388N2668c14906H134
11749A1914a38721A10466N8771d6164n2937A21569a29642b9698A42893a363I4626
11737I8343K25283A27466a78510H770c13037B75903F9726L3215d04771D1923e270
11725A89687e09751A07216j9553g7773B08842f35585b99819A52699C2900b4438
11714a32961P26K4354F6326a58177D3669l534L44655b05479R7440B58802d8576
11702C84145A13155E5952J03094l5918c3881D3693R4508c5588A05122f9624B11301
11690B13409l9751J13653j8561J76350c2302C56143b57830A13436Q8768H7617
$$ y = [-309526, 59616, 111014, 180430, 101434, 112312, 183717, 179732, 36605, -101587, -38884, -358152, -22248, 53024, -183113, -169748, -431928, 109826, 34333, 46721, 99389, -314906, 8134, 11914, -138721, 110466, 169237, -46164, -99101, 121569, -129642, -29698, 142893, -1363, 94626, 98343, 323626, 127466, -178510, 8770, -313037, 275903, 69726, 102941, -404771, 41923, -5270, 189687, -509751, 107216, 87663, -77773, 208842, -635585, -299819, 152699, 32900, -24438, -132961, -132235, -107881, 66326, -158177, 43669, 40135, 384790, -205479, -108039, 258802, -48576, 384145, 113155, 55952, 159046, 123128, -33881, 43693, 138201, -35588, 105122, -69624, 211301, 213409, 173658, 287311, 268750, 445100, -32302, 356143, -257830, 113436, 202204, 87617]
11679c21553a52313C21337a45261F4297a2781k91467C99751A71543j6895n4818
11669I9830J35340A9575b31324A77745a00427B14438J6175b5490J1231k45544
11659b59803A50117R7068p8463b31433N0190B06814b0675B3204J02176b8269l4041
11648f2310A97892h8269D4667J5629N0446a24470A6595b5776A78809O0783g272
11636a7713k5493C71267J05342A89526F0966b6796m8167A58773j5329J91911A22427
11624B97340J93793A0924R2874l1543c83037A91811J08070A0516R3176c5636G6940
11612c20563G24M8165A0920K51730A1633c7952A8811c6910m1460I6208A2633N2616
11600F5249h7392I775a69081A40533J95326a65769P1778A78692G834f0755A82427
$$ y = [-321553, -152313, 321337, -145261, 64297, -12781, -304248, 399751, 171543, 154648, 99830, 235170, 19575, -231324, 177745, -100427, 214438, 230613, -25490, -14259, -259803, 150117, 247185, 168722, -231433, -181243, 206814, -20675, 23204, 125380, -28269, -62310, 197892, -88269, 44667, 60296, 110742, -124470, 16595, -25776, 178809, 239592, -7272, -17713, -43206, 371267, 476609, 189526, 60966, -26796, -74963, 158773, 143444, 335355, 122427, 297340, 491133, 10924, 103798, 72255, -383037, 191811, 299881, 10516, 103692, -35636, 76940, -320563, 724, 48889, 10920, 262650, 11633, -37952, 18811, -36910, -78370, 96208, 12633, 65249, -87392, 9775, -169081, 140533, 335859, -165769, -93991, 178692, 7834, -60755, 182427]
11588b49809C18064A48356P7495C5147Q7944P249R2344p2462J38677i4694q7568
11577a82262C9207a4964C48293j28570c16019C32274j58427M1557b66082D08881
11566C5134N9029g7640A76302k4522a23876J9367M1893l5772r2031A92860n9343
11555A33517M3537b03083F2180J39674J02823A50985K83173g5287J7946k22476
11545b79817f349k5796q8626J2548B50290D106a68198O9597A09769K13168b975
11533i246E7471P4198e4336o5379A61674a5219C38758I8696O9593f2251C09948
11521C48362c25963G1198C0277K36417A30791D3112J46174L72612f1040j18278
11511a79318E9293b7632A34781L8984O7810j18429M96256k74640p4691c46178
$$ y = [-249809, 318064, 148356, 225851, 35147, 123091, 130340, 222684, 150222, 288899, -94694, -182262, 39207, -14964, 348293, 219723, -316019, 332274, 173847, 215404, -266082, 408881, 35134, 94163, -77640, 176302, 151780, -123876, -104509, -62616, -98388, -190419, 192860, 133517, 177054, -203083, 62180, 201854, 304677, 150985, 434158, -75287, -57341, -279817, -6349, -32145, -120771, -108223, 250290, 4106, -168198, -98601, 109769, 322937, -2975, -9246, 57471, 131669, -54336, -119715, 161674, -15219, 338758, 98696, 168289, -62251, 309948, 348362, -325963, 71198, 30277, 266694, 130791, 43112, 189286, 561898, -61040, -179318, 59293, -27632, 134781, 173765, 241575, 123146, 619402, 344762, 270071, -346178]
11500a17251A62430F6299N41599B31460K6387i3254c5256a7098A80244p431C7223
11488D05243j03586E2744c0119G48636A08162K275P212P5603g5575C50419j22038
11477B28381M0723N149J66048j11548D0232P5784L60287I7953J77110K26716B26984
11465A10537C530J97099D5262d8510C70818g1286B44405K7818o2785A03908b21557
11453a61183k18042B33156M425q6567j7352c2617A74813N9277l1213J3288N6026
11442B72191f529j56046E1594J29104E0963K60970b38463A86761J97757j76869
11432B07649C2359f244C6496c77166C53223j61831j9630A3775N4143a06052H5646
11420B31054o4646b00139A61040J88913A59031a51093k45460J09986g6397j29345
$$ y = [-117251, 162430, 66299, 607898, 231460, 257847, -93254, -35256, -17098, 180244, 172813, 37223, 405243, 301657, 52744, -30119, 748636, 108162, 110437, 117649, 193252, -75575, 350419, 228381, 269104, 274253, 440301, 328753, 40232, 116016, 476303, 97953, 275063, 501779, 226984, 110537, 3530, 200629, 45262, -48510, 370818, -71286, 244405, 272223, 209438, 103908, -221557, -161183, -379225, 233156, 237581, 151014, 133662, -32617, 174813, 234090, 202877, 216165, 272191, -6529, -162575, 51594, 180698, 50963, 311933, -238463, 186761, 384518, 207649, 32359, -6244, 36496, -377166, 353223, 191392, 171762, 13775, 67918, -106052, 85646, 231054, 166408, -200139, 161040, 349953, 159031, -151093, -396553, -286567, -76397, -205742]
11410b05742H8140a12085E06199b83594a35884f5130A36348N706P7006l4771E7648
11398A77522f9513a1461B69051k4934F0265K34464c90910i5600A29239h6035k21815
11387c07850A29708d4338A04846J49353a20845I1735b4312B4712a35794A32345
11376a20396B36861n0737C0582L16604b66926h8416l7133A68146J87469b33400
11365B9342a68879p645A12122d6683j85423K9962A59063d7706j32922A45699b60428
11353I3711a75781a6522k89218A28180A7705a70919h4077j62340G2733K07089
11343B79822A11350f0748A37594L0416h1415j59252B7977J82434o9650a40614
11332A27753K02890b70947g984B2792J9545c03462B22494D4248a78122c5087A49250
$$ y = [-205742, 88140, -112085, 506199, -283594, -135884, -65130, 136348, 142054, 219060, 184289, 57648, 177522, -69513, -11461, 269051, 244117, 60265, 294729, -390910, -95600, 129239, -86035, -307850, 129708, -44338, 104846, 254199, -120845, 91735, -24312, 24712, -135794, 132345, -120396, 236861, 186124, 30582, 347186, -266926, -88416, -125549, 168146, 355615, -233400, 29342, -168879, -176524, 112122, -46683, -232106, -202144, 159063, -47706, -180628, 145699, -260428, 93711, -175781, -16522, -305740, 128180, 17705, -170919, -84077, -246417, 72733, 279822, 111350, -60748, 137594, 168010, -81415, -240667, 27977, 210411, 140761, -140614, 127753, 330643, -270947, -7984, 22792, 42337, -303462, 222494, 44248, -178122, -35087, 149250]
11320A41202o219F537a21812j20964D3703a38661L0742I0868a46253G4012a44321
11308C2064f3554A4390R634b52447p5931L2070c7947A57774f9977j15273I1250
11296c9166k09244c3387e885j36750j63311B78513a14710A67565b3629k64852
11286b88481K1934P7224b864m84389B25305C5856K5490b68548k9777A27337m8628
11275G8709B6630K408c38529J29177g5884l6969B04358k6462p2660P3955b6992
11263H8422a72204f7496j52970Q659q3774l1796Q7194B00750A020J23987A4732
11251d25836A15890c55137A0416O1493J51921b01207g575C65031A07530b13619
11240I7978K34418A29289h2566j45380O4430j68739J08916B78980A8192a84845
$$ y = [141202, 134983, 6537, -121812, -242776, 43703, -138661, -107919, 90868, -146253, 74012, -144321, 32064, -63554, 14390, 24024, -252447, -328378, -296308, -37947, 157774, -69977, -185250, 91250, -39166, -248410, -33387, -5885, -142635, -305946, 278513, -114710, 167565, -23629, -288481, -266547, -189323, -2864, -487253, 225305, 35856, 61346, -268548, -298325, 127337, 78709, 26630, 29038, -338529, -209352, -75884, -112853, 204358, 177896, 105236, 179191, -26992, 88422, -172204, -67496, -220466, -211807, -295581, -327377, -240183, 200750, 1020, 125007, 14732, -425836, 115890, -355137, 10416, 71909, 223830, -201207, -7575, 365031, 107530, -213619, 97978, 332396, 129289, -82566, -227946, -163516, -332255, -223339, 278980, 18192, -184845]
11229H7535L1706a20580o7269e8647A18124d14833a17339A03535f0514C5664J15445
11218A51109F845K626c54471M0223I9618c2535A65441K3329a72718A39163E8376
11206F3621i9119j83416J33265p921B66290b32568A05067a9212B7593a64787p6674
11195b41461b5955C6940a78582h8381p5413B46089b24843i2180A92364E5363a17901
11183b25217A3290K04255M2178b73607P6084B07641f0512p644m4579q5824M5728
11172a52831A58747E5993c70186H2054e2912j50887h9230K4559m4477A67212n2792
11161A14420C3738a83j16157b6229A744J724c7594B1113a81123o4351h4676B4625
11148g229o7490A26821j9845d1359J2082A89786c64544D15500a40309B18500P5597
$$ y = [87535, 119241, -120580, -187849, -58647, 118124, -414833, -117339, 103535, -60514, 35664, 151109, 6845, 9471, -354471, -314248, 99618, -32535, 165441, 188770, -172718, 139163, 58376, 63621, -99119, -282535, -149270, -157191, 266290, -232568, 105067, -19212, 27593, -164787, -241461, -25955, 36940, -178582, -88381, -163794, 246089, -224843, -92180, 192364, 55363, -117901, -225217, 13290, 217545, 259723, -273607, -197523, 207641, -60512, -68156, -112735, -198559, -152831, 158747, 55993, -370186, 82054, -52912, -203799, -89230, -64671, -109148, 167212, 114420, 33738, -183, -116340, -26229, 1744, 3468, -37594, 21113, -181123, -245474, -84676, 24625, -7229, -74719, 126821, 106976, -41359, -29277, 189786, -364544, 415500, -140309, 218500, 294097]
11137B94097a32781F4579B0393K80231b0522p7246A9425d809A41771i5658A30308
11125a1811A61797K14492a9201B67159e1601j48869A90873F0672J21172a95492
11114B50930e2609o8933B02635J4372J11135G6531K11605f8498A82301O1193A01023
11102A54770D1534N4771J44486P1167A8001J74692H0087c2801A5035L14182c1183
11090A46097J03945a0557A22231D4058L05109o9251J07240j7543Q3752p9452F6646
11078B02846c30196E03136A03463J35038o6778a22255E37389j42568K04131j77901
11068D21051A51784J02497J67585K77939p3286J34878k80776B21864j5502M51112
11058F57474l07995M05443l11085J89448C08032M38073k74849K47536K24597j19992
$$ y = [294097, -132781, 64579, 20393, 300624, -20522, -97768, 19425, -4809, 141771, -95658, 130308, -11811, 161797, 376289, -19201, 267159, -51601, -200470, 190873, 60672, 181844, -195492, 250930, -52609, -121542, 202635, 217007, 328142, 76531, 288136, -68498, 182301, 243494, 101023, 154770, 41534, 96305, 240791, 311958, 18001, 192693, 80087, -32801, 15035, 329217, -31183, 146097, 250042, -10557, 122231, 44058, 349167, 279916, 387156, 369613, 453365, 373913, 66646, 202846, -330196, 503136, 103463, 238501, 171723, -122255, 537389, 394821, 598952, 421051, 151784, 254281, 421866, 699805, 626519, 761397, 480621, 221864, 206362, 657474, 349479, 754922, 443837, 633285, 308032, 746105, 471256, 718792, 943389, 823397]
11048H23397K37443l83586J97302j51232J07215J9353k96752j24291J4701M37643
11038H81193j67730l30268R2458K77693J28513j30934N2127q357k06055k9904
11028E58736K84263K5757j80782J53729l27248J14622J75748K36581D88438J19207
11018F07645N1278p86J10574n3385j41887J6136K70419D13081M04195k97252J53977
11007F74001o0267k85009K12021J42659k8073K27354r2692j47764j8842M84700
10997A108088m96122m0895J09071K4019K13175L3513K4818k48953j90730Q32941
10987A368925l62804P9721K54626l60280L07591q7575Q2427O8470j85200M15724
10977A581625K64983J16032L99335K03464m545K32354k4899K99009l99052L5248
$$ y = [823397, 1060840, 677254, 874556, 723324, 830539, 849892, 553140, 428849, 443550, 881193, 713463, 383195, 475653, 753346, 881859, 750925, 803052, 794695, 588640, 558736, 842999, 868756, 687974, 841703, 514455, 629077, 804825, 1041406, 488438, 607645, 658923, 658137, 768711, 715326, 573439, 589575, 859994, 413081, 817276, 520024, 674001, 613734, 328725, 540746, 683405, 655332, 882686, 789994, 642230, 623388, 1108088, 611966, 571071, 680142, 704161, 917336, 950849, 975667, 726714, 535984, 1368925, 1006121, 1085842, 1340468, 980188, 1287779, 1200204, 1282631, 1351101, 1165901, 1581625, 1846608, 1962640, 2361975, 2565439, 2560894, 2793248, 2768349, 3067358, 2668306, 2703554]
10967B703554m32971M4132m69843L81915q4889l9704j81501J75692J44458n29024
10957A711819K08525m21523K96457k43905k8864q9849l77321m57393K79493j05205
10947G72234k72351O1213B24114J77070j36035N885J17814m8299m350P1538Q5834
10936D93571a24182B8528L39721j30241K49738d4504I46J4521d1350C02495p0445
10925B32050H4650K71348o980j26373J43746H1255f3597n63653i0905r5356f4877
10913a92501D5890b5944C9198J4260c8277l64363g6718l10402i6492A76775f9594
10901B23024I9314c87173f1790B20696I6985a17234j00014J00751F9795e4559
10890b94560C53687g7939E1105J06581M7933G4480e58287a26126O1825j37201
$$ y = [2703554, 2270583, 2314715, 1844872, 2226787, 2141898, 2102194, 1920693, 2096385, 2240843, 1711819, 1920344, 1498821, 1795278, 1551373, 1522509, 1432660, 1055339, 597946, 877439, 772234, 499883, 561096, 224114, 401184, 265149, 271034, 388848, 340549, 336199, 407737, 493571, -124182, 28528, 368249, 238008, 487746, -44504, 946, 15467, -41350, 302495, 232050, 84650, 355998, 349018, 222645, 366391, 81255, -63597, -627250, -90905, -186261, -64877, -192501, 45890, -25944, 39198, 53458, -38277, -402640, -76718, -387120, -96492, 176775, -69594, 223024, 99314, -387173, -61790, 220696, 96985, -117234, -217248, -116497, 69795, -54559, -294560, 353687, -77939, 51105, 157686, 205619, 74480, -558287, -126126, -64301, -201502]
10880b01502e1311B31817i4554n63280B72476m8021a50721P5084j54979c624A0033
10868A77338L8985i3483R989B5643K52653b55987A32632g5107B80881b44435F0231
10856A75020f3170K4043F2408M9754D6964J66063D672M4866d28485a41311n6249
10845a97560i5966J3867A52038a97429O4993H1272R8925A6490M6137b5405k66916
10834b92321c6125i087C089J80281b53460C3069j5702L05416c2374B60519b9511
10822a36029j27217m5020a1550q611A76148a73686M1417c2525C19024a03541A89128
10810a58730j90829D4389J07948a42049b6877Q320n8083j15285B73899p548a6123
10798b89683B47873h5373j10105B2074b43179a0697q8499K5556H3657c4245k44332
$$ y = [-201502, -51311, 231817, -94554, -657834, 272476, 224455, -150721, -75637, -230616, -3624, 10033, 177338, 216323, -93483, -83494, 25643, 278296, -255987, 132632, -75107, 280881, -244435, 60231, 175020, -63170, -39127, 62408, 112162, 46964, 213027, 4672, 49538, -428485, -141311, -197560, -95966, -82099, 152038, -197429, -132436, 81272, 180197, 16490, 62627, -25405, -292321, -36125, -9087, 3089, 183370, -253460, 33069, 17367, 322783, -32374, 260519, -29511, -136029, -263246, -308266, -11550, -20161, 176148, -173686, -132269, -32525, 319024, -103541, 189128, -158730, -349559, 44389, 152337, -142049, -26877, -18557, -76640, -191925, 273899, 266351, -16123, -289683, 247873, -85373, -195478, 22074, -243179, -10697, -99196, -73640, 83657, -34245, -278577]
10787b78577G2793i8661H219L80307A77839c3485A54176a31314B01783e5393a2674
10775b34448C780P9172J43856r2578b44248O722I4404b14599F8816K03802d6264
10763A84790b50310F5021N6487i5050J5811D3344d8293k22983I1019a40500L0801
10752a09699B05654a68007A21739p463j9442b08917C771a81222A57834E1175c31200
10740F4742a48557f5979k09876C305K9666K17721e1100k39272C8954e8372k16136
10729b74508I0491L4654l9684J91669E094b13176A18004c65182a81121C3254e0295
10717a8503j07202c4528j03488B33019l7817d3790E0973B4679b66067P9754j03749
10706b90062A56615o789k8429i6649B509J03461e0432l74932A24823d37777Q1912
$$ y = [-278577, 72793, -98661, 8219, 388526, 177839, -33485, 154176, -131314, 201783, -55393, -12674, -234448, 3780, 82952, 226808, 134230, -244248, -237526, 94404, -214599, 68816, 272618, -46264, 184790, -250310, 65021, 121508, -95050, -79239, 43344, -48293, -271276, 91019, -140500, -109699, 205654, -168007, 121739, 114276, 94834, -208917, 3771, -181222, 157834, 51175, -331200, 64742, -148557, -65979, -275855, 3305, 32971, 250692, -51100, -290372, 38954, -58372, -274508, 90491, 125145, 85461, 277130, 5094, -213176, 118004, -365182, -181121, 33254, -50295, -18503, -125705, -34528, -138016, 233019, 195202, -43790, 50973, 24679, -266067, -186313, -290062, 156615, 149826, 121397, -96649, 2509, 105970, -50432, -425364, 124823, -437777, -355865]
10695c55865J23096H6743Q2017n5407D0227J84709b42940a06357A26759B4482
10684a86037E3479J1773a99446O191K9395P8634j79951H5057a29746F12590c47350
10672f5530E39204c08354Q4135B24129a79120M0200j04044h7626F876R8844D0966
10660F4578g3323j19135P3825j73472c6727k8946M272j48732A0993h4304B24009
10648a48036C34059a7470m25996i5479A64225C6098I986a27657F3237J03266e9597
10636I6028J13785C9453g1333B0224a34673O201M218k40916A45369b12697j6558
10625b29255A33200C1469d64194a48927k29042h686m0622C39502b48885m9099
10615b97984h627j13246C32823d8487k11247B87484a40399F5924a52095L0395
$$ y = [-355865, -232769, 86743, 168760, 113353, 40227, 224936, -242940, -106357, 126759, 24482, -186037, 53479, 65252, -199446, -193255, -163860, -85226, -265177, 85057, -129746, 612590, -347350, -65530, 539204, -308354, -224219, 224129, -179120, -138920, -242964, -87626, 6876, 105720, 40966, 64578, -73323, -192458, -118633, -292105, -36727, -65673, -61401, -210133, 10993, -84304, 224009, -148036, 334059, -17470, -443466, -95479, 164225, 36098, 9986, -127657, 63237, 166503, -59597, 96028, 209813, 39453, -71333, 20224, -134673, -128472, -124254, -365170, 145369, -212697, -229255, 133200, 31469, -464194, -148927, -377969, -8686, -49308, 339502, -248885, -297984, -8627, -121873, 332823, -48487, -259734, 287484, -140399, 65924, -152095, -121700]
10605a21700E49391E8284a0598k64936h503A88869j8716a30179j08351m2268P2101
10594b08697I1255e1894B54352A1628O32201a5332C4805Q126R2265N2041a49672
10582A33846j9104J64348B016P0103N0243b57771i3678B2132J71640p6243C7511
10570B60715g1958D3182i4199E3075a96032A19290a63346f1119A3087J1521K00735
10559B25343H0281a57766G8592f2435C33540i0032L8013j53619h7340p4272B55471
10547C09110m3800c54958e7531A92494J1489i6729M5581m4629C29875A34050F190
10535F0876H036c14778K9631A82485c43300a23066j3333l004C2281i7728m7169
10524a44897A43484E6310B1452K50847a00456c5074k25286b2872k06516c0468
$$ y = [-121700, 549391, 58284, -10598, -275534, -8503, 188869, 170153, -130179, -238530, -280798, -208697, 91255, -51894, 254352, 11628, 643829, -15332, 34805, 42931, 135196, 187237, -149672, 133846, 114742, 279090, 2016, 72119, 122362, -257771, -93678, 22132, 193772, 117529, 37511, 260715, -71958, 43182, -94199, 53075, -196032, 119290, -163346, -61119, 13087, 24608, 225343, 80281, -157766, 78592, -62435, 333540, -90032, -52019, -205638, -87340, -161612, 255471, 309110, 265310, -354958, -57531, 192494, 203983, -96729, -51148, -95777, 329875, 134050, 6190, 60876, 8036, -314778, -285147, 182485, -343300, -123066, -136399, -139403, 32281, -97728, -144897, 143484, 56310, 21452, 272299, -100456, -35074, -260360, -22872, -229388, -30468]
10513c7822C52214B1648i8622j00367A05026a38620A18506a35367m04865A07506
10502b03727k4391A48532a08601j58235A59934h3763C7192N626k0600b72689J25466
10491a47223m9235M177i3857M1210B48112G2910e2467A38826K56144j88737D3253
10479B80945A04090L67280l2845C9661J50855G0682c1808m1154A6199P0816c0588
10467F5471K93136j16805D2905i247k64370C4386c4959l54740g4128A61190c95128
10455B32922O4460b40519A79052p0045b18213B53294a97376C7260b43078j75396
10445d18474a73708M6845C09957d7163b3485B53784d1138N273A27599A001b43410
10433A79371a66191b2680H0010b72033A96659n7021C0571c21924B43826d5502
$$ y = [-37822, 352214, 21648, -98622, -198989, 105026, -138620, 118506, -135367, -540232, 107506, -203727, -228118, 148532, -108601, -266836, 159934, -83763, 37192, 42818, 22218, -272689, -147223, -196458, -192281, -93857, -52647, 248112, 72910, -52467, 138826, 394970, 206233, 43253, 280945, 104090, 471370, 438525, 39661, 190516, 70682, -31808, -72962, 16199, 87015, -30588, 65471, 358607, 241802, 42905, -9247, -273617, 34386, -34959, -389699, -74128, 161190, -395128, 232922, 297382, -240519, 179052, 109007, -218213, 253294, -197376, 37260, -243078, -418474, -173708, -126863, 309957, -47163, -23485, 253784, -41138, -35865, 127599, 1001, -243410, 179371, -166191, -22680, 80010, -272033, 196659, 139638, 30571, -321924, 243826, -45502]
10422c2329k51821e5713B8020R7216c49646g919k85828A66497b20082j05989a38144
10410I0087g2112D619a25896j81573C1091d9505j05483p3414B39653J91897B383
10398h6476M1126I8610a10705M3063A26185O0668a00916A15367a49372A80552
10387A97536K2058e6162j14614C90194A89667P5964R4663g2850B96564C8266K08943
10376B47209J13251j66846J46256p2250r0028O2273J6444K41441j6669p2517j98223
10365B10341K84756C6990J1050L25396I4927l3841k6206n33R3754c9725B24497
10353D06769Q3792k19610P02175D12489A18690L23110e5994A88652K92079A84449
10342D35056j27216A43263P2232K1503p3300Q365K77792d1295A3316M70836B36245
$$ y = [-32329, -284150, -55713, 28020, 125236, -349646, -7919, -293747, 166497, -220082, -326071, -138144, 90087, -72112, 4619, -125896, -307469, 31091, -49505, -154988, -228402, 239653, 431550, 2383, -86476, -45350, 98610, -110705, -67642, 126185, 186853, -100916, 115367, -149372, 180552, 197536, 219594, -56162, -170776, 390194, 189667, 265631, 360294, -72850, 296564, 38266, 247209, 360460, 193614, 339870, 267620, 177592, 239865, 256309, 497750, 481081, 408564, 210341, 495097, 36990, 48040, 373436, 94927, 61086, 34880, 34347, 128101, -39725, 224497, 406769, 490561, 270951, 973126, 412489, 118690, 441800, -55994, 188652, 480731, 184449, 435056, 307840, 143263, 215495, 236998, 163698, 172063, 449855, -41295, 13316, 484152, 236245]
10330B28228J24406G3827J01140k0222b6551B89552A12541A7851K6432M78822
10320E23105e2982B32827q5930J38617C1091K6692B8832a75418R363M7351B64244
10308g8645C15877A700c0074l41683h6083b5668A92152G7561O4594J25407a37350
10296F7259B5816O6342e3674C0775b03939P9175l0455B89247G5488a4565H4019
10284B65270j8502a88967e3430A33236l4933b6167m7679A21888c3503m10874a69349
10272c428B28992b62176N3035N7139j04123I5705k404P5956M8319C5955J43451
10261A79406K76123B06713K4694L60085k06391B1639O1370j7905i5953F3915J93638
10250B57553c4185B28058G286R328J6647L47722A16863E2354D806a9180A66113
$$ y = [228228, 352634, 73827, 174967, 154745, -26551, 289552, 112541, 17851, 44283, 523105, -52982, 232827, 146897, 285514, 31091, 57783, 28832, -175418, -166055, -118704, 264244, -78645, 315877, 1700, -30074, -371757, -86083, -25668, 192152, 77561, 142155, 267562, -137350, 67259, 25816, 92158, -53674, 30775, -203939, -124764, -155219, 289247, 75488, -14565, 84019, 265270, 246768, -188967, -53430, 133236, 98303, -26167, -73846, 121888, -33503, -444377, -169349, -3428, 228992, -262176, -209141, -152002, -256125, 95705, 93301, 169257, 217576, 35955, 179406, 455529, 206713, 231407, 591492, 385101, 21639, 83009, 65104, -95953, 63915, 257553, -34185, 228058, 7286, 16614, 33261, 380983, 116863, 52354, 4806, -19180, 166113]
10238I5148e5435A92043D8630j2914j2000b1445J778I9945C5222K36567a05885
10226b23354Q7983O1798A22351c38073H794a11253j3686C21694b91228c4538n8951
10215i3489C0317J51699F4935j5710K7421b86229h5899l47340B60941a19769a4738
10203i8824k78828H6985d21094f9845A24520D9009b90842J24675M5299l869j37272
10192b62009k32016a80852d04j03667E2758a61460k02476A05930Q8075b29813
10181b09824A2562J53250J0257A6961a07107G6312b7135H1150a55995j4539h1056
10169F2272e9354A65536B4603J82354g3497A01130B4488M9721a50153A38133E1398
10157f8436j059N893A3091C400b10370A7816M7967d5082B31009C5761a85619j2196
$$ y = [95148, -55435, 192043, 48630, 35716, 23716, -21445, -19667, 99945, 35222, 271789, -105885, -223354, -135371, -73573, 122351, -338073, 8794, -111253, -124939, 321694, -291228, -34538, -93489, 30317, 182016, 64935, 49225, 76646, -286229, -85899, -433239, 260941, -119769, -14738, -98824, -377652, 86985, -421094, -69845, 124520, 49009, -290842, -166167, -120868, -124737, -262009, -494025, -180852, -404, -104071, 52758, -161460, -363936, 105930, 194005, -229813, -209824, 12562, 165812, 176069, 16961, -107107, 76312, -27135, 81150, -155995, -170534, -81056, 62272, -59354, 165536, 24603, 206957, -73497, 101130, 24488, 74209, -150153, 138133, 51398, -68436, -69495, -63602, 13091, 3400, -210370, 17816, 65783, -45082, 231009, 35761, -185619, -197815]
10145a97815B7752a08976l8638a9528A49608J49930b1689l02203j0434a41539
10134b43699a07596A51563E2083a54228j10153F007d3995l6520A24735B1074e32343
10122B49402D4411d57629A269b07166c4935j48387A19812a98461n8377A72887
10111A46879g1858j35546J02432A17286c82894A1114a21724g882C2992A0819g4608
10099c4890l43902d6111I3517C7246a54445O4860o8019r2150j6282l04587b24577
10087c02490A5556g8561j13104g9012d828J132C172h811r4176H5873a97938B98847
10074D5250c42189E6336Q3086b16253i3148M3916j57761c1811D4999c67420f2183
10062e2995F3940h3888l42603d0314j15950j35444A7101a80531K7696Q784j30899
$$ y = [-197815, 27752, -108976, -147614, -19528, 149608, 299538, -21689, -323892, -334326, -141539, -243699, -107596, 151563, 52083, -154228, -264381, 6007, -43995, -80515, 124735, 21074, -532343, 249402, 44411, -457629, 1269, -207166, -34935, -183322, 119812, -198461, -256838, 172887, 146879, -71858, -207404, -104972, 117286, -382894, 11114, -121724, -7882, 32992, 10819, -74608, -34890, -378792, -46111, 93517, 37246, -154445, -89585, -157604, -249754, -266036, -570623, -224577, -302490, 15556, -78561, -191665, -79012, -4828, -3696, 3172, -8811, -102987, 85873, -197938, 298847, 45250, -342189, 56336, 139422, -216253, -93148, -49232, -206993, -31811, 44999, -367420, -62183, -52995, 63940, -83888, -426491, -40314, -156264, -291708, 17101, -180531, -152835, -144051, -274950]
10051b74950N8017i4776f244j62112d2588m08777a60548k2473c30j43980E8334
10039A10118D9944b62676d8371C04063d26928A56548g8973n6479B11066a42911
10028b12897a3753o8538j16819o4080Q1072I2198b4003r6248A03223a40773M8058
10017i2715j59904a3167d827j92192k1923E6993a37866j6616k00856H994a32064
10005B5757a2356A01064g0089P775b6947j60265A08893a08408B371Q3702J36112
9994B22185o1259a85948A8362a73346G9334J349b58965e8355I1415m2275L8790
9983H7930L2936L6053b88131J41937k08100A31522c64434a25693A02764a64100
9972a43051G4919L6165L4575N7496c20229J7470O2748e9127A06031a75715j32233
$$ y = [-274950, -216933, -94776, -6244, -168356, -42588, -451365, -160548, -183021, -330, -144310, 58334, 110118, 49944, -262676, -48371, 304063, -426928, 156548, -78973, -135452, 211066, -142911, -212897, -13753, -82291, -199110, -263190, -182118, 92198, -24003, -120251, 103223, -140773, -92715, -252619, -13167, -4827, -197019, -218942, 56993, -137866, -154482, -355338, 8994, -132064, 25757, -12356, 101064, -70089, -62314, -26947, -187212, 108893, -108408, 2371, 86073, 222185, 160926, -185948, 18362, -173346, 79334, 80683, -258965, -58355, 91415, 49140, 87930, 120866, 156919, -288131, -146194, -354294, 131522, -364434, -125693, 102764, -164100, -143051, 74919, 111084, 145659, 203155, -320229, -302759, -240011, -59127, 106031, -175715, -307948]
9961c07948J04343d9320j34587j46174i7903k7394b1071p4953k10065a38388A76607
9949I6419a71949H4669c76035g6791L0681A32070b45692A11975d3606k00741A60746
9937a5209A38369N9709b24787j22777A01915c60763N5594g9404D004b78961A21719
9925h7818o5570D3769a11151n1669b6256m28466b2439j16812o1162i0710d4829
9913E986O846b42921H40h3498a2287m6492k03988B582g0142D05339b9257A45732
9900g3471q4825C3776a78709c718j59794E5359K3656a57045l3815l06663B7890
9888A40920N273m9788b31252J14939B9420J89550h4947m51132b62613q3068e9867
9876F6598c10813b4197C3089O1839h3166r510A20573g2549q6259F2706e6110j22630
$$ y = [-307948, -203605, -49320, -183907, -330081, -97903, -125297, -21071, -96024, -306089, -138388, 176607, 96419, -171949, 84669, -376035, -76791, -46110, 132070, -245692, 111975, -43606, -244347, 160746, -15209, 138369, 198078, -224787, -347564, 101915, -360763, -305169, -79404, 4004, -278961, 121719, -87818, -153388, 43769, -111151, -162820, -26256, -454722, -22439, -139251, -200413, -90710, -44829, 5986, 12832, -242921, 840, -83498, -12287, -58779, -262767, 2582, -70142, 405339, -29257, 145732, -73471, -158296, 33776, -178709, -3718, -163512, 55359, 79015, -157045, -190860, -497523, 27890, 140920, 146193, 96405, -231252, -116313, 29420, 218970, -84947, -536079, -262613, -345681, -59867, 66598, -310813, -24197, 33089, 94928, -83166, -92676, 120573, -72549, -158808, 62706, -56110, -178740]
9864a78740M6584o8224g4218B04005a68871r6548C9264b47472g3751k8182j2610
9853a14543j16920R2780k31004F9486c25844J19169m9783e5667A41700J40560
9843B82260m8616a9514l3535B33162f4042r0864B91396c12339a4945C19472i1663
9831a53035A59521d3483k9824e845A17997b55714i4739l8381a6339f730q3353
9820i0083d4703k19863L9902K9357A27592f4456l86069A802b51818H211d58249
9808A79273c03384e259n945r1086B20303J84194A32911P4975c2338n7683l08588
9797c98609G6473J62395f3040A33424h31k19102P4204A79153b07453c8416A9661
9785b6295k38260Q6625j48240c8877A64196a30197m2486a6967j96294Q9337k54786
$$ y = [-178740, -132156, -200380, -74218, 204005, -168871, -265419, 39264, -247472, -73751, -101933, -114543, -231463, -138683, -369687, 69486, -325844, -206675, -256458, -55667, 141700, 282260, 233644, -19514, -53049, 233162, -64042, -154906, 291396, -312339, -14945, 319472, -91663, -153035, 159521, -43483, -73307, -5845, 117997, -255714, -94739, -133120, -16339, -6730, -90083, -44703, -264566, -224664, -195307, 127592, -64456, -450525, 1802, -251818, 8211, -458249, 179273, -303384, -5259, -11204, -102290, 220303, 404497, 132911, 207886, -32338, -90021, -398609, 76473, 238868, -63040, 133424, -831, -219933, -145729, 179153, -207453, -38416, 19661, -26295, -264555, -177930, -326170, -38877, 164196, -130197, -172683, -16967, -213261, -123924, -378710]
9774c78710J40420q0018a50555K4994k6650q4345H0069R743J28543b5043m01104
9763d26147a4772E70717a79600K7966k281K0156n9911a1190k42511Q6831H4237
9751B9971d61535D4999N060a48654J135l8235A40118A5344g1016A80450d66152
9739b47134j46240A76774b07371I0962f9186o371J3521k19321C03412h2426E2787
9727b7333C013K07452e4895A12913e23054A75313a62896J2289D3409J52747c94999
9715a92A59552J28054c5630j34389C48102D0477c51383b5538k02668b3685j67526
9704a91211e806L35A29409b26167J11117B19402F2316f9494J6384j84594l09569
9693e47273A99309a58890N5679D1156F337a02641f788A3522a30120l61200B83166
$$ y = [-378710, -238290, -318308, -150555, -125561, -152211, -236556, 80069, 89812, 218355, -25043, -426147, -14772, 570717, -179600, -151634, -153915, -133759, -193670, -11190, -253701, -166870, 84237, 29971, -461535, 44999, 50059, -148654, -147519, -185754, 140118, 15344, -71016, 180450, -466152, -247134, -393374, 176774, -207371, 90962, -69186, -75557, -62036, -281357, 303412, -82426, 52787, -27333, 3013, 210465, -54895, 112913, -523054, 175313, -162896, -150607, 43409, 196156, -394999, -192, 159552, 287606, -35630, -170019, 348102, 40477, -351383, -25538, -228206, -23685, -191211, -5806, -5471, 129409, -226167, -115050, 219402, 62316, -69494, -53110, -237704, -547273, 199309, -158890, -103211, 41156, 6337, -102641, -6788, 13522, -130120, -491320, 283166]
9681e2311l14516d9769k52287m0468a18471C0714a95754j89703f5570h825H693
9669b8579k86248D1903b75129a09579a7536H0433J65022a81353d3471k95100a27983
9657c22450d9476j62056P3529D473P8985a21610C09591c7362k06728d9933A06587
9645b53389J10271A39591b02745M0314k04500a50229l9948j13917I182R7179J31891
9634B38252f1709o5675E9189b50188D3096a41423N0467j10551L2505q1294q9046
9623c39342D175d1947B01002c9977j22843B4064a84228j72919O2623D4782J20109
9612A64891d5897B22907A076J34224d68o5422A63322e883j32678k69872b6890
9600a91076N3827r9762O1790P1769n186J8246j45180g0246D175K5456J80594b45645
$$ y = [-52311, -366827, -49769, -302056, -342524, -118471, 30714, -195754, -385457, -65570, -8825, 8693, -28579, -314827, 41903, -275129, -109579, -17536, 80433, 245455, -181353, -43471, -338571, -127983, -322450, -49476, -211532, -138003, 4473, 83458, -121610, 309591, -37362, -244090, -49933, 106587, -253389, -143118, 139591, -202745, -162431, -366931, -150229, -190177, -304094, 9182, 106361, 238252, -61709, -127384, 59189, -250188, 43096, -141423, -90956, -201507, -169002, -250296, -339342, 4175, -41947, 201002, -39977, -162820, 24064, -184228, -357147, -294524, 44782, 164891, -45897, 222907, 1076, 135300, -468, -65890, 163322, -5883, -138561, -408433, -26890, -191076, -137249, -237011, -175221, -103452, -108638, -90392, -235572, -70246, 4175, 29631, 210225, -245645]
9587B47318F5759K32956f0770J7469a3610j00078k44465i739A02889c54993a58895
9575b6618b325E063J95316m0802a33525G0974Q1158a5020A65443B0582b14376
9563A07699Q6870d69232J62143i8700c9695A4320a82977K2950E424J58755a20376
9551A50325e56815H4716A3344b17207g6665E691b1950k34805p0934C07654b01231
9539B86762a22516I1786k1766b38654Q0831E4972J6972a07689j69336J0417h5762
9527A1727O4777d28428B11494h6569k08401h7947k44118r4987H745M8333f3911
9515i2970a398A26536e6932F3975J15506P2182p4320b83424a7184m5259n08467
9504e70910D0431a30743c2501l9921o4839A02006c5118n2244E0009Q5990N4060
$$ y = [247318, 65759, 298715, -60770, -43301, -13610, -113688, -358153, -9739, 102889, -354993, -158895, -26618, -2325, 5063, 200379, 159577, -133525, 70974, 152132, -15020, 165443, 20582, -214376, 107699, 194569, -469232, -307089, -98700, -39695, 14320, -182977, -160027, 5424, 164179, -120376, 150325, -556815, 84716, 13344, -217207, -76665, 5691, -21950, -256755, -327689, 307654, -201231, 286762, -122516, 91786, 70020, -238654, -157823, 54972, 71944, -107689, -277025, -266608, -85762, 11727, 76504, -428428, 211494, -86569, -294970, -87947, -332065, -427052, 8745, 57078, -63911, -92970, -1398, 126536, -56932, 63975, 179481, 251663, 177343, -283424, -17184, -62443, -570910, 40431, -130743, -32501, -72422, -137261, 102006, -35118, -87362, 50009, 135999, 190059]
9493A90059b9434k08293B00795R8848c6076p3820B30287c00453k14509A53862
9482a77023K6250o492K1309k47786a29204r8903C0427K93312d6403D6474b92386
9470c2794p6768B84850c71915A23023P8672b47757B16798b51890h5214m1504b9506
9458b99604Q4406A24978a86279F6133J06697J04742A07543a53679l4855A610K38440
9447B40050m6145b20534m2008e4174A74813g042l39768J8076A00935D1273K09226
9436B50499n1722b88792j3897J9164B83380b67723h105j66885N7392B20672d43849
9424C89115d13873a00922B76509o5439e3140E305g0050B45737a30512N2165j3630
9413i1977A73099g5568j72092A80321d22786B0710c12857B97759e5196k11268
$$ y = [190059, -29434, -237727, 200795, 299643, -36076, -109896, 230287, -300453, -514962, 153862, -177023, -150773, -157265, -135956, -383742, -129204, -228107, 30427, 323739, -46403, 46474, -292386, -32794, -109562, 284850, -371915, 123023, 201695, -247757, 216798, -251890, -85214, -126718, -29506, -299604, -215198, 124978, -186279, 66133, 172830, 277572, 107543, -153679, -188534, 1610, 240050, 193905, -220534, -262542, -54174, 174813, -7042, -346810, -328734, 100935, 41273, 250499, 198777, -288792, -302689, -283525, 283380, -267723, -8105, -174990, -117598, 220672, -443849, 389115, -413873, -100922, 276509, 211070, -53140, 5305, -70050, 245737, -130512, -78347, -91977, 173099, -75568, -247660, 180321, -422786, 20710, -312857, 297759, -55196, -266464]
9403b66464j44145a75586p0142P9785A26883a70r0149k480r1823N0273j39008
9392b73357g6170G2148j508b27457g1385C5199Q4047c7174k98542A71697n6311
9381A15386a15518d9j67920B52118A0495c75778o0833K11024E0191K1688a29463
9369i3709p3405B00634a34694M1920b2973I629K3068R0961a70512A69626c70260
9357a81260O2469J3883n0221a0489k16072A43636a46354a5041k55265C2819Q9130
9346A21949a89591d5317l57291B27406e1317l61431H8462M2504E2607B3477a06325
9334D7045M0167d5456p0721B75428a83347A09196M7400c4179r3388N9723J5084
9323e2760A01111g4475E3000L9428a79767e8503o9733B3193b87701A38965N4206
$$ y = [-266464, -410609, -175586, -245728, -165943, 126883, -170, -90319, -92799, -184622, -134349, -273357, -76170, 72148, 70640, -227457, -71385, 35199, 119246, -37174, -335716, 171697, 115386, -115518, -49, -167969, 252118, 10495, -375778, -436611, -225587, 50191, 71879, -129463, -93709, -167114, 200634, -134694, -92774, -22973, 9629, 32697, 123658, -170512, 169626, -370260, -181260, -118791, -104908, -155129, -10489, -226561, 143636, -146354, -15041, -270306, 32819, 121949, -189591, -45317, -402608, 227406, -51317, -412748, 88462, 130966, 52607, 23477, -106325, 47045, 87212, -45456, -116177, 275428, -183347, 109196, 156596, -34179, -127567, -67844, -52760, 101111, -74475, 53000, 92428, -179767, -58503, -128236, 23193, -287701, 138965, 193171]
9312A93171a88387j45405A37156F161L2941d50597B4756a26383q7406o9831h0202
9300G530b50038D0522J95951k5397b48214M4030B00923D9971d8784j62452h1420
9288C8648a21849m0294D5421a63128F6727a66235g7935D4883c76518a29173A7800
9276a81778N8319k7732i855L328A63261h6308D7618a7514j88541j42291E2788
9264d8777H6042b49904Q8235J552j9537C0216k745b99634A19088f4338j03385
9253a67723I0343L3443a79249r3308p1984d2995j70127R7342n7222o5615a12131
9241b90216P2619R4388B46776J3607b16906R3313K2428C25980j53459f1977K3186
9230c8791A44471b90753G553K19986f3158k29090k69787h6475q6375q3036J09521
$$ y = [193171, -188387, -333792, 137156, 6161, 39102, -450597, 24756, -126383, -213789, -283620, -80202, 7530, -250038, 40522, 236473, 211076, -248214, -204184, 200923, 49971, -48784, -211236, -81420, 38648, -121849, -162143, 45421, -163128, 66727, -166235, -77935, 44883, -376518, -129173, 17800, -181778, -123459, -151191, -9855, -6527, 163261, -86308, 47618, -17514, -206055, -348346, 52788, -48777, 86042, -249904, -161669, -160117, -179654, 30216, 27471, -299634, 119088, -64338, -167723, 90343, 123786, -179249, -272557, -344541, -42995, -213122, -115780, -173002, -238617, -112131, -290216, -217597, -123209, 246776, 260383, -216906, -123593, -101165, 325980, 172521, -61977, -38791, 144471, -290753, 7553, 227539, -63158, -292248, -562035, -86475, -172850, -255886, -146365]
9219a46365k72094A32390b28013M6890A3126K8588a55653A07684a97190A45513
9208a2140E7977a29714m5417C4661d0264A25252d667m6681E7296a84441A26450
9196A19696a5852r831k64362C03478B9808p853K71889A12177e8503j16682k14508
9185c89693i3587A08258o890c69889f2468n4997o1879m33813b49021k27045Q4466
9174c91600Q8998d0495B68940j25184a56505G0655f7003J5967B03164a94695a8662
9162A22105a05837j8563j74224A5539N8616c44598a32644C31010c1844G9530i3874
9150a76097I6196J94915j10474B8209K23836b77625a28731G5639C1976i833A14852
9138c98302J88432A00215B474K8204L39347a51498j5728j05158k55259a29224
$$ y = [-146365, -418459, 132390, -228013, -181123, 13126, 41714, -155653, 107684, -197190, 145513, -12140, 57977, -129714, -175131, 34661, -40264, 125252, -4667, -51348, 57296, -184441, 126450, 119696, -15852, -25683, -290045, 303478, 29808, 21955, 293844, 112177, -58503, -175185, -389693, -93587, 108258, 101368, -369889, -62468, -117465, -179344, -613157, -249021, -476066, -391600, -302602, -40495, 268940, 143756, -156505, 70655, -67003, -51036, 203164, -194695, -18662, 122105, -105837, -124400, -298624, 15539, 74155, -344598, -132644, 331010, -31844, 79530, -93874, -176097, 96196, 291111, 180637, 28209, 252045, -277625, -128731, 75639, 31976, -9833, 114852, -398302, -209870, 100215, 2474, 30678, 370025, -151498, -167226, -272384, -527643, -129224]
9127a73195d971l74482c3743o9406J9552j9784C14488m9108d1690B63806c2914
9115e958q9457A17784a63817B3643a60094F8329c6489o4967j418k46237a99B84690
9102e4857k03972A24139a63362l9994O9364n9363g5523m3505A13457a44042F1708
9090a35688A99331E3114d863A9685g1768q0064r3254G7861g8309H0732a1933j80704
9078a92637k59920a29505b5446k1520r1402j55170J03138A01073c28619K7892
9068c00727A18190l0279a78928c8573k05672c3416F9944d6750j1989B91969a06188
9056c3296I3101a29665j6547j69890G3494f4816j29722J4168l1262m9724b7233
9044C09050c0591q3265A04533c10009e6221B25583b81413M2506d5795G8993b20522
$$ y = [-173195, -4971, -379453, -33743, -103149, -83597, -103381, 314488, 265380, -41690, 263806, -32914, -5958, -95415, 117784, -163817, 23643, -160094, 68329, -36489, -101456, -102874, -349111, -199, 284690, -54857, -258829, 124139, -163362, -203356, -133992, -193355, -75523, -119028, 113457, -144042, 61708, -135688, 199331, 53114, -4863, 19685, -71768, -151832, -245086, 77861, -78309, 80732, -11933, -192637, -452557, -129505, -25446, -46966, -138368, -293538, -190400, 101073, -328619, -300727, 118190, 87911, -178928, -38573, -244245, -33416, 69944, -46750, -58739, 291969, -106188, -33296, 93101, -129665, -146212, -316102, 73494, -64816, -194538, -180370, -211632, -261356, -27233, 309050, -30591, -113856, 104533, -310009, -56221, 225583, -281413, -238907, -45795, 78993, -220522]
9032c5309A36697c3519m76974e5851o9319j01042L8423A3007J14742c24029I3019
9020a3502l8118C63794a41053M7264J6553A30437R3615a28787M8074B979e8275
9008A2693D592c26979a31596F4824b0626n12733b37465a2362j0356k40656B2888
8996b47470m2187a25945d4892j07224A66597F7135b87671B76297D1634L9184a63210
8984C4901J86369k4003a70707B9151N4799D505a72656j80129B51031b15947E5077
8972D16416c28451H5118J32784n5267e372B8769b71213A93327b487H8299m0148
8961D8151l530c63115a34833a0931a342j74844b7474j80130K8066B06241i2717
8949B9585J22008a28352j67976k27291J97488A21903a63457Q0749B61082p1573
$$ y = [-35309, 136697, -33519, -510493, -55851, -125170, -226212, -187789, 13007, 127749, -324029, 93019, -13502, -51620, 363794, -141053, -93789, -77236, 130437, 224052, -128787, -80713, 2979, -58275, 12693, 4592, -326979, -131596, 64824, -20626, -533359, -237465, -12362, -22718, -263374, 22888, -247470, -289657, -125945, -44892, -152116, 166597, 67135, -287671, 276297, 41634, 80818, -163210, 34901, 221270, 197267, -170707, 29151, 83950, 4505, -172656, -352785, 251031, -215947, 55077, 416416, -328451, 85118, 217902, 162635, -5372, 28769, -271213, 193327, -2487, 88299, 48151, 44621, -363115, -134833, -10931, -1342, -176186, -27474, -207604, -179538, 206241, -92717, 29585, 151593, -128352, -296328, -523619, -326131, 121903, -163457, -82708, 261082, 189509]
8939A89509b14727Q0345A70154F8199M5384K83020h6029F6876g7887r0126k27174
8928c95187J62494B61099m2208L3974N69745J984126M363458l008084j858792
8919B303318A137721l96018a75011A04401D4949O7987L84923F3543g4355k2293
8909i6648A66716L0575H2421f1802C7002a579m10778d1897l56876A20558l3773
8898H6785b93490a4762B3918a7294O222k31745h5434L833I6652k1499j5951a66054
8885B9610Q18c3606k54341c4531A39234b8494G6373M966N0550a28830B2303a86011
$$ y = [189509, -214727, -134382, 170154, 68199, 113583, 396603, -86029, 66876, -77887, -168013, -395187, -232693, 261099, 218891, 252865, 822610, 2806736, 7170194, 4162110, 2303318, 1137721, 741703, -175011, 104401, 44949, 112936, 497859, 63543, -74355, -96648, 166716, 197291, 82421, -61802, 37002, -1579, -412357, -41897, -398773, 120558, 86785, -293490, -14762, 23918, -17294, -11072, -242817, -85434, -81601, 96652, 75153, 59202, -166054, 29610, 30428, -33606, -287947, -34531, 139234, -28494, 76373, 81339, 131889, -128830, 22303, -186011]
$$ [...]
##END NTUPLES=NMR SPECTRUM
##END=
