
##TITLE=AC1213_BRAAS12064_7164184_Es8uZslE2v
##JCAMPDX= 6.0         $$ Bruker NMR JCAMP-DX V2.0
##DATA TYPE= NMR SPECTRUM
##DATA CLASS= NTUPLES
##ORIGIN= BRUKER
##OWNER= Administrator
$$ 1.72 TOPSPIN		Version 2.1
$$ 2013-01-30 03:30:27.397 -0500  Administrator@X
$$ Compression mode = diff/dup
##.OBSERVE FREQUENCY= 400.02188249412
##.OBSERVE NUCLEUS= ^1H
##.ACQUISITION MODE= SIMULTANEOUS (DQD)
##.ACQUISITION SCHEME= undefined
##.AVERAGES= 8
##.DIGITISER RES= 22
##SPECTROMETER/DATA SYSTEM= spect
##.PULSE SEQUENCE= zg30
##.SOLVENT NAME= COFFEE_meoh
##.SHIFT REFERENCE= INTERNAL, COFFEE_meoh, 1, 14.98509
##AUDIT TRAIL= $$ (NUMBER, WHEN, WHO, WHERE, PROCESS, VERSION, WHAT)
$$ ##TITLE= Audit trail, TOPSPIN		Version 2.1
$$ ##JCAMPDX= 5.01
$$ ##ORIGIN= Bruker BioSpin GmbH
$$ ##OWNER= Administrator
$$ $$ E:\/data/COFFEE/nmr/AC1213_BRAAS12064_7164184_Es8uZslE2v/20/pdata/1/auditp.txt
$$ ##AUDIT TRAIL=  $$ (NUMBER, WHEN, WHO, WHERE, PROCESS, VERSION, WHAT)
(   1,<2013-01-30 03:30:19.319 -0500>,<Administrator>,<X>,<go>,<TOPSPIN 2.1>,
      <created by zg
	started at 2013-01-30 03:29:13.178 -0500,
	POWCHK enabled, PULCHK disabled,
       configuration hash MD5:
       86 BA 57 50 F2 9D 5C 9B 26 00 A9 28 5F 66 2E 89
       data hash MD5: 64K
       B8 BC DC 83 4D 2D D6 49 6E A0 34 4D 5F 40 9B 1C>)
(   2,<2013-01-30 03:30:22.334 -0500>,<Administrator>,<X>,<proc1d>,<TOPSPIN 2.1>,
      <Start of raw data processing
       efp LB = 0 FT_mod = 6 PKNL = 1 PHC0 = 0 PHC1 = 0 SI = 32K 
       data hash MD5: 32K
       40 03 C3 44 39 EF 33 26 96 EC FE D1 81 A8 A8 C5>)
(   3,<2013-01-30 03:30:22.803 -0500>,<Administrator>,<X>,<proc1d>,<TOPSPIN 2.1>,
      <pk PHC0 = 98.91541 PHC1 = 0 
       data hash MD5: 32K
       24 45 47 4C 8A 5C 07 A3 86 89 F8 B9 2F 89 A6 DB>)
(   4,<2013-01-30 03:30:23.053 -0500>,<Administrator>,<X>,<proc1d>,<TOPSPIN 2.1>,
      <abs ABSG = 1 
       data hash MD5: 32K
       67 11 39 A4 4F C3 F5 19 E9 F6 0D CF 8E F4 85 E5>)
(   5,<2013-01-30 03:30:23.194 -0500>,<Administrator>,<X>,<proc1d>,<TOPSPIN 2.1>,
      <abs ABSG = 2 
       data hash MD5: 32K
       8D CB F1 89 21 1D DC 0C 14 00 3B EC D8 05 B5 E5>)
(   6,<2013-01-30 03:30:23.334 -0500>,<Administrator>,<X>,<proc1d>,<TOPSPIN 2.1>,
      <abs ABSG = 3 
       data hash MD5: 32K
       65 B1 AA 50 7B 16 85 68 47 48 B8 74 CB CC 1D F8>)
(   7,<2013-01-30 03:30:23.475 -0500>,<Administrator>,<X>,<proc1d>,<TOPSPIN 2.1>,
      <abs ABSG = 4 
       data hash MD5: 32K
       86 B7 C4 66 AF 78 08 FB 75 2A E5 D9 67 3E 1C 87>)
(   8,<2013-01-30 03:30:23.616 -0500>,<Administrator>,<X>,<proc1d>,<TOPSPIN 2.1>,
      <abs ABSG = 5 
       data hash MD5: 32K
       FF 5A F2 8B FD 3F C4 4D EA 79 E9 B0 69 BE 21 44>)
$$ ##END=
$$ 
$$ $$ hash MD5
$$ $$ D7 C9 68 F9 98 D2 85 E4 36 FC B7 52 C6 DE 98 39
##$RELAX= 
##$RELAX= 
##$RELAX= 
##$RELAX= 
##$RELAX= 
##$RELAX= 
##$RELAX= 
$$ Bruker specific parameters
$$ --------------------------
##$DU= <E:\>
##$EXPNO= 20
##$NAME= <AC1213_BRAAS12064_7164184_Es8uZslE2v>
$$ [...]
150 150 150 150 150 150 150 150
##$TP07= 0
##$TPNAME0= <>
##$TPNAME1= <>
##$TPNAME2= <>
##$TPNAME3= <>
##$TPNAME4= <>
##$TPNAME5= <>
##$TPNAME6= <>
##$TPNAME7= <>
##$TPOAL= (0..7)
0.5 0.5 0.5 0.5 0.5 0.5 0.5 0.5
##$TPOFFS= (0..7)
0 0 0 0 0 0 0 0
##$TUNHIN= 0
##$TUNHOUT= 0
##$TUNXOUT= 0
##$USERA1= <user>
##$USERA2= <user>
##$USERA3= <user>
##$USERA4= <user>
##$USERA5= <user>
##$V9= 5
##$VALIST= <valist>
##$VCLIST= <CCCCCCCCCCCCCCC>
##$VD= 0
##$VDLIST= <DDDDDDDDDDDDDDD>
##$VPLIST= <PPPPPPPPPPPPPPP>
##$VTLIST= <TTTTTTTTTTTTTTT>
##$WBST= 1024
##$WBSW= 4
##$XGAIN= (0..3)
0 0 0 0
##$XL= 0
##$YL= 0
##$YMAX_a= 598321
##$YMIN_a= -505345
##$ZGOPTNS= <>
##$ZL1= 120
##$ZL2= 120
##$ZL3= 120
##$ZL4= 120
##$ABSF1= 14.98509
##$ABSF2= -5.573092
##$ABSG= 5
##$ABSL= 3
##$ALPHA= 0
##$AQORDER= 0
##$ASSFAC= 0
##$ASSFACI= 0
##$ASSFACX= 0
##$ASSWID= 0
##$AUNMP= <proc_prof1d_extract_pilot.lims>
##$AXLEFT= 0
##$AXNAME= <>
##$AXNUC= <1H>
##$AXRIGHT= 0
##$AXTYPE= 0
##$AXUNIT= <>
##$AZFE= 0.1
##$AZFW= 0.1
##$BCFW= 0
##$BC_mod= 0
##$BYTORDP= 0
##$COROFFS= 0
##$CY= 15
##$DATMOD= 1
##$DC= 0
##$DFILT= <>
##$DTYPP= 0
##$F1P= 0
##$F2P= 0
##$FCOR= 0.5
##$FTSIZE= 32768
##$FT_mod= 6
##$GAMMA= 0
##$GB= 0
##$INTBC= 1
##$INTSCL= 1
##$ISEN= 128
##$LB= 0
##$LEV0= 0
##$LPBIN= 0
##$MAXI= 10000
##$MC2= 0
##$MEAN= 0
##$ME_mod= 0
##$MI= 0
##$NCOEF= 0
##$NC_proc= -8
##$NLEV= 6
##$NOISF1= 0
##$NOISF2= 0
##$NSP= 0
##$NTH_PI= 0
##$NZP= 0
##$OFFSET= 14.98509
##$PC= 1
##$PHC0= 98.91541
##$PHC1= 0
##$PH_mod= 1
##$PKNL= yes
##$PPARMOD= 0
##$PPDIAG= 0
##$PPIPTYP= 0
##$PPMPNUM= 2147483647
##$PPRESOL= 1
##$PSCAL= 4
##$PSIGN= 0
##$PYNMP= <proc.py>
##$REVERSE= no
##$SF= 400.02
##$SI= 32768
##$SIGF1= 0
##$SIGF2= 0
##$SINO= 400
##$SIOLD= 32768
##$SPECTYP= <>
##$SREGLST= <1H.CDCl3>
##$SSB= 0
##$STSI= 32768
##$STSR= 0
##$SW_p= 8223.68421052631
##$SYMM= 0
##$S_DEV= 0
##$TDeff= 65536
##$TDoff= 0
##$TI= <>
##$TILT= no
##$TM1= 0
##$TM2= 0
##$TOPLEV= 0
##$USERP1= <user>
##$USERP2= <user>
##$USERP3= <user>
##$USERP4= <user>
##$USERP5= <user>
##$WDW= 1
##$XDIM= 32768
##$YMAX_p= 454931013
##$YMIN_p= -715827
##$CURPLOT= <Network HP LaserJet P1505>
##$CURPRIN= <$Network HP LaserJet P1505>
##$DFORMAT= <normdp>
##$LAYOUT= <+/1D_H.xwp>
##$LFORMAT= <normlp>
##$PFORMAT= <normpl>
##$SURQMSG= 1
$$ End of Bruker specific parameters
$$ ---------------------------------
##NTUPLES= NMR SPECTRUM
##VAR_NAME=  FREQUENCY,     SPECTRUM/REAL,   SPECTRUM/IMAG
##SYMBOL=    X,             R,               I
##VAR_TYPE=  INDEPENDENT,   DEPENDENT,       DEPENDENT
##VAR_FORM=  AFFN,          ASDF,            ASDF
##VAR_DIM=   32768,         32768,           32768
##UNITS=     HZ,            ARBITRARY UNITS, ARBITRARY UNITS
##FACTOR=    0.250966925370066, 1,           1
##FIRST=     8223.43324360094, 74755,        121851
##LAST=      0,             -65694,          -123421
##MIN=       0,             -715827,         0
##MAX=       8223.43324360094, 454931013,    0
$$ Real data points
##PAGE= N=1
##DATA TABLE= (X++(R..R)), XYDATA
$$ [...]
19514A59681o9694G252K2835L3975a05464A47125k3783B947d14092J98595f4055
19502A7597L39430a6765j42228P2356A14108a63584O6593p940j02840K0910A84394
19490a03907A68561n1989h5160k8463A18002a45225j49570B10555b8861j69704
19480a98565A27156J59684b67192h3407m10914H8006A1185K4102K79141a87268
19469G9591h4277j24037A5178M3214b31490j23852J75069H118b24442j01220J29928
19458a95734m8684a10228B91257a96158B01562h5136L534J343C13652a61869H1590
19446b1313l320j17769e8212l60497d2513p6764M1183o9303A94700f9852B1613
19434a09457A26935h5843A41933c8749k41346H4383e9893j32055f9735G3985b27326
$$ y = [159681, 89987, 7252, 30087, 64062, -105464, 147125, 123342, 2947, -414092, -215497, -64055, 17597, 357027, -16765, -158993, -86637, 114108, -163584, -96991, -104931, -207771, -186861, 184394, -103907, 168561, 116572, -85160, -113623, 118002, -145225, -294795, 210555, -28861, -198565, 127156, 286840, -267192, -83407, -494321, 88006, 11185, 35287, 314428, -187268, 79591, -84277, -208314, 15178, 58392, -231490, -355342, -180273, 8118, -224442, -325662, -195734, -244418, -110228, 291257, -196158, 201562, -85136, -81602, -80259, 313652, -161869, 81590, -21313, -24633, -142402, -58212, -418709, -42513, -119277, -78094, -147397, 194700, -69852, 21613, -109457, 126935, -85843, 141933, -38749, -280095, 84383, -59893, -191948, -69735, 73985, -227326]
19422A48454K4846e0230B3825a21753C1185J49706h8510j1994a3264A55379d1012
19410c28138i5370A92461d8524H3773a80600E5445M2689K41043m9925c29319a12342
19398c02594B16432c41248e4946j2561G3334a29547c4940l476A01756b25567B8429
19386h6772A82998b87659b1174k32271i0844E9338N0391b73670e428k77693a12876
19374a20585a1923j96780e2679j57418J03559A55958a33251F7968b20771L2884
19364a87887A48031a62966n31M9994C02625D5137b46694a08611c0482p5446K7038
19353g8890r4609j01781a7721m4386p3836j66226a13636J4120k15991B58550b76587
19341b7182j21204p0683g1765g524l25816e4392b2984j1378M911k79825N3110
$$ y = [148454, 173300, -50230, 23825, -121753, 31185, 180891, -88510, -100504, -13264, 155379, -41012, -328138, -95370, 192461, -48524, 83773, -180600, 55445, 98134, 339177, 289252, -329319, -112342, -302594, 216432, -341248, -54946, -67507, 73334, -129547, -34940, -38416, 101756, -225567, 28429, -86772, 182998, -287659, -21174, -253445, -90844, 59338, 109729, -273670, -5428, -283121, -112876, -120585, -11923, -208703, -52679, -210097, -106538, 155958, -133251, 67968, -220771, -187887, 148031, -162966, -163497, -113503, 302625, 45137, -246694, -108611, -30482, -105928, -78890, -173499, -275280, -17721, -62107, -135943, -302169, -113636, -99516, -315507, 258550, -276587, -27182, -148386, -219069, -71765, -7524, -333340, -54392, -22984, -34362, -29451, -309276, -256166]
19330b56166a05336j03512c1822j47097p6742B59262d8129j44444E792i7153j44100
19319b41253A00771a42377d6862n6078m5435j82414D6952g1503j69779r3648i190
19307b73827h8451A10492j3294b7848q7312N0408H0018a51614O2779B1921J59519
19296A81440N761J07925f0255j91996E4599b21330D031c28940a08157j88026A3927
19284a13815r7862I0714a72641B0174b7260i601l6964E2996a65569g9185j8997
19273i8182j12465h665m5802j1946J7176j20808d8820B4266d4374E1924Q1215
19262A33139b09293O3314G9379a644D14981c14804a34081a1829p2743J7543J3453
19251e3576m1053j50777C13841F0425a99447C2819c0663A53239g0769k6726A29014
$$ y = [-256166, -105336, -208848, -31822, -178919, -255661, 259262, -48129, -192573, 5792, -97153, -241253, 100771, -142377, -46862, -102940, -148375, -330789, 46952, -71503, -241282, -334930, -9190, -273827, -88451, 110492, 97198, -27848, -115160, -64752, 80018, -151614, -88835, 21921, 181440, 187201, 295126, -60255, -252251, 54599, -221330, 4031, -328940, -108157, -296183, 13927, -113815, -211677, 90714, -172641, 20174, -27260, -9601, -46565, 52996, -165569, -79185, -98182, -210647, -8665, -54467, -66413, -49237, -170045, -48820, 24266, -44374, 51924, 133139, -209293, -145979, 79379, -1644, 414981, -314804, -134081, -11829, -84572, -67029, -53576, -94629, -245406, 313841, 60425, -199447, 32819, -30663, 153239, -70769, -97495, 129014]
19239c3455j70112B56985o9010a12765I0170c4841k66659A16902J8887a49141
19228c5287b036l17815J36176L3554C2974h2307D2386g0688B40660b35062b7714
19216D8881J58567H0816b27178q712M7867Q3923B1471J46300d667j8713j92209
19205b15589c1304k34386h9253M1301m0724l04811H3765d5107B8834a47033D2241
19193A15422e0180B650e2710A90815e2025k41872p8143a23611A49872c30283a0360
19181B7825J41795m0986a24188b6966m88719d2886F8968a68711k12005C5672i1056
19169A68554e1434j99481p945A0768M1359M3417f5141C85667A60124h2762j19860
19158b02622N6184k3172C294J51031a72390K7937j31420B61798a50021G6024b76019
$$ y = [-33455, -203567, 256985, 187975, -112765, 90170, -34841, -301500, 116902, 135789, -149141, -35287, -2036, -319851, -183675, -150121, 32974, -82307, 42386, -70688, 240660, -235062, -27714, 48881, 207448, 80816, -227178, -235890, -188023, -104100, 21471, 167771, -4667, -23380, -215589, -31304, -265690, -89253, -47952, -88676, -393487, 83765, -45107, 28834, -147033, 42241, 115422, -50180, 2650, -52710, 190815, -52025, -293897, -372040, -123611, 149872, -330283, -10360, 27825, 169620, 128634, -124188, -26966, -515685, -42886, 68968, -168711, -380716, 35672, -91056, 168554, -51434, -250915, -258860, 10768, 52127, 95544, -65141, 385667, 160124, -82762, -202622, -146438, -169610, 3294, 154325, -172390, -144453, -275873, 261798, -150021, 76024, -276019]
19146a60933k4168A26449a64895q1429N9799b5159E3931c56913d8996A28972a22852
19134c06670d2635K877k59730G5257a06651F1865f1702B49152a60869a6193H6438
19122a38287d1913k08907A26422c6199m21875a54000G335b57280K2154K0063A22986
19110b05629g8670j13010Q1355A75041c75132b3203O954H4405P4979a0927j42023
19099a52950K1395G474K4918d4462A04282c44363J618j3020i7856C07280A06837
19087a6445a947C1185d3128o541F9854c3594B17565a26537e291H1636e9543j12283
19075a71826g2207A11529g9178m180j90966A46788E1778k0363K29624a41847O9933
19064g1914p7561n1047F4974g1725b1718j52884h4731k6831E8644K3458L2970
$$ y = [-160933, -185101, 126449, -164895, -246324, -186525, -25159, 53931, -356913, -48996, 128972, -122852, -306670, -42635, -39758, -299488, 75257, -106651, 61865, -61702, 249152, -160869, -16193, 86438, -138287, -41913, -250820, 126422, -36199, -458074, -154000, 7335, -257280, -235126, -215063, 122986, -205629, -78670, -191680, -110325, 175041, -375132, -23203, -16249, 84405, 159384, -10927, -152950, -131555, 7474, 32392, -44462, 104282, -344363, -342745, -355765, -97856, 307280, 106837, -16445, -1947, 31185, -43128, -49669, 69854, -33594, 217565, -126537, -5291, 81636, -59543, -171826, -72207, 111529, -79178, -83358, -274324, 146788, 51778, 31415, 261039, -141847, -71914, -149475, -200522, 64974, -71725, -21718, -174602, -84731, -111562, 58644, 82102, 115072]
19053A15072i7828G1878C5844P9576c02874J17444A06160a3114j12642j68609
19043b94365I5926i2495E5954M7039c15652d403H5259E336a94917I0420J10796
19032B01216l5986d570j02791C75141F0090J34352l4812a86916j07166h9397F6624
19020E39302A99901l8385F8807e8619B94061E1927j9431a94627g2621B9089c10040
19008B05304C9230E464J52000a40187A05895C1670b38226L044c072k765k03598
18997b09435L1089D55615b30465c7351A69499G7832a41119J6234j90926a19353
18986a87051h4407L2173q1644J0001H6908C9101b10835e2620a6339B2536b0904
18974E81021a270o3553G3995O1033N10459k65221A61915p5424K50009f186C76576
$$ y = [115072, -97828, 71878, 35844, 115420, -302874, -185430, 106160, -13114, -125756, -294365, 95926, -92495, 55954, 102993, -315652, -4403, 85259, 5336, -194917, 90420, 201216, 165230, -4570, -107361, 375141, 60090, 194442, 159630, -186916, -294082, -89397, 66624, 539302, 199901, 161516, 68807, -58619, 294061, 51927, 32496, -194627, -72621, 29089, -310040, 205304, 39230, 5464, 157464, -140187, 105895, 31670, -238226, -235182, -3072, -5837, -209435, -178346, 455615, -230465, -37351, 169499, 77832, -141119, -124885, -315811, -119353, -187051, -84407, -52234, -133878, -123877, 86908, 39101, -210835, -52620, -16339, 22536, -20904, 581021, -1270, -64823, 73995, 135028, 645487, 380266, 161915, 86491, 336500, -6186, 376576]
18962c3811o8539j21904B47647a46751A67329Q544B3590a89190k0005B27914c39938
18950h7952m517E0760a22810M5304m8735d2888k17370A08722d1187q2267L0788
18939i2666c8294c547G3619C2203a87551m4412E4991b46227g1788j00964j75775
18928c48527R7074K5659J6392A10027A1056K195a26368d5589A24280J1839f9370
18916A00916b29117P6226a5664l43777R0330C57465b0765j6046F8893N19351L78368
18905I66612C86971j74854b60282d5219j6767I1461a17174B3374K7725b11194
18894D10239A1953g9514A96926a3574m56459g1736J1481A23734C8276N03d206
18882E19865a67961A33659M5601a45375B4131b84197A10490J63584a30867q4677
$$ y = [-33811, -102350, -224254, 247647, -146751, 167329, 175873, 23590, -189190, -209195, 227914, -339938, -87952, -92469, 50760, -122810, -77506, -126241, -42888, -260258, 108722, -41187, -123454, -92666, -38294, -3547, 73619, 32203, -187551, -231963, 54991, -246227, -71788, -172752, -348527, -251453, -225794, -209402, 110027, 11056, 13251, -126368, -45589, 124280, 136119, -69370, 100916, -229117, -152891, -15664, -359441, -269111, 357465, -20765, -36811, 68893, 588244, 966612, 386971, 212117, -260282, -45219, -61986, 91461, -117174, 23374, 51099, -211194, 410239, 11953, -79514, 196926, -13574, -470033, -71736, -60255, 123734, 38276, 38779, -4206, 519865, -167961, 133659, 179260, -145375, 24131, -284197, 110490, 274074, -130867, -215544]
18872b15544A47318E5154a19984R769j03934j87505a84567c9850c384j6822k06688
18861b26894H897J48297a40570c4256A24241j5160A9870a7307B50401b10382K7203
18850a83179j06187A01062J6350A7831K41392i8885j43880g4231k37154i6774
18839a52899c3253B01736i1937A31971D4185b0269l92171I0970L4294K76612q444
18828C93432f6485B5016K43144c2454A27a69507B19390a20788M6204j90127J06528
18817a58183f8054C28148f7567A09838j675N2680B4568P8133a91183I7296c3892
18805F4942B0680a50853A42835a38171j84356J50239j27241g6868L5189A0205
18794h0677E1596J14953B848d87724A00264c8649C7965a32397K8004A76081a81749
$$ y = [-215544, 147318, 55154, -119984, -110215, -214149, -401654, -184567, -39850, -3384, -20206, -226894, 8897, 157194, -140570, -34256, 124241, 109081, 19870, -17307, 250401, -210382, -183179, -289366, 101062, 117412, 17831, 259223, -98885, -242765, -74231, -311385, -96774, -152899, -33253, 201736, -91937, 131971, 44185, -20269, -412440, 90970, 125264, 401876, 393432, -66485, 25016, 268160, -32454, 127, -169507, 219390, -120788, -74584, -264711, -158183, -68054, 328148, -67567, 109838, 108163, 160843, 24568, 102701, -191183, 97296, -33892, 64942, 20680, -150853, 142835, -138171, -322527, -172288, -299529, -76868, -41679, 10205, -80677, 51596, 166549, 2848, -487724, 100264, -38649, 37965, -132397, -104393, 176081, -181749]
18782d25153J4654a26386m5101m1252c7257j84788c8348E458a858B54984e9287
18770c9016o1631m1966A46675F4852b70449b0630B23238c06463B07958b04260
18759c1852r263r3025r4299A12511f0182j56642A10026a66986K1826J9578A93300
18747A02809Q718p852i1410j2335A78966e0201g744A92775b53201d1925k02196
18736b44121A59997i419j97449E0697a51900A31991d72726a10099J9897l0448
18726a20650k33095C85385h154k2497F1899K6892a43551o8773D0059a50981e0604
18714a96694C93068A95097a2621n0829B24746e651j41560c3307l8951o0617k2795
18703a55670o0684b28n8238r9528a506j869F0450J67630j07827b57375A1099a39345
$$ y = [-425153, -410499, -126386, -171487, -212739, -37257, -222045, -38348, 5458, -1858, 254984, -59287, -39016, -100647, -142613, 146675, 64852, -270449, -20630, 223238, -306463, 207958, -204260, -31852, -41115, -134140, -228439, 112511, -60182, -216824, 110026, -166986, -145160, -125582, 193300, 102809, 111527, 103675, -91410, -103745, 178966, -50201, -7744, 192775, -253201, -41925, -244121, 159997, -9419, -206868, 50697, -151900, 131991, -472726, -110099, -90202, -120650, -353745, 385385, -8154, -30651, 61899, 88791, -143551, -212324, 40059, -150981, -50604, -196694, 393068, 195097, -12621, -63450, 224746, -5651, -147211, -33307, -72258, -132875, -155670, -216354, -228, -58466, -157994, -1506, -3375, 60450, 228080, 120253, -257375, 11099, -139345]
18690b14412E3678a09587j30804g7024k7779l82313E7726e4341q8854A62840a77216
18678F1521b00946m3655B3083b59158B7483A0148J52709i9414M8469n9070k91474
18667d01489A5560a94269G994a89800m0178J10903q9222A58461n2846J36833b19657
18655b4001A78227c19682A82022C2218K2228a9118n4316n2259a0477q809F1166
18643h4930A23706J26033G3229b71252g4267j75050e3174A06827e26818A62809
18632c9897j16229a3701r4039p4905k96200a19052N3212k46601H8996h3901c2126
18620B94817b88377q2279B3606J53179F0400b28194B92283a62901m046I2296a09079
18608b71565F4166K21693c06797P6210j02457H4990J73583B3295g2851l2722G9564
$$ y = [-214412, 53678, -109587, -240391, -77024, -104803, -487116, 57726, -54341, -143195, 162840, -177216, 61521, -200946, -244601, 23083, -259158, 27483, 10148, 162857, -99414, -50945, -110015, -401489, 15560, -194269, 7994, -189800, -229978, -119075, -208297, 158461, 105615, 242448, -219657, -24001, 178227, -319682, 182022, 32218, 54446, -19118, -73434, -125693, -10477, -19286, 61166, -84930, 123706, 249739, 73229, -271252, -74267, -249317, -53174, 106827, -526818, 162809, -39897, -156126, -13701, -107740, -182645, -478845, -119052, -65840, -312441, 88996, -83901, -32126, 294817, -288377, -370656, 23606, 176785, 60400, -228194, 292283, -162901, -166947, 92296, -109079, -271565, 64166, 285859, -306797, -230587, -333044, 84990, 258573, 23295, -72851, -105573, 79564]
18596C201R0884i9751o3828k17183C14771j28580F7147K73996g1708K0672n3646
18585a04682A5336M733c78471a25932q2716n0181H2331g4023M731B26993J9781
18574B46774C0073f9422A27080b12572r1393D9455f2440B9872a82362j57847a05946
18562a20046q2941G0298d0366j11210A31129b791j6244A33852i3579G849a68039
18550i8298d4399j68902Q6622o2010A99008c2362j23574b5731C9379J42865a11268
18538A71523B1696b7783A1438K15430H7135f6342J7746p9598l550G622L4609c0372
18525G448J8146a33206j73930A41623a57343K8955B9489n130O7322G65b92569
18513b390j85127N8758A10456r899Q5168b2394F4051c76379B01433B3331J27453
$$ y = [3201, 94085, -99751, -163579, -380762, 314771, 186191, 67147, 341143, -71708, -51036, -104682, 15336, 20069, -378471, -125932, -208648, -258829, 82331, -74023, -69292, 226993, 246774, 30073, -69422, 127080, -212572, -303965, 49455, -62440, 29872, -182362, -340209, -105946, -120046, -202987, 70298, -40366, -151576, 131129, -2791, -19035, 133852, -93579, 7849, -168039, -98298, -44399, -213301, -126679, -188689, 199008, -32362, -155936, -25731, 39379, 182244, -111268, 171523, 21696, -27783, 11438, 226868, 87135, -66342, -48596, -128194, -131744, 7622, 42231, -30372, 7448, 25594, -133206, -307136, 141623, -157343, -128388, 29489, 24359, 91681, 765, -292569, -2390, -187517, -128759, 110456, 100557, 185725, -22394, 64051, -376379, 201433, 23331, 150784]
18502A50784c1687C02311i5787j0176j18993J367A51772a02296a830k35484J03806
18491a33508K7359A30709A9512r149J45922j3108i6741j70716J28661m81159a68664
18479a43351c9517A06495J341l1748K91079f1184B83487H6235j535B2961i4627
18467c16299a05173M6647l3519a2870j62845P7058j21061f8320j48742k0594c8925
18455b02889j56830p2412d5236G0440b24192P7398A14897L1987c23521e215j15430
18444a20645I2496a23321P568j08212A5322a6150A50797l813h3048e703k41036
18433b46739M069D3248g2270k35860B6631b12450C37992A62249e9247G4327l0085
18422D4242e1502j27398P089g1090F639O6094d7114k30580h0473F6297a4513G1692
$$ y = [150784, -31687, 302311, -95787, -105963, -224956, -223589, 151772, -102296, -1830, -237314, -133508, -106149, 130709, 19512, 10363, 156285, 143177, -96741, -267457, -138796, -619955, -168664, -143351, -39517, 106495, 107836, 76088, 367167, -61184, 283487, 86235, 84700, 22961, -94627, -316299, -105173, -58526, -92045, -12870, -175715, -98657, -219718, -68320, -217062, -237656, -38925, -202889, -359719, -432131, -45236, 70440, -224192, -146794, 114897, 146884, -323521, -5215, -120645, 92496, -123321, -115753, -223965, 15322, -16150, 150797, 146984, -83048, -5703, -246739, -242670, 43248, -72270, -308130, 26631, -212450, 337992, 162249, -59247, 74327, 44242, -51502, -178900, -171811, -71090, 6639, 72733, -47114, -277694, -80473, 66297, -14513, 71692]
18409F8897P2374a5948k99591A18630a17556K1583E6755d04968A40496m9786h0274
18397D02208d2198Q900j78144B8166K30722d7033j7574J5374m405j05093J1885
18386a46846A1392O6566d65q8520G1043c43824a09643A35728F992N5576a56482
18374b21682I288a0327j99793J00060A28387b51884A44009F6261i6667A36710
18363b89662A53148b04733D1503b82684i3734A13329c2706A29737B6681d3563
18352B08473a13256N5497F7512e4227l0374j77544m746A31546b14868D4396M9542
18341I3938C4584L79160i9560A47053D4230K7042a35009A21588b459k6349k61551
18330b90359b601A51988d35327A2274d8500j45293A24068c26713g5235H1709J97220
$$ y = [68897, 141271, -15948, -315539, 118630, -117556, -95973, 56755, -404968, 140496, 90710, -80274, 402208, -42198, -33298, -211442, 28166, 258888, -47033, -64607, -49233, -53638, -158731, -146846, 11392, 77958, -465, -88985, 71043, -343824, -109643, 135728, 6992, 62568, -156482, -221682, 9288, -10327, -210120, -110060, 128387, -251884, 144009, 66261, -96667, 136710, -289662, 153148, -204733, 41503, -282684, -93734, 113329, -32706, 129737, 26681, -43563, 208473, -113256, -57759, 67512, -54227, -84601, -262145, -266891, 131546, -214868, 44396, 93938, 34584, 413744, -99560, 147053, 44230, 71272, -135009, 121588, -2459, -28808, -290359, -2601, 151988, -435327, 12274, -48500, -193793, 124068, -326713, -75235, 81709, 278929]
18319B78929b46615M5599p5798Q7867j7037H1176i6040k57090J33046C32934a90868
18307D9542Q4698c4052B38423f2969J7036j09749k14452a30455j76460p7399B84996
18295D6577b95831C94454d02516N126a47956E2948a72045A10760a19591D4068
18284h7565A08749b16133i678j74668g0589j41262I7520L6187g9249j16578F8192
18272d432E2942a4794o6591B03818D0456L1262d9313Q719k29344K3057B4773b37701
18259a94466C2323J13463h6592j6114J3133L7039j34128j44530A22367a356l749
18248e105m8828A38424b64990A8354a21417j3754F31959I2264b69681A83765H246
18236C18744a75930j50302c7381F1773a61906j28401f7423d496m74999h5471a8385
$$ y = [278929, -246615, -201016, -276814, -188947, -205984, 81176, -96040, -353130, -220084, 332934, -190868, 49542, 134240, -34052, 238423, -62969, -45933, -155682, -370134, -130455, -306915, -384314, 284996, 46577, -295831, 394454, -402516, -397390, -147956, 52948, -172045, 110760, -119591, 44068, -87565, 108749, -216133, -9678, -184346, -70589, -211851, 97520, 133707, -79249, -195827, 68192, -4432, 52942, -14794, -81385, 203818, 40456, 71718, -49313, -40594, -269938, -246881, 24773, -237701, -194466, 32323, 145786, -86592, -102706, -89573, -52534, -186662, -331192, 122367, -1356, -5105, -53933, 138424, -264990, 18354, -121417, -135171, 631959, 92264, -269681, 183765, 8246, 318744, -175930, -326232, -37381, 61773, -161906, -290307, -67423, -4496, -479495, -85471, -18385]
18224c4298j67746f5872a7271P490A91721h1362E966a28410M8696L5610k4393
18213f8497k84532h2725C12106a31020F4405j7741m406b0870G4846b7603m9585
18202g7188n118j0975C6959K53026b12666c3642D5099M1348J77829a29292n4872
18191a84164r9119F914M8773c40665a23339j93012f4032p7791A98454q8708a34458
18179C51974B8148J43544h5806E8015K62160c15363R949a38941I9893a24561m7063
18168a71624F4327J17343k3911b78448j83645D3927a22312A08996D1349a02438
18157B2581e76165h5311B20585i4718o7442N8493n4823e9720H094K4826b66131
18145A21951a81768E5704a49711m1774P8704I2943a63038b3370A4238J70921A7066
$$ y = [-34298, -202044, -65872, -17271, -9781, 191721, -81362, 5966, -128410, -79714, -44104, -68497, -353029, -82725, 312106, -131020, 64405, 46664, 42258, -20870, 74846, -27603, -77188, -82306, -93281, 36959, 289985, -212666, -33642, 45099, 86447, 264276, -129292, -184164, -283283, 6914, 55687, -340665, -123339, -316351, -64032, -141823, 198454, 109746, -134458, 351974, 28148, 171692, -85806, 58015, 320175, -315363, -305414, -138941, 99893, -124561, -171624, 64327, 181670, 157759, -278448, -462093, 43927, -122312, 108996, 41349, -102438, 22581, -576165, -85311, 220585, -94718, -162160, -103667, -158490, -59720, 8094, 32920, -266131, 121951, -181768, 55704, -149711, -191485, -112781, 92943, -163038, -23370, 14238, 185159, 17066]
18133A51060i0982B4975K8237g0894A07342a61524A53150F7206f7742A8151e8133
18121b05485A991d0262k71566G4383a01955K8158A04309L74243b00934M6927A12568
18109B1001K10751b5446n362F1516b37082G5532h2768l102A17874a90842F4240
18097b05143J6472G7159L67854h5568r5642j7478b8697A16484a58169O8733d4354
18085a79740O5057A0806b3324B62496e0231B4415a87149F1427L18942a12312J5858
18074i6454d1216l0881r9942h5947A25464c6932k9828A13199a40943e2892j17279
18063a70171C0148b57727c6414j11501p563B5873a53293p0996e2015B0004P2677
18052I2681R15K2000g0949J3075B79902D6478R1208F0466b33946A71632g7670
$$ y = [151060, -90982, 24975, 53212, -70894, 107342, -161524, 153150, 67206, -67742, 18151, -58133, -205485, 1991, -40262, -311828, 74383, -101955, -73797, 104309, 478552, -200934, -154007, 112568, 21001, 231752, -25446, -30808, 61516, -237082, 75532, -82768, -85870, 117874, -190842, 64240, -205143, -188671, 77159, 445013, -85568, -181210, -198688, -28697, 116484, -158169, -89436, -44354, -179740, -114683, 10806, -23324, 262496, -50231, 24415, -187149, 61427, 380369, -112312, -96454, -41216, -72097, -172039, -85947, 125464, -36932, -66760, 113199, -140943, -52892, -170171, 30148, -257727, -36414, -147915, -155478, 25873, -153293, -224289, -52015, 20004, 92681, 93596, 115596, -70949, -57874, 279902, 46478, 137686, 60466, -233946, 171632, -77670]
18040D9867a65184E9205b43018C91193E1915L13698a90250E582Q8666b64094C64753
18028E3881a4186n5820H0073a23275l23494B51335C5869i3316O154D038b18372
18016C72997A367O251L0381J87402K5798b49955A36983a9554A00381a42413O7476
18005g4937A99590e0040j5151B38150a46789C9033D413d3691A52850F3978b50995
17993a30100A86323j0410a42736C5894R3842c60932I7453l616J23340O4154D3072
17981E7370f1868A34906a50679k4676l9733A3008K34557j1047A05595J15231B0905
17969B77137m9426o2765b19353C1446d8065k78388h5494J7028k67222J63346A7406
17957A6354O5145k7206J65113E7210K957j8464d259A27162c72329i1493f082J920
$$ y = [49867, -165184, 59205, -243018, 391193, 51915, 365613, -190250, 5582, 94248, -264094, 364753, 53881, -14186, -70006, 80073, -123275, -446769, 251335, 35869, -93316, -87162, 4038, -218372, 372997, 1367, 7618, 37999, 225401, 251199, -249955, 136983, -19554, 100381, -142413, -74937, 199590, -50040, -65191, 238150, -146789, 39033, 4413, -43691, 152850, 63978, -250995, -130100, 186323, 175913, -142736, 35894, 129736, -360932, 97453, 93837, 217177, 281331, 43072, 57370, -61868, 134906, -150679, -175355, -215088, 13008, 247565, 236518, 105595, 220826, 20905, 277137, 227711, 164946, -219353, 31446, -48065, -326453, -85494, -68466, -335688, -172342, 17406, 16354, 81499, 54293, 219406, 57210, 60167, 41703, -4259, 127162, -372329, -91493, -6082, -4162]
17945d162J468A17273J2963O5399p7666o069k1753f2574k7791k0004A86405r1563
17933I4842e0045A24654b40415A40898h2142A14886N4035q3922c3983k60516a25267
17921f6336C5887J18001K1827E1884c733A18163d2468k60610A84772F8565d0524
17909b0028C47774A10265b9437G7258L9982a27853j54615J32366H9297A7681k888
17898A4793g7857G5306f2047C34396c7069j66208c5691D8130a57464D0594a17638
17886B0148p788J12217c00895A02815a43845E2022a452r1931A98251o9891N8901
17875A87261m999a93794B3501J99817a39559B86920a86257F341L2178j8744J6343
17864C6118a66757P6556G5246A2477g3990A55135l9346c2121l80869a902B1580
$$ y = [-4162, -2694, 117273, 130236, 195635, 117969, 111900, 90147, -62574, -90365, -110369, 186405, 94842, -50045, 124654, -240415, 140898, -82142, 114886, 168921, 84999, -33983, -294499, -125267, -66336, 35887, 153888, 175715, 51884, -3733, 118163, -42468, -303078, 184772, 68565, -40524, -20028, 347774, 110265, -29437, 77258, 117240, -127853, -282468, -150102, 89297, 17681, 14793, -77857, 75306, -62047, 334396, -37069, -203277, -35691, 48130, -157464, 40594, -117638, 20148, 12360, 124577, -300895, 102815, -143845, 52022, -1452, -93383, 198251, 128360, 187261, 182262, -193794, 23501, 223318, -139559, 286920, -186257, 6341, 38519, 19775, 36118, -166757, -90201, 75246, 12477, -73990, 155135, 115789, -32121, -412990, -1902, 21580]
17852C2874O7682K422O7534K03861a67411H8555j0502b25807B75021m3237E3123
17840a5769j89140A82459m1817c40389e8484J6799l26683b2373A21767i4535D6236
17828A21166b66775e2911l3016L682c1052B43009b52419B9556J92953B8925q269
17817B0656Q7946A3135f8343I396b28472F0640J2424i4464d3901C49184F9146
17805A28704C2999a4895j3224A03757c5895l4217J5974B33447a22663o6555Q523
17794a80695B51331j5735o7566i8952j73740R787A8746L5992J12705d8853D4523
17782A77671k4441K1226d8470m6730B19711b7012A20448E5909J87608j0989J9158
17771B51686o3101D5895b4438R705C67637j09639b31440J06140O1009a5137j67739
$$ y = [32874, 100556, 102978, 170512, 374373, -167411, 88555, 78053, -225807, 275021, 231784, 53123, -15769, -204909, 182459, 140642, -340389, -58484, -41685, -368368, -22373, 121767, -94535, 46236, 121166, -266775, -52911, -85927, -82245, -31052, 243009, -252419, 29556, 222509, 28925, 20656, 108602, 13135, -68343, 9396, -228472, 60640, 73064, -94464, -43901, 349184, 69146, 128704, 32999, -14895, -28119, 103757, -35895, -70112, -54138, 233447, -122663, -189218, -180695, 251331, 235596, 168030, -98952, -272692, -262905, 18746, 54738, 167443, -48853, 44523, 177671, 153230, 174456, -48470, -95200, 219711, -27012, 120448, 55909, 243517, 232528, 251686, 188585, 45895, -24438, -14733, 367637, 257998, -231440, -125300, -64291, -15137, -182876]
17760a82876A98092q2311J1897o3059g8832B44261a41363E6167J63844g7362A82139
17748a50097j73269g1668G8963M24495a23507B59075h4342A12698Q580b59173
17737a69954b1637j67330E26377A97278b37780D17977P3013k13607j17881a21047
17726C03648j16946q3091a94186B75597j02772K93642B31443M0234J50128j40707
17716B81098B4218g7393C35934a16280E0147b04091D7597a86310O2808j35839
17706b59341A15598m4878J27244K4875L9917d84040e9462D9538a5699B06212c8414
17694A80577i6125G2230K3901i9977b2966A93084l1786J79237f026j16255m3725
17683a66006l30485h0178B71180J85527A68332F7283a1069A97663h0276A25149
$$ y = [-182876, 198092, 115781, 127678, 64619, -78832, 244261, -141363, 56167, 220011, -77362, 182139, -150097, -323366, -71668, 78963, 503458, -123507, 259075, -84342, 112698, 121278, -259173, -169954, -21637, -188967, 526377, 197278, -237780, 417977, 490990, 277383, 159502, -121047, 303648, 186702, 103611, -194186, 275597, 172825, 466467, 231443, 271677, 421805, 281098, 24218, -77393, 335934, -116280, 50147, -204091, 47597, -186310, -123502, -259341, 115598, 70720, 197964, 222839, 262756, -484040, -59462, 49538, -15699, 206212, -38414, 180577, -96125, 72230, 96131, -99977, -22966, 193084, 161298, 340535, -6026, -122281, -166006, -496491, -80178, 271180, 456707, 168332, 67283, -11069, 197663, -80276, 125149]
17672A77535C6514K66091j42883J43059d8984m6719E923R8503Q7853c55233h8420
17660C12612h3450I0735b0055A89035D5114R6149K20253j56728J50895j67927
17650A87756a80456B41558D002K9457L3476i9502E851L58803A66956o2874P0959
17639A75041K22755A04644g297B32888L5374b47819C1768a81767f5487G2663O7839
17628A40502N2610G8682c24583e9344A75631p7274N6085a41988f9022A11383L60710
17617D72093a43404C01389Q54n2926B5328J19719K52092G8157d639A25239B4434
17605A9633a86410N435A20258E3139e4857B47592j2070a24724H4509o435a1124
17593A35179K03445j11850A2852O890J70605a65247G2107k6773d0151A80573A1850
$$ y = [177535, 36514, 302605, 159722, 302781, -48984, -95703, 5923, 104426, 192279, -355233, -88420, 312612, -83450, 90735, -20055, 189035, 45114, 141263, 361516, 204788, 355683, 187756, -180456, 241558, 4002, 33459, 66935, -99502, 5851, 364654, 166956, 104082, 175041, 397796, 104644, -7297, 232888, 268262, -247819, 31768, -181767, -65487, 72663, 140502, 193112, 78682, -324583, -59344, 175631, 98357, 154442, -141988, -69022, 111383, 472093, -143404, 301389, 302243, 249317, 25328, 145047, 397139, 78157, -4639, 125239, 24434, 19633, -186410, -180975, 120258, 53139, -54857, 247592, 235522, -124724, 84509, 78074, -11124, 135179, 338624, 226774, 12852, 19742, 190347, -165247, 72107, 45334, -40151, 180573, 11850]
17581G1622a0104A83669o3901B2930J07783J7801l6164a53738A38062J20406J7573
17570B76041A17141O4509i6366A20485j152K89511G9592L10513j40765h1141A49638
17558B10963Q7414A1189M00342c94323a23528C43345c96295A27579j8377K97600
17548D06802a28989C42543A4016K56910f0347B77182o9774J1445D7043a2977C41146
17536E4477L61323a32682K6359D5935K54809j10870L024K8805J77798J31737j8163
17525E13075q5704M34545K30814N974m50245j73963j74489J57591j58562J83673
17515D82709j02241K52431o1516m1576P7099J52737k97628N26546j04670l00533
17505E83358k140B24770J12956j62983o509J71706J30969k25073O1274j36725
$$ y = [71622, -10104, 183669, 119768, 22930, 130713, 148514, 112350, -153738, 138062, 258468, 276041, 117141, 181650, -96366, 120485, 119333, 408844, 79592, 390105, 249340, -81141, 149638, 210963, 298377, 11189, 411531, -394323, -123528, 343345, -396295, 127579, 109202, 406802, -128989, 342543, 14016, 270926, -60347, 277182, 207408, 218853, 47043, -12977, 341146, 54477, 415800, -132682, -106323, 45935, 300744, 189874, 192898, 221703, 399501, 531238, 513075, 427371, 861916, 1092730, 1098704, 648459, 474496, 300007, 457598, 299036, 482709, 380468, 632899, 571383, 529807, 606906, 759643, 462015, 988561, 883891, 583358, 581218, 224770, 337726, 174743, 168234, 339940, 470909, 245836, 307110, 170385]
17495A70385E7974a04074B45474n7515L1469R7909f545D04847m2778K45862A37365
17483E73697A47249N036K3279J28587A1931J03354K5626Q1047L4789b4810C12009
17471A86101J10422h4990C48335G2570K60828p9986J60235j13504p0467D0880
17460B81159J72915j25718J0840j64176M6483N8960l2563J99498M1470a11624
17449C46277j8737M7652L37792l48417k9071J12811N8518j32952q3127J48628
17439D39374j54438A38858K84518J72802k03236L39029l58096j55423R1179J41308
17429D50939j79810m102J67868M9880M0414k40976K6725Q0095A51958F6405K05068
17418B71473r3583L61042L8611A16123K69773j81171R4915J66486K00776C27002
$$ y = [170385, 57974, -104074, 245474, 187959, 219428, 317337, -6545, 404847, 362069, 607931, 137365, 573697, 147249, 152285, 175564, 304151, 11931, 115285, 140911, 221958, 256747, -24810, 312009, 186101, 296523, -84990, 348335, 72570, 333398, 253412, 413647, 300143, 229676, 40880, 281159, 454074, 328356, 339196, 175020, 221503, 280463, 247900, 447398, 488868, -111624, 346277, 327540, 375192, 712984, 364567, 335496, 448307, 506825, 373873, 290746, 439374, 284936, 138858, 423376, 596178, 392942, 731971, 373875, 218452, 309631, 450939, 271129, 267027, 434895, 484775, 525189, 284213, 310938, 391033, 151958, 66405, 271473, 177890, 538932, 577543, 116123, 385896, 204725, 299640, 466126, 666902, 327002]
17407C32489A34463a6111A31037A7528L54405l2946O2451A51305l6128k0686N0986
17396A45477b7487A67031M02128k71099J32104G2843N3548R7625R9707p4131R3014
17385C42606j15240j12680J09428J64517K13248A80598J54565A14084J06225L52770
17375E73079d7186C4160c6757B81918a72620A61891L13803j69570b00032C68934
17364D8143K75748a83798C5808J22539J57359n7726j7164J41359n8881C7100J13852
17353A50952A969N9111a6990D72965j67408o1095N1227E8179L7299g6964C79240
17341C21133N9982i594p1029B08196L11392k37057O5779K28794B45118K57522
17331E02640j44404R4292Q2777l9462E0759K08156J30119J03743k30697J7603
$$ y = [332489, 134463, -16111, 131037, 17528, 371933, 338987, 401438, 151305, 115177, 94491, 145477, -27487, 167031, 569159, 298060, 430164, 72843, 126391, 224016, 323723, 249592, 342606, 227366, 114686, 224114, 388631, 601879, 180598, 335163, 114084, 220309, 573079, -47186, 34160, -36757, 281918, -172620, 161891, 475694, 306124, -200032, 368934, 48143, 323891, -183798, 35808, 158347, 315706, 257980, 240816, 382175, 323294, 37100, 150952, 1969, 61080, -16990, 472965, 305557, 244462, 295689, 58179, 95478, -76964, 379240, 321133, 381115, -9594, -80623, 208196, 519588, 282531, 348310, 577104, 245118, 502640, 358236, 452528, 535305, 495843, 50759, 258915, 389034, 492777, 262080, 279683]
17321B79683j30074q912l1767J30040R501J02492j29839A3233K232J60232c8123
17309B30103K52956A2315J35286c0409B3552J10222J3008k7136E4742h9618C71100
17297G6705J74783k9787r9918M62806j00329k39699J10217j61991L14256j22455
17287C84588j91797L55630B63106H4194M20916F4317J33161b1683D61984k16369
17277B45615j5502J33405j48500G5399J8360j0318K95810o0111H7618a34359A69450
17265C50903H4925K62364C7954K74472A01148K20796B3862L0925L14755G487J48945
17254A56432J41386J17558D8441R7041J7426K51602A73654R2812K42877N0089
17244E59432C2099K13176J3934J87031j97971J24163I6804L60780j48741Q0999
$$ y = [279683, 149609, 140697, 108930, 238970, 248471, 350963, 221124, 13233, 15465, 175697, -38123, 230103, 483059, 12315, 147601, -30409, 23552, 133774, 146782, 119646, 54742, -89618, 371100, 76705, 251488, 221701, 121783, 584589, 484260, 244561, 354778, 192787, 507043, 384588, 192791, 548421, 263106, 84194, 505110, 64317, 197478, -21683, 461984, 245615, 230113, 363518, 215018, 75399, 93759, 83441, 379251, 319140, 87618, -134359, 169450, 350903, 84925, 347289, 37954, 312426, 101148, 321944, 23862, 54787, 369542, 7487, 156432, 297818, 415376, 48441, 145482, 162908, 414510, 173654, 266466, 509343, 559432, 32099, 245275, 259209, 446240, 248269, 372432, 96804, 457584, 308843, 389842]
17234C89842j24897P1817j25888R176L20939j24434l5586j17493r825R5757l9314
17223C10094o6115J15032A58155D3329K22431G6509M53667k19196A37250n3906
17213H3344L06419j49292J80666A49019L9469J33818J74313A91929q3194a705
17202C30085N6892E1722L71476D6737N00311A45312L68806j18566j74167K53088
17192D74473E8365L44568O5151k06810J83964m7884N3734L6429k36887R4615R3254
17181D38499r7242L04652C19382d9090C99782J94309j76078F4630K83456K75207
17171F23293n9892J52948C03310M7816J58187J55241m4791j48872J09659B04772
17160E12779B02520J7722K88916j95715C212K75740K0087J48522L0394L04628
$$ y = [389842, 264945, 336762, 210874, 220050, 540989, 416555, 380969, 263476, 253651, 349408, 310094, 243979, 359011, 158155, 43329, 265760, 76509, 530176, 310980, 137250, 83344, 389763, 240471, 421137, 149019, 188488, 322306, 496619, 191929, 108735, -1705, 330085, 386977, 51722, 423198, 46737, 547048, 145312, 514118, 395552, 221385, 474473, 58365, 402933, 468084, 261274, 445238, 397354, 451088, 487517, 250630, 345245, 438499, 341257, 645909, 319382, -49090, 399782, 594091, 418013, 64630, 348086, 623293, 563401, 716349, 303310, 351126, 509313, 664554, 619763, 470891, 580550, 204772, 512779, 202520, 220242, 509158, 313443, 3212, 278952, 299039, 447561, 477955, 782583]
17150G82583j55863B39352j16302K49857j03014k7651J45004P2152J7635L90835
17140H67868m31024p2260l3270K59219n1498p4372K34523k63953j90017J1734
17130B56950M26605B98863L09041J6615k31679M97209l49066A95398L15186n02
17120E10082r532j65835o0175K68392j04351p4343K62417j88220N34172C69928
17109D53634M8284L31414P7810j54390k38723P0811j67376p3189J96091R4430
17099F38796k33523K96473J38186l36084N3987m1943j94262J23846J3653K15839
17089F74968j08235P211K9462L0990p3671Q6221p2634j71582A82864O00084j7924
17078G65024l04509q183m3857M7681K09600k07491L56898J11629k97467j21690
$$ y = [782583, 626720, 239352, 123050, 372907, 269893, 242242, 387246, 459398, 477033, 867868, 436844, 364584, 331314, 590533, 539035, 464663, 699186, 435233, 245216, 256950, 683555, 298863, 607904, 624519, 392840, 890049, 540983, 195398, 510584, 510082, 500550, 334715, 274540, 542932, 438581, 364238, 626655, 438435, 972607, 369928, 453634, 501918, 833332, 911142, 756752, 518029, 588840, 421464, 348275, 544366, 638796, 405273, 701746, 839932, 503848, 557835, 515892, 321630, 445476, 459129, 674968, 566733, 573944, 603406, 634396, 560725, 646946, 574312, 402730, 182864, 782948, 765024, 460515, 452332, 408475, 456156, 665756, 458265, 815163, 926792, 629325, 507635]
17068E07635P2337J72335R144J12062l20878k19773p4244L85811K36894j52601
17058G28722j63647K15034j86106J76373l1683K90181D27870N00626r1166k21795
17048F15535L45872j34981k5110n5421N0457J01868j86735k6403n3833L56459
17038I87708J7640j01128m0524m5374K33200k11975o3407J40325R0114r5066n2024
17027H59489M521Q8788J64850j04746j95435R5727o8404j18058K05745J66118
17017A098595m53805J66087p6698J00721q814N7169J65965k04382j26761M03000
17007A121077J84871k89239Q7194l42033N20536k36100n1013M98528m12978J71370
16997A252213k61903J55836j8459L8551J20545k88113J61255j14505j59913K34351
$$ y = [507635, 579972, 752307, 761451, 873513, 552635, 332862, 258618, 644429, 881323, 728722, 565075, 780109, 594003, 770376, 738693, 1028874, 427870, 928496, 837330, 615535, 961407, 826426, 801316, 745895, 796352, 898220, 711485, 685082, 631249, 987708, 1005348, 904220, 863696, 818322, 1051522, 839547, 776140, 916465, 1006579, 911513, 859489, 864010, 952798, 1117648, 1012902, 817467, 913194, 844790, 726732, 932477, 1098595, 644790, 810877, 734179, 834900, 826086, 883255, 1049220, 844838, 718077, 1121077, 1305948, 1016709, 1103903, 761870, 1282406, 1046306, 995293, 1493821, 1080843, 1252213, 990310, 1146146, 1127687, 1166238, 1286783, 998670, 1159925, 1045420, 885507, 1119858]
16987A119858l7485J68632r477j64946K26990j32038n6613N0875J26012k85977
16977A005831L379J96109l97020N25490q199Q220k0336J12813k32479K51768j49270
16966A296306J46919k65519J98083j94315j8887M23537j90221N8658j6543o5380
16956A372638K34892l11604L83113l73978M7733N05902l03586K6214l66994J77500
16946A391830N51584m78415J85786k37369L47311l07986L56057m5898j67958K93043
16936A887985J53186j72052j76899J86815r6386r3151n7458K32447q9772L31036
16926B105751m60707j8771N76761m46574Q4917m2686M41271p7360L7145l88840
16916A810907o5329L26151m9157K41011J09213m1682r2539J34027O5156O130m37034
$$ y = [1119858, 1082373, 1251005, 1241528, 1076582, 1303572, 1171534, 1114921, 1165796, 1291808, 1005831, 1009210, 1205319, 808299, 1333789, 1325590, 1333810, 1313474, 1426287, 1193808, 1445576, 1296306, 1443225, 1177706, 1375789, 1181474, 1162587, 1586124, 1395903, 1454561, 1438018, 1372638, 1607530, 1295926, 1679039, 1305061, 1352794, 1858696, 1555110, 1581324, 1214330, 1391830, 1943414, 1464999, 1650785, 1413416, 1760727, 1452741, 1808798, 1762900, 1594942, 1887985, 2041171, 1869119, 1692220, 1879035, 1782649, 1689498, 1632040, 1864487, 1774715, 2105751, 1645044, 1626273, 2203034, 1756460, 1841377, 1798691, 2239962, 2162602, 2199747, 1810907, 1745578, 2071729, 2022572, 2263583, 2372796, 2331114, 2238575, 2372602, 2437758, 2443888, 2006854]
16905B006854J90569q4317L28732P4921l48466L09193K18005j58235l2162K65525
16895B770619j83568j37817L43278k92207L09472j05052n6070M00082j52109J04425
16885C001053K87144j74927j80069L63724l25283K07954k54053N17354l02016
16876C140881L46492m12003K44333o5274K81992k9182M1975O0204l9210L59411
16866C929619K5238j16389J27121j3543j9839j56925K46329j28553K09276J35588
16856D237922o981R7710r394L40161k66953o3861J85520K80052J01245j37290
16846D758131K0205K04085M14287P7797j14615j36695K73045k52905K08136J47630
16836E599101J62836j52337K60646L29464j81823N78900n16676J12062L31935
$$ y = [2006854, 2197423, 2113106, 2441838, 2516759, 2168293, 2477486, 2695491, 2537256, 2505094, 2770619, 2587051, 2449234, 2792512, 2500305, 2809777, 2704725, 2648655, 3048737, 2896628, 3001053, 3288197, 3113270, 2933201, 3296925, 2971642, 3179596, 2925543, 3442897, 3140881, 3487373, 3075370, 3319703, 3254429, 3536421, 3507239, 3549214, 3609418, 3570208, 3929619, 3954857, 3838468, 3965589, 3952046, 3932207, 3775282, 4021611, 3893058, 4102334, 4237922, 4230941, 4328651, 4319257, 4659418, 4392465, 4328604, 4514124, 4794176, 4895421, 4758131, 4778336, 4982421, 5396708, 5474505, 5359890, 5223195, 5496240, 5243335, 5451471, 5599101, 5761937, 5609600, 5870246, 6199710, 6017887, 6596787, 6080111, 6192173, 6524108]
16827F524108K85180l42056M08096M60113j10247k43354M51178l207L26620j31861
16817G624570N11162k6743O2096L33498O3250N28274j39265K72164M58451k10017
16807I477440m2280M83027K54998J08976J69283L97096J87935M28072K48814j29051
16797A1584310K65725M81272J72241K51008O54675M7368N32796n6013L98532M60925
16787A4792839K73770M83006K42754M90488N12676P69817J20332N62375N80934
16778A8828991K93536J053460k9660Q01632O95898M01064O37426Q86863O72499
16769B4241709P26401P62375Q18702J068186M04390J169664J078622J001115O93443
16760C1964607J013257J581706J212151J134435J162875J503663J166108J655601
$$ y = [6524108, 6809288, 6467232, 6875328, 7335441, 7225194, 6981840, 7433018, 7429811, 7756431, 7624570, 8135732, 8108989, 8171085, 8504583, 8567833, 9096107, 8956842, 9229006, 9687457, 9477440, 9435160, 9918187, 10173185, 10282161, 10451444, 10848540, 11036475, 11464547, 11713361, 11584310, 11850035, 12331307, 12503548, 12754556, 13409231, 13456599, 13989395, 13933382, 14331914, 14792839, 15066609, 15549615, 15792369, 16282857, 16795533, 17565350, 17685682, 18248057, 18828991, 19122527, 20175987, 20146327, 20947959, 21643857, 22044921, 22682347, 23569210, 24241709, 24968110, 25730485, 26549187, 27617373, 28021763, 29191427, 30270049, 31271164, 31964607, 32977864, 34559570, 35771721, 36906156, 38069031, 39572694, 40738802, 42394403]
16752D2394403J844189J195364K124442J269609J778067K317392J909877J570260
16744E6403603K167896K055497K492546K775795K029087K253292K441025K906260
16736G5525001K400842K548875K719623K641220K694028K526423K701829K253687
16728I6011528K272975K501388J957761K022783J720779J594262J304310J002034
16720A10387820Q24610L63227O8399L10976n23425n71650j038356j515274j123984
16711A07182343k100861j624155k141081k422896k302462k541206k536271k529224
16703H8984187k692216k648502k641966k728193k610638k570384k635308k254605
16695F8202375k295710k628660k079092k480584k004732k068223k179258j659096
$$ y = [42394403, 44238592, 45433956, 47558398, 48828007, 50606074, 52923466, 54833343, 56403603, 58571499, 60626996, 63119542, 65895337, 67924424, 70177716, 72618741, 75525001, 77925843, 80474718, 83194341, 85835561, 88529589, 91056012, 93757841, 96011528, 98284503, 100785891, 102743652, 104766435, 106487214, 108081476, 109385786, 110387820, 111212430, 111575657, 111644056, 111955032, 111431607, 110859957, 109821601, 108306327, 107182343, 105081482, 103457327, 101316246, 98893350, 96590888, 94049682, 91513411, 88984187, 86291971, 83643469, 81001503, 78273310, 75662672, 73092288, 70456980, 68202375, 65906665, 63278005, 61198913, 58718329, 56713597, 54645374, 52466116, 50807020]
16687E0807020j930151j786269j781890j647621j260281j453800j574665j377290
16679C7995053j170177j675414p25188j304684j055532j022301j014844o71656
16671B9355257j410012p25266q30128p79081p15483r42502q04507l72091p04759
16662B2071428p12985n38112r40788K0942j035941n02251m24662m92081l79610
16653A7065940m08360n96412p6294n56760l61768m17955n91205N8788k45337n39015
16643A3331622m00631n09956P4497l28363k17408o68617j75973p37m63093m9864
16633A0591477o9849l05772l68466n9303l04478l24337N3384n76219P0159k34091
16623H472505o8518l01414l8487q4707L9844j40943p1441l84353n4858l73944
$$ y = [50807020, 48876869, 47090600, 45308710, 43661089, 42400808, 40947008, 39372343, 37995053, 36824876, 35149462, 34424274, 33119590, 32064058, 31041757, 30026913, 29355257, 27945245, 27219979, 26389851, 25610770, 24895287, 23952785, 23148278, 22776187, 22071428, 21358443, 20820331, 19879543, 19900485, 18864544, 18362293, 17937631, 17445550, 17065940, 16657580, 16061168, 15984874, 15428114, 15066346, 14648391, 14057186, 14115974, 13870637, 13331622, 12930991, 12421035, 12495532, 12167169, 11949761, 11281144, 11105171, 11104434, 10641341, 10591477, 10521628, 10215856, 9847390, 9788087, 9483609, 9159272, 9212656, 8636437, 8706596, 8472505, 8403987, 8102573, 8064086, 7979379, 8019223, 7878280, 7806839, 7422486, 7367628, 6993684]
16613F993684o5127k88175N8107K95938r11178L77012k01092l77865N5386k76027
16603E660663J86825j56929K06385j95966j09694j11215k48171R4458m22947k5048
16593D878361j21792J02616l95821Q9641J3647l7458n1541M006l1527Q3838j84957
16582D349013J61122l65201j79358m4546m8574R3792j03470M4161k89083P136
16572C624992O6764k44720M36011k63546k85353N20780l17000l13684m92737K25366
16562B956873M77188O5661n48623L62929m83665N9722q49m3014L63366l21438
16552B888150k17449J62978q753K6743l35802K64454n3318j49223L6362J46819
16542B760961J2574j62270j20239K2948q7835j96975L40602l06057R0475k19560
$$ y = [6993684, 6928557, 6640382, 6698489, 6994427, 6083249, 6460261, 6259169, 5881304, 5936690, 5660663, 5847488, 5690559, 5896944, 5700978, 5591284, 5480069, 5231898, 5326356, 4903409, 4878361, 4756569, 4859185, 4463364, 4553005, 4566652, 4529194, 4477653, 4481659, 4450132, 4533970, 4349013, 4510135, 4144934, 3965576, 3921030, 3872456, 3966248, 3862778, 3906939, 3617856, 3624992, 3691756, 3447036, 3883047, 3619501, 3334148, 3854928, 3537928, 3224244, 2731507, 2956873, 3434061, 3499722, 2951099, 3314028, 2830363, 2890085, 2889236, 2846222, 3209588, 2888150, 2670701, 2833679, 2824926, 2851669, 2515867, 2780321, 2727003, 2577780, 2614142, 2760961, 2773535, 2611265, 2491026, 2513974, 2426139, 2229164, 2569766, 2263709, 2354184, 2134624]
16532B134624J00178j47691P3335R6954R22k63783l8304J9998J52885m88059N46891
16521B187950J2475j56754J8920P3186k23760k59131j5143L72768l73481L01864
16511A938894n8561k39431k0254N4025k52341M48767k54104J98100M2260j74472
16501A682883J81314n08013M92745m23910L9203J73668k02893K24848o6255L90867
16491A984457n88636L44044k94785j87207O5670J04000j97126J86933q3172N4272
16481A388450j43381K22094q6960k29355j54609K22446M1638J11160q7779q3853
16471A199851L3141J45637K3849j80555J10312J24773m29723L3178R4256L8867
16461A193586j43298K43397j45368m1002k54234N16547P3751m86893K96935j78839
$$ y = [2134624, 2234802, 2087111, 2160446, 2257400, 2258322, 1994539, 1956235, 1976233, 2129118, 1641059, 2187950, 2200425, 2043671, 2062591, 2135777, 1912017, 1652886, 1637743, 2010511, 1637030, 1938894, 1880333, 1640902, 1620648, 1674673, 1422332, 1871099, 1616995, 1815095, 1857355, 1682883, 1864197, 1356184, 1848929, 1425019, 1464222, 1637890, 1434997, 1659845, 1593590, 1984457, 1395821, 1739865, 1445080, 1257873, 1323543, 1427543, 1230417, 1417350, 1334178, 1388450, 1245069, 1467163, 1380203, 1150848, 996239, 1218685, 1260323, 1371483, 1283704, 1199851, 1232992, 1378629, 1402478, 1221923, 1332235, 1457008, 1027285, 1060463, 1154719, 1193586, 1050288, 1293685, 1148317, 1107315, 853081, 1369628, 1443379, 956486, 1253421, 1074582]
16451A074582j17034l0004K92679j47308j16615P5640K04159m40480J79343l02726
16441F72236M51614l50834L85207k19009q6047K6252J09220k57753k4759K02021
16431I08148m6998K12861k38324j3143K58205j96481O6288J83906k86838N0646
16421H98270J71557l18183J00991q5718J21817r7315k42634L49776j39948p3287
16411F85326K95967j54066k54463L22273j62962N1972k83514J15976J71379j0160
16401G77728l58790M90314j3628p2373j63929J21164j30399K50289D09486L60703
16391G70189J87188l96042J00029J80213k45968J74824j83795L29417j06544l54692
16381D54819K09123K23800j92461J80676k56408l8153M7286J7004j12766J76974
$$ y = [1074582, 957548, 927544, 1220223, 1072915, 956300, 1031940, 1236099, 795619, 974962, 672236, 1123850, 773016, 1158223, 939214, 853167, 879419, 988639, 730886, 706127, 908148, 861150, 1074011, 835687, 822544, 1080749, 884268, 950556, 1134462, 847624, 898270, 1069827, 751644, 852635, 766917, 888734, 791419, 548785, 898561, 758613, 685326, 981293, 827227, 572764, 895037, 732075, 784047, 500533, 616509, 787888, 777728, 418938, 909252, 895624, 823251, 659322, 780486, 650087, 900376, 409486, 770189, 957377, 561335, 661364, 841577, 595609, 770433, 586638, 916055, 809511, 454819, 663942, 887742, 695281, 875957, 619549, 581396, 628682, 645686, 532920, 709894]
16371G09894k43884j62242L42989B02523P43398j39480k55615k24214j3602Q3355
16361C96365K39558m1625j29498P716J60613j47520K22917A10460L19918o2427
16351C67951M1429K23127N7799k75805M59942j77137l40891P378j6819j4666J16296
16340D48604n8488A28707O18054j95331j92395j03594L16356l4341k37119j39346
16330A60991M48808j05169N5398J30538O6828l04627j53267L23984j49845j21825
16320C51814p3621M78481l58045K26973k82077L14154l3074k78981R0958j51673
16310B84909n1341J89622m4096j80938J10422K07202B7359M24254B21700K14039
16300D35739p0981k8267k1999A04568M02241Q3013n8850B65346K92306j01707
$$ y = [709894, 466010, 303768, 646757, 202523, 945921, 806441, 550826, 326612, 313010, 396365, 635923, 594298, 464800, 472516, 633129, 485609, 708526, 110460, 430378, 367951, 409380, 632507, 690306, 414501, 874443, 697306, 356415, 363793, 346974, 332308, 448604, 390116, 128707, 746761, 551430, 359035, 255441, 571797, 537456, 300337, 160991, 609799, 504630, 560028, 690566, 757394, 452767, 299500, 623484, 473639, 351814, 278193, 756674, 398629, 625602, 343525, 657679, 624605, 345624, 436582, 284909, 233568, 423190, 379094, 198156, 308578, 515780, 27359, 451613, 221700, 435739, 364758, 336491, 314492, 104568, 506809, 589822, 530972, 265346, 557652, 455945]
16290D55945j06918j45176N71428l48447q3624M92883B65994R4802J77273k5206
16280E12863J004j25893q2144G534K65734K87147d729B13082K22498P2043B39862
16268C50042M2014A67037J12060p669r0711n2171O8009M58342j73511A28970M46865
16257E75835j60226b07807B82800J09614J05280j05096j5903A2264L33219K14602
16247E60085G8479J45628J79003j43325b08815C66123K31284A17214L1732B8561
16236B38018Q2306p2547k029D9586L53153j23661I2276A3214P8002L12458c7751
16224D87790k43233n9072f2977B22302q8457P6240K55864A50599J68678a1634
16213C05954p8141K74797B41039k3152K16300G2951d8078A0996K97839A09285
$$ y = [455945, 349027, 203851, 775279, 426832, 343208, 836091, 265994, 360796, 538069, 512863, 513867, 387974, 305830, 7534, 273268, 560415, -4729, 213082, 435580, 507623, 239862, 350042, 392056, 167037, 279097, 271428, 180717, 128546, 196555, 654897, 481386, 128970, 575835, 415609, -207807, 282800, 392414, 497694, 392598, 376695, 12264, 345483, 560085, 78479, 224107, 403110, 259785, -208815, 366123, 597407, 117214, 148946, 28561, 238018, 320324, 247777, 245748, 49586, 402739, 279078, 92276, 13214, 91216, 403674, -37751, 487790, 244557, 185485, -62977, 222302, 133845, 210085, 465949, 150599, 319277, -11634, 305954, 227813, 502610, 241039, 217887, 434187, 72951, -48078, 10996, 308835, 109285]
16202F0953L1455N0933D9097N0639R8409J73792j05522J7208a16134B97617j17448
16191A80169b21895C62428J59959G4626a3901C87993a23844c6982n163C57323
16180e3216A46937L13714B20994K22964L550A67569N8055L4555d2118B06990o6769
16169A40221C6354j0104J69983a24953A24859P8906J07391j53011m3071J51292
16159B66366P9159j20325a65482A83439B7929L91801j73100o98K43654g6006B94910
16147E8026a643E7136L03315I9732P2452l5741k6475K04199A14341e4041G2969
16135f0798A81038L8167A04445N9382L4144n2723i059k43418B65699B8807J97499
16124B26306F8492b1580m3650A64273l0750b6783J2642A95334J07564j35764f6583
$$ y = [60953, 92408, 143341, 49097, 99736, 198145, 371937, 266415, 283623, -116134, 297617, 180169, -221895, 362428, 522387, 74626, -13901, 387993, -123844, -36982, -42145, 357323, -53216, 146937, 460651, 220994, 443958, 447508, 167569, 225624, 260179, -42118, 206990, 140221, 36354, 26250, 196233, -124953, 124859, 203765, 311156, 158145, 115074, 266366, 345525, 225200, -165482, 183439, 27929, 419730, 246630, 245932, 489586, -76006, 294910, 58026, -1643, 57136, 360451, 99732, 172184, 136443, 109968, 314167, 114341, -54041, 72969, -60798, 181038, 219205, 104445, 163827, 197971, 145248, -9059, -252477, 265699, 28807, 226306, 68492, -21580, -65230, 164273, 133523, -26783, -14141, 195334, 302898, 167134, -66583]
16112A06926K6916O0265i695G2521J85659F9952e0314C14846m8301C3842I617
16100H2945B4502J98337A6958R0787a52274L9525c5720C38151l2347L0381J24958
16089D61143b8608C80943B7318b2660C70166A4113K15756A7170N8211g7505j29876
16078b07381H4653N3449F1107J30080L64516b87295g7797j5584L3100G334b16801
16066a57438c9401k07660M0873Q7243A00268a84935L9494m1943A155K66214J11924
16055C79293j77619I9307R4306a01854B18348J04979K8155j22165n6457l8585
16045A34275f1129A7928J5802J03084F3623q95I006J90992H3626b81836g7276
16033A41135b24851c8268B0776M75K0814a1012B0537P4299e5776K5538A48708
$$ y = [106926, 133842, 194107, -9695, 72521, 258180, 69952, -50314, 314846, 266545, 33842, 9617, 82945, 24502, 222839, 16958, 107745, -152274, -112749, -35720, 338151, 305804, 336185, 461143, -28608, 380943, 27318, -22660, 370166, 14113, 229869, 17170, 75381, -77505, -207381, 84653, 138102, 61107, 191187, 555703, -287295, -77797, -93381, -60281, 7334, -216801, -157438, -39401, -247061, -206188, -118945, 100268, -184935, -145441, -187384, 1155, 267369, 379293, 201674, 99307, 193613, -101854, 218348, 323327, 351482, 229317, 172860, 134275, -61129, 17928, 33730, 136814, 63623, 62728, 9006, 199998, 83626, -281836, -77276, 141135, -224851, -38268, 20776, 21251, 42065, -11012, 20537, 94836, -55776, -30238, 148708]
16021A74588G818a22759D6539c7828a6007A18053N684h8256c4514A7436a87231
16009a26284A80705m7872a56692A87119F7565J57964a2259C58781A57773Q0005
15999B37778A1952D417A134a67890A26248J77030A46667F1393k1967K79168K32056
15988E50650J44519l33253Q04187j21906J82824p8476l20379C51351k8406H0671
15977A45123j0267f3103A66358C6535J15724a74125A39317h9852l7574H6332J90179
15966B76511A04351K23632a34792o8866f066D06678j5573B5758J4329G138K53625
15955B60763a56711r1818A6472J07044Q1064i6870L9731F089L52475c9550a1632
15943c3216p2691M9678j48897g2956j66827a4838G5706g7336q0417a2728B89460
$$ y = [174588, 7818, -122759, 46539, -37828, -16007, 118053, 123737, -88256, -34514, 17436, -187231, -126284, 180705, 132833, -156692, 187119, 67565, 225529, -12259, 358781, 157773, 237778, 11952, 4417, 1134, -167890, 126248, 303278, 146667, 61393, 39426, 318594, 550650, 695169, 361916, 1166103, 1044197, 1227021, 1148545, 828166, 351351, 322945, 80671, 145123, 134856, -63103, 166358, 36535, 152259, -174125, 139317, -89852, -127426, 86332, 276511, 104351, 327983, -134792, -203658, -6066, 406678, 391105, 25758, 40087, 7138, 260763, -156711, -248529, 16472, 123516, 204580, -96870, -57139, 6089, 358564, -39550, -11632, -33216, -105907, -56229, -205126, -72956, -239783, -14838, 75706, -77336, -157753, -12728, 289460]
15931C6626Q3691f4537k43083c3658B8925a8822f910E08c01358g3147j11912B31142
15918F916P580a50B34148f7084b919E34737C6126j2541b11669A16559a25076J6132
15906a08944A30845i4172B6137b02969m549K8997I6486i3128k26950C07729J7635
15895C25364d00759g1698n2966j33105A26264J34931a66553A06554O9114e8119
15884G886d0566A93R5754i8350d627k26877B8262e8439J8038p650b3563n6944
15872h0507A50249n6593D4373d03133A38164a06959k88265a61013m021r2833A21348
15860E3313P2630i2275B12733c0924m530G541K0296i213k42776A61634a10627
15848a00984j89759J25463d103A9508c67763e5866C04654A35106C8773c5352j36825
$$ y = [36626, 120317, -64537, -307620, -33658, 28925, -18822, -6910, 508, -301358, -73147, -185059, 231142, 6916, 14496, -150, 234148, -67084, -2919, 534737, 36126, 23585, -211669, 116559, -125076, -108944, 130845, -94172, 26137, -202969, -207518, -178521, 96486, -93128, -320078, 307729, 325364, -400759, -71698, -124664, -257769, 126264, 261195, -166553, 106554, 175668, -58119, 7886, -40566, 193, 95947, -98350, -4627, -231504, 28262, -58439, -40401, -48051, -23563, -80507, 150249, 93656, 44373, -403133, 138164, -106959, -395224, -161013, -165034, -257867, 121348, 53313, 125943, -92275, 212733, -30924, -35454, 7541, 27837, -9213, -251989, 161634, -110627, -100984, -290743, -165280, -4103, 19508, -367763, -55866, 304654, 135106, 38773, -35352, -172177]
15837a72177B2832L36805f1005A29856J7944a55984d130k84739O2596n9507B19924
15825d8598A33619a41900B00734c9983A1395h0j50979o5535a9162k19134A46723
15813a58262k07273a39799f1521j41058A41440L7697o1260a09475B86182J1778
15803B97960b58447f2312D2262J25812d99112K07697m7111j0594i6477n6302B84602
15791g5815A79950G5741i5303k03271J37912F5503L54171C6745J43727b17851
15780g2148p7151J2903M1446C233K82780a88534D5502e7404H7167b33598L7473
15769a96125A75229G9742j8428b08056j4118E0003K59732e2384A6326a03323E0002
15757H4368c09546G0446R992l9946R5224g6870D4323R1336a20825H6600b3888
$$ y = [-172177, 22832, 359637, -61005, 129856, 147800, -155984, -4130, -288869, -226273, -285780, 219924, -48598, 133619, -141900, 200734, -39983, 11395, -80, -151059, -216594, -19162, -238296, 146723, -158262, -365535, -139799, -61521, -202579, 141440, 179137, 117877, -109475, 286182, 297960, -258447, -62312, 42262, 168074, -499112, -291415, -338526, -349120, -96477, -152779, 284602, -75815, 179950, 75741, -95303, -298574, -160662, 65503, 419674, 36745, 180472, -217851, -72148, -149299, -136396, -94950, 3233, 286013, -188534, 45502, -57404, 87167, -233598, -196125, 175229, 79742, 61314, -208056, -222174, 50003, 309735, -52384, 16326, -103323, 50002, 84368, -309546, 70446, 80438, 40492, 135716, -76870, 44323, 135659, -120825, 86600, -23888]
15745f7367k58679B50766M5842L2774c00480a6222D28988F7736J5947A1811c18159
15733C48268j43841b26538J06559j13855A2942b0469k4550A69090h2697Q60l0574
15722a12411m0011B73788B7576h1713b7827m08487H7037J51657c01099a22468
15711A47862f5074J9695j13513A50991d2696A15032R9894c9611l4921j72978i1166
15699C1872J2264d5862k35898a00066k0471H0546h0904j68566o9330J37365j6937
15688a98372A5277O1241K772b43335F6314j4438b09112k1717F6419M7996e4954
15676b05435A58161m2914c05176B87967j32466K2116p1025l8371P5600J28738
15666B72559Q411j7862F7926a25839F8954J831g4296j55338C3581b60144e7903
$$ y = [-67367, -326046, 250766, 296608, 329382, -300480, -16222, 428988, 67736, 83683, 11811, -318159, 348268, 204427, -226538, -119979, -233834, 12942, -20469, -45019, 169090, -82697, -81837, -112411, -152422, 273788, 27576, -81713, -27827, -436314, 87037, 238694, -301099, -122468, 147862, -65074, -45379, -158892, 150991, -42696, 115032, 214926, -39611, -74532, -247510, -91166, 31872, 44136, -45862, -281760, -100066, -120537, 80546, -80904, -249470, -318800, -181435, -198372, 15277, 76518, 79290, -243335, 66314, 51876, -209112, -230829, 66419, 114415, -54954, -205435, 158161, 115247, -305176, 287967, 155501, 177617, 106592, 68221, 143821, 272559, 280970, 263108, 67926, -125839, 68954, 70785, -74296, -229634, 33581, -260144, -57903]
15654h5136B46J313a81040a9738A07815b06363k1229A40089A574a33902B0974
15642d3813A96420c34252J04846J13235p7792i6611A7716b63898E6208J91548
15632B47756A1433c7828B01149K6827j08198n3280J0106J29664M0401j9651G0559
15620b11195b6634k3749q3301j16436h174B30931a11782L4798A5313J63585N821
15609A84719b32397a04433C56981b31472K3762B89183a68609A00753f0406A87795
15598E7196c08601H0834k0595d7859q9985B9320b5021A42647d12658B5143i3942
15586a09917b6710p4840B03751b0290o385k94935J36733l94925b58207A81831
15575a83248J7914B94835F3778h3859k7297H4265L62578b74908f5982m7269o1349
$$ y = [-85136, 246, 1559, -181040, -19738, 107815, -206363, -227592, 140089, 1574, -133902, 20974, -43813, 196420, -334252, -229406, -116171, -193963, -96611, 17716, -263898, 56208, 247756, 11433, -37828, 201149, 227976, 119778, 66498, 76604, 206268, 246669, 227018, 70559, -211195, -26634, -50383, -133684, -250120, -8174, 230931, -111782, -76984, 15313, 178898, 184719, -232397, -104433, 356981, -231472, -207710, 289183, -168609, 100753, -60406, 187795, 57196, -308601, 80834, 60239, -47859, -137844, 29320, -25021, 142647, -412658, 25143, -93942, -109917, -26710, -101550, 203751, -20290, -26675, -321610, -184877, -579802, -258207, 181831, -183248, -165334, 294835, 63778, -83859, -111156, 84265, 446843, -274908, -65982, -113251, -174600]
15564a74600A09733b46782B13919i5450I810L6042c42830a11734j11505c0482
15553B65845C5610b04841c9095j18661f0499A59143a77527L1372C1766M4515K7242
15542A03523L55653F7389l0361j8476b53877f0132j84884f1768A02355h4281j27874
15531b12155A03588a53621B58534A03467r372g7144B87492D2479J97585q3817
15521A56247e5905K5521E40914A1443O3119L22680i1958B29383G1787J26092r3306
15510A04573J59084E3067R3949r868M7797e2566r8928k9241A90380b566n7591
15499f0157B37005D1495a43945A84012E7743a89249R1192A51055H317J05252b06805
15487A39480J7042k4450a00675p3023H3092b77580b0190G3026Q967l0346L03909
$$ y = [-174600, 109733, -246782, 213919, -95450, 9810, 45852, -342830, -111734, -223239, -30482, 265845, 35610, -204841, -39095, -157756, -60499, 159143, -177527, -146155, 31766, 76281, 103523, 459176, 67389, 37028, 18552, -253877, -60132, -245016, -61768, 102355, -84281, -212155, 103588, -153621, 258534, 103467, 94095, -77144, 287492, 42479, 240064, 156247, -55905, -30384, 540914, 11443, 74562, 397242, -91958, 229383, 71787, 197879, 104573, 263657, 53067, 147016, 137148, 184945, -52566, -151494, -180735, 190380, -2566, -60157, 237005, 41495, -143945, 184012, 57743, -189249, -98057, 151055, 8317, 113569, -206805, 139480, 156522, 132072, -100675, -173698, 83092, -277580, -20190, 73026, 81993, 51647, 355556]
15476C55556j70110J66225L33799j7536l8252B42256m6666n2157g1998K1856A35447
15464A06440K05144p2280G7758N60440B26088o5362b76356G3879Q7664J51907
15454C13450M4387g3491B167J07249b8660a0806j3702H4202c58997B97557H553
15442D68134j13928P78561k19076j32048k25807k55779e2361A5413g7459I5953
15431C25415j21786B9310P4209a02892B66583I0018b97674b9703A90959J44036
15421C34995a61132G0573e6137D1370a3594l08380C47401a2493B5839g7934C2518
15409h3613j73663Q3984C33720g7532n3241B32316F2629b8629r839k19464A15282
15397b19091g807k13657C7874O9281g7454d749j97881A09521b2424J0634e640
$$ y = [355556, 185446, 351671, 685470, 667934, 629682, 242256, 195590, 143433, -71998, -50142, 135447, 106440, 311584, 239304, 77758, 638198, 226088, 160726, -276356, 73879, 161543, 313450, 357837, -73491, 2167, 109416, -28660, -10806, -24508, 84202, -358997, 297557, 8553, 468134, 354206, 1132767, 913691, 781643, 555836, 300057, -52361, 15413, -77459, 95953, 325415, 203629, 29310, 103519, -102892, 266583, 90018, -297674, -29703, 190959, 334995, -161132, 70573, -56137, 41370, -13594, -321974, 347401, -12493, 25839, -77934, 32518, -83613, -257276, -173292, 333720, -77532, -130773, 232316, 62629, -28629, -38468, -257932, 115282, -219091, -7807, -221464, 37874, 107155, -77454, -4749, -202630, 109521, -22424, -11790, -5640]
15385c56098D96836A28684a83395C67022A34115b48737I0911J05008J128g0344
15374b28329b4332l211A33975K70775c10497J31695A23455k8398q670Q9882f8687
15362A82827k1798J6812g3976C5960a29716B3112L57512K206j26956d6857p4816
15351a21673A34716L8201p2359J94148A14212J24831A11203J92484J36263A57123
15340D05344q8F7214a1070C44427A69665K11654b58721J14747B05949c7257a6780
15328B29200d9265E8578a7809o9762C10050P1115A73702a47756I6559m7529M00682
15317D49712H6949L4721E6281K20722A03947C4553L0463J94362j00676K28432
15307C87134F9197a19315r1149G0009K68769a57041B8602g5757C2624J02953O5708
$$ y = [-356098, 496836, 128684, -183395, 367022, 134115, -248737, 90911, 195919, 197047, -70344, -228329, -24332, -27543, 133975, 404750, -310497, -178802, 123455, 95057, 86387, 176269, -68687, 182827, 161029, 177841, -73976, 35960, -129716, 23112, 380624, 382830, 255874, -46857, -121673, 134716, 172917, 100558, 294706, 114212, 239043, 111203, 303687, 439950, 157123, 405344, 405256, 67214, -11070, 344427, 169665, 381319, -258721, -143974, 205949, -37257, -16780, 229200, -49265, 58578, -17809, -87571, 310050, 381165, 173702, -147756, 96559, 49030, 449712, 86949, 121670, 56281, 277003, 103947, 34553, 65016, 259378, 158702, 387134, 69197, -119315, -210464, 70009, 338778, -157041, 28602, -75757, 32624, 135577, 201285]
15296B01285a25160k1538f3431B5834b93798h3768D36200a42884K4656B80245
15285b19231a8210j71648l5575J5342D0722b6730j7617B51014G5142O5796b66015
15273B9507c1569B50941M913j01716B6699p189b18260a3137B37523f6678A20742
15261g8772A90817c2517l6893A6569f6148A58854J211C1741d0675n3469F4743
15249c3611A93054p6037O4641c1173D08763j14005L34644J272390m07861j6493
15239A477438P2858E24520B11389A0978P8571h0883A51240k3810n3056j9048a0690
15227a32240A6856c9228D1921A1540J33100k8834e2948B28716O145a37946G6028
15215c57870A25942K40233c34294A45438Q6258b2718j43256b4294A20926a51676
$$ y = [201285, -125160, -146698, -63431, 25834, -293798, -83768, 436200, -142884, -118228, 280245, -219231, -18210, -189858, -225433, -210091, 40722, -26730, -44347, 251014, 75142, 140938, -266015, 29507, -31569, 250941, 255854, 154138, 26699, 19510, -218260, -13137, 237523, -66678, 120742, -78772, 190817, -32517, -69410, 16569, -66148, 158854, 160065, 31741, -40675, -94144, 64743, -33611, 193054, 117017, 181658, -31173, 408763, 294758, 629402, 1901792, 1493931, 1477438, 1550296, 524520, 211389, 10978, 89549, -80883, 151240, 127430, 74374, 55326, -10690, -132240, 16856, -39228, 41921, 11540, 144640, 115806, -52948, 228716, 234861, -137946, 76028, -357870, 125942, 366175, -334294, 145438, 231696, -22718, -165974, -24294, 120926, -151676]
15204G7367J75624I1303R8844b3363A32884C5991J64193a54288O2483a7131k3894
15193d1025r0316M8366A23938R6883a04487A96659e2845n2906q4904k7693A44516
15181C40302a75369A84116A5863a57786a3355C1655J24303c13680C9347L8603
15171G7950a9102j10480c2019j9217A17117b06692c4191a0192l41410A78360a14635
15159A80334a27909J5235e6176B58994a94943K8674P1765j0674d8295m3242k02851
15148b94388G9840k7426a18311E6771k56K70296j23942a10619B3548E265K24225
15137B29490g9370G4840J03605h3774C7217a81383D96842B1442K60450A40390
15126a03105F1279a38138C36204A66512d3417D45628p0250o0800L4879j3575L40599
$$ y = [77367, 252991, 91303, 190147, -23363, 132884, 35991, 200184, -154288, -91805, -17131, -41025, -131341, -82975, 123938, 220821, -104487, 196659, -52845, -105751, -190655, -218348, 144516, 340302, -175369, 184116, 15863, -157786, -13355, 31655, 155958, -313680, 39347, 77950, -19102, -129582, -32019, -51236, 117117, -206692, -34191, -10192, -351602, 178360, -114635, 180334, -127909, -112674, -56176, 258994, -194943, -166269, -94504, -105178, -48295, -91537, -294388, 79840, 52414, -118311, 56771, 56515, 326811, 202869, -110619, 23548, 5265, 229490, -79370, 74840, 178445, -83774, 37217, -181383, 496842, 21442, 281892, 140390, -103105, 61279, -138138, 336204, 166512, -43417, 445628, 375378, 314578, 349457, 335882, 676481]
15115F76481a06460G3744l1116g4575B14967j6881n8184b63543B09920a14168
15104b11234M8372A50302E6777J39177O794J61678A4267B805K47405e7710H5616
15092B11004O3797g0765O803A61430n6011J25144F3232J21288G7166K55197q7513
15081B44850a01427B5741J76563K43607j99043C406a83191C37242a8949B18046
15070A82212a7381B8610J21901d6216C37868C9461J1947a1996D92980I5373L2930
15059A28303e0264m6232B14020R1005C1901L93005j42220m2527n7210d3880E2394
15047C45713Q1869B07914o4625L44894A97886a53201D64884J94167A79275K31019
15037D10294B02398J55526G043K19168K09495A85785K60572k8174J09035M59586
$$ y = [676481, -106460, 73744, 42628, -74575, 214967, 198086, 139902, -263543, 209920, -114168, -211234, -162862, 150302, 56777, 195954, 202748, 364426, 14267, 2805, 250210, -57710, 85616, 211004, 274801, -70765, -63962, 161430, 105419, 230563, 63232, 184520, 77166, 332363, 244850, -101427, 25741, 202304, 445911, 246868, 3406, -183191, 337242, -18949, 218046, 182212, -17381, 28610, 150511, -46216, 337868, 39461, 51408, -11996, 492980, 95373, 128303, -50264, -96496, 214020, 305025, 31901, 424906, 282686, 240159, 182949, -43880, 52394, 345713, 427582, 207914, 143289, 488183, 197886, -153201, 464884, 659051, 179275, 410294, 202398, 357924, 7043, 226211, 435706, 185785, 446357, 418183, 527218, 986804]
15027I86804j87130N5544C05486J41538F657M68021R6501j92745P5394j32739
15017C21089K48379j84742m7804P4840A95095L52614m4966k16440q0933N33580
15007G38950A12059J0327M28868k24581J56902k28789O9194J15689A42004L40182
14997D82186j4143k14843A10793M3937L10244q3202L5045N8508O9853j22787Q0075
14986E02466j57309J28337J5408J50680j52286L3306K93592k75826K71625k07869
14976F02124j80670P7430N3742l3505P0621J661k3239k17516L44262A50154L15158
14965D65312A54533K03045R6448M7904j95440L9991j48336O6560L936l921R8739
14954C63459r4336B0410K48747J58785O7922j75681J26753A65345a4078E52647
$$ y = [986804, 799674, 855218, 305486, 447024, 6657, 474678, 571179, 378434, 453828, 321089, 569468, 384726, 336922, 411762, 195095, 547709, 502743, 286303, 205370, 738950, 112059, 122386, 551254, 326673, 483575, 254786, 323980, 439669, 142004, 482186, 468043, 253200, 110793, 154730, 464974, 381772, 416817, 475325, 545178, 422391, 502466, 345157, 473494, 488902, 639582, 487296, 520602, 814194, 538368, 809993, 602124, 421454, 498884, 552626, 519121, 589742, 591403, 568164, 350648, 694910, 150154, 465312, 154533, 357578, 454026, 501930, 306490, 346481, 198145, 264705, 268641, 264720, 363459, 269123, 20410, 269157, 427942, 495864, 320183, 446936, 165345, -14078, 552647]
14943A12031N75421k46969L43478A37054J57672J77484E5819b5531B61788J21750
14933C83538L4160J10812P2547L59691L72374k67468o4067J84752J0431L41372
14923A538142j81863J31045p8492l81693K29200M47217K5719M46919k75928M9598
14913A949864o37650k86166o8118J5332k45005E9067L66952k0501K22940k71639
14903C56819J09315K33200C09640n193A43742K00753l7252Q3305J76547B47419
14892B74776J95802m5621K400G7615L05074K2457K35323k04713M96328j47976
14882G84108k41137O4459k07583L24099k48413L26818j98562j4818A22543L6147
14872A58690l550K8718M15319j69963l7002N8004O7240L29576D07819L55385C77877
$$ y = [112031, 687452, 440483, 783961, 137054, 294726, 472210, 55819, -25531, 261788, 383538, 417698, 528510, 601057, 960748, 1333122, 1065654, 1001587, 1186339, 1196770, 1538142, 1356279, 1487324, 1408832, 1027139, 1256339, 1703556, 1729275, 2176194, 1900266, 1949864, 1312214, 1026048, 957930, 973262, 728257, 59067, 426019, 405518, 628458, 356819, 466134, 699334, 309640, 304447, 143742, 344495, 307243, 390548, 567095, 247419, 274776, 470578, 424957, 427357, 77615, 382689, 405146, 640469, 435756, 932084, 784108, 542971, 607430, 399847, 723946, 475533, 802351, 603789, 588971, 122543, 158690, 155140, 183858, 599177, 429214, 392212, 450216, 517456, 847032, 407819, 763204, 377877]
14860H75014A26495N65963C19203O5224p2357J18608J22373A97997J89945M3892
14850D31834M8037o7484J21129r802K7265J07186K11393j43411K85479L1463j33797
14839I09292J41622q3610n967j674k12860C72237j74J71198j50034J36444r7273
14828D32398l4038A56428O95458A76619N33832l29816L2165P5611q7204K37908
14818F39115M3256l1927J34760r1978j82334M93386k63554K2984A19689N73951
14808F93640j88786K79222B98804L96878M6626N74861F31782J07039K59677l47911
14798F50587n839k54993P1532n7697K02553A89653K31757B8527O82669k02374
14788E08822j09512L1870j8810J47488j3727Q6419J63188C07590J86460j19482
$$ y = [875014, 126495, 692458, 319203, 384427, 312070, 430678, 553051, 197997, 387942, 431834, 479871, 412387, 533516, 523714, 550979, 658165, 869558, 726147, 1011626, 1043089, 909292, 1050914, 967304, 961337, 959663, 746803, 372237, 372063, 543261, 393227, 529671, 432398, 398360, 156428, 851886, 176619, 710451, 380635, 412800, 488411, 401207, 639115, 682371, 650444, 785204, 693226, 510892, 1004278, 740724, 763708, 119689, 693640, 504854, 784076, 298804, 695682, 742308, 1317169, 631782, 738821, 998498, 650587, 644748, 389755, 461287, 403590, 606143, 189653, 421410, 28527, 711196, 508822, 399310, 431180, 412370, 559858, 546131, 632550, 795738, 307590, 494050, 374568]
14778C74568J50858M9287P0900L00834K08763j93197q7041k83759L46718l47953
14768E89978r6863K22420R4148l32834N1333j47250J04790N6199j28828A27403
14757D46831J73057J27358k49877j81116J15854K89275j48122J56291l49567L38750
14747G18734P3605j49174j0330k09304K40326j29936L94162l40568j54267Q9715
14737E22963P4807l9536B35001N80880j70612l3694K15181j60941M66686k80707
14727H51794P07847p0751J28716m746m81676r8469k19533L14626j28512j97708
14717H01588l23145K36043m7564J79120l00374M1690M34259l97904R5173k6310
14707F92576J19074M42057l29581Q16O5130Q3472L80685K24067J47621q6535p27686
$$ y = [374568, 525426, 574713, 645613, 946447, 1155210, 962013, 874972, 591213, 937931, 589978, 493115, 715535, 809683, 476849, 528182, 380932, 485722, 541921, 413093, 127403, 446831, 619888, 747246, 497369, 316253, 432107, 721382, 573260, 729551, 379984, 718734, 792339, 643165, 632835, 423531, 663857, 533921, 928083, 587515, 433248, 522963, 597770, 558234, 235001, 815881, 645269, 611575, 826756, 665815, 1132501, 851794, 1559641, 1488890, 1617606, 1612860, 1131184, 1032715, 813182, 1127808, 999296, 801588, 478443, 714486, 666922, 846042, 545668, 587358, 1021617, 623713, 718886, 692576, 811650, 1253707, 924126, 924942, 990072, 1073544, 1454229, 1678296, 1825917, 1739382, 1011696]
14696A011696j65153K08891m00454q7682K97426J87237P003k34058j15044Q6086
14686G95948K13304k89237o9709J4014K62791j15567k95880L54072k82943J56904
14676G43697L03095D78074K96896J93647k0826m27596O07332k09661j92546k40314
14666D85006L23350J34899j75023k31027L87464j79133l4735O2998O0977N8864
14656H93640l01825K96091N3166J19925m0736k64014K38120M0549k75603K85284
14646A044597j65895M01587k10898j849l63254P5934L41228l07755K39520k89804
14636G63411J85109j52118J17389M0572l42122J85948M54787M1780k58139L37062
14626A373679k74663k54388J19246M06234m04746L14523j39582J57014k62238
$$ y = [1011696, 846543, 1055434, 654980, 567298, 864724, 1051961, 1058964, 824906, 709862, 795948, 1009252, 720015, 650306, 664320, 927111, 811544, 515664, 869736, 586793, 743697, 1046792, 478074, 774970, 968617, 947791, 520195, 1127527, 917866, 725320, 485006, 808356, 943255, 768232, 537205, 924669, 745536, 710801, 773799, 834776, 893640, 591815, 887906, 941072, 1060997, 1020261, 756247, 994367, 1034916, 759313, 1044597, 878702, 1280289, 1069391, 1067542, 704288, 780222, 1121450, 813695, 1053215, 763411, 948520, 796402, 913791, 954363, 612241, 798189, 1252976, 1294756, 1036617, 1373679, 1099016, 844628, 963874, 1370108, 965362, 1279885, 1140303, 1297317, 1035079]
14617A035079M52718l26467M5769J65122p7875Q32j4748k98354L48731o34752
14607F96055M70318K31583N023k42472J05495R4320r3588R48J1104j37037J90301
14596A332050p0847J82396l68727L79650J79453m28525L87139j27592r6624K42337
14586A610710j53286J48693l5328n6436Q5798l38454L44806j49798L96982j86847
14576A666840K25124N2120l75556J17939L52903k46472m3520J99951j65026L2192
14566A816495j36824M9328J65304J61321r4433L34275k12661k48204K56045j47582
14556A943064N12610j31338N98743k49775O34000M55956J189666J214557L417265
14547I584748P406216J5059295J1062201k0032796G615169C396427q72793l17925
$$ y = [1035079, 1487797, 1161330, 1207099, 1372221, 1294346, 1295178, 1280430, 982076, 1330807, 696055, 1166373, 1397956, 1402979, 1160507, 1266002, 1360322, 1266734, 1267682, 1278786, 1141749, 1332050, 1261203, 1443599, 1074872, 1454522, 1633975, 1205450, 1592589, 1464997, 1368373, 1610710, 1457424, 1606117, 1570789, 1514353, 1600151, 1261697, 1606503, 1456705, 1853687, 1666840, 1891964, 1944084, 1568528, 1686467, 2039370, 1792898, 1749378, 1949329, 1784303, 1816495, 1679671, 1728999, 1894303, 2055624, 1961191, 2295466, 2082805, 1834601, 2090646, 1943064, 2455674, 2324336, 2923079, 2673304, 3307304, 3763260, 4952926, 6167483, 9584748, 16990964, 32050259, 43112460, 23079664, 7615169, 3396427, 2523634, 2205709]
14539B205709Q92191J260296p16100j463063m82136j36660R0051j28660K44314
14530A765942k26444K42856j11115J33958N248k09352K89613R9980r5620l3438
14520A861628k28322O2212L50112J22565l36642k4043K29501J16926j2268P387
14510B149056p4856j44829K38168J19463j79422K11286j0518J94229l0339j30498
14500B341740R6128K86401k9238k14318j4884O2602Q4742J06486J4298K01078
14490B935035L2729N2690k13648O9118L24113m46138J69255M4196J31316k99598
14480B799068J75817J14972m9087J82608o0199K10329j04928j6140K50086P2664
14470C575190J15917k18893K25553J1339o9019Q4815m1120K68311J3087L48594
$$ y = [2205709, 3097900, 4358196, 3642096, 2179033, 1696897, 1560237, 1650288, 1521628, 1765942, 1539498, 1782354, 1671239, 1805197, 1810445, 1601093, 1890706, 1990686, 1895066, 1861628, 1633306, 1695518, 2045630, 2168195, 1831553, 1807510, 2037011, 2153937, 2141669, 2149056, 2074200, 1929371, 2167539, 2287002, 2107580, 2318866, 2308348, 2502577, 2472238, 2341740, 2437868, 2724269, 2695031, 2480713, 2465829, 2528431, 2613173, 2719659, 2733957, 2935035, 2967764, 3020454, 2806806, 2875924, 3200037, 2753899, 2923154, 2967350, 3098666, 2799068, 2974885, 3089857, 3040770, 3223378, 3163179, 3373508, 3268580, 3252440, 3502526, 3575190, 3691107, 3472214, 3697767, 3709106, 3640087, 3724902, 3683782, 3952093, 3965180, 4313774]
14460D313774j59474l65953L14373o83061P48196j0013l53624K48724L10588J00956
14450D464486j3169K24494k02823J2218L13986k93736M47845n18286L46175J12424
14440D893614j28866K40707M04070j12347q3626m7651P9593J36270M6334K78804
14430E706902J57494p4471k27761M99772O769j54233L07160J09394J43389k35622
14420F238793O99119J34223J57463r8045k85156K77620K00695k51080N0781L02865
14410G427278j08941O5940N54952p9815L28832k6000M38702j34529K6677j32509
14400H360587K14270L93153j53470N3648L26392J69418j71760K90014L61749j36105
14390I707896N00324J83894L060J97520K45191J09252J62211M37173O9393K62899
$$ y = [4313774, 4154300, 3788347, 4102720, 3419659, 4167855, 4157842, 3804218, 4052942, 4363530, 4464486, 4451317, 4675811, 4472988, 4485206, 4799192, 4505456, 4953301, 4435015, 4781190, 4893614, 4764748, 5005455, 5409525, 5297178, 5213552, 5165901, 5245494, 5381764, 5428098, 5706902, 5864396, 5789925, 5562164, 6061936, 6068705, 5914472, 6221632, 6331026, 6474415, 6238793, 6937912, 7072135, 7229598, 7131553, 6846397, 7124017, 7324712, 7073632, 7124413, 7427278, 7318337, 7384277, 7939229, 7859414, 8188246, 8162246, 8600948, 8466419, 8493096, 8360587, 8574857, 8968010, 8814540, 8868188, 9194580, 9363998, 9192238, 9482252, 9844001, 9707896, 10208220, 10392114, 10395174, 10592694, 10837885, 10947137, 11109348, 11546521, 11615914, 11878813]
14380A1878813N01129K5271J11413L15431K16259K66072J29745M67047J10429
14371A4021609K71019R2923M25182N84401J43126M98392L34170J96475J94358
14362A6761655M95138M39897J67970O74198K05921N03783M63797L37276N91261
14353B0640896N19580J3066J087789L64449K67670P07865N58038L54527J111353
14344B5625233N48245N15650R10769P66757R53546O86059Q44224J048458P77568
14335C2676509R66341P82678P87503J243715J909561P27862J121060J437536J423701
14326D3076466J268560J523957J359553J485084K259953J807308K004673J871574
14318E6657128K096034K438853J967956K364193K627933K836466K786779L279481
$$ y = [11878813, 12379942, 12405213, 12516626, 12832057, 13048316, 13314388, 13444133, 13911180, 14021609, 14292628, 14385551, 14810733, 15395134, 15538260, 16036652, 16370822, 16567297, 16761655, 17256793, 17696690, 17864660, 18538858, 18744779, 19248562, 19712359, 20049635, 20640896, 21160476, 21173542, 22261331, 22625780, 22893450, 23601315, 24159353, 24513880, 25625233, 26173478, 26689128, 27599897, 28366654, 29320200, 30006259, 30850483, 31898941, 32676509, 33642850, 34425528, 35213031, 36456746, 38366307, 39094169, 40215229, 41652765, 43076466, 44345026, 45868983, 47228536, 48713620, 50973573, 52780881, 54785554, 56657128, 58753162, 61192015, 63159971, 65524164, 68152097, 70988563, 73775342, 77054823]
14310G7054823K959982L670012L618264L936730M262716M403876M596160N207458
14302A09710021N329444N658829N929613O441376O780031P312036Q191702P769339
14294A63122391R308399R333274J0181811J0765523J1710043J2045090J2942477
14287B39409008J3589523J4428864J4494326J6114380J5838775J6551455J6618352
14280C47044683J7353306J6671608J6135772J5354854J4601363J2801544P420442
14273D47383572M194558K293639M94300N60970L974r01223q70226p632345j1065220
14264D34461999j2764467j3799883j5421220j6430021j7031673j6823188j7036412
14257C25155135j6597773j6092286j5453920j4878186j4295277j3601956j2803131
$$ y = [77054823, 80014805, 83684817, 87303081, 91239811, 95502527, 99906403, 104502563, 109710021, 115039465, 120698294, 126627907, 133069283, 139849314, 147161350, 155353052, 163122391, 172430790, 181764064, 191945875, 202711398, 214421441, 226466531, 239409008, 252998531, 267427395, 281921721, 298036101, 313874876, 330426331, 347044683, 364397989, 381069597, 397205369, 412560223, 427161586, 439963130, 447383572, 451578130, 453871769, 454366069, 454927039, 454931013, 454029790, 453159564, 445527219, 434461999, 421697532, 407897649, 392476429, 376046408, 359014735, 342191547, 325155135, 308557362, 292465076, 277011156, 262132970, 247837693, 234235737, 221432606]
14250B21432606j2230385j0537057r408927j0366792r650589q868586p834971
14243A52535299p549067p407935o949108o524785n708479n447253m994348n116052
14235A02838272m522919m243695m153070l777715l215722l391068l424590l173372
14227G2936121k755978k833146k831640k400868k108760k017192k387617j553954
14219E4046966j796517j914964j392634j747023j760040j240741p74282j578245
14211D1842520j445700j404062j003302j066338o81409j058897j091545j052862
14203C3038405p32336j250347o34267q15326o15801j060640o69187p64499n48652
14194B5947350o40329k58915j037932p42207l63969p11227n57392k26020p65636
$$ y = [221432606, 209202221, 198665164, 189256237, 178889445, 169238856, 160370270, 152535299, 144986232, 137578297, 130629189, 124104404, 118395925, 112948672, 107954324, 102838272, 98315353, 94071658, 89918588, 86140873, 82925151, 79534083, 76109493, 72936121, 70180143, 67346997, 64515357, 62114489, 60005729, 57988537, 55600920, 54046966, 52250449, 50335485, 48942851, 47195828, 45435788, 44195047, 43420765, 41842520, 40396820, 38992758, 37989456, 36923118, 36241709, 35182812, 34091267, 33038405, 32306069, 31055722, 30421455, 29606129, 28990328, 27929688, 27260501, 26496002, 25947350, 25307021, 25048106, 24010174, 23267967, 22903998, 22192771, 21635379, 21409359, 20643723]
14185B0643723n83859j44358m89746p49268Q1646o23550k97060k48619p02692
14176A6886217l12362l55480k92439l72554j15561k52675m17230m82684j41724
14167A4143508j47391l80130r4358l03034j45300k26018l44584p6228l64415J90663
14157A2252713p65393l0346m35415J6719K28952m93051m82848K39942l84602k67311
14147I879360K30841m45332j70305l13583j83165P6932j02919k36824O3859j26679
14137H672185l05058l07221o6291J96232q4640j00673j51051j81228l75373p864
14127G289018k3j18881n4841k69769L75730m57278L3213l89303K51802l37000
14117F322668R7360l64921K4201r9599l4012k4175p4546k45071j25758M56764
$$ y = [20643723, 20059864, 19915506, 19425760, 18676492, 18758138, 18134588, 17837528, 17588909, 16886217, 16573855, 16218375, 15925936, 15553382, 15437821, 15185146, 14767916, 14285232, 14143508, 13996117, 13615987, 13521629, 13218595, 13073295, 12847277, 12502693, 12426465, 12062050, 12252713, 11487320, 11456974, 11021559, 11038278, 11267230, 10774179, 10291331, 10531273, 10146671, 9879360, 10110201, 9664869, 9494564, 9180981, 8997816, 9074748, 8971829, 8735005, 8798864, 8672185, 8367127, 8059906, 7993615, 8189847, 8105207, 8004534, 7853483, 7672255, 7296882, 7289018, 7288995, 7170114, 7115273, 6845504, 7221234, 6763956, 6797169, 6407866, 6659668, 6322668, 6420028, 6055107, 6079308, 5979709, 5945697, 5921522, 5846976, 5601905, 5476147, 5932911]
14107E932911l76985m2093M2808j31062j52636Q0064k68244J83780m31505L57240
14097E194278k27644L8742K47237p10849O39991m42589K40816l30706K45290k66163
14087D628403k01125p6325P8369L3258m15495M00369l06359L28981l55226L8807
14077D153657m43559M94193p97791N54338m48860K49579J69529k06492N2873j08236
14067C669231j82300j64340K73429l84957J51970K82523k20225L5523K21038l60719
14057C321173Q6479J13890k29006j85002L0205m8090K742r7307m5135K01495j36221
14046C015223J01203O1505n27041J58501j05978J19692j11413j55684J54381r9257
14036B611132J54394l42766K33844K29724M1289j33138L03165k81347J6402k29446
$$ y = [5932911, 5555926, 5513833, 5556641, 5425579, 5272943, 5353007, 5084763, 5268543, 4837038, 5194278, 4966634, 5005376, 5252613, 4541764, 5181755, 4739166, 4979982, 4649276, 4894566, 4628403, 4427278, 4350953, 4429322, 4462580, 4047085, 4447454, 4141095, 4470076, 4114850, 4153657, 3710098, 4204291, 3406500, 3960838, 3511978, 3761557, 3931086, 3724594, 3777467, 3669231, 3486931, 3322591, 3596020, 3211063, 3363033, 3645556, 3425331, 3460854, 3681892, 3321173, 3407652, 3521542, 3292536, 3107534, 3137739, 3089649, 3092391, 2995084, 2949949, 3151444, 3015223, 3116426, 3177931, 2650890, 2809391, 2703413, 2823105, 2711692, 2556008, 2710389, 2611132, 2765526, 2422760, 2656604, 2886328, 2927617, 2794479, 3097644, 2816297, 2832699, 2603253]
14026B603253l99738M26256j15422J82312k48006j14608j68544L96013o59261
14017A902255J04872K63757l28956L14246j54194K77034j92807l31395M15827
14008B270639k02808k22338n445L5170K10711k71861J10526m5357M5715j52357
13998A772595K01669k60297j65379J78694l0654K58935p7081j01176L45619J367121
13988C490046K129840N557820J3451280J8279979j2298831A3506303o181404k249361
13980E075538r09444o81792l25364p5998k04744m06417K0798L0556m24791m1906
13970B056436L43704m76718L56376l30529K49461j31581K02835m17178P1396j64694
13960A759508J27957j47983k25158P0704L50175l62063J46710K4031j04223J27118
$$ y = [2603253, 2203515, 2629771, 2514349, 2696661, 2448655, 2334047, 2165503, 2561516, 1902255, 2007127, 2270884, 1941928, 2256174, 2101980, 2379014, 2186207, 1854812, 2270639, 2067831, 1845493, 1840048, 1875218, 2085929, 1814068, 1924594, 1879237, 1924952, 1772595, 1974264, 1713967, 1548588, 1727282, 1696628, 1955563, 1878482, 1777306, 2122925, 3490046, 5619886, 11177706, 24628986, 42908965, 30610134, 13506303, 7324899, 5075538, 4166094, 3484302, 3158938, 3082940, 2878196, 2471779, 2492577, 2523133, 2098342, 2056436, 2400140, 1923422, 2279798, 1949269, 2198730, 2067149, 2269984, 1852806, 1924202, 1759508, 1887465, 1739482, 1514324, 1585028, 1935203, 1573140, 1719850, 1743881, 1639658, 1766776]
13950A766776j51029N6658k07961n0753K64075k92302J19917l83184K18700J45685
13940A486582J75417N6553k37560K41022j30752l5575j17151r3136j99209N12938
13930A659129k99478J62745j82329J93115J85828n07766K08466k08256K79275
13921A490729j6221r5988o9222J13683k18692M171j0799K37085l3978p704J29422
13910A522486k57189k3465J67599l43415M9648J88512J96573m68149K766K98812
13900A334178j89542O7947J75977p8055k05858l1553L6215J40761m27257N51416
13890A374229k34120m29906K75686K43134q2197M3191q8895q4027l2698n3469
13880I30928N1986o0548J19315k66424K06150k25329K54986k4217J04704J50634
$$ y = [1766776, 1615747, 1672405, 1464444, 1413691, 1677766, 1385464, 1505381, 1122197, 1340897, 1486582, 1661999, 1718552, 1480992, 1722014, 1591262, 1555687, 1438536, 1345400, 1146191, 1659129, 1359651, 1522396, 1340067, 1533182, 1719010, 1211244, 1419710, 1211454, 1490729, 1474508, 1378520, 1309298, 1422981, 1204289, 1208460, 1197661, 1434746, 1400768, 1393064, 1522486, 1265297, 1241832, 1409431, 1066016, 1115664, 1304176, 1500749, 1032600, 1035366, 1334178, 1144636, 1212583, 1388560, 1310505, 1104647, 1073094, 1109309, 1250070, 822813, 1374229, 1140109, 710203, 985889, 1229023, 1146826, 1190017, 1101122, 1017095, 984397, 930928, 982914, 922366, 1041681, 775257, 981407, 756078, 1011064, 986847, 1091551, 1242185]
13870A242185m8540q8714E36201K07859R8366L10884n34719M08588O765j05745
13860I28199j08859J57479j54770K58317l47330j16668L74037K88206j1273m18106
13850H49232L10828r7903l55284J59802L15872m61488N4994K22198j55882K6714
13840H69083j41636r955L17137l17860J13019j49447k18939N10304p0175j65326
13830G36205M10414m48295J96323J14623l18827J9228Q0646J65949j15948j30726
13820G09592K88775l80056k43161L06882R972K71893j96201Q9427k86923j17345
13810D52855K22262k34871Q9570J60204o2518n0119J91997m2105K0634M594j39282
13799F13221J17051N908l7847l39007M74385r9797J00483B74152J79328P487L35259
$$ y = [1242185, 1193645, 1104931, 536201, 744060, 842426, 1153310, 618591, 1027179, 1033944, 928199, 819340, 976819, 822049, 1080366, 733036, 616368, 990405, 1278611, 1267338, 849232, 1160060, 1062157, 706873, 866675, 1182547, 721059, 776053, 998251, 842369, 869083, 727447, 717492, 1034629, 716769, 829788, 680341, 461402, 971706, 901531, 736205, 1146619, 698324, 894647, 1009270, 690443, 709671, 790317, 956266, 840318, 709592, 998367, 618311, 375150, 682032, 692004, 963897, 767696, 857123, 570200, 452855, 675117, 440246, 529816, 690020, 627502, 577383, 769380, 727275, 747909, 752503, 613221, 730272, 736180, 698333, 359326, 833711, 733914, 834397, 274152, 453480, 460967, 796226]
13788G96226j78916J76584o7460n2057k86480L45624J74610D46495K23046J18501
13778G88042k62525K65619j8850k12041L91588m27841j26828K94377r2937j45460
13768D53144J07416m5862J70239B76831N29903l9211o0794k59728M897J06006
13758E57904M14234l69776j30785q4535L77152j82345p2241p4517K06379K5063
13748F66533M7784l03101O2126K58612k94814A78147a8460E39299o6905L15121
13738G87515n2331r4219N1682k9850J83792D10015j26991Q5910Q8986J03360p1805
13727D89475j26351M518P2524A4237O53365k14988r9934K53162J19195j23295
13717F01742j72813q0263J56663J30737j64763q0783M63805D12320P6439r2435
$$ y = [796226, 617310, 793894, 726434, 674377, 387897, 733521, 908131, 446495, 669541, 788042, 525517, 791136, 772286, 560245, 951833, 523992, 397164, 691541, 598604, 453144, 560560, 514698, 684937, 276831, 806734, 767523, 706729, 447001, 451898, 557904, 972138, 602362, 471577, 387042, 764194, 581849, 509608, 435091, 641470, 666533, 714317, 411216, 473342, 731954, 437140, 178147, -18460, 539299, 472394, 787515, 735184, 640965, 692647, 662797, 846589, 410015, 283024, 368934, 457920, 561280, 489475, 363124, 367642, 440166, 14237, 667602, 452614, 352680, 605842, 725037, 601742, 428929, 348666, 505329, 636066, 471303, 390520, 854325, 412320, 488759, 396324]
13707C96324J04656j22851J93674j93453K22178j47225l6935N3821B04142K39772
13697D43914K425B01217L00333l6748L0085K07593C42640j15678J80477K09858
13687F17297J5560l15241K95477C05845J45879N0238A84539K89546j77819K50511
13677E46777o2440Q5883j23686j74629J36298L3146l4090o6668l6425R591J68376
13666D82133B24638J5715Q2428N8186J66155A58528K37880M254k3756J64216k26819
13655C14303P8460P6350j94997l7284n254K29092r694r1834n0637J30714L1267
13644D70486k02829J93780A02025J85919m7788K41270A46200J70556q4234J81267
13634D13789j78746L84804k26945q6148P597m6145Q5296j2108A47484L23974j40894
$$ y = [396324, 500980, 378129, 571803, 378350, 600528, 453303, 416368, 470189, 204142, 443914, 446339, 201217, 501550, 464802, 494887, 702480, 342640, 226962, 407439, 617297, 632857, 317616, 613093, 305845, 451724, 501962, 184539, 474085, 296266, 546777, 484337, 570220, 446534, 271905, 408203, 441349, 407259, 340591, 304166, 313757, 482133, 224638, 240353, 322781, 380967, 547122, 158528, 396408, 400662, 376906, 541122, 314303, 392763, 469113, 274116, 236832, 231578, 460670, 450976, 359142, 308505, 439219, 470486, 267657, 461437, 102025, 287944, 240156, 481426, 146200, 316756, 232522, 413789, 235043, 619847, 392902, 306754, 314351, 268206, 353502, 341394, 147484, 471458, 330564]
13623C30564A22419j3295j4700K84730q6559L0168O0520J76951O8514k45165M5242
13612D28825j85073j13455L16222j75673j24708M01636k32597K27942f2702A69240
13601E33764k64723Q8592A65901j9388a29124C92565b12957B60831J10049J79134
13591E50014p8040A2565K34477J24017q5049j22473D7533L54763B7163M12795
13581D39958L22J0329j84360P3570O74J73506A90779R2794B7418N28849k16369
13570C39898J65408r9924k5550B8217M38794n5031A34284O5818L60219B43448
13559a19351k4080B42977J60123D8913H33K53539C1380J59143K63678A7449e5564
13547C95239H5319K73599P4123f7413C10024D1438M88875A04647J85880L03258
$$ y = [330564, 122419, 109124, 94424, 379154, 292595, 322763, 383283, 560234, 628748, 383583, 428825, 243752, 130297, 446519, 270846, 146138, 547774, 315177, 543119, -62702, 169240, 533764, 269041, 357633, 165901, 146513, -129124, 392565, -212957, 260831, 370880, 550014, 471974, 12565, 247042, 371059, 286010, 163537, 47533, 402296, 27163, 439958, 440280, 450609, 266249, 339819, 340493, 513999, 190779, 283573, 27418, 556267, 339898, 505306, 405382, 379832, 28217, 467011, 411980, 134284, 200102, 560321, 243448, -119351, -143431, 242977, 403100, 48913, 833, 254372, 31380, 190523, 454201, 17449, -55564, 395239, 85319, 358918, 433041, -67413, 310024, 41438, 530313, 104647, 290527, 593785]
13537E93785B30806M3048Q8240j12967J34790p3345D3476K78750j25557f646B79039
13525A11112B1866M04012D9483N4955R7025i9218C1271O24593B61220n5262J86622
13514C92580j80827g52I1896J40660R6410A49807K56271j40813o9068H1446M19145
13503E00591H4692J50986N0390A21268a75411B27951L14491j64355d2390A05490
13492B97107j42862M5052D1383K63435C7858L45661c7493C47830J12332F611a30133
13480A88091J19662p8083M47190A35025h9349A82203O3350L10353j80425k2834
13470C52647A18435K36591l2399j28381b5718A33487D5651R798J11504J88341
13460C55294m8254J81282B42978n6924n7484I325M30007j51790A08682L18181
$$ y = [593785, 230806, 273854, 362094, 249127, 383917, 310572, 43476, 322226, 196669, -6646, 279039, 111112, 21866, 425878, 49483, 104438, 201463, -99218, 31271, 655864, 261220, 205958, 392580, 211753, -752, 91896, 232556, 328966, 149807, 406078, 265265, 196197, 81446, 500591, 84692, 235678, 286068, 121268, -175411, 227951, 542442, 378087, -42390, 105490, 297107, 154245, 199297, 41383, 304818, 37858, 383519, -37493, 347830, 460162, 6611, -130133, 188091, 307753, 229670, 676860, 135025, -89349, 182203, 245553, 555906, 375481, 352647, 118435, 355026, 322627, 194246, -25718, 133487, 45651, 55449, 166953, 355294, 307040, 488322, 242978, 186054, 128570, 9325, 439332, 287542, 108682, 426863]
13450D26863k09707m2510D9558h9161B97891j19459K91195o3711A82058C3349
13439C38149J61543a42028B97269l2491B1021l993M7137M07365k17577J34661
13429C88614j80271I4059L58221j53512H6430D2251L47602p2652j05792K89962
13419E01371q154j67443A4466a9703E3051a58569M8663C28838a61702D68686j47955
13408C20731O1374j63879q204j1507c478B36066L3418A27925R3431a96934A02079
13396A69358a30291j9138I7808g4250M715C26725k2111J8021p1914c70j37043
13385a37413D38922g1049B17160M6823J17132C3339L30089a09977F3154K39700
13375C02854K30304A37998L3260L62334B38835B7649b01958B77932A24025A6509
$$ y = [426863, 217156, 174646, 49558, -89161, 297891, 178432, 469627, 405916, 182058, 33349, 338149, 499692, -142028, 297269, 264778, 21021, 17028, 64165, 471530, 253953, 388614, 208343, 94059, 452280, 298768, 86430, 42251, 389853, 317201, 211409, 501371, 493217, 325774, 14466, -19703, 53051, -158569, -109906, 328838, -161702, 468686, 320731, 382105, 218226, 210022, 198515, -3478, 236066, 269484, 127925, 221356, -196934, 102079, 169358, -130291, -149429, 97808, -74250, -69535, 326725, 304614, 322635, 250721, -370, -137413, 438922, -71049, 217160, 263983, 381115, 33339, 363428, -109977, 63154, 302854, 533158, 137998, 171258, 533592, 238835, 27649, -201958, 277932, 124025, 16509]
13364A97008G4156L21082p7426e7102C03685H5198g2129B63522E7288K0349M45356
13353E22993A43597o2910J96634F3042K15718K02101C8195L66369H5165k3140
13343F2025L78423J762j24894A12812L34068j27845A55985J00746M57991A60912
13332F30870k61664P9191A58883J6776J7421f1508J671A77710A4101L61979C4343
13320C01129J48914r3148c3678H6053D0906J98601n8185J44170J6179A58035P3371
13309B31406E3785j5984J05428K13426A67814a06224B03049K27281B0095K87454
13299C07549I6367e780B43869d3603C80045L4792j91398a32676p0714P3004N2347
13288g8039A97340C7303l316A5634J88497K58018a39854B69726o7806a6281A15562
$$ y = [197008, 74156, 395238, 317812, -57102, 303685, 85198, -72129, 263522, 57288, 77637, 522993, 143597, 80687, 277321, 63042, 278760, 480861, 38195, 404564, 85165, 62025, 440448, 442210, 317316, 112812, 446880, 319035, 155985, 256731, 714722, 160912, 630870, 369206, 448397, 158883, 175659, 193080, -61508, -59837, 177710, 14101, 376080, 34343, 301129, 450043, 356895, -33678, 86053, 40906, 239507, 181322, 325492, 341671, 158035, 231406, 53785, 37801, 143229, 356655, 167814, -106224, 203049, 430330, 20095, 307549, 96367, -5780, 243869, -43603, 380045, 414837, 223439, -132676, -203390, -130386, -78039, 197340, 37303, 33987, 15634, 204131, 462149, -139854, 269726, 201920, -16281, 115562]
13276a61827b8280N213I2251c98443C65547h1483I4668B288K02617a19384C21521
13264A01065K14563A34556A939h7513B04973N5195b81250A52682K36423a3187
13253e0961o9619A75520F7551l1447a2282A98858f7381C44700a39585e2926H8756
13241F6846Q8108j993K1785o5502c505B28848A9167M06309F1409R5661C5798P5956
13229A11754O1084O0442d68C69873j24554A07422K6273a13004F7294J26648N5674
13218B49616h5968C18212j31052b25442C67382j28273k8890d5032A14526R2518
13208B07044q7719L8389c25265H1147a1554j4793A71157k5949J26583a57765C6345
13196C3882K32985G6799J07002B9947h035A1637J76151j4616i5224I692a8772
$$ y = [-161827, -28280, -23067, 92251, -398443, 365547, -81483, 94668, 2288, 204905, -119384, 321521, 101065, 315628, 134556, 1939, -87513, 204973, 260168, -281250, 152682, 389105, -13187, -50961, -120580, 175520, 67551, 36104, -12282, 198858, -67381, 344700, -139585, -52926, 88756, 66846, 154954, 152961, 174746, 109244, -3505, 228848, 19167, 425476, 61409, 157070, 35798, 111754, 172838, 233280, -468, 369873, 245319, 107422, 133695, -113004, 67294, 193942, 249616, -85968, 318212, 187160, -225442, 367382, 239109, 210219, -45032, 114526, 207044, 119325, 157714, -325265, 81147, -11554, -26347, 171157, 145208, 271791, -157765, 36345, 33882, 266867, 76799, 183801, 29947, -8035, 11637, 187788, 173172, -95224, 9692, -18772]
13184d1727A6363J18093L36142A78073q7938c7153F2699K05586a51851I771J97472
13173B07243c17658E8864K21865j04622o4739a64532B4282J35118a16884l2370
13163a49254A20954d0692A32825m1740o227Q5115I740a03307B39667a4375B68276
13151B22574P0368H577i2245j84973A58947a92558N0637n0377A13549K16699g7314
13139a9806k6387C62690j53231o4673A1987J11464R9335E1345J34800B1098R9415
13128A20513R4990c8456E54814a40883N6833N385j98473b2561B20674H3850i3012
13116A68409J92807a16227C30010c13058B28593a53332b0180o6945R719j09933
13106a87339A63837L60167A24124D9950K55334c23959A95395L03241c82149B02873
$$ y = [-41727, 16363, 134456, 470598, 178073, 90135, -37153, 62699, 268285, -151851, 9771, 207243, -317658, 58864, 280729, 176107, 111368, -164532, 24282, 159400, -116884, -149254, 120954, -40692, 132825, 91085, 84858, 169973, 9740, -103307, 239667, -14375, 268276, 222574, 292942, 8577, -92245, -277218, 158947, -192558, -141921, -192298, 113549, 330248, -77314, -19806, -46193, 362690, 209459, 144786, 11987, 123451, 222786, 51345, 186145, 21098, 120513, 215503, -38456, 554814, -140883, -84050, -78665, -277138, -22561, 220674, 83850, -93012, 168409, 361216, -116227, 330010, -313058, 228593, -153332, -20180, -87125, -77406, -187339, 163837, 524004, 124124, 49950, 305284, -323959, 195395, 498636, -382149, 202873]
13095d04992C9168K94771B633M4237d95010e8202G0544M92084B47147j00682a07648
13083A11691B8234b63752H5340a00j25587E8248J36587c3895J2429R114A05708
13071C69438a58582F3464K9865J26589C036J44811I858K98187e3591B16647a05669
13059B08830a23806m1322A00800C4058J90945k6328b42627C90180o7300B103J07020
13048A09123d6504C52625j12126l0231G8969e258C7803a11119A26653b33237f6505
13036b1162B57474r9964f1950j3110n604c6523j08827B45706e2340A40360K36959
13025C77319A28927e4301B74199h6378B73359q8973n6591M2690n7466A8696J74559
13014A93255b62424g3914C8451K43397E9238K30615I1087R1177k1986J9057o769
$$ y = [-404992, 39168, 333939, 2633, 46870, -495010, -58202, 70544, 562628, 247147, 146465, -107648, 111691, 28234, -263752, 85340, -100, -125687, 58248, 194835, -33895, -21466, -12352, 105708, 369438, -158582, 63464, 93329, 219918, 3036, 147847, 9858, 308045, -53591, 216647, -105669, 208830, -123806, -165128, 100800, 34058, 225003, 198675, -242627, 390180, 322880, 2103, 109123, -46504, 352625, 240499, 210268, 78969, -5258, 37803, -111119, 126653, -233237, -66505, -21162, 257474, 157510, -61950, -75060, -80664, -36523, -145350, 245706, -52340, 140360, 377319, 128927, -54301, 274199, -86378, 273359, 184386, 127795, 170485, 113019, 18696, 193255, -262424, -73914, 38451, 281848, 59238, 289853, 91087, 182264, 160278, 179335, 172566]
13003A72566K03197A24252L4234j8194h2960A97872a9673m7058B51377r4069L0058
12992A87366D0406J92839a5737B07341G661K01921I4308L0947k4929b5332p0163
12981i5495C3139J94348r6932a6395B42666n6632d2089G8281O0774a38361E3316
12969a29280n9057Q2804A29855a11383G864J98538J6619p697c05216a29097I4663
12957b18527A40873a35446B52716a69619D1318K42110o7064j8068R5480j46444
12947A47332L2730l6505c5400l83858A25599J11034r5194n9256A4676K38546e2659
12935A61710b8951B98734a56572j9754G3476a46832g1815b0122j26355b2638l32039
12924c54677C5091M2199C6110j4889J64844l6181F690K5834e3960l546B1977b05627
$$ y = [172566, 375763, 124252, 158486, 140292, -82960, 197872, -19673, -66731, 251377, 157308, 187366, 40406, 233245, -15737, 207341, 7661, 209582, 94308, 125255, 100326, -25332, -95495, 33139, 227487, 130555, -16395, 242666, 186034, -42089, 78281, 139055, -138361, 53316, -129280, -188337, -105533, 129855, -111383, 7864, 206402, 223021, 215324, -305216, -129097, 94663, -218527, 140873, -135446, 252716, -169619, 41318, 283428, 216364, 198296, 293776, 147332, 180062, 143557, -35400, -419258, 125599, 236633, 141439, 82183, 14676, 253222, -52659, 161710, -28951, 298734, -156572, -176326, 73476, -146832, -71815, -20122, -146477, -22638, -354677, 35091, 77290, 36110, 21221, 186065, 149884, 6690, 32524, -53960, -57506, 21977, -205627]
12911a23079E5066n865i5920A01795k4373A3504b0080j78122i4484M953A16480
12899a66681j08599M0685j27731a49600E4512i8823B54052D3824j4818a09603
12888d9382B3969a61891H9505J06402r0171b64254K999B37756a32253j09112K2622
12877b18743A47402o7974K3466a52811D2690J38423J3524M3598i0568j62025a12984
12865A12604D943h0856k0575H010P6082b7349m166C86664a7564A14490b4660j90663
12853b15323r9084G0833a97676I1426L4819i0548D46371A24267J16987b48500
12842A56667O8830a5279F1896c1491A46192K9015k6975c65942M5153g9192I6229
12830A26991B0845f9070A6971h5803m27215h4322D01232d0612l6618j24382b1794
$$ y = [-123079, 55066, 49201, -95920, 101795, 77422, 13504, -20080, -198202, -94484, -89531, 116480, -166681, -275280, -234595, -362326, -149600, 54512, -98823, 254052, 43824, 29006, -109603, -49382, 23969, -161891, 89505, 195907, 105736, -264254, -261255, 237756, -132253, -241365, -218743, 147402, 79428, 102894, -152811, 42690, 181113, 194637, 238235, -90568, -252593, -112984, 112604, 4943, -80856, -101431, 8010, 84092, -27349, -31515, 386664, -17564, 114490, -24660, -215323, -314407, 70833, -197676, 91426, 126245, -90548, 446371, 124267, 241254, -248500, 156667, 225497, -15279, 61896, -31491, 146192, 175207, 148232, -365942, -320789, -79192, 96229, 126991, 20845, -69070, 16971, -85803, -513018, -84322, 401232, -40612, -77230, -201612, -21794]
12818A72029J70753n6912A16534b19177A79518a35332o9145j2348d0786D73631
12807B4139d0015B68308H0324J78598f8504K4065j27373B04279e9420m8807B79474
12795A23680g4470j49890g6969j60233A91835e0235j7600B0002N8268h0930H47
12783b11084A11948a78938d9475B18656I7243h9059b3500A23855d1167B27783
12772C06779b1930l10519A39187i6414A17102a55784A70323E8629f3996B13588
12761f5407j4462A60238A473K2211K19466D4181A9947a70205d3946H5909c8925
12749E3154J53637r0677a98376K6888k8211B6995K4680k011K04410a56125l2214
12738a88339F9149a12780k14024B42726B3606L9852a27191B29298E4922B4724
$$ y = [172029, 342782, 285870, 116534, -219177, 179518, -135332, -204477, -216825, -40786, 473631, 24139, -40015, 268308, 80324, 258922, -68504, -44439, -171812, 204279, -59420, -108227, 279474, 123680, -74470, -224360, -76969, -237202, 191835, -50235, -67835, 20002, 78270, -80930, 847, -211084, 111948, -178938, -49475, 218656, 97243, -89059, -23500, 123855, -41167, 227783, 306779, -21930, -332449, 139187, -96414, 117102, -155784, 170323, 58629, -63996, 213588, -65407, -79869, 160238, 1473, 23684, 243150, 44181, 19947, -170205, -43946, 85909, -38925, 53154, 206791, 116114, -198376, -171488, -199699, 26995, 51675, 49664, 254074, -156125, -188339, 69149, -112780, -326804, 242726, 23606, 63458, -127191, 229298, 54922, 24724]
12727a22298N5515C8827O2487L36072a66377j49896H0672d4881C882K82079F9182
12715D391a72505C2763I250J46738R4993a0743B24771a11319H3990q113B6871
12703C05776q2244G5369K98233j20450i8460A16867c40904E7155J87112p7378
12693A66889b5085B01512F4033J56511b6398o0089k21359Q9260G0908J28975a48355
12681B87438r4337g1436n8390B6794K61001B6611K2900J81183b1071A71125N7833
12670B28958b6874C39560C7475i7072j89701A38940J23513j07025K53558d5780
12659B37898o620n5179a15980n0021q3702D04834b37918J4062B21335f4737A2079
12647B22234a07428l950n1678k5217E1883b67872J07443i757H3730Q6513o8373
$$ y = [-122298, -66783, 38827, 101314, 437386, -166377, -316273, 80672, -44881, 3882, 285961, 69182, 4391, -172505, 32763, 9250, 155988, 250981, -10743, 224771, -111319, 83990, 75877, 26871, 305776, 223532, 75369, 373602, 253152, -98460, 116867, -340904, 57155, 244267, 166889, -25085, 201512, 64033, 220544, -26398, -86487, -307846, -218586, 70908, 199883, -148355, 287438, 193101, -71436, -129826, 26794, 287795, 26611, 49511, 230694, -21071, 171125, 228958, -26874, 339560, 37475, -97072, -286773, 138940, 262453, 155428, 408986, -45780, 237898, 231278, 176099, -115980, -166001, -249703, 404834, -237918, -223856, 221335, -64737, 12079, 222234, -107428, -111378, -163056, -188273, 51883, -267872, -160429, -9757, 83730, 170243, 101870]
12636A01870b88714o2119D17411e9674j71053e9523B33692f8382H2971N4080K92153
12625D29204j21124j48863J48292A11072J29810R5698h4263J2847B78970K5156
12615C04126a06203A45609b01736A27973f8378n9632b1932C64727f696B84281
12604a074B1645i215B778K65533A02884a36740C14940b12797i7985c8975B93095
12592a7404j3589B22118a29380M5099m964J6416H0693g6432A31782K4308f5161
12580e8454C7105a03497A78447a4751B87276E9807a57492c1618B19880a18388
12569I8145C4470Q161J48014j9745F9648a37344r6074A4598a24430M6656M117
12558g3657j04007j00764E5470d2430e458B9327a47483E1600c7663B51130D8472
$$ y = [101870, -288714, -350833, 417411, -59674, -230727, -59523, 233692, -68382, 82971, 137051, 429204, 308080, 159217, 307509, 111072, 240882, 336580, -84263, -71416, 278970, 304126, -106203, 145609, -201736, 127973, -68378, -128010, -21932, 364727, -6696, 284281, -1074, 21645, -9215, 2778, 268311, 102884, -136740, 314940, -212797, -97985, -38975, 293095, -17404, -30993, 222118, -129380, -84281, -89245, -72829, 80693, -76432, 131782, 156090, -65161, -58454, 37105, -103497, 178447, -14751, 287276, 59807, -157492, -31618, 219880, -118388, 98145, 34470, 42631, 190645, 170900, 69648, -137344, -233418, 14598, -124430, -77774, -73657, -177664, -278428, 55470, -42430, -5458, 29327, -147483, 51600, -37663, 251130, 48472]
12546A17254J15701m6344c56606g3580j38772f7118G6692a30979e4699G8198a12682
12534a52882d0532C46181a66104B95620a49584j50328I5376h8805A27729a11038
12523e6579M330J2875A70279Q0501b15206B733O2394C845g2109j02859A12468
12511b25201C32828p331h026D89321E6561K45595l3984A23790n2347O2194e0281
12499a9348B1178R9249c17121D8407b34742A57299b15267H3610J7646i1464A82584
12487a27997B11553p0927K07786I8381d5431B40528o9486a01263C8107e5150A32408
12475A00894K52184G1470j212N9419g2475j3620j54843j96404h0948j14466A15225
12463a59307c1915l00144D4802P2090j5363O7047i4035a4787D439m12b5424j86145
$$ y = [117254, 232955, 186611, -356606, -73580, -212352, -67118, 76692, -130979, -54699, 78198, -112682, -152882, -40532, 346181, -166104, 295620, -149584, -299912, 95376, -88805, 127729, -111038, -56579, -52249, -39374, 170279, 250780, -215206, 2733, 65127, 3845, -72109, -174968, 112468, -225201, 332828, 325497, -8026, 489321, 56561, 302156, 268172, 123790, 71443, 133637, -50281, -19348, 21178, 120427, -317121, 48407, -234742, 157299, -215267, 83610, 101256, -91464, 182584, -127997, 211553, 140626, 348412, 98381, -45431, 240528, 171042, -101263, 38107, -55150, 132408, 100894, 353078, 71470, 70258, 129677, -72475, -86095, -240938, -437342, -80948, -195414, 115225, -159307, -31915, -332059, 44802, 116892, 101529, 168576, -94035, -14787, 4439, 4027, -25424, -211569]
12451b11569B3057K75165b35039I04f623j62265P0176j17453B79262a32482G3371
12439a50293c6788j49131B60712I0647a06483M8172A68342f9485j35022C83846
12428i8418I6650d7390C984K2557d4966m44552a30272M2306A7330a35510k28520
12417c64030A12522C3357n459K3356L360a6145D3486K93765h7274q8914N5675
12406a20513n4484f7432p976A04579b54521j21647b5982m7099A75469a80482f9578
12394b44612a5952A74460J7037E4821d1126r5771D7054O8631C8503M7465h4228
12382A75012f0506B48535a77785A71915b00408a0962H4230b71249A78784l0988
12372A47796h2674C7890M98978I5742N5604L7142f2613o4809D8480J58205k1493
$$ y = [-211569, 23057, 298222, -235039, 904, -6623, -168888, -98712, -216165, 279262, -132482, 73371, -150293, -36788, -185919, 260712, 90647, -106483, -58311, 168342, -69485, -204507, 383846, -98418, 96650, -47390, 3984, 26541, -44966, -489518, -130272, -87966, 17330, -135510, -364030, 112522, 33357, 27898, 51254, 54614, -16145, 43486, 337251, -87274, -176188, -120513, -174997, -67432, -75408, 104579, -254521, -376168, -25982, -73081, 175469, -180482, -69578, -244612, -15952, 174460, 191497, 54821, -41126, -136897, 47054, 115685, 38503, 85968, -84228, 175012, -60506, 248535, -177785, 171915, -200408, -10962, 84230, -271249, 178784, 147796, -82674, 37890, 536868, 95742, 151346, 188488, -62613, -127422, 48480, 206685, 185192]
12361A85192d25420A08020c10976d5136j18601M4003c0531j0367j6739A12579
12350C49748C6767b55128A78010K09805b10255C47231A66995p5815c03163J12920
12340a90243B60101A22347a42195F9033a4562k18592N4446A61747J13556H4799
12329A08553i2345B47670E3820K75759l3025a77594A83977O5707J08603j14925
12319B43362K90858D9967L28274j60643p653p7871J24875B7254J42231O2979j2481
12308B19983J76023d15483C5504J76345B8736j0736h2299G5797A5319D198i997
12296F2815J4294g124B0394i3304B62237a78408K8889d4972I2986K3898a80501
12284A8645P2926j440O746K70766A41828P6047l034q5418l3350J69259l790G3684
$$ y = [185192, -425420, 108020, -310976, -45136, -163737, -119734, -30531, -40898, -57637, 112579, 349748, 36767, -255128, 178010, 387815, -210255, 347231, 166995, 91180, -303163, -190243, 260101, 122347, -142195, 69033, -14562, -233154, -178708, 161747, 275303, 84799, 108553, -92345, 247670, 53820, 329579, 296554, -177594, 183977, 249684, 358287, 243362, 534220, 49967, 378241, 217598, 209945, 132074, 256949, 27254, 169485, 232464, 219983, 396006, -415483, 35504, 211849, 28736, 18000, -82299, 75797, 15319, 4198, -9997, 62815, 77109, -7124, 20394, -93304, 262237, -178408, -149519, -44972, 92986, 116884, -180501, 18645, 91571, 90131, 96877, 367643, 141828, 217875, 214841, 129423, 96073, 265332, 261542, 73684]
12271C73628B6998J33923K0465K05732E4517f045A60735J07022A10320j8172J87780
12260B79928e8762j14124D87237A35225K37433E8594J94635A15448K75172b42166
12249C85350a62327B9627a43485B51612q9929R2619H8525k5458J10816R7045a7774
12237f8386A89240a18272c8662k4900D29849A30961J81220a06211A02378L7869
12227A40247Q1765d5164B28486o3857a79133A67780J11842J27a21577C38434l6414
12216C02020A12612N3658J39642K9676j04472L18487j68320K2969j55117J64377
12206D13512J52581d1861J671H3551K9456K14188A50328j6498D3600K40857r7184
12195A87273n4389M45592B37204P4310m0799c0799A49798K32317J27125E1488
$$ y = [373628, 26998, 160921, 181386, 387118, 54517, -6045, 160735, 267757, 110320, 92148, 279928, -58762, -172886, 487237, 135225, 372658, 58594, 253229, 115448, 390620, -242166, 385350, -162327, 29627, -143485, 251612, 161683, 254302, 88525, 63067, 173883, 270928, -17774, -68386, 189240, -118272, -38662, -63562, 429849, 130961, 312181, -106211, 102378, 140247, 222012, -45164, 228486, 164629, -179133, 167780, 279622, 279749, -121577, 338434, 302020, 112612, 166270, 305912, 335588, 231116, 549603, 381283, 404252, 249135, 413512, 566093, -41861, -40190, 83551, 113007, 327195, 150328, 133830, 43600, 284457, 187273, 132884, 578476, 237204, 311514, 270715, -30799, 149798, 382115, 509240, 51488]
12184B36129H0824C8455L92930j40183j16420K2297k778l7049E3955M1660Q868
12173A04483d389B98533J35785B01773N6385J72852I2379K73689P5643j37028
12163C04683q8329Q5953K2345J92888j35694b2733A58192a15256H8730R3819n5995
12152A26554a92682f5246D73004B27960c6197A7914a7472A43803J57719o8468
12142B33054L90096H1315e4914B36740J7350m0322J95754d7720B16112H047b45898
12130A95100O9588Q9936b94308B01097H2727K96180o3463a3300j1077D05056j04201
12119C00855A16294N9224J66591J0518a47822B13013C7552J13749d646A2263a54398
12107a07538l9981E3817b21889C8916j56g9922C29415e14556E8045a59348B54808
$$ y = [236129, 80824, 38455, 431385, 291202, 174782, 197079, 194301, 157252, 53955, 95615, 104483, -4389, 298533, 434318, 201773, 258158, 431010, 92379, 366068, 441711, 304683, 216354, 302307, 324652, 517540, 381846, -22733, 158192, -115256, 88730, 182549, 126554, -192682, -65246, 473004, 227960, -36197, 17914, -17472, 143803, 301522, 233054, 623150, 81315, -54914, 236740, 254090, 213768, 409522, -47720, 216112, 8047, -245898, 195100, 264688, 354624, -294308, 201097, 82727, 378907, 315444, -13300, -24377, 405056, 300855, 116294, 175518, 342109, 352627, -147822, 213013, 37552, 151301, -4646, 12263, -154398, -107538, -147519, 53817, -221889, 38916, 38760, -79922, 329415, -514556, 58045, -159348, 254808]
12095a00400a0670m384A51330d2845K1009r308B75718l7678J31816A52065E755
12083A73255H93e8843A48782k3481m977K6676a42218E6261L68374b59610C42057
12071b34370A2936K18690a07016C1613c99025A57979l7313C3911K63634a87338
12060g2434C12316E0613L1165P4337i6288k3641H8499a77301D9342B3737Q3701
12049A07438J40497c16449f4284A73534B8212b4064B65519D4704K71936a02973
12038b36166a0439j4872j24339N7288I0662a47982C7760H890i9087l64326c4322
12026D444L39787a30430A9946b6335B93007r3716M6096J8111n7835A02153J543
12015A03696C5764l372K18326I3342m5252J7772K52959d6036n5980B18885l6899
$$ y = [-100400, -10670, -15054, 151330, -42845, -21836, -31144, 275718, 238040, 369856, 152065, 5755, 173255, 893, -58843, 148782, 125301, 120324, 147000, -142218, 56261, 424635, -259610, 342057, -234370, 12936, 231626, -107016, 31613, -399025, 157979, 120666, 33911, 297545, -187338, -72434, 312316, 50613, 81778, 156115, -96288, -119929, 88499, -177301, 49342, 23737, 107438, 247935, -316449, -64284, 173534, 28212, -24064, 265519, 44704, 316640, -102973, -236166, -10439, -25311, -149650, -92362, 90662, -147982, 37760, 8890, -99087, -463413, -34322, 4444, 344231, -130430, 19946, -26335, 293007, 199291, 245387, 263498, 205663, 102153, 103696, 35764, 32392, 250718, 93342, 48090, 65862, 318821, -46036, -102016, 218885, 181986]
12004A81986L5198a11479H7930f9942G3618h9225j45642A46184h4786q1496G1812
11992G087a15051C17b08161A05611i0620m4455a2856q4205c3755j37354l669B98588
11979c9946j16258p195f1005B03665a11550A76540b68363g2896m4144j19702P4660
11968a62082M4002r5323B9249d5587l16272J56654A13814K515J63360a65271o9350
11957b34621d2900r8616L2878A04475a13557N6251A52566a79172G08h2469L3946
11946d8523A22885a9749E2904b05393C54045A43186i4835c1939G2788p260J4974
11935H0502K5057K01313a10496j01765P6488o0637k87421A3623O4458a81113C81999
11923a08694A10231d2217G5690K45804f2695r3761j05157j34223f3934H1726b6534
$$ y = [181986, 217184, -111479, 87930, -69942, 73618, -89225, -234867, 146184, -84786, -166282, 71812, 7087, -115051, 317, -208161, 105611, -90620, -135075, -12856, -97061, -33755, -171109, -174778, 298588, -39946, -156204, -163399, -61005, 203665, -111550, 176540, -268363, -72896, -117040, -236742, -162082, -118080, -213403, 29249, -45587, -361859, -205205, 113814, 116329, 279689, -165271, -234621, -42900, -141516, -108638, 104475, -113557, -57306, 152566, -179172, 708, -82469, -48523, 122885, -19749, 52904, -205393, 354045, 143186, -94835, -31939, 72788, 65528, 80502, 105559, 306872, -110496, -212261, -135773, -196410, -483831, 13623, 78081, -181113, 381999, -108694, 110231, -42217, 75690, 321494, -62695, -156456, -261613, -395836, -63934, 81726, -26534]
11911B0203a13273C0150b12230B95583f8261A05291e53900H0890B9963i2594d6033
11899a21658B9189d23A0968a312A51859a14052A0099a7700A18705b11819D8876
11887a70933f5522B40840g1144G6732K6450f2073B06395b80895J27486A14670
11876F0209i5226b8816j25965j79602B39111a84437c5318F4238J35651d9279n0680
11865i9959m5434C64278A14281a01366K609b8809I015H50O5711a27878k13001
11854c40879a8872A81799c33441a29071b4832n4684m18450H0451c8060j38529
11844a76589F1624b58429J01669A72458b48003A13439c09686i406j33897j44398
11834b87701A05948a31610m4118A1887c7351j29571j66795A45864o6167b0637
$$ y = [20203, -113273, 30150, -212230, 295583, -68261, 105291, -553900, 80890, 29963, -92594, -46033, -121658, 29189, -423, 10968, -1312, 151859, -114052, 10099, -17700, 118705, -211819, 48876, -170933, -65522, 240840, -71144, 76732, 103182, -62073, 206395, -280895, -153409, 114670, 60209, -95226, -28816, -154781, -334383, 239111, -184437, -35318, 64238, 199889, -49279, -99959, -145393, 364278, 114281, -101366, -98757, -28809, 9015, 850, 66561, -127878, -340879, -18872, 181799, -333441, -129071, -24832, -79516, -497966, 80451, -38060, -176589, 61624, -258429, -156760, 172458, -248003, 113439, -309686, -9406, -143303, -287701, 105948, -131610, -175728, 11887, -37351, -166922, -333717, 145864, 79697, -20637]
11823A56513K7218a54795A87785F2585b87519e0235j13019A96045A7831L13403
11813C31234c6969j06575e4730B98797A06334h6655H2508O1603J61415a51388
11802C6783f2617G5511a79594A97409a23516e1549k57578P0769D204d2103j52030
11791a94133O1440c1893j06831j05929l9913A68181B3532J52259e1800E3638a85308
11779e8957l53144B91322p4799g5593A00317d7581G534a4648C8525i1606A6128
11767I6826B8827b55722a6397k49876Q2056A02784c3460A26799a11915N4721p3863
11756a31057C7480K34942e8736A49285d66j20883p777O2690m4391B8779J7152
11745D5931J74652I1385a03731b5494D3204l733K2023a2604j33358A23446c05930
$$ y = [156513, 183731, -154795, 187785, 62585, -287519, -50235, -163254, 196045, 17831, 331234, -36969, -143544, -54730, 298797, 106334, -86655, 82508, 144111, 305526, -151388, 36783, -62617, 75511, -179594, 197409, -123516, -51549, -309127, -238358, 4204, -42103, -194133, -132693, -31893, -138724, -244653, -284566, 168181, 23532, 175791, -51800, 53638, -185308, -58957, -412101, 291322, 216523, -75593, 100317, -47581, 7534, -14648, 38525, -91606, 16128, 96826, 28827, -255722, -16397, -266273, -184217, 102784, -33460, 126799, -111915, -57194, -131057, 37480, 272422, -58736, 149285, -466, -121349, -129126, -66436, -110827, 28779, 45931, 220583, 91385, -103731, -25494, 43204, 39471, 61494, -12604, -145962, 123446, -305930]
11733C5959g4358A62835b19171D3584c75044J06069f4191K9980j83129B7320Q1146
11722A08466b34204n3042D399b93203B51927c41610A56373l5500g3782E22108
11711c43224a36553a1067p0848L1587A70365b86556k2445A76521M3614E8168K81299
11700C39467D2357K70763G3237g7159E16422j70165A1996c4512k3249j5058j48183
11689b21002O5992A8115K04587b8825b116I6255N9380B8679b93692A2661J9551
11678C2212J24014m0085J98146A37470a58688I2220b30095L0742c2164A8514K45457
11667B63971A408l42h3498n10868B73460D0824R638J13760m0157j0641m4937b11072
11654A60843m9316a76410B74338D4896J90645D7172d5941A72133O7890p8652G4237
$$ y = [35959, -74358, 162835, -219171, 43584, -375044, -268975, -64191, -34211, -217340, 27320, 108466, -234204, -287246, 4399, -293203, 251927, -341610, 156373, 120873, -73782, 522108, -343224, -136553, -11067, -81915, -50328, 170365, -286556, -309001, 176521, 220135, 58168, 339467, 42357, 313120, 73237, -77159, 516422, 346257, 11996, -34512, -57761, -72819, -221002, -155010, 18115, 222702, -28825, -2116, 96255, 155635, 28679, -293692, 12661, 32212, 156226, 116141, 314287, 137470, -158688, 92220, -230095, -199353, -32164, 18514, 263971, 1408, 1066, -83498, -594366, 273460, 40824, 50462, 164222, 124065, 113424, 68487, -211072, 160843, 111527, -176410, 274338, 44896, 235541, 47172, -45941, 172133, 240023, 161371, 74237]
11642C05187E6302O599M491H211e4264o6426b1362O411j54930j22580d3589A63757
11629b9032C08524f8867A19072d1746A37936P7670a28758A63419F3976j1668O8813
11618A21121p963J7992h5815D2615B4K58159m6993b8283m4382G3295h1027j85786
11606b66813e7961n1292m0001A94004q1861R350g4912A67598J05561L5840a31080
11594c6476A38651k8208a54915E083J92805b6189n7521p9591E05250D4648b98558
11582f0643P624A60119F3251P9489l7515d0261a8439B3601d2870D1014f8658F9379
11569g7277B34017J5804C0311J16364P4164o0559K73041g54C2308e1137B58126
11557B32290m63E7910b10308A07166N497g8034i579j36609c6333a992B03904c49008
$$ y = [305187, 56302, 62901, 67392, 8211, -54264, -120690, -21362, -14951, -169881, -292461, -43589, 163757, -29032, 308524, -68867, 119072, -41746, 137936, 215606, -128758, 163419, 63976, 52308, 121121, 113158, 131150, -85815, 42615, 24, 258183, 211190, -28283, -72665, 73295, -81027, -266813, -57961, -109253, -149254, 194004, 112143, 121493, -74912, 167598, 273159, 308999, -131080, -36476, 138651, 110443, -154915, 5083, 197888, -26189, -83710, -163301, 505250, 44648, -298558, -60643, -53019, 160119, 63251, 142740, 105225, -40261, -18439, 23601, -42870, 41014, -68658, 69379, -77277, 234017, 249821, 30311, 146675, 220839, 160280, 433321, -754, 32308, -51137, 258126, 232290, 231827, 57910, -210308, 107166, 112663, -78034, -9579, -146188, -36333, -1992, 203904, -349008]
11544H6156l0723e1405A48816a36754P921C9694a3191A82285a38806B0550a33776
11532a14310A52439c8864m9368b729A55667L31263h2291C3580b5226A3017Q6639
11521I9656a37657I796i7900B60743P1806k0567A24827m1462L7798a9009B31208
11509B0970K5758K77397f638B49080a42687M7078F3907a89123E25043I5749N0892
11498A46641n7771b06897L9369A12554N8129L59798c08378e0598B72550b15829
11487A51865K38604a27161C60926A02890a8687B197M37643b06727G5068C5150
11476B76769F8404K68015A65854f6873A86209b58301P5690D78886B04171c7282
11465a2135H2142b4683B61086N3210g8223B2284a48395A57060m9733f2232f042
$$ y = [86156, 55433, -51405, 148816, -136754, -128833, 39694, -13191, 182285, -138806, 20550, -133776, -114310, 152439, -38864, -88232, -2729, 155667, 486930, -82291, 33580, -25226, 13017, 99656, -137657, 9796, -97900, 260743, 332549, 311982, 124827, 83365, 121163, -19009, 231208, 20970, 46728, 324125, -6638, 249080, -142687, -95609, 63907, -189123, 525043, 95749, 146641, 88870, -206897, -167528, 112554, 170683, 530481, -308378, -50598, 272550, -215829, 151865, 390469, -127161, 360926, 102890, -18687, 2197, 439840, -206727, 75068, 35150, 276769, 68404, 336419, 165854, -66873, 186209, -258301, -182611, 478886, 204171, -37282, -12135, 82142, -24683, 261086, 314296, -78223, 22284, -148395, 157060, 107327, -62232, -6042]
11453h473E10455A60773b0182E5895M3333J92392A20979K5921o2512J30362o7180
11442A47570j8381N7334b32537G6574L7530i4548G4559K22773j07489J5091q9296
11431A15638m7454J47378c2349C46920a44977C6840b45100B6677J94359B8072
11420A87484q4079d8827B12949b28046j69358A06968A624h602A52699F0894J23115
11409A84009a49163A62824h7012b4762r416H2107b80794J7766A79311F8443a11927
11397C0062H07a69274F4983J65133c76057c3978j29881R673A72491J32113F4800
11385H7377b45037e9938A20521J05191m5040d6799o872E5823g5607J5118j06046
11374a66535G6272c7955A98066C9997J77772h0363A03815a09957j17982e0337
$$ y = [-8473, 510455, 160773, -20182, 55895, 99228, 291620, 120979, 146900, 84388, 214750, 147570, 129189, 186523, -232537, 76574, 114104, -94548, 74559, 297332, 189843, 204934, 115638, 68184, 215562, -32349, 346920, -144977, 36840, -245100, 26677, 221036, 28072, 187484, 103405, -48827, 212949, -228046, -397404, 106968, 1624, -8602, 152699, 60894, 184009, -149163, 162824, -87012, -24762, -34178, 82107, -280794, -263028, 179311, 68443, -111927, 30062, 807, -169274, 64983, 230116, -376057, -33978, -163859, -154186, 172491, 304604, 64800, 87377, -245037, -59938, 120521, 225712, 180672, -46799, -53671, 55823, -75607, -60489, -166535, 76272, -37955, 198066, 39997, 217769, -80363, 103815, -109957, -227939, -50337]
11363B37950C8341P5315j4054O904c78232A33042a96057A78067D9767a25357F1866
11351b12261a05767J2206A2651c6856C74533f4175k21735A90550b21460C71252
11340A7056f4114J4054A10890A2931a32403c2578k41542e8988j56759J9845D7933
11328g3625C6340c19975d6982p8004A23352R4293a09090D170J33868a91349j24832
11317c16181f2403q6555j58758a00123I0704L22183A67008c03710G187a56863
11306A98575a13475j28962g2792B37995n9021b67286A00887C978c5609p0566B2004
11294b655B18894H2730C5268L2420Q22g0883b2423A54123D6400j8773c12173a00033
11281a35421b1396C28880e32978e296j03178b6918r5676A31477L1638m8987e6077
$$ y = [237950, 38341, 113656, 99602, 106506, -378232, 133042, -196057, 178067, 49767, -125357, 61866, -212261, -105767, -93561, 12651, -36856, 374533, -64175, -285910, 190550, -221460, 371252, 17056, -64114, -50060, 110890, 12931, -132403, -32578, -274120, -58988, -215747, -195902, 47933, -73625, 36340, -319975, -46982, -124986, 123352, 217645, -109090, 4170, 138038, -191349, -316181, -62403, -148958, -307716, -100123, 90704, 412887, 167008, -303710, 7187, -156863, 198575, -113475, -242437, -72792, 237995, 178974, -267286, 100887, 3978, -35609, -106175, 22004, -2655, 218894, 82730, 35268, 67688, 68510, -70883, -22423, 154123, 46400, 27627, -312173, -100033, -135421, -21396, 328880, -532978, -5296, -108474, -26918, -122594, 131477, 163115, 114128, -56077]
11269B9266J22913B9531a13652l3624M38A26043m5000a58910B57077e3297k77788
11258c31085B83333d3194H2453a98657a8825A6450i6357q4915R765c3034q6510
11247a19544H5742K87668a76615B3282g1284A6683b75270G3247R1299J05968b89415
11235e8819l24402a13321r8891G5031j8334k7402J71232h2376c1850I1459b70238
11223B22844a58904C4213a756G1941a73869N0240k212k47829a45437N4327A63523
11211c11822J16793c2384C5165C050L51991j63103E8408a97720m0401a08425I3421
11199A02883N5918p8483L5713b93888P965A6612a33010n0913F0658c38493a55739
11187A41449Q6444A2301a95753j4762p1230A555K8554b44093c9548B68722b51153
$$ y = [29266, 152179, 29531, -113652, -147276, -146838, 126043, 81043, -158910, 257077, -53297, -331085, 283333, -43194, 82453, -198657, -18825, 16450, -96357, -181272, -171507, -33034, -119544, 85742, 373410, -176615, 23282, -71284, 16683, -275270, 73247, 164546, 270514, -289415, -58819, -383221, -113321, -212212, 75031, 56697, 29295, 200527, -82376, -31850, 91459, -270238, 222844, -158904, 34213, -1756, 71941, -173869, -123629, -125841, -373670, -145437, -91110, 163523, -311822, -195029, -32384, 35165, 3050, 355041, 191938, 58408, -197720, -238121, -108425, 93421, 102883, 158801, 80318, 116031, -293888, -285923, 16612, -133010, -183923, 60658, -338493, -155739, 141449, 227893, 12301, -195753, -210515, -281745, 1555, 30109, -244093, -39548, 268722, -251153]
11175b81286J28813B62253m1416f0440j4011C78566a16514j52935O0052i2878
11164a58833a3405j59171A16026a92757e560j65281C99465I7114R0700i9752E8160
11152a20350A56238g5337k2317A7716d08845J60630J03825H982N1316a38702k12280
11141c50982a7753A49310b53954i4598B16707H7432b77570e2701m0466H6424j0621
11130G5803f1434A99253A0087J73697J118o7443a61564c6280Q087I5605J55323
11119B50928g3814k5244c6780a224j64689I6485J25596q8709e7026C46338A11204
11107a15186B57414a01836C1082a77926D6430c07562g4885G7486C4045M97321
11097E31366B48637J6566n337e605D8500J69760p109J8724g1936C78277A58466
$$ y = [-281286, -152473, 262253, 220837, -60440, -74451, 378566, -116514, -269449, -209397, -92878, -158833, -13405, -172576, 116026, -192757, -5560, -170841, 399465, 97114, 187814, -99752, 58160, -120350, 156238, -75337, -97654, 17716, -408845, -248215, -144390, 8982, 60298, -138702, -350982, -17753, 149310, -253954, -94598, 216707, 87432, -277570, -52701, -93167, 86424, 75803, -61434, 199253, 10087, 183784, 184902, 117459, -161564, -36280, -28193, 95605, 250928, -73814, -99058, -36780, -1224, -165913, 96485, 222081, 133372, -57026, 346338, 111204, -115186, 257414, -101836, 31082, -177926, 46430, -307562, -74885, 77486, 34045, 531366, 248637, 265203, 259866, -5605, 48500, 218260, 211151, 229875, -71936, 378277, 158466]
11085H6411B6672M72707d0329A01049J77146M0912C2598L3760P0159D347O2805
11074F7152j2330R3609k5447L5481J40745f1816E08483k03551R9256j01280J3085
11063C15993j29055K57805A35454K39671J30038q5559Q3597j42120L45791K3871
11053G30743j10650J54214m8824j78166L54836k68485k05004M64577j10423J4032
11043G96850j33596K3841J16615B83177N09153m9151K2346j33261p8411K53295
11033H07148j33723K40279l8743N520K94816j82179m83791J08614j720o6653J42362
11022F91930K49368J65828k86281K48117l98120j02563J77252p2956n4591J19867
11012G37851o1052m0049r2195k03232K76311k54063L6148N84575j47652j33285
$$ y = [86411, 26672, 499379, -40329, 101049, 278195, 319107, 32598, 66358, 136517, 4347, 67152, 54822, 148431, 122984, 158465, 299210, -61816, 508483, 304932, 404188, 302908, 315993, 186938, 444743, 135454, 375125, 505163, 419604, 503201, 361081, 706872, 730743, 620093, 774307, 725483, 547317, 902153, 633668, 428664, 893241, 782818, 796850, 663254, 687095, 803710, 283177, 792330, 743179, 765525, 632264, 553853, 807148, 673425, 913704, 874961, 880481, 1175297, 993118, 509327, 617941, 616221, 549568, 691930, 941298, 1107126, 820845, 1068962, 670842, 568279, 745531, 672575, 617984, 737851, 676799, 636750, 544555, 341323, 617634, 363571, 399719, 984294, 836642, 703357]
11002G03357J9291q7149J89369j00006K74030k86600r7140N8905Q0599O0737K75863
10991A091256l72848J21320j41768l4690J72249j37954K62077J6146k78827L35465
10981A032426Q468j53397J75655M36252q2917m84140K60970L80254k53499N57934
10971A878006L52566K43250p4336L34672J64498K45896l92955N0247J78180m07964
10961B572060n95485P1064k35649j10581K49396l15484J25894l9020P145k21805
10951A507535N4463j5347l93261l23801j2209k53177P8720k10464M4856j65222
10941C12093l6425J54002A81650p4097n1189M38653f4971A534L56300D9499a30476
10929a02935B0166J55570a61362B25753B9708a09085A69258M55847H264L8191
$$ y = [703357, 722648, 635499, 824868, 724862, 998892, 712292, 615152, 674057, 754656, 815393, 1091256, 718408, 839728, 697960, 663270, 835519, 697565, 959642, 975788, 696961, 1032426, 1040894, 887497, 1063152, 1499404, 1416487, 932347, 1193317, 1573571, 1320072, 1878006, 2230572, 2473822, 2399486, 2734158, 2898656, 3144552, 2751597, 2801844, 2980024, 2572060, 1976575, 2047639, 1811990, 1701409, 1950805, 1635321, 1761215, 1722195, 1729340, 1507535, 1561998, 1546651, 1153390, 829589, 817380, 564203, 642923, 432459, 477315, 312093, 275668, 429670, 181650, 107553, 56364, 495017, -64971, 1534, 357834, 49499, -130476, -102935, 20166, 175736, -161362, 225753, 29708, -109085, 169258, 625105, 8264, 46455]
10919D6455c50250F7099D621d7738l4957A86722b28546b1123j00201r406d2414
10907B04588r5831o821a71989B1160J43840J45964b26532A33957e0591j84678
10897b35269a07592J2643A4715g4585E1877A4949Q0864J04633I6174b10910h7832
10885C6620d64235i5010D7696F4f7936C8986K0546b83732J991j73786A00717h4885
10872A67592c0559A11392f8576I257i4544B32951D1585b75389N4550A25951J5973
10861A41924J90427A52437a42427b0083k79907A72379K37463n0330I6615K0570
10851A17185m0369J4707i2982b3644B53837o5048e0256o1253n5104C5895e5224
10839A28148a3660p297j28331m5520Q0478K1635B43976a04733B0550b92326C01220
$$ y = [46455, -350250, 67099, 4621, -47738, -82695, 186722, -228546, -21123, -121324, -130730, -42414, 204588, 108757, 101936, -171989, 21160, 165000, 310964, -226532, 133957, -50591, -235269, -107592, -94949, 14715, -74585, 51877, 14949, 95813, 200446, 96174, -210910, -87832, 36620, -464235, -95010, 47696, 64, -67936, 38986, 59532, -283732, -281741, -455527, 100717, -84885, 167592, -30559, 111392, -68576, 9257, -94544, 232951, 41585, -275389, -220839, 125951, 141924, 332351, 152437, -142427, -20083, -299990, 172379, 409842, 359512, 96615, 117185, 76816, 91523, -92982, -23644, 253837, 188789, -50256, -111509, -166613, 35895, -55224, 128148, -13660, -20957, -149288, -194808, -114330, -92695, 243976, -104733, 20550, -292326, 301220]
10827b77766A5495R679b19361i5674l2146j10544A90491p6691j9506g5482j23107
10816a98589j3777A0977L15323a72011H3786i1129k0222I7403r141a39430B61956
10804b14127L5180N9527N1698m63749K60556a29992j20749E8083b17628M9189
10794a68439E1080J29404a18213j78178d9947o5341K6304A56831b45865B13841
10783F4161d24891K03969M7517C3490e9529C1373b36813N8423a117o5878k82355
10772c49350B87900a52892m3847A63877d2071A21787a69893e932F6917K6780f4758
10760I1140b37542A1801N7423c81252a16610n6046f0024A25960N0559b07744N4336
10749a53408A55622b74498J10440O8715j44432N3706P9733l76591a0405n2259
$$ y = [-277766, 15495, 25174, -219361, -95674, -127820, -238364, 190491, 113800, 94294, -75482, -198589, -212366, 10977, 326300, -172011, 83786, -91129, -111351, 97403, 88262, -139430, 261956, -214127, -178947, -119420, -67722, -531471, -270915, -129992, -250741, 58083, -217628, -168439, 51080, 180484, -118213, -296391, -49947, -115288, -88984, 156831, -245865, 213841, 64161, -424891, -220922, -173405, 33490, -59529, 31373, -236813, -178390, -1117, -66995, -349350, 287900, -152892, -196739, 163877, -42071, 121787, -169893, -5932, 66917, 93697, -64758, 91140, -237542, 11801, 69224, -381252, -116610, -172656, -60024, 125960, 176519, -207744, -153408, 155622, -274498, -164058, -95343, -239775, -186069, -106336, -482927, -10405, -62664]
10739f2664j08937A49951J73305A6187c1717o4561o6053e0336n55E9307i6359
10727a11157N0460r8377e65j61334i484j23466C4889a65771f4126G8757a5459
10715a45672d5558A66318b24418B59845G5610k0765i2536C3221d8279A62032p2970
10704H9062f5669j4799A9932r249b9538G5252a93327c6668B77542g3054j40976
10693b14030j0768a02371m8750j22647h4122b1053m0352l8917n1847M3452r1687
10682b00404r0932B88792a38762F0767C454c60025c574k85982R9530D19b23684
10670a26728q4273I7654a12615G110R1906c48672E7347g8834J1214l3710C6702
10658c43466Q7897b8695B42327a98802C1651a54161c8368A52591a58210H3884
$$ y = [-62664, -171601, 149951, 323256, 16187, -31717, -96278, -162331, -50336, -50891, 59307, -96359, -111157, -60697, -159074, -565, -161899, -9484, -132950, 34889, -165771, -64126, 78757, -15459, -145672, -45558, 166318, -224418, 259845, 75610, 54845, -92536, 33221, -48279, 162032, 89062, -65669, -80468, 19932, 10683, -29538, 75252, -193327, -36668, 277542, -73054, -214030, -224798, -102371, -151121, -273768, -84122, -21053, -61405, -100322, -152169, -108717, -200404, -291336, 288792, -138762, 60767, 3454, -360025, -3574, -289556, -190026, 419, -223684, -126728, -211001, 97654, -112615, 7110, 99016, -348672, 57347, -78834, -67620, -101330, 36702, -343466, -255569, -28695, 242327, -198802, 31651, -154161, -38368, 152591, -158210, 83884]
10647b46609J17719c6803j89634r1611a28010q0052O5592c0932A77665d04305
10636d46007a15530F9472d4597j56923J9796C7936P6542A6506P2260L99288b74530
10624c8804r0096I6455O2700L08628E6193g3085B7460a62563A42036j245e9460
10612c18666J29326B23508b93752A20320k8826c1462A41226E3567c36297G5168
10601A21719d13777b4882C60963A18144a30991o2651i1952A26188O4096A6030
10590a0867k21937i9762j98030i5316j2259A97051a04013a3286j427q6960m11
10579a02084A67497b73103Q1279L3418m9236A01885l9005b40088e5444O132E9395
10567B12051a10588G8513k8406c04559f6700A54186A8579a3698m877j76756P3441
$$ y = [-246609, -128890, -36803, -226437, -318048, -128010, -208062, -142470, -30932, 177665, -404305, -446007, -115530, 69472, -44597, -201520, -181724, 37936, 114478, 16506, 88766, 488054, -274530, -38804, -128900, 96455, 159155, 467783, 56193, -73085, 27460, -162563, 142036, 140791, -59460, -318666, -189340, 223508, -293752, 120320, 91494, -31462, 141226, 53567, -336297, 75168, 121719, -413777, -24882, 360963, 118144, -130991, -193642, -91952, 126188, 190284, 16030, -10867, -232804, -99762, -297792, -95316, -107575, 197051, -104013, -13286, -14713, -101673, -102084, 167497, -273103, -191824, -158406, -207642, 101885, 62880, -240088, -55444, -49312, 59395, 212051, -110588, 78513, 50107, -304559, -66700, 154186, 18579, -13698, -18575, -195331, -121890]
10556a21890I9542b08708A42893n3066a57299l5554n4552B7996l410L29771a05571
10544C54581a83459I167P3826A6496a48668c8743k78431a46124A693K5013c15688
10532a31460F0968a90481f1691C09898a4070E7148d4919a0716j38240E5435i1875
10520E8580P702a69787K0359L5998R626A57817G3818J4958k4388J15705d16630
10508b03335B1537h7545A6090a36118B3750e1858k27985h9338C38671b94548h0993
10496d754p3468J283I3126e3976A20112h0540l3788Q667j71789A4804b61404j39192
10484d00596e095B38873A9938c75136A60116C2875L6130l1865K67485j35264J15189
10473B84550A30981K36110b6206A88229K8060i6927q0414A01502O0652b70640
$$ y = [-121890, 99542, -208708, 142893, 89827, -157299, -192853, -247405, 27996, 24586, 354357, -105571, 354581, -183459, 9167, 82993, 16496, -148668, -38743, -317174, -146124, 1693, 26706, -315688, -131460, 60968, -190481, -61691, 309898, -14070, 57148, -44919, -10716, -148956, 55435, -91875, 58580, 66282, -169787, -149428, -113430, -103804, 157817, 73818, 88776, 64388, 180093, -416630, -203335, 21537, -87545, 16090, -136118, 23750, -51858, -279843, -89338, 338671, -294548, -80993, -4754, -78222, -76939, 93126, -53976, 120112, -80540, -114328, -105661, -277450, 14804, -261404, -400596, -5095, 238873, 19938, -375136, 160116, 32875, 69005, 37140, 304625, 169361, 284550, 130981, 367091, -26206, 188229, 216289, -96927, -177341, 101502, 162154, -270640]
10462D67239a84076B05882g8769J9634n3577k1793A82347b52125A03272a05143
10451b34666B339c61815a44626F3399a265p481k73305Q6268E155K15437c42963
10439f2083p4352k2601E9753a79063p1254A0556d6957a9084D081a63141E1237
10427B47121b04877j40100F372c05044D3498f0708B43526b69143b4246q797j1961
10416d5004l12238E0356a53749B77840b70917P088A10070B4897M5334b65753A27238
10404F0652J27315D6489J66303b16113f7441k24589a07695N3319n8594l2764B1137
10392G7466h1930B68471k3242B7822M3747R3756O6932p5267k5644h206C28804
10380A01908J0506a34117K0174B78654P8328j15176M6811B7772L5345Q3563L49561
$$ y = [467239, -184076, 205882, -78769, -59135, -112712, -134505, 182347, -252125, 103272, -105143, -234666, 2339, -361815, -144626, 63399, -1265, -8746, -282051, -195783, 5155, 220592, -342963, -62083, -136435, -159036, 59753, -179063, -250317, 10556, -46957, -19084, 4081, -163141, 51237, 247121, -204877, -344977, 6372, -305044, 43498, -60708, 243526, -269143, -24246, -33043, -45004, -357242, 50356, -153749, 277840, -270917, -263829, 110070, 24897, 70231, -265753, 127238, 60652, 187967, 46489, 212792, -216113, -67441, -292030, -107695, -54376, -112970, -145734, 21137, 77466, -81930, 268471, 245229, 27822, 71569, 165325, 232257, 156990, 131346, -8206, 328804, 101908, 112414, -134117, -113943, 278654, 356982, 241806, 288617, 27772, 63117, 146680, 496241]
10369D96241A26234L41044A54289L10862J82072A78990L55263k35872J74759m9666
10359D23474A51775M84793k83532J05583f5074B15473R0463I7123K37247A43109
10348E15060N9030l7265J06866j32200J26691B49710H434J38036M11540A59632
10337C44026F0062J22094a34224C02592K4301q0679A18291j6781m1103J0557L65679
10326D36643m0454B116i1091A04183E819K06288A01383K68988J0150A39974k8064
10315A11910J24066k6595J50943g7898B17057a04453L459I5811L7155a0425B61373
10303i4410b2913A64394b93508B35230j05977K6023a94234P0869K808M9450A21515
10291A1238a77241A0735N032L9072f7644n1912r5253c5297j34683j29961C29867
$$ y = [496241, 126234, 467278, 154289, 465151, 647223, 178990, 534253, 298381, 473140, 423474, 151775, 636568, 353036, 458619, -65074, 215473, 305936, 97123, 334370, 143109, 515060, 574090, 536825, 643691, 511491, 638182, 249710, 8434, 146470, 558010, 159632, 344026, 60062, 182156, -134224, 302592, 326893, 246214, 118291, 101510, 60407, 70964, 436643, 396189, 2116, -91091, 104183, 5819, 212107, 101383, 370371, 380521, 139974, 111910, 235976, 209381, 360324, -77898, 217057, -104453, -100994, 95811, 132966, -10425, 261373, -94410, -22913, 164394, -293508, 235230, 129253, 155276, -194234, -123365, -120557, -71107, 121515, 11238, -177241, 10735, 15767, 54839, -67644, -119556, -214809, -35297, -169980, -299941, 329867]
10279B25094a25393I2936a5899B02803H5136i0952B9609l296a83796F8922c1497
10267E4663i9289A75326g3878k62528B68179a06784l1445D6072b6764j99718i4998
10255A02842R1474L87135k4277I8155K51297L74712a29791A60985k7236K4849
10245A58598O6629a16961A23241c1974m663j98840b6194H7100k2633Q7308o1662
10234I0113h9628j17778D8802d360k53195D6329J45491a45018C8866h932C34626
10222c20873B3189c05163B0907d02871J52739F1490i9870A6922g5321B7573J57310
10211A84883b96129O0154l579R775a05093E4516G289J64328b26682h8538j02037
10200a90575d5918G205e3509m9549r7612Q6118L0843j03959A5042R5273D5000
$$ y = [225094, -125393, 92936, -15899, 202803, 85136, -90952, 29609, 26313, -183796, 68922, -31497, 54663, -99289, 175326, -73878, -336406, 268179, -106784, -138229, 46072, -26764, -226482, -94998, 102842, 194316, 581451, 557174, 98155, 349452, 724164, -129791, 160985, 133749, 158598, 225227, -116961, 123241, -31974, -36637, -235477, -26194, 87100, 64467, 151775, 90113, -89628, -207406, 48802, -4360, -257555, 46329, 191820, -145018, 38866, -8932, 334626, -320873, 23189, -305163, 20907, -402871, -250132, 61490, -99870, 16922, -75321, 27573, 184883, -296129, -235975, -239554, -229779, -105093, 54516, 7289, 171617, -226682, -88538, -190575, -45918, 7205, -53509, -103058, -200670, -114552, -83709, -187668, 15042, 110315, 45000]
10188E4445b57917J8879A21798b2796j01511m9446H935J69232F780N808L0712
10177D3300c12420J52391b47k17601A18218B7442a09155C1566P4640Q9572B7731
10165A25788l5358e0931D9862a09408l710j9345J9101J2259n7156b5066r7989
10154a23055A96458K6273c58696E7463N192c9748J6367j094l17094B28776a51059
10142b83636F5072B7958J77329a1023m3945j38278C25624K616a32240l60527D7289
10130g7466j48227k0453J12152j01361n1913C7770b8851a1565r053I3600D6558
10118a3789k4877j29351l0049N1087n3643b6411k3725k20676i2437l22827A25122
10106i1098d669A7174i0873B6355N7028a46522l3524E4991a91326l0063f1327
$$ y = [54445, -257917, -239038, 121798, -22796, -124307, -173753, 8935, 178167, 6780, 12588, 43300, -312420, -160029, -247, -217848, 118218, 27442, -109155, 31566, 106206, 195778, 27731, 125788, 90430, -50931, 49862, -109408, -113118, -132463, -113362, -101103, -158259, -25066, -123055, 196458, 222731, -358696, 57463, 62655, -39748, -23381, -24475, -341569, 228776, -151059, -283636, 65072, 27958, 205287, -11023, -54968, -193246, 325624, 328240, -132240, -492767, 47289, -77466, -225693, -246146, -133994, -235355, -287268, 37770, -28851, -11565, -20618, 93600, 46558, -13789, -38666, -168017, -198066, -146979, -200622, -26411, -50136, -270812, -92437, -415264, 125122, -91098, -4669, 17174, -90873, 26355, 83383, -146522, -180046, 54991, -191326, -221389, -61327]
10094c24228f6524p1871n8922A27526c52575b3330A29990a01234a58B32741E0255
10082g7796B6096f3283A32108c10756K1432D4780a06926F2400c67952N7019h1039
10070a6357D890K40760c52907h8581k16462a50071N8704p7240H771J39851a08769
10058b39862I1656C6962a18594j36059A44781a00107k61284J30865f2217n7320
10048a19537A6161c22891o2268F570a2868k0522A43157h9713b9833D9687b11696
10036a09065a2316D9895O8655B7348b45460J07952b0367r8005k107p7757M2305
10025a55931C12367h6608o1873l4488Q0143j83434E0567J84127b74745A0268L0620
10014D0888d61133B41186a90589R1715q1979n0171b9616A81353a00550D8744a2050
$$ y = [-324228, -66524, -138395, -197317, 127526, -352575, -23330, 129990, -101234, -158, 232741, 50255, -77796, 26096, -63283, 132108, -310756, -289324, 44780, -106926, 62400, -367952, -310933, -81039, -16357, 4890, 245650, -352907, -88581, -305043, -150071, -91367, -168607, 8771, 148622, -108769, -239862, 91656, 36962, -118594, -254653, 144781, -100107, -361391, -230526, -62217, -119537, 16161, -322891, -385159, 6570, -12868, -33390, 143157, -89713, -29833, 49687, -211696, -109065, -12316, 49895, 118550, 27348, -245460, -137508, -20367, -118372, -120479, -198236, -155931, 312367, -86608, -148481, -182969, -102826, -286260, 50567, 234694, -274745, 10268, 40888, -461133, 241186, -190589, -98874, -180853, -231024, -29616, 181353, -100550, 48744, -12050]
10002a11361M3499n0802c4493B14238b8927l6268a509A38183a74766B00545E7578
9990B55560G1304a82828A85755E5816K00709b57142N9074A79012a17168o3139
9980a80307K9264J2947o9972B37137a50916A08285c24521B08673b8600r0318e8428
9968C33161A32402m0982A7790a4246j9494k05673d0878j61102F6313b64161a14495
9956c01786a01401e0348k1253H972a25714e6416m45J1187F2012J3675c6891r4308
9944a31199k1417D1724a37985j8497m9585k18998D8096M9099a41549l7709E3676
9932a95098A61601B731f0272b6319r1824m7157O4451k16625d7293j36884k7348
9921b11525O875A05175F632Q1605a05862e0031E7887c56397H4054J92128i6657
$$ y = [-111361, -67862, -118664, -34493, 214238, -28927, -65195, -1509, 138183, -174766, 200545, 57578, 255560, 71304, -182828, 185755, 55816, 256525, -257142, -198068, 179012, -117168, -180307, -151043, -138096, -208068, 237137, -150916, 108285, -324521, 208673, -28600, -118918, -58428, 333161, 132402, 91420, 17790, -14246, -33740, -239413, -40878, -201980, 66313, -264161, -114495, -301786, -101401, -50348, -71601, 8972, -125714, -56416, -56861, -45674, 62012, 75687, -36891, -131199, -152616, 41724, -137985, -156482, -206067, -425065, 48096, 97195, -141549, -179258, 53676, -195098, 161601, 2731, -60272, -26319, -118143, -165300, -100849, -317474, -47293, -184177, -211525, -204650, 105175, 6632, 88237, -105862, -50031, 57887, -356397, 84054, 276182, -96657]
9909E1455J10196M4623a78935a3629r7402k3522o224B8765b7281r1898A64904
9897a22768M7819A92860d3708E1718i322C8373f5269A03176m7157J61856c35491
9885B1068a8645E2149b00323j77989a72984c4925r6720M8128l96941A8765K56301
9874B75066a65947D6233a1761j36826n5862i9631d7439C5368a15787A915a50403
9862c64945a79824e5696p9589e0941k6162B28207b2177B29292o9658f2284F3286
9850A17154d54845a53550q1286A9689a75297C13338a22162C67611i7012H8984
9839E5693b61063N7619i8311E1538J35514B9024a33982N1359A26290i1499g740
9827b13735B1610b44666B97431d9291j20297H5183J07689j8868b13672o3586b0467
$$ y = [51455, 161651, 206274, -178935, -13629, -111031, -134553, -140777, 28765, -27281, -119179, 164904, -122768, -74949, 192860, -43708, 51718, -9322, 38373, -65269, 103176, 56019, 217875, -335491, 21068, -18645, 52149, -200323, -378312, -172984, -34925, -131645, -83517, -480458, 18765, 275066, -165947, 46233, -11761, -148587, -204449, -99631, -47439, 35368, -115787, 1915, -150403, -364945, -179824, -55696, -135285, -50941, -77103, 228207, -22177, 229292, 159634, -62284, 63286, 117154, -454845, -153550, -234836, 19689, -175297, 313338, -122162, 367611, -97012, 88984, 55693, -261063, -203444, -98311, 51538, 187052, 29024, -133982, -82623, 126290, -91499, -7740, -213735, 21610, -244666, 297431, -49291, -169588, 85183, 192872, 174004, -213672, -277258, -20467]
9815D9890g0378j76991a21882E8359b24644C6125K1877K92166c59169B6098L1698
9804E7796a93079c393k47743j34705J60239d1103A06072c5415j60962A1971R5668
9793A07639a04699Q344H8229b11948p3956a22239B6566b73369J36530A02577L5935
9782A38512d2604l3079A49259A29a86349O5527l5310E7005b81489M6705J04759
9771a30025j35758K2143c3124A22308b0025j25736B6267b90368k5847E5i9264
9759g3743I66J42867C8208b7548A14411c2721I1040b74857a10754C21053j20020
9748B01033E9642d80553J30372a36990M6287L301A02374k4224J96195a36150r5110
9737b31260j04421d9558A47367D0249O361J0354E583b13356B37524c41322A37363
$$ y = [49890, -70378, -247369, -121882, 58359, -224644, 36125, 58002, 350168, -359169, 26098, 57796, -193079, -3393, -251136, -385841, -225602, -41103, 106072, -35415, -196377, 11971, 107639, -104699, -96355, 88229, -211948, -285904, -122239, 26566, -273369, -136839, 102577, 138512, -42604, -75683, 149259, 129, -186349, -120822, -156132, 57005, -281489, -234784, -130025, -265783, -243640, -33124, 122308, -20025, -145761, 26267, -290368, -316215, 55, -99264, -73743, 966, 143833, 38208, -27548, 114411, -32721, 91040, -274857, -110754, 321053, 201033, 59642, -480553, -350181, -136990, -90703, -87402, 102374, 78150, 274345, -136150, -231260, -335681, -49558, 147367, 40249, 46610, 56964, 5583, -213356, 237524, -341322, 137363]
9725c14758k05822E6945a06760J8256o8827I9224b62089R5301A76722A4128c27307
9713b42116A3661N1385G734d1295o0062K9221N440I8054c97A40285i4399B62K93988
9700B94250E3175J67501q8058D2208a66953d8695o8429d7345p1321j85542J5706
9689b88502d9859B16558a03p633l3240o2563e1758A23667f1092A27006C5529P1764
9677A07293J7506b40432e4025k49522d6019k3259j19762L0021B72872d9399m7161
9666i6560A11510b23489B02725c59876J78342f3979j50163D9372b4881A14056
9655b41212g169k68873a19787C69991a13869k7153A0665N8473A3057K4448f1105
9643b69137A62064b45656H1964i3113K7243p7715M5451o2625A87850C8590f409
$$ y = [-314758, -520580, 56945, -106760, -88504, -157331, 99224, -262089, -166788, 176722, 14128, -327307, -242116, 13661, 65046, 7734, -41295, -101357, -72136, -66696, 98054, -397, 140285, -94399, 262, 294250, 53175, 220676, 132618, 42208, -166953, -48695, -117124, -47345, -118666, -304208, -288502, -49859, 216558, -103, -7736, -40976, -103539, -51758, 123667, -61092, 127006, 35529, 107293, 124799, -240432, -54025, -303547, -46019, -69278, -189040, -159019, 272872, -49399, -96560, 111510, -223489, 202725, -359876, -181534, -63979, -214142, 49372, -24881, 114056, -241212, -7169, -276042, -119787, 369991, -113869, -141022, 10665, 69138, 13057, 37505, -61105, -269137, 162064, -245656, 81964, -93113, -65870, -143585, -98134, -160759, 187850, 38590, -6409]
9631a34578C2302a91121n7592j3351A39554b25577M841I4483b70243J11312c4756
9619A29763a10145n2012N8985M4121k45272D43741a31138m2406D8596K07253H1821
9607h2571B4491a314j25248N0065A28955B8502J86494A5774b042l5073A8081K1873
9595C9954a8620B26530d2164A765O2917b77271F7218a61512o2766e2716n4265
9584a06981D2240M9606a1291j42803A25563A3962c47065e3221j18953b9740A76929
9572a65057b1006r1005j19887j34559J25798c9802q7149l2259i764j06630B29355
9560f5948g653A22332a50536J6008j3547N0322G2817P9741l7532J44684b68411
9548b49834L6059C1332a22447d6667C37971b24404a8841j79281H8986B7491e8619
$$ y = [-134578, 32302, -191121, -248713, -262064, 139554, -225577, -220736, 94483, -270243, -158931, -34756, 129763, -110145, -162157, -103172, -59051, -304323, 443741, -131138, -173544, 48596, 255849, 81821, -82571, 24491, -1314, -126562, -76497, 128955, 28502, 214996, 15774, -2042, -37115, 18081, 39954, -18620, 226530, -42164, 1765, 64682, -277271, 67218, -161512, -224278, -52716, -106981, 42240, 91846, -11291, -154094, 125563, 13962, -347065, -53221, -172174, -29740, 176929, -165057, -21006, -112011, -231898, -366457, -240659, -39802, -126951, -159210, -9764, -116394, 229355, -65948, -7653, 122332, -150536, -134528, -148075, -97753, 72817, 152558, 115026, 259710, -268411, -249834, -213775, 31332, -122447, -46667, 337971, -224404, -18841, -198122, 88986, 27491, -58619]
9536A62645d5981j54985o293M1261o9515A6598f0348n0363A07737a4696j58584
9525a73280p7608J855B24753b95360l3490B39130l1870c30938a1320B627f8001
9513D775a77617D3402a17997F2416a07362o4258N6177B0917a37297E4400J35789
9502A90189R7831I2315a05328o2580A80305n3894n253q967C6952a19185l26054
9491d45239K11032m0041Q4278A41901b69991G6679b372A32984m6715F821N2706
9480E9527b09215b581j34526j31780B8771M79688A3295a18004j13188J03266H5870
9468i5018l4149b2052o2809n9317D5761N4770D1323a80644B8462O6066a91244
9456b13048j1389h94B52543b01406j97540a19582a651j2136l3214k90888a60968
$$ y = [162645, -45981, -200966, -207259, -165998, -235513, 16598, -60348, -110711, 107737, -14696, -173280, -250888, -249033, 224753, -295360, -328850, 239130, 207260, -330938, -11320, 2627, -68001, 4775, -177617, 43402, -117997, 62416, -107362, -171620, -115443, 20917, -137297, 54400, 190189, 288020, 92315, -105328, -167908, 180305, 126411, 121158, 112191, 36952, -119185, -445239, -234207, -274248, -189970, 141901, -269991, 76679, -2372, 132984, 86269, 6821, 59527, -209215, -2581, -137107, -268887, 28771, 508459, 13295, -118004, -231192, -127926, 85870, -95018, -129167, -22052, -84861, -144178, 45761, 100531, 41323, -180644, 28462, 94528, -191244, -213048, -224437, -894, 252543, -201406, -398946, -119582, -1651, -13787, -47001, -337889, -160968]
9444b27711a00677j6563D6678M8213K01178C9776m816K86141a74746B4568J50990
9433A75558a2227D6833e9460k18311e6928D7193K8961B7669a10894h629A64380
9421c10074D7001M4341D1364Q1044a26935N9658B4585g4151A25491a71383k05548
9410c76931a42156o4710E3860a24245M9101K7010B28520a43572A87561c06088
9399E5918a30737A1012a18164D2056K962a35168L806f522k53510N7488l9932K5005
9387b17471P7775k03054a63096m9990H2029C2085D475J87202q6090D4647R6379
9376A41026d4684m705k3184B50368a53692k03553a33345A16365E7336b7929D7143
9364a50502f2294J7207l0670c7779l23696a02556c1050A93284b74386A7720d8372
$$ y = [-227711, -100677, -117240, 46678, 94891, 296069, 39776, 34960, 321101, -174746, 24568, 175558, -12227, 46833, -59460, -277771, -56928, 47193, 76154, 27669, -110894, -8629, 164380, -310074, 47001, 91342, 41364, 122408, -126935, -67277, 24585, -74151, 125491, -171383, -376931, -142156, -206866, 53860, -124245, -75144, -48134, 228520, -143572, 187561, -306088, 55918, -130737, 11012, -118164, 42056, 45018, -135168, -131362, -6522, -260032, -202544, -242476, -217471, -139696, -342750, -163096, -213086, 82029, 32085, 4475, 191677, 105587, 44647, 141026, -44684, -49389, -72573, 250368, -153692, -357245, -133345, 116365, 57336, -27929, 47143, -150502, -62294, -45087, -75757, -37779, -361475, -102556, -31050, 193284, -274386, 17720, -48372]
9352a6444k5474E8683Q0406c19948B30951E4061i038l8010C41747b46763j8426
9341b65189J4014A36277b3071l3631C1957d78061a01943p4150A52828o5965A3864
9329c8449j14515k14331c5188m515G8513b43808g1641m6284J2399p766J1382b4299
9316B98790A21057b86361A33118k576a10346j20050H972b72361C639a87154R1739
9305i5415k44787a29286k46651C24830p4711j07718a93963H8131k1925a87885
9294C3525J82780G3564B5624c81461C9436g4039l89036d1241B15477b3479h555
9282E0330K23759a20710A32238c50735G4286c23087B6507a3471l10743J36596
9272a87618e9159B3983J69033a02173j0445j06443B980a71110r2702a14023L4837
$$ y = [-16444, -41918, 58683, 139089, -319948, 230951, 54061, -9038, -47048, 341747, -246763, -265189, -251175, 136277, -23071, -56702, 31957, -478061, -101943, -176093, 152828, 86863, 13864, -38449, -152964, -367295, -35188, -39703, 78513, -243808, -71641, -117925, -105526, -113292, -101910, -24299, 298790, 121057, -286361, 133118, 130542, -110346, -230396, 8972, -272361, 3639, -187154, -95415, -340202, -129286, -375937, 324830, 250119, 142401, -193963, 88131, 66206, -187885, 33525, 216305, 73564, 25624, -381461, 39436, -74039, -463075, -41241, 215477, -23479, -8555, 50330, 274089, -120710, 132238, -350735, 74286, -323087, 26507, -13471, -324214, -187618, -59159, 23983, 193016, -102173, -112618, -219061, 2980, -171110, -263812, -114023, -79186]
9261g9186N531j42174G1798b2464j21502H6767A2576a22702K4269H2297b83002
9249a55285A30332A7716b72145R4004k95627A5255a31063m2383m5084A77645K8774
9238B06419B8570a61914K575b0274N994j77788B293i7490F0437h9766p9239J8041
9226a50964n4554A91359b16203A61885K03446b04232A07325a87323B9586g1381
9215a09741r8232j36762A5570a43989B21780a21866A3893J0705C564a50017K7483
9204a22534j02538a09103c5358k7538o7070a241k19285A82493I543c44023f5345
9192A61809c3308A39619F1860d52026e9944A19105n599a36234A94094D839Q6216
9181I1055b3839l60505J72796C04966e1439b513l00716a13818K0011E8172b6053
$$ y = [-79186, -73655, -215829, 71798, -22464, -143966, 86767, 12576, -122702, -98433, 82297, -283002, -155285, 130332, 17716, -272145, -178141, -473768, 15255, -131063, -173446, -218530, 177645, 206419, 28570, -161914, -159339, -20274, -14280, -192068, 2293, -97490, 60437, -89766, -169005, -150964, -205518, 191359, -216203, 161885, 365331, -204232, 107325, -187323, 29586, -71381, -109741, -207973, -344735, 15570, -143989, 221780, -121866, 13893, 24598, 3564, -150017, -122534, -225072, -109103, -35358, -62896, -129966, -1241, -220526, 182493, 9543, -344023, -65345, 161809, -33308, 139619, 61860, -452026, -59944, 119105, 113506, -136234, 194094, 4839, 91055, -23839, -384344, -211548, 304966, -51439, -2513, -303229, -113818, -93807, 58172, -26053]
9169a99138B8129a17997j9198f929k42966D3303a56987G099L26316o3285a93254
9157D3499i6216K7407B7399E117J24450J30851B2597a39462A11353L2551C9234
9145a63422A13013m6401K1051j5979F964g1415k40635O5441d5100b0024j40775
9134a60799E5400J35055A729e7837j37551b3214o0513r3907H7158h415B7026e4199
9121a76685G5757c4109C5018a22152N6411l9576k40457g5480B4274K14274B6233
9109b09873e8558m1128k03575B51920h9631j36327k66599g2252K4658F1717b90223
9097a41839A77877E9220d61554f241j09554J7442j71854E7711J15730l8245c85493
9085a18483B99020h4404j25145I689a48463E9842J1441a12875G3590B457Q7717
$$ y = [-199138, 28129, -117997, -137195, -6929, -249895, 43303, -156987, 7099, 333415, 270130, -193254, 43499, -96216, -68809, 27399, 5117, 129567, 260418, 22597, -139462, 111353, 143904, 39234, -163422, 113013, 66612, 87663, 71684, 6964, -71415, -312050, -246609, -45100, -20024, -160799, 55400, 190455, 1729, -57837, -195388, -23214, -83727, -177634, 87158, -8415, 27026, -54199, -176685, 75757, -34109, 35018, -122152, -65741, -105317, -345774, -75480, 24274, 238548, 26233, -209873, -58558, -99686, -303261, 251920, -89631, -225958, -492557, -72252, -47594, 61717, -290223, -141839, 177877, 59220, -461554, -6241, -115795, -98353, -270207, 57711, 173441, 135196, -385493, -118483, 299020, -84404, -209549, 9689, -148463, 59842, 71283, -112875, 73590, 2457, 90174]
9074I0174a82469E7069a03083B80357f5546o7978M6221B1857J57483h716B84533
9062b12040b2136A6385a97355N065F9171b6725k9330G629K0536c41253a66059
9050a38752M7640E8808J08765c63637a7939n4075r7187i329o0273B94992c7920
9038h8200N691o441K3914j50970e5586k37507B35853A10295R0544j2641a78108
9026B59820b67883H9729k8893O9137a00635J8142r9037j47748J29392k5480A00451
9014a15515m6333f1782r703G240a94867E3260R7229a53133M2042k05450d1393
9002a75034A60035G0234M0182c83843j76245a98650F8380A1772a50741A08378
8991A21228c7968g207j16105B4929L13763Q5212j82023A6486b10054d4152n514
$$ y = [90174, -182469, 57069, -103083, 280357, -65546, -133524, -87303, 21857, 179340, -8716, 284533, -212040, -22136, 16385, -197355, -192290, 69171, -26725, -56055, 7629, 28165, -341253, -166059, -138752, -91112, 58808, 167573, -363637, -17939, -72014, -169201, -9329, -69602, 294992, -37920, -88200, -82509, -88950, -65036, -216006, -55586, -293093, 235853, 110295, 200839, 188198, -178108, 259820, -267883, 89729, 60836, 129973, -100635, -82493, -181530, -329278, -199886, -225366, 100451, -115515, -161848, -61782, -71485, 7240, -194867, 53260, 150489, -153133, -111091, -316541, -41393, -175034, 160035, 70234, 110416, -383843, -560088, -198650, 68380, 11772, -150741, 108378, 121228, -37968, -7207, -123312, 24929, 338692, 423904, 241881, 16486, -210054, -44152, -49666]
8980d9666a1608C7346d4452I6767a97578k10659J93756A53932h7833q2439C0758
8968a06675j40091J5074d7560C3961g092k8944H706J85949a3007j0435D6027P1447
8956A17474i1668o7132A75771D4586d3853B402a90106A116K46741a55750b7098
8944b31429N2330j36415J10469c3944A69879a09793H7295e9311j25354A17325
8933A7953Q5077J9069R5688C0284i6779G6447h5268A61117J27888E3797N58198
8922F11995J42693J370707L726626R699956o965586B000554C96103q4701K60046
8913E71448a5110k4239B23339g9671q2986P2903D1539N58095B83536j15145c3565
8901c2207m3222p1747C962a31209A42301m5117J16615a28999b9910G3254b60724
$$ y = [-49666, -11608, 37346, -44452, 96767, -197578, -408237, -214481, 153932, -87833, -170272, 30758, -106675, -246766, -231692, -47560, 33961, -7092, -36036, 8706, 194655, -13007, -23442, 46027, 117474, -91668, -158800, 175771, 44586, -43853, 2402, -190106, 1116, 247857, -155750, -27098, -231429, -179099, -315514, -205045, -33944, 169879, -109793, 87295, -59311, -184665, 117325, 17953, 103030, 122099, 217787, 30284, -96779, 76447, -85268, 161117, 289005, 53797, 611995, 754688, 2125395, 5852021, 15551977, 8586391, 2000554, 396103, 311402, 571448, -15110, -39349, 223339, -79671, -162657, -89754, 41539, 599634, 283536, 168391, -33565, -32207, -75429, -147176, 3962, -131209, 142301, 97184, 213799, -128999, -29910, 73254, -260724]
8889a49262A3729K060d9750k62577r150a21463D7538J97277a77534f2988j56947
8878b19935A7262J3223c06219B4697b61918Q4231N4553j13872R9478q1608A49756
8866b18013f465j65326C56655f3956j97734k2444Q4590Q3785F9441J32332o7385
8855A34388e8353j09549c2266C8216a13151r816p434m9071k4421A10206N3653
$$ y = [-149262, 13729, 15789, -49750, -312327, -321477, -121463, 47538, 244815, -177534, -62988, -219935, 17262, 30485, -306219, 24697, -261918, -177687, -123134, -237006, -137528, -219136, 149756, -218013, -6465, -171791, 356655, -63956, -261690, -284134, -199544, -115759, 69441, 201773, 134388, -58353, -167902, -32266, 38216, -113151, -122967, -130401, -179472, -203893, 110206, 163859]
$$ [...]
##END NTUPLES=NMR SPECTRUM
##END=
