
##TITLE=AC1214_MBOAH12040_5946941_p5poUjc0Yj
##JCAMPDX= 6.0         $$ Bruker NMR JCAMP-DX V2.0
##DATA TYPE= NMR SPECTRUM
##DATA CLASS= NTUPLES
##ORIGIN= BRUKER
##OWNER= Administrator
$$ 1.72 TOPSPIN		Version 2.1
$$ 2012-04-11 04:34:32.421 -0500  Administrator@TOPSPIN
$$ Compression mode = diff/dup
##.OBSERVE FREQUENCY= 400.13188235
##.OBSERVE NUCLEUS= ^1H
##.ACQUISITION MODE= SIMULTANEOUS (DQD)
##.ACQUISITION SCHEME= undefined
##.AVERAGES= 64
##.DIGITISER RES= 22
##SPECTROMETER/DATA SYSTEM= spect
##.PULSE SEQUENCE= noesygpps1d.comp
##.SOLVENT NAME= COFFEE_meoh
##.SHIFT REFERENCE= INTERNAL, COFFEE_meoh, 1, 14.96852
##AUDIT TRAIL= $$ (NUMBER, WHEN, WHO, WHERE, PROCESS, VERSION, WHAT)
$$ ##TITLE= Audit trail, TOPSPIN		Version 2.1
$$ ##JCAMPDX= 5.01
$$ ##ORIGIN= Bruker BioSpin GmbH
$$ ##OWNER= Administrator
$$ $$ C:\Bruker\TOPSPIN/data/COFFEE/nmr/AC1214_MBOAH12040_5946941_p5poUjc0Yj/12/pdata/1/auditp.txt
$$ ##AUDIT TRAIL=  $$ (NUMBER, WHEN, WHO, WHERE, PROCESS, VERSION, WHAT)
(   1,<2012-04-11 04:34:27.687 -0500>,<Administrator>,<TOPSPIN>,<go>,<TOPSPIN 2.1>,
      <created by zg
	started at 2012-04-11 04:22:55.921 -0500,
	POWCHK enabled, PULCHK disabled,
       configuration hash MD5:
       1A 1E CE 29 27 FD 77 03 67 4E F0 E3 C4 B2 CB 90
       data hash MD5: 64K
       A2 C2 E7 FE 47 9E 89 1B FE A0 86 29 84 50 7F E0>)
(   2,<2012-04-11 04:34:30.453 -0500>,<Administrator>,<TOPSPIN>,<proc1d>,<TOPSPIN 2.1>,
      <Start of raw data processing
       efp LB = 0.3 FT_mod = 6 PKNL = 1 PHC0 = 0 PHC1 = 0 SI = 128K 
       data hash MD5: 128K
       0A 5D CB 6E AB EB C8 08 FF C9 1C CC 7C 7F 7D 5E>)
(   3,<2012-04-11 04:34:31.671 -0500>,<Administrator>,<TOPSPIN>,<proc1d>,<TOPSPIN 2.1>,
      <pk PHC0 = 33.33252 PHC1 = 0 
       data hash MD5: 128K
       DD DF 72 35 CF 06 C2 C0 78 82 65 69 F6 6C 33 1E>)
(   4,<2012-04-11 04:34:31.906 -0500>,<Administrator>,<TOPSPIN>,<proc1d>,<TOPSPIN 2.1>,
      <abs ABSG = 1 
       data hash MD5: 128K
       59 CC C1 D3 20 80 B6 06 03 C9 AD A4 F7 D2 C0 8B>)
(   5,<2012-04-11 04:34:31.984 -0500>,<Administrator>,<TOPSPIN>,<proc1d>,<TOPSPIN 2.1>,
      <abs ABSG = 2 
       data hash MD5: 128K
       51 B0 FE F5 45 B3 5D BB 15 2F DC 39 08 26 8F 8C>)
(   6,<2012-04-11 04:34:32.046 -0500>,<Administrator>,<TOPSPIN>,<proc1d>,<TOPSPIN 2.1>,
      <abs ABSG = 3 
       data hash MD5: 128K
       AA 99 B1 A7 E5 4B AB 4D 25 BA EE F7 A7 8D F4 36>)
(   7,<2012-04-11 04:34:32.281 -0500>,<Administrator>,<TOPSPIN>,<proc1d>,<TOPSPIN 2.1>,
      <abs ABSG = 4 
       data hash MD5: 128K
       17 BF 6B 13 AC FF 3B 0D AD 3E 6A 18 7E DB DA A1>)
(   8,<2012-04-11 04:34:32.328 -0500>,<Administrator>,<TOPSPIN>,<proc1d>,<TOPSPIN 2.1>,
      <abs ABSG = 5 
       data hash MD5: 128K
       86 D3 25 4E 7B 0A D2 72 50 8B 6F 4A 7D 0B 24 F2>)
$$ ##END=
$$ 
$$ $$ hash MD5
$$ $$ 96 88 41 9C 24 7C 31 8D 68 82 DB 82 93 11 1C 33
##$RELAX= 
##$RELAX= 
##$RELAX= 
##$RELAX= 
##$RELAX= 
##$RELAX= 
##$RELAX= 
##$RELAX= 
$$ Bruker specific parameters
$$ [...]
##$TP07= 0
##$TPNAME0= <>
##$TPNAME1= <>
##$TPNAME2= <>
##$TPNAME3= <>
##$TPNAME4= <>
##$TPNAME5= <>
##$TPNAME6= <>
##$TPNAME7= <>
##$TPOAL= (0..7)
0.5 0.5 0.5 0.5 0.5 0.5 0.5 0.5
##$TPOFFS= (0..7)
0 0 0 0 0 0 0 0
##$TUNHIN= 0
##$TUNHOUT= 0
##$TUNXOUT= 0
##$USERA1= <user>
##$USERA2= <user>
##$USERA3= <user>
##$USERA4= <user>
##$USERA5= <user>
##$V9= 5
##$VALIST= <valist>
##$VCLIST= <CCCCCCCCCCCCCCC>
##$VD= 0
##$VDLIST= <DDDDDDDDDDDDDDD>
##$VPLIST= <PPPPPPPPPPPPPPP>
##$VTLIST= <TTTTTTTTTTTTTTT>
##$WBST= 1024
##$WBSW= 4
##$XGAIN= (0..3)
0 0 0 0
##$XL= 0
##$YL= 0
##$YMAX_a= 13992721
##$YMIN_a= -6106993
##$ZGOPTNS= <>
##$ZL1= 120
##$ZL2= 120
##$ZL3= 120
##$ZL4= 120
##$ABSF1= 14.96852
##$ABSF2= -5.58401
##$ABSG= 5
##$ABSL= 3
##$ALPHA= 0
##$AQORDER= 0
##$ASSFAC= 0
##$ASSFACI= 0
##$ASSFACX= 0
##$ASSWID= 0
##$AUNMP= <proc_prof1d_extract.lims>
##$AXLEFT= 0
##$AXNAME= <>
##$AXNUC= <1H>
##$AXRIGHT= 0
##$AXTYPE= 0
##$AXUNIT= <>
##$AZFE= 0.1
##$AZFW= 0.1
##$BCFW= 0
##$BC_mod= 0
##$BYTORDP= 0
##$COROFFS= 0
##$CY= 15
##$DATMOD= 1
##$DC= 0
##$DFILT= <>
##$DTYPP= 0
##$F1P= 0
##$F2P= 0
##$FCOR= 0.5
##$FTSIZE= 131072
##$FT_mod= 6
##$GAMMA= 0
##$GB= 0
##$INTBC= 1
##$INTSCL= 1
##$ISEN= 128
##$LB= 0.3
##$LEV0= 0
##$LPBIN= 0
##$MAXI= 10000
##$MC2= 0
##$MEAN= 0
##$ME_mod= 0
##$MI= 0
##$NCOEF= 0
##$NC_proc= -3
##$NLEV= 6
##$NOISF1= 0
##$NOISF2= 0
##$NSP= 0
##$NTH_PI= 0
##$NZP= 0
##$OFFSET= 14.96852
##$PC= 1
##$PHC0= 33.33252
##$PHC1= 0
##$PH_mod= 1
##$PKNL= yes
##$PPARMOD= 0
##$PPDIAG= 0
##$PPIPTYP= 0
##$PPMPNUM= 2147483647
##$PPRESOL= 1
##$PSCAL= 4
##$PSIGN= 0
##$PYNMP= <proc.py>
##$REVERSE= no
##$SF= 400.130004836136
##$SI= 131072
##$SIGF1= 0
##$SIGF2= 0
##$SINO= 400
##$SIOLD= 131072
##$SPECTYP= <>
##$SREGLST= <1H.CDCl3>
##$SSB= 0
##$STSI= 131072
##$STSR= 0
##$SW_p= 8223.68421052632
##$SYMM= 0
##$S_DEV= 0
##$TDeff= 65536
##$TDoff= 0
##$TI= <>
##$TILT= no
##$TM1= 0
##$TM2= 0
##$TOPLEV= 0
##$USERP1= <user>
##$USERP2= <user>
##$USERP3= <user>
##$USERP4= <user>
##$USERP5= <user>
##$WDW= 1
##$XDIM= 131072
##$YMAX_p= 541192542
##$YMIN_p= -459122416
##$CURPLOT= <Network HP LaserJet P1505>
##$CURPRIN= <$Network HP LaserJet P1505>
##$DFORMAT= <normdp>
##$LAYOUT= <+/1D_H.xwp>
##$LFORMAT= <normlp>
##$PFORMAT= <normpl>
##$SURQMSG= 1
$$ End of Bruker specific parameters
$$ ---------------------------------
##NTUPLES= NMR SPECTRUM
##VAR_NAME=  FREQUENCY,     SPECTRUM/REAL,   SPECTRUM/IMAG
##SYMBOL=    X,             R,               I
##VAR_TYPE=  INDEPENDENT,   DEPENDENT,       DEPENDENT
##VAR_FORM=  AFFN,          ASDF,            ASDF
##VAR_DIM=   131072,        131072,          131072
##UNITS=     HZ,            ARBITRARY UNITS, ARBITRARY UNITS
##FACTOR=    0.0627417313425165, 1,          1
##FIRST=     8223.62146879498, 1501,         -105640
##LAST=      0,             5209,            -105786
##MIN=       0,             -459122416,      0
##MAX=       8223.62146879498, 541192542,    0
$$ Real data points
##PAGE= N=1
##DATA TABLE= (X++(R..R)), XYDATA
$$ [...]
$$ plain form
60691 1661354 1677404 1693619 1707970 1720862 1734749 1751115 1768516 1784195 1797103 1808152 1817612
60680 1817612 1823888 1825841 1825070 1824314 1824207 1823224 1820553 1817133 1813457 1807995 1798836 1785942 1770942 1755360
60666 1755360 1739725 1723840 1707296 1690119 1673297 1658146 1644768 1631780 1617995 1603767 1590193
60655 1590193 1577655 1565875 1554934 1545385 1537413 1530367 1523124 1514690 1504731 1493806 1482941 1472752
60643 1472752 1463217 1454354 1446567 1439913 1433547 1426590 1419540 1414326 1412746 1414995 1419836 1426085 1433622 1442742
60629 1442742 1452814 1462255 1470033 1476536 1482549 1487948 1491954 1493968 1493262 1488420 1478356 1463891 1447180
60616 1447180 1429415 1410003 1388205 1364624 1340736 1317788 1296655 1278077 1262282 1248457 1234969
60605 1234969 1220461 1205197 1191550 1182351 1177922 1175235 1170976 1165065 1159982 1157028 1154823 1151714 1148034
$$ packed form
60691A661354J6050J6215J4351J2892J3887J6366J7401J5679J2908J1049R460
60680A817612O276J953p71p56j07r83k671l420l676n462r159j2894j5000j5582
60666A755360j5635j5885j6544j7177j6822j5151j3378j2988j3785j4228j3574
60655A590193j2538j1780j0941r549p972p046p243q434r959j0925j0865j0189
60643A472752r535q863p787o654o366o957p050n214j580K249M841O249P537R120
60629A442742J0072R441P778O503O013N399M006K014p06m842j0064j4465j6711
60616A447180j7765j9412k1798k3581k3888k2948k1133j8578j5795j3825j3488
60605A234969j4508j5264j3647r199m429k687m259n911n083k954k205l109l680
$$ plain form
60592 1148034 1145162 1143492 1142362 1141464 1141509 1143468 1147336 1151516 1153738 1153130 1151173 1150096 1150664 1152155 1153792
60577 1153792 1155070 1155411 1155143 1156458 1161496 1169479 1177649 1185226 1194347 1206530 1220473 1234529 1249412
60564 1249412 1266849 1287027 1309073 1333061 1359705 1388547 1417969 1447025 1476283 1506968 1539822
60553 1539822 1574548 1609906 1644649 1678448 1711324 1742280 1769738 1793469 1814485 1832333 1844101
60542 1844101 1847345 1842918 1833729 1821648 1806726 1788501 1766765 1741631 1713916 1685032 1655882 1626610
60530 1626610 1597977 1571833 1549404 1530266 1513932 1501078 1491942 1484882 1478104 1471683 1466242 1460868
60518 1460868 1454418 1447928 1443337 1440183 1435915 1429581 1423065 1418312 1415272 1413200 1412237 1412882 1415154 1419070
60504 1419070 1424934 1432486 1440734 1449349 1459415 1471983 1486397 1500877 1514625 1528807 1545391 1565243
$$ packed form
60592A148034k872j670j130q98M5J959L868M180K222o08j957j077N68J491J637
60577A153792J278L41k68J315N038P983Q170P577R121J2183J3943J4056J4883
60564A249412J7437K0178K2046K3988K6644K8842K9422K9056K9258L0685L2854
60553A539822L4726L5358L4743L3799L2876L0956K7458K3731K1016J7848J1768
60542A844101L244m427r189j2081j4922j8225k1736k5134k7715k8884k9150k9272
60530A626610k8633k6144k2429j9138j6334j2854r136p060o778o421n441n374
60518A460868o450o490m591l154m268o334o516m753l040k072r63O45K272L916
60504A419070N864P552Q248Q615J0066J2568J4414J4480J3748J4182J6584J9852
$$ plain form
60492 1565243 1587516 1610784 1634480 1658935 1684409 1710876 1738737 1768797 1801323 1836129 1874002
60481 1874002 1916928 1966308 2021960 2083503 2151348 2225089 2301966 2378127 2450455 2515808 2569644
60470 2569644 2607460 2627494 2630752 2618941 2593981 2558985 2517787 2473354 2428007 2384907 2347492
60459 2347492 2317352 2294266 2278579 2271930 2275141 2286727 2304076 2325196 2349163 2376115 2407277 2444022
60447 2444022 2486502 2533921 2586242 2644710 2710820 2785866 2871435 2969115 3079710 3204132 3345135
60436 3345135 3506540 3690377 3896360 4124649 4377264 4655635 4958202 5281942 5625507
60427 5625507 5989669 6375503 6783474 7213394 7662507 8121526 8571957 8987409 9338248
60418 9338248 9596784 9740961 9756455 9638421 9393136 9037812 8597295 8099242 7570439 7034538
$$ packed form
60492A565243K2273K3268K3696K4455K5474K6467K7861L0060L2526L4806L7873
60481A874002M2926M9380N5652O1543O7845P3741P6877P6161P2328O5353N3836
60470B569644L7816K0034L258j1811k4960l4996m1198m4433m5347m3100l7415
60459B347492l0140k3086j5687o649L211J1586J7349K1120K3967K6952L1162L6745
60447B444022M2480M7419N2321N8468O6110P5046Q5569R7680J10595J24422J41003
60436C345135J61405J83837K05983K28289K52615K78371L02567L23740L43565
60427E625507L64162L85834M07971M29920M49113M59019M50431M15452L50839
60418I338248K58536J44177J5494j18034k45285l55324m40517m98053n28803n35901
$$ plain form
60408 7034538 6509856 6007906 5534632 5093626 4687875 4318840 3985470 3685317 3416318
60399 3416318 3177039 2965622 2779134 2613887 2466386 2334303 2216652 2112771 2021106 1939269
60389 1939269 1865206 1797873 1736838 1681621 1631283 1584346 1539427 1496468 1456884 1421721 1390021
60378 1390021 1359816 1330370 1302449 1276753 1253290 1232123 1213398 1196529 1180585 1165672 1152701
60367 1152701 1141596 1131189 1121308 1113411 1108159 1103617 1097263 1089284 1082686 1080222 1081999 1086009 1090246
60354 1090246 1094018 1097537 1100812 1103480 1105787 1108970 1113997 1120351 1126765 1132689 1138163 1142779 1146160 1149289
60340 1149289 1153885 1160272 1167148 1173595 1179961 1186576 1193323 1200968 1211054 1223265 1234464 1241889 1246380
60327 1246380 1250962 1256999 1263309 1268556 1272875 1276963 1280851 1283897 1285269 1284284 1280856 1275705 1269748 1263454
$$ packed form
60408G034538n24682n01950m73274m41006m05751l69035l33370l00153k68999
60399C416318k39279k11417j86488j65247j47501j32083j17651j03881r1665q1837
60389A939269p4063o7333o1035n5217n0338m6937m4919m2959l9584l5163l1700
60378A390021l0205k9446k7921k5696k3463k1167j8725j6869j5944j4913j2971
60367A152701j1105j0407r881p897n252m542o354p979o598k464J777M010M237
60354A090246L772L519L275K668K307L183N027O354O414N924N474M616L381L129
60340A149289M596O387O876O447O366O615O747P645J0086J2211J1199P425M491
60327A246380M582O037O310N247M319M088L888L046J372r85l428n151n957o294
$$ plain form
60313 1263454 1257262 1252188 1249166 1247806 1246677 1245001 1243504 1243360 1244803 1247041 1249208 1251020 1252621 1254151
60299 1254151 1255726 1257852 1261529 1267541 1275623 1284676 1293903 1303335 1313212 1323375 1333628 1344254 1355644
60286 1355644 1367624 1379607 1391317 1402902 1414362 1425224 1434896 1442954 1448986 1452576 1453779 1453384 1452263
60273 1452263 1450560 1448053 1445319 1443826 1444490 1446890 1450570 1456405 1465388 1476423 1486792 1495054 1502048 1508559
60259 1508559 1513559 1515798 1515819 1514911 1512898 1508558 1501942 1494771 1488506 1483126 1477867 1472218 1466106 1459868 1454096
60244 1454096 1448975 1443924 1438518 1433410 1429659 1427528 1426695 1427138 1428823 1430935 1432598 1434208 1437054 1441717
60230 1441717 1447691 1454246 1460694 1466140 1470097 1473289 1477037 1482162 1489183 1498712 1510353 1521984 1531838
60217 1531838 1540859 1551380 1563867 1576855 1589804 1603925 1620053 1637799 1657206 1679327 1704610
$$ packed form
60313A263454o192n074l022j360j129j676j497j44J443K238K167J812J601J530
60299A254151J575K126L677O012Q082R053R227R432R877J0163J0253J0626J1390
60286A355644J1980J1983J1710J1585J1460J0862R672Q058O032L590J203l95j121
60273A452263j703k507k734j493O64K400L680N835Q983J1035J0369Q262O994O511
60259A508559N000K239K1r08k013m340o616p171o265n380n259n649o112o238n772
60244A454096n121n051n406n108l751k131q33M43J685K112J663J610K846M663
60230A441717N974O555O448N446L957L192L748N125P021R529J1641J1631R854
60217A531838R021J0521J2487J2988J2949J4121J6128J7746J9407K2121K5283
$$ plain form
60206 1704610 1732384 1762434 1795462 1831560 1869975 1910909 1955731 2004851 2057247 2112857 2173541
60195 2173541 2240703 2313804 2392316 2477260 2569397 2667615 2770893 2880666 2999569 3128750
60185 3128750 3267832 3416496 3574344 3739685 3909959 4083170 4257958 4432684 4605317
60176 4605317 4773735 4935313 5086684 5224753 5347662 5454418 5544284 5616933 5672366 5710186
60166 5710186 5729886 5732279 5719672 5694357 5658428 5615703 5571988 5532080 5497591 5468727 5446833
60155 5446833 5433909 5431029 5439037 5459905 5495670 5546479 5611078 5688900 5780605 5887087 6008898
60144 6008898 6145770 6295448 6453566 6615807 6779625 6942892 7101813 7251522 7388008
60135 7388008 7508080 7608272 7685572 7739090 7769516 7776826 7759641 7716915 7649648 7561308 7457285
$$ packed form
60206A704610K7774L0050L3028L6098L8415M0934M4822M9120N2396N5610O0684
60195B173541O7162P3101P8512Q4944R2137R8218J03278J09773J18903J29181
60185C128750J39082J48664J57848J65341J70274J73211J74788J74726J72633
60176D605317J68418J61578J51371J38069J22909J06756Q9866P2649N5433L7820
60166E710186J9700K393j2607k5315l5929m2725m3715l9908l4489k8864k1894
60155E446833j2924k880Q008K0868L5765N0809O4599P7822R1705J06482J21811
60144F008898J36872J49678J58118J62241J63818J63267J58921J49709J36486
60135G388008J20072J00192P7300N3518L0426P310j7185m2726o7267q8340j04023
$$ plain form
60124 7457285 7343416 7224146 7102350 6981293 6865821 6760773 6669163 6592851 6533892 6493904
60114 6493904 6472962 6470609 6487404 6524230 6580672 6655226 6746346 6851846 6967912 7090169 7215275
60103 7215275 7340188 7460567 7571635 7670389 7755475 7825196 7877206 7910336 7925680 7925995 7914919
60092 7914919 7896421 7874076 7851192 7832234 7823092 7828745 7851593 7893311 7957063 8046095 8161239
60081 8161239 8302130 8470448 8669706 8902045 9167231 9464742 9794757 10157094 10551238
60072 10551238 10977548 11436423 11925655 12440070 12973856 13521468 14076047 14628838 15170768
60063 15170768 15693084 16186212 16639873 17045185 17395427 17684513 17906492 18057298 18135606
60054 18135606 18141313 18074442 17936145 17729489 17458810 17129672 16750178 16331102 15884071 15420580
$$ packed form
60124G457285j13869j19270j21796j21057j15472j05048r1610p6312n8959l9988
60114F493904k0942k353J6795L6826N6442P4554R1120J05500J16066J22257J25106
60103G215275J24913J20379J11068R8754Q5086O9721N2010L3130J5344L15j1076
60092G914919j8498k2345k2884j8958r142N653K2848M1718O3752Q9032J15144
60081H161239J40891J68318J99258K32339K65186K97511L30015L62337L94144
60072A0551238M26310M58875M89232N14415N33786N47612N54579N52791N41930
60063A5170768N22316M93128M53661M05312L50242K89086K21979J50806P8308
60054A8135606N707o6871j38297k06656k70679l29138l79494m19076m47031m63491
$$ plain form
60044 15420580 14952760 14493054 14051833 13636330 13252551 12906835 12604543 12348346 12138941
60035 12138941 11976644 11861432 11792258 11767264 11783990 11838537 11925153 12037274 12168349 12311020
60025 12311020 12456371 12594926 12718169 12818933 12891340 12931405 12937389 12909091 12847166 12753445
60015 12753445 12631078 12483455 12313009 12121315 11910045 11681692 11439799 11188700 10932666
60006 10932666 10675220 10419548 10169161 9927453 9696928 9479866 9279549 9099727 8942927
59997 8942927 8810434 8703804 8624934 8574353 8550869 8553352 8581654 8635473 8713719 8815425 8939584
59986 8939584 9083076 9240000 9403963 9569832 9732391 9884863 10020547 10135213 10226510 10291588
59976 10291588 10326791 10329475 10298879 10235264 10139387 10013120 9859902 9684353 9491802 9288125
$$ packed form
60044A5420580m67820m59706m41221m15503l83779l45716l02292k56197k09405
60035A2138941j62297j15212o9174k4994J6726N4547Q6616J12121J31075J42671
60025A2311020J45351J38555J23243J00764P2407M0065N984k8298o1925r3721
60015A2753445j22367j47623j70446j91694k11270k28353k41893k51099k56034
60006A0932666k57446k55672k50387k41708k30525k17062k00317j79822j56800
59997H942927j32493j06630p8870n0581k3484K483K8302N3819P8246J01706J24159
59986H939584J43492J56924J63963J65869J62559J52472J35684J14666R1297O5078
59976A0291588L5203K684l0596o3615r5877j26267j53218j75549j92551k03677
$$ plain form
59966 9288125 9079496 8871973 8671129 8481649 8306937 8149339 8010846 7893304 7797998 7725695
59956 7725695 7677398 7654563 7658245 7688356 7743965 7824007 7927670 8054629 8205034 8378739 8574286
59945 8574286 8788859 9018878 9259959 9506485 9752073 9990434 10215080 10418792 10595025
59936 10595025 10740131 10852882 10931562 10972979 10974942 10938340 10865990 10760820 10626163 10466697
59926 10466697 10287696 10094029 9891001 9685611 9485765 9298179 9127419 8976341 8846692
59917 8846692 8739776 8657303 8601391 8573346 8572923 8599117 8650953 8727050 8825230 8943265 9079257
59906 9079257 9230503 9392659 9560809 9730852 9899258 10062376 10217042 10361354 10493913
59897 10493913 10612869 10716761 10805918 10882004 10946633 11001597 11050210 11097198 11147175 11204289 11273467
$$ packed form
59966I288125k08629k07523k00844j89480j74712j57598j38493j17542r5306p2303
59956G725695m8297k2835L682L0111N5609Q0042J03663J26959J50405J73705J95547
59945H574286K14573K30019K41081K46526K45588K38361K24646K03712J76233
59936A0595025J45106J12751P8680M1417J963l6602p2350j05170j34657j59466
59926A0466697j79001j93667k03028k05390j99846j87586j70760j51078j29649
59917H846692j06916q2473n5912k8045m23K6194N1836P6097R8180J18035J35992
59906I079257J51246J62156J68150J70043J68406J63118J54666J44312J32559
59897A0493913J18956J03892Q9157P6086O4629N4964M8613M6988M9977N7114O9178
$$ plain form
59886 11273467 11360677 11471240 11608579 11775349 11975322 12213203 12492463 12813938 13176958
59877 13176958 13581352 14027441 14513837 15035972 15587053 16159251 16742425 17321945 17879152
59868 17879152 18394222 18847747 19220249 19493015 19651725 19689415 19605939 19405966 19098578 18697724
59858 18697724 18221275 17688990 17120901 16535912 15950105 15376147 14824605 14305085 13825333
59849 13825333 13390047 13001711 12662328 12373625 12136215 11949814 11814047 11728108 11689878 11696382
59839 11696382 11745038 11833533 11958575 12115577 12299392 12504186 12722177 12943018 13154570 13343981
59829 13343981 13498582 13607088 13660728 13653231 13580049 13438475 13228926 12955811 12626968 12252262
59819 12252262 11842272 11407557 10958703 10506555 10061369 9630759 9218620 8826652 8456795
$$ packed form
59886A1273467Q7210J10563J37339J66770J99973K37881K79260L21475L63020
59877A3176958M04394M46089M86396N22135N51081N72198N83174N79520N57207
59868A7879152N15070M53525L72502K72766J58710L7690q3476j99973l07388m00854
59858A8697724m76449n32285n68089n84989n85807n73958n51542n19520m79752
59849A3825333m35286l88336l39383k88703k37410j86401j35767q5939l8230O504
59839A1696382M8656Q8495J25042J57002J83815K04794K17991K20841K11552J89411
59829A3343981J54601J08506N3640p497p3182j41574k09549k73115l28843l74706
59819A2252262m09990m34715m48854m52148m45186m30610m12139l91968l69857
$$ plain form
59810 8456795 8111656 7793004 7501029 7235399 6996265 6783683 6596492 6432275 6288378
59801 6288378 6162784 6054011 5960252 5878633 5805409 5737005 5670913 5605786 5541046 5476569 5412554
59790 5412554 5349670 5289635 5235338 5189398 5152006 5120755 5093158 5068756 5047955 5029330 5009257
59779 5009257 4984227 4952604 4913990 4868086 4815088 4756667 4695595 4634253 4574066 4516513 4464090
59768 4464090 4419570 4384321 4357892 4339560 4329972 4330843 4343185 4366443 4399462 4441786 4493456 4553706
59756 4553706 4620547 4692147 4768513 4851238 4941244 5037181 5136564 5237994 5341049 5443700 5541158
59745 5541158 5628275 5702563 5764249 5814232 5853270 5882802 5905215 5923052 5938635 5954403 5972913
59734 5972913 5996593 6028060 6070236 6125383 6194585 6279283 6382807 6508979 6659440 6833838
$$ packed form
59810H456795l45139l18652k91975k65630k39134k12582j87191j64217j43897
59801F288378j25594j08773r3759q1619p3224o8404o6092o5127o4740o4477o4015
59790E412554o2884o0035n4297m5940l7392l1251k7597k4402k0801j8625k0073
59779E009257k5030l1623l8614m5904n2998n8421o1072o1342o0187n7553n2423
59768D464090m4520l5249k6429j8332r588Q71J2342K3258L3019M2324N1670O0250
59756D553706O6841P1600P6366Q2725R0006R5937R9383J01430J03055J02651R7458
59745E541158Q7117P4288O1686M9983L9038K9532K2413J7837J5583J5768J8510
59734E972913K3680L1467M2176N5147O9202Q4698J03524J26172J50461J74398
$$ plain form
59724 6833838 7032615 7258122 7512866 7798264 8115582 8466783 8853830 9277848 9738498
59715 9738498 10231885 10747686 11268514 11771689 12230562 12615604 12898855 13061361 13097802 13015458
59705 13015458 12830894 12567182 12250015 11902604 11543546 11188753 10852391 10544283 10268637
59696 10268637 10027487 9823976 9660607 9536429 9448788 9396812 9380717 9398739 9447737 9526639
59686 9526639 9636711 9778317 9949620 10148801 10375726 10631274 10916865 11234877 11587709
59677 11587709 11976019 12399311 12858442 13356000 13894190 14474243 15098366 15770305 16492950
59668 16492950 17266674 18090788 18965099 19888726 20858116 21867045 22907684 23970564 25043916
59659 25043916 26113966 27166183 28186831 29165174 30096177 30981845 31829865 32650824 33456123
$$ packed form
59724F833838J98777K25507K54744K85398L17318L51201L87047M24018M60650
59715I738498M93387N15801N20828N03175M58873L85042K83251J62506L6441q2344
59705A3015458j84564k63712l17167l47411l59058l54793l36362l08108k75646
59696A0268637k41150k03511j63369j24178q7641n1976j6095J8022M8998P8902
59686I526639J10072J41606J71303J99181K26925K55548K85591L18012L52832
59677A1587709L88310M23292M59131M97558N38190N80053O24123O71939P22645
59668A6492950P73724Q24114Q74311R23627R69390J008929J040639J062880J073352
59659B5043916J070050J052217J020648R78343R31003Q85668Q48020Q20959Q05299
$$ plain form
59650 33456123 34257258 35065589 35891616 36743254 37623707 38530423 39455650 40387000 41306814
59641 41306814 42191893 43015907 43753514 44383118 44887565 45254932 45480374 45567467 45527802 45379564
59631 45379564 45145960 44853309 44528957 44199767 43891189 43626252 43424699 43302906 43274369
59622 43274369 43349931 43538079 43845823 44279202 44842352 45536185 46358395 47304098 48364905
59613 48364905 49526426 50766306 52053648 53348773 54602985 55759402 56755619 57528152
59605 57528152 58018882 58182959 57995412 57453623 56576058 55399498 53975140 52362499 50622318
59596 50622318 48811586 46981380 45175303 43427454 41761312 40190142 38717221 37335038
59588 37335038 36025307 34761684 33514665 32257039 30969155 29643075 28283881 26907041
$$ packed form
59650C3456123Q01135Q08331Q26027Q51638Q80453R06716R25227R31350R19814
59641D1306814Q85079Q24014P37607O29604N04447L67367K25442Q7093l9665j48238
59631D5379564k33604k92651l24352l29190l08578k64937k01553j21793k8537
59622D3274369P5562J88148L07744M33379N63150O93833Q22210R45703J060807
59613D8364905J161521J239880J287342J295125J254212J156417R96217P72533
59605E7528152M90730J64077j87547n41789q77565j176560j424358j612641j740181
59596E0622318j810732j830206j806077j747849j666142j571170j472921j382183
59588C7335038j309731j263623j247019j257626j287884j326080j359194j376840
$$ plain form
59580 26907041 25533131 24182558 22872339 21615482 20422015 19299816 18254004 17285731
59572 17285731 16392329 15569369 14813054 14120903 13490493 12917959 12398184 11926549 11500038
59563 11500038 11116201 10771506 10461529 10182533 9931824 9706684 9504241 9322664 9160952
59554 9160952 9016588 8884440 8758970 8636689 8515512 8392846 8265873 8133284 7995276
59545 7995276 7852004 7703315 7550074 7394614 7239520 7086528 6936510 6789940 6647530
59536 6647530 6511061 6383300 6266394 6160578 6065119 5980059 5906226 5844065 5793623 5755402
59526 5755402 5729949 5716435 5712776 5717440 5730308 5751483 5780042 5814463 5853796 5898032 5947386 6001369
59514 6001369 6058546 6117471 6177923 6240887 6307354 6378000 6454400 6539544 6636201 6745163 6865731
$$ packed form
59580B6907041j373910j350573j310219j256857j193467j122199j045812r68273
59572A7285731q93402q22960p56315o92151o30410n72534n19775m71635m26511
59563A1500038l83837l44695l09977k78996k50709k25140k02443j81577j61712
59554I160952j44364j32148j25470j22281j21177j22666j26973j32589j38008
59545G995276j43272j48689j53241j55460j55094j52992j50018j46570j42410
59536F647530j36469j27761j16906j05816r5459q5060p3833o2161n0442l8221
59526E755402k5453j3514l659M664J2868K1175K8559L4421L9333M4236M9354N3983
59514F001369N7177N8925O0452O2964O6467P0646P6400Q5144R6657J08962J20568
$$ plain form
59503 6865731 6997479 7141008 7297691 7469471 7658337 7865336 8090739 8335683 8602508
59494 8602508 8892504 9204444 9536784 9890404 10267464 10667994 11089240 11527959 11981526
59485 11981526 12446555 12917934 13389754 13856469 14313121 14755361 15179441 15581863 15959481
59476 15959481 16310358 16633552 16927182 17188001 17414566 17610205 17781265 17933058 18069102
59467 18069102 18193470 18311402 18427473 18544975 18666958 18795398 18928332 19059067 19178412
59458 19178412 19276262 19340985 19359700 19320771 19215674 19038495 18785410 18455709 18052472 17581630
59448 17581630 17051146 16471420 15855316 15216706 14568922 13924203 13293363 12685303 12106927
59439 12106927 11563277 11057258 10589802 10161197 9771942 9421722 9108545 8830232 8586010
$$ packed form
59503F865731J31748J43529J56683J71780J88866K06999K25403K44944K66825
59494H602508K89996L11940L32340L53620L77060M00530M21246M38719M53567
59485A1981526M65029M71379M71820M66715M56652M42240M24080M02422L77618
59476A5959481L50877L23194K93630K60819K26565J95639J71060J51793J36044
59467A8069102J24368J17932J16071J17502J21983J28440J32934J30735J19345
59458A9178412R7850O4723J8715l8929j05097j77179k53085l29701m03237m70842
59448A7581630n30484n79726o16104o38610o47784o44719o30840o08060n78376
59439A2106927n43650n06019m67456m28605l89255l50220l13177k78313k44222
$$ plain form
59430 8586010 8375155 8194916 8041750 7914223 7812824 7737358 7686633 7660469 7659606 7683430 7730035
59419 7730035 7798960 7891813 8009757 8152397 8319499 8511513 8727742 8966139 9225836 9507862
59409 9507862 9812255 10136022 10474538 10822867 11174551 11520876 11852484 12160284 12433987
59400 12433987 12661731 12832551 12938200 12972447 12931326 12815751 12631937 12387527 12088908 11743613
59390 11743613 11362922 10959233 10541778 10117046 9692246 9275646 8873560 8488971 8123270
59381 8123270 7777853 7453967 7152462 6874073 6619135 6386897 6175657 5983679 5809869
59372 5809869 5653987 5516343 5396617 5292826 5202445 5124767 5060891 5010932 4972723 4944122
59362 4944122 4925188 4916959 4919272 4931024 4951583 4980552 5016855 5059349 5108071 5164267 5229753 5306338
$$ packed form
59430H586010k10855j80239j53166j27527j01399p5466n0725k6164q63K3824M6605
59419G730035O8925R2853J17944J42640J67102J92014K16229K38397K59697K82026
59409I507862L04393L23767L38516L48329L51684L46325L31608L07800K73703
59400A2433987K27744J70820J05649L4247m1121j15575j83814k44410k98619l45295
59390A1743613l80691m03689m17455m24732m24800m16600m02086l84589l65701
59381H123270l45417l23886l01505k78389k54938k32238k11240j91978j73810
59372E809869j55882j37644j19726j03791r0381p7678o3876m9959l8209k8601
59362D944122j8934q229K313J1752K0559K8969L6303M2494M8722N6196O5486P6585
$$ plain form
59350 5306338 5394067 5488708 5582492 5669471 5750197 5830347 5915657 6009375 6113669 6231410 6366135
59339 6366135 6521077 6698053 6896403 7112972 7343838 7586466 7840873 8110093 8400067
59330 8400067 8717893 9069090 9456853 9883953 10353921 10869578 11431843 12041166 12698923
59321 12698923 13405803 14159198 14952948 15778492 16624721 17477302 18320029 19137580 19917046
59312 19917046 20647852 21321508 21931500 22473166 22944241 23345955 23682598 23958931 24177942
59303 24177942 24340816 24447625 24497170 24486978 24414204 24276016 24069345 23792235 23446824 23040376
59293 23040376 22582994 22085526 21559870 21018784 20473195 19930115 19393527 18865331 18343938
59284 18343938 17823849 17299006 16766170 16224111 15671318 15106970 14533546 13956471 13381518
$$ packed form
59350E306338Q7729R4641R3784Q6979Q0726Q0150Q5310R3718J04294J17741J34725
59339F366135J54942J76976J98350K16569K30866K42628K54407K69220K89974
59330H400067L17826L51197L87763M27100M69968N15657N62265O09323O57757
59321A2698923P06880P53395P93750Q25544Q46229Q52581Q42727Q17551P79466
59312A9917046P30806O73656O09992N41666M71075M01714L36643K76333K19011
59303B4177942J62874J06809M9545j0192p2774j38188k06671k77110l45411m06448
59293B3040376m57382m97468n25656n41086n45589n43080n36588n28196n21393
59284A8343938n20089n24843n32836n42059n52793n64348n73424n77075n74953
$$ plain form
59275 13381518 12813976 12259480 11723469 11209609 10720011 10256771 9822198 9417921 9044888
59266 9044888 8703778 8394353 8114939 7863551 7638988 7440148 7265375 7113596 6984801
59257 6984801 6877988 6789900 6717581 6661145 6622163 6600164 6592656 6597886 6615623 6645795 6688311
59246 6688311 6743675 6811849 6891032 6979629 7079012 7192144 7319698 7459682 7610653 7772946
59236 7772946 7946387 8129070 8318900 8514484 8713907 8914348 9113528 9310026 9501633
59227 9501633 9684916 9857094 10017195 10165029 10300475 10424441 10539371 10648043 10752547
59218 10752547 10854561 10955571 11056510 11158096 11261561 11367755 11475053 11579030 11674416
59209 11674416 11756526 11820772 11862175 11875896 11857639 11803786 11712752 11587033 11433070 11258657
$$ packed form
59275A3381518n67542n54496n36011n13860m89598m63240m34573m04277l73033
59266I044888l41110l09425k79414k51388k24563j98840j74773j51779j28795
59257F984801j06813q8088p2319n6436l8982k1999p508N230J7737L0172M2516
59246F688311N5364O8174P9183Q8597R9383J13132J27554J39984J50971J62293
59236G772946J73441J82683J89830J95584J99423K00441J99180J96498J91607
59227I501633J83283J72178J60101J47834J35446J23966J14930J08672J04504
59218A0752547J02014J01010J00939J01586J03465J06194J07298J03977R5386
59209A1674416Q2110O4246M1403J3721j8257n3853r1034j25719j53963j74413
$$ plain form
59199 11258657 11071068 10877487 10685534 10502105 10332177 10179330 10046906 9937919 9854106
59190 9854106 9795710 9762399 9754375 9772522 9817316 9887564 9980671 10094313 10227346 10378770 10546525
59179 10546525 10727914 10920684 11123169 11334039 11552705 11779477 12014779 12258959 12513597
59170 12513597 12782082 13067814 13372376 13696347 14040906 14406933 14792463 15191672 15595567
59161 15595567 15992188 16366414 16701086 16979033 17184187 17302019 17320698 17232485 17034146 16727009
59151 16727009 16317434 15816595 15238903 14600966 13921738 13221122 12516114 11818595 11137727
59142 11137727 10482945 9862821 9282050 8741692 8241997 7783404 7365405 6986289 6643862
59133 6643862 6335101 6055799 5802156 5572346 5365181 5177984 5007333 4851057 4707906
$$ packed form
59199A1258657j87589j93581j91953j83429j69928j52847j32424j08987q3813
59190I854106n8396l3311q024J8147M4794P0248R3107J13642J33033J51424J67755
59179A0546525J81389J92770K02485K10870K18666K26772K35302K44180K54638
59170A2513597K68485K85732L04562L23971L44559L66027L85530L99209M03895
59161A5595567L96621L74226L34672K77947K05154J17832J8679q8213j98339l07137
59151A6727009m09575n00839n77692o37937o79228p00616p05008o97519o80868
59142A1137727o54782o20124n80771n40358m99695m58593m17999l79116l42427
59133F643862l08761k79302k53643k29810k07165j87197j70651j56276j43151
$$ plain form
59124 4707906 4576251 4455123 4345582 4248629 4162267 4082825 4008730 3940747 3879204 3823649 3774894
59113 3774894 3734462 3701786 3674548 3652044 3635686 3626010 3622087 3624446 3635554 3656137 3683581 3715390
59101 3715390 3752044 3795056 3844391 3899553 3961386 4030816 4106963 4188313 4274921 4367945 4467600
59090 4467600 4572955 4683484 4799796 4923025 5054200 5193991 5342517 5499349 5663749
59081 5663749 5834801 6011706 6194410 6383318 6577500 6773742 6968552 7160686 7350343
59072 7350343 7536176 7714647 7882250 8037017 8177959 8304658 8417680 8518305 8607902 8688719
59062 8688719 8764992 8841780 8922747 9010274 9107177 9216501 9339898 9478134 9633228 9808177
59052 9808177 10004151 10219346 10450367 10693002 10941581 11189242 11428709 11651020 11843874
$$ packed form
59124D707906j31655j21128j09541r6953q6362p9442p4095o7983o1543n5555m8755
59113C774894m0432l2676k7238k2504j6358r676l923K359J1108K0583K7444L1809
59101C715390L6654M3012M9335N5162O1833O9430P6147Q1350Q6608R3024R9655
59090D467600J05355J10529J16312J23229J31175J39791J48526J56832J64400
59081E663749J71052J76905J82704J88908J94182J96242J94810J92134J89657
59072G350343J85833J78471J67603J54767J40942J26699J13022J00625Q9597Q0817
59062H688719P6273P6788Q0967Q7527R6903J09324J23397J38236J55094J74949
59052I808177J95974K15195K31021K42635K48579K47661K39467K22311J92854
$$ plain form
59043 11843874 11993775 12090660 12129501 12108355 12027803 11892601 11711223 11492792 11246023 10980985
59033 10980985 10708940 10439205 10177795 9929404 9698321 9486602 9293503 9117751 8958639
59024 8958639 8814447 8682001 8558597 8442258 8329335 8214189 8092396 7962280 7822462
59015 7822462 7670184 7503488 7323050 7130456 6926390 6711888 6489761 6263400 6035397
59006 6035397 5808279 5585099 5368273 5159159 4959330 4770444 4592105 4421852 4258394
58997 4258394 4103196 3957947 3822354 3695436 3577018 3466700 3363179 3265890 3175601 3092160
58987 3092160 3013399 2937558 2865166 2797345 2734016 2675057 2621495 2574022 2531726 2493526 2459474
58976 2459474 2429676 2403610 2381578 2364976 2353834 2345814 2338952 2333797 2331696 2332813 2336946 2344280 2353830
$$ packed form
59043A1843874J49901R6885L8841k1146q0552j35202j81378k18431k46769k65038
59033A0980985k72045k69735k61410k48391k31083k11719j93099j75752j59112
59024H958639j44192j32446j23404j16339j12923j15146j21793j30116j39818
59015G822462j52278j66696j80438j92594k04066k14502k22127k26361k28003
59006F035397k27118k23180k16826k09114j99829j88886j78339j70253j63458
58997D258394j55198j45249j35593j26918j18418j10318j03521r7289r0289q3441
58987C092160p8761p5841p2392o7821o3329n8959n3562m7473m2296l8200l4052
58976B459474k9798k6066k2032j6602j1142q020o862n155k101J117M133P334R550
$$ plain form
58963 2353830 2363006 2370222 2376258 2381809 2385775 2387500 2388568 2390580 2393052 2395170 2397657 2401053 2404319 2407255
58949 2407255 2412334 2421767 2434389 2447726 2461499 2476725 2492848 2508349 2522993 2537113 2549703 2559456
58937 2559456 2566764 2572694 2577197 2580383 2584244 2590742 2599223 2607977 2617360 2629135 2643662 2660073 2678426
58924 2678426 2699446 2722834 2747910 2775200 2805266 2836760 2867898 2899401 2933877 2972659 3014859
58913 3014859 3058986 3103859 3148818 3194758 3244209 3298758 3357323 3418500 3483188 3552903 3626945
58902 3626945 3703615 3783116 3866789 3954357 4044410 4136772 4231963 4329229 4427895 4530110 4639586
58891 4639586 4757834 4883969 5017663 5159785 5310613 5470150 5639999 5822247 6016526
58882 6016526 6220993 6436467 6667043 6915972 7183104 7467010 7767861 8087815 8430248
$$ packed form
58963B353830R176P216O036N551L966J725J068K012K472K118K487L396L266K936
58949B407255N079R433J2622J3337J3773J5226J6123J5501J4644J4120J2590R753
58937B559456P308N930M503L186L861O498Q481Q754R383J1775J4527J6411J8353
58924B678426K1020K3388K5076K7290L0066L1494L1138L1503L4476L8782M2200
58913C014859M4127M4873M4959M5940M9451N4549N8565O1177O4688O9715P4042
58902C626945P6670P9501Q3673Q7568R0053R2362R5191R7266R8666J02215J09476
58891D639586J18248J26135J33694J42122J50828J59537J69849J82248J94279
58882F016526K04467K15474K30576K48929K67132K83906L00851L19954L42433
$$ plain form
58873 8430248 8798940 9196455 9623184 10079249 10567085 11090660 11652811 12255373 12901354
58864 12901354 13594431 14336154 15125994 15964408 16853529 17794022 18782901 19814771 20883078
58855 20883078 21978803 23088607 24194456 25273953 26300876 27246539 28081331 28775502
58847 28775502 29300915 29635267 29765905 29689723 29411112 28941838 28301652 27515973 26612081
58838 26612081 25617834 24561784 23470813 22366833 21267197 20187498 19141391 18137944
58830 18137944 17181935 16277267 15427998 14635975 13900030 13218216 12588807 12008639 11472789
58821 11472789 10977112 10519681 10099015 9712257 9355705 9025863 8719522 8434014 8167830
58812 8167830 7920118 7689651 7475357 7277477 7096629 6931826 6780897 6642707 6517467
$$ packed form
58873H430248L68692L97515M26729M56065M87836N23575N62151O02562O45981
58864A2901354O93077P41723P89840Q38414Q89121R40493R88879J031870J068307
58855B0883078J095725J109804J105849J079497J026923R45663Q34792O94171
58847B8775502N25413L34352J30638p6182k78611m69274o40186p85679r03892
58838B6612081r94247j056050j090971j103980j099636j079699j046107j003447
58830A8137944r56009r04668q49269p92023p35945o81814o29409n80168n35850
58821A1472789m95677m57431m20666l86758l56552l29842l06341k85508k66184
58812H167830k47712k30467k14294j97880j80848j64803j50929j38190j25240
$$ plain form
58803 6517467 6405074 6304800 6216509 6140504 6076229 6022687 5979871 5948059 5926100 5912469 5907968
58792 5907968 5915230 5935323 5966790 6008261 6060129 6123284 6197910 6283888 6381010 6488820 6607847
58781 6607847 6740752 6890252 7055972 7235357 7427673 7635056 7859647 8102169 8363638
58772 8363638 8645937 8949873 9274780 9621010 9991033 10387304 10810852 11262814 11745817
58763 11745817 12263029 12817326 13411994 14050705 14736033 15469233 16251755 17085286 17969407
58754 17969407 18900192 19871195 20874248 21898803 22931675 23957224 24955726 25901064 26761951
58745 26761951 27506717 28106826 28537449 28778672 28818572 28654760 28293069 27746626 27036395
58736 27036395 26189750 25236130 24203725 23119164 22007114 20888176 19778212 18690633
$$ packed form
58803F517467j12393j00274q8291p6005o4275n3542m2816l1812k1959j3631m501
58792E907968P262K0093L1467M1471N1868O3155P4626Q5978R7122J07810J19027
58781F607847J32905J49500J65720J79385J92316K07383K24591K42522K61469
58772H363638K82299L03936L24907L46230L70023L96271M23548M51962M83003
58763A1745817N17212N54297N94668O38711O85328P33200P82522Q33531Q84121
58754A7969407R30785R71003J003053J024555J032872J025549R98502R45338Q60887
58745B6761951P44766O00109M30623K41223L9900j63812l61691n46443p10231
58736B7036395q46645r53620j032405j084561j112050j118938j109964j087579
$$ plain form
58728 18690633 17638070 16630869 15675164 14773463 13926364 13133318 12393099 11704598 11066688
58719 11066688 10477060 9932072 9427909 8960973 8527330 8123297 7746732 7396339 7069449
58710 7069449 6762023 6471327 6197224 5940338 5700236 5475897 5266653 5071851 4890416
58701 4890416 4721214 4563246 4415514 4277495 4149709 4032879 3926730 3830289 3742743 3662919
58691 3662919 3588882 3519612 3456306 3400192 3349832 3302600 3258063 3217355 3179619 3141962 3103254
58680 3103254 3065451 3030539 2998361 2967923 2938727 2910071 2880926 2851206 2821698 2792375 2762315
58669 2762315 2731317 2699884 2667572 2633261 2597148 2560642 2524202 2487118 2449168 2410374 2369392
58658 2369392 2324659 2277315 2230587 2186103 2143096 2101163 2061080 2022605 1984320 1946305 1910449
$$ packed form
58728A8690633j052563j007201r55705r01701q47099p93046p40219o88501o37910
58719A1066688n89628n44988n04163m66936m33643m04033l76565l50393l26890
58710G069449l07426k90696k74103k56886k40102k24339k09244j94802j81435
58701D890416j69202j57968j47732j38019j27786j16830j06149r6441q7546p9824
58691C662919p4037o9270o3306n6114n0360m7232m4537m0708l7736l7657l8708
58680C103254l7803l4912l2178l0438k9196k8656k9145k9720k9508k9323l0060
58669B762315l0998l1433l2312l4311l6113l6506l6440l7084l7950l8794m0982
58658B369392m4733m7344m6728m4484m3007m1933m0083l8475l8285l8015l5856
$$ plain form
58647 1910449 1877571 1846667 1817377 1790556 1765879 1741658 1717634 1695253 1674565 1653822 1632926
58636 1632926 1614135 1598144 1582348 1564448 1545218 1526503 1509052 1493631 1481628 1472990 1465781 1459023
58624 1459023 1453821 1450874 1449493 1449972 1453819 1460289 1465772 1468278 1469568 1471088 1470983 1467447 1462170 1457703
58610 1457703 1453792 1449024 1444123 1440851 1439256 1438508 1439174 1442334 1447564 1453807 1461149 1469943 1479239 1487719
58596 1487719 1495221 1502234 1509173 1517281 1528637 1544063 1562501 1583350 1607453 1634747 1663287 1692225
58584 1692225 1723675 1759958 1800900 1845385 1893484 1945297 1999703 2056256 2116672 2182734 2254464
58573 2254464 2331910 2416724 2510052 2610817 2718120 2833725 2960250 3098547 3248788 3412501
58563 3412501 3591475 3786009 3996091 4223091 4468729 4733554 5017506 5320027 5638039
$$ packed form
58647A910449l2878l0904k9290k6821k4677k4221k4024k2381k0688k0743k0896
58636A632926j8791j5991j5796j7900j9230j8715j7451j5421j2003q638p209o758
58624A459023n202k947j381M79L847O470N483K506J290J520j05l536n277m467
58610A457703l911m768m901l272j595p48O66L160N230O243P342Q794R296Q480
58596A487719P502P013O939Q108J1356J5426J8438K0849K4103K7294K8540K8938
58584A692225L1450L6283M0942M4485M8099N1813N4406N6553O0416O6062P1730
58573B254464P7446Q4814R3328J00765J07303J15605J26525J38297J50241J63713
58563C412501J78974J94534K10082K27000K45638K64825K83952L02521L18012
$$ plain form
58554 5638039 5965444 6295723 6622701 6937100 7224812 7471096 7665095 7798983 7865649 7860514
58544 7860514 7784604 7643799 7446322 7202602 6925512 6627880 6320028 6010392 5706262 5412152
58534 5412152 5129515 4860302 4609109 4379899 4172518 3984470 3814234 3660674 3521305
58525 3521305 3393931 3278816 3177002 3087829 3009964 2943243 2887366 2840291 2799880 2765453 2735801
58514 2735801 2707706 2678838 2650263 2623596 2597386 2568949 2538241 2507109 2475899 2443372 2408962
58503 2408962 2372750 2334085 2292400 2248566 2203651 2157471 2109977 2062649 2016711 1971454 1926056
58492 1926056 1881527 1839141 1798723 1760247 1725186 1694237 1665623 1637723 1611535 1588488 1567761
58481 1567761 1547972 1529547 1513169 1497766 1482285 1467528 1454076 1440483 1425841 1412004 1400905
$$ packed form
58554E638039L27405L30279L26978L14399K87712K46284J93999J33888O6666n135
58544G860514p5910j40805j97477k43720k77090k97632l07852l09636l04130k94110
58534E412152k82637k69213k51193k29210k07381j88048j70236j53560j39369
58525C521305j27374j15115j01814q9173p7865o6721n5877m7075m0411l4427k9652
58514B735801k8095k8868k8575k6667k6210k8437l0708l1132l1210l2527l4410
58503B408962l6212l8665m1685m3834m4915m6180m7494m7328m5938m5257m5398
58492A926056m4529m2386m0418l8476l5061l0949k8614k7900k6188k3047k0727
58481A567761j9789j8425j6378j5403j5481j4757j3452j3593j4642j3837j1099
$$ plain form
58470 1400905 1391775 1383280 1376022 1370459 1364911 1358341 1352608 1349101 1345798 1340840 1336399 1335432 1336997 1338426
58456 1338426 1339837 1342453 1344406 1342456 1336583 1329060 1320221 1308827 1295438 1281883 1268509 1255176 1243564
58443 1243564 1234976 1227212 1217172 1205465 1195077 1186747 1178966 1171291 1164231 1157138 1149591 1143681 1141492
58430 1141492 1141468 1140474 1138129 1136017 1134128 1131456 1128563 1126186 1122952 1117868 1113253 1111587 1111321 1109597 1107147
58415 1107147 1106410 1106698 1105687 1104065 1104077 1104864 1103753 1100984 1098676 1096385 1092306 1087708 1085413 1084942 1083950 1083443
58399 1083443 1086563 1092928 1099258 1105258 1113861 1125842 1139083 1153175 1169847 1188446 1205432 1218858
58387 1218858 1229395 1236880 1239854 1238666 1235191 1229514 1220599 1209831 1199980 1190919 1180245 1167740 1155433
58374 1155433 1143965 1132917 1123928 1118991 1116144 1111131 1103044 1094332 1086032 1077267 1068750 1062310 1057542
$$ packed form
58470A400905r130q495p258n563n548o570n733l507l303m958m441r67J565J429
58456A338426J411K616J953j950n873p523q839j1394j3389j3555j3374j3333j1612
58443A243564q588p764j0040j1707j0388q330p781p675p060p093p547n910k189
58430A141492k4r94k345k112j889k672k893k377l234n084m615j666k66j724k450
58415A107147p37K88j011j622J2P87j111k769k308k291m079m598k295m71r92n07
58399A083443L120O365O330O000Q603J1981J3241J4092J6672J8599J6986J3426
58387A218858J0537P485K974j188l475n677q915j0768r851r061j0674j2505j2307
58374A155433j1468j1048q989m937k847n013q087q712q300q765q517o440m768
$$ plain form
58361 1057542 1053086 1050205 1050782 1053077 1054330 1056085 1061585 1069203 1074450 1077720 1083781 1093830 1104270 1113659
58347 1113659 1124723 1138730 1153567 1168311 1184430 1201649 1217647 1232525 1248725 1266066 1281690
58336 1281690 1295186 1308932 1323367 1336942 1350473 1366097 1381964 1393583 1400501 1406070 1410681 1411195
58324 1411195 1407207 1401794 1395684 1386767 1375807 1366431 1358850 1349674 1338552 1328912 1321668 1314490 1307729
58311 1307729 1304443 1303946 1302225 1299502 1300329 1305199 1309499 1312354 1318902 1331438 1345320 1356286 1365263 1373415
58297 1373415 1378972 1381843 1385503 1391605 1397985 1403913 1411666 1421167 1428923 1434039 1439485 1445939 1450564 1453233
58283 1453233 1457498 1463927 1469037 1472302 1477295 1484374 1489399 1491511 1494990 1501549 1508211 1514740 1525362 1540664
58269 1540664 1555514 1567709 1581123 1597724 1614298 1630011 1649177 1673182 1697195 1718353 1739853
$$ packed form
58361A057542m456k881N77K295J253J755N500P618N247L270O061J0049J0440R389
58347A113659J1064J4007J4837J4744J6119J7219J5998J4878J6200J7341J5624
58336A281690J3496J3746J4435J3575J3531J5624J5867J1619O918N569M611N14
58324A411195l988n413o110q917j0960r376p581r176j1122r640p244p178o761
58311A307729l286m97j721k723Q27M870M300K855O548J2536J3882J0966Q977Q152
58297A373415N557K871L660O102O380N928P753R501P756N116N446O454M625K669
58283A453233M265O429N110L265M993P079N025K112L479O559O662O529J0622J5302
58269A540664J4850J2195J3414J6601J6574J5713J9166K4005K4013K1158K1500
$$ plain form
58258 1739853 1763814 1787584 1810296 1835353 1862990 1887977 1908155 1927782 1949235 1969051 1985400
58247 1985400 2001694 2019619 2036459 2052320 2071871 2096066 2120639 2145441 2175937 2212440 2247761
58236 2247761 2279129 2312400 2350563 2388570 2423990 2462042 2504870 2546342 2583075 2620336 2661402
58225 2661402 2701672 2739304 2781069 2831140 2884321 2936735 2992733 3054776 3117445 3178640 3245929
58214 3245929 3324349 3408521 3494179 3586436 3688703 3794455 3898524 4006075 4122123 4242703
58204 4242703 4364639 4493211 4631817 4774977 4919944 5073998 5241981 5418450 5600477
58195 5600477 5795591 6008166 6231226 6461362 6707933 6976924 7259471 7547550 7847181
58186 7847181 8164696 8494486 8832872 9189652 9572718 9975415 10392414 10833487 11307991
$$ packed form
58258A739853K3961K3770K2712K5057K7637K4987K0178J9627K1453J9816J6349
58247A985400J6294J7925J6840J5861J9551K4195K4573K4802L0496L6503L5321
58236B247761L1368L3271L8163L8007L5420L8052M2828M1472L6733L7261M1066
58225B661402M0270L7632M1765N0071N3181N2414N5998O2043O2669O1195O7289
58214C245929P8420Q4172Q5658R2257J02267J05752J04069J07551J16048J20580
58204D242703J21936J28572J38606J43160J44967J54054J67983J76469J82027
58195E600477J95114K12575K23060K30136K46571K68991K82547K88079K99631
58186G847181L17515L29790L38386L56780L83066M02697M16999M41073M74504
$$ plain form
58177 11307991 11811101 12339767 12906353 13520757 14174707 14859780 15584898 16359635 17177270
58168 17177270 18032030 18935901 19899957 20916934 21981622 23109845 24316357 25592631
58160 25592631 26927848 28332195 29817103 31374264 32999885 34719123 36560956 38531350
58152 38531350 40638638 42921118 45419012 48143294 51104081 54344821 57917614 61857589
58144 61857589 66221610 71120470 76668207 82929344 89959389 97862545 106767009 116795620
58136 116795620 128122826 141008468 155701877 172359257 191114455 212152552 235681334
58129 235681334 262072865 292227653 327343668 367319845 408746848 444809654 468085035
58122 468085035 474255494 463751125 440481863 409391401 374767049 339690463 306042035
$$ packed form
58177A1307991N03110N28666N66586O14404O53950O85073P25118P74737Q17635
58168A7177270Q54760R03871R64056J016977J064688J128223J206512J276274
58160B5592631J335217J404347J484908J557161J625621J719238J841833J970394
58152C8531350K107288K282480K497894K724282K960787L240740L572793L939975
58144F1857589M364021M898860N547737O261137P030045P903156Q904464J0028611
58136A16795620J1327206J2885642J4693409J6657380J8755198K1038097K3528782
58129B35681334K6391531L0154788L5116015L9976177M1427003L6062806K3275381
58122D68085035O170459j0504369k3269262l1090462l4624352l5076586l3648428
$$ plain form
58115 306042035 274707688 245960746 219846244 196338699 175332893 156672639 140222160
58108 140222160 125859120 113416799 102693235 93508417 85706471 79117394 73569777
58101 73569777 68941401 65158720 62147830 59820940 58110494 56979792 56393657 56323389
58093 56323389 56819565 58051272 60171893 63031209 65981551 68045599 68407682 66840427
58085 66840427 63712909 59645147 55176813 50670484 46352200 42336048 38639779 35244102
58077 35244102 32146792 29351710 26838789 24578934 22561713 20781606 19212933 17823604
58069 17823604 16599299 15530327 14588102 13738315 12966525 12269575 11633023 11038357 10482528
58060 10482528 9969359 9489921 9030904 8594351 8189978 7814920 7459081 7123705 6816618
$$ packed form
58115C06042035l1334347k8746942k6114502k3507545k1005806j8660254j6450479
58108A40222160j4363040j2442321j0723564r184818p801946o589077n547617
58101G3569777m628376l782681l010890k326890j710446j130702n86135p0268
58093E6323389M96176J231707K120621K859316K950342K064048L62083j567255
58085F6840427l127518m067762m468334m506329m318284m016152l696269l395677
58077C5244102l097310k795082k512921k259855k017221j780107j568673j389329
58069A7823604j224305j068972r42225q49787p71790o96950o36552n94666n55829
58060A0482528n13169m79438m59017m36553m04373l75058l55839l35376l07087
$$ plain form
58051 6816618 6534576 6266989 6011862 5772164 5541643 5310231 5079518 4858493 4648216
58042 4648216 4444405 4250160 4071776 3906000 3745171 3591388 3452448 3327252 3207954
58033 3207954 3093163 2986652 2886380 2787122 2691001 2603620 2522574 2441181 2360710 2287624 2221377
58022 2221377 2156011 2091322 2031658 1975991 1919709 1864129 1814135 1768571 1722702 1677822 1638680
58011 1638680 1603783 1567918 1532048 1501146 1474546 1447901 1422352 1402003 1384417 1363418 1339756
58000 1339756 1319615 1303916 1288180 1271385 1255871 1239847 1219219 1196050 1176662 1162206 1149185
57989 1149185 1137848 1131516 1128728 1124571 1119006 1115839 1114496 1111004 1106204 1104730 1106496 1107199 1106610 1108467
57975 1108467 1112730 1115755 1117666 1121756 1126976 1128686 1126590 1124424 1122166 1116208 1107029 1099067 1092818 1084417
$$ packed form
58051F816618k82042k67587k55127k39698k30521k31412k30713k21025k10277
58042D648216k03811j94245j78384j65776j60829j53783j38940j25196j19298
58033C207954j14791j06511j00272r9258r6121q7381q1046q1393q0471p3086o6247
58022B221377o5366o4689n9664n5667n6282n5580m9994m5564m5869m4880l9142
58011A638680l4897l5865l5870l0902k6600k6645k5549k0349j7586k0999k3662
58000A339756k0141j5699j5736j6795j5514j6024k0628k3169j9388j4456j3021
57989A149185j1337o332k788m157n565l167j343l492m800j474J766P03n89J857
57975A108467M263L025J911M090N220J710k096k166k258n958r179p962o249q401
$$ plain form
57961 1084417 1073262 1062892 1054160 1044557 1034506 1027236 1022111 1014962 1005399 997017 990031 980585 968015
57948 968015 956206 946959 938186 929206 921663 914775 905898 896223 889890 887011 883607 878637 874864 872511
57934 872511 868567 863045 859579 858925 857972 856062 856285 859506 862908 865434 869066 873925 877620 880040 883198
57919 883198 885949 884961 881563 881393 886140 891578 894805 897350 899837 899792 896627 893166 890350 885607 878111
57904 878111 870477 863739 855789 846343 838353 832920 827697 821619 816228 811077 803086 791944 781108 772171
57890 772171 763429 755219 750922 750850 750790 748821 748261 751522 756180 759635 762776 766396 768632 768572 768146 768033
57874 768033 765927 761144 756700 754376 751801 746756 740462 734359 727597 719944 713387 708855 704960 701676
57860 701676 701132 703111 704226 703574 704742 709901 716454 722063 728606 738134 748945 758720 768021 777787
$$ packed form
57961A084417j1155j0370q732r603j0051p270n125p149r563q382o986r446j2570
57948I68015j1809r247q773q980p543o888q877r675o333k879l404m970l773k353
57934H72511l944n522l466o54r53j910K23L221L402K526L632M859L695K420L158
57919H83198K751r88l398j70M747N438L227K545K487m5l165l461k816m743p496
57904H78111p634o738p950r446p990n433n223o078n391n151p991j1142j0836q937
57890G72171q742q210m297p2o0j969n60L261M658L455L141L620K236o0m26j13
57874G68033k106m783m444k324k575n045o294o103o762p653o557m532l895l284
57860G01676n44J979J115o52J168N159O553N609O543R528J0811R775R301R766
$$ plain form
57846 777787 786715 793802 800363 807126 812580 816308 820413 825465 828733 828788 827963 827658 825170 818217 809010
57831 809010 800643 792689 783483 773657 764208 753918 741791 729574 719149 709991 701636 695759 693124
57818 693124 691277 688078 684911 683780 683921 683989 684915 687756 691233 694178 698107 704650 712562 719815 726570
57803 726570 733821 741248 748548 756614 765396 772918 778156 782269 785407 785582 782704 780113 779485 777589 771106
57788 771106 761568 752438 744224 735697 727218 719522 711444 701874 691834 682140 671606 660089 650270
57775 650270 643414 636465 626681 616182 608332 602475 596130 589722 584897 580379 573695 565233 556621 546900
57761 546900 534427 521041 510136 501785 493686 485751 479823 475668 471074 465400 459697 453996 447707
57748 447707 441969 438476 436698 435138 434254 435141 436535 436497 436033 437628 441004 443757 445491 448043 452253
$$ packed form
57846G77787Q928P087O561O763N454L728M105N052L268N5q25l05k488o953r207
57831H09010q367p954r206r826r449j0290j2127j2217j0425r158q355n877k635
57818F93124j847l199l167j131J41O8R26K841L477K945L929O543P912P253O755
57803G26570P251P427P300Q066Q782P522N238M113L138J75k878k591o28j896o483
57788G71106r538r130q214q527q479p696q078r570j0040r694j0534j1517r819
57775F50270o856o949r784j0499p850n857o345o408m825m518o684q462q612r721
57761E46900j2473j3386j0905q351q099p935n928m155m594n674n703n701o289
57748D47707n738l493j778j560q84Q87J394l8m64J595L376K753J734K552M210
$$ plain form
57733 452253 457818 465632 476742 489335 500058 508139 515217 521581 525893 528307 530538 532841 533954
57720 533954 533996 534371 534754 533159 529156 524197 518690 511710 503857 497524 493715 491046 488363 485982 483993
57705 483993 481676 479189 477860 478313 479966 482525 486285 490922 495671 500651 506450 512768 519020 525636
57691 525636 532984 539820 544883 549345 555440 563319 571493 579643 588380 596781 603070 607683 613056 620194
57677 620194 627818 635022 642532 651147 660984 672371 685557 699557 713034 726175 740048 754727
57665 754727 769962 786806 806233 826849 846557 865919 887173 910476 934135 958302 985195
57654 985195 1015387 1046908 1078607 1111578 1146607 1182823 1219832 1258881 1301039 1346207 1394596
57643 1394596 1447280 1504692 1566330 1632434 1704199 1782008 1865233 1954199 2050673 2156231 2271682
$$ packed form
57733D52253N565P814J1110J2593J0723Q081P078O364M312K414K231K303J113
57720E33954M2L75L83j595m003m959n507o980p853o333l809k669k683k381j989
57705D83993k317k487j329M53J653K559L760M637M749M980N799O318O252O616
57691E25636P348O836N063M462O095P879Q174Q150Q737Q401O289M613N373P138
57677F20194P624P204P510Q615R837J1387J3186J4000J3477J3141J3873J4679
57665G54727J5235J6844J9427K0616J9708J9362K1254K3303K3659K4167K6893
57654I85195L0192L1521L1699L2971L5029L6216L7009L9049M2158M5168M8389
57643A394596N2684N7412O1638O6104P1765P7809Q3225Q8966R6474J05558J15451
$$ plain form
57632 2271682 2398113 2536679 2687451 2850192 3026115 3217024 3423045 3643260 3878037
57623 3878037 4128270 4392327 4665949 4944641 5223250 5493117 5742544 5960858 6140174
57614 6140174 6274010 6358059 6393663 6388268 6351528 6292310 6218103 6132704 6032730 5909212 5754536
57603 5754536 5566896 5348948 5106299 4848650 4588616 4336387 4096697 3871827 3664877
57594 3664877 3478354 3312011 3164404 3035287 2924879 2832089 2754874 2691261 2639078 2596209
57584 2596209 2562167 2538151 2524714 2520706 2524979 2537367 2557348 2583817 2617356 2660999 2717572 2787487
57572 2787487 2869671 2962950 3065911 3177410 3298373 3431541 3578673 3739360 3912742 4098243
57562 4098243 4293968 4496336 4701727 4906016 5101797 5278703 5427599 5542313 5616837 5644460
$$ packed form
57632B271682J26431J38566J50772J62741J75923J90909K06021K20215K34777
57623C878037K50233K64057K73622K78692K78609K69867K49427K18314J79316
57614F140174J33836Q4049L5604n395l6740n9218p4207q5399r9974j23518j54676
57603E754536j87640k17948k42649k57649k60034k52229k39690k24870k06950
57594C664877j86523j66343j47607j29117j10408r2790p7215o3613n2183m2869
57584B596209l4042k4016j3437m008M273J2388J9981K6469L3539M3643N6573O9915
57572B787487Q2184R3279J02961J11499J20963J33168J47132J60687J73382J85501
57562D098243J95725K02368K05391K04289J95781J76906J48896J14714P4524K7623
$$ plain form
57552 5644460 5621756 5550972 5436772 5283287 5096230 4884879 4658848 4424541 4186928 3952441
57542 3952441 3726845 3511604 3305517 3109362 2926440 2759068 2606817 2467917 2340496
57533 2340496 2222769 2113701 2013383 1921791 1837923 1761138 1692108 1631072 1576223 1525387 1478360
57522 1478360 1436107 1398660 1365326 1336017 1310724 1288341 1267429 1247595 1229117 1212182 1197523
57511 1197523 1186435 1178745 1172000 1164280 1156730 1151799 1150120 1150814 1153594 1158486 1164358 1170041 1176515 1186014
57497 1186014 1198949 1213408 1227861 1243161 1261707 1285309 1313678 1344552 1375838 1407935 1443004
57486 1443004 1481785 1522692 1564695 1609162 1657795 1710728 1768239 1832373 1904825 1984753 2070817
57475 2070817 2164026 2266389 2377928 2497338 2624624 2760755 2905373 3057044 3215026 3378366
$$ packed form
57552E644460k2704p0784j14200j53485j87057k11351k26031k34307k37613k34487
57542C952441k25596k15241k06087j96155j82922j67372j52251j38900j27421
57533B340496j17727j09068j00318r1592q3868p6785o9030o1036n4849n0836m7027
57522A478360m2253l7447l3334k9309k5293k2383k0912j9834j8478j6935j4659
57511A197523j1088p690o745p720p550m931j679O94K780M892N872N683O474R499
57497A186014J2935J4459J4453J5300J8546K3602K8369L0874L1286L2097L5069
57486A443004L8781M0907M2003M4467M8633N2933N7511O4134P2452P9928Q6064
57475B070817R3209J02363J11539J19410J27286J36131J44618J51671J57982J63340
$$ plain form
57465 3378366 3543554 3705091 3857779 3996290 4113119 4199852 4251132 4265777 4244272 4187318
57455 4187318 4097137 3978372 3837194 3680610 3516144 3350219 3186470 3026815 2873859 2730573
57445 2730573 2597874 2474537 2359901 2255139 2161493 2078649 2005256 1939953 1881662 1829947
57435 1829947 1785394 1748864 1720312 1698836 1683536 1673677 1668567 1668075 1672643 1682027 1694977 1711088
57423 1711088 1731827 1758539 1790837 1828505 1873425 1927310 1988599 2054271 2124213 2201274 2287269
57412 2287269 2381472 2483065 2592541 2710273 2835865 2969334 3110756 3257853 3405411 3547508
57402 3547508 3678710 3792861 3882651 3941519 3965220 3951662 3900882 3815671 3700813 3561102
57392 3561102 3400958 3225847 3042411 2856661 2673008 2495078 2325989 2167375 2019263
$$ packed form
57465C378366J65188J61537J52688J38511J16829Q6733N1280J4645k1505n6954
57455D187318r0181j18765j41178j56584j64466j65925j63749j59655j52956j43286
57445B730573j32699j23337j14636j04762r3646q2844p3393o5303n8291n1715
57435A829947m4553l6530k8552k1476j5300r859n110m92M568R384J2950J6111
57423A711088K0739K6712L2298L7668M4920N3885O1289O5672O9942P7061Q5995
57412B287269R4203J01593J09476J17732J25592J33469J41422J47097J47558J42097
57402C547508J31202J14151Q9790N8868K3701j3558n0780q5211j14858j39711
57392C561102j60144j75111j83436j85750j83653j77930j69089j58614j48112
$$ plain form
57383 2019263 1881307 1753381 1635165 1526308 1426969 1337156 1255753 1181329 1113621 1052976
57373 1052976 998733 949447 904219 862335 822308 783242 746746 715241 688321 662794 636557
57362 636557 610466 586146 563861 542979 522942 503305 484216 466954 452576 440123 427739
57351 427739 415231 403647 392666 380764 368027 356347 346416 336840 326772 317207 308983 301563
57339 301563 294451 287761 280835 272482 263307 255619 250259 245727 241289 238491 238362 239366 239642 239225 238469
57324 238469 236219 231539 225969 222258 221655 223541 226590 229072 229167 226342 221800 216803 211514 206044 201327
57309 201327 198144 196366 195719 196001 196148 194672 191677 188813 186632 183861 180056 176917 175752 175431 174216
57294 174216 172138 170347 169481 169768 171267 172980 173204 171818 170725 171204 172529 173967 175992 178354 179190
$$ packed form
57383B019263j37956j27926j18216j08857r9339q9813q1403p4424o7708o0645
57373A052976n4243m9286m5228m1884m0027l9066l6496l1505k6920k5527k6237
57362F36557k6091k4320k2285k0882k0037j9637j9089j7262j4378j2453j2384
57351D27739j2508j1584j0981j1902j2737j1680r931r576j0068r565q224p420
57339C01563p112o690o926q353r175p688n360m532m438k798j29J004K76m17p56
57324B38469k250m680n570l711o03J886L049K482R5k825m542m997n289n470m717
57309B01327l183j778o47K82J47j476k995k864k181k771l805l139j165l21j215
57294A74216k078j791q66K87J499J713K24j386j093M79J325J438K025K362Q36
$$ plain form
57279 179190 177689 175692 175046 175290 175606 176978 180409 184824 188932 193460 199343 205328 209810 213693 218840
57264 218840 224710 229080 231455 233397 235961 238943 242309 246413 250926 255133 259020 262801 266015 268328
57250 268328 270530 273403 276493 279240 282301 286312 290496 294113 298272 304648 313358 323574 335094 347608
57236 347608 359686 370405 380925 392593 404630 415702 426617 439259 453800 469377 486753
57225 486753 507782 532605 559655 588188 618791 651674 686488 723605 763616 805586 847403
57214 847403 887755 926303 962248 994056 1020137 1038695 1047981 1048281 1042541 1033149 1019024 997892
57202 997892 970393 939648 907541 873845 838691 803550 769839 738413 710272 686138 665585
57191 665585 647996 633679 622563 612847 602734 592592 583623 575629 568181 562704 560828 561657 563094
$$ packed form
57279A79190j501j997o46K44L16J372L431M415M108M528N883N985M482L883N147
57264B18840N870M370K375J942K564K982L366M104M513M207L887L781L214K313
57250B68328K202K873L090K747L061M011M184L617M159O376Q710J0216J1520J2514
57236C47608J2078J0719J0520J1668J2037J1072J0915J2642J4541J5577J7376
57225D86753K1029K4823K7050K8533L0603L2883L4814L7117M0011M1970M1817
57214H47403M0352L8548L5945L1808K6081J8558R286L00n740r392j4125k1132
57202I97892k7499l0745l2107l3696l5154l5141l3711l1426k8141k4134k0553
57191F65585j7589j4317j1116r716j0113j0142q969p994p448n477j876Q29J437
$$ plain form
57178 563094 565004 568489 572952 576707 579893 584226 590502 598903 610898 627849 648197 668966 689739
57165 689739 712544 738409 766880 798329 833474 870803 907495 942955 978769 1015568 1052836
57154 1052836 1091440 1133143 1177610 1222810 1268240 1314949 1362771 1410644 1459285 1510249 1562667
57143 1562667 1614291 1665533 1718922 1774779 1831070 1887461 1945615 2005374 2064617 2123245 2183331
57132 2183331 2244839 2305111 2363225 2420858 2478083 2532433 2583318 2633535 2685068 2736772 2787297
57121 2787297 2836937 2885593 2932394 2978391 3026445 3077615 3130664 3185289 3242348 3301056 3360174
57110 3360174 3422071 3490985 3566918 3646127 3727905 3815134 3907084 3997779 4083729 4167933 4253892
57099 4253892 4340878 4427480 4514397 4600630 4681758 4755209 4822954 4886277 4942461 4989673 5030716
$$ packed form
57178E63094J910L485M463L755L186M333O276Q401J1995J6951K0348K0769K0773
57165F89739K2805K5865K8471L1449L5145L7329L6692L5460L5814L6799L7268
57154A052836L8604M1703M4467M5200M5430M6709M7822M7873M8641N0964N2418
57143A562667N1624N1242N3389N5857N6291N6391N8154N9759N9243N8628O0086
57132B183331O1508O0272N8114N7633N7225N4350N0885N0217N1533N1704N0525
57121B787297M9640M8656M6801M5997M8054N1170N3049N4625N7059N8708N9118
57110C360174O1897O8914P5933P9209Q1778Q7229R1950R0695Q5950Q4204Q5959
57099D253892Q6986Q6602Q6917Q6233Q1128P3451O7745O3323N6184M7212M1043
$$ plain form
57088 5030716 5068796 5103428 5133001 5157014 5173189 5176952 5166693 5145325 5114241 5070235 5010523
57077 5010523 4935550 4844154 4731378 4594078 4433449 4249088 4036034 3790391 3512098 3199400
57067 3199400 2846985 2452499 2017589 1538457 1002032 395066 -290386 -1064113 -1941137
57058 -1941137 -2932049 -4037150 -5255349 -6591149 -8048192 -9625590 -11327720 -13169581
57050 -13169581 -15166509 -17327998 -19668444 -22214449 -24994911 -28035225 -31369699 -35049387
57042 -35049387 -39130997 -43672943 -48754604 -54489448 -61012166 -68468538 -77026466 -86875291
57034 -86875291 -98195389 -111137027 -125827832 -142366231 -160788357 -181058860 -203071556
57027 -203071556 -226573774 -251098418 -276189867 -301922574 -329080519 -358357968 -388965044
$$ packed form
57088E030716L8080L4632K9573K4013J6175L763j0259k1368l1084m4006n9712
57077E010523p4973r1396j12776j37300j60629j84361k13054k45643k78293l12698
57067C199400l52415l94486m34910m79132n36425C95066b90386p73727q77024
57058a941137r90912j105101j218199j335800j457043j577398j702130j841861
57050a3169581j996928k161489k340446k546005k780462l040314l334474l679688
57042c5049387m081610m541946n081661n734844o522718p456372q557928r848825
57034h6875291j1320098j2941638j4690805j6538399j8422126k0270503k2012696
57027b03071556k3502218k4524644k5091449k5732707k7157945k9277449l0607076
$$ plain form
57020 -388965044 -417972311 -441263635 -455434729 -459122416 -452968829 -438710538 -418322425
57013 -418322425 -393632508 -366257421 -337613723 -308904377 -281063994 -254689228 -230029048
57006 -230029048 -207080783 -185736468 -165889540 -147478838 -130496854 -114971889 -100926349
56999 -100926349 -88342425 -77162531 -67305841 -58671639 -51137974 -44575937 -38867449 -33905155
56991 -33905155 -29584363 -25807424 -22493312 -19575256 -16993969 -14701570 -12667199 -10868651
56983 -10868651 -9279370 -7868762 -6610547 -5483060 -4464620 -3536185 -2686730 -1909604
56975 -1909604 -1195123 -531813 87397 665220 1203447 1701148 2152136 2550489 2898373 3205016
56965 3205016 3480117 3731814 3968009 4194183 4410574 4614885 4806330 4984441 5146889
$$ packed form
57020c88965044k9007267k3291324j4171094l687687O153587J4258291K0388113
57013d18322425K4689917K7375087K8643698K8709346K7840383K6374766K4660180
57006b30029048K2948265K1344315J9846928J8410702J6981984J5524965J4045540
56999a00926349J2583924J1179894R856690Q634202P533665O562037N708488M962294
56991c3905155M320792L776939L314112K918056K581287K292399K034371J798548
56983a0868651J589281J410608J258215J127487J018440R28435Q49455P77126
56975a909604P14481e31813H7397N77823N38227M97701M50988L98353L47884L06643
56965C205016K75101K51697K36195K26174K16391K04311J91445J78111J62448
$$ plain form
56956 5146889 5292534 5424595 5546957 5658888 5756337 5836377 5897686 5939698 5965127 5981037
56946 5981037 5993480 6002306 6003703 5995420 5976796 5946687 5905196 5855926 5804600 5758502 5728221 5722089
56934 5722089 5731323 5724268 5663853 5532189 5335761 5091133 4813161 4515189 4210719 3910175
56924 3910175 3619532 3343768 3088197 2855050 2641881 2444692 2260594 2087551 1924629
56915 1924629 1773211 1635410 1510714 1396103 1289379 1190159 1098081 1012649 934667 865191
56905 865191 803102 746224 694744 651084 616434 589790 570124 556916 548431 541850 535267 527539
56893 527539 516522 499876 477547 451255 421814 389326 355690 324006 295243 267915 241340
56882 241340 216832 195236 175542 156589 138503 122139 108695 99803 96454 98055 104084 115743
$$ packed form
56956E146889J45645J32061J22362J11931R7449Q0040O1309M2012K5429J5910
56946E981037J2443Q826J397q283j8624l0109m1491m9270n1326m6098l0281o132
56934E722089R234p055o0415j31664j96428k44628k77972k97972l04470l00544
56924C910175k90643k75764k55571k33147k13169j97189j84098j73043j62922
56915A924629j51418j37801j24696j14611j06724r9220r2078q5432p7982o9476
56905H65191o2089n6878n1480m3660l4650k6644j9666j3208q485o581o583p728
56893E27539j1017j6646k2329k6292k9441l2488l3636l1684k8763k7328k6575
56882B41340k4508k1596j9694j8953j8086j6364j3444q892l349J601O029J1659
$$ plain form
56870 115743 133575 153919 170231 177876 175688 163803 143182 117142 89991 63350 36310 9341
56857 -14963 -35645 -54843 -74362 -93301 -110148 -124800 -137281 -146791 -153405 -158741 -163644 -166993 -168045
56844 -168045 -168201 -169159 -170775 -171856 -171650 -169651 -165398 -159300 -152205 -143496 -131494 -116604 -101992 -89824
56830 -89824 -78558 -65402 -49739 -32481 -13593 7511 29597 49223 62710 67795 64257 54120
56818 54120 40972 28258 18167 11848 9593 10629 13891 19384 27830 39142 52866 70222 93534
56805 93534 122890 155469 189414 226604 270141 320449 375029 430265 481492 522610 548209 556569
56793 556569 549903 532263 508091 481740 456698 435051 418126 407028 402010 402181 406718 415780 429792
56780 429792 448935 474129 507451 550556 603348 664749 733469 806846 879708 945392 997362
$$ packed form
56870A15743J7832K0344J6312P645k188j1885k0621k6040k7151k6641k7040I341
56857a4963k0682j9198j9519j8939j6847j4652j2481r510o614n336m903l349j052
56844a68045j56r58j616j081K06J999M253O098P095Q709J2002J4890J4612J2168
56830h9824J1266J3156J5663J7258a3593G511K2086J9626J3487N085l538j0137
56818E4120j3148j2714j0091o319k255J036L262N493Q446J1312J3724J7356K3312
56805I3534K9356L2579L3945L7190M3537N0308N4580N5236N1227M1118K5599Q360
56793E56569o666j7640k4172k6351k5042k1647j6925j1098n018J71M537R062J4012
56780D29792J9143K5194L3322M3105N2792O1401O8720P3377P2862O5684N1970
$$ plain form
56769 997362 1029883 1039204 1025800 994563 951621 901608 848310 795627 745978 699236 655279 616500
56757 616500 585856 563572 548043 539211 538634 546720 562316 584934 614941 651407 691975 735078
56745 735078 779746 822206 854830 870208 865699 843629 808545 765195 717812 669622 622869 579468
56733 579468 541049 508140 480158 456746 438514 426144 419449 417772 420693 427946 439189 454319
56721 454319 473540 496579 521753 545683 563803 571855 568030 554005 533308 508570 480755 450609
56709 450609 419622 389294 360386 333262 308278 285536 264944 246770 231467 218768 207839
56698 207839 198652 192228 188836 186748 183686 179121 174360 170663 168086 166101 164457 163107 161824 160487
56684 160487 159623 160101 161991 164025 164691 163904 163110 163513 164704 165431 165315 165125 165524 166219 166469 165928 164698
$$ packed form
56769I97362L2521R321j3404l1237m2942n0013n3298n2683m9649m6742m3957l8779
56757F16500l0644k2284j5529q832n77Q086J5596K2618L0007L6466M0568M3103
56745G35078M4668M2460L2624J5378m509k2070l5084m3350m7383m8190m6753m3401
56733E79468l8419l2909k7982k3412j8232j2370o695j677K921P253J1243J5130
56721D54319J9221K3039K5174K3930J8120Q052l825j4025k0697k4738k7815l0146
56709D50609l0987l0328k8908k7124k4984k2742k0592j8174j5303j2699j0929
56698B07839r187o424l392k088l062m565m761l697k577j985j644j350j283j337
56684A60487q64M78J890K034O66p87p94M03J191P27j16j90L99O95K50n41j230
$$ plain form
56667 164698 162817 159986 155870 150685 145284 140388 135782 130703 125161 120288 117174 115883 115861 116705 118118
56652 118118 119760 121633 124024 126544 127930 127475 125921 124218 122209 119625 117613 117806 120140 122796 124260
56637 124260 124412 123802 123140 123468 125604 129058 132396 134822 136801 139307 143262 149379 157443 165863 173030
56622 173030 178923 184222 188206 189255 187556 185704 186037 188629 192179 195408 197083 196288 193639 191147 190030
56607 190030 189558 188612 187232 185890 184433 182692 181164 180194 179331 178333 177893 178365 178605 177170 174126 170684
56591 170684 167587 164608 161142 156507 150250 142897 135818 129643 123479 116453 109263 103214 98376 93764
56577 93764 88871 83909 78835 73178 66883 60654 55539 52509 51953 53110 54466 55300 56301 58202 60672
56562 60672 63253 66470 70856 75544 78985 80762 81776 83091 85502 89656 95303 100771 104446 106766
$$ packed form
56667A64698j881k831m116n185n401m896m606n079n542m873l114j291k2Q44J413
56652A18118J642J873K391K520J386m55j554j703k009k584k012J93K334K656J464
56637A24260J52o10o62L28K136L454L338K426J979K506L955O117Q064Q420P167
56622A73030N893N299L984J049j699j852L33K592L550L229J675p95k649k492j117
56607A90030m72r46j380j342j457j741j528r70q63r98m40M72K40j435l044l442
56591A70684l097k979l466m635o257p353p079o175o164p026p190o049m838m612
56577I3764m893m962n074n657o295o229n115l030n56J157J356Q34J001J901K470
56562F0672K581L217M386M688L441J777J014J315K411M154N647N468L675K320
$$ plain form
56548 106766 109673 114162 119303 123658 126697 128698 130113 131328 132613 134205 136532 139920 143783 146860
56534 146860 148849 151085 154796 159483 163942 168008 172097 175821 178567 180940 184033 187581 190448 192731
56520 192731 195627 199191 202091 204010 206589 211225 217209 222873 227429 230983 233908 237208 242626 251221
56506 251221 262092 273329 283971 294495 305681 317654 330045 342615 355477 368755 382145
56495 382145 394993 406811 417455 426734 434314 440248 445063 449059 452203 455089 458974 463995 468122
56482 468122 469018 466410 461594 455314 447441 438307 428823 419378 409841 400453 391432 381996 371313 360378
56468 360378 351373 344951 339577 333739 327325 320529 313038 304960 297296 290740 284996 279773 275457 272268
56454 272268 269737 267456 265374 262974 259242 254012 248421 243604 239784 236842 234564 231926 227460 221075
$$ packed form
56548A06766K907M489N141M355L039K001J415J215J285J592K327L388L863L077
56534A46860J989K236L711M687M459M066M089L724K746K373L093L548K867K283
56520A92731K896L564K900J919K579M636N984N664M556L554K925L300N418Q595
56506B51221J0871J1237J0642J0524J1186J1973J2391J2570J2862J3278J3390
56495C82145J2848J1818J0644R279P580N934M815L996L144K886L885N021M127
56482D68122Q96k608m816o280p873r134r484r445r537r388r021r436j0683j0935
56468C60378r005o422n374n838o414o796p491q078p664o556n744n223m316l189
56454B72268k531k281k082k400l732n230n591m817l820k942k278k638m466o385
$$ plain form
56440 221075 214534 209500 206074 203799 202850 203195 203546 202343 199506 196535 195156 196254 199615 204254 209402
56425 209402 215256 222260 229737 236282 241599 246802 252550 258055 262503 266445 271041 276567 282181 286661
56411 286661 289275 290677 292927 297640 304118 310456 316341 323154 331181 338691 344523 349781 355881 362372
56397 362372 367862 371943 375072 377644 380266 383946 388877 393835 397701 400767 403721 406308 407914 408610
56383 408610 408749 408359 407718 407617 408264 408920 409363 410568 413021 415448 416234 415162 412807 409348 404981 400445
56367 400445 395971 390719 384339 378054 373015 368622 363718 358361 352965 346705 338557 329441 321731 316760
56353 316760 313854 311508 308619 305039 301814 300391 300853 301591 301390 300903 301324 302678 304367 306240 307974
56338 307974 308590 307926 307531 308719 310686 311899 312392 313230 314719 316685 319601 323738 327994 331247 334238
$$ packed form
56440B21075o541n034l426k275r49L45L51j203k837k971j379J098L361M639N148
56425B09402N854P004P477O545N317N203N748N505M448L942M596N526N614M480
56411B86661K614J402K250M713O478O338N885O813Q027P510N832N258O100O491
56397C62372N490M081L129K572K622L680M931M958L866L066K954K587J606O96
56383D08610J39l90o41j01O47O56M43J205K453K427P86j072k355l459m367m536
56367D00445m474n252o380o285n039m393m904n357n396o260q148r116p710m971
56353C16760k906k346k889l580l225j423M62P38k01m87M21J354J689J873J734
56338C07974O16o64l95J188J967J213M93Q38J489J966K916M137M256L253K991
$$ plain form
56323 334238 338396 343518 348398 353164 359076 366210 373118 378694 382804 385216 385549 384483 383715 384466 386833
56308 386833 390331 394171 397381 399653 401696 403986 405850 406814 407961 410632 414465 418095 421209 424494
56294 424494 428069 431429 434564 437904 441421 444922 448770 453270 457926 462302 466918 472207 477370 481342
56280 481342 484117 486253 488292 491686 498635 509261 520330 528701 534931 541572 549265 556839 564189 572372
56266 572372 581316 589976 598640 608921 621408 635001 648443 661005 672147 682161 692693 705062
56254 705062 718614 732113 745685 759744 773222 784973 795861 807202 818244 827645 836431 846658
56242 846658 857794 867322 874602 881459 889080 896949 904779 913139 922210 932079 944007 959322 977441
56229 977441 997055 1018458 1042415 1067773 1093028 1119473 1149705 1183689 1219472 1257172 1298747
$$ packed form
56323C34238M158N122M880M766N912P134O908N576M110K412L33j066p68P51K367
56308C86833L498L840L210K272K043K290J864R64J147K671L833L630L114L285
56294D24494L575L360L135L340L517L501L848M500M656M376M616N289N163L972
56280D81342K775K136K039L394O949J0626J1069Q371O230O641P693P574P350Q183
56266E72372Q944Q660Q664J0281J2487J3593J3442J2562J1142J0014J0532J2369
56254G05062J3552J3499J3572J4059J3478J1751J0888J1341J1042R401Q786J0227
56242H46658J1136R528P280O857P621P869P830Q360R071R869J1928J5315J8119
56229I77441J9614K1403K3957K5358K5255K6445L0232L3984L5783L7700M1575
$$ plain form
56218 1298747 1344129 1391313 1440383 1493841 1552470 1614382 1678871 1747933 1823246 1904723 1992902
56207 1992902 2089822 2196552 2312332 2436719 2570221 2712760 2864401 3027750 3206505 3401415
56197 3401415 3610618 3833747 4071897 4323399 4583801 4850735 5124458 5402346 5677165
56188 5677165 5942565 6196110 6434732 6651180 6838010 6992184 7113055 7198505 7246076 7256166
56178 7256166 7231912 7177463 7097875 6998579 6883107 6752933 6610743 6461682 6310033 6156687
56168 6156687 6001073 5843308 5683326 5520368 5354797 5188084 5019676 4846330 4666147
56159 4666147 4481206 4295090 4110027 3927461 3748715 3573651 3401144 3232279 3070725
56150 3070725 2918676 2774920 2638073 2509019 2388836 2277091 2173777 2080229 1996420 1919797
$$ packed form
56218A298747M5382M7184M9070N3458N8629O1912O4489O9062P5313Q1477Q8179
56207A992902R6920J06730J15780J24387J33502J42539J51641J63349J78755J94910
56197C401415K09203K23129K38150K51502K60402K66934K73723K77888K74819
56188E677165K65400K53545K38622K16448J86830J54174J20871Q5450M7571J0090
56178G256166k4254n4449p9588r9296j15472j30174j42190j49061j51649j53346
56168F156687j55614j57765j59982j62958j65571j66713j68408j73346j80183
56159D666147j84941j86116j85063j82566j78746j75064j72507j68865j61554
56150C070725j52049j43756j36847j29054j20183j11745j03314r3548q3809p6623
$$ plain form
56140 1919797 1848388 1782805 1723848 1670624 1622261 1578904 1539704 1502494 1466760 1434386 1406423
56129 1406423 1381913 1360735 1344150 1331245 1318290 1303296 1288225 1275455 1265457 1259035 1257806 1260728
56117 1260728 1264121 1267019 1272473 1281689 1291364 1299401 1308728 1322228 1337969 1352986 1368080 1385165 1403184
56104 1403184 1420441 1438117 1457837 1478334 1497756 1516666 1535548 1552148 1564709 1575439 1587567
56093 1587567 1601216 1615083 1629687 1645962 1663005 1680171 1699349 1722823 1751147 1785014 1826112
56082 1826112 1874100 1926239 1982412 2046709 2121501 2204132 2292689 2390916 2503613 2630674 2769019
56071 2769019 2916297 3068561 3218005 3357664 3485981 3603771 3710501 3807173 3898414 3986620
56061 3986620 4066923 4132134 4179532 4209015 4218687 4207467 4179121 4138971 4089072 4030124 3964256
$$ packed form
56140A919797p1409o5583n8957n3224m8363m3357l9200l7210l5734l2374k7963
56129A406423k4510k1178j6585j2905j2955j4994j5071j2770r998o422j229K922
56117A260728L393K898N454R216R675Q037R327J3500J5741J5017J5094J7085J8019
56104A403184J7257J7676J9720K0497J9422J8910J8882J6600J2561J0730J2128
56093A587567J3649J3867J4604J6275J7043J7166J9178K3474K8324L3867M1098
56082A826112M7988N2139N6173O4297P4792Q2631Q8557R8227J12697J27061J38345
56071B769019J47278J52264J49444J39659J28317J17790J06730R6672R1241Q8206
56061C986620Q0303O5211M7398K9483R672j1220k8346m0150m9899n8948o5868
$$ plain form
56050 3964256 3891422 3806738 3706331 3592780 3470826 3341898 3207629 3074293 2947972 2828854
56040 2828854 2715682 2611846 2521232 2441850 2369774 2305876 2252306 2205828 2161406 2119514 2083317
56029 2083317 2051581 2021171 1993928 1973888 1959686 1946386 1933124 1922722 1915745 1911031 1909985 1914136
56017 1914136 1920509 1925369 1930320 1938858 1949700 1959737 1970640 1985861 2003677 2019957 2035302 2052900
56005 2052900 2072091 2090822 2111471 2137227 2165626 2192828 2221136 2254749 2291242 2325250 2357647
55994 2357647 2392893 2430184 2465699 2501026 2540638 2583225 2623958 2663121 2704250 2746414 2787039
55983 2787039 2829690 2879916 2935739 2991254 3047025 3107755 3172639 3237996 3306863 3385672 3473458
55972 3473458 3564463 3659192 3762676 3874086 3988627 4107526 4235533 4370770 4507841 4648621
$$ packed form
56050C964256p2834q4684j00407j13551j21954j28928j34269j33336j26321j19118
56040B828854j13172j03836r0614p9382p2076o3898n3570m6478m4422m1892l6197
56029B083317l1736l0410k7243k0040j4202j3300j3262j0402o977m714j046M151
56017A914136O373M860M951Q538J0842J0037J0903J5221J7816J6280J5345J7598
56005B052900J9191J8731K0649K5756K8399K7202K8308L3613L6493L4008L2397
55994B357647L5246L7291L5515L5327L9612M2587M0733L9163M1129M2164M0625
55983B787039M2651N0226N5823N5515N5771O0730O4884O5357O8867P8809Q7786
55972C473458R1005R4729J03484J11410J14541J18899J28007J35237J37071J40780
$$ plain form
55962 4648621 4798955 4957411 5118712 5285406 5464088 5652978 5845927 6045932 6261443
55953 6261443 6491994 6731245 6981621 7251310 7538811 7835375 8141122 8463843 8803748
55944 8803748 9155092 9521409 9912993 10330339 10766163 11222752 11710920 12233141 12784440
55935 12784440 13368355 13994508 14662207 15364693 16107573 16903947 17753586 18647066 19587711
55926 19587711 20587856 21646701 22756005 23925362 25175808 26509101 27909614 29375774
55918 29375774 30921839 32549831 34251008 36037334 37941351 39983825 42173555 44540028
55910 44540028 47131190 49976321 53086994 56497258 60266640 64446088 69087404 74289577
55902 74289577 80187739 86890939 94478041 103053639 112750787 123683382 135972729 149834683
$$ packed form
55962D648621J50334J58456J61301J66694J78682J88890J92949K00005K15511
55953F261443K30551K39251K50376K69689K87501K96564L05747L22721L39905
55944H803748L51344L66317L91584M17346M35824M56589M88168N22221N51299
55935A2784440N83915O26153O67699P02486P42880P96374Q49639Q93480R40645
55926A9587711J000145J058845J109304J169357J250446J333293J400513J466160
55918B9375774J546065J627992J701177J786326J904017K042474K189730K366473
55910D4540028K591162K845131L110673L410264L769382M179448M641316N202173
55902G4289577N898162O703200P587102Q575598R697148J0932595J2289347J3861954
$$ plain form
55894 149834683 165578145 183535236 204097030 227805021 255260721 286930411 323167291
55887 323167291 364230264 409526986 456120537 498083032 528191553 541192542 536049123
55880 536049123 515572488 484347972 446887549 406834998 366809768 328444388 292601401
55873 292601401 259713175 229993796 203463172 179976377 159331284 141321141 125694566
55866 125694566 112152848 100421437 90279578 81514087 73902815 67261832 61462802
55859 61462802 56389362 51917614 47950662 44430830 41302494 38495817 35956223 33655064
55851 33655064 31559806 29625301 27825268 26162482 24636391 23226885 21918641 20713753
55843 20713753 19609067 18585259 17628887 16743048 15926693 15164367 14445015 13770656 13138400
$$ packed form
55894A49834683J5743462J7957091K0561794K3707991K7455700L1669690L6236880
55887C23167291M1062973M5296722M6593551M1962495L0108521J3000989n143419
55880E36049123k0476635l1224516l7460423m0052551m0025230l8365380l5842987
55873B92601401l2888226k9719379k6530624k3486795k0645093j8010143j5626575
55866A25694566j3541718j1731411j0141859q765491p611272o640983n799030
55859F1462802n073440m471748l966952l519832l128336k806677k539594k301159
55851C3655064k095258j934505j800033j662786j526091j409506j308244j204888
55843B0713753j104686j023808r56372q85839q16355p62326p19352o74359o32256
$$ plain form
55834 13138400 12534040 11952044 11402912 10892142 10409661 9947985 9513309 9110159 8731285
55825 8731285 8370648 8031076 7711658 7402702 7100650 6813686 6545581 6288036 6035672
55816 6035672 5794525 5568701 5352295 5141789 4943353 4760243 4585203 4412648 4246858
55807 4246858 4091028 3939507 3788136 3641864 3505171 3374687 3247671 3128332 3019682
55798 3019682 2918333 2822925 2738537 2667221 2603124 2542134 2487276 2439458 2391967 2339607 2284703
55787 2284703 2229146 2169358 2104464 2040971 1983798 1930371 1878232 1830326 1788039 1747135 1705631
55776 1705631 1667804 1635626 1604089 1569753 1536008 1504967 1472241 1435091 1398135 1365490 1334438
55765 1334438 1302126 1271302 1243828 1215401 1182430 1147967 1115636 1083851 1051126 1020822 995300
$$ packed form
55834A3138400o04360n81996n49132n10770m82481m61676m34676m03150l78874
55825H731285l60637l39572l19418l08956l02052k86964k68105k57545k52364
55816F035672k41147k25824k16406k10506j98436j83110j75040j72555j65790
55807D246858j55830j51521j51371j46272j36693j30484j27016j19339j08650
55798C019682j01349r5408q4388p1316o4097o0990n4858m7818m7491n2360n4904
55787B284703n5557n9788o4894o3493n7173n3427n2139m7906m2287m0904m1504
55776A705631l7827l2178l1537l4336l3745l1041l2726l7150l6956l2645l1052
55765A334438l2312l0824k7474k8427l2971l4463l2331l1785l2725l0304k5522
$$ plain form
55754 995300 971299 946221 923347 905928 891800 878733 869450 866250 866049 865591 866443 870215 874127
55741 874127 876043 878662 883875 887988 887225 883145 878076 870163 857663 843276 829440 813856 794406
55728 794406 774083 756342 739733 721648 703403 687249 672278 657365 644258 633900 623875
55717 623875 613294 605803 603612 602782 598544 591138 582366 570908 555619 539433 525318 511873 497237
55704 497237 483729 474369 468171 462962 459444 458340 456902 452287 445389 437726 427908 414771 400565
55691 400565 387382 373888 359139 345878 336293 328207 319263 311128 305523 299887 291366 281768 274204
55678 274204 267994 261192 255089 251808 250147 247973 246260 246954 249451 252636 257334 263079 265738 262518
55664 262518 256551 252531 250552 248095 245077 242597 239411 234064 228310 224403 221218 216887 212951 212018
$$ packed form
55754I95300k4001k5078k2874j7419j4128j3067r283l200k01m58Q52L772L912
55741H74127J916K619N213M113p63m080n069p913j2500j4387j3836j5584j9450
55728G94406k0323j7741j6609j8085j8245j6154j4971j4913j3107j0358j0025
55717F23875j0581p491k191q30m238p406q772j1458j5289j6186j4115j3445j4636
55704D97237j3508r360o198n209l518j104j438m615o898p663r818j3137j4206
55691D00565j3183j3494j4749j3261r585q086q944q135n605n636q521r598p564
55678B74204o210o802o103l281j661k174j713O94K497L185M698N745K659l220
55664B62518n967m020j979k457l018k480l186n347n754l907l185m331l936r33
$$ plain form
55650 212018 213524 215476 218107 222201 226279 229257 233492 241290 250583 257852 263162 268603 273994 278004
55636 278004 281507 286010 290596 293904 297127 301631 305768 307603 308710 311797 316532 320990 324960 328580
55622 328580 330151 328817 327072 327163 327540 326316 325422 327289 330070 330540 329526 330229 333035 335933 338053 339001
55606 339001 336965 331662 326959 326394 328130 328452 327861 329006 330772 329591 325336 321239 319042 318489 320135
55591 320135 324096 327248 326236 322311 319028 316402 311701 304697 297348 289242 278203 264984 252796
55578 252796 242370 231604 219805 208306 197218 185541 174198 165195 158121 151000 144009 138724
55566 138724 134424 128937 122528 117252 113216 109289 106561 106814 108206 106893 102748 99335 98351 98158 97634
55551 97634 97307 96665 94412 91690 91142 92497 92765 90929 88770 86967 84322 81170 79700 80241 80741 80448
$$ packed form
55650B12018J506J952K631M094M078K978M235P798R293P269N310N441N391M010
55636B78004L503M503M586L308L223M504M137J835J107L087M735M458L970L620
55622C28580J571j334j745R1L77j224q94J867K781M70j014P03K806K898K120R48
55606C39001k036n303m703n65J736L22n91J145J766j181m255m097k197n53J646
55591C20135L961L152j012l925l283k626m701p004p349q106j1039j3219j2188
55578B52796j0426j0766j1799j1499j1088j1677j1343r003p074p121o991n285
55566A38724m300n487o409n276m036l927k728K53J392j313m145l413r84j93n24
55551I7634l27o42k253k722n48J355K68j836k159j803k645l152j470N41N00k93
$$ plain form
55535 80448 80741 81865 82250 81545 81080 80909 79658 77695 77167 78385 79331 79117 78830 78667 77543 75898 75610
55518 75610 76556 76557 75172 74292 74389 73665 71794 71177 73225 76355 78920 81421 84647 88097 91507 95683 100625
55501 100625 104615 106118 105182 102707 99933 98516 99131 100098 99295 97026 94859 92395 87991 82271 77833
55486 77833 75403 73211 70374 68167 67610 68341 70044 72587 74747 75253 74984 75753 77359 78462 79677 82641
55470 82641 86587 89249 90855 93641 97566 100348 101858 104384 107864 108964 106149 102134 99775 98554
55456 98554 96557 93189 88645 83079 77421 72923 69328 65626 62599 61871 62418 61182 57386 52968 48538
55441 48538 42728 36242 32459 32472 33073 31412 28514 26416 24855 22692 20062 17258 13753 9873 7214
55426 7214 6086 4723 2259 144 -515 -605 -785 -105 1837 3616 4116 3841 3044 879 -2507 -5418 -7285
$$ packed form
55535H0448K93J124L85p05m65j71j251j963n28J218R46k14k87j63j124j645k88
55518G5610R46Jj385q80R7p24j871o17K048L130K565K501L226L450L410M176M942
55501A00625L990J503r36k475k774j417O15R67q03k269k167k464m404n720m438
55486G7833k430k192k837k207n57P31J703K543K160N06k69P69J606J103J215K964
55470H2641L946K662J606K786L925K782J510K526L480J100k815m015k359j221
55456I8554j997l368m544n566n658m498l595l702l027p28N47j236l796m418m430
55441D8538n810o486l783J3O01j661k898k098j561k163k630k804l505l880k659
55426G214j128j363B259A44e15r0j80a05A837J779N00k75p97H79b507k911j867
$$ plain form
55409 -7285 -9607 -13137 -16311 -17573 -17167 -15836 -14120 -13561 -15880 -19945 -22318 -21872 -21194 -22417 -24584 -26291
55393 -26291 -27741 -28633 -27196 -23393 -20383 -20723 -23355 -26053 -28359 -30218 -30371 -28372 -26107 -25188 -24652 -23105
55377 -23105 -21198 -20140 -19576 -18720 -17911 -17573 -17317 -17354 -18778 -21304 -22900 -22898 -23004 -23965 -24045 -22470 -21458 -22673
55359 -22673 -24337 -24240 -23147 -22733 -22500 -21313 -19862 -18908 -17119 -13452 -9808 -8478 -8483 -7335 -5050 -3530
55343 -3530 -3059 -2277 -981 -386 -1022 -2366 -3995 -5500 -6066 -5782 -6236 -8217 -10058 -10007 -8851 -8318 -8248 -7502
55325 -7502 -6417 -6108 -6371 -6408 -6659 -7770 -8676 -7942 -6263 -5544 -6183 -7311 -9056 -12421 -17209 -21898 -25376
55308 -25376 -27398 -27918 -27476 -27574 -29118 -30984 -31481 -30637 -29655 -28965 -28270 -27756 -27730 -27719 -27256 -26877 -27027 -26794 -25015
55289 -25015 -21950 -18675 -15747 -13625 -13204 -14540 -16086 -16656 -17084 -18505 -20146 -20516 -19752 -19123 -19038 -19191 -19795
$$ packed form
55409g285k322l530l174j262M06J331J716N59k319m065k373M46O78j223k167j707
55393b6291j450q92J437L803L010l40k632k698k306j859j53J999K265R19N36J547
55377b3105J907J058N64Q56Q09L38K56l7j424k526j596Kj06r61q0J575J012j215
55359b2673j664R7J093M14K33J187J451R54J789L667L644J330nJ148K285J520
55343c530M71P82i81c86o36j344j629j505n66K84m54j981j841N1J156N33P0P46
55325g502J085L09k63l7k51j111r06P34J679P19o39j128j745l365m788m689l478
55308b5376k022n20M42r8j544j866m97Q44R82O90O95N14K6J1M63L79j50K33J779
55289b5015L065L275K928K122M21j336j546n70m28j421j641l70P64O29Q5j53o04
$$ plain form
55272 -19795 -21040 -22127 -22394 -22592 -23513 -24265 -23484 -21405 -19175 -17052 -14974 -13941 -14984 -17416 -19746 -21657
55256 -21657 -23386 -24031 -22431 -19289 -16545 -14962 -13904 -13183 -13401 -14541 -15709 -16343 -16655 -17000 -17620 -18711
55240 -18711 -20022 -20856 -21049 -21295 -22012 -22850 -23749 -25107 -26312 -25752 -23250 -20764 -19573 -18586 -16801 -15365
55224 -15365 -15372 -15517 -14138 -12091 -11302 -11769 -12201 -12436 -12905 -12755 -10937 -8386 -6934 -6775 -7074 -8066 -10180 -11911
55206 -11911 -11142 -8232 -5560 -4442 -4598 -6063 -9085 -12357 -13711 -12698 -10586 -8063 -5111 -2951 -3651
55191 -3651 -7292 -11325 -13295 -12977 -11781 -11432 -13084 -16304 -18932 -19224 -17913 -17024 -17221 -17603 -17450 -16622 -14839
55174 -14839 -12198 -9820 -8429 -6990 -4420 -1770 -725 -804 -211 1205 2143 2438 2880 2774 399 -3967 -7980
55157 -7980 -10383 -11897 -12678 -11577 -8752 -6621 -6882 -8293 -8664 -7720 -6876 -7105 -7989 -8393 -7639 -6422 -6357
$$ packed form
55272a9795j245j087k67j98r21p52P81K079K230K123K078J033j043k432k330j911
55256b1657j729o45J600L142K744J583J058P21k18j140j168o34l12l45o20j091
55240a8711j311q34j93k46p17q38q99j358j205N60K502K486J191R87J785J436
55224a5365pj45J379K047P89m67m32k35m69J50J818K551J452J59k99r92k114j731
55206a1911P69K910K672J118j56j465l022l272j354J013K112K523K952K160p00
55191c651l641m033j970L18J196L49j652l220k628k92J311Q89j97l82J53Q28J783
55174a4839K641K378J391J439K570a770g25p9b11A205R38K95M42j06C99c967m013
55157g980k403j514p81J101K825K131k61j411l71R44Q44k29q84m04P54J217O5
$$ plain form
55140 -6357 -7921 -9263 -8224 -5204 -2709 -2352 -3658 -5463 -6771 -6321 -3234 1433 5231 6982 7809
55125 7809 9185 11085 12445 12471 11038 8514 5486 2324 -906 -3892 -5909 -6664 -6597 -5864 -4044 -1480
55108 432 1321 2745 5606 8146 8263 6532 4925 3761 2179 608 164 127 -1383 -4391 -7017 -8281
55092 -8281 -8817 -8885 -7911 -6080 -4428 -3330 -2589 -2737 -4308 -6163 -6651 -6131 -6142 -6483 -5588 -3708 -3016 -4269
55074 -4269 -5838 -6352 -6016 -4883 -2269 1395 4229 5118 4592 3279 1573 938 3115 7435 11205 13345
55058 13345 15405 18382 21076 22550 23797 25629 27046 27193 27188 28495 30896 33365 35664 37836 39240
55043 39240 39278 38340 37250 36529 36528 37259 37853 37349 36228 35836 36295 36514 36342 36815 37939 38252 37245 36334 36713
55024 36713 37972 39631 42269 46149 50172 53069 54408 53896 51226 47334 44366 43672 44903 47211 49824
$$ packed form
55140f357j564j342J039L020K495L57j306j805j308M50L087A433L798J751Q27
55125G809J376J900J360K6j433k524l028B324i06k986k017p55O7P33J820a480
55108D32Q89J424K861K540J17j731j607j164j582F08A64l7a383l008k626j264
55092h281n36o8R74J831J652J098P41j48j571j855m88N20j1l41Q95J880O92j253
55074d269j569n14L36J133b269A395K834Q89n26j313A573o35K177M320L770K140
55058A3345K060K977K694J474J247J832J417J47nJ307K401K469K299K172J404
55043C9240L8r38j090p21jP31N94n04j121l92M59K19j72M73J124L13j007r11L79
55024C6713J259J659K638L880M023K897J339n12k670l892k968o94J231K308K613
$$ plain form
55009 49824 51380 50791 49240 49265 51221 52621 51733 49802 48838 49182 50153 51104 50840 48080 43720 40706 40527
54992 40527 41719 42911 44963 48452 51305 51192 48780 46558 45619 45392 45308 44867 43142 40117 37664 37460
54976 37460 38611 38950 38032 37238 37516 38565 39940 41592 43467 45454 47486 49058 49308 48246 47098 46757
54960 46757 46804 46851 47783 50589 54687 58408 60589 61005 59985 58386 57220 56807 56917 57900 60379 63431 64677
54943 64677 63074 60329 58613 58093 57616 56601 55268 54032 53505 54038 54662 53861 52014 51332 52579 53746
54927 53746 53226 52317 52920 54544 55619 56367 58149 60832 62949 63957 64601 65418 66299 67101 67487 66889 65842
54910 65842 66418 69849 74589 78300 80963 84239 88361 91664 93184 94048 96045 99941 105307 111133 116592
54895 116592 121923 128447 137303 148572 161875 176836 192465 207408 221838 237902 257015 277543
$$ packed form
55009D9824J556n89j551K5J956J400q88j931r64L44R71R51k64k760m360l014j79
54992D0527J192J192K052L489K853j13k412k222r39k27q4m41j725l025k453k04
54976C7460J151L39r18p94K78J049J375J652J875J987K032J572K50j062j148l41
54960D6757M7M7R32K806M098L721K181M16j020j599j166m13J10R83K479L052J246
54943F4677j603k745j716n20m77j015j333j236n27N33O24q01j847o82J247J167
54927E3746n20r09O03J624J075P48J782K683K117J008O44Q17Q81Q02L86n98j047
54910F5842N76L431M740L711K663L276M122L303J520Q64J997L896N366N826N459
54895A16592N331O524Q856J1269J3303J4961J5629J4943J4430J6064J9113K0528
$$ plain form
54883 277543 296278 311165 321417 326278 325526 320493 312880 303057 290951 277703 264491 250249 232828
54870 232828 212636 193192 177438 164956 153606 142846 134400 129904 128606 127804 125667 123253 122995
54857 122995 125392 128442 130576 132609 135984 140503 145112 149926 156016 163844 173293 184810 199202 216284
54843 216284 234523 251921 266870 278713 287933 295215 300020 300945 297687 291357 282394 269918 254062
54830 254062 237225 221580 206723 191388 176190 162962 152334 143631 136312 129874 123130 115340
54818 115340 107558 101334 96568 91944 86896 81821 77074 73173 71301 72137 74724 77651 80533 83061
54804 83061 83790 81559 77240 72435 67372 61824 56963 54181 52883 51729 51293 53016 55977 57320 55996
54789 55996 53738 52170 51199 50573 50743 51485 51559 50504 49314 48727 48262 47433 46698 46707 47694 49732 52496 54755
$$ packed form
54883B77543J8735J4887J0252M861p52n033p613r823j2106j3248j3212j4242j7421
54870B32828k0192j9444j5754j2482j1350j0760q446m496j298q02k137k414k58
54857A22995K397L050K134K033L375M519M609M814O090P828R449J1517J4392J7082
54843B16284J8239J7398J4949J1843R220P282M805R25l258o330q963j2476j5856
54830B54062j6837j5645j4857j5335j5198j3228j0628q703p319o438o744p790
54818A15340p782o224m766m624n048n075m747l901j872Q36K587K927K882K528
54804H3061P29k231m319m805n063n548m861k782j298j154m36J723K961J343j324
54789E5996k258j568r71o26J70P42P4j055j190n87m65q29p35RR87K038K764K259
$$ plain form
54771 54755 55314 54542 53771 53406 53035 53206 55279 59302 63616 66955 69558 71981 74255 76527 79102 81496
54755 81496 82746 83041 83798 85863 88832 92417 97097 102967 109130 114767 119906 124938 130249 136386 143585
54740 143585 151184 158584 166592 176543 188342 200892 214270 229656 246942 264315 280628 296379
54728 296379 311719 325225 335518 342564 346461 346420 341997 334209 324422 313087 300489 287669 275567
54715 275567 264004 252478 241378 231504 222935 215260 208612 203695 200819 199311 197926 195842 193479
54702 193479 192239 193054 195417 198292 201585 205979 211765 218905 227962 239744 254060 269921 286958
54689 286958 305471 325085 344653 363618 382155 399658 414295 424530 430088 431212 428073 421342
54677 421342 412243 401548 389310 375796 361734 347353 332110 315632 298191 280263 262635 246862
$$ packed form
54771E4755N59p72p71l65l71J71K073M023M314L339K603K423K274K272K575K394
54755H1496J250K95P57K065K969L585M680N870O163N637N139N032N311O137P199
54740A43585P599P400Q008R951J1799J2550J3378J5386J7286J7373J6313J5751
54728B96379J5340J3506J0293P046L897m1m423p788r787j1335j2598j2820j2102
54715B75567j1563j1526j1100r874q569p675o648m917k876j508j385k084k363
54702A93479j240Q15K363K875L293M394N786P140R057J1782J4316J5861J7037
54689B86958J8513J9614J9568J8965J8537J7503J4637J0235N558J124l139o731
54677D21342r099j0695j2238j3514j4062j4381j5243j6478j7441j7928j7628j5773
$$ plain form
54665 246862 234206 223907 213818 203133 193226 185370 178966 172638 165965 159480 153904 149926 147820
54652 147820 146808 145597 143817 142025 140301 138128 135854 134716 134917 135173 134826 134924 136338 138189 139198
54637 139198 139399 139411 139134 138373 137916 138726 140595 142602 144252 145293 145128 143579 141896 141959 144510 148737 153246
54620 153246 156966 159546 161529 163874 166884 169957 172546 174679 176264 176864 176765 177454 180195 184681 189719
54605 189719 194668 199611 204778 210609 217870 226916 237096 247428 257430 266772 274710 280718 285380
54592 285380 289934 295006 300190 304624 307712 309648 311554 314666 319039 323512 327200 330395 333641 336770
54578 336770 339579 342859 347839 354930 363795 374401 387071 401403 415855 428715 439166 447175 452597
54565 452597 454691 452513 445640 434329 419162 401031 381556 362847 346239 331631 318589 307553
$$ packed form
54665B46862j2656j0299j0089j0685r907p856o404o328o673o485n576l978k106
54652A47820j012j211j780j792j724k173k274j138K01K56l47R8J414J851J009
54637A39198K01J2k77p61m57Q10J869K007J650J041j65j549j683O3K551M227M509
54620A53246L720K580J983K345L010L073K589K133J585O00r9O89K741M486N038
54605A89719M949M943N167N831P261R046J0180J0332J0002R342P938O008M662
54592B85380M554N072N184M434L088J936J906L112M373M473L688L195L246L129
54578C36770K809L280M980P091Q865J0606J2670J4332J4452J2860J0451Q009N422
54565D52597K094k178o873j1311j5167j8131j9475j8709j6608j4608j3042j1036
$$ plain form
54553 307553 299096 292402 285668 278117 270696 264628 260171 256927 254571 253000 252391 253263 255773 258974 261581
54538 261581 263495 265688 268430 270592 270900 268990 265006 259172 252144 244913 237824 230395 222383 214279
54524 214279 206472 198772 191155 184140 177928 171900 165491 158943 152807 147282 142424 138399 135142 132179
54510 132179 129004 125300 120894 116093 111886 108975 106720 104026 101166 99480 99217 99025 97892 96193 94319
54495 94319 91745 88343 85418 84342 84936 86065 87084 87872 88216 88251 88995 91383 94910 98071 100159 102028
54479 102028 104907 108846 112580 115081 117007 120084 124863 129936 133965 137531 141931 147090 152239 157976
54465 157976 165562 174256 181506 186184 189812 194045 198779 203404 208003 212205 214426 213504 209930 204523
54451 204523 197233 188336 179428 171834 164981 157741 150556 144744 140245 135487 129470 123072 118124 115580
$$ packed form
54553C07553q457o694o734p551p421o068m457l244k356j571o09Q72K510L201K607
54538B61581J914K193K742K162L08j910l984n834p028p231p089p429q012q104
54524B14279p807p700p617p015o212o028o409o548o136n525m858m025l257k963
54510A32179l175l704m406m801m207k911k255k694k860j686k63j92j133j699j874
54495I4319k574l402k925j076N94J129J019P88L44L5P44K388L527L161K088J869
54479A02028K879L939L734K501J926L077M779N073M029L566M400N159N149N737
54465A57976P586Q694P250M678L628M233M734M625M599M202K221r22l574n407
54451B04523p290q897q908p594o853p240p185n812m499m758o017o398m948k544
$$ plain form
54437 115580 114519 112932 109848 106424 104233 102980 101265 99312 99029 101202 104540 107954 111652 115156
54423 115156 116526 115056 112949 112697 114313 116666 119845 124164 128105 129499 128211 125987 124259 123681 125095
54408 125095 129007 134343 139162 142430 144023 143730 141690 139249 137854 137365 136729 135866 135528 135675 135447 134635
54392 134635 133935 133804 134016 134133 133539 131422 127689 123487 119945 116935 114023 111882 111498 112457 113339 113498
54376 113498 113426 113700 114547 115957 117232 116988 114666 111468 108829 106748 104837 103976 105228 107740 109519 110041
54360 110041 110498 111611 112767 113232 112894 111943 111149 112157 115994 121358 125763 128317 130039 131764 133539
54345 133539 136012 140422 146602 152592 157072 160986 166045 172661 180085 187715 195376 202782 209507 215506
54331 215506 221379 228025 235819 244047 251440 257503 262838 267962 272600 276538 280119 283009 283487 280276
$$ packed form
54437A15580j061j587l084l424k191j253j715j953k83K173L338L414L698L504
54423A15156J370j470k107k52J616K353L179M319L941J394j288k224j728n78J414
54408A25095L912N336M819L268J593k93k040k441j395m89o36q63l38J47k28q12
54392A34635p00j31K12J17n94k117l733m202l542l010k912k141l84R59Q82J59
54376A13498p2K74Q47J410J275k44k322l198k639k081j911q61J252K512J779N22
54360A10041M57J113J156M65l38r51p94J008L837N364M405K554J722J725J775
54345A33539K473M410O180N990M480L914N059O616P424P630P661P406O725N999
54331B15506N873O646P794Q228P393O063N335N124M638L938L581K890M78l211
$$ plain form
54317 280276 274421 268084 261901 254795 246034 236286 226804 218648 212375 207505 202563 196657 190636 185750
54303 185750 181744 177349 172093 166469 160953 156145 153099 152044 151374 149511 147129 145866 145533 144670 143343
54288 143343 143032 143849 144374 144579 146522 151343 157607 163587 169318 175336 181043 185645 189670 194478 200974
54273 200974 209377 219206 228981 237109 243650 250012 256206 259859 259048 254929 250223 245898 240797 234076
54259 234076 226485 219052 211660 203576 194888 186661 179560 172846 165304 156963 149088 142341 135937 129211
54245 129211 122973 118352 115089 112101 109044 106172 103303 100309 97972 96830 95626 92628 88213 84430
54231 84430 82191 80721 79674 79630 80103 79147 75865 71770 68870 67785 68382 70744 74565 78739 82423 85580
54215 85580 88000 89045 88960 89137 90171 90862 90113 88818 88912 91303 95446 100094 103713 105103 104551 103717 103705
$$ packed form
54317B80276n855o337o183p106q761r748r482q156o273m870m942n906o021m886
54303A85750m006m395n256n624n516m808l046j055o70j863k382j263l33q63j327
54288A43343l11Q17N25K05J943M821O264N980N731O018N707M602M025M808O496
54273B00974Q403R829R775Q128O541O362O194L653q11m119m706m325n101o721
54259B34076p591p433p392q084q688q227p101o714p542q341p875o747o404o726
54245A29211o238m621l263k988l057k872k869k994k337j142j204k998m415l783
54231H4430k239j470j047m4M73r56l282m095k900j085N97K362L821M174L684L157
54215H5580K420J045q5J77J034O91p49j295R4K391M143M648L619J390n52q34j2
$$ plain form
54198 103705 103937 103553 102942 102928 103214 102700 101003 98839 97126 96332 96324 96367 95657 94281 93267 93208 93362 92637 91125
54179 91125 90089 90556 92237 93741 93794 92457 91093 90852 91367 91394 90503 89517 89478 90735 92789 94396 94277
54162 94277 92595 91315 92028 93835 94613 93898 92959 92397 91648 90991 91901 94607 97101 97617 96756 96168 96307
54145 96307 96535 96471 96164 95701 95549 96644 99284 102411 104657 105655 105870 105688 105115 103924 101816 98841 95748
54128 95748 93320 91483 89801 88619 88580 89175 89103 88219 87717 88193 88833 88772 87845 85731 82013 77632 74733
54111 74733 74330 75365 76575 77753 78613 78202 76584 75552 76390 78093 78974 78878 78628 78323 77470 76127 74938
54094 74938 74574 75663 78328 81217 82302 81402 80678 81755 83630 84343 83436 81738 80113 79579 81246 84623
54078 84623 87159 87035 85517 85145 86521 88329 89574 90113 89762 88620 87901 88846 90930 92342 92001 90211
$$ packed form
54198A03705K32l84o11j4K86n14j697k164j713p94qM3p10j376j014n9J54p25j512
54179I1125j036M67J681J504N3j337j364k41N15K7q91r86l9J257K054J607j19
54162I4277j682j280P13J807P78p15r39n62p49o57R10K706K494N16q61n88J39
54145I6307K28o4l07m63j52J095K640L127K246R98K15j82n73j191k108k975l093
54128I5748k428j837j682j182l9N95p2q84n02M76O40o1r27k114l718m381k899
54111G4733m03J035J210J178Q60m11j618j032Q38J703Q81r6k50l05q53j343j189
54094G4938l64J089K665K889J085r00p24J077J875P13r07j698j625n34J667L377
54078H4623K536j24j518l72J376J808J245N39l51j142p19R45K084J412l41j790
$$ plain form
54062 90211 87863 85984 85443 85935 85777 83776 80761 78325 76804 75670 75100 75742 77345 78951 80158 81172
54046 81172 82022 82614 83083 83315 82830 81963 82116 83724 85116 84785 83726 83846 84906 84924 83132 80763 79130
54029 79130 78440 78253 77739 75887 72760 70096 69268 69357 68765 67902 68317 69791 70587 70366 70511 71469 71995 71574
54011 71574 71564 73221 76154 79342 82159 83897 83769 81986 79601 76965 73779 70903 70266 72227 74705
53996 74705 75898 76491 78163 81288 85218 89639 94325 98428 101388 103944 107141 110783 113854 116052 117889
53981 117889 119710 121623 124157 127854 132230 136097 139254 143085 149088 157211 165941 173744 180156 185831
53967 185831 191954 199516 208561 217880 225765 231467 235789 239991 244481 249051 253984 259870 266232 271372
53953 271372 274124 275072 275565 276259 277139 278231 279483 280366 280316 279363 277826 275752 273042 269782 266213 262887
$$ packed form
54062I0211k348j879n41M92j58k001l015k436j521j134n70O42J603J606J207J014
54046H1172Q50N92M69K32m85q67J53J608J392l31j059J20J060J8j792k369j633
54029G9130o90j87n14j852l127k664q28Q9n92q63M15J474P96k21J45R58N26m21
54011G1574j0J657K933L188K817J738j28j783k385k636l186k876o37J961K478
53996G4705J193N93J672L125L930M421M686M103K960K556L197L642L071K198J837
53981A17889J821J913K534L697M376L867L157L831O003Q123Q730P803O412N675
53967A85831O123P562R045R319P885N702M322M202M490M570M933N886O362N140
53953B71372K752R48M93O94Q80J092J252Q83n0r53j537k074k710l260l569l326
$$ plain form
53937 262887 260996 261575 263922 265875 266339 266544 267957 270112 271668 272675 274308 276905 279686 282101 284182
53922 284182 285795 286638 286764 286152 284151 280417 276016 272391 269415 265587 259975 253057 245976 239950 235946
53907 235946 233727 231534 227883 223386 219771 217551 215920 214426 213168 211634 209049 205945 203936 203742
53893 203742 204729 206417 209042 212476 215890 218764 221171 223105 224824 227812 233833 242639 251862 259588
53879 259588 266023 272459 279852 288668 298790 309146 318476 326962 336230 347481 360356 373693 386338
53866 386338 397169 405473 411490 415689 417565 416342 412927 409797 408613 408949 409449 409181 407902 406213 405503
53851 405503 406599 408566 410053 411501 414407 418720 422960 426804 431345 436494 440401 442009 442062 440968 438070
53836 438070 434012 431359 431337 432036 431383 429823 428248 425369 419647 412406 406420 402122 397544 391425 384151
$$ packed form
53937B62887j891N79K347J953M64K05J413K155J556J007J633K597K781K415K081
53922B84182J613Q43J26o12k001l734m401l625k976l828n612o918p081o026m004
53907B35946k219k193l651m497l615k220j631j494j258j534k585l104k009j94
53893B03742R87J688K625L434L414K874K407J934J719K988O021Q806R223P726
53879B59588O435O436P393Q816J0122J0356R330Q486R268J1251J2875J3337J2645
53866C86338J0831Q304O017M199J876j223l415l130j184L36N00k68j279j689p10
53851D05503J096J967J487J448K906M313M240L844M541N149L907J608N3j094k898
53836D38070m058k653k2O99o53j560j575k879n722p241n986m298m578o119p274
$$ plain form
53821 384151 375843 365814 354180 342341 331444 321601 312736 304981 297998 290981 283622 276382 269746
53808 269746 263850 258646 253735 248308 242035 235803 230746 226784 222805 218035 212470 206421 200560 196074
53794 196074 193565 191785 188531 183056 176899 172098 169150 166805 163438 158567 153419 149932 148941 149501 150172
53779 150172 150352 149913 148314 145118 141034 137408 134709 132370 130066 128250 127372 127487 128791 131587 135201
53764 135201 137764 137895 136310 135022 135036 135586 135743 136046 137800 141107 144472 146555 147577 148578 150002 151662
53748 151662 153550 155770 158039 160141 162728 166710 171908 177154 181661 185370 188143 189922 191809 195688
53734 195688 202259 210413 218843 227124 234864 241173 245759 249506 253142 256269 258400 260002 261664 263218
53720 263218 264472 265855 267449 268377 268161 267741 267966 267986 266531 264089 262345 261883 261798 261278 260160 258107 254738
$$ packed form
53821C84151q308j0029j1634j1839j0897r843q865p755o983p017p359p240o636
53808B69746n896n204m911n427o273o232n057l962l979m770n565o049n861m486
53794A96074k509j780l254n475o157m801k948k345l367m871n148l487r91N60O71
53779A50172J80m39j599l196m084l626k699k339k304j816q78J15J304K796L614
53764A35201K563J31j585j288J4N50J57L03J754L307L365K083J022J001J424J660
53748A51662J888K220K269K102K587L982N198N246M507L709K773J779J887L879
53734A95688O571Q154Q430Q281P740O309M586L747L636L127K131J602J662J554
53720B63218J254J383J594R28k16m20K25K0j455k442j744m62q5n20j118k053l369
$$ plain form
53703 254738 250699 247392 245285 243388 240710 237433 234432 232210 230544 228785 226407 223543 220795 218333
53689 218333 215538 211897 207712 203578 199949 197790 198556 202328 206733 209104 209313 209160 209472 209451 208684 207944
53673 207944 207640 207104 206083 205545 206170 207188 207651 208181 210488 215568 222906 231038 238464 244553 250115 256640
53657 256640 264552 272666 279836 286490 293805 301766 308956 314284 318187 321848 325701 329052 331025 331600
53643 331600 331662 332160 333316 334591 335173 334393 331977 328235 323949 319862 316303 313542 312160 312540 314003 315098
53627 315098 315006 314276 313859 313799 313346 312168 310913 310452 310987 312154 313718 315747 318165 320602 322910 325518
53611 325518 328917 332973 336989 340368 342909 344700 346125 347930 350740 354371 357975 360974 363535 366094
53597 366094 368868 371964 375478 379232 382721 385636 388241 391006 393994 396727 398512 398929 398159 396725 394718
$$ packed form
53703B54738m039l307k107j897k678l277l001k222j666j759k378k864k748k462
53689B18333k795l641m185m134l629k159P66L772M405K371K09j53L12k1p67p40
53673B07944l04n36j021n38O25J018M63N30K307N080P338Q132P426O089N562O525
53657B56640P912Q114P170O654P315P961P190N328L903L661L853L351J973N75
53643C31600O2M98J156J275N82p80k416l742m286m087l559k761j382L80J463J095
53627C15098r2p30m17o0m53j178j255m61N35J167J564K029K418K437K308K608
53611C25518L399M056M016L379K541J791J425J805K810L631L604K999K561K559
53597C66094K774L096L514L754L489K915K605K765K988K733J785M17p70j434k007
$$ plain form
53582 394718 391516 386721 381115 376007 371729 367461 362602 357565 353061 349324 346261 343714 341335 338770
53568 338770 336253 334501 333904 334319 335541 337144 338060 337545 336717 337776 341154 344778 346856 348049 349904
53553 349904 352507 355104 357966 361854 366171 369428 371482 373805 377361 381561 385630 389881 395129 401623
53539 401623 408984 416532 423452 429296 434659 440739 447783 454455 459291 462471 465612 469870 474813 479456
53525 479456 483964 489504 496290 502658 506820 508978 510666 512402 513412 513760 515078 518435 522700 525967
53511 525967 527630 528158 527908 527423 528105 530988 535079 538167 539272 539350 539804 541344 544158 547972 551727 554107
53495 554107 554798 554755 555155 556610 559337 563440 568867 575465 583137 591679 600675 609844 619174 628392 636827
53480 636827 644344 651949 660756 670707 680968 691201 701744 712913 724949 738381 753591 770102
$$ packed form
53582C94718l202m795n606n108m278m268m859n037m504l737l063k547k379k565
53568C38770k517j752n97M15J222J603R16n15q28J059L378L624K078J193J855
53553C49904K603K597K862L888M317L257K054K323L556M200M069M251N248O494
53539D01623P361P548O920N844N363O080P044O672M836L180L141M258M943M643
53525D79456M508N540O786O368M162K158J688J736J010L48J318L357M265L267
53511E25967J663N28k50m85O82K883M091L088J105P8M54J540K814L814L755K380
53495E54107O91m3M00J455K727M103N427O598P672Q542Q996R169R330R218Q435
53480F36827P517P605Q807R951J0261J0233J0543J1169J2036J3432J5210J6511
$$ plain form
53468 770102 786904 803287 818906 833574 847800 863048 880401 899183 917856 936110 955147
53457 955147 976001 998484 1021862 1045737 1070190 1095640 1122437 1150081 1177089 1202367 1226417
53446 1226417 1250567 1275527 1301652 1330002 1361647 1395892 1430618 1464825 1499884 1537818 1579051
53435 1579051 1622151 1665256 1707513 1749550 1792697 1837548 1883380 1929117 1974231 2018342 2060932
53424 2060932 2102356 2144235 2187509 2230744 2271804 2310748 2349572 2389465 2430033 2470928 2512217
53413 2512217 2552922 2591256 2626972 2661765 2696580 2730162 2761127 2789890 2817274 2842601 2864650
53402 2864650 2883593 2900363 2914712 2925467 2932642 2937810 2941908 2943648 2940798 2932685 2920860 2907329
53390 2907329 2892772 2876881 2859883 2842460 2823967 2802234 2776387 2748826 2722762 2698202 2672141
$$ packed form
53468G70102J6802J6383J5619J4668J4226J5248J7353J8782J8673J8254J9037
53457I55147K0854K2483K3378K3875K4453K5450K6797K7644K7008K5278K4050
53446A226417K4150K4960K6125K8350L1645L4245L4726L4207L5059L7934M1233
53435A579051M3100M3105M2257M2037M3147M4851M5832M5737M5114M4111M2590
53424B060932M1424M1879M3274M3235M1060L8944L8824L9893M0568M0895M1289
53413B512217M0705L8334L5716L4793L4815L3582L0965K8763K7384K5327K2049
53402B864650J8943J6770J4349J0755P175N168M098J740k850q113j1825j3531
53390B907329j4557j5891j6998j7423j8493k1733k5847k7561k6064k4560k6061
$$ plain form
53379 2672141 2642640 2610906 2579043 2547525 2515604 2482687 2448462 2412877 2376908 2342261 2309451
53368 2309451 2277260 2244987 2214117 2186602 2162467 2140419 2120154 2102621 2088214 2076032 2065051
53357 2065051 2055145 2046835 2040691 2037088 2036024 2037074 2039768 2043977 2049886 2057899 2068668 2082672 2099527
53344 2099527 2118311 2138951 2162673 2190467 2221583 2254253 2287684 2322768 2361000 2403147 2448898
53333 2448898 2497469 2548484 2602267 2659103 2718521 2779941 2843901 2911682 2983458 3057708 3132871
53322 3132871 3208738 3285690 3363479 3441579 3520036 3599076 3678364 3757558 3837118 3917496 3997621
53311 3997621 4075211 4148733 4218386 4284931 4348244 4407390 4461683 4511081 4555427 4593624 4624094
53300 4624094 4646274 4661251 4670413 4673796 4670524 4660630 4645152 4624102 4595663 4558517 4514251 4466234
$$ packed form
53379B672141k9501l1734l1863l1518l1921l2917l4225l5585l5969l4647l2810
53368B309451l2191l2273l0870k7515k4135k2048k0265j7533j4407j2182j0981
53357B065051r906q310o144l603j064J050K694M209N909Q013J0769J4004J6855
53344B099527J8784K0640K3722K7794L1116L2670L3431L5084L8232M2147M5751
53333B448898M8571N1015N3783N6836N9418O1420O3960O7781P1776P4250P5163
53322C132871P5867P6952P7789P8100P8457P9040P9288P9194P9560Q0378Q0125
53311C997621P7590P3522O9653O6545O3313N9146N4293M9398M4346L8197L0470
53300D624094K2180J4977R162L383l272r894j5478k1050k8439l7146m4266m8017
$$ plain form
53288 4466234 4416318 4363687 4306996 4246633 4184387 4121428 4057276 3990836 3922104 3852446 3783031
53277 3783031 3713433 3642424 3570129 3498554 3429593 3363091 3297490 3232074 3167951 3106876 3049545
53266 3049545 2995190 2942542 2891091 2841394 2794195 2749411 2706154 2663687 2622174 2582656 2546507
53255 2546507 2514613 2486566 2460724 2435396 2409792 2383570 2356178 2327646 2299685 2274675 2253336
53244 2253336 2234395 2216796 2201117 2188263 2177803 2168531 2160267 2154395 2152735 2156053 2163307 2172142 2180625
53231 2180625 2188702 2197716 2208784 2222407 2239410 2260851 2286523 2314630 2343614 2373579 2405594 2440559
53219 2440559 2479178 2521821 2567474 2613674 2658432 2701542 2743346 2783202 2820325 2855349 2889617
53208 2889617 2923147 2954503 2982608 3007743 3030656 3051436 3069287 3082889 3091122 3093937 3092378 3087337
$$ packed form
53288D466234m9916n2631n6691o0363o2246o2959o4152o6440o8732o9658o9415
53277C783031o9598p1009p2295p1575o8961o6502o5601o5416o4123o1075n7331
53266C049545n4355n2648n1451m9697m7199m4784m3257m2467m1513l9518l6149
53255B546507l1894k8047k5842k5328k5604k6222k7392k8532k7961k5010k1339
53244B253336j8941j7599j5679j2854j0460r272q264n872j660L318P254Q835Q483
53231B180625Q077R014J1068J3623J7003K1441K5672K8107K8984K9965L2015L4965
53219B440559L8619M2643M5653M6200M4758M3110M1804L9856L7123L5024L4268
53208B889617L3530L1356K8105K5135K2913K0780J7851J3602Q233K815j559n041
$$ plain form
53196 3087337 3078688 3066199 3050767 3033819 3015611 2994943 2970586 2942452 2911410 2878590 2844919
53185 2844919 2810809 2776110 2740449 2703538 2665121 2625105 2584182 2543883 2505434 2468606 2432106
53174 2432106 2394944 2357239 2319990 2284424 2251259 2220202 2190303 2160944 2132283 2104803 2078944
53163 2078944 2055203 2033754 2013764 1993983 1974417 1956462 1940842 1926339 1911428 1896212 1881748
53152 1881748 1868260 1855275 1842894 1831519 1820498 1808342 1794405 1779232 1763144 1745579 1726185
53141 1726185 1705694 1685201 1665075 1644956 1624502 1603855 1583549 1564069 1545407 1527115 1508841
53130 1508841 1490501 1471795 1452100 1431303 1410247 1389751 1369445 1348179 1325417 1301765 1278342
53119 1278342 1256098 1235417 1215683 1195400 1173457 1150324 1127506 1105673 1083760 1060074 1034115
$$ packed form
53196C087337q649j2489j5432j6948j8208k0668k4357k8134l1042l2820l3671
53185B844919l4110l4699l5661l6911l8417m0016m0923m0299l8449l6828l6500
53174B432106l7162l7705l7249l5566l3165l1057k9899k9359k8661k7480k5859
53163B078944k3741k1449j9990j9781j9566j7955j5620j4503j4911j5216j4464
53152A881748j3488j2985j2381j1375j1021j2156j3937j5173j6088j7565j9394
53141A726185k0491k0493k0126k0119k0454k0647k0306j9480j8662j8292j8274
53130A508841j8340j8706j9695k0797k1056k0496k0306k1266k2762k3652k3423
53119A278342k2244k0681j9734k0283k1943k3133k2818k1833k1913k3686k5959
$$ plain form
53108 1034115 1007238 981556 958162 936457 915321 894534 874542 855196 835785 816315 797581
53097 797581 779634 761350 742204 723420 706498 691426 677156 663064 649060 634980 620799
53086 620799 606906 593412 580028 567445 557657 551499 546721 540151 531330 522430 514915 508072 500870
53073 500870 493511 486598 480107 473862 468193 463638 460541 459046 458792 458636 457511 455688 454499 454767 456161
53058 456161 457886 459221 459634 459374 459820 462125 465542 468186 469528 470928 473488 476577 478865 479661 478658
53043 478658 475348 469449 461435 452198 442639 433685 425925 418959 411798 404177 396662 389285 381053 371448
53029 371448 361598 353216 346770 341268 335453 328757 321465 314336 307920 302047 296255 290685 285964 282097
53015 282097 278244 273885 269524 265749 262210 258116 253312 248282 243417 239002 235731 234443 235010 235955 235681
$$ packed form
53108A034115k6877k5682k3394k1705k1136k0787j9992j9346j9411j9470j8734
53097G97581j7947j8284j9146j8784j6922j5072j4270j4092j4004j4080j4181
53086F20799j3893j3494j3384j2583r788o158m778o570q821q900p515o843p202
53073E00870p359o913o491o245n669m555l097j495k54j56j125j823j189K68J394
53058D56161J725J335M13k60M46K305L417K644J342J400K560L089K288P96j003
53043D78658l310n899q014r237r559q954p760o966p161p621p515p377q232r605
53029C71448r850q382o446n502n815o696p292p129o416n873n792n570m721l867
53015B82097l853m359m361l775l539m094m804n030m865m415l271j288N67R45k74
$$ plain form
53000 235681 234070 232485 231981 231845 230352 226858 222506 218820 216341 214912 214442 214625 214558 213537 211946 210689
52984 210689 210083 210051 210809 212384 213829 214149 213838 214273 215539 216182 215477 214666 215219 216726 217404 216196 213711
52967 213711 211321 209911 209519 209796 210495 211351 211724 211011 209703 209245 210265 211652 212217 212458 213456 214720 214851
52950 214851 214231 215120 218494 222392 224326 224175 223700 224071 225034 226069 227321 229238 231743 233913 234647 234022
52934 234022 233808 235912 240283 245070 248855 251791 254436 256644 258134 259209 260205 260967 261549 262726 265060
52919 265060 268008 270738 273356 276653 281027 286415 292967 300855 309536 318010 326004 334255 343327 352695
52905 352695 361427 369460 377520 385745 393114 398767 403253 407430 410326 409542 404443 397779 393081 391133
52891 391133 390070 388164 385151 381252 376535 371407 366512 361869 357026 352084 347573 343355 338837 334296
$$ packed form
53000B35681j611j585n04j36j493l494m352l686k479j429m70J83o7j021j591j257
52984B10689o06l2P58J575J445L20l11M35J266O43p05q11N53J507O78j208k485
52967B13711k390j410l92K77O99Q56L73p13j308m58J020J387N65K41R98J264J31
52950B14851o20Q89L374L898J934j51m75L71R63J035J252J917K505K170P34o25
52934B34022k14K104M371M787L785K936K645K208J490J075R96P62N82J177K334
52919B65060K948K730K618L297M374N388O552P888Q681Q474P994Q251R072R368
52905C52695Q732Q033Q060Q225P369N653M486M177K896p84n099o664m698j948
52891C91133j063j906l013l899m717n128m895m643m843m942m511m218m518m541
$$ plain form
52877 334296 330801 328690 327364 326758 327622 329919 332284 333620 334086 334058 333436 332596 332639 333763 334503 333553 331449
52860 331449 329533 328186 327108 326511 326843 327755 328308 327956 326819 325444 324700 325143 325985 325612 323806 322462
52844 322462 323269 325618 327773 329088 329875 329969 329122 328333 329181 331769 334580 336456 337647 338850 340225 341542
52828 341542 342533 342936 342826 342853 343460 344057 343830 343256 343729 345525 347271 347905 348230 349712 352317 354513 355360
52811 355360 355640 356508 357605 357387 355411 353460 353760 356439 359576 361601 362776 364207 366368 369099 372302
52796 372302 375947 379818 383850 388407 393735 399394 404652 409227 413365 417505 422089 427320 432829 438048
52782 438048 443039 448395 454019 458803 462074 464629 467562 470583 472318 471980 469959 466957 463321 459097
52768 459097 454086 447806 440033 431429 423166 415811 408993 402132 395098 387997 380825 373720 367447 363218
$$ packed form
52877C34296l495k111j326o06Q64K297K365J336M66k8o22q40M3J124P40r50k104
52860C31449j916j347j078n97L32R12N53l52j137j375p44M43Q42l73j806j344
52844C22462Q07K349K155J315P87R4q47p89Q48K588K811J876J191J203J375J317
52828C41542R91M03j10K7O07N97k27n74M73J796J746O34L25J482K605K196Q47
52811C55360K80Q68J097k18j976j951L00K679L137K025J175J431K161K731L203
52796C72302L645L871M032M557N328N659N258M575M138M140M584N231N509N219
52782D38048M991N356N624M784L271K555K933L021J735l38k021l002l636m224
52768D59097n011o280p773q604q263p355o818o861p034p101p172p105o273m229
$$ plain form
52754 363218 361694 362241 363355 363786 362810 359578 353208 344211 335061 328243 323945 320488 316670 312651 308861
52739 308861 305341 302258 299826 297553 294671 291447 288863 286873 284247 280398 276022 271700 267363 263408
52725 263408 260638 258471 255139 250579 247206 246496 246557 244801 241551 239143 238697 239707 241762 244341 245469
52710 245469 242959 237231 231256 227486 226089 226013 226308 226370 226111 225998 226030 225044 222143 218318 215243 212793 209321
52693 209321 204240 198768 194036 190012 186471 183646 181570 179986 179131 179460 180466 181079 181367 182443 184260
52678 184260 184829 182326 177051 170842 165443 161858 160281 160023 160052 159924 159611 158565 156139 153087 151359 151832
52662 151832 153253 153960 153643 152854 151916 151133 151182 152200 153096 152793 151823 151825 153649 156665 159856 162910 166064
52645 166064 169290 171859 172769 171866 170645 171588 176298 184218 193259 201598 208791 215402 221844 227788 232594
$$ packed form
52754C63218j524N47J114M31r76l232o370q997r150o818m298l457l818m019l790
52739C08861l520l083k432k273k882l224k584j990k626l849m376m322m337l955
52725B63408k770k167l332m560l373p10O1j756l250k408m46J010K055K579J128
52710B45469k510n728n975l770j397p6K95O2k59j13L2r86k901l825l075k450l472
52693B09321n081n472m732m024l541k825k076j584q55L29J006O13K88J076J817
52678A84260N69k503n275o209n399l585j577k58K9j28l13j046k426l052j728M73
52662A51832J421P07l17p89r38p83M9J018Q96l03r70KJ824L016L191L054L154
52645A66064L226K569R10r03j221R43M710P920R041Q339P193O611O442N944M806
$$ plain form
52630 232594 235946 237671 237311 234772 231465 229603 229599 229010 225128 218113 210536 204239 198836 193208 187238
52615 187238 181763 177601 174773 172104 167718 160724 152395 144975 139477 135419 132377 130617 130132 130216 130279
52600 130279 130176 129594 128101 125944 123824 121645 118571 114564 110808 108193 106482 105472 105800 107739 110059
52585 110059 111113 110585 109434 108559 108144 107910 107333 105892 103650 101475 100335 100509 101635 103154 104563 105681
52569 105681 106855 108505 110431 112124 113740 115797 117742 117924 115765 113036 112043 113049 114389 114744 114249
52554 114249 113554 112825 111959 111141 110812 111394 113230 116435 120539 124429 126951 127678 127120 126223 125706 125810 126396
52537 126396 127046 127147 126329 124976 123948 123582 123277 122357 120956 119755 119260 119708 121186 123256 124922 125698
52521 125698 126385 128089 130795 133707 136615 139812 142797 144350 144195 143588 143759 144682 145944 147988 151562
$$ packed form
52630B32594L352J725l60k539l307j862mn89l882p015p577o297n403n628n970
52615A87238n475m162k828k669m386o994q329p420n498m058l042j760m85Q4O3
52600A30279j03n82j493k157k120k179l074m007l756k615j711j010L28J939K320
52585A10059J054n28j151q75m15k34n77j441k242k175j140J74J126J519J409J118
52569A05681J174J650J926J693J616K057J945J82k159k729r93J006J340L55m95
52554A14249o95p29q66q18l29N82J836L205M104L890K522P27n58q97n17J04N86
52537A26396O50J01q18j353j028l66l05r20j401j201m95M48J478K070J666P76
52521A25698O87J704K706K912K908L197K985J553j55o07J71R23J262K044L574
$$ plain form
52506 151562 156162 159964 161707 162424 164801 170417 177771 183639 186452 187492 188468 189089 188134 185951 184348
52491 184348 184278 185156 186452 188492 191335 194088 195944 197069 198042 199151 200499 202079 203563 204698 206028
52476 206028 208461 212040 215949 219741 223608 227421 230480 232357 233095 232621 231143 230052 230898 233132 234401
52461 234401 233695 232700 233284 235075 236636 237684 238717 239369 238730 237013 235676 235921 237898 241098 244713 247697
52445 247697 249304 249738 249846 250180 250482 250027 248398 246134 244519 244340 245063 245831 246920 249146 251938 253392
52429 253392 252548 250410 248298 246472 245069 244995 246739 249133 250369 249770 247883 245531 243569 242826 243334 244135
52413 244135 244591 245319 247052 249207 250533 250783 250903 251765 253404 255238 256592 257241 257810 259201 261305 262921
52397 262921 263274 262983 263221 264770 268152 273475 279444 283713 285306 285808 287150 289151 290448 291040 292305
$$ packed form
52506A51562M600L802J743P17K377N616P354N868K813J040R76O21r55k183j603
52491A84348p0Q78J296K040K843K753J856J125R73J109J348J580J484J135J330
52476B06028K433L579L909L792L867L813L059J877P38m74j478j091Q46K234J269
52461B34401p06r95N84J791J561J048J033O52o39j717j337K45J977L200L615K984
52445B47697J607M34J08L34L02m55j629k264j615j79P23P68J089K226K792J454
52429B53392q44k138k112j826j403p4J744K394J236n99j887k352j962p43N08Q01
52413B44135M56P28J733K155J326K50J20Q62J639J834J354O49N69J391K104J616
52397B62921L53k91K38J549L382N323N969M269J593N02J342K001J297N92J265
$$ plain form
52382 292305 294735 297098 297975 297182 295532 293936 292898 292477 292742 294221 297323 301135 303726 304219 303782 303959
52366 303959 304948 306208 307730 309658 311530 313108 315253 318737 322781 325930 327863 329180 330017 330273 330773
52351 330773 332695 335955 339474 343004 347488 353595 360986 368953 376723 383183 387465 389970 391872 393552
52337 393552 394366 393919 392531 390348 386991 382428 377500 373289 370247 367918 365095 360592 354339 347447 340842
52322 340842 334546 328813 324892 323469 323096 321602 318654 315610 313422 312227 312569 315029 318473 320522 320309
52307 320309 319400 319463 320411 321464 322790 325125 328558 332406 335839 338303 339964 342010 345779 351312 357350
52292 357350 362856 367736 372029 375420 377960 380334 383007 385872 389082 393336 398816 404639 410021 415397
52278 415397 421732 429088 436440 442753 447926 452828 458576 465633 473570 481791 490198 498864 507515 515939
$$ packed form
52382B92305K430K363Q77p93j650j596j038m21K65J479L102L812K591M93m37J77
52366C03959R89J260J522J928J872J578K145L484M044L149J933J317Q37K56N00
52351C30773J922L260L519L530M484O107P391P967P770O460M282K505J902J680
52337C93552Q14m47j388k183l357m563m928m211l042k329k823m503o253o892o605
52322C40842o296n733l921j423l73j494k948l044k188j195L42K460L444K049k13
52307C20309r09O3R48J053J326K335L433L848L433K464J661K046L769N533O038
52292C57350N506M880M293L391K540K374K673K865L210M254N480N823N382N376
52278D15397O335P356P352O313N173M902N748P057P937Q221Q407Q666Q651Q424
$$ plain form
52264 515939 524449 533161 541198 547648 553188 559742 568473 579027 590594 602587 614206 624641 634299
52251 634299 644962 658190 673993 691125 708112 724098 739583 756366 775829 797305 819144
52240 819144 841310 865559 892823 921848 950916 979593 1008048 1035919 1062881 1089476 1116505
52229 1116505 1144269 1173073 1203609 1235944 1268894 1301412 1333989 1367620 1401823 1434859 1465944
52218 1465944 1496268 1527498 1559781 1591602 1621431 1649241 1676190 1702861 1728317 1751261 1771606
52207 1771606 1790128 1806968 1821638 1834427 1846531 1858464 1869472 1878910 1887149 1894585 1900844 1905694
52195 1905694 1909875 1914174 1918470 1922379 1926190 1930482 1935487 1941565 1949579 1959891 1971584 1983550 1995967
52182 1995967 2009935 2026050 2044018 2063146 2082452 2100796 2117891 2134930 2153472 2173948 2195881
$$ packed form
52264E15939Q510Q712Q037O450N540O554Q731J0554J1567J1993J1619J0435R658
52251F34299J0663J3228J5803J7132J6987J5986J5485J6783J9463K1476K1839
52240H19144K2166K4249K7264K9025K9068K8677K8455K7871K6962K6595K7029
52229A116505K7764K8804L0536L2335L2950L2518L2577L3631L4203L3036L1085
52218A465944L0324L1230L2283L1821K9829K7810K6949K6671K5456K2944K0345
52207A771606J8522J6840J4670J2789J2104J1933J1008R438Q239P436O259M850
52195A905694M181M299M296L909L811M292N005O078Q014J0312J1693J1966J2417
52182A995967J3968J6115J7968J9128J9306J8344J7095J7039J8542K0476K1933
$$ plain form
52171 2195881 2218950 2242720 2265685 2285932 2303124 2318926 2335105 2351699 2367332 2380769 2391755
52160 2391755 2400647 2407665 2412783 2416253 2418758 2420488 2420245 2416420 2408994 2399640 2389286 2376645 2360104
52147 2360104 2340303 2319608 2299450 2279468 2259029 2238108 2216455 2193237 2168312 2143007 2118932
52136 2118932 2096526 2075381 2055429 2037034 2020178 2004334 1989259 1975377 1963213 1952756 1943513
52125 1943513 1934836 1926063 1916628 1906455 1896189 1886796 1878851 1872261 1866503 1860881 1854713 1847806 1840861
52112 1840861 1834888 1830009 1825272 1819840 1813811 1807500 1800641 1792999 1785249 1778354 1772322 1766360 1759955 1752977
52098 1752977 1745098 1736267 1727576 1720376 1714427 1708220 1701318 1694975 1689927 1685066 1679188 1672820 1667133 1662008
52084 1662008 1656534 1650742 1645449 1640689 1635661 1630233 1625359 1621754 1619103 1616870 1615098 1614011 1613410 1612994
$$ packed form
52171B195881K3069K3770K2965K0247J7192J5802J6179J6594J5633J3437J0986
52160B391755Q892P018N118L470K505J730k43l825p426r354j0354j2641j6541
52147B360104j9801k0695k0158j9982k0439k0921k1653k3218k4925k5305k4075
52136B118932k2406k1145j9952j8395j6856j5844j5075j3882j2164j0457r243
52125A943513q677q773r435j0173j0266r393p945o590n758n622o168o907o945
52112A840861n973m879m737n432o029o311o859p642p750o895o032n962o405o978
52098A752977p879q831q691p200n949o207o902o343n048m861n878o368n687n125
52084A662008n474n792n293m760n028n428m874l605k651k233j772j087o01m16
$$ plain form
52070 1612994 1612955 1613729 1615128 1616126 1615805 1614394 1612965 1611914 1610225 1606777 1601985 1597309 1593394 1589772 1586486
52055 1586486 1584574 1584311 1584125 1582523 1580471 1580654 1584544 1591190 1598881 1607088 1616529 1627924 1641115 1655343
52041 1655343 1670342 1687019 1706687 1729576 1754644 1781096 1809386 1840283 1873610 1908632 1945196
52030 1945196 1983656 2023801 2064519 2104525 2143119 2180552 2217919 2256199 2294909 2332171 2366585
52019 2366585 2398469 2428701 2457153 2483190 2507062 2529495 2550152 2567677 2581280 2591300 2598207
52008 2598207 2602148 2603551 2603077 2600577 2594910 2585225 2571905 2556066 2538897 2521673 2505602 2491000 2477014
51995 2477014 2462492 2446971 2430818 2414938 2400437 2387944 2377065 2366901 2357222 2348642 2341694 2336549
51983 2336549 2333780 2334404 2338516 2344414 2349639 2352639 2353370 2353128 2354289 2359273 2368719 2380884 2393503 2405833
$$ packed form
52070A612994l9P74J399R98l21j411j429j051j689l448m792m676l915l622l286
52055A586486j912k63j86j602k052J83L890O646P691Q207R441J1395J3191J4228
52041A655343J4999J6677J9668K2889K5068K6452K8290L0897L3327L5022L6564
52030A945196L8460M0145M0718M0006L8594L7433L7367L8280L8710L7262L4414
52019B366585L1884L0232K8452K6037K3872K2433K0657J7525J3603J0020O907
52008B598207L941J403m74k500n667r685j3320j5839j7169j7224j6071j4602j3986
51995B477014j4522j5521j6153j5880j4501j2493j0879j0164r679q580o948n145
51983B336549k769O24M112N898N225L000P31k42J161M984R446J2165J2619J2330
$$ plain form
51969 2405833 2418199 2430188 2440499 2448479 2454557 2458965 2461154 2460949 2459227 2456636 2452366 2445144 2435000
51956 2435000 2423123 2410223 2396037 2380455 2364098 2347410 2329900 2310721 2289410 2265710 2239230
51945 2239230 2209896 2178344 2145392 2111399 2076428 2040533 2003321 1963840 1921745 1878253 1835145
51934 1835145 1792977 1751070 1708946 1666692 1624032 1580401 1536349 1493645 1453310 1414452 1375801
51923 1375801 1337636 1301300 1267359 1235182 1204016 1173580 1143755 1114540 1086353 1059748 1034734
51912 1034734 1010862 988047 966715 946987 928153 909286 890291 872064 855533 840499 825577
51901 825577 809479 792330 775376 759414 743935 728002 711474 695016 679270 664551 651160
51890 651160 639451 629444 620636 612285 603796 594817 585108 574499 563203 552123 542354 534028 525979
$$ packed form
51969B405833J2366J1989J0311P980O078M408K189k05j722k591m270p222j0144
51956B435000j1877j2900j4186j5582j6357j6688j7510j9179k1311k3700k6480
51945B239230k9334l1552l2952l3993l4971l5895l7212l9481m2095m3492m3108
51934A835145m2168m1907m2124m2254m2660m3631m4052m2704m0335l8858l8651
51923A375801l8165l6336l3941l2177l1166l0436k9825k9215k8187k6605k5014
51912A034734k3872k2815k1332j9728j8834j8867j8995j8227j6531j5034j4922
51901H25577j6098j7149j6954j5962j5479j5933j6528j6458j5746j4719j3391
51890F51160j1709j0007q808q351q489q979r709j0609j1296j1080r769q326q049
$$ plain form
51877 525979 517194 508332 501004 495645 491001 485874 480415 475290 470494 465719 461313 458017 455962 454459
51863 454459 452695 450393 448032 446623 446873 448335 449781 450542 450867 450778 449362 445786 440502 434906 430149
51848 430149 426524 423424 419598 414096 407479 401492 397130 393741 390410 387223 384499 381767 378515 375160
51834 375160 372092 368485 363332 357284 352146 348698 346072 343193 339800 336182 333000 331326 331755 333334
51820 333334 334283 333988 333409 333339 333191 332000 330038 328829 329618 332039 334438 335734 336778 339184 342743 345208
51804 345208 345293 344665 345724 348359 350529 351509 352632 354902 357636 359842 361367 362179 361993 361357 361896 364608
51788 364608 368711 372810 376346 379256 381151 381783 381758 382017 383014 384947 388121 392219 395751 397323 397470 398457
51772 398457 402044 407836 413793 417918 419484 419198 418485 418384 418683 418085 415371 410498 404567 398756 393529
$$ packed form
51877E25979q785q862p328n359m644n127n459n125m796m775m406l296k055j503
51863D54459j764k302k361j409K50J462J446P61L25q9j416l576n284n596m757
51848D30149l625l100l826n502o617n987m362l389l331l187k724k732l252l355
51834C75160l068l607n153o048n138l448k626k879l393l618l182j674M29J579
51820C33334R49k95n79p0j48j191j962j209P89K421K399J296J044K406L559K465
51804C45208Q5o28J059K635K170R80J123K270K734K206J525Q12j86o36N39K712
51788C64608M103M099L536K910J895O32k5K59R97J933L174M098L532J572J47R87
51772C98457L587N792N957M125J566k86p13j01K99n98k714m873n931n811n227
$$ plain form
51757 393529 388899 384931 381549 378220 374625 371466 369657 368730 367199 364828 363253 363617 364780 364993 364350
51742 364350 364274 365283 366703 368165 369927 371861 373418 374550 375574 376335 376584 376974 378396 380493 382113
51727 382113 383023 383797 384133 382943 380240 377350 374959 372489 369716 367409 365867 364495 363397 363759 365752
51712 365752 367689 368365 368736 370084 371836 372768 373323 375134 378838 383714 388941 393903 397593 399038 398320
51697 398320 396413 394330 393055 393616 396132 399232 401542 403469 406536 411236 416636 421872 426958 432121
51683 432121 437373 442895 448944 455222 460949 465733 469872 473884 478374 484237 492205 502068 512863 523743
51669 523743 534108 543168 550465 557071 565215 576074 588470 600322 610907 620930 630788 639873 647892
51656 647892 655959 665458 676041 685659 692750 697659 701584 704846 706841 707126 705747 702844 698765 694265
$$ packed form
51757C93529m630l968l382l329l595l159j809r27j531k371j575L64J163K13o43
51742C64350p6J009J420J462J762J934J557J132J024P61K49L90J422K097J620
51727C82113R10P74L36j190k703k890k391k470k773k307j542j372j098L62J993
51712C65752J937O76L71J348J752R32N55J811L704M876N227M962L690J445p18
51697C98320j907k083j275N61K516L100K310J927L067M700N400N236N086N163
51683D32121N252N522O049O278N727M784M139M012M490N863P968R863J0795J0880
51669E23743J0365R060P297O606Q144J0859J2396J1852J0585J0023R858R085Q019
51656F47892Q067R499J0583R618P091M909L925L262J995K85j379k903m079m500
$$ plain form
51642 694265 689802 684892 679046 672917 667348 661679 654647 646994 641346 638927 638043 636654 634831 633586
51628 633586 632791 631802 630954 630710 630209 628459 626487 626481 628922 632165 634858 637213 639655 641685 642549 641872 639225
51611 639225 634176 627264 619927 612945 605890 598624 592251 587666 584023 579919 575775 573828 575563 580055
51597 580055 585286 590318 595490 600932 605818 609338 611696 613710 615856 618234 620994 624030 626394 626964
51583 626964 625838 624227 622591 619622 613525 603808 591472 578074 565040 553168 542134 530890 519122
51570 519122 507806 497766 488355 478450 468271 459150 451556 444369 436415 428035 420722 415418 411465
51557 411465 407297 402156 396912 392799 389595 385896 381303 377250 375130 374492 373905 372797 371508 370154 368576
51542 368576 367036 365953 365154 364253 363450 363082 362763 361984 361176 360997 360818 359340 356771 354998 355265 356769 358012
$$ packed form
51642F94265m463m910n846o129n569n669p032p653n648k419q84j389j823j245
51628F33586p95r89q48k44n01j750j972oK441L243K693K355K442K030Q64o77k647
51611F39225n049o912p337o982p055p266o373m585l643m104m144j947J735M492
51597E80055N231N032N172N442M886L520K358K014K146K378K760L036K364N70
51583F26964j126j611j636k969o097r717j2336j3398j3034j1872j1034j1244j1768
51570E19122j1316j0040r411r905j0179r121p594p187p954q380p313n304l953
51557D11465m168n141n244m113l204l699m593m053k120o38n87j108j289j354j578
51542C68576j540j083p99r01q03l68l19p79q08j79j79j478k569j773K67J504J243
$$ plain form
51525 358012 358497 358664 359117 360524 363507 367957 372996 378043 383401 389419 395709 401739 407742 414495 422517
51510 422517 431872 442362 453572 464981 476385 487942 499490 510134 518872 525445 530266 533650
51498 533650 535373 534989 532401 528139 523089 517872 512511 506695 500205 493009 485258 477437 470257 464131
51484 464131 459030 455149 453200 453567 455588 458342 461867 466896 473689 481914 491452 502424 514479 526854
51470 526854 539215 551602 563603 574442 583969 592672 600569 606970 611405 613892 614184 611991 608365
51457 608365 605614 604985 605161 603803 599976 594535 588992 584800 582959 583182 583804 583409 582357 582015 582875 584396
51441 584396 586455 589850 595124 601620 608004 613228 616818 618773 619521 619685 619559 618813 616706 612549 606056
51426 606056 597542 587830 577878 568512 560396 553875 548676 544113 539897 536462 534177 532642 531232 530065
$$ packed form
51525C58012M85J67M53J407K983M450N039N047N358O018O290O030O003O753Q022
51510D22517R355J0490J1210J1409J1404J1557J1548J0644Q738O573M821L384
51498E33650J723l84k588m262n050n217n361n816o490p196p751p821p180o126
51484D64131n101l881j949L67K021K754L525N029O793Q225R538J0972J2055J2375
51470E26854J2361J2387J2001J0839R527Q703P897O401M435K487K92k193l626
51457F08365k751o29J76j358l827n441n543m192j841K23O22l95j052l42Q60J521
51441E84396K059L395N274O496O384N224L590J955P48J64j26p46k107m157o493
51426F06056q514r712r952r366q116o521n199m563m216l435k285j535j410j167
$$ plain form
51412 530065 529754 530308 531027 531697 533171 536358 540972 545808 550066 554083 558816 564922 572256 579908 586835
51397 586835 592856 599102 607069 616985 627478 637224 646548 656853 668709 681261 693613 706019 719235
51384 719235 733276 747336 760659 772930 783953 793365 800574 804824 805701 803902 801113 798548 795894
51371 795894 792183 787250 781655 775636 769216 763191 758820 756261 754381 752519 751430 751907 753357 754736
51357 754736 756317 759430 764427 769728 773234 774210 773502 772057 769596 764934 757572 748633 739865 731936 724098
51342 724098 715373 705438 694382 682361 669822 657471 645635 634024 622347 610696 599103 587385
51330 587385 575835 565569 557591 551914 547915 544961 542151 538144 532298 525777 520595 517519 515663 514128
51316 514128 513287 514226 517619 523360 530697 538344 544886 549562 552483 553903 553596 551155 546587 540274 532516
$$ packed form
51412E30065l11N54P19O70J474L187M614M836M258M017M733O106P334P652O927
51397E86835O021O246P967R916J0493R746R324J0305J1856J2552J2352J2406J3216
51384G19235J4041J4060J3323J2271J1023R412P209M250Q77j799k789k565k654
51371G95894l711m933n595o019o420o025m371k559j880j862j089M77J450J379
51357G54736J581L113M997N301L506R76p08j445k461m662p362q939q768p929p838
51342G24098q725r935j1056j2021j2539j2351j1836j1611j1677j1651j1593j1718
51330E87385j1550j0266p978n677l999k954k810m007n846o521n182l076j856j535
51316E14128q41R39L393N741P337P647O542M676K921J420l07k441m568o313p758
$$ plain form
51301 532516 523342 512685 500516 486915 472244 457219 442691 429337 417423 406569 395705 383858
51289 383858 371392 360219 352171 347196 343534 339580 334948 329741 323738 316900 310030 304140 299343 295069
51275 295069 291127 287833 285209 282925 281070 279986 279172 277424 274593 272098 270835 269517 266324 261595
51261 261595 257515 255340 254372 253739 253696 254607 255869 256716 257351 258537 260586 263362 266712 270170 272847 274514
51245 274514 276491 280529 286793 293760 300166 306252 312786 319620 325881 331388 337216 344731 354331 365221
51231 365221 376194 386445 395816 404596 413078 421001 427301 430763 431167 429482 426658 422577 416667 409119
51217 409119 400770 391974 382437 372139 361554 350830 339776 328982 319899 313050 306994 300011 292233
51204 292233 285055 278885 272735 266081 259927 255526 252782 250438 247414 243608 239679 236377 233865 231548
$$ packed form
51301E32516r174j0657j2169j3601j4671j5025j4528j3354j1914j0854j0864j1847
51289C83858j2466j1173q048m975l662l954m632n207o003o838o870n890m797m274
51275B95069l942l294k624k284j855j084q14j748k831k495j263j318l193m729
51261B61595m080k175r68o33m3R11J262Q47O35J186K049K776L350L458K677J667
51245B74514J977M038O264O967O406O086O534O834O261N507N828P515R600J0890
51231C65221J0973J0251R371Q780Q482P923O300L462M04j685k824m081n910p548
51217D09119q349q796r537j0298j0585j0724j1054j0794r083o849o056o983p778
51204B92233p178o170o150o654o154m401k744k344l024l806l929l302k512k317
$$ plain form
51190 231548 228731 225489 222669 220998 220495 220740 221319 221890 222265 222610 223346 224654 226382 228526 231344 234777
51174 234777 238210 241115 243650 246263 249025 251679 254053 255953 256989 257096 257084 258024 260002 261986 263005
51159 263005 263121 263150 263748 264789 265308 264215 261535 258781 257564 258005 259262 261251 264448 267884 269056 266877
51143 266877 263459 261648 261735 262013 261701 261564 262065 262839 263956 265774 267158 265744 260798 254439 249276 246220
51127 246220 245274 246754 250304 253977 255922 256256 256037 255293 253557 251619 250935 251492 251841 251152 249845 248165
51111 248165 245647 242292 239043 236668 235020 233607 232017 229663 226095 221871 218279 215985 214638 213798
51097 213798 213541 214127 215915 219424 224408 228998 231121 230938 230559 231105 231515 230760 229635 229317 229391 228613 226834
51080 226834 224949 223405 221768 219516 216529 213127 210290 209303 210422 212181 212763 211813 210390 209534 209502 210086
$$ packed form
51190B31548k817l242k820j671n03K45N79N71L75L45P36J308J728K144K818L433
51174B34777L433K905K535K613K762K654K374J900J036J07j2R40J978J984J019
51159B63005J16K9N98J041N19j093k680k754j217M41J257J989L197L436J172k179
51143B66877l418j811Q7K78l12j37N01P74J117J818J384j414m946o359n163l056
51127B46220r46J480L550L673J945L34k19p44j736j938o84N57L49o89j307j680
51111B48165k518l355l249k375j648j413j590k354l568m224l592k294j347q40
51097B13798k57N86J788L509M984M590K123j83l79N46M10p55j125l18P4p78j779
51080B26834j885j544j637k252k987l402k837r87J119J759N82r50j423q56l2N84
$$ plain form
51064 210086 210960 211901 213141 215222 217988 220172 220549 219182 216995 214641 212570 211749 213152 216484 220280
51049 220280 223491 226315 229366 232757 236380 240500 245446 250856 255728 259379 262171 265109 268728 272565
51035 272565 275769 277986 279453 280448 281039 281234 281003 280270 279327 279067 280159 282000 283140 282823 281490 279799
51019 279799 277958 276169 274831 273987 273418 273551 275377 278960 282905 285879 287794 288880 288614 286642 284083
51004 284083 282759 283378 285251 287398 289078 289659 289045 288115 287809 287782 286732 284131 280980 278794 278285 279000
50988 279000 279792 279710 278860 278342 279064 280888 283042 284806 285477 284501 282436 281118 281887 284149 286630 289482
50972 289482 293798 299289 304011 306738 308400 310731 314477 319533 325930 333814 342808 351984 360419 367561
50958 367561 373327 378069 382311 386357 390182 393519 395854 396713 396493 396749 398972 403161 408195 413474 419289
$$ packed form
51064B10086Q74R41J240K081K766K184L77j367k187k354k071q21J403L332L796
51049B20280L211K824L051L391L623M120M946N410M872L651K792K938L619L837
51035B72565L204K217J467R95N91J95k31p33r43k60J092J841J140l17j333j691
51019B79799j841j789j338q44n69J33J826L583L945K974J915J086k66j972k559
51004B84083j324O19J873K147J680N81o14r30l06k7j050k601l151k186n09P15
50988B79000P92q2q50n18P22J824K154J764O71r76k065j318P69K262K481K852
50972B89482M316N491M722K727J662K331L746N056O397P884Q994R176Q435P142
50958C67561N766M742M242M046L825L337K335Q59k20K56K223M189N034N279N815
$$ plain form
50943 419289 425648 431824 437566 443897 451994 461737 472024 482160 492377 503193 514858 527471 541219
50930 541219 556437 573523 592603 612979 633132 651849 669576 688372 710332 736190 765502
50919 765502 797651 832188 868519 906276 946311 990599 1040433 1095033 1152597 1212552 1276236
50908 1276236 1345493 1421193 1502995 1589907 1681070 1776566 1877379 1983949 2094953 2208321
50898 2208321 2323191 2439750 2557091 2672507 2783256 2887812 2984945 3072817 3149888 3215794
50888 3215794 3270522 3313559 3344650 3364637 3374890 3376592 3371121 3360061 3344068 3322845 3297118 3269511
50876 3269511 3242311 3215428 3187697 3158905 3129005 3096619 3060360 3020813 2978921 2932952 2879492
50865 2879492 2817422 2748569 2674191 2593240 2505112 2412062 2317548 2223403 2129723 2036499 1944275
$$ packed form
50943D19289O359O176N742O331Q097R743J0287J0136J0217J0816J1665J2613J3748
50930E41219J5218J7086J9080K0376K0153J8717J7727J8796K1960K5858K9312
50919G65502L2149L4537L6331L7757M0035M4288M9834N4600N7564N9955O3684
50908A276236O9257P5700Q1802Q6912R1163R5496J00813J06570J11004J13368
50898B208321J14870J16559J17341J15416J10749J04556R7133Q7872P7071O5906
50888C215794N4728M3037L1091J9987J0253J702n471j1060j5993k1223k5727k7607
50876C269511k7200k6883k7731k8792k9900l2386l6259l9547m1892m5969n3460
50865B879492o2070o8853p4378q0951q8128r3050r4514r4145r3680r3224r2224
$$ plain form
50854 1944275 1853944 1766798 1684344 1607459 1536123 1470246 1410141 1355968 1307407 1264021 1225194
50843 1225194 1189720 1156499 1125909 1099459 1077697 1059434 1043330 1029240 1017588 1008556 1002505 1000109
50831 1000109 1001212 1004290 1007858 1011880 1017274 1024644 1034067 1045394 1058052 1071046 1083836 1096867 1110880
50818 1110880 1126121 1142572 1160428 1179917 1201081 1224017 1248917 1275804 1304745 1336301 1370990
50807 1370990 1408436 1448172 1491268 1539610 1593114 1649293 1706712 1767626 1835958 1913543 1999627
50796 1999627 2093209 2194312 2303368 2420989 2548581 2688072 2840660 3006467 3185437 3377843
50786 3377843 3583695 3802160 4031773 4270892 4517820 4770705 5027371 5285144 5540812
50777 5540812 5790511 6029272 6250900 6449222 6619983 6761242 6872068 6951716 7000447 7020167
$$ packed form
50854A944275r0331q7146q2454p6885p1336o5877o0105n4173m8561m3386l8827
50843A225194l5474l3221l0590k6450k1762j8263j6104j4090j1652r032o051k396
50831A000109J103L078L568M022N394P370R423J1327J2658J2994J2790J3031J4013
50818A110880J5241J6451J7856J9489K1164K2936K4900K6887K8941L1556L4689
50807A370990L7446L9736M3096M8342N3504N6179N7419O0914O8332P7585Q6084
50796A999627R3582J01103J09056J17621J27592J39491J52588J65807J78970J92406
50786C377843K05852K18465K29613K39119K46928K52885K56666K57773K55668
50777E540812K49699K38761K21628J98322J70761J41259J10826P9648M8731J9720
$$ plain form
50767 7020167 7013622 6983746 6934488 6871450 6800468 6725784 6650285 6576987 6508916 6447293 6390724
50756 6390724 6336563 6282428 6226116 6164613 6094052 6010781 5912240 5796758 5662985 5510281 5339707
50745 5339707 5153915 4955530 4746176 4527687 4303698 4079089 3858171 3644282 3440577
50736 3440577 3249612 3071944 2906412 2752078 2608933 2476842 2355502 2245882 2149952 2068004
50726 2068004 1997532 1935628 1881240 1834134 1793149 1756951 1725553 1699551 1678392 1660693 1645713
50715 1645713 1633355 1623148 1614310 1606340 1598573 1589771 1579254 1567904 1556941 1546301 1535366 1524638
50703 1524638 1515270 1507330 1499952 1492924 1486826 1481821 1477678 1474877 1474409 1476682 1481795 1490611 1503990 1521043
50689 1521043 1539818 1560003 1583592 1612589 1647369 1687501 1732566 1781681 1833802 1889436 1950852
$$ packed form
50767G020167o545k9876m9258o3038p0982p4684p5499p3298o8071o1623n6569
50756F390724n4161n4135n6312o1503p0561q3271r8541j15482j33773j52704j70574
50745E339707j85792j98385k09354k18489k23989k24609k20918k13889k03705
50736C440577j90965j77668j65532j54334j43145j32091j21340j09620r5930q1948
50726B068004p0472o1904n4388m7106m0985l6198l1398k6002k1159j7699j4980
50715A645713j2358j0207q838p970p767q802j0517j1350j0963j0640j0935j0728
50703A524638r368p940p378p028o098n005m143k801m68K273N113Q816J3379J7053
50689A521043J8775K0185K3589K8997L4780M0132M5065M9115N2121N5634O1416
$$ plain form
50678 1950852 2019553 2094613 2174594 2260327 2354542 2459074 2573455 2696003 2825378 2961030
50668 2961030 3102969 3251505 3406768 3567953 3732746 3897413 4057725 4210220 4352683
50659 4352683 4483336 4599752 4698821 4777545 4833440 4864534 4869890 4850590 4809965 4752730 4683794
50648 4683794 4607294 4526104 4442328 4358667 4278898 4206302 4141796 4084234 4032302 3985245 3941890
50637 3941890 3900066 3857198 3810734 3757804 3695329 3621012 3533967 3434494 3323889 3204458 3078879
50626 3078879 2949269 2817426 2685981 2558419 2437605 2324761 2220047 2123475 2035206 1955742
50616 1955742 1886023 1826606 1776553 1733901 1697456 1667258 1643184 1624309 1610231 1601847 1599813 1603009
50604 1603009 1609543 1618704 1630904 1646082 1663372 1682220 1702828 1725286 1749072 1773739 1799544 1826984
$$ packed form
50678A950852O8701P5060P9981Q5733R4215J04532J14381J22548J29375J35652
50668B961030J41939J48536J55263J61185J64793J64667J60312J52495J42463
50659D352683J30653J16416R9069P8724N5895L1094N356j9300m0625n7235o8936
50648D683794p6500q1190q3776q3661p9769p2596o4506n7562n1932m7057m3355
50637C941890m1824m2868m6464n2930o2475p4317q7045r9473j10605j19431j25579
50626C078879j29610j31843j31445j27562j20814j12844j04714r6572q8269p9464
50616A955742o9719n9417n0053m2652l6445l0198k4074j8875j4078q384k034L196
50604A603009O534R161J2200J5178J7290J8848K0608K2458K3786K4667K5805K7440
$$ plain form
50592 1826984 1856016 1886044 1916631 1948097 1981443 2017690 2057226 2099720 2144602 2191549 2240665
50581 2240665 2292423 2347460 2406142 2468277 2533420 2601451 2672620 2747035 2824345 2903796 2984113
50570 2984113 3063285 3139068 3210030 3275966 3337145 3393490 3444525 3489680 3528310 3559888 3584724
50559 3584724 3604538 3621882 3638616 3654796 3669154 3680899 3691122 3702200 3715759 3731545 3748207
50548 3748207 3764477 3779210 3791192 3799913 3806057 3810196 3811157 3806633 3795087 3775873 3747580 3707840
50536 3707840 3655302 3590707 3515445 3430224 3335872 3234451 3128592 3020287 2910938 2801796
50526 2801796 2693510 2586006 2479905 2377511 2281400 2192362 2109809 2033874 1965813 1906242
50516 1906242 1854036 1807364 1765067 1726818 1692642 1662710 1637211 1616224 1599983 1589192 1584395
$$ packed form
50592A826984K9032L0028L0587L1466L3346L6247L9536M2494M4882M6947M9116
50581B240665N1758N5037N8682O2135O5143O8031P1169P4415P7310P9451Q0317
50570B984113P9172P5783P0962O5936O1179N6345N1035M5155L8630L1578K4836
50559C584724J9814J7344J6734J6180J4358J1745J0223J1078J3559J5786J6662
50548C748207J6270J4733J1982Q721O144M139R61m524j1546j9214k8293l9740
50536C707840n2538o4595p5262q5221r4352j01421j05859j08305j09349j09142
50526B801796j08286j07504j06101j02394r6111q9038q2553p5935o8061n9571
50516A906242n2206m6672m2297l8249l4176k9932k5499k0987j6241j0791m797
$$ plain form
50505 1584395 1584918 1589070 1595643 1604708 1616706 1631489 1648849 1669450 1694415 1724041 1757601 1794455
50493 1794455 1834579 1877762 1922925 1969048 2016560 2067016 2121170 2177950 2235703 2293931 2353160
50482 2353160 2413403 2473628 2532887 2591271 2649395 2707551 2765888 2825107 2886339 2950369 3017491
50471 3017491 3088198 3163674 3245420 3334567 3431555 3536185 3647907 3766314 3891557 4024108
50461 4024108 4163775 4308990 4457298 4606650 4755946 4904217 5049530 5189056 5319994
50452 5319994 5439946 5546401 5636502 5707826 5759235 5790661 5802147 5793265 5763356 5712354 5641780
50441 5641780 5555074 5456522 5349429 5235702 5117465 4998596 4884101 4778331 4684343 4604467
50431 4604467 4540403 4492704 4460922 4444389 4442174 4452149 4470699 4493435 4515575 4531665 4536024 4524223
$$ packed form
50505A584395N23M152O573R065J1998J4783J7360K0601K4965K9626L3560L6854
50493A794455M0124M3183M5163M6123M7512N0456N4154N6780N7753N8228N9229
50482B353160O0243O0225N9259N8384N8124N8156N8337N9219O1232O4030O7122
50471C017491P0707P5476Q1746Q9147R6988J04630J11722J18407J25243J32551
50461D024108J39667J45215J48308J49352J49296J48271J45313J39526J30938
50452E319994J19952J06455R0101P1324N1409L1426J1486q882k9909n1002p0574
50441E641780q6706r8552j07093j13727j18237j18869j14495j05770r3988p9876
50431D604467o4064m7699l1782j6533k215R975J8550K2736K2140J6090M359j1801
$$ plain form
50419 4524223 4493856 4443703 4372850 4281223 4170587 4044365 3906463 3760390 3609177 3455585
50409 3455585 3302253 3151607 3005587 2865572 2732732 2608230 2492779 2386280 2288559 2200339
50399 2200339 2122727 2055698 1997783 1947456 1904083 1867390 1836830 1811991 1792996 1779975 1772570
50388 1772570 1770292 1772842 1779762 1790362 1804377 1822126 1843624 1868267 1895825 1926942 1961802 1999055
50376 1999055 2037075 2075924 2117009 2160969 2206921 2253887 2302012 2351959 2403535 2455238 2505028
50365 2505028 2551644 2595427 2637637 2678672 2717355 2752521 2784837 2816107 2846952 2876274 2903316
50354 2903316 2929308 2956443 2985818 3017055 3049661 3084059 3121313 3162181 3206474 3253025 3300415
50343 3300415 3348037 3396435 3446189 3496313 3544013 3586279 3621520 3649487 3669885 3681637 3683420
$$ packed form
50419D524223l0367n0153p0853r1627j10636j26222j37902j46073j51213j53592
50409C455585j53332j50646j46020j40015j32840j24502j15451j06499r7721q8220
50399B200339p7612o7029n7915n0327m3373l6693l0560k4839j8995j3021p405
50388A772570k278K550O920J0600J4015J7749K1498K4643K7558L1117L4860L7253
50376A999055L8020L8849M1085M3960M5952M6966M8125M9947N1576N1703M9790
50365B505028M6616M3783M2210M1035L8683L5166L2316L1270L0845K9322K7042
50354B903316K5992K7135K9375L1237L2606L4398L7254M0868M4293M6551M7390
50343C300415M7622M8398M9754N0124M7700M2266L5241K7967K0398J1752J783
$$ plain form
50332 3683420 3674288 3653511 3620342 3574437 3516169 3446178 3365103 3274297 3176341 3073994 2968950
50321 2968950 2862618 2757934 2659163 2569576 2490263 2421480 2363885 2317776 2282214 2256052 2239197
50310 2239197 2231790 2232459 2238357 2246731 2255663 2263538 2268758 2269977 2265846 2254426 2233622 2202602 2162550
50297 2162550 2115942 2065171 2011565 1955385 1896944 1837989 1781391 1728916 1679830 1632547 1587254
50286 1587254 1545820 1509328 1476943 1447474 1420898 1397728 1377732 1360039 1344069 1329802 1317475
50275 1317475 1307492 1300309 1295947 1293921 1293983 1296554 1301896 1309239 1317453 1326438 1337184 1350417 1365928 1383446
50261 1383446 1403407 1426221 1451180 1476900 1502773 1529253 1556563 1583976 1610909 1637998 1666216
50250 1666216 1695232 1723592 1750505 1776520 1802235 1827316 1851237 1874082 1895778 1915168 1930764
$$ packed form
50332C683420r132k0777l3169m5905n8268o9991q1075r0806r7956j02347j05044
50321B968950j06332j04684r8771q9587p9313o8783n7595m6109l5562k6162j6855
50310B239197p407O69N898Q374Q932P875N220J219m131j1420k0804l1020m0052
50297B162550m6608n0771n3606n6180n8441n8955n6598n2475m9086m7283m5293
50286A587254m1434l6492l2385k9469k6576k3170j9996j7693j5970j4267j2327
50275A317475r983p183m362k026O2K571N342P343Q214Q985J0746J3233J5511J7518
50261A383446J9961K2814K4959K5720K5873K6480K7310K7413K6933K7089K8218
50250A666216K9016K8360K6913K6015K5715K5081K3921K2845K1696J9390J5596
$$ plain form
50239 1930764 1942368 1951335 1959329 1967208 1974718 1980569 1983038 1981258 1976018 1968890 1960739 1951573 1941466
50226 1941466 1930710 1919016 1905392 1888964 1869348 1846325 1820068 1791880 1763677 1736211 1708498
50215 1708498 1679475 1649432 1619124 1588263 1556082 1523225 1491909 1463868 1438872 1415634 1393660
50204 1393660 1373609 1356170 1341172 1327932 1316016 1305348 1295795 1287214 1280086 1275649 1274818 1276928 1280051
50191 1280051 1282805 1285555 1289618 1295637 1303096 1311172 1319438 1327697 1335689 1343303 1350618 1357314 1362329 1364685
50177 1364685 1364584 1363187 1361266 1358678 1355345 1351927 1348857 1345236 1339566 1331483 1321986 1312021 1301731 1291258
50163 1291258 1281275 1272158 1263289 1253978 1244719 1236872 1231359 1228234 1227252 1228088 1230014 1232052 1233703 1235189
50149 1235189 1236948 1239248 1242251 1246024 1250336 1254821 1259441 1264336 1268979 1271914 1271842 1268998 1265111 1261796
$$ packed form
50239A930764J1604Q967P994P879P510N851K469j780n240p128q151r166j0107
50226A941466j0756j1694j3624j6428j9616k3023k6257k8188k8203k7466k7713
50215A708498k9023l0043l0308l0861l2181l2857l1316k8041k4996k3238k1974
50204A393660k0051j7439j4998j3240j1916j0668r553q581p128m437q31K110L123
50191A280051K754K750M063O019P459Q076Q266Q259P992P614P315O696N015K356
50177A364685j01j397j921k588l333l418l070l621n670q083r497r965j0290j0473
50163A291258r983r117q869r311r259p847n513l125r82Q36J926K038J651J486
50149A235189J759K300L003L773M312M485M620M895M643K935p2k844l887l315
$$ plain form
50135 1261796 1259032 1255400 1249785 1242516 1234552 1225965 1215993 1204646 1193335 1183273 1173823 1163278 1151007
50122 1151007 1137928 1124929 1111855 1098414 1085272 1073436 1062844 1052131 1039896 1025951 1011423
50111 1011423 997813 985926 975493 965868 957016 949602 944050 939886 936301 933027 930082 926804 921879
50098 921879 914722 906297 898013 890065 881467 871633 861149 850769 840398 829618 818700 808408 799104
50085 799104 790749 783557 777790 772900 767686 761578 755062 748645 742143 735492 729562 725452 723283 722223
50071 722223 721574 721346 721790 722712 723415 723425 723461 725394 730594 738227 745830 751809 756772 762226 768817 776349
50055 776349 784747 794198 804752 816481 829648 844111 858927 873140 886623 899629 912088 923946
50043 923946 935653 947482 958834 969115 978852 989008 999565 1009808 1019621 1029309 1038373 1045802
$$ packed form
50135A261796k764l632n615p269p964q587r972j1347j1311j0062r450j0545j2271
50122A151007j3079j2999j3074j3441j3142j1836j0592j0713j2235j3945j4528
50111A011423j3610j1887j0433r625q852p414n552m164l585l274k945l278m925
50098I21879p157q425q284p948q598r834j0484j0380j0371j0780j0918j0292r304
50085G99104q355p192n767m890n214o108o516o417o502o651n930m110k169j060
50071G22223o49k28M44R22P03J0L6J933N200P633P603N979M963N454O591P532
50055G76349Q398R451J0554J1729J3167J4463J4816J4213J3483J3006J2459J1858
50043I23946J1707J1829J1352J0281R737J0156J0557J0243R813R688R064P429
$$ plain form
50031 1045802 1051692 1057277 1063097 1068360 1072706 1077588 1085153 1096206 1109562 1122881 1134115 1143018 1151546
50018 1151546 1161955 1174289 1186646 1198102 1210119 1224337 1240239 1256112 1271601 1288013 1306457
50007 1306457 1326869 1348839 1372290 1397081 1422704 1448779 1475359 1502260 1528367 1552107 1572929
49996 1572929 1592235 1612423 1634658 1657701 1679407 1699152 1718047 1736746 1754127 1768779 1781002
49985 1781002 1792354 1803521 1813586 1821237 1825764 1826736 1823713 1816905 1807567 1797064 1785745 1773337 1760277
49972 1760277 1747684 1735585 1721866 1703991 1681782 1657847 1635187 1615089 1597482 1582152 1568562
49961 1568562 1555116 1540038 1523273 1506759 1492581 1481390 1472577 1465201 1458598 1452882 1449156 1448561 1450751
49948 1450751 1453920 1456627 1458927 1461348 1463637 1465291 1466627 1468305 1470037 1470672 1469486 1466512 1461599 1454163
$$ packed form
50031A045802N890N585N820N263M346M882P565J1053J3356J3319J1234Q903Q528
50018A151546J0409J2334J2357J1456J2017J4218J5902J5873J5489J6412J8444
50007A306457K0412K1970K3451K4791K5623K6075K6580K6901K6107K3740K0822
49996A572929J9306K0188K2235K3043K1706J9745J8895J8699J7381J4652J2223
49985A781002J1352J1167J0065P651M527R72l023o808r338j0503j1319j2408j3060
49972A760277j2593j2099j3719j7875k2209k3935k2660k0098j7607j5330j3590
49961A568562j3446j5078j6765j6514j4178j1191q813p376o603n716l726n95K190
49948A450751L169K707K300K421K289J654J336J678J732O35j186k974m913p436
$$ plain form
49934 1454163 1444372 1433784 1423899 1414256 1402815 1388481 1372537 1357001 1342075 1326191 1308531 1290306
49922 1290306 1272984 1256294 1239126 1221735 1205707 1192050 1180774 1172394 1168082 1167607 1168587 1169076 1170068
49909 1170068 1174276 1182966 1195201 1209824 1226908 1247140 1270700 1296967 1324732 1352685 1380280 1408076
49897 1408076 1436438 1463942 1487876 1506520 1520237 1530182 1536963 1541190 1544501 1548862 1554877 1561479 1567270
49884 1567270 1571501 1573660 1572829 1567930 1558214 1543013 1521344 1492445 1456755 1415939 1371774 1325380
$$ packed form
49934A454163r791j0588r885r643j1441j4334j5944j5536j4926j5884j7660j8225
49922A290306j7322j6690j7168j7391j6028j3657j1276q380m312m75R80M89R92
49909A170068M208Q690J2235J4623J7084K0232K3560K6267K7765K7953K7595K7796
49897A408076K8362K7504K3934J8644J3717R945O781M227L311M361O015O602N791
49884A567270M231K159q31m899r716j5201k1669k8899l5690m0816m4165m6394
$$ [...]
##END NTUPLES=NMR SPECTRUM
##END=
