
##TITLE=AC1214_MBOAH12040_7165427_vBGWnf1sOw
##JCAMPDX= 6.0         $$ Bruker NMR JCAMP-DX V2.0
##DATA TYPE= NMR SPECTRUM
##DATA CLASS= NTUPLES
##ORIGIN= BRUKER
##OWNER= Administrator
$$ 1.72 TOPSPIN		Version 2.1
$$ 2012-12-02 02:42:27.194 -0500  Administrator@X
$$ Compression mode = diff/dup
##.OBSERVE FREQUENCY= 400.02188249412
##.OBSERVE NUCLEUS= ^1H
##.ACQUISITION MODE= SIMULTANEOUS (DQD)
##.ACQUISITION SCHEME= undefined
##.AVERAGES= 8
##.DIGITISER RES= 22
##SPECTROMETER/DATA SYSTEM= spect
##.PULSE SEQUENCE= zg30
##.SOLVENT NAME= COFFEE_meoh
##.SHIFT REFERENCE= INTERNAL, COFFEE_meoh, 1, 14.98509
##AUDIT TRAIL= $$ (NUMBER, WHEN, WHO, WHERE, PROCESS, VERSION, WHAT)
$$ ##TITLE= Audit trail, TOPSPIN		Version 2.1
$$ ##JCAMPDX= 5.01
$$ ##ORIGIN= Bruker BioSpin GmbH
$$ ##OWNER= Administrator
$$ $$ E:\/data/COFFEE/nmr/AC1214_MBOAH12040_7165427_vBGWnf1sOw/10/pdata/1/auditp.txt
$$ ##AUDIT TRAIL=  $$ (NUMBER, WHEN, WHO, WHERE, PROCESS, VERSION, WHAT)
(   1,<2012-12-02 02:42:18.772 -0500>,<Administrator>,<X>,<go>,<TOPSPIN 2.1>,
      <created by zg
	started at 2012-12-02 02:41:11.131 -0500,
	POWCHK enabled, PULCHK disabled,
       configuration hash MD5:
       86 BA 57 50 F2 9D 5C 9B 26 00 A9 28 5F 66 2E 89
       data hash MD5: 64K
       FA 7A B0 1B 80 36 38 65 47 86 4E FE C9 71 55 60>)
(   2,<2012-12-02 02:42:21.944 -0500>,<Administrator>,<X>,<proc1d>,<TOPSPIN 2.1>,
      <Start of raw data processing
       efp LB = 0 FT_mod = 6 PKNL = 1 PHC0 = 0 PHC1 = 0 SI = 32K 
       data hash MD5: 32K
       30 D0 4A 22 BB 4B 89 0F 51 85 10 67 31 CF 4B 0C>)
(   3,<2012-12-02 02:42:22.413 -0500>,<Administrator>,<X>,<proc1d>,<TOPSPIN 2.1>,
      <pk PHC0 = 96.69067 PHC1 = 0 
       data hash MD5: 32K
       1E 86 41 A8 02 DD 7D D3 B1 55 75 EA D9 43 C4 BB>)
(   4,<2012-12-02 02:42:22.647 -0500>,<Administrator>,<X>,<proc1d>,<TOPSPIN 2.1>,
      <abs ABSG = 1 
       data hash MD5: 32K
       4C 16 D2 82 35 25 79 D8 B8 F8 6E 0D 8E 30 BA A1>)
(   5,<2012-12-02 02:42:22.788 -0500>,<Administrator>,<X>,<proc1d>,<TOPSPIN 2.1>,
      <abs ABSG = 2 
       data hash MD5: 32K
       15 35 49 05 F5 EB B5 C5 96 2C C8 9B 36 3B A5 9E>)
(   6,<2012-12-02 02:42:22.928 -0500>,<Administrator>,<X>,<proc1d>,<TOPSPIN 2.1>,
      <abs ABSG = 3 
       data hash MD5: 32K
       29 94 3E D0 D7 B0 0C CF D5 3A FA A2 66 15 F3 5A>)
(   7,<2012-12-02 02:42:23.085 -0500>,<Administrator>,<X>,<proc1d>,<TOPSPIN 2.1>,
      <abs ABSG = 4 
       data hash MD5: 32K
       6B BC 72 B6 72 DF E1 05 77 E8 E2 34 1A 11 03 D7>)
(   8,<2012-12-02 02:42:23.256 -0500>,<Administrator>,<X>,<proc1d>,<TOPSPIN 2.1>,
      <abs ABSG = 5 
       data hash MD5: 32K
       F3 68 5B A6 AF C0 24 1D 64 10 5D 16 4F 65 38 C7>)
$$ ##END=
$$ 
$$ $$ hash MD5
$$ $$ 05 BC 0A 86 F8 4D F0 A7 01 63 6E 3A E2 EE 17 B2
##$RELAX= 
##$RELAX= 
##$RELAX= 
##$RELAX= 
##$RELAX= 
##$RELAX= 
##$RELAX= 
$$ Bruker specific parameters
$$ --------------------------
##$DU= <E:\>
##$EXPNO= 10
##$NAME= <AC1214_MBOAH12040_7165427_vBGWnf1sOw>
$$ [...]
##$TP= (0..7)
150 150 150 150 150 150 150 150
##$TP07= 0
##$TPNAME0= <>
##$TPNAME1= <>
##$TPNAME2= <>
##$TPNAME3= <>
##$TPNAME4= <>
##$TPNAME5= <>
##$TPNAME6= <>
##$TPNAME7= <>
##$TPOAL= (0..7)
0.5 0.5 0.5 0.5 0.5 0.5 0.5 0.5
##$TPOFFS= (0..7)
0 0 0 0 0 0 0 0
##$TUNHIN= 0
##$TUNHOUT= 0
##$TUNXOUT= 0
##$USERA1= <user>
##$USERA2= <user>
##$USERA3= <user>
##$USERA4= <user>
##$USERA5= <user>
##$V9= 5
##$VALIST= <valist>
##$VCLIST= <CCCCCCCCCCCCCCC>
##$VD= 0
##$VDLIST= <DDDDDDDDDDDDDDD>
##$VPLIST= <PPPPPPPPPPPPPPP>
##$VTLIST= <TTTTTTTTTTTTTTT>
##$WBST= 1024
##$WBSW= 4
##$XGAIN= (0..3)
0 0 0 0
##$XL= 0
##$YL= 0
##$YMAX_a= 656519
##$YMIN_a= -552808
##$ZGOPTNS= <>
##$ZL1= 120
##$ZL2= 120
##$ZL3= 120
##$ZL4= 120
##$ABSF1= 14.98509
##$ABSF2= -5.573092
##$ABSG= 5
##$ABSL= 3
##$ALPHA= 0
##$AQORDER= 0
##$ASSFAC= 0
##$ASSFACI= 0
##$ASSFACX= 0
##$ASSWID= 0
##$AUNMP= <proc_prof1d_extract_pilot.lims>
##$AXLEFT= 0
##$AXNAME= <>
##$AXNUC= <1H>
##$AXRIGHT= 0
##$AXTYPE= 0
##$AXUNIT= <>
##$AZFE= 0.1
##$AZFW= 0.1
##$BCFW= 0
##$BC_mod= 0
##$BYTORDP= 0
##$COROFFS= 0
##$CY= 15
##$DATMOD= 1
##$DC= 0
##$DFILT= <>
##$DTYPP= 0
##$F1P= 0
##$F2P= 0
##$FCOR= 0.5
##$FTSIZE= 32768
##$FT_mod= 6
##$GAMMA= 0
##$GB= 0
##$INTBC= 1
##$INTSCL= 1
##$ISEN= 128
##$LB= 0
##$LEV0= 0
##$LPBIN= 0
##$MAXI= 10000
##$MC2= 0
##$MEAN= 0
##$ME_mod= 0
##$MI= 0
##$NCOEF= 0
##$NC_proc= -8
##$NLEV= 6
##$NOISF1= 0
##$NOISF2= 0
##$NSP= 0
##$NTH_PI= 0
##$NZP= 0
##$OFFSET= 14.98509
##$PC= 1
##$PHC0= 96.69067
##$PHC1= 0
##$PH_mod= 1
##$PKNL= yes
##$PPARMOD= 0
##$PPDIAG= 0
##$PPIPTYP= 0
##$PPMPNUM= 2147483647
##$PPRESOL= 1
##$PSCAL= 4
##$PSIGN= 0
##$PYNMP= <proc.py>
##$REVERSE= no
##$SF= 400.02
##$SI= 32768
##$SIGF1= 0
##$SIGF2= 0
##$SINO= 400
##$SIOLD= 32768
##$SPECTYP= <>
##$SREGLST= <1H.CDCl3>
##$SSB= 0
##$STSI= 32768
##$STSR= 0
##$SW_p= 8223.68421052631
##$SYMM= 0
##$S_DEV= 0
##$TDeff= 65536
##$TDoff= 0
##$TI= <>
##$TILT= no
##$TM1= 0
##$TM2= 0
##$TOPLEV= 0
##$USERP1= <user>
##$USERP2= <user>
##$USERP3= <user>
##$USERP4= <user>
##$USERP5= <user>
##$WDW= 1
##$XDIM= 32768
##$YMAX_p= 468657615
##$YMIN_p= -703113
##$CURPLOT= <Network HP LaserJet P1505>
##$CURPRIN= <$Network HP LaserJet P1505>
##$DFORMAT= <normdp>
##$LAYOUT= <+/1D_H.xwp>
##$LFORMAT= <normlp>
##$PFORMAT= <normpl>
##$SURQMSG= 1
$$ End of Bruker specific parameters
$$ ---------------------------------
##NTUPLES= NMR SPECTRUM
##VAR_NAME=  FREQUENCY,     SPECTRUM/REAL,   SPECTRUM/IMAG
##SYMBOL=    X,             R,               I
##VAR_TYPE=  INDEPENDENT,   DEPENDENT,       DEPENDENT
##VAR_FORM=  AFFN,          ASDF,            ASDF
##VAR_DIM=   32768,         32768,           32768
##UNITS=     HZ,            ARBITRARY UNITS, ARBITRARY UNITS
##FACTOR=    0.250966925370066, 1,           1
##FIRST=     8223.43324360094, -90834,       73598
##LAST=      0,             -11134,          -344633
##MIN=       0,             -703113,         0
##MAX=       8223.43324360094, 468657615,    0
$$ Real data points
##PAGE= N=1
##DATA TABLE= (X++(R..R)), XYDATA
$$ [...]
23777 -333058 180586 19287 118512 -125017 -199167 -45507 -52641 -29076 118440 78818 -39050
23765 -215439 43987 158655 102403 -162785 185827 -46079 -10184 -140718 -61878 261007
23754 -111362 -60108 150137 83350 -73539 -236778 351805 -319884 -104702 -102615 203357
23743 -249617 251367 -81715 -265474 -205257 213151 -74268 194515 27991 -397066 -29334
23732 32116 -384379 -292812 -530348 255495 59098 67821 103439 -181328 -29740 -135804 -168555
23721 -168555 -8022 254759 67462 -7274 58264 105818 -212521 -7456 153354 44257 -71831
23709 12287 6685 -206401 -247292 -186658 92373 -19770 112153 -230613 -43696 -116175 45741
23697 -281733 -94484 179932 -61870 61969 60165 4838 7363 -124050 -186958 32620 62356 51669
23685 51669 188942 27471 -118690 -245114 47515 178089 -377714 -312675 -197846 -402613
23675 -402613 -46536 234240 37403 -12260 253784 272071 -224364 -67461 162177 -75983 48902
23663 94802 152086 -23536 -33216 226952 345482 -156109 -175102 215637 -30297 -103193 172457
23651 -7007 -156515 17512 -241063 81151 152171 -107744 29106 -383383 -43111 -317881 -100631
23639 144278 -96660 -110748 -85125 -166356 -170576 155918 -6475 -173343 185569 205910 447401
23628 447401 202678 -18292 -108163 85416 -7554 -246004 231280 -416823 -143891 396333
23617 85744 -75685 -6927 -62459 -228736 138183 488641 -178929 -254382 -452967 -90929 -163919
23606 -163919 -312465 -179155 116540 -54276 179066 36373 -64963 151168 -150918 16677
23595 481903 170614 5285 246909 225668 123016 228597 66814 -65799 -50013 101041 422551
23584 422551 223734 537047 -9572 -91323 266499 -97706 299457 -49786 191371 49098 -28613
23572 -259981 37736 33745 -178061 -351288 -101427 -172369 -228112 -93429 168959 122369 16708
23560 -150185 -222744 142057 -174736 -138729 -174825 171424 -216127 -29716 -241786 -400441
23550 -400441 20856 29534 252647 77756 86432 31276 -286940 6711 -34910 -32304 53482 -204865
23537 -97703 177072 -17270 -41395 -95087 -78023 12354 44368 212230 -28121 -169410 64195
23525 -90762 -33110 193839 289962 -154446 157250 -126737 28611 245943 99689 82528 124028
23514 124028 -158476 -121248 -231562 166807 -380301 -23992 -137588 56974 -198962 146822
23503 76111 -142645 -285161 134817 26442 -31068 -63495 76529 -311843 63929 141711 3657
23491 -43085 -127491 -202044 -65099 -228836 208001 -65038 83172 -95388 -78118 -77837 330797
23479 107173 -187764 84990 -290452 273014 -49376 -139483 194313 -203563 10121 78714
23469 78714 72013 102830 -188791 -71673 -535 -34891 -457797 -179392 -119774 -119552 125878 229436
23457 229436 -230583 80880 249153 19847 193771 -165994 -163693 165231 -86004 -57099 18020
23445 229942 273907 244702 -203665 -143967 -205552 35821 80786 253617 197818 -192516 -29221
23433 -62166 -52321 184068 -175502 -101734 -7923 -173025 109597 184967 -172800 188599 -181525
23421 -154169 -193543 33585 304063 -251162 64928 -76729 5079 106918 -384934 -35303 -40857
23410 -40857 -10277 271889 -200966 -21466 -4662 -74004 -45001 -385730 66868 245273 -128157
23398 -169686 235370 -118224 -202120 -254972 313122 -173505 -83950 125641 -140033 -1437
23387 -197158 -40916 22921 -230593 -199608 15227 169700 -195191 309651 11196 88219 207438
23376 207438 -187942 28246 124077 -703113 -244861 -9610 15360 -69166 -103404 -27316 204494
23364 103213 -353557 82645 -276542 133814 -158207 40056 -242392 14074 219563 -137873
23353 -107702 88616 65279 -50274 -10803 -276481 -296177 69811 149617 -182743 -82321 -26932
23341 -415072 37570 46928 -204089 20467 -231581 -299015 -31780 771 -152084 100050 157378
23330 157378 -102766 104690 244964 72240 -15680 -91465 -322194 4092 -103872 -97859 179862
23318 -140883 -45564 -60324 92576 -137211 27344 -141470 -163964 -68317 384850 149708 -62160
23306 24902 97362 342984 268135 -180713 135799 -67985 -70352 5279 -174561 256822 36160
23294 63855 -60909 -280219 -81179 242327 -176890 -15464 -156409 -113477 -48099 47279 258179
23283 258179 -56797 10807 -100553 167932 113466 -192515 -254241 -180239 -137099 56805 -169129
23271 12528 65860 74822 -182364 -314246 -145915 68344 18203 -235640 -184394 -56757 79833
23259 247550 56060 68307 -183066 -242658 131789 245688 -210841 59143 -176443 -123767
23249 -123767 60077 -13032 -59349 187609 -108596 -25900 146418 143444 29771 286155 154191
23238 154191 -314099 50988 -222453 164896 -317447 -175653 -148332 88228 19819 36520
23228 36520 -91236 -42299 233443 75238 -80293 17302 -122064 -12203 169848 -70976 45464
23216 -19167 42877 3744 -187294 319754 -483432 -174858 105631 280264 89473 148907 -263230
23204 486646 33628 -46286 -131425 -23094 -160148 -222923 -33000 89162 197441 -34558 147902
23192 -83846 -2746 41628 -82877 90471 -103809 63264 215063 -18935 -165538 204076 -156106
23180 -74300 -178247 -84626 -64384 -230795 -17135 -211702 -340919 104655 90609 -109420
23169 -88536 -1428 -118862 -221000 -325918 -153401 -152123 140365 -25483 61845 -254215 -53802
23157 -48244 -201645 44283 111215 92343 182480 -83362 -61528 -35382 -47154 -30956 -34255 -21101
23145 -21101 12721 236428 176787 282860 286722 -35068 158250 229782 -303956 197230 -174195
23133 -6224 -256932 169860 -300896 4485 -110537 -64262 6809 95457 351586 105383 125610
23122 125610 -122683 7672 14751 -10968 -68484 85574 -155518 54583 -412900 16105 -137657
23110 115544 -36889 127570 -214438 -149822 98501 117912 209179 72783 228479 -100729 75566
23098 206769 60516 432442 -118051 -5093 134087 -79436 238367 104580 335890 -68969
23087 188937 -228789 -188549 8827 16840 -379428 27101 168283 -49131 -108081 -13087 284801
23075 -483754 -121812 -89163 -78463 -432013 -105040 -15480 -13211 168101 -202050 -35402 -185797
23064 -185797 -52049 61163 -164508 -76353 110537 145072 183700 -71768 -14633 -20221 166268
23052 143657 209667 -42591 60129 -8964 418376 145020 -352250 13446 -69864 20983 -219556
23040 -184889 -308198 -14765 -75446 104032 57488 329919 -21265 108861 -90783 -86959 -259183
23029 -259183 -145663 164974 -303847 127630 74282 105343 69055 141709 227949 -125335
23018 201334 289297 3231 72382 286707 24574 -141729 260852 -91742 -103814 167787 -210194
23006 -232596 392822 35846 108298 51949 6413 -77508 -153037 -94758 -64823 -218533 -157494
22995 -157494 125958 143289 -86014 -266920 50108 -107179 -105889 -114871 -218007 -257169 -52851
22983 -36145 -276401 136195 -101475 7350 -396453 -80645 216200 -166135 139393 -63139
22972 -341980 -67250 -18426 -454468 -229605 -69394 -132256 -31058 56074 -112269 13663 467350
22961 467350 47000 -71192 133704 -268030 -16047 -236127 -276414 34808 -307060 -300456 314687
22949 -108202 167614 99540 26881 360207 -17759 -172818 -100648 143268 111435 117320 -331900
22937 54252 -258310 -59113 -207509 10116 -259412 52410 -330913 140734 87695 -28084 108747
22925 -64173 -307847 17918 -84738 -138760 26716 196073 366873 -61405 150466 34383 -137880
22913 241304 50104 86191 -453106 101488 -84540 84487 -73549 -244751 -134611 -26507 53119
22901 -364249 -358974 -164106 213909 -56994 -4228 -118469 -117558 49982 36817 -205909 43753
22889 -467579 225480 58259 -124102 30728 -72104 140386 10136 259700 -211615 -180746
22879 -180746 -226287 150311 -187776 -120397 -7787 -172884 -40295 150687 -145406 -8942 -119450
22868 -119450 -260812 209041 -68708 49582 -110998 69790 -59325 -8238 -230056 -1979 133242
22856 140444 -178351 39582 -2376 88036 -220722 -153808 84690 -64860 195454 -285270 3377
22844 -86975 -160704 -104144 146558 -206960 -89869 282588 -177047 36332 27058 -224739 215118
22832 262114 -9187 110047 112104 -464039 146593 233874 71132 54937 -2785 -94945 -211641
22821 -211641 -15795 -71289 92307 -32150 93478 -101883 237032 14760 -89134 64486 -92690
22809 12489 -256033 -44389 12346 -228673 -223367 94309 125276 -143864 -176219 87341 17226
22797 143921 -47278 -264215 10254 145757 -140319 -52471 -74661 -166030 -98118 14150 -36151
22785 59496 184441 -197281 -180951 -48085 26151 55836 131505 -386337 194857 -296978 -305243
22774 -305243 73264 132173 -151675 131194 -416335 -12620 11446 -306006 -108126 35210
22763 56100 -87650 20923 -518171 112618 43351 55704 92706 -230180 5911 -136461 -104218
22752 -104218 -368250 14111 -217380 134934 286917 145154 -164323 -83474 97272 -65539
22741 107018 -85005 -262647 155415 -249927 79361 -258432 -172349 141726 362692 295756
22731 295756 -22880 52462 -118095 267742 119411 -107874 -184039 -105595 -105255 -182021 49157
22719 -137551 -134162 -10735 46249 -85329 138698 217940 -136490 46286 20105 -217882 113034
22707 -228857 -61956 -239790 -213257 -53372 -181276 156709 36283 -298122 -148443 151319
22696 -82641 -199278 -226665 -384858 -510826 126771 217408 -11475 336757 -14174 77955 -29360
22684 -229716 -212099 29470 143354 -74058 -290492 122970 -4262 -12874 -123593 -60939 -161644
22673 -161644 358096 -423219 -50293 -177979 -232187 -104198 29799 64221 -48209 -64609 -251081
22662 -251081 -4945 -361624 -110151 73312 60173 -68379 85286 -24543 -602888 -187016 -224137
22651 -224137 182886 78918 -178805 -105650 384140 58728 -128453 -234766 210657 -41734
22640 129652 -278437 -246985 -85903 133591 -86721 256995 -311505 -66641 -245685 -3677 126103
22628 -31360 24962 145527 -197462 76416 -184684 130123 135491 -36552 -262043 22542 22552
22617 22552 121171 -200411 -10842 166165 71513 69705 -224171 27886 -278608 2530 -7215
22605 121060 -121931 -423017 -69658 -78968 -241904 14087 -263071 88344 50024 136975 -149369
22593 -547805 196367 -347762 -129727 -102619 -243186 61566 55370 268345 35337 -159012
22582 -68630 124051 -139948 129007 -265732 -247207 175553 -41035 143881 296069 88636
22571 7478 24652 98902 -398780 80434 -153565 -115037 -204461 140476 37689 100167 257235
22560 257235 163301 -129107 48175 15370 231096 -141551 -157197 -133695 60287 127034 -167353
22548 -67229 267923 99657 281605 71860 132494 -1387 -235682 -27860 62969 161598 -30617
22536 59055 56436 -96867 237230 85978 -64015 21654 271890 -407942 205774 -311664 106838
22524 -82149 -117946 17634 -211493 91340 -345475 -46474 -16963 -297001 -32593 -291766 -272876
22513 -272876 -360221 217253 69651 62358 -252065 -72080 -61324 -177020 -242389 293448 -109027
22501 328683 151413 -58302 -424583 126835 143125 158942 -296937 -261597 -110733 -50587
22490 331238 59595 58603 74597 362364 54346 -203072 -20108 -256091 13524 -140586 -78502
22479 -78502 -327375 403362 234163 -150898 -20500 -96103 39909 -172278 -103769 -56259 261489
22467 23248 51424 227098 -174798 -35704 108838 109366 -44238 -313133 -170110 -82354 -2998
22455 -213256 -288191 169826 -366247 -321547 37075 -327732 -250430 -107071 -114513 114903 -337146
22443 -59174 67211 26308 -158865 26483 146460 32187 -82625 57169 -83824 401329 -136303
22431 -171667 -298073 -23100 -272713 -33895 -39062 34161 -56286 -244640 341913 -139400 -162222
22420 -162222 -264787 131430 -204704 6080 -255966 -40475 -187300 238513 89875 76537
22410 76537 -297111 174944 -276767 -108696 -299616 211130 -238624 -30518 72838 175675
22400 175675 208042 63878 70344 295804 -214286 111684 -192468 248726 45754 -364600
22389 220827 206727 -249501 -401965 48706 29129 -106759 -95360 48244 14320 -107677 383774
22377 21536 -100545 -45809 218356 227701 20892 300909 137989 -97002 -181223 -75105 -69195
22366 -69195 -15543 -153424 24132 -537923 -225306 63884 3222 -49661 -68608 13151 -300912
22354 302948 -10009 -58493 -87341 -341405 -20286 86083 245317 -127780 29252 -437569 -27045
22342 146956 821 -354054 -109476 -15265 -99418 -225089 -162962 -74972 49245 -148663 -144198
22331 -144198 -542474 -41621 -229481 -197558 125875 41650 -154078 -245956 111366 -256496
22320 -195391 204527 -156114 -331302 58041 -152769 138973 -182278 -181162 -242549 -130891
22310 -130891 91999 94311 -588677 90042 209395 -202591 -320106 170058 99055 123649 -458238
22298 -109859 138928 -175782 -25567 -158596 -165378 6867 217789 -58534 216689 225972 -25633
22286 -356554 -132999 -155149 -385812 119805 270461 -71070 -338094 31808 -120221 -289980
22276 -289980 -56330 -325401 16148 51267 -282995 -336196 -98319 -93025 246986 20648 -49087
22264 -227090 116040 -21347 -11991 -4781 -57505 -278557 18650 119592 -229527 42841 -291898
22252 -93701 -37141 -116659 39289 -213582 -103613 -92524 -121738 165224 -63099 -163932 232120
22240 -332321 -41508 -51471 -268286 76012 -95008 -95990 132611 74076 26351 54515 155135
22229 155135 -60467 -94054 213427 61094 -60556 -314284 225948 3740 -141082 -57015 48757
22217 -216340 344786 163456 -180797 183493 85104 9813 -36632 -140793 -64200 16835 -186535
22205 -309743 -71122 -39348 -50534 299438 166821 -69392 223248 253434 -223838 -17617 84730
22193 -93111 -192780 -410600 -116074 113023 -336672 -334158 -206679 -162117 -63429 -60043 -186478
22182 -186478 -195991 49739 -135838 44107 -88977 193546 -98380 118287 -58015 -213595 -240593
22171 -240593 -9016 145113 123318 -166772 -49493 120344 110614 49395 -21200 -169729 -244986
22160 -244986 -142560 -12928 -90977 116367 -42895 249671 -113179 -122931 -225077 340327
22149 -354115 155935 125056 16227 -109866 53558 28235 -113340 114425 -99206 -10483 -105261
22138 -105261 -389123 -173674 -353968 -249875 -176786 -91065 -248172 -208606 -273250 26793
22127 1195 -300212 124033 6603 -293404 -138710 -34320 261470 138598 -196106 -126079 -65187
22116 -65187 208316 8068 -254565 -140308 82025 155702 55013 -299272 -424571 462164 -346938
22104 16409 163101 9093 -416139 -247563 -174362 -269392 27111 -117963 -48081 3812 -174764
22092 23815 149616 16075 -41805 72619 -361170 -212470 -198393 -139178 360170 -98470 -338407
22081 -338407 -298467 32874 362599 125493 284853 -28101 -265649 147600 -237631 98024
22070 118692 108351 -49981 -236047 -14637 -16506 -57889 -41485 339037 -197808 228125 -240351
22058 233007 -330015 -15330 32392 8906 163320 -261038 37901 13603 213562 -155912 119334
22046 -114580 -221047 -36204 74262 -231897 -20071 203035 240661 -245496 13611 41804 165290
22035 165290 -269143 156580 -211528 -277556 -84475 13044 -54424 -319361 13659 -266272
22024 -178695 -48788 -122611 -9192 -73303 26376 -103589 -74365 318614 -58720 339891 79669
22012 -334351 136815 55500 -90778 -469985 -149410 -138946 -49876 -189362 204863 -85982
22001 354880 -335182 -222915 148145 -287915 -335761 -78958 367941 366710 -218997 -37187
21990 -72144 -287984 89157 84886 -107157 -107131 -143138 214942 -149361 179807 -249557 -339105
21979 -339105 -3300 90281 288153 -145664 20344 55862 83990 244682 -58233 -108431 -102492
21968 -102492 143471 -45340 222974 -308045 -165165 -100122 -159812 -205429 -33718 94986 -289090
21956 -67146 -40135 -96947 -93933 -3265 86162 -64908 -94955 46243 -278950 24996 -18075 171780
21943 47141 -236910 16493 -333400 44194 -64133 15538 198234 -215798 -406265 -378943 -228372
21932 -228372 -890 -29524 -160371 -40339 15023 -155917 -6358 108345 -11309 -252904 243644
21920 263933 -155568 1161 -84702 157980 -473536 -40446 -12441 -90199 -80895 -320039 -237749
21909 -237749 -68349 -154411 -240430 -344850 -198491 -17131 -150745 216132 5104 22961 -100136
21897 -171670 -187205 -333052 -191168 1386 -97500 29475 -201102 -140664 -347154 -3624 -110640
21886 -110640 39046 366120 -13174 104327 -114620 34804 19097 -179760 124386 -27716
21875 162547 164694 99820 151583 1633 96226 108339 -78500 -223699 -91521 -142302 5497 137383
21863 137383 56769 27876 35591 331324 -68490 9468 -220563 57018 80933 -176434 -186650
21852 -186650 -142135 -117224 28905 -54508 222668 32581 37311 72599 -104904 -361316 -248763
21841 -248763 105948 -226901 -240378 220316 -165077 -255660 121721 107882 104378 40937 -82797
21829 27455 17452 258504 -5698 -453211 43699 -24454 -152142 -13755 31400 -169306 -102921
21818 -102921 32422 -134621 -149820 -172704 -570295 -147104 66033 147934 59836 -98252 -185464
21807 -185464 -36215 -272686 83753 -197468 75037 10094 91514 25345 -190427 -435698 -71400
21795 -149406 306740 -70471 -30805 160543 -224222 78478 66314 5557 134932 -556 -440233
21784 -440233 -16316 -177872 300620 -22329 -77401 184905 -54931 -219182 -213883 -119957 -115523
21773 -115523 69712 -122023 -64930 47697 -64602 58699 123155 -59502 -60558 -355146 -69207
21761 50660 213307 51770 154458 -241399 -56349 101525 -88893 -10688 -229299 -187020 506172
21749 -413289 186111 229886 98863 164716 -24664 -313412 -68991 156369 214012 -52055 221063
21737 -79911 189416 -54550 -166939 -66163 228563 28658 104713 217025 -185116 -107117 155805
21725 54044 262499 106646 -175855 49096 323550 -258582 257546 -111720 -56505 18752
21714 -154328 253020 28514 -424861 -152172 140878 -73448 -23720 151658 49672 551 131510
21703 131510 212926 -121698 -188183 -13962 -401975 -104277 -458508 10292 -157970 -33684
21692 -320920 -106766 -120979 -221654 -53442 -46229 -244279 28062 -328133 -77067 90639 -102166
21680 11578 -110488 53952 181035 -198176 224368 -54485 -296872 37627 154026 2178 -44326
21668 -43353 -186441 -102395 -153680 -121900 4342 -167081 148678 -75392 -160998 188966 -224353
21656 933 -205573 -66775 -119562 -142294 99234 182005 268012 197993 -150321 -266433 11251
21644 -81637 62585 206501 -43642 -237929 22531 165379 -59509 -54869 -315288 -161465 371192
21632 -29649 -136027 -64707 231361 -143564 161709 -253190 -101175 -212509 -66179 63043
21621 -193972 64934 60426 206727 -439707 99656 -350406 -300541 -227529 -160947 -175880 206989
21609 127427 32290 -54659 -120585 398145 108889 3408 227957 89753 -288164 -88772 -60778
21598 -60778 85112 35886 -103349 -217179 327096 -11117 246154 53335 218903 -169044
21587 -174804 -77645 -107821 -307077 110625 -72691 -169649 64532 -5960 -162553 -144327 -162102
21576 -162102 26203 -39861 38169 60098 20288 -304244 -180979 38448 -215506 257991 -108022
21564 102433 122438 -75038 108360 43319 -14066 -167543 -287247 -31572 17302 -31041 -131875
21553 -131875 -95715 -318890 5853 -129520 -120530 -89313 -226403 92214 134030 -144422 -170586
21542 -170586 39877 -71940 -321468 -30808 82711 -236064 20017 -206897 134566 -328093
21531 -69284 -144058 142726 -295332 136226 -28136 -74933 -90460 25000 179699 -201643 -316990
21520 -316990 -88498 -158135 -31097 116111 -57309 -48804 147864 -24623 -107942 -27889 -232804
21509 -232804 -14026 -186231 -39355 69242 -86962 195941 -259755 -108285 90396 -24952 -266743
21498 -266743 17498 18369 -243249 -346109 -214675 173134 -139620 -45410 -48854 -156547 22529
21486 -86035 -302456 96366 -20470 -1278 95457 -224537 -89600 -102427 -145872 -345366 68351
21474 -8140 -239056 57362 -111765 169543 238957 -64899 -53215 38574 -243296 -134103 123471
21462 182643 -244714 -109582 -187380 11012 166611 -202164 -106132 -131536 -276331 81769
21451 -249577 -15678 -25523 119995 -47316 90869 -205257 -134319 19579 -326953 -245027 12966
21439 -137127 -126178 42786 432691 607332 613494 333306 157945 150710 223463 249592 -4362
21427 -112451 -113468 -283120 -342484 295789 17606 79558 374538 -38566 195752 -293012 -152693
21416 -152693 72791 7629 -259630 -42795 -224819 -1032 132293 -213854 24224 -3083 -35505
21405 -35505 -165729 180087 5016 -136780 -168660 381136 -36478 -158153 52328 -266433 -158028
21394 -158028 -67800 -184982 -321330 -7407 -152072 -102743 105612 77645 -192342 -369451
21384 -369451 -78245 -134476 191496 291779 150854 48439 -339808 98702 -46133 136746
21373 -320817 1990 147572 96615 -5585 -2143 -329295 -135899 90566 22343 -35154 -33474 301614
21360 -58451 -194147 -69763 -177407 -20508 -32516 18715 -44292 -51229 -184539 -329441 59057
21348 -112610 51765 -91890 3589 -13162 -435835 -134001 -21292 -95841 -280835 96738 296084
21337 296084 4725 -150046 -259258 68531 -11447 101500 -163671 -505047 -170779 -28845
21326 26785 -103299 150262 -109487 103201 -531732 -166698 193487 -348572 203641 -312687
21315 -60676 -186212 245380 -211245 -360 -269220 -34292 -137616 -145165 158540 -86221 -247515
21304 -247515 41710 -140708 138278 119733 357685 -553155 -242928 -198648 -29679 275708
21293 -294975 -250026 157383 -683073 -346246 -185982 -190568 -328081 155091 -36692 -35466 -226214
21282 -226214 271410 -247289 19807 97163 476231 -151506 -196999 -16827 97328 -115541
21271 -218080 -161077 352191 72152 33971 -18577 -303877 407107 172949 29424 -72331 -175798
21260 -175798 37994 55547 -132241 -133458 -268902 -22510 195090 70407 -42433 3598 238387
21249 238387 9578 143236 -9845 99749 -19476 18968 153107 3121 -223284 192748 -149657
21237 130161 134741 -57406 -228379 -193178 -72849 -110097 166495 -80804 -115290 -237390 -187763
21226 -187763 -173642 2694 -160965 -151741 28011 -95860 -322738 40212 116646 -207733 52625
21214 -51274 100515 202144 140853 -276140 -33299 283190 -86272 -133962 -202713 -477561 -198002
21202 186123 -177832 184857 96823 -193632 -211559 -311625 -177075 23039 175354 50191
21191 162038 -161369 -306806 2040 27213 160310 -317556 -22959 -48374 16625 -203142 39480
21179 63922 -73446 -209090 106613 -141244 -137142 -219353 -204739 -149546 -158743 -57906 -85880
21168 -85880 56877 -98599 -38864 49016 196484 -42345 -71919 -108814 -30350 78374 189386
21157 189386 -35057 -194644 -196732 175969 156842 -645 43370 74818 -116879 -45382 -26146
21146 -26146 -268986 37081 73634 69406 99425 181511 45788 -154005 -99508 -142170 -23645
21134 117704 -63511 -14059 -166226 -220994 111429 50139 139177 -130208 -163256 -237792 -198742
21123 -198742 -92760 -189964 -114798 -158126 -47152 -132147 34966 -328984 -189310 -386856 -266420
21112 -266420 204997 -142836 277347 -37458 211122 -78075 165804 -223358 7827 138980
21102 138980 -174754 113151 -255940 -318691 74472 -195752 -146519 58146 320377 19751
21091 -94263 -204667 44355 -241980 -113040 -159300 207032 -34939 70505 -47205 -30504 -375618
21080 -375618 -5118 67201 -101590 66738 -54696 -12231 -226677 -169634 -138276 102765 2996
21068 -34979 91885 42566 -271200 -147623 -9487 -113054 -214854 -82193 -3099 150278 -136925
21056 123852 44972 -1546 -446465 -309812 92322 -448362 -405814 4789 121764 -184871 -223722
21045 -223722 -353864 -233574 106960 -156137 -65220 -86970 -210870 61296 -105381 100576
21034 -277403 -41361 320613 -184661 235011 81941 144504 -27152 -242786 -157988 10388 128604
21023 128604 163940 -212479 -245170 -51178 -162726 263431 -13539 303316 150671 -313671
21012 -26511 165761 -135740 -98653 257756 21020 267893 96876 472400 146350 140652 271745
21001 271745 150234 7436 -250932 2523 -380821 -95056 -65344 -92749 -13292 -125210 134245
20989 -27168 -138171 100195 45017 -189779 -173958 117440 -370741 -144176 -140860 -14782 14106
20977 9946 -80101 61129 4044 -350530 354478 -264907 342182 -232067 47212 67748 135043
20966 135043 3852 -108068 -184403 86688 -294903 -134297 162947 -27158 -145829 -15054 55240
20954 -307114 -317501 -11321 -149187 -210905 269011 -115806 80742 68417 -254925 -164324 330858
20942 328679 375144 497300 214030 38422 216206 42657 178730 -209862 -14999 -251184
20932 -251184 -14280 -118262 199145 -227686 -148150 167269 1219 -274407 -146000 -342868
20922 -342868 -43996 -173892 -243286 -194545 52995 -43665 -29601 -282718 -299039 51782 -189673
20910 37011 238915 -372362 -126664 121764 -212957 29374 -401365 -112499 109790 186603
20900 186603 -475691 -66132 -208194 97747 -77243 88411 -284051 -155922 -84190 89439 -12844
20888 326652 -68046 -285645 -16720 -187612 -223856 18467 -296221 275812 -78545 -196608
20878 -196608 -64768 -288046 310894 79257 -173841 -187163 249573 -262043 -238036 -106614
20867 -327460 -16225 10306 40989 -325040 -68091 -61771 127491 255950 1514 -79500 85843
20855 99717 27656 -51305 -164366 -78072 116909 152386 -83790 -324766 -226916 -219850 -1531
20843 179975 -92707 -65267 -274755 53583 -237874 -47595 84865 -33646 152089 156305 225821
20832 225821 133105 40634 -348942 -383090 215633 400210 50452 -132728 -63242 133885
20821 -147006 217339 66398 198897 -92339 22876 -172617 198853 -283993 31238 -284934
20810 -222186 -233993 55329 -293454 -55326 -21633 -64569 108266 1675 -198079 113408 -135782
20798 171384 -196274 114140 -83052 -305899 6404 -137938 -61338 -169078 -58636 229024
20787 39384 117094 -118923 27087 23359 17135 33874 82113 17785 -333967 271240 112184
20775 40808 133889 151490 -106644 -255259 -98593 318988 -224892 99360 371505 61348 -108335
20763 -26230 -90501 -305305 59882 -244906 73922 -83877 -147707 220783 -62778 18797 19870
20752 19870 -208365 -120140 -128892 407218 47679 7220 -397021 -57465 89421 -53888 171567
20740 -72427 130740 146727 -52486 -208577 2291 -106251 155492 -573889 -104217 66590 -374816
20728 -191727 -74894 -50337 -305608 -88060 -72951 74305 -323487 -379537 135534 -12972 -33073
20717 -33073 27746 39304 -89520 39439 126290 -65193 -314272 -216939 -159399 -41600 -41708 -73907
20705 -73907 119694 -205397 -128829 -60211 -216255 -255021 53945 -174702 -193378 -20694 -25948
20694 -25948 227436 31045 -58877 -9752 138239 -7247 -17598 -6200 -224759 5576 -135219 -479800
20682 -479800 -72939 -123185 39482 68484 -192584 -14279 -345280 147458 184394 -265675 56194
20670 -59153 -120462 -255373 -371082 -126075 -321800 34494 -276735 -1469 41297 -461041 -90703
20658 -39290 155050 -310859 96018 -101714 -276328 295242 -154798 -207053 -113055 -241967
20648 -241967 -51682 -272969 -159270 55705 -336147 -238187 -218249 -50152 145184 3682 132202
20637 132202 42603 -19726 -290586 -9446 232488 465140 -3285 -220830 -105337 44103 -153929
20625 57664 63958 -93031 -491148 -17187 -255996 -320336 100982 88913 -182749 181100 7144
20613 -31948 -29225 271282 -55028 -465928 -136455 -217980 -151707 57897 55779 -484101 -167602
20601 -75098 34000 2016 -145028 116882 185463 -163923 -170162 6630 10683 230688 -37125 -246599
20589 -246599 296475 339398 -36008 551752 -22706 187869 -59739 -24545 -57483 -337114 204680
20577 -208702 147942 -38451 255570 -60631 -229908 -157096 123671 161551 -132056 10186
20566 80738 67591 1421 -164148 -119959 67656 277518 21283 4578 252873 -226363 118036
20554 67737 352232 -23474 -45371 -239544 62187 68932 -267320 -483628 146148 -182983 -117098
20543 -117098 -454679 -410354 416760 6384 -42810 29976 -38926 -370331 88970 -220812 -207967
20532 -207967 -247090 -11172 -153644 -167633 -249919 96071 -32579 -65740 -13436 216081 -21812
20520 -251665 23132 100584 -139772 14176 -4786 139326 137016 60047 -117307 -157045 -104793
20509 -104793 5628 -267367 -148065 1315 -69566 -316949 35074 -147406 39173 13425 174852
20498 174852 -50251 -65569 -284596 -260773 141323 48465 -60542 -349533 69001 62824 51706
20487 51706 13541 -32913 -144184 242289 -91461 73986 -50124 85481 107336 45207 185850
20476 185850 292388 264247 -13186 -37187 -21900 -432237 -491165 193973 152004 -319000 -304722
20465 -304722 -178061 158467 230364 -7043 271563 -26365 -309400 87505 271865 -90038 56848
20453 63306 63847 370063 -7078 -34527 113254 8229 133877 -236518 -144189 -112991 -251035
20442 -251035 -49136 155016 -151559 -87334 101265 -91928 -70076 -86564 160192 21398 13256
20431 13256 -341486 133862 336707 8782 -217361 49106 87541 -110650 -157262 35021 -24850
20419 -127719 -100565 118245 -48714 158218 68642 -122139 116744 115473 -307991 -103424
20408 -304080 -83489 92258 -307909 75527 -427568 -258180 -161504 -32996 -213370 1006 -131824
20396 13955 -169574 -151782 236287 -95979 -3835 150155 -119235 -294468 90406 -373473 -202747
20385 -202747 -256986 -188025 -236424 -267226 -109089 -6042 -311543 -249171 -337036 53609 167873
20374 167873 -261102 151494 30060 52119 86038 -154874 191368 211145 276136 -311481
20363 58432 -131034 -214197 -165023 -166193 -216564 315931 64296 -36511 -384306 -115680 126159
20351 -93981 -51448 167994 -75410 -56049 -62047 -125352 26463 -165619 -175955 -72209 -65914 181420
20338 262191 121040 -52028 74950 127689 -84353 -58034 -135755 -32344 137001 59734 214648
20327 214648 162725 72253 -453484 -92235 -190004 -59561 -152439 32315 -161713 -70145 82267
20315 12323 -237102 -357517 -239791 -108186 -146270 -100590 -164818 161835 88556 84860 -190429
20303 -230791 -110655 44109 -156818 -175397 -19699 -242612 -100216 -75886 -138108 -53090 -35772
20292 -35772 -89382 -97151 -145911 10486 -168846 -155689 70730 -168565 276205 -357159 5792
20280 -227531 -200682 205493 -180424 -314239 109071 -183768 -140522 -314626 -163238 -160234
20270 -160234 129917 -73591 -18120 -241498 -60061 -206981 -107901 -203024 -292114 -385282 163119
20258 307736 -550610 242 224912 -101459 -108416 -149556 -95826 2590 -237148 -4129 164984
20246 214460 95023 -84091 -200447 -92190 -24811 28507 -145578 -131555 -218061 185655 -116198
20234 187725 270229 352365 -100549 -167315 -15611 66842 -295535 147745 -433866 -49317 27367
20222 -272108 -316620 137955 -412225 -145856 202344 208224 -363076 300853 145754 -83224
20211 114397 -369115 31251 21296 83894 -8007 -508786 -131419 38741 58780 67474 82024
20200 82024 109505 66671 438199 159684 441052 -225110 -151303 34624 -186973 -52319 -323601
20189 -323601 -13290 -75143 -6481 117047 -195933 103540 -279656 -165062 387908 3414 -82644
20177 -185976 -23777 93499 -111459 126502 134047 77502 -13896 -148921 -141582 74656 -55409
20165 138445 -130202 -245624 -280582 -6081 19726 5793 299923 1984 197373 139720 187313
20154 187313 212870 61715 -145045 199716 399974 -89768 376034 112215 462571 218439
20143 357954 32801 344598 431893 445661 673718 799532 293854 186157 129873 276925
20133 276925 33799 -151197 37410 -210263 -57427 -163299 -55276 -152258 36930 -441617 10745
20121 -76798 -318077 -1132 154543 -45582 -249366 157622 -204009 65138 -162839 -450633
20111 -450633 167016 -8800 181630 -110007 -18334 87760 -19389 -3965 5284 -144850 60364
20099 -48365 -6387 -308188 -144472 -153374 -385279 -301786 180318 59587 65904 124565 -345443
20087 371803 76402 -252443 -90323 -49718 -145287 -255499 -68529 -265962 -100624 100290
20076 212288 -324292 -230077 22649 129929 -11488 29925 -19787 -8182 44248 168546 -328976
20064 -128784 -13675 -70708 -400297 -455995 -453715 -145690 -218087 3674 -127894 -71954 70896
20052 -413453 -82996 -104128 -21746 132860 140515 -172462 -3841 -47289 -103273 -196505 -58814
20040 -359114 220689 -3019 224705 -246458 60026 165675 144967 -75362 -77068 -196329 31942
20028 -215601 -123894 -22095 180861 300679 -31525 -168886 37599 309018 -345735 49908
20017 130113 -7300 -42396 -27430 142674 122246 -108083 -37597 81446 253928 157653 -330311
20005 8461 -156657 58794 -174643 233463 -46808 -223914 362292 -2945 87238 -16127 239062
19993 -5613 -137108 55589 391477 -48748 117794 230039 -76857 -146927 305140 -190068 184823
19981 -394436 -194981 -99521 215196 86722 -87467 -48757 90460 -90718 -165975 28273 20061
19970 20061 49253 129985 54856 -74117 214771 -112146 428891 78584 -31854 171028 163649
19959 163649 442789 34296 30429 185808 467911 261582 -17894 295858 41380 173750
19949 173750 -94756 -356018 228410 -137405 225514 -326232 -32451 2560 -306399 -103418
19938 -430378 -115637 -315095 -101823 -32920 -124627 50135 -331445 -192683 -145435 -44682
19927 110432 -92650 -280385 -100566 -22999 -160128 -90345 -136684 -102939 308789 141507
19916 -98912 -122330 -210519 -107957 -8637 149547 -165144 -84401 -266954 444203 -391770 68916
19904 -289306 -110652 200283 -120941 33087 47478 -286938 -198174 160924 170106 50030 -10516
19892 -272850 21967 314561 -114276 154880 -53835 -73497 322394 -245659 -52910 181382
19881 -112830 75897 -305208 151736 -89342 -37709 -15381 201485 -176652 110288 42077
19870 -461659 -394705 -531982 -148378 69290 -189418 -229110 302569 250024 -139025 -268920
19860 -268920 6224 22758 -268405 -47626 48509 -324992 -190074 15621 -184492 87227 134721
19849 134721 -342000 221297 215225 -423201 -245761 -217760 -72476 50925 -34 44401 -313802
19837 -338168 82343 174025 -154179 -221867 130044 -155349 -185311 -19825 68294 -168753 -229957
19826 -229957 91318 -273575 -256925 75814 -90860 -288318 169411 -186327 81856 -450572
19815 116892 -120528 -148965 214046 -166425 -143909 -366635 -210026 17729 53745 -198807
19804 -279802 -383805 -11979 -213308 -56488 56687 13950 101355 -38480 -62021 -29367 -10924
19792 -98200 -181901 9688 9998 -51616 -143156 -312010 -63515 -171239 -76443 26298 -75554 305828
19779 -487200 -193346 52352 -244288 -150205 -156575 -4875 -120925 229399 242327 -54456 -154751
19768 -154751 -278757 6424 -213274 -60345 2387 -30667 -204681 129658 35684 58681 -209993
19756 -39172 425965 5504 -274469 -252642 -119585 239368 64902 127616 218068 -138207 37625
19744 -209245 -14314 99334 -448814 -11033 -177866 107585 56304 123292 38413 -97787 143962
19732 -104457 83800 69634 290034 407615 633305 348630 227787 490654 156155 250655
19722 250655 252798 -101733 -190363 -164120 39537 -188753 185350 32539 78056 31535 -34044
19710 160288 -112822 -36792 131969 -141606 -137907 -180246 -294316 -513552 6364 -206696 300235
19698 152898 311574 437985 666650 -9178 -116723 77474 -2977 115697 44263 -160398 -57586
19686 -164547 -120738 -12915 -232990 -44573 -163611 -78305 -9739 -257749 -2877 60510 185027
19675 185027 -302787 42093 49247 94040 -5309 135006 -67868 -16195 -61633 99132 122058
19664 122058 152863 65369 33672 106525 -238300 -201032 127574 -328897 180806 -54325 43577
19652 -43967 -176267 -459224 -263447 -144004 -61779 -30614 13951 -11174 -13359 -432533 -211731
19640 207187 184267 -274153 152491 -22400 -221890 270325 -152056 79046 -115959 -92587
19630 -92587 -23942 17707 26904 -237987 91959 171799 55870 26559 -301745 -156435 -38375
19618 52157 -78701 86024 134793 -73020 -453360 -30248 56976 152467 143722 -239068 38195
19606 -143848 -156131 -111070 -139354 -384955 -115352 167209 -48153 -93127 -92788 -106495 -225031
19595 -225031 -339141 208842 -67035 -234785 164683 -224335 194574 -9303 -281793 327774
19584 -161151 -158322 -107872 -366095 98296 3301 -145991 -377648 -300694 -373190 170207 33526
19572 -81049 -253603 -89055 -53806 -38218 148556 -201975 -209698 51578 -74601 -311764 86471
19560 262049 -21421 36053 169460 -174138 -219285 42696 74591 -223211 74334 15101 16888
19549 16888 300934 -61646 236312 -201841 7169 -371799 -366975 -289079 -279384 165346 263521
19538 263521 -267209 13668 83139 105414 24603 -2549 -326743 23233 -204350 -60111 -16535
19526 -11982 101789 286099 -212876 -249120 66396 -383210 -20775 -42296 90822 -61209 18836
19514 -216223 -36683 -290395 175052 -150515 -146418 59453 -247540 -101363 -127511 -182420 -369840
19503 -369840 -133281 -38386 218744 277916 -18961 -324548 -52883 -116596 -266747 -428794
19493 -428794 -108076 -228854 229417 -31777 462005 -88449 88832 -27602 -238691 -242782 -392601
19482 -392601 202753 -62166 29465 -215220 -675022 -42029 -5880 -252609 -8491 204064 -27078
19470 45803 -92384 -445842 107141 -307374 112870 -162866 -411246 -445901 -308331 15644
19459 -199568 -423180 -61468 84673 -251503 -206820 -215920 -36242 38894 -115164 188004 -336109
19447 -206770 10203 62218 -101817 105862 -167970 172271 -154738 -275129 -309437 -197353
19437 -197353 -285427 49061 117072 -107653 1812 -6208 173552 247577 26271 -199236 -5136
19425 -142807 -327053 -237904 53582 -187900 269335 -239705 -57701 -69717 -123683 -88735 -139393
19414 -139393 -12041 -99416 53008 -346215 -83689 198863 -178229 268639 -82369 56996 -116227
19402 -99710 -288535 -123880 -156495 163940 328613 -262454 117168 -186864 -135879 43504
19391 1366 -32030 -33346 -106987 -141874 -164360 -231264 4082 28999 -32370 111499 -167120 2761
19378 -96177 175176 -184980 -53714 -311021 64262 -322492 -15538 -179423 -187100 -134204 -19346
19366 219514 32594 -289285 -22410 -157240 -117127 -84557 122809 -24521 -260038 -45952 305008
19354 -366996 -105872 -147392 -161399 97846 188340 -97669 -485251 89084 -246487 -73311 279198
19342 -373034 -56550 -14843 -60838 152051 -70965 -51825 -356736 63487 -3182 -181956 147679
19330 -208445 -164329 -159428 -265781 -298440 108621 227655 -92222 -167689 74670 -153731 -84495
19319 -84495 -3761 29446 165683 9164 -137309 88945 -88998 -313177 -951 -23257 17447 24470
19307 24470 -2730 -138586 -190429 -319935 146002 -89075 -412857 29554 175573 -13229 -192716
19296 -192716 106716 67761 -243114 -158347 -25067 48128 62644 -106239 -323519 -236778 -413947
19285 -413947 -195460 -401779 -37040 -233096 -87889 306891 29993 -3261 -312067 92885 -295
19273 -130535 -34638 -142406 99439 471704 25981 -267498 -175838 -7717 -16970 14130 -10688
19261 46750 21671 -361963 37979 -171373 -40691 146961 120457 366779 110471 -70931 -118965
19250 -118965 -72192 113473 -376766 240798 -159387 81947 -39022 270074 113670 55193
19239 -81894 -425056 109846 -85349 507 -330466 -29127 -166566 30595 -211896 34371 -154281
19227 225812 -16549 -6393 74047 -580088 -32645 -40135 123595 25446 -51230 -46646 -14469 -301224
19215 -301224 117652 -24498 28743 -260793 96717 -144243 17802 -249620 -179238 -389903
19205 -389903 -94966 -281467 187220 -107726 177497 -143389 -46822 -435444 38225 -105029
19194 34080 -109271 147899 -89436 -364953 -142871 18414 -364216 -114404 1736 -101516
19183 129404 -231091 -444024 46996 -29196 -256843 96491 293505 -242619 -13451 -39166
19173 -39166 -289029 42152 5392 263246 -94895 72471 -246074 67515 -6269 -222514 -100634
19161 -116523 -296832 -136465 -298353 79152 106314 -190291 113517 27217 -139059 -43991
19150 417725 94552 4795 -38421 -212825 167308 -198043 -213488 -24370 -142326 81127 -441489
19138 -266813 -79503 -94824 -256349 94136 -283188 99587 19610 53547 103557 -113806 -383026
19127 -383026 7540 -111667 -95355 126612 -32751 41654 -182687 -174508 -228120 202340 -169358
19115 49276 86251 210421 -33664 -450409 -118897 23461 79909 -93584 -172444 -467853 -527338
19104 -527338 204073 -4448 169075 189029 -355932 406397 -79070 -562172 88209 -368141
19093 -40094 -67876 -73392 15530 -260867 -76603 -421136 45534 -16418 -78791 -91336 245414
19081 -242354 -58630 230788 -39322 287915 131771 -77022 -83529 -169075 -78742 -34257 31017
19069 42839 -111853 221156 -250039 190749 134010 55625 -203450 -178032 -11485 29561 -407073
19057 268749 -318409 -32777 -177654 86497 16034 -445787 -196865 -87007 -152829 142190
19046 -174748 -243716 -82146 126759 -369042 1000 -145636 -218163 92656 -388459 -30965 -216469
19035 -216469 -112203 175011 -306116 -45311 -210577 118763 -3856 214308 -29742 -358588
19025 -358588 -237821 -44314 -92011 -58681 -261438 81582 -59300 236555 -188007 -81763 34193
19013 27591 -12017 -370160 -116909 254027 309366 245817 144864 -155108 296341 -26920
19002 -123602 -27054 -157554 62738 -136855 179039 311488 -148210 -118692 166497 -173950
18991 109132 -98199 39857 -164080 311169 146589 125886 -302030 -132799 -110211 -239768
18981 -239768 -10382 -346106 182905 -57836 -56332 -42225 -228650 77970 -36793 9495 311083
18970 311083 419595 725116 394371 228145 124406 158387 -46909 -385475 -145497 -50294
18959 -101114 -18774 -5181 -59064 -61910 90128 250405 -388410 -114105 12607 -181406 32367
18947 51459 -64969 73094 -101912 -208798 -191532 -61456 -190796 -19435 98753 -115219 -201347
18936 -201347 276386 -195205 -151687 52662 -243840 -86813 -100316 -41246 -211212 68094 -110021
18924 -146744 138952 343063 -60493 -272938 25035 -150076 376909 129385 -120363 30522
18913 -86465 425469 91476 341129 164151 298166 533510 631573 592765 756702 59546
18902 179782 54376 -419411 299325 174200 -132345 -143286 -160637 153714 35728 -287802
18891 -78772 -68498 -25737 134902 -295794 -31417 -270525 158931 -24864 -285575 -289637 92133
18879 -323361 208356 197802 -7469 -198557 -192993 -202420 73754 -1045 -121846 83296 74268 107273
18867 107273 117394 -136657 198814 -111039 302397 -111925 -53570 -162214 32168 144594
18857 144594 -44849 44462 -159998 319640 -99621 -151287 -61468 -275583 -78672 -141558 -111986
18846 -111986 -40825 -144857 -158040 161487 80749 -27329 -79319 141423 -7214 -13080 90221
18834 -396124 -177620 27859 55753 317080 -70112 35402 161393 -117606 -216842 -108927
18824 -108927 -293852 238701 -204058 -90266 133195 -101220 -211325 97415 -31073 141439
18813 107680 -187796 218102 189339 26296 165708 -79848 287239 203270 116693 142718 261828
18802 261828 276642 105127 140292 52625 -300033 -72130 42525 -87886 -105424 -282592 -217471
18791 -217471 -3777 -168022 183638 -179247 -94507 -157096 -186282 123483 -40867 -88332 -104654
18780 -104654 449084 -61072 -228072 -63235 219118 341754 61878 163459 3418 -50364 -158827
18769 -158827 -205478 -173627 266598 -391370 -4141 -286281 -221719 -125447 63535 103322 -575873
18757 -57600 -17939 -72398 -306276 -332788 -130235 -97893 -275625 -106134 -222101 -151561 306548
18745 -53433 -262572 94867 -141515 -261528 356 -266786 -27687 53477 -215113 -39467 -22294
18734 -22294 101953 219446 -234133 -192471 -290693 -452299 -51846 81677 112005 -86282 -265544
18723 -265544 46671 -339643 22735 82355 -72536 -38326 -50197 -32732 269653 70993 -97441
18711 51614 -142001 -8231 -7331 44745 -11900 -105031 -72098 132894 -268702 -311590 75138 -154917
18698 -32382 -119840 34469 -244609 -18436 155481 -227382 -336230 -158264 -374647 41739
18687 112960 78089 -339944 -259767 -20230 -158080 -21624 192933 53543 -26472 -27617 72423
18675 -182194 -113332 -93852 -481 -27499 50338 346459 -347988 -92150 -200201 133879 -220910
18663 -91483 -288038 22102 20432 117734 -41444 -108524 105722 48112 -82993 -512853 42045
18651 237552 74957 -135791 90795 -68041 -328171 -75742 -182908 42232 132420 213861 294865
18640 294865 71622 40424 271569 130535 -120938 -26256 -65892 117248 -94176 -61714 15788
18628 -252060 -51372 -392105 -322478 287589 1126 -5817 -49429 -210411 272339 64077 48098
18617 48098 213951 42748 -299449 -169690 -358667 -37249 89494 69532 16466 -7861 -303210
18606 -303210 27066 186925 96151 126808 -65579 -317938 102805 32807 149716 65982 -124990
18594 2833 -355076 -71196 -340599 -56237 115206 -74985 153137 -231669 -113839 -55690 -33187
18583 -33187 234149 -302026 -184167 -314231 -17673 57300 -236176 129416 80777 -184316
18572 334228 -113348 -269696 -256366 -23105 -19313 -400947 -265803 36672 -58586 3462 -134871
18560 -27697 -183432 112702 -124491 -98633 -97920 -88483 -469568 298149 -218415 -212065 -208474
18549 -208474 -55274 -43027 85002 -131002 -258249 -30567 366939 290076 -510462 -418196 -84687
18537 -269455 2519 -116423 -48385 -170424 -80311 -36017 6091 42318 -129090 -101802 250133
18525 -245637 -202103 -27043 -60078 -79598 -60242 28865 -273643 -30562 178107 -251485 -198767
18514 -198767 235255 -530355 -58238 327738 306758 87031 -137281 -92762 -93768 -161265 -64908
18502 -246260 119794 140907 -183968 -111950 110382 -148942 -90729 -231944 -27766 126786
18491 -64918 -88986 -94376 -68531 -144019 49665 85735 322896 357718 -217393 -183363 -374576
18480 -374576 178271 415147 -182981 -128704 -106914 117237 -180986 -77887 -154382 49627
18469 92389 74280 197678 -33771 -90876 -140475 -56490 -154212 -145596 -100719 -276923 -96100
18457 -335816 64183 180226 26620 -5913 201411 98160 240930 -98227 33494 274154 -4028
18445 114399 -479814 165043 -528986 -47149 41765 -413205 -30430 -110814 107912 54267
18435 54267 70237 76729 -356269 148188 126533 182752 -89514 -256593 310 -133793 34559
18423 201546 -417195 35874 81715 172576 -17417 323411 -80674 7097 13572 -220747 -267781
18412 -267781 -277723 -264196 70722 -124212 -111823 -298939 89084 -11355 23380 -336252 196576
18400 79419 76495 121732 -305763 68734 -7048 225450 209638 -25820 34558 25820 8271 -342937
18387 -211802 -33196 -903 -8360 -334805 215386 -107991 170193 -101286 43575 250286 -172928
18375 -289002 31903 10395 -279580 -224418 228275 -13431 -265394 -83615 63001 81514 121563
18364 121563 -87108 171571 -473 -181621 -421866 160815 61007 -49992 -136995 -97403 -163116
18353 -163116 -198926 -171081 -212510 -341239 -37809 -285035 -111794 32909 -157605 -280456
18343 -280456 -127573 -188569 11053 56526 138611 -145511 -201819 -17248 102497 -103018 183291
18331 -306661 13046 213036 69544 -428311 -239781 96717 -282349 134306 -203707 -27844
18320 -87818 35476 121911 116049 145257 -11916 -66704 95885 142959 164690 120621 -118408 -76717
18308 -76717 149858 -148363 -329250 1960 53429 -128065 -135384 -268980 135180 -70944 -186229
18297 -186229 -102730 101364 -79974 6027 -242273 -131443 -345303 153620 202548 155086 9214
18285 -102352 340740 -4925 -46795 -156061 -105843 -73928 -418084 -82664 -237693 -207730 -17581
18273 -92439 -26741 -89551 91069 -8641 280538 13792 36798 159331 -135049 -83767 -171272
18262 -171272 -91647 -16381 48086 -51984 213928 -168700 -193836 -142895 -171320 73650 -116404
18250 -10571 -2663 -541 215170 277453 -193868 -226913 -159995 -6415 -228365 113799 -97717 -126046
18238 -126046 6812 40590 -239298 19401 -215697 -8812 4540 -22913 126805 -312010 -80547
18226 -25830 -195154 -305579 -44896 -93809 -2538 -306287 -147982 49372 -6882 84955 -133832
18214 -152958 -315258 -72877 -143369 -7306 134508 -214058 -158887 -43904 11157 -113987 -127438
18203 -127438 36142 -219321 103122 -24463 310990 -37675 -197107 50964 164814 -406918
18192 -36204 291666 -60642 -21235 -68587 67526 9053 -156275 221633 -122284 -187989 -8274
18180 -73008 73392 -326615 4032 163160 -375957 49133 -195067 218211 92377 -151650 68106
18168 239257 -204806 -206863 85212 75632 -161682 -5080 192139 -33964 72942 36887 -86455
18156 -64607 43100 -359969 -538657 -62505 28213 234675 34017 179462 -302014 371881
18145 -320620 -119161 77460 217677 -2573 -166779 22784 -271721 187813 -218089 -193100
18135 -193100 340042 10421 4523 141915 -56170 145647 -25505 49661 -126979 -83816 184421
18123 -158289 -12809 -126792 209285 -160685 116091 -29033 88253 269851 143532 11459
18112 -98157 -270911 -207271 -345648 -189575 -140254 -26766 -153922 69144 -98287 80207 -64681
18100 -97625 217716 -212630 -92452 -52877 -101281 -122031 273908 56000 29433 -95657 185757
18088 -1133 50308 -207102 106913 -63259 -40330 -233186 206982 18726 -149846 -118777 482577
18076 -92320 131243 75396 118005 -23919 258880 407132 113319 106039 327625 -241141 -304879
18065 -304879 258847 92769 -183447 168783 163273 -138755 -174630 -269400 -398155 -216951
18055 -216951 98867 -234069 -249816 11827 1133 253844 -120830 195333 72336 226769 26437
18043 -15670 -371701 33214 -5366 73428 206043 -65062 -330120 10665 -119040 -7908 -97402
18032 -97402 -117741 17494 -167801 -45569 267142 -212505 380924 133952 -15656 -57281 341677
18020 -43217 168319 -53401 204516 370540 18985 122183 -46441 129115 -360458 -99270
18009 -14860 -215696 -181383 -266867 207438 -75898 45213 474896 76115 1245 195074 -53603
17997 -93800 250688 -180860 26305 181482 -290829 -6101 -13703 115706 136468 206975 24135
17985 331802 -355199 145266 117024 95552 -91098 -26118 -248955 -158913 -140982 -167982 -108788
17974 -108788 62757 -57090 -139462 -195147 101281 -154575 -181387 -246247 -89189 -179565 8598
17962 68849 -119846 150386 -17105 -153426 119203 179121 145759 -278665 -38638 61014 -284895
17950 -36126 22620 78494 -71193 339598 -72623 104615 62713 -193424 88040 -62445 -220260
17939 -220260 59048 30065 156797 48196 54673 18647 -140820 78001 -87583 55709 -172587
17927 148313 -81064 171519 44863 179261 23081 -24466 152412 -115816 8467 -135555 -147117
17916 -147117 -49673 -197499 108889 -158178 -138259 -91688 -195745 171520 155756 -204425
17905 -19631 -21289 -32811 145190 -194663 317483 -30483 80743 86852 -17124 -101569 414979
17893 153951 36240 -13270 -36213 42344 -215022 167441 -240958 -263082 240514 207081 24783
17881 88533 -114148 7099 -211927 -214803 300826 -184775 -187127 252870 282027 92207 107725
17870 107725 -211548 -42115 -283469 151717 232874 153476 96637 169290 -70042 57390 133582
17859 133582 135037 110517 -22074 -159103 208800 137762 16958 439266 161802 333230 -20962
17847 219451 -29142 -153177 131290 -206449 220578 101296 34816 -18412 140084 -89502
17836 287963 235400 -116167 -84842 52279 -184670 139075 62424 -302538 128660 45846
17825 -116275 250343 109238 -167839 -60770 -26996 86343 927 -13033 163194 265120 -79795
17813 -298289 87632 -177742 -420324 -160211 153943 252989 262005 165284 -112446 -221264
17803 -221264 -79970 -18418 -52272 -542 92822 -72534 -13575 -117510 165374 -134471 198211
17791 -80704 82199 65577 211279 21053 243701 107065 115199 -35653 51453 86856 419887
17780 419887 -99604 5800 46788 -84526 -205713 9405 218123 70858 22834 -34015 134823
17768 -188981 -144793 149164 -45834 -16929 -63726 -227313 -25050 295328 277079 65142 -83270
17756 34334 -268947 13606 71197 105479 132259 148361 35665 222662 136307 50948 -152240
17744 91119 76188 70704 138251 92959 -14631 246313 -23728 39768 164399 162566 -234366
17732 -245704 184808 -48702 14030 208050 -311220 296692 315909 211720 -48197 348182
17721 118061 -47851 -56966 469757 304412 -338525 21936 158751 -133187 -100994 -272993
17711 -272993 72076 147723 -276374 1156 350749 -102015 -33386 -264551 335782 235359
17701 235359 49747 544028 70828 237785 136335 249370 -88950 -155344 147841 -156854
17690 250680 -77469 107236 55769 267603 8273 -20840 173089 -96371 285117 362066 195112
17679 195112 101207 55484 -173689 191839 -117073 88811 -52675 40540 181172 -141438
17668 1353 183337 -60657 22391 168997 215692 76052 256895 94141 -30582 40358 -29650
17656 51721 78851 337713 -256140 -72662 162578 86668 119866 211702 286013 145465 151970
17645 151970 365737 313204 334954 110819 24485 24160 238688 196383 76397 155050 -262454
17633 576054 -6963 183649 79735 68272 -19566 58243 261852 -30821 -85767 166416 -64481
17621 -298503 48787 -56533 181566 -236309 -59940 161318 389416 373615 -102152 -12923
17610 325703 392811 -14615 309947 299370 55077 269019 36951 228657 32894 80117 -173205
17598 -170811 -44787 717516 110582 120342 69869 -265597 139978 207874 58591 102029 495294
17587 495294 -66181 -21109 158160 371934 -37157 70642 196600 84128 228868 125226
17577 125226 -59809 280190 396136 227745 146023 226569 -276872 -350540 -399134 331973
17566 249844 276397 159887 160533 109656 45330 316583 -55418 127222 94122 102029 -138964
17554 40417 -81239 55489 120773 43692 -100637 143064 -61838 579313 -123328 196772 198639
17543 198639 42151 112363 134373 261342 194856 91575 311479 119576 318234 297644 468148
17532 468148 128404 39289 613858 299363 208945 210708 688381 631724 1316999 1303524 811801
17521 811801 1044623 427228 258841 450104 221848 555773 689748 359846 237855 525415
17511 525415 601662 843278 1192358 1106942 568545 553567 657371 90648 270445 468203
17501 468203 275601 254892 214248 359382 482896 184596 360696 144642 171601 499827
17491 499827 266630 259668 506910 128800 484287 409450 291414 331598 227223 160190
17481 160190 191494 300917 265129 382524 -39574 156192 234571 411182 -5173 193124 409917
17470 409917 329423 196823 214873 287862 371219 419546 264777 515553 100591 186164 253973
17459 253973 279166 282993 311040 337624 308511 333378 154877 24826 345973 308847 434958
17448 434958 666815 752296 357938 701399 543804 537959 508096 531455 315601 623903
17438 623903 461569 470208 636950 423170 589185 597264 178191 404706 415541 557489
17428 557489 545419 548035 513227 436673 220711 177210 516754 656885 490182 461184 298591
17417 298591 484936 651320 429496 504258 713412 753998 575190 665272 749143 471144
17407 471144 350034 421196 232641 479856 444279 150184 423906 326207 34489 135442
17397 135442 251268 274324 336940 329470 229539 157116 215172 269248 269197 399949 578438 344391
17385 344391 420884 227331 574842 458747 370076 335548 247777 359580 299170 399055 137130
17373 396176 390171 228248 243149 192992 267396 112229 479517 416029 305902 455431 351460
17362 351460 160751 332919 455190 -7213 487480 129841 284849 318152 419891 136080
17351 319027 321285 176797 290917 90577 10557 395902 88834 191737 166324 211217 97346
17339 66468 126900 325067 316117 -57007 276505 355820 163688 149463 276127 162838 115556
17328 115556 270051 277698 31061 473515 364399 229103 302521 536560 123821 105184
17318 105184 374315 18615 300735 449528 421007 211211 195195 198988 217727 183640 617149
17307 617149 345345 374911 337344 191633 399021 597363 592377 380250 95521 348318
17297 348318 272580 345356 691832 347295 221094 325740 273472 484486 185448 161652
17287 161652 103982 204787 -56842 371671 395276 543502 315409 389926 327687 314721 153390
17275 -120316 157150 345527 688870 436682 51778 16021 446454 394821 308534 280468
17265 280468 472339 176511 2554 663207 28992 666627 671267 126344 -28830 177422 446586
17254 446586 533235 265391 488334 385831 150317 61659 255926 290130 418170 503844
17244 503844 115624 256367 353600 434940 98142 221388 397291 74458 276895 291172
17234 291172 628717 550114 180639 298498 211838 137585 262885 221993 635438 345662
17224 345662 287764 396900 167136 373313 341058 325995 317025 559633 495730 214259 114776
17213 114776 388319 407000 616182 242305 245459 602415 518389 189129 537103 68990
17202 341366 428499 470643 533478 412932 206090 387734 400372 222228 183144 182510 369551
17191 369551 562678 271361 227429 446426 222806 725701 647604 689495 732750 736720 733542
17180 733542 465770 458440 482065 648445 182847 515848 742314 592502 539202 313766
17170 313766 249666 743719 386299 625314 520044 498561 812574 633864 770730 577193
17160 577193 693495 253403 111844 672688 257281 417023 604322 555668 516595 607544
17150 607544 612381 392968 789005 374448 616682 495829 692119 548582 703662 621128
17140 621128 590258 412398 362766 582058 840187 380998 492328 412797 741642 399673
17130 399673 853036 599408 456475 785867 965015 408696 600087 461764 673436 580907
17120 580907 681059 431483 471379 516614 672223 511538 664948 565725 514034 916628
17110 916628 590925 594015 371432 471201 971640 595093 758153 495173 547285 684386
17100 684386 611591 654366 766138 595540 691803 762970 869111 628552 1101653 483204
17089 553358 822923 925546 893006 944308 702255 682953 518948 821987 518635 578209
17079 578209 785069 757970 809035 618571 558163 703870 610307 700566 688819 894503 772836
17068 772836 828017 983831 688995 839308 806213 1158750 912498 618386 679814 952064
17058 952064 817509 1042994 835406 936954 869545 836385 1017737 1016667 1088507 945736
17048 945736 798079 996860 709355 1018490 859148 774110 904777 843125 1013567 887246
17038 887246 1244468 831736 1075267 1052773 815062 749984 1062652 1273162 1032463 1019470
17028 1019470 768682 1073957 1074521 966235 1218913 1134730 1003419 1060957 1014393 1081255 1095223
17017 1095223 860399 1029734 907461 1335552 1068495 953148 1205526 1215735 1175693 1208845
17007 1208845 1344477 1128973 1399496 1205784 1282449 1460822 1437308 1376205 869181 1620335
16997 1620335 1348668 1317185 1326432 1467309 1161386 1488447 1637490 1414091 1490597 1603192
16987 1603192 1695799 1519481 1422033 1536682 1489853 1439387 1396847 1507677 1510536 1423042 1887792
16976 1887792 1503461 1409876 1455734 1683345 1346020 1435981 1444506 1477081 1509255 1648299 1418937
16965 1418937 1778648 1609101 1635273 1508735 1646886 1573992 1541475 1632827 1697728 1913332
16955 1913332 1845476 1756631 1834685 1933131 1656668 2093049 1675668 1959968 1983597 1913267
16945 1913267 2069637 1904667 1907001 1832850 1962994 2008433 1938652 1800930 2162006 2028883
16935 2028883 2072548 2178387 2358440 2206509 2021408 2414949 2035500 2264725 2233058 2355661
16925 2355661 2116894 2422336 1774266 2667816 1960554 2212972 2314491 2750812 2376874
16916 2376874 2778745 2382157 2718836 2653291 2541970 2664004 2830496 2834770 2506492 2855676
16906 2855676 2831365 2885281 2805566 2844296 2999557 3049593 2926418 3127730 2976244 3022565
16896 3022565 2994974 3059853 3049816 3020770 3390239 3517001 3239497 2981107 3240332 3409354
16886 3409354 3168194 3265019 3470558 3420342 3620682 3251987 3515370 3700076 3556211 3628794
16876 3628794 4061939 4247997 3841269 3597422 4046359 4191482 4237556 4156278 4585082 4298437
16866 4298437 4442708 4457001 4156462 4478667 4257926 4447664 4419325 4767934 4628010 4896833
16856 4896833 4850971 5027909 5030841 5166844 5370645 5111856 5287788 5618797 5545625 5624801
16846 5624801 5838467 5843526 5724053 6385885 6426808 6433982 6434010 6164905 6823874 6847270 6838475
16835 6838475 6662985 6904190 6890655 7084618 7149827 7752441 7434799 7821378 7889764 8150021
16825 8150021 7956884 8347019 8509957 8530439 8538680 8856514 9252146 9367290 9317568 9572214
16815 9572214 9572108 10018354 10272045 10366476 10398725 10803992 10915518 11645715 11572139 11650062 11870200
16804 11870200 12110875 12605530 12747152 13274878 13531373 13802886 13887142 14519237 14794705
16795 14794705 14929198 15787479 15692789 15988083 16080654 16764284 17688710 17768309 18428597 18425474
16785 18425474 19484441 19579065 20626165 20762269 21160811 22033278 22779797 23185455 23887911
16776 23887911 24939017 25623785 26265199 26662436 27561862 28895634 29436791 30145881 31321387
16767 31321387 32433829 33253670 34792806 35941819 37012476 37820543 39603188 41102604
16759 41102604 42132140 44012047 45502237 47082569 48657887 50446929 52492319 54510359
16751 54510359 56630735 58672586 60542764 62986880 65298472 67976496 70520671 72855789
16743 72855789 75887247 78818575 81701678 84340652 87289632 90324496 93437127 96591732
16735 96591732 99533293 102486195 105758167 108534939 111089049 113552056 116066929 118809841
16727 118809841 120253277 122113587 123273695 124829108 126023100 126243273 126393172 126289254
16719 126289254 125765363 124888373 123484649 122061142 120387841 117999683 115601010 113231085
16711 113231085 110712768 107599908 104799941 101548142 98390922 95117934 92257055 88839834
16703 88839834 86064356 82951533 80149515 76826436 74450948 71627596 68700821 66383230
16695 66383230 63502269 61220708 58813816 56955490 54691474 52444515 50697684 48889190
16687 48889190 46967716 45076423 43722734 42145633 40470162 38841936 37282989 36471386
16679 36471386 35025309 33916470 32649027 31413226 30601073 29412500 28632517 27644531
16671 27644531 26849965 25820953 25227583 24466767 23485030 22906647 22455318 21396582 21015259
16662 21015259 20215737 19956540 19157816 18810250 18222372 17752111 17197885 16351476 16058695
16653 16058695 15892567 15247366 15077676 14402274 14271192 14158508 13784790 13096106 12895722
16644 12895722 12498363 12031546 11980405 11514080 11471958 11015636 10891520 10476066 10424906 10308571
16634 10308571 10228043 9673272 9678418 9293686 9157122 9028210 8861261 8412630 8415665 8149536
16624 8149536 7960090 7465543 7608975 7596395 7639462 7310707 7722508 7437585 6788785 6679774
16614 6679774 6842509 6431056 6352583 6287553 6170112 5765946 5565165 5959281 5676740 5584864
16604 5584864 5564154 5506288 5431318 5183800 5092762 5322469 4929173 4728942 5066349 5033124
16594 5033124 5002501 4789942 4693799 4890753 4624358 4610060 4423104 4263225 4433901 4211659
16584 4211659 3996926 4143619 4060748 3871453 3987011 3585927 3775256 3347672 3887434 3398851
16574 3398851 3807452 3327313 3505748 3319174 3417592 3219900 3146814 2857969 2979117 3198258
16564 3198258 2599093 2964749 2968318 3379261 2960818 2933386 2607407 2675157 2997510 2601566
16554 2601566 2598709 2654469 2668496 2443913 2589848 2614500 2318767 2326951 2221591 2400059 2670390
16543 2670390 2017841 2334077 2113533 2104542 2164293 2055595 2160235 2085249 2193646 2178433
16533 2178433 2236840 2130718 1828247 1763029 1779375 1795136 1934945 1945916 1968546 1955116 1783204
16522 1783204 1711143 1560457 1911938 1660095 1806321 1609407 1559115 1635826 1577274 1691415
16512 1691415 1850580 1634168 1527498 1275908 1693949 1846376 1480918 1459220 1489749 1535809
16502 1535809 1612993 1530115 1222889 1487609 1321158 1303702 1385170 1404939 1396667 1366804 1596146
16491 1596146 1421072 1175408 995723 1180541 1518008 1287238 1407418 961547 1235823
16482 1235823 1043866 1366803 1263268 1259449 1242172 1241992 1157625 692016 1260540 1074988 1453766
16471 1453766 985330 718965 1044898 1223984 1006070 873986 1109983 914094 1021089
16462 1021089 948042 1210961 1027262 785359 549199 844354 962139 684668 578618 1073175
16452 1073175 561898 883460 851637 822750 649143 977933 714967 895634 878213 852961
16442 852961 448171 891209 839374 947041 931103 827210 993768 886170 884472 954365
16432 954365 909549 878230 514658 764117 532874 718801 786882 701432 631102 474249
16422 474249 894952 637544 856613 579630 820069 664941 935163 573084 625465 426244
16412 426244 653515 696805 543764 868973 764038 657163 572040 754649 827737 554596
16402 554596 420846 580208 816674 648792 714821 881149 866216 438289 326158 553478
16392 553478 614991 484625 681495 323349 649825 456768 578189 699852 409693 381124
16382 381124 233986 25148 480475 466543 151334 612402 370154 332723 377419 293435
16372 293435 200343 750661 531074 442703 570680 483170 602007 384521 586400 256353
16361 584852 488821 259293 260400 272236 462652 605234 697645 401023 257766 47403 302407
16350 302407 193665 615790 516810 543496 235736 307920 142692 169427 524519 452639
16340 452639 258793 422804 663160 414385 649379 239300 420638 493854 324228 338442
16330 338442 265988 89225 727927 230642 240065 320353 433194 361998 409338 378865 711497
16319 711497 256373 757760 -130771 212666 396002 504158 194594 315250 305755 558022
16309 558022 138256 94480 252133 411994 612516 193079 16218 267534 318458 445312
16299 445312 135583 -44165 -26896 366015 168348 112145 209904 364098 137720 264549
16289 264549 -29756 209451 276411 15861 293012 -210125 351136 297646 215619 147353 -61785
16277 442305 313730 616389 554018 192907 -59892 139847 121886 -29760 173016 414768
16267 414768 604127 -167056 232578 273889 75787 207059 129112 236094 82286 334358
16257 334358 -52450 478273 215926 265790 20350 97598 6902 373222 235377 -88091 425636
16245 346171 465445 -8563 249517 -24016 67970 65838 -240279 19642 241553 220315 365681
16234 365681 175118 107541 145430 143556 -8443 265268 324616 444055 -141571 23383 -215157
16222 312606 241080 -178281 352499 180962 -13133 317322 392338 120581 223854 239209
16212 239209 18584 279409 271757 171338 177360 405960 -211194 284829 -35317 272213 264138
16201 264138 40547 232393 298816 558300 -199300 202071 50790 184712 90129 11073
16190 91396 -82418 139475 177974 -22160 -348882 98896 185742 125525 -54119 5444 246531
16179 246531 5490 -337132 60389 114434 -322880 140193 86671 113220 78956 -63257 201752
16167 517448 75958 -114748 -264775 -204931 138030 -203383 35026 -135694 -127538 97053 -104274
16155 288564 -141321 576724 331320 135216 -3640 -55523 165076 -71520 -17204 19461 458345
16144 458345 155933 -3022 199110 -106565 279017 -23389 -13502 71396 115492 30343 232715
16133 232715 -33877 220413 -28301 245251 -74994 -92703 -115282 505161 -69771 109160 50669
16121 -43007 -58315 78030 35559 -15170 216829 -94238 420363 -49001 -2889 94013 -157058
16109 68066 -145504 187952 -16631 -4744 188707 116600 70083 -103732 207308 -140237 299126
16097 -48583 -169733 108494 -64262 81148 -167101 50602 222971 76364 -208472 87861 115689
16086 115689 -33377 -153675 316011 -59087 52757 72400 1267 12212 -146284 203967 -59876
16074 166875 87170 -25642 159636 95774 -384765 -69590 140387 180554 349862 21711 328151
16063 328151 123846 -135656 -71946 -167785 150853 47948 72031 -10033 15068 -165110 -109776
16052 -109776 83501 57478 -6470 97051 342756 -78219 -43368 -162510 -14740 -110306 -96329
16041 -96329 57663 97094 168819 308244 -131551 277878 127322 73702 173882 -43936 -3408
16029 52294 -56656 231733 -107452 -9685 115427 385398 -36456 -42695 -145760 -293984 -152115
16018 -152115 32333 98364 168315 223093 -122653 177996 -204562 -38133 -29376 139302 -199483
16006 -338290 -3217 -99508 -54884 23296 -124403 -147214 -608364 -92843 164378 -165539 -176165
15995 -176165 11807 81571 -215668 64258 208915 175596 167257 -46358 686352 358191 540545
15984 540545 1189945 1262356 1271534 1169506 681295 111052 -167063 -3382 -92203 32781 -127597
15972 189955 71398 310651 -63612 -43454 281040 323546 9678 174672 34869 -124702 -328327
15961 -328327 96490 111916 -21009 117255 61592 3043 83806 -39729 -132276 -113806 -66285
15950 -66285 -55456 -50037 162744 -144874 146880 224583 43544 18866 75862 5907 -110884
15938 -215243 67962 39667 -377570 -129166 -155931 95948 -257728 71774 -31880 -126847 76083
15926 -32807 -8264 -508318 -77599 133978 111405 116986 122735 -22426 177284 -190417 140003
15914 -277273 34937 119514 -31766 160090 -114730 -84717 -57048 35508 338211 22440 21170
15903 21170 -98168 124393 -95610 -122762 236704 -96774 -321954 -325226 -187816 314406 79839
15891 7744 -152508 -49285 29347 -39333 -72942 22439 -103615 -65000 -184287 -37234 132493
15879 -197773 225898 -11121 -38635 -263332 -308904 162601 -341683 136246 -45425 125204
15868 -236985 -45408 -393052 65788 55414 198112 -12830 -113107 -208652 -62324 280792 -468841
15856 144828 105122 150821 -115225 10099 35721 -50901 276644 377346 125347 -202304
15845 -249026 68719 -146791 -165168 216536 -97025 -393061 -53284 123794 -251972 -235583
15835 -235583 -47795 -69397 300649 -234140 -375546 122550 -124615 -60073 322921 -109005
15824 -176661 -277404 -51527 212748 -192151 46814 -61925 336337 372369 69824 -311385
15813 -261116 122486 -113901 -135189 -158840 -108778 -108405 -207144 -6918 4797 125367 11567 48243
15801 48243 31985 93155 176565 -151301 -186263 -174138 -14906 -156037 -53010 -291128 28707
15789 86625 -85904 -110114 -66397 145660 -139918 3576 -361277 -206003 -69888 234926 -188915
15777 -141333 -242081 10530 100203 -94663 -161761 130650 -294155 -367741 -127418 -67708 -25062
15765 52436 201822 -211401 34834 -39810 94702 194100 -85520 -321623 -24240 396059 -124980
15753 9621 -23149 -42910 53049 -92153 -172814 270401 90425 114026 -31316 177048 51741
15741 -31669 -106243 -57620 55572 -395487 -56093 236563 -187199 160567 -34822 -7982 7171
15729 -109228 -40977 93049 125966 -18085 173875 215642 -388534 -84485 -615282 3217 -172829
15717 -105766 -115802 85484 26047 -169544 -56069 -328043 210843 -86368 75297 62441 142760
15706 142760 59200 -228763 253544 -195495 -21301 94698 175525 308145 165824 164685 129040
15695 129040 90491 37898 40315 153480 -73852 267795 -108286 153083 -181865 417466
15684 119150 -832 217235 -169347 261954 105206 -120460 135340 -36869 139345 127219
15674 127219 8891 13387 57001 -46685 -183509 115199 148261 -620 123680 -20628 187070
15662 -31591 -250846 -28528 2028 -76572 86061 22868 185555 -123671 -62893 -163441 -94870
15651 -94870 -35815 -104971 -547502 142033 -201439 332614 140056 -46348 -150911 -4102 -100152
15640 -100152 -223872 54154 -155236 -141655 -149296 -72424 -114568 -187005 -114373 -9493 -191942
15629 -191942 -137888 -180510 54363 -7624 227256 25877 -96408 239683 71556 -197496 -269743
15618 -269743 -72864 208258 -155332 94912 25520 269640 -151739 -180932 -88748 -160804 -41712
15606 -188249 55130 -123643 -139557 -126467 -15135 -75489 -104660 135363 -55755 188675 208845
15595 208845 7926 -179780 428187 -82094 64846 -404090 75480 147545 205875 -4642 64307
15583 -100946 39785 240793 -136839 -115145 207790 86090 76110 72992 194348 165477 -273406
15571 -236061 53666 76106 14430 -85754 202598 -9278 -445542 -189218 -140432 -8167 -162427
15560 -162427 8959 238776 -29831 127934 -329917 143389 114415 226327 -141965 -130025
15550 -130025 -37754 138770 122315 -71707 -125965 -170634 -45863 -109405 -195781 -17080 323158
15538 -17344 53642 -408496 155013 -416549 134013 12218 17657 -148392 123046 -87933 59898
15526 -94785 32786 221823 -86479 140122 248351 63975 461970 276302 113513 106639 94779
15515 94779 360205 323641 59249 -16768 280910 7693 44067 202099 60563 35815 283996
15504 283996 136368 75051 222704 318091 43962 14620 257543 21741 45505 273413 256269
15493 256269 109223 21146 16607 19459 31472 -244733 83877 -300568 365843 170625 49011
15481 -135129 -38122 26473 484528 -107896 -133599 67398 416367 683654 811201 473275
15471 473275 811061 522507 -224873 209817 -1311 -164528 97451 -97482 360438 25830
15460 186758 170290 79163 185173 505461 -65913 424017 191147 220469 -53240 125265
15449 -131592 146446 -117451 -89426 123130 182082 221641 191054 762689 395664 1455186
15439 1455186 1291952 859356 487888 208155 71144 462978 -63379 399263 217083 -11427
15428 166821 -68441 -98167 60827 165460 381036 108867 -273786 -440017 107285 144440
15418 144440 -91478 21596 245875 290148 188750 145747 -126509 -125014 57449 -67402 -131774
15407 -131774 -134821 -20175 258411 -91144 13107 -299477 41687 135512 34875 -90018 16716
15395 184102 -323617 -43330 273719 74320 135522 -24222 -74424 36519 -52048 249754 267780
15384 267780 77122 20238 -22916 -42079 51392 -201650 27921 520592 102782 315515 98986
15372 383990 389677 398736 17513 234209 158452 414405 255448 308751 51456 162223 160747
15361 160747 80467 -175712 -29882 241244 482512 68876 35996 -43749 291740 131927
15350 361697 270368 212011 224559 -58042 6402 245119 449238 294979 469705 255108 310675
15339 310675 121855 140514 223400 69967 112371 -167073 175876 -29515 -24400 84046 -261471
15327 125238 -20435 335235 138616 191385 -164670 81732 36548 40543 7603 263085 296327
15316 296327 162055 -39229 166133 145115 95295 278880 72757 -69986 192128 266329 153138
15305 153138 199097 3204 177893 93610 97202 -147896 -230436 45428 140114 -9114 -91573 107334
15292 31158 -62292 97798 182146 -194857 -86500 37328 -13357 -295545 223378 -138968 451527
15280 177595 -303284 51535 30913 172434 28173 345833 -141058 -57379 -17791 85250 193421
15269 193421 250627 -24774 138396 -2023 252294 -11931 258818 -43615 78478 -275071 -299548
15258 -299548 -106444 -117867 201116 -241761 206543 134753 288859 -319691 61139 66267
15248 66267 102941 187319 169583 -71538 116611 407903 746263 2024999 1847628 1315504
15238 1315504 2278523 975939 754105 142542 110690 -66154 -201461 120097 383435 167301
15227 -15708 143247 -266181 -112295 -111075 38392 41187 -16353 18871 328610 166317 -63473
15215 447803 -71332 94966 127982 52600 -73786 151875 -31510 31202 73368 -85924 -334986
15204 -334986 43626 -37379 55900 6109 140324 358538 44036 13866 54410 108087 -99567
15192 66557 137138 -33807 44495 224844 236083 76732 -194932 -223811 125213 -82731 -80841
15181 -80841 -496855 -154367 -166137 261931 -48415 87140 188854 148726 203593 217279 -128290
15169 -258835 -192518 57353 136541 131032 40054 163177 103326 281317 42102 -89838 -67 -134234
15157 -134234 -49690 35050 1402 30518 -236605 -13120 403282 260293 150910 -1998 136219
15145 114405 179427 62260 -144294 269377 202227 64171 81317 117926 172784 71230 -211969
15133 -93231 -84482 148086 219643 312910 160740 163202 114090 30949 -222830 396296 269155
15122 269155 70596 -20544 347972 350078 800558 489059 163444 207113 233151 283025 375031
15111 375031 90410 8461 134791 252147 181579 396194 119382 -20697 -22872 -284873 236850
15099 -201414 303956 -81917 438523 -70828 74282 -57736 68640 248289 297030 224566 463634
15088 463634 186411 218316 171963 185131 46348 273583 196752 114231 12597 -218896 162008
15076 130867 247036 6010 384394 201135 76857 265524 423751 390005 515408 107997
15065 -147688 321679 14586 112172 608055 287584 515847 460992 120462 214057 97611
15054 8449 10831 140333 -68752 494524 354895 358966 473488 696743 529110 323143 557583
15043 557583 166536 578617 477265 428906 500113 159903 376106 427846 309725 127793
15032 155402 486307 494485 394195 720260 423175 652373 547759 448770 403345 463168
15022 463168 495598 347203 294644 704004 475401 524459 516499 417917 697466 569965 305254
15011 305254 207309 376453 399499 578177 210502 434268 420467 545011 390473 430733
15001 430733 218864 482013 445539 812722 478247 393736 423668 296821 533699 250941
14990 915143 500377 480021 222959 288244 347496 619175 595066 433898 793539 625171
14980 625171 637647 826346 722962 495393 522348 531224 481701 605050 601684 798765 463767
14969 463767 749618 713651 420497 381857 196230 382016 417726 308457 373582 367208 297825
14958 297825 404993 283855 340233 262956 -79334 538699 202023 309112 168113 96623
14948 96623 465296 215342 523036 223969 401441 231837 786831 689246 394579 512539
14938 512539 357250 688815 181623 343383 307346 431062 721237 630924 802555 901123
14928 901123 915050 1138865 1195261 1429480 1718793 1450287 1489542 1495789 1492835 1334156 1374158
14917 1374158 1998127 2426245 2067952 1807235 1292414 965176 1345292 678910 409821
14908 409821 393930 187946 611186 420829 475957 226470 588478 361667 455249 323550
14898 323550 317253 617627 416046 207926 286166 337426 388918 316447 277699 499645 128556
14886 658980 820455 838830 381171 596777 976900 883492 792364 406150 1085771 761820
14876 761820 673183 763075 697087 484022 543680 662151 513497 458187 326443 513229
14866 513229 695773 1126411 843368 509398 857417 642955 682638 423916 234301 494558
14856 494558 286814 397904 623068 380895 392707 330692 431603 520139 655260 583494
14846 583494 685011 607148 708728 606161 1146846 1023682 1129204 878548 779789 651411
14836 651411 868604 806483 1029760 671789 778493 474391 292231 781008 549009 711251
14826 711251 363340 649710 524180 671951 426693 905250 311553 350317 643776 665044
14816 665044 548832 1050715 887697 849313 534060 838335 912307 795033 595001 733399
14806 733399 717399 927931 783960 735807 939215 1063013 858630 490036 825192 277240
14795 682050 464563 343495 365479 472641 438240 617619 469027 817298 564132 485075
14785 485075 461669 699992 1062784 774596 699918 433874 682383 1080143 1003754 927925
14775 927925 868417 781331 994035 881982 634125 954094 706642 640912 713272 979611
14765 979611 359279 686018 465602 746728 632534 827086 683323 822930 456760 477494
14755 477494 826470 923107 459943 882390 701146 860492 769644 844565 685185 536623
14745 536623 465039 943567 783693 647586 590575 887338 864977 668159 662942 473115
14735 473115 810312 830330 1290141 840738 698523 962100 1293745 1643652 2118741 1920729
14725 1920729 1762594 1484027 1202134 946501 1003439 1226843 790116 754017 778614 1098560
14715 1098560 991705 589990 1039034 818264 1011057 901791 700212 893834 924740 1374577
14705 1374577 1058949 1810618 1386621 1724562 1839631 1880761 1643269 1552080 1358781 1391296
14695 1391296 1201395 1054027 701141 874452 1007970 651012 1009545 766880 809244 714440
14685 714440 1137924 1009334 1001849 1169485 964780 970218 1310543 751471 786275 1111745
14675 1111745 1008378 1126108 821634 991308 1165681 1079634 512495 1100542 930704 1132777
14665 1132777 1003245 990427 786492 944175 1165697 794420 886774 1134234 918409 1128592
14655 1128592 1027471 1214671 1298904 1441666 1316469 1568650 1278850 1030443 1203185 1224258
14645 1224258 1245697 1148370 1157540 1451475 1270345 1040754 1199463 1334208 507918 1051375
14635 1051375 1434975 1300005 1314440 1329383 1136976 1128320 1256642 1180795 1528494 1231203
14625 1231203 1559321 1326929 1058136 1293170 1838901 1306595 1380976 1626014 1394210 1322076
14615 1322076 1449716 1197426 1659964 1362808 1619208 1625007 1634145 1593397 1372186 1594887
14605 1594887 1405031 1581555 1579136 1815473 1399016 1595905 1406920 1709531 1529070 1546467
14595 1546467 1526469 1798627 1821920 1737733 1643639 1871857 1581181 1752991 1914587 1988637
14585 1988637 2072235 1533509 1949399 1779744 2245937 1913724 1830048 1909825 1675081 1838166
14575 1838166 2190572 2320575 2170627 1852123 1992110 1949732 2409233 2158432 2170616 2203894
14565 2203894 2505898 2211608 2543216 2439655 2835556 2208229 2661647 2533904 2983286
14556 2983286 3100924 3029153 3598427 3430145 3770443 4606010 5006517 6750982 10127862
14547 10127862 18938040 41863497 49705706 18124433 8061242 4282580 2900219 2531461
14539 2531461 2393080 2856254 3879455 6120551 3048325 2377175 2052977 1877556 2019902
14530 2019902 2081536 2390476 2139474 2083415 2208728 2273308 2206785 2458404 2319024 2250137
14520 2250137 2401858 2483855 2472835 2498463 2432376 2427837 2600671 2360092 2819356 2650274
14510 2650274 2503197 2603407 2502918 2876743 2907984 2848710 2924476 3094987 2939740 3013953
14500 3013953 3107028 3161737 3282255 3084241 3352605 3151830 3236398 3276836 3424533 3606917
14490 3606917 3536693 3465087 3539586 3510211 3385399 3687324 3598115 3553250 3874149 3522569
14480 3522569 3944762 3820779 3799541 3663792 4040997 3966274 4091225 3889915 4229064 4133221
14470 4133221 4221035 4509111 4252709 4315208 4461498 4783694 4564115 4563948 4452937 4605420
14460 4605420 4885758 4444847 4738983 5165773 4792845 4680484 4922766 5040024 5250599
14451 5250599 5207853 5413331 5197127 5400248 5345778 5237147 5786320 5469322 5737006 5826419
14441 5826419 5962931 6069780 6406182 6011762 6051597 6352881 6258996 6424219 6471362 6825776
14431 6825776 6865787 7037828 6919894 7036815 6893606 7114254 7434391 7615332 7585377 7819835
14421 7819835 7746502 8067472 8331093 8347081 8531645 8661766 8346593 8190763 8551629 8697707
14411 8697707 8757196 8512261 9030227 9465858 9557677 9608333 10050298 10218406 10122783 10197266
14401 10197266 10233587 10243801 10409669 10540843 10799007 11066472 11328720 11338359 11550700 11592076
14391 11592076 12098530 12254318 12312457 12455307 12865287 13145728 13359119 13473958 14003471
14382 14003471 14102943 14755312 14887966 14936578 15089629 15241031 15629459 15953444 16162727 16407661
14372 16407661 16592864 17179797 17623348 18113072 18567271 18621406 19331657 19898023 19965366 20255746
14362 20255746 20874612 21425682 21412541 22339148 22704102 22939237 23704544 24243968 24712389
14353 24712389 25135555 26070390 26603580 27212809 27924421 28549248 29092854 29831007 30587797
14344 30587797 31467771 32311938 33491398 34178365 35000139 35941136 37300419 38404555 39394318
14335 39394318 40263748 41728484 42592017 44475775 45498277 46919622 48361695 49611146
14327 49611146 51816077 53649879 55007196 57112256 58887701 61111020 63387575 65670137
14319 65670137 68022427 70422975 73292470 75686230 78492229 81567193 84896324 88239517
14311 88239517 91981112 95886974 99960019 104274404 108669719 113572235 118576728 123850449
14303 123850449 129721641 135923336 142476788 148791617 156262183 163947954 172450829 180912272
14295 180912272 190042311 199769251 210006502 220921726 232490893 244671963 257034064
14288 257034064 270337234 284172567 298325132 313042150 327949700 343267268 358591452
14281 358591452 373897424 388859567 403930378 417848169 431230470 443127514 453928313
14274 453928313 462427309 467863179 468657615 468561454 467561122 464335470 460010022 453655630
14266 453655630 445477619 436889269 426949038 415058059 401717011 387240374 371207673
14259 371207673 354729734 338769998 322711919 307316439 292115075 277323439 263686359
14252 263686359 250242399 237643974 225458902 213977727 203342210 195155919 185276987
14245 185276987 175761032 167937107 159848227 151972907 145272910 138534622 132149443 126584910
14237 126584910 121168701 115786924 110281588 106019000 101278139 97238196 94027824 89993678
14229 89993678 86315755 83187735 79933394 76556892 74220726 71193807 68709115 66242648
14221 66242648 63766407 62473210 60216407 57727354 56065885 53934313 52241247 51493639
14213 51493639 49670938 48069184 46727029 44979429 43843389 42424648 42237094 40766017
14205 40766017 39357258 38084973 37078223 36152010 35367541 34881303 33508713 32602411 31608681
14196 31608681 30829714 30271119 29783769 29080218 28040495 27024086 26812898 25845529 25438869
14187 25438869 24559695 24100107 23622033 23021402 22531060 22296133 21617191 21240950 20769355
14178 20769355 20323016 20076515 19677831 19195891 18832075 18237346 17924259 17453150 17324284
14169 17324284 17044454 16742947 16633861 16034047 16018292 15516750 15300644 15083625 14654780
14160 14654780 14540173 14188523 13876410 13608539 13580854 13677520 13350050 12889740 12626816 12286765
14150 12286765 12054502 11947551 11816115 11917019 11499043 11288234 11104663 11129444 10753295
14141 10753295 10859702 10506568 10420340 10225045 10055909 9917468 10101166 9803965 9669828
14132 9669828 9242926 9251398 9140676 8834110 8764375 8486693 8466661 8366024 8400279 7900944
14122 7900944 7904634 8045249 7881176 7803137 7816346 7885657 7788021 7404228 7365138 7372535 7321162
14111 7321162 6970444 7029997 7031571 6593772 6515546 6454984 6393795 6554324 6396470 6053017
14101 6053017 6256814 6239992 6072952 5992775 5907437 6099950 5885626 5826849 5563244 5699704
14091 5699704 5515461 5499603 5123587 5824002 5494633 5253120 5315574 5179879 5100485 5121755
14081 5121755 4870713 4888712 4945175 4759187 4705869 4627628 4883219 4445301 4531659 4239448
14071 4239448 4486233 4425849 4264363 4284830 4435848 4099851 4240068 4272653 4428295 4325230
14061 4325230 4132888 4268652 4003395 4348483 3731263 4238692 3852745 3969642 4007057 3642713
14051 3642713 3897383 3694649 3582680 3687257 3204245 3501458 3120262 3785105 2981609
14042 2981609 3144560 3164672 3514338 3187233 3154544 3285624 3184298 2932560 3039833 3169870
14032 3169870 2868254 3156285 3217894 3170905 3169708 3247216 2864689 2685310 2922458 2828532
14022 2828532 2641693 2870457 3049630 2702407 2522001 2740290 2544845 2203479 2605355
14013 2605355 2482923 2736154 2342597 2155985 2404962 2390652 2321602 2122940 2134385 1873886
14003 1873886 2527720 1959439 2018451 1640372 2369485 2193414 2136469 1947340 1840162 2190549
13993 2190549 1723746 1931209 2047284 2304197 2772732 5424465 11046394 31041784 55820390
13984 55820390 26091668 13453934 8371812 6070628 4945398 4025361 3547009 3173534
13976 3173534 3242584 2893116 2696378 2737434 2586280 2656574 2656023 2387627 2742067 2340695
13966 2340695 2694343 2439469 2032164 2375611 2252803 2094495 2207987 2067591 2325111
13957 2325111 2202645 2304000 1980338 2051558 1983476 2226815 1856588 1928221 2039765 1886630
13947 1886630 1652085 1747042 2143011 1857099 1700915 1863181 1755673 1757209 1686702 1919077
13937 1919077 1591807 2039821 1817967 1686440 1358846 1580028 1716224 1569319 1815232
13928 1815232 1588821 1534831 1527203 1611339 1781650 1597520 1622714 1761344 1648045 1387980
13918 1387980 1255869 1476405 1575939 1455669 1204777 1775353 1344197 1502030 1511086 1543680
13908 1543680 1373526 1289763 1361013 1583361 1495129 1302424 1370007 1270824 1361213 1320736 1266266
13897 1266266 1374106 1324995 1412815 1308124 1431293 1575706 1298297 1247842 1158958 945556
13887 945556 1322699 1267727 1271374 1181318 1234424 1267947 926719 1141099 1385679 1376211 1221568
13876 1221568 985434 1063142 1246121 1216273 1296822 1149507 1213263 1274906 1137431 1042582
13866 1042582 1222196 1006858 1235155 1355624 920578 777541 956257 831407 1431468
13857 1431468 990146 1064903 980166 934022 1024698 925965 876155 958291 929219 960371 1437301
13846 1437301 717098 975404 1103698 894599 1064554 1324282 1066711 655013 722748 925126
13836 925126 870407 961529 956039 859838 1034786 1008757 846499 806132 844750 923894 883847
13825 883847 825204 1132542 890328 926214 1050265 1090704 1121242 869171 734355 588166
13815 588166 682474 579578 814008 900301 1163289 386869 1071353 983301 1026159 943565
13805 943565 944001 751528 1074969 604244 643009 759084 543972 981029 683968 983112
13795 983112 912223 693889 618300 721638 471055 847305 586634 1108069 970947 955034
13785 955034 630007 670602 705072 868625 754244 758857 829605 614418 689109 465860 689102
13774 689102 691836 545858 768820 706291 735469 1039803 593088 228511 757270 841548
13764 841548 652674 1145231 868459 300784 809707 492466 557119 455086 557338 512748
13754 512748 651471 874914 716147 438561 461868 698644 522452 566101 692173 435016
13744 435016 342066 827511 623350 761985 441130 618943 477955 345738 652299 730958
13734 730958 858600 558898 599783 658620 332480 474278 744500 549460 306287 616289
13724 616289 529671 683857 336082 681797 736047 840823 568724 742474 505559 610822
13714 610822 703799 578710 748002 249382 743877 195354 390477 388843 534044 491002
13704 491002 485191 385880 836347 434259 525918 490377 567820 844854 671658 312961 508438
13693 508438 902819 463814 662761 268300 90820 679780 545192 823515 375359 687962
13683 687962 462982 220309 417131 629771 247278 411686 102631 339014 760116 448941
13673 448941 594557 451886 299523 345451 309644 491038 662997 760950 787597 200533
13662 321829 484700 237176 356077 309421 429420 307247 465784 501379 314993 560510
13652 560510 536598 568123 149494 746265 452716 613075 665006 368909 393498 312524
13642 312524 555558 395087 278623 291601 134778 600308 299932 681310 298284 382922
13632 382922 413552 291227 211702 634262 537709 12686 502357 362667 879138 269021
13621 410405 92338 492798 488649 234406 341355 571501 308111 491218 79536 450559
13611 450559 284054 256893 244946 260431 39116 351009 616539 334928 478742 308706
13601 308706 -8771 298794 15635 511140 83386 454774 644847 280546 224290 450423
13591 450423 201739 161052 709957 347463 222403 218868 164125 585943 420749 367420
13581 367420 112737 270865 118417 319160 50171 409166 264294 367046 339525 210414
13571 210414 550473 268566 344392 682739 278083 129298 333744 159534 200422 205929
13561 205929 498077 -33533 -15510 362222 409030 436361 434554 21497 483405 78582 594908
13550 594908 570165 200491 93290 424258 2960 530269 340024 246616 28959 164112 410028
13539 410028 554782 348606 416959 179947 330595 268497 42980 87306 332673 361137
13529 361137 78137 331026 -137865 324369 429566 347005 73479 330841 619699 171655
13518 148536 259044 48598 273222 299876 285538 210299 605047 486785 622568 352729
13508 352729 164590 47967 -46188 538469 231898 264660 375908 157457 -36467 19592
13497 198770 221880 312637 138948 151312 648359 189578 164874 134085 361419 126547
13486 259345 247775 420773 136874 127609 525737 -109605 262200 314484 500941 28779
13475 543508 408641 369736 116274 308566 -18311 155170 -116118 72141 428159 45351
13464 47287 618791 33852 35478 206418 324211 18681 282269 441361 262191 174167 -57714
13452 110846 350097 153846 -74965 432888 392696 344084 349890 14663 399436 180596 165184
13441 165184 -16739 306634 162894 508573 416140 -66890 71262 222970 -78759 291265
13430 420314 94238 437218 86560 151981 311225 -24073 173267 95273 -98327 524936 44714
13418 273468 306692 -199865 261721 487789 357254 425381 235698 -157052 211199 344738
13408 344738 172289 39275 95910 256419 554351 -12168 124643 204241 34955 276598
13398 276598 173553 83789 143240 22916 401559 399120 264852 357908 -62007 11704 269731
13387 269731 319980 20306 183781 123736 190110 25390 -32917 -137940 67497 107761 370269
13376 370269 110373 250700 347042 73025 363570 -58066 493415 -42870 248475 318885
13366 318885 13792 437445 307320 213119 322257 111229 196931 168304 47535 544905
13356 544905 315735 264092 64221 416699 202052 107494 -37569 561890 405941 689 -226641
13344 456751 286629 113494 193319 499007 522652 241082 538038 585385 607804 547587
13334 547587 589154 243179 54750 36855 561207 126757 235678 345934 240162 266427
13324 266427 428903 218944 472975 -41805 -87923 484466 325675 326854 364556 420788 622934
13313 622934 374582 394420 548420 105297 587353 431715 145226 -53951 246303 167712
13303 167712 190604 117400 143828 25299 -206831 244389 206333 65312 -165556 10527 207856
13292 207856 174768 263937 235908 51219 98346 247719 181966 174632 -37716 208063 943 134914
13280 134914 192862 162989 53783 349846 159421 63076 215764 146714 184244 142268 288213
13269 288213 7794 333223 20725 58289 140239 104329 165804 62298 -165717 386200 -1702
13257 33910 -76020 67016 58745 181348 -57092 190301 53130 -36842 213048 -149285 167222
13245 -98534 228010 103640 246688 147089 122347 -78774 157239 204355 16203 -118309 195178
13233 111528 100701 203041 312735 153170 217125 159818 242964 -47918 316830 141274
13222 -149277 13505 118936 206725 81313 194681 -8713 -134588 227058 -69729 169721 -188002
13210 153761 31144 22066 22442 -61011 -8393 79377 -17268 195571 -167306 93378 163154 -78681
13197 192931 91386 -70432 -24692 77062 103167 137781 226294 -104022 425871 183948 211622
13186 211622 185444 25162 -233380 189061 -33773 -106464 -298253 -7003 -18636 121541 -36124
13174 -23010 160868 93375 -22660 87322 335096 300290 459677 23606 -97819 381812 -212900
13162 218251 -49633 200737 -347703 146864 -73195 156472 -315582 214590 74703 -46621
13151 82580 -197199 -9207 495817 -57280 -287097 -101306 9889 -1085 282153 16012 20527
13140 20527 257678 260104 99117 -16706 -14263 24464 -58273 119602 108645 -41362 24845 108082
13128 108082 423310 -63113 109443 201765 63208 104036 118987 203889 -121416 235432 291014
13117 291014 19768 92758 55611 285346 69061 -72154 -200974 132841 -66305 107741 -226738
13105 370384 24093 197092 465594 296387 14782 81269 368107 -58874 -251338 -91060
13094 188325 106442 142432 48978 292070 104332 -104882 195704 39956 -183619 163006
13083 205952 -142321 -115532 191545 -233621 291548 268523 -858 272381 53720 92198 295957
13072 295957 77875 101163 117338 54015 190169 -75281 328968 5838 -184839 60471 128274
13061 128274 -18596 190959 485840 -223216 -5475 88510 44222 -130806 185634 285215 69985
13049 -145703 330300 436361 220698 256784 -63944 -228461 126983 303627 410652 281986
13039 281986 -128907 335324 -55730 203700 178799 -20291 158771 357078 131660 640850
13029 640850 184953 -276734 -287182 -42873 293544 166469 320870 -379529 29559 189519
13019 189519 246173 173371 -33697 392902 273219 -249460 24228 369208 -21447 47267 164669
13008 164669 212436 103659 -219846 29592 124632 168546 -61777 129558 295807 53976 -77134
12996 67050 140876 -21539 -60288 148584 -15257 -7962 63410 65830 121480 104001 210798 -72056
12983 162760 237831 -156453 -229732 -354753 -39700 -43400 78384 332734 51096 12713 199822
12972 199822 -7664 94829 -183207 -17316 192182 143960 -178913 103877 73849 151959 139720
12961 139720 61719 184442 -183952 198898 -341692 -4627 -171373 -77152 -42832 -190963
12951 -190963 419919 142857 -22813 308963 158136 117417 -134157 -17357 161907 140680
12941 140680 -30916 -176780 154424 -291770 -151164 99314 78892 -9885 -21138 385065 107010
12929 305726 32346 -140574 -90024 -67289 99511 -257366 10295 124283 -104562 322399
12918 168803 400077 -176226 78992 -247257 -32086 -172673 164125 -29015 -5032 10219 -170573
12906 8699 259293 -104169 191752 180367 131360 128158 -340819 -52773 -249548 -118545 32537
12894 -11088 -86618 -118044 126530 -84677 242629 -46369 37119 434169 -229545 23659 -13977
12882 275008 -307439 -166646 302651 -41423 -50936 92209 139456 -31323 230662 -76499 -217855
12871 -217855 38219 156810 -68205 -264957 -92629 72617 19348 -220666 6225 68065 -117037
12859 375740 -68668 32351 143572 58033 9432 -57539 -57769 -72700 31089 64288 63418 67853
12847 67853 -247316 39876 -189179 111883 -61333 33715 150797 -68840 332639 124911
12836 116420 292944 -299494 -13508 7301 54733 122658 29983 186321 26139 -233190 92378
12824 119179 -49580 58597 125334 -33058 178425 19730 -62771 -294789 -103038 -68106 90342
12812 -101443 255008 206879 -251401 -53552 76923 276552 -149471 234736 -133460 78767
12801 -381180 149612 215781 -258974 311421 66542 -135602 -46187 -146491 -37008 104599
12790 -368138 111662 -151726 104214 -42926 -73013 140868 166224 -191017 -305159 93418
12779 -22155 359907 -121261 -108653 -257311 95745 284371 141818 -262022 -138154 -77458
12769 -77458 12394 -72462 -312617 -131285 58411 98134 -102296 -155914 -125922 -303665 182448
12757 36705 422 -153074 -124585 60507 -129594 -248225 220777 -288562 -135113 -71029 18209
12745 -9697 191217 202412 -97057 -159803 -94381 185306 -76441 374229 184625 196792 -39959
12733 -258465 -57671 94992 244352 282579 516561 -47231 -58250 -129208 20781 -517465 -47863
12721 16311 -31321 219528 111980 16886 -66383 27328 106687 197423 141301 8811 73381
12710 73381 -33719 132848 83257 64617 238339 384411 -6075 -12543 -55096 373342 507733
12699 507733 -78600 53559 283772 -320679 53428 240147 -7697 94581 -16787 -45075 -14536
12687 -245952 400953 172658 -105554 24211 64508 194131 -92556 -97626 202464 301164 169745
12676 169745 203754 -31157 108975 315633 -24848 119155 10828 -188270 -332231 227215
12665 196318 -9778 -45538 -83395 81140 79321 222671 378822 191957 153345 10778 -126027
12653 284993 -316791 332785 -131720 224340 138285 346748 130619 -90799 27605 -14252
12642 404072 -103751 -260014 -2611 89238 -2710 46184 307141 152768 162924 -135021 -98129
12631 -98129 -99874 246302 512098 21624 374074 121528 476133 14117 161948 -65758 262075
12619 41470 27766 149008 -157278 167442 269815 402325 -13599 166215 38853 -136802
12608 97040 58381 -355626 8170 -278359 -169522 -26668 235290 -54823 133644 181209 -154057
12596 -79253 292510 271484 285572 55617 -56583 208698 -51065 9567 -284636 -99429 207653
12584 -92250 -139573 70000 -153014 78861 -54782 297548 389284 254712 -198959 297987 -72737
12572 -97851 -101504 366152 -125572 -144746 -93987 88115 109345 77595 -17775 254497 -50794
12560 146422 325193 9755 128880 109027 -462216 4689 -156680 -6689 75747 -5246 144820
12548 57878 -272498 31435 50596 131517 13670 20037 -149532 269351 75287 9130 -143747
12536 -40208 194389 -63194 361031 -58055 7986 -98677 -130557 3389 -1221 5691 33765 -180346
12523 19117 90562 -300477 -56250 83719 -119155 74982 87917 250914 188152 396427 536070
12512 536070 363055 93050 476044 -85880 -181038 2501 267410 -305254 -169273 -183937 51678
12500 100946 -81277 151449 77270 -323514 -219163 29994 316315 -134399 82326 -259069
12489 -128377 -152576 10895 181777 -67339 52428 559925 432752 415024 515075 355937
12479 355937 9055 20390 30514 -114714 199548 65351 -306925 -62788 38509 -267318 -92917
12467 -24414 -100874 49726 83555 233302 126516 -142043 210476 -23196 27010 -90936 436122
12455 218360 118366 389346 66038 126206 451603 155875 238749 -248606 -229448 84388 -218618
12443 -64114 -91137 12432 -171116 -91129 -99286 26354 -37311 -133424 136142 -448516 219426
12431 -268052 -40236 179692 31582 -60735 34908 -67484 13330 -136287 223929 -136043 83300
12419 -87506 60063 -166433 42414 10446 -208116 -106119 -79022 -149353 45130 -19826 -194015
12408 -194015 -69210 222285 76973 -193241 3532 -326697 -220103 219075 -300199 127416
12397 -15499 399008 223049 79025 -339702 -51260 23577 -3128 -211277 -82958 362 32410
12386 32410 54710 -262935 -214799 303841 -170820 2906 283138 306249 486641 -4189 207213
12374 100488 121255 197754 54497 125079 -308547 -182113 227837 -28885 -85931 -342347 -309622
12363 -309622 3012 6691 -111226 -180079 -123830 155806 -119276 -78027 -117255 -22485 106654
12351 175785 132584 -122247 39765 58208 -86554 240028 -115721 -15433 10204 -1909 -321955
12340 -321955 -8420 250822 41115 266626 -81222 398212 -70934 -64290 318673 337566 172358
12329 172358 140967 487986 95877 -40832 240341 46610 207148 -107362 297593 174583
12319 174583 205152 91715 -20278 166655 -34977 603 43198 -141533 145456 102917 156058
12308 156058 413034 64396 332780 20837 213769 -80631 -164669 -195327 324530 267415 180880
12297 180880 342821 82536 53315 73998 220546 79894 108454 -81175 200379 10087 153231
12286 153231 198991 83681 152592 358861 -67538 225378 -397 7824 30363 180182 412531
12275 412531 587892 79315 219113 178803 243862 81920 164772 270684 230526 -35699 340473
12263 52629 395039 -88333 145598 169838 345460 221919 268883 249488 281323 242884 183490
12252 183490 261782 255867 373019 6214 74143 90266 154917 396906 112162 283819 238650
12241 238650 28143 90230 3558 218901 257666 113591 -63750 358385 311744 -3069 77797
12229 255422 144295 340691 316263 462239 219737 -107847 668867 481062 484608 214540
12218 262541 510339 218301 538265 484991 182082 38823 250178 520633 14457 429172
12208 429172 261010 442208 -203667 358329 111919 -71332 109760 77546 106357 132910
12198 132910 142529 291067 18312 536280 159784 276604 117651 505814 282489 586628
12188 586628 342912 334347 184570 400901 268546 337277 267883 161211 -60539 371766
12177 241447 251134 166170 254999 359996 352199 407925 395190 311366 440093 259072 269968
12166 269968 482180 259900 401949 359728 353696 168515 130081 50657 248831 445970
12156 445970 71142 212028 262756 -88085 -33725 22835 -160138 124555 227367 -84651 226730
12144 -251729 66184 10343 340678 98372 236544 -195612 107941 319479 195189 257619
12134 257619 325375 100726 -194681 -40723 300554 224803 -394854 5719 426442 -110743
12123 116114 5911 364730 97549 -139330 24397 146921 -55822 463095 196864 170454 108551
12112 108551 105991 471230 268200 -69836 178451 188827 -65032 229095 263307 -82873 227814
12100 171309 80108 -54812 177592 160378 21053 322544 17388 -86623 221466 77188 -95074
12088 242169 112628 -111432 15251 18239 177138 165420 298897 163492 132150 160432 72210
12076 231246 204400 308074 365202 179154 484406 110 382271 355059 445234 -80888 154587
12064 -140065 -153971 -60165 -113109 177363 374219 -173412 162187 250407 -40823 33508 -372454
12052 -243907 263499 -146507 123559 -240229 -21218 -47021 -69265 136076 64948 154460
12042 154460 192095 2201 -142031 14012 45115 -235063 281330 42511 -38536 19009 -520055
12030 -259918 209263 -53403 101674 -197614 159686 3431 5530 -39381 -119931 -111092 90624
12018 -10654 89650 258892 -178365 -14142 235645 58980 -147802 55303 258431 -104520
12007 69467 -156264 -126799 -6142 64384 177908 182170 187669 -360356 253987 -326632 216875
11995 159108 65147 -262531 -51759 234523 -153738 -18411 71870 128372 -26474 130537 35459
11983 51436 -65880 220095 -315752 114598 -51420 9652 86429 122779 39692 342552 -165127
11971 149713 -188082 54674 -190881 -200076 133897 -100192 -196640 29316 11279 81295 110631
11960 110631 -3344 -119336 82133 -262262 -66370 -213529 -111109 17018 276400 250701 -227644
11948 -364415 -78819 -2112 -442737 -126744 71625 99671 -66643 -221106 268540 37964 55506
11937 55506 -76780 112093 1033 -181900 -76122 24764 -70945 175999 -53007 -41524 -46313
11926 -46313 -196128 -135445 106516 -29620 299831 -85972 -92473 -220615 30391 -194124 110416
11914 219984 136951 -36523 -272843 192478 -105104 -50950 -209109 -235878 -80343 -38057 -54529
11903 -54529 180676 -30637 75041 14743 -80792 -164255 -319999 -235363 -96243 38766 11028
11891 -37968 -112033 232237 -269904 -299890 -115029 -136028 -170657 -260757 -279950 -121091 108897
11879 580690 64831 -96618 -65954 -168013 -204446 -118184 -61295 316988 249362 -64789 4227
11867 60696 -17773 -290453 112027 285396 -120722 110905 -46358 -294312 -17162 -175857
11857 -175857 -149784 -67237 -181578 -143376 42458 -2040 432653 29919 -240090 97069 156564
11846 156564 -45036 277740 -28068 287807 -180517 -85594 -297868 -67658 -239202 -194592
11836 -194592 21152 -244867 31685 -23714 75713 -313801 -157506 -82773 -60923 -67812 -39253
11825 -39253 -203010 -30128 46298 -395632 -22637 -287236 -93439 -5389 4902 73436 9919 -139520
11812 252705 35739 85957 -247740 -56965 -55260 163382 16631 144569 207299 -54488 -20157
11800 -247103 -30263 -132854 256059 -19703 -257136 -19357 94246 123762 86016 74646 -84682
11788 43314 91348 14197 -413196 217881 -61911 -118565 -86746 18687 40546 94467 -224509
11776 -53738 56560 56231 -66046 -96620 -320882 -523309 183680 -40878 -218413 -51846 -38053
11765 -38053 91339 -168842 64197 -61793 -260472 -161176 -250029 -89368 -119756 100079 -316593
11753 -14780 -111098 -26035 6860 64479 368353 141784 66596 -20305 -247214 20190 106196
11742 106196 -24609 -40277 -212555 121452 -298517 100571 47947 262983 151781 227941
11732 227941 159919 -24376 -100073 307942 444290 -45071 -443503 -138800 85535 232523
11722 232523 -20224 4640 192774 116389 342348 -54687 -45422 -29000 -335512 221604 130669
11711 130669 -125128 -397906 -12788 122251 -116126 60938 209882 84611 287211 -289586
11700 290127 -120523 41948 -204816 -34207 -219692 126580 -163450 51672 71743 286632
11690 286632 4348 36590 235448 -218451 388116 94501 -211403 197232 68982 195456
11680 195456 118325 32372 -98195 192033 271469 -73056 -30721 180431 -58319 200620 -64118
11668 239107 225442 189840 -133671 347077 -229595 -48780 -254840 -167890 -153168 7656 14028
11657 14028 235444 105939 -19241 140858 56598 -35072 2421 -147697 -253292 192844 -1821
11645 63094 98394 -140787 -39857 291077 240537 71712 47135 270944 287007 -3915 176311
11633 128786 10076 -143876 97352 94016 146441 -149190 67039 -119972 61591 -158900 -108484
11622 -108484 -20395 249496 68983 -62328 -190355 171212 -124399 -150358 260676 287250
11612 287250 -10767 -275662 11994 95691 -154904 192312 87793 187773 126428 217437 90706
11600 121242 -16258 47509 -3571 126234 319835 -88880 202274 -174257 59010 -36322 20020
11588 190532 -20483 73120 89028 -21922 80608 -43654 323395 113308 -365701 37441 181745
11577 181745 36535 45196 -116670 62075 -11082 163364 6033 392529 -241873 33324 62847
11566 62847 418543 83313 267028 95229 200558 125345 549250 -174081 156020 -138907
11555 -187849 -55088 39371 126846 337099 359138 386877 -153367 -311701 55679 -153503 -92177
11544 -92177 129915 -222323 66409 77538 185072 88803 -37115 206823 160917 252202 116699
11532 105374 142935 162907 28364 149818 482593 43631 -3000 -315552 88446 197093 101667
11521 101667 127053 4793 204419 116713 312789 87906 -45250 121879 -73779 159609 -73540
11509 122398 169715 30242 179381 298838 333998 257071 79958 43476 269207 -56430 54433
11497 401187 351963 374783 81470 -53513 -37749 488255 341092 -115552 186656 -194205
11486 122686 348635 428894 250470 42734 99638 -81062 -39047 593774 -279947 799750
11475 102511 127363 109579 556402 143666 246433 426170 329818 312910 82422 171466 44338
11463 -79118 182429 393076 215232 68574 285433 649165 199322 248246 252606 71332 351066
11452 351066 470674 253326 14836 62425 123665 -244307 98051 21395 239656 -60327 168034
11440 181639 71834 564484 427146 -7907 356158 97816 170395 60054 249975 128716 565497
11429 565497 200408 396170 255784 54308 40360 94235 83804 235244 7961 -68722 -4052
11417 141159 170419 -88419 64582 31708 -34316 -84553 -180253 20978 268221 20528 -4355
11405 78269 -32082 235901 90805 122599 219106 100925 -88289 -178615 49209 153448 132710
11394 132710 40455 -31015 -142292 -113759 -90032 -123547 -143424 -97193 -76606 118790 61082
11383 61082 -218100 -44084 236673 -353224 37694 213962 -22750 86959 -23257 77443 -190684
11371 -27145 188684 256977 -117865 -114449 241379 -157036 242234 -47566 -32524 102395 -47305
11359 -23987 -44345 105551 -44347 -266362 -220865 41259 239231 -109749 -114941 -101727 -213096
11348 -213096 151431 67981 1677 -181905 194336 14838 91843 100792 -58235 153659 -228348
11336 -253657 307467 248557 85345 -176123 -63577 84486 113628 -48997 75598 194088 -22541
11324 -423745 -62342 -487202 310823 -17448 -292009 730 -427122 -301986 -19857 17879 -115466
11312 -58984 -112573 363346 -35566 -72010 -220444 -61969 -141000 -285873 29407 -196015 -57994
11300 -49837 -194891 -79667 -55250 329764 161239 123239 -83408 387062 -148957 -244241 -43245
11288 31803 196609 127952 -266408 25740 -220665 -236371 45456 -279080 26470 -67979 172866
11276 -130192 -136089 -328302 -182919 227936 135063 -42271 -1918 -16396 -124687 18271 -83537
11264 11296 -71025 15732 -136025 -303338 199592 -144836 -339544 -163226 -389675 91152
11253 -238135 226585 -202088 -53982 -152741 -6144 -5040 -322979 -119173 -22933 -6114 104092
11241 -217857 -33968 34041 -52023 83218 257213 -212925 -82805 22121 290245 -159262 -347828
11230 -347828 340811 -293 -199205 -215418 -189674 40910 -24752 269735 185224 -222397 41370
11218 -96325 -138882 -125172 113198 214755 63649 -136281 -151818 -214190 -328698 -280446 186709
11206 159717 -230789 88591 -280868 -415 -33837 18292 -233217 -203467 -251986 -65819 196591
11194 45239 -181447 -267029 -47167 148641 471578 163619 44640 -102627 16548 183885
11184 183885 87787 -237388 -94124 64445 -14021 -129163 -242742 15059 -130157 -349834
11174 -349834 33743 127281 -65511 -93367 -124029 78394 13775 -241007 -289245 -215269 199130
11162 65 105436 -418400 97905 -97840 -433779 -105706 -71105 -65763 17035 -103641 -68976
11151 -68976 -24685 -1386 164292 -3520 -59885 170597 -169466 -433481 156446 268212 57273
11139 244145 129956 45383 30331 -146911 504967 -105960 280078 232616 141619 74327
11129 74327 29210 5295 -117474 -102235 -66059 -65556 291421 253172 98796 -41567 315732 268411
11117 268411 487566 98220 178909 -161710 156192 25899 -140365 299445 315097 -51919
11106 41178 58837 177231 212816 262115 259709 269839 85923 620430 261037 171063 372944
11095 372944 303478 330169 269093 28046 219005 140542 266767 264966 562888 564734 305572
11084 305572 424021 589939 313678 367324 275799 423669 504612 181515 324392 327203
11074 327203 426431 539345 494472 460219 466241 11334 417272 560935 470934 535741 795195
11063 795195 525717 358817 461865 728946 884991 1112675 610015 876732 933515 1319444
11053 1319444 933765 1301080 1141253 1523580 1298180 1219361 1515014 1169355 1412176 1397934
11043 1397934 1480386 1307618 1729739 1402389 1397803 1433409 1529083 1472342 1730874 1492811
11033 1492811 1589338 1234280 1397217 1287985 1413428 1164011 1271681 1136024 1304879 1233322
11023 1233322 1491097 1583309 1385756 1333209 1261256 1150877 1319724 1000130 1160514 1179168
11013 1179168 862410 1031822 1210272 824203 1162608 848298 854915 995347 1469960 1461046
11003 1461046 1093552 1333183 1172564 1037407 1072831 1045897 1048595 993699 1078118 1115416 1000801
10992 1000801 1009536 636873 1233107 885993 1187595 994274 1115551 1126669 1193516 1756855
10982 1756855 1294272 1480947 1726120 1767562 1808458 1966847 1952100 2093619 2272138 2470540
10972 2470540 3334201 3441890 4003083 4219374 4774044 5149087 5350320 5523045 5771349
10963 5771349 5389258 4940484 3986290 3433931 3121558 2513794 2564166 2330169 2076678 1819948
10953 1819948 2065453 1852404 1874842 1853665 1714350 1143380 1207877 887013 826360 613339
10943 613339 386817 351239 256991 545716 20843 337141 32681 230229 -60494 496203
10932 461840 -127273 214723 -140143 303040 406089 99951 126709 9425 26035 107858 20668
10920 -311644 289605 133253 36405 101622 -147752 154269 -344926 -50665 -50905 -70943 294132
10908 -123874 -302576 -250455 129446 197573 -339775 68784 247736 -57124 -72691 -89781 187173
10896 -238170 132975 395458 -134122 201826 -97610 102112 35037 -237705 -117579 -88926
10886 -88926 283089 268353 116762 208397 -338663 67949 -117196 -30694 -86458 79314 -354076
10874 -329163 106494 -52316 98923 -151813 245701 44942 49229 137895 -22041 -165460 259607
10862 -95219 182212 -105428 184568 -190545 257215 -6414 280812 -147728 18871 -156966
10851 14073 -81571 -3132 -104781 231862 -26650 -179048 202679 86612 53646 -277501 -22680
10839 -44675 62892 -8894 92277 -116378 30396 23201 -92434 -308938 -273729 -23892 -19155 162781
10826 -347273 -24395 -105339 -270976 60148 172494 136669 -263494 -42115 24276 -201254 -397368
10815 -397368 62450 -154426 62745 -144988 72034 9475 356706 -83586 -70937 95572 -442471
10803 -264185 -40534 151194 -114658 135697 -321553 -215764 -86857 -10686 -239674 32162
10792 -80686 2735 42023 -188491 180724 -43825 215905 23571 -216354 185821 -95073 156900
10780 -116561 132284 -138880 53121 107786 -287067 -273722 -109530 22744 -146528 162125
10769 -273969 -46798 -317468 90095 113179 82572 -54259 -247081 -6530 -146917 -30543 147138
10757 -106570 249466 -136138 142467 -65119 -281277 174205 -193532 -145244 -184989 42839
10746 -216676 -200233 -80715 -62869 58696 195350 -127546 -10451 -112041 85612 62329 120582
10735 120582 49330 101701 243323 211528 -9903 -33468 -195923 -259394 -371612 -184927 315072
10723 -27163 215254 -269653 134512 -125909 -108855 -47231 12019 -291789 -96809 -136955 -32865
10711 -170630 -183581 221641 54650 168801 263295 -190912 -449820 -136820 23914 -444074
10700 -34454 -34630 -106961 -110149 -105093 -32376 -164337 94993 -83268 69831 -232873 -494901 -204817
10687 34815 -86303 365241 -85219 -431705 -311750 77434 -55127 -355274 -3728 -147310 -297035
10676 -297035 -144201 166301 -9131 -226897 71711 -3693 244604 -205150 1782 -22289 -3542
10664 -57052 -54844 -134772 -11852 -66214 -150177 -326565 -20667 -22605 -169045 52502 54826 -109803
10651 -121749 -76134 53552 -415148 -54593 -94357 -410846 36007 -14281 11729 -160977 140119
10639 34398 14689 82281 -196594 -165532 189722 -1222 -5609 -155345 383959 -108069 -228697
10628 -228697 44314 282751 159937 72245 472868 -215591 199205 -170167 -248729 -27037
10617 -196014 -461987 90290 18326 -4928 -117587 78456 60622 141222 -109660 -300961 -185961
10606 -185961 419953 140624 220061 -37148 -318389 170260 -370164 -233656 -293692 -111318
10595 71407 234163 -80562 88395 -53487 -34151 7053 -5334 67225 -3082 -81803 -181014 165291
10582 -242762 -74208 -1449 -279847 52990 126794 -461537 -149452 -142892 118948 -289415 2666
10570 -170673 -5668 189757 88401 -57916 296112 42886 -112468 130733 104081 -241217 -38705
10558 200423 -96453 94311 -395082 27622 -462089 221955 260891 207061 -6057 8334 -24856
10546 111083 -121005 148185 -98479 -82252 -128712 -370276 213404 59591 -240855 -222336
10536 -222336 49924 84167 111197 -58144 -42609 193819 33392 -262260 -126546 -143317 -67732
10524 -188267 -198351 -88069 -33004 -101559 -166217 -223651 -34874 -91089 10349 27262 -114454
10512 -314789 -188769 39785 118199 34678 -265215 -245905 90981 -4899 -20373 -14484 -125354
10501 -125354 46226 36503 -97331 -90544 405343 -129683 -357952 55767 -171517 -148305 222356
10489 -287798 -47905 -98472 -418623 -35801 -197049 403670 -202010 239747 -229662 150424
10478 -88975 -94120 80441 242167 379306 465391 374998 68210 202775 217910 92540 218941
10467 218941 131399 -24751 -30889 156585 -9030 -253567 3100 -114486 331597 84851 17043
10455 -208023 -13304 20434 122855 -100344 -304702 -394520 179599 -159081 -184179 -211868
10445 -211868 -15725 -20484 16697 -193478 109570 -84192 -183505 -67740 -68663 -99989 -106855 -234532
10433 -234532 -289789 -23728 -26068 168619 -151183 -249714 -94050 -182488 -282740 -114545 106022
10421 14984 91174 241148 207103 -294180 -52112 -327293 -208017 -271511 -17448 -67429 253891
10409 2923 29777 111815 -109542 147301 -57141 111605 -141892 11555 246789 -110690 -201190
10398 -201190 -76222 -181292 -89945 80440 655843 -61733 -10412 204944 161785 312522 357814
10387 357814 166589 113900 149178 225540 220439 184550 190880 -124 69496 275483 57014 127115
10375 127115 363428 389286 451200 411092 401131 411917 209638 356925 178578 360176 453240
10364 453240 946540 501429 769678 861762 733910 882426 527387 275392 271461 494220
10354 494220 183799 336635 389273 545356 787377 956490 1086140 1236131 684853 459705
10344 459705 568303 692132 82363 703502 664789 215768 -30274 -47346 165045 96642
10334 96642 176086 681443 641236 84724 383526 274681 287091 15508 130735 131156 82651
10323 82651 342697 194721 279718 489974 495816 347432 -60055 312094 206890 329227
10313 329227 257340 -79318 -58843 -161818 57619 208021 19256 37281 11652 -56186 -99770
10302 -99770 243637 28172 -115804 91940 -294938 -116006 94415 127887 -34945 311064 -166450
10290 16343 -77655 149419 24330 42153 181422 -270118 218638 -160854 -259328 74273 -64783
10278 -172583 -227302 194896 -98276 -66455 -35927 -206720 -100852 82715 30209 -258374 2836
10266 -101006 -409975 -178681 -163996 136979 -61111 -32531 146764 234494 140774 45465 144158
10255 144158 -38407 500859 169503 373990 307413 559490 164756 -15620 56184 44149
10245 44149 -240713 289885 88322 -59301 -64899 -190338 -260980 103972 176481 71606 -16371
10233 -216470 -130512 41859 2107 -214576 61255 59937 -89845 -171796 -7197 12835 -182196 -241486
10221 -241486 -77695 202157 11794 -113573 -486125 -314971 -243075 -61147 -311997 8772 159431
10210 159431 -11343 -143956 -294891 -308695 27820 -196967 217947 59859 -199935 -6261 -315943
10199 -315943 -480131 143284 -273729 -184011 196677 -467478 202434 -140637 -236705 158858
10188 -2831 22131 -269252 97770 -120648 -44251 15890 80220 96515 176291 -176311 -232141
10177 -232141 -72989 42222 -217065 -245879 -26148 -218506 -202459 -136939 -340081 -60901 6172
10165 239674 -49653 -183658 -120226 202923 120687 67929 -198957 -90957 -28896 375272 -99349
10153 -53577 -323566 -76329 -97733 163923 -59486 -27782 -24426 80877 -255808 -491804 -68294
10141 -2422 -243369 265200 -100311 -137990 30429 -125556 85394 -102050 -14865 324656 366525
10130 366525 -216790 29575 -139132 -90434 -198363 62911 31671 -261900 -473182 -216064
10119 -253300 -136203 -111582 -90818 99090 -224527 -174329 23627 56233 -14037 92715 221146
10108 221146 65953 -180014 -32866 -363194 -237516 -19648 -73001 34590 -23402 -38595 67536
10096 -57341 68208 -230437 136710 -49389 62028 201333 -246 49788 -146389 -195098 -399829
10085 -399829 44815 -184238 -74152 192452 -338297 54816 131092 -47200 -205255 337994
10074 -454753 -161222 -227191 -35240 -5968 -94317 -190880 -426284 -168156 78977 24182 -296126
10062 -262651 -121082 -98048 330569 -67381 -170289 275411 -238725 -26384 -10997 -127201
10052 -127201 -147034 -70861 -207807 42267 87197 254386 27451 315400 -460914 -87847 -107695
10041 -107695 -279889 -76666 -250871 74095 41043 -25243 155131 -78149 -253424 94772 -254483
10029 -13018 -174614 -195465 -205393 -147546 -105729 -360338 92410 -266807 77635 -41385 150056
10017 40537 50271 -5693 -113768 -207121 -176843 54385 63240 202375 27779 -222174 116879
10005 -355783 24199 86852 201279 -157201 -286528 -79409 133355 -265282 -17027 -287386
9995 -287386 -44264 1021 -181375 187331 497244 -360773 146588 -29847 -104942 -325970 5656
9983 -35702 31677 -173570 151393 160375 -52702 -65532 -238637 -15936 -84211 -180012 189410
9971 -262786 -62065 -15366 -208961 64505 -48688 -156742 -25204 -161833 -354655 -56044 -133408
9960 -133408 -235364 2950 89750 -101592 -18829 -82203 19497 -168265 -38492 -130995 -7033
9948 -9597 -100085 -450050 -147614 -99757 -63235 147788 -307315 -192534 -340858 31320 136942
9937 136942 -310876 -268095 99716 -63282 86601 -41420 -118962 254853 -281822 32194 -323672
9925 31719 -138396 -49208 219971 72182 45545 -369091 -141113 230919 -163615 79774 -230894
9913 -149976 -145712 -209196 167843 148023 -322245 -25175 -204273 10848 83755 29049 -84755
9901 -27106 -55259 -162209 -83675 -14726 -148787 19892 7113 -231786 -70747 -101388 -31483
9889 -185144 -374238 187124 -65497 156612 -22558 160370 227076 234845 -366981 3616 13403
9878 13403 134648 -132080 -323992 105794 -159564 83528 -95688 135830 -218508 -72283
9867 44059 -133479 -240766 -226537 169421 -55780 -126070 -46388 -314298 -196134 -80697 -106141
9856 -106141 -114109 -52356 -303589 -109167 -5295 -117555 -74974 294070 243142 95873 38077
9844 -125634 -226182 -401971 -169696 -32536 23473 18121 -112494 205513 712 33436 -402455
9832 -134872 -216547 -269475 -139645 31819 104297 184764 -222858 74874 82289 152588 35279
9820 -260617 183346 87586 -146741 -115389 -170575 -162308 -97227 -267145 -72754 -204991 -12078
9808 105834 -106842 -128038 157685 -54233 -419760 -210130 -151893 -53800 -356462 -106580
9797 24129 63860 347990 30716 -186769 -190051 35216 -221957 -235313 -275552 -14166 220943
9785 113938 39366 175330 -209523 279857 -364332 203668 -74181 59178 -244161 -319787
9775 -319787 -248965 -310307 -90418 217935 -41163 -158525 -460845 -302466 -44238 114579 90306
9764 90306 40478 -281975 -187198 -260550 -143863 66389 176466 -220894 -140981 134447 15601
9752 -334647 -127404 -141807 -9190 174264 -66264 -190226 374631 -118821 -61175 -42552 80039
9740 136867 -159112 -265635 -243376 46508 -157783 302332 -295662 318556 -198099 -91075
9729 -345068 -210571 -189093 -148710 -240817 9793 -68146 -39134 31986 -93066 -214235 57233
9717 215564 -12106 37034 47238 202188 -96826 -148705 -168321 -289030 -202012 -278811 -185290
9706 -185290 -37316 88572 -327520 181830 -189534 98777 112813 -284347 -82713 -195883 -182853
9695 -182853 83517 -400171 -232105 310045 -116596 -36093 -174503 -111725 -393731 224009
9684 57801 -93483 -208297 -41340 109376 -125691 -16977 199555 243446 -180927 -240273 -431818
9673 -431818 -54357 -175851 -28822 -28203 -172093 82823 -119908 -77198 128219 -240731 -113655
9661 -342224 169203 217722 289964 107305 -215749 41698 48248 -189730 2329 165739 53012
9649 -252505 74874 -54056 -139118 -201940 -116994 95538 -167477 -131375 -158094 158011 8119
9637 -250351 -172261 -155027 80640 -231701 26522 -112285 -266402 98802 103267 186605 106183
9626 106183 31698 -103004 -70870 -94730 -197061 -289471 448888 33656 134118 -191924 -100381
9615 -100381 -216274 -97012 -174859 -392295 354508 227787 -360690 149982 -67109 99968
9604 -99488 112192 -175890 5916 -189243 -103072 16914 -66739 -55727 -129823 -91970 2798 -239784
9591 -143085 -37826 -145456 169474 304581 -71964 -169054 30455 -314990 -244537 -303083 289650
9579 -186163 49150 -177300 222532 153657 -14596 -460714 37544 -106333 -249496 -12288 -66709
9568 -66709 -14632 -209878 74013 37120 18236 -104726 -161756 -260430 237861 115920 37937
9556 -125584 -31174 36144 -194005 67914 -124217 126821 186828 -199204 -106836 74047 -145750
9544 -27328 -115201 4213 -107338 -221636 -142371 199201 160047 79532 -71367 362480 -70454
9532 -219848 12493 85891 113814 -108660 -95971 -238985 84791 -288618 -145504 -272252 -55594
9520 -146956 14936 -263371 92362 4531 -150326 -45352 -2873 -126970 8997 -143223 -183680
9509 -183680 13245 150267 -107879 -258054 -169796 -300845 -152884 327039 190512 -130221
9498 -55600 -285578 117311 100149 -147737 -169728 -260925 -246690 -94835 197817 -329767 -108636
9486 -3442 -395104 14898 -68278 94109 181093 221417 -36232 -166761 -58396 -160125 -172969
9475 -172969 -25233 -4839 -46795 100752 -63156 -136243 -20308 114030 -33962 27347 -40403
9463 -20756 -45486 -224655 123052 388493 -65412 42243 -15364 -173402 -59817 -49062 -70805
9452 -70805 -12373 -66926 -65000 -352582 69142 128364 -156819 32321 319780 -375205 58431
9440 7246 -142031 -104436 -111517 145755 53230 60699 -279420 81359 232875 -121313 207024
9428 -85094 -83958 17591 -37268 -7670 -9785 74881 -115091 -99451 124609 -235552 -14725 -166535
9416 -166535 2555 -231600 263022 16512 142895 72429 -40581 -3196 115916 -136773 -81098
9405 -81098 15384 -68170 -217754 -96284 -453151 417295 -146579 -9658 141268 -118009 42782
9393 -116011 -66417 211931 -102847 -219595 172772 -140805 52450 53141 -181509 -225905 -117359
9382 -117359 -346815 -86715 90610 -110686 -106296 -147413 12166 135681 -124845 -291325 -305461
9371 -305461 -112572 -67888 -46198 132407 -320765 40524 -55461 59643 -80010 163820 266967
9360 266967 -319992 93689 -411198 -11504 -21338 6916 -190780 30981 71621 166397 8781 36978
9348 36978 -33831 189846 -63871 -372196 100979 -200501 24153 155245 -71706 108082 -101338
9336 223201 119770 -166025 97432 -419733 142496 -129365 -352605 -133484 -46973 -48040
9326 -48040 -58384 149502 18704 108038 176789 251751 141416 -11511 -6809 -67875 -136175 -77868
9314 -77868 -230958 -49791 -148930 -95317 -295353 43914 83489 89008 -10575 -222685 -9860 152540
9301 -189592 -252699 -20003 6172 148 -118094 -229183 -107058 -10880 105143 -65364 -280517
9290 -280517 -144708 -170143 -339357 222761 351165 -75938 -564 5181 -317138 -196166 -136757
9279 -136757 84539 49649 -208267 -229000 13511 -119302 27772 -49840 -84905 -17687 -148366
9268 -148366 -315766 -287951 -127452 14488 223612 -59568 -243783 -150658 221178 -17979 238474
9256 82313 -7068 -290460 -23161 -78008 225614 -256826 -69772 -155967 -60959 22891 -381533
9244 -263408 73270 -107672 -349673 -57737 -306148 -159294 -359969 8594 181521 184698 89611
9232 70745 -259399 -195445 -292931 101381 -119410 -23105 -28784 -5102 249180 193928 -38968
9220 217092 -138436 60617 -332345 -119693 129890 -196642 38745 -94498 -47550 -364320
9210 -364320 -8118 -313759 -54439 232322 -160865 146012 -194609 -147289 26710 25222 -484106
9198 -100455 353387 -38665 187312 -14564 -26916 -335192 -153552 -122249 -215888 174420 -405655
9186 -257467 -199109 26325 -61898 -61495 132297 72417 327784 55640 72508 -60599 -80656 -62059
9174 -62059 -293781 43809 104462 -212576 -225953 33469 -154679 -317479 -136096 148461 -142508
9162 -54611 -31326 -66941 192071 34815 98687 135323 -204010 -73809 -228424 -88608 -220546
9151 -220546 -380309 162250 -370859 -187535 -178418 -14254 100685 81743 177636 291065 -319328
9139 56723 33537 -104344 -119407 -240296 100743 -186806 402330 -357858 -326294 22579 43092
9128 43092 249535 -151731 35979 -38426 -232924 -85567 243573 -146854 -104586 152318 -130043
9116 11265 -38655 210117 123166 -130166 -380653 -207584 -33408 24046 225836 -266567 305551
9104 311970 24236 3507 -63870 -259502 -183731 89855 50828 -110225 305869 132989 -113074
9092 152760 116751 59522 -190537 -214678 199668 -265349 -23196 -249911 -100291 14772 -180837
9080 -213078 -513441 -339331 -12276 -65144 -138225 246543 186337 -169273 -252567 -94266 196673
9068 -39681 49874 -12620 -14474 -28638 -33002 64646 164783 -297966 -200959 -40170 89479 155822
9056 155822 -362294 179567 -45346 -346577 324372 241255 -74682 -211546 50739 121681 146878
9045 146878 146132 -117282 -55154 -223096 -97868 57128 -12524 -124369 122482 -152220 -202334
9034 -202334 -69329 68289 -287930 -187572 306628 64894 -345605 1109 6766 -369873 -413099
9023 -413099 -242869 -85842 90541 -111339 -18844 -14028 -49205 -13905 -312976 88993 -133499
9011 57687 11833 112880 -44715 230668 195292 -1357 -211478 -140600 86377 -246880 -142449
9000 -142449 106640 183128 157555 -341493 -229875 -79050 -151221 5101 -19949 -179050 80145
8988 -41873 -153600 109434 -37168 -104802 31282 -78512 23428 -252556 -92926 -352185 -195785
8977 -195785 19122 4700 23042 320650 -321672 -67075 -131487 -77735 -297484 -124792 -76723
8966 -76723 -52421 -47151 -302137 -61467 -74993 -209861 -304064 -258444 52531 3710 95379 126746
8954 126746 -170337 -108643 187167 205513 15679 -603962 -219626 -200880 -180513 -135005 197839
8942 -121977 365101 16164 130003 -264078 -146749 128239 40027 107082 -8533 205668 134809
8931 134809 59603 -142725 -134254 -13488 -135555 -278476 14238 -149523 -20588 472315 1068636
8920 1068636 5076409 13220294 3668056 1385521 1089695 8493 155550 -284772 154044
8910 -194893 -60417 96891 -165134 179054 576989 -306634 165155 35734 192483 -136200
8899 -433561 207577 -116178 157698 -70400 -273751 -191164 153162 159396 -184514 -130011 -208173
8888 -208173 120212 101758 -135189 174016 78665 -212635 51555 76645 -191775 -160927 206080
8876 44772 -367817 -208022 29451 -252166 -497144 -92475 -213242 -196922 -187191 114724 304142
8865 304142 53678 -259166 -63775 -500 -30621 -331722 53881 -17226 -40688 -326363 -308383
8854 -308383 124082 213042 -229607 -72340 -98025 -491740 -117548 104583 -82254 -327680
8844 -327680 -175678 -61369 354546 12496 -281018 -316187 -138372 -2565 244469 -193683 120053
8832 247522 -347135 -68034 328216 235904 20448 102291 27473 -280717 130416 -3794 213792
8820 -93440 16909 -327679 -218766 -85061 199186 -108479 -74830 98672 -414280 -154634 -298540
8809 -298540 126815 -221619 -118725 219884 -3298 -372976 -115060 148188 68916 52392
8799 52392 -281580 29093 302125 272226 -316415 149509 -232739 -218648 -209079 -58730 -192397
8788 -192397 -198437 76064 -104032 -32817 -180910 -189262 -36826 -152510 -175612 -14732 93525
8776 -212705 -92098 -102137 -294418 107960 -103113 117072 -463370 -314242 137931 -265843
8765 -75209 -141778 -295353 -69180 -10354 225980 245461 -282327 -214063 114784 66415 240506
8754 240506 -123525 -50208 -2907 27327 253398 5489 19778 -256754 53274 -185724 -254096
8743 -254096 -821 -77084 -13404 -24635 -86102 -122009 -118330 -41336 -318123 -422974 207579 304318
8731 304318 68199 97035 53148 -97088 -236451 193144 9905 -14722 11847 -7130 -228060
8720 -228060 -261102 -100543 189593 67822 7276 161515 -73249 123395 -97890 -517193 -7663
8708 105616 76720 -47965 -322275 -196448 -88705 -151876 259526 -55993 -105347 -249190 131715
8696 -10042 74029 94148 -290027 114583 366610 20833 -136183 -164246 249597 -119446 -211639
8685 -211639 -183488 -251624 117301 3354 167390 -86255 44953 112859 90757 27695 -116182
8673 88269 219813 -14691 123983 166387 67301 76754 112666 53915 -193211 -91255 -88469 -377721
8661 -377721 -216773 2507 271005 208947 -108964 -175669 19918 -129977 48631 -603 -59143
8650 -59143 -370055 -239644 -211246 42881 -110537 -29398 -13317 -126272 87575 -349854 -186082
8639 -186082 -221472 355279 -127640 -187811 7099 -308590 -209773 -174492 -181374 -87655 -7666 -125671
8627 -125671 -34380 7238 -126229 -378798 -67105 79900 27917 -148039 -119824 124566 -50585
8615 -372558 -276149 -189513 -295141 -107074 -132084 40098 -338213 -189254 99400 -14678 12712
8603 -20510 -62534 12106 63451 -202710 -305541 74633 -41631 52851 -201799 43526 73333
8592 73333 -126408 -68119 26945 174791 -326824 -237960 5491 -334043 -364436 -100578 -35206
8580 167710 -59021 114871 435777 -226006 -43097 -90979 37938 231234 173077 -96066 153043
8568 24422 -46601 170611 -196517 -4733 -146131 -183332 330404 101714 -60638 -260879 50977
8556 -112144 7496 55614 45562 -131030 -167284 -3969 -279164 187980 67222 -56142 -55231 93553
8543 -67428 25529 -367352 -195174 -69821 -78300 103861 -110435 -144521 95545 -107017 -147285
8532 -147285 -10191 -246430 178501 -97908 -79417 96443 -27 -190116 179282 21017 -77560
8520 77278 255486 -356680 57946 206323 -43392 -42269 -126732 73962 -178997 -144156 -232134
8509 -232134 152177 -101710 -80287 -34808 -271288 -321197 -301826 -28491 -144360 -170706 -194531
8498 -194531 215493 -337037 40267 -48799 -189983 20144 -461709 380522 -130439 163936
8487 -83724 46426 -15885 -25963 216498 -89106 -136703 63790 -46390 906 -111149 231099 -116142
8474 -193657 -43883 -250507 -94005 -236112 -21667 -13734 -212249 -212680 194128 -93164 -278144
8463 -278144 191369 -86818 235089 158486 86974 -119053 142398 24261 82687 -52625 -132274
8452 -132274 -272617 -99417 -18224 -242987 198219 74320 -346729 -375885 -253782 50475 -76267
8440 8457 -229353 -11337 244259 -202964 -25877 -222614 326406 -191805 -244082 -210071 3799
8428 -211421 -250836 -290381 -69551 71888 -279195 -48400 -57671 -208557 -275924 -245968 -96903
8416 -300205 288044 -115750 -87576 -142373 -68896 196857 44649 68264 109453 -148746 -45338
8404 -96817 -92011 145606 -108012 -145154 -168291 -96363 -282771 176252 -163176 -331171 -145175
8392 -288704 10675 274465 -238307 -42004 -74818 195710 71210 -222453 -196784 -109649 -182275
8381 -182275 187682 270898 -107115 40401 -24816 267849 -512109 68660 64774 -190813 -14857
8369 39787 -169094 -207813 -93032 13845 35554 309954 -154218 199010 -297889 -184596 -128681
8358 -128681 169132 234102 -30864 -390185 -132740 -14508 -201466 -165202 -77057 181655 -261326
8346 2951 155025 -89422 -163414 12532 -86188 2393 -2840 17834 194311 -224954 -63475 275823
8333 218944 -53506 76168 -81247 21467 -56092 67693 -188220 -21502 -172314 167351 -58560
8321 247003 -318655 -224042 -77659 -50528 175555 -122438 539 -274124 -214265 10628 -281067
8309 -104043 -9023 305453 -32432 -92603 -391798 -112243 156098 245636 -31490 -169255 -408239
8298 -408239 159359 6419 -110810 -63662 -175362 -305939 -119994 -305369 135447 -255090
8287 -274478 -159615 -94969 59445 123814 -172973 -33125 -189805 -254713 -162836 -296287 359608
8275 -273021 186747 17757 245593 81157 -182798 -135610 -199642 443626 136349 -118146
8264 -36843 17796 -133067 29388 -141832 -15966 -27129 -269956 9430 -71956 198287 -98859
8252 13826 52672 -73154 49281 -98694 -70827 -113598 -180868 11284 5851 -274594 -136216 35243
8239 128432 -254062 -64584 49681 6946 -135919 -575941 -38646 -145313 -84537 40548 53878
8228 53878 97229 -138523 29334 212882 -160314 -15537 -158516 -36477 -123122 -40962 -323743
8217 -323743 168156 -43334 -11793 50231 -168321 -107944 33935 -347091 -252579 -214897 -181508
8206 -181508 94769 171318 -393311 107717 433354 -117301 -69394 75850 89020 -117252 -45520
8194 -17967 -99027 -78258 -101661 -119876 -231721 -140836 222219 -294592 76226 -189042 274585
8182 -332618 -238031 26241 170668 -77209 109936 -8657 60733 63662 -243585 229205 -226996
8170 -103820 -168762 -92456 11506 -200139 -82719 -131517 114249 -342218 27361 -194818 -65302
8158 -258085 343647 -79810 -151443 -120996 27482 -12741 32084 -16318 -116826 -210710 -112158
8147 -112158 394906 -278269 -85904 212708 -203845 -242960 -245332 -63336 -79331 81378 266534
8136 266534 54066 3965 -248597 -161038 -131140 159422 -57622 131156 -50366 -98703 26796
8124 -98974 -239522 -75965 -8712 362593 -13064 -161534 24987 -108760 228903 55171 -47339
8112 -114366 -59066 -187747 138320 -103950 -443865 49132 117718 20151 311850 41365 94936
8101 94936 49763 -159635 290585 -64050 -352360 48979 -101579 65117 255049 -394425 -499160
8090 -499160 -11365 63351 103775 -163675 -46931 147538 165122 23084 -82502 70269 -18305
8078 -270893 44099 23053 92955 -65805 -16765 58875 335459 -53440 251924 83615 -248098
8066 139693 -56550 50753 1154 87186 115817 390875 73858 98308 -65070 132077 -53629
8054 -309335 184018 -14936 67206 87059 -38478 -6334 -82754 -7686 -88786 -149195 118159 -197654
8041 -218079 264855 -50553 -174790 -227716 106485 -16643 -304503 110984 -309065 -6070 -24046
8030 -24046 94874 -177749 -43252 -56752 -13931 -183819 238782 99847 159136 -89809 -40446
8018 -96572 109664 -70566 -206056 -192705 -89643 169868 75567 -91384 -274685 322985 -412768
8006 177608 -83823 -124043 -245158 69121 -429362 -57306 -244664 -68504 -367241 116060 117983
7995 117983 8633 -141709 13685 16115 127521 -21640 -297157 299011 -356607 -2742 192734
7983 -82880 92148 -42422 -19953 171342 38776 -8317 -184007 -78962 -108623 -13820 -304747
7972 -304747 -151273 -278227 -348655 166115 -53105 -11393 57089 -129664 60761 336934 26711
7960 -196926 -98861 -73056 -75465 -194877 135250 72005 215073 261543 -186417 -41091 -261453
7949 -261453 270608 11195 -108342 -163982 -375644 74996 221147 47868 225775 249343 -84636
7937 -181746 157579 -53435 76421 -5692 11731 -9521 12715 151959 -86275 -8553 135978 -41508
7924 -134616 -48955 -348377 -90529 -34369 49356 -233644 257132 232069 30225 -56692 -142195
7913 -142195 -147700 59663 -17146 -84301 -77447 -2696 301459 -4432 1536 -56919 15848 -30375
7900 -130746 -221759 15470 -93015 -283281 -27140 -256131 -30493 -138981 -72893 -319744 64389
7888 -46847 4733 14264 -218505 52925 -82427 182563 -178151 16824 -262239 -125448 134282
7876 75728 299571 64453 -248399 34480 -315206 11267 23678 -156780 -249280 89474 91445
7865 91445 -339933 75231 -20201 -233297 -99749 -64717 -46919 232998 -32146 -70662 86519
7853 -107648 145343 -305156 27965 -151398 -72386 -195170 171345 -224546 -107164 -221840
7843 -221840 134194 -288857 128264 48715 120022 -62473 -41565 195498 -80433 89245 -71623
7831 126845 47173 136395 -137330 -93216 281488 -97370 -262317 -131488 -64822 144554 313874
7820 313874 -239877 -186369 -97637 -131608 -235020 -2938 -75215 174209 -51950 72054 -209104
7808 -108258 -82698 106399 -268327 105194 -38231 -280592 98830 94141 -52200 -191762 100773
7796 71416 -58040 -33113 -40951 -471879 67178 370135 -286525 233567 -84398 170582 140453
7785 140453 -2481 -247806 -186821 -57766 -263587 -152308 280136 63439 104024 -88697 20203
7773 -106731 -296188 -384910 -95524 -26231 81604 -325147 -42304 40124 -221928 -70110 -37218
7762 -37218 83005 -92503 -177814 48581 174921 20932 -34302 -120944 -192828 -80415 -250043
7751 -250043 143927 -15964 -83378 -3701 -52653 -15093 -10565 -97832 76257 -21648 -132208 142846
7738 -342704 -24440 -254425 185705 105695 -155790 -285325 153035 118327 -30309 123659
7727 -329311 302144 -283694 14739 -49165 -153646 -388203 96612 13145 -44588 29473 -75968
7715 -36142 265174 190390 60987 -32507 -111791 58164 -293000 65415 -146767 29859 307338
7704 307338 74706 -345228 137940 -94918 52862 196167 -51929 -189031 179879 -195205
7693 -219256 385165 -102905 -238599 301083 78478 -22330 -34643 -89348 83113 263067 -29647
7681 241532 113599 -110754 -257302 243669 -11144 -100658 -283142 100664 -51523 148870
7670 -66442 -172567 41298 39735 -117572 -74305 135498 -301062 -89992 -160916 10270 -24247
7658 -195531 105408 -308431 381423 204 -31861 -78453 -101624 -133229 51034 -81016 202042
7646 -59190 159621 147642 -122774 56991 37485 260222 236286 69059 32087 -332891 95688
7634 -283059 -84140 25476 -143255 -68232 -193592 141499 -60400 -106641 -2371 -134974 -348827
7623 -348827 235533 20965 218853 105517 -27219 269037 -357388 -377589 -141419 -289769
7613 -289769 25477 -229225 -60851 -41890 81917 -216637 -118995 -119080 58545 203061 -232884
7601 -171540 -242474 -88440 -134642 366389 97245 -42299 -158406 -107256 139931 3365 -49133
7589 -201098 3008 -192647 -155095 -7726 146652 -136398 95034 -13006 97655 165874 -74761
7577 -182028 39547 -37881 55823 234627 -2208 -440433 -67904 110124 -215818 182616 31945
7565 2519 281747 50228 -195390 -173624 43533 1517 -155039 123224 85885 -302465 -76322
7553 135078 -44873 361869 62702 -155161 -110800 12671 -62869 -297182 -86386 -136370 200292
7541 -294837 209351 -279997 63142 186126 189116 -9894 106348 205837 -80180 -75601 -253692
7530 -253692 -138040 -173402 108312 -69577 -81209 200170 -196564 -70598 14909 -123926 79487
7518 128347 13876 45005 185899 -3290 -90925 274572 243793 -232417 54021 332853 46690
7506 -135660 -195273 156582 -34431 -147447 -255294 -118994 147134 34518 162448 -7173 305
7494 28718 12399 211281 -124837 -9798 183856 -181962 -238045 214074 23647 113138 63531
7483 63531 -10374 55485 54536 -57349 -57970 -13044 -55258 -4871 200951 -73738 -246189 -255926 280507
7469 -178222 93402 69733 -266456 -221424 17659 2211 -303649 -123608 82264 -145626 167904
7457 174623 -274474 -9783 133896 -42815 22915 -191915 253378 -53995 -42969 -64945 129545
7445 180320 100663 193036 -65913 180099 217332 161781 -52064 -89792 60951 100020 -211311
7433 -644360 72612 71297 -546029 176451 -204251 56780 204296 193802 -327450 -401177 150363
7421 43083 -23111 -82887 143573 -38577 -129720 -127744 142728 -34592 -319261 -16286 -180640
7410 -180640 -66478 -10843 -227804 -102168 -198549 -128740 -270747 216737 -99794 25949 -39541
7398 -365622 -3501 -197734 -310218 70972 238273 220052 132956 81397 -349399 -390765 -67812
7386 -179324 -192191 -176886 -315706 43913 -117984 -1609 6979 146271 -95951 357903 -199817
7374 -289469 183818 99249 256609 374675 -291853 -167429 -6558 -193538 69342 -198621
7363 -251893 9177 -61032 -52391 -146306 -31325 -310221 108492 -40323 -221100 -146526 126052
7351 263304 -97007 947 157046 247150 -79947 -55964 -105395 66357 -34303 38973 -127388 450877
7338 169017 -125320 -28028 139970 119391 190264 276937 -59667 195980 95814 -74731 -352515
7327 -352515 204493 -31453 178348 -182003 -3960 29569 -181617 -41758 371110 97627 -13722
7315 296833 -234174 499410 342279 -193728 -34964 124402 -11959 -119271 -199587 -176094
7305 -176094 -5324 159481 102835 -107792 -5054 304018 -141549 -29888 162860 -55002 124066
7293 282701 -143570 25142 -81013 14301 -322223 -396258 144236 -71221 58948 93067 -64866
7281 -73116 -157446 228369 -18050 -441294 -260253 36940 -190732 48355 -141925 -1447 -164585
7270 -164585 211259 -96994 -41066 -24111 -181190 -63329 70307 97508 -30934 320811 254519
7259 254519 -118946 59157 107399 -421038 215391 -115806 -217503 -53167 82834 152737 5633
7247 -254731 167690 -7438 49585 89489 -7193 104782 -129275 -122552 -318335 -115357 -85860
7236 -85860 -46516 -286944 -59099 250806 -89022 -79463 103141 -123266 215382 30114 -152864
7224 304033 -95397 95540 -125997 -348154 194813 202095 -113306 -30920 71689 92599 -215471
7212 159317 -39777 -68338 -219904 99382 -150394 -65375 -61372 54611 87892 122166 -97761
7200 54164 -64082 55201 -224053 110278 28358 -250486 52392 -54480 -248718 224246 -25671
7188 -88542 64083 124832 49614 -45904 75823 267503 334704 -131425 -59804 -78278 -126416
7177 -126416 -146009 161033 140196 34246 123457 -50594 206377 -166858 -115577 -128261 245415
7165 2883 222895 -268789 -269426 106529 -146190 -50707 -226435 110559 19003 198955 192775
7154 192775 24789 140469 273028 219455 225162 92754 -179846 -68604 -59963 -35726 -105749
7143 -105749 195324 -203469 82940 28653 -412496 -113668 7747 -405207 215857 -194037
7132 51853 -230861 -130757 311243 28371 196789 -217496 160017 -170300 135842 16707
7121 -166801 167419 -93125 -58902 -59611 140943 -52460 279614 -116505 132880 -49900 -135690
7110 -135690 -220461 -205311 -227184 -164967 -472553 48245 -54184 -111510 -27150 -354058 171514
7098 92552 223679 -353266 243572 119885 210657 275630 -92537 -218183 -74109 -8787 243255
7086 52965 -359886 -85446 53614 -207945 151782 78671 363166 289937 -68607 162562 10975
7074 21960 -47736 -60239 -119984 82531 -94401 110452 40831 -294588 -12963 -166457 -185287
7063 -185287 -294815 -95463 -259799 -245563 -285032 33408 -447730 -86133 79276 -47639 137278
7051 236536 -107395 -48217 217095 -109518 -265555 122488 127456 -167157 236435 -60539
7040 41402 -110279 195583 276046 -106122 -253999 -133677 -46086 -80265 196708 12418 -33707
7028 -119840 -64661 155394 -34294 -123764 128726 118110 364120 -361697 -154788 10725 -90428
7016 -368462 120096 13939 -228171 -383115 -163681 42038 150543 55067 -150364 -100922
7006 -100922 -468673 -252175 -92891 -42703 -172844 300673 -86587 26533 -197125 95326 -27034
6994 -71062 135354 267521 60591 -261877 -88867 71875 -80962 173856 -58290 95960 26940
6982 -379055 -229630 -34318 80644 -240355 -199043 308305 219386 -177935 -224296 5128 -147684
6970 -185967 244254 99154 -311255 212701 71461 75568 -158956 -141396 -82577 81810 421813
6959 421813 46168 358561 -65039 209579 -228579 4507 117200 163072 -78536 -151956 -210921
6948 -210921 -256743 -163922 -280413 222780 -37955 -143521 -12250 -416286 112872 -266283
6937 -152232 106425 -236169 82826 171318 201143 20086 152735 196795 172244 -49060 131980
6925 -62887 304045 -59808 301056 -147470 -180468 -100040 -353693 176675 147000 25933 92896
6914 92896 57842 215019 -61773 -5289 26552 82285 4299 92854 -23599 -112515 -79078 -70736
6902 -70736 220039 -16120 -95116 -48146 249270 -71336 199965 -248169 -107573 281217 118253
6890 23866 97814 -503729 -124089 196661 -292290 -96461 -173163 -139921 -167160 -204297 95021
6878 -289744 -107766 110547 -110462 -205832 236745 -46350 91411 -180508 -126557 117738
6867 108344 54734 146990 -2007 -158852 104118 448596 282054 -95146 285796 -26807 77931
6855 143971 2385 248641 -85503 -20209 4902 -125683 235065 3514 194769 -38093 -77048
6844 -77048 -212861 270972 -9586 -91578 -61888 -21887 15813 -14113 -95422 123350 -108817
6832 -79936 311827 -92933 -23108 217966 156328 -157670 -341129 219768 -341328 -14442 -394788
6821 -394788 13451 245017 -106811 -1740 219691 -171530 90356 -166605 -188156 -399649 -169507
6809 217785 -119313 -107764 -93722 -69654 -234517 -31804 -62915 -47025 12981 -269237 92894
6797 -83008 99785 -27904 174321 -140245 150647 110621 58195 25047 195900 -12319 -364086
6786 -364086 -157104 -153137 102856 3691 -32874 -213624 -252979 -72160 -3858 188681 57660
6774 216144 -38721 -75207 -135381 100007 -46176 -522955 -57405 258226 -3664 -360131 -85138
6762 13267 177784 138287 40079 30289 149114 -187782 24247 -119755 -93343 -95884 -164382
6751 -164382 33869 326992 -134750 190953 44117 -129077 280649 -24384 -326150 -329956 -20905
6739 -26600 -71255 -72998 -74870 -35703 -230512 90792 182975 -189634 -383745 -350097 -245787
6728 -245787 229754 104447 45466 99099 -518284 -180006 190879 69114 -200430 -107013
6718 -107013 -39402 -14518 -258817 197909 -87566 -57773 77177 173142 -151960 -217808 -293316
6707 -293316 -95570 -90986 10757 -199585 -139034 -211625 -14984 -178152 151994 -31706 -59460
6696 -59460 118228 -13510 11285 217230 157827 -174498 -267835 181253 -217073 -65416 137025
6684 232222 48386 -116771 5862 -132823 -48169 147918 -16311 211729 308384 -32238 -36088
6673 -36088 265224 -517964 251153 -93966 47252 139771 -27246 -30594 -2948 -244723 160496
6661 11530 301024 -205304 -192618 96672 -28229 -87883 -156879 146218 -58171 64590 -120399
6649 -65040 135972 87393 -293311 90333 153120 65997 -217321 75042 101291 54796 -165117
6637 -28577 32486 -169581 -107325 -49628 -368922 149165 194583 -242964 -120024 -144772 -27193
6625 -59591 -9680 140912 -99618 121979 143728 -152632 -160842 -142400 518985 -166485 -232670
6614 -232670 -331805 -304002 -17762 -58335 38556 1163 -9549 61411 65772 -222181 -1026 -247816
6602 -247816 -157313 -100357 303550 -210026 43169 -35862 -15633 162137 -119454 188612 -198002
6590 -184703 -82830 116076 -15182 -69977 -174501 142722 -81906 -199037 63381 -348727 -362570
6579 -362570 -78056 -200901 22104 -22784 -206318 -27760 92628 203980 -13603 161107 -195423
6567 -100031 -179672 -53012 -20692 103914 -322393 111562 -5688 -226077 -286240 -211157 -81481
6555 -39776 -155399 -46921 -172702 -309942 321379 -69492 22408 -23149 218568 -89186 61148
6543 -65845 -280194 249840 134496 84935 -331041 18231 304410 49633 32933 -378563 136228
6531 -168753 -184089 -48047 -119155 334317 105478 -81853 60894 -470551 -9099 65163 112203
6520 112203 9589 149562 94365 13904 -95547 -275499 235668 109186 188399 91230 -11050
6508 134115 -220731 191230 43321 -26822 -93514 -13378 130353 77470 68628 -164820 4205
6496 144899 -291464 -249102 -368282 19981 28212 -113019 -22121 190994 15100 -79414 232498
6484 348123 26757 -209351 -35408 16148 -68190 372083 -110268 -111270 -28170 -238750 43972
6472 -25669 206060 -290738 -184502 39676 -173422 39315 180696 -73145 -394546 336338
6461 136050 256301 130123 -176789 148118 90085 -59203 -52431 156398 403482 65641 -900
6449 -18452 23364 -145738 555 46866 -236379 -124486 95691 -277326 -314509 308541 -46045
6437 192081 -92381 161956 26937 287524 -58228 -73499 -226436 128313 -181876 -33981 -301767
6426 -301767 6824 48782 -18937 -62299 -3889 -159013 -118296 -201460 5932 -203319 -46441 71226
6413 -84677 -43121 36716 -8968 99465 -332461 79592 -144524 242661 79313 327376 -244182
6401 116922 -150467 1546 87550 -167646 -80497 57403 226273 -15819 39350 -24425 187962
6389 -237334 -33438 -249744 300752 -108107 -201770 107329 -155870 -147406 -167621 -19215 -329369
6378 -329369 164992 79200 -175472 -33089 10485 -181913 -159163 -215125 -164245 -44828 104183
6366 83957 185457 -32729 167557 114738 70876 140050 -270817 -112584 -284088 85752 -366080
6354 225169 -253247 109855 220995 69323 -87559 -159685 108638 15593 -356828 273946
6343 -234289 139963 492128 46212 70987 -114747 -218881 67274 -204102 115733 -123423
6332 95357 153482 -32667 136771 230487 -44555 -128266 -87320 212663 445669 197022 -144231
6320 159239 -4539 -246782 -266245 157163 65403 -71496 -64345 16748 20170 -181357 -61238 58437
6307 -80325 93802 168157 40525 180150 -78920 -223560 -27645 -163577 -193426 241698 116478
6295 54022 -106195 -69384 47735 210771 -17707 -134711 120070 70078 83383 -184821 226723
6283 186180 -399155 -248758 -18016 14854 65787 166273 91300 147928 -103891 -7800 -194058
6272 -194058 -77367 41388 99228 71810 -150711 12211 -132581 -256539 256258 -28462 -181145
6261 -181145 74301 -89710 38773 94071 -49151 78704 -98666 -46538 151218 71018 1512 -16010
6248 -81317 53233 61165 -170314 -177241 -120995 -190430 -17549 -102986 247635 94075 28379 -75828
6235 206443 -198763 100377 344439 -3807 -5962 -181683 25305 -266270 110244 -192233 125354
6223 -252687 184560 422282 -190422 50529 -257396 -160041 125476 78059 -116507 85000
6212 324273 -288806 74940 55966 24300 -124396 28257 -432665 42736 -81653 -145537 305330
6200 -100935 -123762 -307166 -234619 -85783 135846 146023 -226277 17875 179077 -47385 -260386
6189 -260386 -105622 -190579 -199546 86337 -109924 128080 -35733 -201479 -20190 -411930 74942
6177 -71175 -90331 -132899 -281513 178774 285501 147324 140256 -175154 294126 -8405 106577
6165 -362192 -116017 -90911 261143 -345237 434104 230974 -200391 -249729 -210668 -273176
6155 -273176 -119653 -81867 80402 55904 66196 150133 -170858 -94715 -32387 70154 -52687
6143 -203624 190775 -32728 41435 -11178 12365 -145200 -111301 71087 133211 153771 35367
6131 213564 -190932 181690 -76490 -190234 33065 42823 -163638 343060 -82499 -53934 -52574
6120 -52574 287114 216143 -46443 29802 -75334 42500 -104220 -51267 -24261 145230 -24362
6108 1754 42821 181214 -23062 274237 65286 224397 -174649 125147 -99372 -17001 123316
6096 -139121 132072 -219189 -142506 -9898 30464 -23830 -33721 72235 34821 -51221 -189210
6085 -189210 -491485 22731 371822 -99826 -28965 -251725 109796 296887 -30824 -185387
6075 -185387 104422 -42207 -65767 -148982 135155 -430217 -336879 -94952 190534 253786 7909
6063 283266 -117972 -26553 -155060 -60636 -242316 71490 -30084 69888 378049 -13793 184754
6051 -162356 -288636 -237838 268721 -19746 36219 88352 147037 -158344 -351903 -173397 -113853
6040 -113853 -117369 -108207 16505 204986 -316824 44585 160619 318310 57463 118083 -157583
6028 107528 -54405 309117 -39605 -103461 -193704 107738 -265386 -122893 52311 -43268 22892
6016 106660 -86140 -45836 -111488 -222249 82761 -33141 20552 -229201 113534 138092 -147200
6004 138851 44327 -23239 246048 88485 -858 121491 101333 -222254 186020 -42463 -38521
5993 -38521 233663 -41722 -10280 -333591 -52984 -88924 -108494 -110008 -26812 124141 -177398
5981 -225108 -202261 -61793 -51434 -20784 7661 -353505 -58022 -63377 6722 218099 148403 232941
5969 232941 66315 -90298 -254148 103346 -217696 63366 -20501 33869 -16551 170440 -72498
5957 -60548 13904 220948 -106008 182712 -48085 259710 -271733 -147163 266875 -32566
5946 108025 -296676 -58318 -39529 -1517 72807 213917 67709 12537 150834 -124533 -60045
5934 -171411 -120918 93015 118375 -129557 -115880 -35156 -141067 -85341 -15888 -118849 28499
5922 -244109 -164813 27762 100075 60199 161241 -328649 97934 76903 -200211 89923 -36479
5910 -275528 -79704 -120785 192871 8076 -58075 19926 -3032 -364809 46223 -103931 130860
5898 279197 -118340 -110612 8377 136624 -224838 -485175 69526 -349158 97310 -11643 -86189
5887 -86189 77248 -153373 101171 -362872 35166 -7460 85960 -34148 -205164 -101639 109439
5875 247332 38845 -300116 92118 -140784 117102 21987 24982 -284734 263258 7142 -62277
5863 -126230 103731 200495 304014 168215 116896 99779 361715 -12059 164494 -75187 151093
5851 173164 -65384 66336 -199336 -126393 283281 489862 -24327 63703 175924 -419899 -265499
5840 -265499 52128 -57675 110039 -91300 317953 -126098 344559 164455 187339 -120827
5829 -124797 90731 -230304 -78013 -194316 240223 -67352 25162 -8066 -255043 -292574 82148
5817 -347599 -109938 -170327 95511 262464 -83021 -17611 -123466 -74263 231968 416298 -387600
5805 -140394 224280 -198271 -27023 -311700 -96478 -304618 -5932 21771 108117 149150 -38110
5793 -63744 -114476 150711 254225 -92376 228838 -100482 -177410 -267902 -278795 103360 -350745
5781 -98939 200567 -64168 -286020 -122496 -3466 54820 -410368 -189647 -138710 60842 -25419
5769 51770 61228 -30736 -256150 345144 173911 -72786 42354 76600 -184422 73684 -257515
5757 -343242 262347 -237313 171598 3951 19170 -14549 -68013 -143063 10098 -14292 288376
5745 -16123 -43567 208429 -207309 -243815 -25721 -236815 -246224 170487 130608 -257230 12290
5733 67076 11461 129815 -232702 177995 61315 442610 -104106 -101843 152878 8932 286485
5722 286485 -216998 158315 1555 -61190 143026 -79866 128468 168495 198291 224654 -223558
5710 -454822 -26061 5625 45260 -30599 -316711 112019 -61565 65232 185593 219875 61854
5698 -149392 -11894 -80770 29316 388179 -90443 294057 -12473 -356241 142616 29694 388110
5687 388110 36897 26466 23300 -32398 -54216 -239643 370269 268389 -92031 11562 -144773
5675 -313788 -232135 -45511 -201081 207789 -196099 149284 138682 77786 -81035 -534247 54831
5663 -203072 -205068 -21286 176511 83515 40973 -82316 -311835 -148905 -112891 100649 120158
5652 120158 74353 -57127 146999 114318 -186490 -154699 -87904 216553 45537 121038 82056
5641 82056 197906 64114 -152002 -456969 215552 -196263 -29100 107161 9003 -261405 21646
5629 48119 -103992 29643 -13370 -16202 -2874 187971 67966 -149466 -59032 182261 350 -141140
5616 -82976 -195143 -469505 172188 109393 236585 -50759 275537 91439 -440415 70985 -190860
5604 847 175589 -36673 17881 163733 93558 -134892 -74214 241147 -83731 -284805 -194071
5593 -194071 -101104 43896 -274374 3524 -49882 -66220 -196213 81510 -57906 20061 -161666
5581 19475 -75336 -66217 105137 182436 276450 -301403 25938 18054 -59818 -232918 -80199 304949
5568 -47430 -83804 -189103 -32546 -136711 294791 -450627 54126 254117 -152298 -352472
5558 -352472 62812 -8225 52812 -106111 249969 -178662 240021 28393 168441 -60045 -108936
5547 -108936 28262 -17725 136779 135852 -207238 131895 165014 124491 -41449 -44849 -336815
5536 -336815 260149 -101388 -169846 -33254 -42670 -124383 34077 -178493 -45557 163715 -335560
5524 26039 -129728 46351 -160684 -192285 111791 -182530 96386 44477 -42127 -13561 70171
5512 77789 -156646 -25834 217274 273473 177426 143448 -8411 -102962 30629 -385842 -49905
5500 48354 54828 -192470 90961 -99608 -9284 413251 49438 -190033 132164 168848 282512
5489 282512 -96613 -232827 336 373141 -278484 105334 -76 -265462 -123771 118926 -51307
5477 146587 4939 267101 -70830 150849 111613 141691 45051 465 60806 -194538 -13500 -16741
5465 -16741 -177451 -45814 -77447 72724 142690 -241043 114080 37621 256732 47714 26619
5454 26619 101112 -239525 135347 171931 -61526 -61785 -345261 53272 185704 9148 -6938 -119245
5442 -119245 197413 194690 15955 3276 -18960 83663 26045 -70639 -10401 -119865 -374526
5431 -374526 -596 -402207 -129458 170675 -175701 391483 28810 -100340 -254237 93483 -216034
5419 82863 -59820 -115930 -237356 4829 163342 -106229 124287 280665 -304610 -107416 76046
5407 27947 42404 78420 142717 -215031 -630060 108845 -283258 -292447 381976 -22406 -46669
5396 -46669 -241922 142519 -111936 79580 140648 140942 -78462 -203365 4702 111047 -212936
5384 -25044 -213501 157965 -52772 -16100 235417 -294284 -259396 149830 162458 123063 -49968
5372 -94136 135677 -126127 347059 266108 101440 43581 -26541 -121358 -14281 133972 222187
5361 222187 23318 -38980 -14368 72069 148087 95618 365377 164893 272956 -130381 -152734
5350 -152734 80824 13610 180938 -202618 226840 -428158 199356 -26157 233515 -11743
5339 203748 -181780 -252043 -367798 -222908 -32724 28205 -157131 -54691 13037 -196630 130888
5327 -93564 69404 -169581 -127114 142864 -181816 -32058 -242585 -157864 -49367 121686 -92267
5315 221588 91194 -257048 226573 20346 43915 -129590 116069 -182681 -137905 214837
5304 21831 -172441 269747 -29419 113076 -199217 -373737 -68133 -26839 -168981 183925
5293 263685 133274 -182017 156905 -59066 -222396 342929 30058 -189766 100503 19120
5282 190919 -28783 -67498 -77687 -20011 -16902 -523101 113099 -118861 -281418 130669 140303
5271 140303 -8407 344366 -247295 125809 -232775 102788 92301 -307903 -175785 230364
5260 347011 -317865 -188660 304695 -385438 183937 -65504 11992 34150 274913 -41791
5249 47649 28144 -242928 30723 64221 24024 67491 -161328 113700 -6620 96624 -2869 455898
5236 242984 238558 -77570 174450 145458 87918 -346539 329236 -164995 -51049 303935 85412
5224 -18049 54029 -163644 -92987 -187632 23868 63226 -67394 -280618 -41643 700 91641 -135693
5211 -4821 17613 299542 -202807 66098 185408 -26548 -6547 -150007 -173345 119234 -152687
5199 -189200 306707 -173016 -9472 38627 178151 -18279 99778 -59289 248072 209996 -168058
5187 -168615 -147608 366296 -67301 -54590 147444 -167706 12491 -154045 168123 -80094 11093
5175 144420 -140184 296361 -55095 -77045 -178045 51985 -84718 57304 99367 -65992 -5217
5163 96526 1494 76000 26128 32737 -99823 -1685 -82755 209858 233828 -143556 32938 -203051
5150 286980 177153 -134332 -30775 180220 76976 -37005 -89736 362028 -49568 -38066 245626
5138 123858 -107906 105484 -98029 -56734 89547 307109 -232711 -52196 -37481 170977 -175191
5126 80527 90330 -269014 106471 350922 14882 414444 81989 249698 -226118 183001 -294830
5114 -245983 -12860 -145611 248863 -396838 -246809 246877 -82445 -69333 30076 286446
5104 286446 -201860 -575568 170940 45811 78231 212149 -167219 -46010 -306559 -129295
5093 -39031 297088 10352 97092 249397 -204361 -2776 56948 257441 186114 -15707 -375305
5082 -375305 91370 170921 271814 -33637 50711 421015 -169188 -131582 83785 47304 -4643
5070 199703 130358 -147074 -53610 -77576 445864 80717 102981 7198 84459 174876 135098
5059 135098 -1737 64526 303147 422687 -252853 -77379 -96384 -496505 30123 -34253 300551
5047 102354 77953 -328055 262577 41499 -206554 124135 179865 -81683 132754 65831 -268099
5035 138411 116912 328910 -60742 166688 127725 55301 337474 107749 193872 -162003 -134055
5024 -134055 134345 -53809 328763 34577 360431 46914 -333196 -325616 -92512 199343 -224731
5012 277926 59706 16604 407541 -12265 -29193 49039 180145 -139624 70551 -97288 302694
5000 296755 -177724 -182026 -67137 -67593 174523 117988 78378 140735 -59577 -321949 89832 -246213
4987 95640 -31374 -103761 3500 164047 -162640 -11098 -3757 -205859 5192 99982 162386 -28804
4974 -477126 9613 310772 72268 30727 10601 92769 176122 509847 -16687 64893 378691
4963 378691 -40655 -198446 -131951 -5763 36997 213277 -217942 -265440 -91435 137572 124711
4952 124711 -91550 -141343 288514 -59405 281140 118746 -39227 -61515 -155875 -117817 -25587
4940 18427 20137 -23553 -327846 83511 32273 -120669 104750 250257 445604 -70919 77007
4928 10989 20898 -68758 -53522 108500 69890 -9435 -212063 18225 44998 -241813 -131011
4917 -131011 -43823 25387 -145282 342886 -121947 -70567 -240816 184256 -176452 323658
4906 203613 277350 81646 88281 -12715 -27747 155327 78258 -160878 -41183 -106269 231380
4894 -68371 94335 30752 -121534 172799 -16945 67180 -88835 -111686 71142 -219483 -114272
4883 -114272 59338 161255 -3813 31072 266999 -97283 39775 -81183 -69038 -123266 184785
4871 -305767 -352836 -74315 -80581 -127186 74116 83997 -231365 75108 -185877 -59741 241203
4859 204697 -154608 -282936 142121 158597 -270854 244374 -72884 55584 162111 195284
4849 195284 -261323 173866 163923 -53155 -12562 -245470 162854 201610 55934 68747 -112727
4837 -135102 -112248 13081 156421 119460 -951 171175 292853 -117475 33638 -152612 222511
4825 -61357 -135592 288281 -235959 262817 184403 -62376 -11634 -317566 -10684 168483 188066
4814 188066 -23917 110460 -50141 -217616 383903 -90237 -317565 -250677 -45011 -320961 284487
4802 548 186879 -122031 -108461 -56512 36683 430453 -24222 4075 -104240 180111 -95507
4790 70809 125240 229529 127494 69219 186040 -6750 -276545 27081 119450 58477 156869
4779 156869 335446 18290 -180886 -137906 -102335 -105509 -10083 -8104 -65414 155053 96731
4768 96731 -356681 155169 -94517 39378 67425 -27665 131885 -266990 149086 14579 -18550
4756 -162702 5313 -167271 -163179 363807 -25171 496795 -116325 -298966 76430 93812 235468
4745 235468 -34915 164376 198894 -28215 182923 -117203 -128353 122926 79646 -211142 -53085
4733 71215 -145909 280517 134591 171228 620 61887 32694 -252626 1441 52267 -43483 16896
4720 188753 -298760 -172647 211666 206492 193159 355906 48992 82806 59023 -133585 59877
4708 225897 104715 172520 -192778 98134 -34946 -99480 -48098 193661 -145542 417910 52958
4696 -42690 28195 397710 -38831 340882 25660 -156427 -83910 47312 -189386 10635 42410
4685 42410 36099 -368601 -131050 103756 -147883 198491 -98116 102359 132553 388908 177920
4673 152785 -395753 -55209 -33902 91925 116088 148974 -157444 346043 24707 254380 -150249
4661 570715 169766 51245 257770 16654 460729 -38907 56317 62445 -141359 214946 -86317
4649 -143168 -97382 63520 -172173 -85657 29673 268764 -105325 -106522 -37276 164031 52072
4637 -351615 -135270 321187 -82661 259597 362429 22647 -309911 265220 -63420 -43365
4627 -43365 133971 141987 -40484 68125 -199610 -79960 109493 93512 -40218 92507 16724
4615 98916 77567 -323150 -59564 372007 86176 -53701 -33707 86666 238490 4449 17917
4604 17917 36663 -22472 -90788 -90962 -100285 56543 -80295 87135 151521 301212 -128764 466207
4591 237831 -1809 -51907 -74967 85985 168927 -268101 -117198 145992 268678 104979 -169015
4579 218877 21855 112819 77550 -240626 111498 9121 -139892 -235250 -49177 -241786 -345241
4568 -345241 92592 -223057 294601 48792 -87463 115307 235132 -122349 142654 125666
4558 125666 251139 -22218 -57838 435949 -113207 444675 -88556 11753 307786 507617
4548 507617 182656 55144 279390 124863 -132018 207883 38457 -101688 210896 163844
4538 163844 -247609 -68667 67906 283311 218082 -87006 79609 -420487 136779 -55818 -375328
4527 -375328 179300 -102978 -125901 -46021 -203169 -54928 -127708 -109580 60229 -97668 -207228
$$ [...]
##END NTUPLES=NMR SPECTRUM
##END=
