
##TITLE=AC1215_CiNAH12058_5946897_azMbKOOdsf
##JCAMPDX= 6.0         $$ Bruker NMR JCAMP-DX V2.0
##DATA TYPE= NMR SPECTRUM
##DATA CLASS= NTUPLES
##ORIGIN= BRUKER
##OWNER= Administrator
$$ 1.72 TOPSPIN		Version 2.1
$$ 2012-04-11 05:00:11.546 -0500  Administrator@TOPSPIN
$$ Compression mode = diff/dup
##.OBSERVE FREQUENCY= 400.13188235
##.OBSERVE NUCLEUS= ^1H
##.ACQUISITION MODE= SIMULTANEOUS (DQD)
##.ACQUISITION SCHEME= undefined
##.AVERAGES= 8
##.DIGITISER RES= 22
##SPECTROMETER/DATA SYSTEM= spect
##.PULSE SEQUENCE= zg30
##.SOLVENT NAME= COFFEE_meoh
##.SHIFT REFERENCE= INTERNAL, COFFEE_meoh, 1, 14.98061
##AUDIT TRAIL= $$ (NUMBER, WHEN, WHO, WHERE, PROCESS, VERSION, WHAT)
$$ ##TITLE= Audit trail, TOPSPIN		Version 2.1
$$ ##JCAMPDX= 5.01
$$ ##ORIGIN= Bruker BioSpin GmbH
$$ ##OWNER= Administrator
$$ $$ C:\Bruker\TOPSPIN/data/COFFEE/nmr/AC1215_CiNAH12058_5946897_azMbKOOdsf/10/pdata/1/auditp.txt
$$ ##AUDIT TRAIL=  $$ (NUMBER, WHEN, WHO, WHERE, PROCESS, VERSION, WHAT)
(   1,<2012-04-11 05:00:04.187 -0500>,<Administrator>,<TOPSPIN>,<go>,<TOPSPIN 2.1>,
      <created by zg
	started at 2012-04-11 04:58:57.687 -0500,
	POWCHK enabled, PULCHK disabled,
       configuration hash MD5:
       1A 1E CE 29 27 FD 77 03 67 4E F0 E3 C4 B2 CB 90
       data hash MD5: 64K
       6A 9B C5 1B 1F B2 0A 58 52 FB A3 75 34 87 82 BD>)
(   2,<2012-04-11 05:00:07.375 -0500>,<Administrator>,<TOPSPIN>,<proc1d>,<TOPSPIN 2.1>,
      <Start of raw data processing
       efp LB = 0 FT_mod = 6 PKNL = 1 PHC0 = 0 PHC1 = 0 SI = 32K 
       data hash MD5: 32K
       B3 05 57 6E 84 C1 58 21 7F 27 8E 27 85 53 90 BC>)
(   3,<2012-04-11 05:00:07.703 -0500>,<Administrator>,<TOPSPIN>,<proc1d>,<TOPSPIN 2.1>,
      <pk PHC0 = 214.2279 PHC1 = 0 
       data hash MD5: 32K
       8B 01 37 92 0D 13 CC E4 4E DC 77 C0 A3 A0 4C 69>)
(   4,<2012-04-11 05:00:07.765 -0500>,<Administrator>,<TOPSPIN>,<proc1d>,<TOPSPIN 2.1>,
      <abs ABSG = 1 
       data hash MD5: 32K
       FA 66 8E 87 2C D9 F5 43 7F 1F 88 93 09 EF 76 60>)
(   5,<2012-04-11 05:00:07.796 -0500>,<Administrator>,<TOPSPIN>,<proc1d>,<TOPSPIN 2.1>,
      <abs ABSG = 2 
       data hash MD5: 32K
       22 47 48 E8 FD 80 C1 A6 3C 03 A0 C6 EA CA 9A 30>)
(   6,<2012-04-11 05:00:07.828 -0500>,<Administrator>,<TOPSPIN>,<proc1d>,<TOPSPIN 2.1>,
      <abs ABSG = 3 
       data hash MD5: 32K
       06 75 67 BC 3D D7 02 98 B7 B9 F2 52 0C 2E 6D 12>)
(   7,<2012-04-11 05:00:07.859 -0500>,<Administrator>,<TOPSPIN>,<proc1d>,<TOPSPIN 2.1>,
      <abs ABSG = 4 
       data hash MD5: 32K
       1E 77 8E 2F 00 DE CF 4B F7 3D 4A F9 8E 25 86 D0>)
(   8,<2012-04-11 05:00:07.890 -0500>,<Administrator>,<TOPSPIN>,<proc1d>,<TOPSPIN 2.1>,
      <abs ABSG = 5 
       data hash MD5: 32K
       E2 D9 E9 48 2C 22 BD 81 D1 8C F4 3E BA 52 34 50>)
$$ ##END=
$$ 
$$ $$ hash MD5
$$ $$ 15 A8 A1 52 5D 24 B9 5E 15 78 1E CC 5C ED 60 DD
##$RELAX= 
##$RELAX= 
##$RELAX= 
##$RELAX= 
##$RELAX= 
##$RELAX= 
##$RELAX= 
$$ Bruker specific parameters
$$ --------------------------
$$ [...]
150 150 150 150 150 150 150 150
##$TP07= 0
##$TPNAME0= <>
##$TPNAME1= <>
##$TPNAME2= <>
##$TPNAME3= <>
##$TPNAME4= <>
##$TPNAME5= <>
##$TPNAME6= <>
##$TPNAME7= <>
##$TPOAL= (0..7)
0.5 0.5 0.5 0.5 0.5 0.5 0.5 0.5
##$TPOFFS= (0..7)
0 0 0 0 0 0 0 0
##$TUNHIN= 0
##$TUNHOUT= 0
##$TUNXOUT= 0
##$USERA1= <user>
##$USERA2= <user>
##$USERA3= <user>
##$USERA4= <user>
##$USERA5= <user>
##$V9= 5
##$VALIST= <valist>
##$VCLIST= <CCCCCCCCCCCCCCC>
##$VD= 0
##$VDLIST= <DDDDDDDDDDDDDDD>
##$VPLIST= <PPPPPPPPPPPPPPP>
##$VTLIST= <TTTTTTTTTTTTTTT>
##$WBST= 1024
##$WBSW= 4
##$XGAIN= (0..3)
0 0 0 0
##$XL= 0
##$YL= 0
##$YMAX_a= 522662
##$YMIN_a= -634198
##$ZGOPTNS= <>
##$ZL1= 120
##$ZL2= 120
##$ZL3= 120
##$ZL4= 120
##$ABSF1= 14.98061
##$ABSF2= -5.57192
##$ABSG= 5
##$ABSL= 3
##$ALPHA= 0
##$AQORDER= 0
##$ASSFAC= 0
##$ASSFACI= 0
##$ASSFACX= 0
##$ASSWID= 0
##$AUNMP= <proc_prof1d_extract_pilot.lims>
##$AXLEFT= 0
##$AXNAME= <>
##$AXNUC= <1H>
##$AXRIGHT= 0
##$AXTYPE= 0
##$AXUNIT= <>
##$AZFE= 0.1
##$AZFW= 0.1
##$BCFW= 0
##$BC_mod= 0
##$BYTORDP= 0
##$COROFFS= 0
##$CY= 15
##$DATMOD= 1
##$DC= 0
##$DFILT= <>
##$DTYPP= 0
##$F1P= 0
##$F2P= 0
##$FCOR= 0.5
##$FTSIZE= 32768
##$FT_mod= 6
##$GAMMA= 0
##$GB= 0
##$INTBC= 1
##$INTSCL= 1
##$ISEN= 128
##$LB= 0
##$LEV0= 0
##$LPBIN= 0
##$MAXI= 10000
##$MC2= 0
##$MEAN= 0
##$ME_mod= 0
##$MI= 0
##$NCOEF= 0
##$NC_proc= -8
##$NLEV= 6
##$NOISF1= 0
##$NOISF2= 0
##$NSP= 0
##$NTH_PI= 0
##$NZP= 0
##$OFFSET= 14.98061
##$PC= 1
##$PHC0= 214.2279
##$PHC1= 0
##$PH_mod= 1
##$PKNL= yes
##$PPARMOD= 0
##$PPDIAG= 0
##$PPIPTYP= 0
##$PPMPNUM= 2147483647
##$PPRESOL= 1
##$PSCAL= 4
##$PSIGN= 0
##$PYNMP= <proc.py>
##$REVERSE= no
##$SF= 400.13
##$SI= 32768
##$SIGF1= 0
##$SIGF2= 0
##$SINO= 400
##$SIOLD= 32768
##$SPECTYP= <>
##$SREGLST= <1H.CDCl3>
##$SSB= 0
##$STSI= 32768
##$STSR= 0
##$SW_p= 8223.68421052632
##$SYMM= 0
##$S_DEV= 0
##$TDeff= 65536
##$TDoff= 0
##$TI= <>
##$TILT= no
##$TM1= 0
##$TM2= 0
##$TOPLEV= 0
##$USERP1= <user>
##$USERP2= <user>
##$USERP3= <user>
##$USERP4= <user>
##$USERP5= <user>
##$WDW= 1
##$XDIM= 32768
##$YMAX_p= 460930777
##$YMIN_p= -703070
##$CURPLOT= <Network HP LaserJet P1505>
##$CURPRIN= <$Network HP LaserJet P1505>
##$DFORMAT= <normdp>
##$LAYOUT= <+/1D_H.xwp>
##$LFORMAT= <normlp>
##$PFORMAT= <normpl>
##$SURQMSG= 1
$$ End of Bruker specific parameters
$$ ---------------------------------
##NTUPLES= NMR SPECTRUM
##VAR_NAME=  FREQUENCY,     SPECTRUM/REAL,   SPECTRUM/IMAG
##SYMBOL=    X,             R,               I
##VAR_TYPE=  INDEPENDENT,   DEPENDENT,       DEPENDENT
##VAR_FORM=  AFFN,          ASDF,            ASDF
##VAR_DIM=   32768,         32768,           32768
##UNITS=     HZ,            ARBITRARY UNITS, ARBITRARY UNITS
##FACTOR=    0.250966925370066, 1,           1
##FIRST=     8223.43324360095, 141596,       -173724
##LAST=      0,             118200,          -150858
##MIN=       0,             -703070,         0
##MAX=       8223.43324360095, 460930777,    0
$$ Real data points
##PAGE= N=1
##DATA TABLE= (X++(R..R)), XYDATA
$$ [...]
19459A48513D7101j0951a32351N874O937l3052B54560a71474L2292l0567A5938
19447g5731C54726A58318a13872A30589g5465L4321H0089a96041C7983f7037a2864
19435a49639L4192q8907L9178l44632a69482a3918C34199g3505p4372K0596J1906
19424a15375j57619a08857F4631L56259h2273j1805j68182C8312a47779k00718
19414c48497a48068C8192a99637L1563A76193k5302A9443a67067O062A75577l7277
19403A38300o6203d09848a74527D4330J79622d0443o240A7307K1612L4850J61168
19392B34937e4913C52910c3108m15196h5128h786n3276L617K1075j09103K5522
19381a20951e8567j5773j61084O3871c6164o890C13891D5149J77877c81255d5883
$$ y = [148513, 47101, 36150, -132351, -126477, -119540, -152592, 254560, -171474, -139182, -169749, 15938, -75731, 354726, 158318, -113872, 130589, -75465, -41144, 80089, -196041, 37983, -67037, -12864, -149639, -115447, -204354, -165176, -509808, -169482, -13918, 334199, -73505, -147877, -127281, -115375, -272994, -108857, 64631, 420890, -82273, -94078, -262260, 38312, -147779, -348497, -148068, 38192, -199637, -168074, 176193, 150891, 19443, -167067, -161005, 175577, 138300, 72097, -409848, -174527, 44330, 223952, -40443, -46683, 17307, 38919, 73769, 234937, -54913, 352910, -33108, -448304, -85128, -8786, -62062, -58445, -37370, -146473, -120951, -58567, -74340, -235424, -171553, -36164, -43054, 313891, 45149, 223026, -381255, -45883]
19369D0922M4072c05966B04790a03788j26386g2434k60546i7425d916j9254A76382
19357G0977k2695Q3062b78072a00686D0186a21015C5367b12818D16359a48711
19346c37399d1165o8253C78221b10215A46137a05647A64588i3606D0894j0003
19336C0891a90151M3511I4289f1037I1337d90360a21082j0906c6911F8252a1085
19324f7784l3718M9904C0981h3134b5591o7923J8396j14116m7300H7444c66063
19312c00120b4400j72981K4222C606e636k9136j20535J4856D6352b15668k4611
19301b40279B947J40112d709k13212a06069M3563j14022L2954f9531H8829b39399
19289A64328c10462P9981o1749B39134a91541k84899i8579H12b15875L5869k6716
$$ y = [40922, 84994, -305966, 204790, -103788, -230174, -72434, -332980, -97425, -4916, -24170, 176382, 70977, 48282, 131344, -278072, -100686, 40186, -121015, 35367, -212818, 416359, -148711, -337399, -41165, -109418, 378221, -210215, 146137, -105647, 164588, -93606, 40894, 30891, -190151, -146640, 94289, -61037, 91337, -490360, -121082, -131988, -36911, 68252, -11085, -67784, -101502, -51598, 30981, -83134, -25591, -93514, -75118, -189234, -236534, 87444, -366063, -300120, -24400, -197381, -173159, 3606, -5636, -34772, -155307, -140451, 46352, -215668, -240279, 2947, 143059, -4709, -217921, -106069, -62506, -176528, -143574, -69531, 88829, -239399, 164328, -310462, -230481, -292230, 239134, -191541, -476440, -98579, 812, -215875, -180006, -206722]
19278b06722d109j32459q1820a06003I181b05821e6842L408r7322N2081A02465
19266h8689o4527m9772C6746a57463C30893c16785j1954d7228N545J1955J3088
19255a6640j7836k69444a7657e853A83614f8675J926m68404c6735f039f79B04018
19242E6578e4448G5184a55926N4376A04291c19527B7841c2267h459j96467C34682
19230D7666a18609A27706C6331a5717j33985A84086Q9218N8674i036l08074g0968
19218a31978p5244M0434B1819a14874M1213q0652j47076A60096c9330j14005O0850
19207i2485h346n54904a65161b4186N234n6964r7014E316B451c58577M4959A09759
19194b86197b223j27661K9414j22287J07442a490A17546l1494l1874c56719d5980
$$ y = [-206722, -4109, -136568, -218388, -106003, 9181, -205821, -56842, -53434, -150756, -98675, 102465, -88689, -153216, -202988, 36746, -157463, 330893, -316785, -328739, -47228, -41683, -29728, -16640, -34476, -303920, -17657, -5853, 183614, -68675, -66749, -535153, -36735, -6039, -679, 204018, 56578, -54448, 75184, -155926, -101550, 104291, -319527, 27841, -32267, -8459, -204926, 334682, 47666, -118609, 127706, 36331, -15717, -149702, 184086, 273304, 331978, -9036, -317110, -70968, -131978, -207222, -166788, 21819, -114874, -73661, -154313, -301389, 160096, -39330, -153335, -92485, -8346, -563250, -165161, -24186, -18952, -75916, -172930, 5316, 2451, -358577, -313618, 109759, -286197, -2223, -129884, -100470, -222757, -115315, -1490, 117546, 86052, 54178, -356719, -45980]
19182a49938o2345C7730a89105d6780k1846F6766A5297a02962A0744a01191a4764
19170c19491b6583C3019f8326p260a3455j72057b9511j62609A64326B5439P8138
19159A03577L2502a4165l24945e9984F7594b45296a02116A22078a43232B8247
19148b81581C3953R3403b36576A29509b14746K1490f8188C18831q4327b19344
19137d4026k3307O30l53817h3264k1064A10377c31075a4808f531A2342a25073
19125A05530e15286b2220A67892p9099a55648a8744q3446C09845a65652C35898
19114B83652c00311J41314m1527P6258b4769B54506D8049I247R4800k3795J09334
19103A89586a93378i4937M2133r1842q1407C5246K31320c28985G8097b80919C3598
$$ y = [-149938, -212283, 37730, -189105, -46780, -68626, 66766, 15297, -102962, 10744, -101191, -14764, -319491, -26583, 33019, -68326, -75586, -13455, -185512, -29511, -192120, 164326, 25439, 103577, 136079, -14165, -339110, -59984, 67594, -245296, -102116, 122078, -143232, 28247, -281581, 33953, 127356, -236576, 129509, -214746, -193256, -68188, 318831, 234504, -219344, -44026, -67333, -66703, -420520, -83264, -104328, 110377, -331075, -14808, -6531, 12342, -125073, 105530, -515286, -22220, 167892, 88793, -155648, -18744, -102190, 309845, -165652, 335898, 283652, -300311, -158997, -200524, -124266, -24769, 254506, 48049, 9247, 104047, 80252, 189586, -193378, -94937, -52804, -144646, -226053, 35246, 266566, -328985, 78097, -280919, 33598]
19091a81383l3348P2277C1965a71814p0368e0123B03152b2020n799A85904i2883
19079a77346K9759j44108f6145l8193b4799j03901G4493g0392C56824a28327K7930
19068a00397l3290o2187A67943a44743n2721j83267C7422b33938J04351c9169
19057a6220B90382a40778L2106A50851a17106M6344O663b4819l92520I4853f6284
19045B08104b58545E0281b1649A1201L2495c91172O2164B2954P8901b02179A2100
19033A16339D1982P4241c2362B9382b77259a23240N4548L0464k19913A2812a60017
19021A57003a4842m5419B7535c34212R0783j81419a07952d3383A81792d69685
19010a82768I4282A4678a9787p2597B80872F2115J08614k0374a83442P5518M183
$$ y = [-181383, -214731, -142454, 31965, -171814, -242182, -50123, 203152, -22020, -27819, 185904, -92883, -177346, -147587, -291695, -66145, -104338, -24799, -128700, 74493, -70392, 356824, -128327, -100397, -133687, -195874, 167943, -144743, -197464, -380731, 37422, -233938, -129587, -39169, -16220, 290382, -140778, -108672, 150851, -117106, -70762, -64099, -24819, -417339, 94853, -66284, 208104, -258545, 50281, -21649, 11201, 43696, -391172, -329008, 22954, 101855, -202179, 12100, 116339, 41982, 116223, -32362, 29382, -277259, -123240, -68692, -38228, -258141, 12812, -160017, 157003, -14842, -60261, 27535, -334212, -243429, -424848, -107952, -43383, 181792, -469685, -182768, 94282, 14678, -19787, -92384, 280872, 62115, 170729, 150355, -183442, -107924, -103741]
18999a03741C0808j1128m884b93950f3130l8485l6137A39069B0814L6620R3631
18988A51065a71808p0825H0615J50292a80887J545M6376C49094a51160l7646j4468
18977b03274o1122A5821J53916b0298n821n6075a0056j74144k0586Q7977c0847
18965f0931j43872J6619K5678C04424a3059A54009Q0694n308P9589J52669j08023
18954C53630r8315B4918e0281Q206A0774R0174C2622K57438C3966g9986L3679
18943d6307k43996A98474b90815f0077j03638H4334K9333b05267M0286F9369f7918
18931e7928B32887b78517e38k36258F16a8489A39817B4332L6878a58974B07169
18919A98805a400j8027k9014j60765C3893E598a87878K1024D6503a01014j1231
$$ y = [-103741, 30808, 19680, 14796, -293950, -63130, -101615, -137752, 139069, 20814, 57434, 151065, -171808, -242633, 80615, 230907, -180887, -179342, -132966, 349094, -151160, -188806, -203274, -264396, 15821, 169737, -20298, -26119, -82194, -10056, -184200, -204786, -116809, -30847, -60931, -204803, -188184, -162506, 304424, -13059, 154009, 234703, 229395, 308984, 461653, 353630, 255315, 24918, -50281, -42075, 10774, 100948, 32622, 290060, 33966, -79986, -46307, -290303, 198474, -290815, -60077, -163715, 84334, 113667, -205267, -164981, 69369, -67918, -57928, 232887, -278517, -538, -236796, 616, -18489, 139817, 24332, 61210, -158974, 207169, 198805, -1400, -19427, -48441, -209206, 33893, 5598, -187878, -166854, 46503, -101014, -112245]
18908a12245p0402A16553J16197a17390j01815B8432c85168A29075a70116g8703
18897B58206D5604N68423j96217J39435I7732J52098p3160d6010n9710A90640
18886a6611B71096k0129g1991E828a02348j31877B3652b1768B03594a75367h3520
18874a38951A19154b63935G3680a05002C6797h52A19172a74492g7304j06227B94242
18862D2174b71333B02760e7676G6380b57021K3692B06802a23544d3202K1110C5624
18850A42133M6510a91900g8535j9923b2580j10776A00334a40458p125J5365K2128
18839a10090a9393j67683A502J1531R160c70602c2567H2345d69631A64726d4804
18827b11333J00757r0056E59a11380J802A17659b27826A36769g063j58687k11566
$$ y = [-112245, -182647, 116553, 232750, -117390, -219205, 28432, -385168, 129075, -170116, -78703, 258206, 45604, 614027, 417810, 557245, 97732, 249830, 176670, -46010, -105720, 190640, -16611, 271096, 250967, -71991, 5828, -102348, -234225, 23652, -21768, 203594, -175367, -83520, -138951, 119154, -263935, 73680, -105002, 36797, -852, 119172, -174492, -77304, -183531, 294242, 42174, -271333, 202760, -57676, 76380, -257021, -233329, 206802, -123544, -43202, -22092, 35624, 142133, 188643, -191900, -78535, -98458, -22580, -133356, 100334, -140458, -147583, -132218, -110090, -19393, -187076, 1502, 13033, 22193, -370602, -32567, 82345, -469631, 164726, -44804, -211333, -110576, -200632, 559, -111380, -109578, 117659, -227826, 136769, -7063, -165750, -377316]
18816c77316J58332l0846k48737J89908N6287d6428r6947j1363H0221K66244H9595
18804A36156b45115Q0182B39268g4431A12706D2098M8291f4014C25769i8289J6289
18793h2000A67579o2336f8925l3447H8302O1762n2731l1587b67253b4899B38124
18781A2121a26380K9749B4567c97750H8580a08139A08129m1880L2877a49271B43512
18769b26657a7151j51381e4658k72716f4442j3560o9811L9859d819A02512b35645
18757A59416a997B56912b0409j10577o11j47360A5139J42720G8328b92609J14152
18746a78457P7916r3033j9215A80044E5159c03821O597j15806a61372k1981G1378
18734c7447H202J92962a08327A20479O7N0242a74338P1672a1334j59352f1657
$$ y = [-377316, -218984, -249830, -498567, -308659, -252372, -46428, -143375, -154738, 80221, 346465, 89595, 136156, -245115, -164933, 239268, -74431, 112706, 42098, 90389, -64014, 325769, -98289, -82000, 167579, 105243, -68925, -102372, 88302, 150064, 97333, 65746, -267253, -24899, 238124, 12121, -126380, -96631, 24567, -397750, 88580, -108139, 108129, 66249, 99126, -149271, 243512, -226657, -17151, -168532, -54658, -327374, -64442, -78002, -147813, -107954, -4819, 102512, -235645, 159416, -1997, 256912, -20409, -130986, -131597, -278957, 15139, 157859, 78328, -292609, -178457, -100541, -193574, -212789, 180044, 55159, -303821, -297224, -413030, -161372, -183353, 71378, -37447, 8202, 201164, -108327, 120479, 120546, 170788, -174338, -102666, -11334, -170686, -61657]
18722A05568b94150E2056h7194m1984c6553k37803R5024M3883G8419a81672m8469
18711b30141a02342A9691d7889E3488O42c8016j49514O5499o2276n3654N0408
18700a87553A64876b09385a2071m6267l23403a20702E992J07650J38852b83327
18689g8165j74760N4887I8577a49217P4242C12141a91438B11938b95916J22796
18679a73120K5799G2254c85242B43285a04404j99003E9531a47021e7192I4060
18668d3437l1839A93646I4827a32238B29883c2503p2045l170b3817l6280F2501
18656a90143E5609r219b19521m9194J23241e7983M41b4387O744p1181M0650k74752
18644c22926c9333H6391g9285l58997a62141C5595b40649f4965k59148K978A49072
$$ y = [105568, -294150, 52056, -87194, -129178, -36553, -274356, -179332, -135449, 78419, -181672, -230141, -102342, 19691, -47889, 53488, 54130, -38016, -187530, -122031, -184307, -237961, -187553, 164876, -209385, -12071, -58338, -381741, -120702, 5992, 113642, 252494, -283327, -78165, -252925, -198038, 98577, -149217, -74975, 312141, -191438, 211938, -295916, -173120, -147321, 72254, -385242, 243285, -104404, -303407, 59531, -147021, -57192, 94060, -43437, -75276, 193646, 94827, -132238, 229883, -32503, -104548, -107718, -23817, -60097, 62501, -190143, 55609, 46390, -219521, -268715, -145474, -57983, -57542, -24387, -17643, -88824, -48174, -322926, -39333, 86391, -79285, -438282, -162141, 35595, -240649, -64965, -324113, -321135, 149072]
18632A09302a06831D5161j5129J62349b20881j31689a17798B7839c10137h5622
18621B1038f6612D8323c52668G8452J08244H9288c93206q168g3556n4558j26929
18610b55043C32f610B2254K68332B0459M4502a40462d6289A18165C5557a83533
18598a1647m25363A49967h0128A78401b22592N2941l6615a6117k81828e0443l24404
18587c74847k2029a85179e0795j23883g2568A50953b2365k25056a22058B27982
18576a14293A70657J32275c18697A18327C5459O7420J19566b79836e5781C58234
18565B77317a3537C4812g0539k4430o3172C77990b00158J768B37666q0443b66665
18553a366j13863j0399A65107a99098D4353J49466a70553a1286G9390B583J914
$$ y = [109302, -106831, 45161, 30032, 192381, -220881, -352570, -117798, 27839, -310137, -85622, 21038, -66612, 48323, -352668, 78452, 186696, 89288, -393206, -401374, -73556, -128114, -255043, 332, -6610, 22254, 290586, 20459, 64961, -140462, -46289, 118165, 35557, -183533, -11647, -437010, 149967, -80128, 178401, -222592, -169651, -206266, -16117, -297945, -50443, -374847, -396876, -185179, -50795, -174678, -72568, 150953, -22365, -247421, -122058, 227982, -114293, 170657, 302932, -318697, 118327, 35459, 102879, 222445, -279836, -55781, 358234, 277317, -13537, 34812, -70539, -94969, -158141, 377990, -200158, -198390, 237666, 157223, -266665, -1366, -115229, -125628, 165107, -199098, 44353, 193819, -170553, -11286, 79390, 2583, 4497]
18542D497J72666e7417a6471I1490a50733A18775c0823j56181g8147j46974F0565
18530a01715j24804A42578a36498e0796j58194N3342f932l08806B11491r0829
18520A20662l2535L5266b00039A92188B8194b23747J659k7601b6482A67815b398
18508b85067D16056b00260P5720j0022P518H7435a23789b6705k7252C64944H4461
18496a66842e731B02231c56832D8007J81557a91468L4270H7835f1782J5767l82267
18485d28282a27533d9304C4305J45820K0534b34437n0277k5086G3864a7168E0161
18473A269P9274a60496O5492B20406h9241n584A81873m8524A7370Q3024f6268
18461F21855D0178K73090C072K2404e4194A7664R3992l8581i5016n1979O8532
$$ y = [4497, 177163, -57417, -16471, 91490, -150733, 118775, -30823, -187004, -78147, -225121, 60565, -101715, -226519, 142578, -136498, -50796, -208990, -155648, -6932, -315738, 211491, 120662, 88127, 123393, -200039, 192188, 28194, -223747, -222088, -249689, -26482, 167815, -2398, -285067, 416056, -200260, -124540, -134562, -127044, 87435, -123789, -26705, -53957, 364944, 84461, -166842, -5731, 202231, -356832, 48007, 229564, -191468, -157198, 87835, -61782, -46015, -428282, -127533, -49304, 34305, 180125, 200659, -234437, -284714, -309800, 73864, -17168, 50161, 1269, 80543, -160496, -95004, 220406, -89241, -94825, 181873, 133349, 17370, 100394, -66268, 621855, 40178, 313268, 3072, 25476, -54194, 17664, 111656, 73075, -95016, -146995, -78463]
18450g8463k15531I8899b49491B08635c35630g0479B2686a77554j86853N4058
18440c10349J37151A06800J54966L966i9121J8113A44829b5641k70436A8182b41577
18428c9801j72466B37253a48487l0113B70801d508k95202C02880d51078g6907
18417A14390b1392j7535m88772I8564J06038B1993J8813a65041B4170h9603m50567
18406e40170A49305O8304f7337q4956B2604a15079o0616A22960P484c1322j34655
18395a65977F5408a33492F2007K25111G8987P2624l3995J54953F6413K48266F0547
18383A44342C5889R8528E277a01961n31990H9547b05492B09355a05763b1204r5731
18372a16935N4298L917k15301b5571E1485g3042l15608e7947i877k53984f9873
$$ y = [-78463, -293994, 98899, -249491, 208635, -335630, -70479, 22686, -177554, -364407, -310349, -173198, 106800, 261766, 265732, -99121, -81008, 144829, -25641, -296077, 18182, -241577, -39801, -212267, 237253, -148487, -178600, 270801, -4508, -299710, 302880, -451078, -76907, 114390, -21392, -38927, -527699, 98564, 204602, 21993, 40806, -165041, 24170, -89603, -540170, 149305, 217609, -67337, -152293, 22604, -115079, -175695, 122960, 130444, -31322, -165977, 65408, -133492, 62007, 287118, 78987, 151611, 117616, 272569, 66413, 314679, 60547, 144342, 35889, 134417, 5277, -101961, -633951, 89547, -205492, 209355, -105763, -21204, -116935, -62637, -58720, -274021, -25571, 51485, -73042, -388650, -57947, -9877, -263861, -69873]
18360b04662I5052K13708a91140c4497l38191b1736H4397a04087r2518N6060O1894
18349g8651C8860g3525C938K02999D7877b25507b4495l7826F9613a66123b3821
18337A45763D4500Q0760a47390m7980R5096B6597a55974j7375l8319f8581j06355
18326a74936Q2715E6908J59778g049B64754A1970J2157J0852c24263a34078A26601
18314C612Q4472e6735A22637l3862a12216k62067B83904j07265D6024i9522j68620
18303b68142C39167A37752a14584j36911D44590b68807O2444B68472p7312a22456
18292a25515M8497o2053M4786O161j21010c0486A2341a23395j24068r6160H1592
18280A38886a80373p9247A10577b9345k7525j58854a2815A49019A6311N7227a65818
$$ y = [-204662, 95052, 308760, -191140, -34497, -372688, -21736, 84397, -104087, -196605, -140545, -78651, 38860, -73525, 3938, 206937, 47877, -225507, -24495, -62321, 69613, -166123, -23821, 145763, 44500, 125260, -147390, -195370, -100274, 26597, -155974, -173349, -211668, -68581, -174936, -92221, 56908, 216686, -7049, 264754, 11970, 24127, 34979, -324263, -134078, 126601, 3612, 88084, -56735, 122637, 88775, -112216, -374283, 283904, 176639, 46024, -99522, -268142, 339167, 137752, -114584, -251495, 444590, -268807, -206363, 268472, 191160, -122456, -125515, -77018, -139071, -94285, -88124, -209134, -30486, 12341, -123395, -247463, -343623, 81592, 138886, -180373, -259620, 110577, -29345, -56870, -215724, -12815, 149019, 16311, 73538, -165818]
18268B95619a75234k5977k2701C3323e5460A65645O2004c8624o4953B09687a13898
18256b67109B361a28720k68203A93589b09344A41541a75998A64446p1199B7545
18245d6484B720K45871r5472o7386b40738A72005c1432l9107k20260a30572J1136
18234a19436A63990b92713l55504a08875A13902a95971A40452J2150b26584A5785
18223d81699b00857B0768b0620o0714B87432a11756E8747c03999A44825a12503
18212i8053n3012D8285a19664k88370D9469K8715M02849D2086e9704B03111P8850
18201B81961o3321G3302K0518d3971I1562K66605c6068A56574g1932J5970I2608
18189A32613F050g6608B29883j6184j4961i4583G6616A2272Q3239L2730E3294
$$ y = [295619, -175234, -201211, -223912, 33323, -55460, 165645, 227649, -38624, -103577, 209687, -113898, -267109, 2361, -128720, -396923, 193589, -209344, 141541, -175998, 164446, 93247, 27545, -46484, 2720, 248591, 153119, 85733, -240738, 172005, -31432, -70539, -290799, -130572, -119436, 163990, -292713, -648217, -108875, 113902, -195971, 140452, 152602, -226584, 15785, -481699, -200857, 20768, -20620, -81334, 287432, -111756, 58747, -303999, 144825, -112503, -98053, -151065, 48285, -119664, -408034, 49469, 78184, 481033, 42086, -59704, 203111, 281961, 218640, 73302, 93820, -43971, 91562, 358167, -36068, 156574, -71932, -55962, 92608, 132613, 6050, -76608, 229883, 213699, 198738, -94583, 76616, 12272, 95511, 128241, 53294]
18177d1694o6493B44129A00328C8150c12798f9168k1880A9158a98929B71988b44789
18165F5920f0343A16708f6704D94345c50191B02829B3729P1626R732e5310p493
18154f2803Q054A02916c30926a63939g3509j3618A81016K89524c28206A72770
18143A83669A0383J6568b4665k45844j71908E348J8932J65915i5947D7161Q53
18132D8014b1758l37663a16005C5624M3043e2153k09870H3441g6295B23632b33617
18120a98047g0338B51692I6797N7972o946b14438C3705R8344a3143C0652N9341
18109H9993L54087A56118o5713j7157a15508k9382j27142J03357d2769B1800O2302
18098H4102f9825m8583O719K3305A7562R8489a82007D9986J78166a0080j88045
$$ y = [-41694, -108187, 244129, 100328, 38150, -312798, -69168, -91048, 19158, -198929, 271988, -244789, 65920, -60343, 116708, -66704, 494345, -350191, 202829, 23729, 95355, 105087, -55310, -62803, -54749, 102916, -330926, -163939, -73509, -87127, 181016, 470540, -328206, 172770, 183669, 10383, 26951, -24665, -270509, -442417, 5348, 24280, 190195, -95947, 47161, 48014, -21758, -359421, -116005, 35624, 78667, -52153, -262023, 83441, -76295, 223632, -233617, -198047, -70338, 251692, 96797, 154769, 147823, -214438, 33705, 132049, -13143, 30652, 89993, 444080, 156118, 90405, 73248, -115508, -144890, -272032, -168675, -42769, 21800, 84102, -69825, -118408, -111689, -88384, 17562, 116051, -182007, 49986, 228152, -10080, -198125]
18087a98125Q2141A92197q9644b70574B59372a3356j09419C8219K94901d37439
18076B32066a68040A10422a5810j52673B11281c80437A686J32945d475k03850
18066b08325j70255D15657b25068c2115A69641a40755A98282m8068E9631g8896
18055A8124Q3708M4516a66745j58099C26636a09700B45469l5787E3301J45093
18045A98394b7493j72845g4126j22766A7865a8164I7636i2928A09352c7357B72455
18033B14705a72266o018d3840I2524b7411J1379A59637d0152G2452K88125b6869
18021e1426C76813k2333c5608I7268b93530b5521j56661l3746j98076a66813B39583
18009a47272E3827a61539E2317e6031j00584M5738r440G3021f8301l60835B6232
$$ y = [-198125, -115984, 192197, 102553, -270574, 259372, -13356, -122775, 38219, 333120, -437439, 232066, -168040, 110422, -15810, -168483, 211281, -380437, 1686, 134631, -4475, -208325, -378580, 415657, -225068, -32115, 169641, -140755, 198282, 150214, 59631, -78896, 18124, 101832, 146348, -166745, -324844, 326636, -109700, 245469, 209682, 53301, 198394, -27493, -200338, -74126, -196892, 17865, -18164, 97636, -92928, 109352, -37357, 272455, 214705, -172266, -178284, -43840, 92524, -27411, -16032, 159637, -40152, 72452, 360577, -26869, -51426, 376813, 354480, -35608, 97268, -293530, -25521, -182182, -215928, -414004, -166813, 239583, -147272, 53827, -161539, 52317, -56031, -156615, -110877, -120317, 73021, -68301, -429136, 26232]
17997G9652B9006O6270j192Q681a17963a0740o8610E392K0889a93181N6638k03368
17985c39911a49856A16039K02126A1601O7594f028k49920a12191m5048b4356B05686
17973g9858G5443a72704g4165F8209b83530J04412P5758B59889g3508j1021k40559
17962c25088E2230J01516J43480E9501K23743n3034h3339j48282A79791D17a5425
17950B70073a87284C16168H6740b5043B17000b3255A86342e4165I3740J91425
17940B85165I3209j7390J32601b23413J06791K7190I691K41132r4990C3244J33649
17929A66893K7317C8570i248j29714j14293C48424j67349q8698B0141M0849P447
17918F8437c3022I0402J81876d6719G1289e0601D8046c6348n3949C3086a8201
$$ y = [79652, 29006, 95276, 94084, 102765, -117963, -10740, -79350, 5392, 26281, -193181, -136543, -339911, -149856, 116039, 318165, 11601, 79195, -6028, -255948, -112191, -157239, -24356, 205686, -79858, 75443, -172704, -74165, 68209, -283530, -179118, -103360, 259889, -73508, -84529, -325088, 52230, 153746, 297226, 59501, 283244, 230210, -83339, -231621, 179791, 417, -15425, 270073, -187284, 316168, 86740, -25043, 217000, -23255, 186342, -54165, 93740, 285165, 93209, 75819, 208420, -223413, -116622, -89432, 9691, 250823, 155833, 33244, 166893, 194210, 38570, -9248, -138962, -253255, 348424, 181075, 92377, 20141, 60990, 68437, -33022, 90402, 272278, -46719, 71289, -50601, 48046, -36348, -90297, 33086, -18201]
17906G8394a13666F975K01154b76333F8426a04016j0800c4701k55339C558a63726
17894a51219A16074K6481A9514K0682F862J33423B9852L21468A33227i2938M2344
17883e0594q0289c4502B26921a55912B41359e8164o3557C7890h5733b2025p0124
17872i2149B24269b84584A39261F5356Q3190n6698R5807a13910L5609J2293B64705
17860g856r6408i882j41952A63404C4192j4703b20241C53118a26744A20735b9271
17848a61187A82926m2861d19742a66947d9221Q522q1183C44515G3154B1328M6601
17837F7929J30069A529h0029C4083K47579B6944J9545a22548j217a9602l1056
17826e0658j84109M8689D7604M9196a64308B3856O0669e647A39144E9563K17896
$$ y = [78394, -113666, 6975, 208129, -276333, 68426, -104016, -114816, -34701, -290040, 3558, -163726, -151219, 116074, 142555, 19514, 40196, 6862, 140285, 29852, 351320, 133227, -92938, -50594, -130883, -34502, 226921, -155912, 241359, -58164, -121721, 37890, -85733, -22025, -92149, 224269, -284584, 139261, 65356, 148546, 91848, 187655, -113910, -78301, -66008, 264705, -7856, -104264, -9882, -151834, 163404, 34192, 19489, -220241, 353118, -126744, 120735, -29271, -161187, 182926, 140065, -419742, -166947, -49221, -40699, -121882, 344515, 73154, 21328, 67929, 197998, 1529, -80029, 34083, 281662, 26944, 46489, -122548, -123765, -19602, -50658, -234767, -186078, 47604, 96800, -164308, 23856, 84525, -5647, 139144, 59563, 277459]
17815B77459b8978A28888k3493K770J9992c21410c7092B9225g7825j6494B51317
17803A06146m6803K37455d5770D38457d881B78508A20077K32399N6307c5602j9067
17792e4669A97277c0942k20549E8442P374B9777P3425J53541o9820E7828c6208
17780G7237J48192Q52B0659K39863H8151O3660e5223E4371b1648B51700j10413
17769A41287d16077A36796J41459H7971f3278F3148R1915d8250A26508a78470
17758A2636a4251A45857E2088K7155c1655k01603A254J49921i5091L1626A1407
17746B13750C3606K6262M2931b37251a14842c4281I0240K38661j52050d7138B20059
17734A79919J8327O488I5961i6611I335J53536P2094J44095q9480g1021r056B63011
$$ y = [277459, -28978, 128888, 105395, 108165, 128157, -321410, -37092, 29225, -77825, -94319, 251317, 106146, 59343, 296798, -45770, 438457, -4881, 278508, 120077, 352476, 408783, -35602, -54669, 197277, -30942, -251491, 58442, 65816, 29777, 103202, 256743, 186923, 57828, -36208, 77237, 225429, 226281, 20659, 260522, 88151, 151811, -55223, 54371, -21648, 251700, 141287, -416077, 136796, 278255, 87971, -63278, 63148, 155063, -48250, 126508, -178470, 12636, -14251, 145857, 52088, 79243, -31655, -233258, 1254, 151175, -95091, -63465, 11407, 213750, 33606, 59868, 102799, -237251, -114842, -34281, 90240, 328901, 176851, -47138, 220059, 179919, 198246, 204734, 95961, -96611, 9335, 162871, 234965, 379060, 289580, -71021, -80077, 263011]
17721B06231a06698E6196k6763R618e2255D18621h9326Q729I043K04332o5048
17710A48327b5402C48914j24529a60922E8518b56736G9336a07931h642B76129
17699B18153C0953q022R7762B5832K88628p8291g2955A05584K3520i8247C28069
17687d1546A79120m8280J98263i2394k23291p6983a46365C15256q6634q0119m3329
17676A05174m1551B1112a07095B93652g6203A54743B7738J38261J92841o0782
17666B98058a67182N0759A43356o2105M8220d3861A01845a30032e0857D2994b7523
17654B63203q4215h763G2167a2932A55164C6998O8095L09232j0164a5976A90507
17642C40624q7556D81P7213d929A77584k9189K5505b35147C01456a95338d02A25841
$$ y = [206231, -106698, 56196, 29433, 39051, -52255, 418621, -89326, -80597, 9043, 213375, 148327, -25402, 348914, 224385, -160922, 58518, -256736, 79336, -107931, -8642, 276129, 218153, 30953, 22931, 120693, 25832, 314460, 236169, -72955, 105584, 129104, -98247, 328069, -41546, 179120, 130840, 329103, -92394, -315685, -392668, -146365, 315256, 228622, 148503, 105174, 63623, 21112, -107095, 293652, -76203, 154743, 27738, 165999, 358840, 298058, -167182, -116423, 143356, 81251, 129471, -43861, 101845, -130032, -50857, 42994, -27523, 263203, 178988, -8763, 72167, -12932, 155164, 36998, 105093, 414325, 404161, -15976, 190507, 340624, 253068, 481, 77694, -4929, 177584, 148395, 173900, -235147, 301456, -195338, -402, 125841]
17629d3664m6449G180f4273B7155Q6451B0917K80194L2433A52764k7741J26467
17618B51490a79727A56612n1015m1541E611J66416O1043q9162a23663A18746M8470
17607A67216l679J97458A7420J49801K43252m4283F4779i1636l0649A1879J8158
17596C0037J00722C7609a45238o8622d5836a3271C7117L19088A36290a61912B28597
17584C04459l3243H2453b1476C9107R3310D0895J18529m7802J95506B6830J30623
17573A57453K50839e8856A82493a01332A15378J56017C2262J30596J71651i9951
17562C27948H5850l5886L36886m1417A11562K59056j73318M4415K09385c24800
17551B16849p0335J03146a3452k78220F2092J51027N5850M902D0482a18737D02118
$$ y = [-43664, -90113, 7180, -64273, 27155, 113606, 20917, 301111, 333544, 152764, 125023, 251490, -179727, 156612, 105597, 64056, 5611, 172027, 233070, 143908, -123663, 118746, 167216, 163537, 360995, 17420, 167221, 410473, 366190, 64779, -91636, -122285, 11879, 30037, 130759, 37609, -145238, -213860, -45836, -13271, 37117, 356205, 136290, -161912, 228597, 304459, 271216, 82453, -21476, 39107, 132417, 40895, 159424, 111622, 307128, 26830, 157453, 408292, -58856, 182493, -101332, 115378, 271395, 32262, 162858, 334509, -99951, 327948, 85850, 49964, 386850, 345433, 111562, 370618, 197300, 241715, 451100, -324800, 216849, 146514, 249660, -13452, -291672, 62092, 213119, 268969, 273871, 40482, -118737, 402118]
17539A05123D493N5482L3521m1382K60384j05937p7261K99737l7006m2656k3735
17528C25640J11643K5872l055A63527C3088O1802J09905H9798J34091o104J22457
17517C40242r5030K57606B04624M12602J12629k06490L24047J45480l20282K88535
17507I61145j54683j21979k00893A51573L23670j7845r8965N2440k5270K09958
17497E95561p1050K71968o7252L48008M1714o6504l22738K50621D83530G7915
17486D56613J952k17410H6239K8404K47016A69423m5306J41756A04107J40935
17476B45042K42222k29482l111j07944B1623J70944K61610j56136J40824q4913
17466C53952A67539J32303L5081Q1117A84923J30596J6799j14468b8724D19885
$$ y = [105123, 4493, 59975, 93496, 52114, 312498, 206561, 129300, 429037, 392031, 349375, 325640, 437283, 463155, 460100, 163527, 33088, 94890, 204795, 89798, 223889, 217785, 340242, 245212, 502818, 204624, 617226, 729855, 523365, 847412, 992892, 672610, 961145, 806462, 684483, 483590, 151573, 475243, 457398, 358433, 410873, 385603, 595561, 524511, 796479, 729227, 1077235, 1118949, 1052445, 729707, 980328, 483530, 77915, 456613, 458565, 241155, 86239, 114643, 361659, 169423, 124117, 265873, 104107, 245042, 487264, 257782, 254671, 146727, 21623, 192567, 454177, 298041, 438865, 353952, 167539, 299842, 334923, 416040, 184923, 315519, 332318, 217850, -28724, 419885]
17455A81504b7914B91679Q7914p7368A34090L13621k16281L27561j12446E1150
17444A89712K7655E8441K05570C6103O5421L21240r6935J32167K14703k95175
17434C77524J08437k04216J90036K7229J0782j27292H2239J58045M47856C29305
17423A49319J82312H4757B3391L21038A39224L5451o7375M28464m0335k43953
17413B51476K80208k47822K5553L14834B28004q3877L42265B11004M9018j10416
17403A49606J98522L0663o912j03038K82894k59632L6373O0294J20496c1291C02427
17391H5278K73147a02395D46460A7312M34136B24265J0456A03525K63294J76188
17381E43007A98483E2135A5776M05525Q8502k21896k1777J69910C0153J29382
$$ y = [181504, -27914, 291679, 379593, 302225, 134090, 447711, 231430, 558991, 446545, 51150, 189712, 217367, 58441, 264011, 36103, 101524, 422764, 325829, 457996, 672699, 377524, 485961, 281745, 471781, 499010, 509792, 382500, 82239, 240284, 688140, 329305, 149319, 331631, 84757, 23391, 344429, 139224, 174675, 107300, 535764, 495429, 251476, 531684, 283862, 309415, 624249, 228004, 144127, 486392, 211004, 260022, 149606, 348128, 378791, 371879, 268841, 551735, 292103, 328476, 388770, 509266, -31291, 302427, 85278, 358425, -102395, 446460, 17312, 451448, 224265, 234721, 103525, 366819, 543007, 198483, 52135, 15776, 421301, 509803, 287907, 266130, 436040, 30153, 159535]
17371A59535L6123J90620C6660O51473l11726i054A22885b5658A48517R2940J15809
17360C57266A51913J12754Q873J22447j33964j2694Q4682J1556J02163p7351A19232
17348B74704l7331J82043P7196P2300d9533B46952J85923A32757A4451J2649J18421
17337A45521J51416A32454l6664L70866A43815J35110L84905k77604J0421p3339
17327C23308J9867n7848P2540A10305g902C35854j56575K49500r4449A18571P0378
17316A88949M2702h9348C19756r0800J18676J45131j9841j22136F7048b438B35094
17304H4247L41077B10218c5370A41027J82103p8110B3709L61370l5251m6966F9988
17292D7164K45360H3927K55805A03093P1351c7905C72974A51864M3041J49087
$$ y = [159535, 195658, 386278, 36660, 688133, 376407, -9054, 122885, -25658, 148517, 241457, 357266, 151913, 264667, 273540, 395987, 262023, 249329, 334011, 345567, 447730, 370379, 119232, 274704, 237373, 419416, 496612, 568912, -49533, 246952, 432875, 132757, 14451, 27100, 145521, 296937, 132454, 95790, 466656, 143815, 278925, 663830, 386226, 396647, 323308, 343175, 285327, 357867, 110305, -7902, 335854, 179279, 428779, 334330, 118571, 188949, 231651, -89348, 319756, 228956, 347632, 492763, 472922, 350786, 67048, -2438, 235094, 84247, 425324, 210218, -35370, 141027, 323130, 245020, 23709, 385079, 349828, 302862, 69988, 47164, 292524, 83927, 339732, 103093, 174444, -37905, 372974, 151864, 194905, 343992]
17282C43992l4230A22438P5202n9193J96153H6294M19683A43150d1228E26789
17271A76661J71872K2080o8309o2501O6164P5518C189L17378J53020R1017A8528
17259A17607J40946j08731O2676q6056J40195L93308j97380J252p7123J96397
17249E83091B74387m5922K1913L57695B65817K01890j30329A29287R5778L08703
17239E33768L357k14800j22206I7149N35861k10264l8439q6166r8723l6569M5785
17228B08634L08452B4957P27055k66282A88122p578J35620m0721j32968O7594
17218B10069K21450J24271j71546j59266J24237J19582A37865J92371A4554K01064
17208B15618J55460I9338O06134l37299k262K67071j87679j34911j3552M4965
$$ y = [343992, 309762, 122438, 197640, 138447, 334600, 86294, 505977, 143150, -41228, 526789, 176661, 348533, 370613, 302304, 239803, 305967, 381485, 3189, 320567, 473587, 564604, 18528, 117607, 258553, 149822, 212498, 126442, 266637, 659945, 462565, 463817, 386694, 583091, 274387, 228465, 250378, 608073, 265817, 467707, 337378, 129287, 225065, 533768, 537125, 322325, 200119, 97149, 633010, 422746, 384307, 298141, 199418, 162849, 208634, 517086, 24957, 752012, 485730, 188122, 180544, 316164, 275443, 142475, 210069, 431519, 555790, 384244, 224978, 349215, 468797, 137865, 330236, 14554, 215618, 371078, 99338, 705472, 368173, 365911, 632982, 445303, 310392, 296840, 341805]
17198C41805J76047C7622M66478k3982k5051p1549j40432K12866K93846k65493
17188D84305m1235j23727J17627j6482p6697p5798J59965j46161J72881O2103
17178E16781r2530o4574n013J04926j97227P3220K62758k68976J78872R2094B93323
17166C40741K77104r0638R0874C05157L49921q4866j20385j28089m8964K96676
17156E69450J82939j34845j11937O3393o3946N9687L15417B93404J29526l0053
17146C92877j80566N44162B71178K78225j39618j41370L33400J3312k98600K67738
17136E84265k5853m8558k0377k803M15732C37538r069Q3340J18146j82619K42750
17125E90086j54070J6199m6424J75013A57550J65056K17325J8636j38491J77690
$$ y = [341805, 517852, 37622, 504100, 480118, 455067, 383518, 243086, 455952, 749798, 484305, 443070, 319343, 436970, 420488, 343791, 267993, 427958, 281797, 454678, 516781, 424251, 359677, 354664, 459590, 262363, 335583, 598341, 329365, 508237, 600331, 293323, 340741, 617845, 527207, 618081, 305157, 655078, 570212, 449827, 321738, 272774, 569450, 752389, 617544, 505607, 569000, 505054, 564741, 880158, 293404, 422930, 392877, 212311, 756473, 271178, 549403, 409785, 268415, 601815, 615127, 316527, 584265, 558412, 509854, 489477, 486674, 902406, 337538, 328469, 411809, 529955, 347336, 590086, 436016, 452215, 405791, 580804, 157550, 322606, 539931, 558567, 420076, 597766]
17115E97766M313J23508j52613J56597k18571n7437M0286n4144M0661K91437J03936
17104H75739j01434l47489L14078j24498O7254j51790L21284k64184J81441j10513
17094F59888j90213K53604j12827K6132K87335J8875K4060m13770K87353m06458
17084D33979K37135O0049k9624r4467M1739j28312K7747K6205L49737k60332j7073
17073F46783P5776P9454p5307n82n8606J45749p4213j65608J11850P7851J62521
17062I25668M3924j06442J16992q4840o5379r3467R9166r0273L62521m06337J35588
17051H37121K07040m95945L41248M9933l08154K90167j32033K68002j88267l3417
17041H35695n7214N5735l43424M43897j63396N7428L01498n01302K20200j07154
$$ y = [597766, 602079, 725587, 572974, 729571, 511000, 453563, 493849, 439705, 480366, 771803, 875739, 774305, 426816, 740894, 616396, 683650, 531860, 853144, 588960, 770401, 659888, 469675, 723279, 610452, 636584, 923919, 942794, 966854, 553084, 840437, 433979, 671114, 731163, 701539, 607072, 648811, 520499, 548246, 574451, 924188, 663856, 646783, 722559, 802013, 726706, 726124, 667518, 813267, 739054, 573446, 685296, 763147, 925668, 969592, 863150, 980142, 895302, 829923, 736456, 835622, 745349, 1107870, 701533, 837121, 1044161, 548216, 889464, 939397, 631243, 921410, 789377, 1057379, 869112, 835695, 778481, 834216, 490792, 934689, 771293, 828721, 1130219, 628917, 849117, 741963]
17031G41963M61541j09924k85439j87312L6867J58688N2254J2063K66310o2593
17021A084418l18417J87649k15838K00443Q5402k96771L18548R4406n65741M94682
17011A068781k89771L02275j04951j30787P2179K06811o7521q8292K06170m38122
17001G36772J79112J41369L68744l68854J41444J12176p8740Q7971L4293m77918
16991H76369K38312P2068o1602m4618J03817O0109j77579M03809l47323J76463
16981A299825k37905J22367N3084n3664o8218j00255M73337l49116O1713J06217
16971A307385k04312J57106j82723M08742j05903n8099K03800j37032M36120n97202
16961A227882J3230L96005k66745J82017m48371l15435R66325o30175M67001m01495
$$ y = [741963, 1203504, 1093580, 808141, 620829, 657696, 816384, 868638, 880701, 1147011, 1084418, 766001, 953650, 737812, 938255, 1023657, 726886, 1045434, 1139840, 574099, 1068781, 779010, 1081285, 976334, 845547, 917726, 1124537, 1057016, 968724, 1174894, 736772, 915884, 1057253, 1425997, 1057143, 1198587, 1310763, 1232023, 1319994, 1354287, 876369, 1114681, 1186749, 1125147, 1080529, 1184346, 1244455, 1066876, 1470685, 1123362, 1299825, 1061920, 1184287, 1237371, 1183707, 1115489, 1015234, 1488571, 1139455, 1201168, 1307385, 1103073, 1260179, 1077456, 1486198, 1380295, 1322196, 1525996, 1388964, 1825084, 1227882, 1241112, 1637117, 1370372, 1552389, 1104018, 788583, 1754908, 1124733, 1591734, 1190239]
16951A190239L49950j63239n0615L32507p276l5216q8596K36647k56634k73703
16941A234064M12896n7394l5346L47626n26078M82710j94552K5002N7491k2836
16931A723583K44342k62660K40921m9038q4129J21349j8774J00402j65457o3658
16921A786881K18410K33200j75382k11007p9062K38217j40569R845J85537k87865
16911A778205K8937J09779L29423J77539j75721K53416k30246l45983L04380M04582
16901B634311N0764k10103N8367R436l5649k25462L76898p3731J35625n6979J31884
16890B795361k62697L58461k63212P5091j20272L45219P5895p13335M78306K25874
16880B994691n9338p0626q9455N85996k9553r3777q796K6469j18133o4709O29020
$$ y = [1190239, 1540189, 1376950, 1326335, 1658842, 1651566, 1616350, 1527754, 1764401, 1507767, 1234064, 1646960, 1589566, 1554220, 1901846, 1375768, 1858478, 1663926, 1688928, 1746419, 1723583, 1967925, 1705265, 1946186, 1897148, 1813019, 1934368, 1915594, 2015996, 1850539, 1786881, 2005291, 2238491, 2063109, 1852102, 1773040, 2011257, 1870688, 1880533, 2066070, 1778205, 1807142, 1916921, 2246344, 2423883, 2248162, 2501578, 2271332, 1925349, 2229729, 2634311, 2685075, 2474972, 2533339, 2542775, 2507126, 2281664, 2658562, 2584831, 2720456, 2663477, 2795361, 2532664, 2891125, 2627913, 2703004, 2582732, 2927951, 3003846, 2290511, 2768817, 2994691, 2935353, 2864727, 2775272, 3361268, 3331715, 3237938, 3229142, 3255611, 3137478, 3072769, 3701789]
16869C701789n49165J10178L18653k8222K5959k24657j06821L09356K40858l5263
16859C762665j21928L95895j70609j82917K29670K42363j12781J76635K3293o589
16849D235697L9880p3188K54909j95848M15401r82j9817N5354j06948M8123L09396
16838D961977Q1413o9755K27246K96036k36322J77916J53480J03256k30604O1495
16828E526138K96802K04000K41620k05817J34263K33846R9532R5951L38796l48273
16818F616858L29519P9088j3811r0019N20855L39898m66492P51630l5151j52662
16808G879713P9586K81455L10886J41364K95695O758M48636N9803j80493L95574
16798I718977k01328Q99294J57745m3037Q183O60794N5820M21722o1667N02457
$$ y = [3701789, 3152624, 3262802, 3581455, 3553233, 3579192, 3354535, 3247714, 3557070, 3797928, 3762665, 3640737, 4036632, 3866023, 3683106, 3912776, 4155139, 4042358, 4218993, 4242286, 4235697, 4275577, 4202389, 4457298, 4261450, 4676851, 4675869, 4656052, 4711406, 4604458, 4652581, 4961977, 5043390, 4973635, 5200881, 5496917, 5260595, 5438511, 5591991, 5695247, 5464643, 5526138, 5822940, 6026940, 6268560, 6062743, 6197006, 6430852, 6530384, 6626335, 6965131, 6616858, 6946377, 7025465, 7011654, 6921635, 7442490, 7782388, 7315896, 8067526, 8032375, 7879713, 7959299, 8240754, 8551640, 8693004, 8988699, 8995457, 9444093, 9503896, 9323403, 9718977, 9517649, 10416943, 10574688, 10531651, 10539834, 11200628, 11256448, 11678170, 11616503, 12118960]
16788A2118960J74428J51687L51367M44870k3567K67228M26770N99043M18095
16779A4928881L29393K48870L43601N42381N52761J43606M29023N90857N20059
16770A8629432N53711J99530N89110R01655K81567R70807M82400J064254K63478
16761B3935944J106579N02838R29794P46725Q70595Q64493J182997O55385R68605
16752C1763955J079967J215306J234330J230101J045843J624789J498531J448627
16744D2141449J177210J680853J883901J811664J703301J774551K236944J876942
16736E6286815K319175K009922K593991K361345K276832L123863K391802K926129
16728G6289874K955593K612827L213498K910859L194843L126241L262157L425085
$$ y = [12118960, 12293388, 12445075, 12796442, 13241312, 13217745, 13484973, 13911743, 14510786, 14928881, 15258274, 15507144, 15850745, 16393126, 16945887, 17089493, 17518516, 18109373, 18629432, 19183143, 19382673, 19971783, 20873438, 21155005, 22125812, 22608212, 23672466, 23935944, 25042523, 25545361, 26475155, 27221880, 28092475, 28956968, 30139965, 30795350, 31763955, 32843922, 34059228, 35293558, 36523659, 37569502, 39194291, 40692822, 42141449, 43318659, 44999512, 46883413, 48695077, 50398378, 52172929, 54409873, 56286815, 58605990, 60615912, 63209903, 65571248, 67848080, 70971943, 73363745, 76289874, 79245467, 81858294, 85071792, 87982651, 91177494, 94303735, 97565892, 100990977]
16720A00990977K891434K713861L095755K862765K786951K289271K530005K321520
16712A22482539J465864J682892J365856R73563L60954L03844k33623m53261o35232
16703A27313396j367369j553390j649712k048940k482608k543822l057963k314917
16695A10294675k787492l847066l048540l081104k980587l298233l285441k918152
16687H5048060l096345l163964k648914k760961k849956k579842k864703k249501
16679F2833874k594456k429904k087132k282879j904567j819319j971748j749749
16671D5994120j503167k060604j284687j423875j580745j723654r26932r42039
16663C4548417j433769j098403j065062j050753j175595n54999j034387r64004
$$ y = [100990977, 103882411, 106596272, 109692027, 112554792, 115341743, 117631014, 120161019, 122482539, 123948403, 125631295, 126997151, 127970714, 128331668, 128635512, 128401889, 127948628, 127313396, 125946027, 124392637, 122742925, 120693985, 118211377, 115667555, 112609592, 110294675, 107507183, 103660117, 100611577, 97530473, 94549886, 91251653, 87966212, 85048060, 81951715, 78787751, 76138837, 73377876, 70527920, 67948078, 65083375, 62833874, 60239418, 57809514, 55722382, 53439503, 51534936, 49715617, 47743869, 45994120, 44490953, 42430349, 41145662, 39721787, 38141042, 36417388, 35490456, 34548417, 33114648, 32016245, 30951183, 29900430, 28724835, 28169836, 27135449, 26171445]
16655B6171445o23123p20534j135727m21736m31035j248164l07872o05501p74483
16646A9903270o81646n45745k90267o89835m45284l66578l81084q6922o81407
16637A5734502o86325q6635n66791l96545n06513J94223p67170j8898j36728o34081
16627A2129039P6957n32351o00820O0579k98173l55495M4458k60099l75013k56331
16617I632751P2499o33407k55078L09107j17662j59728m1533m31305l97819m6415
16607G931410j9498r0568j53339j88059l72496J00355O6199j84165j36224j79935
16597F773680j01598k30934K8291m07281N2838p827l46063k48159M59036l71864
16587E600119J92791n27131m7447J68525k72088J35517j86832p2619o11711P90605
$$ y = [26171445, 25548322, 24827788, 23692061, 23270325, 22839290, 21591126, 21283254, 20677753, 19903270, 19221624, 18675879, 18385612, 17695777, 17250493, 16883915, 16502831, 16415909, 15734502, 15048177, 14961542, 14394751, 13998206, 13491693, 13685916, 12918746, 12899848, 12763120, 12129039, 12205996, 11673645, 11072825, 11133404, 10835231, 10479736, 10524194, 10264095, 9889082, 9632751, 9705250, 9071843, 8816765, 9125872, 9008210, 8848482, 8806949, 8375644, 7977825, 7931410, 7911912, 7821344, 7668005, 7479946, 7107450, 7207805, 7274004, 7089839, 6953615, 6773680, 6672082, 6441148, 6469439, 6062158, 6114996, 6107169, 5761106, 5512947, 5971983, 5600119, 5792910, 5265779, 5218332, 5386857, 5114769, 5250286, 5063454, 4990835, 4379124, 5169729]
16577E169729j77070j08573j35984k07648k30736k9721L82493l81379q302O5020
16567D337829p2211r7147m56375J10119j3914j88704J72001j5087j44868k54951
16557C376692P1841j55357M84804m2770l09961o3811m14840M41985o9520K13821
16547C532884n92613M15286m907k87997j84960r7901L61400n3653o2643k9086
16537B995810K7164m3011Q384j16921k9859k23686n4287q410K29008m1899k17547
16526B524746j4Q535J54196l84818r5676O4686J19429l17212L13928J832l62585
16515B027047K63376p2754j25342J88762o2369L6396j61972R3106J22632m26607
16505A882275K53279j75790J97J21739j37465r3573K15153j5952j54547K58200
$$ y = [5169729, 4992659, 4884086, 4748102, 4540454, 4309718, 4279997, 4662490, 4281111, 4272809, 4337829, 4265618, 4168471, 3712096, 3822215, 3808301, 3619597, 3791598, 3776511, 3631643, 3376692, 3448533, 3293176, 3777980, 3735210, 3425249, 3361438, 2946598, 3388583, 3319063, 3532884, 2940271, 3355557, 3350650, 3062653, 2877693, 2779792, 3141192, 3087539, 3024896, 2995810, 3022974, 2979963, 2988347, 2871426, 2841567, 2617881, 2563594, 2555184, 2784192, 2742293, 2524746, 2524732, 2533267, 2687463, 2302645, 2206969, 2271655, 2391084, 2073872, 2387800, 2389632, 2027047, 2290423, 2217669, 2092327, 2281089, 2218720, 2255116, 2093144, 2186250, 2308882, 1882275, 2135554, 1959764, 1959961, 2081700, 1944235, 1850662, 2065815, 2049863, 1895316, 2153516]
16495B153516l52521j68406K9797J10027Q5969j86432K80209k79106K4015j55692
16485A541376K43091K8176k58348J42548k21456K68004R035l44685o7380L43928
16475A684289K9244r7181Q9155p3144k00210J39453l28595L93827j52252J0398
16465A494984l0755K39388K10488l96800k46227Q9246J76175J20480k78318J7776
16455A396437k28907M24868k17597l8317M5724j71585M0864m5140J12755n9490
16445A259612j43994J05732J0024P3581j32789j2114J77071J09318o24003R4628
16435I17066J13178M2278K68846n33647K98890j21972J60354N9185O6352l36327
16425I34203j0983M46901l00617l84090M10008k30991L31594L6902j94256j18739
$$ y = [2153516, 1800995, 1632589, 1662386, 1772413, 1858382, 1671950, 1952159, 1673053, 1697068, 1541376, 1784467, 1812643, 1554295, 1696843, 1475387, 1743391, 1752426, 1407741, 1340361, 1684289, 1713533, 1616352, 1705507, 1632363, 1432153, 1571606, 1243011, 1636838, 1484586, 1494984, 1464229, 1703617, 1914105, 1517305, 1271078, 1360324, 1536499, 1656979, 1378661, 1396437, 1167530, 1592398, 1374801, 1336484, 1382208, 1210623, 1251487, 1206347, 1319102, 1259612, 1115618, 1221350, 1231374, 1304955, 1172166, 1160052, 1337123, 1446441, 822438, 917066, 1030244, 1072522, 1341368, 807721, 1106611, 984639, 1144993, 1204178, 1270530, 934203, 923220, 1370121, 1069504, 685414, 1095422, 864431, 1196025, 1232927, 1038671, 919932]
16415I19932K19432j66235q822L1539Q8312K06425k07068K03184j85545P8795
16405A179949l43522K04265N6923K31823m42595R6313j90216J48466n3333j62228
16395G25845M7425K15050m46942O42417l35515j5561M6796J68947k06623Q5239
16385I27078n3118J14467k89030Q8175j31982j610N20454m82822m5054K1928k39993
16374D28493K57266J46184J02913j13324k06150J38251j90699l6930L86051l57960
16364E54095K83894j4584o6621m9678j83440L43779k54682M5506J3842k72301
16354C99810L12670K1532o0675Q7861r9271J90383K6197q6806O7133C96545O09473
16343A006018l63621M56327k80097l31739L34351l68727K71760o103K246l43933
$$ y = [919932, 1139364, 973129, 964307, 995846, 1084158, 1290583, 1083515, 1286699, 1101154, 1179949, 836427, 1040692, 1097615, 1329438, 886843, 983156, 792940, 941406, 888073, 725845, 773270, 988320, 541378, 1183795, 848280, 832719, 879515, 1048462, 841839, 927078, 873960, 988427, 699397, 787572, 655590, 653980, 1174434, 691612, 646558, 668486, 428493, 685759, 831943, 934856, 821532, 615382, 753633, 562934, 526004, 912055, 554095, 837989, 823405, 756784, 707106, 523666, 867445, 612763, 658269, 672111, 399810, 712480, 734012, 673337, 761198, 661927, 852310, 878507, 791701, 858834, 396545, 1006018, 642397, 1098724, 818627, 486888, 821239, 452512, 724272, 718169, 720415, 376482]
16333C76482L73872k07601J14341j66202A39770P21724J6549l89867J04210j62025
16323D30361K75194P0286k07579J96832j24104M5225l21104K86334J38372J5765
16313H05582p0500n5743j79878j78687K35599k10578M27342j87279J70443j22324
16303F33977R8163j72576o123N1146k52267J88971R4847m0881N0856C02019J00738
16292D02757r723R6020K09295j10309j29892J41159N0535j36671j65211M60680
16282H08640C69358O4721L13625l11776K10351l0007J48588k59135k06940Q7656
16272C86441J64362l4182k1584L0367P1389j83207o8848P2992j30030L14139k29006
16261C72833k3787J63221q9838A27967m8819N0612M68334j96832j82033J38824
$$ y = [376482, 750354, 542753, 657094, 490892, 139770, 861494, 878043, 488176, 592386, 430361, 705555, 775841, 568262, 765094, 640990, 686215, 365111, 651445, 789817, 805582, 735082, 679339, 499461, 320774, 556373, 345795, 773137, 585858, 756301, 633977, 732140, 559564, 553441, 604587, 352320, 541291, 636138, 595257, 646113, 302019, 402757, 393034, 489054, 698349, 588040, 458148, 599307, 649842, 513171, 347960, 808640, 369358, 434079, 747704, 435928, 646279, 616272, 764860, 505725, 298785, 386441, 550803, 516621, 495037, 525404, 596793, 413586, 344738, 417730, 287700, 601839, 372833, 349046, 512267, 422429, 127967, 79148, 129760, 598094, 401262, 219229, 358053]
16251C58053J12917m7924I8667L55333n9924N5917A82522K51195J99494J2181
16241F45392r9170J38577l12675n9177N3551J86389j40678j27970O747M8372Q106
16230C47464J48988j61601A60812N01497A55400K25913L33260n2567B42341J06026
16220C48367J78847j57708J63631j74246M1123n9864J72692A35243L8047M02176
16210E75466A90399E0210L83129P0462k13241J3410c5587A44397N23720m0837
16200F27280k90152p1121K42703k34704J97927A94529K17709j4383P5963q6871
16190C86947j76898Q9642K51026D4195J44720O6261P7489A37746J74452c1773
16179E58805k57027A0532K64915Q0540o0109k7299K36748I8236L63834k10524
$$ y = [358053, 470970, 423046, 98667, 454000, 394076, 449993, 182522, 433717, 633211, 645392, 546222, 684799, 372124, 312947, 366498, 552887, 412209, 284239, 290986, 339358, 347464, 496452, 334851, 160812, 662309, 155400, 381313, 714573, 662006, 242341, 348367, 527214, 369506, 533137, 358891, 400014, 340150, 512842, 135243, 173290, 575466, 190399, 50210, 433339, 503801, 290560, 303970, -35587, 144397, 668117, 627280, 337128, 266007, 508710, 274006, 471933, 194529, 412238, 397855, 473818, 386947, 210049, 299691, 550717, 44195, 188915, 255176, 332665, 137746, 312198, -31773, 558805, 301778, 10532, 275447, 355987, 295878, 268579, 505327, 98236, 462070, 251546]
16169B51546F0643k9226K33873h460C24972J91463k19311L036f8447A61313L06331
16158D67644j49466r5665F8707L55408A0626L24987q4542G7618N09005n5518I1218
16146c7824C46610K0749j15125j5771E3430J26962O9858q0011D2489K30653J4950
16135B88092e6470B74806J72372j11890A06385R0775q3601K42245J5262E1348
16124C93008j36099j00305K19707A60224L53631A35163E4571Q7500J9195a9903
16113C27946r436A07609J10516K48495a24294A91218b0510C53921A30022h5649
16102f1249I1034l1166K38812F3304J84894b13429P9504A48670R6642Q3459o1828
16091B66943A14780M15227a33273C35668a48461G7143M59304d3739A49870n5725
$$ y = [251546, 60643, 31417, 265290, -8460, 324972, 516435, 297124, 300160, -68447, 161313, 467644, 318178, 222513, 68707, 424115, 10626, 335613, 251071, 77618, 586623, 531105, 91218, -37824, 346610, 367359, 252234, 236463, 53430, 180392, 250250, 170239, 42489, 273142, 288092, -56470, 274806, 447178, 335288, 106385, 197160, 113559, 355804, 371066, 51348, 393008, 256909, 156604, 376311, 160224, 513855, 135163, 54571, 142071, 161266, -19903, 327946, 318510, 107609, 218125, 466620, -124294, 191218, -20510, 353921, 130022, -85649, -61249, 91034, 59868, 298680, 63304, 248198, -213429, -133925, 148670, 245312, 328771, 266943, 114780, 530007, -133273, 335668, -148461, 77143, 536447, -43739, 149870, 94145]
16081I4145K2564K58916a26651H2314a30287A37116A7448K74742J11101a34322
16070D9107k2842b49333F5164a4947B19439g7571n3808M4044J5312C312a43697
16058a57069O1395A07468m3774R3447b71738B6892J48894F3808L9525L82059I9217
16046A4998K30912A17342d8037A64214o0054i777E7975K16119H0688J62K74452
16035C55302b7569A28928C9445J82493F3672k2691K26785A07906c226D8026a59243
16023G8286C6497L2684c15074H374a83330C1218b54432C54151c77843B01781L4016
16012B35797c32472a13593d8839b844C00041o6414j12593a5873C56929a34568
16001D39247b66166g0671B84386j23677l59B6019a4936B84603E9952a08637a2758
$$ y = [94145, 116709, 375625, -126651, 82314, -130287, 137116, 17448, 292190, 403291, -134322, 49107, 26265, -249333, 65164, -14947, 219439, -77571, -131379, -87335, -72023, 3312, -143697, -157069, -95674, 107468, 63694, 157141, -271738, 26892, 175786, 63808, 103333, 485392, 99217, 14998, 245910, 117342, -48037, 164214, 104160, -9777, 57975, 274094, 80688, 80850, 355302, -27569, 128928, 39445, 221938, 63672, 40981, 267766, 107906, -3226, 48026, -159243, 78286, 36497, 69181, -315074, 8374, -183330, 31218, -254432, 354151, -377843, 201781, 235797, -332472, -113593, -48839, -2844, 300041, 233627, 121034, -15873, 356929, -134568, 439247, -266166, -70671, 284386, 160709, 160350, 26019, -14936, 284603, 59952, -108637, -12758]
15989B10012F9811J89446A19548c8859C05419b85595D7338K05265r0103a27002
15978B04700N0022c30591B52186N13666l44474M10697k97416L60925J01342j29999
15968H66927K2153p8605l84040p4030A74964J56813J64302j51151K9789A19478
15957c8843D1392J24581K05650b78048a15223A91425e0917J6990H3875a00398
15946b28111A31807a1495l6018k11495A13257g7392k31914J23206A17256g6608
15935c13373A28027b25443A89J8213b4784k53310B465R5362K13525g5630C69776
15923a37818C48795f2226j12734C38733b95667B78749A03711K06188i3707m57150
15913e50857B0643O302P9811c3865C42653B9924J49641K7411n4702c5946q9639
$$ y = [210012, 69811, 259257, 119548, -38859, 305419, -285595, 47338, 252603, 162500, -127002, 204700, 254722, -330591, 252186, 765852, 421378, 832075, 534659, 895584, 996926, 866927, 889080, 810475, 426435, 352405, 174964, 331777, 496079, 344928, 374717, 119478, -38843, 41392, 165973, 371623, -278048, -115223, 191425, -50917, -33927, 83875, -100398, -228111, 131807, -11495, -47513, -259008, 113257, -77392, -309306, -186100, 117256, -76608, -313373, 128027, -225443, 189, 18402, -24784, -278094, 2465, 97827, 311352, -75630, 369776, -137818, 348795, -62226, -174960, 338733, -295667, 278749, 103711, 309899, -93707, -550857, 20643, 26945, 106756, -33865, 342653, 29924, 179565, 206976, 152274, -35946, -125585]
15902a25585l8302c499j25616a4634C37108A5391P488c82703d5167A6115K0695
15891C6810e2284B31235H6802j9954J07098c5723k34763C34011A09464Q5359l0885
15880A63938b7059A71925m3546l6169K97913j50511a12495q958G7278j0200d0303
15868b7350A41941j9408i4037k49015j4187a51379G5531a22732j5202d6867l5669
15857h2536A2696a41726G7701J38885a76731M3828j71548f2986B31837e4726b0437
15845i2781k62517a50582P4633H7093b5816F821K56756j29127a5280k59277K8021
15834b46536B5009a27998B51267a63107A30903c24922a12969A51697b08170H0758
15823a9431q3328B35631F9970b08233P4940N068o4734b64l41539a5615j02182
$$ y = [-125585, -163887, -3499, -129115, -14634, 337108, 15391, 22879, -382703, -45167, 16115, 36810, -52284, 231235, 86802, 66848, 173946, -35723, -270486, 334011, 109464, 194823, 163938, -27059, 171925, 128379, 92210, 390123, 239612, -112495, -121453, 77278, 67078, -40303, -27350, 141941, 122533, -94037, -343052, -357239, -151379, 75531, -122732, -137934, -46867, -82536, 12696, -141726, 77701, 216586, -176731, -132903, -304451, -62986, 231837, -54726, -20437, -92781, -355298, -150582, -75949, 87093, -25816, 6821, 263577, 134450, -15280, -274557, -246536, 25009, -127998, 251267, -163107, 130903, -324922, -112969, 151697, -208170, 80758, -19431, -102759, 235631, 69970, -208233, -133293, -128225, -192959, -264, -341803, -15615, -117797]
15812a17797B40231b22363H2108b54411h5288L7242l87444B84362a80148e8183
15801a37531d1672G8288l8946A8142L03315a17709q9551R2339C7302a91646m8852
15790b40498B88937E6075O8543h9789b2694j1638l6011j05627B01239a10415C61440
15778b30057B2137a91777Q8200l6912C6732b3343H124J36365J29390c3930B09181
15766a26434i582j39680A99158b17557b2327q7182b9738D4352N027R9044m6535
15755A01888K38054b17703R5306m071r1738E7261J00806F2100R6806o9961e152
15743b17257L9028A96316F4233a16716F3995g0068N603A55106a53189A82743n3019
15732A29724b11183B31785b26843B18921K7394A8998e6410A68004c74080m1620
$$ y = [-117797, 240231, -222363, 82108, -254411, -85288, -48046, -435490, 284362, -180148, -58183, -137531, -41672, 78288, 39342, 18142, 321457, -117709, -207260, -114921, 37302, -191646, -240498, 288937, 56075, 124618, -89789, -22694, -34332, -70343, -175970, 201239, -110415, 361440, -230057, 22137, -191777, -103577, -140489, 36732, -23343, 8124, 144489, 273879, -33930, 209181, -126434, -9582, -149262, 199158, -217557, -22327, -109509, -29738, 44352, 49379, 148423, 101888, 339942, -217703, -122397, -126468, -218206, 57261, 158067, 62100, 158906, 88945, -5152, -217257, -178229, 196316, 64233, -116716, 63995, -70068, -64465, 155106, -153189, 182743, 129724, -211183, 231785, -226843, 218921, 246315, 18998, -56410, 168004, -374080, -415700]
15722d15700a46048A50439F23J99240c8010k21950A46728a88077g2109Q411o069
15711f9767F2492j9412J60905J4518a10106r7903A35107m357k1250l4774B388
15699e6794H7697f7266G7684J36300b10838A05037b33453B2591d9117B16334B1213
15687b3196L296B00568b13302A27227N877a78429E9708P8923c99915f7653p9076
15676a46729l064H9402M9495a18809d4649A60974a77863K6071e1816B56809d9202
15664H8617b57005N9190r5894R7277B74240j33259k8220K529C1633g5710b2399
15652a29731E495b2498A22938a01287C5699g8952B18918a40031P345I4533a07793
15640c27148c9550r276B21356B2837a5565A47142a64583o2528R4523D6004M38784
$$ y = [-415700, -146048, 150439, 623, 199863, -38010, -259960, 146728, -188077, -72109, -63698, -69767, 62492, 43080, 203985, 218503, -110106, -208009, 135107, 130750, 109500, 74726, 2388, -56794, 87697, -67266, 77684, 213984, -210838, 105037, -233453, 22591, -49117, 216334, 21213, -23196, -19900, 200568, -213302, 127227, 133104, -178429, 59708, 138631, -399915, -67653, -146729, -149793, 89402, 138897, -118809, -44649, 160974, -177863, -151792, -51816, 256809, -49202, 88617, -257005, -197815, -293709, -196432, 274240, 140981, 112761, 115290, 31633, -75710, -22399, -129731, 5495, -22498, 122938, -101287, 35699, -78952, 218918, -140031, -132686, 94533, -107793, -327148, -39550, -48826, 221356, 22837, -15565, 147142, -164583, -227111, -132588, 46004, 484788]
15629D84788c2538H3121M9888g6276E375J531J6383c59993b9309B8758M8305Q7525
15617A64588E9293b66793E3919b965l8642k11423h6080F0198b15437A69364d2821
15605c78395a09442I0811m1876b51949J06228b8818k6722j26586A71093K4453
15595A95546n3613f1640F3661m308b32451A3842O8879b46205A63140k3516R3249
15584B32873a70035B03870a5669A23967E3864a05443j25255i9192K3962A07617
15573C20054E9599J1137a41485C0070P5325E1406e4085J834j09270j54442B8883
15561A0826c6286M499E4123b86305A81392N3539a40457N0293I1833K83503B4575
15549H9643L32333A01304L8761d5099n131l22243a364n7282A5924e2531o5949
$$ y = [484788, -32538, 83121, 133009, -76276, 5375, 6906, 23289, -359993, -29309, 28758, 77063, 164588, 59293, -266793, 53919, -2965, -41607, -253030, -86080, 60198, -215437, 169364, -42821, -378395, -109442, 90811, 48935, -251949, -145721, -28818, -55540, -182126, 171093, 195546, 141933, -61640, 63661, 59353, -232451, 13842, 82721, -246205, 163140, 139624, 232873, -170035, 203870, -15669, 123967, 53864, -105443, -230698, -99192, -75230, 107617, 320054, 59599, 70736, -141485, 30070, 105395, 51406, -54085, -52251, -161521, -315963, 28883, 10826, -36286, -31787, 54123, -286305, 181392, 234931, -140457, -90164, 91833, 375336, 24575, 89643, 421976, 101304, 140065, -45099, -50230, -372473, -1364, -58646, 15924, -52531, -118480]
15538a18480o9164I826O2474J48251o8038a01134C72027j01968b01622C30205
15527d0951k42502F2023D334d3231E21526B578c4469j83033a9042H8650M6776
15516A35426K2931c29039J09956A80348c77084N3937a571q2646A90601f8564A3862
15504A09378M02682a17572G6143Q195J83157f0949B52906G7198J45262g6242F3901
15492D89830d9691B29207j10393L26537A86520e084k26108A52310E9645K11674
15482B71319j20049C6331L02094l3403e658A59029N4252i3379B58864F4278C0133
15470D370J9637j1764f453I6316j0327a27990B21461e2636J8179B39215M7025
15459B86240J98498Q7377o2464k39683M954j37354K87576I7424J09447n4919f2528
$$ y = [-118480, -187644, 9826, 72300, 220551, 152513, -101134, 372027, 270059, -201622, 330205, -40951, -283453, 62023, 4334, -43231, 521526, 2578, -34469, -217502, -19042, 88650, 135426, 158357, -329039, -219083, 180348, -377084, -323147, -1571, -84217, 190601, -68564, 13862, 109378, 512060, -117572, 76143, 84338, 267495, -60949, 252906, 77198, 222460, -76242, 63901, 489830, -49691, 229207, 118814, 445351, 186520, -5084, -231192, 152310, 59645, 271319, 151270, 36331, 338425, 305022, -5658, 159029, 213281, -93379, 258864, 64278, 30133, 4370, 24007, 12243, -6453, 96316, 85989, -127990, 221461, -52636, -34457, 239215, 286240, 484738, 572115, 509651, 269968, 274922, 137568, 425144, 97424, 206871, 151952, -62528]
15447e790C6008J9867d9293A8851L58766f1172H4820b60910B014J5768Q2079A460
15434B83310a16484e0042b3970A15871K76891A62939K39351J49876L96530J10145
15424A058841j18220l60246B88909m3358L52064a3753q8831j22091f4448a0722
15413G3400a93832j09355H6615Q9730D5486J67165J04593q998a90226A04697K5890
15402A30587c5278C8404e5723A6825J8065a6993B21152a86990J9405a1401I3782
15390A11051P6289a51595b3353H9119b07582O6027O0750A91573g2394C64918h0555
15378c6536B36724b07106C20052A40266a79686k8925B59688D2127A3405a01041
15367c96699a47482f9696A61111J84366a21250B73364h5620E0663K04017J52857
$$ y = [-5790, 36008, 55875, -49293, 18851, 377617, -61172, 84820, -260910, 2014, 17782, 99861, 1460, 283310, -116484, -50042, -23970, 115871, 392762, 162939, 402290, 552166, 948696, 1058841, 940621, 580375, 288909, 245551, 597615, -13753, -102584, -224675, -64448, -10722, 73400, -193832, -303187, 86615, 176345, 45486, 212651, 317244, 308246, -190226, 104697, 130587, -35278, 38404, -55723, 16825, 34890, -16993, 221152, -186990, -167585, -11401, 93782, 111051, 187340, -151595, -23353, 89119, -207582, -141555, -80805, 191573, -72394, 364918, -80555, -36536, 236724, -207106, 320052, 140266, -179686, -208611, 259688, 42127, 13405, -101041, -396699, -147482, -69696, 161111, 345477, -121250, 273364, -85620, 50663, 254680, 407537]
15357D07537A98010a65276e7136C24498I3903D974a23575B94994H4437L20972
15347D05409H5373J87940C088g5910C51800a2980k8144B25809m9800J5291J20107
15336C11407O6552B0551K74073L6435r1741f887G5534K02821A32089J05454J26799
15325C64342j74331M02339k34745d92706A84218d1722A10405K82206a55353M7985
15315a07368C40971c5802F4095K25691n5162r7827K18247l2788j58285j9968a92366
15303a08308F97K2060J28851j7695Q5767a74255g1762F31616l05251L66752B40488
15291C47554a11766B8650J29278a82069B98426a2277A25129J77697a17032A92032
15280B86596D5939J50642C6988a40353A25610B4754b30542a02680d8757F0074
$$ y = [407537, 198010, -165276, -57136, 324498, 93903, 4974, -123575, 294994, 84437, 405409, 85373, 273313, 3088, -75910, 351800, -12980, -41124, 225809, 176009, 191300, 311407, 377959, 20551, 294624, 331059, 239318, -6887, 75534, 278355, 132089, 237543, 364342, 190011, 592350, 357605, -492706, 184218, -41722, 110405, 392611, -155353, -107368, 340971, -35802, 64095, 289786, 234624, 136797, 355044, 322256, 163971, 144003, -192366, -108308, 697, 22757, 151608, 133913, 219680, -174255, -71762, 631616, 326365, 693117, 240488, 347554, -111766, 28650, 157928, -182069, 298426, -12277, 125129, 302826, -117032, 192032, 286596, 45939, 196581, 36988, -140353, 125610, 24754, -230542, -102680, -48757, 60074]
15269h8130M2328D8791J79298k1491C139L9883a96652P4885A03593M1558J10663
15258B55814L7588A5863D158J08064C1783K24187f965I5282B3931M8548j7219
15247E5260e9886B67131n2744E0512b35580G8905l485L81643A6526c90758B55824
15235B00563F648J41304o4826K03849O6099J70837j33687R92283O39790n71457
15225A450840J72832k63625n86791l65160H756a1297j34709l6756B05768r7449
15215A08319g4177H3729l8582P7094c2839A04406a8650B23824C9500Q4335c08240
15203b782B11944e7998A39309o0440c497A61188A6673P745p806e8931A22936D3260
15190c38277B82851j22463l3966C201O9552M71114a39316A56654f1346B96502
$$ y = [-88130, -45802, 48791, 228089, 206598, 3139, 43022, -196652, -121767, 103593, 145151, 255814, 293402, 15863, 4158, 112222, 31783, 255970, -6965, 95282, 23931, 72479, 55260, -59886, 267131, 214387, 50512, -235580, 78905, 75420, 457063, 16526, -390758, 255824, 200563, 6648, 147952, 83126, 286975, 353074, 523911, 390224, 1382507, 2022297, 1450840, 1623672, 1360047, 773256, 408096, 8756, -11297, -146006, -182762, 205768, 108319, -74177, 83729, 45147, 122241, -32839, 104406, -18650, 223824, 39500, 123835, -308240, -2782, 211944, -57998, 139309, 78869, -3497, 161188, 16673, 24418, 16612, -58931, 122936, 43260, -338277, 282851, 160388, 126422, 3201, 72753, 543867, -139316, 156654, -61346, 296502]
15179D52817j71469L688a49519A30230c3561C25410j46875a2902K362j03661C1061
15167D36453E9919K3894K70536b49871B20500j0160K44679A82096A6377M62417
15157D78794A66546G291c88341A11783g7702n1250j87588A70180k7528A5433K09751
15146B25184P1338H8356d9449O025D6998b93381a32058J5407B62951n7360F8877
15134B9242b27699b7921m0786A19759Q0494a25267A98579m8386k754A2203P151
15123A9354K46006J35545j19342q9558q8975M0319E0361B476M86235F765L40611
15112C47376j06560A1624c11475A8805R6075Q8763D3703a60033E3730K67469N18865
15101H40064B99374b63595A07532Q3116l6002J04117D6987O8558O5596M4343c4075
$$ y = [452817, 281348, 285036, -149519, 130230, -33561, 325410, 178535, -12902, -10540, -114201, 31061, 436453, 59919, 83813, 354349, -249871, 220500, 210340, 455019, 182096, 16377, 478794, 166546, 7291, -388341, 111783, -77702, -128952, -316540, 170180, 142652, 15433, 225184, 296522, 88356, -49449, -43424, 46998, -293381, -132058, -116651, 262951, 205591, 68877, 29242, -227699, -27921, -68707, 119759, 200253, -125267, 198579, 150193, 147439, 12203, 19354, 265360, 400905, 281563, 192005, 103030, 143349, 50361, 2476, 488711, 6765, 347376, 240816, 11624, -311475, 18805, 114880, 203643, 43703, -160033, 53730, 321199, 840064, 299374, -263595, 107532, 190648, 154646, 258763, 46987, 115545, 181141, 225484, -34075]
15089e7386H8829e2961A3321M2503h7869C65569A75945K9019h2137C84990L9993
15078D24983D988J06121J13110P1155j27715Q9501m4351K50903F4384R7407B3187
15066A23872J4540Q4040l5348Q7579J5614a42553A17988K01663o5805L8751A20642
15054A94877O7232p5544C0628L06918n957e307A96010l2810L60440k41810L9054
15043C20884q2222n9591J63245C6820L11028L4949j0917J39615j82505G3188N23987
15032E97175A86073M94165a20070G35903l56583A44268L84290k17561J04487A4171
15021B81797M53368B51978j12427a1843F44953J52393l26460J79062L69362n6948
15011I62362k74831k56696j53728L68887k86575J04863J05974J93701j83568K32872
$$ y = [-57386, 88829, -52961, 13321, 55824, -87869, 365569, 175945, 204964, -82137, 384990, 424983, 4988, 111109, 224219, 295374, 167659, 257160, 212809, 463712, 64384, 161791, 23187, 123872, 138412, 222452, 187104, 274683, 290297, -142553, 117988, 319651, 253846, 292597, 120642, 194877, 262109, 186565, 30628, 337546, 331589, -5307, 196010, 163200, 523640, 281830, 320884, 238662, 179071, 342316, 36820, 347848, 382797, 371880, 511495, 328990, 73188, 597175, 186073, 680238, -120070, 735903, 379320, 144268, 528558, 310997, 415484, 14171, 281797, 735165, 251978, 139551, -11843, 644953, 797346, 470886, 649948, 1019310, 962362, 687531, 430835, 277107, 645994, 359419, 464282, 570256, 763957, 580389, 813261]
15001H13261j8289k57333j60933J88285B33927J93964m1385J47925p2161k2986
14991D39284J31317j32483A11164M84961j79834n635j58619J06880J16802J22584
14981E98303A59843M15518K32174l50380H9634L67000k730l2221J24108J4038
14971E59829j29794J83858j6340m221j95319P16712l36575j39693R918l10031
14961C38344K27833k04596K53375J21499j85211J15029j46309N8046R0858A08963
14950A94561K59181Q1044k19699r7173O5066P1960j59371K66112A15498M28399
14940E43897J32269C23083J36962B16779R385L4744J36850A69432n7919K96839
14930D08352O7302j27278L37996p8649J34667k23710A67449N27691j86537M9047
$$ y = [813261, 794972, 537639, 376706, 564991, 233927, 427891, 386506, 534431, 462270, 439284, 570601, 438118, 111164, 596125, 416291, 410656, 252037, 358917, 475719, 598303, 159843, 575361, 807535, 457155, 89634, 456634, 453904, 421683, 545791, 559829, 430035, 613893, 597553, 593332, 398013, 1114725, 778150, 638457, 648375, 338344, 566177, 361581, 614956, 736455, 551244, 666273, 519964, 578010, 668868, 108963, 194561, 453742, 534786, 315087, 217914, 282980, 354940, 195569, 461681, 115498, 543897, 676166, 323083, 460045, 216779, 226164, 260908, 397758, 169432, 111513, 408352, 475654, 348376, 686372, 607723, 742390, 518680, 167449, 695140, 508603, 557650]
14920E57650B67450M03609j18371M91561J0120J68294k47800J05710K72774O8965
14910A422312J92401q4882J65363Q1856l49817J44528k33507M92515J69443M03544
14900B403756k93263k2095l87237k53791k60308l43838r7233p0029k57884P4966
14890D93044j94544J75859K29510k16719M2036J76744k00431J25236j67561D9129
14879B66610K12125m5515J94132m4571j74242j25606M71695j80952K14753L05863
14869A094292l2565m25826J8601L78873m55167J85633J85130k27131k69155K55608
14859G08293o1510q8849R0598k03402K74334k798k25281L19009j98938j73219
14849D38237K80283O3796l26537J0279M81211k72615O1562j60499J24006k49234
$$ y = [557650, 267450, 671059, 552688, 1044249, 1054369, 1222663, 974863, 1080573, 1353347, 1422312, 1614713, 1529831, 1695194, 1777050, 1427233, 1571761, 1338254, 1830769, 2000212, 2403756, 2110493, 2088398, 1701161, 1447370, 1187062, 843224, 745991, 675962, 418078, 493044, 298500, 474359, 703869, 487150, 529186, 705930, 505499, 630735, 463174, 49129, 266610, 478735, 433220, 627352, 582781, 408539, 282933, 754628, 573676, 788429, 1094292, 1061727, 635901, 654502, 1033375, 578208, 763841, 948971, 721840, 452685, 708293, 646783, 557934, 648532, 445130, 719464, 716666, 491385, 810394, 611456, 438237, 718520, 782316, 455779, 466058, 947269, 674654, 736216, 575717, 699723, 450489]
14839D50489M4029J43526l4714j54916k01440K32446J05045L49950C61408K69630
14829F31038K53323L64289l02436M16518m8492j62054j31155k19891J87976k22036
14819G67080k13040J70843j29536J48003j48283q2574M845J17610N8356k40618
14809D52686J07182L67340j31695p4026N7818j873L13893j65979n4297j29281
14799G41768k41798j13447K64695K76304P6057D62800M60127q4787j82698J69673
14789H25115q9284J61884J38589k74973k47524P2357l2480p7406K19867q7018
14779F09127J05630k58063J66760r982A83555N79831k4788Q7955Q5502j42971
14769G69084C46530K29790K65514l67282M86667D49628M24314k88879L12352q5070
$$ y = [450489, 494518, 638044, 603330, 448414, 246974, 479420, 584465, 934415, 361408, 631038, 884361, 1248650, 946214, 1362732, 1314240, 1152186, 1021031, 801140, 989116, 767080, 554040, 724883, 595347, 743350, 595067, 512493, 517338, 634948, 693304, 452686, 559868, 927208, 795513, 721487, 779305, 777432, 1091325, 925346, 871049, 741768, 499970, 386523, 651218, 927522, 1003579, 462800, 922927, 838140, 655442, 825115, 735831, 897715, 1036304, 761331, 513807, 586164, 553684, 476278, 696145, 609127, 714757, 456694, 623454, 613472, 183555, 763386, 738598, 826553, 912055, 769084, 346530, 576320, 841834, 474552, 961219, 449628, 873942, 585063, 897415, 812345]
14759H12345Q5715J08371m9452r0453p1069J30614k67507p9401J73674j64916
14749E87921L2037M0846K8239j26111j21735L55665o2146J2172J22477l64893
14739E04472Q2077J61938l00659J68921l5683N0135j44187K38266J23262r6842
14729G51700L80760k28979m214K09034k69443n6392j5523j955j10666L65732j0453
14718A009601k99010J17263K25248l42834J61211K29715M92996J19456k92519
14709A421127O34558n66210k39479j34084K07556j76441r5543l26509K98598l5656
14699I87917n7896o2038L2666K4289O2904m07449O69020j80969j48290Q3618L61043
14688A364815j49549O02003l41348M75675K7676l06781j98710k23105R7041l30986
$$ y = [812345, 898060, 1006431, 956979, 866526, 795457, 926071, 658564, 579163, 752837, 587921, 619958, 660804, 689043, 562932, 441197, 796862, 734716, 746888, 869365, 504472, 586549, 748487, 447828, 616749, 581066, 631201, 487014, 725280, 848542, 751700, 1132460, 903481, 899267, 1108301, 838858, 782466, 766943, 764988, 654322, 1020054, 1009601, 710591, 827854, 1053102, 710268, 871479, 1101194, 1594190, 1713646, 1421127, 2055685, 1489475, 1249996, 1115912, 1323468, 1147027, 1051484, 724975, 1023573, 987917, 930021, 867983, 900649, 924938, 987842, 580393, 1249413, 1068444, 920154, 1003772, 1364815, 1215266, 1817269, 1475921, 1951596, 1979272, 1672491, 1473781, 1250676, 1347717, 1016731]
14678A016731j34234K74450K2098l57118J94772q0585L0165k65210J81976k7579
14668H55466L49736R2284m24377j24746J71108n1294J49939j27633p5121L02777
14658A118139Q5808m06963m7193L27096O8966l9546m9799q4966r6180K07673L6081
14647A119116j97172r2993r129M11712P3974k91004j931L46306j4472k93137j10004
14636I41266J04386O07352o29892M20886k21604l5748M2254j05834L15215j92590
14626A245691n7628Q7206L69686m35059k03732Q6485O5180K52796k26557J93126
14616A377194N15476m32060m1885m83810O26466k48383o7458J10017J42917K0617
14606A519091J6748l5963K4657l76631J84614k39598M21897M1943k12769L45663
$$ y = [1016731, 882497, 1156947, 1179045, 821927, 1016699, 936114, 966279, 701069, 883045, 855466, 1205202, 1297486, 873109, 748363, 919471, 868177, 1018116, 890483, 815362, 1118139, 1203947, 796984, 749791, 1076887, 1145853, 1106307, 1056508, 971542, 875362, 1083035, 1119116, 921944, 828951, 819822, 1231534, 1305508, 1014504, 1012573, 1358879, 1344407, 1051270, 941266, 1045652, 1653004, 1023112, 1443998, 1222394, 1186646, 1228900, 1123066, 1438281, 1245691, 1188063, 1275269, 1644955, 1209896, 1006164, 1092649, 1157829, 1410625, 1184068, 1377194, 1892670, 1460610, 1418725, 934915, 1561381, 1312998, 1245540, 1355557, 1498474, 1519091, 1535839, 1499876, 1524533, 1147902, 1332516, 1092918, 1514815, 1556758, 1343989, 1689652]
14596A689652r0422n24222N05232J34776k87016J67520l79024M33892k82128J15292
14586A483552J39731J88470j70550L7897l03663J53149K83855k95234K49818k13068
14576A553957K29201J26542o5594j45635K66048j34249k4313j33680K58127o5206
14566A865198p3806J10264p9543J06699J58592j2259L37450m08018J96421J42272
14556B343270l32478K42686r6007N13121L4173m35526J46585M6737r0823K91726
14546B663464J68416m6644J35371Q6149L04177K58058J33604O44780K99630N95983
14536E242988Q00093J668867K214858L910649O102019J0875425P32675j3524420
14528A8023154p688545l698317j864921n35688q2601O98968j31420j089354n94451
$$ y = [1689652, 1599230, 1075008, 1580240, 1715016, 1428000, 1595520, 1216496, 1650388, 1368260, 1483552, 1623283, 1811753, 1641203, 1679100, 1375437, 1528586, 1812441, 1517207, 1767025, 1553957, 1783158, 1909700, 1844106, 1698471, 1964519, 1830270, 1805957, 1672277, 1930404, 1865198, 1791392, 1901656, 1822113, 1928812, 2087404, 2075145, 2412595, 2004577, 2200998, 2343270, 2010792, 2253478, 2157471, 2670592, 2704765, 2269239, 2415824, 2462561, 2371738, 2663464, 2831880, 2785236, 2920607, 3006756, 3310933, 3568991, 3702595, 4347375, 4647005, 5242988, 6043081, 7711948, 9926806, 13837455, 19939474, 30814899, 31547574, 18023154, 10334609, 6636292, 4771371, 4235683, 4153082, 4852050, 4720630, 3631276, 3036825]
14519C036825k46242n40589j9191O633K34581j55961R2716k51614M27722l7538
14509B547342p0568P0074R684O9400k29274R0494q1273J27617L71042j61259L05051
14498C048330j29051q0935J07473j43336n9153K52824o8722K28362j24718j28268
14488B902806J17787j23200J38179J25931l158k4737K04313j51855K84990J19478
14478C590534o9001j31430j8817j68895L26054O0433r6820L6188P3669R1301K57355
14467C950571M6348l0922k27804K90416k91799R6554M68618k72529J77324n8105
14457D148672p5240M76327l55822L64671j02454k8058L46849k38068J60664J45335
14447D842876k59711M53137m89744L72927L66367j03664k77544M44246m22932
$$ y = [3036825, 2790583, 2249994, 2230803, 2237436, 2472017, 2316056, 2408772, 2157158, 2584880, 2547342, 2476774, 2546848, 2556532, 2625932, 2396658, 2487152, 2405879, 2533496, 2904538, 2743279, 3048330, 2919279, 2838344, 2945817, 2802481, 2743328, 2996152, 2927430, 3155792, 3031074, 2902806, 3020593, 2897393, 3035572, 3161503, 3158345, 3133608, 3337921, 3186066, 3471056, 3590534, 3521533, 3390103, 3371286, 3202391, 3528445, 3588878, 3492058, 3528246, 3601915, 3693216, 3950571, 3996919, 3965997, 3738193, 4028609, 3736810, 3833364, 4301982, 4029453, 4206777, 4148672, 4073432, 4549759, 4193937, 4558608, 4456154, 4428096, 4774945, 4536877, 4697541, 4842876, 4583165, 5036302, 4546558, 4919485, 5285852, 5182188, 4904644, 5348890, 4925958]
14438D925958Q68808m61934o646J71751j67604L78710j11872Q6197m9305M56037
14428F090100k0082l169K43760J7293k9009K7347L42378l11559L29199j57822
14418F528436J17729P9005M37885J65430l84458P22290p17176P62757J23488o4508
14408G770878J00565N9774K69217P4938K64786K63495m25788M48191J92149k04002
14398H814203K18434P5545O8465L58709j07670L5612K81784K98404L16748J62392
14388A0522626j57510L87655K78117k14757K19734j2267K83447J82989l5815K52521
14378A1706740K67960o376K22911P37341k34361L57818J36014J92216L23149J53259
14368A3856671L48684O67878J29924L67052J58036L52116J96342L34276J38067
$$ y = [4925958, 5794766, 5332832, 5326186, 5497937, 5330333, 5709043, 5597171, 5683368, 5634063, 6090100, 6070018, 6066849, 6310609, 6327902, 6298893, 6326240, 6668618, 6357059, 6686258, 6528436, 6646165, 6725170, 7163055, 7328485, 6944027, 7666317, 6949141, 7711898, 7835386, 7770878, 7871443, 7931217, 8200434, 8275372, 8540158, 8803653, 8377865, 8826056, 9018205, 8814203, 9032637, 9108182, 9176647, 9535356, 9427686, 9463298, 9745082, 10043486, 10360234, 10522626, 10365116, 10752771, 11030888, 10816131, 11035865, 11023598, 11307045, 11490034, 11454219, 11706740, 11974700, 11968324, 12191235, 12928576, 12694215, 13052033, 13188047, 13380263, 13703412, 13856671, 14205355, 14873233, 15003157, 15370209, 15528245, 15880361, 16076703, 16410979, 16549046]
14359A6549046M86354J15641Q7785N03443K19396P69354N1424P88208L71764P05691
14349B0648106J13186N39182M02684K33186O76321Q0479N34857M50400O60870
14340B4339271O33465J017283O3396Q33504R11774N93349J86205J449655K66543
14331C0294445R92014N93124J047047J095523J146348N61817R37591P72081J490300
14322C8930290P98282J412352J102187J102206J578045J507546R00484J704166
14314D9035558J496347J872590J855304J612179J611333K183074K457838J913635
14306F4037858K029902K439380K702479K349674K849750K774466L093866L054086
14298H5331461L526719L554713L820473L741542M905866M115004M531378N403909
$$ y = [16549046, 17035400, 17151041, 17238826, 17742269, 17961665, 18731019, 18782443, 19570651, 19942415, 20648106, 20761292, 21300474, 21703158, 21936344, 22612665, 22693144, 23228001, 23678401, 24339271, 24972736, 25990019, 26053415, 26886919, 27798693, 28392042, 28578247, 30027902, 30294445, 31286459, 31879583, 32926630, 34022153, 35168501, 35730318, 36667909, 37439990, 38930290, 39728572, 41140924, 42243111, 43345317, 44923362, 46430908, 47331392, 49035558, 50531905, 52404495, 54259799, 55871978, 57483311, 59666385, 62124223, 64037858, 66067760, 68507140, 71209619, 73559293, 76409043, 79183509, 82277375, 85331461, 88858180, 92412893, 96233366, 99974908, 104880774, 108995778, 113527156, 118931065]
14290A18931065N260073O188987N807454O492472O825364P137569P872280P774778
14282A72290042R002693Q851673R486054J0242032J0604166J1032566J1640722
14275B43149948J2683467J2920723J3364083J3675295J3853036J3710325J3842236
14268C37199113J3818232J3121748J3098427J2405272J1626916J1322581J0044194
14261D22636483R688036R225571P550091M542976K132988K198336K956296r4041
14253D60836736n339347m763383q440417r289034j1266078j1677255j3244246
14246C96816976j3337558j3821753j3847007j3695471j4994178j3834566j4159941
14239B99126502j3839636j3173121j2553091j1774825j1949738j1345611j0248867
$$ y = [118931065, 124191138, 130380125, 136187579, 142680051, 149505415, 156642984, 164515264, 172290042, 181292735, 190144408, 199630462, 209872494, 220476660, 231509226, 243149948, 255833415, 268754138, 282118221, 295793516, 309646552, 323356877, 337199113, 351017345, 364139093, 377237520, 389642792, 401269708, 412592289, 422636483, 432324519, 441550090, 449100181, 453643157, 455776145, 457974481, 460930777, 460836736, 455497389, 450734006, 442293589, 433004555, 421738477, 410061222, 396816976, 383479418, 369657665, 355810658, 342115187, 327121009, 313286443, 299126502, 285286866, 272113745, 259560654, 247785829, 235836091, 224490480, 214241613]
14232B14241613j1049284j0315965r560229r068870q646705p721249p627399o986515
14224A43265397o454174o194050n638019n833037n341707m541241m653924m614992
14216I9994253l530452m247792l779249l438514l453945l058522l037488k433633
14208G3014658k638817k865974k470610j854305k127566k146754j750603k066348
14200E5093681j941289j462330j112351j778520j457555j503403j242514j439834
14192D3155885p50201j301573j376462j069681j001844j229443n14816r84426
14184C4927439j016092r00811q42109q95896r67660n23984q18236o03027o04267
14175B7755357l99667j242095k39973r06214m16934m81762m92488m12069m29227
$$ y = [214241613, 203192329, 192876364, 183316135, 174247265, 165600560, 157879311, 150251912, 143265397, 136811223, 130617173, 124979154, 119146117, 113804410, 109263169, 104609245, 99994253, 96463801, 92216009, 88436760, 84998246, 81544301, 78485779, 75448291, 73014658, 70375841, 67509867, 65039257, 63184952, 61057386, 58910632, 57160029, 55093681, 53152392, 51690062, 50577711, 48799191, 47341636, 45838233, 44595719, 43155885, 42405684, 41104111, 39727649, 38657968, 37656124, 36426681, 35911865, 34927439, 33911347, 33010536, 32168427, 31272531, 30304871, 29780887, 28962651, 28359624, 27755357, 27355690, 26113595, 25873622, 24967408, 24550474, 24068712, 23576224, 23164155, 22734928]
14166B2734928p93865l35459l36762r70474J35545p81642k51233k53970l38760
14157A8808308l18344m63884l54841k18592n70413l12349m61113j26072k63936
14148A5718764l47636l82877o2534l33749o1009m16547m1119l00033k24102m30022
14138A3119136m08999J49252m26485J48992l76626l95064j72217K37983l76542
14129A1499430o44373q1736k40591j85139q9919l87957L88156n8455j04102k71756
14119I823558j98161k65934M67466k59776o13846j7848k60724J72356k63459J60270
14109H743902k31106j56714l50087r1603j76143M5910k00997J53675l88740K05624
14099G553721l68556j50352r2428q1374Q8695L4840j98607M67469m54851o1575
$$ y = [22734928, 21941063, 21605604, 21268842, 20298368, 20433913, 19652271, 19401038, 19147068, 18808308, 18489964, 18026080, 17671239, 17452647, 16882234, 16569885, 16108772, 15982700, 15718764, 15371128, 14988251, 14925717, 14591968, 14530959, 14114412, 14073293, 13773260, 13549158, 13119136, 12710137, 12859389, 12432904, 12581896, 12205270, 11810206, 11637989, 11875972, 11499430, 10855057, 10773321, 10532730, 10347591, 10257672, 9869715, 10257871, 10199416, 10095314, 9823558, 9625397, 9359463, 9826929, 9567153, 8953307, 8935459, 8674735, 8847091, 8583632, 8743902, 8512796, 8356082, 8005995, 7914392, 7738249, 7784159, 7583162, 7736837, 7348097, 7553721, 7185165, 7034813, 6942385, 6861011, 6949706, 6984546, 6785939, 7253408, 6798557, 6736982]
14089F736982l262m01416k6278L30326l99592j0615j63738k86474K11661r6517
14079E891077R72n42140K40365L6287j33211m4436k534p9421j47115J28332j06081
14068E242095j05264o7671j61959J10832J41840j83202o9030J19251l33135r9762
14058D593995K82079k81874J89920o4871m54851j23590j29971L53893q9195L25731
14048D601266l31998K58228j11592k6202N9495l58388k1096l1396m31233L62827
14038C969911p9046o8389k36127K14482J3812l81370K79172j82358J8641K74725
14028C823453m11760J46032k91313r4056J84823J8335k94912l21817L79795j12738
14018C025842K42510q4788l12618l8131L4329J79360L2321j40096K30982m51756
$$ y = [6736982, 6733720, 6332304, 6306026, 6636352, 6236760, 6226145, 6062407, 5775933, 5987594, 5891077, 5892049, 5349909, 5590274, 5626561, 5493350, 5448914, 5446380, 5366959, 5219844, 5348176, 5242095, 5136831, 5069160, 4907201, 5018033, 5159873, 4976671, 4907641, 5026892, 4693757, 4593995, 4876074, 4594200, 4784120, 4719249, 4264398, 4140808, 4010837, 4364730, 4275535, 4601266, 4269268, 4527496, 4415904, 4389702, 4449197, 4090809, 4069713, 4038317, 3607084, 3969911, 3890865, 3822476, 3586349, 3800831, 3814643, 3433273, 3712445, 3530087, 3548728, 3823453, 3411693, 3557725, 3266412, 3172356, 3357179, 3375514, 3080602, 2758785, 3138580, 3025842, 3268352, 3183564, 2870946, 2832815, 2867144, 3046504, 3078825, 2938729, 3169711, 2717955]
14008B717955J22611j07574l6129N5818L64723j85577Q2029k55060o2388j91063
13998B505345K60352k87499j21728J4081N8585n0553N16752n86495J69363j35308
13988B342895k35663L44755p1484L2783k8674L7567J19704j75585L66483J56577
13978B889358J35401N39201N56713Q60762J688801L359545N199333J0770699Q202225
13969C4202038j1497909q446158m636453k776146q30235j055396p18431k81993
13961C959317L1555o74638j16708o4090r1331l03005l47611J57305J42595o0782
13951B632607m35246O5467j98796L20628l27165M16122j58423l06213J7255J09034
13941B135270l55444L97833J19106l85074j31593L22179M441k7830J2113o1912
$$ y = [2717955, 2840566, 2732992, 2696863, 2752681, 3117404, 2931827, 3013856, 2758796, 2696408, 2505345, 2765697, 2478198, 2356470, 2370551, 2429136, 2378583, 2895335, 2308840, 2478203, 2342895, 2107232, 2451987, 2380503, 2413286, 2384612, 2422179, 2541883, 2366298, 2732781, 2889358, 3024759, 3563960, 4120673, 4981435, 6670236, 10029781, 15229114, 25999813, 34202038, 22704129, 14257971, 9621518, 6845372, 6015137, 4959741, 4241310, 3959317, 3990872, 3316234, 3199526, 3135436, 3044105, 2741100, 2393489, 2550794, 2693389, 2632607, 2197361, 2262828, 2064032, 2384660, 2057495, 2473617, 2315194, 2008981, 2026236, 2135270, 1779826, 2177659, 2296765, 1911691, 1780098, 2102277, 2106718, 2078888, 2091001, 2029089]
13931B029089J11463k62164K0596l21382Q6844K36580N0616K7619k37375J2724
13921A754610r3847J7159n6697J27032J76363k36897K70595l33008k5274J8368
13911A618404O8696m83534N10804p0068O806m162L6250j85925k05352L7402O7599
13900A396920j28809L20451K4201o9056K1026r1468J75389m10309L97050k26438
13890A408957N7980p1647j76541j35329N59341L7701j40543l04409O9856K28222
13880A533588L8224j40635O9301K1809l10121K81197l74944J10383k169K47448
13870A474081M2754j24267j45801j96942K92353j10123J44499j80997K5082l31661
13860H88978M0177J63289j41191L56546j06230j32023K19995n3300j82245m639
$$ y = [2029089, 2140552, 1878388, 1898984, 1577602, 1664446, 1901026, 1951642, 1979261, 1741886, 1754610, 1660763, 1677922, 1621225, 1748257, 1924620, 1687723, 1958318, 1625310, 1600036, 1618404, 1687100, 1203566, 1714370, 1644302, 1651108, 1646946, 1683196, 1497271, 1291919, 1329321, 1396920, 1268111, 1588562, 1612763, 1543707, 1564733, 1473265, 1648654, 1238345, 1635395, 1408957, 1466937, 1395290, 1218749, 1083420, 1642761, 1680462, 1539919, 1235510, 1305366, 1533588, 1571812, 1431177, 1500478, 1522287, 1212166, 1493363, 1118419, 1228802, 1226633, 1474081, 1516835, 1392568, 1246767, 1049825, 1342178, 1232055, 1376554, 1195557, 1220639, 888978, 929155, 1092444, 951253, 1307799, 1201569, 1069546, 1289541, 1236241, 1053996, 1049357]
13850A049357J62903L5074j39729r2118n3317K09103O2644j18606L16510n53867
13840H77954J19040N07934m13677k70778K07073R6206j23451p2510m5708n3754
13830H28329L34744n05261O66145k43817n4103K36518j554k78609m3552k91290
13820F47550J57643L46207J237l98563J28305L31890J861j96324k6796j09228
13810H83782O4095n9737J05533l8722J14219l36131n7072J41722J0386J4900j27837
13799G15138L01484j18940Q9644Q2412k10896j60327M02688k89725B75708P25994
13789A001702j70729J92942j80086M06360l40084L27474l53869j18438J63206
13780I28478q2646K44542l69937L6473P376j3764K68546l93277M26112C82818
$$ y = [1049357, 1212260, 1247334, 1107605, 1015487, 962170, 1171273, 1233917, 1115311, 1431821, 877954, 996994, 1504928, 1091251, 820473, 1027546, 1123752, 1000301, 927791, 882083, 828329, 1163073, 657812, 1323957, 1080140, 1026037, 1262555, 1261001, 982392, 938840, 647550, 805193, 1151400, 1152637, 754074, 882379, 1214269, 1216130, 1019806, 993010, 883782, 947877, 888140, 993673, 954951, 1069170, 733039, 675967, 817689, 828075, 842975, 715138, 1016622, 897682, 987326, 1069738, 858842, 698515, 1101203, 811478, 275708, 1001702, 830973, 1023915, 843829, 1250189, 910105, 1237579, 883710, 765272, 928478, 845832, 1090374, 720437, 756910, 764286, 750522, 1019068, 625791, 1051903, 382818]
13769A041695j59833n6084K85515M2929l98483K17110j90426P9258L07314l50674
13759H18321C97502M73128k25796J81332o2335j7573k86007L38305j29593j79747
13749D89216B29581O77506j34995j25808Q4042C48112M53537j08085j03407K36881
13739H27038l68729J29490K30577j26723L6182o1159k09812J77433K0300Q6798
13729G41395p7339k64485J28506R8727J75342n6323k5222j17885K91037l28179
13719E65574L59541l5386C96720K17014J40149l231k12027M870j71171J00737
13709D73061M56234m25078j45023M46041J33973D38435J83665J18578k668k14428
13699E23582L76596j22527k21304l1125j49206J48156n5089J7849r7753K92484
$$ y = [1041695, 881862, 825778, 1111293, 1154222, 755739, 972849, 782423, 861681, 1168995, 818321, 397502, 870630, 644834, 826166, 763831, 746258, 460251, 798556, 668963, 489216, 229581, 907087, 772092, 646284, 730326, 348112, 801649, 693564, 590157, 827038, 458309, 587799, 818376, 691653, 727835, 666676, 456864, 634297, 654597, 741395, 664056, 399571, 528077, 626804, 802146, 745823, 720601, 602716, 893753, 565574, 925115, 889729, 396720, 613734, 753883, 750652, 538625, 543495, 372324, 473061, 929295, 504217, 359194, 805235, 939208, 438435, 622100, 740678, 738010, 523582, 900178, 777651, 556347, 525222, 376016, 524172, 469083, 486932, 389179, 681663]
13689F81663j42852p3821K84442J03462l77132J9815j01770K17717j22783L62592
13679H51333k43314M124j37190J499A03412O09960k42036j65795K51301j30722
13669D26120n4054N1616J77074j30843j5966j92499K46920k08272N3849K77821
13659F31766k04414K25714p5029j52139P3998j74748M51328j32060K0625r741
13649F55300k74384M69545k36586r2036k28663J26550J03398j9796O8100L51024
13639I22452D38547k6245J74173n9118J70214A57384L80855B26375N86115l72284
13629D40206K24095A25661J65896K01499m1254q1844Q6810J13819j67539A34409
13618B97344J58807N7386r0369o3499N4523C6474M42570p6523A99965L48101B62596
$$ y = [681663, 538811, 464990, 749432, 852894, 475762, 495577, 393807, 611524, 488741, 851333, 608019, 612143, 474953, 476452, 103412, 713372, 471336, 305541, 556842, 426120, 372066, 423682, 600756, 469913, 453947, 261448, 508368, 300096, 353945, 631766, 427352, 653066, 578037, 425898, 499896, 325148, 776476, 644416, 665041, 655300, 380916, 850461, 613875, 521839, 293176, 419726, 523124, 503328, 571428, 922452, 438547, 412302, 586475, 527357, 697571, 157384, 538239, 226375, 812490, 440206, 664301, 125661, 291557, 493056, 451802, 369958, 456768, 570587, 403048, 134409, 297344, 456151, 513537, 423168, 359669, 414192, 36474, 479044, 402521, 199965, 548066, 262596]
13606G66535k75035A49782J92666J22872J12559B09822J60432j28628O6562M6347
13596C54535N0108J78357A57868o4042M85127Q334j1228j06048B22385J59621
13586C82006l1481K27930j42904j1202J29098l1302o415L0746j38343M0432r487
13575D39078A59260M8973K48668l5660M4282a04394C43043K40766Q3388b11386
13564D60624R5054r7072N1908B21281J00350A08877L35065n7062j78791G5979
13553G2662M94166n7701q1575j36634O8242J63406a2514B60533M18670k43098
13543D36105J52064B45826L54364B62111J51853M6793A68630K70323j51307M5704
13533C33350p9708h373B06171Q338a06746A15383K72365j93108D830L98486m4588
$$ y = [766535, 491500, 149782, 342448, 465320, 577879, 209822, 370254, 241626, 308188, 354535, 404643, 583000, 157868, 93826, 578953, 587287, 576059, 470011, 222385, 382006, 350525, 578455, 435551, 424349, 553447, 522145, 515730, 546476, 408133, 448565, 439078, 159260, 208233, 456901, 421241, 465523, -104394, 343043, 583809, 667197, -211386, 460624, 555678, 458606, 510514, 221281, 321631, 108877, 443942, 386880, 208089, 75979, 72662, 566828, 509127, 427552, 290918, 359160, 522566, -12514, 260533, 679203, 436105, 588169, 245826, 600190, 262111, 413964, 460757, 168630, 438953, 287646, 333350, 253642, -8373, 206171, 214509, -106746, 115383, 387748, 194640, 4830, 403316, 358728]
13522C58728J87672k39375j34669l8446J23503J56502A48180a43236A96817K5697
13512B22514J97444A83732K73760n6712A95648l2306J23216A20694K45824J1118
13502C77636j4544m9109J4303d6921D88489a2269B20733J03606P5398n5214i2843
13490E7564M06523A9368M21230D8118J70982A08714K43637j24245E5178J36882
13480A92060J92348j88069J27361J47870A82795J25606j44997J42405A33099J16122
13470B49221A19443N29810j24391j48695A49251l7498N6788M48600j88861H7221
13459f3735B62007p6518J0984K42675A97204k8475J65679j29204B6818N1135K57198
13448C35151L2540A49709l8958K56665A28258e665G5480L23737B3570J98496c59829
$$ y = [358728, 546400, 307025, 172356, 133910, 257413, 413915, 148180, -143236, 196817, 222514, 419958, 183732, 457492, 400780, 195648, 163342, 286558, 120694, 366518, 377636, 363092, 313983, 328286, -46921, 488489, -12269, 220733, 324339, 399737, 344523, -92843, 57564, 464087, 19368, 440598, 48118, 219100, 108714, 352351, 228106, 55178, 192060, 384408, 196339, 323700, 471570, 182795, 308401, 163404, 305809, 133099, 249221, 119443, 649253, 524862, 376167, 149251, 111753, 168541, 617141, 428280, 87221, -63735, 262007, 185489, 196473, 439148, 197204, 168729, 334408, 205204, 26818, 77953, 335151, 367691, 149709, 110751, 367416, 128258, -5665, 75480, 399217, 23570, 222066, -359829]
13436A70091K890K4423J49795G5755J12650a23567C91003n9756J24004B24746
13425C17417r7882R2157F1379c6383C21411j04611J83129j09260K9268j48065
13415A71872O5306p0393N2216q8065F1482B7397K08676n1268J43196J98273f5258
13403A68949R8392K9515q9868J44365o0484H9417K19797A21618M1709k8462i2832
13391a35966A87852p9400f5284B62687J1194B6699J31508Q2768E9271e992B64016
13379B57037N8155j10731r5871J92012N6412L6346q9800B1411J58180J7129K32716
13368D29436F83K51635A2618a32499e8479D84385a15361F7612O5066J50757j37428
13357A46007J41555l0981K0070j20089n3076M274M28036k63917A19176J84055
$$ y = [170091, 172981, 197404, 347199, 75755, 188405, -123567, 391003, 331247, 455251, 224746, 317417, 219535, 311692, 61379, -36383, 321411, 216800, 399929, 290669, 319937, 171872, 237178, 166785, 219001, 130936, 61482, 27397, 236073, 184805, 328001, 526274, -65258, 168949, 267341, 296856, 206988, 351353, 290869, 89417, 309214, 121618, 163327, 134865, -92832, -135966, 187852, 108452, -65284, 262687, 273881, 26699, 158207, 240975, 59271, -5992, 264016, 257037, 315192, 204461, 108590, 300602, 357014, 393360, 303560, 21411, 179591, 196720, 429436, 683, 252318, 12618, -132499, -58479, 484385, -115361, 67612, 132678, 283435, 146007, 287562, 256581, 276651, 156562, 103486, 107760, 535796, 271879, 119176, 303231]
13347C03231J39264j03368J5155A77083M1852p8976B642N90209A11673P3461J22070
13336C07204r9690J84715j23425K04597J12596l9709j96927B8484J610K22631
13326B52725j088D8674M48686j20748p7936J4378j09195o9228L84637B02191J69985
13315C72176j14545c0253A64568K19665j35559i7668B80720k4066J14050J6783
13305C87487H7288J3931D0780K24788A15009K84324A30764L79701M3796h7268
13294D39418H6876B4806L82384A24387K84892A43440E1357J40317J2489N2448
13284B56611p5306b07432J5013B37160K5419a06874C63539j21720G0805J26102
13274A96907K3409E4310a17997A81255K7699L2014N5120E5375L99871k6030A27885
$$ y = [303231, 442495, 339127, 354282, 177083, 218935, 139959, 2642, 592851, 111673, 185134, 307204, 207514, 392229, 268804, 473401, 585997, 546288, 349361, 28484, 30094, 252725, 251637, 48674, 497360, 376612, 298676, 313054, 203859, 134631, 519268, 202191, 372176, 257631, -30253, 164568, 384233, 248674, -97668, 280720, 256654, 370704, 387487, 87288, 101219, 40780, 265568, 115009, 399333, 130764, 510465, 554261, -87268, 439418, 86876, 24806, 407190, 124387, 409279, 143440, 51357, 191674, 204163, 256611, 181305, -207432, -192419, 237160, 262579, -106874, 363539, 241819, 70805, 196907, 220316, 54310, -117997, 181255, 208954, 240968, 296088, 55375, 455246, 429216, 127885]
13262A57898l2218n4837i3026A34301C340K41517l0483e3948K0378B60491A25866
13250B87171j34668m6014K4544a1662D42309n5639A88585o0413R0010C8907J5006
13239E3913J61330j8791O6180K922I7476a5327G9902O1025R4722c1432H6639b2066
13226a31721c5146F1726a89902E9104J57897F8215L54911d3077E1469J18428j6077
13215A53820m6694Q0273b2150C56015a38444B86472A17530i4399m9590B46958
13204B80912A36612P889a3332o2204A97241f7564B47153q5469h160A16083c92320
13192A54186G5266M10149H0946i5321k895n1773C3847J88574B0764g10j62314
13181a63024e4845B3675K30425a50919B24686a36740C69296A33224N4286J51912
$$ y = [157898, 125680, 70843, -93026, 134301, 3340, 244857, 214374, -53948, -33570, 260491, 125866, 287171, 152503, 106489, 131033, -11662, 442309, 386670, 188585, 128172, 218182, 38907, 53913, 215243, 196452, 262632, 265554, 97476, -15327, 79902, 140927, 235649, -31432, 86639, -22066, -131721, -35146, 61726, -189902, 59104, 217001, 68215, 423126, -43077, 51469, 169897, 153820, 107126, 187399, -22150, 356015, -138444, 286472, 117530, -94399, -143989, 246958, 280912, 136612, 144501, -13332, -75536, 197241, -67564, 247153, 161684, -8160, 116083, -392320, 154186, 75266, 485415, 80946, -95321, -98216, -149989, 33847, 222421, 20764, -710, -163024, -54845, 23675, 254100, -150919, 224686, -136740, 369296, 133224, 187510, 339422]
13171C39422C7771R3218l2761N8368j1073h6755D7420j9500a74742C04834j0426
13160B94408f966k53070C59336p4289E6227J17470P9204c05456G1427K23669b68203
13148A60573b21511b9498o0111o1511M5038L619d7834j26911B56605b91314J41701
13137a49613B1503f1187G8819C5101K1566K8476J79609o6790J90640A45176n511
13126A39665d8146j89124e5361B97360j47490e5958k35557A64702m5631b7669
13115F674a2254F6333d2127p4926E15499G8848a17751j19692C98431h3260B00282
13103A76861o1649A8241M04345I9618c7596a3892j74600D8169G76K07413a5604
13091A11801a47070B85138h0486C39493G9974R6530F2218a13417j6314J7572J1694
$$ y = [339422, 37771, 130989, 98228, 156596, 145523, -86755, 47420, 27920, -174742, 304834, 294408, -6966, -260036, 359336, 285047, 56227, 173697, 252901, -305456, 71427, 295096, -268203, 160573, -221511, -29498, -89609, -151120, -106082, -102463, -47834, -174745, 256605, -291314, -149613, 21503, -61187, 78819, 35101, 56667, 85143, 264752, 197962, 388602, 145176, 139665, -48146, -237270, -55361, 297360, 149870, -55958, -291515, 164702, 119071, -27669, 6674, -12254, 66333, -42127, -117053, 515499, 78848, -117751, -237443, 398431, -83260, 200282, 176861, 115212, 18241, 422586, 99618, -37596, -13892, -188492, 48169, 776, 208189, -15604, 111801, -147070, 285138, -80486, 339493, 79974, 176504, 62218, -113417, -129731, -112159, -100465]
13080a00465A36131P239a44002B26065k3858J0487c56403A184M70117e3985D03034
13068A391J75218L45550A19800a82914A39360C2918K23396E4232C639a50354c4189
13056D28066n9834h1842j2589A30345J44194P9214A60070G9345a68456A33111
13045a12887I9853a0662B90727F6986a9864A57269g3689E9473K5595a23141C82713
13033B91040l7436a41236C64840A04164Q1841j5049a39415A07833J63536g2183
13022A80462b10819A81551H9648J90741G2793b10109r4467a11432A80443a03222
13011a14722k71761B30862g2447A74829i6260A13446J1559J80780p3279q6096
13001A46410B7381J89112j06779l4830L81443j49165o4666k5474a98818A47803
$$ y = [-100465, 136131, 143370, -144002, 226065, 202207, 212694, -356403, 1184, 471301, -53985, 403034, 1391, 176609, 522159, 119800, -182914, 139360, 32918, 256314, 54232, 3639, -150354, -34189, 428066, 368232, -81842, -94431, 130345, 274539, 353753, 160070, 79345, -168456, 133111, -112887, 99853, -10662, 290727, 66986, -19864, 157269, -73689, 59473, 85068, -123141, 382713, 291040, 253604, -141236, 364840, 104164, 186005, 170956, -139415, 107833, 271369, -72183, 180462, -210819, 181551, 89648, 280389, 72793, -210109, -304576, -111432, 180443, -103222, -114722, -386483, 230862, -72447, 174829, -96260, 113446, 125005, 305785, 232506, 146410, 27381, 216493, 109714, 74884, 456327, 307162, 242496, 217022, -198818, 147803]
12990A27410k9097a73315d4216C62436l8474C4062d17078A60973a05208r6505
12980b01713F1834K52375j03760a13342B63967d2980n4529B67618r3417b5065
12969A247N0727b17100B97986G5231a53766B45620d06848B6605J7201Q0298c1850
12957c20790C54692A76518B5623J60437R2084E9122b8254j1209D12046A67901
12946a34821B27007K94359D655a99993f1920j25499e8531F9008a9196m0412C17701
12934A61143m7637i2458B356a99938A35125c0719o8789B18584c59117p668f9048
12922a44916A25936J96166H6685l5024b43550A76344D7481N6761c18563d4833
12911H2456B4701P0124e2317A99828a91896d6324A30156h1648L2992B06742Q3699
$$ y = [127410, 98313, -173315, -44216, 362436, 323962, 34062, -417078, 160973, -105208, -201713, 61834, 314209, 210449, -113342, 263967, -42980, -97509, 267618, 174201, -25065, 1247, 51974, -217100, 297986, 75231, -153766, 245620, -406848, 26605, 43806, 124104, -31850, -320790, 354692, 176518, 25623, 186060, 278144, 59122, -28254, -39463, 412046, 167901, -134821, 227007, 521366, 4655, -199993, -61920, -187419, -58531, 69008, -19196, -59608, 317701, 161143, 113506, -92458, 2356, -199938, 135125, -30719, -99508, 218584, -359117, -366785, -69048, -144916, 125936, 322102, 86685, 51661, -243550, 176344, 47481, 104242, -318563, -44833, 82456, 24701, 94825, -52317, 199828, -191896, -46324, 130156, -81648, -48656, 206742, 290441]
12900B90441J15037H5571g4447A52926D9816N16565a51695C0114a07127B95289
12889A65135a72339A12992q034J05970a34571C8188J1357A2335M83476A0700b3757
12877g5956A06956h9200B07161H7880b4589D776b62652B23810p0802n7541h3783
12865b16148F2403K6388P1893k3150b704C5260j182b96751A11373J20846o7408
12854A64811k9458d1297j51757A23519D659J30799K2003E8271B5868J80116Q31
12843B06815h4521E6722L2634a11314a1350A98622j235b64190G6816a69264h1050
12831a88738k32150E7218O604b01568C08117r299i4788j5077k1390f4423j62251
12820b26674N2026m3834B27511a6559D7027K63668q4170q3739a50422I7676D204
$$ y = [290441, 405478, 85571, -74447, 152926, 49816, 566381, -151695, 30114, -107127, 295289, 165135, -172339, 112992, 104958, 210928, -134571, 38188, 49545, 12335, 495811, 10700, -23757, -75956, 106956, -89200, 207161, 87880, -24589, 4776, -262652, 223810, 153008, 95467, -83783, -216148, 62403, 88791, 160684, 137534, -2704, 35260, 34078, -296751, 111373, 232219, 164811, 135353, -41297, -193054, 123519, 4659, 135458, 157461, 58271, 25868, 205984, 206815, -84521, 56722, 89356, -111314, -11350, 198622, 197387, -264190, 76816, -169264, -81050, -188738, -420888, 57218, 63822, -201568, 308117, 298818, -94788, -109865, -131255, -64423, -226674, -174648, -218482, 227511, -16559, 47027, 310695, 226525, 142786, -150422, 97676, 4204]
12808c04210B28224h5847C34311A15080c39847A41928a30247j79941D630i7361
12797A69664o4384b47699e0829k41423A40867D8162b70509A84854a6559j3081
12787b9640F480b4316f205G5076A461K85919q6805G2753b04106B72691R7231j32329
12775B37593O3534A2267O8188d0520A1297a7427B34495D6316a47107j61560P6164
12764b32503h3637A33702L4895P2225a32913C90860c8317j72008B77754f0707
12753A28877a77481C5949J02614L171b03323D4371i9797a6787F7155N273b63471
12741B90853g9178H1500K447i6553B17608B5135a76922m8088C53897i4327b1279
12729g0211k23647B01764J36590a01823o2989j30013H8190C2141a38386j6825
$$ y = [-304210, 228224, -85847, 334311, 115080, -339847, 141928, -130247, -310188, 4630, -97361, 169664, 105280, -247699, -50829, -292252, 140867, 48162, -270509, 184854, -16559, -29640, 6480, -24316, -6205, 75076, 1461, 287380, 200575, 72753, -204106, 272691, 369922, 237593, 301127, 12267, 80455, -40520, 11297, -17427, 234495, 46316, -147107, -308667, -232503, -83637, 133702, 168597, 240822, -132913, 390860, -38317, -210325, 277754, -60707, 128877, -177481, 35949, 138563, 141734, -203323, 44371, -99797, -16787, 67155, 72428, -263471, 290853, -79178, 81500, 83947, -96553, 217608, 25135, -176922, -225010, 353897, -94327, -21279, -70211, -293858, 201764, 338354, -101823, -164812, -294825, 88190, 32141, -138386, -155211]
12719a55211E1867a34611B134L94517f0511r6584a1244B31991E426a5057j00664
12708a15721r7630a05619k66533f8747k4909l8566C3943a62418C0510J10777A8098
12696B53791f5335H5948g1731B47724K8410b477A49961K92006F0136L54836I3603
12684g4759B92587b9867j56881d7715A80598a43037Q012F2276B7196L40333E3379
12672b9837B82334a02770B98084i4992K2756C61028j43749K24046a22830j53826
12662b76656A10563J37844E6311K74342A32828d404C21505i1055j69892A09478
12651f5422B56279c66028A88940C0030L80105E9078K30795m006a52265I8535j0709
12640H7826J22272a759A61573N1032l0617C1292a0499j20015E0547g8422F313
$$ y = [-155211, 51867, -134611, 2134, 396651, -60511, -157095, -11244, 231991, 5426, -15057, -115721, -213351, -105619, -372152, -68747, -93656, -132222, 33943, -162418, 30510, 141287, 18098, 253791, -65335, 85948, -71731, 247724, 276134, -2477, 149961, 441967, 60136, 414972, 93603, -74759, 292587, -29867, -186748, -47715, 180598, -143037, -135025, 62276, 27196, 367529, 53379, -29837, 282334, -102770, 298084, -94992, -72236, 361028, 217279, 441325, -122830, -276656, 110563, 248407, 56311, 330653, 132828, -4404, 321505, -91055, -260947, 109478, -65422, 256279, -366028, 188940, 30030, 410135, 59078, 289873, 285867, -152265, 98535, 87826, 210098, -1759, 161573, 212605, 181988, 31292, -10499, -130514, 50547, -78422, 6313]
12628a87755B8002L97704A92778J65883j33248b88789a14922c1822A90858H0018
12617A43926c94577a00016M5813j56729J3479C00316J46918j34811e5837D00345
12606g1920A25180J48367f1481A79582g3502C74269O2304e1920b0350j20243f6327
12594b95531H9296A0191L41593F300h1836A0847K19578D7959b82429J15644A54651
12582G24011f3318C23468g2131o8388A90356e7514E2397M08719a74135i409j45708
12571a55117c7813p3549B16620m1152c93353b0441C54804b05177b1123F6108C210
12559f0784J8059A48543O3237I8720D7812a02523j15534K4348l9123h7926q5170
12548a73096i809l6061H087K89180d490G7258h5278A25847a13140C54413a13889
$$ y = [-187755, 28002, 425706, 192778, 358661, 225413, -288789, -114922, -31822, 190858, 80018, 143926, -394577, -100016, -54203, -210932, -197453, 300316, 447234, 312423, -55837, 400345, -71920, 125180, 273547, -61481, 179582, -73502, 374269, 436573, -51920, -20350, -140593, -66327, -295531, 89296, 10191, 351784, 6300, -81836, 10847, 230425, 47959, -282429, -166785, 154651, 724011, -63318, 323468, -72131, -140519, 190356, -57514, 52397, 461116, -174135, -9409, -155117, -37813, -111362, 216620, 175468, -393353, -20441, 354804, -205177, -21123, 66108, 3210, -60784, -42725, 148543, 211780, 98720, 47812, -102523, -218057, -193709, -232832, -87926, -173096, -9809, -45870, 8087, 297267, -4490, 77258, -85278, 125847, -113140, 354413, -113889]
12536C06860A38899n0930J86158m0566b11716d2188B64013I6029c2756O658A37735
12524b30E415N702a49729J6156g597A99651b803j75564c5886A44877k2567a35224
12511B76977j27023d9007B02484b5312j28240f0052C7019f5984c2188G1803c07206
12499A16K94652H0608c0986C42088a65416J2372b4783B41064B6729b50829D54480
12487a30559A32016A4943N0940E616K2771J05357D4800P3134g7056E321b7418
12475a64070j05793e0323B58654i400l68368a35624n8805A07288a80835B6132
12464G1897J16342d7023k92359b5159B83136B4513J98174c18690B95548a27455
12453F8841c08063A33696m5639i5639k27039I19N2995a4078l81211h2098k68910
$$ y = [306860, 138899, 87969, 274127, 233561, -211716, -42188, 264013, 96029, -32756, -26098, 137735, -230, 5415, 11117, -149729, -133573, -7597, 199651, -2803, -178367, -35886, 144877, 122310, -135224, 276977, 149954, -49007, 202484, -25312, -153552, -60052, 37019, -65984, -32188, 71803, -307206, 116, 294768, 80608, -30986, 342088, -165416, -153044, -24783, 241064, 26729, -250829, 454480, -130559, 132016, 14943, 65883, 5616, 28387, 133744, 44800, 117934, -77056, 5321, -27418, -164070, -269863, -50323, 258654, -9400, -377768, -135624, -194429, 107288, -180835, 26132, 71897, 188239, -47023, -339382, -25159, 283136, 24513, 222687, -318690, 295548, -127455, 68841, -308063, 133696, 88057, -95639, -322678, 919, 53914, -14078, -395289, -82098, -351008]
12442c51008I4486P858e0365r0737E6741B0621a10666I9322R4257j5509a45778
12430C56177a40963k44184a62636A8038h9353B83996a38661p179D51248A04347
12419d9492C30139D6562o770b0563l05227G7261a85657E2758K2046C2023K83841
12408C15864A03590i4101G2033k2685a90607H3823b36770D6458a0347I5814a6158
12396c9700q7347e9358p699A38095J5668h8619B61650l9324D5317K396a82445
12384i3007n7802N0479L0778n4892D93297a37795k5461A4770J02523a54668A62330
12372a06514H0646j3315R4384Q1523n5446J20343a6776E3146J43396C0266d3806
12360A77380a11279a5144A17408J60958E485O4508P570a16979a0431j1610G4208
$$ y = [-351008, 94486, 102344, -50365, -141102, 56741, 20621, -110666, 99322, 193579, 178070, -145778, 356177, -140963, -385147, -162636, 18038, -89353, 283996, -138661, -145840, 451248, 104347, -49492, 330139, 46562, 39792, -20563, -325790, 77261, -185657, 52758, 74804, 32023, 315864, 103590, -94101, 72033, 49348, -190607, 83823, -236770, 46458, -10347, 95814, -16158, -39700, -127047, -59358, -67057, 138095, 153763, -88619, 261650, 222326, 45317, 47713, -182445, -93007, -150809, -100330, -69552, -124444, 493297, -137795, -163256, 14770, 117293, -154668, 162330, -106514, 80646, 67331, 161715, 243238, 187792, 308135, -16776, 53146, 196542, 30266, -43806, 177380, -111279, -15144, 117408, 278366, 5485, 69993, 77563, -116979, -10431, -22041, 74208]
12348f8288C9593J94273j0417a8384k0471H6186A5623e4077j92863d2229k24360
12337b66589A52701m3799a33836J9094A54679e283j64527A8223P5090D0368a4808
12325A97051N3141n954n654b35194E5562f0602A72808A192O3473e8982A64691
12313B5913b36934E69200A32866c8971B2017K17416L2916d766o9856C42966c64413
12301A70099J05714j08433K34706A65464j8407J46779J26329h2756E57124B66102
12290a28929M0742A10452J78775a3811A44282G0093B7465h1424A09131j7898K09264
12279C00497C5981K27750J7093A5638a65324H7550B8472J12724C7400b34211B86858
12267A20138K7680g2894A80443a93667C80490q6847j46057n5820l3832L91332
$$ y = [-68288, 39593, 233866, 223449, -18384, -38855, 86186, 15623, -54077, -246940, -42229, -266589, 152701, 108902, -133836, -114742, 154679, -5283, -169810, 18223, 93313, 40368, -14808, 197051, 250192, 244238, 238584, -235194, 55562, -60602, 172808, 1192, 64665, -58982, 164691, 25913, -236934, 569200, 132866, -38971, 22017, 239433, 272349, -4766, -74622, 342966, -364413, 170099, 275813, 167380, 402086, 165464, 147057, 293836, 420165, -82756, 557124, 266102, -128929, -88187, 110452, 289227, -13811, 144282, 70093, 27465, -81424, 109131, 91233, 300497, 35981, 263731, 280824, 15638, -165324, 87550, 28472, 141196, 37400, -234211, 286858, 120138, 147818, -72894, 180443, -193667, 380490, 293643, 147586, 91766, 57934, 449266]
12257D49266k12969H2705N4918K00713a14798A36203K85693j17293I5046J14351
12247B09397a7589H4652d390C58418J13951j17963B2371O2797J98732c9951C72104
12235A90828l562a72C22960A3244N824L25414a71279H6141a43544A40729N3724
12224A94453E8218B7727Q2220C5844L1246L05210n5124h9505A18018J68819a55122
12212A17471J1171L2199o2869O5105M7190r4417j1651K57287p2095I384a44258
12200C47790P5525b24489A31816a6679n8407A7129b44409B99344b2381l33392
12190c55773A06543g3188A01833k8589K7371k8877N1956J79979g3793B66073h75
12178b7535E0167M1062K43514o6599K05531H1130e6646B81876a62171B25835B0465
$$ y = [449266, 236297, 82705, 137623, 338336, -114798, 136203, 421896, 304603, 95046, 209397, -17589, 84652, -4390, 358418, 472369, 354406, 22371, 85168, 283900, -39951, 372104, 190828, 187266, -172, 322960, 13244, 19068, 344482, -171279, 86141, -143544, 140729, 194453, 58218, 27727, 109947, 35844, 67090, 372300, 317176, -89505, 118018, 286837, -155122, 117471, 128642, 160841, 97972, 163077, 210267, 115850, 104199, 361486, 289391, 9384, -144258, 347790, 423315, -224489, 131816, -16679, -75086, 17129, -244409, 299344, -22381, -355773, 106543, -73188, 101833, 73244, 100615, 71738, 123694, 303673, -73793, 266073, -875, -27535, 50167, 91229, 334743, 268144, 473675, 81130, -56646, 281876, -162171, 225835, 20465]
12166a08697C20840A38068D0160R7718M46446B52620j20936J77277D6142g9370
12155f0391B27412L655p3335J51334j31916j937k8170J7752J70335J79152D6858
12143B85945a88456B90664h7404A40135O3234o7260a98081I393J25999b53057
12132f0886F0017a39060C57365A67043c1074A52256k1258b49251C00040i615B26934
12120b13982A62130f7843B48097A08276J52379m1943D0483K35539G1834a17118
12109A2022a01648B03108m693J565N4657a17966C84703a7406B66261F9489d0723
12097b0799B42134J12890K34837g2610l09819a58750B77932A16229J03210G9081
12086B5294L19438n8392A8224P7503o12C5771K56454A18985C6306K3787K38998
$$ y = [-108697, 320840, 138068, 40160, 137878, 584324, 252620, 131684, 308961, 46142, -79370, -60391, 227412, 231067, 157732, 309066, 177150, 175213, 147043, 164795, 335130, 514282, 46858, 285945, -188456, 290664, -87404, 140135, 203369, 136109, -198081, 9393, 135392, -253057, -60886, 60017, -139060, 357365, 167043, -31074, 152256, 130998, -249251, 300040, -9615, 226934, -213982, 162130, -67843, 248097, 108276, 260655, 218712, 40483, 276022, 71834, -117118, 12022, -101648, 203108, 198415, 199980, 254637, -117966, 384703, -17406, 266261, 69489, -40723, -20799, 242134, 355024, 589861, -72610, -382429, -158750, 277932, 116229, 219439, 79081, 25294, 344732, 286340, 18224, 95727, 95115, 35771, 292225, 118985, 36306, 60093, 299091]
12075B99091c0023j69684B50676L0069J71678A99304A5960L23572A39504L1829
12065A71333c05400A15201B7429h044B30117J66126H0667J55965G40M1229c0506
12053c959A86279J2117K09197I4381a27970j00130C78727D4343a67172A21458
12042G5710a43435a407j76492B25142A7670N8367b28217B05646F1271K24982A07976
12030I1203k1704J40876b78057A16554K8586a6749k52876L0508A53723c1498A99939
12018c05661C3152A5558J14169c3407C3973b8092j01819j13637O9696B13947b8420
12006C70992I9112b17746D5996c05106A18943L4606l2571c59537E8020N0125B3330
11994H5803J06695e0477B44832J22164m6356a6617j42901l4408J6206n0316P0846
$$ y = [299091, -30023, -199707, 250676, 280745, 452423, 199304, 15960, 339532, 139504, 171333, -305400, 115201, 27429, -8044, 230117, 396243, 80667, 236632, 740, 41969, -30506, -3959, 186279, 198396, 407593, 94381, -127970, -228100, 378727, 44343, -167172, 121458, 75710, -143435, -1407, -177899, 225142, 17670, 76037, -228217, 205646, 61271, 286253, 107976, 91203, 69499, 210375, -278057, 116554, 145140, -16749, -269625, -239117, 153723, -31498, 199939, -305661, 33152, 15558, 129727, -33407, 33973, -28092, -129911, -243548, -173852, 213947, -28420, 370992, 99112, -217746, 45996, -305106, 118943, 153549, 120978, -359537, 58020, 108145, 23330, 85803, 192498, -50477, 244832, 366996, 320640, -16617, -159518, -193926, -177720, -228036, -157190]
11983a57190H4223g6217c2649G8077L52237I5565J1632J2870d38310K16544g532
11971A19424J45227c49670a93A27604a44433N7507A84108b63207H142K13711a66750
11959a30011L4605A2807O8056C8293g1878g306l08714A3060J68485C2673d8133
11947B85440e6645L23A30972m3308c02075A36639a2512k60214B13556C1519i0767
11935b6349q654j8786o12754b36515I7581a89730k00977A03365K88242A72695
11924G8218a24428I1095i8391c8080C37422b997k25453L0586C6309K6873a28855
11912b2584I6019b38842B2297a33816j58503p4050C53052a68755e0012a1318k40389
11901b51707J10037H0806a27069l618I6805a35840N081G2438K1756C0670J08024
$$ y = [-157190, 84223, -76217, -32649, 78077, 430314, 95565, 107197, 120067, -438310, -221766, -7532, 119424, 264651, -349670, -193, 127604, -144433, -86926, 184108, -263207, 8142, 221853, -166750, -130011, -95406, 12807, 80863, 38293, -71878, -7306, -316020, 13060, 181545, 32673, -48133, 285440, -56645, -56322, 130972, 87664, -302075, 136639, -12512, -272726, 213556, 31519, -90767, -26349, -35003, -53789, -666543, -236515, 97581, -189730, -390707, 103365, 391607, 172695, 78218, -124428, 91095, -98391, -38080, 337422, -2997, -228450, -197864, 36309, 63182, -128855, -22584, 96019, -238842, 22297, -133816, -292319, -366369, 353052, -168755, -50012, -11318, -251707, -141670, 80806, -127069, -130687, 96805, -135840, -130759, 72438, 94194, 30670, 138694]
11890A38694a1427l20564B35116C4663d4898o9351e2703C81749F8330i7535B17040
11878b67603H9927b10082A68118b4331k66884A12249l6103a13884j63801A65396
11867B35838b34667c6176l11178a27736p1152M5278b4821A90450a84711B5432
11856b40993b9173p4031a6802q4760k016H2675d5316J5681k78687J13575H4666
11844d1150q605E2858a93424Q3671H5572d43206a68947b3139O939j90976j90132
11833c97308E7333P5458K29219H0159a56715C69080c25842f2723A14802a64006
11822G4812A5443k059a08565H367Q0434C9067J42701b09320A11797e9178j79422
11811b38600g5421M750A9681K57765l1605i7201o3377f6582A96622j5045q0034
$$ y = [138694, -11427, -331991, 235116, 34663, -44898, -114249, -52703, 381749, 68330, -97535, 217040, -267603, 89927, -210082, 168118, -24331, -291215, 112249, 76146, -113884, -277685, 165396, 235838, -234667, -36176, -347354, -127736, -198888, -153610, -24821, 190450, -184711, 25432, -240993, -29173, -103204, -16802, -101562, -103578, 82675, -45316, -29635, -308322, -194747, 84666, -41150, -49755, 52858, -193424, -109753, 85572, -443206, -168947, -23139, -16200, -207176, -397308, 57333, 132791, 362010, 80159, -156715, 369080, -325842, -62723, 114802, -164006, 74812, 15443, 13384, -108565, 8367, 88801, 39067, 181768, -209320, 111797, -59178, -238600, -75421, -70671, 19681, 277446, 245841, -97201, -160578, -66582, 196622, 181577, 101543]
11800A01543a79773P1312l06245h1369A71408b35170e5950j66622P8910B1251
11789d7691l01769i2085C9046K3635O5457e3351A47978a92137N5449j07943a1292
11777e1327B21867L6156A04595B8435b13962A14754J08452a52941G2204J53861
11767B26065K2810m8508J4538a24786o4610C04136d0433l6832o7322j17349N742
11756b56194m6105C38001a08589E2463K76249q040D3977B0117N5983c19308C210
11744C3179h2505b5604C39431e9534A7496J84709a32663k69673A65385G4565l3375
11733D1190R9974m8494a99116P4013j01868l4894J14685a064r9368R769A10178
11721i5462l06264b91B16219n1759g6574d014G3742c4932h121H5693J36460B4700
$$ y = [101543, -179773, -108461, -414706, -81369, 171408, -235170, -55950, -222572, -143662, 21251, -47691, -349460, -92085, 39046, 62681, 128138, -53351, 147978, -192137, -136688, -244631, -11292, -51327, 221867, 258023, 104595, 28435, -213962, 114754, 223206, -152941, 72204, 226065, 248875, 200367, 214905, -124786, -189396, 304136, -40433, -77265, -144587, -261936, -256194, -302299, 338001, -108589, 52463, 328712, 320672, 43977, 20117, 76100, -319308, 3210, 33179, -82505, -25604, 339431, -59534, 17496, 202205, -132663, -402336, 165385, 74565, 41190, 141164, 92670, -199116, -125103, -226971, -261865, -147180, -1064, -100432, -90663, 110178, -95462, -401726, -291, 216219, 164460, -76574, -4014, 73742, -34932, -8121, 85693, 222153, 24700]
11708a33375d1936A67440a06125B74497q8389d0221E7941a21645a1639A6876a18607
11696b32316C37355G9752a1884B27598B9545a44601E187J75451i2365d3660p4505
11685a18165o5315B15938a60951d0845C86403A83306e2924A13479j3529C1505
11674A19058b22202B26038e9641B1200a54871E9571d8481A82694D2872h2675G6824
11662D42739j08788J54557B16392P6648C2308N0427K25117j26429o8916k0613
11652I1894D958d2029A2286J0550a2358L519k724n7390B82552q5431J535a11152
11639b07145B43798A4716a09888b2752A79969A184J0516J23798a41070B89639
11628g4869c7041B87707L9837i8733R23B62369A8571O0665b2626B0452c76215
$$ y = [-133375, -41936, 167440, -106125, 274497, 186108, -40221, 57941, -121645, -11639, 16876, -118607, -232316, 337355, 79752, -11884, 227598, 29545, -144601, 5187, 180638, -92365, -43660, -118165, -183480, 215938, -160951, -40845, 386403, 183306, -52924, 113479, 99950, 31505, 119058, -222202, 226038, -59641, 21200, -154871, 59571, -48481, 182694, 42872, -82675, 76824, 442739, 333951, 488508, 216392, 293040, 32308, 82735, 307852, 181423, 112507, 91894, 4958, -42029, 12286, 22836, -12358, -8839, -11563, -68953, 282552, 197121, 198656, -111152, -207145, 243798, 14716, -109888, -22752, 179969, 1184, 11700, 135498, -141070, 289639, -74869, -37041, 287707, 327544, -98733, -97810, 262369, 18571, 79236, -22626, 20452, -376215]
11616a59239f2502m4024k3040I9216b47568D6109J76204j04048a35902K8474j2351
11605a19779B04605f3385G1293a51053h351A58211e9577r2020l2915F8472b39509
11593H3611B9246a79394N7714b6652j20816B57923j06834D4725P0368e5845A83219
11581a83768J718h1234C54131j17034A17524b43785A61730O6281A6389a08035
11570d0295j35084k1229D2403K57269A21872P3738e805k8364A52750a2680D1663
11558C86567A14830R6390G2213L4597Q1213a71855A16752m6533L8255C2554a12691
11546i888A90098a77212J7848A14661b3078C06345j00057j6978a07316l38200
11536d45516C33093k6064G0050C0739a81108H4478O3489F1156J00333M4486a86934
$$ y = [-159239, -62502, -106526, -129566, 99216, -247568, 46109, 222313, 118265, -135902, -107428, -119779, 204605, -63385, 71293, -151053, -8351, 158211, -59577, -151597, -184512, 68472, -239509, 83611, 29246, -179394, -121680, -26652, -147468, 257923, 151089, 44725, 115093, -55845, 183219, -183768, -182050, -81234, 354131, 237097, 117524, -243785, 161730, 228011, 16389, -108035, -40295, -175379, -196608, 42403, 299672, 121872, 195610, -5805, -34169, 152750, -12680, 41663, 386567, 114830, 211220, 72213, 106810, 188023, -171855, 116752, 70219, 108474, 32554, -112691, -9888, 190098, -177212, -159364, 114661, -23078, 306345, 206288, 189310, -107316, -445516, 333093, 307029, 70050, 30739, -181108, 84478, 147967, 61156, 161489, 205975, -186934]
11524i0264C9665b05460B00181a46633E8626c759H1762k0199J6510J1281p570
11513H1784b51672J21402q493K8113A10754A2983b8077j28871j9839F22402B31785
11501a33969e8357B53621a33386C13270g109C2810K1755K08902h9A63485K48861
11490D12346I3976E741e6622k58951E48994B3595b06164K1402G3220l2152a61281
11478A1629k376L30595b00382A5244J51508G8131a74328h725j41051C2775K13693
11467B46468E9990P4710P5157k3108c07951B6788N5353O239K02901A23717D599
11455a16667j30935D26556I0922D0085c8122B00292l463p8205a80022E8756C565
11443A3869h865B06933k12a48420J0554I4070K34825R0726G5856P725J39260b39556
$$ y = [-90264, 39665, -205460, 200181, -146633, 58626, -3759, 81762, 61563, 78073, 89354, 81784, -251672, -130270, -138763, -110650, 110754, 12983, -28077, -156948, -176787, 622402, 231785, -133969, -58357, 253621, -133386, 313270, -7109, 32810, 54565, 263467, -89, 163485, 412346, 93976, 5741, -56622, -315573, 548994, 23595, -206164, -184762, 73220, 41068, -161281, 11629, 9253, 339848, -200382, 15244, 166752, 78131, -174328, -8725, -149776, 32775, 246468, 59990, 134700, 209857, 186749, -307951, 26788, 82141, 88380, 291281, 123717, 4599, -116667, -247602, 426556, 90922, 40085, -38122, 200292, 196829, 118624, -180022, 58756, 3565, 13869, -8865, 206933, 206721, -148420, -137866, 94070, 328895, 419621, 75856, 83581, 222841, -239556]
11430h6719B6610j2015K87321I5376a038k08477D0376Q848b24299H8477c03958
11418E4068i0206K8456k9683p3541O9158l5453H673a25694M6568k4856j25279
11407b29261R9731B5705c1512o0895j88893i4234j2030q3480R69C44801a57144
11395g4182j05573F5432J59811j0560B3599c1493A19234H533g6005L7883g978
11383I2643I29K7031N2218K45144c73981B27952a47369C2072K24407D8698b44474
11371A90276P8129q4584e657k59142A94814a53285B23299b5843j85057A45667
11360a12470o9384D1907M8154K71717A59899a0597B37273m4608b10447B24243
11349c88006f3224j57884A16411d89054a21959A05181c21118J34276I3712M4901
$$ y = [-86719, 26610, 14595, 301916, 95376, -1038, -209515, 40376, 49224, -224299, 88477, -303958, 54068, -90206, -61750, -91433, -164974, -95816, -131269, 8673, -125694, -79126, -103982, -229261, -129530, 25705, -31512, -92407, -281300, -94234, -106264, -189744, -188775, 344801, -157144, -74182, -179755, 65432, 225243, 214683, 23599, -31493, 119234, 8533, -76005, -38122, -7978, 92643, 929, 27960, 80178, 325322, -373981, 227952, -147369, 32072, 256479, 48698, -244474, 190276, 268405, 183821, -5657, -264799, 194814, -153285, 223299, -25843, -210900, 145667, -112470, -181854, 41907, 90061, 361778, 159899, -10597, 237273, 192665, -210447, 224243, -388006, -63224, -221108, 116411, -489054, -121959, 105181, -321118, -186842, 93712, 138613]
11339A38613a25190N5072r3594B4388M0286b21068C8391f7319B05951r2035c37321
11327b0824I3549c03800D8999i4538m3890d986l391H4878K1188g5821j04606A34778
11314A78093K83214i5425B39870q6018d4884j2047r7234B3857K87086h3472A76469
11302F2820a2290k28625e6010K6761k67508R2224J4480A09996c1695l22859A38970
11290F2340A1237J423b96699L1694a18468r1537O9930B88327A07477a15773m5661
11279a61434E2292a29357a3221j03107c1569A35068E6372L2136a08791A56149
11268A64767b56769D0651c2217n59402A97678B316a68789f1704p5830e1419l19253
11257c70672A31075J18680f316j36854e5587j26464C72574b76576Q5998b9942
$$ y = [138613, -125190, -70118, -163712, 24388, 64674, -221068, 38391, -67319, 205951, 113916, -337321, -20824, 93549, -303800, 48999, -94538, -138428, -4986, -8377, 84878, 106066, -75821, -180427, 134778, 178093, 461307, -95425, 239870, 153852, -44884, -56931, -154165, 23857, 310943, -83472, 176469, 62820, -12290, -240915, -56010, -29249, -296757, -204533, -190053, 109996, -31695, -354554, 138970, 62340, 11237, 12660, -296699, -265005, -118468, -210005, -140075, 288327, 107477, -115773, -161434, 52292, -129357, -13221, -116328, -31569, 135068, 56372, 88508, -108791, 156149, 164767, -256769, 40651, -32217, -591619, 197678, 2316, -168789, -61704, -137534, -51419, -370672, 131075, 249755, -6316, -143170, -55587, -182051, 372574, -276576, -190578, -29942]
11246d34208K00946e8476o2564l61870B15870Q7188j28619a30223C24201b19669
11235B74235b72563B26661b00940E7037K22068a2467j03620A86019J28833a07241
11224B15254I611J60176G9144J3005D4142a14579L9268I0421a53402Q415a641
11212d6463M031r7645k4426d9771b66B06837E2914g3700G1841J37959h9318k45781
11200c35099J61585I2282a27310B5728J89480c8888k92695H8322c01227J32313
11190a68914A62644j2856b85002A85367q9683e7019q0572n4837q4645A21202a33428
11178d23981A36149g8023b8575k28171d4742l70850A83941q1106i044j33675k30890
11167c73609O7332A75903c90868a39069L8692C1505Q0282a26789E7300c4156j6582
$$ y = [-434208, -233262, -58476, -121040, -482910, 215870, 303058, 174439, -130223, 324201, -219669, 274235, -272563, 226661, -200940, 57037, 279105, -12467, -116087, 186019, 314852, -107241, 215254, 9611, 169787, 79144, 92149, 44142, -114579, -75311, 90421, -153402, -144987, -1641, -46463, -42432, -140077, -164503, -49771, -266, 206837, 52914, -73700, 71841, 209800, -89318, -335099, -173514, 92282, -127310, 25728, 215208, -38888, -331583, 88322, -301227, -168914, 162644, 149788, -285002, 185367, 95684, -57019, -137591, -192428, -277073, 121202, -133428, -423981, 136149, -78023, -28575, -256746, -44742, -415592, 183941, 102835, -9044, -142719, -373609, -306277, 175903, -390868, -139069, -100377, 31505, 111787, -126789, 57300, -34156, -50738]
11156e0738A63733a69571j59010j07457i1073j40439A20537a54365A68528C5892
11145H8688b61057j6935a012r0162m6975j81746J47882P5074k43899e3094f762
11133a02062E6754K6798K9700f9333j01601f6064K1688B6073a62609k1336J0001
11122a73944L1340A28867C3687g7493m4671e5098F4747l0084C902M651a71183
11110A87342a36301O3364D1021J33579b3018o2488l8555b4329A6577K08749p7537
11099A47789m5187Q982M4056J01680a55834L530B1282g6073B3983K59999A25264
11087F2755L6413j8649h3862E3588a28617I6343D1623j1890J20360B7995L75365
11076D03360G6989J43509o6058p2872L96164B2625k87M96361E5932K10106b8391
$$ y = [-50738, 163733, -169571, -328581, -436038, -91073, -231512, 120537, -154365, 168528, 35892, 88688, -261057, -277992, -1012, -91174, -138149, -319895, -172013, -96939, -340838, -53094, -6762, -102062, 56754, 83552, 113252, -69333, -170934, -66064, -44376, 26073, -162609, -183945, -173944, -142604, 128867, 33687, -77493, -122164, -55098, 64747, 34663, 3902, 8553, -171183, 187342, -136301, -72937, 41021, 174600, -23018, -85506, -124061, -24329, 16577, 225326, 147789, 102602, 111584, 155640, 257320, -155834, -152304, 21282, -76073, 23983, 283982, 125264, 62755, 99168, 80519, -83862, 53588, -128617, 96343, 41623, 29733, 150093, 27995, 403360, 76989, 220498, 154440, 81568, 477732, 22625, 22338, 518699, 55932, 266038, -28391]
11064A29594R6856q3361J15258n0836R5603k9773H7308P7378b3927D05654A28108
11052B59114j16323J9233L31611B37287l1637J82956P7959A7511L23027B0918
11041C52307j01256M51599k76837j05690J56943M3917K4900O1024l4859M4710
11031F16758j16732q6982J42329r081m3091j7554J56530j4447K4940j5998L08202
11020I44874k29530j36432k52478N51034C97952P5955J62103B67518K1193N4037
11010C42748J05172O4294J00877J30210J65644k73418k52284K20670k20429O3787
11000D47271m3435J12321A16890L03509K43535n1962m1638M359o2679R7629j92603
10989D17040M95909A65731L31849O1546O5140j12559o4880p9882J99346k38094
$$ y = [129594, 226450, 143089, 258347, 207511, 303114, 273341, 87308, 164686, -23927, 405654, 128108, 259114, 142791, 162024, 493635, 237287, 205650, 388606, 466565, 17511, 340538, 20918, 352307, 251051, 702650, 425813, 320123, 477066, 520983, 545883, 606907, 572048, 616758, 500026, 413044, 555373, 546292, 503201, 485647, 642177, 627730, 652670, 636672, 944874, 715344, 578912, 326434, 877468, 397952, 473907, 636010, 267518, 288711, 342748, 447920, 512214, 613091, 743301, 908945, 635527, 383243, 603913, 383484, 447271, 403836, 516157, 116890, 420399, 663934, 611972, 570334, 574693, 512014, 609643, 417040, 912949, 165731, 497580, 559126, 624266, 511707, 446827, 366945, 566291, 328197]
10979C28197J67584j09336L02988j81180r1393j49347L34924K44065k94072j40692
10969D11738J58449J16442j5491L0637j16970L28059j19544J20305n5195L26574
10959A185004K4124K52095l31684K94331J93887M66804j73924K652j79322J23939
10949A857906j80481J04544k69734Q8828J62601k35142j40787M792M95855l71134
10939A517248j08471Q9244K23787l60888K4108J96661m00337o5756m30686J50672
10929H35582j75038j07970n5557k25273j00972J05259l5388M9453F1888k0345
10919D1543K67918j0951l5907a98635K1818A77903q4846b30412A7079c1005l8762
10908f9767B92249A4604L16321A29431k725b8720k72383J00638C34915a37585
$$ y = [328197, 495781, 386445, 689433, 508253, 416860, 267513, 602437, 846502, 552430, 411738, 570187, 686629, 671138, 701775, 584805, 912864, 793320, 913625, 858430, 1185004, 1209128, 1461223, 1129539, 1423870, 1617757, 2084561, 1910637, 1913289, 1733967, 1857906, 1677425, 1781969, 1512235, 1601063, 1763664, 1528522, 1387735, 1392527, 1888382, 1517248, 1408777, 1498021, 1721808, 1360920, 1385028, 1581689, 1181352, 1115596, 684910, 835582, 660544, 552574, 497017, 271744, 170772, 276031, 240643, 290096, 61888, 41543, 309461, 298510, 262603, -198635, -176817, 177903, 93057, -230412, 17079, -31005, -69767, 292249, 14604, 330925, 129431, 126706, -28720, -301103, -200465, 334915, -137585]
10897A81943n5456A7188h1542r1495E5599e7567A64634J34068m2664d9296A12615
10885a20257L443M0846m81229a14142B35309e1884j23911A19423P7268H0048e4655
10873f4384D2950J13634R1746a14017B2106b07183A44858e5552k36457A25812
10862a13044j49327G9607C3739e3109n6344B3686K10580a53462F3603N6471g6942
10850a90934j99884A53438a04850A8232R2225a18430A59302a73369D0995J88719
10840B29714a23441A91929I5412J50422M690b2750j31578k06445C42031h2486
10829a07892l0939B79121j27356c06288h7172j20916k49575B70801b02846F0917
10818b49775A0906b78402B86710G1664h3463A66806a90130B01427r5187Q4620
$$ y = [181943, 126487, 17188, -81542, -173037, 55599, -57567, 164634, 298702, 256038, -49296, 112615, -120257, -116814, -75968, -557197, -114142, 235309, -51884, -175795, 119423, 196691, 80048, -54655, -64384, 42950, 156584, 248330, -114017, 22106, -207183, 144858, -55552, -292009, 125812, -113044, -262371, 79607, 33739, -53109, -109453, 23686, 234266, -153462, 63603, 120074, -76942, -190934, -390818, 153438, -104850, 18232, 110457, -118430, 159302, -173369, 40995, 229714, -123441, 191929, 95412, 245834, 250524, -22750, -154328, -360773, 342031, -82486, -107892, -138831, 279121, 151765, -306288, -87172, -208088, -457663, 270801, -202846, 60917, -249775, 10906, -278402, 286710, 71664, -83463, 166806, -190130, 201427, 106240, 190860]
10808A90860p0580J12980c51341Q254I4457a43939k02631D4343A175a77825A37095
10796B65459g4359m3861A33945J8010F9980K4315j2052b70333A43042L6969L6955
10785B16966q1464c6768A62878A9486a65990A19254b56113C0900J48040a78158
10774c78501A04176h3373j47292R4822O6502j52118g4135b5049A01352a76813
10763e0148a6497r7411d4667k9852C9743J96692b63078j7400a27990A39421d76506
10751a87759D6428a50551j84297A9243b29046K8567e3827B7302M4396M3889a55935
10739i4502m9023k98762a38033H0222b69821N979I4359M3658b35563J14814E798
10727A69876a34839B06457c8204j88381A17754a09358r4594H7755a36328B32505
$$ y = [190860, 120280, 233260, -351341, -343087, 94457, -143939, -346570, 44343, 1175, -177825, 137095, 265459, -74359, -118220, 133945, 151955, 69980, 94295, 82243, -270333, 143042, 180011, 216966, 135502, -36768, 162878, 19486, -165990, 119254, -256113, 30900, 178940, -178158, -378501, 104176, -83373, -230665, -135843, -69341, -221459, -74135, -25049, 101352, -176813, -50148, -16497, -113908, -44667, -74519, 39743, 236435, -263078, -280478, -127990, 139421, -476506, -187759, 46428, -150551, -334848, 19243, -229046, -200479, -53827, 27302, 71698, 115587, -155935, -94502, -143525, -442287, -138033, 80222, -269821, -263842, 94359, 138017, -235563, -120749, 5798, 169876, -134839, 206457, -38204, -226585, 117754, -109358, -203952, 87755, -136328, 232505]
10716B09102i8690M0954B16757E4132K5527e5719j46921A76391D6093h6624l3065
10705a19689A52733a62215J9152B61668n1983b60728f1952C39952A35029F7056
10694b9961A42470c6160j00877A16192J39617a9758n7044a5079B1052b9525l59038
10683c88563F6634l0647a07175J1783A00932a52915a0694j32957b0755B2738i7013
10671g4210j84604A46396b59148B76896p5055b55956J3387i5867j361A42405d51
10659h2064j21111d6258K522q4078K1131D5270a05049I460b11386D23378A27240
10647c34588P9749j8500O1266F0443J4311a90238m1169E7941B3157e0773j12947
10636a63720f0802k44433A62803a1311A6530K12068i0139j99860G9180J40420
$$ y = [209102, -98690, -57736, 216757, 54132, 79659, -55719, -202640, 176391, 46093, -86624, -119689, 152733, -162215, -143063, 261668, 209685, -260728, -61952, 339952, 135029, 67056, -29961, 142470, -36160, -137037, 116192, 255809, -19758, -76802, -15079, 21052, -29525, -388563, 66634, 35987, -107175, -95392, 100932, -152915, -10694, -143651, -20755, 22738, -97013, -74210, -258814, 146396, -259148, 276896, 201841, -255956, -242569, -95867, -97228, 142405, -451, -82064, -203175, -46258, -43736, -127814, -106683, 45270, -105049, 9460, -211386, 423378, 127240, -334588, -254839, -273339, -212073, 60443, 74754, -190238, -231407, 57941, 23157, -50773, -163720, -60802, -305235, 162803, -11311, 16530, 228598, -90139, -289999, 79180, 219600]
10626B19600a91392f9246N275C1759P271N4589a27007C65704a18156B55886a06396
10614f3502C2360b0561J400A22131a1846q0435A65423i5164B95031a55915j33851
10603b89766R5502h3384j84262R8496A60476L7698b86503K40B61929a97067h4048
10591b49959k37296A86063G7007d6404j3681j06050a1650l0386j78379h6271F1454
10579A90249b57396E0772b63513K0707g2648p4713A2227L9978a39126A94891F4138
10567a22574b2040j34944B97926r4152G6105a8652j9037A7148P9949d3936o7230
10556a11166B34256D340e2346D0122K0299a59731M3385g615I4691i9986j41494
10545b41480A91304N6735J37644g2764C9733c63854a34233L0578j20625a959k03903
$$ y = [219600, -191392, -69246, -63971, 31759, 39030, 93619, -127007, 365704, -118156, 255886, -106396, -63502, 32360, -20561, -19161, 122131, -11846, -92281, 165423, -95164, 295031, -155915, -289766, -194264, -83384, -267646, -169150, 160476, 198174, -286503, -286263, 261929, -197067, -84048, -249959, -487255, 186063, 77007, -46404, -60085, -166135, -11650, -42036, -220415, -86271, 61454, 190249, -257396, 50772, -263513, -242806, -72648, -147361, 12227, 52205, -139126, 194891, 64138, -122574, -22040, -156984, 297926, 203774, 76105, -18652, -37689, 17148, 97097, -43936, -111166, 234256, 4340, -52346, 40122, 60421, -159731, -116346, -7615, 94691, -99986, -241480, 191304, 248039, 385683, -72764, 39733, -363854, -134233, -103655, -224280, -1959, -205862]
10534b05862f620m74588a9030l8201j4331q1127j70113b3963j01616G1946J62739
10523B34685h3021l00617b4577m7698j81371a1842A9225J38601j4152a52031A29666
10511A63339b58601m4778A13205a04364a9236j90766A81039I518M2800i5163B24305
10499e2093A0348g6157K7656J4965l11679J57532m3675C87675A65084b48783h2059
10487C0471l135a107A28921c4287k86512A03610a59959A9065b09245I6366J19749
10476B16115n1359a22585p2129P7081N4748o8470L4387E2270G256J56686b01374
10464d26316E01294c1952C63663j72613E2772L12865o4708l14m5961l1758E7066
10452H6695R8032e8159j19305A67661a16442I1966A164i2315m5391F2355g7018
$$ y = [-205862, -6620, -481208, -19030, -57231, -71562, -152689, -322802, -23963, -125579, 71946, 234685, -83021, -383638, -24577, -72275, -253646, -11842, 19225, 157826, 143674, -152031, 129666, 163339, -258601, -303379, 113205, -104364, -19236, -210002, 181039, 9518, 52318, -95163, 224305, -52093, 10348, -76157, -48501, -33536, -345215, -187683, -231358, 387675, 165084, -248783, -82059, 30471, 27336, -1107, 128921, -34287, -320799, 103610, -159959, 19065, -209245, 96366, 216115, 164756, -122585, -194714, -117633, -62885, -131355, -96968, 52270, 7256, 163942, -201374, -426316, 501294, -31952, 363663, 191050, 52772, 365637, 300929, 300615, 254654, 222896, 57066, 86695, 184727, -58159, -177464, 167661, -116442, 91966, 1164, -92315, -137706, 62355, -77018]
10440A3307a39917J085j62607M4666g2723H277M5411h0766j25658P3289K2653
10429a10482C07502b00248L4269n956c8379A20768B8747b26704M2252L1884N829
10418a46739b0700A50250L10190j21278c57221A46700c36653A78168a24966H2845
10407h0669E0735c2025B0493e0927m2149B06345b7236J0546G6716f5280l6209
10396a01489B76464a26079R100B08161r8754a07438k10347A69603a97791m7017
10386b44808A89325b54660a15524k26641J39503A5284J14337i1557j60069A20907
10375a8013G9217k9557b25542A10503d9603C29975A24498F399J04028g849j26984
10364a34833A48986c16838C56263F809O0600C3600M6865Q5369d2194B15148m7976
$$ y = [13307, -139917, -138832, -301439, -256773, -72723, 8277, 53688, -80766, -206424, -133135, -110482, 307502, -200248, -165979, -171935, -38379, 120768, 28747, -226704, -184452, -152568, -146739, -20700, 150250, 460440, 339162, -357221, 146700, -336653, 178168, -124966, 82845, -80669, 50735, -32025, 20493, -50927, -93076, 206345, -27236, -16690, 76716, -65280, -101489, 276464, -126079, -116979, 208161, 109407, -107438, -317785, 169603, -197791, -244808, 189325, -254660, -115524, -342165, -202662, 15284, 129621, -91557, -251626, 120907, -18013, 79217, 49660, -225542, 110503, -49603, 329975, 124498, 6399, 110427, -7849, -134833, 148986, -316838, 356263, 6809, 67409, 33600, 80465, 165834, -42194, 215148, 167172]
10353A67172N4440J34596a15109G27977F8161M41052K69228A35914D7427L425
10343E0852j4982N17144q4311j44402J45473B04272I5085k7804L4582N12270l3672
10332E80461N6597B93531c4222A12290L5981N2973m2746J16448j4728J7098A4776
10320B41191M7530a0637A41460Q1474O3552l0869a9934k18462f2761C2410K02769
10309B35179B3633J40924J20189m843d09362D2074J01488o4942k5438Q1357O3773
10298A98312A5130L4820h9696C22147C9320P6353b02699e8647o9804A59272J62146
10287C21418e43800a09739N1933k23713A79418F5798a91540n5626h7418H4301
10276A00175a40343A5086c20756A12015a52780A16373N8371D830a10724k6772
$$ y = [167172, 221612, 356208, -115109, 727977, 68161, 509213, 778441, 135914, 47427, 50852, 35870, 553014, 468703, 324301, 469774, 204272, 95085, 67281, 101863, 614133, 580461, 637058, 293531, -34222, 112290, 148271, 201244, 158498, 274946, 260218, 277316, 14776, 241191, 288721, -10637, 141460, 222934, 286486, 255617, -19934, -238396, -62761, 32410, 235179, 23633, 164557, 284746, 279903, -409362, 42074, 143562, 78620, 53182, 134539, 198312, 15130, 49950, -89696, 322147, 39320, 115673, -202699, -58647, -128451, 159272, 321418, -543800, -109739, -57806, -281519, 179418, 65798, -191540, -247166, -87418, 84301, 100175, -140343, 15086, -320756, 112015, -152780, 116373, 174744, 4830, -110724, -137496]
10266a37496m845d4716A64294b9293o5636A81318a22109b659j48592L9622B9128
10254b21945g3914A26448C0977b63059B21158K1194B6453c53392b0068r5765C37609
10242A77971i0746D8405a24889A25762a46411B63810f4651B63962a02196B42198
10231A9029a10670b4619B49053F5334c16261D0180b29493i5726j53755P4613B59861
10219G2729j1394h8131j44411j1865I194g9220l03450J25397O9908c7545j16428
10208a53973p4343b8257m05815f1126F457b79858A62887h8219j14608C61965B3865
10196A74357g6145A53428a40403A2304Q3001c72299b3187j74283b4200o9690p8550
10185a72440A88906b31669f0264C2153a29713F6945H673M3696i2362d3296m40959
$$ y = [-137496, -142341, -44716, 164294, -29293, -94929, 181318, -122109, -2659, -151251, -111629, 29128, -221945, -73914, 126448, 30977, -263059, 221158, 242352, 26453, -353392, -20068, -115833, 337609, 177971, -90746, 48405, -124889, 125762, -146411, 263810, -64651, 263962, -102196, 242198, 19029, -110670, -24619, 249053, 65334, -316261, 40180, -229493, -95726, -249481, -174868, 259861, 72729, 61335, -88131, -232542, -244407, 9194, -79220, -382670, -257273, -187365, -37545, -153973, -228316, -28257, -434072, -61126, 6457, -279858, 162887, -88219, -202827, 361965, 23865, 174357, -76145, 153428, -140403, 12304, 95305, -372299, -23187, -197470, -24200, -93890, -172440, 188906, -231669, -60264, 32153, -129713, 66945, 8673, 52369, -92362, -43296, -484255]
10174d84255D353i9628l8667B2422a3626j1938j82931B7201c93940g4592B98019
10162E0731J18114b06190j4792A7965h4763o2123J8012r4798B6815L2104L1236
10151I0155c31800E4608b24933e4401k36983g7378B50362b66387f909l92770A74530
10139e8535j52803a9291j60696Q9518D67525b28736H2923e1486a736r1192c0148
10127b4735D9880J11406Q1841b53329B33775C9929J04117a49329M6446j10493
10117b13376B3956N4349a00480B04743o0575b69327J17363N7539m69430a9246
10106A35353C0312a43103E532a29969K6137j37193A54114G0992b97684B32064
10095E9299a73015L1520j7328N0027b763k10261g3972c6179j49157o5757k8423
$$ y = [-484255, 4353, -99628, -138295, 22422, -13626, -25564, -208495, 27201, -393940, -74592, 298019, 50731, 168845, -206190, -220982, 17965, -84763, -146886, -128874, -223672, 26815, 58919, 90155, -331800, 54608, -224933, -54401, -291384, -77378, 250362, -266387, -6909, -399679, 174530, -58535, -211338, -19291, -179987, -90469, 467525, -228736, 82923, -51486, -1736, -92928, -30148, -24735, 49880, 161286, 243127, -253329, 233775, 39929, 144046, -149329, -102883, -213376, 23956, 78305, -100480, 204743, 144168, -269327, -151964, -94425, -563855, -19246, 135353, 30312, -143103, 5532, -129969, -103832, -241025, 154114, 70992, -297684, 232064, 59299, -173015, -141495, -158823, -108796, -2763, -213024, -73972, -36179, -185336, -251093, -279516]
10084b79516J31465M7561r3194B24650J64622H5626b0246j88993f4629K2487q7015
10073a29157N8235L1321A79209h9402l4064N5113C1314N1388a19337a1074o4576
10062g5650d983j38708r8595B5225c16271C60757a03495j379J2531C8603c46450
10050i1879A49066l3116O1009a22276B5543b08535A33986j1897D182a46227F7630
10038G1188a8403A50566b26754a08548o3199L3882B42702E0004e3019K2333q2302
10027a12988m8794A49222a84362A68967c81796J83628R5429H8849b97833f6578
10016A04156m901e4398p724j64925d0931Q415k54443J22932E9037L96594a55200
10004d2347k15662J11908o7488j95913B01671a82924P1549j15618P5943A49511
$$ y = [-279516, -148051, -100490, -193684, 224650, 389272, 85626, -20246, -209239, -64629, -42142, -129157, -70922, -39601, 179209, -89402, -123466, -68353, 31314, 82702, -119337, -11074, -75650, -4983, -143691, -242286, 25225, -316271, 360757, -103495, -104874, -92343, 38603, -346450, -91879, 149066, 115950, 176959, -122276, 25543, -208535, 133986, 122089, 4182, -146227, 67630, 71188, -18403, 150566, -226754, -108548, -171747, -137865, 242702, 50004, -53019, -30686, -112988, -161782, 149222, -184362, 168967, -381796, -198168, -102739, 88849, -297833, -66578, 104156, 99255, -54398, -62122, -227047, -40931, -32516, -286959, -164027, 59037, 455631, -155200, -42347, -258009, -146101, -213589, -409502, 201671, -182924, -111375, -226993, -151050, 149511]
9993h4505C0923a46233p1778j71059P1992H6255a22436I6459a27534I0140k0577
9982F9563b25823C26436e6603h324D563P0616e1141C24456a11689C3086r349a27022
9969d16808g3232A41485a16299o1805r1135c8912k8507f30j19558L9138n81A50959
9956G533c1712j16579f422j69903j30276J27815p2410m6366B16551D7752d75387
9944b6033l8624A87682b97700A7872o570R0541i3293I7612l6239b13083B12322
9932a09725j90438R8983h8691E5357b22218K3783A73154p4146a42942l2505b6425
9920h469j0024j16270j54493J33701k39139a8123j59545P0665a2175p9792M1368
9909e0599n5447I2218a44877A94334a28048A67673i8576o5073L2457j63945i3889
$$ y = [-84505, 30923, -146233, -218011, -389070, -317078, 86255, -122436, 96459, -127534, 90140, 69563, -225823, 326436, -56603, -8324, 4563, 75179, -51141, 324456, -111689, 33086, 23737, -127022, -416808, -73232, 141485, -116299, -178104, -269239, -38912, -67419, -630, -120188, -81050, -81631, 150959, 7533, -31712, -148291, -6422, -176325, -306601, -178786, -251196, -297562, 216551, 47752, -475387, -26033, -64657, 187682, -297700, 17872, 11302, 101843, -93293, 97612, 61373, -213083, 212322, -109725, -300163, -201180, -88691, 55357, -222218, -198435, 173154, 99008, -142942, -175447, -26425, -8469, -18493, -134763, -289256, -155555, -394694, -18123, -177668, -107003, -12175, -91967, -50599, -106046, 92218, -144877, 194334, -128048, 167673, -98576, -163649, -131192, -295137, -93889]
9897a3884l60956Q4665a064A06333O1808K9851b29093l0007C337b27519L1646
9886a95873d5024C5675a49629d1017q3416j87135j57498J73425J42211N1277b3394
9874a33850J9011j9372j00539Q7417a4622k47776d2865a452G7888K0110h7905
9862h5213A58550F720P9657a04226I6901a70360j8488M9523A45742O6388K487
9851B14617b20891d5003q1970A24795b16920d6400H6123a38158k18063a06967
9840A34140c5225A86403a4323j15974R97j13608a08095A37838M5929a54458q4470
9829b38928c7963f393j5672A28908a61129B08319N3480a84456j15892a04162B8593
9817a70677L2070j02596A05722k5300a1427l62780B10281D8461f9261a4861l59345
$$ y = [-13884, -374840, -290175, -1064, 106333, 168141, 197992, -229093, -259100, 3337, -227519, -195873, -45024, 35675, -149629, -41017, -124433, -311568, -469066, -295641, -153430, -102153, -23394, -133850, -114839, -134211, -234750, -147333, -14622, -262398, -42865, -1452, 77888, 97998, -87905, -85213, 158550, 6720, 86377, -104226, 96901, -170360, -188848, -139325, 145742, 212130, 214617, -220891, -45003, -126973, 124795, -216920, -46400, 86123, -138158, -356221, -106967, 134140, -35225, 186403, -14323, -130297, -129300, -242908, -108095, 137838, 183767, -154458, -238928, -37963, -6393, -22065, 128908, -161129, 208319, 261799, -184456, -300348, -104162, 28593, -170677, -138607, -241203, 105722, 80422, -11427, -374207, 210281, 48461, -69261, -14861, -374206]
9806c74206A72903D2747K05544I5035D6106e0995E2997P3617l2018J75067j26121
9795A43542E9842b89317R7878h5758p5203B01931a6692r9267c1854j03098H5138
9783c24580J34215E6034a00457j62266e953A58117K53972I9861N4484c53586J67186
9772a86400H7537e1553j50102i9168F5132a82498E2916M14891c62736d3983C9544
9760a0887c568l5001k55541A15673e253D71826k19997a94601j240n3677C02972
9748h0451j75596h2883E4003K5558K98010e7984j2432J5189l24787a54642c0526
9736a45389A84054i2467n9386H9136e3217l0386a1202o4760o3040A15117B2928
9724a26209d7622d454j88913p4678e2869k1090A35848c9797o3373D4796a42098
$$ y = [-374206, 172903, 42747, 248291, 95035, 46106, -50995, 52997, 126614, 94596, 269663, 143542, 59842, -289317, -191439, -85758, -160961, 201931, -16692, -115959, -31854, -134952, 85138, -324580, -190365, 56034, -100457, -262723, -5953, 158117, 412089, 99861, 154345, -353586, -186400, 87537, -51553, -201655, -99168, 65132, -182498, 52916, 467807, -362736, -43983, 39544, -10887, -3568, -38569, -294110, 115673, -5253, 471826, 251829, -194601, -195841, -249518, 302972, -80451, -256047, -82883, 54003, 79561, 377571, -57984, -70416, -55227, -380014, -154642, -30526, -145389, 184054, -92467, -151853, 89136, -53217, -83603, -11202, -75962, -139002, 115117, 22928, -126209, -47622, -4454, -193367, -268045, -52869, -73959, 135848, -39797, -103170, 44796, -142098]
9712b27117p1746e9249C1902a81321c5108n5472l9297l5196e2811H9311a70162
9700c3171H1713f4349j49583m5966c6325j10738j65110J55955A06412b93249Q8441
9689b04808B3062a39541L9075G2129a7403I8570e0748n4969L6071B23301c02506
9677A38861a4318m4205l508j42296A21612e3040k05527K3214I1223d077j25107
9666a29184O0388l28721G1877f9981L4306j84287K1171R4956J8120A13686c07612
9654a40697j08632j2666c5872j1000D8383A4064a11902A46998a48532L2581A23227
9642c8052B3040d3524j72797h0850j85809B64154l9448A07119J02874b92900J14701
9631a78199O9405c4779B31774c262A04720e5693j73560f9548k4284C37470a02637
$$ y = [-227117, -298863, -59249, 31902, -181321, -35108, -90580, -129877, -165073, -52811, 89311, -170162, -33171, 81713, -64349, -213932, -259898, -36325, -147063, -312173, -156218, 106412, -293249, -204808, 23062, -139541, -100466, 72129, -17403, 98570, -50748, -105717, -69646, 223301, -302506, 138861, -14318, -58523, -62031, -204327, 121612, -53040, -258567, -235353, 91223, -4077, -129184, -68796, -397517, 71877, -69981, -35675, -219962, -198791, -103835, -85715, 113686, -307612, -140697, -249329, -261995, -35872, -46872, 48383, 14064, -111902, 146998, -148532, -115951, 123227, -38052, 23040, -43524, -216321, -80850, -266659, 264154, 224706, 107119, 209993, -292900, -178199, -108794, -34779, 231774, -3262, 104720, -55693, -229253, -69548, -93832, 337470, -102637]
9619B62977P7467a40513B4437M6264f4958j69545A22709C0463a64579P0221B4314
9607D344M9076a14365p4745A52478d404k5307A03169k8429O421c8076k16567l6924
9595b91567R6182o2114h9554K1697B3470b3449F210J12859b8115J0264A99282
9583A66788a07974j04806P1956E0694a15610k28000J53156j06657a26372k44574
9573c70946H4666A0745b42001Q3244C8928K04852a28492m8899A7953a23874b9939
9561c43091a14888k96241i0268K7667A28975b01158D49771a09759d5108A10494
9550F8583c54550h1341j09181G0927c24176l4221Q1635F1061b55989Q4010N1456
9539a20523K9128B82041d8291A03026i2736N753E7688a66623A8683c37653I0383
$$ y = [262977, 340444, -140513, 24437, 70701, -64958, -234503, 122709, 30463, -164579, -94358, 24314, 4344, 53420, -114365, -189110, 152478, -4404, -29711, 103169, 74740, 81161, -38076, -254643, -291567, -195385, -257499, -89554, -67857, 23470, -23449, 6210, 119069, -28115, -17851, 199282, 166788, -107974, -212780, -140824, 50694, -115610, -343610, -190454, -297111, -126372, -370946, 84666, 10745, -242001, -158757, 38928, 243780, -128492, -177391, 17953, -123874, -29939, -343091, -114888, -411129, -90268, -62601, 128975, -201158, 449771, -109759, -45108, 110494, 68583, -354550, -81341, -190522, 70927, -324176, -358397, -276762, 61061, -255989, -171979, -120523, -91395, 282041, -48291, 103026, -92736, -86983, 57688, -166623, 18683, -337653, 90383]
9527B1872a32724B5898b11009p7770B52872b35111j35095a17718L1418A3349i8708
9515A42434J47734f4739C5977g3069D30453g6225H0586h3582E9766K9311c25204
9503a16863i471l6864B23936H0714b11275G6011c0751A71920b37383f4195C3020
9491a5859A1974K5471a50531d5886k06002A53669b5459r5954k48851I7191O4249
9480A61440B3846f1567C5413f2066I7647j2500e4742J6842j62766p0162a05754
9468A03238b53692N765a16181H5311j4827K344J44321c16450a47274d4931F1803
9456A69001g490k75149J32071C759b35341Q4721g3093C8762a58046A24944j0247
9445A14697b93445J16714N3299r8772a09191A99451a11263M4746C82099b26164
$$ y = [21872, -132724, 25898, -211009, -288779, 252872, -235111, -370206, -117718, -86300, 13349, -98708, 142434, 290168, -64739, 35977, -73069, 430453, -76225, 80586, -83582, 59766, 89077, -325204, -116863, -9471, -46335, 223936, 80714, -211275, 76011, -30751, 171920, -237383, -64195, 33020, -15859, 11974, 37445, -150531, -45886, -251888, 153669, -25459, -121413, -370264, 97191, 161440, 23846, -61567, 35413, -62066, 97647, 85147, -54742, -37900, -200666, -270828, -105754, 103238, -253692, -247927, -116181, 85311, 70484, 72828, 217149, -316450, -147274, -44931, 61803, 169001, -7490, -282639, -150568, 3759, -235341, -150620, -73093, 38762, -158046, 124944, 114697, -293445, -176731, -123432, -222204, -109191, 199451, -111263, -66517, 382099, -226164]
9434A1251b3309n844A2315a03656A45774b91937b4003k38525J18923j09712R3157
9423a60160r2058I5430J6074a71882A32317D3157b93805B41071b57127P2465B12838
9411a81682O9598e002B77099a00698l2382c9201n2728A01819f011j59009O6363
9400i8657A2528A092J97564A425J12543c29470J55736A28546a77263l2794f4810
9388c9284Q597A39672o050b79579B71015a7795l98607a1119j83116K2536N2641
9377a19058A33339n1496J30327a61056b3124j96068F403P0295r947a41862B16793
9365a97895H8499l3616o701a2389j72751j04101A69734B266J97710b01631A23248
9353g8082L2268k3293E602N3905K13740a47577N1066A62665d46400a50391B14320
$$ y = [11251, -23309, -29153, 12315, -103656, 145774, -291937, -24003, -262528, -143605, -253317, -160160, -252218, 95430, 111504, -171882, 132317, 43157, -293805, 241071, -257127, -184662, 212838, -181682, -112084, -5002, 277099, -100698, -133080, -39201, -91929, 101819, -6011, -165020, -98657, 12528, 1092, 198656, 1425, 113968, -329470, -173734, 128546, -177263, -210057, -64810, -39284, -30687, 139672, 133622, -279579, 271015, -17795, -416402, -11119, -194235, -171699, -119058, 133339, 81843, 212170, -161056, -23124, -219192, 6403, 76698, 66751, -141862, 216793, -197895, 88499, 54883, 48182, -12389, -185140, -289241, 169734, 2266, 199976, -201631, 123248, -78082, -45814, -69107, 5602, 59507, 273247, -147577, -96511, 162665, -446400, -150391, 214320]
9341f8442A04266O6255h5618m3C5602a61799B28756a44585A9108a41969M7922
9330i4047D7838a57924B662c27725a9556C40795e079F9887r575c01188O0358D4893
9317d2188F2144d7910r6315o0861M1838H909b31883A50884b4725D302d5382C9859
9304A02d0251G4746c15003i8671K6796r0438e449A32924B6431a97518l6918c1090
9291b71422E2270J4439b41911a9522A59882b42128A91217F2854a43755F7910J23733
9280A91643C219K17958b08872A52627E7838f4545n6388R258j87813B02160c32931
9268b11906K5560K6507j07064a28751a1253A78825a61501A27784C6064M82R3274
9257A29820b12016Q098B19325A06420a1716A11434D6729i9809c1667A47615b09056
$$ y = [-68442, 104266, 170521, -85618, -85661, 35602, -161799, 228756, -144585, 19108, -141969, -94047, 47838, -157924, 2662, -327725, -19556, 340795, -5079, 69887, 60312, -301188, -240830, 44893, -42188, 62144, -47910, -144225, -205086, -163248, 8909, -231883, 150884, -24725, 4302, -45382, 39859, 102, -40251, 74746, -315003, -98671, -71875, -162313, -5449, 132924, 26431, -197518, -234436, -31090, -271422, 52270, 66709, -241911, -19522, 159882, -242128, 191217, 62854, -143755, 67910, 191643, 3219, 221177, -208872, 152627, 57838, -64545, -120933, -111675, -299488, 202160, -332931, -211906, -186346, -159839, -266903, -128751, -11253, 178825, -161501, 127784, 36064, 36546, 129820, -212016, -203918, 219325, 106420, -11716, 111434, 46729, -99809, -31667, 147615, -209056]
9245b68722a20704o2378r5922C2354a5169l83869B91528b38717b5368C33864A52591
9233b47341B2719a16217C7178a98693A9621a39065j60885P1352I1721K08005g4898
9221E3473B5670b91287d0880L334A55543C6803g7371k3745A0675J64553G3644
9209e3995K5798j83331R1896j94518C3537e4257j72213B0425c628l8314A10677
9197c2294A77162J87341b67691c5806o0163F8567d0518m5714k44401k6338a18147
9185b50576E6698i6966E003b65514B07948g1337k7596A31266a61574D5506a12520
9173b66235K2540N8320h7223c5625A8480h8925j44439A8388L25585k122f5120
9161B4525e07750a35180j6528P096E338L04605G0766L359P2517F4774B2776a6367
$$ y = [-268722, -120704, -183082, -279004, 32354, -15169, -399038, 291528, -238717, -25368, 333864, 152591, -247341, 22719, -116217, 37178, -198693, 19621, -139065, -299950, -228598, 91721, 299726, -74898, 53473, 25670, -291287, -40880, -37546, 155543, 36803, -77371, -101116, 10675, 175228, 73644, -53995, -28197, -211528, -119632, -314150, 33537, -54257, -226470, 20425, -3628, -41942, 110677, -32294, 177162, 364503, -267691, -35806, -95969, 68567, -40518, -86232, -330633, -356971, -118147, -250576, 56698, -96966, 5003, -265514, 207948, -71337, -98933, 131266, -161574, 45506, -112520, -266235, -243695, -185375, -87223, -35625, 18480, -88925, -233364, 18388, 343973, 341851, -65120, 24525, -507750, -135180, -151708, -144612, 5338, 309943, 70766, 74125, 146642, 64774, 22776, -16367]
9148c53132g6696i654m2700k915B0527J57228a62824A85598G3537A8988J02304
9137A21292D6322c43478e0774l86765h4378B6636a42192K7361a1024D9613a00835
9125a91970r7532c631l3917k16117M6906a0923l73351d7936k28748J01710H8538
9113A83054a54906j75748O5257G8736a16757M9308C3178b33720P9931j69775K7704
9102b95860H4541A7425c48141A67295a41233H6028g0350j19388A0457a40734D0764
9090C4410b01410N3704F7013c3875h916A64763d6053k69419D5288M2573a44393
9078a02152c9271c918j83424k23223f5109D2489N0892b20531P7741A84481a30740
9066A98943H4829M1437R759a80980A0308K94684H5122J10116a17360r4157A76510
$$ y = [-353132, -76696, -9654, -52354, -55269, 20527, 177755, -162824, 185598, 73537, 18988, 121292, 46322, -343478, -50774, -437539, -84378, 26636, -142192, -114831, -11024, 49613, -100835, -191970, -289502, -3631, -37548, -253665, -206759, -10923, -384274, -47936, -276684, -174974, 88538, 183054, -154906, -330654, -265397, 78736, -116757, -67449, 33178, -233720, -153789, -323564, -295860, 84541, 17425, -348141, 167295, -141233, 86028, -70350, -189738, 10457, -140734, 40764, 34410, -201410, -147706, 67013, -33875, -8916, 164763, -46053, -315472, 45288, 87861, -144393, -102152, -39271, -3918, -187342, -410565, -65109, 42489, 93381, -220531, -142790, 184481, -130740, 198943, 84829, 126266, 136025, -180980, 10308, 304992, 85122, 195238, -117360, -211517, 176510]
9054h8468j0865k62009a04628K750L322E210J75730c38225A90161a51964J0704
9043a41260M4669q9256K9190p399a4363F1682B351c5365H6807a70326p353I0275
9030D1836J72393b05764O9238b4845P466j92919r4232i6910F0674b30773d5718
9018a75735d1311C6556d5121G3235m10K9696J0223A0779J96215g7611r7216B1245
9005a55802E2082d28444a24676G2689k1485A758b01944A32392c771j3352l11456
8994c28579A2240a98104M3180j21598q6746a22453c9011j35090H3910K7739c0497
8982b97800a17777l0371d7826n7852n916H4067C8349g9053D7086i8354l08522
8971d06876E0033a912A77992n2217a67264F9187a13393N1391l85469e8385m5425
$$ y = [-88468, -99333, -361342, -104628, -101878, -98556, 5210, 180940, -338225, 190161, -151964, -141260, -96591, -185847, -156657, -164056, -14363, 61682, 2351, -35365, 86807, -170326, -177679, 90275, 41836, 214229, -205764, -136526, -24845, -17379, -210298, -304530, -96910, 60674, -230773, -45718, -175735, -41311, 36556, -45121, 73235, 72825, 102521, 112744, 10779, 206994, -77611, -174827, 21245, -155802, 52082, -428444, -124676, 72689, 51204, 1758, -201944, 132392, -3771, -17123, -328579, 12240, -198104, -154924, -276522, -363268, -122453, -39011, -174101, 83910, 111649, -30497, -297800, -117777, -148148, -47826, -105678, -111594, 84067, 38349, -79053, 47086, -98354, -406876, 50033, -1912, 177992, 125775, -167264, 69187, -113393, -62002, -447471, -58385, -103810]
8960a03810j2057H2924b00969J5793Q9061A05109g3922A57395f2059j25794a8853
8948a816C8724c1840A16392L0713A6521b20393J5209k48627j43974e8078K1165
8937c6913A3339K48587G4798f3469k37115a16110p2283E5658N1653a48840l8266
8926a87106k07275a47413B88741a16426C52068A65833o5580b0388j01558b4561
8915A09958g4147D68912A92960g5632l5268A81625J86760L739K34083O88266J013803
8904B308276J355488M920168l817470B178061r10306o28614j70844A46846N8107
8895B04953J03463B5304h5636C27319b21507e9221B04088a60918A39335J10289
8885B49624b5701q3332O370n688k9901A34748h6902A9732a8779n6487q1062k03615
$$ y = [-103810, -115867, 82924, -200969, -185176, -96115, 105109, -73922, 157395, -62059, -187853, -18853, -1816, 38724, -31840, 116392, 147105, 16521, -220393, -205184, -453811, -597785, -58078, -36913, 13339, 261926, 74798, -63469, -300584, -116110, -188393, 55658, 107311, -148840, -187106, -394381, -147413, 288741, -116426, 352068, 165833, 100253, -20388, -121946, -24561, 109958, -74147, 468912, 192960, -75632, -110900, 181625, 368385, 372124, 606207, 1294473, 2308276, 3663764, 8583932, 4766462, 2178061, 1267755, 639141, 468297, 146846, 204953, 308416, 25304, -85636, 327319, -221507, -59221, 204088, -160918, 139335, 249624, -25701, -109033, -102663, -108351, -138252, 134748, -86902, 19732, -18779, -75266, -156328, -359943]
8873c59943J53188b9508N747A74168b74921D8876f7654B94747A17686c20689L9043
8862b81646a20811k2255f8213b5195j2774i760j89445A58075B472N13K6770j4140
8850A5615J84437a77864Q977B14078A6065J28650O4046b77450J9831J1903P5345
8839a70371C4496K50510D3865a09822N1794n5727M9429m12923A64850A6864d0034
$$ y = [-359943, -206755, -29508, -23761, 174168, -274921, 48876, -67654, 294747, 117686, -320689, -281646, -120811, -143066, -68213, -25195, -37969, -9760, -199205, 158075, 2472, 2985, 29755, 15615, 200052, -177864, -168887, 214078, 16065, 144715, 208761, -277450, -257619, -245716, -170371, 34496, 285006, 43865, -109822, -58028, -113755, -64326, -477249, 164850, 16864, -40034]
$$ [...]
##END NTUPLES=NMR SPECTRUM
##END=
