
##TITLE=AC1215_CiNAH12058_5946897_azMbKOOdsf
##JCAMPDX= 6.0         $$ Bruker NMR JCAMP-DX V2.0
##DATA TYPE= NMR SPECTRUM
##DATA CLASS= NTUPLES
##ORIGIN= BRUKER
##OWNER= Administrator
$$ 1.72 TOPSPIN		Version 2.1
$$ 2012-04-11 05:13:45.750 -0500  Administrator@TOPSPIN
$$ Compression mode = diff/dup
##.OBSERVE FREQUENCY= 400.13188235
##.OBSERVE NUCLEUS= ^1H
##.ACQUISITION MODE= SIMULTANEOUS (DQD)
##.ACQUISITION SCHEME= undefined
##.AVERAGES= 64
##.DIGITISER RES= 22
##SPECTROMETER/DATA SYSTEM= spect
##.PULSE SEQUENCE= noesygpps1d.comp
##.SOLVENT NAME= COFFEE_meoh
##.SHIFT REFERENCE= INTERNAL, COFFEE_meoh, 1, 14.9685
##AUDIT TRAIL= $$ (NUMBER, WHEN, WHO, WHERE, PROCESS, VERSION, WHAT)
$$ ##TITLE= Audit trail, TOPSPIN		Version 2.1
$$ ##JCAMPDX= 5.01
$$ ##ORIGIN= Bruker BioSpin GmbH
$$ ##OWNER= Administrator
$$ $$ C:\Bruker\TOPSPIN/data/COFFEE/nmr/AC1215_CiNAH12058_5946897_azMbKOOdsf/12/pdata/1/auditp.txt
$$ ##AUDIT TRAIL=  $$ (NUMBER, WHEN, WHO, WHERE, PROCESS, VERSION, WHAT)
(   1,<2012-04-11 05:13:41.062 -0500>,<Administrator>,<TOPSPIN>,<go>,<TOPSPIN 2.1>,
      <created by zg
	started at 2012-04-11 05:02:09.531 -0500,
	POWCHK enabled, PULCHK disabled,
       configuration hash MD5:
       1A 1E CE 29 27 FD 77 03 67 4E F0 E3 C4 B2 CB 90
       data hash MD5: 64K
       68 F4 4E 89 4E 6F 0D 6C 76 63 41 78 3B E1 CD 75>)
(   2,<2012-04-11 05:13:43.765 -0500>,<Administrator>,<TOPSPIN>,<proc1d>,<TOPSPIN 2.1>,
      <Start of raw data processing
       efp LB = 0.3 FT_mod = 6 PKNL = 1 PHC0 = 0 PHC1 = 0 SI = 128K 
       data hash MD5: 128K
       4B A8 A3 36 5F EC A9 EA C3 FC C1 14 26 59 81 BA>)
(   3,<2012-04-11 05:13:45.000 -0500>,<Administrator>,<TOPSPIN>,<proc1d>,<TOPSPIN 2.1>,
      <pk PHC0 = 36.39771 PHC1 = 0 
       data hash MD5: 128K
       16 1E 19 70 65 BB F1 93 7D EA 8F 83 20 E7 52 4B>)
(   4,<2012-04-11 05:13:45.234 -0500>,<Administrator>,<TOPSPIN>,<proc1d>,<TOPSPIN 2.1>,
      <abs ABSG = 1 
       data hash MD5: 128K
       4B 53 21 29 67 13 F0 36 ED CD D4 52 4A 0F 29 ED>)
(   5,<2012-04-11 05:13:45.375 -0500>,<Administrator>,<TOPSPIN>,<proc1d>,<TOPSPIN 2.1>,
      <abs ABSG = 2 
       data hash MD5: 128K
       BD 15 54 51 9E C6 02 44 C1 F1 07 28 56 4F D5 97>)
(   6,<2012-04-11 05:13:45.546 -0500>,<Administrator>,<TOPSPIN>,<proc1d>,<TOPSPIN 2.1>,
      <abs ABSG = 3 
       data hash MD5: 128K
       D9 08 6E 85 B3 B3 81 B1 3D 01 10 7A 64 C5 CF 6D>)
(   7,<2012-04-11 05:13:45.609 -0500>,<Administrator>,<TOPSPIN>,<proc1d>,<TOPSPIN 2.1>,
      <abs ABSG = 4 
       data hash MD5: 128K
       B6 65 8A 46 BD EC 7E EB CB FC D3 82 4D A7 61 13>)
(   8,<2012-04-11 05:13:45.656 -0500>,<Administrator>,<TOPSPIN>,<proc1d>,<TOPSPIN 2.1>,
      <abs ABSG = 5 
       data hash MD5: 128K
       44 E5 A3 0C B5 D5 33 85 3B 62 5C A5 EB EC B7 A9>)
$$ ##END=
$$ 
$$ $$ hash MD5
$$ $$ E9 54 76 67 6F 2D 2B 04 DA F8 5B A6 F4 BF A5 E2
##$RELAX= 
##$RELAX= 
##$RELAX= 
##$RELAX= 
##$RELAX= 
##$RELAX= 
##$RELAX= 
##$RELAX= 
$$ Bruker specific parameters
$$ [...]
##$TP07= 0
##$TPNAME0= <>
##$TPNAME1= <>
##$TPNAME2= <>
##$TPNAME3= <>
##$TPNAME4= <>
##$TPNAME5= <>
##$TPNAME6= <>
##$TPNAME7= <>
##$TPOAL= (0..7)
0.5 0.5 0.5 0.5 0.5 0.5 0.5 0.5
##$TPOFFS= (0..7)
0 0 0 0 0 0 0 0
##$TUNHIN= 0
##$TUNHOUT= 0
##$TUNXOUT= 0
##$USERA1= <user>
##$USERA2= <user>
##$USERA3= <user>
##$USERA4= <user>
##$USERA5= <user>
##$V9= 5
##$VALIST= <valist>
##$VCLIST= <CCCCCCCCCCCCCCC>
##$VD= 0
##$VDLIST= <DDDDDDDDDDDDDDD>
##$VPLIST= <PPPPPPPPPPPPPPP>
##$VTLIST= <TTTTTTTTTTTTTTT>
##$WBST= 1024
##$WBSW= 4
##$XGAIN= (0..3)
0 0 0 0
##$XL= 0
##$YL= 0
##$YMAX_a= 13537616
##$YMIN_a= -6288376
##$ZGOPTNS= <>
##$ZL1= 120
##$ZL2= 120
##$ZL3= 120
##$ZL4= 120
##$ABSF1= 14.9685
##$ABSF2= -5.58403
##$ABSG= 5
##$ABSL= 3
##$ALPHA= 0
##$AQORDER= 0
##$ASSFAC= 0
##$ASSFACI= 0
##$ASSFACX= 0
##$ASSWID= 0
##$AUNMP= <proc_prof1d_extract.lims>
##$AXLEFT= 0
##$AXNAME= <>
##$AXNUC= <1H>
##$AXRIGHT= 0
##$AXTYPE= 0
##$AXUNIT= <>
##$AZFE= 0.1
##$AZFW= 0.1
##$BCFW= 0
##$BC_mod= 0
##$BYTORDP= 0
##$COROFFS= 0
##$CY= 15
##$DATMOD= 1
##$DC= 0
##$DFILT= <>
##$DTYPP= 0
##$F1P= 0
##$F2P= 0
##$FCOR= 0.5
##$FTSIZE= 131072
##$FT_mod= 6
##$GAMMA= 0
##$GB= 0
##$INTBC= 1
##$INTSCL= 1
##$ISEN= 128
##$LB= 0.3
##$LEV0= 0
##$LPBIN= 0
##$MAXI= 10000
##$MC2= 0
##$MEAN= 0
##$ME_mod= 0
##$MI= 0
##$NCOEF= 0
##$NC_proc= -3
##$NLEV= 6
##$NOISF1= 0
##$NOISF2= 0
##$NSP= 0
##$NTH_PI= 0
##$NZP= 0
##$OFFSET= 14.9685
##$PC= 1
##$PHC0= 36.39771
##$PHC1= 0
##$PH_mod= 1
##$PKNL= yes
##$PPARMOD= 0
##$PPDIAG= 0
##$PPIPTYP= 0
##$PPMPNUM= 2147483647
##$PPRESOL= 1
##$PSCAL= 4
##$PSIGN= 0
##$PYNMP= <proc.py>
##$REVERSE= no
##$SF= 400.130004845939
##$SI= 131072
##$SIGF1= 0
##$SIGF2= 0
##$SINO= 400
##$SIOLD= 131072
##$SPECTYP= <>
##$SREGLST= <1H.CDCl3>
##$SSB= 0
##$STSI= 131072
##$STSR= 0
##$SW_p= 8223.68421052632
##$SYMM= 0
##$S_DEV= 0
##$TDeff= 65536
##$TDoff= 0
##$TI= <>
##$TILT= no
##$TM1= 0
##$TM2= 0
##$TOPLEV= 0
##$USERP1= <user>
##$USERP2= <user>
##$USERP3= <user>
##$USERP4= <user>
##$USERP5= <user>
##$WDW= 1
##$XDIM= 131072
##$YMAX_p= 505417910
##$YMIN_p= -455526598
##$CURPLOT= <Network HP LaserJet P1505>
##$CURPRIN= <$Network HP LaserJet P1505>
##$DFORMAT= <normdp>
##$LAYOUT= <+/1D_H.xwp>
##$LFORMAT= <normlp>
##$PFORMAT= <normpl>
##$SURQMSG= 1
$$ End of Bruker specific parameters
$$ ---------------------------------
##NTUPLES= NMR SPECTRUM
##VAR_NAME=  FREQUENCY,     SPECTRUM/REAL,   SPECTRUM/IMAG
##SYMBOL=    X,             R,               I
##VAR_TYPE=  INDEPENDENT,   DEPENDENT,       DEPENDENT
##VAR_FORM=  AFFN,          ASDF,            ASDF
##VAR_DIM=   131072,        131072,          131072
##UNITS=     HZ,            ARBITRARY UNITS, ARBITRARY UNITS
##FACTOR=    0.0627417313425165, 1,          1
##FIRST=     8223.62146879498, 5426,         -92674
##LAST=      0,             7577,            -92300
##MIN=       0,             -455526598,      0
##MAX=       8223.62146879498, 505417910,    0
$$ Real data points
##PAGE= N=1
##DATA TABLE= (X++(R..R)), XYDATA
$$ [...]
60652A812320L747K898J488J027J533R70j826m951n967n530o241q454r805r068
60638A772141q000q355r111q157n468l080k446l077l752m103m759o284q409j0386
60624A686754j1976j3676j5899j8322k0306k1517k1865k1328k0236j9261j8617
60613A483751j7718j6123j4340j3132j2402j1384r672p507n275l114r70J160K850
60600A376124L316K420J327J280J853J624N32j6L48K17j088k001r45J324K980
60585A389295L609M002M399M453M181L799L119K246K042K977M248N037N717O910
60571A446034Q385R951J2177J5019J7010J7385J7685J9547K2051K3242K3371K4464
60559A656321K7164L0054L1818L2321L1808L0787L0417L1384L2595L2379L0505
$$ plain form
60652 1812320 1816067 1818965 1820453 1821480 1823013 1823983 1822157 1817206 1811239 1805709 1799468 1791014 1781209 1772141
60638 1772141 1764141 1755786 1746675 1738518 1733050 1729970 1727524 1724447 1720695 1716592 1711833 1705549 1697140 1686754
60624 1686754 1674778 1661102 1645203 1626881 1606575 1585058 1563193 1541865 1521629 1502368 1483751
60613 1483751 1466033 1449910 1435570 1422438 1410036 1398652 1388980 1381473 1376198 1373084 1372114 1373274 1376124
60600 1376124 1379440 1381860 1383187 1384467 1386320 1387944 1388476 1388460 1388808 1389025 1387937 1385936 1384991 1386315 1389295
60585 1389295 1392904 1396906 1401305 1405758 1409939 1413738 1416857 1419103 1421145 1424122 1428370 1433407 1439124 1446034
60571 1446034 1454419 1464370 1476547 1491566 1508576 1525961 1543646 1563193 1585244 1608486 1631857 1656321
60559 1656321 1683485 1713539 1745357 1777678 1809486 1840273 1870690 1902074 1934669 1967048 1997553
60548A997553K7653K3689J8296J2583P954L800j576q041j3848j8678k3989l0019
60536A995377l4667l6172l5135l3127l0812k8162k5251k2091j8652j5352j2778
60525A703178j0809q980p526o990o976o609o051o193o965p380p181p027o963o199
60511A601329m488k403k55J987L769M455M717N936Q145R995J0814J1228J1726
60498A666955J2163J2779J4117J5722J6325J5570J4256J2969J1857J1625J3023
60487A817361J5242J6595J6935J7783J9911K2537K5106K8081L1601L5054L8364
60476B084570M2127M6040M8754M9312M7304M1779L2110J9946Q061k910j4149k4884
60464B378060l1944l4124l3986l3723l1904k6356j8101r914k633M592J1528J6802
$$ plain form
60548 1997553 2025206 2048895 2067191 2079774 2087728 2091528 2089952 2081911 2068063 2049385 2025396 1995377
60536 1995377 1960710 1924538 1889403 1856276 1825464 1797302 1772051 1749960 1731308 1715956 1703178
60525 1703178 1692369 1683389 1675863 1668873 1661897 1655288 1649237 1643044 1636079 1628699 1621518 1614491 1607528 1601329
60511 1601329 1596841 1594438 1594183 1596170 1599939 1604394 1609111 1615047 1623192 1633187 1644001 1655229 1666955
60498 1666955 1679118 1691897 1706014 1721736 1738061 1753631 1767887 1780856 1792713 1804338 1817361
60487 1817361 1832603 1849198 1866133 1883916 1903827 1926364 1951470 1979551 2011152 2046206 2084570
60476 2084570 2126697 2172737 2221491 2270803 2318107 2359886 2391996 2411942 2420003 2417093 2402944 2378060
60464 2378060 2346116 2311992 2278006 2244283 2212379 2186023 2167922 2158008 2155375 2159967 2171495 2188297
60452B188297K0098K2423K4473K6391K8764L2235L6285L9805M2896M6907N2700
60441B561274N9924O8148P7797Q9616J03705J19293J35476J52108J69924J89514
60431C726779K10406K31547K52427K73098K93572L14206L36451L61950L90755
60422F391191M21076M50015M72696M80818M64529M17356L39096K34275J09567
60413I780619k6686j64127k91235l97172m74086n19588n37426n34422n16412m87661
60403E831804m52807m16404l80262l43737l07276k73455k43860k17463j93164
60394C003376j71665j53567j37729j23098j10173r9257q9155p9277p1084o5565
60384A902806o0962n5127m8654m3618m0430l8008l6015l4753l3665l1811k9354
$$ plain form
60452 2188297 2208395 2230818 2255291 2281682 2310446 2342681 2378966 2418771 2461667 2508574 2561274
60441 2561274 2621198 2689346 2767143 2856759 2960464 3079757 3215233 3367341 3537265 3726779
60431 3726779 3937185 4168732 4421159 4694257 4987829 5302035 5638486 6000436 6391191
60422 6391191 6812267 7262282 7734978 8215796 8680325 9097681 9436777 9671052 9780619
60413 9780619 9753933 9589806 9298571 8901399 8427313 7907725 7370299 6835877 6319465 5831804
60403 5831804 5378997 4962593 4582331 4238594 3931318 3657863 3414003 3196540 3003376
60394 3003376 2831711 2678144 2540415 2417317 2307144 2207887 2118732 2039455 1968371 1902806
60384 1902806 1841844 1786717 1738063 1694445 1654015 1616007 1579992 1545239 1511574 1479763 1450409
60373A450409k6993k4740k2687k1820k2244k1843j8874j4941j2941j2774j1788
60362A238764r219p306p515q251p418n256l320k017n68J360L203M380M791M585
60348A206213M013L597M032N615P672Q927Q706P600O570N823N263N541P281R433
60334A296286J0062R075Q472R346J0291R784Q464P735P496O757N465M200K875
60321A396308J087r25k798m679o288o449m859l220l074l557l116k412l217n014
60307A347787n168k721J81J235P20L84J032K114L016L760M666N876P217Q353Q963
60292A387415Q739P594O280O413Q808J1893J3124J2159J1201J1781J2865J3017
60280A511289J2533J2156J1138Q445M752J664k47j133o47J297L413M382M743N830
$$ plain form
60373 1450409 1423416 1398676 1375989 1354169 1331925 1310082 1291208 1276267 1263326 1250552 1238764
60362 1238764 1229545 1222239 1214724 1206473 1199055 1193799 1190479 1188462 1187894 1189254 1192457 1196837 1201628 1206213
60348 1206213 1210226 1213823 1217855 1223470 1231142 1240069 1248775 1256375 1262945 1268768 1274031 1279572 1286853 1296286
60334 1296286 1306348 1315423 1323895 1333241 1343532 1353316 1361780 1369515 1377011 1383768 1389233 1393433 1396308
60321 1396308 1397395 1396470 1393672 1388993 1382705 1376256 1371397 1368177 1365103 1361546 1358430 1356018 1352801 1347787
60307 1347787 1342619 1339898 1340079 1341314 1342034 1342418 1343450 1345564 1348580 1352340 1357006 1362882 1370099 1378452 1387415
60292 1387415 1396154 1403748 1410028 1416441 1425249 1437142 1450266 1462425 1473626 1485407 1498272 1511289
60280 1511289 1523822 1535978 1547116 1555561 1560313 1561977 1561730 1560597 1559950 1561247 1564660 1569042 1573785 1579615
60266A579615P551Q827R549J0285J0549R296O824M421K310l54l613o495q618j0388
60252A619759j1676j1898j1355j0945j0493q902o032k988m67J735L420L720K570
60239A556448J194P28J150J870K593L521N213P919J0504J0877Q580O017N684P055
60225A629353P917Q023R133J1675J3768J3979J3066J2373J2191J2231J2351J2251
60213A768311J1739J1581J2787J4873J6325J6970J8232K0642K3002K4675K6992
60202A966129L1182L6333M0769M4449M8718N4218O0230O5764P0474P4598P8703
60191B571567Q3478Q9402R6511J04585J13499J23441J34706J47024J59066J69360
60181C792639J77867J85917J94178K01636K07094K10422K11456K08969K02160
$$ plain form
60266 1579615 1587166 1595993 1605542 1615827 1626376 1635672 1642496 1646917 1649227 1648873 1645260 1638765 1630147 1619759
60252 1619759 1608083 1596185 1584830 1573885 1563392 1554490 1548458 1545470 1545003 1546738 1550158 1553878 1556448
60239 1556448 1557642 1558370 1559520 1561390 1563983 1567504 1572717 1580636 1591140 1602017 1610597 1616614 1622298 1629353
60225 1629353 1637270 1645293 1654426 1666101 1679869 1693848 1706914 1719287 1731478 1743709 1756060 1768311
60213 1768311 1780050 1791631 1804418 1819291 1835616 1852586 1870818 1891460 1914462 1939137 1966129
60202 1966129 1997311 2033644 2074413 2118862 2167580 2221798 2282028 2347792 2418266 2492864 2571567
60191 2571567 2655045 2744447 2840958 2945543 3059042 3182483 3317189 3464213 3623279 3792639
60181 3792639 3970506 4156423 4350601 4552237 4759331 4969753 5181209 5390178 5592338
60172E592338J92047J79893J65263J47223J26599J05153Q3410O1163L9349J9359
60162F711797J107j5967l0639m0957m7012n0177n0171m5777l8145l0094k1860
60151F342105j0802M094K0633L7223N4909P4317R3740J11987J30154J48566J64707
60140G171633J76614J85754J93936J99247J97959J89044J74374J55734J34133
60131H778428J10820Q6370N9609K9771j137l0264n7201q2745j05405j22185j32642
60120H533419j39159j42804j41666j34076j21137j04969q6288o4979m1728j7854
60110G538759N669K8336M9891P0439R0008J07645J21781J31796J38220J41030
60100H423574J38734J30005J15610R8017P9473O0976M2796K5333R478l646j3226
$$ plain form
60172 5592338 5784385 5964278 6129541 6276764 6403363 6508516 6591926 6653089 6692438 6711797
60162 6711797 6712904 6696937 6666298 6625341 6578329 6528152 6477981 6432204 6394059 6363965 6342105
60151 6342105 6331303 6335397 6356030 6393253 6448162 6522479 6616219 6728206 6858360 7006926 7171633
60140 7171633 7348247 7534001 7727937 7927184 8125143 8314187 8488561 8644295 8778428
60131 8778428 8889248 8975618 9035227 9064998 9063861 9033597 8976396 8893651 8788246 8666061 8533419
60120 8533419 8394260 8251456 8109790 7975714 7854577 7749608 7663320 7598341 7556613 7538759
60110 7538759 7544428 7572764 7622655 7693094 7783102 7890747 8012528 8144324 8282544 8423574
60100 8423574 8562308 8692313 8807923 8905940 8985413 9046389 9089185 9114518 9123996 9120350 9107124
60089I107124j9038k1066j8984j2203l39J6545L7856O2328Q8358J15180J43576
60078I499337J74762K08669K43913K79510L15781L53242L91329M28833M65153
60069A2360529N00320N33813N64043N89360O08970O22266O27600O22644O06295
60060A7635840N79367N42986M97012M41009L76264L05558K30800J52024O9103
60051B0829963j6311j01232j83046k60190l31395l94842m48129m88994n16185
60042A8089639n29741n30340n18760m96269m65067m27358l84130l35685k83419
60033A4118870k30011j77496j26045p5151k5504K0699O0789R2821J16374J32368
60023A3907714J41449J42577J34062J15941R0333N9356K4193j3448n0685q5494
$$ plain form
60089 9107124 9088086 9067020 9048036 9035833 9035494 9052039 9089895 9152223 9240581 9355761 9499337
60078 9499337 9674099 9882768 10126681 10406191 10721972 11075214 11466543 11895376 12360529
60069 12360529 12860849 13394662 13958705 14548065 15157035 15779301 16406901 17029545 17635840
60060 17635840 18215207 18758193 19255205 19696214 20072478 20378036 20608836 20760860 20829963
60051 20829963 20813652 20712420 20529374 20269184 19937789 19542947 19094818 18605824 18089639
60042 18089639 17559898 17029558 16510798 16014529 15549462 15122104 14737974 14402289 14118870
60033 14118870 13888859 13711363 13585318 13510167 13484663 13505362 13566151 13658972 13775346 13907714
60023 13907714 14049163 14191740 14325802 14441743 14532076 14591432 14615625 14602177 14551492 14465998
60013A4465998j18227j49903j80024k07359k31927k54446k74245k89312k98528
60004A2462027l02535l02385k98483k91018k80097k65058k44717k18983j89590
59995A0069161j58721j27538r6424o5865l6188o806K3233N3741Q3096J09789J33723
59984I981201J55382J74018J87388J93523J92236J84602J71392J52466J27458
59975A1519666R6597O1081K2948j5667n3569r0545j26058j58412j85753k07550
59965A0862738k24230k35733k41247k40165k32476k18518j99340j77021j53426
59956H940582j28663j01958p3878m6110j8955R238L9423P0223R9845J28264J56394
59945I074405J84289K11342K37143K60661K79349K90804K94872K92633K83521
$$ plain form
60013 14465998 14347771 14197868 14017844 13810485 13578558 13324112 13049867 12760555 12462027
60004 12462027 12159492 11857107 11558624 11267606 10987509 10722451 10477734 10258751 10069161
59995 10069161 9910440 9782902 9686478 9620613 9584425 9577619 9600852 9654593 9737689 9847478 9981201
59984 9981201 10136583 10310601 10497989 10691512 10883748 11068350 11239742 11392208 11519666
59975 11519666 11616263 11677344 11700292 11684625 11631056 11540511 11414453 11256041 11070288 10862738
59965 10862738 10638508 10402775 10161528 9921363 9688887 9470369 9271029 9094008 8940582
59956 8940582 8811919 8709961 8636083 8589973 8571018 8580256 8619679 8689902 8789747 8918011 9074405
59945 9074405 9258694 9470036 9707179 9967840 10247189 10537993 10832865 11125498 11409019
59936A1409019K65214K36765K00608J60783J19956P8669L6616o178m9170r1425
59926A2360857j31533j67584j97568k20032k34366k40478k38479k29027k13687
59917A0488103j94230j71419j44985j14953q2543m9586j7473J3162M2318P0371
59907I838765R7491J22954J45473J64260J79289J90488J97453K00087J98715J93252
59897A1528227J83248J69336J53622J37797J21727J05004Q9156P6862O9079O4454
59887A2698512O1979O3034P0081Q4123J04401J30169J61563J98510K39761K83742
59877A4095875L29806L77808M26732M74745N20530N63329O01347O31286O50061
59868A8671519O55784O46130O17124N65261M90456L95616K84128J59431K6667
$$ plain form
59936 11409019 11674233 11910998 12111606 12272389 12392345 12471014 12507630 12501452 12452282 12360857
59926 12360857 12229324 12061740 11864172 11644140 11409774 11169296 10930817 10701790 10488103
59917 10488103 10293873 10122454 9977469 9862516 9779973 9730387 9712914 9726076 9768394 9838765
59907 9838765 9936256 10059210 10204683 10368943 10548232 10738720 10936173 11136260 11334975 11528227
59897 11528227 11711475 11880811 12034433 12172230 12293957 12398961 12488117 12564979 12634058 12698512
59887 12698512 12760491 12823525 12893606 12977729 13082130 13212299 13373862 13572372 13812133 14095875
59877 14095875 14425681 14803489 15230221 15704966 16225496 16788825 17390172 18021458 18671519
59868 18671519 19327303 19973433 20590557 21155818 21646274 22041890 22326018 22485449 22512116
59859B2512116j07262k35589l52507m52614n31683n88432o24187o40528o38832
59850A8340482o21959n94165n58455n15713m66861m14065l59064l02394k45168
59841A4262638j89536j36103q3092k9832K0941O6334J07042J45226J79955K07611
59831A4551184K26066K35489K35054K21958J94613J54481J03777M3338k5881j00703
59821A5839376j76678k50276l18857l79196m27736m62590m84615m96209m99388
59812A2343831m94890m82638m62887m37210m08312l78575l48711l18152k86987
59803H725469k56873k29512k04670j80814j57809j37662j22069j10383j01095
59794G224582r4141r0177q8246q6041q2458p8206p3729o8156o0785n2251m3682
$$ plain form
59859 22512116 22404854 22169265 21816758 21364144 20832461 20244029 19619842 18979314 18340482
59850 18340482 17718523 17124358 16565903 16050190 15583329 15169264 14810200 14507806 14262638
59841 14262638 14073102 13936999 13853907 13824075 13845016 13911350 14018392 14163618 14343573 14551184
59831 14551184 14777250 15012739 15247793 15469751 15664364 15818845 15922622 15965960 15940079 15839376
59821 15839376 15662698 15412422 15093565 14714369 14286633 13824043 13339428 12843219 12343831
59812 12343831 11848941 11366303 10903416 10466206 10057894 9679319 9330608 9012456 8725469
59803 8725469 8468596 8239084 8034414 7853600 7695791 7558129 7436060 7325677 7224582
59794 7224582 7130441 7040264 6952018 6865977 6783519 6705313 6631584 6563428 6502643 6450392 6406710
59783F406710l5842k9476k5386k3888k5247l0494m0128n1858o1810o8567p3927
59772E940087p8793q0703p7226o9825o2080n5231m7734l8497k8292j8107q070
59761E375529J731J0636J8108K4348L0238L7149M6391N8090P0768Q2420R1679
59750E847087R7897J01006J01884J01848J01175R8823R4037Q7197P8768O8835
59740F778557N8382M9459M3002L7876L3254L0510L1525L6430M4488N5791P0356
59729G269630Q6940J04698J25029J49658J77614K06219K34703K64862K98188L34130
59719I251671L71192M08347M45252M82051N18676N53242N81108N95686N89178
59710A3796403N52493M77702L64109K21954O8452p9620k09334l11296l80661m18925
$$ plain form
59783 6406710 6370868 6341392 6316006 6292118 6266871 6236377 6196249 6144391 6082581 6014014 5940087
59772 5940087 5861294 5780591 5703365 5633540 5571460 5516229 5468495 5429998 5401706 5383599 5375529
59761 5375529 5377260 5387896 5406004 5430352 5460590 5497739 5544130 5602220 5672988 5755408 5847087
59750 5847087 5944984 6045990 6147874 6249722 6350897 6449720 6543757 6630954 6709722 6778557
59740 6778557 6836939 6886398 6929400 6967276 7000530 7031040 7062565 7098995 7143483 7199274 7269630
59729 7269630 7356570 7461268 7586297 7735955 7913569 8119788 8354491 8619353 8917541 9251671
59719 9251671 9622863 10031210 10476462 10958513 11477189 12030431 12611539 13207225 13796403
59710 13796403 14348896 14826598 15190707 15412661 15481113 15401493 15192159 14880863 14500202 14081277
59700A4081277m31947m25475m03694l70956l31787k88865k43318j97115j52771
59691A1235349j10600o8896k7458J1554M7034Q0765J14658J48319J80806K13029
59681A1824560K46785K82471L19052L55685L92482M30352M70622N14101N60143
59672A5396253O07490O56142P07295P61252Q16854Q73284R30890R89453J046914
59663B2785827J100690J149242J191386J224778J245990J251865J240714J213086
59655C2403578J172032J122419J069740J019573R77268R46761R29555R25323R32932
59646D1499181R49863R71334R91579J005741J009290R96455R61396R01274Q16638
59637E0102751P09351N82493M42299K97539J55998K3372r4071j88575k54326k90150
$$ plain form
59700 14081277 13649330 13223855 12820161 12449205 12117418 11828553 11585235 11388120 11235349
59691 11235349 11124749 11055853 11028395 11039949 11086983 11167748 11282406 11430725 11611531 11824560
59681 11824560 12071345 12353816 12672868 13028553 13421035 13851387 14322009 14836110 15396253
59672 15396253 16003743 16659885 17367180 18128432 18945286 19818570 20749460 21738913 22785827
59663 22785827 23886517 25035759 26227145 27451923 28697913 29949778 31190492 32403578
59655 32403578 33575610 34698029 35767769 36787342 37764610 38711371 39640926 40566249 41499181
59646 41499181 42449044 43420378 44411957 45417698 46426988 47423443 48384839 49286113 50102751
59637 50102751 50812102 51394595 51836894 52134433 52290431 52313803 52219732 52031157 51776831 51486681
59627E1486681k97619k78167k33475j66849q2182J7708J30470K53089L82780N17980
59617E1730416O56927P96067R31223J059502J178090J281501J361612J410215
59609F0405553J419952J382554J288146J128260R00273O09572K68525j05770m93082
59600F6803983q71085j217426j513258j746443j912357k012605k053325k043593
59592E3433891j993554j913100j812350j702967j598076j510681j451847j428557
59584D0022759j440861j480256j532041j580380j612301j619491j599380j555196
59576B7602853j493284j419311j337052j249891j161311j073680r88098r05929
59568A7974297q28974p57870o91839o30598n74942n24763m78126m33356l90866
$$ plain form
59627 51486681 51189062 50910895 50677420 50510571 50428389 50446097 50576567 50829656 51212436 51730416
59617 51730416 52387343 53183410 54114633 55174135 56352225 57633726 58995338 60405553
59609 60405553 61825505 63208059 64496205 65624465 66524738 67134310 67402835 67297065 66803983
59600 66803983 65932898 64715472 63202214 61455771 59543414 57530809 55477484 53433891
59592 53433891 51440337 49527237 47714887 46011920 44413844 42903163 41451316 40022759
59584 40022759 38581898 37101642 35569601 33989221 32376920 30757429 29158049 27602853
59576 27602853 26109569 24690258 23353206 22103315 20942004 19868324 18880226 17974297
59568 17974297 17145323 16387453 15695614 15065016 14490074 13965311 13487185 13053829 12662963
59559A2662963l52015l17279k86466k59614k36543k16276j97868j81393j67611
59550A0447898j57346j51509j50683j54024j59329j64833j70264j75797j80954
59541H983159j85002j87457j87636j84629j78293j69552j59256j47645j35115
59532G448574j22423j09642r6095q1859o8180n5828m4206l2751k1962j2221k736
59521F800671P315J7443K6559L4287M0956M6959N2672N8249O3175O6986P0653
59510G285925P5884Q2798Q9863R6689J05052J16230J29158J42519J56970J73655
59500H454743J91976K10710K30108K50979K72655K93982L15676L39495L65286
59491A0925610L90841M14787M37684M59941M80268M96869N08882N15944N17309
$$ plain form
59559 12662963 12310948 11993669 11707203 11447589 11211046 10994770 10796902 10615509 10447898
59550 10447898 10290552 10139043 9988360 9834336 9675007 9510174 9339910 9164113 8983159
59541 8983159 8798157 8610700 8423064 8238435 8060142 7890590 7731334 7583689 7448574
59532 7448574 7326151 7216509 7120414 7038555 6970375 6914547 6870341 6837590 6815628 6803407 6800671
59521 6800671 6807986 6825429 6851988 6886275 6927231 6974190 7026862 7085111 7148286 7215272 7285925
59510 7285925 7361809 7444607 7534470 7631159 7736211 7852441 7981599 8124118 8281088 8454743
59500 8454743 8646719 8857429 9087537 9338516 9611171 9905153 10220829 10560324 10925610
59491 10925610 11316451 11731238 12168922 12628863 13109131 13606000 14114882 14630826 15148135
59482A5148135N12152N00371M82692M60354M34745M06750L76094L41754L03380
59473A8966427K62396K21748J84694J53378J28104J08008R2670Q2927P9866Q3395
59463B0363613R2363J05799J23127J42699J60486J71003J69938J55702J28283
59454B1613013Q7202L1612l7603j17072k02825k91930l81364m66417n41798o04151
59444A9088667o52364o85880p04186p07901o98998o79627o51496o16375n76193
59435A3115647n32623m87273m41872l97351l53371l09962k68847k31492j96641
59426I896215j61858j27084r4324o3953l4008l503K6242N4453Q2581J11903J41466
59415I828130J69932J97670K25550K52992K78721L02428L24333L43830L59466
$$ plain form
59482 15148135 15660287 16160658 16643350 17103704 17538449 17945199 18321293 18663047 18966427
59473 18966427 19228823 19450571 19635265 19788643 19916747 20024755 20117425 20200352 20280218 20363613
59463 20363613 20455976 20561775 20684902 20827601 20988087 21159090 21329028 21484730 21613013
59454 21613013 21700215 21731827 21694224 21577152 21374327 21082397 20701033 20234616 19692818 19088667
59444 19088667 18436303 17750423 17046237 16338336 15639338 14959711 14308215 13691840 13115647
59435 13115647 12583024 12095751 11653879 11256528 10903157 10593195 10324348 10092856 9896215
59426 9896215 9734357 9607273 9512949 9448996 9414988 9411485 9437727 9492180 9574761 9686664 9828130
59415 9828130 9998062 10195732 10421282 10674274 10952995 11255423 11579756 11923586 12283052
59406A2283052L69623L72592L66803L51365L25622K88281K38522J77929J09674
59397A4883463L5695m3175j23958k00954k69452l28161l77198m16046m44660m64201
59387A2251353m75028m76064m67724m53529m36799m17507l94350l68467l42874
59378H419011l19153k96547k73739k50139k26179k03435j83542j66152j49134
59369F350991j31470j14347r8638q3351o7855n3588m1883l1916k2307j3015m087
59358E688534N461J5691K4580L0876L6492M4159N4270O5506P6285Q3712Q3916
59347F209482P6734O8360O6151P1967Q2915R6640J12665J30241J48745J69187
59337G233087J91791K12943K28383K39050K50367K65938K85588L09416L39575
$$ plain form
59406 12283052 12652675 13025267 13392070 13743435 14069057 14357338 14595860 14773789 14883463
59397 14883463 14919158 14875983 14752025 14551071 14281619 13953458 13576260 13160214 12715554 12251353
59387 12251353 11776325 11300261 10832537 10379008 9942209 9524702 9130352 8761885 8419011
59378 8419011 8099858 7803311 7529572 7279433 7053254 6849819 6666277 6500125 6350991
59369 6350991 6219521 6105174 6006536 5923185 5855330 5801742 5759859 5727943 5705636 5692621 5688534
59358 5688534 5693995 5709686 5734266 5765142 5801634 5845793 5900063 5965569 6041854 6125566 6209482
59347 6209482 6286216 6354576 6420727 6492694 6575609 6672249 6784914 6915155 7063900 7233087
59337 7233087 7424878 7637821 7866204 8105254 8355621 8621559 8907147 9216563 9556138
59328I556138L76792M18450M61734N06491N53885O04144O56576P10239P63869
59319A4608318Q16368Q67328R15606R57611R88628J005458J006194R88511R51144
59310B3105166Q96943Q31771P60081O83785O05153N27697M53442L81792L11958
59301B8557788K44348J78896J14016M7989k0300r2181j68641k48394l28244m05571
59291B7879706m78409n43215n95476o33659o60545o79830o93540p03405p12163
59282B2179464p21743p31685p40526p47321p50807p48827p40005p24990p05048
59273A5568512o80464o51136o17781n81725n44324n06737m69355m31391l92463
59264A0693136l54491l20217k89666k60042k29731k00327j73922j50389j28565
$$ plain form
59328 9556138 9932930 10351380 10813114 11319605 11873490 12477634 13134210 13844449 14608318
59319 14608318 15424686 16292014 17207620 18165231 19153859 20159317 21165511 22154022 23105166
59310 23105166 24002109 24833880 25593961 26277746 26882899 27410596 27864038 28245830 28557788
59301 28557788 28802136 28981032 29095048 29143037 29122737 29030556 28861915 28613521 28285277 27879706
59291 27879706 27401297 26858082 26262606 25628947 24968402 24288572 23595032 22891627 22179464
59282 22179464 21457721 20726036 19985510 19238189 18487382 17738555 16998550 16273560 15568512
59273 15568512 14888048 14236912 13619131 13037406 12493082 11986345 11516990 11085599 10693136
59264 10693136 10338645 10018428 9728762 9468720 9238989 9038662 8864740 8714351 8585786
59255H585786j08236q9413p1139n2626l4630j8272l259J1438K5906L9500N2179
59244H337234O4272P5277Q4194R1124R7449J03924J09211J11046J08808J04217
59234I286756R9234R4015Q7929Q1811P7428P4676P1565O7780O6147O9047P5352
59223A0151740Q2773R1391J02547J15744J29379J43409J58455J72954J84115J91342
59213A1523849J95924J97614J94194J84238J67348J41880J05898O1275J4004l0529
59203A2755695p0406j05055j33134j53765j67545j75140j76570j72465j64154
59194A1437461j52103j36226j18025j00057q2865o4948m6223k8980j4746k909
59184A0690379O885J3993J9430K6161L5167M4043N1137N8600O9515Q4505J02936
$$ plain form
59255 8585786 8477550 8388137 8316998 8264372 8229742 8211470 8208211 8219649 8245555 8285055 8337234
59244 8337234 8401506 8476783 8560977 8652101 8749550 8853474 8962685 9073731 9182539 9286756
59234 9286756 9385990 9480005 9567934 9649745 9727173 9801849 9873414 9941194 10007341 10076388 10151740
59223 10151740 10234513 10325904 10428451 10544195 10673574 10816983 10975438 11148392 11332507 11523849
59213 11523849 11719773 11917387 12111581 12295819 12463167 12605047 12710945 12772220 12786224 12755695
59203 12755695 12685289 12580234 12447100 12293335 12125790 11950650 11774080 11601615 11437461
59194 11437461 11285358 11149132 11031107 10931050 10848185 10783237 10737014 10708034 10693288 10690379
59184 10690379 10697264 10711257 10730687 10756848 10792015 10836058 10887195 10945795 11015310 11099815 11202751
59173A1202751J24957J50292J77473K06549K40336K80376L23624L65745M05934
59164A3478037M45596M83576N15742N38532N50071N48032N28956M90236M31323
59155A8010101L53110K57479J47415K6644j00568k28682l51071m62040n58059
59146A7094329o36488o94676p31627p49185p50102p36049p08950o72968o33009
59137A0781275n91733n49567n07041m65464m25703l87863l52198l19373k89953
59128F892380k64244k42085k22221k02857j83554j65685j50269j36601j23815
59119E201049j12348j02455r2719q1777p0556o1051n3442m6138l8227l0324k3123
59108D488889j6408r539k024O221J4543K1962K8490L5386M3360N1435N8489O4963
$$ plain form
59173 11202751 11327708 11478000 11655473 11862022 12102358 12382734 12706358 13072103 13478037
59164 13478037 13923633 14407209 14922951 15461483 16011554 16559586 17088542 17578778 18010101
59155 18010101 18363211 18620690 18768105 18794749 18694181 18465499 18114428 17652388 17094329
59146 17094329 16457841 15763165 15031538 14282353 13532251 12796202 12087252 11414284 10781275
59137 10781275 10189542 9639975 9132934 8667470 8241767 7853904 7501706 7182333 6892380
59128 6892380 6628136 6386051 6163830 5960973 5777419 5611734 5461465 5324864 5201049
59119 5201049 5088701 4986246 4893527 4811750 4741194 4680143 4626701 4580563 4542336 4512012 4488889
59108 4488889 4472481 4462942 4460918 4467139 4481682 4503644 4532134 4567520 4610880 4662315 4720804 4785767
59096D785767P1865P8783Q4268Q7999R1427R6283J03036J10580J17040J21241
59086E748289J23797J26282J29206J31461J31838J29994J25783J19033J10536
59077F876219J01874R3543Q4283P3045O0501M8055L6626K6981J9867J5101J1919
59066G448014J0947J4254K2483L3423M4431N4922O5799P8166R3537J13135J35437
59055H114548J56388J73845J90168K08662K29182K49347K68226K86197L02392
59046A0178955L15075L23976L29617L30761L24798L10366K87209K53810K07964
59037A2862531J50384Q5691J9031m6641j09436j66645k15444k54702k85206l08406
59027A1731157l25500l37243l44191l47011l46570l43716l39227l34008l28865
$$ plain form
59096 4785767 4857632 4936415 5020683 5108682 5200109 5296392 5399428 5510008 5627048 5748289
59086 5748289 5872086 5998368 6127574 6259035 6390873 6520867 6646650 6765683 6876219
59077 6876219 6978093 7071636 7155919 7228964 7289465 7337520 7374146 7401127 7420994 7436095 7448014
59066 7448014 7458961 7473215 7495698 7529121 7573552 7628474 7694273 7772439 7865976 7979111 8114548
59055 8114548 8270936 8444781 8634949 8843611 9072793 9322140 9590366 9876563 10178955
59046 10178955 10494030 10818006 11147623 11478384 11803182 12113548 12400757 12654567 12862531
59037 12862531 13012915 13098606 13117637 13070996 12961560 12794915 12579471 12324769 12039563 11731157
59027 11731157 11405657 11068414 10724223 10377212 10030642 9686926 9347699 9013691 8684826
59018H684826l23805l18160l11467l03694k94476k83189k70165k56923k44642
59009F078305k33210k22137k11345k00658j89534j78100j67392j57907j48835
59000D369187j39396j30033j21613j14314j07845j01858r5857q9612q3927p9792
58990C304940p6639p2959o8683o5202o2752o0039n6920n4993n4486n3149m9658
58979B629460m5679m2749l9592l4733k9639k6543k4775k1982j7899j4225j1502
58968B320142q675n340k205M70L014N061N870N724N641N912O055N871N449M770
58954B357759M089M035M532M673M413M995O756Q224Q618R409J1835J4615J6078
58941B460031J6830J8203J9604J9736J9272J9791K1133K2133K3000K4605K6175
$$ plain form
59018 8684826 8361021 8042861 7731394 7427700 7133224 6850035 6579870 6322947 6078305
59009 6078305 5845095 5622958 5411613 5210955 5021421 4843321 4675929 4518022 4369187
59000 4369187 4229791 4099758 3978145 3863831 3755986 3654128 3558271 3468659 3384732 3304940
58990 3304940 3228301 3155342 3086659 3021457 2958705 2898666 2841746 2786753 2732267 2679118 2629460
58979 2629460 2583781 2541032 2501440 2466707 2437068 2410525 2385750 2363768 2345869 2331644 2320142
58968 2320142 2311467 2306127 2303922 2304392 2307406 2312467 2318337 2324061 2329702 2335614 2341669 2347540 2352989 2357759
58954 2357759 2361848 2365883 2370415 2375088 2379501 2384496 2391252 2399476 2408094 2417503 2429338 2443953 2460031
58941 2460031 2476861 2495064 2514668 2534404 2553676 2573467 2594600 2616733 2639733 2664338 2690513
58930B690513K6228K5242K5087K6113K7037K7451K8225K9553L0519L0687L0591
58919B997246L0686L1135L2274L4054L5592L6420L7475L9720M2690M5546M8364
58908C411202N1217N3450N5310N8672O4278O9896P3253P5238P8054Q1778Q5063
58897D157411Q7710R0071R1407R1634R3214R8345J05407J11311J16204J22601
58887E165315J30854J39162J47555J58061J70770J83107J93669K03950K15742
58878F708185K29320K44563K61520K79552K97941L17414L39205L62908L87449
58869I428057M13510M42682M74734N08234N43423N81791O23367O67163P13685
58860A4396646P64028Q16941Q69904R22687R76420J029522J078309J121634J160856
$$ plain form
58930 2690513 2716741 2741983 2767070 2793183 2820220 2847671 2875896 2905449 2935968 2966655 2997246
58919 2997246 3027932 3059067 3091341 3125395 3160987 3197407 3234882 3274602 3317292 3362838 3411202
58908 3411202 3462419 3515869 3571179 3629851 3694129 3764025 3837278 3912516 3990570 4072348 4157411
58897 4157411 4245121 4335192 4426599 4518233 4611447 4709792 4815199 4926510 5042714 5165315
58887 5165315 5296169 5435331 5582886 5740947 5911717 6094824 6288493 6492443 6708185
58878 6708185 6937505 7182068 7443588 7723140 8021081 8338495 8677700 9040608 9428057
58869 9428057 9841567 10284249 10758983 11267217 11810640 12392431 13015798 13682961 14396646
58860 14396646 15160674 15977615 16847519 17770206 18746626 19776148 20854457 21976091 23136947
58851B3136947J194432J216465J221636J207937J173049J111624J018499Q92482
58843C2173071P35683N51757L46572J28505r3683l12140n18677p04699q63850
58834C1442539r93318j092168j160422j200317j216137j211761j189978j154342
58826B2224096j109263j057554j000276r39585q79295q21719p66423p12985o62564
58817A4274432o15848n72010n30957m94239m62397m33639m06278l80347l55730
58808A0022987l31061l05999k82304k61048k40788k20118k00113j82444j66722
58799G832390j51516j36555j22277j08282r3854p9126o4670n0849l8233k7327
58789F959701j7043m967R784K5269L9265N1785O4130P6799Q9574J02598J16215
$$ plain form
58851 23136947 24331379 25547844 26769480 27977417 29150466 30262090 31280589 32173071
58843 32173071 32908754 33460511 33807083 33935588 33841905 33529765 33011088 32306389 31442539
58834 31442539 30449221 29357053 28196631 26996314 25780177 24568416 23378438 22224096
58826 22224096 21114833 20057279 19057003 18117418 17238123 16416404 15649981 14936996 14274432
58817 14274432 13658584 13086574 12555617 12061378 11598981 11165342 10759064 10378717 10022987
58808 10022987 9691926 9385927 9103623 8842575 8601787 8381669 8181556 7999112 7832390
58799 7832390 7680874 7544319 7422042 7313760 7219906 7140780 7076110 7025261 6987028 6959701
58789 6959701 6942658 6937691 6947475 6972744 7012009 7063794 7127924 7204723 7294297 7396895 7513110
58778G513110J30388J44991J60017J75171J90208K05909K23587K43308K63769
58769I250458K84153L05003L27242L51541L78510M08090M38940M70050N02738
58760A2716725N39284N79936O23359O69679P20408P75147Q30957Q85482R38399
58751A9279376R89403J037179J080795J119278J148867J163180J157151J128695
58743B8103924J075900R95243Q83900P41767N70609L73969J59297o2367k80577
58734C2561665m87855o77598q42742r78517j084444j161996j212061j236077j237474
58725B3642901j220209j187569j143612j093488j040392r84110r24535q64765
58717A5184221q08597p56481p06433o58088o13386n73573n37535n03426m70700
$$ plain form
58778 7513110 7643498 7788489 7948506 8123677 8313885 8519794 8743381 8986689 9250458
58769 9250458 9534611 9839614 10166856 10518397 10896907 11304997 11743937 12213987 12716725
58760 12716725 13256009 13835945 14459304 15128983 15849391 16624538 17455495 18340977 19279376
58751 19279376 20268779 21305958 22386753 23506031 24654898 25818078 26975229 28103924
58743 28103924 29179824 30175067 31058967 31800734 32371343 32745312 32904609 32842242 32561665
58734 32561665 32073810 31396212 30553470 29574953 28490509 27328513 26116452 24880375 23642901
58725 23642901 22422692 21235123 20091511 18998023 17957631 16973521 16048986 15184221
58717 15184221 14375624 13619143 12912710 12254622 11641236 11067663 10530128 10026702 9556002
58708I556002m40170m12610l87548l63504l39686l16974k96552k78181k60863
58699F459914k44463k29084k13636j97067j80605j66445j54447j42528j30274
58690D801365j19538j11251j04197r7426r1388q6150q0944p5941p2100o8883o4730
58679C828817o0190n7624n7230n6368n3775n1440n1009n1228n0458m9241m8735
58668C241519m8724m8576m8384m8184m7798m7986m9664n1769n2389n1953n2366
58657B693726n3006n1312m7794m6170m7348m7570m4393m0359l8372l7366l5341
58646B204695l3242l2612l2258l0455k8139k7018k6510k5315k4060k3922k4253
58635A896911k3879k3185k2967k2878k2561k2488k2275k0436j7153j4707j3711
$$ plain form
58708 9556002 9115832 8703222 8315674 7952170 7612484 7295510 6998958 6720777 6459914
58699 6459914 6215451 5986367 5772731 5575664 5395059 5228614 5074167 4931639 4801365
58690 4801365 4681827 4570576 4466379 4368953 4277565 4191415 4110471 4034530 3962430 3893547 3828817
58679 3828817 3768627 3711003 3653773 3597405 3543630 3492190 3441181 3389953 3339495 3290254 3241519
58668 3241519 3192795 3144219 3095835 3047651 2999853 2951867 2902203 2850434 2798045 2746092 2693726
58657 2693726 2640720 2589408 2541614 2495444 2448096 2400526 2356133 2315774 2277402 2240036 2204695
58646 2204695 2171453 2138841 2106583 2076128 2047989 2020971 1994461 1969146 1945086 1921164 1896911
58635 1896911 1873032 1849847 1826880 1804002 1781441 1758953 1736678 1716242 1699089 1684382 1670671
58624A670671j1741p439k980m67J102L013M102L269J879R58j050m910p816p208
58610A641383m913m206m900m644l202k098j465k89J349K777M130N158M310J231
58596A634621j534j588L08K290M439P527J0819J3461J6284J9944K3260K5429K7805
58583A783065L1304L4428L6050L7805M1254M5174M8199N1678N7110O3162O8048
58572B297277P2669P8523Q4685Q9821R5224J02917J12577J22870J33914J46131
58562C336608J58707J71524J86160K02868K19386K35015K52554K73274K93498
58553E329594L09574L22886L35984L46857L51222L47742L36498L14784K79193
58544H274334K30340J71523J04500L0781m4663j15299j77674k30890k73193l02832
$$ plain form
58624 1670671 1658930 1651491 1648511 1648044 1649146 1652159 1656261 1659530 1661409 1662367 1661317 1656407 1648591 1641383
58610 1641383 1636470 1632264 1627364 1622720 1619518 1617420 1615955 1615666 1617015 1619792 1623922 1629080 1633390 1634621
58596 1634621 1633087 1631499 1631807 1634097 1638536 1646063 1656882 1670343 1686627 1706571 1729831 1755260 1783065
58583 1783065 1814369 1848797 1884847 1922652 1963906 2009080 2057279 2108957 2166067 2229229 2297277
58572 2297277 2369946 2448469 2533154 2622975 2718199 2821116 2933693 3056563 3190477 3336608
58562 3336608 3495315 3666839 3852999 4055867 4275253 4510268 4762822 5036096 5329594
58553 5329594 5639168 5962054 6298038 6644895 6996117 7343859 7680357 7995141 8274334
58544 8274334 8504674 8676197 8780697 8811478 8766815 8651516 8473842 8242952 7969759 7666927
58534G666927l20844l29565l29753l22305l10654k97946k83655k66187k46829
58525D959189k27818k08943j89470j71000j54885j39484j23508j09085r7782q7078
58515C450136p5225o5912o2689o2236n9106n4283n2569n3748n3233n0086m7704
58504B813345m7272m6842m6410m7927n0410n0715m9114m8878n0550n1676n1796
58493B271755n2463n2726n0015m5313m2235m1136l9130l5724l3184l1558k8591
58482A819680k4632k2453k2081k0768j8162j6592j6288j5259j3765j3791j4277
58471A621612j2194q422p113q863r881q398o627n821m663l308l878n962o520n071
58457A524891m489n892p347q135r706j1943j3032j3421j5170j7288j6660j3887
$$ plain form
58534 7666927 7346083 7016518 6686765 6364460 6053806 5755860 5472205 5206018 4959189
58525 4959189 4731371 4522428 4332958 4161958 4007073 3867589 3744081 3634996 3537214 3450136
58515 3450136 3374911 3308999 3246310 3184074 3124968 3070685 3018116 2964368 2911135 2861049 2813345
58504 2813345 2766073 2719231 2672821 2624894 2574484 2523769 2474655 2425777 2375227 2323551 2271755
58493 2271755 2219292 2166566 2116551 2071238 2029003 1987867 1948737 1913013 1879829 1848271 1819680
58482 1819680 1795048 1772595 1750514 1729746 1711584 1694992 1678704 1663445 1649680 1635889 1621612
58471 1621612 1609418 1600996 1593883 1585020 1575139 1566741 1560114 1554293 1549630 1546322 1542444 1536482 1529962 1524891
58457 1524891 1520402 1514510 1507163 1499028 1489322 1477379 1464347 1450926 1435756 1418468 1401808 1387921
58445A387921j2962j4706j5724j4603j3721j4054j3375j0827q476p249n943m951
58433A251330o151q489q564o296n104n980o536o343p640r877r416n895l357l531
58419A158151l371q98J686K412K272J968O10j092r85K20m39k567k665p24q19l938
58403A149821n976m417j506P99L310N490M735J888J871O490J1671J3873J4158
58390A202207J3971J2261R042O708N582K909j905n935q083j0569j3637j4384j2646
58377A185521j2161j3946j4402j2206j0986j2496j3129j0339o898n587m954l453
58365A064964k704l410k984l48J544Q76J28J338K827L161L816N485O264N744O401
58350A093102Q951J0944J1483J2376J3358J1858Q953R335J3541J6568J6195J6069
$$ plain form
58445 1387921 1374959 1360253 1344529 1329926 1316205 1302151 1288776 1277949 1269473 1262224 1256281 1251330
58433 1251330 1245179 1236690 1228126 1221830 1216726 1210746 1204210 1197867 1190227 1180350 1170934 1165039 1161682 1158151
58419 1158151 1154780 1153882 1155568 1157980 1160252 1162220 1162830 1161738 1160753 1160973 1160534 1157967 1155302 1154578 1153759 1149821
58403 1149821 1143845 1139428 1137922 1138721 1142031 1147521 1152256 1154144 1156015 1162505 1174176 1188049 1202207
58390 1202207 1216178 1228439 1237481 1244189 1249771 1252680 1250775 1244840 1236757 1226188 1212551 1198167 1185521
58377 1185521 1173360 1159414 1145012 1132806 1121820 1109324 1096195 1085856 1078958 1073371 1068417 1064964
58365 1064964 1062260 1058850 1055866 1055518 1057062 1057938 1058066 1059404 1062231 1065392 1069208 1074693 1080957 1086701 1093102
58350 1093102 1102053 1112997 1124480 1136856 1150214 1162072 1171025 1180360 1193901 1210469 1226664 1242733
58338A242733J8289J9852J9095J8777J9701J8220J3400R847R854R483O132L159
58326A408542L064K847L21j572j107j871n950r374q993p781q570q676n500j670
58312A353710K31K321O186Q666P504N718N914N935M315M035O523P992O282N064
58298A430396O687P368M388J609K524M108K959J431K288L233K154J788L975N198
58284A480106L183J796M100O780O811P224J0610J3393J2437J1116J2941J5402
58272A585899J5849J7030K0785K2827K0099J6981J7898J9942J9136J7583J8236
58261A792265J8758J6943J5932J8011J9576J8106J7344J9749K1121J8772J7297
58250A993874J9803K1529J9058J7585K1454K5725K4999K2722K3594K4746K2897
$$ plain form
58338 1242733 1261022 1280874 1299969 1318746 1338447 1356667 1370067 1379914 1389768 1399251 1405383 1408542
58326 1408542 1411606 1414453 1414774 1413202 1412095 1410224 1404274 1394900 1385907 1378126 1369556 1360880 1355380 1353710
58312 1353710 1353941 1356262 1362448 1371114 1378618 1384336 1390250 1396185 1400500 1404535 1411058 1419050 1425332 1430396
58298 1430396 1437083 1444451 1448839 1450448 1452972 1457080 1460039 1461470 1463758 1466991 1469145 1470933 1474908 1480106
58284 1480106 1483289 1485085 1489185 1495965 1502776 1510000 1520610 1534003 1546440 1557556 1570497 1585899
58272 1585899 1601748 1618778 1639563 1662390 1682489 1699470 1717368 1737310 1756446 1774029 1792265
58261 1792265 1811023 1827966 1843898 1861909 1881485 1899591 1916935 1936684 1957805 1976577 1993874
58250 1993874 2013677 2035206 2054264 2071849 2093303 2119028 2144027 2166749 2190343 2215089 2237986
58239B237986K2263K6667L1398L1694L1627L5865M0380M0346L9453M2247M4962
58228B624888M3121M0634M2184M4495M4041M5058N0901N6357N7737O1054P0267
58217C180737P7670P6833P4805P9782Q6861Q8582Q9509R6820J05908J09173J10391
58206D177071J16437J23298J24315J24015J29767J37920J41998J46105J56316
58197E377242J67579J73424J79565J93389K09293K19308K28474K44344K61401
58188G254019K71903K81861K99687L19570L33213L47203L70886L97953M18564
58179A0294859M38499M67208M98523N22979N47284N80927O16107O42768O70626
58170A5279780P13118P62282Q03595Q42453Q90949R42306R85404J031050J095763
$$ plain form
58239 2237986 2260249 2286916 2318314 2350008 2381635 2417500 2457880 2498226 2537679 2579926 2624888
58228 2624888 2668009 2708643 2750827 2795322 2839363 2884421 2935322 2991679 3049416 3110470 3180737
58217 3180737 3258407 3335240 3410045 3489827 3576688 3665270 3754779 3851599 3957507 4066680 4177071
58206 4177071 4293508 4416806 4541121 4665136 4794903 4932823 5074821 5220926 5377242
58197 5377242 5544821 5718245 5897810 6091199 6300492 6519800 6748274 6992618 7254019
58188 7254019 7525922 7807783 8107470 8427040 8760253 9107456 9478342 9876295 10294859
58179 10294859 10733358 11200566 11699089 12222068 12769352 13350279 13966386 14609154 15279780
58170 15279780 15992898 16755180 17558775 18401228 19292177 20234483 21219887 22250937 23346700
58161B3346700J173146J250085J336310J446602J568576J681095J789946J911797
58153C5504257K039917K163186K302043K485136K706470K947076L220903L554256
58145E6923244L939784M361026M843273N427154O113564O893105P805346Q901539
58137A05208035J0171582J1577793J3128074J4829986J6612712J8412172K0320299
58130B10260653K2552621K5316761K8801903L3045452L7295643L9400334L6460923
58123D33134290K6888956J2075545m166270j7966448k7355796l2402242l4152973
58116C56055062l3724272l1999987k9601894k6895833k4079395k1307920j8716299
58109A69729462j6361575j4227361j2294022j0565302r035135p672809o447834
$$ plain form
58161 23346700 24519846 25769931 27106241 28552843 30121419 31802514 33592460 35504257
58153 35504257 37544174 39707360 42009403 44494539 47201009 50148085 53368988 56923244
58145 56923244 60863028 65224054 70067327 75494481 81608045 88501150 96306496 105208035
58137 105208035 115379617 126957410 140085484 154915470 171528182 189940354 210260653
58130 210260653 232813274 258130035 286931938 319977390 357273033 396673367 433134290
58123 433134290 460023246 472098791 467932521 449966073 422610277 390208035 356055062
58116 356055062 322330790 290330803 260728909 233833076 209753681 188445761 169729462
58109 169729462 153367887 139140526 126846504 116281202 107246067 99573258 93125424
58102I3125424n345960m357135l462632k641561j886726j195010n14010K77837
58094G4000227J232755K104032K346503J519397k58491k332493m018543n033603
58086F9559784n463856n488268n242614m848520m412886l978994l545653l131959
58078C3447034k772727k466507k184460j923417j703206j520744j352896j198884
58070A8324193j077472r86106r01581q18317p50545o99325o50525o02990n67557
58061A1269775n40335n06127m66164m34811m11444l82519l48977l25143l12092
58052G542163k97361k79675k69722k67371k61307k50376k43332k38735k26716
58043E207568k09454j98649j93757j83506j67921j58095j54625j46694j32817
$$ plain form
58102 93125424 87779464 83422329 79959697 77318136 75431410 74236400 73722390 74000227
58094 74000227 75232982 77337014 79683517 81202914 80944423 78611930 74593387 69559784
58086 69559784 64095928 58607660 53365046 48516526 44103640 40124646 36578993 33447034
58078 33447034 30674307 28207800 26023340 24099923 22396717 20875973 19523077 18324193
58070 18324193 17246721 16260615 15359034 14540717 13790172 13090847 12440322 11837332 11269775
58061 11269775 10729440 10223313 9757149 9322338 8910894 8528375 8179398 7854255 7542163
58052 7542163 7244802 6965127 6695405 6428034 6166727 5916351 5673019 5434284 5207568
58043 5207568 4998114 4799465 4605708 4422202 4254281 4096186 3941561 3794867 3662050
58034C662050j22811j18607j11887j01520r5234r3343q8164q0070p7030p8074
58024B695310p4260o6317o4069o7848o7675o1821n9041o0891n8883n1484m7435
58013B015586m9205m8751m2998l8662l8451l6775l2385l1339l4085l3031k6515
58002A603389k2110k2673k1877j7230j4921j7631j9300j6428j3676j4116j4113
57991A409314j1715j0450j1515j1341r667j0733j4263j4641j1132r333j0576r747
57979A274201n676l707n454n834k960j299k300j362K888N420L895K145J876k53
57965A261580m505n902l364k387n470q057p210o293p784r144q986r919j2306j2361
57951A157892r365p741r412j0962j0667j1145j2805j2045q410o328p278p247m370
$$ plain form
58034 3662050 3539239 3420632 3308745 3207225 3111991 3018648 2930484 2850414 2773384 2695310
58024 2695310 2621050 2554733 2490664 2422816 2355141 2293320 2234279 2173388 2114505 2063021 2015586
58013 2015586 1966381 1917630 1874632 1835970 1797519 1760744 1728359 1697020 1662935 1629904 1603389
58002 1603389 1581279 1558606 1536729 1519499 1504578 1486947 1467647 1451219 1437543 1423427 1409314
57991 1409314 1397599 1387149 1375634 1364293 1354626 1343893 1329630 1314989 1303857 1294524 1283948 1274201
57979 1274201 1268525 1264818 1259364 1253530 1250570 1249271 1246971 1245609 1248497 1253917 1257812 1259957 1261833 1261580
57965 1261580 1257075 1251173 1247809 1245422 1239952 1231895 1224685 1218392 1210608 1201464 1192478 1182559 1170253 1157892
57951 1157892 1148527 1140786 1131374 1120412 1109745 1098600 1085795 1073750 1065340 1059012 1051734 1044487 1040117
57938A040117j920j422L2L116M070J861N34J848K386N03o84K14J97j704k080K53
57922A047321J780Q62K91J062K78k423l280j535j323m002n649m722m944p765r166
57907A006785p199n654o827p602o131n556p368p795m772k154k989m747n000n753
57893I27238q196r182p022n078n743o413n119m284n197m750j551O87j44n66J563
57878H66243K443n25l253j992j58k255o076p012n811o011p344p404o869p784r318
57863G96874r708r779j0431r645n892j580N51J362K386K635J838K862O893J0110
57849G78476R383P495Q326J0496J0532R055Q818R281P989N137K453k87l725o037
57835H57392n534m116m431n700n867n589o556p925q027p671q425r440q994p403
$$ plain form
57938 1040117 1038197 1036775 1036807 1039923 1043993 1045854 1046388 1048236 1050622 1051125 1050441 1050655 1050852 1049148 1047068 1047321
57922 1047321 1049101 1049963 1050254 1051316 1051594 1049171 1045891 1044356 1043033 1039031 1033382 1028660 1023716 1015951 1006785
57907 1006785 999586 993932 987105 979503 973372 967816 960448 952653 947881 945727 942738 937991 932991 927238
57893 927238 919042 909860 902838 897760 892017 885604 880485 876201 871004 866254 864703 865390 865246 864680 866243
57878 866243 868686 868161 864908 862916 862758 860503 854427 847415 841604 835593 828249 820845 813976 806192 796874
57863 796874 787166 777387 766956 757311 751419 749839 750390 751752 754138 756773 758611 761473 768366 778476
57849 778476 787859 795354 803680 814176 824708 833763 842581 851862 859851 864988 867441 867154 863429 857392
57835 857392 851858 847742 843311 837611 831744 826155 819599 811674 803647 795976 787551 778111 769117 761714
57821G61714n726l708j545j153l102m791m277l171l182k832n27K148L304L976
57807G37128N497O580O058N486N913N415K997J498K849M007J719j847k809k056
57793G78435l160o054p611p034o307o417o901p952r590j0169q824p665q497r512
57779F72742q454o726o666p062n510l296l659o556r112j0123j0370r770p903o295
57765E71240o653p788p576o756p451r186r874r655j0279j1475j1284r386p138
57752D56739m981k502l16O42Q34J031P99J75Q94L581N747N315M102M825O789P657
57736D91331P570Q127R060R196Q994Q969P590M077J099J038J851O64q05Q47M295
57721E63903N003K233n37j535k320l644m366m661o001p573o735l568j323j756
$$ plain form
57821 761714 755988 752280 750735 749582 746480 741689 737412 734241 731059 728227 727700 729848 733152 737128
57807 737128 742625 749205 755263 760749 766662 772077 775074 776572 779421 783428 785147 783300 780491 778435
57793 778435 775275 769221 761610 754576 748269 741852 734951 726999 717409 707240 698416 690751 682254 672742
57779 672742 664288 657562 650896 643834 638324 635028 631369 624813 615701 605578 595208 585438 577535 571240
57765 571240 564587 556799 549223 542467 535016 525830 515956 506301 496022 484547 473263 463877 456739
57752 456739 451758 449256 448940 449582 450416 451447 452246 452421 453315 456896 462643 467958 472060 476885 483674 491331
57736 491331 498901 507028 516088 525284 534278 543247 550837 554914 556013 557051 558902 559566 558761 559608 563903
57721 563903 568906 571139 570602 569067 566747 563103 558737 554076 548075 540502 533767 530199 528876 527120
57707E27120l275m087m012k881k89K555L602K965K679L471M326M937N819O335
57693E49265N486M425N208P259Q108P387P048P712P975P407P133P248O600N518
57679F43779N737P216P809O647N376N529O930R055J1637J3712J4187J3605J3411
57666G64630J3679J3539J3454J4646J6679J8071J9065K1273K4678K7505K9056
57655I76275L0235L1374L1941L2288L3424L5113L6409L7756M0326M3665M6364
57644A375170M8584N1537N5022N8088O1588O7252P4601Q1566Q7762R4421J01552
57633B157143J08262J15425J24930J36404J48011J60286J75674J94056K12222
57624C532413K28495K44628K62302K80579K97612L12108L22229L25522L20761
$$ plain form
57707 527120 523845 519758 515746 512865 512576 515131 518733 521698 524377 527848 532174 537111 542930 549265
57693 549265 554751 559176 564384 571643 579751 587138 594186 601898 609873 617280 624413 631661 638261 643779
57679 643779 649516 656732 664541 671188 676564 682093 689023 698078 709715 723427 737614 751219 764630
57666 764630 778309 791848 805302 819948 836627 854698 873763 895036 919714 947219 976275
57655 976275 1006510 1037884 1069825 1102113 1135537 1170650 1207059 1244815 1285141 1328806 1375170
57644 1375170 1423754 1475291 1530313 1588401 1649989 1717241 1791842 1873408 1961170 2055591 2157143
57633 2157143 2265405 2380830 2505760 2642164 2790175 2950461 3126135 3320191 3532413
57624 3532413 3760908 4005536 4267838 4548417 4846029 5158137 5480366 5805888 6126649
57615F126649L07885K86017K54062K13556J68448J21929P5687L1641r343n0776
57605G525755r8735j54900k13530k65943l05754l29818l37815l32704l19149l00108
57595D867299k76468k50119k24504k01339j79509j58172j38504j21279j05265
57586C212140q9403p4510o1546n0000l9017k8633j9051r941q66Q674J9298L0463
57574B897608M0062M7413N5497O7427Q1762R4714J06141J19107J33934J47428
57564C791093J58667J70697J85007J98650K08865K16520K22585K24775K20191
57555E597050K08230J88385J58270J16829O7354J4807l7918q9071j35774j75216
57545E912946k06584k29874k44500k50938k51814k49513k44250k35887k25600
$$ plain form
57615 6126649 6434534 6720551 6974613 7188169 7356617 7478546 7554233 7585874 7576531 7525755
57605 7525755 7427020 7272120 7058590 6792647 6486893 6157075 5819260 5486556 5167407 4867299
57595 4867299 4590831 4340712 4116208 3914869 3735360 3577188 3438684 3317405 3212140
57586 3212140 3122737 3048227 2986681 2936681 2897664 2869031 2849980 2840039 2839173 2847847 2867145 2897608
57574 2897608 2937670 2985083 3040580 3108007 3189769 3284483 3390624 3509731 3643665 3791093
57564 3791093 3949760 4120457 4305464 4504114 4712979 4929499 5152084 5376859 5597050
57555 5597050 5805280 5993665 6151935 6268764 6336118 6350925 6313007 6223936 6088162 5912946
57545 5912946 5706362 5476488 5231988 4981050 4729236 4479723 4235473 3999586 3773986
57536C773986k14128k00705j85513j71018j58882j47677j35772j24291j14936
57527B321064j06835r8098q8805q0031p1562o3030n5898n1664m9273m6647m3627
57516A565594m1088l8302l3946k8902k5365k3493k1350j8121j5134j3551j2849
57505A293493j1996j0657q855o398l145N21L617N117N134N492P980J2109J5791
57492A308203J8258K0588K3225K5244K6750K9614L4517L9347M2094M3606M5991
57481A657437M9936N5101O1496O8763P5544Q1244Q7141R4330J02150J10109J19507
57470B562758J31204J43279J53123J60672J67620J74451J80215J84059J84776
57461D042157J79751J66600J45459J17983Q4941M6670N303l5570p3373j07101
$$ plain form
57536 3773986 3559858 3359153 3173640 3002622 2843740 2696063 2560291 2436000 2321064
57527 2321064 2214229 2116131 2027326 1947295 1875733 1812703 1756805 1705141 1655868 1609221 1565594
57516 1565594 1524506 1486204 1452258 1423356 1397991 1374498 1353148 1335027 1319893 1306342 1293493
57505 1293493 1281497 1270840 1261985 1255587 1252442 1252963 1256580 1261697 1266831 1272323 1280303 1292412 1308203
57492 1308203 1326461 1347049 1370274 1395518 1422268 1451882 1486399 1525746 1567840 1611446 1657437
57481 1657437 1707373 1762474 1823970 1892733 1968277 2049521 2136662 2230992 2333142 2443251 2562758
57470 2562758 2693962 2837241 2990364 3151036 3318656 3493107 3673322 3857381 4042157
57461 4042157 4221908 4388508 4533967 4651950 4736891 4783561 4788864 4753294 4679921 4572820
57451D572820j35867j58447j74232j83367j86173j83433j76824j68071j58113
57442C048293j47637j37451j27478j16566j04372r2398q2084p3202o5130n8168
57432B043807n2102m5139l6220k7023j9688j3672p065j9N617R578J3729J9403
57420A891206K6189L3357M0699M7878N4477O0906O8053P5994Q4121R2286J00841
57409B576007J09778J18902J28488J38747J48847J57210J62474J63629J59981
57400C864063J51543J38526J19836R3357N8691J8468k3839o5893j05385j39050
57390D110317j64841j83625j96991k04604k05614k01253j93924j84787j74279
57381B400399j63773j54336j44863j33886j22482j12847j04680r5735q5728p7047
$$ plain form
57451 4572820 4436953 4278506 4104274 3920907 3734734 3551301 3374477 3206406 3048293
57442 3048293 2900656 2763205 2635727 2519161 2414789 2322391 2240307 2167105 2101975 2043807
57432 2043807 1991705 1946566 1910346 1883323 1863635 1849963 1842898 1842879 1848496 1858074 1871803 1891206
57420 1891206 1917395 1950752 1991451 2039329 2093806 2154712 2222765 2298759 2382880 2475166 2576007
57409 2576007 2685785 2804687 2933175 3071922 3220769 3377979 3540453 3704082 3864063
57400 3864063 4015606 4154132 4273968 4367325 4426016 4444484 4420645 4354752 4249367 4110317
57390 4110317 3945476 3761851 3564860 3360256 3154642 2953389 2759465 2574678 2400399
57381 2400399 2236626 2082290 1937427 1803541 1681059 1568212 1463532 1367797 1282069 1205022
57371A205022p1265o7286o3178n8074n2056m5977m1431l9269l8138l6014l2917
57360F59417l0475k9128k7635k5201k2324j9566j7291j6296j6907j7638j6606
57349D20350j4171j2397j2096j2187j1772j0891r522p723o531o751p195o265m791
57336B98058m734n488m459j445P63P81M98J452K348J861J277K213L724L891K836
57321C03576K126K139J966J297P91Q75J330J877K383K755L177L986M954N288M668
57306C43188L722L200L353M188N533O717P054O636N892M659K879J831L053N932
57292D07837Q118Q508Q117P749O798N148M283N220O681O605M597J974L09O94L306
57277D85944O778Q873Q716P739P800R173J0856J1956J2175J1872J2080J3507J5051
$$ plain form
57371 1205022 1133757 1066471 1003293 945219 893163 847186 805755 766486 728348 692334 659417
57360 659417 628942 599814 572179 546978 524654 505088 487797 471501 454594 436956 420350
57349 420350 406179 393782 381686 369499 357727 346836 337314 329591 323060 316309 309114 302849 298058
57336 298058 293324 287836 283377 281932 282695 283476 283974 285426 287774 289635 290912 293125 296849 300740 303576
57321 303576 305702 307841 309807 311104 311895 312770 314100 315977 318360 321115 324292 328278 333232 338520 343188
57306 343188 346910 350110 353463 357651 363184 369901 376955 383591 389483 394142 397021 398852 401905 407837
57292 407837 415955 424463 432580 440329 447127 452275 456558 461778 468459 475064 479661 481635 481944 482638 485944
57277 485944 492722 501595 510311 518050 525850 535023 545879 557835 570010 581882 593962 607469 622520
57264F22520J4533J1576Q529P702Q842J0233J1087J1574J1552J0875J0488J1663
57252G51174J4090J5814J5439J3740J2712J3389J4930J5961J6356J7185J8908
57241I19698K0656K1686K2487K3495K3958K3442K3449K5610K9018L1558L3289
57230A198346L6025L9754M2409M3636M5746M9923N4303N7319O0283O4540O8317
57219A760601O8886O6444O3312O0249N5825M8833L9364K7864J4956K045r359j8938
57207B180082k7226l4430m0470m5550m9488n1216n0102m7177m3797l9813l4394
57196A716419k8085k2555j8545j5401j2459r728p302n139l286j584N16L079N148
57183A601078N883N722N600N699N951O863Q641J0141J0152R270R197J0505J2335
$$ plain form
57264 622520 637053 648629 657158 664860 673702 683935 695022 706596 718148 729023 739511 751174
57252 751174 765264 781078 796517 810257 822969 836358 851288 867249 883605 900790 919698
57241 919698 940354 962040 984527 1008022 1031980 1055422 1078871 1104481 1133499 1165057 1198346
57230 1198346 1234371 1274125 1316534 1360170 1405916 1455839 1510142 1567461 1627744 1692284 1760601
57219 1760601 1829487 1895931 1959243 2019492 2075317 2124150 2163514 2191378 2206334 2208379 2199020 2180082
57207 2180082 2152856 2118426 2077956 2032406 1982918 1931702 1881600 1834423 1790626 1750813 1716419
57196 1716419 1688334 1665779 1647234 1631833 1619374 1609646 1602344 1597205 1593919 1592335 1592851 1595930 1601078
57183 1601078 1606961 1612683 1618283 1623982 1629933 1636796 1645437 1655578 1665730 1675000 1684197 1694702 1707037
57170A707037J3934J5139J5786J5943J6506J8264K0567K2269K3644K5967K9319
57159A924375L2335L4157L5219L6034L6634L7357L8771M0511M1517M1695M2106
57148B340711M3161M3947M3957M4217M5900M8779N1824N4569N7138N9467O1285
57137B894955O2498O3156O3215O2728O1997O1434O1439O2451O4645O7528P0180
57126C596226P1960P2739P2568P1518O9683O6996O3354N9331N6336N5399N6149
57115D312259N7528N9042O0365O0358N7745N2706M6641M0260L2938K4115J4424
57104D818381N190k486q114j1926j4706j6948j8370j8654j8171j7328j5932j4085
57092D666851j2862j2856j3007j2521j3134j7392k5151l4255m4568n8472p6676
$$ plain form
57170 1707037 1720971 1736110 1751896 1767839 1784345 1802609 1823176 1845445 1869089 1895056 1924375
57159 1924375 1956710 1990867 2026086 2062120 2098754 2136111 2174882 2215393 2256910 2298605 2340711
57148 2340711 2383872 2427819 2471776 2515993 2561893 2610672 2662496 2717065 2774203 2833670 2894955
57137 2894955 2957453 3020609 3083824 3146552 3208549 3269983 3331422 3393873 3458518 3526046 3596226
57126 3596226 3668186 3740925 3813493 3885011 3954694 4021690 4085044 4144375 4200711 4256110 4312259
57115 4312259 4369787 4428829 4489194 4549552 4607297 4660003 4706644 4746904 4779842 4803957 4818381
57104 4818381 4823571 4821085 4812971 4801045 4786339 4769391 4751021 4732367 4714196 4696868 4680936 4666851
57092 4666851 4653989 4641133 4628126 4615605 4602471 4585079 4559928 4525673 4481105 4422633 4345957
57081D345957r6176j13800j29806j46513j64955j84344k03661k22353k40331k58307
57071B585711k77412k97834l18741l39959l62436l86712A89927b51760m76904
57062g28664n20569n72141o30047o93820p63537q38971r20451j009249j106206
57053g783655j211561j326744j454373j596020j752712j928633k131353k367466
57045b1552517k641553k961182l338801l786233m311412m923498n636652o464725
57037e5616573p416202q497649r715524j1067304j2534696j4091822j5714723
57030a34654493j7374069j9021975k0595140k2032533k3297025k4404424k5436947
57023b86816606k6464302k7350087k7604070k6513362k3550826j8732876j2602873
$$ plain form
57081 4345957 4249781 4135981 4006175 3859662 3694707 3510363 3306702 3084349 2844018 2585711
57071 2585711 2308299 2010465 1691724 1351765 989329 602617 189927 -251760 -728664
57062 -728664 -1249233 -1821374 -2451421 -3145241 -3908778 -4747749 -5668200 -6677449 -7783655
57053 -7783655 -8995216 -10321960 -11776333 -13372353 -15125065 -17053698 -19185051 -21552517
57045 -21552517 -24194070 -27155252 -30494053 -34280286 -38591698 -43515196 -49151848 -55616573
57037 -55616573 -63032775 -71530424 -81245948 -92313252 -104847948 -118939770 -134654493
57030 -134654493 -152028562 -171050537 -191645677 -213678210 -236975235 -261379659 -286816606
57023 -286816606 -313280908 -340630995 -368235065 -394748427 -418299253 -437032129 -449635002
57016d49635002n891596P95822P040698J2526158J7018275K0436677K2878677
57009c74830291K4531003K5553202K6033526K6018358K5552450K4692084K3499404
57002a98950264K2037846K0375425J8589146J6760663J4962607J3247314J1647679
56995h1329584J0184650Q870595P708567O694078N818482N068930M427472L875093
56987b8681717L397399K984575K627643K318446K052221J826074J634710J470501
56979a0370148J327226J200831J087276R83152Q88106Q03278P27444O57798N93981
56970b101056N37668M88049M41457b37873A15218L13787K77169K43400K15061
56961A164635J93997J79109J68273J60061J52774J44505J35409J27782J22954
$$ plain form
57016 -449635002 -455526598 -454730776 -447690078 -435163920 -418145645 -397708968 -374830291
57009 -374830291 -350299288 -324746086 -298712560 -272694202 -247141752 -222449668 -198950264
57002 -198950264 -176912418 -156536993 -137947847 -121187184 -106224577 -92977263 -81329584
56995 -81329584 -71144934 -62274339 -54565772 -47871694 -42053212 -36984282 -32556810 -28681717
56987 -28681717 -25284318 -22299743 -19672100 -17353654 -15301433 -13475359 -11840649 -10370148
56979 -10370148 -9042922 -7842091 -6754815 -5771663 -4883557 -4080279 -3352835 -2695037 -2101056
56970 -2101056 -1563388 -1075339 -633882 -237873 115218 429005 706174 949574 1164635
56961 1164635 1358632 1537741 1706014 1866075 2018849 2163354 2298763 2426545 2549499
56952B549499J20069J18385J18421J20049J21724J22278J21361J17876J10666
56943C620328J01275R3522R0269R3319J05148J24252J36950J20601O1906k9071
56933D518499j26188k06940k62985k95785l09203l07281k94457k74629k50560
56924B190471k24617j99142j76006j56554j41545j30403j21316j12936j05312
56915H22640r8436r1291q3260p5067o7182n8733m9328m0396l3150k6779k0321
56904A78697j4875j1850j0323q170m867j160K956P645J1377J1893Q733L175l570
56891A69661j0474j5959j9223k1582k4466k6769B4925A894a7271j5631j1646p003
56879e1551k511J730O265J0482J3108g831I334K1395K5837K8944L0070K8183K1969
$$ plain form
56952 2549499 2669568 2787953 2906374 3026423 3148147 3270425 3391786 3509662 3620328
56943 3620328 3721603 3815125 3905394 3998713 4103861 4228113 4365063 4485664 4547570 4518499
56933 4518499 4392311 4185371 3922386 3626601 3317398 3010117 2715660 2441031 2190471
56924 2190471 1965854 1766712 1590706 1434152 1292607 1162204 1040888 927952 822640
56915 822640 724204 632913 549653 474586 407404 348671 299343 258947 225797 199018 178697
56904 178697 163822 151972 141649 133479 128612 127452 130408 138053 149430 161323 170056 173231 169661
56891 169661 159187 143228 124005 102423 77957 51188 24925 1894 -17271 -32902 -44548 -51551
56879 -51551 -54062 -52332 -46067 -35585 -22477 -7831 9334 30729 56566 85510 115580 143763 165732
56866A65732J1861K84j0613j9854k6313k8800k8075k6733A1306a4042k3083j9979
56854e7104j7084j4444j1925r893q175n861l170j849k510l063j365J712L547L330
56840a27854K712L288N031P297J0025J3329J6717J9433K1500d637B2685L1176
56828E3861L4113L5968L8018M0792M2516M0670L4688K6111J6667P390p72o954
56816C63068j1003j3054j2800j0346p376n788n178l259J034O337J0939J4487J7380
56803C44441K0102K3641K8956L5198L9662M0149L6467K9452J9934R157j276j0547
56791F15336j8498k4083k5534k2827j8281j3820r109l394K504P501J2254J8180
56779E20229K5289L2420L8995M5153N0745N5488N9494O2279O1452N3896L8600
$$ plain form
56866 165732 177593 177877 167264 147410 121097 92297 64222 37489 11306 -14042 -37125 -57104
56854 -57104 -74188 -88632 -100557 -110450 -118625 -124486 -127656 -129505 -132015 -135078 -136443 -134731 -131184 -127854
56840 -127854 -125142 -121854 -116823 -109526 -99501 -86172 -69455 -50022 -28522 -4637 22685 53861
56828 53861 87974 123942 161960 202752 245268 285938 320626 346737 363404 370794 370022 363068
56816 363068 352065 339011 326211 315865 308489 302701 297523 294264 295298 301635 312574 327061 344441
56803 344441 364543 388184 417140 452338 492000 532149 568616 598068 618002 627159 625883 615336
56791 615336 596838 572755 547221 524394 506113 492293 483184 479790 482294 489795 502049 520229
56779 520229 545518 577938 616933 662086 712831 768319 827813 890092 951544 1005440 1044040
56768A044040J7837m248k3625l7661m5823m9489n0449m9341m5711l9389l1409
56757F84732k3539j6994j1420n292K177R700J5275J8925K3011K9431L7399M4296
56745H07701M7555M5073L5183J7996l178k2868l6565m3160m4856m4854m4655m3260
56733F70112l9222l3061k6921k2060j7830j3290q518l986K25M088P551J1224J5935
56720E44247K0916K3598K1949J6134P435l123j4109k3105k8255k9893k9671k8730
56708D77393k7468k6131k4497k1825j8208j5233j4038j3484j1632q515o005n116
56696B85241m858l912k229p61k80p73j499j598r86m75p37j474j909j731j162n78
56680B60279m28j060k237l225l599l567l350l047l093l956n130n479m902m421
$$ plain form
56768 1044040 1061877 1057629 1034004 996343 950520 901031 850582 801241 755530 716141 684732
56757 684732 661193 644199 632779 627487 629664 639364 654639 673564 696575 726006 763405 807701
56745 807701 855256 900329 935512 953508 950330 927462 890897 847737 802881 758027 713372 670112
56733 670112 630890 597829 570908 548848 531018 517728 509210 505224 505449 509537 517088 528312 544247
56720 544247 565163 588761 610710 626844 634279 631156 617047 593942 565687 535794 506123 477393
56708 477393 449925 423794 399297 377472 359264 344031 329993 316509 304877 296362 290357 285241
56696 285241 280383 276471 274242 273481 273201 272428 270929 269331 268345 267870 267133 265659 263750 262019 260857 260279
56680 260279 259851 258791 256554 253329 249730 246163 242813 239766 236673 232717 227587 222108 217206 212785
56666B12785m341l731k357j509j951k504j921q41n41q81r70r36j452k244k514
56651A84092k246j833j060K48J327J580J782K675L313K468R97P74J686J766L01
56636A97870j170j318p49o35j095j591j930k129j839n25J856M310N070L057m45
56621A98737k510j635P19K372L057L692M261M120L622L630L850L332K279J639
56607B31165J276K49j233j982j873j940k311j877l46R86J063L58j43j75j0Om17
56590B22796j033r44Q1N98p59k895l412k071j112j820k764k239p18K47L15L69
56574B04639R07J386R11q27l016m110l303j485j14M87Q62R77L68n55p67j88L33
56557A96505M52M98L00n46j333p07J316L266M240M479L952K191j14j176m18Q94
$$ plain form
56666 212785 208444 204713 202356 200847 198896 196392 194471 193630 193089 192208 191238 190302 188850 186606 184092
56651 184092 181846 180013 178953 179201 180528 182108 183890 186565 189878 192346 193343 194117 195803 197569 197870
56636 197870 196700 195382 194633 193998 192903 191312 189382 187253 185414 184889 186745 191055 196125 199182 198737
56621 198737 196227 194592 195311 197683 200740 204432 208693 212813 216435 220065 223915 227247 229526 231165
56607 231165 232441 232690 231457 229475 227602 225662 223351 221474 221128 222114 223177 223535 223392 223217 223207 223213 222796
56590 222796 221763 220819 220900 221498 220739 217844 214432 212361 211249 209429 206665 204426 203708 203955 204270 204639
56574 204639 205546 206932 207843 207016 204000 199890 196587 195102 194988 195475 196337 197314 197682 197127 196360 196172 196505
56557 196505 196957 197455 197755 197209 195876 195169 196485 199751 203991 208470 212422 214613 214499 213323 212905 213799
56541B13799J781K639L631L740K474J023O89J295K009K600K993K682J529K49n06
56526B42627p79n43O09K476L980M379L828K506M69j298j198Q89L185M374N091
56511B70595O280P461P623O845N976N488N425N716O017N904N600N677N885N407
56497C55899M377L807L833L637L329L975N256N202L261J531J662K381J674j77
56483C99647j486j778j732j684j854l030n240o571n259k408r66k152m480o072
56469C54935o517o351n985n495m772l646k203q55R5N17J00j361l031l409k174
56454C09848p44m05p78o98J99J460K477K552J159j086k542k264r85k0R1m76j266
56437C06522j587j147q67j844l380l535j982n32k77j47P87J491P94n52r79p5J685
$$ plain form
56541 213799 215580 218219 221850 225590 228064 229087 229776 231071 233080 235680 238673 241355 242884 243133 242627
56526 242627 241848 241305 241914 244390 248370 252749 256577 259083 259552 258254 257056 257945 261130 265504 270595
56511 270595 276875 284336 291959 298804 304780 310268 315693 321409 327426 333330 338930 344607 350492 355899
56497 355899 360276 364083 367916 371553 374882 378857 384113 389315 392576 394107 395769 398150 399824 399647
56483 399647 398161 396383 394651 392967 391113 388083 382843 376272 371013 368605 367639 365487 361007 354935
56469 354935 348418 342067 336082 330587 325815 322169 319966 319111 319206 319723 319823 318462 315431 312022 309848
56454 309848 309104 308699 307921 307223 307422 308882 311359 313911 315070 313984 311442 309178 308193 308173 308264 307788 306522
56437 306522 304935 303788 302921 301077 297697 294162 292180 291648 291371 291224 292011 293502 294296 293744 292765 292690 294375
56420B94375L850N518N441L853K763L265L890K967J209M80J227K620M053N095
56406C40606N055L987L108L111L279L215L841N345N973M599K867K890M155M704
56392C96735M178L594L107K055O20l25n31k22N73J408J250R3n21K21J073J004
56376D14312Q44J140M20k209m681m711l303k940l641l588k471j545j165q22p71
56361C84869j304j319Q6J624J713J088J097R48n63k053j582l85j015k829l100
56346C77275j955k059l555l472o70K410L686L789L568K562J007N06J424K006J063
56331C87585n53j770k338j740N06K971L426K220K007L523M502L666K866L862N565
56316D16298O036N218M183L282K438J868J507R09L53P08J882K829L240L565L397
$$ plain form
56420 294375 298225 303743 309184 313037 315800 319065 322955 325922 327131 327611 328838 331458 335511 340606
56406 340606 345661 349648 352756 355867 359146 362361 366202 371547 377520 382119 384986 387876 392031 396735
56392 396735 400913 404507 407614 409669 410289 409964 409433 409211 409784 411192 412442 412535 412014 412235 413308 414312
56376 414312 415156 416296 416716 414507 409826 405115 401812 398872 395231 391643 389172 387627 386462 385640 384869
56361 384869 383565 382246 382332 383956 385669 386757 387854 388802 388239 386186 384604 384219 383204 380375 377275
56346 377275 375320 373261 369706 366234 365564 367974 371660 375449 379017 381579 382586 383092 384516 386522 387585
56331 387585 387032 385262 382924 381184 381690 384661 388087 390307 392314 395837 400339 404005 406871 410733 416298
56316 416298 422334 427552 431735 435017 437455 439323 440830 441739 442092 442800 444682 447511 450751 454316 457713
56301D57713J902M3O4K283M467N028M840N196N920O248N956N104M050L900N277
56286E17991O746O272M131K402J844J593J672L063N265O484O627P366R001J0059
56272E90516J0408J1725J4100J5170J3773J1798J1356J2353J3842J5430J6447
56261G36918J6100J5227J5755J7650J8678J7771J6184J4993J3927J3240J3909
56250I10352J5353J5629J4506J3551J2801J0601P253N409N932O723O613O896P985
56237A039604Q282P706Q555J1310J3457J4141J5959K0024K3384K4058K4705K8159
56225A239344L2822L5910L8188M1772M5947M8704N0464N2876N5893N9038O3627
56214A764585P0675P8381Q4633R0275R7203J05130J13100J22286J34155J47425
$$ plain form
56301 457713 459615 459658 459722 462005 466472 471500 476340 481536 487456 493704 499660 504764 508814 512714 517991
56286 517991 524737 531009 535140 537542 539386 540979 542651 545714 550979 557463 564090 571456 580457 590516
56272 590516 600924 612649 626749 641919 655692 667490 678846 691199 705041 720471 736918
56261 736918 753018 768245 784000 801650 820328 838099 854283 869276 883203 896443 910352
56250 910352 925705 941334 955840 969391 982192 992793 1000046 1005455 1011387 1018110 1024723 1031619 1039604
56237 1039604 1047886 1055592 1064147 1075457 1088914 1103055 1119014 1139038 1162422 1186480 1211185 1239344
56225 1239344 1272166 1308076 1346264 1388036 1433983 1482687 1533151 1586027 1641920 1700958 1764585
56214 1764585 1835260 1913641 1998274 2088549 2185752 2290882 2403982 2526268 2660423 2807848
56204B807848J59952J72238J86129K01357K16319K31156K47170K63960K79710
56195D765839K93449L04829L12752L16558L17433L16271L11080K98660K78046
56186G514917K50435K16991J78901J38390R7511N6550J5440k4195n9963r0737
56176H294240j16431j37015j53043j65806j75770j82361j86230j89726j94011
56167F793847j98004k01305k05539k11207k16061k18466k19772k21321k21884
56158D880288k20178k17142k13442k07582j99051j90369j83303j75873j66051
56149C107297j55509j46523j37900j27466j16095j05806r6253q6639p8762p4233
56139A982111p0772o5139n7980n2047m7424m2400l7484l4559l3155l1165k8294
$$ plain form
56204 2807848 2967800 3140038 3326167 3527524 3743843 3974999 4222169 4486129 4765839
56195 4765839 5059288 5364117 5676869 5993427 6310860 6627131 6938211 7236871 7514917
56186 7514917 7765352 7982343 8161244 8299634 8397145 8453695 8469135 8444940 8384977 8294240
56176 8294240 8177809 8040794 7887751 7721945 7546175 7363814 7177584 6987858 6793847
56167 6793847 6595843 6394538 6188999 5977792 5761731 5543265 5323493 5102172 4880288
56158 4880288 4660110 4442968 4229526 4021944 3822893 3632524 3449221 3273348 3107297
56149 3107297 2951788 2805265 2667365 2539899 2423804 2317998 2221745 2135106 2056344 1982111
56139 1982111 1911339 1846200 1788220 1736173 1688749 1646349 1608865 1574306 1541151 1509986 1481692
56128A481692k5582k2801j9372j6387j4681j2569q712n206m385m375j719L154
56116A349057O998Q785R900J0660J0576J1018J3742J7552J9787K0236K0461K0440
56104A519212J9192J7367J6035J4305J1287Q780Q689R567R098Q059Q283Q790P893
56091A666557P105Q785J1818J3937J6433K1987K9516L5885M1285M8204N6416O3808
56079B021736P1111Q0967R3118J04945J15889J26914J36404J41022J39820J33750
56069C165676J22710J07461R2746Q3337P7927P1543O2677N3262M3131L0011J4377
56058C924858p97j4501k7280l7542m3472m7886n6012o8810q2864r5791j07081
56047C342822j15047j18105j18013j16875j12402j01567q7293p5553o7074n7992
$$ plain form
56128 1481692 1456110 1433309 1413937 1397550 1382869 1370300 1361588 1356382 1351997 1347622 1345903 1349057
56116 1349057 1356055 1364840 1374740 1385400 1395976 1406994 1420736 1438288 1458075 1478311 1498772 1519212
56104 1519212 1538404 1555771 1571806 1586111 1597398 1606178 1614867 1624434 1633532 1641591 1649874 1658664 1666557
56091 1666557 1673662 1682447 1694265 1708202 1724635 1746622 1776138 1812023 1853308 1901512 1957928 2021736
56079 2021736 2092847 2173814 2266932 2371877 2487766 2614680 2751084 2892106 3031926 3165676
56069 3165676 3288386 3395847 3488593 3571930 3649857 3721400 3784077 3837339 3880470 3910481 3924858
56058 3924858 3924061 3909560 3882280 3844738 3801266 3753380 3697368 3628558 3545694 3449903 3342822
56047 3342822 3227775 3109670 2991657 2874782 2762380 2660813 2573520 2497967 2430893 2372901
56037B372901m7574l8980l2999k7427k2284j9686j8920j7446j6065j7198j9028
56026B095294j7676j4282j3301j4470j3392r636p116o439m003Q16M429N689P447
56013B013360J0843J4007J6605J9881K2276K1055J7967J7294J8932J9597J9726
56002B211543K2354K6292K7692K7390K9282L2491L2923L1590L3184L7205L8906
55991B550852L8345L9881M3324M4345M3242M4377M7499M8715M9210N3450N9579
55980C062819O1768O1369O5003P2141P5918P6159P9679Q7199R2174R3690R8123
55969C926042J06452J12254J14324J18916J27231J33058J35341J40579J49973
55960E064170J56749J59178J63825J72858J80704J86265J95665K09772K21799
$$ plain form
56037 2372901 2325327 2286347 2253348 2225921 2203637 2183951 2165031 2147585 2131520 2114322 2095294
56026 2095294 2077618 2063336 2050035 2035565 2022173 2012537 2005421 1998982 1994979 1995795 2000224 2005913 2013360
56013 2013360 2024203 2038210 2054815 2074696 2096972 2118027 2135994 2153288 2172220 2191817 2211543
56002 2211543 2233897 2260189 2287881 2315271 2344553 2377044 2409967 2441557 2474741 2511946 2550852
55991 2550852 2589197 2629078 2672402 2716747 2759989 2804366 2851865 2900580 2949790 3003240 3062819
55980 3062819 3124587 3185956 3250959 3323100 3399018 3475177 3554856 3642055 3734229 3827919 3926042
55969 3926042 4032494 4144748 4259072 4377988 4505219 4638277 4773618 4914197 5064170
55960 5064170 5220919 5380097 5543922 5716780 5897484 6083749 6279414 6489186 6710985
55951F710985K30287K41465K56079K67646K76384K90460L10495L27867L41459
55942I253127L60366L86500M10856M30965M55264M85775N13764N37320N65609
55933A3399546O00745O33645O62950O99222P44950P89756Q30654Q76694R28458
55924B0166620R75224J018506J075116J150096J230661J313480J411689J526983
55916B9868375J642684J753614J874366K009180K145278K286527K460049K677328
55908D6717401K923868L199682L531241L929659M380152M889959N500999O236596
55900H1309557P085641Q058515R198893J0513642J1955542J3508199J5221283
55893A56851272J7134478J9256668K1659227K4476813K7753051L1395418L5270790
$$ plain form
55951 6710985 6941272 7182737 7438816 7706462 7982846 8273306 8583801 8911668 9253127
55942 9253127 9613493 9999993 10410849 10841814 11297078 11782853 12296617 12833937 13399546
55933 13399546 14000291 14633936 15296886 15996108 16741058 17530814 18361468 19238162 20166620
55924 20166620 21141844 22160350 23235466 24385562 25616223 26929703 28341392 29868375
55916 29868375 31511059 33264673 35139039 37148219 39293497 41580024 44040073 46717401
55908 46717401 49641269 52840951 56372192 60301851 64682003 69571962 75072961 81309557
55900 81309557 88395198 96453713 105652606 116166248 128121790 141629989 156851272
55893 156851272 173985750 193242418 214901645 239378458 267131509 298526927 333797717
55886C33797717L8974223M1175215L9499256L1845854J8326906J798739j3785346
55879D91632564k5647919l3084113l6757211l7665532l6686600l4530382l1712247
55872B55548560k8558100k5315819k2218808j9416031j6927866j4727064j2812021
55865A15572851j1175071r768858q550639p515464o653840n920265n273636m709747
55857E6005331m227618l801255l410895l067979k783341k539837k318396k122572
55849C1733438j956081j802981j651539j513676j401041j303785j210518j127450
55841A9766367j060388r98369r32142q69780q18268p68209p12073o59625o19979
55832A2327534n85167n46127n08803m80004m52745m19932l88405l65711l46296
$$ plain form
55886 333797717 372771940 413947155 453446411 485292265 503619171 505417910 491632564
55879 491632564 465984645 432900532 396143321 358477789 321791189 287260807 255548560
55872 255548560 226990460 201674641 179455833 160039802 143111936 128384872 115572851
55865 115572851 104397780 94628922 86078283 78562819 71908979 65988714 60715078 56005331
55857 56005331 51777713 47976458 44565563 41497584 38714243 36174406 33856010 31733438
55849 31733438 29777357 27974376 26322837 24809161 23408120 22104335 20893817 19766367
55841 19766367 18705979 17707610 16775468 15905688 15087420 14319211 13607138 12947513 12327534
55832 12327534 11742367 11196240 10687437 10207433 9754688 9334756 8946351 8580640 8234344
55823H234344l23649l03190k90633k79954k64854k50296k41377k32588k19099
55814E828704k07001k01594j96952j87496j78502j74766j70387j60464j51560
55805D199982j49479j47581j38499j27230j21281j17454j09640j00678r5092q8554
55795C004494p5962o2572n6331n5814n5617n6890o2687o9231p1248p0330o9765
55784B298047o7310o0891n4945n3132n1431m6048m1166m0921m0930l6120l0030
55773A775123k7918k7440k4814k3485k7702l3619l5657l5909l8523m0611l7833
55762A421612l3595l3549l5673l4655l1595l0665l0423k7052k2368k0330j9357
55751A102350j6115j3104j4259j6681j4897j0209p882p906o454l799l179l885
$$ plain form
55823 8234344 7910695 7607505 7316872 7036918 6772064 6521768 6280391 6047803 5828704
55814 5828704 5621703 5420109 5223157 5035661 4857159 4682393 4512006 4351542 4199982
55805 4199982 4050503 3902922 3764423 3637193 3515912 3398458 3288818 3188140 3093048 3004494
55795 3004494 2928532 2865960 2809629 2753815 2698198 2641308 2578621 2509390 2438142 2367812 2298047
55784 2298047 2230737 2169846 2114901 2061769 2010338 1964290 1923124 1882203 1841273 1805153 1775123
55773 1775123 1747205 1719765 1694951 1671466 1643764 1610145 1574488 1538579 1500056 1459445 1421612
55762 1421612 1388017 1354468 1318795 1284140 1252545 1221880 1191457 1164405 1142037 1121707 1102350
55751 1102350 1086235 1073131 1058872 1042191 1027294 1017085 1009203 1001297 994843 991044 987865 983980
55739I83980k701l06J68j067j903l056n736p513o351n454q260j1951j2146j0594
55725I07110j1657j4334j4497j2330j0924r998p447m792m837o132n872n826r357
55712G89107j4872j8259j9549k1246k2520k1117j8644j7909j7269j3829r884r722
55700E84287j2076j2344j0546j0480j2390j3026j2089j2277j3518j3100j1158
55689D51283j0550j1589j1835j0756r921r222p420n591n688o652o139m871n077
55676C45972o069n598m061l188k229K32K534K386J035N78n46m511q727q918n894
55661C02996m010m331m371l240k141j111O4n98m027o398l917O38J836K35J052
55646B72677N304Q594Q421O846N746M638L493L115K648R06m51Q11L017K926J414
$$ plain form
55739 983980 981279 980973 981141 980074 978171 975115 969379 961866 955515 950061 941801 929850 917704 907110
55725 907110 895453 881119 866622 854292 843368 833370 825923 821131 816294 810162 804290 798464 789107
55712 789107 774235 755976 736427 715181 692661 671544 652900 634991 617722 603893 594009 584287
55700 584287 572211 559867 549321 538841 526451 513425 501336 489059 475541 462441 451283
55689 451283 440733 429144 417309 406553 396632 387410 379990 374399 368711 362059 355920 351049 345972
55676 345972 339903 334305 330244 327056 324827 325059 327593 329979 331014 331592 331046 326535 317808 308890 302996
55661 302996 298986 294655 290284 287044 284903 283792 283856 283258 279231 272833 268916 269554 271390 271625 272677
55646 272677 277981 286575 294996 301842 307588 312226 315719 318834 321482 322388 321937 322748 325765 328691 330105
55631C30105J995M553N645M567M022N020N766N512N162M395K371O74J338K842
55617C83967K343P72J131K823K777J185J003K360K682J899K339L751L567K010
55603D14609J955L727M739M233L789L470K091Q69K054M368M524K698J652J278
55589D56056o74l258l406j870k378n103o847p368r314j1837j0953p005n212p605
55575C73226j0490j1346j2057j3687j3969j2193j1074j1688j1672j0306j0189
55564B44555j1902j2209r719p342o995o801n623n401o667o678m399k704l234l739
55550A51142k859k645l848l646j012N76r66k447r70J021K30j939k373j456j228
55535A27580j321o01k69j534k533j231O47J11k287l453k279l86O71O30j23p95
$$ plain form
55631 330105 332100 336653 342298 346865 350887 355907 361673 367185 372347 376742 379113 379787 381125 383967
55617 383967 386310 387082 388213 391036 393813 394998 396001 398361 401043 402942 405281 409032 412599 414609
55603 414609 416564 420291 425030 429263 433052 436522 438613 439482 441536 445904 450428 453126 454778 456056
55589 456056 455382 452124 448718 446848 444470 439367 432520 425152 415838 404001 393048 386043 380831 373226
55575 373226 362736 351390 339333 325646 311677 299484 288410 276722 265050 254744 244555
55564 244555 232653 220444 210725 203383 196388 189587 183964 178563 171896 165218 160819 158115 154881 151142
55550 151142 148283 145638 141790 138144 137132 137708 136742 134295 133325 134346 134576 132637 130264 128808 127580
55535 127580 126259 125658 125389 123855 121322 120091 120738 120849 118562 115109 112830 112444 113115 113745 113622 112827
55519A12827o53k74q46j824j411J59O53j97LK014L542L581M352P019R084Q484
55503A46513O807N957M867K452O51J264K382J168j844m249n504o313o145m380
55489A43626k450k075k595k322j355q13o50j61M45Q12J433K381K496J364O14J729
55473A42479M021N976P022O927N353L239K628L959N404N804N906N870M315J278
55459B10181q71r73q73k014l208l581m563o754p926o767n656o847q477p696n457
55444A38518m851o359p988q822r367r421q286o498n168m401l948m220n035m976
55430D9178l635k793l511m016k510j57R61R75R72L51j783m021m109k117N0J343
55414B5178J781J159l82j496j274p58j163j859j719j088o65L0J315J929R03n66
$$ plain form
55519 112827 112174 111900 111054 109230 107819 107978 108631 108434 108437 110451 113993 117574 121926 128945 138029 146513
55503 146513 153320 159277 164144 166596 167247 168511 170893 172061 170217 165968 160464 154151 148006 143626
55489 143626 141176 139101 136506 134184 132829 132016 131366 131205 131650 132462 133895 136276 138772 140136 140750 142479
55473 142479 146500 152476 159498 166425 171778 175017 177645 181604 187008 192812 198718 204588 208903 210181
55459 210181 209310 208337 207464 205450 202242 198661 194098 187344 179418 172651 166995 160148 151671 143975 138518
55444 138518 133667 127308 119320 110498 101131 91710 83424 76926 71758 67357 63409 59189 54154 49178
55430 49178 45543 42750 39239 35223 32713 32556 33517 34492 35464 35815 34032 30011 25902 23785 23835 25178
55414 25178 26959 28118 27736 26240 24966 24208 23045 21186 19467 18379 17714 17744 19059 20988 21891 21325
55398B1325r92r41j650k759l241l209l054k176l37J246J750K058K674K351N82
55383A3627o46J70J407R20n31q72q5N28P91J083Q56n2l15O04J003ll74J311K710
55364B2132J416o00p4J895J584j188k963k226r82p43o85j92M4k9M74J377J561
55347B0801J147J216J455N71j084j821j504j589k182j677L46K182K582K168J852
55332B4463J564J104P85P38O07M5j169k941m133l138k85J721J226q8l0P70O76
55315B1915L06J114K077J179p33r66N98J464Q13M62J203J396K3j559j939j574
55299B5779j471j688j973k371k715k682k442k121r67J429L722M290L555K939K184
55284B5468N2k783m119l498k635k537k464j985j771A822C58A61J046J874K473
$$ plain form
55398 21325 20333 19392 17742 14983 11742 8533 5479 3303 2966 4212 5962 8020 10694 13045 13627
55383 13627 12981 13151 14558 15478 14947 14075 13990 14518 15309 16392 17248 17196 16881 17485 18488 18485 18111 19422 22132
55364 22132 23548 22948 22874 24769 26353 25165 22202 19976 18994 18251 17566 17374 17418 17389 17863 19240 20801
55347 20801 21948 23164 24619 25190 24106 22285 20781 19192 17010 15333 15679 17861 20443 22611 24463
55332 24463 26027 27131 27916 28654 29261 29306 28137 25196 21063 17925 17640 19361 20587 20499 20469 21239 21915
55315 21915 22221 23335 25412 26591 25858 24892 25490 26954 27767 28229 29432 30828 30851 29292 27353 25779
55299 25779 24308 22620 20647 18276 15561 12879 10437 8316 7349 8778 12500 16790 20345 23284 25468
55284 25468 25520 22737 18618 15120 12485 9948 7484 5499 3728 1822 358 161 1207 3081 5554
55269E554K283N59j575j768L98K721L244K095K50j656k820k338n69Q43P99l59
55253G661j712k442A622k71Q19J84A153c95q97o24q11k63J054b45G66n3e7j340
55235a397j803j752j220m09J175a747C665M675K289Q30J150J900K177K399K578
55220B1663K075J208R51Q78l48k285k913j744m25J76J025K437K993J950O72M47
55204B8760O65K74m33n23K39J418K267J801l30k810l828l264k369j565l36R12
55188B0878R74K1m91k66m77j311j414l14P46R78J055J256P84k52l21R87J724L11
55170B4868k017k746j091J471K885K139P1j124j05J915K692J851Q32M54L55O14
55154C3064J697K742K182K91r69q22l46j15L85P91k5j348q92J525L269K788J530
$$ plain form
55269 5554 7837 8396 6821 5053 5451 8172 11416 13511 13761 12105 9285 6947 6378 7221 8020 7661
55253 7661 5949 3507 1622 1351 2170 2354 1153 -395 -1292 -1916 -2727 -2990 -1936 -245 766 713 -57 -1397
55235 -1397 -3200 -4952 -6172 -6581 -5406 -1747 3665 8340 10629 11459 12609 14509 16686 19085 21663
55220 21663 23738 24946 25897 26775 26427 24142 21229 19485 19060 19236 20261 22698 25691 27641 28313 28760
55204 28760 29425 29699 29266 28743 28982 30400 32667 34468 34138 31328 27500 24236 21867 20302 19966 20878
55188 20878 21852 21873 21382 21116 20639 19328 17914 17600 18346 19324 20379 21635 22419 22167 21846 22833 24557 24868
55170 24868 22851 20105 19014 20485 23370 25509 25580 24456 24351 26266 28958 30809 31641 32095 32450 33064
55154 33064 34761 37503 39685 39976 39007 38185 37839 37724 38109 38900 38875 37527 36635 38160 41429 44217 45747
55137D5747R03J57j197j661l95P62K5j602k279k135k089j625m9J548J673P72K10
55120C8765K6m61r06o37j20M8N96K212L596K904N51j328j782j739k060k579k946
55103C4140l075k718j743p11k04P1O43J009J46j838l526l765k728j447p30m83
55087A3041J95J947M095N105M324K682J377N42l96j711l090l871l379j548N84
55072A9897J633J283M13k02n17o89o77m55P6J206K618K978J501m47p70O18J985
55055C0451K495K984M056N121N574N309L935J227j495k311j342n90q66q43L35
55040E4040J667K254K658L317L369K179O61J14Q28K291L628L692K170O30P65J767
55024H6030J509J17k90O08R08K42N88K409L366K297J127J033K35k208l660j974
$$ plain form
55137 45747 46650 46807 45610 43949 43554 44316 44341 42739 40460 38325 36236 34611 34562 36110 37783 38555 38765
55120 38765 38791 38330 37424 36787 36667 36715 37311 39523 43119 46023 46574 45246 43464 41725 39665 37086 34140
55103 34140 31065 28347 26604 25893 25689 25760 26403 27412 27558 25720 22194 18429 15701 14254 13524 13041
55087 13041 13236 15183 19278 24383 28707 31389 32766 33308 32912 31201 28111 24240 20861 19313 19897
55072 19897 21530 22813 23226 23024 22507 21818 21141 20686 20762 21968 24586 27564 29065 28618 27848 28466 30451
55055 30451 32946 35930 39986 45107 50681 55990 59925 61152 59657 57346 56004 55414 54548 53705 54040
55040 54040 55707 57961 60619 63936 67305 69484 70145 70259 71087 73378 77006 80698 82868 83498 84263 86030
55024 86030 87539 87656 87366 87974 88882 89124 89712 92121 95487 97784 98911 99944 100179 97971 94311 92337
55008I2337N85P46p60j020L8Q2j349k441k372k032j766j071l22n74j711k630k903
54991G2837k698j737j5J254J091L21J11n0j050k055j746p32n39j037r56k69Q0
54974F2810J34N09O70k66j548j656o10M38J290K362L047K639K203L136M369L521
54958H3048O02j860k324j547l66J311L037L549K678J685J355J364J681K756M095
54943A01064M447L724L002K427R57j393k927k624j495r39j076j402j771j993j574
54928I8427n03N48J192J644J800J093l69j490j519r88q45j217j423q07N40J822
54912I7905K364K498K917L148J926k89q28J753N060N608L373J524K067L893N161
54897A38080N600N970O765Q044R518J0596J1069J1641J2940J4365J5005J5200
$$ plain form
55008 92337 92922 93668 92908 91888 91926 92008 90659 88218 85846 83814 82048 80977 80655 80081 78370 75740 72837
54991 72837 70139 68402 68387 69641 70732 71053 71164 71114 70064 68009 66263 65531 64992 63955 62999 62730 62810
54974 62810 62944 63453 64123 63857 62309 60653 60043 60481 61771 64133 67180 69819 72022 75158 79527 83048
54958 83048 83650 81790 79466 77919 77553 78864 81901 85450 88128 89813 91168 92532 94213 96969 101064
54943 101064 105511 109235 112237 114664 115621 114228 111301 108677 107182 106243 105167 103765 101994 100001 98427
54928 98427 97924 98472 99664 101308 103108 104201 103832 102342 100823 99835 98990 97773 96350 95543 96083 97905
54912 97905 100269 102767 105684 108832 110758 110469 109641 111394 116454 122062 125435 126959 129026 132919 138080
54897 138080 143680 149650 156415 164459 173977 184573 195642 207283 220223 234588 249593 264793
54885B64793J5897J6958J7468J7311J6854J5437J1896O476O63m713r615j3327
54873C56098j4800j4619j4790j6136j7424j7390j6238j4748j3280j2027j1142
54862A93504j0197q589o457m334k148J39J377M76j332j375J182M537O948Q371
54848A82102R233R513R688J0813J2919J4800J6003J7353J8886J8895J6229J2044
54836C48478Q075M324k49n591j0384j3616j5382j6369j7097j7564j7326j6216
54824B31083j4824j3832j3019j1813j0380r225p934n703l058j646j959k682k673
54811A32335k239k047k063k136k490k997l019k493k134k146j850j141j070k112
54797A02398l021k436q44J25o7l40L99J787K312R43j546l158k879j819j629k365
$$ plain form
54885 264793 280690 297648 315116 332427 349281 364718 376614 383090 383753 379040 369425 356098
54873 356098 341298 326679 311889 295753 278329 260939 244701 229953 216673 204646 193504
54862 193504 183307 174718 168261 163927 161779 161918 163295 163771 162439 161064 162246 166783 173731 182102
54848 182102 191335 200848 210536 221349 234268 249068 265071 282424 301310 320205 336434 348478
54836 348478 356553 360877 360628 355037 344653 331037 315655 299286 282189 264625 247299 231083
54824 231083 216259 202427 189408 177595 167215 157990 150056 144353 141295 139649 137690 135008 132335
54811 132335 130096 128049 125986 123850 121360 118363 115344 112851 110717 108571 106721 105580 104510 102398
54797 102398 99377 96941 96097 96222 96155 95815 96214 98001 100313 101256 99710 96552 93673 91854 90225 87860
54781H7860k893k843k823k960k597j561l83O60J449J074j185l821l898o94L090
54766F8475M531L581K148J448J396J522J338N19n00p11R8J084J887L296N568P271
54750A02951O919M936K964J997K153L464N604P324P522O826P104R248J2102J3726
54736A94840J3272J1689J0941J2388J5565J8608K0010J9758J8660J7161J5191
54725C68083J2722R832O356K003k954p388j0041j0746j0737j1388j2627j3126
54713C19989j2114j0321q788p629o593n986n993n826m665l027k027j680j067J32
54699B44405J573L411O173R421J1860J2850J2826J2414J2251J3360J6254J9630
54687C76428K1420K1252K0612K0517K0498J9825J8251J5395J0929N612O05m445
$$ plain form
54781 87860 84967 82124 79301 76341 73744 72183 71800 72460 73909 74983 73798 69977 66079 65385 68475
54766 68475 73006 76587 78735 80183 81579 83101 84439 84958 84458 83747 83845 84929 86816 90112 95680 102951
54750 102951 109870 114806 117770 119767 121920 125384 130988 138312 145834 152660 159764 169012 181114 194840
54736 194840 208112 219801 230742 243130 258695 277303 297313 317071 335731 352892 368083
54725 368083 380805 390637 396993 398996 396042 388654 378613 367867 357130 345742 333115 319989
54713 319989 307875 297554 288766 281137 274544 268558 262565 256739 252074 249047 247020 245340 244273 244405
54699 244405 245978 249389 255562 264983 276843 289693 302519 314933 327184 340544 356798 376428
54687 376428 397848 419100 439712 460229 480727 500552 518803 534198 545127 550739 551344 546899
54675E46899j0777j7666k2201k2817k1378k0702k1370k2108k1985k1038j9518
54664C25339j7683j5840j3987j1973j0209r402r350r128q624q667r261r050p203
54651A84962m484j985l8J124J030O5n10l04k69p80p55M34J683J827J209O16L0
54634A83855m91j42J171K019J530R52J663K750K304K47j775k644k371j058J031
54619A89041K669K547J028n8N69K617M871O056N357L124R50L88J628L699N375
54604B29861N701M492L011L180N380P780Q519P616O067M244K344J310J830L032
54590B94367L526L311L485M564O062P399Q190Q102P370O982P498Q337R020J0298
54576C88511J2802J5433J6485J6044J5880J7108J9111K0512K0164J7383J2315
$$ plain form
54675 546899 536122 518456 496255 473438 452060 431358 409988 387880 365895 344857 325339
54664 325339 307656 291816 277829 265856 255647 246245 236895 227767 219143 210476 201215 192165 184962
54651 184962 180478 178493 178455 179579 180609 180674 180164 179860 179591 178811 178056 178490 180173 182000 183209 183825 183855
54634 183855 183364 183222 184393 186412 187942 188894 190557 193307 195611 195858 194083 191439 189068 188010 189041
54619 189041 191710 194257 195285 195227 195796 198413 203284 209340 214697 217821 218771 219159 220787 224486 229861
54604 229861 235562 240054 243065 246245 251625 259405 267924 275540 281607 285851 288195 289505 291335 294367
54590 294367 297893 301204 304689 309253 315315 322714 330904 339006 346376 353358 360856 369193 378213 388511
54576 388511 401313 416746 433231 449275 465155 482263 501374 521886 542050 559433 571748
54565E71748O082j61o063j1513j5882j8728k0546k1926k2537k2022k1064k0342
54553C97046j9112j6296j2489r414p687o593n796n567n510m810l891m053n095
54540B90733m967k626J83J010m84k796m801o455p681p854o780n472n319o555p905
54525B22231p985o728n183m151l652l612m138m813m713l714l089l920n470n987
54511A55076m806k835j230m61n15j238k273l077l132k068J7K121K754J305j194
54496A38444l021l160j627Q73L189M197L604K038K82j013r55R95L644M608L014
54481A55112O53m11j51M21J169K202K620J792J160K656N578P199O706O302P727
54466B00735R593R544P858P128Q757J1256J2352J1633J0232Q545N581R18l897
$$ plain form
54565 571748 577830 577669 571606 560093 544211 525483 504937 483011 460474 438452 417388 397046
54553 397046 377934 361638 349149 339735 332048 325455 319659 314092 308582 303772 299881 295828 290733
54540 290733 285766 283140 283323 284333 283849 281053 276252 269797 262116 254262 247482 242010 236691 230136 222231
54525 222231 214246 207518 202335 198184 194532 190920 186782 181969 177256 173542 170453 166533 161063 155076
54511 155076 150270 147435 146205 145744 145229 143991 141718 138641 135509 133441 133458 135579 138333 139638 138444
54496 138444 135423 132263 130636 131509 134698 138895 142499 144537 144819 143806 142851 143846 147490 152098 155112
54481 155112 155765 155354 155203 155624 156793 158995 161615 163407 164567 167223 172801 180000 186706 193008 200735
54466 200735 210328 219872 227730 234858 243615 254871 267223 278856 289088 297633 303214 304132 300235
54453C00235o953q281r328j0545j1037j0569j0116j0040r379p758o405o195o131
54440A87498n085l814l672m271m069k717j393j062j616k396k639j798k93O68O83
54425A54024P97J724K604K668K830M019N102M408K520J512J836K098J650J407
54411A89199J979K889L826N031O086N945M527K981K075J472P40j24j270k758l851
54396B18747l903l886n272p254p029l606L55J582j85k607l704l268k104j076o80
54381A76110p88q38o21n87j105j857k277k306k325k510k544k014j078n31r20j657
54365A52152j686r58m12l36J6O54K26j667k941j577J249K552J656Q08J647L114
54349A54497L490K852K495K970L668L912L728L669M117M822N273N522N995O370
$$ plain form
54453 300235 293282 285001 275673 265128 254091 243522 233406 223366 213987 206229 199824 193629 187498
54440 187498 182413 178599 174927 170656 166587 163870 162477 161415 159799 157403 154764 152966 152673 153341 154024
54425 154024 154821 156545 159149 161817 164647 168666 173768 178176 180696 182208 184044 186142 187792 189199
54411 189199 191178 194067 197893 202924 209010 214955 219482 222463 224538 226010 226750 226626 225356 222598 218747
54396 218747 214844 210958 205686 198432 191403 187797 188152 189734 189549 186942 183238 179970 177866 176790 176110
54381 176110 175322 174484 173863 173276 172171 170314 168037 165731 163406 160896 158352 156338 155260 154729 153809 152152
54365 152152 150466 149508 149096 148760 148776 149430 149656 147989 145048 143471 144720 147272 148928 149736 151383 154497
54349 154497 157987 160839 163334 166304 169972 173884 177612 181281 185398 190220 195493 201015 207010 213380
54335B13380N651L886K648K970L924M306M455N042N202L732J243p20k006l346
54321B50367m339m133l545m127n356n279l875l229m058m619l832k996l316l825
54307A93838l198k044j850k800l781l882l021j724p53m62m73o33j696l744m680
54292A59097k391J696L675K185N5J76K058L602M265M702M871M203K902J832J626
54277A94554K537M270N580N230L715K786K789K146O4j946k213j046K85J089Q53
54262B20693j090m158o226o089n146n289o437p362p733p816p264n800m315l851
54248A42117m114m141l841l696l634l302k866k610k300j793j455j277n87N04N82
54233A07587j077l036l432k256p22O00J784K589K788K750K515J276j061k854k664
$$ plain form
54335 213380 219031 222917 225565 228535 232459 236765 241220 246262 251464 255196 256439 255719 253713 250367
54321 250367 246028 241895 238350 234223 228867 223588 219713 216484 212426 207807 203975 200979 197663 193838
54307 193838 190640 188596 186746 183946 180165 176283 173262 171538 170785 170323 169850 169217 167521 163777 159097
54292 159097 156706 158402 162077 164262 164317 164493 166551 170153 174418 179120 183991 188194 191096 192928 194554
54277 194554 197091 201361 206941 212171 215886 218672 221461 223607 223671 221725 219512 218466 218751 219840 220693
54262 220693 219603 215445 209219 203130 197984 192695 186258 178896 171163 163347 156083 150283 145968 142117
54248 142117 138003 133862 130021 126325 122691 119389 116523 113913 111613 109820 108365 107088 106501 107005 107587
54233 107587 106510 103474 100042 97786 97064 97664 99448 102037 104825 107575 110090 111366 110305 107451 104787
54218A04787j289l89q6M42R51O58R4M04J170R41k24p66k27R1m73o51Q28L284M908
54199A14453M818L723K968L212L712K964N44k040k998k418j961k571l499l645
54185A17262k932k055j447p76O79K987M895M751K480n2j155j073r49r89o73r6
54169A20857J05j12l07n00r98j547j635j373j157p65J26R12P21oN0J131J979J667
54151A19148P04L1j28N8O29J489J964J357l9r08j80J588K463J222j010k114j880
54134A24394k293m426o506o200l705j145K78R07R46O0j217j416n2J516J825R76
54118A03942L0n92j331k448l391l330k099m34Q59J710K413K749K251J337J027
54103A02693J229N87j273k661k104n81Q3pN59J618J426l23j582q24P49R49n01
$$ plain form
54218 104787 103498 103109 103023 103465 104416 105074 105168 105572 106742 107683 107459 106693 106466 106557 106084 105433 106261 109545 114453
54199 114453 119271 122994 125962 129174 132886 135850 136394 134354 131356 128938 126977 124406 120907 117262
54185 117262 114330 112275 110828 110052 110731 113718 118613 123364 125844 125792 124637 123564 122615 121626 120953 120857
54169 120857 120962 120850 120543 120043 119045 117498 115863 114490 113333 112568 112694 113606 114327 114321 114371 115502 117481 119148
54151 119148 119852 119883 119755 119813 120442 121931 123895 125252 125213 124305 124125 125713 128176 129398 128388 126274 124394
54134 124394 122101 117675 111169 104969 101264 100119 100397 101304 102250 102310 101093 99677 99625 101141 102966 103942
54118 103942 103972 103380 102049 99601 96210 92880 90781 90347 91206 92916 95329 98078 100329 101666 102693
54103 102693 103922 104509 103236 100575 98471 97890 97973 97966 98525 100143 101569 101246 99664 98840 99589 100538 100037
54086A00037k057k664k783l150l532l169j937n18M80R86R26l9j603k300j134N87
54070G8130N17j525l166k811j633j338j548r38L79J300J690K104K169J156j70
54055G4316j15J468K889K937K043R24m78k109l121k746j290K77J251J548J549
54040G9343J668J796J404M47k61j17M36P71J051J580J971J922K055K758K910J316
54024A01050j182k558k183j004M07K124L252K305l69k241j493Q83K546K307P41
54009A04585o77o76O82J817J402J71j36N77Q06J40K2J237K468K292J276Q85J408
53992A18279K047K244J944J194L66L15J510L300M481M374L215K004J945L316M833
53977A55367N053M360M354N262N540M545L906N225P699R336R533R154Q857Q689
$$ plain form
54086 100037 97980 95316 92533 89383 85851 82682 80745 80227 80707 81693 82619 82580 80977 78677 77543 78130
54070 78130 78647 77122 73956 71145 69512 68174 66626 65688 66067 67367 69057 71161 73330 74486 74316
54055 74316 74201 75669 78558 81495 83538 84462 83984 81875 78754 76008 74718 74995 76246 77794 79343
54040 79343 81011 82807 84211 84658 84397 84280 84716 85487 86538 88118 90089 92011 94066 96824 99734 101050
54024 101050 99868 97310 95127 94123 94530 96654 99906 102211 101842 99601 98108 98991 101537 103844 104585
54009 104585 103908 103232 103914 105731 107133 107304 107168 107745 108551 108691 108713 109950 112418 114710 115986 116871 118279
53992 118279 120326 122570 124514 125708 126074 126389 127899 131199 135680 140054 143269 145273 147218 150534 155367
53977 155367 160420 164780 169134 174396 179936 184481 188387 193612 201311 210647 220180 229334 238191 246880
53963B46880Q876R619J0240R641P751N707M542M237M105L648K940K469K510K620
53949C25785K039P54l66p46q94j563k569l030k641k159k582m010n389n506m364
53934B92759l342l623m774n417n048m301l672l042k572k921m145n356n988o442
53920B32116o917o542m596j968m51p45j893k518k117j261q82j296j756j208M80
53905A98446K341L347L162K028N49l58j24O91J065J046J629K953L738L137K011
53890B25661J540J467Q61k6J84K168M961O893P074O114N653O836Q971J0216R812
53875B98385Q943Q940R508R477Q639P764P209O447N024L295K173K349L530M203
53861C85886K864J1j855r15J812L871M226L619K783J820J343K456N079P521Q434
$$ plain form
53963 246880 255756 265375 275615 285256 293007 298714 303256 307493 311598 315246 318186 320655 323165 325785
53949 325785 327824 328578 328212 327466 326572 325009 322440 319410 316769 314610 312028 308018 302629 297123 292759
53934 292759 289417 285794 281020 275603 270555 266254 262582 259540 256968 254047 249902 244546 238558 232116
53920 232116 225199 218657 214061 212093 211642 210897 209004 206486 204369 203108 202226 200930 199174 197966 198446
53905 198446 200787 204134 207296 209324 209873 209515 209391 210082 211147 212193 213822 216775 220513 223650 225661
53890 225661 227201 228668 229529 229503 229687 231855 236816 243709 250783 256897 262550 269386 278357 288573 298385
53875 298385 307328 316268 325776 335253 343892 351656 358865 365312 370336 373631 375804 378153 381683 385886
53861 385886 388750 388761 386906 385991 387803 391674 395900 399519 402302 404122 405465 407921 413000 420521 428955
53846D28955Q326Q395Q742Q678Q176P913P950P371N482K808N64n59q86j270k270
53831D98375l632m539m539m294n061p231r684j0952j0882j0723j1548j2982j3644
53818C88664j2632j0459q615q293r344j0484j0594r767q874q399q155p903p555
53805B67590o817n489m267m259n293n694m477k920k924m420n578n306m367l944
53791B01835m185m424m224l737l457l711m168l993k865j562j035j191j223q85
53777A61175o11m51R8J012J370N80n67o69N21J619J156n55j589p51P65Q23q42
53760A63084k380k346j068P19K904M717M421J803m25K70K630L307J545q4M38K233
53744A81768L432L560L312L414M293N798O874O475N010L925L900M553N597O929
$$ plain form
53846 428955 437281 445676 454418 463096 471272 479185 487135 494506 499988 502796 503360 502801 501915 500645 498375
53831 498375 494743 490204 485665 481371 476310 469079 459395 448443 437561 426838 415290 402308 388664
53818 388664 376032 365573 356958 348665 339321 328837 318243 308476 299602 291203 283048 275145 267590
53805 267590 260773 255284 251017 246758 241465 235771 231294 228374 225450 221030 215452 210146 205779 201835
53791 201835 197650 193226 189002 185265 181808 178097 173929 169936 167071 165509 164474 163283 162060 161175
53777 161175 160564 160113 160211 161223 162593 163173 162606 161937 162458 164077 165233 164678 163089 162338 163103 163926 163084
53760 163084 160704 158358 157290 158009 160913 165630 170051 171854 171429 171699 174329 177636 179181 179097 179535 181768
53744 181768 185200 188760 192072 195486 199779 205577 212451 218926 223936 227861 231761 236314 241911 248840
53730B48840P768P373O590O939Q199Q624P680O549N654L948J360k67R8Q86K29
53715C20470j412k383k360k426l434n292p148p655n990l188j386j350k010k576
53701B71860l421m322m036k674k426m368o388o041l961k532k513k960l359l781
53687B19078l617k286p73p05j967k718j757K59J816J862N65o03j07J705K777K183
53671B15712J342J543J826R09l31l01O07R17Q74J931L855M588L088N23j469k157
53655B33457j468NQ59J60j143j433p17k18r0O00J783K211J559Q91P85O64L54O54
53637B38913J770K654K515J806J208P16K61J57N55J299K603M707O696O857M764
53622B77481K045N36M90R13Q82J19r99j640j243j56R83K200L700M785M496L234
$$ plain form
53730 248840 256608 263981 270571 277510 285709 294333 302013 308562 314216 318164 319524 319257 319355 320241 320470
53715 320470 319058 316675 314315 311889 308455 303163 296015 288360 282370 279182 277796 276446 274436 271860
53701 271860 268439 264117 260081 257407 254981 250613 244225 238184 234223 231691 229178 226218 222859 219078
53687 219078 215461 213175 212402 211697 209730 207012 205255 205514 207330 209192 209757 209154 209047 210752 213529 215712
53671 215712 217054 218597 220423 221332 221001 220700 221307 222224 223098 225029 228884 233472 236560 237083 235614 233457
53655 233457 231989 231994 232853 233013 231870 230437 229720 229502 229412 230012 231795 234006 235565 236456 237241 237905 238259 238913
53637 238913 240683 243337 245852 247658 248866 249582 249843 250000 250555 251854 254457 259164 265860 272717 277481
53622 277481 279526 280062 280552 281465 282347 282466 281467 279827 278584 278428 279411 281611 285311 290096 294592 297826
53606B97826K390K182J386l73j520o19J487K635J906L50n01k59J71l11j748l138
53590C01864l696l654l390k534q11P84R33n0m58N51J990K512J866P21j39k66J19
53573B96342K93M0J48J045J653Q35n12n34P19J416R29P16J695K742K729K263K307
53556C14826K535K433K744M348O406P062N611L082J027N80K119M806O762O634
53542C70975M993L552L327M012M885N525N798N741N579N535N614N646N522N280
53528D41984N143N406N964O057M987L123J692J464K102K799L031K635J700O26
53514D88713q3j81L02J163J769J250l36j522j017N36J479J445J476J999K249J942
53498E01184J985K864L562K942J269l01j097j115n16N31J966L940O283P901P693
$$ plain form
53606 297826 300216 302398 303784 303411 301891 301272 302759 305394 307300 307650 307149 306890 307061 306750 305002 301864
53590 301864 298168 294514 291124 288590 287779 288563 289496 289446 288988 289539 291529 294041 295907 296628 296489 296223 296342
53573 296342 296635 296675 296823 297868 299521 300356 299844 299310 300029 301445 302374 303090 304785 307527 310256 312519 314826
53556 314826 317361 319794 322538 326886 333292 340354 345965 349047 350074 350654 352773 357579 364341 370975
53542 370975 375968 379520 382847 386859 391744 397269 403067 408808 414387 419922 425536 431182 436704 441984
53528 441984 447127 452533 458497 464554 469541 472664 474356 475820 477922 480721 483752 486387 488087 488713
53514 488713 488630 488449 488751 489914 491683 492933 492597 491075 490058 490594 492073 493518 494994 496993 499242 501184
53498 501184 503169 506033 509595 512537 513806 513505 512408 511293 510777 511308 513274 517214 523497 531398 539091
53483E39091O175N065N067N278N060N016N499N620M827M231N094O863P976P949
53469F18811P509P226P157P661R255J1636J3628J4254J3502J2232J1681J2776
53457G47328J5390J8398K0702K1928K2220K2002K2134K3384K5331K6557K6416
53446I91790K5826K5892K6575K7316K8084K9037K9913L0585L1484L2738L3669
53435A312909L3972L4648L6536L8732L9735L9665L9813M0262L9564L7151L4647
53424A727634L4004L5142L6270L6118L5205L4845L5357L5724L5057L3893L3366
53413B112615L3301L2240K9752K7515K7218K8196K8365K7081K5649K5009K4226
53402B421167K1947J8369J4982J2697J0990Q852O045L018p6l711q036j2091j4680
$$ plain form
53483 539091 545266 550331 555398 560676 565736 570752 576251 581871 586698 590929 596023 602886 610862 618811
53469 618811 626320 633546 640703 648364 657619 669255 682883 697137 710639 722871 734552 747328
53457 747328 762718 781116 801818 823746 845966 867968 890102 913486 938817 965374 991790
53446 991790 1017616 1043508 1070083 1097399 1125483 1154520 1184433 1215018 1246502 1279240 1312909
53435 1312909 1346881 1381529 1418065 1456797 1496532 1536197 1576010 1616272 1655836 1692987 1727634
53424 1727634 1761638 1796780 1833050 1869168 1904373 1939218 1974575 2010299 2045356 2079249 2112615
53413 2112615 2145916 2178156 2207908 2235423 2262641 2290837 2319202 2346283 2371932 2396941 2421167
53402 2421167 2443114 2461483 2476465 2489162 2500152 2509004 2515049 2518067 2517991 2514280 2506244 2494153 2479473
53389B479473j5968j7398j9724k1850k2267k1232k0681k1958k4302k5933k6314
53378B241846k6694k8259l0322l1133l0317k9393k9473k9639k8603k6841k5587
53367A925585k4388k1650j7457j3794j1673r955p695n758n005m648l752k942k992
53354A793876k836q31K720O000Q201J0054J2155J4282J6334J8600K1026K3293
53342A922874K5595K8281L0842L2384L3263L5010L8282M1815M3899M4350M4657
53331B321252M6522N0298N4625N7684N9173O0627O3423O6932O9491P0652P1368
53320B992047P2162P2372P1470P0157O9564O9848P0038O8990O6445O3280O0693
53309C747066N8877N6800N3481M9063M4165L8839L2939K7002K1713J6635J0688
$$ plain form
53389 2479473 2463505 2446107 2426383 2404533 2382266 2361034 2340353 2318395 2294093 2268160 2241846
53378 2241846 2215152 2186893 2156571 2125438 2095121 2065728 2036255 2006616 1978013 1951172 1925585
53367 1925585 1901197 1879547 1862090 1848296 1836623 1826668 1818973 1813215 1808210 1803562 1799810 1796868 1793876
53354 1793876 1791040 1790209 1792929 1798929 1807130 1817184 1829339 1843621 1859955 1878555 1899581 1922874
53342 1922874 1948469 1976750 2007592 2039976 2073239 2108249 2146531 2188346 2232245 2276595 2321252
53331 2321252 2367774 2418072 2472697 2530381 2589554 2650181 2713604 2780536 2850027 2920679 2992047
53320 2992047 3064209 3136581 3208051 3278208 3347772 3417620 3487658 3556648 3623093 3686373 3747066
53309 3747066 3805943 3862743 3916224 3965287 4009452 4048291 4081230 4108232 4129945 4146580 4157268
53298D157268L852k596p918j2963j8933k5703l2041l7116m1365m5916n1241n6421
53286C828907n9886o1081o1102o1413o2290o2950o2715o1496n9498n7309n5969
53275C163198n6115n7044n7495n7231n6996n6825n5519n2288m8178m5121m3874
53264B576512m3354m2003l9510l7029l5612l4736l2939k9975k7426k6545k6426
53253B200957k5251k2877k0881k0423k1245k2673k4142k4580k2697j8689j4591
53242A962908j2275j1696j1521j0613q484n173j517J109K121K449L441N503Q178
53229A924430J1022J3721J5937J7725J9745K2336K4867K6612K7837K9205L0449
53218B163886L0762L0375L0552L1701L2500L1529K9077K6660K5166K4170K2858
$$ plain form
53298 4157268 4161120 4158524 4150606 4137643 4118710 4093007 4060966 4023850 3982485 3936569 3885328 3828907
53286 3828907 3769021 3707940 3646838 3585425 3523135 3460185 3397470 3335974 3276476 3219167 3163198
53275 3163198 3107083 3050039 2992544 2935313 2878317 2821492 2765973 2713685 2665507 2620386 2576512
53264 2576512 2533158 2491155 2451645 2414616 2379004 2344268 2311329 2281354 2253928 2227383 2200957
53253 2200957 2175706 2152829 2131948 2111525 2090280 2067607 2043465 2018885 1996188 1977499 1962908
53242 1962908 1950633 1938937 1927416 1916803 1908319 1903146 1901629 1902738 1904859 1907308 1910749 1916252 1924430
53229 1924430 1935452 1949173 1965110 1982835 2002580 2024916 2049783 2076395 2104232 2133437 2163886
53218 2163886 2194648 2225023 2255575 2287276 2319776 2351305 2380382 2407042 2432208 2456378 2479236
53207B479236K0908J8489J5817J2869R260M579q16n474p962q494q805j0201j2347
53194B507059j4438j6807k0376k4753k8023k8833k7972k7481k8599l0946l3321
53183B225510l4819l5262l4878l3740l1771k9468k8189k8852l0389l0525k8509
53172A879108k6239k5961k7564k8973k8765k7487k6481k6322k6525k6267k5093
53161A583431k3261k1384j9704j7884j5698j3549j1947j0869j0103r836j0313
53150A418883j1143j1687j1952j2427j3140j3554j3425j3166j3218j3680j4595
53139A276896j6066j7840j9101j9007j7304j4610j2276j1615j2657j3859j3696
53128A108865j2568j2337j3972j6470j8345j9302j9810j9909j9262j8126j7284
$$ plain form
53207 2479236 2500144 2518633 2534450 2547319 2556579 2561158 2560342 2554868 2546906 2538412 2529607 2519406 2507059
53194 2507059 2492621 2475814 2455438 2430685 2402662 2373829 2345857 2318376 2289777 2258831 2225510
53183 2225510 2190691 2155429 2120551 2086811 2055040 2025572 1997383 1968531 1938142 1907617 1879108
53172 1879108 1852869 1826908 1799344 1770371 1741606 1714119 1687638 1661316 1634791 1608524 1583431
53161 1583431 1560170 1538786 1519082 1501198 1485500 1471951 1460004 1449135 1439032 1429196 1418883
53150 1418883 1407740 1396053 1384101 1371674 1358534 1344980 1331555 1318389 1305171 1291491 1276896
53139 1276896 1260830 1242990 1223889 1204882 1187578 1172968 1160692 1149077 1136420 1122561 1108865
53128 1108865 1096297 1083960 1069988 1053518 1035173 1015871 996061 976152 956890 938764 921480
53117I21480j6941j6475j5532j4697j4608j4876j4566j3581j2881j3135j3894
53106G60294j4431j4723j4893j4283j2237r686q646r690j0987j0707r466r377
53094F21168j1118j3181j3942j3318j2120j0748r172p692o856o706o614o098n415
53081D98188n062m934m446l571l100l561m294m300l708l609m465n446n602m841
53067D37249l635k533k278l440n392o360n290l126j591j149r91n60k08l24n99
53052C99773m45K24Q14O81o6n70l10J29J08L45K108M922O463N370K940J199M30
53035D24115l71j657l118m593n893o324n521m328l741l576l224l125l981n120
53021C69543n234m544m614o018p559q061p494o203m357k596j987k729l741m036
$$ plain form
53117 921480 904539 888064 872532 857835 843227 828351 813785 800204 787323 774188 760294
53106 760294 745863 731140 716247 701964 689727 680041 671395 661705 650718 640011 630545 621168
53094 621168 610050 596869 582927 569609 557489 546741 537569 529877 523021 516315 509701 503603 498188
53081 498188 493126 488192 483746 480175 477075 473514 469220 464920 461212 457603 453138 447692 442090 437249
53067 437249 433614 431081 428803 425363 419971 413611 408321 405195 403604 402455 401464 400904 400696 400372 399773
53052 399773 399328 399552 400366 401047 400981 400411 400101 400230 400338 400683 402791 407713 414176 419546 422486 423685 424115
53035 424115 423744 422087 418969 414376 408483 402159 396638 392310 388569 384993 381769 378644 374663 369543
53021 369543 364309 359765 355151 349133 341574 333513 326019 319816 315459 312863 310876 308147 304406 300370
53007C00370l859m002m674n287n039l596j593l12l80j088j487j644j983k118j546
52992B61762r46j328k244k372j687j461k107k764l112l798m650m348k555p53r3
52977B27544L5L47J73j218k953l628l136k259j202K77J779K430J876M60j176k184
52961B17165j907p66p6m09r97j233j620k357k269m79J785K545J693P49M66J78
52945B12468n46j086q95k96J17J71j5j90M8P52J222P92r9m28m7K46N7j81k86p17
52925B11087j450j456k0J986K915K120M34p52m63J422L933N396M807K963J702
52910B34624J829K412K352J953K280L324L799K928J604J477L217O078Q650R664
52896B86191Q599O187M152L850N059O504P291P378O844N506L489J564N02L06K84
$$ plain form
53007 300370 296511 292509 287835 282548 277509 273913 272320 272008 271628 270540 269053 267409 265426 263308 261762
52992 261762 260816 259488 257244 254872 253185 251724 249617 246853 243741 239943 235293 230945 228390 227637 227544
52977 227544 227579 227926 228099 226881 223928 220300 217164 214905 213703 213980 215759 218189 220065 220525 219349 217165
52961 217165 215258 214492 214416 214007 213010 211777 210157 207800 205531 205052 206837 209382 211075 211824 212290 212468
52945 212468 211922 210836 209941 209645 209762 209933 209918 209728 209776 210528 211750 212542 212443 212015 211968 212214 212271 212090 211804 211087
52925 211087 209637 208181 208161 210147 213062 215182 215616 214864 214401 215823 219756 225152 229959 232922 234624
52910 234624 236453 238865 241217 243170 245450 248774 252573 255501 257105 258582 261799 267877 276527 286191
52896 286191 294790 300977 305129 308979 314038 320542 327833 335211 342055 347561 351050 352614 353116 353422 353706
52881C53706j40q39j197r31o48j240k627l611l252j987j011q77j224j532j680
52866C30910j918k569l414l356j529R08J249j491m745n205k776l04K20m97q92
52851C04591m80L56J133J259M16o49o23P37K339L224L293K561J008n54p99L10
52835C18122J215Q35j56o73o97o30k92N08J233J427J594K370L315L406K423J143
52819C35143M35O57J707L142M339M773M176K591N93q47j325j542k170k572j732
52804C47368j05P24J89p18j075p92J66J762K966K519R98M14J319K098J680J021
52788C60534J073J266J170J724L381M758M736M318M718N143M372L129K771K766
52774D05859J803O31J267L733N851O314N895N439M581K954J098l65j351j852j905
$$ plain form
52881 353706 353566 352727 351530 350599 349951 348711 346084 342473 339221 337234 336223 335346 334122 332590 330910
52866 330910 328992 326423 323009 319653 318124 319032 320281 318790 314045 308840 306064 305760 305980 305483 304591
52851 304591 304111 304467 305600 306859 307275 306626 306003 306740 309079 312303 315596 318157 319165 318611 317812 318122
52835 318122 319337 320172 320016 319343 318646 318016 317724 318232 319465 320892 322486 324856 328171 331577 334000 335143
52819 335143 335578 336235 337942 341084 345423 350196 354372 356963 357556 356709 355384 353842 351672 349100 347368
52804 347368 347263 347987 348176 347458 346383 345591 345757 347519 350485 353004 354002 354416 355735 357833 359513 360534
52788 360534 361607 362873 364043 365767 369148 373906 378642 382960 387678 392821 397193 400322 403093 405859
52774 405859 407662 408293 409560 413293 419144 425458 431353 436792 441373 444327 445425 445060 443709 441857 439952
52759D39952k178l416n220o417o747p001p381p056n773m680m840n748o097n513
52745C61885m801m724n157n501n523n420n225m558l369k441k552l374l973m120
52731C01147m180m040l430l160m363o263o571m647k470j749j947k123k615l510
52717B50079l457j834l23m01r08k99L20j015l584m953m633l993l277j640K74P52
52701B21108m3l47p2r39l085m323l558k302j981k177k397l162m253m162k595j440
52685A84272j918k771k597k105k439l045l015k987l848m700m096k425j220p24
52671A46382N6J274J887J336K30o61j030o82L82J468J600P07j82k06K81M5j617
52654A51270l899n074m305k604j493j060k30J239K223J957J223J254K255L420
$$ plain form
52759 439952 437774 434358 429138 422721 415974 408973 401592 394536 388763 384083 379243 373495 367398 361885
52745 361885 357084 352360 347203 341702 336179 330759 325534 320976 317607 315166 312614 309240 305267 301147
52731 301147 296967 292927 289497 286337 281974 275711 269140 264493 262023 260274 258327 256204 253589 250079
52717 250079 246622 244788 244465 244064 243156 242857 243177 242162 238578 233625 228992 224999 221722 220082 220356 221108
52701 221108 221065 220718 220646 219707 216622 212299 208741 206439 204458 202281 199884 196722 192469 188307 185712 184272
52685 184272 182354 179583 176986 174881 172442 169397 166382 163395 159547 154847 150751 148326 147106 146382
52671 146382 146438 147712 149599 150935 151165 150504 149474 148792 149174 150642 152242 152949 152767 152561 152842 152887 151270
52654 151270 147371 142297 137992 135388 133895 132835 132605 133844 136067 138024 139247 140501 142756 146176
52640A46176L807K908J121r4N71K537L646K625M30j160j342l66J245K832L782
52625A68718M253N109O618P805P541N660K828Kj667j507l58K3q97j852j849j627
52609A98800k150k787k250p76n5j141l327m948m823l112j292r71k291l755l948
52594A61174k966j879j448j758k491l023k718j705r41j154k037k762k729j722
52580A31841M5J708K325J923J338Q85J79o16n48N84J629J641J009M22j26n74l67
52563A43298K57j26j964l354k501n54q2j350k089r21R77J956J939J562P70o79
52547A37139k029k053n86J150J789J141K21J73J154K272K636K269J905K029K358
52532A51568K192J133n05j873k190j248M93K161K941K744K567L456M802M524J740
$$ plain form
52640 146176 149983 152891 154012 153918 154489 157026 160672 163297 163727 162567 161225 160859 162104 164936 168718
52625 168718 172971 178080 184698 192503 200044 205704 208532 208534 206867 205360 205002 205025 204128 202276 200427 198800
52609 198800 196650 193863 191613 190837 190782 189641 186314 181366 176543 173431 172139 171168 168877 165122 161174
52594 161174 158208 156329 154881 153123 150632 147609 144891 143186 142245 141091 139054 136292 133563 131841
52580 131841 131886 133594 135919 137842 139180 140065 140244 139628 139080 139664 141293 142934 143943 144365 144239 143665 143298
52563 143298 143555 143429 141465 138111 135610 135056 134974 133624 131535 130614 131591 133547 135486 137048 137818 137139
52547 137139 135110 133057 132471 133621 135410 136551 136772 136945 138099 140371 143007 145276 147181 149210 151568
52532 151568 153760 154893 154388 152515 150325 149077 149570 151731 154672 157416 159983 163439 168241 172765 174505
52517A74505j563k732j651l79p8j08J6j23k85O98K839M401M360L800L806L707
52501A91213K717J759J882K164J155m85q16M55J715J965J845K190K950L735M123
52486B18567L472J605k87o07P30K358L362L893L976L063J300o7j75M23Q78J430
52470B43921K839M766N677M566K339R86J427K538K615J388R6k30K95J117J896
52455B76236K236J786R82P94J240J130p9j197r28L21J203J258R65N75m3q20j515
52438B84144k045k257j877j154p99q73o91k57m31r90j81K530M881M624K558R26
52422B88108R2j067k472k904k157r25R29L594N315L911L00j978j157J103K683
52407B93375L242K986J695q5r37o69n84r64l56J627L043K518J419J498K198K123
$$ plain form
52517 174505 172942 170210 168559 168180 168102 167994 168010 167887 167602 168300 171139 175540 179900 183700 187506 191213
52501 191213 193930 195689 197571 199735 200890 200405 199589 200044 201759 203724 205569 207759 210709 214444 218567
52486 218567 222039 223644 223357 222750 223480 225838 229200 233093 237069 240132 241432 241365 241190 241613 242491 243921
52470 243921 246760 251526 257203 261769 264108 265094 266521 269059 271674 273062 273158 272928 273223 274340 276236
52455 276236 278472 280258 281240 282034 283274 284404 284325 283128 282200 282521 283724 284982 285947 286522 286479 285659 284144
52438 284144 282099 279842 277965 276811 276012 275139 274448 274191 273760 272770 272589 275119 280000 284624 287182 288108
52422 288108 288200 287133 284661 281757 279600 278675 279604 283198 288513 292424 292724 290746 289589 290692 293375
52407 293375 296617 299603 301298 301213 300276 299607 299023 298059 297703 299330 302373 304891 306310 307808 310006 312129
52391C12129J630J894K497K014M73o10k95J059K725L893L541J378j188k234j304
52376C27602N27K127K932K730J928J644K467L485L441K451J464O47m72j626j986
52361C49361j570j239j320j466j816k963m548n138m005k052n81N2K37L99R00J886
52345C26137K783K599J254m6j86O00J281J331Q81l1j479k889l003j116J800L645
52329C33561L051O38j704k660k316j374l11M72M42l50r32n73M4j80q19k23K002
52312C28768M028L984K234O70L62P69R71Q23Q13J321K125K481J905J027J141K589
52296C56011M166M666M349M079L728K726J691J995L634N033N263N017M846M180
52282D11384K924K463L582M858M761M275N295P261P842O736O214P444Q664Q076
$$ plain form
52391 312129 313759 315653 318150 320164 320637 320027 319732 320791 323516 327409 330950 332328 331140 328906 327602
52376 327602 328129 330256 333188 335918 337846 339490 341957 345442 348883 351334 352798 353445 352973 351347 349361
52361 349361 347791 346552 345232 343766 341950 338987 334439 329301 325296 323244 322663 322715 322952 323351 324251 326137
52345 326137 328920 331519 332773 332727 332541 333141 334422 335753 336634 336603 335124 332235 329232 328116 329916 333561
52329 333561 336612 337250 335546 332886 330570 329196 328885 329357 329799 329449 328517 327944 327988 327808 326989 326766 328768
52312 328768 332796 336780 339014 339684 340046 340815 341786 342609 343422 344743 346868 349349 351254 352281 353422 356011
52296 356011 360177 364843 369192 373271 376999 379725 381416 383411 387045 392078 397341 402358 407204 411384
52282 411384 414308 416771 420353 425211 429972 434247 439542 446803 454645 461381 467595 475039 483703 491779
52268D91779O519N830O082N993N084M055L701M510O560Q967J0304J0533J1334
52255E81251J3496J5190J4421J2133J1028J1951J3291J3626J3105J2373J1889
52244G23754J2367J4341J7202J9882K2306K4683K5858K4530K2017K1409K3418
52233I51767K5414K5438K4773K5253K6259K6362K6151K7059K8462K8352K6528
52222A241818K5019K5347K7021K8663K9106K7549K4222K1018J9796J9879J8823
52211A508261J6029J3795J3965J5169J4740J2103Q830O233M683M641O340Q261
52199A633050P849M635J239K63J317K241K238K166K295J817P54O11K330M964P139
52184A674908Q759J0234J1308J1908J3173J6004J9125K0277J9210J7920J7911
$$ plain form
52268 491779 498298 504128 510210 516203 521287 525342 529043 533553 540113 549080 559384 569917 581251
52255 581251 594747 609937 624358 636491 647519 659470 672761 686387 699492 711865 723754
52244 723754 736121 750462 767664 787546 809852 834535 860393 884923 906940 928349 951767
52233 951767 977181 1002619 1027392 1052645 1078904 1105266 1131417 1158476 1186938 1215290 1241818
52222 1241818 1266837 1292184 1319205 1347868 1376974 1404523 1428745 1449763 1469559 1489438 1508261
52211 1508261 1524290 1538085 1552050 1567219 1581959 1594062 1602892 1609125 1613808 1618449 1624789 1633050
52199 1633050 1640899 1645534 1646773 1647036 1648353 1650594 1652832 1654998 1657293 1659110 1659864 1660475 1662805 1667769 1674908
52184 1674908 1683667 1693901 1705209 1717117 1730290 1746294 1765419 1785696 1804906 1822826 1840737
52173A840737J8784J9733K0640K1242K0799J9460J8520J8305J7258J4321J0933
52162B040732R065Q299O824M631L400L302K338l34k665k773k017l099o094q683
52148B052926r957j1508j4187j6149j5721j4420j4911j6869j7419j5535j3545
52137A892705j3504j4364j4187j3260j2910j2537j0372o802m447m482n073m334
52125A776433k999k790l589l894l400l300m184n019m696l577k985l613m938n922
52111A721527o036n615n446n950o743o981o239m960m065m107m858n740o535p401
52097A640851q233q475p838o836o269o296o394o074n340m558m178m415m948n162
52083A555835m951m914n479o243o640o706o642o200n295m667m940n450n140m264
$$ plain form
52173 1840737 1859521 1879254 1899894 1921136 1941935 1961395 1979915 1998220 2015478 2029799 2040732
52162 2040732 2049797 2058096 2064920 2069551 2072951 2076253 2078591 2078257 2075592 2072819 2070802 2067703 2061609 2052926
52148 2052926 2042969 2031461 2017274 2001125 1985404 1970984 1956073 1939204 1921785 1906250 1892705
52137 1892705 1879201 1864837 1850650 1837390 1824480 1811943 1801571 1794769 1790322 1785840 1780767 1776433
52125 1776433 1773434 1770644 1767055 1763161 1759761 1756461 1752277 1747258 1742562 1738985 1736000 1732387 1727449 1721527
52111 1721527 1715491 1709876 1704430 1698480 1691737 1684756 1678517 1673557 1669492 1665385 1660527 1654787 1648252 1640851
52097 1640851 1632618 1624143 1616305 1609469 1603200 1596904 1590510 1584436 1579096 1574538 1570360 1565945 1560997 1555835
52083 1555835 1550884 1545970 1540491 1534248 1527608 1520902 1514260 1508060 1502765 1498098 1493158 1487708 1482568 1478304
52069A478304m002m471m514l552k327j602j500k284m326o634p055m934k416j850
52055A426837k846l105j443J246L594N045N729O079O655P646Q648R453J0690J2969
52041A497197J5737J7894J9406K1367K4331K7417K9395L0123L0502L1335L2590
52030A777294L3768L4635L5357L5903L5803L4863L3822L3483L3362L2110K9547
52019B149947K7166K6028K5055K2425J8194J4424J2816J2965J2935J0938O577
52008B339470J127l297n474o102o760p991q938q888q409q571r558j0598j1074
51995B244937j1116j1021j0626r627q298p386p212p364p291o724n356k834L75
51982B150457K803L413K868K507K555K338J944K381L848N064M838L462K234K118
$$ plain form
52069 1478304 1474302 1469831 1465317 1461765 1459438 1457836 1456336 1454052 1449726 1443092 1436037 1431103 1428687 1426837
52055 1426837 1423991 1420886 1419443 1420689 1424283 1429328 1435057 1441136 1447791 1455437 1464085 1473538 1484228 1497197
52041 1497197 1512934 1530828 1550234 1571601 1595932 1623349 1652744 1682867 1713369 1744704 1777294
52030 1777294 1811062 1845697 1881054 1916957 1952760 1987623 2021445 2054928 2088290 2120400 2149947
52019 2149947 2177113 2203141 2228196 2250621 2268815 2283239 2296055 2309020 2321955 2332893 2339470
52008 2339470 2340597 2337300 2331826 2325724 2318964 2310973 2302035 2293147 2284738 2276167 2266609 2256011 2244937
51995 2244937 2233821 2222800 2212174 2202547 2194249 2186863 2179651 2172287 2164996 2158272 2152916 2150082 2150457
51982 2150457 2153260 2156673 2159541 2162048 2164603 2166941 2168885 2171266 2175114 2180178 2185016 2188478 2190712 2192830
51968B192830L068L990L350O56k610m435m726n137o451p612p858q222r833j2056
51954B134954j3533j4206j5079j6661j8781k1451k4646k7611k9402l0014l0225
51943A893345l0533l0925l1373l1943l2662l3769l5604l7791l9163l9178l8754
51932A511650l8960l9540l9593l9177l9229m0208m1536m2170m1245l8734l5965
51921A075293l4709l5022l4883l2844l0047k8506k8297k7946k6767k5250k3612
51910G47410k1733k0192j9639j9209j7248j3827j0903r719r636r908j0858j2528
51898E72010j3633j3064j1492j0445j0385j0604j0537j0260r944r541r021q437
51886D44647p750o839n661m407l533l516m278m981m767l708k691k421k840l426
$$ plain form
51968 2192830 2195898 2199888 2203238 2203894 2201284 2196849 2192123 2186986 2180535 2172923 2165065 2156843 2147010 2134954
51954 2134954 2121421 2107215 2092136 2075475 2056694 2035243 2010597 1982986 1953584 1923570 1893345
51943 1893345 1862812 1831887 1800514 1768571 1735909 1702140 1666536 1628745 1589582 1550404 1511650
51932 1511650 1472690 1433150 1393557 1354380 1315151 1274943 1233407 1191237 1149992 1111258 1075293
51921 1075293 1040584 1005562 970679 937835 907788 879282 850985 823039 796272 771022 747410
51910 747410 725677 705485 685846 666637 649389 635562 624659 614940 605304 595396 584538 572010
51898 572010 558377 545313 533821 523376 512991 502387 491850 481590 471646 462105 453084 444647
51886 444647 436897 430058 424397 419990 416457 412941 408663 403682 398915 395207 392516 390095 387255 383829
51872C83829l692l492l151l222l842m527m729m248l001j015R76J724R75J2j0M53
51856C53040M03J01M19J022O65p62j931j987j704k382m414p008q704q364o439
51841C11955m884m935n459m645k726j480j370j142l10p1j221k849l852m242m200
51826B68569l252j468j81m22j511k185k318k510k742k537k002j792k215k874l038
51811B37522k110l25Q67J7k322l777k928r93O7J55O56K071L320L389K666K337
51795B40612K897L573L255J960J032J503K651K985K296J622J341Q21K39R64L363
51780B71114N642N995M741L251J991R42Q14K062L366K946J114j22N0M38N2n21
51764C03875m75j65l16q19j192j530k160k774k742k218k168l064m061l837k174
$$ plain form
51872 383829 380137 376645 373494 370272 366430 361903 357174 352926 349925 348910 349886 351610 352585 352597 352587 353040
51856 353040 353443 353544 353963 354985 355650 354888 352957 350970 349266 346884 342470 335462 326758 318394 311955
51841 311955 307071 302136 296677 292032 289306 287826 286456 285314 285004 284933 283712 280863 277011 272769 268569
51826 268569 265317 263849 263668 263246 261735 259550 257232 254722 251980 249443 247441 245649 243434 240560 237522
51811 237522 235412 235087 235954 235971 233649 229872 226944 225951 226018 226173 226829 228900 232220 235609 238275 240612
51795 240612 243509 247082 250337 252297 253329 254832 257483 260468 262764 264386 265727 266548 266787 267751 271114
51780 271114 276756 282751 287492 290743 292734 293676 294490 296552 299918 302864 303978 303856 303906 304344 304396 303875
51764 303875 303400 303235 302919 302100 300908 299378 297218 294444 291702 289484 287316 284252 280191 276354 274180
51749B74180l02M98K25j76j72j4Q4L36O91O04mk54O17K172L320L613L341K751
51731B91510J797N12j022k886m942o403o366m834k751j101k21J70P04J920L527
51716B69614M259K995J64k387l060j862j72O78O46R10K380M333M963L457R59q89
51700B86988j692k007j902q52J034K632K966K226J403J221J623K128K456K799
51686C01023L432M099M182L624L279L981N558P158Q259Q925R252R160Q736Q406
51672C89074Q626R584J1106J2779J4285J5654J7103J8593J9924K1150K2286K2592
51660E82756K1075J8142J5715J4831J3899J0474M401j942o387q815j0264j1370
51648F42515j2178j2686j2941j2907j2486j1376r072n621k400j234k339l836l892
$$ plain form
51749 274180 273878 274376 274601 274425 274253 274239 274323 274659 275350 275954 275950 275696 276313 278485 281805 285418 288759 291510
51731 291510 293307 293819 292797 289911 284969 278566 272200 267366 264615 263514 263293 263463 264167 266087 269614
51716 269614 273873 276868 277032 274645 271585 269723 269551 270229 270875 271785 274165 278498 283461 286918 287877 286988
51700 286988 285296 283289 281387 280535 281569 284201 287167 289393 290796 292017 293640 295768 298224 301023
51686 301023 304455 308554 312736 316360 319639 323620 329178 336336 344595 353520 362772 371932 380668 389074
51672 389074 397700 407284 418390 431169 445454 461108 478211 496804 516728 537878 560164 582756
51660 582756 603831 621973 637688 652519 666418 676892 681293 679351 672964 664149 653885 642515
51648 642515 630337 617651 604710 591803 579317 567941 558869 553248 550848 549614 547275 543439 539547
51635E39547k739j964k252k774k629j923j143k11J206K843L909M041L615L221
51621E42747L283M157N874P553P817O409M685L789L026J162j123j628L53K924
51607E91028M055L918L930M633N612O649P701Q159P420O061N430O031P091P706
51593F75424P656P114O244N274M341L227J587o11l190n948q375r608r415q824
51579F64896q977r646r784r285r059r404r487q735p730p320p640q409r360r991
51565E40069r592q176o797o440o952p480p482o986o246n601n313n204m842m222
51551D48736l827l739l438k773k371k552k586j848r98j007j495j283m23k68j347
51536D18781k393k125r79k58l55o66p75o90j88R87K311K810K467K367L140M139
$$ plain form
51635 539547 536808 534844 532592 529818 527189 525266 524123 523912 525118 527961 531870 535911 539526 542747
51621 542747 546030 550187 556061 563614 571431 577840 582525 586314 589340 590502 589379 587751 588104 591028
51607 591028 595083 599001 602931 607564 613176 619825 627526 635685 643105 649166 654596 660627 667718 675424
51593 675424 683080 690194 696438 701712 706053 709280 710867 710256 707066 701118 692743 683135 673720 664896
51579 664896 655919 646273 636489 627204 618145 608741 599254 590519 582789 575469 567829 559420 550060 540069
51565 540069 530477 522301 515504 509064 502112 494632 487150 480164 473918 468317 463004 457800 452958 448736
51551 448736 444909 441170 437732 434959 432588 430036 427450 425602 424604 423597 422102 420819 420396 420128 418781
51536 418781 416388 414263 413284 413026 412671 412005 411230 410540 410352 411339 413650 416460 418927 421294 424434 428573
51520D28573M749N495O962Q258P864N868M142M163N628P440R021J0068J0014Q530
51506E26775O163L710J441n48j741j853j698k515m461o474p615p778p237o228
51492D89941n128m333l776l131k491k177j783l88J907L511L207J918J787L696
51478D82760O479Q542R509J0014J0494J0759J0599J0218R808Q946O978M105J644
51465E90855P28Q74M60j315l421m234l328j696n48m25j257k592l686l895l331
51450E63189k728k384j699k50J065Q47q47k198j715R5J670K240J986J023m82j494
51434E58318r48L48J24k306m860n519n098n670p253q019p429p041p795q476p800
51419D80576o437n696n304l950j475Q41J925J806J101N68J016K579M144M496L978
$$ plain form
51520 428573 433322 438817 445779 454037 461901 467769 471911 476074 481702 489142 498163 508231 518245 526775
51506 526775 532938 536648 538089 537541 535800 533947 532249 529734 525273 518799 511184 503406 496169 489941
51492 489941 484813 480480 476704 473573 471082 468905 467122 466734 468641 472152 475359 477277 479064 482760
51478 482760 489239 497781 507290 517304 527798 538557 549156 559374 569182 578128 585106 589211 590855
51465 590855 591583 592457 592917 591602 588181 583947 580619 578923 578375 577950 576693 574101 570415 566520 563189
51450 563189 560461 558077 556378 556128 557193 558040 557193 554995 553280 553375 555045 557285 559271 560294 559812 558318
51434 558318 557370 557718 557842 555536 550676 545157 540059 534389 527136 519117 511688 504647 496852 488376 480576
51419 480576 474139 468443 463139 459189 457714 458555 460480 462286 463387 463955 464971 467550 471694 476190 480168
51404D80168L999M914N625N610N920P407R168R887R794J0015J0551J0445R792
51391E83295J0010J1730J3607J3897J2369J0076P878N866L808J619l99j453q62
51378F71441R36K443K627J937J390J195Q45J42n78j031j071m53Q90K397L369L852
51362F90331M572N920P458Q326P923O326M329K837J929R35l79j418k041l234n509
51347G28305p578p943p195p060p574p136n447m312m808n539m839l263k539l055
51333F50017l839m336m767m997m328k618q11n9n45j186n26J744M120M652L101
51318F35622J107J96N36J682L258M402L858J517j053k487l167m171n663p378r600
51303F18659j2385j4655j5361j4997j4631j4126j2749j0987j0120j0247j0322
$$ plain form
51404 480168 484167 489081 494706 500316 506236 513643 522811 532698 542492 552507 563058 573503 583295
51391 583295 593305 605035 618642 632539 644908 654984 662862 668728 672536 674155 673756 672303 671441
51378 671441 672377 674820 677447 679384 680774 681969 682814 682956 682378 681347 680276 679823 680713 683110 686479 690331
51362 690331 694903 700823 708281 716607 724530 730856 735185 738022 739951 740886 740507 739089 737048 733814 728305
51347 728305 720727 712784 705589 698529 690955 683819 678372 674060 669252 663713 658874 655611 653072 650017
51333 650017 646178 641842 637075 632078 627750 625132 624321 624262 623717 622531 622005 623749 627869 632521 635622
51318 635622 636729 636925 637461 639143 642401 646803 650661 652178 651125 648638 645471 641300 635637 628259 618659
51303 618659 606274 591619 576258 561261 546630 532504 519755 508768 498648 488401 478079
51292D78079j0087j0296j0919j0694r031p027n971n849n943n975n997n812n222
51279C79256m470m074m315m978n404m949l758k854k926l439l496l126k849k495
51265C26123j597n92l11l19O33K439L413K827K146K768L772L128N83j843k081
51250C41089N8L003M908N063M254L781M056M459M516M690N720P519R112R494Q505
51235D20227P053O329O523O489N242L425K497K531J949l54l514n896o987p508
51221D38006q226r285j0389j1049j0907j0138r382q965q528p673o685o191o339
51208C24249o612o408n614m712m414n048o121o651n989m428k970k496k996l569
51194B56221l465k947k693k451j271O28J453K23j375q69J743L974L905K012j9
$$ plain form
51292 478079 467992 457696 446777 436083 427052 420025 414054 408205 402262 396287 390290 384478 379256
51279 379256 374786 370712 366397 361419 356015 351066 347308 344454 341528 338089 334593 331467 328618 326123
51265 326123 324526 323934 323623 323304 323937 326376 329789 332616 334762 337530 341302 344430 345013 343170 341089
51250 341089 341147 344150 349058 354121 358375 362156 366212 370671 375187 379877 385597 393116 402228 411722 420227
51235 420227 427280 433609 440132 446621 451863 455288 457785 460316 462265 461911 458397 452501 445514 438006
51221 438006 429780 420495 410106 399057 388150 378012 368630 359665 351137 343464 336779 330588 324249
51208 324249 317637 311229 305615 300903 296489 291441 285320 278669 272680 268252 265282 262786 259790 256221
51194 256221 252756 249809 247116 244665 243394 244022 245475 245698 244323 243454 245197 249171 253076 255088 255069
51179B55069j049r57m12l95j072j147N86L221M548L915K814K349J718L6j774k084
51163B65366p59P55J064o5j700k410j509p2O5j355k509j863j44Q60N55j91m11
51146B55677J42J137J880J737P89l06j335k649l998m244k925j124J1P16J633K283
51130B49424J863Q90N91R56P60m32j578j740j314j216j658k232k618k667k066
51115B36963o49J023J728O81j495l225l598l206l020k927k094n47O23P61L94K21
51099B21633K79M98J149K265L280L789L935L628K337K94j102r32o8N1p12j554
51083B38770k159k669k721j850o24j33m73p78p57j080k029k804k589j582n28J94
51067B16188N99O76M02J23N42K091M221N574N297M027L031K438J267o38j821j113
$$ plain form
51179 255069 254020 253063 252651 252256 251184 250037 250623 253844 258392 262307 265121 267470 269188 269224 267450 265366
51163 265366 264607 265362 266426 266361 264661 262251 260742 260670 260735 259380 256871 255008 254864 255724 256279 256088 255677
51146 255677 255819 256956 258836 260573 261362 261056 259721 257072 253074 248830 245905 244781 244792 245508 247141 249424
51130 249424 251287 252177 252768 253724 254484 254052 252474 250734 249420 248204 246546 244314 241696 239029 236963
51115 236963 236314 237337 239065 239746 238251 235026 231428 228222 225202 222275 220181 219634 220257 221018 221412 221633
51099 221633 221912 222410 223559 225824 229104 232893 236828 240456 242793 243087 241985 241053 240985 241036 240324 238770
51083 238770 236611 233942 231221 229371 228747 228614 228141 227363 226606 225526 223497 220693 218104 216522 215994 216188
51067 216188 216787 217463 217865 217988 218530 220621 224842 230416 235713 239740 242771 245209 246476 245838 244017 242904
51051B42904P11K086K630K839K632J739J027J729L319L864K804J857K401L355
51037B75897K730M05j859k621j855k78J220J503j25k740m194l364j397j60k8m0
51021B63094J96Q6m70n62J96Q03M22j27M10J701K396K245K156K353K096J379J237
51004B79611J853J878M00j619k727k664j824k48J707K741J929J39j046j269j188
50989B77673j001m94j28o95j874k347j438L02K149L893N259N644M911L887L560
50974B99301M078M795N123N043M731L974K411N07l05Q18K805L814L537L177L231
50959C47040K779J470O21J397L112M347M717M516L632K081P34L05L35K49O39K193
50943C80167M233N733P005Q831J0518J0619R280Q176Q227Q929R863J1190J2569
$$ plain form
51051 242904 243615 245701 248331 251170 253802 255541 256568 258297 261616 265480 268284 270141 272542 275897
51037 275897 278627 279032 277173 274552 272697 272419 273639 275142 275017 272277 268083 264719 263322 263162 263134 263094
51021 263094 263290 263376 262906 262344 262540 263343 263765 263638 264048 265749 268145 270390 272546 274899 276995 278374 279611
51004 279611 281464 283342 283742 282123 279396 276732 274908 274660 276367 279108 281037 281176 280130 278861 277673
50989 277673 276672 276178 276050 275355 273481 271134 269696 269998 272147 276040 281299 286943 291854 295741 299301
50974 299301 303379 308174 313297 318340 323071 327045 329456 329963 329658 330476 333281 337095 340632 343809 347040
50959 347040 349819 351289 351910 353307 356419 360766 365483 369999 373631 375712 376446 376751 377086 377335 377974 380167
50943 380167 384400 390133 397138 405969 416487 427106 436386 444562 452789 461718 471581 482771 495340
50930D95340J3217J3376J4263J6182J7961J8741J9129J9939K0920K1432K1742
50919F92242K2977K5964L0305L4445L6938L8004L9454M2558M6606N0193N3203
50908A112889N6519O0614O5546P1561P8220Q3765Q7094Q9696R3615R8064J00327
50897A997910R9780R8451R7427R5424R1602Q7036Q2208P5508O5997N5580M6509
50886B893432L8353K9459K0155J2343O767K747P6r32j095k129m436o573p383p603
50872B973181q880j2024j6663k2069k7957l4634m2399n0848n9083o6729p4195
50861B557700q1517q7612r1298r2631r2570r1807r0673q9621q8657q6486q1407
50850A583421p3526o5232n8897n4626n0857m6647m2545l9143l5778l1366k6137
$$ plain form
50930 495340 508557 521933 536196 552378 570339 589080 608209 628148 649068 670500 692242
50919 692242 715219 741183 771488 805933 842871 880875 920329 962887 1009493 1059686 1112889
50908 1112889 1169408 1230022 1295568 1367129 1445349 1529114 1616208 1705904 1799519 1897583 1997910
50897 1997910 2097690 2196141 2293568 2388992 2480594 2567630 2649838 2725346 2791343 2846923 2893432
50886 2893432 2931785 2961244 2981399 2993742 3000509 3003256 3003332 3002400 3001305 2999176 2994740 2988167 2980784 2973181
50872 2973181 2964301 2952277 2935614 2913545 2885588 2850954 2808555 2757707 2698624 2631895 2557700
50861 2557700 2476183 2388571 2297273 2204642 2112072 2020265 1929592 1839971 1751314 1664828 1583421
50850 1583421 1509895 1444663 1385766 1331140 1280283 1233636 1191091 1151948 1116170 1084804 1058667
50839A058667k1550j8473j6304j4255j2481j1217r637o832l506j372r11q61m4
50826I41224J389K839M291N965P848R938J2227J4093J4650J4172J4274J6012J8619
50813A077541K0852K2689K4805K6973K8294K8887L0204L3307L7506M1218M3759
50802A416035M5899M8702N2421N6739O1790O8126P5609Q3208R0437R8328J08121
50791B205415J19420J30674J41212J51701J62607J73370J83393J92821K01837
50782C662450K09879K16025K19695K20647K18667K13434K04491J91447J74665
50773E531400J55412J34701J12332Q8024O3214M0538K1544N971o742j6482k3113
50762F106799k6748k7009k3267j6315q826l629k179m963j2191k3628l8501n6100
$$ plain form
50839 1058667 1037117 1018644 1002340 988085 975604 964387 954750 947918 944412 943040 942129 941268 941224
50826 941224 942613 945452 949743 955708 963556 973494 985721 999814 1014464 1028636 1042910 1058922 1077541
50813 1077541 1098393 1121082 1145887 1172860 1201154 1230041 1260245 1293552 1331058 1372276 1416035
50802 1416035 1461934 1510636 1563057 1619796 1681586 1749712 1825321 1908529 1998966 2097294 2205415
50791 2205415 2324835 2455509 2596721 2748422 2911029 3084399 3267792 3460613 3662450
50782 3662450 3872329 4088354 4308049 4528696 4747363 4960797 5165288 5356735 5531400
50773 5531400 5686812 5821513 5933845 6021869 6085083 6125621 6147165 6153136 6146394 6129912 6106799
50762 6106799 6080051 6053042 6029775 6013460 6004634 6001005 5998826 5993863 5981672 5958044 5919543 5863443
50750E863443p5766r6344j16663j36714j57050j76845j93886k06776k15776k21115
50740D266508k22288k19634k14755k08271j98867j85971j71740j58762j46979
50731B539241j34734j21926j10143j00151r1081q2035p3053o4559n6944n0618
50721A653997m5479m0495l4840k9243k5191k2986k1488j9637j7407j5284j3614
50710A368333j2411j1270r622p572o013n500n456n041m101k650l06K758N029N156
50696A311334L886L348M657P298J0559J4294J8157K1317K3432K5297K8005L1718
50684A503302L5467L8218M0236M3213M8513N5334O1457O6039P0625P6932Q4585
50673B123921R1860R7794J02800J07950J14319J22233J30309J36056J38320J38325
$$ plain form
50750 5863443 5787677 5691333 5574670 5437956 5280906 5104061 4910175 4703399 4487623 4266508
50740 4266508 4044220 3824586 3609831 3401560 3202693 3016722 2844982 2686220 2539241
50731 2539241 2404507 2282581 2172438 2072287 1981206 1899171 1826118 1761559 1704615 1653997
50721 1653997 1608518 1568023 1533183 1503940 1478749 1455763 1434275 1414638 1397231 1381947 1368333
50710 1368333 1355922 1344652 1335030 1327458 1321445 1315945 1310489 1305448 1301347 1298697 1298391 1301149 1306178 1311334
50696 1311334 1315220 1318568 1323225 1330523 1341082 1355376 1373533 1394850 1418282 1443579 1471584 1503302
50684 1503302 1538769 1576987 1617223 1660436 1708949 1764283 1825740 1891779 1962404 2039336 2123921
50673 2123921 2215781 2313575 2416375 2524325 2638644 2760877 2891186 3027242 3165562 3303887
50663C303887J37559J35665J31452J24761J15990J04717R0458P4125N7118L9467
50653D315199K0444O80j7840l3590m5885n3865n6758n5246n1212m6018m0117l4049
50641C901743k8564k3928k0435j9403k2178k8283l5946m4420n4474o6579q0115
50630C477418r4286j08340j20698j29411j33838j34721j32631j27784j21298j14803
50620B259608j08338j00386r0687q1362p4391o9251o4117n8131n1561m4680l7694
50609A479010l1153k5496k0451j5541j0798o576l119m91J541L700O548R580J1786
50596A398540J3286J5366J8615K2076K4688K6678K8993L2237L6559M1728M6803
50585A705569N0651N3439N6734O1473O6624P0586P3149P5348P7889Q0664Q3335
$$ plain form
50663 3303887 3441446 3577111 3708563 3833324 3949314 4054031 4144489 4218614 4275732 4315199
50653 4315199 4335643 4336323 4318483 4284893 4239008 4185143 4128385 4073139 4021927 3975909 3935792 3901743
50641 3901743 3873179 3849251 3828816 3809413 3787235 3758952 3723006 3678586 3624112 3557533 3477418
50630 3477418 3383132 3274792 3154094 3024683 2890845 2756124 2623493 2495709 2374411 2259608
50620 2259608 2151270 2050884 1960197 1878835 1804444 1735193 1671076 1612945 1561384 1516704 1479010
50609 1479010 1447857 1422361 1401910 1386369 1375571 1368995 1365876 1365385 1366926 1370626 1377174 1386754 1398540
50596 1398540 1411826 1427192 1445807 1467883 1492571 1519249 1548242 1580479 1617038 1658766 1705569
50585 1705569 1756220 1809659 1866393 1927866 1994490 2065076 2138225 2213573 2291462 2372126 2455461
50574B455461Q5636Q7380Q8582Q9282Q8901Q6317Q1089P4098O6574N9102N2019
50563C314441M5923M0805L5369K8392K0653J4444J1078R772R182R120J0056J1607
50551C560842J2524J2326J1998J2525J3184J2268R370O046L760K068o24n170j1378
50538C639739j9015k8138l8579m9946o1954p4077q5039r3558r9473j03410j05566
50527B880984j05694j04127j01756r8843r4798q9359q3206p7255p1865o6866o1810
50516A925405n6256n0292m4528l9071l3155k6673k1236j8247j6407j2965p367
50505A599208j835J970M971Q656J2748J5962J8038J9879K2325K5532K8963L1628
50493A788045L3053L4202L6478L9589M1582M1416M0241L9630L9813M0382M1383
$$ plain form
50574 2455461 2541097 2628477 2717059 2806341 2895242 2981559 3062648 3136746 3203320 3262422 3314441
50563 3314441 3360364 3401169 3436538 3464930 3485583 3500027 3511105 3520877 3530059 3539179 3549235 3560842
50551 3560842 3573366 3585692 3597690 3610215 3623399 3635667 3645037 3651083 3654843 3656911 3656287 3651117 3639739
50538 3639739 3620724 3592586 3554007 3504061 3442107 3368030 3282991 3189433 3089960 2986550 2880984
50527 2880984 2775290 2671163 2569407 2470564 2375766 2286407 2203201 2125946 2054081 1987215 1925405
50516 1925405 1869149 1818857 1774329 1735258 1702103 1675430 1654194 1635947 1619540 1606575 1599208
50505 1599208 1597373 1599343 1604314 1612970 1625718 1641680 1659718 1679597 1701922 1727454 1756417 1788045
50493 1788045 1821098 1855300 1891778 1931367 1972949 2014365 2054606 2094236 2134049 2174431 2215814
50482B215814M2757M3678M3410M2196M0761L9876M0672M3990M8731N2463N4714
50471B709062N8114O5017P4370Q3416R1209R8725J06605J14865J23962J33934
50461C659279J42854J48292J50355J51344J52203J51340J47407J41228J33921
50452D978223J24691J11897R5509P7167N8126L8295J7302m354k5424m4816o2041
50441E364575p6922q9269r8910j05763j09492j09273j04510r5842q4784p2195
50431D417615n7822m1716k5293j0344K459J3164K1137K5007K3956J8460R471k670
50419D393424j8444l8209o0965q4092j04752j21562j34441j43245j47683j48544
50409C391487j47376j44433j38564j30090j21928j16029j10208j00948q8732p7835
$$ plain form
50482 2215814 2258571 2302249 2345659 2387855 2428616 2468492 2509164 2553154 2601885 2654348 2709062
50471 2709062 2767176 2832193 2906563 2989979 3081188 3179913 3286518 3401383 3525345 3659279
50461 3659279 3802133 3950425 4100780 4252124 4404327 4555667 4703074 4844302 4978223
50452 4978223 5102914 5214811 5310320 5387487 5445613 5483908 5501210 5496856 5471432 5426616 5364575
50441 5364575 5287653 5198384 5099474 4993711 4884219 4774946 4670436 4574594 4489810 4417615
50431 4417615 4359793 4318077 4292784 4282440 4284899 4298063 4319200 4344207 4368163 4386623 4396094 4393424
50419 4393424 4374980 4336771 4275806 4191714 4086962 3965400 3830959 3687714 3540031 3391487
50409 3391487 3244111 3099678 2961114 2831024 2709096 2593067 2482859 2381911 2293179 2215344
50399B215344p0758o5329n8212m9126m0225l2852k6536k0451j4444q743l635P48
50387A825781M809R343J4543J9552K3534K6744K9984L3438L6689L9467M1659M2939
50375B148482M3327M3874M5664M7967M8592M6626M3791M2212M1566L9724L5833
50364B627658L1339K7746K4739K1184J6937J2729R013N884L764L106L695N063
50352B792857P275J0433J3786J6517J9184K3132K8413L3623L7894M1532M4346
50341C068992M5056M3298M0828L9353L8081L4770K8525K0374J1407J758q765k0125
50329C343552l2297m5208n8226p0094p9515q5587q8149q8090q6863q4980q1334
50318B543209p4707o5637n5997m6861l7707k7818j7698q691j521M354R877J4974
$$ plain form
50399 2215344 2144586 2079257 2021045 1971919 1931694 1898842 1872306 1851855 1837411 1828668 1825033 1825781
50387 1825781 1830590 1839933 1854476 1874028 1897562 1924306 1954290 1987728 2024417 2063884 2105543 2148482
50375 2148482 2191809 2235683 2281347 2329314 2377906 2424532 2468323 2510535 2552101 2591825 2627658
50364 2627658 2658997 2686743 2711482 2732666 2749603 2762332 2771345 2777229 2780993 2784099 2787794 2792857
50352 2792857 2800132 2810565 2824351 2840868 2860052 2883184 2911597 2945220 2983114 3024646 3068992
50341 3068992 3114048 3157346 3198174 3237527 3275608 3310378 3338903 3359277 3370684 3372442 3363677 3343552
50329 3343552 3311255 3266047 3207821 3137727 3058212 2972625 2884476 2796386 2709523 2624543 2543209
50318 2543209 2468502 2402865 2346868 2300007 2262300 2234482 2216784 2208093 2206572 2210926 2220803 2235777
50306B235777J8231J8234J4965R431K195o732j6587k5702l3192l9681m5606m9899
50294B081434n1407n0862n0087m9676m8687m6469m3617m0988l8695l6286l3326
50283A591334k9718k5870k2556k0223j8585j7011j5008j2244q785n655m164l968
50271A407547k802Q00N436Q715J0536J2790J6114J8772J9206J8233J7999J9517
50259A552863K1942K3845K4773K5598K7368K9833L1587L1854L1371L0886K9848
50248A861768K7636K5196K3843K2905K0365J5891J1484Q735P016M981K463j14
50236B032169l103p110j1548j4811j5963j5759j5891j7408j9828k1780k2504k2461
50224A844003k2377k2287k1982k1816k2264k3132k3984k4953k6115k6466k4852
$$ plain form
50306 2235777 2254008 2272242 2287207 2296638 2298833 2292101 2275514 2249812 2216620 2176939 2131333 2081434
50294 2081434 2030027 1979165 1929078 1879402 1830715 1784246 1740629 1699641 1660946 1624660 1591334
50283 1591334 1561616 1535746 1513190 1492967 1474382 1457371 1442363 1430119 1421334 1415679 1411515 1407547
50271 1407547 1404745 1405545 1410981 1419696 1430232 1443022 1459136 1477908 1497114 1515347 1533346 1552863
50259 1552863 1574805 1598650 1623423 1649021 1676389 1706222 1737809 1769663 1801034 1831920 1861768
50248 1861768 1889404 1914600 1938443 1961348 1981713 1997604 2009088 2017823 2024839 2029820 2032283 2032169
50236 2032169 2029066 2021956 2010408 1995597 1979634 1963875 1947984 1930576 1910748 1888968 1866464 1844003
50224 1844003 1821626 1799339 1777357 1755541 1733277 1710145 1686161 1661208 1635093 1608627 1583775
50213A583775k1808j9276j8451j8962k0136k1676k2895k2713k1001j8803j6746
50202A361308j4284j1129q242o573n727m753l585k756k114p37J861M913O850O579
50188A321611M532K428J591J690J676J449J662K095J632j0j857l283m628n800
50174A324788n837m809m646o686r413j0209q826p519p904r071r077p350n084l821
50160A224536l909m270l655k063n02O11K011M178O211O994O872P132Q102Q665
50146A260913P731N409K619J99j439k237k491k683l271m530o522r010j1470j3258
50132A219960j3782j2880j1330j0752j2163j4708j6553j7098j7308j7689j7205
50121A058492j4979j2028j0146r674r526r104r035r920j1212j1553r911o485k856
$$ plain form
50213 1583775 1561967 1542691 1524240 1505278 1485142 1463466 1440571 1417858 1396857 1378054 1361308
50202 1361308 1347024 1335895 1327653 1321080 1315353 1310600 1307015 1304259 1302145 1301408 1303269 1308182 1315032 1321611
50188 1321611 1326143 1328571 1330162 1331852 1333528 1334977 1336639 1338734 1340366 1340356 1338499 1335216 1330588 1324788
50174 1324788 1318951 1314142 1309496 1302810 1293397 1283188 1274362 1266843 1258939 1249868 1240791 1233441 1228357 1224536
50160 1224536 1220627 1216357 1212702 1210639 1210137 1210748 1212759 1216937 1223148 1230142 1237014 1244146 1252248 1260913
50146 1260913 1268644 1274053 1276672 1276871 1275432 1273195 1270704 1268021 1264750 1260220 1253698 1244688 1233218 1219960
50132 1219960 1206178 1193298 1181968 1171216 1159053 1144345 1127792 1110694 1093386 1075697 1058492
50121 1058492 1043513 1031485 1021339 1011665 1002139 993035 984000 974080 962868 951315 941404 934919 932063
50108I32063r83j409k742l301k876k281j868j450j366k311m024n286n488n325
50094H91353n663o537p634q892j0087j0607j0307r976j0221j0314q976o144l237
50081G82758j688j812k982m215m459l119q22Q21Q44N4J07J647L973O260Q265R606
50065G95238R500P983O708P362R437J0704J0177R534J0954J4155J6533J6101J3686
50052I38072J1987J2836J5480J7394J6746J4081J1579J0706J0902J0729R731Q751
50040A088994Q572Q972R157Q641P477O023M838M435M672M630L700K712L273N695
50026A171791Q283R247Q746Q189Q102P817P237P246P922P760N848L832M247P312
50012A273579J0761J2664J3109J3074J3056J3399J4740J7176J9563K0559K0106
$$ plain form
50108 932063 931080 929671 926929 923628 920752 918471 916603 915153 913787 911476 907452 902166 896678 891353
50094 891353 885690 879153 871519 862627 852540 841933 831626 821650 811429 801115 792139 785995 782758
50081 782758 781070 779258 776276 772061 767602 764483 763661 764482 765326 765380 765487 767134 771107 777367 785632 795238
50065 795238 804738 812721 819429 826791 836228 846932 857109 866643 877597 891752 908285 924386 938072
50052 938072 950059 962895 978375 995769 1012515 1026596 1038175 1048881 1059783 1070512 1080243 1088994
50040 1088994 1097566 1106538 1115695 1124336 1131813 1137836 1142674 1147109 1151781 1156411 1160111 1162823 1166096 1171791
50026 1171791 1180074 1189321 1198067 1206256 1214358 1222175 1229412 1236658 1244580 1252340 1258188 1262020 1266267 1273579
50012 1273579 1284340 1297004 1310113 1323187 1336243 1349642 1364382 1381558 1401121 1421680 1441786
50001A441786J9405J9503K0307K0921K0722K0028J9711K0174K1029K1818K2512
49990A667916K2840K1802J8886J5338J2985J1864J0232P152L724J275m61k458
49978A791095m805o974r063j1588j4405j6793j8487j9869k1137k2065k2512k2643
49966A600754k2508k1819k0342j8328j6513j5549j5243j4521j2613j0265q955
49955A424098q888q565o830m365k524j473m80N75J097R08M59j21j235k941m572
49940A385143n521n908o317p261q988j1395j3993j6239j7883j8860j9015j8345
49928A235418j7357j6648j6269j5947j5778j6134j6819j7014j6191j4726j3345
49917A059190j2361j1540j0492r031p404o106n221m081k109J04J312J282J155
$$ plain form
50001 1441786 1461191 1480694 1501001 1521922 1542644 1562672 1582383 1602557 1623586 1645404 1667916
49990 1667916 1690756 1712558 1731444 1746782 1759767 1771631 1781863 1789015 1792739 1794014 1793553 1791095
49978 1791095 1786290 1779316 1770253 1758665 1744260 1727467 1708980 1689111 1667974 1645909 1623397 1600754
49966 1600754 1578246 1556427 1536085 1517757 1501244 1485695 1470452 1455931 1443318 1433053 1424098
49955 1424098 1415210 1406645 1399815 1395450 1392926 1391453 1390973 1391548 1392645 1393553 1394012 1393891 1392656 1389715 1385143
49940 1385143 1379622 1373714 1367397 1360136 1351148 1339753 1325760 1309521 1291638 1272778 1253763 1235418
49928 1235418 1218061 1201413 1185144 1169197 1153419 1137285 1120466 1103452 1087261 1072535 1059190
49917 1059190 1046829 1035289 1024797 1015766 1008362 1002256 997035 992954 990845 990949 992261 993543 994698
49904I94698J724K292J997J477K037L527M403L979L196K654J376j332l960m460
49890A013608l321l123m857o578o339m918m431n412o768p954r628j2267j5307
49877I22705j7882j9541k0196k0020j9493j8945j8122j6727j5071j3608j2200
$$ plain form
49904 994698 996422 998714 1000711 1002188 1004225 1007752 1012155 1016134 1019330 1021984 1023360 1022028 1018068 1013608
49890 1013608 1010287 1007164 1002307 995729 989390 984472 980041 974629 967861 959907 950279 938012 922705
49877 922705 904823 885282 865086 845066 825573 806628 788506 771779 756708 743100 730900
$$ [...]
##END NTUPLES=NMR SPECTRUM
##END=
