
##TITLE=AC1216_HNAAH12057_5973515_f5SzcqnN1H
##JCAMPDX= 6.0         $$ Bruker NMR JCAMP-DX V2.0
##DATA TYPE= NMR SPECTRUM
##DATA CLASS= NTUPLES
##ORIGIN= BRUKER
##OWNER= Administrator
$$ 1.72 TOPSPIN		Version 2.1
$$ 2012-04-14 21:14:02.671 -0500  Administrator@TOPSPIN
$$ Compression mode = diff/dup
##.OBSERVE FREQUENCY= 400.13188235
##.OBSERVE NUCLEUS= ^1H
##.ACQUISITION MODE= SIMULTANEOUS (DQD)
##.ACQUISITION SCHEME= undefined
##.AVERAGES= 8
##.DIGITISER RES= 22
##SPECTROMETER/DATA SYSTEM= spect
##.PULSE SEQUENCE= zg30
##.SOLVENT NAME= COFFEE_meoh
##.SHIFT REFERENCE= INTERNAL, COFFEE_meoh, 1, 14.98061
##AUDIT TRAIL= $$ (NUMBER, WHEN, WHO, WHERE, PROCESS, VERSION, WHAT)
$$ ##TITLE= Audit trail, TOPSPIN		Version 2.1
$$ ##JCAMPDX= 5.01
$$ ##ORIGIN= Bruker BioSpin GmbH
$$ ##OWNER= Administrator
$$ $$ C:\Bruker\TOPSPIN/data/COFFEE/nmr/AC1216_HNAAH12057_5973515_f5SzcqnN1H/10/pdata/1/auditp.txt
$$ ##AUDIT TRAIL=  $$ (NUMBER, WHEN, WHO, WHERE, PROCESS, VERSION, WHAT)
(   1,<2012-04-14 21:13:52.093 -0500>,<Administrator>,<TOPSPIN>,<go>,<TOPSPIN 2.1>,
      <created by zg
	started at 2012-04-14 21:12:44.515 -0500,
	POWCHK enabled, PULCHK disabled,
       configuration hash MD5:
       1A 1E CE 29 27 FD 77 03 67 4E F0 E3 C4 B2 CB 90
       data hash MD5: 64K
       35 29 02 77 E5 B1 73 18 80 13 76 AE 4C 62 3E AF>)
(   2,<2012-04-14 21:13:55.859 -0500>,<Administrator>,<TOPSPIN>,<proc1d>,<TOPSPIN 2.1>,
      <Start of raw data processing
       efp LB = 0 FT_mod = 6 PKNL = 1 PHC0 = 0 PHC1 = 0 SI = 32K 
       data hash MD5: 32K
       7B 55 D7 25 52 18 14 BF CB A4 60 2E 47 E4 77 88>)
(   3,<2012-04-14 21:13:56.390 -0500>,<Administrator>,<TOPSPIN>,<proc1d>,<TOPSPIN 2.1>,
      <pk PHC0 = 211.6241 PHC1 = 0 
       data hash MD5: 32K
       D3 B7 10 3E B3 1C 10 D7 FE DE 44 C8 D6 B5 DA A3>)
(   4,<2012-04-14 21:13:56.531 -0500>,<Administrator>,<TOPSPIN>,<proc1d>,<TOPSPIN 2.1>,
      <abs ABSG = 1 
       data hash MD5: 32K
       54 D4 4E 57 1E 8F 2A 0B FE 2F 36 0F C8 4D 4F 7A>)
(   5,<2012-04-14 21:13:56.703 -0500>,<Administrator>,<TOPSPIN>,<proc1d>,<TOPSPIN 2.1>,
      <abs ABSG = 2 
       data hash MD5: 32K
       24 0B 77 DD AA A5 B8 AC 9E 1E E4 37 07 F1 19 F6>)
(   6,<2012-04-14 21:13:56.750 -0500>,<Administrator>,<TOPSPIN>,<proc1d>,<TOPSPIN 2.1>,
      <abs ABSG = 3 
       data hash MD5: 32K
       A9 3E 73 04 A7 F8 14 EB CE 99 FB 49 68 27 F0 12>)
(   7,<2012-04-14 21:13:56.828 -0500>,<Administrator>,<TOPSPIN>,<proc1d>,<TOPSPIN 2.1>,
      <abs ABSG = 4 
       data hash MD5: 32K
       35 1C E4 34 7E 1C ED 8C 74 11 22 45 13 21 D8 5C>)
(   8,<2012-04-14 21:13:56.875 -0500>,<Administrator>,<TOPSPIN>,<proc1d>,<TOPSPIN 2.1>,
      <abs ABSG = 5 
       data hash MD5: 32K
       8D 74 45 2F 14 6C 54 5B 93 00 BF 85 7E F0 24 4E>)
$$ ##END=
$$ 
$$ $$ hash MD5
$$ $$ 80 40 13 78 6C D3 D2 3B 9A 51 4A CE BA A6 92 0B
##$RELAX= 
##$RELAX= 
##$RELAX= 
##$RELAX= 
##$RELAX= 
##$RELAX= 
##$RELAX= 
$$ Bruker specific parameters
$$ --------------------------
$$ [...]
150 150 150 150 150 150 150 150
##$TP07= 0
##$TPNAME0= <>
##$TPNAME1= <>
##$TPNAME2= <>
##$TPNAME3= <>
##$TPNAME4= <>
##$TPNAME5= <>
##$TPNAME6= <>
##$TPNAME7= <>
##$TPOAL= (0..7)
0.5 0.5 0.5 0.5 0.5 0.5 0.5 0.5
##$TPOFFS= (0..7)
0 0 0 0 0 0 0 0
##$TUNHIN= 0
##$TUNHOUT= 0
##$TUNXOUT= 0
##$USERA1= <user>
##$USERA2= <user>
##$USERA3= <user>
##$USERA4= <user>
##$USERA5= <user>
##$V9= 5
##$VALIST= <valist>
##$VCLIST= <CCCCCCCCCCCCCCC>
##$VD= 0
##$VDLIST= <DDDDDDDDDDDDDDD>
##$VPLIST= <PPPPPPPPPPPPPPP>
##$VTLIST= <TTTTTTTTTTTTTTT>
##$WBST= 1024
##$WBSW= 4
##$XGAIN= (0..3)
0 0 0 0
##$XL= 0
##$YL= 0
##$YMAX_a= 496255
##$YMIN_a= -604804
##$ZGOPTNS= <>
##$ZL1= 120
##$ZL2= 120
##$ZL3= 120
##$ZL4= 120
##$ABSF1= 14.98061
##$ABSF2= -5.57192
##$ABSG= 5
##$ABSL= 3
##$ALPHA= 0
##$AQORDER= 0
##$ASSFAC= 0
##$ASSFACI= 0
##$ASSFACX= 0
##$ASSWID= 0
##$AUNMP= <proc_prof1d_extract_pilot.lims>
##$AXLEFT= 0
##$AXNAME= <>
##$AXNUC= <1H>
##$AXRIGHT= 0
##$AXTYPE= 0
##$AXUNIT= <>
##$AZFE= 0.1
##$AZFW= 0.1
##$BCFW= 0
##$BC_mod= 0
##$BYTORDP= 0
##$COROFFS= 0
##$CY= 15
##$DATMOD= 1
##$DC= 0
##$DFILT= <>
##$DTYPP= 0
##$F1P= 0
##$F2P= 0
##$FCOR= 0.5
##$FTSIZE= 32768
##$FT_mod= 6
##$GAMMA= 0
##$GB= 0
##$INTBC= 1
##$INTSCL= 1
##$ISEN= 128
##$LB= 0
##$LEV0= 0
##$LPBIN= 0
##$MAXI= 10000
##$MC2= 0
##$MEAN= 0
##$ME_mod= 0
##$MI= 0
##$NCOEF= 0
##$NC_proc= -8
##$NLEV= 6
##$NOISF1= 0
##$NOISF2= 0
##$NSP= 0
##$NTH_PI= 0
##$NZP= 0
##$OFFSET= 14.98061
##$PC= 1
##$PHC0= 211.6241
##$PHC1= 0
##$PH_mod= 1
##$PKNL= yes
##$PPARMOD= 0
##$PPDIAG= 0
##$PPIPTYP= 0
##$PPMPNUM= 2147483647
##$PPRESOL= 1
##$PSCAL= 4
##$PSIGN= 0
##$PYNMP= <proc.py>
##$REVERSE= no
##$SF= 400.13
##$SI= 32768
##$SIGF1= 0
##$SIGF2= 0
##$SINO= 400
##$SIOLD= 32768
##$SPECTYP= <>
##$SREGLST= <1H.CDCl3>
##$SSB= 0
##$STSI= 32768
##$STSR= 0
##$SW_p= 8223.68421052632
##$SYMM= 0
##$S_DEV= 0
##$TDeff= 65536
##$TDoff= 0
##$TI= <>
##$TILT= no
##$TM1= 0
##$TM2= 0
##$TOPLEV= 0
##$USERP1= <user>
##$USERP2= <user>
##$USERP3= <user>
##$USERP4= <user>
##$USERP5= <user>
##$WDW= 1
##$XDIM= 32768
##$YMAX_p= 463805397
##$YMIN_p= -697173
##$CURPLOT= <Network HP LaserJet P1505>
##$CURPRIN= <$Network HP LaserJet P1505>
##$DFORMAT= <normdp>
##$LAYOUT= <+/1D_H.xwp>
##$LFORMAT= <normlp>
##$PFORMAT= <normpl>
##$SURQMSG= 1
$$ End of Bruker specific parameters
$$ ---------------------------------
##NTUPLES= NMR SPECTRUM
##VAR_NAME=  FREQUENCY,     SPECTRUM/REAL,   SPECTRUM/IMAG
##SYMBOL=    X,             R,               I
##VAR_TYPE=  INDEPENDENT,   DEPENDENT,       DEPENDENT
##VAR_FORM=  AFFN,          ASDF,            ASDF
##VAR_DIM=   32768,         32768,           32768
##UNITS=     HZ,            ARBITRARY UNITS, ARBITRARY UNITS
##FACTOR=    0.250966925370066, 1,           1
##FIRST=     8223.43324360095, -140617,      -220235
##LAST=      0,             2704,            -214273
##MIN=       0,             -697173,         0
##MAX=       8223.43324360095, 463805397,    0
$$ Real data points
##PAGE= N=1
##DATA TABLE= (X++(R..R)), XYDATA
$$ [...]
19472B06437A1328c86258C1440a63087r8119a10030m0732L3175K2658A43761e09210
19460A09777L3448o8997j4137c9010A04301a20247I203a28100E858N4485J18618
19449A78961H8599a59503F2051j3494b68619I107a02474A455a04974D9798J66428
19438B16226f8121j36255A31391c40463a13458d7054k00614p8072J0591j9161
19428c34310M4340D5848J38822n3037b47170G099b59148J19506K6791A93026d19836
19416a67772L3848b2353j2041a6417k11499P8731k0313Q1074j79785a22990R033
19405a13957A35899G451c32147B82315A01542b8567B54783D3532c4742q8202K6721
19394i6223E8921h4848A82909g7864p6059b46q0902K0034M817C799c9112m315
$$ y = [206437, 11328, -386258, 31440, -163087, -261206, -110030, -150762, -117587, -94929, 143761, -509210, 109777, 143225, 74228, 60091, -39010, 104301, -120247, 9203, -128100, 5858, 60343, 178961, 88599, -159503, 62051, 48557, -268619, 9107, -102474, 1455, -104974, 49798, 216226, -68121, -204376, 131391, -340463, -113458, -47054, -247668, -325740, -315149, -334310, -289970, 45848, 184670, 131633, -247170, 7099, -259148, -139642, -112851, 193026, -419836, -167772, -133924, -22353, -34394, -16417, -227916, -149185, -169498, -88424, -268209, -122990, -113957, 135899, 7451, -332147, 282315, 101542, -28567, 254783, 43532, -34742, -122944, -96223, 58921, -84848, 182909, -77864, -153923, -246, -81148, -61114, -56297, 3799, -39112, -43427]
19382d3427k82655h4009k24460a42937j95801R4961O8805N300A59736a57218A59549
19370A73159b67064a6198r5135l68102b21422P0993g0616L2239j59982C3060c19255
19358b58970b5378q210r3273I4864Q7177e6555B30574c14170a00180m3577O5927
19347g7830k37086O0880C3711i0009l51882H5789d6957j83876n4582a38651g99
19335E382a91172f0367p4646C960a97155E4696Q2962c5302A2896b46350B04720
19323a94189i5617q4928j9448q1499h5262I1913a24024L3075B31693a10954a9229
19311B8343Q139h5439A3623a65551L7825q0777C1757c1663C3966J46686j2601
19300A68051j4549a82372A12456a88287C20710e6415k24589P7832o4q6810J17154
$$ y = [-43427, -326082, -84009, -308469, -142937, -338738, -243777, -174972, -169672, 159736, -157218, 159549, 173159, -267064, -16198, -111333, -479435, -221422, -150429, -70616, -38377, -198359, 33060, -319255, -258970, -25378, -33588, -126861, 94864, 182041, -56555, 230574, -314170, -100180, -143757, -77830, -314916, -254036, 33711, -90009, -441891, 85789, -46957, -230833, -285415, -138651, -799, 5382, -191172, -60367, -135013, 3960, -197155, 54696, 137658, -35302, 12896, -246350, 204720, -194189, -95617, -180545, -199993, -281492, -85262, 91913, -124024, -90949, 231693, -110954, -19229, 28343, 36482, -85439, 13623, -165551, -127726, -208503, 31757, -31663, 33966, 180652, 168051, 153502, -182372, 112456, -188287, 320710, -56415, -281004, -203172, -203236, -290046, -172892]
19289a72892J2933B0042a30761b2943j02642a2934j00670k79936A74266q0493
19279I3773c76011a22007R119m528d8445J730j20530A81754d5621j3140D9559
19267a58083A91589K247a3524l7124k74655f9900C4431a0051l60058A97293k5240
19256A72053n8836N4389b0370L073k41655A65031b16545j23650J25981J02460
19246a11754J1543C48660b61630B36979a93891e3189k74764g9104j47903c4022
19235a96146j80726i4480d4366j21128B91193c06955c6660k50908j76512G0223
19224A46155a06632k72149e0615j62475A83676C6691c80068A72105b39649J08831
19214a30818j46620d5414j91347p2281A81861b4032q9076A6874J56877c09685
$$ y = [-172892, -159959, 20042, -130761, -22943, -125585, -12934, -113604, -393540, 174266, 93773, -376011, -122007, -112888, -117416, -48445, -46715, -167245, 181754, -45621, -58761, 49559, -158083, 191589, 193836, -13524, -50648, -325303, -69900, 34431, -10051, -370109, 197293, 172053, 113217, 167606, -20370, -17297, -258952, 165031, -216545, -340195, -214214, -111754, -100211, 348660, -261630, 236979, -193891, -53189, -327953, -79104, -227007, -34022, -196146, -376872, -94480, -44366, -165494, 291193, -306955, -36660, -287568, -464080, 70223, 146155, -106632, -378781, -50615, -213090, 183676, 36691, -380068, 172105, -239649, -130818, -277438, -45414, -236761, -309042, 181861, -24032, -113108, 16874, 173751, -309685]
19203a07530a2674k47690A9708b34285J15282p8926m9674A69865n6017D3388a71966
19191A76392b7788A15826j0167N5287k6508a69107f2712n255j20316A16801a4366
19179c20651A48450J15089f5436D6983L03520F2927M5493a32930A60349o1454
19169I8895b04642p5538f6254c1903l106B38413g7953j89622m9436I794M5292
19158E5086a17338H9900B634J49448b36256Q9656l2936B21255a66611A3260b34768
19146g662A4705R4447b51137A87731F6936b98383g4446j97290B6949J03481J78348
19135C08778H0797d15681b0755j52210Q3285j36885O7938e5507j09520c875l86069
19124c89944B48189a26725e5398n3064A25612d8857b229C9311J33959c58393a29176
$$ y = [-107530, -12674, -260364, 19708, -234285, -119003, -197929, -247603, 169865, 113848, 43388, -171966, 176392, -27788, 115826, 105659, 160946, 134438, -169107, -62712, -67967, -188283, 116801, -14366, -320651, 148450, 263539, -65436, 46983, 350503, 62927, 108420, -132930, 160349, 98895, -204642, -280180, -66254, -31903, -35009, 238413, -77953, -267575, -317011, 9794, 55086, -117338, 89900, 2634, 152082, -236256, -146600, -179536, 221255, -166611, 13260, -234768, -7662, 14705, 109152, -251137, 187731, 66936, -298383, -74446, -271736, 26949, 130430, 308778, 80797, -415681, -20755, -172965, -89680, -226565, -158627, -55507, -165027, -3875, -389944, 248189, -126725, -55398, -108462, 125612, -48857, -2229, 39311, 173270, -358393, -129176]
19112b27838F373b83582J12389A24226a15230A07274m6762e1499B92776i963k55661
19101b65624a26723N3133n8707q2322o6799p2103J66760r8102e3717J6045C74735
19089H4596a93299K7884q7959g3489o4846n6362C1230J93962a1860j30978c4340
19077A11241b31824B11657h2133j72635R9553A07237c81066a70967D8450b24212
19066B10136a18251K5832E2254a2277D33056d13715a32238k64107e0839A4727
19055D1533b26453d5228A20495b51879j01703A35475b67815J23845B35447a18511
19044a52707E6362d7590b3097q919q1297b1871k47250c6176D0965L17332a67831
19032b63943B1728d0081m76221a71321A563c31835J0658R3504m7653A09045b27471
$$ y = [-227838, 6373, -283582, -171193, 124226, -115230, 107274, 60512, -51499, 292776, -9963, -265624, -126723, -73590, -132297, -214619, -281418, -353521, -186761, -284863, -53717, -37672, 374735, 84596, -193299, -165415, -253374, -73489, -138335, -194697, 31230, 225192, -11860, -142838, -34340, 111241, -231824, 211657, -82133, -254768, -155215, 107237, -381066, -170967, 48450, -224212, 210136, -118251, -92419, 52254, -12277, 433056, -413715, -132238, -396345, -50839, 14727, 41533, -226453, -45228, 120495, -251879, -353582, 135475, -267815, -143970, 235447, -118511, -152707, 56362, -47590, -23097, -32016, -113313, -21871, -269121, -36176, 40965, 358297, -167831, -263943, 21728, -40081, -516302, -171321, 1563, -331835, -321177, -227673, -275326, 109045, -227471]
19020B25261h1405j94963B76566A04830H88a30323r7046D9458P2339h67k17285
19009b18152J7150A69018B8452K29933e6000A21708k7658K72071A39674a48761
18998A6094a4213j01403A43177n542b79200J15171P6395F112f0470l4005A49832
18986A02491g3830j41178B06358c0203j73713b7998l0944A29759b28032O6381
18976a61651r3177A13364a96110A11692d3801k43002J02161O6702A90212B5813
18965e1256A53413L4913H9811g490A44196L884O2718I6236J23706L92163B2110
18953A59273f0198B03498a13839d2787H8899J2814l7078c8817A24228G926J71441
18942A79367a58332j18012b4074E6916K1121J3362K8327a81525n2260r5026B66281
$$ y = [225261, -81405, -276368, 276566, 104830, 888, -130323, -227369, 49458, 121797, -867, -218152, -201002, 169018, 28452, 258385, -56000, 121708, 94050, 366121, 139674, -148761, 16094, -14213, -115616, 143177, 137635, -279200, -164029, -87634, 6112, -60470, -94475, 149832, 102491, -73830, -215008, 206358, -30203, -203916, -27998, -58942, 129759, -228032, -161651, -254828, 113364, -196110, 111692, -43801, -286803, -184642, -117940, 190212, 25813, -51256, 153413, 188326, 89811, -7490, 144196, 148080, 210798, 96236, 219942, 612105, 22110, 159273, -60198, 203498, -113839, -42787, 88899, 101713, 64635, -38817, 124228, 7926, 179367, -158332, -276344, -24074, 56916, 78037, 91399, 119726, -181525, -233785, -328811, 266281]
18930C2270b55170j92126A47082b93851D6990j9704L0367P1417j1693P6746q4477
18919A09646D3569b73604C72788A26128b53638C98390b50544b2333k22112H8031
18908a8160k82244c4617k72229A81726b31480E4229K12486a07396I678K43926
18898B53604b09829c3032m8485J5963F9159R3476D6173a24435E7428J44959e016
18886a53596K6911n1940D8759O3116c17045j61270a97876B22813c24975a39545
18875H531i6217m7018F3673a32770b2870H6250a18088k3636q4407d3231A32657
18863G9064b79340j0499M8788J08843A84923B2127h5813k7437A99584q2688E666
18851A76824B590d0436A87146K85815d3058B23b59641h5819K4178J4023C9036
$$ y = [32270, -255170, -447296, 147082, -293851, 46990, 27286, 57653, 129070, 117377, 194123, 109646, 43569, -273604, 372788, 126128, -253638, 398390, -250544, -22333, -244445, 88031, -18160, -300404, -34617, -306846, 181726, -231480, 54229, 266715, -107396, 9678, 253604, -209829, -33032, -81517, -65554, 69159, 162635, 46173, -124435, 57428, 202387, -5016, -153596, -126685, -178625, 48759, 111875, -317045, -478315, -197876, 222813, -324975, -139545, 8531, -96217, -143235, 63673, -132770, -22870, 86250, -118088, -141724, -226131, -43231, 132657, 79064, -279340, -289839, -241051, -132208, 184923, 22127, -85813, -113250, 199584, 116896, 5666, 176824, 2590, -40436, 187146, 472961, -43058, 223, -259641, -85819, -61641, -47618, 39036]
18839b20833p5561m2205A07487K22479i3230j77440a04156j43276A81270G5915
18828C31958H371b80673Q1200A68824J48573H7142J95653f0761r1534C28140g7881
18816a62775c7683n6041j42425a08057A15679k2525a91918d0387j06202E1862
18805a4741l3945C05840i4771d3258C6213b84632c6309b929j62697k2310q5669
18794b73605C38283M491D2813M9496d5380a9293A5605K2532K1339b01011o5014
18783b66025A66858b00314k0846Q7647c7294m46365a19855l6365k69892B7381
18772c6346C97238a81799e3578A00585L9550c31132B70003b09642A87585c80625
18761A7439c7207j4438p3187A26826h3321k22529B36899b46491A54106k2229b34269
$$ y = [-220833, -296394, -338599, 107487, 329966, -93230, -270670, -104156, -247432, 181270, 75915, 331958, 8371, -280673, -199473, 168824, 317397, 87142, 282795, -60761, -152295, 328140, -77881, -162775, -37683, -93724, -236149, -108057, 115679, 93154, -191918, -40387, -146589, 51862, -14741, -48686, 305840, -94771, -43258, 36213, -284632, -36309, -2929, -165626, -187936, -273605, 338283, 342774, 42813, 92309, -45380, -19293, 15605, 38137, 59476, -201011, -266025, 166858, -200314, -221160, -133513, -37294, -483659, -119855, -156220, -426112, 27381, -36346, 397238, -181799, -53578, 100585, 140135, -331132, 270003, -209642, 187585, -380625, 17439, -37207, -51645, -124832, 126826, -83321, -305850, 236899, -246491, 154106, 131877, -234269]
18749d3090g727k35678a01586B66022p4670b06865A441a75672B19127A2009J6336
18738B8345b64824B10380E8594a17628F7425J96642d4545A06220J53504b83303
18727h9655j40092C6494h5288C0055b08755P6439c7925j3811j70756R6116m6721
18716a73097I5813g2513J944B08066m535a75404B6660e57573h7136b2503E2151
18704C88193a86358h1838j990j5993l99160h4878C83129A01943f7431P73o1508
18693a28166J4100D2567c02114e2482B24634A12243h2411k08381a21443k5522
18683a46965n5873j07415J40553C23700b1350B27765H0505e8162q5216b7994I3380
18671D9715M9858b8457F4351i648B34506J9143a01792B10418b89821A50242a43524
$$ y = [-43090, -7727, -243405, -101586, 266022, 191352, -206865, 1441, -175672, 219127, 12009, 28345, -264824, 210380, 58594, -117628, 67425, 264067, -44545, 106220, 259724, -283303, -89655, -229747, 36494, -85288, 30055, -208755, -132316, -37925, -51736, -222492, -126376, -173097, 95813, -72513, -70569, 208066, 203531, -175404, 26660, -557573, -87136, -22503, 52151, 388193, -186358, -81838, -83828, -99821, -498981, -84878, 383129, 101943, -67431, -66658, -128166, -114066, 42567, -302114, -52482, 224634, 112243, -82411, -290792, -121443, -146965, -202838, -310253, -169700, 323700, -21350, 227765, 80505, -58162, -143378, -27994, 93380, 49715, 99573, -28457, 64351, -9648, 234506, 253649, -101792, 210418, -289821, 150242, -143524]
18659B40264i1300l4100l9950O2317o8158j82364a039j27376A35096c76594a38646
18647a59289g063j27045H0928J70380b23060b4764E424h5050k22335B2223N4664
18636G6887a46471c6875E0861h4336j43528j32767e9510m44533J14827A06655
18625a02574k79345B25732b59412B3004d4329A28975m0521a26271A22498J66976
18615B89474g5179A23883e0574E7033A5926a43429A56017B710b26603A63496g1770
18603A13710B1113a97645R4805A75007n0279g0273l70622C07328b66049E2415
18592b73917A21328a90150A31336K3362g1893r7836B10339b51133Q0824I55a09070
18580b3793q3749M4665p0918D2786c09040J41267d8776j0916n2354j27135F8329
$$ y = [240264, -91300, -125400, -165350, -103033, -171191, -353555, -1039, -128415, 135096, -376594, -138646, -159289, -7063, -134108, 80928, 251308, -223060, -24764, 5424, -85050, -307385, 22223, 76887, -146471, -36875, 50861, -84336, -227864, -360631, -59510, -504043, -389216, 106655, -102574, -381919, 225732, -259412, 23004, -44329, 128975, 88454, -126271, 122498, 289474, -75179, 123883, -50574, 57033, 15926, -143429, 156017, 2710, -226603, 163496, -71770, 113710, 21113, -197645, -102840, 175007, 124728, -70273, -440895, 307328, -266049, 52415, -273917, 121328, -190150, 131336, 154698, -71893, -169729, 210339, -251133, -170309, 955, -109070, -23793, -107542, -62877, -133795, 42786, -309040, -167773, -48776, -59692, -112046, -239181, 68329]
18568B15506b18998f6150p3221A12348a50060k47230B03874h3996A10815c19441
18557e1491f626j78172h0416l07395J28456A16088g4448A13186a76978E6587a40006
18545b06165j4061A79409j5984a9673A09085a9q2471l8813n5478f1386B0853d20094
18532e3947K393n4663C2255h3926G428K60633D6111H863O5717a2089G0980K6329
18520I7309a49398I7993a48101M8252l3949A8432a84318A03805e8027j06013A01293
18508B52084a6599m3022k57086j13741a63120E446c04595p4263C19182k6892a53645
18496E9045i77j18122A04002d5537B7095O1205K3795g4125A91081J568a54701
18484d9175A32465i7998k56697a62452A0304a46922K6968R123k3871J523A2652
$$ y = [215506, -218998, -66150, -139371, 112348, -150060, -397290, 203874, -83996, 110815, -319441, -51491, -6626, -184798, -80416, -387811, -259355, 116088, -74448, 113186, -176978, 56587, -140006, -206165, -220226, 179409, 163425, -19673, 109085, -19, -82490, -121303, -176781, -61386, 20853, -420094, -53947, -51554, -106217, 32255, -83926, 7428, 268061, 46111, 8863, 74580, -12089, 70980, 97309, -149398, 97993, -148101, -99849, -133798, 18432, -184318, 103805, -58027, -164040, 101293, 252084, -16599, -59621, -316707, -430448, -163120, 5446, -304595, -378858, 319182, 292290, -153645, 59045, -977, -119099, 104002, -45537, 27095, 88300, 112095, -74125, 191081, 192649, -154701, -49175, 132465, -97998, -354695, -162452, 10304, -146922, -119954, -110831, -134702, -133179, 12652]
18472f5863j28755C86682a17843H8574J9983a66761j64758J33473i7322K6846
18462g0476I7548b57743A4125a19270q7144D6444K77103D8680c9970F3249k8223
18451C5026b1947k16000A3615c4125p3441k8761k52700P5655f274j96619A31219
18439A74675i2458A24200b3222j87347B5098a30653d6594A5330p427c138j08232
18428a11370j18360f7599l32305F8872a30031B23844a36593C16925e698A75927
18417a77383M396C00312k3509a33104I8531J46142f0278i051E8244K20809a94427
18405A6678J03617b31914p4871A84419a10400j73767B63197f46j94241g966j00928
18394a08894K7158k4047A97995N0155b4227C0273Q3176h4327M1945B66132J0383
$$ y = [-65863, -194618, 386682, -117843, 88574, 108557, -166761, -331519, -198046, -97322, -70476, 97548, -257743, 14125, -119270, -206414, 46444, 323547, 48680, -39970, 63249, 35026, -21947, -237947, 13615, -34125, -107566, -136327, -389027, -313372, -6274, -202893, 131219, 174675, -92458, 124200, -23222, -210569, 25098, -130653, -46594, 15330, 7903, -3138, -111370, -229730, -67599, -399904, 68872, -130031, 223844, -136593, 316925, -5698, 175927, -177383, -172987, 300312, 276803, -133104, 98531, 244673, -60278, -9051, 58244, 279053, -194427, 16678, 120295, -231914, -306785, 184419, -110400, -284167, 263197, -646, -194887, -7966, -108894, -81736, -105783, 197995, 248150, -24227, 30273, 113449, -84327, -42382, 266132, 276515]
18383B76515L9829j06102a31174D01698a55533l7539A84422a10834A16037J87611
18373C03648I1308a27260c5445A0852b32838A62496E7525L9757d12986e6142A2127
18361c51743C09882a93957j2293i7362B88179b53865b7287G4843c7028k48053
18351b85081I879i2855B45250B6960A100a41037j7996j4682f9813j91839a02549
18339B90652f6341o9510k2134j9668b4925l14053A94618n2556a14194o7886n8850
18328b40930E08153A48143f9517D96962e1796A8463L0011j207b06976j6369A2426
18316a30535P160l6378c546l49067Q5291I2780a12313j66057p785g7640j90564
18305b68204f8358B57844g3558A09525f3573K6099A55670R0780d85485K42045
$$ y = [276515, 316344, 210242, -131174, 401698, -155533, -193072, 184422, -110834, 116037, 303648, 91308, -127260, -35445, 10852, -232838, 162496, 57525, 97282, -412986, -56142, 12127, -351743, 309882, -193957, -206250, -97362, 288179, -253865, -27287, 74843, -37028, -285081, 9879, -92855, 245250, 26960, 1100, -141037, -159033, -173715, -69813, -261652, -102549, 290652, -66341, -135851, -157985, -177653, -24925, -338978, 194618, 142062, -114194, -182080, -240930, 508153, 148143, -69517, 496962, -51796, 18463, 48474, 47267, -206976, -223345, 12426, -130535, -123375, -159753, -3546, -352613, -267322, 92780, -112313, -278370, -286155, -77640, -268204, -68358, 257844, -73558, 109525, -63573, -37474, 155670, 246450, -485485, -243440]
18295b43440P1479A56567a79796A01858b7448j83048p3771B34667A16296K3214
18285A39510b37447j07330B3000c04882F097h8850k91040E4738a67468m4748B35761
18273c39315a36092O0738p8579A56272b3356B8027h712j07513j13536K1667M3340
18262a64754a8768A47185B9225J274g089o3288a9256k07170B5108g715k18527
18251b26242a1379k27309A42818a13631C57301j17665f2511j06598A1614J21243
18241A32857F4889b43702i2120m0438B4352c03212P544J30684O8309j511j53325
18230b51511f0394E8481N1478a18061A19758d3877k21599i7382d6333j12071A0177
18218b41732I2195b82216D191e2421k98441D9041f3405D1230a28444c3698n870
$$ y = [-243440, -171961, 156567, -179796, 101858, -27448, -210496, -284267, 234667, 116296, 139510, -237447, -344777, 23000, -304882, 6097, -88850, -379890, 54738, -167468, -212216, 235761, -339315, -136092, -75354, -153933, 156272, -23356, 28027, -8712, -116225, -229761, -208094, -164754, -18768, 147185, 29225, 30499, -7089, -70377, -19256, -226426, 25108, -7715, -226242, -11379, -238688, 142818, -113631, 357301, 239636, -62511, -169109, 11614, 132857, 64889, -243702, -92120, -132558, 24352, -303212, -295668, -164984, -96675, -98186, -251511, -60394, 58481, 109959, -118061, 119758, -43877, -265476, -97382, -46333, -158404, 10177, -241732, 92195, -282216, 4191, -52421, -350862, 49041, -63405, 41230, -128444, -33698, -39568]
18207c9568C9288M7916L52594D0966f2858a0885A20202b12131A38260l0351B7301
18195b04569a00506E5297b99404j37889I3946g8089E6880a02627m0308I0958J5480
18184A06438a39845e704A33504a92931C49975A13856m7177a48381A43394K1280
18174A64674K2986f2992j23906j38790a47403C4549J69387b33191E8468a12366
18163A27417E9839g4964F8887J75780e8567I2236J31212C3890J56733a10677C3118
18151d9050k09327C5763a09063b0332A14247L381e8090A10687e46511a17085l2998
18140a50083A25982J29225B0437e5864k68182L6556A69008D4450j2640J5212K50914
18129B97936g6869L1957A66351j1397J09207c71559F7962j3579g9303C10086B9272
$$ y = [-39568, 39288, 87204, 439798, 40966, -62858, -10885, 120202, -212131, 138260, 107909, 27301, -204569, -100506, 55297, -299404, -437293, 93946, -78089, 56880, -102627, -142935, 90958, 106438, -139845, -5704, 133504, -192931, 349975, 113856, 66679, -148381, 143394, 164674, 187660, -62992, -186898, -325688, -147403, 34549, 203936, -233191, 58468, -112366, 127417, 59839, -74964, 68887, 244667, -58567, 92236, 223448, 33890, 190623, -110677, 33118, -49050, -258377, 35763, -109063, -20332, 114247, 117628, -58090, 110687, -546511, -117085, -150083, 125982, 255207, 20437, -55864, -324046, -287490, 169008, 44450, 31810, 47022, 297936, -76869, -44912, 166351, 154954, 264161, -371559, 67962, 54383, -79303, 310086, 29272]
18117A59538d03870A2544a91609i1372P585D1747L16043N2011E7120a15746b2645
18105B0119b4182j19634C06066c07972A56157P6682f4854e71F8518i1030H0096
18093E2673I510K37487b604A90748c73013H1068c1411A33045m0434i2042j31628
18082b23670h9700B86349b3349j65829l4938l7186A64626J9555a32131B3147O0611
18071H3758a21170j8753A58276m952b42410A92364a44538C1550b76195j25928
18061d02123a39698a94k13672a0251m3787G0040a21928A22050g9395n3955f5387
18049e5799o264b5250i011j66165j95364J70978j40127A53611b93546D1087j9059
18038B2028b98923c2451J4555j41929k5737O833K0462B02888b9662j08451j17836
$$ y = [159538, -403870, 12544, -191609, -91372, -83787, 41747, 357790, 409801, 57120, -115746, -22645, 20119, -24182, -143816, 306066, -307972, 156157, 232839, -64854, -571, 68518, -91030, 80096, 52673, 9510, 246997, -2604, 190748, -373013, 81068, -31411, 133045, 92611, -92042, -223670, -89700, 286349, -23349, -189178, -224116, -261302, 164626, 184181, -132131, 23147, 83758, -121170, -139923, 158276, 153324, -242410, 192364, -144538, 31550, -276195, -402123, -139698, -194, -213866, -10251, -54038, 70040, -121928, 122050, -79395, -133350, -65387, -55799, -62063, -25250, -9011, -175176, -370540, -199562, -339689, 153611, -293546, 41087, 22028, -298923, -32451, -17896, -159825, -185562, -178729, -158267, 202888, -29662, -138113, -255949]
18027b55949C15787f2619A42702k8987a07029I2750E114J57585K52755A1856J81630
18016A93486r4404P5652A81a02494p8699q0484B88927r9887f7344E8457B1992
18004h9565J6968A89708r2496k3816k123C4592K20098G290J58345A2645g0764
17992A15534b91867B78734O090h5825I9633b07042P6901r1062d7532p2929p6496
17981a96957B81311G3919j0410c6953A17392M1751n9397d2967D6237P8945b83640
17969f9940j82481M0102A6849J19924f0855m8519A15183K2537a26070j18934J9342
17958b25662c0651l68265B13526A0157d1453k40669A32221E1327e476o7805A08329
17946A55208E5907j9783g7112J2604B6265J7221J75171C4770b41992a03476f425
$$ y = [-255949, 315787, -62619, 142702, 113715, -107029, 92750, 5114, 162699, 415454, 11856, 193486, 99082, 174734, 181, -102494, -181193, -261677, 288927, 189040, -67344, 58457, 21992, -89565, -72597, 189708, 97212, 73396, 71273, 34592, 254690, 7290, 165635, 12645, -70764, 115534, -291867, 278734, 284824, -85825, 99633, -207042, -130141, -221203, -47532, -120461, -196957, 281311, 73919, 63509, -36953, 117392, 159143, 99746, -42967, 46237, 125182, -283640, -69940, -252421, -212319, 16849, 136773, -60855, -109374, 115183, 137720, -126070, -245004, -225662, -30651, -398916, 213526, 10157, -41453, -282122, 132221, 51327, -5476, -73281, 108329, 155208, 55907, 36124, -77112, -64508, 26265, 43486, 218657, 34770, -241992, -103476, -6425]
17934E8763P8848h8568A69319a10226J0335A04339b71705g9811n5378e7184j74348
17923b31532A97827j4280c15E4041k44D956N6541M1354d4136l1281j59294i4633
17910A45458a64007I3930g8104l1104j59040d1846B2508b18493A23555b6523C58791
17898A36885A1814K36257a67264A91638f487A29217h4207C18400a91228A42174
17887A9592b70930B82549j11548p861M845K09692A45289b78586D6698D895K68685
17876B73580j10783o6323B3287b25439i479j01834C6262e2399r9244j26661A09201
17864F5046a27438c0038j00477E8384d6466A16973g7909A16579A9614J41531D3666
17852a21453m1052F5500a7279C95186m2184j34053b6999A00753l9393g9174A88595
$$ y = [58763, 137611, -88568, 169319, -110226, -99891, 104339, -271705, -79811, -135189, -57184, -231532, 197827, 183547, -315, 54041, 53797, 4956, 61497, 102851, -44136, -75417, -234711, -94633, 145458, -164007, 93930, -78104, -109208, -268248, -41846, 22508, -218493, 123555, -26523, 358791, 136885, 11814, 248071, -167264, 191638, -6487, 129217, -84207, 318400, -191228, 142174, 19592, -270930, 282549, 171001, 163140, 167985, 377677, 145289, -278586, 46698, 4895, 273580, 162797, 96474, 23287, -225439, -9479, -111313, 36262, -52399, -151643, -278304, 109201, 65046, -127438, -30038, -130515, 58384, -46466, 116973, -77909, 116579, 19614, 161145, 43666, -121453, -162505, 65500, -17279, 395186, 353002, 218949, -26999, 100753, 61360, -79174, 188595]
17840b04351B76056h6471B23165j7258A9490b16934G7029b93922C14199a16077
17829E685b32915a07541A53131K2576K74028f0872j56185A81288J26753d7721
17818e6876r2232j00371a04330C79195A6234b1896B2850L35886A02186b025m919
17807f944A9834e7179r9516e439k61839I4709i6865A92141J6342a07566B88520
17795d88316A30859a38883C02842C2520e3363I2508A9958J65216a18973c2371
17784B0620K15857J05665A02309f164k02189l337A75820A2844c59461a71643C4991
17772A22901Q4830E3748o179a32045F9094L4554M3508J19485j23751Q5H056N76142
17760E84198a99618M6538D04351A71572c6512d153n4632E274a22068A34735K6207
$$ y = [-204351, 276056, -86471, 223165, 205907, 19490, -216934, 77029, -293922, 314199, -116077, 5685, -232915, -107541, 153131, 175707, 449735, -60872, -217057, 181288, 308041, -47721, -56876, -149108, -249479, -104330, 379195, 16234, -21896, 22850, 358736, 102186, -2025, -6944, 19834, -57179, -156695, -5439, -267278, 94709, -96865, 192141, 208483, -107566, 288520, -488316, 130859, -138883, 302842, 32520, -53363, 92508, 19958, 185174, -118973, -32371, 20620, 236477, 342142, 102309, -6164, -208353, -211690, 175820, 12844, -359461, -171643, 34991, 122901, 207731, 53748, 47569, -132045, 69094, 103648, 147156, 266641, 142890, 142975, 8056, 584198, -199618, -153080, 404351, 171572, -36512, -4153, -58785, 5274, -122068, 134735, 160942]
17749A60942B0040a34A31762K09820L605D2794j71P369J69227M3923a49227B3969
17736A61879b9909A30281a44710H1120K23784B3477d48020H6967K09286p2607
17726B23646d5286A36477h1326B6307a93763c0170A21417b64926a1053B06805
17715b6668B56885p4285H9263K68611K419F2414L73855r4163E3285b16907A85510
17703a51128B27844j05859E8949J26852h4259B33294a10995D9377a03553F0481
17692B20596I7698J57916j01860P9059a17517A30846J80336q2668I5530c11361
17681a00245M6755j71410B5817R307J04982D586L99744j92940o6298B3671L11091
17670C34762j12640J4207d2092j6001B64647a87972n4494Q9874c8409A51866l9492
$$ y = [160942, 20040, -134, 131762, 341582, 345187, 42794, 42623, 49992, 219219, 263142, -149227, 23969, 161879, -29909, 130281, -144710, 81120, 304904, 23477, -448020, 86967, 296253, 223646, -45286, 136477, -81326, 26307, -193763, -30170, 121417, -264926, -11053, 206805, -26668, 256885, 182600, 89263, 357874, 360293, 62414, 436269, 342106, 53285, -216907, 185510, -151128, 227844, 121985, 58949, 185801, -84259, 233294, -110995, 49377, -103553, 60481, 220596, 97698, 255614, 153754, 232813, -117517, 130846, 311182, 228514, 95530, -311361, -100245, -53490, -224900, 25817, 35124, 140106, 4586, 404330, 211390, 145092, 23671, 334762, 222122, 236329, -42092, -58093, 264647, -187972, -242466, -152592, -38409, 151866, 112374]
17659A12374g151C24868j59424J72430p9484c09768D6486J86189I7395M7735J9835
17648A64965L52c0036A01586g5054A18120a18133l28817A59313J64307H3456e4140
17636D2218K22254F5800P9428M9575b45826A57589D1875b44956L0333B9602J46675
17625A76277a42647A23237J50605d7005f900A03439O7863a36257C79051d015m1341
17614d5356o8452A82472J13489a37m5143F6133R8280m9997Q1301M8648d1569B48805
17601B34244k5783Q5823c1591o8901I8837M3583b04017A06377N8468c1465A30175
17589C58742A38862a85513B59109K1575A36139B2963M5220R5874J4979P9233b3555
17577A29060e9413C610J76101N5065l717a14347A61298L71117g3533A63542h4076
$$ y = [112374, -7151, 324868, 165444, 337874, 258390, -309768, 46486, 232675, 97395, 145130, 164965, 165317, -30036, 101586, -75054, 118120, -118133, -446950, 159313, 323620, 83456, -54140, 42218, 264472, 65800, 145228, 194803, -245826, 157589, 41875, -244956, -214623, 29602, 176277, -142647, 123237, 273842, -47005, -6900, 103439, 171302, -136257, 379051, -4015, -45356, -113808, 182472, 295961, -137, -45280, 66133, 164413, 114416, 195717, 244365, -41569, 248805, 234244, 208461, 294284, -31591, -100492, 98837, 142420, -204017, 106377, 164845, -31465, 130175, 358742, 138862, -185513, 259109, 280684, 136139, 22963, 68183, 164057, 179036, 258269, -23555, 129060, -59413, 3610, 179711, 234776, 231059, -114347, 161298, 532415, -73533, 163542, -84076]
17565c3504j48739B14010M5002F2285A9742g5958D0711a59297B78352P0931j53330
17554A95953p8495N6562O3417J53934A47584J98701e0898E35361c32377E3590
17543D84346b9604B36947J89576a20422A20944c23869E5360h9303B31963E5373
17532e8217D6520K57679i9625F21718k74195b12975E975J10889J62307j2415h1112
17520A53446K39549c4540F12661A28815b4191F25482A98070J89777J47496B61624
17509B61330L96466J00073l1083B79337L95606J1468k74004q8251j44914N10026
17499F89268A72392K8286J018N48736k83995K65822L7739r7378O8095l37693n4962
17488C48060J88327o287j87399L99874B48214J55532p1824a08487A22110K79669
$$ y = [-33504, -182243, 214010, 259012, 62285, 19742, -75958, 40711, -159297, 278352, 349283, 195953, 117458, 174020, 237437, 391371, 147584, 346285, -50898, 535361, -332377, 53590, 484346, -29604, 236947, 426523, -120422, 120944, -323869, 55360, -89303, 231963, 55373, -58217, 46520, 304199, -99625, 621718, 347523, -212975, 5975, 116864, 279171, 266756, -81112, 153446, 392995, -34540, 612661, 128815, -24191, 625482, 198070, 387847, 535343, 261624, 261330, 657796, 757869, 726786, 279337, 674943, 686411, 412407, 324156, 179242, 689268, 172392, 200678, 201696, 750432, 466437, 732259, 769998, 672620, 740715, 403022, 348060, 536387, 530100, 342701, 742575, 248214, 403746, 331922, -108487, 122110, 401779]
17478D01779B0094L6622J20970N5599a33586C26140B4153Q9968K90815M2304j54100
17467B93140A9646K34121a67049B46761M872n0180q5964k3024J92179m0830G2320
17455I734J73625p4539a45678B30760P0416i6712C43909L55747C5959M55778B06156
17443a58545b311B44399D1069J73413J87352j45625J23532r777G8232J43442J73368
17432C95042J01147j19632j43114K62154D6805L20342L5475A20457K20398j30718
17422B10137E1274K28313n7923K57042j89386A41992k118K66703E8232J20653
17412A78885L04173j37594A38974J47661i995A65699P9914J44957C2517J99108
17402B31625J45601L9086j87744H7471J29786J53627A73848J24398Q931l9499
$$ y = [401779, 20094, 56716, 177686, 233285, -133586, 326140, 24153, 114121, 404936, 447240, 293140, 19646, 253767, -167049, 246761, 251633, 201453, 115489, 92465, 284644, 243814, 72320, 9734, 183359, 108820, -145678, 230760, 301176, -96712, 343909, 699656, 35959, 491737, 206156, -158545, -2311, 244399, 41069, 214482, 401834, 256209, 379741, 369964, 78232, 221674, 395042, 496189, 376557, 233443, 495597, 46805, 367147, 402622, 120457, 340855, 210137, 51274, 279587, 221664, 478706, 289320, 141992, 139874, 406577, 58232, 178885, 483058, 345464, 138974, 286635, -9995, 165699, 245613, 390570, 32517, 231625, 377226, 416312, 228568, 87471, 217257, 370884, 173848, 298246, 307177, 267678]
17392B67678J04347G7608P7032j4320c465A36445A4375d4818k3775A83020K73906
17381D56926C7550J17093h0367B03012r0998f7414B85668o1560o1315L27634C9491
17369E46542a47236C43484C1949M24151q1186c00607C24197E7220K99310A13632
17358A11505K65051N3687D9960f4874k8070A60013R8944B3019L789b40781B09939
17346A89508E2159j6338O6192b9002A44623F7015L5578K26318A15843R8701A1790
17334D13669I6066L05363e3724A80240K41701K00887o1294k77357j28504d3844
17323D00206j71177N9577j38933M69978E4496O1461J14865I0988L2615E216R6157
17312A01373J53915I3770J71999B3683Q4482a4715B34822f179B17898p5808B7416
$$ y = [267678, 372025, 77608, 154640, 140320, -3465, 136445, 14375, -44818, -68593, 183020, 456926, 37550, 154643, -80367, 203012, 112014, -67414, 285668, 224108, 162793, 490427, 39491, 546542, -147236, 343484, 31949, 456100, 374914, -300607, 324197, 57220, 356530, 113632, 111505, 376556, 430243, 49960, -64874, -92944, 160013, 258957, 23019, 26808, -240781, 209939, 189508, 52159, 35821, 102013, -29002, 144623, 67015, 102593, 328911, 115843, 214544, 11790, 413669, 96066, 401429, -53724, 180240, 421941, 622828, 561534, 284177, 155673, -43844, 400206, 229029, 288606, 149673, 619651, 54496, 115957, 230822, 90988, 123603, 5216, 101373, 255288, 93770, 265769, 23683, 108165, -14715, 234822, -6179, 217898, 142090, 27416]
17300C10401E7108J1382L55084A64524f548B29066J66296A38686K59560j34497
17290B63749j07888B059R4268J74563G6578J89362j5142o9326p5481l2046M27335
17279E01280I1057J89354J25142j46243O663F7749g4183E33930A01655K27088
17269C28743J57043k21309j7233D6348K97089m0188o8372J0290J36151r1351J40850
17258D30817k05913A6392J98702K14961d4009G13053A60799G2360R1626j3997
17248A49989M72364A94619j5782M2331L69433j666k88319P1336b1991A56197J45324
17237C01521K8171m6822J17288j23855r9738Q393b2367C15744J81527j53251G8338
17225B2942L53388j07359J6058K82473B20380L0217K7309E3166K88940j64047
$$ y = [310401, 57108, 68490, 423574, 164524, -6548, 229066, 395362, 138686, 398246, 263749, 155861, 2059, 96327, 270890, 76578, 265940, 250798, 181472, 105991, 73945, 501280, 91057, 280411, 405553, 259310, 265973, 67749, -74183, 533930, 101655, 328743, 485786, 264477, 247244, 46348, 343437, 303249, 234877, 245167, 381318, 289967, 430817, 224904, 16392, 215094, 430055, -44009, 713053, 160799, 72360, 163986, 149989, 622353, 194619, 178837, 221168, 590601, 588935, 300616, 371952, -21991, 156197, 301521, 329692, 282870, 400158, 276303, 176565, 184958, -22367, 315744, 497271, 344020, 78338, 22942, 376330, 268971, 285029, 567502, 220380, 250597, 277906, 53166, 342106, 178059]
17215A78059j3551Q7508k9002l104J62691j65949Q6682o9729Q2778c476C19929
17203E47132j88991J59733A93437J27036A20635M2807J28967J18933G0292N58977
17193F29269B08376B5694J91599L6291L64530j15227A98954M96529l6521A41759
17182C86868J59086p6075o0843j93146J17931q7809J88825P2953k22303O1192
17172C46679J04427J13420B56365J49455J30138o3609B32219l6525P1372L02780
17162E69846k00283p2531p2247L8562n1171m4623J35762J8434J17108p8565J78097
17151E38389j73465r4522P8144j33071L17742N1861j59721q0367L4018J29813
17141E08821j5902j92075p9894K32886M8729k7356L2716m0179k8199A88137M75465
$$ y = [178059, 164508, 252016, 223014, 219910, 382601, 216652, 303334, 233605, 316383, -3476, 319929, 547132, 358141, 517874, 193437, 320473, 120635, 163442, 292409, 411342, 70292, 629269, 208376, 25694, 217293, 253584, 618114, 502887, 198954, 695483, 658962, 141759, 386868, 545954, 469879, 409036, 215890, 333821, 246012, 434837, 507790, 285487, 346679, 451106, 564526, 256365, 405820, 535958, 472349, 232219, 195694, 267066, 569846, 369563, 297032, 224785, 263347, 212176, 167553, 303315, 321749, 438857, 360292, 538389, 364924, 270402, 348546, 215475, 533217, 585078, 425357, 344990, 379008, 508821, 492919, 300844, 220950, 453836, 502565, 475209, 507925, 467746, 439547, 188137, 663602]
17130F63602K02153A58839a05520C33725j06057R7796K32792A51224K80549j77646
17120B54127J25242K7604J80247j41950R9498C5965J61269K72319j04889n1244
17110C13420J69361p1169J92352j82405J22627L025B48134K16531L17562j53838
17100F28389j20349K99080C99033R4017j07582J59655j42299J74942j12813A60609
17089D18257j51721N41793p4259J66144k84019r8240k9258k18333m6357Q8887
17079C12894K90455k35532L01220k95196Q1R0241K6076J28758J32975l67819L64749
17068G48902k83903K35093j82709K24207l00983K35851j21990L34078l14721Q1183
17058F55008J28712J371m9944J54734k82706J33054J30982o0224l41504N24870
$$ y = [663602, 865755, 158839, -105520, 333725, 227668, 325464, 558256, 151224, 431773, 254127, 379369, 406973, 587220, 445270, 544768, 35965, 197234, 469553, 364664, 313420, 482781, 411612, 603964, 421559, 544186, 547211, 248134, 464665, 782227, 628389, 508040, 807120, 399033, 493050, 385468, 545123, 402824, 577766, 464953, 160609, 418257, 266536, 808329, 734070, 900214, 616195, 517955, 488697, 270364, 224007, 312894, 603349, 367817, 669037, 373841, 373922, 464163, 490239, 618997, 751972, 384153, 748902, 464999, 700092, 517383, 741590, 440607, 676458, 554468, 888546, 573825, 655008, 783720, 785091, 735147, 889881, 607175, 740229, 871211, 810987, 469483, 994353]
17048I94353l95031L2193n8216J7687k11815K44441Q3212L6340N93l3694j79919
17037E30144M07193m03595R5206O9103K30452j09893C32423K36462K3254L36627
17027I28766m20890J83270J92341j10931j14208J40780C83187L50194J29183K5899
17017H88463k50423O0600K61833j87575L42391l43478k94154L04150O9670q4037
17007G67440L37054n31568K01275k51140L18068j05151J48539o642j97655K01871
16997H82091J06432k47139m3036P1798N9903K54535D22639O88114k50613j8395
16987H41745M98694l68574O8298j36363O1027J59828J61755l16426L24015m20601
16977H73398l8725k56684N71617J15179k88407j1534K09273l2853q3986Q8177
$$ y = [994353, 599322, 631515, 573299, 590986, 379171, 623612, 706824, 743164, 743757, 710063, 530144, 937337, 533742, 628948, 698051, 928503, 818610, 332423, 568885, 592139, 928766, 507876, 691146, 883487, 772556, 658348, 799128, 383187, 733381, 862564, 888463, 638040, 698640, 960473, 772898, 1115289, 771811, 477657, 781807, 851477, 767440, 1104494, 572926, 774201, 523061, 841129, 735978, 884517, 877875, 680220, 882091, 988523, 741384, 698348, 770146, 830049, 1084584, 422639, 1110753, 860140, 841745, 1340439, 971865, 1040163, 903800, 964827, 1124655, 1286410, 969984, 1293999, 873398, 834673, 577989, 1149606, 1264785, 976378, 964844, 1174117, 1141264, 1057278, 1145455]
16967A145455P6414l96132P7773j5514M24236m50594L84985J52321k85508J75187
16957A288623k61701K88018n06655P07934K4540J73681q22380K75028O1952l06035
16947I23005L56170o4519p2352M1721L57239l23971N67537o19208J68074N7513
16937A391209l57047M44627k18837Q4957K90056j29349j74998L06556j59627J42536
16927A620083j74613O3131j39761j20299N99396l83963L00339l428j50122L29512
16917A940275j63287p7296j7122K2732P0376K19019m70784N21843Q5279p4271
16907B056764K5548k20387K08840k07758l531K94972r6207J44971j62909P0499
16897B110802p986m7739j23249q2562M52877J799j96315L6352J76724j90096J43743
$$ y = [1145455, 1221869, 825737, 903510, 887996, 1312232, 861638, 1246623, 1398944, 1113436, 1288623, 1026922, 1314940, 808285, 1516219, 1540759, 1714440, 892060, 1167088, 1229040, 923005, 1279175, 1214656, 1142304, 1184025, 1541264, 1217293, 1784830, 1165622, 1333696, 1391209, 1034162, 1478789, 1259952, 1344909, 1634965, 1505616, 1330618, 1637174, 1477547, 1620083, 1445470, 1508601, 1368840, 1248541, 1847937, 1463974, 1764313, 1760885, 1610763, 1940275, 1776988, 1699692, 1682570, 1705302, 1775678, 1994697, 1523913, 2045756, 2131035, 2056764, 2082312, 1861925, 2070765, 1863007, 1859476, 2154448, 2058241, 2203212, 2040303, 2110802, 2102816, 2055077, 1931828, 1849266, 2302143, 2303942, 2107627, 2143979, 2320703, 2130607, 2274350]
16886B274350p1132J79863J5305M32j99948J30065J64719L1664k29992K25996
16876B521322J92869j63742M57959j82642k38087K33159K13288O6695l88238O1529
16866B774112L32944k48706R723L88641j65448L09147j87225j39047K67543j29103
16856C212581J26924j32624J12719J89049k73372L22002k052J65526L3123l53732
16846C400144L33501l2079J03932J82807o2477L69813k59269L3434L53082O2240
16836D485128J74314k06711M18181l07542K19401l438Q4248n1283J81272J00667
16826E094237L43060k76169K40215m61J39827j25435O28237r2601k79854M62089
16816F133145K3168J00532K12281p5581N86760j67293j46964L52442J59896j20276
$$ y = [2274350, 2203218, 2383081, 2398386, 2398818, 2198870, 2328935, 2493654, 2525318, 2295326, 2521322, 2714191, 2550449, 3008408, 2825766, 2587679, 2820838, 3034126, 3100821, 2712583, 2774112, 3107056, 2858350, 2868073, 3256714, 3091266, 3400413, 3213188, 3074141, 3341684, 3212581, 3339505, 3206881, 3319600, 3508649, 3235277, 3557279, 3555227, 3720753, 3753876, 3400144, 3733645, 3701566, 3805498, 3988305, 3925828, 4295641, 4036372, 4069806, 4422888, 4485128, 4659442, 4452731, 4870912, 4563370, 4782771, 4779333, 4863581, 4812298, 4993570, 5094237, 5437297, 5161128, 5401343, 5400882, 5540709, 5415274, 6043511, 5950910, 5671056, 6133145, 6156313, 6256845, 6469126, 6393545, 6980305, 6813012, 6666048, 7018490, 7178386, 7058110]
16806G058110L80759j8493Q4904O87475k35758J50614L46590R1248J81573M15831
16796I142853l09826L41614K69436L49933J17139K30159J54212J74000J61639
16787A0631159N17621N06015j62552N71501o4642N88140J27052K48848N68758
16778A3531900K17616M18623J90863L64988O20807L87558K78628Q42775K39935
16769A7093693M10551P62582K84466N53593L67620J099824P34646K72349N32853
16760B2112177Q96296Q13059J071244L08088J273807Q56184P61273J256449R94796
16751C0343373R75875J334338J188693R66495J537638J544385J209137J777162
16743D0877096J598022J761955J390672K103981J757601K258305K145277K294998
$$ y = [7058110, 7438869, 7420376, 7505280, 8192755, 7956997, 8107611, 8454201, 8545449, 8727022, 9142853, 8833027, 9174641, 9444077, 9794010, 9911149, 10141308, 10295520, 10469520, 10631159, 11148780, 11654795, 11492243, 12063744, 11999102, 12587242, 12714294, 12963142, 13531900, 13749516, 14168139, 14359002, 14723990, 15344797, 15732355, 16010983, 16853758, 17093693, 17504244, 18266826, 18551292, 19104885, 19472505, 20572329, 21306975, 21579324, 22112177, 23008473, 23821532, 24892776, 25200864, 26474671, 27330855, 28092128, 29348577, 30343373, 31319248, 32653586, 33842279, 34808774, 36346412, 37890797, 39099934, 40877096, 42475118, 44237073, 45627745, 47731726, 49489327, 51747632, 53892909, 56187907]
16735E6187907K056386K818196K522186K313844L286582K634231K821797L203467
16727G7844596L160343L282298L453152L380281L474329L408842L369511L355316
16719A04728668L475271L204747K758010K963545K714518K410635K278160J824274
16711A26357828J434585J467275M32933M24329j66624n78471p93924j373074j361614
16702A25843243k367776k363693k606689k925660k976414l021277l389258l586595
16694A02605881l365201l033235l527181l467196l571050l381225l042125l302970
16686G5915698l043143l096017k328374l080030k152059l102306k379946k034578
16678E4699245k164816k053749k283264j596058j967136j889195j100804j898082
$$ y = [56187907, 58244293, 61062489, 63584675, 65898519, 69185101, 71819332, 74641129, 77844596, 81004939, 84287237, 87740389, 91120670, 94594999, 98003841, 101373352, 104728668, 108203939, 111408686, 114166696, 117130241, 119844759, 122255394, 124533554, 126357828, 127792413, 129259688, 129692621, 130116950, 129950326, 129371855, 128577931, 127204857, 125843243, 123475467, 121111774, 118505085, 115579425, 112603011, 109581734, 106192476, 102605881, 99240680, 96207445, 92680264, 89213068, 85642018, 82260793, 79218668, 75915698, 72872555, 69776538, 67448164, 64368134, 62216075, 59113769, 56733823, 54699245, 52534429, 50480680, 48197416, 46601358, 44634222, 42745027, 41644223, 39746141]
16670C9746141j638748j555601r35211j731581r14902j317376r79859j088308
16662B9584555j028043j117649r74999p20897r39250o18619r70427l81982p29050
16653B2103639o71914j097663l33796m83883n64606o32501n28398o59199l92782
16644A6738897m72663l74816p67903K0r8370p42122k93218l77654m01778j66233
16634A3044160j72842m45655l57995k26887k87061j2532p93476R6414o65641K0498
16624A0198983k32540p3728n21892j77085K66670n08643p5087k35443k12805l5634
16614H392796k42465k32159J6420l02924k54482q1431j56593J11480l62828m4370
16604F843444j96847k18943K391j98170j35040j80090L0154J74569l36785j56456
$$ y = [39746141, 38107393, 36551792, 35616581, 33885000, 32970098, 31652722, 30672863, 29584555, 28556512, 27438863, 26463864, 25742967, 24803717, 24185098, 23214671, 22832689, 22103639, 21431725, 20334062, 20000266, 19516383, 18951777, 18319276, 17790878, 17131679, 16738897, 16266234, 15891418, 15123515, 15123535, 15025165, 14283043, 13989825, 13612171, 13210393, 13044160, 12871318, 12425663, 12067668, 11840781, 11553720, 11541188, 10747712, 10844126, 10178485, 10198983, 9966443, 9892715, 9370823, 9193738, 9460408, 8951765, 8876678, 8641235, 8428430, 8392796, 8150331, 7918172, 7934592, 7631668, 7377186, 7295755, 7139162, 7250642, 6887814, 6843444, 6646597, 6427654, 6430045, 6231875, 6096835, 5916745, 5946899, 6121468, 5784683, 5628227]
16594E628227L5652k33736p016J98340l98681r754o0552k68552q9061J79512l28943
16583D645436l5359J76537j02579j97433j63757o7620M31131l10247j30231R193
16573D255071M1131j24822m03412J19571j11387K3139o7150P4140j90435q0291
16563C535555l20844M45192j42605R551j86844R5537l37785o609K40181l2941
16553C298388k40923J59372K0219k16118r3224l7916q0699K32059k63170J1376
16543B789364r946J83759O7610l91710o6473r619J04097k3711P6738j05203n6088
16532B558818j5523M3926k67507P5994K2826J05067P7761k37663l4057k29176
16522B100466N4810q4457J09229r6043l1781o2070J91011r2245J09980k41552
$$ y = [5628227, 5663879, 5430143, 5423127, 5621467, 5222786, 5213032, 5152480, 4883928, 4794867, 4974379, 4645436, 4610077, 4786614, 4684035, 4486602, 4322845, 4255225, 4686356, 4376109, 4245878, 4255071, 4296202, 4171380, 3767968, 3887539, 3776152, 3799291, 3732141, 3806281, 3615846, 3535555, 3214711, 3659903, 3517298, 3526849, 3340005, 3435542, 3097757, 3091148, 3331329, 3298388, 3057465, 3216837, 3237056, 3020938, 2927714, 2889798, 2809099, 3041158, 2777988, 2789364, 2779418, 2963177, 3030787, 2639077, 2572604, 2562985, 2667082, 2643371, 2720109, 2614906, 2558818, 2543295, 2587221, 2319714, 2395708, 2418534, 2523601, 2601362, 2363699, 2329642, 2100466, 2155276, 2070819, 2180048, 2084005, 2052224, 1990154, 2181165, 2088920, 2198900, 1957348]
16512A957348P7534k85914M79582j47922p5380J37293k90914J58740k44633L6526
16502A802260N6670j37235K11424j99383j59998J68819K1536O2484k88199k83611
16492A254767P42047l13361L36729j45678l11108p8062j34305N41579j46759k96335
16482A449514J94618k53608l3463J91518J50278m01169N28842o58223M30065r5881
16472A502491r4213J71695J00520r7633j42207K20628l01776o8307Q0196Q53J4831
16461A387078k31110r2660L08583j95091k69187L21140L4453p1431M63468l62089
16451A293154k53651J32482j45191P5006J51216n17614N57597j85167J86348j08193
16441A185987J30370k93514L00856l49740J22966L5716j08640J28453p2519K72346
$$ y = [1957348, 2034882, 1748968, 2228550, 2080628, 2005248, 2142541, 1851627, 2010367, 1765734, 1802260, 1858930, 1721695, 1933119, 1733736, 1573738, 1742557, 1764093, 1826577, 1538378, 1254767, 1996814, 1683453, 2020182, 1874504, 1563396, 1485334, 1351029, 1892608, 1745849, 1449514, 1644132, 1390524, 1357061, 1548579, 1698857, 1297688, 1826530, 1168307, 1598372, 1502491, 1408278, 1579973, 1680493, 1582860, 1440653, 1661281, 1359505, 1291198, 1371394, 1372247, 1387078, 1155968, 1063308, 1371891, 1176800, 907613, 1228753, 1263206, 1191775, 1655243, 1293154, 1039503, 1171985, 1026794, 1101800, 1253016, 735402, 1292999, 1107832, 1294180, 1185987, 1316357, 1022843, 1323699, 973959, 1096925, 1132641, 1024001, 1152454, 1079935, 1352281]
16431A352281j46654O622j25721k00945K19992o6256O7389n8727k83259K66007
16421A030729j58278J60531p9141K19383j31876J3465K54441j73689k33022l18991
16411E83552M00406J9295m1378R2860j36958O28J30942O2236j52882J99611j46971
16400A011341m89991O06713K5419j93499j04636n3813m6701K32480l63792J97358
16390H20879J47210K8690Q450C92073N14022J00684m7783k2083j08163k8458j11724
16379F88568j52730K57190J32226l68991K26793K20135l84196K5547K28846k25720
16369F47668J27887M071n1063L58039m08835r1209r0779Q1362J01121J81586j66099
16358F93749k87906J83703k66113O31094j95689L0427k00073J01993K7066J01135
$$ y = [1352281, 1205627, 1212249, 1086528, 885583, 1105575, 1039319, 1106708, 1047981, 764722, 1030729, 872451, 1032982, 953841, 1173224, 1041348, 1054813, 1309254, 1135565, 902543, 583552, 983958, 1003253, 961875, 1054735, 917777, 918405, 1049347, 1111583, 958701, 1158312, 1011341, 521350, 1128063, 1153482, 959983, 855347, 801534, 754833, 987313, 623521, 820879, 968089, 996779, 1005229, 392073, 906095, 1006779, 958996, 936913, 828750, 800292, 688568, 535838, 793028, 925254, 556263, 783056, 1003191, 618995, 644542, 873388, 647668, 775555, 779626, 728563, 1086602, 677767, 586558, 495779, 577141, 678262, 859848, 693749, 405843, 589546, 323433, 954527, 758838, 789265, 589192, 691185, 718251, 819386]
16348H19386Q5446k24665j00059j23246L51278r6086k78212l8371M14774j70372
16338F39873j65698K26326l8747j52773A80969L53171J59745N5978k29009P4167
16328E95021J66870l09070L69678j18382k50896M26391j59074M4626k83538J39641
16318F21267q7849Q3509J9541o3933j19000N3088K16922k35498K30045k41826
16308D76266K58498l42669N6119r4622L84138k09283j37629K70521p3852J59861
16298G47348j86255K3245j58435l2434o9940K35J4849O46218D32027J54252J48936
16287G35215q9746K56430l28853q3628k7189L1307J61511j87070p5801K17667
16277F09843j2809j66955J08016j13168j29486L88909R9843r1974C15520m2666
$$ y = [819386, 904832, 680167, 580108, 456862, 808140, 712054, 433842, 395471, 810245, 639873, 474175, 700501, 661754, 508981, 180969, 534140, 693885, 749863, 520854, 595021, 761891, 452821, 822499, 704117, 453221, 879612, 720538, 765164, 481626, 621267, 533418, 616927, 636468, 572535, 453535, 506623, 723545, 488047, 718092, 476266, 734764, 392095, 448214, 353592, 737730, 528447, 390818, 661339, 587487, 747348, 561093, 584338, 425903, 393469, 323529, 323764, 338613, 984831, 432027, 586279, 735215, 645469, 901899, 573046, 489418, 462229, 493536, 655047, 467977, 392176, 609843, 597034, 430079, 538095, 424927, 295441, 684350, 784193, 692219, 315520, 272854]
16267B72854M2830K26601A13849M92474B62868N9159L12390k79119L24269l32711
16257C46856J70970j56897K53796B98633M93255l67040l6233j51111J67245O3233
16247D67982j46004K41433M0635A73667K45407j24236M06900C12990L92303j62679
16237E42614B07208L58372j54260K09066G9139L28773J29977m5487j32645O2970
16227D22727k10805J99813r4314P1599M2699j31101K41826j7898j49633n0508
16217C24405l2914K96575N6153k95937K2931Q2517o0082N6083A91594M20995p7380
16206E35209l1211r1894K62452A95893O2200Q7723O8842K41918B10244L37488
16196E47732j89837J5624F3848O515L70180I9749P3687J03197L5004j8407J43548
$$ y = [272854, 315684, 542285, 113849, 606323, 262868, 322027, 634417, 355298, 679567, 346856, 517826, 360929, 614725, 298633, 791888, 424848, 388615, 237504, 404749, 467982, 321978, 563411, 604046, 173667, 419074, 294838, 701738, 312990, 705293, 542614, 207208, 565580, 411320, 620386, 79139, 407912, 537889, 492402, 359757, 422727, 211922, 411735, 317421, 389020, 431719, 300618, 542444, 524546, 374913, 324405, 291491, 588066, 644219, 348282, 371213, 453730, 393648, 449731, 191594, 612589, 535209, 503998, 412104, 674556, 195893, 258093, 345816, 414658, 656576, 210244, 547732, 357895, 373519, 63848, 70363, 440543, 99749, 173436, 276633, 311637, 293230, 436778]
16185D36778l9907p6821A43630L7753p9881J65734Q6456M3875K8629K2889L5463
16174D84548J6665B8038L33483p4353p2055R4858j9989J99374p4936j03241e1419
16162C98895J17098B48888J21428m9458A13752N3313K11487c5802A19432L40877
16152D60309k21501K0141J36292A16599J50774a08559A37463N1341K39903A81118
16141a97347D18308q5621q4607b13297B73193A05535J38632r7396K0519G5383
16130A71159n6882M03527a18992A38114l6429J04102E3502a8979j81692D12965
16119A56857F6677d6242C80783J48661B36417J34722A24606P0093e3458B62924
16108A59186P5702o1885R2340A11930M4984R5722I2119M36707a72783F7527N6420
$$ y = [436778, 396871, 320050, 143630, 181383, 101502, 267236, 353692, 397567, 426196, 449085, 484548, 501213, 28038, 361521, 287168, 215113, 309971, 289982, 489356, 414420, 311179, -51419, 398895, 515993, 248888, 370316, 320858, 113752, 167065, 378552, -35802, 119432, 460309, 238808, 258949, 395241, 116599, 267373, -108559, 137463, 188804, 428707, 181118, -197347, 418308, 332687, 248080, -213297, 273193, 105535, 244167, 146771, 167290, 75383, 171159, 114277, 517804, -118992, 138114, 101685, 205787, 53502, -18979, -200671, 412965, 156857, 66677, -46242, 380783, 529444, 236417, 371139, 124606, 194699, -53458, 262924, 159186, 234888, 173003, 265343, 111930, 156914, 252636, 92119, 528826, -172783, 67527, 123947]
16097A23947D1742Q6932j5312J55594m0598E8805L04047c3930G5934a1979E5219
16085a2371A94217R295N0221b5231B90664a37359B93971j42023K467a61861d6969
16073A36327E8015J89634N517a3803C2385N7828K82750I2522b82271J33116A26822
16061h8746F9294K34406f685I2980j4498A7664J12344c7987B38802a32099b4081
16049B31982C8660J86370M3891a8112B686e2765A56793p199L7950P3450f7872
16037E65480A32366J70605K7240A51383O4359G7067J65816e2398r9955F4368Q8170
16026A52538D9370R1382m8533l7452J85775r9857m3831K37077C0087a22585C34514
16014b96875A24071J15407J08879i0608A41944k3141c7676A46761m9834g9194
$$ y = [123947, 41742, 128674, 113362, 268956, 228358, 58805, 362852, -33930, 75934, -11979, 55219, -12371, 194217, 203512, 253733, -25231, 290664, -137359, 293971, 151948, 154415, -161861, -46969, 136327, 58015, 247649, 253166, -13803, 32385, 90213, 372963, 92522, -282271, -149155, 126822, -88746, 69294, 303700, -6685, 92980, 78482, 17664, 130008, -37987, 238802, -132099, -24081, 231982, 38660, 225030, 268921, -18112, 2686, -52765, 156793, 149594, 187544, 260994, -67872, 565480, 132366, 302971, 330211, 151383, 215742, 77067, 242883, -52398, -152353, 64368, 152538, 49370, 140752, 92219, 54767, 240542, 140685, 96854, 333931, 30087, -122585, 334514, -296875, 124071, 239478, 348357, -90608, 141944, 118803, -37676, 146761, 96927, -79194]
16003A08388J31854H8901L8850K41942A5305f6797K8521G9692A5846Q2456a49005
15991b26363i0615A08865J0383b99215B93248j08611M12431H1812a66696A95663
15980H0588B302f8311A60505J50698a71489B82908G8351L67621l3925L74572k66216
15969E20403L57783q8231j97144G4689N0459K7156J3560e895q1436D13655b6174
15957h9385A02625f4496A3316K59904g0690J8008D3899J89125F7645f3125j453
15946f4578p5519e4635j86430R545O7609B70443j1867a63112E6747B0720r282
15935A1438J9187J26681b38836e1839H5814M86B7991a60617n5782e5745B57844
15923E1386a69454e3943j3126j4210E4879J509b36773K3390A78979P4518b72027
$$ y = [108388, 240242, 88901, 127751, 369693, 15305, -66797, -38276, 79692, 15846, 98302, -149005, -226363, -90615, 108865, 119248, -299215, 293248, 184637, 597068, 81812, -166696, 195663, 80588, 2302, -68311, 160505, 311203, -171489, 282908, 78351, 445972, 412047, 786619, 520403, 878186, 789955, 592811, 74689, 125148, 152304, 165864, -5895, -87331, 413655, -26174, -89385, 102625, -64496, 13316, 273220, -70690, -52682, 43899, 233024, 67645, -63125, -64578, -140097, -54635, -241065, -231520, -163911, 270443, 258576, -163112, 56747, 20720, 11438, 30625, 157306, -238836, -51839, 85814, 86300, 27991, -160617, -216399, -55745, 257844, 51386, -169454, -53943, -67069, -81279, 54879, 56388, -236773, -213383, 178979, 253497, -272027]
15911a80546C06998a04249A53807a06993k0830e6541C3675a30991K7914j98831
15901c01908Q9310A81843b08223B61772d57238a57378A36542D4030b16135A58260
15890b78136n8582D0502N8722b04030A50750E8588a60804A66466b06406o2414
15880b68820h4968M088B0729c9926n441B67721b06628B0642a57346g4743p3563
15869a48306I2923A2085c0533p5745C57804c08662B16194m0071q0536B5325b74242
15857D65830B03959b41876A5961L3940b9742A563a3935k04495g6437b9051j82417
15846b11468B8283b66681J31787d1572B17741g6086O867k10104n1099R3696f0360
15834D06561a74933k3808E922b36200j77693b7170c152D1252A8782g712j71955
$$ y = [-180546, 306998, -104249, 153807, -106993, -127823, -56541, 33675, -130991, -103077, -301908, -212598, 181843, -208223, 261772, -457238, -157378, 136542, 44030, -216135, 158260, -278136, -336718, 40502, 99224, -204030, 150750, 58588, -160804, 166466, -206406, -268820, -84968, -80880, 20729, -39926, -45367, 267721, -206628, 20642, -157346, -74743, -148306, 92923, 12085, -30533, -106278, 357804, -308662, 216194, 176123, 95587, 25325, -274242, 465830, 203959, -241876, 15961, 49901, -29742, 1563, -13935, -218430, -76437, -29051, -211468, 28283, -266681, -134894, -41572, 217741, -76086, -69219, -279323, -330422, -236726, -60360, 406561, -174933, -198741, 5922, -236200, -413893, -27170, -3152, 41252, 18782, -7712, -179667]
15823a79667K4304j8862j9389J5161c6286G3219h2940q5143K5915C18363G3778
15811A46877a95352j80834A55305l18j1526c05127D5355a9449I7669A795a30733
15799i5825A08898b16120P5812H2326J69251c0694F1810L6225e468j31A30818
15787a4717B20803b1016A03980a58076r5550A43456b46226c5677a7190A20783
15776F3095R41c01349B66289a12127j63976O5424f1149F5070c8787F809J42691
15765A49500K04767A4645a7305A75031p3264a46468p314N7811F2195Q9373F4886
15753a99911B42780c9909n6748A208e03616J2477A87214r0642b52678a2717m7904
15742f0621A07794J55214j23415F0182j7180N2652f4720B487b30067M8264L520
$$ y = [-179667, -155363, -174225, -193614, -178453, -36286, 73219, -82940, -168083, -142168, 318363, 73778, 146877, -195352, -376186, 155305, 154987, 143461, -305127, 45355, -19449, 97669, 1795, -130733, -95825, 108898, -216120, -140308, 82326, 251577, -30694, 61810, 98035, -5468, -5599, 130818, -14717, 220803, -21016, 103980, -158076, -253626, 143456, -246226, -35677, -17190, 120783, 63095, 64036, -301349, 266289, -112127, -276103, -210679, -61149, 65070, -38787, 6809, 149500, 354267, 14645, -17305, 175031, 101767, -146468, -153782, -95971, 62195, 151568, 64886, -199911, 242780, -39909, -96657, 1208, -503616, -491139, 187214, 96572, -252678, -12717, -60621, 107794, 263008, 139593, 60182, 43002, 95654, -64720, 2487, -230067, -181803, -178283]
15731a78283C35895C1534a9985k08766J02457q0281A71644c7955j9758J8109n8867
15720i8471I6539a64566K1336b7339D8704a14411A59053b82417J11061M3954k5291
15709a52693L5871A01943c5703l19955A4355K57858b23002E3620j2657a89399
15698I9412J22576c16756D3108a9199B65934F3560c52099A01342a44838A50188
15687c09804J9267I8471c5752G0466a18398l01839I5891b8301j5895H4592K2661
15676A07253J44570H7704K06745b85033d9739j1877j66862A84877a05238j8525
15666a23763b0984B07648j0136d757B46945b5091k02870D8625K78810A57835a84233
15654d035r1548F2383b5756k26185e8193j38542o698O4648M1423m4656c6455j9514
$$ y = [-178283, 335895, 31534, -19985, -228751, -126294, -206575, 171644, -37955, -57713, -39604, -98471, 96539, -164566, -143230, -27339, 48704, -114411, 159053, -282417, -171356, -127402, -152693, -116822, 101943, -35703, -355658, 14355, 272213, -223002, 53620, 40963, -189399, 99412, 221988, -316756, 43108, -19199, 265934, 63560, -352099, 101342, -144838, 150188, -309804, -290537, 98471, -35752, 70466, -118398, -420237, 95891, -28301, -44196, 84592, 107253, 251823, 87704, 294449, -285033, -49739, -61616, -228478, 184877, -105238, -123763, -20984, 207648, 197512, -4757, 246945, -25091, -227961, 48625, 327435, 157835, -184233, -4035, -95583, 62383, -25756, -251941, -58193, -196735, -203433, -138785, -97362, -142018, -36455, -55969]
15642e5969j02160o6528D4203g8967R205j22118o2922B6415K8856J12194b11574
15630a06503k39527A18855i8628B75148a0108j34223j67400c2398m687e748p3270
15619g9018m5843A76781M3996c52564a55058H0368b17417B00917c08203a194k3226
15608b4420j73049n6207C6202c35570a11811A72574b47308D9255K17453j2469
15598B54239b54086f4465I3979c8263h388I2796P9606b14312D11525d2914C10558
15586d1892j7264j16709J6833J275d559k56352H8759a4390B6407J18830i1949
15574e0128r1974J7607A2447J11174K65113A23117c5012j17245m466A02092Q04
15563A02896L7146P742i4764L4462A45510d8798j52154c3669D3562c27053E8084
$$ y = [-55969, -158129, -224657, 44203, -78967, -69762, -191880, -254802, 26415, 55271, 167465, -211574, -106503, -346030, 118855, -98628, 275148, -10108, -144331, -311731, -32398, -37085, -5748, -79018, -124861, 176781, 220777, -352564, -155058, 80368, -217417, 200917, -308203, -1194, -24420, -197469, -253676, 36202, -335570, -111811, 172574, -247308, 49255, 266708, 254239, -254086, -64465, 93979, -38263, -8388, 92796, 172402, -214312, 411525, -42914, 310558, -41892, -59156, -175865, -159032, -157757, -4559, -260911, 88759, -14390, 26407, 145237, -91949, -50128, -142102, -124495, 12447, 123621, 388734, 123117, -35012, -152257, -156723, 102092, 102896, 140042, 147784, -94764, -60302, 145510, -48798, -200952, -33669, 43562, -327053, 58084]
15551B36830g932j38789j43149A59658i7161l39838g7155l498j89892A04693a9078
15539A85925M5751e4746k03861a19905j18192A9823i9679B8245a52048A20270
15528D8755a77477I8445K18570A02897g1492p6412K7008k8117n9206A42610N7988
15517B00598a72919N5269d0565l20388H0458r39M5647B6024R9410a43325A67725
15505a37165j47059A13289e168n8507B30801M8715j39160K09169A34131l0067
15495A04064J89562J25938A86610P8917N2142C2818K43344a8942q3564l7202G6888
15483a2949j1725H7251D0622a34019A63025a34681G6022h8257E8492A8532E016
15471C61263c41864J17993E6601J45326d2897A65007C1815J29420o3038j3316
$$ y = [236830, -7932, -146721, -289870, 159658, -97161, -436999, -77155, -80653, -270545, 104693, -19078, 185925, 231676, -54746, -258607, -119905, -238097, 19823, -99679, 28245, -152048, 120270, 48755, -177477, 98445, 317015, 102897, -71492, -147904, -120896, -149013, -208219, 142610, 200598, -172919, -117650, -40565, -360953, 80458, 79519, 125166, 26024, 125434, -143325, 167725, -137165, -284224, 113289, -5168, -63675, 230801, 279516, 140356, 349525, 134131, 104064, 293626, 419564, 186610, 265527, 317669, 32818, 276162, -18942, -102506, -139708, 76888, -12949, -24674, 87251, 40622, -134019, 163025, -134681, 76022, -88257, 58492, 18532, 5016, 361263, -341864, -223871, 56601, 201927, -42897, 165007, 31815, 161235, 98197, 84881]
15461H4881K99246j85845J09468n3098M972J50597J35993k61581A9061J76250
15451A95311J52884i0215A70735K05435o2545a9049l02061A85447f8817k7670
15441i6487F3504K1923O2368i1936f783A4820A97a75422D351J76824J67445a4084
15428C84288A23824P28212k66915j23128m9608J7566J39528A18969J59729b14332
15417D4844L73271A7453J3925h832B22322a33554b8597j86905B12693b14192H3080
15405i0276j50664i5831j8895K2555A592a77574D4822P4295B6599a88117P8332
15394a09785F7770c41447C06561A4236J33453a1636l50195H5222a4397l3597B4244
15382g7168m3796q4124J01736L943j10492C09459h9398I598L59743d8331A44935
$$ y = [84881, 384127, 198282, 307750, 254652, 259624, 410221, 546214, 284633, 19061, 195311, 348195, -90215, 170735, 376170, 313625, -19049, -321110, 185447, -68817, -96487, 63504, 85427, 147795, -91936, -6783, 14820, 197, -175422, 4351, 181175, 348620, -14084, 384288, 123824, 852036, 585121, 461993, 412385, 429951, 569479, 118969, 278698, -214332, 44844, 418115, 17453, 31378, -8832, 222322, -133554, -28597, -215502, 212693, -214192, 83080, -90276, -240940, -95831, -114726, -92171, 1592, -177574, 44822, 119117, 26599, -188117, -109785, 67770, -341447, 306561, 14236, 147689, -11636, -361831, 85222, -14397, -47994, 24244, -77168, -120964, -205088, -103352, -99409, -209901, 309459, -89398, 9598, 369341, -48331, 144935]
15370B07672F5662c32647i8893F1206B553K84993d76729B60817a41047B23250
15359A49962A5613M93248e700D42122G7384O7798j0489M1631q1746C5204J45832
15348A81036L1984j3622d3057B84256h4435p8871C3209J69538q9998b2005B22997
15336B57526j03237J05437D164J40643j9635j2762m7707K95299A41902m6590P2373
15325A67685C4046L482Q978J40195H4652B7082J90286c9520a4112A82702a97798
15313b4847A38254B6468c76850B72180A6884J41423p8935J4154A7457K1146J34551
15302A73154j6507b4098A99061i1148d2598A3789b9077A71323l5795m399J05418
15291B36547D1887c9881A42567b4282G3808J2102a09115B29955G4135j0585K14667
$$ y = [207672, 65662, -332647, -98893, 61206, 2553, 287546, -476729, 260817, -141047, 223250, 149962, 15613, 508861, -5700, 442122, 77384, 145182, 134693, 176324, 94578, 35204, 181036, 213020, 199398, -43057, 284256, -84435, -163306, 33209, 202747, 112749, -22005, 222997, 257526, 154289, 259726, 4164, 144807, 125172, 112410, 64703, 360002, 141902, 95312, 167685, 34046, 37528, 46506, 186701, 84652, 27082, 217368, -39520, -14112, 182702, -197798, -24847, 138254, 26468, -376850, 272180, 16884, 158307, 79372, 93526, 17457, 38603, 173154, 156647, -24098, 199061, -91148, -42598, 13789, -29077, 171323, 135528, 131129, 236547, 41887, -39881, 142567, -24282, 73808, 85910, -109115, 229955, 74135, 63550, 278217]
15280B78217E9810J35762a43855C0820a8084j09186C99692j80303e2553j58801
15270b11354R8963e5157C914g4586B3233B342b3615G9566a33785A31914g6934
15258g148B07067A01295K3861L2272e5032k6386A02495l4206d42679a39891n2715
15247a92606B14470c50127a09845C27243j066B4331Q3752c7892C55340a56817
15236C1614O9572J0377N4753L28432A18665K91055K72992P97264l25985J37659
15226A291650l7553n26407A45610N4142J50301f1312A02889J2918J53978c84910
15215G3161A1286i8041J9348A02483J06337Q9856e9182J8900E1231M3689c616
15203E1365B1447f6654g246G8937J28630E9341h2854j10936B27765M2639L0881
$$ y = [278217, 59810, 195572, -143855, 30820, -18084, -127270, 399692, 219389, -52553, -211354, -112391, -55157, 3914, -74586, 23233, 2342, -23615, 79566, -133785, 131914, -76934, -7148, 207067, 101295, 125156, 157428, -55032, -81418, 102495, 68289, -442679, -139891, -192606, 214470, -350127, -109845, 327243, 326177, 24331, 108083, -37892, 355340, -156817, 31614, 101186, 111563, 166316, 494748, 118665, 409720, 682712, 1479976, 1153991, 1291650, 1254097, 727690, 145610, 199752, 350053, -61312, 102889, 115807, 269785, -384910, 73161, 11286, -98041, -78693, 102483, 208820, 298676, -59182, -40282, 51231, 94920, -3616, 51365, 21447, -66654, -7246, 78937, 207567, 59341, -82854, -193790, 227765, 270404, 301285]
15192C01285a16906N6309A57782n5589a6657r76B7265g6703B15033a31589c7483
15180a69206I8061J05430B3625J47816a85443D6778K1196B9149R6804D4146R9226
15169A43372e3036D9309J19235N176f6349B10762m11i5784B67446E8806d9752
15157e3610K5331r2537B91056G4229B1747M1160a02986C5898K30067J67082g278
15145i6147A56810p0578k2296a22305A35782L2984n3425B8201P8868K78501A06538
15133A69614j9029J05615a62884a4530N496k72120F17K57948D7968J70750E5515
15121i9092B00144J3956C6977a11133A76152a38350B60924L1071N6565j61641
15111A86919b927B91605A08718K23280a0532B21255I3003J01184M504G3502J97138
$$ y = [301285, -116906, -60597, 157782, 102193, -16657, -17633, 27265, -76703, 215033, -131589, -37483, -169206, 98061, 203491, 23625, 171441, -185443, 46778, 67974, 29149, 125953, 44146, 143372, -53036, 49309, 168544, 173720, -66349, 210762, 210351, -95784, 267446, 58806, -49752, -53610, -28279, -120816, 291056, 74229, 21747, 62907, -102986, 35898, 265965, 433047, -7278, -96147, 156810, 86232, 63936, -122305, 135782, 168766, 115341, 28201, 107069, 385570, 106538, 169614, 150585, 256200, -162884, -14530, -9034, -281154, 617, 258565, 47968, 218718, 55515, -99092, 200144, 214100, 36977, -111133, 176152, -138350, 260924, 291995, 348560, 186919, -2927, 291605, 108718, 331998, -10532, 221255, 93003, 194187, 198691, 73502, 270640]
15100B70640j08468N9627K9944H8587J81720N2464c6653q8592C36418G6049J34477
15089B10526H4398h7898d186q5486H1310C7758J97137M0707j08297E3950M7230
15078A01180C5430Q2983O3288K776J2651o6131J21468N2082g1115J4609B56529
15066f462D3656K53674g3207B3996J71369L5040e0265C75149j73669E4764a4086
15054c1510a935j27375b9715D38832q9439G0884J57968a23273A1733P924h8778
15042B87171l8677j13131Q9509F4451L12598J4382H8591m3398K51718F1835K03850
15031B65685L07897j93510K39635k71725A16295J37872K6882r9254G487K57832
15021B65319r277E6975K30918r1855J21202J39686j02339M62751l08040B06101
$$ y = [270640, 162172, 221799, 251743, 88587, 270307, 322771, -36653, -125245, 336418, 76049, 210526, 84398, -87898, -4186, -89672, 81310, 37758, 234895, 275602, 167305, 53950, 101180, 35430, 118413, 181701, 184477, 197128, 130997, 252465, 304547, -71115, -56506, 256529, -6462, 43656, 297330, -73207, 23996, 195365, 230405, -50265, 375149, 201480, 54764, -14086, -31510, -1935, -129310, -29715, 438832, 349393, 70884, 228852, -123273, 11733, 19657, -88778, 287171, 248494, 135363, 224872, 64451, 377049, 391431, 88591, 45193, 296911, 61835, 265685, 573582, 380072, 619707, 347982, 116295, 254167, 281049, 181795, 7487, 265319, 256042, 56975, 287893, 196038, 317240, 456926, 354587, 817338, 509298, 206101]
15010E77415j66474o6412K22042j8557n6872j74479K37937M3933j40443j22942
15000C35148O8407H940K02439l0447G1222k7582K22018j9783M0350L40405k83313
14989C43317Q3286j28861O8194A5527L01700J49698L24251l50024P1046A97171
14978E03938B46679l6933P438J93021m9947q7324n4956R9301J482L61762B52020
14966F13262K21989k88997J35713k47784N7432j64015J2822j23086J88042J01827
14956E07205Q4507k16430A66976J68726L14963k41787j2788q4676J01945j26253
14946B87106Q3591b8138B10111A7782J40614J54227p962r7898J41313N96l4307
14935C14365R6752d197B70541A12375J46394P5616A20101B7340M29845K12574
$$ y = [577415, 410941, 344529, 566571, 548014, 491142, 316663, 554600, 598533, 458090, 335148, 403555, 8940, 211379, 180932, 71222, 43640, 265658, 245875, 286225, 626630, 343317, 426603, 297742, 365936, 15527, 317227, 466925, 791176, 441152, 512198, 197171, 503938, 246679, 209746, 217184, 410205, 360258, 272934, 217978, 317279, 318761, 680523, 252020, 613262, 835251, 546254, 681967, 434183, 491615, 327600, 340422, 217336, 405378, 507205, 591712, 375282, 166976, 335702, 650665, 408878, 396090, 311414, 413359, 287106, 370697, -28138, 210111, 17782, 158396, 312623, 304661, 206763, 348076, 348672, 314365, 411117, -4197, 270541, 112375, 258769, 334385, 120101, 27340, 457185, 669759]
14925F69759J07985C20068L40027j60392B48523L5235L28576k5036p2103N19233
14915A034428k31837k72502L38540N6693L62426l54013K10842q1434M76422n11004
14905A028561K98489n3770J29770J27456k64191K60610J29895j54523k94367J66443
14895A374373m26538j64670j90114m5187P3700H7337N74945q1155A97398K50856
14885D48254K00845B78070C9531L01795m8799e2027C13160K76610B73092K73714
14875E46806J52467O6810j76001j1536K80960B97426J88461j22947K61948J21278
14865G46166C68720N27790j97576k26904L66299A74979L39078k24569J31774L65930
14855G87192A26142M71667j91448K35169j48423J25720J61476N9153D05072P2734
$$ y = [669759, 777744, 320068, 660095, 499703, 248523, 283758, 612334, 587298, 515195, 1034428, 802591, 530089, 868629, 925322, 1287748, 933735, 1144577, 1063143, 1539565, 1028561, 1327050, 1273280, 1403050, 1530506, 1266315, 1526925, 1656820, 1502297, 1207930, 1374373, 947835, 783165, 593051, 547864, 621564, 87337, 662282, 581127, 197398, 448254, 649099, 278070, 39531, 341326, 292527, -52027, 313160, 589770, 273092, 546806, 699273, 766083, 590082, 578546, 859506, 297426, 485887, 362940, 624888, 746166, 368720, 896510, 698934, 472030, 838329, 174979, 514057, 289488, 421262, 787192, 126142, 597809, 406361, 641530, 493107, 618827, 780303, 839456, 405072, 477806]
14845D77806M650k2557N8985j91418J27798o9578A66078O60023l86957k0366J2333
14834D31111k7477Q6988o7341o0628J3755N07678B99341K44852J70274j30170
14824E84297J91027k70623M30435J54877m48219k4960K36905l37184o6261l6979
14814D13315j2283p2905L04377B10511K30604p5968K28195k3303j16419J48918
14804F02538j82790L19523E0643L47246K15443J06844A40140K80072J51723J79817
14794G51752l08243j14203l6659R5479R1000L50749K20390k83479j37764L09688
14784I38710k36253k05333L48677C82757k0052L29993q5007k75498K8918R0715
14774D51826J07071k78984L90022B20428K25285J41101J3522n0652J0904k02823
$$ y = [477806, 482456, 459899, 518884, 327466, 455264, 385686, 166078, 826101, 439144, 418778, 431111, 403634, 490622, 423281, 362653, 376408, 884086, 299341, 544193, 714467, 584297, 775324, 504701, 935136, 1090013, 641794, 616834, 853739, 516555, 450294, 413315, 401032, 328127, 632504, 210511, 441115, 365147, 593342, 570039, 453620, 602538, 419748, 739271, 50643, 397889, 613332, 720176, 140140, 420212, 571935, 751752, 443509, 329306, 292647, 388126, 479126, 829875, 1050265, 766786, 629022, 938710, 702457, 497124, 845801, 382757, 362705, 692698, 607691, 332193, 361111, 451826, 558897, 279913, 669935, 220428, 445713, 586814, 600336, 549684, 560588, 357765]
14764C57765K09592j62560J39700k54062L46915J66915J77301l1958j48763j13919
14754F86926o0733k02756r3142J47459N9122J30539J71218k43421k04347J70182
14744E61047R6899j1488j37748N7312o9403J54972o8503l0791n3283O855Q1646
14733E87515j03825K33530j76280R8166L59483C77182L74997k38797L6910M45954
14723I96246m65062j01804L81582k24741m5429j33154M36920K52879k99118N9513
14713H57832K46965m26685O46833N2677K278l6956J88822l26860l28277r656n8697
14702H08276K70682J6697j96331l77831K88153j87729J1624k08910N91510k77834
14692G38307K58411o4290J78323k5090m5382k30652L83679R3006J19129l9620
$$ y = [357765, 567357, 404797, 544497, 290435, 637350, 804265, 981566, 949608, 800845, 686926, 626193, 423437, 330295, 477754, 536876, 667415, 838633, 595212, 390865, 561047, 657946, 646458, 508710, 566022, 496619, 651591, 583088, 552297, 499014, 505869, 587515, 483690, 717220, 540940, 639106, 998589, 377182, 752179, 513382, 550292, 996246, 531184, 429380, 810962, 586221, 540792, 407638, 844558, 1097437, 798319, 857832, 1104797, 678112, 1324945, 1377622, 1379900, 1342944, 1531766, 1204906, 876629, 866973, 808276, 1078958, 1095655, 899324, 521493, 809646, 621917, 633541, 424631, 1016141, 738307, 996718, 932428, 1110751, 1085661, 1040279, 809627, 1193306, 1286312, 1405441, 1365821]
14682A365821L71644o01653K00247n52547M6947K33886k67663J48322N3674R1085
14672A089763k89384o9560O0020K00506l9059k75451O92273l62365l23015M24786
14662A108514p6091k01438l20155J95508L41956p0175l2342j74643M07119k67614
14652I10639k89815J78942J26022j57197K89088l9197K2156j81688n1572J97655
14642A005033j42320P1980j1091Q8122j00817K09720l75680K81834J85517M5769
14632A258067L35495l73349l41706N38194p2847l95721L2529K04073l78620L44413
14622A150528l68792N22842l48593l3934j20545L90340j61212J77295M5280K5547
14612A278756k08471J66014k23914J28582j84225L29575j70182K27235j92300
$$ y = [1365821, 1737465, 1135812, 1336059, 783512, 830459, 1064345, 796682, 945004, 998678, 1089763, 800379, 730819, 790839, 991345, 952286, 676835, 1369108, 1006743, 683728, 1108514, 1032423, 830985, 510830, 706338, 1048294, 978119, 945777, 771134, 1178253, 910639, 620824, 799766, 925788, 768591, 1057679, 1018482, 1040638, 858950, 807378, 1005033, 862713, 934693, 923602, 1011724, 910907, 1120627, 744947, 1026781, 1212298, 1258067, 1593562, 1220213, 878507, 1416701, 1343854, 948133, 980662, 1184735, 806115, 1150528, 781736, 1304578, 955985, 922051, 801506, 1191846, 1030634, 1207929, 1253209, 1278756, 1070285, 1236299, 1012385, 1140967, 956742, 1286317, 1116135, 1343370, 1151070]
14603A151070j72390p1687m1391L51335o0525R5100L2398J42357j56592p0815
14593A198860K69396j11235N5422k19990j5801j02335R7269N12769n28328N38155
14583A694182j89576p7401l3557M42632p50776L72388L4577j01965p8985j1044
14573A300475J34446j99200M56957m73323M02922J36691J6604j57442K57369n68029
14563A307470Q2640L66198J34527p4141K9850k37984M67758k16428K94545P9660
14553B234095r3074M7895q8313K13570l5968j37764n6645M53497J58441m255J30651
14542B822130j2187J80142P99297j81243O94256M48899J019005P39072K509263
14533I018634L683779O787488J0078019j304763j1366281o449427l904794j406974
$$ y = [1151070, 978680, 906993, 865602, 1216937, 1156412, 1251512, 1283910, 1426267, 1269675, 1198860, 1468256, 1357021, 1412443, 1192453, 1176652, 1074317, 1171586, 1684355, 1156027, 1694182, 1504606, 1427205, 1393648, 1836280, 1085504, 1457892, 1492469, 1390504, 1311519, 1300475, 1434921, 1235721, 1692678, 1219355, 1622277, 1758968, 1775572, 1618130, 1875499, 1307470, 1390110, 1756308, 1890835, 1816694, 1846544, 1608560, 2076318, 1859890, 2154435, 2234095, 2141021, 2188916, 2100603, 2314173, 2278205, 2140441, 2083796, 2537293, 2695734, 2691479, 2822130, 2809943, 2990085, 3789382, 3608139, 4302395, 4751294, 5770299, 6509371, 9018634, 12702413, 19489901, 29567920, 28263157, 16896876, 10447449, 6542655, 5135681]
14525E135681j50422k11847j621760o19468j50206r9392J55089k9191k61718l82683
14515A764083L23047l56689K57271P2662j98221j25755M86970l31734K47800M03653
14505B543087l19160k20262J82202J70092k0194j01175J26230j43854J81947j05900
14495B293013K38395j23914Q8044p3753q8l3541K30640J47033L7683m7150K6905
14484B783267o452j07077J68470J96959j19218Q6903J62320l98689K50117m9539
14474B967061m7786o3379K08900J93805K5007k66023p5231q9272M29154L33356
14464C615592l24135L26519l42339K57511l8055P1493j97787L40198K31002k71930
14454C668069j59624L34073L31846k04935J92958q8168P197k00812J05979J51158
$$ y = [5135681, 4985259, 4773412, 3151652, 2532184, 2381978, 2282586, 2437675, 2408484, 2146766, 1764083, 2087130, 1730441, 1987712, 2060374, 1862153, 1736398, 2223368, 1891634, 2139434, 2543087, 2223927, 2003665, 2185867, 2355959, 2335765, 2234590, 2360820, 2216966, 2398913, 2293013, 2531408, 2407494, 2495538, 2421785, 2421697, 2388156, 2618796, 2765829, 2803512, 2756362, 2783267, 2776815, 2669738, 2838208, 3035167, 2915949, 3002852, 3165172, 2766483, 3016600, 2967061, 2919275, 2855896, 3064796, 3258601, 3283608, 3017585, 2942354, 2853082, 3282236, 3615592, 3291457, 3617976, 3275637, 3533148, 3495093, 3566586, 3368799, 3708997, 3939999, 3668069, 3508445, 3842518, 4174364, 3969429, 4162387, 4074219, 4081416, 3880604, 3986583, 4137741]
14444D137741m2750N28895n03702L9071J62540L27925J21949k93623k02639N43687
14434D819094l04947P1310J09204O67602M060m60501M90499m22332L91413n3670
14424E311732K62346J20826l25980M78938l06309L24518r4108L46825j81190L12534
14414F250132N0741M20428J991l66838p0282J31552N68157l54592K44792N3131
14404F929212o0277P34749N6657J26251k01433J12138P5940j61456L97585J26825
14394H136191L54164m5340O228L42349K5736J8504O87861J12796j45995P7953
14384I570447j2959K23177j79374K38154J42230L25038M19285j06552K63977l8638
14374A0844785M28898j970J45370K70839M85094Q1894K14896l0558N93595L88458
$$ y = [4137741, 4094991, 4623886, 4120184, 4159255, 4321795, 4649720, 4771669, 4478046, 4275407, 4819094, 4514147, 4585457, 4694661, 5362263, 5366323, 4905822, 5396321, 4973989, 5365402, 5311732, 5574078, 5694904, 5368924, 5847862, 5541553, 5866071, 5771963, 6118788, 5937598, 6250132, 6300873, 6721301, 6723292, 6356454, 6286172, 6417724, 6985881, 6631289, 6876081, 6929212, 6868935, 7603684, 7660341, 7786592, 7585159, 7697297, 7773237, 7611781, 8009366, 8136191, 8490355, 8445015, 8451243, 8793592, 8819328, 8837832, 9525693, 9638489, 9492494, 9570447, 9557488, 9780665, 9601291, 9839445, 9981675, 10306713, 10725998, 10619446, 10883423, 10844785, 11273683, 11271713, 11417083, 11687922, 12173016, 12254910, 12469806, 12439248, 13032843, 13421301]
14364A3421301R2403N67339L52618p6736J17938M70023L60731L50452K01994J54063
14354A6012126M94155J36509L92248M24350L59675M22184K44259O99203L66077
14345A9550786M06694K76467J46786O79331N80058M9291J159873J63516Q45135
14336B3857937P21283L24404M35359J088289M87846Q07352Q26748M21024P81972
14327B9752214O35524R34059J147296R63189N22820J170277R29932J213740J257030
14318C8526081P11473J403174J255086J454741J558669J337351J388654J916925
14310D9552154J706809J546894K425564J772395K098335K286633K101883K714037
14302F6204704K506126K353656K960949L296705L088053L299252M024877L698748
$$ y = [13421301, 13513704, 14081043, 14433661, 14356925, 14474863, 14944886, 15305617, 15656069, 15858063, 16012126, 16506281, 16642790, 17035038, 17459388, 17819063, 18241247, 18485506, 19184709, 19550786, 19957480, 20233947, 20380733, 21060064, 21640122, 21689413, 22849286, 23012802, 23857937, 24579220, 24903624, 25338983, 26427272, 26915118, 27722470, 28549218, 28970242, 29752214, 30387738, 31321797, 32469093, 33432282, 33955102, 35125379, 36055311, 37269051, 38526081, 39237554, 40640728, 41895814, 43350555, 44909224, 46246575, 47635229, 49552154, 51258963, 52805857, 55231421, 57003816, 59102151, 61388784, 63490667, 66204704, 68710830, 71064486, 74025435, 77322140, 80410193, 83709445, 87734322, 91433070]
14294I1433070L820912L907062M959000M896727N157679N841156O189737O378044
14286A32583387O543818P224897P457444Q580736Q539542R082174J0109876J0243214
14278B00365088J1085535J1696785J2422431J2816091J3792963J4035906J4114046
14271B90328845J4785986J5118188J5112448J5088907J4916505J4704347J3506713
14264C93561939J2653257J2090462J0842198J0066772R012907Q009082M031178
14257D60267795J729860J052959P54783m336509p280442o421709q067676j2485432
14249D25213629j3259476j3610019j4595500j5163173j5303557j5083791j5325041
14242C22873072j5000071j4575616j4413971j3582455j3025912j2489853j2345522
$$ y = [91433070, 95253982, 99161044, 104120044, 109016771, 114174450, 120015606, 126205343, 132583387, 139127205, 146352102, 153809546, 162390282, 170929824, 180011998, 190121874, 200365088, 211450623, 223147408, 235569839, 248385930, 262178893, 276214799, 290328845, 305114831, 320233019, 335345467, 350434374, 365350879, 380055226, 393561939, 406215196, 418305658, 429147856, 439214628, 448227535, 456236617, 460267795, 461997655, 463050614, 463805397, 459468888, 452188446, 445766737, 437699061, 425213629, 411954153, 398344134, 383748634, 368585461, 353281904, 338198113, 322873072, 307873001, 293297385, 278883414, 265300959, 252275047, 239785194, 227439672]
14235B27439672j0602121j1966216j0860534j0867702r483657q814350q435649
14228A56409443p731382p451459o759695o308022o079388n395781n303484n044898
14220A06335334m958180m259261m424435l557769l258437l849285l244654l189597
14212G5593716k817954l100250k261596k720051k621926j898615k241665j751297
14204E6180362j967813k186090j647316j739248r49648j607408j341789j711059
14196D3029991j275531j195817j127958j065616r55084j324578p25737j131994
14188C4227676j084510p50906n41097j059401q28901j196226n63620p14172l98621
14179B7090222r39319l84880m79368j003267n88541o21851n78260l72214m77152
$$ y = [227439672, 216837551, 204871335, 194010801, 183143099, 173659442, 164845092, 156409443, 148678061, 141226602, 134466907, 128158885, 122079497, 116683716, 111380232, 106335334, 101377154, 97117893, 92693458, 89135689, 85877252, 82027967, 78783313, 75593716, 72775762, 69675512, 67413916, 64693865, 62071939, 60173324, 57931659, 56180362, 54212549, 52026459, 50379143, 48639895, 47690247, 46082839, 44741050, 43029991, 41754460, 40558643, 39430685, 38365069, 37409985, 36085407, 35359670, 34227676, 33143166, 32392260, 31851163, 30791762, 29962861, 28766635, 28203015, 27488843, 27090222, 26150903, 25766023, 25286655, 24283388, 23694847, 23072996, 22494736, 22122522, 21645370]
14170B1645370n46780n58396l16732o35383l02788m87881n20715j62484m89624
14161A7624587k24336l10542m70381j69461k67168k78456m31584l76785m5478
14152A5050396o30046m5564j24396k93170k66012o06965K79604n59494j28468
14143A2675885k75517j74228l9370l77177j71684p4978l17200k38964q0334j49248
14133A0777185m07236m076l67527M59719q52730j65128J89379j99325j08035j91763
14123I130463k23246l1058k91367k10838K65824k20720m16426o3736j77229K09887
14113G971554k05913L6595q5927m09183J35340j61815r4720l32259O6485K56627
14103G176784k56259l16611k14207N49686l12228k42177o6639j78648J84813l86644
$$ y = [21645370, 21098590, 20540194, 20223462, 19588079, 19285291, 18797410, 18276695, 18114211, 17624587, 17400251, 17089709, 16619328, 16449867, 16182699, 15904243, 15472659, 15095874, 15050396, 14420350, 14374786, 14250390, 13957220, 13691208, 13084243, 13363847, 12804353, 12675885, 12400368, 12226140, 12186770, 11809593, 11637909, 11562931, 11245731, 11006767, 10926433, 10777185, 10369949, 10365873, 9998346, 10458065, 9605335, 9440207, 9629586, 9430261, 9322226, 9130463, 8907217, 8876159, 8584792, 8373954, 8639778, 8419058, 8002632, 7938896, 7761667, 7971554, 7765641, 7802236, 7716309, 7307126, 7442466, 7280651, 7185931, 6853672, 6920157, 7176784, 6920525, 6603914, 6389707, 6939393, 6627165, 6384988, 6318349, 6139701, 6324514, 5937870]
14093E937870l3087r3082J4421K0070j6067k86288Q9669j06483k52003O6758o5301
14082E276477k34129R818k89556K67240J17125j13284j3431l88703J32549J67690
14072D931796k10975j65834j34122M77858j04928l84970k432Q1729O9710l59554
14062D198278k6908k02599K83142L1776l31291K81081k96236J79973m01588J76025
14052C891653j48418j83659M11991J26398l58420J0775j43391O3452j35941o8614
14042C465826j94224K47820k33255K80413Q1140q9953k42014n3132J58595m69463
14032B951753L87814K2710k56746j15768k65145J96878j0750R8741j18815m7057
14022B843615L23139m90420J92024K37639p29640M80893k4163Q341l14705M33623
$$ y = [5937870, 5904783, 5811701, 5826122, 5846192, 5830125, 5543837, 5633506, 5527023, 5275020, 5341778, 5276477, 5042348, 5052166, 4762610, 5029850, 5146975, 5033691, 5020260, 4631557, 4764106, 4931796, 4720821, 4554987, 4420865, 4898723, 4793795, 4408825, 4406393, 4488122, 4557832, 4198278, 4171370, 3968771, 4251913, 4283689, 3952398, 4233479, 3937243, 4117216, 3715628, 3891653, 3743235, 3559576, 3971567, 4097965, 3739545, 3750320, 3606929, 3670381, 3534440, 3465826, 3271602, 3519422, 3286167, 3566580, 3647720, 3557767, 3315753, 3262621, 3421216, 2951753, 3339567, 3362277, 3105531, 2989763, 2724618, 2921496, 2910746, 3009487, 2890672, 2843615, 3166754, 2676334, 2868358, 3105997, 2376357, 2857250, 2833087, 2841428, 2526723, 2960346]
14012B960346j75365l59690M9519k38864L66207k6350j27496r1629P5921n8889
14002B373710J60573j70751N6229j65998k49049J94372k9607j20783J7727j8073
13992B048350K56092m23967K00707j2165J68993j81671J77733m34570M62919k45263
13982B017158K57676k73098M11466N7680M55056j36578O51261N84685J945151
13973E970457K956209N594880J0576619N440958r685322p337217m556655k088924
13965F871005j309003j205272m20600p34736P5460m43169P2394j12908l77558
13956B415613l18357L22415l71270L23843P6215m70011K22541l76391N6919N8736
13946A940253j85222N61159m13318j30962R7262l64241L87103J58434L5861m30763
$$ y = [2960346, 2784981, 2425291, 2474810, 2235946, 2602153, 2575803, 2448307, 2356678, 2432599, 2373710, 2534283, 2363532, 2419761, 2253763, 2004714, 2199086, 2169479, 2048696, 2066423, 2048350, 2304442, 1880475, 2081182, 2069017, 2238010, 2056339, 2234072, 1799502, 2262421, 2017158, 2274834, 2001736, 2413202, 2470882, 2925938, 2789360, 3440621, 4025306, 5970457, 8926666, 14521546, 25098165, 30539123, 20853801, 13516584, 8959929, 6871005, 5562002, 4356730, 3936130, 3201394, 3276854, 2833685, 2906079, 2793171, 2415613, 2097256, 2419671, 2048401, 2372244, 2448459, 1978448, 2200989, 1824598, 1881517, 1940253, 1755031, 2316190, 1902872, 1771910, 1869172, 1504931, 1892034, 2050468, 2086329, 1655566]
13936A655566j16392L03431j33772j56228K05896j94197J28648m2416j3435j88539
13926A448562L22004j83419k0983P9936q1389O0343j50702R0620r9947L11732
13916A776757k74765j54433j7375L61654k00451j46208j26656K3762K0322L22902
13906A585509j95559P6090j10758q9539j7107P4388l12431j59903K88854K57055
13896A396599K95940j42149l56817N1342J49185j88519k1403O2395K70366n3381
13886A463558l02392J32487l85142J06188L61863k64554J72620k65413J60614
13877A179829n3374m4192K42260l44840K37239J10052J21489k38986o0592J85905
13867A334790k77669L38718j73828k79811J6147J5300o7455K13667o353m45848
$$ y = [1655566, 1539174, 1842605, 1708833, 1552605, 1758501, 1564304, 1692952, 1650536, 1637101, 1448562, 1770566, 1587147, 1566164, 1646100, 1564711, 1625054, 1474352, 1564972, 1465025, 1776757, 1501992, 1347559, 1330184, 1691838, 1491387, 1345179, 1218523, 1242285, 1262607, 1585509, 1389950, 1466040, 1355282, 1265743, 1248636, 1323024, 1010593, 850690, 1139544, 1396599, 1692539, 1550390, 1193573, 1244915, 1394100, 1205581, 1184178, 1246573, 1516939, 1463558, 1161166, 1293653, 908511, 1014699, 1376562, 1112008, 1284628, 1019215, 1179829, 1126455, 1082263, 1324523, 979683, 1216922, 1326974, 1448463, 1209477, 1148885, 1334790, 1057121, 1395839, 1222011, 942200, 958347, 973647, 906192, 1119859, 1113506, 667658]
13857F67658L33352k16818M02214j32790J11260j64772j06364J4424M33387k27681
13847A113870R8590j2875j04569j85238j03575M74107k74387J28133j87840L03552
13837A249768j11300Q36D72349M73569j80079J45504K242K36264j768l94086J96209
13826I50204k42234L8060K62718D84251L86807K82348k60490N9942m0631D05735
13815I08062M1730q5653m7845q0422K47123k49390R4586j98536J67340J8985j71279
13804F44701J79614K07867N6841q4378k06554l3889k10047O3489K6921M29003
13794A073568l71049J12731M5713j99633J71225J941J21354l49000Q6543J4851
13784G08244k34193K43928k27934K1653j65780K60313P8097B62053L38476J20307
$$ y = [667658, 1001010, 784192, 1186406, 1053616, 1164876, 1000104, 893740, 908164, 1341551, 1113870, 1212460, 1199585, 1095016, 909778, 806203, 1280310, 1005923, 1134056, 946216, 1249768, 1138468, 1139304, 472349, 945918, 765839, 911343, 913585, 1149849, 1148081, 753995, 950204, 707970, 746030, 1008748, 484251, 871058, 1153406, 892916, 952858, 912227, 405735, 908062, 949792, 864139, 816294, 735872, 982995, 733605, 828191, 629655, 796995, 815980, 644701, 824315, 1032182, 1089023, 1004645, 798091, 764202, 554155, 617644, 644565, 1073568, 702519, 815250, 860963, 661330, 832555, 834496, 955850, 606850, 693393, 708244, 474051, 717979, 490045, 511698, 345918, 606231, 684328, 262053, 600529, 720836]
13774G20836J65179j17399r5646k34383k4220L91078C60016M88022l65874p6594
13764D05570K89832P5562j05250N145l7758K01573l25646J88143n1231j07883
13754E38057K2469J79159m8241P6800r2284j38704K03893j2336n0024j11396n8733
13743E08660k15280M45335k90304J64386P3467O6228j01868q7885l3898K22653
13733G51494B33296K63079J44896K51179l01947Q669j39442J28554J76118j99065
13723E65337J9603J05784k8751R7957A95331L41482o3714O6470j88155J62674
13713E14088B54918M21682k53252L58237C72749n0583r5547O1053Q6878K24253
13703E98803r0971A68015M49356k21363J91685o1620l1411j43369O0191J31265
$$ y = [720836, 886015, 768616, 672970, 438587, 414367, 805445, 360016, 848038, 482164, 405570, 695402, 770964, 665714, 670859, 633101, 834674, 509028, 697171, 645940, 538057, 560526, 739685, 691444, 768244, 675960, 537256, 741149, 728813, 678789, 567393, 508660, 293380, 738715, 448411, 612797, 686264, 752492, 650624, 562739, 528841, 751494, 233296, 496375, 641271, 892450, 590503, 599172, 459730, 588284, 764402, 565337, 584940, 690724, 661973, 759930, 195331, 536813, 473099, 539569, 351414, 514088, 254918, 676600, 423348, 781585, 372749, 322166, 226619, 287672, 374550, 598803, 507832, 168015, 617371, 396008, 587693, 526073, 494662, 351293, 411484, 542749]
13693E42749B09705J66104K06850O1938k13438R1408j24131J33714j60693l3456
13683C38001K561J25807K03285k78763J61748j54426j60052K55759n0157R6153
13673E39916j46346K69703A57190N85962B89835p1730K44076k11645e562C08700
13662D68036K62974j93146K97570l73211J4558A59857J58030L12180B11137N35967
13652G47104l33967K44466A88050K64940J3607j3137b7021C70621L18404k70902
13642D18123K90340j79571N2691k5874j2187M8580o959j75888K3219J24933J57094
13631G14501k01178k13299K61908j25830l9844J58636j06743K49882j65898l869
13621E28266O831B18174L01155k23875J23513j60781P4295B1102L48656K79371
$$ y = [542749, 209705, 375809, 582659, 644597, 431159, 522567, 398436, 532150, 371457, 338001, 340562, 466369, 669654, 390891, 552639, 398213, 238161, 493920, 443763, 539916, 393570, 663273, 157190, 743152, 289835, 218105, 462181, 250536, -5562, 308700, 468036, 731010, 537864, 835434, 462223, 476781, 159857, 317887, 630067, 211137, 747104, 413137, 657603, 188050, 452990, 466597, 453460, -27021, 370621, 689025, 418123, 708463, 528892, 581583, 555709, 543522, 592102, 585143, 409255, 432474, 557407, 714501, 513323, 300024, 561932, 436102, 396258, 554894, 448151, 698033, 532135, 528266, 535097, 218174, 519329, 295454, 418967, 258186, 332481, 21102, 369758, 649129]
13611F49129A0691K59728L28283l6023j72575j47832K02548k5989j21512p5412
13601B21907L4627K72795A91492J4105q9795L24232j71319G1825L41725j62580
13591B50970L19016j4645m6458j33662j9863A02782J0488M7735J06317K85051
13581E52373n9506L7211k62154E9733J91944O0915A48300J09978l2324J21833
13571C47787C0454M16240J5333E8960J49109n3273R8386m9757K12177p6679J26890
13560D65813j62512A21454K15779J452A10835K60019A32236L33969E4258K44830
13550B99088J29068I3466K02713m8049M869L4414p3746a7642B91756E8485a36211
13538C54759J637J75260B25398I2056K72501c7263E33112c1497C58980l4957R2706
$$ y = [649129, 10691, 270419, 598702, 562679, 390104, 242272, 444820, 418831, 297319, 221907, 256534, 529329, 191492, 205597, 115802, 440034, 268715, 71825, 413550, 250970, 569986, 555341, 508883, 375221, 355358, 102782, 113270, 161005, 267322, 552373, 492867, 530078, 267924, 59733, 251677, 312592, 148300, 258278, 225954, 347787, 30454, 446694, 462027, 58960, 208069, 154796, 253182, 203425, 415602, 338923, 465813, 303301, 121454, 337233, 338685, 110835, 370854, 132236, 466205, 54258, 299088, 428156, 93466, 296179, 248130, 252999, 287413, 213667, -17642, 291756, 58485, -136211, 354759, 356396, 531656, 225398, 92056, 364557, -37263, 533112, -31497, 358980, 324023, 416729]
13527D16729j05089O9255N3779L3474j81268P6137A49582P8999l5600L32542B47461
13515C96324A82468J00497L0151m6473A32309k3774J14888b03404H8506M58529
13505E47035B42647A15028k0685J89059J6413L19702A94303P4895p2349a36730
13494A49933J61300j49977j4892g739E70735A84578M0597A8045N9838M34285A75178
13482b3497C97562o7065j46671L3566P1015i405B90983J7682C5561K84407K10825
13471E30793k01770i1772A59485l0259P5415D1807g6400D28025A54317J75979
13461C30296J5921b7079G3190K30697a28789A97335j0681J47914l0961n8677r0087
13450A54843P8362J33524A82868o0860L1967K06585j00964m1965p9574Q818p1163
$$ y = [416729, 311640, 380895, 434674, 468148, 286880, 363017, 149582, 228581, 192981, 525523, 247461, 396324, 182468, 282965, 313116, 266643, 132309, 108535, 223423, -203404, 88506, 547035, 242647, 115028, 94343, 283402, 299815, 619517, 194303, 269198, 196849, -136730, 149933, 311233, 161256, 146364, -7739, 570735, 184578, 225175, 18045, 77883, 512168, 175178, -23497, 397562, 330497, 183826, 217392, 288407, -9405, 290983, 308665, 35561, 319968, 530793, 329023, -91772, 159485, 129226, 204641, 41807, -76400, 428025, 154317, 330296, 346217, -27079, 73190, 303887, -128789, 197335, 186654, 334568, 303607, 244930, 154843, 233205, 366729, 182868, 122008, 153975, 360560, 259596, 217631, 138057, 146875, 75712]
13439G5712B1709R6578J48107j5503o516m7681L8798r0783J05682L67905k74787
13428C43509b4681A23527b02177f0843C76714j32667H0274N106K7936O3779B2882
13416B99412A45211L9398q5719J05294J0770G2616K41114p9596H4066J74819A21534
13404D36000B0975Q5917l3539c1967A31980J0754R2561J2211a45221A4436N8947
13393G3383R3342d3760B20797J34019A34860J2978B6662J39050o1916J90291C3777
13381a22134D05094A44222K37773A45558J78759H2683J62870f9139B14008g5828
13370B63031A30285D0725g807B64777j23956n6388K07568j0516b08012A91983
13359c9454A84701e5292m5903B92575j28053J03236c1903o2117D5398J29471P4704
$$ y = [75712, 21709, 118287, 266394, 250891, 244375, 196694, 235492, 144709, 250391, 618296, 343509, -24681, 123527, -202177, -60843, 376714, 244047, 80274, 85380, 113316, 177095, 22882, 299412, 145211, 184609, 98890, 204184, 214954, 72616, 313730, 234134, 84066, 258885, 121534, 436000, 20975, 106892, 73353, -31967, 131980, 142734, 235295, 247506, -145221, 14436, 73383, 166725, -43760, 220797, 354816, 134860, 147838, 26662, 165712, 103796, 294087, 33777, -122134, 405094, 144222, 381995, 145558, 324317, 82683, 245553, -69139, 214008, -75828, 263031, 130285, 40725, -7807, 264777, 140821, 84433, 292001, 281485, -208012, 191983, -39454, 184701, -55292, -101195, 292575, 164522, 267758, -31903, -94020, 45398, 174869, 249573]
13348B49573J07829Q9468j01122A68800j2074L9625M7707a82522d5066C05706
13337C17817F2171K3982J12954P8252A07608a51804B06434a08580A76200D1277
13326A92079q5792J96185a4771B11794l3005L4254J84471C2178M8326a37282D33085
13314B52012j04031D3957K11301r3398O2251a41520B48376J30566H6851K20938
13304C07789I0264j027J55109M0083J0060A44342K30896A00480J45464J24704
13294C70648B7777J32606J09789j1111J50506n5433O4738j29000h159A11763J66005
13283B77768a71228A38798E9862b9345B35542A3241K07992K25908e58035B5405
13272C9739P3087L48244D1760O0149O8929F8731a78780F4904J43031D4131Q4788
$$ y = [249573, 357402, 446870, 345748, 168800, 156726, 196351, 244058, -182522, -45066, 305706, 317817, 62171, 86153, 199107, 277359, 107608, -151804, 206434, -108580, 176200, 41277, 192079, 106287, 302472, -14771, 211794, 178789, 213043, 397514, 32178, 80504, -137282, 433085, 252012, 147981, 43957, 255258, 161860, 224111, -141520, 248376, 378942, 86851, 307789, 90264, 89237, 244346, 284429, 294489, 144342, 375238, 100480, 245944, 370648, 27777, 160383, 270172, 259061, 409567, 354134, 418872, 289872, -8159, 111763, 277768, -171228, 138798, 59862, -29345, 235542, 13241, 221233, 447141, -558035, 25405, 39739, 112826, 461070, 41760, 101909, 170838, 68731, -178780, 64904, 207935, 44131, 128919]
13261A28919M8586L12756a99703C70609C1708M87380A9997N8056Q2477a77326
13250f0266B87334A700K8914R4374m1127M8019J05045p9568a93335C36455I0225
13238B35018m0390B3347K01694A8384R5869a22266B39515q6617R4141a55158A70235
13226F5263O6787a93281B51096a94141A82916h6228B51521k4091r6406E2293R6512
13215A48805n3619a33684A15187L7352j9573A0635J0181b66048A37851n8246J58275
13204B37880H3591L45693i5324l0950A8166q218J79575e5502f170C41011I7029
13192A96619N9498a62520M4418O670B27574J57044j25733b29030a01348C12728
13181f1591j72015B75573H7519k98K03696D9082B047L30531E4449J25453J51125
$$ y = [128919, 177505, 490261, -199703, 370609, 31708, 519088, 19997, 78053, 160530, -177326, -60266, 287334, 1700, 30614, 124988, 83861, 131880, 236925, 157357, -193335, 336455, 90225, 235018, 194628, 23347, 225041, 18384, 114253, -122266, 239515, 152898, 247039, -155158, 170235, 65263, 132050, -193281, 251096, -194141, 182916, -86228, 251521, 227430, 131024, 52293, 148805, 95186, -133684, 115187, 152539, 132966, 10635, 20816, -266048, 137851, 79605, 237880, 83591, 429284, -95324, -126274, 18166, 9948, 189523, -55502, -6170, 341011, 97029, 196619, 256117, -162520, -118102, -111432, 227574, 384618, 258885, -229030, -101348, 312728, -61591, -233606, 275573, 87519, 87221, 290917, 49082, 2047, 332578, 54449, 179902, 331027]
13170C31027D2739a04348H9545b6651A46800j0199J35503g3589I4698M0934L5465
13159A71097A4466L82916F7355A342J25453R6492M7268k9943C5611J42258p0577
13148A07292D7528h8619A06878c7542j01162k1918A3889L09775b17429D057L28295
13137C32352k7138r5255l9739a85578A79340J1948R2044A4244J77382a9744B68175
13125b69765A70581d3790B21987b760A40386E7055a05753F6487a78908A68567
13114A07432f5682D3509a00968C78123j75595B0431a31941O1205e797B97667A25219
13102A45267C1521d0954A79374l6966J13255E3782K21191f5565A14144o952k7258
13091G9934N4516i8108j4319E7806K0020h8429B63409b68086M5058A90536E0187
$$ y = [331027, 42739, -104348, 89545, -26651, 146800, 136601, 272104, -73589, 94698, 135632, 171097, 14466, 397382, 67355, 1342, 126795, 223287, 270555, 240612, 35611, 177869, 107292, 47528, -88619, 106878, -37542, -138704, -160622, 13889, 323664, -217429, 4057, 332352, 305214, 209959, 170220, -185578, 179340, 191288, 283332, 14244, 191626, -19744, 268175, -269765, 170581, -43790, 221987, -2760, 140386, 57055, -105753, 66487, -178908, 168567, 107432, -65682, 43509, -100968, 378123, 202528, 20431, -131941, -70736, -5797, 297667, 125219, 145267, 31521, -40954, 179374, 142408, 255663, 53782, 274973, -65565, 114144, 107192, 79934, 134450, -98108, -112427, 57806, 77826, -88429, 263409, -268086, -223028, 190536, 50187]
13079d9756k8323B24075h2238j56285E6547R4244b61609A03890a44062O1635A96535
13067g7057K3860A09077h8605p8814A68936J5717e4030A70794i1950D2003L26591
13056C68594j54682K9598o7980q0635a2798q6349A95882b41278A32805j9612a9319
13044a47993j54369A58675K15217e1088B43361c6050k7562b8917L95B81194n9913
13033B21281I7870a41114p0844g108A84831J83401H8685A6423N0333B6758K51623
13022B78381j21087i7785C68929B7880J80957G7513a1233j34249n8950A00918
13011a11698B38478j13503B8533J81704I0835N4372Q3860q3191J88380j03018
13001B31238F9552M8406a4567A61227Q2497j02696i9394p1114g3774p9154A14091
$$ y = [-49756, -78079, 224075, -82238, -238523, 56547, 150791, -261609, 103890, -144062, -82427, 196535, -77057, -53197, 109077, -88605, -167419, 168936, 184653, -54030, 170794, -91950, 42003, 368594, 213912, 243510, 175530, 94895, -12798, -99147, 195882, -241278, 132805, 113193, -19319, -147993, -302362, 158675, 373892, -51088, 243361, -36050, -63612, -28917, -28522, 281194, 221281, 97870, -141114, -211958, -7108, 184831, 368232, 88685, 16423, 66756, 26758, 278381, 157294, -97785, 368929, 27880, 208837, 77513, -11233, -145482, -204432, 100918, -111698, 238478, 124975, 28533, 210237, 90835, 145207, 229067, 145876, 334256, 231238, 69552, 117958, -14567, 161227, 243724, 141028, -99394, -170508, -73774, -152928, 114091]
12989D60501A86412G6078J05895A1212c9526n1745B91197j41476Q2637g2893p509
12978h0402J7194F5105R746j4340h7071B9986K28139b0586F8714Q902l5848N761
12966D7529b5005F1325c207C86070d08099a75179I7756A5459K01820b54948d2778
12954b4412A21081N7916K0398b71052g4057a6242C35219f0043A45742D9629a29319
12942f7132F533K97269a29545H9991K5603c38619a42411o5842A40882b2987B0754
12930B8720P1705d810j23022C48472b1897H2574a53269M3449A47078n8069a65747
12918A32590N0517n3591b4274r4003A66780F9796R4940a72707E9374N9262g5412
12906a74116N750B82672a99988I1474b5958B96459B834L24842i4555j31870B15879
$$ y = [460501, 186412, 76078, 181973, 11212, -39526, -91271, 291197, 149721, 232358, -72893, -80402, -63208, 65105, 74851, 60511, -87071, 29986, 258125, -20586, 68714, 77616, 41768, 47529, -25005, 61325, -3207, 386070, -408099, -175179, 97756, 15459, 217279, -254948, -42778, -24412, 121081, 178997, 199395, -271052, -74057, -16242, 335219, -60043, 145742, 49629, -129319, -67132, 6533, 303802, -129545, 89991, 115594, -338619, -142411, -208253, 140882, -22987, 20754, 28720, 100425, -4810, -127832, 348472, -21897, 82574, -153269, -109820, 147078, 89009, -165747, 132590, 183107, 129516, -24274, -118277, 166780, 69796, 164736, -172707, 59374, 118636, -75412, -174116, -168366, 282672, -199988, 91474, -25958, 296459, 2834, 327676, -94555, -226425, 215879]
12894A30572a91063q3677i3576A78344a93523K0270A47971a99070B02163d5261
12883C40682n9274A34541f5000b6673j1319P382g675l5515I7553L7012b3424k15608
12871b39032B49870A06185d6498p9607m3089l8176h3380B8389a76879b4237n5723
12860g9960G3684k1013a03740F6052g9758c8373j04627P0754m3960l06615J68722
12849b54099J03397F7271N1257J28759c72570f4723B03982q327A1911b52234A91978
12837A20596a68831A15844A0170a30821A50955b5598A88271J1888E4293J27280
12827A81573b55910a17152A80608H3650b56187C631a09212A6292K41753d5507
12816a02455E32J36313k2556k7953a24616f1602A2641K19142a43703M5779j3143
$$ y = [130572, -191063, -274740, -93576, 178344, -193523, -173253, 147971, -199070, 202163, -45261, 340682, 281408, 134541, -65000, -26673, -37992, -30610, -7675, -43190, 97553, 134565, -23424, -239032, 249870, 106185, -46498, -126105, -169194, -207370, -83380, 28389, -176879, -24237, -79960, 73684, 52671, -103740, 66052, -79758, -38373, -143000, -72246, -116206, -422821, -254099, -150702, 67271, 118528, 247287, -372570, -64723, 203982, 195655, 11911, -252234, 191978, 120596, -168831, 115844, 10170, -130821, 150955, -25598, 188271, 200159, 54293, 181573, -255910, -117152, 180608, 83650, -256187, 3631, -109212, 16292, 258045, -45507, -102455, 532, 136845, 114289, 86336, -124616, -61602, 12641, 231783, -143703, -97924, -111067]
12805a11067j3190M5320L1204A76224d1503D62030A50698B8028a79896f0193K8008
12794c2185a611j91134h3260r1663l07176F4290E550a95218A32658D7240a553
12782b35668h246A80486c10152b0122B07192b64835B67576C3026e576B03811a15567
12770G45K67470J23602q5471n0476A0780J05997n1682L7807C8583K29232b10768
12758A30449m4208c7764j25611e2951c511F874a08582B71738q5027G1905N2254
12747A24159a00068k8237j1097L1205L746j44868E6041a07435a8887B19628a4062
12735I3554b93647D6938K5226Q7695l3276c87119H1657a32722k37179I305e04878
12723b27482b3078f967r3992o483C09140f4954B45358g8939n8716j05084C493
$$ y = [-111067, -124257, -78937, -47733, 176224, -41503, 462030, 150698, 28028, -179896, -60193, -32185, -1611, -192745, -83260, -174923, -482099, 64290, 5550, -195218, 132658, 47240, -1553, -235668, -8246, 180486, -310152, -20122, 207192, -264835, 267576, 33026, -5576, 203811, -115567, 745, 268215, 391817, 306346, 255870, 10780, 116777, 65095, 102902, 38583, 267815, -210768, 130449, 86241, -37764, -163375, -52951, -3511, 6874, -108582, 271738, 186711, 71905, 124159, -100068, -128305, -139402, -108197, -104451, -249319, 56041, -107435, -18887, 219628, -14062, 93554, -293647, 46938, 72164, 159859, 126583, -387119, 81657, -132722, -369901, 9305, -504878, -227482, -23078, -6967, -100959, -107442, 309140, -64954, 245358, -78939, -137655, -242739, 3493]
12711h2237j4897Q697n288j90594J31546l19838A43303N7976l6150a05502k21445
12700c26947B78299q3517b12665A6808J13900K56201M4914b44952C53288j69950
12690A83338d4767B24815b19364C65622d479j46835d7993I7145J02628d3479B66890
12678e44427A3114g660m5755B425J67578E8606b29928A61260f9504n7190C23549
12666A4072h0061j0659B50602B9712J9970N6200a20368B95738C5094J16244i5698
12654H4274b7626B37273c635n2701k04074C95688b6467B10510a39937o1727A09124
12642c32654b0010D43144C9165K5310J21043I1925a75252C21824a7700q3812A18013
12630H0421a10062D1681L09093J28428q4779d3656k34006k09759J89411D3773
$$ y = [-82237, -97134, -88437, -93725, -284319, -152773, -472611, 143303, 201279, 165129, -105502, -326947, 278299, 194782, -212665, 16808, 130708, 386909, 431823, -244952, 353288, 183338, -44767, 224815, -219364, 365622, -4479, -151314, -47993, 97145, 199773, -43479, 266890, -544427, 13114, -7660, -53415, 2425, 170003, 58606, -229928, 161260, -69504, -126694, 323549, 14072, -80061, -90720, 250602, 29712, 49682, 105882, -120368, 295738, 35094, 151338, -95698, 84274, -27626, 237273, -3635, -56336, -260410, 395688, -26467, 210510, -139937, -201664, 109124, -332654, -20010, 443144, 39165, 64475, 185518, 91925, -175252, 321824, -17700, -101512, 118013, 80421, -110062, 41681, 350774, 479202, 394423, -43656, -277662, -487421, -298010, 43773]
12619B79242a77319g3950A87955b69165B41969N7772A9767f5496j72041A08262
12608A05016g2943D850K25064d4657A75360a86088D71268a71034q485d9936A0784
12596I2375g1247E400O6265J68872F7166g0949r7239A02450D1101L31548a66515
12584A95295F8818J27217H4827L16925F5090A7821J73421a98167O9337I785d5691
12572a55092r612N9770a6953j18454B06692j00590J53717K9313E8684M31202e0427
12560A91134I4184c72197f0526n3999k5460A56528g4639q4443N1887j1043B92634
12548B0264a46426c6799B24472C5765J4771d00129D2600b64103A6906K37112C3048
12536a59481B25800d39633B18276d366H4172l3647b10825q9417L0613h6056a7371
$$ y = [279242, -177319, -73950, 187955, -269165, 241969, 299741, 19767, -65496, -237537, 108262, 105016, -72943, 4850, 229914, -44657, 175360, -186088, 471268, -171034, -179519, -49936, 10784, 92375, -71247, 5400, 71665, 240537, 67166, -70949, -168188, 102450, 41101, 372649, -166515, 195295, 68818, 196035, 84827, 401752, 65090, 17821, 191242, -198167, -128830, 9785, -45691, -155092, -164704, -104934, -16953, -135407, 206692, 106102, 259819, 289132, 58684, 489886, -50427, 191134, 94184, -372197, -60526, -114525, -139985, 156528, -74639, -159082, -107195, -118238, 292634, 20264, -146426, -36799, 224472, 35765, 50536, -400129, 42600, -264103, 16906, 254018, 33048, -159481, 225800, -439633, 218276, -4366, 84172, 50525, -210825, -300242, -269629, -86056, -17371]
12524b55728B3578c26165a46966E6458L75759b22684J09785b3941F4061J00366
12514A64427a41001A86923c8277A17140C9275b32792B29483b42052k5871B7301
12503a50782j05794d9738C0395K18522l7665B9398b86366b2949j08676F8332g7266
12491a33394j15696f0191k1618A14691J87148A05881C5165a07049j7829C28374
12480a78100B89792j40065a1676B7000h1864M0636j73528B44105C4774c91141
12469g3717j3013q6881m5154A20972a64526D5326d870j14617l9585b2964E4801
12457I2398C1326N0482J21862h9933k01161f9200B6109b5803n8564A90344g1115
12445a5419A70840a29838N707d3295D0948b13785a1609A35065Q3473A2851c8563
$$ y = [-255728, 23578, -326165, -146966, 56458, 432217, -222684, -112899, -23941, 64061, 164427, -141001, 186923, -38277, 117140, 39275, -232792, 229483, -242052, -267923, 27301, -150782, -256576, -49738, 30395, 248917, 211252, 29398, -286366, -22949, -131625, 68332, -77266, -133394, -249090, -60191, -81809, 114691, 301839, 105881, 35165, -107049, -124878, 328374, -178100, 289792, 149727, -11676, 27000, -81864, -41228, -214756, 244105, 34774, -391141, -73717, -86730, -173611, -218765, 120972, -164526, 45326, -4870, -119487, -159072, -22964, 54801, 92398, 31326, 81808, 203670, -89933, -291094, -69200, 26109, -25803, -84367, 190344, -71115, -15419, 170840, -129838, -124131, -43295, 40948, -213785, -11609, 135065, 218538, 12851, -38563]
12433a8458j57784B76897g1565H4649i2497C8547d40202A89528D993K52019B4154
12421d13520b1065P054I2180c98834N7836D21121e2881B62551g5336Q622B41346
12409B8277a40941A35868b65304H6002i7464k41273B13260b94715b192n5726C55256
12397e5105A26293O0998D7951J90058a10520k18787B0763f2117C2184D320Q9740
12386I4060L0826b16856c7357B51602C4842a93018g5484F8968a4680B9886a07009
12374a57834A22311I216b7112H8704O1340b11000A3234J97632I8048P4419i6205
12362b39783C25155r9842e226C54415j71366b2779j6706j3974k8524I2443O4933
12351A57376h9682E0444F661J37134a89671n062H2144K32407a93344R3724K7479
$$ y = [-18458, -176242, 276897, -71565, 84649, -92497, 38547, -440202, 189528, 4993, 257012, 24154, -413520, -21065, -14011, 92180, -398834, -340998, 421121, -52881, 262551, -75336, -66714, 241346, 28277, -140941, 135868, -265304, 86002, -97464, -338737, 213260, -294715, -2192, -57918, 355256, -55105, 126293, 187291, 47951, 238009, -110520, -329307, 20763, -62117, 32184, 4320, 94060, 124886, -216856, -37357, 251602, 34842, -193018, -75484, 68968, -14680, 29886, -107009, -157834, 122311, 9216, -27112, 88704, 150044, -211000, 13234, 210866, 98048, 172467, -96205, -239783, 325155, 225313, -5226, 354415, 183049, -22779, -39485, -53459, -81983, 92443, 157376, -89682, 50444, 6661, 143795, -189671, -194733, 82144, 314551, -193344, -99620, -72141]
12340g2141B4666J63260F8867e2996j98365a13177C1650d2364q9742C3731c4801
12328g3048a7615A634K14936l2581j3565a68825O4146p657k7181J3713A97444
12316a53949d2188A1543N69726c55843e3614C27319F4391L04911B8711c7862k502
12305d0364C03828d7340B62702A23683J54870j01001f063B92844F6029f6024A72774
12293b01057A09181L16353h0852a7370j43602C9748a95408A16555j8268r178J48228
12282B37337h5652p9463A34189R8626b16489A24265O1803a14748C33192A58071
12271A81385I564K97339I915J86043a06809G4538L2506D7453P7112K07350a43016
12259g071C68605c9753k8173F16596a9503j17336L5788H5206M00730a6105B53599
$$ y = [-72141, 24666, 187926, 68867, -52996, -251361, -113177, 31650, -42364, -132106, 33731, -34801, -73048, -17615, 1634, 216570, 183989, 170424, -168825, -104679, -112336, -139517, -125804, 197444, -153949, -42188, 11543, 581269, -355843, -53614, 327319, 64391, 369302, 28711, -37862, -40364, 303828, -47340, 262702, 123683, 278553, 177552, -6063, 292844, 66029, -66024, 172774, -201057, 109181, 425534, -80852, -17370, -160972, 39748, -195408, 116555, 98287, 89109, 237337, -85652, -165115, 134189, 232815, -216489, 124265, 186068, -114748, 333192, 158071, 181385, 9564, 306903, 9915, 195958, -106809, 74538, 107044, 47453, 124565, 331915, -143016, -7071, 368605, -39753, -67926, 616596, -19503, -136839, -101051, 85206, 485936, -16105, 253599]
12247E1970K26883a06226A18K71523h6245j5148B41067L17103A96080L0244p6397
12236A49927A4878K03101q6482a52119B25918k2568d3263I8923Q2946a57990B13920
12224b47321j0474h4128I60c3452j26544C89245a80325g578F5740N402a15705
12212b00143i2950C19984R1693o4797g0548A6976K09632J08453A4518L40178d4347
12200A25692j8187A3439K11431a16705d6538H0185J89735g6183j77492H8058L42358
12189D30416j77973d2297l0884A37026c21446e9343B38868L25221A97539b56168
12178c0686A78131O7385a14757D27991j14928A28573J02120g5558H0644M196N5281
12167A40121F0557K09606G125J23622d7771D92604A17695a14895D85363A83909
$$ y = [51970, 278853, -106226, 118, 271641, -86245, -101393, 241067, 558170, 196080, 226324, 149927, 14878, 217979, 131497, -152119, 225918, 203350, -43263, 98923, 181869, -157990, 213920, -247321, -257795, -84128, 960, -33452, -159996, 389245, -180325, -7578, 65740, 71142, -115705, -200143, -92950, 319984, 411677, 346880, -70548, 16976, 226608, 335061, 14518, 354696, -44347, 125692, 107505, 13439, 224870, -116705, -46538, 80185, 269920, -76183, -253675, 88058, 430416, 252443, -42297, -73181, 137026, -321446, -59343, 238868, 564089, 197539, -256168, -30686, 178131, 245516, -114757, 427991, 313063, 128573, 230693, -75558, 80644, 84840, 140121, 60557, 270163, 7125, 130747, -47771, 492604, 117695, -114895, 485363, 183909]
12156H6967a19629E6438L251J68884L9457r5937E0507a2224j7827A31657P7933
12145B09590r6807a72122F64277I2942O0304q29d0699p6067o5797h0248A9023
12133h5628B41733j03323A3773a42030j3512I0674l5270J59558a31763B429J20461
12122A22890a25784A01621c5114G1612f9283B97025b47096B762J99921a89767
12111C37817i2941A37443J07761c5151A21312L17000B02770J62672F9265N3297
12101A22562Q4712m4270a11573A14723d6649A33695a27005A37512o666F1519p733
12090E3786L8568N6385P2015m6035J76375A29407K7178h4056j21180q214A22571
12078B51041K23310b07087B38817E1613B3991c19044A8996J48512F2749b09899
$$ y = [86967, -119629, 56438, 59689, 228573, 268030, 172093, 50507, -12224, -30051, 131657, 209590, 112783, -172122, 664277, 92942, 153246, 152417, -40699, -116766, -182563, -80248, 19023, -85628, 241733, 138410, 13773, -142030, -155542, 90674, 55404, 214962, -131763, 2429, 122890, -125784, 101621, -35114, 71612, -69283, 297025, -247096, 2762, 202683, -189767, 337817, -92941, 137443, 245204, -35151, 121312, 438312, 202770, 365442, 69265, 122562, 207274, 163004, -111573, 114723, -46649, 133695, -127005, 137512, 130846, 61519, 53786, 92354, 148739, 220754, 174719, 351094, 129407, 156585, -84056, -205236, -213450, 122571, 251041, 474351, -207087, 238817, 51613, 23991, -319044, 18996, 167508, 62749, -209899]
12067B84653a26907A9333J00998K46476r2797A15697d2534D87252C6934J12653
12057A49587E8614J2847J98118i056A3835K36816c3125m0695E8867O7500c6791
12045A21514M4348M7775A8839O9065a66124A30737E3658h5434A32929l5979m8315
12034D8635R06k2327J14159j5011O3659q3274D1185L1576k9192b83569C36402
12022a14846E9574b32060N1433j30960G500h1866k1107B01316B5624J44617n2517
12011A17724J62334A07638a88681A16468i5905A58604a7878A09158P2620K02644
12001C84422g7582B40664I9238B9068J86684L302a03229d9477A66178C1532K14543
11990B46075J3433m2701i389A24401b33789J02462A12188a39684k2990E772M5063
$$ y = [284653, -126907, 19333, 120331, 366807, 274010, 115697, -42534, 487252, 36934, 149587, 58614, 71461, 269579, -9056, 13835, 250651, -33125, -73820, 58867, 126367, -36791, 121514, 165862, 213637, 18839, 87904, -166124, 130737, 53658, -85434, 132929, 96950, 48635, 49541, 27214, 141373, 126362, 190021, 106747, 41185, 72761, 43569, -283569, 336402, -114846, 59574, -232060, -180627, -311587, 7500, -81866, -102973, 201316, 25624, 170241, 117724, 280058, 107638, -188681, 116468, -95905, 158604, -17878, 109158, 181778, 384422, -77582, 240664, 99238, 29068, 215752, 219054, -103229, -49477, 166178, 31532, 246075, 259508, 216807, -9389, 124401, -233789, -131327, 112188, -139684, -162674, 5772, 50835]
11979E0835R6231c22538i7637A1566b35993c1645C0373K21297a10214a8033A09572
11967I1837J38861d27242B1296J23494F3904i4387I7352J0783A1855K06570e2139
11955B39410j4291b12184N8381C20629b04588g2551A15029a0811R68j95623C88553
11943a48761a209A52465J04076E4047c4944A44727a10371B62047f7754A41072
11932g4118I71b25777c1181A63142a11596A09473n164f3007k52485A28310O0891
11921A89201b14311a4074j16344B8073J91084F5058b52822g0803j13957j4398
11911a99158r9367d5734q0205e009A7956c215A55282a25853E3160c53857J01203
11900b52654J20897a8272B84965j01387p0605c4265k92550B37126p8678a74708
$$ y = [50835, 147066, -322538, -97637, 11566, -235993, -31645, 30373, 251670, -110214, -18033, 109572, 91837, 230698, -427242, 21296, 144790, 63904, -94387, 97352, 108135, 11855, 218425, -52139, 239410, 225119, -212184, -153803, 320629, -204588, -72551, 115029, -10811, -9843, -205466, 388553, -148761, -1209, 152465, 256541, 54047, -34944, 144727, -110371, 262047, -67754, 141072, -74118, 971, -225777, -31181, 163142, -111596, 109473, 104309, -63007, -315492, 128310, 189201, -214311, -14074, -130418, 28073, 219157, 65058, -252822, -70803, -184760, -199158, -298525, -45734, -125939, -5009, 17956, -3215, 155282, -125853, 53160, -353857, -252654, -131757, -18272, 284965, 183578, 112973, -34265, -326815, 237126, 158448, -174708]
11889A53615a37989A48091b8003K425B63712a30057j07396C7520b5003j12628
11879a37631L544k66365E1536c2586C6686a79798f7687A50428g1441q2126e5537
11867a01912p8895l6485A42881o4324a92934R0012c0331j1947I271a00100A37875
11855c58382h237j95020j43232h8615j4418n8851B03239f6599k65741C4256a3679
11843f6829r3516E5534f5989r3212l3210j03890C13364r9104R3376f7583A6813
11831f3937A13415K46250d36069B1038a99583N1108r5240N1939n3168P3174f2297
11819A70734c41092L7217D8149a74962M9959I8229L73254a49615f6690B54565
11808D7921J8285N414Q828e4323j02284M4776A23371a73654A03065a0224A10282
$$ y = [153615, -137989, 148091, -28003, -25578, 263712, -130057, -237453, 37520, -25003, -137631, -134087, -400452, 51536, -32586, 36686, -179798, -67687, 150428, -71441, -153567, -55537, -101912, -180807, -217292, 142881, 78557, -192934, -102922, -30331, -42278, 9271, -100100, 137875, -358382, -8237, -203257, -346489, -88615, -103033, -161884, 203239, -66599, -332340, 34256, -13679, -66829, -160345, 55534, -65989, -159201, -192411, -296301, 313364, 214260, 307636, -67583, 16813, -63937, 113415, 359665, -436069, 21038, -199583, -148475, -243715, -191776, -244944, -171770, -62297, 170734, -341092, -303875, 48149, -174962, -125003, 98229, 471483, -149615, -66690, 254565, 47921, 66206, 71620, 80448, -54323, -156607, -111831, 123371, -173654, 103065, -10224, 110282]
11796a70963g4783D81382b15006Q8941A16244a00399A52800g6842B82684C7836
11785a36562l5885f1594F232c86180A26659b13907K2686c4447j0113j1742A66646
11773D6106a12209n3555e7457A56400h2544a1507m6118A88850o9807Q8834a21784
11761b48060e5538r9641O457A50807L5301c3208p81j30623c5696C0079c1927j14783
11749a46710j0114B9290g237A85795a08834B63603a62735K5812A89137a73007
11738i525k4722j09684q2923E1474c8473A10701N540e9388j14744b3430r1282
11727a14712K7038E0222f037G1918f1076A2529a02744q1506B32088b51827A25357
11715D36674B0133e6592j2055A91538B9968a2252j09772n6406G502a87439B34126
$$ y = [-170963, -74783, 481382, -215006, -126065, 116244, -100399, 152800, -76842, 282684, 37836, -136562, -172447, -61594, 6232, -386180, 126659, -213907, -191221, -34447, -44560, -56302, 166646, 46106, -112209, -165764, -57457, 156400, -82544, -11507, -57625, 188850, 119043, 207877, -121784, -248060, -55538, -155179, -148722, 150807, 186108, -33208, -33989, -164612, -35696, 30079, -31927, -146710, -156824, 29290, -7237, 185795, -108834, 263603, -162735, -136923, 189137, -173007, -9525, -34247, -143931, -226854, 51474, -38473, 110701, 116241, -59388, -174132, -23430, -114712, -87674, 50222, -6037, 71918, -61076, 12529, -102744, -184250, 232088, -251827, 125357, 436674, 20133, -56592, -68647, 191538, 29968, -12252, -122024, -178430, 7502, -187439, 234126]
11703A63418C722c01857G0434K45641d4740D1146F872L49886I9301K18680b20868
11691B52654A2348J49521C3150b4196j08242D300M4542b13573J8773B4731f524
11679d3925j05935A11804k5388b68470B86472A19277Q342C1589J34597K2127a54164
11667h4550B28862o1780g767A36808L040a18455A28576a41934B48977i6949B89404
11655C38677a63608e7704l1675A76696c75023J54061L4721g9119P568q664A75580
11643D0763A9029a32902A93610a9504j12571N8553j07832d4672b1747k11534N2966
11632a80315k2369p5628A80116a04151A68587c11826O0611a09223B6387c6185
11621C03231f0340B61722C1926R6755Q4220c3807k9805B11280C6010K2965a16074
$$ y = [163418, 3722, -301857, 70434, 316075, -44740, 41146, 6872, 356758, 99301, 317981, -220868, 252654, 12348, 161869, 33150, -24196, -132438, 4300, 48842, -213573, -194800, 24731, -6524, -43925, -149860, 111804, 86416, -268470, 286472, 119277, 127619, 31589, 166186, 188313, -154164, -84550, 228862, 167082, -7767, 136808, 139848, -118455, 128576, -141934, 248977, -96949, 289404, 338677, -163608, -57704, -89379, 176696, -375023, -220962, -186241, -79119, -71551, -80215, 175580, 40763, 19029, -132902, 193610, -19504, -132075, -73522, -181354, -44672, -21747, -233281, -180315, -202684, -278312, 180116, -104151, 168587, -311826, -251215, -109223, 26387, -36185, 303231, -60340, 261722, 31926, 128681, 212901, -33807, -63612, 211280, 36010, 58975, -116074]
11609a49363C945J0335g4112E760K18243g3250C6144h8643C4941b2116A38349
11597B25741c62156C9410A7478a80244f5242b5147A45150J43862A02830G500a35175
11585a44131q3183B980a21730E7888b21819G9210b60260C51367b58467D87443
11574d3128j05395l26867a86981C79595b0677A46486L27239j94491a5335j7068
11564c2403A46196a75672Q0385B46061j12846b6339B15242A00986J98151A28923
11553B78265I3057J01459N3125b24318O8751e9701H8394K35249b05080F2871K722
11542F5593K32148l8567b28604E1480r189A0579a06122B6422L09143A49644a27446
11530h9807k00611A909e0821A91654L67242H1905J44935j04390B0137J88992I3237
$$ y = [-149363, 3945, 14280, -74112, 5760, 224003, -73250, 36144, -88643, 34941, -22116, 138349, 225741, -362156, 39410, 17478, -180244, -65242, -25147, 145150, 289012, 102830, 7500, -135175, -144131, -227314, 2980, -121730, 57888, -221819, 79210, -260260, 351367, -258467, 487443, -43128, -148523, -475390, -186981, 379595, -20677, 146486, 473725, 279234, -15335, -32403, 146196, -175672, -95287, 246061, 133215, -26339, 215242, 100986, 299137, 128923, 278265, 93057, 194516, 247641, -224318, -155567, -59701, 88394, 323643, -205080, 62871, 65593, 297741, 259174, -228604, 51480, 42291, 10579, -106122, 26422, 335565, 149644, -127446, -89807, -290418, 1909, -50821, 191654, 558896, 81905, 226840, 122450, 20137, 209129, 93237]
11518g3429c4272B66425A20803P0888b41835C0449J429a1242n5987r8568A87797
11506b38780C3904c00337e6900E5395M910K28205b15584A30240D4961J21070e9252
11494c75560B16745a14214A29593l8449J91208C1647K5081a52751C55772A67875
11483B25215r2779K09937n6863h4787e122A8700d5731i924m3543C5153K8576a92604
11470b79779L9898A17727b38124g656A44268b42907G3559N1239f6609b1550C45154
11458F5927J66062b3291k17239A32541D0863R6127a04014A24764i7401A21716
11447E8492i7698L0305C28813J3500I4011a49355A17445A434L6592J41337B770
11435f654G4085B9881O6324g2689D9548M5862A1649a10416C25600h9667B40732
$$ y = [-73429, -34272, 266425, 120803, 191691, -241835, 30449, 31878, -11242, -67229, -165797, 187797, -238780, 33904, -300337, -56900, 55395, 60305, 288510, -215584, 130240, 44961, 166031, -59252, -375560, 216745, -114214, 129593, 91144, 282352, 31647, 56728, -152751, 355772, 167875, 225215, 132436, 342373, 285510, -84787, -5122, 18700, -45731, -9924, -53467, 35153, 63729, -192604, -279779, -239881, 117727, -238124, -7656, 144268, -242907, 73559, 124798, -66609, -21550, 345154, 65927, 231989, -23291, -240530, 132541, 40863, 136990, -104014, 124764, -97401, 121716, 58492, -97698, -67393, 328813, 342313, 94011, -149355, 117445, 1434, 38026, 179363, 2770, -6654, 74085, 29881, 96205, -72689, 49548, 95410, 11649, -110416, 325600, -89667, 240732]
11423C89643C8291K00912C8444a38850e7171K2578D67392A6944R9613a97131e2035
11411A21068a38492B34728I3328j397a09484j5479B27373M0109a44480j24536
11401b69016A53156g9199j13512j3249H8946J4810c04060O4314p4873A51973F8783
11389F3039i8369A30800j5057E4979K34287b21716A36747B2994L07754I0878R2271
11378A83149B4273a41659J4795A26127l9706d24472a49049C06436K7894a00613
11367b38703B31380G4492a22150K2900j23799d0111A30755D101L1727L71289a67926
11355B49927N9226A7696c55191J49796G4756A5845a2559A44197d1262J5462j35580
11344a61380d7932j79217A51562f3671J1078A38826g7629h082B33756D9061a41425
$$ y = [389643, 38291, 239203, 38444, -138850, -57171, -34593, 467392, 16944, 116557, -197131, -52035, 121068, -138492, 234728, 93328, 91931, -109484, -124963, 227373, 267482, -144480, -269016, 153156, -79199, -192711, -205960, 88946, 103756, -304060, -239746, -314619, 151973, 68783, 63039, -98369, 130800, 115743, 54979, 289266, -221716, 136747, 22994, 330748, 90878, 183149, 24273, -141659, -126864, 126127, 86421, -424472, -149049, 306436, 334330, -100613, -238703, 231380, 74492, -122150, -99250, -223049, -40111, 130755, 4101, 35828, 407117, -167926, 249927, 309153, 17696, -355191, -205395, 74756, 15845, -12559, 144197, -41262, -25800, -161380, -47932, -227149, 151562, -63671, -52593, 138826, -77629, -8082, 233756, 49061, -141425]
11332a57312B0597J28496o0196K50835a76188B20693a67531A29643L5275b1121
11321f9977j49205j82934a2592j5055q0088e2864G6280d0428j46543q2495a0605
11309h7573A1262M9023h2610l22383B59305f1632A99637a07153I4894b26697A7893
11297a42517r9261A62519a36034e2047j01409j56777a3964B5733e703D7246d45209
11285A44406K4222E5546a6879l2629r3976d5857p0508a0992l79641J47798F4521
11273A34241B0174b72622O2250k12340L7014F0556N4602J87474a16768j24110
11263b40878B46078a17873B01979l4276D5154a50067B72269A09932a36846p0610
11253b07456A22673d4975A08776I406D428K7371K0428b0611m43542A1316a03226
$$ y = [-157312, 20597, 149093, 88897, 339732, -176188, 220693, -167531, 129643, 164918, -21121, -69977, -219182, -402116, -12592, -27647, -107735, -52864, 76280, -40428, -186971, -269466, -10605, -87573, 11262, 60285, -82610, -404993, 259305, -61632, 199637, -107153, 94894, -226697, 17893, -142517, -241778, 162519, -136034, -52047, -153456, -310233, -13964, 25733, -5703, 47246, -445209, 144406, 168628, 55546, -16879, -49508, -143484, -45857, -116365, -10992, -390633, -242835, 64521, 134241, 20174, -272622, -210372, -422712, -385698, 60556, 115158, 302632, -116768, -240878, 246078, -117873, 201979, 167703, 45154, -150067, 272269, 109932, -136846, -207456, 122673, -44975, 108776, 9406, 4428, 31799, 52227, -20611, -464153, 11316, -103226]
11241d6150B03222B2064c05760b5084m060j4369m2362C05318o3701F200R0005
11230I6205a57137k28523B44904f4735k85279I576f9032k75274J66929k5664C35180
11218a56591B5956a10471j68120i2133B98216a30265o098B3992b78596M2432J7620
11207b18544N4361B29576a06702j54302A25189a76938O0741B55235A10924a57444
11196a1047B67068a09336g025B9493L46641j15510G0458b22395j27546a46168
11185g8136l49925a16776C0253a0090k21117B47914f9237A91277c6102E7973b54740
11173b49613D7753K078K1436B1308L19125A60588b6636I6903k5228j5987a00053
11161h7889A44721p932P1198f4709j4313K3133D2926b25393A1947L2232d44867
$$ y = [-46150, 203222, 22064, -305760, -25084, -29144, -43513, -85875, 305318, 241617, 6200, 96205, -157137, -385660, 244904, -64735, -350014, 9576, -69032, -344306, -177377, -203041, 335180, -156591, 25956, -110471, -278591, -92133, 298216, -130265, -136363, 23992, -278596, -236164, -218544, -164183, 229576, -106702, -261004, 125189, -176938, -116197, 255235, 110924, -157444, -11047, 267068, -109336, -7025, 29493, 376134, 260624, 70458, -222395, -349941, -146168, -78136, -428061, -116776, 30253, -10090, -231207, 247914, -69237, 191277, -36102, 57973, -254740, -249613, 47753, 49831, 71267, 21308, 340433, 160588, -26636, 96903, 71675, 55688, -100053, -87889, 144721, 136789, 207987, -64709, -79022, -55889, 42926, -225393, 11947, 44179, -444867]
11149B03751e5471F3156b26360A94340e1612H6774J79231h2174m10100a17956
11138b65113k2334A31518f1702A24395J66958d00888a84997O7368F3022e5627
11127b01631f7963K4562k55101a16054m29831A45435a08439A26228c5270l3852
11117f9122j57144B03420b91105J7975A3187M2726h7l2304F3527P5501B2753d7005
11104a12742l3470C4186a73161E2073b61809J06862A76971l3398c75729g2840
11093b974C1195K3759f3350A62975J34948A16353K12247A26426C8535J09797a22920
11081B21862K6453A8854J2611d7979E9802L8549G792a1177n32631B37915a66807
11069B77514j00739N0055F7766K30628j16463G4591J14654H6187K44738j52764
$$ y = [203751, -55471, 63156, -226360, 194340, -51612, 86774, 266005, -82174, -492274, -117956, -265113, -287447, 131518, -61702, 124395, 291353, -400888, -184997, -117629, 63022, -55627, -201631, -67963, -43401, -298502, -116054, -545885, 145435, -108439, 126228, -35270, -69122, -226266, 203420, -291105, -273130, 13187, 55913, -87, -32391, 63527, 139028, 22753, -47005, -112742, -146212, 34186, -173161, 52073, -261809, -154947, 176971, 143573, -375729, -72840, -2974, 31195, 54954, -63350, 162975, 297923, 116353, 328600, 126426, 38535, 148332, -122920, 221862, 248315, 18854, 31465, -47979, 59802, 98351, 7792, -11177, -543808, 237915, -166807, 277514, 176775, 226830, 67766, 298394, 181931, 74591, 189245, 86187, 330925, 178161]
11059A78161O9502K86716G9201J57314K3723j01071K67459B7698J52554R9061
11049B79313K8368O6138j42563K90804L9705j36851A18415M29507j78461M20999
11039G90460B47079K42820J86894l25559R2393q4698Q9180J12907k4998l722j02669
11028D29627J18244B63601K45473P308L12358l29337q0420r878K54672J57159
11018H20936D04917j37601r968J15595J35087p0448L9413J08796j13661q0694
11008C91436L34059j54293k32750J24828j05976j46022R0500J07596O9136L5296
10998E13810J70975l11131j47982L47694o9546n4479j12032j22934K29171J232
10988D44778o8877L1730K11144j99066O8280D2659J37512J92803J18615c0538
$$ y = [178161, 247663, 534379, 79201, 236515, 260238, 159167, 426626, 27698, 180252, 279313, 307681, 373819, 231256, 522060, 561765, 424914, 118415, 547922, 369461, 790460, 247079, 489899, 676793, 351234, 443627, 358929, 448109, 561016, 536018, 532296, 429627, 547871, 263601, 509074, 516382, 828740, 499403, 418983, 409105, 663777, 820936, 404917, 267316, 257348, 372943, 508030, 437582, 476995, 585791, 472130, 391436, 725495, 571202, 338452, 463280, 357304, 211282, 301782, 409378, 478514, 513810, 684785, 373654, 225672, 573366, 503820, 449341, 337309, 214375, 443546, 444778, 375901, 407631, 618775, 419709, 487989, 42659, 180171, 372974, 491589, -30538]
10977D63549k30732L85400k55635q9944L77157B21950L59119q6865j23704J92930
10967E63430N4087l1994R0523l2170J18949J18673P0917N0150L86261N2547J67273
10956A608646j41704k7811M4419L40788m7614K4714j55725l58128N11337o32084
10946A166838L09019k81970K27116j52631J14803j09678k10989L21687M8077l15436
10936A116836j63813L18312K06953o11230j80950J49922k12889A83293O38348
10927H21641l57948j83300m8658p4749l0847J33183A9807M38685E7201d4405C18838
10915a4588A4575M69651B32360I4488C4573e0192D4441a09570c3728r0805l6608
10904a61141C74161B5788R6271R621K11647a6406m9424k11945M4830F7113c42752
$$ y = [463549, 232817, 618217, 362582, 272638, 649795, 221950, 581069, 494204, 370500, 563430, 617517, 585523, 676046, 643876, 762825, 881498, 952415, 1002565, 1388826, 1441373, 1608646, 1466942, 1439131, 1483550, 1824338, 1776724, 1801438, 1645713, 1287585, 1798922, 1166838, 1475857, 1193887, 1421003, 1268372, 1383175, 1273497, 1062508, 1384195, 1432272, 1116836, 953023, 1271335, 1478288, 867058, 686108, 836030, 623141, 183293, 821641, 463693, 280393, 231735, 156986, 126139, 259322, 19807, 458492, 57201, -44405, 318838, -14588, 14575, 484226, 232360, 94488, 34573, -50192, 44441, -109570, -33728, -124533, -161141, 374161, 25788, 122059, 131680, 343327, -16406, -65830, -277775, -232945, 67113, -342752]
10892H6853a20239d6985m37187D8553c27951a58628A94720e2899B49375b56387
10881b88494d8778B25538a8223A18481a09328D3555b8749j17786c9012A15780
10870a02258i065A15677e8744k3110H4791m422K74142c30814E407c56774a4554
10858H9273h1635A11168L1681c1826A26295c28896H3c02794d1072C26899h0176
10846A40180a63410A64466K42966c24218a37901M0264p7080C814K98586a92520
10835b39292a06911k0408A15996a42032r922l9048j8989o6556g7711B96894a02286
10823e3243r6149N0003d7436B07680F3874h6827k69346e3060j55039B12971c4656
10811A61995H972b0460k8358k1986J4750D5563J49839F2847M113Q823k5215L679
$$ y = [86853, -120239, -46985, -484172, 48553, -327951, -158628, 194720, -52899, 249375, -256387, -288494, -48778, 225538, -18223, 118481, -109328, 43555, -28749, -146535, -39012, 115780, -102258, -9065, 115677, -58744, -81854, 84791, 80369, 354511, -330814, 5407, -356774, -14554, 89273, -81635, 111168, 142849, -31826, 126295, -328896, 83, -302794, -41072, 326899, -80176, 140180, -163410, 164466, 407432, -324218, -137901, -97637, -174717, 3814, 302400, -192520, -239292, -106911, -127319, 115996, -142032, -151954, -191002, -209991, -276547, -77711, 296894, -102286, -53243, -149392, -99389, -47436, 207680, 63874, -86827, -356173, -53060, -208099, 212971, -34656, 161995, 8972, -20460, -48818, -70804, -56054, 45563, 195402, 62847, 66960, 75783, 50568, 54247]
10799E4247a60444p8121j22614J32253D6642a29048j15432j18212J14610J21413
10789a26669j24471C6460a10385M9275j46294N8712j31485A58467d91259A32735
10778C018c4568j40898h0795k99945A8952a6636k50853a03371A82703H4998K48056
10767C33054e2393A38834g3737j33661L5247A21271m9166J63215i7582k74751
10757c72333F9650h6444D6777I094B986i634m92069A78568f2540B06751a25030
10745a28823k83465H2216D314O9935J68103h1571B28223j00877o2339a80355e4614
10733b61757L8277A3789L6398b28615e171j42384b7759A43784E5326h7192k94127
10722c81319F1666e09313A72190c23572h4153D4615B1281b31244H5390a21196
$$ y = [54247, -160444, -238565, -361179, -228926, 46642, -129048, -244480, -362692, -248082, -126669, -251140, 36460, -110385, -61110, -207404, -148692, -280177, 158467, -491259, 132735, 3018, -34568, -175466, -80795, -380740, 18952, -16636, -267489, -103371, 182703, 84998, 333054, -52393, 138834, -73737, -207398, -172151, 121271, 72105, 235320, -97582, -372333, 69650, -86444, 46777, 9094, 2986, -9634, -501703, 178568, -62540, 206751, -125030, -128823, -412288, 82216, 4314, 74249, 242352, -81571, 228223, 127346, 65007, -180355, -54614, -261757, -223480, 13789, 50187, -228615, -5171, -147555, -27759, 143784, 55326, -87192, -381319, 61666, -509313, 172190, -323572, -84153, 44615, 21281, -231244, 85390, -121196]
10711B86648b13585I7607b32639B3877B478L77370a47689d4581j69490H0716e7228
10699F4616a35008B4204b54921a1478l6974k7243C42170e1780I4412f3362A21100
10687a25721C0516Q930a18149A82907j0190p6822C1811c65611B58669A23116a60687
10675A6318b6404n4910m8666N7675j00062a9433j15123G3878k4964j5063a10672
10663g7573p22n509l0902N0282A14939c3844H7138i987E788Q2615a09448B07608
10650c512j26366q0969A64932b42635J07301n7568b7426A67497b09409r8869A64553
10638h9740a0005n96283c8423K309m2121A45026a1929G9450i4649F8025a0477
10626b31180d5973k49592O940a1752q4171M3244K125k25413B044L96032a74824
$$ y = [286648, -213585, 97607, -232639, 23877, 2478, 379848, -147689, -44581, -214071, 80716, -57228, 64616, -135008, 24204, -254921, -11478, -48452, -75695, 342170, -51780, 94412, -63362, 121100, -125721, 30516, 39446, -118149, 182907, 172717, 95895, 31811, -365611, 258669, 123116, -160687, 16318, -26404, -81314, -129980, -72305, -172367, -19433, -134556, 73878, 48914, 33851, -110672, -77573, -78295, -83804, -114706, -64424, 114939, -33844, 87138, -9987, 5788, 88403, -109448, 207608, -3512, -129878, -210847, 164932, -242635, -135334, -192902, -27426, 167497, -209409, -308278, 164553, -89740, -10005, -606288, -38423, -36114, -78235, 145026, -11929, 79450, -94649, 68025, -10477, -231180, -45973, -295565, -288625, -11752, -95923, -52679, -50554, -275967, 2044, 398076, -174824]
10614b90507J1413n6791J06058A67091i2419L7367K0009a2361l0170A7467a25724
10602A20516b36757e6570B72635a38606m2665F0193J14375O0482I655a3485l53392
10591c66877f1878o5548A20079a28342A11719b38250C38087a37632A00182b42660
10580d02806J45079b9563A30619N1951a65248M8042C2519a21141A30232c76761
10569a13113L888N1629r018C40493B7835h1601B86250a27014H749e9810k65781
10558c25591a59632n304a1486n894C04947J2016a28225B61145b83988N0534A73432
10546A19492f2881k2911j63425a20544P308k38007B29603d4199A04579f7320A86435
10534a76168E5527i6939C07009m2469b54633g1293j99101B54969p5108m5643a0246
$$ y = [-290507, -279094, -335885, -229827, 167091, -92419, -55052, -35043, -12361, -42531, 17467, -125724, 120516, -236757, -56570, 272635, -138606, -181271, 60193, 174568, 235050, 9655, -13485, -366877, -61878, -127426, 120079, -128342, 111719, -238250, 338087, -137632, 100182, -242660, -402806, -257727, -29563, 130619, 182570, -165248, -117206, 32519, -121141, 130232, -376761, -113113, -109225, -57596, -66614, 340493, 27835, -81601, 286250, -127014, 8749, -59810, -325591, -159632, -164936, -11486, -17380, 304947, 316963, -128225, 261145, -283988, -233454, 173432, 119492, -62881, -85792, -249217, -120544, -113236, -351243, 229603, -44199, 104579, -67320, 186435, -176168, 55527, -96939, 307009, 264540, -254633, -71293, -270394, 254969, 179861, 134218, -10246]
10522A09335J8532J6588D2174f0479A3992J99880D394P0784J97411g0527A00479
10510d0572j84150q607a2826j2566P607n73908A71170e3238l28738a08881A40943
10498b38374F161K01324b19311c5237k13340Q0419m23445A03373a01761B29304
10487b6410B5937J95084H4732b43949B40319b4143j0719J1860k60772c5987C9125
10475A17370C4960J9895b77950j43847A00983K4094h9273A61188c16870i0043
10464F2735J83388j100J68559A56423F3107J48584Q1328c8745C00488A24664K83117
10453D07781n5706a36310A16715a24581C5463e0403R562j46249n8401M0365j60748
10442c65874B92247a97862P1127G5966f7652q064j5566k96363G1249b59690a10536
$$ y = [109335, 127867, 144455, 42174, -60479, 13992, 213872, 4394, 75178, 272589, -70527, 100479, -40572, -224722, -233329, -12826, -25392, -17785, -591693, 171170, -53238, -381976, -108881, 140943, -238374, 6161, 207485, -219311, -35237, -248577, -168158, -591603, 103373, -101761, 229304, -26410, 25937, 221021, 84732, -243949, 240319, -24143, -34862, -23002, -283774, -35987, 39125, 117370, 34960, 54855, -277950, -421797, 100983, 125077, -89273, 161188, -316870, -90043, 62735, 246123, 245023, 413582, 156423, 63107, 211691, 293019, -38745, 300488, 124664, 407781, 352075, -136310, 116715, -124581, 35463, -50403, -40841, -187090, -245491, -205126, -365874, 292247, -197862, -126735, 75966, -67652, -75716, -91282, -387645, 71249, -259690, -110536]
10430a5324F3956j7524a66874D4104b22274h8493L5943A98170h024l10362B28217
10418f5591m6920l71158A39953j997P2415b14554n2596J28853I0676R7116H8747
10406A03130J9104B0245i1847o9950m4716g2507a0063G9834h7177m19167a0816
10394a46671b9706j93488C624d2478l55848K262b0495n0358m3956D50862E8995
10382a94164d9573K4173p4697b4827A94264J10932c73613h3256L8123A05559Q4906
10371A90465b31833a6790E9405h1708A92786K3076g8480C1448h5066c1556B0446
10359C4954J19009J69409l005F8461M6300D5765K21840J61180j58585A03915L190
10348A07105M46801n3789A90765J98831A12702D752d0427F2854J79487D0569L50274
$$ y = [-15324, 63956, 46432, -166874, 44104, -222274, -88493, -52550, 198170, -8024, -318386, 228217, -65591, -112511, -483669, 139953, 137956, 210371, -214554, -267150, -138297, 90676, 187792, 88747, 103130, 122234, 20245, -91847, -161797, -206513, -72507, -10063, 79834, -87177, -506344, -10816, -146671, -29706, -223194, 3624, -42478, -398326, -396064, -20495, -70853, -114809, 450862, 58995, -194164, -49573, -25400, -100097, -24827, 194264, 305196, -373613, -83256, -45133, 105559, 190465, -231833, -16790, 59405, -81708, 192786, 215862, -78480, 31448, -85066, -31556, 20446, 34954, 153963, 323372, 320367, 68461, 114761, 45765, 267605, 428785, 270200, 103915, 107105, 553906, 500117, 190765, 389596, 112702, 4752, -40427, 62854, 242341, 40569, 390843]
10337C90843q5828b65588B14069Q1096F8065J33610J51442H4011J8397h6649A13166
10325A60045J25428L4696m1685q0165m5825j916J06017I8394a70327A52772K2230
10314A75002C062J13338a43717G0261j7660c4959D41886k16400L7615I1484J37414
10303B28898F0394b3876G8944K87186d4789I3925O8854F36J47134l2708L47271
10292D62333G6946l2225f9115j37472F4053a70701i792B71021h5805I413c5638
10280b6671m1979H3985b22292M7103e729A46528M0213n7118E3902J03946d3516
10268I3504b99956A11799a72365D2766b51916L926i9234D194c12651d7183n802
10257e2985k45785k36035K51785i3452A85037K13a94418E6976b56682A07452g7376
$$ y = [390843, 305015, -265588, 214069, 295165, 68065, 201675, 353117, 84011, 102408, -86649, 113166, 160045, 285473, 320169, 278484, 198319, 152494, 150578, 256595, 98394, -170327, 152772, 175002, 3062, 116400, -143717, 70261, 52601, -34959, 441886, 225486, 263101, 91484, 228898, 60394, -23876, 78944, 366130, -44789, 93925, 162779, 636, 147770, 115062, 462333, 76946, 44721, -69115, -206587, 64053, -170701, -9792, 271021, -85805, 9413, -35638, -26671, -68650, 83985, -222292, -175189, -5729, 146528, 186741, 129623, 53902, 157848, -43516, 93504, -299956, 111799, -172365, 42766, -251916, -247990, -99234, 4194, -312651, -47183, -52985, -298770, -534805, -283020, -93452, 185037, 185250, -194418, 56976, -256682, 107452, -77376]
10245i9472j54524B84456Q8176A67659Q0887j12573K1354m4446R7562l840K0430
10234B27033i193H9483K64396A37117d2635C84235a37717A42238d7352q3820D6383
10222E1891k2725a10058C2646L49981a06532A70263g8368A47553f7870k74212
10212c42082a34910c3467m692B60121c36744A44521O1867b04987R671j64861a57607
10200c0050n16605a36380N5659A31146f7372F9195M6591d8428A54992A6156a36798
10188a83423A19357b1810l36844J46528a05040l9343a5634A33907a3801k81326
10178b95127J36010j40692C51013C9689a90432o2677q5994a47343B6419a13002
10167a47481B62794a78872H063R0610a52933A43289b12614A45518D5316d11324
$$ y = [-99472, -253996, 284456, 372632, 167659, 248546, 135973, 157327, 112881, 210443, 206603, 227033, -9193, 89483, 353879, 137117, -42635, 384235, -137717, 142238, -47352, -131172, 46383, 51891, 29166, -110058, 32646, 382627, -106532, 170263, -78368, 147553, -67870, -342082, -134910, -33467, -38159, 260121, -336744, 144521, 206388, -204987, -195316, -360177, -157607, -30050, -546655, -136380, -80721, 131146, -67372, 69195, 115786, -48428, 154992, 16156, -136798, -183423, 119357, -21810, -358654, -212126, -105040, -144383, -15634, 133907, -13801, -295127, -159117, -299809, 351013, 39689, -190432, -253109, -339103, -147343, 26419, -113002, -147481, 262794, -178872, 8063, 98673, -152933, 143289, -212614, 145518, 45316, -411324]
10156a90020c8401j756l68564i2921D1162a47971A46097B7710h2594A34502j2563
10145A21939f3684l0533B04299E7101b4229j31421j12369f4534f98A40449b19691
10133a74687I3846c77815H1954L8052b051k64187j05520a64277A23136a33570
10122B1801f0241j05096q3875f3271k26352e4910B53630o4626b12469a6865l81117
10111c97982D33098b1380B17637m2017d2844l01008f2029m1062E5132a52272L1383
10100a20889g643A85564b360p4470A99944b99006A36501a60322K0682d8643j13202
10089a61845p8424R4818c4933j92038b0739k79288N3267L3412A88714a22769q4913
10078b07682q0325P3083d5749A13648d54460K24844g8567F2643a79918A89524
$$ y = [-190020, -38401, -40157, -408721, -92921, 41162, -147971, 146097, 27710, -82594, 134502, 121939, -63684, -94217, 204299, 57101, -24229, -155650, -268019, -64534, -698, 140449, -219691, -174687, 93846, -377815, 81954, 120006, -2051, -266238, -371758, -164277, 123136, -133570, 21801, -60241, -165337, -249212, -63271, -289623, -54910, 253630, 189004, -212469, -16865, -397982, 433098, -21380, 217637, 175620, -42844, -343852, -62029, -103091, 55132, -152272, -120889, -7643, 185564, -2360, -76830, 199944, -299006, 136501, -160322, -139640, -48643, -161845, -240269, -145451, -34933, -226971, -20739, -300027, -246760, -213348, 188714, -122769, -207682, -288007, -214924, -45749, 113648, -454460, -229616, -78567, 62643, -179918, 189524]
10067a22810O0465j45915B41068a95375J3685C14231a46586c4953b811l2982H6145
10055a45163q9559a06346l60236G9388e5778A7538b80463c8843j99994R0498O7097
10044h1242k19984b8048a3553m4118j34958f5490D1839N217a11278B00115e9097
10032E8591b23660H8529c45298J21922A15901c7079A96659J04479h9046n0245
10022a39291m0889E9498b47360P052e0722l4144d0946p4555c6764b176l3817A67445
10009B5385J0716a64399j78221g531o908l43219B34054a98113K1331F8374a13874
9997B83495A1465c7519E1204b4462D59195G0324K7826b43134Q3392O0118b0668
9985B68438E5663G510b35077A0413b32445p3687m525B31021I329b86150f9329
$$ y = [-122810, -62345, -208260, 241068, -195375, -181690, 314231, -146586, -34953, -2811, -35793, 86145, -145163, -234722, -106346, -466582, 79388, -55778, 17538, -280463, -38843, -238837, -148339, -81242, -301226, -28048, -13553, -57671, -192629, -65490, 41839, 47056, -111278, 200115, -59097, 58591, -223660, 88529, -345298, -223376, 115901, -37079, 196659, 301138, -89046, -139291, -180180, 59498, -247360, -240308, -50722, -84866, -40946, -115501, -36764, -2176, -35993, 167445, 25385, 36101, -164399, -342620, -7531, -14439, -357658, 234054, -198113, -176782, 68374, -113874, 283495, 11465, -37519, 51204, -24462, 459195, 70324, 98150, -243134, -159742, -99624, -20668, 268438, 55663, 7510, -235077, 10413, -232445, -306132, -310657, 231021, 9329, -286150, -69329]
9973e02120a72467B06321b59194c2722F9749a1399j64045K2121B8971J38232E1888
9961A6320a47255N4474e039p8733J7309B08378a2472B04620G4900i1261m2726
9950a33987l7034j13473J23404e9201B29534c21850B4035e91595A5487d84281
9939a10728k70890R2583J07723C9575a85363r3252a8875k47600D24411G6728c33033
9927A6039b15237e2451j04152C94115a94026C6696i8174k08546a1632j49861A41592
9915b52462A35584a07570B78797b65652J00020c8368B56828I7762a6469n5278
9905g1747j26810h6166H5432C4442d4294J4119o2360k591C0264J64450b08540
9893b18835m0428A82895G7111c32196A41394a33313o4291A20330c39021G5449
$$ y = [-502120, -172467, 206321, -259194, -32722, 69749, -11399, -175444, -153323, 28971, 167203, 51888, 16320, -147255, -92781, -5039, -83772, -66463, 208378, -12472, 204620, 74900, -91261, -133987, -171021, -284494, -161090, -59201, 229534, -321850, 24035, -591595, 15487, -484281, -110728, -381618, -289035, -181312, 39575, -185363, -278615, -18875, -266475, 424411, 76728, -333033, 16039, -215237, -52451, -156603, 394115, -194026, 36696, -98174, -306720, -11632, -161493, 141592, -252462, 135584, -107570, 278797, -265652, -165632, -38368, 256828, 97762, -16469, -71747, -198557, -86166, 85432, 34442, -44294, -30175, -92535, -95126, 30264, 194714, -208540, -218835, -259263, 182895, 77111, -332196, 141394, -133313, -197604, 120330, -339021, 75449]
9882H645O657d3909d854l1931k80368A26025a26857A01288e804E6894M0462b71120
9869A27854e3890E6038a42416f1758J6408B08913a17510i138m49589h9521F9842
9857g6205J5877B6974c9213l29991f4253B89652d04631A72445b11359n2923E2740
9845a60556F563g8227j10837H5949c93465e0273R613G6718I380a46990j9991e9117
9832h929r4670g334m6057k18693R560q8114F613a18744D4860f1155q6371A53511
9819b19415B2983c61612a58433G6811b35808J09282F6317a12152k26913a14616
9808B6636b31787A13731b50487o8821H8143F301b76431j21689A0932M2126e846
9796A39713a74709B66556a30252H8488d88000a7108q9837j23192r2393F671N4627
$$ y = [8645, 15302, -43909, -4854, -36785, -317153, 126025, -126857, 101288, -5804, 56894, 97356, -271120, 127854, -53890, 56038, -142416, -61758, -45350, 208913, -117510, -9138, -458727, -89521, 69842, -76205, -60328, 26974, -39213, -369204, -64253, 289652, -404631, 172445, -211359, -264282, 52740, -160556, 6563, -78227, -189064, 85949, -393465, -50273, -40660, 76718, 9380, -146990, -166981, -59117, -8929, -103599, -7334, -53391, -272084, -262524, -350638, 6613, -118744, 44860, -61155, -147526, 153511, -219415, 22983, -361612, -158433, 76811, -235808, -126526, 66317, -112152, -339065, -114616, 26636, -231787, 113731, -250487, -319308, 88143, 6301, -276431, -398120, 10932, 53058, -5846, 139713, -174709, 266556, -130252, 88488, -488000, -17108, -106945, -230137, -322530, 6671, 61298]
9785F1298b71844B56545b02668n0921I8845P5679c6799j63500C1447b14363A59831
9773a81650l29885I9595C9208d9628m2388j14520J6967P7356c368q6402n2840
9762a42610I542J3846L738J11046a50932q9071k83353b54175b5314I4332J27875
9751B22207q0097b11655e3737D7428a71117e073j57582C02198a90610M5612B00720
9739h1157n0235A2671a36989k63287d6920q3573q9564J8159f5860J7142r8055
9728a46773A7086d5381A8295a93142G8504J92908b47118I5575a62627O6625l0850
9717a26852j80520A33364B2673M07155E0002b80027a00102b1846k957j66955B2291
9705a28024A27197M2653D2751d7097m7942l31603b2471A1892N8334b77613F86
$$ y = [61298, -271844, 256545, -202668, -253589, 98845, 174524, -36799, -200299, 31447, -214363, 159831, -181650, -511535, 99595, 39208, -49628, -92016, -206536, -189569, -112213, -3368, -89770, -142610, 9542, 23388, 27126, 138172, -150932, -240003, -523356, -254175, -25314, 94332, 222207, 142110, -211655, -53737, 47428, -171117, -5073, -162655, 302198, -190610, -144998, 200720, -81157, -131392, 12671, -136989, -400276, -46920, -130493, -220057, -201898, -65860, -48718, -146773, 17086, -45381, 18295, -193142, 78504, 271412, -247118, 95575, -162627, -96002, -126852, -307372, 133364, 22673, 429828, 50002, -280027, -100102, -21846, -24803, -191758, 22291, -128024, 127197, 169850, 42751, -47097, -95039, -426642, -22471, 11892, 70226, -277613, 686]
9693B8460b05240i7892H8983a06377o5129A2063J69207h451j19657J6160P10j74972
9681b86210A42111j3316C0834K43287c15631P3231O9339A3498O9111a34620n9466
9670a94086P7356j16105M9805h808A2321a09112b3427j05293L3936A08246c37894
9658B19243F9044a10212d3217l47997J40877A99187g0362m4095C8319h7038a6002
9646a96306a1455A57273a68881K3838A32394c32597f7361B04182b29404J08104
9636a21300k48168A87575a55242a4546j4330n4035B62a6589l5521A18436a77574
9624c65954f8166j9220l00972a09178A72744c89636D40192d3106n0861A19629
9613d11342C0391d6053P112A7043a95882B9779M294a14462B2898A048J97821a16770
$$ y = [28460, -205240, -97892, 88983, -106377, -171506, 12063, 181270, -8451, -128108, -111948, -111238, -286210, 142111, 128795, 30834, 274121, -315631, -242400, -173061, 13498, 82609, -134620, -194086, -116730, -232835, -183030, -8808, 12321, -109112, -23427, -128720, -94784, 108246, -337894, 219243, 69044, -110212, -43217, -391214, -250337, 199187, -70362, -114457, 38319, -87038, -16002, -196306, -11455, 157273, -168881, -145043, 132394, -332597, -67361, 204182, -229404, -121300, -369468, 187575, -155242, -14546, -28876, -82911, 262, -16589, -52110, 118436, -177574, -365954, -68166, -87386, -388358, -109178, 172744, -389636, 440192, -43106, -93967, 119629, -411342, 30391, -46053, -38941, 17043, -195882, 29779, 34073, -114462, 22898, 1048, 198869, -116770]
9600H6733r165a71218c0843E106b49764a07056l31214G6706d8071k57845F436
9588h569A95176a44255e7576j82927p9477A33059M6207c64981a44934a4428A64906
9576E2130J157a11958L3984k13821h4987E0096d11300a15525Nd5853Q605k33988
9564b71236A13409c41599A0659M4766a8778j66199O8358A71797a55281J0839I1492
9552d05711J79754O6953k8755O1350j97777Q5906c8191n1524p6464a9018c457
9540a18241B6355e3616j64666A20667l6534C5806c31790A1776b13647F1237P5888
9529A37125A2347K34783c02281b7159k32858E0180g0599l2512M1653B26885E0942
9517a93994A95663a42802l98256g2016B16540a46307P1312K3824A03595b8381
$$ y = [86733, 77568, -171218, -30843, 5106, -249764, -107056, -438270, 76706, -48071, -305916, 6436, -8569, 195176, -144255, -57576, -240503, -319980, 133059, 179266, -364981, -144934, -14428, 164906, 52130, 53287, -111958, -77974, -291795, -84987, 50096, -411300, -115525, -115520, -45853, -37248, -271236, 113409, -341599, 10659, 55425, -18778, -184977, -116619, 171797, -155281, -144442, 91492, -405711, -225957, -159004, -187759, -126409, -324186, -238280, -38191, -89715, -166179, -19018, -3457, -118241, 26355, -53616, -218282, 120667, 84133, 35806, -331790, 11776, -213647, 61237, 137125, 12347, 247130, -302281, -27159, -260017, 50180, -70599, -103111, -61458, 226885, 50942, -193994, 195663, -142802, -541058, -72016, 216540, -146307, -74995, -51171, 103595, -28381]
9506a10362k04947i1174A89738B8519Q5849a28501b3227j02462K5244o5241j2835
9495a78521C30210c03638A19790h3383F583b34748A15387c0020p4213j15214B36520
9483E5044K88976I5865a12156H7894b92249C60860f841A56873A4014h0940m3404
9472a24344e5712A26749Q2989f8231B13278J14404a02054p8030a100A10903C2085
9460c313q15q13r8544H6423d5307J4197D4327j0749e6357k32950D66419a91394
9447f8149F9911b12862p2624D8698c00213M8357E4909K10054a61568O755E9898
9435f4211k19498B74466b16862i5456o341a9175E7821a85621A05276d20187a35417
9423f8238p1016l20362a2587k37805Q7325P9004K2447H4518b10190C4420r987
$$ y = [-110362, -315309, -91174, 189738, 28519, 114368, -128501, -23227, -125689, -100445, -165686, -178521, 330210, -303638, 119790, -83383, 6583, -234748, 115387, -30020, -104233, -219447, 236520, 55044, 344020, 95865, -112156, 87894, -292249, 360860, -6841, 156873, 14014, -80940, -124344, -55712, 126749, 209738, -68231, 213278, 327682, -102054, -180084, -1100, 110903, 32085, -3313, -4128, -4941, -103485, 86423, -45307, -31110, 44327, 33578, -56357, -289307, 466419, -191394, -68149, 69911, -212862, -285486, 48698, -300213, -251856, 54909, 264963, -161568, -154813, 59898, -64211, -283709, 274466, -216862, -95456, -101797, -19175, 57821, -185621, 105276, -420187, -135417, -68238, -139254, -459616, -12587, -250392, -163067, -84063, -61616, 84518, -210190, 34420, 24433]
9412B4433d99656a70321D9233J93985c81802a44104N5170A34675d0108j34743
9402a74851k29067a14537j0224j62830B33131d0798A9497b748l1834G1596A4167
9390a41767G1408c73929J78276p0440c5647A7046d6616k24394A28818n5276i4505
9378A88319f97173H1516M4459d69166R4043A45047h4345m6689f1017C19477c7706
9366a74173A32777a06468K2564r4053o2717D3810J43278J27295B5795i2552k0071
9355a12623l4229A56411g0856H7045a53403J684m4673R2363L454B29470b78162
9343a27213E6437c99800B18071d3831E0759K9172J75020A24482f9293m71763c1992
9331b1192I3731c24103J27435A13133a06746K2864A6506i8985A26308E8670j7427
$$ y = [24433, -499656, -170321, 49233, 243218, -381802, -144104, -88934, 134675, -40108, -174851, -403918, -114537, -124761, -287591, 233131, -40798, 19497, -2748, -34582, 71596, 14167, -141767, 71408, -373929, -195653, -266093, -35647, 17046, -46616, -271010, 128818, 73542, -94505, 188319, -697173, 81516, 125975, -469166, -375123, 145047, -84345, -131034, -61017, 319477, -37706, -174173, 132777, -106468, -83904, -177957, -240674, 43810, 187088, 314383, 25795, -92552, -112623, -146852, 156411, -70856, 87045, -153403, -151719, -196392, -104029, -100575, 229470, -278162, -127213, 56437, -399800, 218071, -43831, 50759, 79931, 254951, 124482, -69293, -541056, -31992, -21192, 93731, -324103, -196668, 113133, -106746, -83882, 16506, -98985, 126308, 58670, 41243]
9320D1243d1565O587j31314P1715j72670I7996b30557m1730f8559J7412B8690
9308C6118J72745b49075O9115C19424B6788a20200A52466K1987E6835g6341A650
9296A39850b03680k4885c1779j34328b4547k51726A11912D723a42304A13750e26621
9284c31077C0261M96966d7890j66748E635K4150c9196A3387a70384B74520b71393
9272f6851m202A4883a47599j66887a34631A8566b9981b582H3113a09033E3083
9260B51856J4508B4291a75413r109C2927J54110a11043d3444j60392G4781b04209
9248b54565B5845b05736B12467i6829m8042C0070a0131l6781j94965Q6907K8665
9237a26305A04924C5531J62113c76417i0559k5062A50438e7247k13747E6329J24508
$$ y = [41243, -41565, -34978, -166292, -94577, -267247, 97996, -230557, -272287, -68559, -51147, 28690, 36118, 208863, -249075, -179960, 319424, 26788, -120200, 152466, 174453, 56835, -76341, 1650, 139850, -203680, -228565, -31779, -166107, -24547, -276273, 111912, 4723, -142304, 113750, -526621, -331077, 30261, 527227, -47890, -214638, 5635, 29785, -39196, 13387, -170384, 274520, -271393, -66851, -71053, 14883, -147599, -314486, -134631, 18566, -29981, -2582, 83113, -109033, 53083, 251856, 266364, 24291, -175413, -184522, 32927, 187037, -111043, -43444, -203836, 74781, -204209, -254565, 25845, -205736, 212467, -96829, -144871, 30070, -10131, -46912, -241877, -154970, -126305, 104924, 35531, 197644, -376417, -90559, -115621, 150438, -57247, -270994, 56329, 180837]
9226A80837M7426b41621c5404r6951F8954a78160P2599m356C1033h5679J8208
9215f7471l27910A30277a01618k87603a54122K7681H2704i4594I1328c48345a54995
9203B52605D0448M8757P693c4657k10155H6820l344a52362M8007C2548b13433
9191a90091C38957a2280l42419a19688A80684H4202K9029h1588D708b38979I4573
9179c79978C0918j3649a08488d6289r9676C3744J18470l8949a23515p5465e0705
9167a28728k35254f4798b9874j69893i3662B05736L815G7734K7717i9332l5987
9156a35319A3090b16374j33413f0952A38928B6780a47058A55728f3792j63092
9146b26884C17704A05334g017p1364B02015q8037m199J00736e4624j0219l9829
$$ y = [180837, 228263, -241621, -35404, -132355, 68954, -178160, -105561, -109917, 31033, -85679, -67471, -395381, 130277, -101618, -389221, -154122, -126441, 82704, -94594, 91328, -348345, -154995, 252605, 40448, 89205, 96898, -34657, -244812, 86820, 83476, -152362, -104355, 32548, -213433, -190091, 338957, -12280, -354699, -119688, 180684, 84202, 113231, -81588, 4708, -238979, 94573, -379978, 30918, 17269, -108488, -46289, -145965, 33744, 152214, 113265, -123515, -198980, -50705, -128728, -363982, -64798, -29874, -199767, -93662, 205736, 209551, 77734, 105451, -99332, -135319, 13090, -216374, -349787, -60952, 138928, 26780, -147058, 155728, -63792, -226884, 317704, 105334, -7017, -78381, 202015, 113978, 109779, 210515, -54624, -64843, -104672]
9135a04672o0259I2987f2188j36535J2537J0341D5938j3069j3665f7195k01755
9124b68950D79a51558k90524a68190G2046f1282j02636M0779b2965j44291A24096
9112g4747j79404P9363j7716C5094d48674K18837B5641e6751l41648A0551c79700
9100a29215k2136O4637B85361d0173A41503b05788K7111B16421i7819M7151B3063
9088a44617M475K9505p3675j5598P2506m2637C02381j03593N5745D4970a31378
9076a49562k8686j42949D9620O236b83782a16083B4240L1650P6256c71046I677
9064c2212j65007B50768m9665e584m9226A67726a17717o1290B52657c30466Q263
9053c22203Q1790o8421A44578D2962b61551I7263a09146F0993J0402b12011p8916
$$ y = [-104672, -164931, 92987, -62188, -198723, -186186, -175845, 45938, 32869, 19204, -67195, -268950, 479, -151558, -442082, -168190, 72046, -61282, -163918, -123139, -22965, -167256, 124096, -74747, -254151, -174788, -192504, 35094, -448674, -229837, 25641, -56751, -398399, 10551, -379700, -129215, -151351, -86714, 285361, -40173, 141503, -205788, -178677, 216421, -97819, -50668, 23063, -144617, -140142, -110637, -184312, -199910, -127404, -170041, 302381, 198788, 254533, 44970, -131378, -149562, -178248, -321197, 49620, 55856, -283782, -116083, 24240, 55890, 132146, -371046, 9677, -32212, -197219, 250768, 201103, -5584, -54810, 167726, -117717, -179007, 252657, -330466, -322203, -240413, -308834, 144578, 42962, -261551, 97263, -109146, 60993, 71395, -212011, -290927]
9042b90927e7273j1729j63776g0433j65853O2223A44951b9955A28277J84b14457
9030C7403c9240k70786a22379A69966O4077d9709j04797K0027c6374k66856A02273
9018b37530j90955c2035l1218A37110b25816M5548f3632B64133D4970d1273k96147
9007c37420J66607I5945J03982m3177D7127f1724C02403I2368j6028a97667j19185
8996c16852E9961J11800C1862J39202o8708a49931j19224G7797b03385k49126
8986d52511a29145j08123c8730A63616j8457a07815e3583l23871C3258c56248
8975a89518a3532k59161M4105n014h9586A06669a99603N331B63582j15201a3320
8963b47428E1723b96249F8636f0981A43846l0586j5545a27855j05969A84802a14101
$$ y = [-290927, -57273, -69002, -232778, -70433, -236286, -174063, 144951, -29955, 128277, 128461, -214457, 37403, -39240, -310026, -122379, 169966, 234043, -49709, -154506, -134479, -36374, -303230, 102273, -237530, -428485, -32035, -63253, 137110, -225816, -180268, -63632, 264133, 44970, -41273, -337420, -170813, 95945, 199927, 156750, 47127, -61724, 302403, 92368, 76340, -197667, -316852, 59961, 171761, 31862, 171064, 102356, -149931, -269155, 77797, -203385, -452511, -129145, -237268, -38730, 163616, 145159, -107815, -53583, -377454, 33258, -356248, -189518, -13532, -272693, -228588, -233602, -89586, 106669, -199603, -194272, 263582, 148381, -13320, -247428, 51723, -296249, 68636, -60981, 143846, 113260, 97715, -127855, -233824, 184802, -114101]
8951A07689a52782R232f7237L3154k9305A0617a05186j35383A57386i1626F1942
8939E0655A641M4523a85682l08982J12010B1770b67162b6344B01167m2418M6068
8928B04817b71793a1785p6474B29466a94451N9925L2746C35035j31951i4569B07882
8916h3445B84999h3530D031N8953k0511O5190R1265J09589J26591Q5522K72479
8905G93109R44775J379118L338469B488877r45309p60284k04738k52519A50920
8895B7693J78437g1997A48557a00025B0202f6552k4491p8584A88543a18936j8546
8884a37482k62190a23793G4281b47957J07371f774n0813C11182I6468f6113c0761
8872C3407b4439j86457N0543k44096G3253a34373A57712c07534c2355j77810B50806
$$ y = [107689, -152782, -143550, -67237, -34083, -63388, 10617, -105186, -240569, 157386, -91626, 61942, 50655, 1641, 46164, -185682, -494664, -382654, 21770, -267162, -26344, 201167, 158749, 204817, -271793, -11785, -88259, 229466, -194451, -134526, -101780, 335035, 203084, -94569, 207882, -83445, 284999, -83530, 4031, 62984, 42473, 107663, 198928, 308517, 435108, 520630, 793109, 1737884, 3117002, 6455471, 2488877, 1543568, 783284, 578546, 326027, 150920, 27693, 206130, -71997, 148557, -100025, 20202, -66552, -91043, -169627, 188543, -118936, -137482, -399672, -123793, 74281, -247957, -140586, -6774, -57587, 311182, 96468, -66113, -30761, 33407, -24439, -210896, -160353, -404449, 73253, -134373, 157712, -307534, -32355, -210165, 250806]
8860A8340P7995c86086d8586F8655b46183B68138c57404a75606O7099e0378D115
8848A70912E6554M4443a96689i3563j03288N6925j36660A74215K0754m3846h1992
8836b39656C8562h6432M0512j47223k2491A41223a62770L9021E4638c8856H7854
8824b25118b5476l2083l2634j51309P2924m4430H5771L85344G4707P1976j5508
$$ y = [18340, 96335, -386086, -48586, 68655, -246183, 268138, -357404, -175606, -108507, -50378, 4115, 170912, 56554, 100997, -196689, -93563, -196851, -139926, -276586, 174215, 194969, 151123, -81992, -239656, 38562, -86432, -45920, -193143, -215634, 141223, -162770, -123749, 54638, -38856, 87854, -225118, -25476, -57559, -90193, -241502, -168578, -213008, 85771, 471115, 74707, 146683, 131175]
$$ [...]
##END NTUPLES=NMR SPECTRUM
##END=
