
##TITLE=AC1216_HNAAH12057_5973515_f5SzcqnN1H
##JCAMPDX= 6.0         $$ Bruker NMR JCAMP-DX V2.0
##DATA TYPE= NMR SPECTRUM
##DATA CLASS= NTUPLES
##ORIGIN= BRUKER
##OWNER= Administrator
$$ 1.72 TOPSPIN		Version 2.1
$$ 2012-04-16 19:03:12.171 -0500  Administrator@TOPSPIN
$$ Compression mode = diff/dup
##.OBSERVE FREQUENCY= 400.13188235
##.OBSERVE NUCLEUS= ^1H
##.ACQUISITION MODE= SIMULTANEOUS (DQD)
##.ACQUISITION SCHEME= undefined
##.AVERAGES= 64
##.DIGITISER RES= 22
##SPECTROMETER/DATA SYSTEM= spect
##.PULSE SEQUENCE= noesygpps1d.comp
##.SOLVENT NAME= COFFEE_meoh
##.SHIFT REFERENCE= INTERNAL, COFFEE_meoh, 1, 14.9683
##AUDIT TRAIL= $$ (NUMBER, WHEN, WHO, WHERE, PROCESS, VERSION, WHAT)
$$ ##TITLE= Audit trail, TOPSPIN		Version 2.1
$$ ##JCAMPDX= 5.01
$$ ##ORIGIN= Bruker BioSpin GmbH
$$ ##OWNER= Administrator
$$ $$ C:\Bruker\TOPSPIN/data/COFFEE/nmr/AC1216_HNAAH12057_5973515_f5SzcqnN1H/12/pdata/1/auditp.txt
$$ ##AUDIT TRAIL=  $$ (NUMBER, WHEN, WHO, WHERE, PROCESS, VERSION, WHAT)
(   1,<2012-04-14 21:27:40.921 -0500>,<Administrator>,<TOPSPIN>,<go>,<TOPSPIN 2.1>,
      <created by zg
	started at 2012-04-14 21:16:08.281 -0500,
	POWCHK enabled, PULCHK disabled,
       configuration hash MD5:
       1A 1E CE 29 27 FD 77 03 67 4E F0 E3 C4 B2 CB 90
       data hash MD5: 64K
       74 70 21 0F 55 C2 1F 5D 00 64 2F 03 1D BB 0B D3>)
(   2,<2012-04-14 21:27:44.468 -0500>,<Administrator>,<TOPSPIN>,<proc1d>,<TOPSPIN 2.1>,
      <Start of raw data processing
       efp LB = 0.3 FT_mod = 6 PKNL = 1 PHC0 = 0 PHC1 = 0 SI = 128K 
       data hash MD5: 128K
       04 BC 4D 49 C6 08 46 12 A7 C4 B8 48 2F AD 54 BF>)
(   3,<2012-04-14 21:27:46.265 -0500>,<Administrator>,<TOPSPIN>,<proc1d>,<TOPSPIN 2.1>,
      <pk PHC0 = 33.92029 PHC1 = 0 
       data hash MD5: 128K
       69 F7 84 0E 5E F4 94 F5 B2 CF F3 41 8D 35 82 73>)
(   4,<2012-04-14 21:27:47.453 -0500>,<Administrator>,<TOPSPIN>,<proc1d>,<TOPSPIN 2.1>,
      <abs ABSG = 1 
       data hash MD5: 128K
       0E 8B DF 6F 06 9A 38 E4 54 78 7E 22 94 04 B7 94>)
(   5,<2012-04-14 21:27:47.546 -0500>,<Administrator>,<TOPSPIN>,<proc1d>,<TOPSPIN 2.1>,
      <abs ABSG = 2 
       data hash MD5: 128K
       E9 1F C2 00 D7 8D 16 D5 91 36 48 22 BF 35 63 88>)
(   6,<2012-04-14 21:27:47.640 -0500>,<Administrator>,<TOPSPIN>,<proc1d>,<TOPSPIN 2.1>,
      <abs ABSG = 3 
       data hash MD5: 128K
       4B 39 AD 8C 28 A7 A6 99 D8 83 84 3C D6 61 F2 DE>)
(   7,<2012-04-14 21:27:47.718 -0500>,<Administrator>,<TOPSPIN>,<proc1d>,<TOPSPIN 2.1>,
      <abs ABSG = 4 
       data hash MD5: 128K
       4C 7A 4A 33 99 16 88 78 23 CD D3 07 F8 27 21 82>)
(   8,<2012-04-14 21:27:47.781 -0500>,<Administrator>,<TOPSPIN>,<proc1d>,<TOPSPIN 2.1>,
      <abs ABSG = 5 
       data hash MD5: 128K
       A7 4D F2 26 C2 F2 25 69 F9 49 B2 C6 9A 87 13 E6>)
(   9,<2012-04-14 21:27:51.718 -0500>,<Administrator>,<TOPSPIN>,<audit>,<TOPSPIN 2.1>,
      <user comment:
       ICON-NMR User ID: COFFEE
       data hash MD5: 128K
$$ [...]
##$TP07= 0
##$TPNAME0= <>
##$TPNAME1= <>
##$TPNAME2= <>
##$TPNAME3= <>
##$TPNAME4= <>
##$TPNAME5= <>
##$TPNAME6= <>
##$TPNAME7= <>
##$TPOAL= (0..7)
0.5 0.5 0.5 0.5 0.5 0.5 0.5 0.5
##$TPOFFS= (0..7)
0 0 0 0 0 0 0 0
##$TUNHIN= 0
##$TUNHOUT= 0
##$TUNXOUT= 0
##$USERA1= <user>
##$USERA2= <user>
##$USERA3= <user>
##$USERA4= <user>
##$USERA5= <user>
##$V9= 5
##$VALIST= <valist>
##$VCLIST= <CCCCCCCCCCCCCCC>
##$VD= 0
##$VDLIST= <DDDDDDDDDDDDDDD>
##$VPLIST= <PPPPPPPPPPPPPPP>
##$VTLIST= <TTTTTTTTTTTTTTT>
##$WBST= 1024
##$WBSW= 4
##$XGAIN= (0..3)
0 0 0 0
##$XL= 0
##$YL= 0
##$YMAX_a= 11096794
##$YMIN_a= -5952246
##$ZGOPTNS= <>
##$ZL1= 120
##$ZL2= 120
##$ZL3= 120
##$ZL4= 120
##$ABSF1= 14.9683
##$ABSF2= -5.58423
##$ABSG= 5
##$ABSL= 3
##$ALPHA= 0
##$AQORDER= 0
##$ASSFAC= 0
##$ASSFACI= 0
##$ASSFACX= 0
##$ASSWID= 0
##$AUNMP= <proc_prof1d_extract.lims>
##$AXLEFT= 0
##$AXNAME= <>
##$AXNUC= <1H>
##$AXRIGHT= 0
##$AXTYPE= 0
##$AXUNIT= <>
##$AZFE= 0.1
##$AZFW= 0.1
##$BCFW= 0
##$BC_mod= 0
##$BYTORDP= 0
##$COROFFS= 0
##$CY= 15
##$DATMOD= 1
##$DC= 0
##$DFILT= <>
##$DTYPP= 0
##$F1P= 0
##$F2P= 0
##$FCOR= 0.5
##$FTSIZE= 131072
##$FT_mod= 6
##$GAMMA= 0
##$GB= 0
##$INTBC= 1
##$INTSCL= 1
##$ISEN= 128
##$LB= 0.3
##$LEV0= 0
##$LPBIN= 0
##$MAXI= 10000
##$MC2= 0
##$MEAN= 0
##$ME_mod= 0
##$MI= 0
##$NCOEF= 0
##$NC_proc= -3
##$NLEV= 6
##$NOISF1= 0
##$NOISF2= 0
##$NSP= 0
##$NTH_PI= 0
##$NZP= 0
##$OFFSET= 14.9683
##$PC= 1
##$PHC0= 33.92029
##$PHC1= 0
##$PH_mod= 1
##$PKNL= yes
##$PPARMOD= 0
##$PPDIAG= 0
##$PPIPTYP= 0
##$PPMPNUM= 2147483647
##$PPRESOL= 1
##$PSCAL= 4
##$PSIGN= 0
##$PYNMP= <proc.py>
##$REVERSE= no
##$SF= 400.130004927797
##$SI= 131072
##$SIGF1= 0
##$SIGF2= 0
##$SINO= 400
##$SIOLD= 131072
##$SPECTYP= <>
##$SREGLST= <1H.CDCl3>
##$SSB= 0
##$STSI= 131072
##$STSR= 0
##$SW_p= 8223.68421052632
##$SYMM= 0
##$S_DEV= 0
##$TDeff= 65536
##$TDoff= 0
##$TI= <>
##$TILT= no
##$TM1= 0
##$TM2= 0
##$TOPLEV= 0
##$USERP1= <user>
##$USERP2= <user>
##$USERP3= <user>
##$USERP4= <user>
##$USERP5= <user>
##$WDW= 1
##$XDIM= 131072
##$YMAX_p= 479352324
##$YMIN_p= -537480478
##$CURPLOT= <Network HP LaserJet P1505>
##$CURPRIN= <$Network HP LaserJet P1505>
##$DFORMAT= <normdp>
##$LAYOUT= <+/1D_H.xwp>
##$LFORMAT= <normlp>
##$PFORMAT= <normpl>
##$SURQMSG= 1
$$ End of Bruker specific parameters
$$ ---------------------------------
##NTUPLES= NMR SPECTRUM
##VAR_NAME=  FREQUENCY,     SPECTRUM/REAL,   SPECTRUM/IMAG
##SYMBOL=    X,             R,               I
##VAR_TYPE=  INDEPENDENT,   DEPENDENT,       DEPENDENT
##VAR_FORM=  AFFN,          ASDF,            ASDF
##VAR_DIM=   131072,        131072,          131072
##UNITS=     HZ,            ARBITRARY UNITS, ARBITRARY UNITS
##FACTOR=    0.0627417313425165, 1,          1
##FIRST=     8223.62146879498, 3151,         -87217
##LAST=      0,             6194,            -86214
##MIN=       0,             -537480478,      0
##MAX=       8223.62146879498, 479352324,    0
$$ Real data points
##PAGE= N=1
##DATA TABLE= (X++(R..R)), XYDATA
$$ [...]
65551 93133 92151 91486 90916 89396 86143 82107 79562 79816 81904 83998 85489 86984 88733 90023 90205 89587
65535 89587 88930 88521 88159 87892 88155 88956 89339 88271 86018 83968 82917 82136 80643 78756 77664 77771 78305
65518 78305 78424 77912 76813 75295 74098 74272 75966 78017 79195 79509 79876 80720 81255 80225 77367 74159
65502 74159 72777 73953 76213 77727 78384 79149 79891 79307 77144 74947 73963 73520 72411 70860 70086 70624
65486 70624 72187 74589 77698 80721 82650 83390 83657 83776 83312 81880 79705 77402 75649 74911 74974 75043 74796
65469 74796 75064 76865 80134 83950 87489 89908 90022 87556 84552 83962 86532 90185 92685 93585 93195 91369
65453 91369 88514 86591 87427 90339 92697 92799 91293 89854 89512 90450 92424 94778 96506 96882 95945 94169
65437 94169 91820 88915 85763 83304 82640 84081 86697 88965 89972 89921 89654 90010 91613 94667 98501 101688
65421 101688 103145 103074 102462 101786 100675 98812 96646 94997 94317 94454 94860 94930 94521 94387 95667 98544 101594
65404 101594 102883 101607 98380 94234 90019 86627 84878 84672 84838 84379 83519 83001 82797 82267 81313 80457
65388 80457 79693 78291 76132 74440 74403 75546 76325 76210 76420 78326 81585 84266 84794 83487 81975 81234
65372 81234 80677 79431 77815 76764 76156 74990 73392 73104 75285 78944 82519 85980 90000 93721 95123
65357 95123 93650 91012 89058 88113 87825 88397 90093 92291 93916 94524 94477 94381 94743 95810 97345 98809 99908
65340 99908 100574 100399 98915 96751 95676 96864 99636 102508 104829 106716 107999 108333 108111 108284 109179 110323
65324 110323 111538 113443 116515 120235 123605 126161 128078 129539 130472 131042 132062 134568 138879 144275 149854
65309 149854 155630 162504 171127 181066 191074 199944 207192 213439 220175 228594 238376 248016 256413 263472
65295 263472 268883 271220 269070 262608 253366 242869 232203 222442 214263 207012 199037 189394 178818
65282 178818 168927 160913 154989 150586 146920 143702 141306 139913 138647 136113 131770 126334 120921 116363
65268 116363 113206 111507 110495 109152 107355 105785 104588 103021 100738 98517 97064 95860 93942 91256
65254 91256 88419 85667 83030 81186 81033 82274 83453 83646 83377 83469 83728 83365 82258 81136 80655 80862 81560
65237 81560 82667 83976 84920 84949 84150 83226 82759 82599 82134 81080 79786 78731 78005 77454 77165 77500 78625
65220 78625 80239 81853 83175 84167 84881 85421 85951 86587 87273 87877 88386 88872 89182 88843 87487 85388 83391
65203 83391 82189 81739 81499 81074 80424 79549 78402 77358 77414 79376 82727 85679 86726 86073 85286 85552 86474
65186 86474 86604 84882 81472 77580 74831 74617 77400 82262 87329 90951 92576 92591 91661 90413 89463 89136
65170 89136 89039 88245 86207 83460 81218 80293 80553 81344 82116 82530 82265 81182 79639 78245 77120 75756 73806
65153 73806 71677 70007 68844 67800 66797 66119 65803 65577 65441 65766 66718 68091 69817 71998 74261 75776
65137 75776 76289 76466 76702 76274 74445 71885 70083 69542 69386 68700 67431 65997 64795 64291 64943 66719 69146
65120 69146 71958 75190 78460 80762 81329 80395 78788 77081 75361 73612 72038 71100 71259 72476 74023
65105 74023 75032 75208 74832 74300 74105 74931 76973 79142 79819 78695 77127 76359 76159 75778 75534 76569 79236
65088 79236 82450 84656 85036 83941 82582 82249 83385 85271 86631 86489 84541 81210 77623 75090 74189
65073 74189 74518 75513 77043 78915 80386 80836 80575 80318 80097 79382 78254 77760 78927 81790 85417 88512
65057 88512 90045 89801 88423 86640 84548 82077 80039 80031 82992 88184 93817 98543 102341 106194 110914
65042 110914 116057 120110 122054 122603 123418 125281 127687 130202 133296 137436 142138 146709 151572 157931 166018
65027 166018 174358 181155 186117 190440 195013 199164 201511 201804 201256 200911 200400 198823 196347 193991 191995
65012 191995 189411 185545 180883 176064 170683 163945 156087 148333 141496 135362 129483 123968 119279 115666
64998 115666 112984 110818 108733 106686 105196 104673 104518 103401 100780 97671 95439 94066 92213 88954 84872
64983 84872 81215 78477 76206 73985 72036 70801 70287 70082 69912 69940 70486 71495 72378 72434 71485 70038 68760
64966 68760 67878 67223 66782 66914 67955 69834 72185 74593 76539 77340 76593 74749 73000 72328 72705 73296 73466
64949 73466 73510 74321 76298 78731 80420 80883 80697 80688 81082 81647 82302 83161 84008 84144 82962 80594 77955 76180
64931 76180 75895 76875 78370 79864 81396 82989 83963 83263 80614 77124 74482 73599 74059 74707 74617 73565 71902
64914 71902 70166 68740 67714 66970 66483 66604 67824 70047 72217 73062 72404 71472 71742 73520 75779 77227
64898 77227 77451 77164 77409 78503 79753 80365 80377 80278 79874 78338 75620 73105 72316 73493 75839 78517 80664
64881 80664 81089 79117 75673 72574 70755 69963 70071 71561 74365 77229 78818 78846 77628 75184 71451 67095
64865 67095 63537 62194 63693 67391 71515 74292 75220 74887 73595 71069 67775 65456 65414 66862 67889
64850 67889 67676 66908 66372 66227 66623 67977 70229 72386 73232 72362 70489 68979 68887 70126 71621 72484 72732
64833 72732 72619 71922 70602 69690 70485 72912 75550 77343 78489 79700 81515 84412 88438 92330 94004
64818 94004 92640 89643 86940 84999 83193 81415 80301 80126 80338 80247 79576 78398 77053 76076 75743 75650 75158
64801 75158 74243 73499 73327 73442 73283 72686 72206 72842 75101 78041 79566 78216 74608 70709 67876 66086
64785 66086 64878 64359 65037 67130 70167 73052 74613 74572 73991 74225 75329 76030 75453 74326 74118 75404 77483
64768 77483 79308 80310 80382 79516 77691 75153 72713 71541 72258 74215 75957 76499 75938 74892 73815 72974
64752 72974 72648 73038 74250 76379 79162 81438 81666 79559 76795 75609 76844 79570 82163 83397 83027
64737 83027 81892 81072 80471 78837 75815 73216 73044 74770 76002 75795 75722 77314 79910 81836 82513 82432 82025
64720 82025 81646 81921 82959 83669 83036 81750 81465 82553 83739 83974 83511 82831 81677 79767 77778 76881 77654
64703 77654 79857 82888 86020 88515 89975 90442 89955 88366 85915 83613 82492 82598 83216 84004 85382 87579
64687 87579 89740 90409 88920 86069 83370 81867 81734 82737 84526 86437 87497 87094 85500 83518 81816
64672 81816 80845 80940 82009 83380 84538 85790 87548 89209 89679 89038 88609 89044 89340 88416 86850 86256 87479
64655 87479 90124 93279 95775 96236 94151 90918 88844 88877 90052 91216 92252 93252 93466 92013 89185
64640 89185 86234 84005 82421 81244 80657 80853 81600 82607 84115 86588 89759 92344 93076 91908 89965
64625 89965 88427 87807 88189 89442 90841 91106 89633 87551 86892 88513 91271 93306 93722 92864 91512 90247
64609 90247 89398 89110 89288 89606 89697 89469 89230 89347 89732 89862 89487 89005 88784 88397 87060 84822 82816 82230
64591 82230 83358 85641 88128 89874 90406 90101 89773 89760 89792 89792 90254 91567 93415 95142 96283 96532 95738 94326
64573 94326 93150 92369 90900 87713 83459 80105 78956 79541 80408 80501 79695 78489 77480 77003 77116 77821 79046
64556 79046 80375 81224 81567 82087 83186 84275 84615 84505 84906 86076 87382 88368 89222 90052 90526 90553 90610 91005
64538 91005 91390 91385 91188 91096 90910 90404 90076 90823 92930 95775 98443 100230 100758 100114 99010 98313 98132 97659
64520 97659 96263 94614 94243 95799 98132 99580 99935 100466 101951 103567 104195 104028 103973 104064 103569 102459 101516
64503 101516 100935 100100 99123 99305 101346 104084 105924 106665 106990 106890 105776 103737 101492 99305 96970 94760
64487 94760 93295 92439 91408 90167 89678 90365 91301 91554 91609 92648 94846 97112 98424 98767 98700 98434 97677
64470 97677 96259 94692 93890 94322 95562 96774 97474 97739 97892 98184 98572 98590 97696 95955 94087 92654 91623
64453 91623 91018 91335 92697 94198 94857 94697 93946 91849 87757 83165 80977 82347 85505 88156 89739 90782
64437 90782 91473 91860 92419 93277 93566 92606 91153 90582 91282 92673 94220 95552 96229 96371 97031 98778 100336
64420 100336 99914 97710 95871 95889 97106 97927 97470 95847 93806 92466 92599 93773 94796 95207 95669 96686
64404 96686 97770 98291 98477 98919 99469 99292 98028 96581 96540 98709 102175 105103 106545 107077 107490 107620 107143
64387 107143 106829 107906 110355 112793 113925 113299 110983 107725 105209 104716 105282 104566 101905 99223 98418 99223
64371 99223 100378 101591 103214 104961 106154 106618 106422 105343 103483 101740 100727 99779 98084 96275 95947
64356 95947 97958 102006 107265 112357 115351 115198 113041 110958 109623 108306 106776 105616 104709 103100 100817
64341 100817 99386 99801 101123 101836 101676 101339 101185 101076 100936 100777 100638 100980 102488 104887 106635 106637 105669 105215
64323 105215 105424 105347 104909 105298 107156 109542 111217 112081 112710 113153 113008 112277 111340 110220 108692 107113 106324
64306 106324 106537 107036 107323 107735 108360 108240 106748 105310 106276 109911 113743 115431 115239 115044 115879 117384 118864
64289 118864 119685 119072 116837 114373 113774 115689 118721 121111 122374 123217 124627 127204 130644 133611 134755
64274 134755 134183 133432 133824 135423 137655 140064 141962 142182 140090 136617 133631 132351 132678 133824 135173
64259 135173 136645 138589 141294 144412 146964 148106 147846 147011 146680 147582 149664 152122 154119 155504 156527
64244 156527 157040 156628 155549 154756 154662 154595 153877 152808 152052 151652 151351 151429 152490 154590 157219 159995 162859
64227 162859 165737 168629 172000 176516 182242 188430 194158 199000 203155 207100 210987 214285 216280 217008
64213 217008 217292 217585 217300 215691 212923 209800 206836 204091 201491 198693 195142 191008 187631 186073 185482
64198 185482 183943 180920 177853 176171 175712 175433 174874 174412 174682 176206 179111 182807 186264 188837 190621
64183 190621 191936 192942 193849 194993 196568 198646 201460 205122 209118 212816 216465 220796 225547 229498
64169 229498 232367 235508 239894 244408 247256 248417 249433 251045 252223 251621 249074 245556 242336 240272
64155 240272 239303 238466 236864 234591 232331 230259 227973 225356 222807 220622 218893 218024 218528 220041 221259
64140 221259 221212 220201 219338 219758 222368 227421 233749 239072 241871 242734 243393 244790 246647 248614 250997 254247
64124 254247 258256 262356 265786 268116 269475 270419 271362 272131 272205 271400 270212 269499 269867 271285 273323 275823
64108 275823 279203 283762 288822 293181 296540 299880 304145 309183 314405 319787 325525 331323 336989 343412
64094 343412 351907 362637 374691 387724 402410 418926 435989 452072 467062 482168 498618 516647
64082 516647 535071 551371 562893 568734 570148 568744 564899 558536 550568 542354 533974 524217 512359
64069 512359 498973 484861 470247 455581 442284 431860 424405 418440 412116 404541 396387 389516 385544
64056 385544 384289 383752 382017 379034 376267 374813 374449 374491 375053 376984 380725 385641 390648 395263 399803
64041 399803 404729 410300 416974 425471 435866 446909 457043 466161 475783 487290 500512 514242 527591
64028 527591 540355 552414 563312 572346 578741 581942 582180 580682 578787 576582 572667 565606 555625 544715
64014 544715 534938 526741 519051 510898 502547 494943 488555 483229 478863 475609 473534 472661 473273 475556 478901
63999 478901 482303 485542 489264 493791 498803 504521 512082 521880 532473 542264 551761 562965 576755
63986 576755 592040 607525 623161 639616 657255 676107 696099 716772 737157 756315 773843
63975 773843 789773 804312 817718 830146 841702 852886 864557 876827 888461 898475 908128 919957
63963 919957 934626 950109 964542 978546 993913 1011103 1029188 1047207 1064264 1079025 1090664
63952 1090664 1100065 1108837 1117341 1124970 1132083 1140099 1149558 1159693 1170381 1183130 1199354 1218770 1240288
63939 1240288 1263568 1288855 1316202 1345824 1378622 1415365 1455812 1499485 1546815 1598677 1655205
63928 1655205 1716050 1781374 1851555 1926233 2004999 2088918 2180015 2278970 2384535 2495751 2613581
63917 2613581 2739711 2874771 3018782 3172635 3337988 3516009 3707268 3913021 4135887
63908 4135887 4379144 4645847 4938805 5261182 5617094 6011846 6451438 6941567 7487139
63899 7487139 8092786 8763469 9504097 10318522 11208615 12173272 13207371 14301954 15446147
63890 15446147 16628848 17838081 19059046 20273386 21459802 22594252 23650093 24600241
63882 24600241 25421079 26094761 26608442 26952659 27120960 27109841 26917976 26546247 25999777
63873 25999777 25290039 24434620 23455401 22377129 21226000 20026997 18801339 17566735
63865 17566735 16339866 15137668 13976018 12867934 11823160 10848415 9947377 9120952
63857 9120952 8368186 7686792 7072887 6521161 6026082 5582726 5186157 4830727 4510875
63848 4510875 4222436 3962477 3728026 3515680 3322531 3146649 2986313 2839307 2703371
63839 2703371 2576934 2458947 2348309 2243911 2145023 2051046 1960919 1873480 1788614 1707460
63829 1707460 1630987 1558726 1489498 1423155 1360806 1303145 1249176 1197062 1145836 1095883 1048045
63818 1048045 1002899 960914 922663 888492 858109 830684 805249 780979 757343 734313 712378
63807 712378 692106 673612 656584 640831 626550 613889 602493 591926 582327 574025 566419 558164
63795 558164 549155 541638 538177 538663 540526 541950 543514 546120 548801 549817 549019 547573 545728 542327 536535
63780 536535 528724 519463 508913 497604 486566 475979 464685 451860 438438 425916 414292 402151
63768 402151 388579 374195 360361 348026 337271 327447 317819 308472 300376 294096 288726 282754 275831
63755 275831 268999 263232 258556 254663 251542 249073 246537 243139 238886 234703 231672 230082 228983 226796
63741 226796 222832 218190 214634 212529 210600 207863 204986 203124 202157 200956 199109 197423 196686 196664 196536
63726 196536 195778 194463 193112 192397 192515 192728 191941 189921 187446 185082 182491 179442 176929 176413 178086 180509
63710 180509 181995 181862 180404 178288 176097 174004 171678 168888 166236 164796 164934 166045 167560 169441 171289
63695 171289 171871 170479 168350 167767 169787 173568 177764 181650 184709 186155 185552 183558 181542 180604 181195
63680 181195 183354 186963 191777 197357 202953 207720 211448 214922 218901 222713 224750 224797 225036 227975 233829
63665 233829 240673 246745 251658 255625 258663 260848 262463 263434 263228 261739 259721 257914 256226 254306 252526
63650 252526 251726 252226 253626 255448 257286 258396 257962 256131 254208 253345 253344 253146 252108 250175 247070 242261
63634 242261 236122 230450 227113 226218 226060 224865 222278 219266 217109 216685 218289 221572 225682 229836 233915
63619 233915 238315 243098 247484 250487 252001 252960 254299 256082 257986 260371 264139 269281 274235 277264
63605 277264 278216 278305 278340 277897 276374 274038 271548 268923 265637 261622 257668 254719 253017 251929 250466 248025
63589 248025 244847 241809 239755 239137 240253 243347 248172 253735 258925 263377 267461 271605 276128 281632
63575 281632 288910 298135 308481 318883 329018 339326 350239 361701 373521 386039 400264 417158
63563 417158 436641 457427 478194 498941 520961 545423 572308 600772 630026 659434 688153
63552 688153 715416 741235 766114 789706 810106 824981 833403 836454 836139 833931 830161 824451 816632
63539 816632 807448 798324 790222 782700 774383 764361 752761 739880 725344 708625 690118 671117
63527 671117 652737 635371 619233 604848 592662 582455 573461 564894 556216 547172 538025 529644 523003
63514 523003 518438 515555 513859 513242 513766 515220 517217 519832 523919 530540 540028 551815 565260 580264
63500 580264 596825 614379 632343 651347 673115 698598 726634 755010 782530 809434 835981
63489 835981 861384 884247 903349 917758 926914 931342 932980 934069 935638 937458 939351 941741 944508
63476 944508 945968 943713 936454 924575 909116 890840 870210 847304 821350 791303 757680 723219
63464 723219 690673 660227 630260 600502 572972 549337 528715 509104 489980 472136 455626
63453 455626 439505 423665 409417 397748 388035 379145 370930 363787 357345 350575 343029 335232 327937
63440 327937 321710 317227 315202 315618 317471 319656 321829 324136 326431 328328 330011 332439 336399 341557
63426 341557 346897 352114 358119 365727 374087 381093 385620 388776 392330 396293 398930 399175 397946 396492
63412 396492 394376 390247 384174 377860 372492 367799 363827 362253 364546 369544 374350 377578 380385 384197
63398 384197 388833 393393 397696 401780 404934 406588 407778 410400 414952 420107 424772 429608 435986 444251
63384 444251 453671 463625 474125 485456 498004 512398 529112 547823 567714 588675 611745 637970
63372 637970 667134 698041 729854 762657 796807 832353 869242 907552 947162 987528 1028025
63361 1028025 1068088 1106616 1141738 1171823 1196460 1215792 1229152 1235442 1235040 1230444 1224433 1218034
63349 1218034 1210591 1201283 1189995 1177047 1162505 1145683 1125199 1099965 1070356 1037959 1003983 968677
63337 968677 932687 897966 866267 837179 808825 780373 752871 727699 705334 685878 669598
63326 669598 656218 644421 632953 622143 613871 610085 611523 617568 626972 638651 651842 665672
63314 665672 679181 692421 707221 725821 748484 773332 798960 826337 857374 892213 928905
63303 928905 965439 1001078 1035689 1068727 1099297 1126619 1149984 1168532 1181394 1187977 1188124 1182467
63291 1182467 1172767 1161428 1150194 1139402 1128639 1117788 1107011 1095835 1082785 1066048 1044510
63280 1044510 1018407 989352 959562 930473 901909 872853 843007 813226 784517 757362 732185
63269 732185 709645 689744 671158 652303 632915 614030 596680 581299 568119 557113 547473 538087
63257 538087 528846 520751 514468 509571 505534 502616 501158 500702 500512 500469 500843 501623 502654 503978 505292 505522
63241 505522 503702 500176 496355 493522 492319 492785 494023 494178 491856 487679 483641 480900 478868 476487 473574
63226 473574 470783 469064 469436 472499 477564 482610 485643 486201 485511 485317 486605 489284 492925 497533 503127
63211 503127 508742 512806 515009 517021 520555 525315 529679 532840 535266 537585 540321 544399 550573 558339
63197 558339 566535 574853 583570 592049 599248 605818 613946 624637 636845 649884 664727 681797 699255
63184 699255 715252 730778 748560 769838 793831 819683 847075 875157 902748 930059 958871
63173 958871 990468 1024301 1059031 1094046 1129443 1165277 1201437 1237954 1274952 1312338 1349730
63162 1349730 1386615 1422492 1456881 1489171 1518648 1545084 1569394 1593122 1616831 1639317 1658766
63151 1658766 1674392 1686417 1694644 1697542 1692832 1678933 1656070 1626157 1591451 1553377 1512926 1471792
63139 1471792 1432050 1394531 1358576 1323972 1292194 1265017 1242687 1224328 1209507 1198423 1191073
63128 1191073 1187288 1187369 1191826 1200597 1213184 1229303 1248695 1270564 1293891 1318098 1342872 1367725
63116 1367725 1392415 1417317 1442608 1467576 1491533 1514909 1538443 1561732 1583645 1603721 1621810
63105 1621810 1636564 1645736 1648226 1644728 1636221 1622933 1604976 1582758 1556261 1524924 1488937 1449990
63093 1449990 1410244 1370995 1332585 1295131 1258920 1224350 1191614 1160424 1130380 1101974 1076478
63082 1076478 1054196 1033559 1013176 994086 978431 966251 955541 945557 937990 934047 932080 929293
63070 929293 924636 918970 913401 908633 905235 903439 902926 903380 904821 907037 909391 911566 913771 915921 917691
63055 917691 919717 923308 928245 932347 934413 936215 940042 945440 950195 953729 957408 961869 966227 970094
63041 970094 974392 979616 984989 990132 996082 1003664 1011964 1019514 1026121 1032455 1038482 1043618 1048134 1053028
63027 1053028 1058311 1062637 1065373 1068280 1074178 1084112 1096731 1110416 1124840 1139891 1154309 1167024
63015 1167024 1179553 1195288 1215707 1238579 1260873 1282481 1305802 1332296 1360952 1390214 1420101
63004 1420101 1451906 1486583 1524063 1563773 1605355 1648930 1694846 1743249 1794003 1847064 1902596
62993 1902596 1960514 2020380 2082210 2147016 2215924 2288888 2364706 2441937 2519147 2594638 2667090
62982 2667090 2736721 2805018 2872973 2940170 3005818 3070027 3133653 3197357 3261120 3324177 3385007
62971 3385007 3441810 3493431 3539579 3579770 3612286 3634513 3644083 3639528 3620371 3587242 3541765 3485612
62959 3485612 3419674 3344692 3262731 3177256 3091334 3006326 2922932 2843116 2770043 2706005 2651166
62948 2651166 2604658 2566194 2536052 2514088 2499778 2493081 2494363 2503228 2518244 2538268 2563409 2594074
62936 2594074 2629430 2667448 2706410 2745890 2786223 2827432 2868771 2909054 2947117 2981982 3012848
62925 3012848 3039259 3061268 3078892 3091028 3095292 3089524 3073305 3047404 3012051 2966651 2911058 2846050
62913 2846050 2772382 2690588 2602196 2509933 2415929 2320763 2225129 2131380 2042075 1957712 1877338
62902 1877338 1801046 1730327 1666023 1607349 1553169 1503036 1456566 1412874 1371277 1331928 1295317
62891 1295317 1261553 1230394 1201539 1174859 1150797 1130397 1114168 1100883 1088283 1075081 1061589
62880 1061589 1048422 1035573 1022939 1010668 998475 985533 971648 957790 944857 932549 920124
62869 920124 907729 896312 886526 878198 870543 862623 854022 845331 837448 830191 822399 813792 805806 799859
62855 799859 795582 791594 787393 783509 780259 777405 774761 772254 769631 766957 765134 764995 766040 767016 767616
62840 767616 768582 770188 771816 773241 775186 778036 780894 782563 782882 782446 781480 779589 776353 771708 765952
62825 765952 759770 754094 749640 746631 745074 744990 746219 748296 750705 752929 754119 753133 749318 743161 736015
62810 736015 729297 723882 719742 715943 711437 706161 701043 696660 692352 687154 681262 676029 672589 670913
62796 670913 670067 668960 666884 663758 660004 656085 652231 648673 645713 643203 640345 636587 632585 629681
62782 629681 628468 628425 628961 630176 632357 635304 638547 641902 645410 648844 651580 653077 653532 654076 656013
62767 656013 659536 663415 666461 669064 672517 676863 680531 682578 684365 688028 693812 699976 705136 709692
62753 709692 714803 720971 728171 736716 747088 758906 770622 780725 789302 798268 809797 824529 841485
62740 841485 859670 879114 900076 921958 943993 966817 992348 1021811 1054625 1089672 1127009
62729 1127009 1167665 1212109 1259715 1309807 1362715 1419548 1481185 1547746 1619039 1695285 1777190
62718 1777190 1865275 1959359 2058861 2163350 2272484 2385579 2501580 2619283 2737011 2852062
62708 2852062 2961089 3061231 3150383 3226235 3285809 3326516 3347277 3348101 3329023 3290231 3233104
62697 3233104 3160330 3074777 2978680 2873997 2763010 2648149 2531479 2414647 2299191 2186547
62687 2186547 2077668 1972867 1872277 1776464 1686358 1602556 1524996 1453546 1388521 1330046 1277125
62676 1277125 1228222 1182934 1142313 1107071 1076134 1047673 1021052 996997 976121 958163 942630
62665 942630 929378 918386 909540 902816 898105 894746 891873 889527 888885 891016 895813 902657 911809 924510
62651 924510 941651 962717 986246 1011233 1038029 1067976 1102186 1140744 1183118 1229201 1279593
62640 1279593 1334747 1394166 1456891 1522841 1593356 1670134 1753600 1842398 1934379 2027736 2120942
62629 2120942 2212033 2298714 2379407 2453529 2520157 2576781 2620135 2648283 2661298 2659832 2643734
62618 2643734 2612546 2566834 2508293 2438652 2359241 2271897 2179689 2085989 1992692 1899752 1806667
62607 1806667 1714222 1624633 1540233 1462120 1389785 1321754 1256851 1195271 1138245 1086347 1038567
62596 1038567 993720 952344 915964 884445 855444 827153 800405 777053 757117 738739 720488
62585 720488 702480 685497 670098 656434 643837 630797 616603 602976 592574 585548 579008 570514
62573 570514 560701 551518 543274 534935 526605 519904 515904 513939 512715 511547 510275 508931 508039 508573 511057
62558 511057 515015 519691 524917 530895 537414 543811 549672 555263 561267 568375 577211 588406 602487 619557
62544 619557 639081 660113 681979 704857 729599 756942 787054 819910 855856 895470 938981
62533 938981 986230 1037160 1091795 1149508 1208914 1269024 1330045 1392236 1454040 1512197 1563874
62522 1563874 1607990 1644229 1671718 1689428 1697280 1695944 1685680 1666149 1637429 1600685 1557720 1510191
62510 1510191 1459247 1405654 1350303 1294738 1240842 1189711 1141189 1094907 1051310 1011058 973896
62499 973896 939080 906761 877864 852467 829180 806507 784192 762923 743256 725145 708081
62488 708081 691507 675466 660838 648336 637352 626607 616096 607371 601422 597154 592764 588001
62476 588001 584238 582630 583010 584498 586461 588758 591514 594932 599227 604678 611605 620132 630098 641581
62462 641581 655463 672922 694121 717896 742981 769152 796948 826729 858483 892369 929056
62451 929056 969381 1013490 1060151 1107284 1153800 1200631 1249131 1298518 1345884 1388728 1426233
62440 1426233 1457694 1481133 1494541 1497719 1491925 1478283 1457468 1430401 1398227 1361792 1321835 1279452
62428 1279452 1235645 1190738 1144919 1099172 1055165 1014516 978473 947613 921124 897024 873917
62417 873917 852052 831957 812929 794134 776545 762159 751391 742666 734691 727688 722165 717803
62405 717803 714228 711784 710873 711213 712283 713856 715711 717491 719362 722247 726887 733070 740154 747982 757034
62390 757034 767969 781156 796084 811023 823845 833603 841039 847350 852782 856549 857625 855383 849855
62377 849855 841580 830997 818085 802985 786741 770642 754777 738023 719678 700413 681513 664017
62365 664017 648895 637048 628406 621607 615201 608803 602764 597352 592770 589368 587201 585847 585261 586237
62351 586237 589368 594032 599172 604665 611090 618503 626377 634631 643737 653677 663617 672918 681833 690919
62337 690919 700355 710223 720930 732745 744987 756159 765065 771746 777161 781951 785615 787201 786803
62324 786803 786001 786435 788210 790165 791592 793113 795850 800374 806806 815445 826698 840629 857123 876446
62310 876446 899110 925139 954088 986035 1021968 1062692 1107914 1157112 1210836 1269951 1333572
62299 1333572 1399068 1464604 1530523 1597292 1663000 1724190 1778672 1826206 1866634 1898766 1921461
62288 1921461 1934659 1938845 1934313 1921516 1901410 1874872 1842118 1802949 1757170 1704893 1647348 1587639
62276 1587639 1529646 1475404 1424170 1374539 1326663 1281702 1239997 1200934 1164219 1130138 1098586
62265 1098586 1068721 1039685 1011117 983124 956442 932454 912213 895379 880774 867932 857378
62254 857378 849305 842892 837272 832450 828759 825945 823378 820886 818888 817765 817404 817213 816361 814227 811023
62239 811023 807864 805801 804677 803291 800833 797898 795822 795208 795418 795478 795106 794828 795546 798231 803641 811710
62223 811710 821255 830744 839462 847796 856544 866297 877359 889751 903313 918197 935164 954784 976414
62210 976414 998786 1021812 1047045 1075950 1108436 1143616 1181388 1222525 1267511 1315996 1367241
62199 1367241 1420609 1475737 1532642 1591440 1651591 1711481 1768873 1821387 1866503 1901958 1926863
62188 1926863 1941950 1948096 1945161 1932943 1912498 1885207 1850886 1808285 1757725 1702134 1645080 1588668
62176 1588668 1533662 1480483 1429327 1380033 1332843 1288956 1249591 1214655 1183154 1154908 1131130
62165 1131130 1112837 1099070 1087285 1075721 1064995 1057002 1052463 1050200 1048832 1048351 1049392 1051665 1054068
62152 1054068 1056187 1058644 1061879 1065337 1068278 1070800 1073779 1078104 1084058 1091001 1097564 1102668 1106626 1110913
62138 1110913 1116861 1124957 1135245 1147570 1161240 1175278 1189436 1204393 1220711 1238372 1257686 1279602
62126 1279602 1304156 1329414 1353142 1375308 1397776 1421540 1445407 1467763 1488781 1510338 1534287
62115 1534287 1561398 1591604 1624611 1660189 1698291 1739099 1782919 1829922 1879852 1931907 1984882
62104 1984882 2037488 2088407 2135975 2178022 2212480 2238398 2256363 2267947 2274781 2277915 2277578 2273309
62092 2273309 2264553 2251455 2235037 2216461 2196244 2174571 2152382 2131621 2113925 2099217 2086086
62081 2086086 2073590 2062244 2053216 2047082 2043630 2042283 2042202 2042458 2042866 2044439 2048256 2053957 2060140 2066320
62067 2066320 2073559 2082883 2093957 2106002 2119369 2135326 2154519 2176363 2199818 2224145 2249000 2274484
62055 2274484 2301261 2330100 2361005 2393165 2425966 2459782 2495519 2533632 2573868 2615907 2659945
62044 2659945 2706565 2756240 2809075 2864817 2922656 2980825 3036895 3089084 3137413 3183274 3227989
62033 3227989 3272335 3317390 3364816 3415462 3467998 3519652 3568362 3613947 3657492 3700250 3743134
62022 3743134 3786691 3831278 3877411 3925915 3977347 4031334 4086847 4143211 4200506 4258972 4318545
62011 4318545 4379239 4441589 4506314 4573619 4643003 4713656 4784835 4855937 4926310 4994838 5059717
62000 5059717 5118951 5171446 5217600 5258546 5294752 5325511 5349872 5367886 5380742 5389705 5395070 5396207
61988 5396207 5392407 5383587 5370472 5354553 5337852 5322211 5308473 5296421 5285492 5275153 5264498 5252267
61976 5252267 5237992 5222934 5209203 5197890 5188392 5179367 5169769 5159062 5147303 5135321 5124221 5114209
61964 5114209 5104331 5093765 5083032 5073342 5064898 5056392 5046321 5034527 5022308 5011267 5002167 4994766
61952 4994766 4988441 4982737 4977353 4971930 4966145 4959990 4953700 4947474 4941441 4935836 4930959 4926878 4923287 4919440
61938 4919440 4914051 4905623 4893576 4878898 4863036 4846047 4826538 4803535 4777587 4749576 4719251 4685671
61926 4685671 4648602 4608756 4567010 4524152 4481184 4439074 4398073 4357803 4317942 4278389 4238929
61915 4238929 4199430 4160445 4123003 4087641 4053994 4021395 3989419 3957821 3926523 3895855 3866387
61904 3866387 3838239 3810846 3783534 3756151 3729160 3703456 3679976 3658931 3639350 3619906 3600334
61893 3600334 3581567 3564392 3548675 3534186 3521463 3511153 3502806 3495065 3487157 3479920 3475258 3474653 3478051
61880 3478051 3484036 3491171 3499202 3508907 3521046 3535980 3554220 3576604 3603573 3634740 3669567 3708050
61868 3708050 3750477 3797024 3848106 3904773 3968273 4039451 4118964 4207704 4306497 4415599 4535057
61857 4535057 4665509 4808335 4965296 5138480 5330325 5543058 5778222 6037293 6322768
61848 6322768 6638079 6986344 7369739 7790300 8250841 8754587 9303666 9897838 10534293
61839 10534293 11208080 11911857 12634410 13359137 14064058 14723158 15307527 15786463 16130634
61830 16130634 16317504 16335924 16187116 15882960 15443622 14894630 14263006 13574208 12851404
61821 12851404 12115598 11384581 10671764 9986942 9337731 8729275 8163255 7638976 7155644
61812 7155644 6712459 6306945 5935296 5594997 5285507 5005578 4751304 4517937 4302758
61803 4302758 4105280 3925458 3762463 3614499 3478998 3353625 3237748 3132309 3037707 2952598
61793 2952598 2875240 2804906 2741148 2682902 2629592 2582218 2541845 2507416 2476365 2447129 2419874
61782 2419874 2395148 2373151 2354198 2338551 2325656 2314634 2305623 2299616 2296923 2296867 2299067 2303809 2310734
61769 2310734 2318338 2325474 2332718 2341629 2353171 2367298 2383619 2401842 2421717 2442930 2465165 2488477
61757 2488477 2513737 2542409 2575388 2612381 2653000 2698049 2748704 2804584 2863886 2925785 2991640
61746 2991640 3063290 3141017 3223963 3312033 3406515 3508981 3620118 3739661 3867233 4003177
61736 4003177 4148532 4304120 4469986 4646269 4834353 5036386 5253703 5486688 5736435
61727 5736435 6005518 6296599 6611117 6950196 7316409 7713906 8147090 8619772 9135421
61718 9135421 9697739 10311114 10980865 11712699 12511373 13379935 14320397 15334481 16422624
61709 16422624 17581714 18803509 20074137 21373329 22672637 23933854 25109389 26145347
61701 26145347 26986942 27585202 27903675 27923757 27647370 27095919 26305584 25320905 24189240
61692 24189240 22957121 21667640 20358142 19058784 17792532 16576203 15421681 14336880
61684 14336880 13326260 12391111 11530194 10740915 10020076 9363442 8765242 8219126 7719841
61675 7719841 7263623 6847284 6467724 6122130 5807479 5519747 5254714 5009887 4784544
61666 4784544 4577589 4386636 4209764 4046624 3896671 3757509 3626523 3503341 3389011
61657 3389011 3283094 3183240 3087694 2996861 2912142 2834344 2763413 2698516 2637927 2579824 2523820
61646 2523820 2471171 2423015 2378826 2336826 2295497 2254509 2214696 2177326 2143015 2111150 2080591
61635 2080591 2050804 2021877 1993659 1965614 1937476 1909326 1881075 1852656 1824796 1798665 1774562
61624 1774562 1751713 1729566 1708415 1688466 1669241 1650460 1632690 1616423 1601112 1585743 1569879
61613 1569879 1553689 1537548 1522102 1508071 1495343 1482870 1470137 1458014 1447317 1437226 1426306
61602 1426306 1414725 1404159 1395547 1388110 1380689 1373006 1365313 1357881 1351316 1346526 1343610 1341271 1337963
61589 1337963 1333429 1328838 1325700 1324930 1326540 1329793 1333738 1337783 1341529 1344199 1345000 1344382 1344181 1345768 1348476
61574 1348476 1350605 1351586 1352274 1353306 1354362 1355282 1356761 1359173 1361485 1362308 1361674 1360757 1359903 1358016 1354230 1349241
61558 1349241 1344289 1339447 1333868 1327398 1320888 1314753 1308299 1300952 1293297 1285974 1278102 1267996 1255539
61545 1255539 1242907 1232404 1224188 1216596 1208303 1199576 1191668 1185608 1181651 1179458 1178559 1178707 1179892 1181975
61531 1181975 1184467 1186851 1189084 1191653 1195233 1200398 1207509 1216557 1227121 1238713 1251290 1265434 1282037
61518 1282037 1301760 1324341 1348105 1370536 1390168 1408250 1428209 1453029 1483061 1516236 1550132
61507 1550132 1583850 1618406 1655637 1696537 1740266 1784610 1827433 1867840 1906314 1944094 1982215
61496 1982215 2020553 2057592 2091529 2121862 2149632 2176031 2201185 2224454 2245358 2263771 2279622
61485 2279622 2292848 2303381 2310759 2314180 2313533 2310087 2305474 2300076 2293090 2284143 2274139 2264362 2255421
61472 2255421 2247356 2240319 2234840 2231773 2232148 2236524 2244249 2253931 2265257 2280086 2301153 2329734 2365004
61459 2365004 2405606 2451350 2503298 2562699 2630254 2706090 2789952 2881509 2981065 3090409 3212504
61448 3212504 3349687 3502107 3668381 3847809 4041329 4250133 4474121 4712383 4964545
61439 4964545 5230502 5508615 5794649 6082254 6363580 6629178 6868437 7071393 7230762
61430 7230762 7342565 7405431 7419786 7387738 7313427 7203071 7063971 6902769 6724548 6533798
61420 6533798 6335945 6137232 5942989 5756543 5579873 5414795 5263329 5127407 5008469
61411 5008469 4906817 4821174 4749471 4690557 4644835 4613043 4594944 4589524 4595951 4613659 4641751
61400 4641751 4678892 4723764 4775404 4833259 4897074 4966392 5039802 5115013 5189997 5263836 5336236
61389 5336236 5406742 5474991 5541360 5606657 5671251 5735025 5798062 5860716 5922895 5983729 6042120
61378 6042120 6097313 6148895 6196592 6240266 6279826 6314923 6344836 6368816 6386523 6397970 6403048
61367 6403048 6401334 6392680 6378033 6359181 6337286 6311954 6282323 6248937 6213926 6179317 6145879 6113704
61355 6113704 6083125 6054633 6028481 6004818 5983776 5965122 5948383 5933630 5921384 5911177 5900866
61344 5900866 5888179 5872676 5855609 5838186 5820630 5802627 5784137 5765950 5749915 5738371 5733048
61333 5733048 5734976 5745797 5768250 5804505 5854732 5918422 5996759 6092606 6208405 6345116 6502973
61322 6502973 6682046 6881983 7102301 7343049 7604096 7883348 8176408 8478021 8782780
61313 8782780 9084062 9373282 9640893 9877729 10075402 10226657 10326546 10373359 10368252 10314272
61303 10314272 10215644 10077115 9903275 9698452 9467068 9213559 8942026 8656687 8362572
61294 8362572 8064793 7766874 7470650 7178099 6892456 6617254 6355310 6109074 5880783
61285 5880783 5671283 5479484 5303939 5144456 5001422 4874324 4762160 4664916 4583381 4517508
61275 4517508 4466092 4428194 4403869 4392952 4393890 4404384 4422937 4449307 4483574 4525063 4572257 4623638
61263 4623638 4678458 4736459 4796781 4857431 4916144 4971702 5024212 5074233 5121912 5166912 5208754
61252 5208754 5246935 5280776 5309441 5332339 5349486 5361147 5366965 5365680 5356120 5338374 5313721 5283537
61240 5283537 5248627 5209335 5165685 5117505 5065101 5009797 4953037 4894855 4834119 4770568 4705624
61229 4705624 4640645 4575503 4510044 4446263 4387563 4335742 4289693 4247267 4207592 4171266 4139082
61218 4139082 4111072 4086340 4063284 4040191 4016127 3991290 3966264 3940996 3914802 3887513 3860431
61207 3860431 3835793 3815116 3798092 3783212 3769436 3757250 3748320 3744388 3746425 3754531 3768675 3789718
61195 3789718 3819643 3860423 3912719 3976102 4050444 4136446 4234533 4343780 4462252 4587939 4718809
61184 4718809 4852092 4983905 5109468 5223307 5319405 5391679 5434860 5445348 5421654 5364348
61174 5364348 5275733 5159616 5021318 4867259 4703679 4535337 4365366 4196071 4029460 3867245
61164 3867245 3711083 3562944 3424760 3297591 3181565 3076548 2982217 2897460 2820542 2750188
61154 2750188 2685964 2627505 2574221 2526063 2483763 2447821 2417896 2393533 2374724 2361343 2352912
61143 2352912 2349500 2351809 2359507 2370443 2382654 2396281 2412025 2428142 2440785 2447616 2449771 2449818 2448778
61130 2448778 2445712 2439407 2429737 2417675 2404390 2390100 2373640 2353411 2328933 2301380 2272655 2244200
61118 2244200 2216518 2189310 2162002 2134399 2106783 2079198 2051032 2021799 1992004 1962431 1932770
61107 1932770 1901785 1868956 1835011 1800578 1765185 1728268 1690692 1654553 1621600 1592271 1566048
61096 1566048 1542077 1519255 1496177 1471572 1445001 1417028 1388519 1359754 1330331 1299922 1268898
61085 1268898 1238145 1208436 1180070 1152965 1127063 1102842 1081403 1063745 1049885 1038958 1030238
61074 1030238 1023643 1019174 1016443 1014996 1014574 1014772 1015073 1015781 1018450 1024694 1034606 1046671 1058998 1070438
61060 1070438 1081043 1091944 1104469 1118868 1134113 1149197 1164190 1179610 1195358 1210854 1225744
61049 1225744 1239751 1252202 1262343 1269944 1275082 1277644 1277514 1274856 1269750 1262136 1252727 1243231 1234788
61036 1234788 1226698 1217595 1207318 1196725 1186298 1176220 1167285 1160251 1154377 1148022 1140830 1134181 1129309
61023 1129309 1126003 1123235 1119991 1115406 1109250 1102671 1097538 1094764 1093834 1093774 1093631 1092271 1089109 1085196 1082368
61008 1082368 1081103 1080273 1079059 1077749 1076518 1074992 1073485 1073255 1074908 1077872 1081992 1088206 1096736 1105998
60994 1105998 1114407 1122329 1131133 1141193 1151860 1162715 1173902 1185744 1198848 1214068 1231741 1251521
60982 1251521 1273318 1297506 1323639 1350083 1375781 1401499 1428517 1457157 1487503 1520435 1556586
60971 1556586 1595108 1634990 1677099 1723515 1775020 1830411 1888137 1947704 2009749 2075824 2147987
60960 2147987 2227549 2314012 2405718 2501504 2601482 2706659 2818226 2936832 3062242 3194261
60950 3194261 3333998 3483101 3641439 3807151 3979935 4162957 4360491 4575119 4808692
60941 4808692 5064466 5346154 5655662 5993785 6363070 6769171 7220682 7729127 8307551
60932 8307551 8966981 9715518 10563070 11525404 12621547 13870643 15296189 16930576 18808750
60923 18808750 20959382 23409338 26185098 29269555 32518138 35619963 38189695 39955909
60915 39955909 40897786 41219644 41209769 41122237 41145757 41394849 41851468 42301587 42379343 41741160
60905 41741160 40247461 38010164 35291955 32365438 29433576 26622283 24000190 21595820
60897 21595820 19412070 17440705 15671659 14095620 12704292 11489565 10439873 9536811
60889 9536811 8757308 8079668 7486686 6964210 6499593 6082252 5704163 5359298 5043554
60880 5043554 4755033 4493003 4256218 4042681 3850224 3675883 3515211 3363678 3218668
60871 3218668 3079142 2944203 2813641 2689168 2572888 2464493 2361805 2263969 2172053 2086303
60861 2086303 2005072 1927231 1853659 1785327 1721513 1660964 1603426 1548980 1497220 1448260 1403383
60850 1403383 1363416 1327276 1293158 1260345 1229023 1199295 1171480 1146369 1123884 1102314 1080250
60839 1080250 1058655 1039572 1023384 1008902 995847 985386 977965 972143 966195 959889 954182 950028
60827 950028 947946 948001 949575 951558 953277 955071 957797 962025 967706 974225 980560 985684 989055 990702 991018
60812 991018 990595 989992 989234 987762 985178 981825 978195 974172 969422 964215 959117 954111 948852 943671 939486
60797 939486 936718 935103 934567 935429 937694 941176 946573 955415 968424 984608 1002292 1020286 1037740
60784 1037740 1053891 1068632 1082641 1096352 1109536 1122342 1135728 1149944 1163528 1174996 1184800
60773 1184800 1194306 1203334 1210351 1214980 1218739 1222846 1226750 1229545 1231837 1235269 1240759 1247861 1255399 1261986
60759 1261986 1266328 1267928 1267738 1267701 1269287 1272385 1275506 1276966 1275938 1272575 1267445 1261220 1254768 1248781 1242815
60744 1242815 1235254 1224939 1212540 1199602 1186693 1173470 1160274 1148188 1137258 1126077 1113984
60733 1113984 1102676 1094601 1090365 1088603 1087910 1087910 1088757 1090634 1093828 1098551 1104458 1110810 1117194 1123874 1131531
60718 1131531 1141011 1152946 1167079 1182124 1196944 1211838 1228141 1246594 1266667 1287403 1308215
60707 1308215 1328720 1348464 1367256 1385339 1402836 1419249 1433877 1446660 1458352 1469741 1480782
60696 1480782 1490572 1498199 1503519 1506937 1508701 1508980 1508642 1509038 1510407 1511178 1509785 1506807 1504252 1502771 1500700
60681 1500700 1496207 1489512 1482413 1476232 1470803 1465052 1457982 1449217 1439080 1428290 1417496 1407119 1397405
60668 1397405 1388244 1379089 1369618 1360463 1352607 1345948 1339321 1332377 1326685 1324173 1324910 1327131 1329157 1330565
60654 1330565 1331677 1332790 1334069 1335527 1336724 1336798 1335232 1332511 1329813 1327921 1326524 1324680 1322009 1319074
60640 1319074 1316347 1313208 1308734 1303333 1298640 1295437 1292576 1288463 1282807 1276227 1268946 1260910 1252631 1244708
60626 1244708 1236685 1227423 1216475 1204177 1190660 1175984 1161111 1147290 1134249 1120330 1104892 1089206
60614 1089206 1074373 1059753 1044470 1029303 1015830 1004576 995241 987972 982977 979466 976463 974398
60602 974398 974353 975982 977842 979854 983687 990221 998210 1006205 1014270 1022765 1030819 1037531 1043821 1051439 1060424
60587 1060424 1068934 1075679 1081301 1087150 1093633 1100129 1105850 1110434 1114186 1117993 1122709 1128511 1135055 1142127
60573 1142127 1149765 1158000 1167144 1178132 1191699 1207029 1221990 1235118 1246904 1258898 1272219 1287254
60561 1287254 1304097 1322598 1342393 1363504 1386571 1411694 1437188 1460476 1480577 1499170 1518663
60550 1518663 1539416 1559342 1576185 1589473 1599869 1607074 1609347 1605364 1595744 1582088 1565019 1544135
60538 1544135 1519658 1492979 1465358 1437160 1408949 1382341 1358803 1338178 1319300 1301784 1286304
60527 1286304 1273450 1263355 1256284 1252401 1250713 1249408 1247773 1246817 1247344 1248374 1248499 1248103 1248859 1251232 1253792
60512 1253792 1255276 1256112 1257371 1259326 1261912 1265821 1271825 1279300 1286644 1293320 1300410 1308833 1318009 1326933
60498 1326933 1335707 1345074 1354982 1364675 1373952 1383319 1392889 1402115 1410877 1419947 1429999 1440983 1452974
60485 1452974 1466814 1483200 1501825 1522355 1545831 1573909 1606804 1643107 1681782 1723119 1766916
60474 1766916 1810465 1849391 1880306 1901966 1914071 1916068 1907746 1890432 1866834 1839640 1810741 1781903
60462 1781903 1755601 1734462 1719719 1710566 1705342 1703332 1705225 1711876 1722901 1736690 1751769 1767993
60450 1767993 1786370 1807952 1833097 1861750 1893998 1930063 1970053 2014269 2063829 2120621 2186453
60439 2186453 2262518 2349768 2449401 2562531 2689533 2830009 2983388 3149396 3328279 3521092
60429 3521092 3729846 3956950 4204444 4474098 4768302 5090228 5442295 5823704 6228351
60420 6228351 6643546 7049651 7421431 7731691 7955925 8075803 8080929 7970106 7752471 7446621
60410 7446621 7076448 6665668 6234511 5799410 5373479 4966199 4583303 4227904 3901853
60401 3901853 3605847 3338950 3098991 2883753 2691582 2520985 2370075 2236349 2116784
60392 2116784 2008479 1909786 1820669 1741447 1671315 1608568 1551899 1500604 1453727 1410164 1369856
60381 1369856 1333744 1302018 1273300 1246221 1220973 1198379 1178136 1159028 1140620 1123649 1108675
60370 1108675 1095069 1081521 1067158 1052263 1038347 1027272 1019585 1013779 1007724 1000679 993162 985132
60358 985132 975631 964839 955442 950752 951543 955349 958836 960317 960130 959492 959553 961079 964199 968247 972307
60343 972307 976229 980917 987302 995108 1002926 1009603 1015428 1021910 1030361 1040568 1050808 1059430 1066544 1073785
60329 1073785 1082155 1090633 1097439 1102193 1105951 1109343 1111774 1112622 1112204 1111085 1109302 1106843 1104316 1102497
60315 1102497 1101552 1101053 1100381 1098897 1096269 1093002 1090190 1088490 1087864 1088395 1090421 1093505 1096292 1098129 1100044
60300 1100044 1103344 1107970 1113000 1118096 1123575 1129692 1136680 1144949 1154467 1164542 1174937 1186378 1199099
60287 1199099 1211905 1223852 1235821 1248921 1262217 1273734 1282989 1290527 1295562 1296478 1293727 1289941 1286744
60274 1286744 1283455 1279458 1275733 1273262 1271890 1271832 1274402 1279781 1285538 1288923 1289619 1288890 1287171 1284025 1279696
60259 1279696 1275035 1270192 1264628 1258193 1251163 1243609 1235753 1228635 1223384 1219948 1217306 1214679 1211895 1209059
60245 1209059 1206761 1206124 1207601 1209948 1211410 1211817 1212608 1214875 1218235 1221629 1224359 1226216 1227260 1227625 1227126
60230 1227126 1225244 1222084 1219063 1217715 1217772 1217362 1215456 1213392 1213505 1216761 1222350 1229325 1237904 1248805 1261719
60215 1261719 1275107 1287683 1299538 1311339 1322883 1333401 1343196 1353901 1366674 1380889 1395154
60204 1395154 1408994 1423061 1438275 1455277 1474207 1494529 1515632 1538109 1563747 1593616 1626859
60193 1626859 1662097 1699409 1739926 1784093 1831553 1882675 1939026 2002057 2071996 2148213 2230193
60182 2230193 2318157 2413169 2516607 2629084 2750017 2878527 3014333 3157211 3306059 3459325
60172 3459325 3616015 3775325 3935272 4092598 4244172 4387836 4521806 4644051 4752614
60163 4752614 4846128 4923756 4984948 5029368 5056851 5067498 5062160 5042859 5012516 4974366 4931703
60152 4931703 4887740 4845242 4806480 4773708 4749112 4733882 4728109 4732400 4749034 4780434 4826891 4887008
60140 4887008 4960345 5048363 5152361 5271421 5402734 5543175 5690034 5840813 5992907 6143244
60130 6143244 6287918 6422482 6542910 6646206 6730165 6793030 6833656 6851716 6847472 6821493 6774838
60119 6774838 6709552 6628784 6536265 6435555 6329941 6223120 6119509 6023293 5937263 5863181
60109 5863181 5802984 5758731 5731390 5720911 5727751 5753079 5796904 5857186 5931394 6017566 6112892
60098 6112892 6212676 6312217 6408726 6500102 6583174 6655145 6715996 6767184 6808248 6836752 6851634
60087 6851634 6854762 6849207 6837957 6824658 6813672 6808621 6812127 6827201 6857425 6905359 6972314 7060025
60075 7060025 7170900 7306089 7464887 7646721 7852341 8082752 8338846 8622797 8937722
60066 8937722 9284476 9660129 10060610 10483318 10925963 11384638 11854688 12331804 12810061
60057 12810061 13279889 13730393 14153431 14543588 14894610 15198095 15446199 15634106 15759522
60048 15759522 15821072 15817855 15749775 15617829 15424583 15174589 14874179 14531162 14155114 13757320
60038 13757320 13349331 12941285 12541652 12157757 11795808 11461136 11159318 10896266 10675721
60029 10675721 10496985 10356468 10251539 10181703 10146271 10142500 10166479 10214463 10282433 10365120 10456215
60018 10456215 10549174 10637449 10714556 10774763 10813992 10830092 10822351 10790689 10735040 10655478 10552868
60007 10552868 10428884 10285056 10122239 9941525 9745179 9536151 9317304 9092014 8864943
59998 8864943 8640919 8423196 8213958 8016362 7834561 7671331 7527107 7402088 7298086
59989 7298086 7217304 7160190 7125686 7113141 7122842 7154928 7208909 7284327 7380785 7496705 7628602
59978 7628602 7772022 7922684 8076177 8227021 8368968 8496460 8605333 8692147 8753747 8788015
59968 8788015 8794399 8772959 8723353 8645596 8541486 8414361 8267739 8105335 7932167 7754039
59958 7754039 7575466 7399494 7229955 7072099 6929770 6803486 6692918 6600152 6528683 6480060
59948 6480060 6453709 6449644 6469035 6511930 6576735 6662836 6771881 6905261 7061695 7238427 7433480
59937 7433480 7645114 7869748 8101881 8335843 8566310 8787185 8991247 9171506 9322609
59928 9322609 9441014 9524497 9571804 9582401 9556304 9494278 9398336 9271973 9120009 8948274
59918 8948274 8763315 8572035 8381237 8197086 8024688 7868090 7730721 7615522 7524321 7457338
59908 7457338 7413962 7394201 7398939 7428632 7482122 7556772 7649394 7757078 7877856 8010841 8155098
59897 8155098 8307939 8464682 8620412 8771639 8916038 9051433 9175945 9288843 9390395
59888 9390395 9480775 9559701 9627286 9684858 9735015 9781394 9828504 9881152 9943487 10018796 10110570
59877 10110570 10223656 10363876 10536237 10743496 10986334 11264575 11578048 11926547 12309468
59868 12309468 12725417 13171427 13641822 14127637 14617184 15096989 15552129 15966408 16323360
59859 16323360 16607881 16807450 16912996 16920229 16830809 16651635 16392265 16063026 15675522 15243949
59849 15243949 14784474 14312601 13840865 13378664 12933694 12513346 12124860 11774208 11464791
59840 11464791 11197341 10971368 10786705 10643664 10542118 10480991 10458658 10473357 10522920 10604399
59830 10604399 10714182 10848117 11001147 11166885 11337925 11506405 11663786 11800175 11904833
59821 11904833 11968291 11984228 11949331 11861944 11721526 11529233 11288455 11004776 10685928 10341486
59811 10341486 9981355 9613729 9244659 8879531 8524033 8183166 7860096 7556884 7275904
59802 7275904 7019612 6789001 6583087 6399948 6237688 6094412 5968017 5856367 5757405 5668978
59792 5668978 5588823 5514760 5444813 5377493 5312364 5250057 5191234 5135767 5083385 5034630 4990333
59781 4990333 4950331 4913515 4878771 4844762 4809001 4768851 4724065 4676991 4629488 4580831 4529748
59770 4529748 4477363 4426412 4377955 4330561 4282950 4236024 4191768 4151447 4115897 4086874 4066683
59759 4066683 4056128 4053420 4055532 4060542 4068653 4081395 4100262 4126104 4159370 4200543 4250191 4308569
59747 4308569 4375099 4448284 4526341 4607913 4691849 4776302 4858680 4936923 5010355 5078772 5141201
59736 5141201 5196531 5245097 5288541 5328053 5363934 5397431 5431889 5471202 5517698 5572341 5636492
59725 5636492 5712603 5803502 5911852 6040107 6190161 6363013 6559542 6781600 7031630 7311279
59715 7311279 7621264 7962731 8337430 8745283 9181775 9637924 10101821 10558382 10986947
59706 10986947 11360541 11650295 11833481 11899989 11853631 11709041 11487197 11211331 10903580 10582792
59696 10582792 10263956 9958579 9674810 9417453 9188922 8990880 8824850 8691578 8590854
59687 8590854 8522535 8486979 8483762 8510548 8564165 8642719 8746057 8874458 9027819 9206220 9410489
59676 9410489 9641813 9901207 10189555 10507858 10857237 11239017 11654962 12107297 12598336
59667 12598336 13130199 13704750 14323508 14987617 15698026 16455461 17259787 18109329 19000868
59658 19000868 19929798 20889574 21870874 22861709 23848561 24817784 25757247 26658568 27518759
59649 27518759 28339683 29125926 29883317 30618813 31340168 32054628 32767532 33481267 34193987
59640 34193987 34898748 35584661 36239401 36850274 37403419 37884260 38280549 38584920 38794471
59631 38794471 38909658 38935391 38882417 38765652 38600957 38404445 38194029 37989117 37807750 37665068
59621 37665068 37574612 37549248 37599732 37733804 37958020 38279438 38703907 39233069 39864229 40592653
59611 40592653 41412202 42313212 43280528 44293404 45325690 46345145 47313320 48187438 48923217
59602 48923217 49477229 49809637 49888682 49696141 49230846 48508351 47557321 46414802 45122287
59593 45122287 43723079 42260134 40773483 39297448 37858919 36477341 35165499 33929347
59585 33929347 32766427 31664511 30602701 29555522 28498335 27412127 26287141 25125105
59577 25125105 23938738 22747499 21571527 20427573 19328327 18282978 17297105 16372925
59569 16372925 15511083 14712317 13976845 13302687 12685816 12122174 11608760 11142665 10719993
59560 10719993 10336303 9987779 9671627 9385639 9127524 8894450 8683249 8491380 8317506
59551 8317506 8160513 8018035 7886585 7763003 7644889 7529516 7413540 7294612 7172505
59542 7172505 7047858 6920379 6789229 6654808 6519072 6383952 6250269 6118480 5989890
59533 5989890 5866688 5751088 5644660 5548276 5462257 5386566 5321122 5266130 5222040 5188909 5165730
59522 5165730 5150640 5142101 5139865 5144714 5157474 5178373 5206859 5241554 5280660 5323046 5368808 5418307
59510 5418307 5471057 5526339 5584643 5647457 5715639 5789061 5867954 5953477 6046751 6148556 6260374
59499 6260374 6384334 6521341 6670522 6831545 7006315 7197247 7404956 7629060 7870153
59490 7870153 8129184 8405527 8697666 9005535 9330103 9670335 10022316 10381767 10745559
59481 10745559 11110033 11469664 11818817 12153646 12470679 12764119 13026185 13250520 13434923
59472 13434923 13581261 13693563 13775905 13830955 13859975 13864446 13847744 13815061 13771841 13722719 13672034
59461 13672034 13625071 13588486 13569431 13574168 13607434 13672767 13772645 13907417 14073920 14265551 14473845
59450 14473845 14689515 14901811 15097654 15262413 15382163 15445569 15444330 15372830 15228100 15010314
59440 15010314 14723084 14373046 13969278 13523285 13048870 12560507 12070566 11587873 11118992
59431 11118992 10670193 10247551 9855622 9497055 9173471 8885887 8634189 8417091 8233150
59422 8233150 8081464 7961212 7870991 7808955 7773426 7763330 7778436 7819271 7886495 7980113 8099382
59411 8099382 8243213 8410307 8598985 8807288 9033035 9273300 9523971 9780263 10037265
59402 10037265 10289145 10528045 10744815 10930982 11079342 11182890 11234833 11230614 11169404 11053231
59392 11053231 10885427 10670376 10413849 10122687 9804402 9467208 9119374 8767476 8415690
59383 8415690 8067522 7727664 7401109 7090729 6796826 6519213 6258902 6017501 5795682
59374 5795682 5592703 5407021 5237026 5081465 4939692 4811677 4697623 4597441 4510558 4436203
59364 4436203 4373717 4322322 4280599 4246713 4219633 4199944 4188861 4186365 4190846 4200767 4216301 4238993
59352 4238993 4269836 4307442 4347577 4384584 4414212 4436027 4453374 4470932 4492276 4519413 4553892
59341 4553892 4597827 4653667 4722663 4803062 4889817 4976942 5061056 5143158 5227419 5318659 5420721
59330 5420721 5536332 5667652 5816578 5984479 6171787 6378416 6604978 6853326 7125708
59321 7125708 7424007 7750400 8108030 8499872 8927200 9390300 9890759 10431834 11016215
59312 11016215 11643976 12312523 13017256 13751899 14509112 15281061 16058511 16829274 17579095
59303 17579095 18295175 18968602 19593704 20166823 20686665 21154440 21571955 21939704 22257501
59294 22257501 22526069 22746605 22918542 23038211 23099533 23095702 23020844 22870897 22643087 22334906
59284 22334906 21944883 21475170 20932922 20328590 19673358 18978275 18254294 17511649 16759557
59275 16759557 16007391 15265460 14543430 13848154 13183802 12553648 11960625 11406496 10891716
59266 10891716 10416296 9980007 9581766 9219660 8891778 8596546 8332325 8097271 7889575
59257 7889575 7707309 7548086 7409415 7289503 7187457 7102720 7034499 6981484 6941994 6914684
59247 6914684 6899203 6895571 6902768 6918768 6942297 6973587 7012613 7057388 7104942 7153367 7201917 7249621
59235 7249621 7295046 7337369 7376695 7413140 7446305 7475927 7502847 7529313 7558128 7590976 7627593
59224 7627593 7667505 7712762 7767806 7836134 7918307 8013670 8122019 8241783 8368006 8494686
59214 8494686 8619166 8742588 8866195 8988854 9108125 9221648 9326472 9418137 9491475 9542311
59204 9542311 9568453 9569559 9546219 9499128 9429591 9340979 9238505 9126646 9007667 8883652 8758754
59193 8758754 8637760 8523123 8415143 8314370 8221789 8136919 8057969 7984210 7916379 7854541
59183 7854541 7797405 7744090 7694647 7648266 7602972 7558069 7515401 7477271 7444555 7417910 7399355
59172 7399355 7391326 7395103 7411451 7442123 7489722 7556663 7645241 7758187 7898285 8067583 8267444
59161 8267444 8498835 8762157 9057406 9384884 9744916 10136024 10553573 10990272 11437097
59152 11437097 11883139 12315336 12719262 13080291 13384325 13618558 13772371 13837507 13808029 13681676
59142 13681676 13461851 13157309 12779406 12340475 11854688 11338066 10805649 10269084 9737719
59133 9737719 9220673 8726009 8258385 7819269 7409638 7031264 6685183 6370146 6083329
59124 6083329 5822244 5585583 5372464 5181153 5008812 4852649 4711242 4584379 4471677
59115 4471677 4371977 4284174 4207871 4142823 4088194 4042645 4004675 3972824 3946308 3925756 3912515
59104 3912515 3906761 3906989 3911921 3922159 3939127 3962845 3991526 4023334 4058100 4097350 4142797 4194704
59092 4194704 4251844 4313380 4380199 4453338 4531384 4610915 4689809 4768602 4848004 4926681 5002577
59081 5002577 5075070 5144180 5208545 5265864 5315114 5356864 5391416 5417842 5435095 5443254 5443555 5437931
59069 5437931 5428667 5417902 5407184 5397594 5390157 5385909 5385878 5391310 5403566 5423621 5452067 5489734 5537568
59056 5537568 5595630 5663059 5739535 5825927 5922926 6030019 6146714 6273842 6412460 6562188
59046 6562188 6721927 6891766 7072870 7265756 7469936 7685070 7911017 8146490 8388694
59037 8388694 8634359 8880004 9120779 9350000 9560265 9744438 9895390 10005798 10069085 10080595
59027 10080595 10038008 9941473 9793887 9600676 9368740 9105293 8817383 8511756 8194608 7871241
59017 7871241 7545916 7222152 6903402 6593406 6295402 6010810 5739330 5480758 5236116
59008 5236116 5006443 4791156 4588653 4398240 4220453 4055525 3902548 3760334 3628242
58999 3628242 3505714 3391592 3284425 3183225 3087721 2998004 2914125 2835982 2763464 2696524
58989 2696524 2634662 2576391 2520000 2465328 2414177 2368216 2326944 2288417 2251405 2215729 2180885
58978 2180885 2145825 2110445 2076139 2044440 2015969 1990932 1969484 1950911 1933488 1916240 1900340
58967 1900340 1887845 1879357 1873752 1869804 1867051 1865106 1863242 1861043 1858856 1857269 1856643 1857337 1859682 1863306
58953 1863306 1867043 1869997 1872303 1874488 1876841 1880122 1886099 1895997 1908488 1920500 1930157 1937869 1944498
58940 1944498 1950046 1954837 1960401 1967875 1976482 1984833 1992890 2001197 2009005 2015125 2020490 2027984 2039315 2053447
58926 2053447 2068463 2083569 2098677 2113378 2127371 2141184 2155686 2171254 2187725 2204700 2221749
58915 2221749 2238968 2257419 2278236 2301223 2325239 2349952 2376058 2403772 2432574 2462902 2496468
58904 2496468 2533994 2573862 2614035 2654258 2695375 2737584 2780590 2824676 2870311 2917250 2965199
58893 2965199 3015007 3068070 3124752 3184262 3245911 3309840 3376872 3448334 3525574 3608853 3696912
58882 3696912 3788267 3882659 3980896 4083942 4192794 4308656 4432370 4564004 4703640 4852188
58872 4852188 5010951 5180809 5362292 5555806 5761385 5979112 6210427 6458195 6724699
58863 6724699 7010338 7315007 7639833 7986579 8356335 8750109 9170144 9619435 10100171
58854 10100171 10613451 11160011 11740478 12355713 13007701 13699095 14430536 15199077 16000202
58845 16000202 16830120 17684232 18554021 19427290 20290896 21131058 21930856 22669482 23324918
58836 23324918 23876839 24307626 24602985 24753061 24752962 24602744 24308216 23881692 23340351 22702963
58826 22702963 21988186 21214865 20401697 19565650 18721417 17882262 17059942 16263201 15497297
58817 15497297 14765488 14070239 13412968 12793765 12212059 11666972 11156770 10678754 10230212
58808 10230212 9809222 9414572 9045497 8701501 8381760 8084603 7807984 7550355 7310634
58799 7310634 7087672 6880474 6688615 6511710 6348875 6199502 6064062 5943024 5835329
58790 5835329 5739123 5653769 5579905 5517714 5466509 5426012 5396667 5378422 5370443 5372306 5384424 5406940
58778 5406940 5439239 5480832 5531855 5592408 5662240 5741319 5830023 5928706 6037896 6158853 6293032
58767 6293032 6440934 6602393 6777867 6968385 7174183 7394691 7630295 7883265 8156616
58758 8156616 8452671 8772801 9117742 9488014 9884653 10309639 10765345 11254091 11778792
58749 11778792 12342844 12947851 13592105 14272995 14990297 15744861 16533815 17348919 18179617
58740 18179617 19015424 19844479 20651720 21419605 22129279 22760253 23290939 23701671 23977543
58731 23977543 24108603 24089333 23919748 23606692 23162929 22604660 21949473 21215280 20419990
58722 20419990 19581867 18719405 17849393 16984592 16133927 15304802 14504038 13736744 13005981
58713 13005981 12314006 11662352 11050201 10474406 9932243 9423147 8947099 8502715 8087910
58704 8087910 7701146 7340859 7004661 6690378 6397071 6123907 5868734 5629042 5403893
58695 5403893 5193770 4998705 4817482 4648600 4491243 4345245 4210535 4086619 3972362
58686 3972362 3866283 3767094 3673814 3585763 3502946 3426132 3355716 3290610 3229061 3170264 3114262
58675 3114262 3060706 3009091 2960057 2914800 2872969 2832737 2793208 2755092 2718478 2681805 2644125
58664 2644125 2606877 2572038 2539389 2506645 2471481 2432595 2389676 2343488 2295484 2246671 2197284
58653 2197284 2147792 2099147 2051502 2003937 1956426 1911042 1869958 1832845 1797329 1761707 1726359
58642 1726359 1692640 1661182 1631381 1602314 1574092 1547994 1524847 1503651 1482627 1461250 1440146
58631 1440146 1419313 1397970 1376188 1355105 1335287 1316439 1299016 1284352 1272503 1261667 1250612
58620 1250612 1240226 1231782 1225163 1219889 1216485 1215484 1216193 1217795 1220881 1226623 1234925 1244357 1253447 1261347
58606 1261347 1267816 1273128 1277517 1280301 1280297 1277365 1272769 1267727 1262489 1257040 1251634 1246436 1241688 1238298 1237084
58591 1237084 1237506 1238612 1240989 1245922 1252772 1259640 1266878 1277125 1290959 1305375 1318188 1331481 1348739
58578 1348739 1370548 1395198 1421825 1450784 1482030 1515083 1549894 1586544 1625032 1666237 1711667
58567 1711667 1761459 1814493 1871413 1935135 2006786 2083572 2162693 2245172 2333607 2428593 2530322
58556 2530322 2641660 2765944 2902784 3049434 3205843 3375103 3559061 3756368 3965109
58547 3965109 4184663 4414398 4652552 4896839 5144426 5390682 5628931 5851413 6049773
58538 6049773 6215516 6341722 6424242 6460568 6448796 6389214 6285833 6144653 5971422 5772624
58528 5772624 5556924 5332846 5105538 4877880 4653832 4438192 4233719 4041228 3862166
58519 3862166 3698471 3549984 3414566 3290914 3178992 3077694 2984668 2898943 2821458 2752256
58509 2752256 2689032 2629160 2571594 2516277 2463121 2412023 2362652 2313982 2265202 2217158 2171753
58498 2171753 2129839 2090692 2053088 2015791 1977673 1938949 1901645 1867101 1833555 1798114 1760613
58487 1760613 1723368 1687409 1651319 1614083 1577076 1542673 1512334 1486103 1462584 1439484 1415727
58476 1415727 1392963 1373546 1357383 1342306 1326965 1311430 1295477 1278720 1262444 1248960 1238739
58465 1238739 1230073 1221770 1214302 1207983 1201985 1195658 1189299 1183170 1177061 1170917 1164681 1157762 1149943 1142245
58451 1142245 1135261 1127376 1116740 1104419 1093213 1083704 1074084 1063741 1054253 1046480 1039363 1032251 1026014
58438 1026014 1021078 1016498 1011793 1007726 1004555 1001321 997587 994161 991592 989576 988197 987964 988246 987519 985509
58423 985509 983310 981200 978366 975068 972811 971869 970773 968815 966919 965396 963014 959219 955288 952389
58409 952389 950262 948515 947355 946345 944441 942074 941189 942209 942921 941534 939099 937672 937664 938331 939582 941946
58393 941946 945527 949917 954551 958800 962539 966634 971835 977312 981573 984562 987253 989461 990017 989094 988242
58378 988242 987932 987073 985087 982387 978688 973173 966740 961681 958513 955356 951129 947192 945010 944182 943565
58363 943565 942526 940504 937288 934310 933772 935965 939234 942760 947128 952035 956014 959022 962700 967418
58349 967418 971653 975148 979973 987460 996544 1006228 1017157 1029559 1042086 1053997 1066201 1078897 1090577
58336 1090577 1100658 1110758 1121877 1132688 1142139 1151505 1162010 1172417 1180793 1187041 1192034 1195776
58324 1195776 1198017 1199357 1200360 1200751 1200522 1200506 1201024 1201378 1201449 1202219 1204006 1205850 1207394 1209733 1213634 1218416
58308 1218416 1223156 1227580 1231573 1235457 1240748 1248703 1258292 1267704 1277455 1289395 1302960 1315511 1326295
58295 1326295 1336833 1347312 1356147 1363417 1371079 1379253 1386046 1391635 1398530 1406927 1414040 1419143 1424898
58282 1424898 1432139 1437837 1440449 1443014 1448366 1455035 1460609 1465730 1472068 1479417 1487346 1496863 1508133 1519471
58268 1519471 1530689 1544481 1562370 1582280 1602108 1622536 1644359 1666388 1688163 1711421 1736703
58257 1736703 1761818 1785804 1810918 1838513 1866464 1892934 1919072 1945765 1971472 1995665 2020554
58246 2020554 2046953 2072409 2095949 2120619 2148644 2178252 2208085 2240238 2275693 2311196 2344215
58235 2344215 2376885 2411652 2447284 2482746 2520521 2562153 2604811 2646386 2689672 2737233 2786480
58224 2786480 2834538 2883932 2938545 2997444 3057473 3118586 3182221 3247791 3315280 3387972 3468283
58213 3468283 3554075 3642816 3735604 3833425 3933934 4036101 4143481 4258537 4378538 4501649
58203 4501649 4631887 4772835 4921625 5074767 5234950 5406150 5586868 5774253 5970090
58194 5970090 6176363 6389666 6606689 6830813 7066725 7312852 7565687 7827282 8101990
58185 8101990 8390243 8691980 9011586 9352885 9713929 10092948 10494237 10922006 11374506
58176 11374506 11850931 12357518 12899459 13473776 14078036 14718880 15403478 16130190 16896722
58167 16896722 17709515 18575108 19490387 20452125 21468193 22548353 23692774 24901857 26188698
58158 26188698 27568802 29046138 30622761 32312893 34132862 36086793 38178149 40426132
58150 40426132 42854811 45477152 48308558 51386487 54758908 58466615 62559619 67120381
58142 67120381 72248609 78034750 84570683 91971735 100365194 109880866 120688776 133025814
58134 133025814 147140607 163217073 181373877 201711585 224356394 249564175 277825093
58127 277825093 309550693 344057247 378478439 407887609 427107324 433042208 425791656
58120 425791656 407971897 383174607 354745006 325257253 296424478 269192411 243951993
58113 243951993 220799366 199730878 180737096 163831059 149035119 136344861 125708405
58106 125708405 117034113 110196896 105028466 101301236 98688039 96692425 94649384 91912379
58098 91912379 88141591 83430642 78147756 72668874 67242773 62011625 57056898 52412649
58090 52412649 48084460 44079524 40408935 37068624 34041675 31317109 28886367 26724473
58082 26724473 24794546 23069614 21533072 20160590 18919730 17787326 16752324 15802493
58074 15802493 14922682 14105199 13348064 12643238 11978785 11351698 10766500 10221908 9710258
58065 9710258 9228981 8781054 8364491 7972392 7603101 7259577 6938535 6630498 6331301
58056 6331301 6044213 5770074 5504511 5246009 4998288 4763135 4538116 4322448 4118545
58047 4118545 3927006 3746173 3576888 3421747 3279687 3146906 3022684 2908627 2802985
58038 2802985 2701640 2604139 2513016 2427935 2346222 2268240 2196323 2129125 2062920 1997871 1937213
58027 1937213 1880766 1825025 1769275 1715946 1665179 1614561 1564116 1516289 1471090 1426255 1382019
58016 1382019 1340828 1302489 1264376 1226259 1190471 1157792 1127548 1100971 1079699 1061610 1042835
58005 1042835 1023196 1005127 988270 970250 951985 936849 924850 912778 899883 888286 877857
57994 877857 865806 851659 837915 825505 813115 801090 791503 784229 777416 771793 769866 770759 770551
57981 770551 768010 765396 763372 759961 755173 751845 750890 750017 748145 746870 746556 745144 742049 739427 738325
57966 738325 737066 734489 731448 728195 723622 717977 713085 709160 704516 698893 693661 688270 680115 668759
57952 668759 656883 646204 635707 624683 614266 605038 596217 587998 581632 576499 570152 562040 554257
57939 554257 548104 542952 538905 537187 537159 536222 533559 530913 529037 526707 524041 523344 525568 529043 532662
57924 532662 537051 541565 543611 542506 540947 541034 541619 541022 539589 537981 535593 532424 530211 530024 530636 530555
57908 530555 529798 528722 527062 524985 522966 519954 514001 505501 497465 491739 487243 482575 477823 472952
57894 472952 467069 460401 454605 450221 446168 442490 440798 441029 440708 438805 437532 438722 441048 442608 443817
57879 443817 445886 448526 451067 453904 457073 459117 459070 457913 456459 453411 447246 438740 430058 422347 415383
57864 415383 408548 401118 392705 384211 377259 372076 367175 361575 356036 351773 349355 349037 350529 352357
57850 352357 353369 354982 359833 368062 377144 385551 393998 402772 410613 416927 422447 426991 429349 430118
57836 430118 431720 434526 435905 434419 431992 430407 428467 424406 418474 411316 402497 392742 385179 381902
57822 381902 381086 379491 376184 372081 367840 364107 362001 361420 360503 358407 356821 357151 358263 358819 359777 362494
57806 362494 366255 369826 373826 379394 386042 392744 399654 406854 413015 417222 420479 423511 424832 423054
57792 423054 419325 415274 410291 403313 395680 389521 384533 378874 372191 365330 358160 350184 342387 336055
57778 336055 330534 324462 318324 313469 309473 304918 299981 295780 291794 286535 280286 274585 269241 262370
57764 262370 253466 244059 235160 226227 217010 208444 201075 194099 186426 177790 168713 160300 153751 149172
57750 149172 145301 141302 137959 136041 134711 133179 132850 135746 141459 147768 153837 160783 169266 178372
57736 178372 186820 193652 197919 199367 199377 199744 200701 201526 202600 205090 208917 212887 216710 221061 225559
57721 225559 228491 228817 227105 224346 221188 218306 215993 213195 208267 200865 192109 183057 174258 166499
57707 166499 160418 155281 149574 142988 136692 131707 128248 126548 126886 128601 130360 131632 132879 134339
57693 134339 135836 137904 141772 147835 154987 161736 167304 171749 175759 180340 185954 192101 198234 204571
57679 204571 211354 218081 224506 231565 239984 248591 255495 260544 265123 269902 274417 278675 283531 289356
57665 289356 295706 302521 310446 319824 330278 341256 352143 362217 371559 381646 393851 407842
57653 407842 422594 438333 455915 474851 493774 512651 532688 554131 576025 598290 622233
57642 622233 648690 677253 707654 740345 775289 811776 849944 891107 936016 984019 1034527
57631 1034527 1088240 1146390 1209693 1278409 1352732 1433042 1520649 1618098 1727601 1849176 1981390
57620 1981390 2123727 2277048 2442190 2619827 2811618 3019556 3243744 3482143 3732525
57611 3732525 3992908 4259707 4526837 4786433 5028068 5236711 5394186 5485251 5502856 5448604
57601 5448604 5330745 5162405 4958909 4733834 4497142 4256707 4019395 3789531 3568336
57592 3568336 3356891 3158646 2977407 2813909 2666142 2532378 2412097 2304511 2208254 2122869
57582 2122869 2049093 1987019 1934830 1889896 1850757 1817774 1792127 1774333 1763702 1759249 1760864 1769053
57570 1769053 1783500 1802706 1825499 1852482 1885646 1926988 1977649 2037650 2105979 2181498 2264368
57559 2264368 2356206 2458452 2570958 2692565 2822632 2961334 3108506 3262462 3419712 3575487
57549 3575487 3724576 3861730 3981343 4077183 4143245 4175291 4171649 4132913 4061486 3961287 3837130
57538 3837130 3693999 3536784 3370172 3198104 3023560 2849467 2679479 2516976 2363413
57529 2363413 2218523 2082123 1954941 1837704 1730240 1631473 1539670 1452881 1370155 1292340
57519 1292340 1220984 1156539 1098337 1045738 998080 953834 911436 871138 834703 802984 775020
57508 775020 749656 726632 705739 686352 668329 652173 637794 624425 612269 602863 596954 593166
57496 593166 589617 585836 582359 579601 578095 578906 582775 589431 598432 609787 623033 636760 650243
57483 650243 664831 682652 704373 729207 756557 786578 819376 854631 891992 931285 972493
57472 972493 1016072 1063079 1114597 1171216 1233300 1301280 1375351 1455335 1541108 1632667 1729615
57461 1729615 1831361 1938065 2050351 2167378 2286063 2403061 2516787 2626358 2728780
57452 2728780 2818055 2887088 2930243 2944712 2930666 2890568 2828057 2746974 2650827 2542511 2424601
57441 2424601 2300524 2175255 2053818 1938673 1829206 1724054 1623247 1528085 1440029 1360243
57431 1360243 1289276 1226443 1170151 1119495 1075028 1037562 1006846 981876 961906 946607 935788
57420 935788 929345 927089 928509 933316 942161 955873 973902 994752 1018270 1046196 1079929 1119080
57408 1119080 1162986 1212329 1268151 1330295 1397995 1471336 1551110 1637813 1731392 1831127 1934983
57397 1934983 2040043 2144465 2247979 2349365 2444398 2527531 2594606 2642589 2667697 2666037 2636367
57386 2636367 2580945 2503620 2408077 2297725 2176018 2046461 1912756 1778557 1646384 1517178
57376 1517178 1391707 1271733 1158810 1052570 951691 856289 767819 686574 610800 538803
57366 538803 470831 408295 352014 301751 256772 216109 178531 142800 108086 74197 41434
57355 41434 10118 -19866 -48811 -76303 -101135 -122531 -141156 -158447 -175174 -191016 -205344 -218057
57343 -218057 -229863 -241953 -255061 -268546 -280702 -290204 -297045 -302188 -306922 -312493 -319381 -326655 -333012
57330 -333012 -338692 -345302 -353321 -361084 -366996 -371525 -376048 -380855 -385551 -390470 -396322 -402997 -409871 -416796
57316 -416796 -423809 -430514 -436758 -443216 -450097 -456054 -459759 -462073 -465224 -470171 -476066 -481993 -487814 -493442
57302 -493442 -498548 -503141 -507532 -511839 -516229 -521247 -527023 -532707 -537714 -542847 -548905 -554820 -558758 -560775
57288 -560775 -562812 -566060 -569757 -572617 -574210 -574928 -575677 -577512 -580474 -583139 -584532 -586039 -589866 -595921 -602011
57273 -602011 -607031 -612033 -617866 -623632 -628102 -631086 -632713 -632692 -631027 -628429 -625508 -622580 -620537 -620610 -622812
57258 -622812 -625746 -628369 -630771 -632945 -634282 -634912 -636053 -638008 -638894 -636412 -630182 -621652 -612465 -603480 -594569
57243 -594569 -584702 -572964 -559968 -547451 -535962 -523911 -509513 -492722 -474578 -455601 -435758 -415235
57231 -415235 -394224 -372336 -349031 -324304 -298399 -271234 -242534 -212077 -179401 -143920 -105925
57220 -105925 -67103 -29565 5359 37327 66603 93710 118560 139488 154006 161013 161504 156531
57208 156531 145362 126466 99703 66721 29686 -9561 -49552 -89369 -128763 -167591 -205299 -241392
57196 -241392 -276021 -309399 -340919 -369619 -395566 -420028 -443912 -466430 -485822 -501478 -514992
57185 -514992 -528728 -543394 -557501 -569360 -579066 -588061 -597275 -606417 -614780 -621979 -628004 -633256 -638544
57172 -638544 -644442 -650697 -656666 -662085 -666867 -670611 -673026 -674440 -675062 -674135 -670764 -665230 -658493 -650827 -641943
57157 -641943 -631782 -619762 -603799 -581948 -555030 -525962 -496396 -465704 -433340 -400262 -367464
57146 -367464 -334773 -301713 -268143 -233586 -197459 -160475 -124280 -89150 -53659 -17022 20078
57134 57562 96610 137251 177283 215094 251881 289626 328418 367205 405512 442735 477253 508208
57122 508208 537036 565374 592616 617575 641650 668054 698215 730765 763642 795365 824555
57111 824555 850234 872882 893858 913679 932014 949139 966100 983515 1001312 1019398 1037310
57100 1037310 1053309 1065040 1071197 1071711 1066636 1055824 1039323 1016882 987148 948372 899622 840395
57088 840395 769400 684972 586551 474585 348856 207741 49198 -128122 -324730 -540791
57078 -540791 -777135 -1035810 -1318861 -1626253 -1956350 -2309227 -2688081 -3096190 -3533783 -3999509
57068 -3999509 -4493929 -5019999 -5581132 -6180853 -6823870 -7515874 -8262731 -9071237 -9949740
57059 -9949740 -10906273 -11946926 -13078205 -14310655 -15658471 -17136495 -18759958 -20546906
57051 -20546906 -22518664 -24698040 -27109253 -29780062 -32742877 -36034759 -39698679 -43784882
57043 -43784882 -48350119 -53457480 -59180442 -65608177 -72847597 -81024581 -90287859 -100810176
57035 -100810176 -112779836 -126385873 -141802309 -159168581 -178568067 -200021602 -223497920
57028 -223497920 -248903926 -276032367 -304531885 -333996386 -364135172 -394808275 -425757068
57021 -425757068 -456163940 -484423245 -508392393 -526005750 -535862667 -537480478 -531193016
57014 -531193016 -517880554 -498714097 -474980964 -447967832 -418860716 -388652263 -358082699
57007 -358082699 -327649036 -297686761 -268481537 -240347508 -213634980 -188680377 -165743681
57000 -165743681 -144972042 -126398927 -109965148 -95545297 -82971962 -72056602 -62606347
56993 -62606347 -54435519 -47372283 -41262049 -35968560 -31372875 -27371547 -23875484 -20809426
56985 -20809426 -18110637 -15726556 -13612861 -11732740 -10056276 -8558823 -7219197 -6019172
56977 -6019172 -4943890 -3981308 -3120226 -2348888 -1655764 -1031453 -469213 36442 491443
56968 491443 902343 1275250 1614738 1923872 2205283 2462263 2698627 2917395 3119684 3305128
56958 3305128 3473404 3625231 3761974 3884534 3992985 4087491 4169403 4240692 4302005 4352608
56948 4352608 4393896 4431925 4472402 4510024 4523851 4486696 4381464 4210022 3989191 3741035
56938 3741035 3485666 3237939 3006483 2794943 2604646 2435877 2287056 2154747 2035875
56929 2035875 1929220 1834133 1749046 1672336 1603649 1542948 1488812 1438890 1391603 1346344 1302442
56918 1302442 1259223 1216917 1176354 1137763 1100867 1066166 1035105 1008623 986208 966669 949441
56907 949441 935044 924653 919241 918847 922703 930165 941079 954968 970498 986463 1002715 1019161
56895 1019161 1034158 1044997 1050084 1049883 1045687 1038249 1027727 1014243 998240 980761 963351 947120
56883 947120 931964 917428 904130 893360 885193 878154 871289 865596 862604 862330 863710 866702 872678
56870 872678 882214 892993 900371 900080 890475 872634 848807 821003 790825 759979 730269 702933
56858 702933 678274 656087 636259 618921 604316 592698 584129 578066 573225 568248 562720 557444 553544
56845 553544 551273 549873 548545 547239 546226 545310 544191 543626 545443 550800 558885 567970 577488 588394
56831 588394 601644 617169 634485 653529 674324 696277 718272 739045 756895 769303 773815 769713
56819 769713 758565 743022 725434 707674 691480 678016 667076 657458 648530 641265 637551 638793
56807 638793 645289 656606 672173 691706 715448 744016 777779 816296 858079 900371 938943 968906
56795 968906 986762 992003 986605 973229 954247 931997 908997 887536 869348 855683 847265 844165
56783 844165 846136 853122 865303 882977 906962 938704 979026 1026672 1078854 1133255 1188574 1242930
56771 1242930 1292591 1332677 1358492 1366350 1354764 1326043 1286001 1240902 1194693 1149279 1106358
56760 1106358 1067713 1034201 1005735 982324 964213 951162 942727 939529 943307 955115 974061 998363
56748 998363 1027191 1060657 1097811 1134968 1166252 1185936 1190699 1180414 1157513 1125750 1088877 1049547
56736 1049547 1009073 968311 928674 891922 859086 830184 805143 784535 769157 759313 754714 754605
56724 754605 757760 763016 770431 781495 797305 816254 833909 845295 847349 839559 823126 800101
56712 800101 773052 744624 716575 689068 661418 633755 607604 584645 565390 549305 535551
56701 535551 523157 511232 499913 490491 483632 478063 472194 466463 462535 460604 459278 458069 457929 458877
56687 458877 459173 457796 456050 455597 456400 457693 459410 461242 461738 460116 457970 457357 457820 456976 453623 448799
56671 448799 444146 440656 438665 437631 436098 433127 429630 427236 426167 425366 424288 423197 422016 420334
56657 420334 418404 416825 415355 413401 411516 410927 411551 411953 411401 410500 409569 407951 405523 403573 403328 404477
56641 404477 405653 405650 403861 400416 396455 393539 392339 392330 392831 393643 394548 395050 394906 394374 393931 394359 396790 401497
56623 401497 406687 409847 410677 411525 414389 418529 421691 422742 422335 421674 421489 421888 422537 423071 423585 424536 426035
56606 426035 427615 428799 429587 430375 431716 434036 437084 439828 441425 442141 442791 443585 444146 444332 444203 443503
56590 443503 442142 440868 440480 440632 440461 440156 440652 441933 442904 442891 442056 440417 437868 435145 433272 431978
56574 431978 430099 427649 425833 424828 423374 421105 419431 419325 419852 419793 419237 418640 417769 416596 415865 415638
56558 415638 414513 411414 407060 402641 398276 393877 390297 388229 386995 385795 385230 386225 388281 390167 391618
56543 391618 392972 393724 392908 390606 387926 385785 384618 384633 385300 385150 383248 380487 378485 377798 378116 379387
56527 379387 381487 383537 384973 386688 389752 393536 396694 399475 403316 408379 413274 417316 421248 425400
56513 425400 428776 430637 431734 433285 435707 439032 443637 449836 457268 465277 473498 481758 489830 497729
56499 497729 505962 515142 525374 535965 545702 553662 560005 565724 571500 577358 583601 591073 599635 607169
56485 607169 611318 611872 610373 607752 603751 598559 593486 589460 585789 580970 574155 565577 556237 547474
56471 547474 540265 534559 529661 525245 521468 517989 513658 507628 500384 493341 487631 483402 480073 477111
56457 477111 474537 472599 470951 468613 465123 461263 458051 455221 451394 445760 439117 433248 429639 428666
56443 428666 429460 430477 430527 429400 427578 425635 424082 423221 422729 421801 420200 418803 418606 419436 420152 419924 418965
56426 418965 418309 419141 421905 425625 428510 429666 429763 429848 430201 430791 431912 433623 435381 437149 440148 445500
56410 445500 452729 460513 468126 475054 480086 482565 484138 487475 493085 498922 503316 506865 511030 516158
56396 516158 521516 526177 529252 530157 529397 528463 528348 528585 528232 527304 526703 527000 527788 528230 527941 527129 525933
56379 525933 523961 520976 517859 516075 515872 515836 514642 512350 509335 505056 499114 492756 487848 484648 481973
56364 481973 479383 477768 477643 478237 478705 479185 480060 480914 480841 479601 478248 478534 481320 485367 488321 489408
56348 489408 490248 492267 494278 494009 491321 488286 486385 485281 484281 483329 482232 480450 478147 476214 474901
56333 474901 473655 472713 473452 476361 479789 481696 481977 482198 483522 485585 487199 487731 487894 489288 492842 497692
56317 497692 501943 504477 505617 506215 506779 507434 508097 508636 509298 510819 513596 517043 520388 523711 527506 531556
56301 531556 535135 537995 540338 542120 543291 544444 546407 549584 554322 561021 568695 574475 576373 576040
56287 576040 576917 580022 583560 586384 589482 593679 598141 601960 605400 608761 611622 614073 617086 620820
56273 620820 624043 626251 628980 633955 641143 649624 659123 669489 679727 688995 697879 707428 717395 726615
56259 726615 734880 743305 752746 762614 771590 779290 786982 796493 808343 821297 833987 846333 858784
56246 858784 870896 881778 891603 901497 912113 923317 934953 946743 957769 967356 976278 985828
56234 985828 996040 1006215 1016740 1028642 1041662 1054708 1068170 1083758 1101943 1121540 1141885
56223 1141885 1163291 1185202 1206439 1227994 1253182 1283991 1319262 1357297 1398133 1442170 1488893
56212 1488893 1538492 1592910 1653688 1720200 1791361 1867614 1950094 2039396 2136416 2242880 2359728
56201 2359728 2486400 2622905 2770912 2931448 3103230 3284901 3477264 3681364 3895545
56192 3895545 4116149 4340086 4564883 4787055 5002261 5206703 5397068 5569555 5719935
56183 5719935 5844175 5938728 6001578 6033684 6038059 6016759 5970510 5901922 5816573 5719222 5610986
56172 5610986 5492058 5365089 5233484 5098077 4958205 4814912 4670379 4524895 4376980
56163 4376980 4226287 4074323 3922515 3771324 3620936 3471234 3321663 3172733 3027157
56154 3027157 2887875 2755477 2629035 2508681 2395665 2290562 2193147 2103409 2021051 1944793
56144 1944793 1873916 1809643 1752953 1701806 1652871 1605651 1562632 1525444 1493004 1463509 1436159
56133 1436159 1410603 1386571 1364607 1345697 1329654 1315041 1300966 1288013 1277293 1269506 1264838 1262724
56121 1262724 1261819 1261120 1261023 1262566 1266018 1271086 1277959 1287073 1298239 1310904 1324913 1340278 1356852 1374939
56107 1374939 1395351 1418085 1441968 1466559 1492966 1521583 1550504 1577926 1604915 1633744 1664457
56096 1664457 1695089 1724595 1753517 1782280 1810829 1839621 1869114 1898605 1927466 1957455 1992171
56085 1992171 2034213 2084266 2142622 2209939 2286575 2372825 2470217 2581495 2708935 2852915 3011417
56074 3011417 3179874 3351645 3519291 3675523 3813934 3931224 4029753 4116066 4195373 4268355
56064 4268355 4333428 4389300 4433579 4461644 4470093 4460572 4438172 4407049 4368956 4323951 4269707 4201168
56052 4201168 4113500 4005296 3878079 3734566 3579331 3419244 3260652 3107147 2961592 2828033
56042 2828033 2709036 2603151 2507929 2423725 2351717 2290164 2236230 2189987 2153071 2124509 2101322
56031 2101322 2082187 2067118 2054627 2042962 2033309 2028124 2026800 2026368 2025738 2025705 2025574 2023688 2020970 2020152
56017 2020152 2021610 2023437 2025408 2029272 2035262 2041941 2049614 2060459 2075096 2092142 2111043 2132235 2154703
56004 2154703 2176667 2198611 2222605 2248950 2276536 2305881 2338385 2373102 2407674 2441986 2477515
55993 2477515 2513889 2549771 2586340 2625857 2667419 2708087 2747737 2788828 2832186 2877210 2925287
55982 2925287 2978288 3034329 3089900 3145731 3205812 3271172 3339777 3412003 3490462 3574365 3659809
55971 3659809 3746307 3837703 3935985 4039352 4146969 4260484 4380319 4505696 4638804 4783607
55961 4783607 4939850 5103408 5272944 5451004 5638389 5833215 6035847 6248929 6471952
55952 6471952 6701526 6937318 7181892 7434766 7693222 7959143 8238314 8532642 8839910
55943 8839910 9161232 9501249 9860824 10237591 10634208 11057656 11509656 11986569 12489738
55934 12489738 13026590 13599993 14206077 14844720 15522714 16244311 17008121 17815680 18673366
55925 18673366 19583493 20543524 21556498 22632205 23776343 24989958 26281820 27668992
55917 27668992 29162172 30763051 32479041 34326923 36318517 38457789 40757189 43242600
55909 43242600 45938094 48862244 52045429 55535261 59381290 63634762 68371984 73700172
55901 73700172 79733319 86580215 94359295 103201674 113238222 124619800 137567108 152377811
55893 152377811 169381930 188921962 211361447 237032377 266135470 298704744 334522970
55886 334522970 372648442 410619603 444177921 468327260 479352324 476334508 461095273
55879 461095273 436918601 407212748 374812842 341814601 309608309 279002870 250423410
55872 250423410 224089510 200105407 178500195 159256632 142306850 127501666 114615929
55865 114615929 103403663 93639481 85114490 77630937 71022861 65166725 59960926 55309903
55857 55309903 51135254 47383230 44008135 40959321 38191361 35673115 33377821 31275236
55849 31275236 29340609 27560230 25920724 24402475 22989753 21677455 20461492 19331264
55841 19331264 18277230 17296927 16387447 15539690 14745498 14003168 13311038 12662756 12053476
55832 12053476 11483642 10952088 10452058 9978363 9531955 9113209 8717035 8338853 7979392
55823 7979392 7639446 7315590 7005089 6709606 6430199 6163817 5908287 5665817 5438206
55814 5438206 5223398 5019739 4828608 4649911 4480055 4317412 4164800 4023536 3890193
55805 3890193 3762502 3643491 3536104 3437941 3344487 3253371 3162587 3069051 2972475 2876933 2785616
55794 2785616 2697540 2611656 2529960 2453751 2381012 2310382 2243805 2182440 2123923 2066602 2012648
55783 2012648 1964036 1919142 1876218 1836548 1801108 1767517 1733441 1699980 1669121 1641018 1616233
55772 1616233 1597064 1583730 1572506 1560398 1548515 1538288 1527885 1515288 1501472 1487408 1471052
55761 1471052 1450598 1427743 1404485 1379462 1350773 1319935 1289776 1260634 1231643 1203579 1177420
55750 1177420 1152154 1126843 1102892 1081746 1062498 1044357 1029129 1018408 1010507 1003113 996975 993914
55738 993914 992914 991258 988252 985158 982584 980200 977786 974534 968727 960078 950921 943306 936573 929428
55724 929428 922382 916225 910203 903692 897612 892074 884702 873479 859283 843567 825840 805690 784935
55711 784935 765208 745625 725567 707393 693325 681610 669072 655873 644383 634646 624358 612568
55699 612568 600277 587942 575237 562922 552369 543386 534390 524410 513433 501772 490733 482608
55687 482608 478064 474715 470140 464870 460373 455750 449034 440444 431655 422913 413610 404886 398788 395217
55673 395217 392171 388778 385895 384061 382916 382372 382471 382345 380947 378356 374913 369889 362606 354005 345498
55658 345498 337330 329689 324139 321800 321316 320722 320216 320770 321227 319552 316240 313799 313256 313682 314699 316838
55642 316838 319507 321082 321161 320678 319913 318443 316908 316605 317347 317782 317865 318970 321526 324571 327777 331941
55626 331941 337271 343107 349577 357622 367034 376268 384709 393430 403079 412455 419893 424920 427916 429075
55612 429075 428309 425664 421606 417152 413441 410574 407345 402912 398280 395340 394883 396295 398540 400572 401536
55597 401536 401572 401877 403209 405166 407637 411547 416958 421842 424353 425156 425868 426382 425667 424114 422879 421611
55581 421611 419115 415809 413410 412274 410843 407521 401576 392753 381760 370699 361272 352990 344648 336669
55567 336669 330055 323991 316817 308694 300890 293093 284218 275369 268880 264226 258028 248812 238982 231106
55553 231106 224875 219055 214073 210908 209002 206953 204341 201548 198512 194621 189557 183784 178629 175651
55539 175651 175110 175348 174675 173422 172824 172465 170808 168023 166201 166439 167489 167694 166592 164274 160921 157453
55523 157453 155036 153464 151468 148875 146786 145376 143440 140647 138280 136934 135287 132274 128927 126977
55509 126977 126848 127950 129761 131695 133039 133974 135762 139124 143207 146589 148362 148048 145859 143555 143445
55494 143445 145665 147710 147482 145588 143698 141968 139375 135802 132506 130833 131165 132724 133966 133817 132836
55479 132836 132506 133172 133612 132886 131493 130301 129552 129519 130960 134054 137667 140412 141862 142374 142594 143433 145565
55462 145565 148559 151446 154317 158093 162464 165647 166886 167623 169237 171075 171960 172301 173172 174201 174032
55447 174032 172469 170730 169636 168610 166549 163052 158757 154811 151800 149138 145962 142654 140463 139410
55433 139410 137684 133718 127861 121337 114706 108293 103063 99694 97358 94631 91274 88136 85627 83310
55419 83310 80895 78700 77134 76323 76153 76191 75748 74649 73798 74417 76671 79330 80829 80579 79482 79230 80724
55402 80724 83022 84196 83279 81002 78709 77314 77289 78663 80485 81117 79751 77281 75244 74328 74199 74224
55386 74224 73919 73160 72338 72000 72137 72287 72455 73324 75255 77615 79387 80007 79488 78243 76897 75682 74077
55369 74077 71635 69058 67528 67092 66850 66710 67547 69259 70153 69035 66770 64886 63662 62476 61116 59854
55353 59854 58936 58841 60290 63178 66180 68221 69695 71467 73454 75111 76523 77906 78518 77308 74408
55338 74408 71067 68278 66255 64997 64403 63877 62629 60526 58273 56798 56748 58275 60865 63625 66051
55323 66051 68197 69883 70379 69369 67650 66253 65350 64578 63933 63560 63103 62099 60826 60046 60016 60395 61024
55306 61024 62124 63632 64849 64963 63732 61602 59222 56874 54509 52439 51564 52246 53190 52442 49798 47326
55290 47326 47047 48828 51000 52283 52485 51961 51284 51184 52095 53729 55345 56356 56701 56957 58022 60101
55274 60101 62116 62925 63005 63791 65205 65251 62645 58480 54480 50982 47889 46320 47465 50352 52648 53719
55258 53719 55277 58612 62564 64990 65290 64579 63900 63284 62507 61827 61376 60412 58163 55399 54058 54800 55928
55241 55928 55622 54370 53893 54466 54997 55315 56293 57603 57544 55757 54087 53791 53765 52802 51841 52308 53614 54120
55223 54120 53593 52914 52170 50907 49829 50368 52647 55350 57602 59739 62261 65209 68469 71613 73580
55208 73580 73628 72501 71605 71165 70299 68701 67057 65825 64855 64280 64610 65680 66545 66694 66532 66401 66008 65066
55190 65066 63618 61568 58780 55980 54596 55067 56017 55793 54433 53400 53692 54868 55992 56800 57556 58143
55174 58143 58041 57277 56667 56602 56236 54687 52630 51657 52209 53328 54455 55963 57596 57956 56512 54849 54770
55157 54770 56184 58042 60408 64013 68268 71227 71677 70269 68626 68044 68947 70882 73050 75218 77791
55142 77791 80755 83257 84667 85228 85083 83675 80973 78249 76551 75249 73257 70905 69355 68969 69474
55127 69474 70898 72873 73799 72396 69654 67701 67205 67396 67972 69014 69515 68244 66086 65432 66877 68533
55111 68533 69075 69484 70930 72637 72986 71496 68744 65317 61715 58501 55799 53238 50880 49561 49905
55096 49905 51563 53633 55276 55996 56152 57076 59699 63099 65468 66376 66759 66754 65265 62083 58840 57110
55080 57110 56806 57049 57381 57415 56517 54680 52805 51433 50189 49094 49292 51658 55594 59910 64044 67773
55064 67773 70739 73077 75594 78560 81266 83489 86290 90298 94230 96261 96162 95053 93910 93499 94879
55049 94879 98326 102114 103941 103633 103168 103901 104975 104790 103059 100787 98857 97297 95832 94713 94724 96223
55033 96223 98391 99921 100486 100899 101607 101851 100914 99517 99205 100707 103665 107557 111894 115566 117064 115856
55017 115856 113165 111000 110544 111534 112952 114117 115085 116124 117023 117216 116561 115663 115281 115662 116500 117306 117690
55000 117690 117475 116644 115137 112990 110852 109875 110416 111191 110636 108917 107566 107145 106585 105205 104007 104080 104824
54983 104824 104923 104443 104662 106039 107471 107720 106786 105601 104904 104756 104917 105457 106774 108935 111281 113144 114807
54966 114807 117044 119702 121654 122477 123227 124835 126451 126380 124288 121601 119824 119191 118982 118579 118032 117945 118854
54949 118854 120582 122345 123686 124996 126872 129285 131711 133754 135230 135966 135962 135555 135050 134462 134019 134441
54933 134441 136022 137737 138074 136808 135136 133888 132357 129440 125407 121797 119676 118693 118050 117711 118014
54918 118014 118412 117583 115169 112704 112090 113426 115053 115684 115836 116965 119680 123110 125809 127160 127963 129582
54902 129582 132423 135487 137681 139125 140732 142885 145295 147886 150999 154742 158959 163894 170124 177677
54888 177677 185890 194245 202851 212165 222958 236225 252031 268443 282941 295172 307038 319537
54876 319537 330840 338366 341651 341991 340024 334907 325681 312575 297103 281476 267533 255568 244287
54863 244287 232391 219976 208158 197954 189921 184224 180184 176244 171240 165657 161027 158269 157163
54850 157163 157158 158056 159878 162591 166056 170029 174343 179235 185258 192789 201940 212949 226050 240704
54836 240704 255630 269949 283606 296228 306346 312488 314510 313157 308784 301351 291394 280152 268692
54823 268692 257358 245970 234124 221537 208505 195883 184319 173694 163567 153838 144775 136840
54811 136840 130657 126622 124253 122473 120808 119587 118778 117610 115879 114590 114510 114941 114834 114215 113412 111743
54795 111743 108406 104330 101685 101528 102906 104195 104352 103074 100825 98760 97647 96776 94774 91560 88668
54780 88668 87556 88286 89784 90649 89917 88031 86997 88486 91653 93892 93968 93298 93689 94925 95402 94321
54764 94321 92338 90509 89567 90055 92229 95549 98805 101220 103255 105970 109554 112836 114498 114563 114326 115016
54748 115016 117093 120780 126316 133176 139758 144637 147900 150698 153787 157084 160387 163886 167950 172886
54734 172886 178809 185476 192516 200227 209775 222006 236226 250708 264334 277341 290586 304527
54722 304527 318811 332470 344383 353649 359487 361039 357954 351220 342711 333663 324290 314992 306782
54709 306782 300005 293738 287244 281079 275905 271316 266897 263457 261875 261564 261449 261641 262605 263535 263558 264132
54693 264132 268052 275945 285682 295598 306456 319684 335407 353051 372433 393408 415595 439212
54681 439212 465069 492830 520245 544951 566204 584069 597655 605029 604479 595379 578451 555829
54669 555829 530320 503989 477720 452207 428494 407053 387165 367883 349136 331434 315070
54658 315070 300160 286940 275491 265508 256654 248642 240846 232634 224408 217536 212720 209152 205720
54645 205720 202135 198288 193558 187861 182673 179809 179403 180040 180637 181190 181851 182369 182710 183264 183958 183848 182247
54628 182247 180004 178903 179605 180681 180219 178217 176656 177079 178879 180566 181891 183691 186178 188766 191497
54613 191497 195153 199745 204214 208118 212251 216903 220822 222977 224204 225949 228309 230670 233517 237963
54599 237963 243791 249528 254463 259236 264304 269207 273646 278033 282436 286214 289503 293995 301068 309729
54585 309729 317602 323806 329821 337435 346940 357823 370349 385497 403488 423358 444343 467102
54573 467102 493029 522503 554316 586818 619130 650903 681197 708088 729495 744108 751371 750948
54561 750948 742752 727531 706778 681652 652388 619434 584842 551600 521354 493517 466901 441516
54549 441516 418313 397948 380527 366004 353887 342804 331184 318491 305424 293100 282490
54538 282490 274192 268012 262861 257615 251979 246143 240134 234107 228784 224650 221052 216998 212529 208352
54524 208352 204457 200230 195756 191786 188396 184886 181055 177412 174033 170429 166660 163261 159878 155414
54510 155414 149982 145280 142450 140925 140014 140057 141046 141560 140507 138895 138482 139375 140292 140626 140872 141426 142234
54493 142234 143526 145711 148471 150778 151853 151628 150588 149862 151029 154875 160336 165375 168833 170916 172220
54478 172220 173141 174250 176531 180911 187692 196271 205306 213595 221106 228780 237114 245687 254458 264596
54464 264596 277044 290963 304730 318137 332497 348565 365226 380225 391555 398191 400329 399058
54452 399058 395342 389230 380318 368720 355152 340410 325338 310981 298033 286176 274507 262516
54440 262516 250318 238210 226621 216255 207751 201250 196529 193223 190600 187637 183830 179497 174996
54427 174996 170335 166054 163509 163333 164283 164579 163730 162159 159980 157580 156692 158989 163641 167811 169718
54412 169718 170010 170163 170923 172385 174173 175305 175191 174946 176287 178952 180745 180557 179676 179389 179030 177560
54396 177560 175686 174951 175575 176523 176979 176553 174690 171251 167346 164322 162111 159630 156639 154090 152617
54381 152617 151740 150784 149791 149179 149007 148884 148354 147323 146233 145584 145052 143619 141103 139099 139507 142316 145624
54364 145624 147740 148418 148090 147079 145912 145384 145607 145673 144977 144297 144806 146359 147746 148510 149569 151839 155054
54347 155054 158433 161917 165990 170569 174739 177760 179899 182120 185163 189001 192938 196148 198340 200066
54333 200066 202236 205186 208406 211200 213348 214922 215676 215039 212706 208985 204464 199484 194084 188435 183135
54318 183135 178817 175314 171482 166297 160076 154143 149275 145149 141691 140227 142220 146919 151266 152676
54304 152676 151451 149941 149682 149994 149468 148095 147413 148658 151339 153781 154690 153955 152245 150393 149104 148759
54288 148759 149239 150166 151354 152870 154759 157084 160110 163798 167011 168021 166338 163539 161734 161596 162452
54273 162452 163880 166231 169533 172708 174316 173724 171289 167778 163994 160803 158973 158608 158814 158225 156187
54258 156187 153393 151146 149970 149188 147861 145781 143408 141159 139033 136730 133915 130550 127196 124788
54244 124788 123819 123757 123394 121751 118668 114725 110740 107249 104400 102365 101511 101898 102818 103419 103707 104431 105983
54227 105983 107999 110056 111995 113372 113392 111852 109686 108180 108025 109246 111400 113510 114436 113882 112681
54212 112681 111876 111907 112738 114104 115401 116032 116048 115832 115159 113658 112258 112738 115369 118482 121088 124383 129504
54195 129504 135218 139231 140631 139688 136550 131960 128178 127059 127700 127908 127440 127756 128931 129211 127842 126219
54179 126219 125736 126204 126909 127564 127696 126707 125200 124871 126453 128965 131378 133581 135209 135114 132953 130059
54163 130059 127911 126773 126493 127405 129546 132017 134002 135610 137088 138140 138623 138878 138718 137226 134311
54148 134311 131388 129737 129240 129472 130777 133272 135999 138192 140268 142388 143320 142240 140593 140318 140920
54133 140920 140174 137403 134154 131649 129407 126757 124210 122600 121890 121550 121478 122050 123560 125772 127676 127888
54117 127888 125927 123054 121245 121138 121481 120628 118262 115642 114477 115355 117069 117722 116744 115283 114326 113314
54101 113314 111420 109427 109034 110573 112614 113762 113769 112787 110843 108504 107127 107659 109564 111369 111984 111201
54085 111201 109378 107095 104965 103303 101843 99955 97367 94748 93377 93942 95822 97948 100155 102898
54071 102898 105640 106662 105075 102114 99657 98188 97093 96196 95820 95767 95523 95251 95392 95418 94349 92695
54055 92695 92509 94870 98207 99851 98674 95762 93113 92252 93615 96482 99456 101302 101560 100482 98689
54040 98689 96845 95437 94791 95259 96922 98841 99313 97669 95357 94278 94379 94166 93396 93690 95971 98789
54024 98789 100225 100354 100654 101719 102888 103795 104939 106607 108339 109707 110782 111524 111536 110882 110482 111099 112391
54007 112391 113589 114798 116833 119859 122938 125144 126526 127641 128624 129152 129122 128907 129053 129942 131607 133643
53991 133643 135620 137878 141426 146501 151668 155249 157470 160170 164319 168940 172851 176406 180637 185463
53977 185463 189752 192888 195475 198584 202914 208559 215111 222055 229412 237761 247250 256926 265560 272892
53963 272892 279568 286080 292340 298093 303095 306927 309248 310408 311491 313599 317065 321085 323961 324191
53949 324191 321732 317926 313889 309365 303568 296562 289252 282441 276532 271657 267324 262394 256372 250421
53935 250421 246121 243393 240645 236864 232474 228151 224031 220403 218065 217312 217321 217090 216473 215819 215168 214241
53919 214241 212851 210961 208774 207019 206600 207522 208580 208522 207203 205373 203829 203127 203555 204694 205296 204369
53903 204369 202433 201161 201523 202724 203274 202799 202264 202409 202727 202532 202472 203921 206844 209411 210203 209802 209499
53886 209499 209472 209354 209752 211762 215318 219445 223966 229398 235160 239612 242499 245820 251328 258346 265108
53871 265108 271375 278411 286815 295554 303174 309143 313859 317740 320553 321678 321256 320887 322604 327020 333059
53856 333059 339548 346159 352585 357907 361742 365291 370295 377273 385404 393677 401367 407821 412796 416921
53842 416921 421072 425271 428793 431230 432767 433472 433014 431274 428719 425979 423372 420848 418084 414540 409748
53827 409748 403606 396267 387908 378819 369530 360483 351759 343358 335473 328059 320400 311752 302368 293376
53813 293376 285644 279234 273918 269575 265833 261871 257022 251441 245956 241362 237924 235277 232604 229107
53799 229107 224591 219526 214441 209466 204690 200719 198244 196811 194650 190476 185296 181559 180219 179519
53785 179519 177256 173567 170517 169371 169452 169580 169270 168172 165630 161744 158071 156221 156091 156205 155540 154364
53769 154364 153556 153804 155274 157425 159264 160338 161376 163388 166354 169407 172100 174604 176656 177387 176720
53754 176720 176222 177710 181182 184780 186932 188051 189853 193239 197350 200793 203397 206353 210804 216738
53740 216738 223225 229286 234526 239404 245011 251998 259609 266342 271717 276659 281845 286652 290472 294137
53726 294137 298915 304573 309607 313198 315760 317597 318230 317322 315270 312462 308856 304745 301157 298846 297317
53711 297317 295384 292304 288060 283077 278206 274530 272497 271395 270148 268539 267260 266893 267169 267129 265759
53696 265759 262683 258555 254655 251754 249478 247043 244352 241883 239651 236974 233548 230219 228181 227559
53682 227559 227169 225781 223288 220491 217987 215518 212328 207989 202894 198209 195203 194226 194237 193765 192478
53667 192478 191350 191026 190636 188937 186196 184017 183296 183300 182974 182305 181927 182100 182798 184320 187008 190536 194143
53650 194143 197594 201330 205583 209830 213308 215779 217659 219646 222345 225985 230272 234589 238488 241990
53636 241990 245450 249156 252970 256253 258318 259217 260051 262166 265939 270530 274808 278225 280716 282202 282589
53621 282589 282099 281119 279669 277419 274509 272129 271843 274151 277926 281421 283720 285043 285894 286438 286804 287415
53605 287415 288410 289059 288357 286299 283982 282359 281450 281000 281195 282157 283220 283510 283008 282308 281461 279858 277318
53588 277318 274468 271934 270092 269791 272075 276327 279748 280057 278260 277419 278854 280895 281550 280941 280522 281054
53572 281054 282285 283893 285716 287373 288488 289195 289945 291050 292875 296062 300903 306678 312175 316686 320036
53557 320036 322086 323012 323813 325652 328640 332056 335701 340141 345484 350864 355547 359719 363740 367409 370592
53542 370592 373950 378356 384009 390706 398430 406896 414938 421297 425926 429709 433052 435620 437512 439677
53528 439677 442713 445961 448376 449838 451094 452763 454927 457551 460746 464472 468286 471476 473449 474096
53514 474096 473920 473727 473987 474519 474863 474862 474785 474975 475492 476117 476628 477027 477406 477604 477283 476630 476678 478313 480895
53495 480895 482604 482576 482194 483655 487517 492325 496548 500165 504109 508749 513465 517519 520844 523849 526719
53480 526719 529325 531834 535083 539874 545888 551680 556065 559406 563364 569541 578358 588959 599921 610239
53466 610239 619897 629457 639237 649208 659641 671120 683664 696515 709310 722808 737812 754052
53454 754052 771008 789139 809042 829782 849635 868584 888678 911451 936258 961684 987387
53443 987387 1013741 1040667 1067934 1095991 1125519 1156391 1187744 1218808 1249386 1280012 1312056
53432 1312056 1346853 1384053 1421527 1457514 1492174 1526339 1559819 1592143 1624141 1657257 1691488
53421 1691488 1725323 1757685 1788821 1819421 1849950 1880735 1911606 1941561 1969965 1997805 2026355
53410 2026355 2054736 2080617 2103625 2126102 2149638 2172626 2192644 2209875 2226302 2242293 2255835
53399 2255835 2265151 2270466 2272832 2272414 2268719 2261822 2252598 2241825 2229515 2215224 2198818 2180745 2161600
53386 2161600 2141733 2121434 2101157 2081084 2060678 2039250 2016952 1994560 1972186 1948968 1924323
53375 1924323 1898875 1873704 1849185 1825178 1802031 1780761 1762207 1746265 1732052 1718744 1706390
53364 1706390 1695788 1687427 1680688 1674532 1668826 1664507 1662473 1662884 1665463 1669773 1675115 1680919 1687578 1696232
53350 1696232 1707427 1720507 1734555 1749395 1765497 1783512 1804175 1827959 1854530 1883074 1913392
53339 1913392 1946050 1981351 2018972 2058818 2101171 2145633 2191013 2236897 2284315 2334109 2385716
53328 2385716 2438453 2493037 2550617 2611020 2673246 2737131 2803211 2871178 2939674 3007495 3074034
53317 3074034 3138785 3201577 3263188 3324545 3385140 3443220 3497785 3549620 3600080 3649467 3696666
53306 3696666 3739802 3777109 3807696 3831685 3849436 3860844 3865696 3864266 3857018 3844149 3826081 3803921
53294 3803921 3778519 3749339 3715124 3675468 3631002 3582492 3530867 3477735 3424484 3370812 3315399
53283 3315399 3258151 3200553 3143676 3087215 3031011 2976150 2923694 2873285 2823821 2774723 2725714
53272 2725714 2676149 2625685 2575313 2526771 2480925 2437334 2395304 2354848 2316602 2281223 2248884
53261 2248884 2219012 2190512 2162542 2135273 2109792 2087011 2066447 2046149 2024212 2000577 1977008
53250 1977008 1955086 1934727 1915067 1896106 1878551 1862432 1847073 1832479 1819720 1809589 1801795
53239 1801795 1795808 1791652 1789293 1787995 1787086 1787072 1789285 1794450 1801947 1810609 1820138 1831721 1847038 1866429
53225 1866429 1888292 1910721 1933492 1957842 1984419 2012271 2040044 2067442 2095128 2123577 2152211
53214 2152211 2179396 2203371 2223719 2241902 2259741 2277326 2292933 2304942 2313048 2317695 2319363 2318754
53202 2318754 2316698 2313288 2307643 2299002 2287545 2273930 2258644 2242075 2224396 2204904 2182226 2155835
53190 2155835 2126914 2097226 2067589 2037807 2007414 1975924 1942937 1908757 1874644 1841877 1810815
53179 1810815 1781188 1752869 1725853 1699823 1674289 1649036 1624138 1599699 1575696 1551746 1527120
53168 1527120 1501640 1476671 1454328 1435224 1417753 1400001 1381648 1363474 1346053 1329718 1315028
53157 1315028 1302167 1290254 1278208 1265957 1254048 1242512 1231003 1219643 1208627 1197176 1183982
53146 1183982 1168763 1152532 1136231 1119874 1103124 1085952 1068509 1050903 1033327 1015959 998721
53135 998721 981606 965288 950945 939342 930244 922496 914365 904190 891425 876941 861834 846215
53123 846215 829773 813153 797713 783872 770651 757042 743111 729575 717096 706238 697263 689501
53111 689501 681594 672959 664432 656933 650015 642390 633557 624213 615326 607505 601150 596268 591829 585910
53097 585910 577125 565819 553531 541476 529896 518809 508779 500557 494186 488892 483821 478660 473478
53084 473478 468311 463100 457889 452888 448318 444194 440229 436028 431505 426967 422654 418340 413732 409103
53070 409103 405125 402120 399888 398234 397092 396126 394791 392997 391140 389326 387185 384733 382613 380955
53056 380955 378689 374776 369707 364961 361151 357453 352807 347107 341162 335960 332012 329117 326752 324815
53042 324815 323687 323280 322505 320244 316643 312874 309861 307794 306626 306297 306501 306916 307747 309312 310975 311256
53026 311256 309470 306839 305446 306271 308610 311276 313870 316578 318944 319509 317282 313404 310573 310391 311771
53011 311771 312354 311010 308394 305677 303670 302856 303071 302963 300818 296501 291962 289251 288454 287935 286098 282310
52995 282310 276575 269257 261378 254543 249980 247590 246075 244037 241079 238061 236287 236184 236634 235772 232748
52980 232748 228511 224545 221111 217445 213696 211637 212705 215886 218440 218476 216120 212516 208809 206050 204890
52965 204890 204860 204676 203562 201682 199257 196274 193300 191454 190927 190583 189723 189260 190176 191640 191806 190018
52949 190018 187201 184450 182218 180668 179902 179846 180447 181732 183254 184128 184303 185162 187900 191796 195013 196673
52933 196673 197110 196591 195095 193182 191862 191403 191108 190256 188579 186139 183617 182397 183282 185320 186855 187442
52917 187442 187701 187769 187301 186757 187126 188389 189686 190955 192823 194853 195740 195575 196024 197597 198618 197968 197183
52900 197183 198479 201921 205891 209378 212467 215382 218360 221969 226385 230775 234240 236840 238879 239903
52886 239903 239523 238723 239184 241541 245170 249333 253601 257493 260699 263588 266751 270201 273601 276944 280297
52871 280297 283313 285773 288219 291130 293855 295335 295673 296018 297037 298474 300059 301834 303502 304484 304790
52856 304790 304961 304995 304255 302729 301450 301076 300741 299053 295962 293071 292088 293228 295111 296101 295692 294520
52840 294520 293173 291543 289599 288206 288347 289804 291398 292475 293311 293950 293588 291633 288847 286939 287260
52825 287260 290086 294622 299220 302065 302440 301488 301286 302935 305589 307391 307239 305646 304088 303671 304393 305445
52809 305445 305973 305634 304753 304127 304447 305683 307121 308144 308765 309161 308875 306994 303325 299129 296379 296143
52793 296143 297686 299189 299376 298441 297459 297187 297682 298847 300771 303299 305650 306858 306662 305910 306104 308336
52777 308336 312265 316101 318037 317833 316759 315984 315593 315290 315321 316122 317461 318539 318753 317910 315939 313012
52761 313012 309927 307795 307099 307259 307170 306062 303918 301254 298580 296078 293923 292765 293381 295638 298234
52746 298234 299870 300420 300558 300516 299730 297695 294690 291528 288747 286181 283333 280105 277021 274517 272263
52731 272263 269622 266680 264136 262132 259971 257189 254058 250609 246144 240591 235525 232666 231673 230536
52717 230536 227991 224491 220924 217614 214889 213524 213801 214707 214786 213585 211825 210271 208815 206687 203397
52702 203397 199311 195275 191760 188677 185968 183759 181618 178382 173513 168168 164018 161146 158208 154695
52688 154695 151911 151214 152166 153100 152970 152019 150982 150228 149569 148540 147021 145643 145174 145330 144848 143184 141453
52671 141453 140914 141049 140250 138329 137106 138067 140297 141491 140474 137970 135251 132906 130994 129587 128715
52656 128715 128194 127819 127527 127157 126355 124979 123291 121521 119607 117669 116370 116252 116929 117406 117112 116203 115161
52639 115161 114671 115615 118248 121335 123019 122891 122591 123960 127085 130379 132056 131432 129406 127988 128672 130939
52623 130939 132830 133225 132854 132872 133442 134255 135470 137272 139190 140712 142084 143761 145647 147623 150129 153192
52607 153192 155507 155734 154384 153251 153185 153597 154068 155075 156884 158885 160551 162320 165069 169037 173354
52592 173354 176339 176593 174429 171962 171039 171453 171958 172387 173300 173928 172370 168225 163425 159772 157066 154467
52576 154467 152292 151265 150976 150482 149894 150194 151638 153306 154088 153431 151314 148255 145311 143430 142618 141985
52560 141985 140553 138036 135113 133007 132322 132232 131508 130532 131273 134650 138841 141291 141761 142192 143781 145593
52544 145593 146357 146479 147445 149712 151992 152635 151272 148951 146906 145552 144701 144357 144807 146050 147615 149157
52528 149157 150859 153127 156100 159517 162718 164798 165184 164255 163012 162059 161355 160988 161481 163048 165127 167025
52512 167025 168635 170271 172253 174862 178180 181759 185005 188018 191240 194133 195299 194553 193752 194609 196557
52497 196557 197897 198339 199018 200473 202047 203246 204296 205238 205672 205735 206286 207699 209402 211041 213242 216623
52481 216623 220721 224448 227109 228484 228551 227823 227618 229190 232509 236332 239581 242380 245613 249642 253605
52466 253605 256205 257208 257887 259612 262211 264267 264999 265143 265681 266390 266303 265344 264736 265614 267688 269596 270393
52449 270393 270307 270027 269641 268648 266872 264936 263658 263244 263194 262740 261297 258889 256426 255157 255496 256674 257870
52432 257870 259131 260557 261140 259533 256033 252732 251373 251772 252696 253524 254403 255430 256459 257514 258729
52417 258729 259926 260719 261059 261282 261674 262302 263229 264549 266204 268008 269832 271532 272802 273442 273734 274125
52401 274125 274484 274090 272615 270753 269589 269677 271066 273809 277703 281568 283656 283284 281590 280186 279451 278786
52385 278786 278263 279061 281969 286180 290129 293164 295795 298335 299906 299240 296437 293518 292744 294184 295381
52370 295381 293918 290133 286660 285379 285610 285563 284642 283607 282972 282198 280513 277919 275302 273874 274508 277167
52354 277167 280728 283479 284003 281931 278225 274648 272476 271548 270938 270489 270999 272839 275413 278417 282507
52339 282507 287812 292777 295707 296846 297635 298442 298475 297632 296759 296159 295569 295861 298815 304390 309888 312910
52323 312910 313875 314427 314729 313904 312239 311126 311091 311401 311629 312256 313611 315321 316986 318472 319416 319374 318698
52306 318698 318500 319534 321768 324966 328764 332059 333501 333252 333357 335633 339751 344043 347671 351175 355215
52291 355215 359646 363936 367840 371437 374847 378166 381518 385011 388686 392535 396518 400530 404354 407819
52277 407819 411144 415074 420222 426126 431357 435102 438391 443153 450027 457700 464494 470091 475570 482287
52263 482287 490889 500886 510836 519429 526827 534640 544325 555879 568231 580384 591959 603335 615791
52250 615791 630866 648772 667765 685884 703085 720872 740034 759782 779313 799275 820998
52239 820998 844836 869883 895241 921105 948462 977862 1008569 1039058 1068323 1096433 1123713
52228 1123713 1149911 1174756 1198926 1223559 1248728 1273097 1295340 1315393 1334237 1352987 1372283
52217 1372283 1391750 1409779 1424603 1436066 1445666 1454392 1461356 1465375 1467109 1468444 1470056 1470955 1470520
52204 1470520 1469666 1469375 1469032 1467202 1463709 1460135 1458220 1458218 1458907 1458975 1458345 1458314 1460465 1465429 1472686 1481383 1491022
52187 1491022 1501454 1512764 1525444 1540213 1557210 1575531 1594039 1612490 1631473 1651396 1672105
52176 1672105 1693429 1715304 1737051 1757219 1774791 1790196 1804543 1818150 1830439 1840976 1849749
52165 1849749 1856403 1860181 1860921 1859349 1855963 1850374 1842303 1832546 1822206 1811454 1799727 1786682 1772252
52152 1772252 1756308 1739257 1722473 1706958 1691808 1675235 1657001 1638497 1620490 1602492 1584702
52141 1584702 1568748 1555557 1544069 1533279 1524154 1517887 1513323 1508032 1501468 1495218 1490288 1485886 1481147
52128 1481147 1476454 1472492 1469198 1466238 1463590 1461114 1458285 1454877 1451186 1447292 1442783 1437594 1432373 1427558
52114 1427558 1422842 1418042 1413895 1411301 1410096 1408993 1406456 1401487 1394139 1385702 1377949 1371714 1366502 1361591
52100 1361591 1356901 1352421 1347543 1341743 1335501 1329658 1324094 1317913 1311053 1304884 1300588 1297275 1292377 1284202
52086 1284202 1273846 1264222 1257291 1252763 1249475 1247066 1245580 1244185 1241619 1237832 1233984 1230690 1227449 1224179
52072 1224179 1222038 1221749 1222026 1220779 1217543 1213734 1210750 1208762 1207430 1206841 1207301 1208620 1210129 1211418 1212833
52057 1212833 1215044 1218258 1222179 1226865 1233014 1240935 1249880 1259342 1270570 1285405 1303581 1322664 1341136
52044 1341136 1360192 1381734 1405975 1432115 1460118 1490246 1521532 1552499 1583217 1615150 1648857
52033 1648857 1683183 1717031 1750670 1784604 1817998 1849063 1876799 1901964 1926378 1951367 1976548
52022 1976548 1999991 2019600 2034497 2045219 2053025 2059187 2064382 2068224 2069569 2067631 2062636 2055242 2045897
52009 2045897 2035147 2023852 2012351 1999914 1985812 1970599 1955575 1941425 1928211 1916291 1906144
51998 1906144 1897441 1889427 1882240 1876856 1873577 1871523 1869931 1869132 1869989 1873015 1878280 1885536 1894169 1903432
51984 1903432 1912865 1922158 1930886 1939005 1947300 1956433 1965652 1973493 1979738 1985546 1991358 1995856 1997518 1996291
51970 1996291 1993147 1988800 1983533 1977639 1971269 1964153 1955869 1946108 1934489 1920743 1905380 1889553 1873809
51957 1873809 1857408 1839191 1818563 1795462 1770182 1743679 1717251 1691148 1664063 1634691 1603338
51946 1603338 1571408 1539810 1508549 1477419 1446256 1414617 1381922 1347860 1312378 1275597 1238164
51935 1238164 1201300 1165951 1132106 1099351 1067551 1036394 1004823 971964 938484 906219 876356
51924 876356 848604 822007 795817 769637 743568 718437 695166 673705 653188 633244 614406
51913 614406 596916 580000 562973 546439 531610 518776 507289 496842 487792 480041 472431 463838
51901 463838 454431 445394 437633 431155 425489 420232 415291 410923 407462 404624 401267 396320 389941 383263
51887 383263 377106 371624 367171 364509 363638 363177 361636 358889 355821 352928 349915 346392 342306 337864 333463
51872 333463 329496 325875 322081 318023 314370 311552 309181 307063 305939 306265 306950 306495 304766 302339 298744
51857 298744 293201 286833 282086 279579 277239 273212 268026 263170 259149 255957 254114 253898 254356 254255 253463
51842 253463 252614 251988 251403 250611 249233 246962 244296 242157 240383 237764 234175 231243 229905 228702 225818
51827 225818 221657 217954 215353 213513 212663 213126 213871 213462 212195 211563 211779 211610 210633 209882 210140 211201 212896
51810 212896 215065 216299 214716 210742 207355 206708 207942 209214 210240 211594 212900 213407 213565 214474 216246
51795 216246 218221 220460 223644 227616 231218 233683 235254 236420 237489 239032 241663 244894 247050 247014 245634
51780 245634 244827 245568 247285 248932 249935 250114 249529 248835 249100 250555 251867 251453 249414 247390 246512 246417 246404
51763 246404 246416 246389 245805 244897 245274 247986 251616 253799 254395 255586 258738 262662 265353 266035 264945 262514
51747 262514 259762 258357 258947 259886 258799 255268 251181 248539 247696 247701 247606 247151 246672 246596 246941 247137 246475 244747
51729 244747 242506 240729 240145 240730 241923 243458 245752 249089 252637 254908 255347 254997 255442 257374 260252
51714 260252 262868 264148 263885 262955 262522 262978 263883 264791 265635 266462 267584 269950 274443 280466 286061 289823
51698 289823 292076 293878 295730 297845 300829 305256 310844 316687 322016 326428 330010 333762 339145 346390
51684 346390 353779 359526 364048 369433 376821 385271 393125 399577 404689 408665 411560 413349 414058 413990 413779
51669 413779 413965 414564 415357 416368 417681 419050 420250 421647 423827 426652 429213 430733 430972 429816 427192
51654 427192 423666 420627 419417 420329 422517 424762 426425 427928 430249 433681 437257 439708 440837 441501 442372
51639 442372 443232 443500 442959 441994 441564 442818 446134 450361 453540 454636 454337 454312 456151 460856 468429 477547
51623 477547 486319 493902 501076 508970 517633 526063 533026 537426 538534 536676 533460 530582 528413 526315
51609 526315 524322 523746 525710 529468 532698 533559 532248 530399 529093 527842 525733 523114 521437 521329 521527
51594 521527 520118 516313 510495 503042 494002 483905 474041 465589 458861 453591 449492 446130 442734 438713
51580 438713 434371 430670 428159 426334 424147 420950 416827 412257 407696 403474 399766 396470 393237 389867
51566 389867 386630 383931 381664 379232 376404 373799 372189 371483 370847 369822 368846 368505 368617 368323 366823 363861
51550 363861 359766 355432 352037 350246 349576 348850 347305 345060 342641 340627 339840 341114 344258 347715 350035
51535 350035 351565 353863 357339 360404 361483 361205 361801 364648 369254 374527 380041 385695 390984 395436 399476
51520 399476 404055 409341 414275 417625 419124 419379 418957 417846 415695 412277 407768 402738 397909 393800 390489
51505 390489 387693 385119 382761 381036 380684 382334 385899 390287 393896 395678 395850 395622 396190 397897 400233
51490 400233 402571 404897 407869 412163 417674 423281 427500 429583 430117 430475 431580 433204 434459 434752 434146
51475 434146 433104 432261 432323 433683 436018 438492 440380 441134 440036 436687 432270 429437 430020 433071 436049
51460 436049 437741 439151 441533 444637 447258 448626 448690 447686 446115 444653 443361 441311 437604 432617 427657
51445 427657 423550 420019 416289 411720 406076 399772 393821 388948 384829 380759 376962 374450 373538 373290 372674
51430 372674 371574 370307 368950 367645 366930 367037 367362 367341 367545 369147 372480 376909 382012 388065 395149 402535
51414 402535 409311 415110 419969 424029 427881 432722 439438 447564 455629 462558 468404 473814 479290 485049
51400 485049 491159 497467 503545 508915 513281 516606 519151 521399 523571 525096 524981 522964 520010 517450
51386 517450 515988 515793 516994 519370 521883 523418 524073 524998 526794 528773 530032 530606 531174 532230 533982
51371 533982 536381 538576 538900 536361 532101 528562 527169 527280 527256 525853 522650 518022 513077 508957 505757
51356 505757 502519 498632 494721 491743 489679 487750 485676 484015 483287 483435 484247 485739 487684 489187 489302
51341 489302 488049 486541 486117 487495 490491 494075 496790 497788 497690 497922 498953 499845 499909 499871 500361 499871 495812
51324 495812 487756 478202 469627 462060 454314 446250 438408 430267 420626 409641 399070 390275 383056 376710
51310 376710 371142 366439 362239 358155 354306 350874 347517 343613 338804 333085 326840 321114 317290 315864
51296 315864 315547 313983 309582 302842 296133 291984 291054 291586 291253 289637 288417 288974 290442 290627 288514 285308
51280 285308 283060 282633 283045 282580 280405 277204 274341 272656 272209 272841 274472 276815 279305 281583 283853
51265 283853 286642 290291 294583 298668 301518 302801 303151 303331 303451 303594 304782 308331 314095 320205 324920
51250 324920 328085 330575 333000 335434 337687 339204 339082 336867 333200 329200 325212 320523 314322 306857
51236 306857 299549 293767 289384 284884 279275 273414 268785 265378 261845 257622 253697 251041 249435 248291
51222 248291 247526 246961 245836 243776 241519 239904 238678 237043 234857 232577 230423 228316 226322 224719 223867
51207 223867 224211 225760 227376 227466 225886 224195 223478 223146 222675 223036 224938 226835 226668 225025 224577 226404
51191 226404 228722 229403 228127 225651 222583 219691 218182 218632 220198 221505 221940 221803 221761 222375 223559 224270
51175 224270 223332 220825 218118 216430 215904 216121 216687 217111 216895 216181 215826 216565 218435 220956 223297 224369
51159 224369 223666 222193 221780 223253 225940 228984 232090 234740 235845 234955 233127 231946 232105 233327 234989
51144 234989 236318 236690 236398 236639 238154 240221 241498 241379 240168 238472 236964 236179 235959 235511 234525 233778
51128 233778 234057 235054 235901 236283 236314 235883 235048 234651 235436 236706 236874 235310 232721 229710 226123 222221 219338
51111 219338 218518 219085 219384 218590 217063 215161 212666 209610 206955 205853 206428 207698 208621 208909 208865 208828 208903
51094 208903 208881 208275 206708 204544 202862 202355 202294 200988 197440 192473 188213 186424 187171 188918 190042 190244
51078 190244 190267 190363 189879 188758 188529 190746 194760 198222 199862 200815 202906 206479 210300 212892 213526 212456
51062 212456 210722 209475 209192 209666 210630 211895 212978 213377 213349 213589 213965 213551 212344 211924 213555 216391 218528
51045 218528 219357 219870 220855 221742 221354 219123 215510 211743 209222 208785 210327 213080 216076 218314 219084 218488
51029 218488 217379 216463 215902 216042 217819 221733 226866 231604 235044 237126 237889 237577 237218 238074 240311 242837
51013 242837 244487 244887 244387 243896 244620 247048 250126 252262 253186 253942 254991 255548 255216 255110 256418 258631
50997 258631 260205 260445 259739 258344 256208 254058 253462 255181 258106 260386 261277 261514 262271 264210 267239 270613
50981 270613 273356 275139 276714 279034 281856 283830 284157 283591 283405 283931 284761 285946 288005 290741 293117
50966 293117 294692 296442 299395 302973 305529 306430 306833 308158 310434 312617 314204 315912 318591 321974 325059
50951 325059 327586 330467 334322 338157 340287 340599 341128 344157 350241 358334 367166 375872 383751 390471 396731
50936 396731 404092 413600 424745 436167 447441 459793 474695 491958 509760 526714 543385 561346
50924 561346 581208 602281 623858 646001 669183 693990 721271 751665 784830 820060 857920
50913 857920 900181 947597 998927 1053023 1110895 1174484 1244047 1318128 1395711 1477003 1562105
50902 1562105 1650342 1741203 1834749 1930464 2026572 2121071 2212918 2301658 2386415 2465798 2538460
50891 2538460 2603328 2659575 2706832 2745323 2775445 2797202 2810207 2814154 2809306 2796798 2778681 2757551
50879 2757551 2735863 2715243 2696015 2677126 2656997 2635006 2612015 2588830 2564237 2535369 2500304
50868 2500304 2459581 2414697 2365693 2310901 2248843 2179723 2105185 2027284 1947828 1868098 1788660
50857 1788660 1709587 1631263 1554930 1482065 1413142 1347377 1284107 1224183 1169518 1121172 1078368
50846 1078368 1039627 1004426 973342 946851 924494 905225 888091 872583 858701 846838 837342
50835 837342 830013 824182 819495 816541 816466 819728 825135 830337 833605 835225 836960 840213 845120 851406 859390
50820 859390 869646 882196 896668 913002 931315 951152 971583 992273 1013979 1037695 1063616
50809 1063616 1091265 1120492 1151969 1186547 1224285 1264534 1307176 1353450 1405056 1462670 1526024
50798 1526024 1595411 1672225 1757658 1851630 1953520 2063295 2181414 2308390 2445193 2593350
50788 2593350 2753690 2925377 3107028 3298109 3498121 3704984 3915694 4128386 4342144
50779 4342144 4554563 4760862 4955732 5134834 5294288 5430441 5541272 5627096 5688997 5727428
50769 5727428 5743123 5738395 5716544 5680734 5634516 5582600 5529558 5477844 5428216 5381813 5340376
50758 5340376 5304195 5271016 5237406 5200163 5155915 5100578 5030659 4945017 4844447 4729468 4599433
50747 4599433 4454164 4295619 4127047 3950826 3768128 3580847 3392712 3207703 3027984
50738 3027984 2854361 2688432 2533083 2390619 2261125 2142962 2034321 1934250 1842819 1760520
50728 1760520 1686965 1620221 1558229 1500914 1449924 1406098 1368357 1335488 1307627 1284927 1265958
50717 1265958 1248806 1233090 1219491 1207814 1196992 1186822 1178094 1170883 1164089 1157003 1150058 1143568
50705 1143568 1136977 1130161 1124464 1121391 1120846 1121669 1123563 1127534 1134413 1143761 1154478 1166001 1178675 1193243
50691 1193243 1210292 1230210 1253482 1280805 1312670 1348923 1389026 1432900 1481254 1534952 1594219
50680 1594219 1658483 1726767 1798246 1872874 1951886 2037420 2131180 2233163 2341630 2454210 2569148
50669 2569148 2685908 2804867 2926302 3049421 3172332 3292784 3408619 3517537 3617171 3705882
50659 3705882 3783077 3847983 3898215 3930344 3942213 3934379 3909333 3870075 3819946 3763080 3703676
50648 3703676 3644369 3585882 3528699 3474678 3426427 3385192 3349960 3318688 3289806 3262116 3233689
50637 3233689 3201670 3163418 3117452 3063113 2999597 2925741 2840893 2746006 2643784 2537501 2429432
50626 2429432 2320501 2211676 2105449 2005244 1913197 1828978 1751061 1678608 1611696 1550451
50616 1550451 1494922 1445662 1403409 1367899 1337743 1311874 1290687 1275331 1266175 1262140 1261274 1261886
50604 1261886 1263582 1267423 1274603 1284851 1296734 1309683 1324858 1343492 1365325 1389521 1416255 1446153
50592 1446153 1478631 1512247 1546618 1582853 1622209 1665574 1714143 1768927 1829146 1892634 1958526
50581 1958526 2028245 2103116 2182472 2265116 2351140 2440692 2532084 2623043 2713167 2803085 2891325
50570 2891325 2974036 3048227 3113621 3170771 3218905 3256609 3283561 3300541 3308399 3308079 3301397 3290886
50558 3290886 3278717 3265973 3252888 3239531 3226303 3213916 3203017 3194100 3187771 3184338 3182710 3180451
50546 3180451 3175966 3170115 3164516 3158555 3149353 3134447 3112966 3084279 3047424 3002469 2950592 2891886
50534 2891886 2824758 2748772 2666564 2581450 2494429 2405371 2315983 2229295 2146507 2066540 1988836
50523 1988836 1914677 1845270 1780345 1719425 1663234 1612857 1568397 1529030 1493667 1461153 1430820
50512 1430820 1403577 1381644 1366418 1357148 1352194 1350830 1353012 1358170 1365394 1374628 1386669 1401843 1419373
50499 1419373 1438246 1458216 1479917 1504313 1532052 1562975 1596133 1630476 1665591 1701766 1739607
50488 1739607 1779757 1822600 1867719 1913684 1958732 2001830 2043175 2084055 2126422 2172112 2221933
50477 2221933 2275628 2333107 2395314 2463258 2536570 2614041 2695726 2783676 2880219 2986174 3100993
50466 3100993 3223872 3354107 3490986 3634081 3783282 3937651 4094279 4248969 4398169
50457 4398169 4539893 4672878 4795456 4905318 4999898 5076737 5133842 5169950 5184494 5177537 5150017
50446 5150017 5103725 5040491 4961521 4868125 4762991 4650079 4533225 4415556 4300264 4190977
50436 4190977 4090903 4002248 3926712 3865743 3819873 3788669 3771891 3769728 3780885 3801193 3825233
50425 3825233 3848935 3869497 3883306 3885536 3872156 3841304 3792467 3725392 3640381 3538991 3423946
50414 3423946 3298729 3167308 3033498 2900073 2768770 2641199 2519223 2404305 2296973
50405 2296973 2197131 2104399 2018119 1937804 1864059 1798537 1742508 1695606 1656083 1622037 1592390
50394 1592390 1567197 1547181 1532610 1522613 1515921 1512109 1511556 1514412 1520478 1530045 1543851 1562040 1584016
50381 1584016 1609372 1637871 1668374 1699181 1730008 1762353 1797270 1834089 1872082 1911751 1952955
50370 1952955 1993175 2029738 2063179 2096358 2130461 2163759 2194351 2222064 2247116 2268868 2287187
50359 2287187 2303804 2321058 2339978 2360668 2383832 2410498 2440448 2472261 2505326 2540886 2580558
50348 2580558 2624404 2671257 2720716 2773835 2831263 2891114 2949427 3002887 3050638 3093297 3130734
50337 3130734 3161367 3183407 3196163 3199876 3194420 3178386 3149625 3106967 3051398 2985394 2911229 2830354
50325 2830354 2744324 2655458 2566204 2478428 2393868 2314742 2243213 2180505 2127143 2083727 2050632
50314 2050632 2026974 2010744 2000456 1996315 1999387 2009591 2024590 2040584 2054102 2062966 2065644 2060401
50302 2060401 2045791 2021802 1989628 1950336 1904727 1854693 1803326 1752839 1703233 1653921 1605726
50291 1605726 1560113 1517130 1475659 1435494 1397810 1363429 1331858 1302364 1275053 1250516 1229095
50280 1229095 1210812 1195388 1182052 1169920 1158895 1149853 1143717 1140629 1139964 1140834 1142734 1146045 1151769
50267 1151769 1160404 1171400 1184217 1199331 1217333 1237436 1257956 1278241 1299172 1321761 1346109
50256 1346109 1371656 1397420 1421986 1444400 1465399 1486794 1509388 1532290 1554343 1575116 1594300
50245 1594300 1611367 1626464 1640641 1654478 1667270 1678063 1686761 1693698 1698936 1702456 1704175 1703271 1698583
50232 1698583 1690422 1680879 1671267 1660191 1645459 1627237 1607871 1588946 1569944 1549765 1528167 1505437
50220 1505437 1481781 1457741 1434524 1413369 1394746 1378179 1362437 1345924 1327679 1308312 1289533
50209 1289533 1272613 1257754 1244920 1234310 1225483 1216810 1206817 1195989 1186462 1179827 1175798 1173094 1170874
50196 1170874 1168916 1167161 1165865 1165848 1167554 1169827 1170549 1168863 1165977 1163268 1160415 1156199 1150520 1144454 1138574
50181 1138574 1132405 1125677 1118982 1112654 1105748 1096990 1086488 1076005 1067491 1061541 1057092 1052430 1046531
50168 1046531 1039647 1032800 1026961 1022662 1020025 1018899 1019214 1021353 1025645 1031338 1036785 1041146 1045206 1049833
50154 1049833 1054467 1058123 1061137 1064602 1068531 1071994 1074718 1076917 1077729 1075623 1070642 1064486 1057927 1049878
50140 1049878 1039732 1028903 1018965 1009659 999886 989485 978814 967573 955344 942533 929761 917022
50128 917022 904351 892439 881620 871287 861501 853987 850007 848092 845669 842266 839249 836761 833051
50115 833051 827086 820028 813584 808305 804052 800854 798506 796193 793231 789686 785924 781996 777640 772409
50101 772409 765800 757838 749486 741756 734473 726693 718293 710232 703122 696447 689474 682233 675437 670027
50087 670027 666736 665186 663475 659797 654734 650884 649839 650613 651559 652611 654641 657477 659784 660716 660843
50072 660843 661636 664626 670593 678718 686647 692282 695685 698753 703075 708716 715192 722761 732149 743378
50058 743378 755531 767761 779998 792415 804642 816037 826623 837212 848411 859984 871435
50047 871435 882795 894351 905852 916520 925865 934221 942421 951068 959929 967965 974244 979027 983629
50034 983629 988997 994921 1000865 1006837 1012805 1017992 1021709 1024468 1027243 1029987 1032066 1033962 1037157 1042098
50020 1042098 1047614 1052900 1058850 1066614 1075798 1085151 1094427 1104556 1116235 1129339 1143641 1159360 1176842
50007 1176842 1196177 1217180 1239320 1261591 1282981 1303328 1323533 1344712 1367144 1390045 1412217
49996 1412217 1432821 1451636 1468794 1484454 1498702 1511452 1522298 1530734 1536839 1541580 1545997 1549950
49984 1549950 1551871 1549937 1543523 1533680 1522319 1510800 1499087 1486244 1471747 1456157 1440619 1426124
49972 1426124 1413297 1402213 1392048 1381579 1370624 1360607 1353062 1348052 1344675 1342635 1342413 1344163 1347423
49959 1347423 1351914 1357912 1365881 1376330 1389666 1405391 1421829 1437658 1453339 1469869 1486523 1501472
49947 1501472 1514463 1526971 1539265 1549279 1555280 1557890 1558247 1555778 1549443 1540150 1530143 1520507 1510788
49934 1510788 1500620 1490124 1478812 1465520 1449611 1431135 1409680 1384084 1353573 1318608 1280704
49923 1280704 1242120 1205434 1172201 1141796 1112365 1083099 1054903 1028875 1005091 983133 962943
49912 962943 944685 928344 913764 900582 888020 875285 862361 849768 837505 824977 812194
49901 812194 800138 789527 779946 770672 761693 753301 745232 736885 727952 718273 707557 695923 684341
49888 684341 673780 664189 655039 646664 640131 635766 632484 628871 624451 619834 616136 614323 614512 615669
49874 615669 616383 616112 615332 614563 613964 613979 615425 618358 621509 623644 625093 627181 630511 634620 639079 643955
49858 643955 649153 654337 659733 666042 673167 680010 686253 693511 703635 716360 729709 742517 755354
49845 755354 768968 783067 797185 811717 827345 844177 862329 882764 906482 933056 961037
49834 961037 989865 1020313 1052701 1085708 1117586 1147766 1176384 1202886 1226319 1246814 1265557
49823 1265557 1283099 1298899 1313074 1327485 1343941 1361824 1378371 1391109 1399252 1403077 1402953 1399055
49811 1399055 1391134 1378383 1360211 1337361 1311541 1283793 1253920 1221744 1188119 1154256 1120653
49800 1120653 1087268 1054287 1022224 991460 962097 934106 907607 883285 862330 845184 830366
49789 830366 815513 799861 784666 770945 758138 745697 734530 725580 718054 710476 702664 695208
49777 695208 687759 679612 671387 664098 656791 647356 636090 626365 620774 618182 615565 611379 606008 600182
49763 600182 594467 589676 586399 584202 582099 579642 577076 574833 573431 573375 574567 576169 577507 578727 580287
49748 580287 582444 585606 590215 595632 600091 602779 605109 608760 613140 616302 618021 620247 624322 629212
49734 629212 633083 635429 636909 638078 639246 641020 644018 648157 652814 657588 662470 667581 673296 680500
49720 680500 689979 701507 714059 727106 741121 756503 772678 789018 806414 826939 851490 878220
49708 878220 903784 926049 945302 963024 979887 995126 1007687 1017718 1026676 1035910 1045480 1054726
49696 1054726 1063519 1072176 1080253 1086473 1090132 1091578 1090751 1086261 1076851 1063046 1046335 1027291 1005594
49683 1005594 981535 956300 930920 905919 881935 859714 839636 822082 807908 797441 789303
49672 789303 781566 773959 767682 763200 759738 756921 755158 754059 752151 748801 744971 741479 738047 734689
49658 734689 732427 731612 731007 729520 727491 725281 722227 718336 715538 715520 717359 718928 719661 720233 720533 719908
49642 719908 718844 718398 718237 717127 715256 714243 714762 715754 716252 716525 717130 718121 719543 721644 724296 727087
49626 727087 729980 732954 735214 735985 735932 736457 737592 738037 737559 737758 739907 743257 746187 748028 749149 750129
49610 750129 751476 753456 755709 757636 759389 761821 765259 769099 772676 775597 777112 776487 774533 773608 775294
49595 775294 778698 781692 783066 783026 782483 782610 784407 787797 791373 793547 793719 792187 789583 786812 784948
49580 784948 784620 785860 788632 792742 796946 799158 798361 795755 793344 791902 790962 790213 789987 790605 791999 793990
49564 793990 796438 799199 802190 805352 808395 810996 813527 817106 822453 829052 835807 842205 848471 854998
49550 854998 862071 869863 878177 886399 894088 901485 909286 918194 928798 941318 955009 968366 980584
49537 980584 992574 1006067 1021768 1038827 1055936 1072511 1088870 1105752 1123849 1143561 1164955
49526 1164955 1187807 1211618 1235798 1260143 1285110 1311378 1339196 1368358 1398554 1429446 1460759
49515 1460759 1492969 1527492 1565343 1605743 1646965 1688460 1731034 1774958 1819334 1863728 1909024
49504 1909024 1955865 2003449 2050902 2098911 2148797 2200610 2253250 2305908 2358344 2410209 2461306
49493 2461306 2512347 2564278 2616772 2668240 2717483 2764613 2810221 2854223 2895619 2933027 2965619
49482 2965619 2993998 3019885 3044283 3066105 3083239 3094868 3102174 3106892 3109863 3111037 3110175 3107275 3102643
49469 3102643 3096739 3089843 3082078 3073956 3066539 3060620 3056106 3052757 3051232 3052733 3057740 3065743 3076105 3088602
49455 3088602 3103088 3119198 3136524 3154865 3174440 3195942 3219726 3244446 3267267 3286469 3303380
49444 3303380 3320549 3338318 3354526 3367493 3377632 3385595 3390473 3390948 3387146 3380008 3369320 3353669
49432 3353669 3332312 3306161 3276773 3244944 3210311 3171724 3127982 3078867 3025750 2970844 2915579
49421 2915579 2859934 2803437 2746354 2689419 2632596 2574863 2515610 2455935 2397931 2342689 2289582
49410 2289582 2237636 2186950 2138192 2091284 2045527 2001020 1958987 1920347 1884666 1850972 1819117
49399 1819117 1789671 1762725 1737505 1713291 1690252 1669043 1649803 1631874 1614579 1598125 1583393
49388 1583393 1570761 1559384 1548017 1536478 1525861 1517206 1510339 1504318 1498651 1493654 1489735 1486801 1484435
49375 1484435 1482499 1481493 1482502 1486522 1493429 1501567 1508975 1515419 1522982 1534157 1549432 1567106 1585433
49362 1585433 1604593 1626399 1652292 1681558 1711070 1736633 1755163 1766187 1771438 1773088 1772659 1771541
49350 1771541 1771596 1774366 1779890 1787077 1795324 1805282 1818013 1833957 1852807 1873785 1895805 1917891 1939925
49337 1939925 1962686 1986773 2011581 2035665 2058144 2079614 2101552 2124686 2147909 2169122 2187416
49326 2187416 2204192 2221712 2240807 2260468 2279333 2296696 2312173 2325609 2337827 2350632 2365393
49315 2365393 2382043 2399887 2418813 2439072 2460384 2482058 2503850 2526047 2548774 2571680 2594381
49304 2594381 2616872 2639505 2662778 2687079 2712542 2739225 2767389 2797274 2828601 2860744 2893515
49293 2893515 2927325 2962409 2998504 3035625 3074638 3116622 3161870 3209617 3258335 3306419 3353541
49282 3353541 3401628 3453553 3510306 3570183 3631285 3693667 3758287 3825041 3893253 3963297 4036054
49271 4036054 4111036 4186624 4262261 4339022 4417762 4497877 4578303 4658769 4739546 4820632 4901549
49260 4901549 4981526 5059865 5136664 5212967 5289270 5363901 5433969 5498111 5557271 5612480 5663097
49249 5663097 5707892 5746835 5780672 5809224 5831183 5845674 5853409 5856257 5856009 5853479 5848526 5840827 5830622
49236 5830622 5818517 5804749 5789102 5771756 5753791 5736637 5721157 5707412 5695050 5683797 5673768
49225 5673768 5665401 5659048 5654850 5653213 5655009 5660842 5670298 5682452 5696811 5713103 5730431 5747708 5764962
49212 5764962 5783158 5802393 5821193 5838077 5852917 5865964 5876096 5880919 5878535 5868860 5853333 5833632
49200 5833632 5810380 5782772 5749506 5710207 5665740 5617222 5565163 5509652 5450824 5388900 5324275
49189 5324275 5257900 5191184 5125161 5059850 4994525 4928447 4861544 4794927 4730529 4669397 4610236
49178 4610236 4550507 4489319 4428496 4370536 4316287 4265027 4215885 4168435 4122502 4078085 4035089
49167 4035089 3992833 3950644 3909567 3872395 3840813 3813078 3785856 3758226 3732578 3711439 3694592
49156 3694592 3679806 3665516 3651956 3639978 3629539 3619657 3609666 3600111 3592075 3585866 3580911 3576988 3574764
49143 3574764 3574701 3576098 3577860 3579782 3582499 3586611 3592607 3601187 3612729 3626554 3641515 3657306 3674375
49130 3674375 3692569 3710830 3728538 3746481 3766037 3787796 3811238 3835407 3859712 3884374 3910329
49119 3910329 3938391 3968322 3998851 4028704 4057485 4085665 4114061 4143354 4173879 4205801 4239503
49108 4239503 4275499 4313674 4352939 4392197 4431527 4471906 4513826 4556771 4599989 4643181 4686371
49097 4686371 4729759 4773836 4819077 4865253 4911510 4957315 5002864 5048377 5093510 5137721 5180865
49086 5180865 5223234 5265451 5308277 5351775 5394365 5433560 5468226 5499512 5528978 5556568 5581366
49075 5581366 5603684 5625059 5646332 5667044 5686957 5706871 5727356 5747710 5767044 5785600 5804071
49064 5804071 5822303 5839773 5856916 5874610 5892347 5908345 5921851 5934130 5946461 5958333 5968682
49053 5968682 5977988 5987701 5997952 6007324 6014858 6020881 6025699 6029056 6031555 6035142 6040878 6047217 6051918 6055143
49039 6055143 6059168 6065266 6072471 6079594 6086914 6095102 6103670 6111620 6119044 6127026 6136129 6145656 6154373 6161483
49025 6161483 6167144 6172498 6178990 6187130 6196023 6204519 6212428 6220067 6227137 6233227 6239315 6247325 6257626 6268050
49011 6268050 6276271 6282363 6287929 6293278 6296813 6297172 6294690 6290379 6284445 6276388 6265835 6252655 6236762
48998 6236762 6218418 6198298 6176662 6152809 6125957 6096416 6065188 6032604 5998109 5961470 5923522
48987 5923522 5885338 5847127 5808266 5768307 5727742 5687788 5649408 5612488 5576132 5539935 5504763
48976 5504763 5471994 5442165 5414713 5388806 5363947 5339947 5316846 5294969 5274659 5255924 5238715
48965 5238715 5223408 5210521 5200032 5191466 5184598 5179449 5175575 5172100 5168581 5165220 5162121 5159042 5156027
48952 5156027 5153487 5151455 5149584 5148240 5148490 5150303 5151710 5150796 5147906 5144777 5141997 5138651 5134235 5129442
48938 5129442 5124698 5119124 5111604 5102037 5090856 5078011 5063282 5047123 5030260 5012447 4992534 4969988
48926 4969988 4945641 4920400 4893761 4864418 4832168 4798373 4764284 4729702 4693839 4656849 4619628
48915 4619628 4582355 4544185 4504469 4463564 4422314 4381482 4341924 4304560 4269625 4236393 4204058
48904 4204058 4172627 4142792 4115437 4091478 4071437 4054661 4039533 4025122 4012295 4002713 3996987 3994341
48892 3994341 3993850 3995594 4000688 4010281 4024136 4040178 4056305 4072984 4093092 4118440 4147246 4175988
48880 4175988 4203025 4229334 4256375 4284773 4314795 4346554 4379428 4412531 4446118 4481466 4519056
48869 4519056 4557918 4597262 4637675 4679914 4723376 4766696 4809412 4852304 4896497 4943047 4993092
48858 4993092 5047345 5105133 5164634 5224598 5285632 5349414 5416804 5487152 5559460 5633630 5710039
48847 5710039 5788293 5867247 5946398 6026520 6108573 6192556 6277767 6363494 6448812 6532293 6612778
48836 6612778 6690227 6765232 6837930 6907856 6974475 7037237 7095709 7150341 7202583 7253178 7300750
48825 7300750 7343012 7378893 7408423 7431311 7447435 7458416 7466515 7471499 7470645 7462790 7450613 7437411
48813 7437411 7422829 7403431 7376832 7343823 7306692 7266777 7223926 7177491 7127460 7074640 7019714
48802 7019714 6962278 6901537 6837998 6773484 6709055 6643957 6577314 6509802 6442643 6375748 6308198
48791 6308198 6240128 6172878 6107443 6043855 5982027 5922251 5864847 5810181 5759069 5712269 5669351
48780 5669351 5628733 5589101 5550479 5514043 5481289 5453128 5429067 5407455 5387243 5369363 5355645
48769 5355645 5346495 5340532 5336513 5334711 5336109 5341134 5349602 5361165 5375345 5391629 5410031 5431118 5455015
48756 5455015 5480689 5506764 5532952 5560287 5589940 5621965 5655210 5688303 5720725 5752915 5785451
48745 5785451 5818430 5851830 5886066 5921635 5958358 5995503 6032672 6069991 6107342 6144091 6179886
48734 6179886 6215246 6250790 6286168 6320336 6352957 6385112 6418368 6453223 6488616 6522963 6555498
48723 6555498 6586569 6616710 6645663 6672339 6695637 6715481 6733270 6751171 6770433 6790257 6808647
48712 6808647 6824304 6837253 6847642 6854917 6858550 6858688 6855305 6847392 6833896 6815117 6792336 6766304
48700 6766304 6736796 6703233 6664974 6621475 6573255 6522330 6470394 6416713 6359145 6297340 6233574
48689 6233574 6170271 6108213 6047606 5989181 5933068 5877878 5822295 5766891 5713238 5661991 5613052
48678 5613052 5567055 5525240 5488064 5455245 5427100 5404571 5387764 5375596 5367299 5363428 5364971 5372108
48666 5372108 5384222 5400529 5420322 5443010 5468225 5495627 5524517 5554107 5584291 5615611 5648286
48655 5648286 5681770 5715435 5749128 5782760 5815965 5848627 5881193 5913871 5945849 5975993 6004308
48644 6004308 6032100 6060538 6089308 6116708 6140919 6161333 6179112 6196607 6216005 6238260 6263053
48633 6263053 6289519 6316898 6344996 6374558 6407137 6443985 6484771 6527693 6571078 6614707 6659505
48622 6659505 6706360 6755657 6807645 6862544 6920227 6980362 7043115 7109179 7178596 7249866 7320869
48611 7320869 7390602 7459417 7527395 7593094 7654252 7709424 7758600 7802497 7841574 7875496 7903096
48600 7903096 7922819 7933444 7934359 7925101 7905020 7873792 7832064 7781139 7722020 7655164 7581174 7501347
48588 7501347 7417350 7330456 7241054 7148733 7053069 6954649 6855207 6756381 6658464 6560759 6462939
48577 6462939 6365463 6268894 6173596 6080197 5989493 5901714 5816552 5734045 5654499 5577325 5501153
48566 5501153 5425822 5353122 5284509 5218921 5154129 5089618 5026737 4966389 4908135 4851507 4796578
48555 4796578 4742954 4689848 4637803 4588903 4544318 4502619 4461467 4420065 4378982 4338574 4298930
48544 4298930 4260712 4224558 4189830 4155289 4121003 4088376 4058151 4029588 4001821 3974813 3948440
48533 3948440 3921833 3894606 3868035 3843912 3822464 3802214 3781896 3761858 3743482 3727717 3714364
48522 3714364 3702519 3691550 3681793 3674336 3670049 3668739 3669215 3670069 3670469 3670495 3671031 3673295 3678222 3686034 3696181
48507 3696181 3707726 3720027 3733276 3748164 3764677 3781403 3796485 3809227 3820284 3830254 3838818 3845661
48495 3845661 3851630 3858303 3866554 3876091 3886196 3896485 3906935 3917729 3929193 3941521 3954397 3967090
48483 3967090 3979002 3989991 4000186 4009783 4019106 4028561 4038337 4048256 4057966 4067123 4075439 4082914 4090168
48470 4090168 4098253 4107783 4118404 4129305 4140148 4151162 4162456 4173683 4184525 4195260 4206651 4219436
48458 4219436 4234021 4250509 4268859 4289092 4311392 4335862 4362091 4389307 4417236 4446568 4478248
48447 4478248 4512510 4549024 4587674 4628425 4670530 4712880 4755615 4800478 4848698 4899074 4949194
48436 4949194 4998419 5048570 5101381 5156181 5210694 5263578 5315508 5367945 5421606 5476242 5531283
48425 5531283 5586140 5639888 5691216 5739142 5783676 5825339 5863936 5898282 5927339 5951091 5969880
48414 5969880 5983442 5991423 5994556 5994303 5991194 5984360 5973093 5958116 5940805 5921657 5900094 5875394
48402 5875394 5847242 5815595 5780688 5743214 5704052 5663660 5621907 5578513 5533482 5487095 5439614
48391 5439614 5391038 5341111 5289599 5236605 5182615 5128310 5074353 5021062 4968081 4914690 4860863
48380 4860863 4807810 4756942 4708501 4661884 4617161 4575400 4537337 4502747 4471455 4443931 4420145
48369 4420145 4398597 4377472 4356423 4336631 4319571 4306346 4297551 4292631 4289583 4286314 4282434 4279130
48357 4279130 4277477 4277745 4280157 4285155 4292488 4300754 4308407 4314914 4320843 4327284 4335221 4344870 4355333 4365321
48343 4365321 4374482 4383756 4394416 4407191 4422313 4439669 4458491 4477402 4495302 4512141 4528651 4545527
48331 4545527 4562918 4580363 4597056 4612377 4626272 4638854 4649700 4658040 4663863 4668320 4672634 4676760
48319 4676760 4679469 4679720 4677770 4674810 4671498 4667149 4660799 4653124 4646557 4642975 4641854 4641401 4640877 4640692 4640682
48304 4640682 4639818 4637822 4635653 4633988 4632589 4631966 4634297 4641349 4652096 4663488 4673258 4681125 4687864 4694433
48290 4694433 4701947 4711357 4722807 4735751 4749574 4763624 4776964 4788918 4799839 4810672 4821849 4833165
48278 4833165 4844440 4855359 4864782 4871304 4874809 4876733 4878522 4880527 4882553 4884609 4886537 4887593 4887142 4885454
48264 4885454 4883246 4880564 4876473 4869771 4859927 4847489 4833718 4819586 4805187 4790382 4775739 4762038
48252 4762038 4748845 4734639 4718823 4702734 4687961 4674399 4660876 4647121 4634007 4622084 4610970
48241 4610970 4600244 4590062 4580759 4572646 4566444 4563100 4562734 4564337 4566843 4570000 4573970 4578760 4584554 4591925
48227 4591925 4601036 4611119 4621593 4633221 4647045 4662019 4674813 4682712 4686248 4688353 4691143 4694049
48215 4694049 4694901 4692161 4685800 4676529 4664721 4650057 4631754 4609007 4581591 4550345 4516833 4482099
48203 4482099 4445738 4406551 4364104 4319303 4273433 4227187 4180803 4134518 4088331 4041681 3994027
48192 3994027 3945744 3897923 3851348 3806027 3761630 3717907 3674672 3631885 3589872 3549025 3509226
48181 3509226 3470090 3431892 3395710 3362220 3330670 3299406 3267347 3234815 3203183 3173864 3147338
48170 3147338 3122873 3099217 3075599 3051912 3028189 3004385 2980616 2956997 2933129 2908449 2883346
48159 2883346 2859209 2836861 2815459 2793401 2769836 2744912 2719202 2693556 2668917 2645457 2622292
48148 2622292 2598744 2575370 2552779 2529990 2505321 2478906 2452938 2428925 2405770 2381230 2354566
48137 2354566 2327022 2300185 2274650 2250336 2227575 2207391 2190398 2175501 2160375 2143822 2127116
48126 2127116 2112334 2099819 2088340 2077482 2068404 2061917 2057061 2052331 2047497 2043586 2041674 2042121 2044363
48113 2044363 2047007 2048892 2050513 2053693 2059349 2066495 2074002 2082243 2091979 2102488 2112190 2120677 2128894 2137496
48099 2137496 2146236 2154938 2163970 2173608 2183859 2194940 2206895 2218597 2228257 2235526 2242310 2250817 2261163
48086 2261163 2271407 2279564 2285185 2289334 2293578 2298998 2305723 2313130 2320490 2327513 2334436 2341717 2349458 2357045
48072 2357045 2363628 2369201 2374968 2382259 2391200 2400688 2409503 2417148 2423944 2430755 2438518 2447639 2457860 2468793
48058 2468793 2480145 2491182 2500796 2508921 2517316 2527887 2540346 2552611 2563476 2573782 2584800 2596520
48046 2596520 2608024 2618600 2627898 2635698 2642328 2648962 2656911 2666614 2677494 2688564 2699097 2709127
48034 2709127 2719542 2731453 2745337 2761010 2778094 2796031 2813922 2831361 2849400 2869655 2892209
48023 2892209 2915450 2938318 2961501 2985816 3010686 3035412 3061011 3089220 3119926 3150919 3180478
48012 3180478 3209189 3238985 3271081 3305181 3340274 3375902 3412668 3451534 3492726 3535864 3581318
48001 3581318 3630656 3685105 3744187 3806782 3873167 3944744 4020968 4096351 4160297 4200411 4208139
47990 4208139 4183521 4134992 4073709 4007553 3940105 3873412 3809334 3748256 3688768 3629897 3572695
47979 3572695 3518910 3469045 3422412 3378221 3335694 3293804 3251936 3210470 3169965 3130128 3090270
47968 3090270 3050397 3011029 2972211 2933580 2895320 2858122 2821879 2785081 2745891 2703757 2659809
47957 2659809 2615795 2572595 2529651 2485899 2441237 2396806 2353780 2312334 2272017 2232590 2193969
47946 2193969 2155852 2118183 2081741 2047471 2015211 1983836 1952883 1923358 1896562 1872484 1849762
47935 1849762 1827070 1804357 1782805 1763601 1746658 1730684 1714754 1699566 1686624 1676281 1667191
47924 1667191 1657853 1648023 1638294 1628903 1619608 1610426 1601849 1594279 1587671 1581819 1576712 1572451 1568874 1565337
47910 1565337 1561023 1555698 1550244 1545968 1543153 1540567 1536722 1531355 1525305 1519239 1513146 1506959 1500928 1495123
47896 1495123 1489168 1482890 1476766 1471294 1466193 1460723 1454523 1447633 1439930 1431250 1422091 1413442 1405592 1397721
47882 1397721 1389197 1380748 1373669 1368148 1363180 1358229 1354197 1352396 1352963 1354736 1356453 1357897 1360035 1364195
47868 1364195 1370843 1378951 1386849 1393920 1401103 1409480 1418844 1428201 1437289 1446882 1457722 1469852 1482935
47855 1482935 1496205 1507970 1516267 1520787 1523446 1526224 1528953 1530236 1530136 1530447 1532006 1532944 1530452 1523654
47841 1523654 1514032 1503587 1493494 1484200 1475689 1467314 1458107 1447659 1436371 1424710 1412751 1400686
47829 1400686 1389214 1378961 1369841 1361372 1353362 1345905 1339115 1333327 1329228 1327125 1326293 1325673 1325179 1325673
47815 1325673 1327685 1330780 1334228 1337648 1340997 1344705 1349960 1357903 1368085 1378431 1387286 1394914 1402528
47802 1402528 1410725 1419593 1429458 1440151 1449873 1456204 1458588 1458862 1459032 1459284 1458551 1456321 1453161 1449721 1445713
47787 1445713 1440025 1431773 1421225 1409609 1397949 1386366 1374538 1362250 1349115 1334520 1318681 1303349
47775 1303349 1290455 1280176 1271228 1262893 1255677 1249980 1245253 1240769 1236308 1231809 1227248 1223229 1220816
47762 1220816 1220393 1221390 1223270 1225883 1228694 1230893 1232666 1235141 1238534 1241593 1243568 1245368 1247858 1250431
47748 1250431 1252558 1255437 1260380 1266449 1271473 1274856 1277709 1280572 1282824 1284231 1285509 1287154 1289045 1291174
47734 1291174 1293540 1295448 1296391 1297549 1300829 1306215 1311632 1315707 1319184 1323320 1328521 1335137 1343960 1355102
47720 1355102 1367606 1380938 1395620 1411759 1428471 1445656 1464854 1487018 1510564 1532992 1553527
47709 1553527 1572982 1591968 1610672 1629560 1648746 1667110 1683426 1697953 1711552 1723674 1732828
47698 1732828 1738960 1743765 1748396 1752134 1753750 1752998 1750224 1745355 1738044 1728529 1717935 1707581 1697756 1687036
47684 1687036 1673473 1657045 1640306 1625772 1613315 1601269 1589469 1579458 1571677 1564392 1556207 1548322
47672 1548322 1543182 1541685 1542672 1544683 1547196 1550324 1554127 1558515 1563574 1569819 1578048 1588783 1601943 1617320
47658 1617320 1635132 1655551 1677735 1700172 1722222 1744759 1768896 1794510 1820358 1845165 1868163
47647 1868163 1888961 1907572 1924656 1941292 1958139 1974617 1989004 1999716 2006761 2011698 2015812 2018652
47635 2018652 2018815 2015729 2009816 2001137 1989051 1973641 1956393 1938691 1920137 1899166 1875258 1850102
47623 1850102 1826590 1806812 1790812 1776976 1763724 1750890 1739450 1730139 1722881 1717455 1713994 1712561
$$ [...]
##END NTUPLES=NMR SPECTRUM
##END=
