
##TITLE=AC1216_HNAAH12057_6672246_mh7D5xwUAd
##JCAMPDX= 6.0         $$ Bruker NMR JCAMP-DX V2.0
##DATA TYPE= NMR SPECTRUM
##DATA CLASS= NTUPLES
##ORIGIN= BRUKER
##OWNER= Administrator
$$ 1.72 TOPSPIN		Version 2.1
$$ 2012-08-14 15:59:39.000 -0500  Administrator@TOPSPIN
$$ Compression mode = diff/dup
##.OBSERVE FREQUENCY= 400.02188249412
##.OBSERVE NUCLEUS= ^1H
##.ACQUISITION MODE= SIMULTANEOUS (DQD)
##.ACQUISITION SCHEME= undefined
##.AVERAGES= 64
##.DIGITISER RES= 22
##SPECTROMETER/DATA SYSTEM= spect
##.PULSE SEQUENCE= noesygpps1d.comp
##.SOLVENT NAME= COFFEE_meoh
##.SHIFT REFERENCE= INTERNAL, COFFEE_meoh, 1, 14.96086
##AUDIT TRAIL= $$ (NUMBER, WHEN, WHO, WHERE, PROCESS, VERSION, WHAT)
$$ ##TITLE= Audit trail, TOPSPIN		Version 2.1
$$ ##JCAMPDX= 5.01
$$ ##ORIGIN= Bruker BioSpin GmbH
$$ ##OWNER= Administrator
$$ $$ C:\Bruker\TOPSPIN/data/COFFEE/nmr/AC1216_HNAAH12057_6672246_mh7D5xwUAd/12/pdata/1/auditp.txt
$$ ##AUDIT TRAIL=  $$ (NUMBER, WHEN, WHO, WHERE, PROCESS, VERSION, WHAT)
(   1,<2012-08-14 15:59:25.062 -0500>,<Administrator>,<TOPSPIN>,<go>,<TOPSPIN 2.1>,
      <created by zg
	started at 2012-08-14 15:47:54.718 -0500,
	POWCHK enabled, PULCHK disabled,
       configuration hash MD5:
       6B 1B 68 BB D9 2E 58 E2 7F 35 AD 54 07 DF 0E 41
       data hash MD5: 64K
       58 F9 E4 57 DE 06 06 5C 51 79 80 24 D7 F5 9A F4>)
(   2,<2012-08-14 15:59:35.562 -0500>,<Administrator>,<TOPSPIN>,<proc1d>,<TOPSPIN 2.1>,
      <Start of raw data processing
       efp LB = 0.3 FT_mod = 6 PKNL = 1 PHC0 = 0 PHC1 = 0 SI = 128K 
       data hash MD5: 128K
       6B 90 BB 6A 74 52 C7 7A 72 FE 92 99 AD 92 A8 C9>)
(   3,<2012-08-14 15:59:36.890 -0500>,<Administrator>,<TOPSPIN>,<proc1d>,<TOPSPIN 2.1>,
      <pk PHC0 = -4.32312 PHC1 = 0 
       data hash MD5: 128K
       4B F3 5A 24 B2 CF FD 64 76 A9 82 1D C1 69 44 8C>)
(   4,<2012-08-14 15:59:37.875 -0500>,<Administrator>,<TOPSPIN>,<proc1d>,<TOPSPIN 2.1>,
      <abs ABSG = 1 
       data hash MD5: 128K
       FA 10 18 ED 39 79 3E 9C 5E 3A CA E5 D8 5A 61 EC>)
(   5,<2012-08-14 15:59:37.984 -0500>,<Administrator>,<TOPSPIN>,<proc1d>,<TOPSPIN 2.1>,
      <abs ABSG = 2 
       data hash MD5: 128K
       D0 84 42 71 85 79 2B 92 90 B8 BC CB BE F5 E0 D0>)
(   6,<2012-08-14 15:59:38.093 -0500>,<Administrator>,<TOPSPIN>,<proc1d>,<TOPSPIN 2.1>,
      <abs ABSG = 3 
       data hash MD5: 128K
       19 F7 6D A5 6E 3C DC 3A 23 5D 59 02 B7 BE 66 9D>)
(   7,<2012-08-14 15:59:38.171 -0500>,<Administrator>,<TOPSPIN>,<proc1d>,<TOPSPIN 2.1>,
      <abs ABSG = 4 
       data hash MD5: 128K
       E3 64 A3 A3 FE 9D 27 88 3E FD A0 C2 85 A1 6D 56>)
(   8,<2012-08-14 15:59:38.250 -0500>,<Administrator>,<TOPSPIN>,<proc1d>,<TOPSPIN 2.1>,
      <abs ABSG = 5 
       data hash MD5: 128K
       AD 98 40 E9 F3 4A A4 1A CF 82 86 F7 02 28 FF 15>)
$$ ##END=
$$ 
$$ $$ hash MD5
$$ $$ 76 86 EE 86 AE C1 C4 9C 41 5F B2 45 20 0B D5 7F
##$RELAX= 
##$RELAX= 
##$RELAX= 
##$RELAX= 
##$RELAX= 
##$RELAX= 
##$RELAX= 
##$RELAX= 
$$ Bruker specific parameters
$$ [...]
150 150 150 150 150 150 150 150
##$TP07= 0
##$TPNAME0= <>
##$TPNAME1= <>
##$TPNAME2= <>
##$TPNAME3= <>
##$TPNAME4= <>
##$TPNAME5= <>
##$TPNAME6= <>
##$TPNAME7= <>
##$TPOAL= (0..7)
0.5 0.5 0.5 0.5 0.5 0.5 0.5 0.5
##$TPOFFS= (0..7)
0 0 0 0 0 0 0 0
##$TUNHIN= 0
##$TUNHOUT= 0
##$TUNXOUT= 0
##$USERA1= <user>
##$USERA2= <user>
##$USERA3= <user>
##$USERA4= <user>
##$USERA5= <user>
##$V9= 5
##$VALIST= <valist>
##$VCLIST= <CCCCCCCCCCCCCCC>
##$VD= 0
##$VDLIST= <DDDDDDDDDDDDDDD>
##$VPLIST= <PPPPPPPPPPPPPPP>
##$VTLIST= <TTTTTTTTTTTTTTT>
##$WBST= 1024
##$WBSW= 4
##$XGAIN= (0..3)
0 0 0 0
##$XL= 0
##$YL= 0
##$YMAX_a= 10291298
##$YMIN_a= -8633467
##$ZGOPTNS= <>
##$ZL1= 120
##$ZL2= 120
##$ZL3= 120
##$ZL4= 120
##$ABSF1= 14.96086
##$ABSF2= -5.597322
##$ABSG= 5
##$ABSL= 3
##$ALPHA= 0
##$AQORDER= 0
##$ASSFAC= 0
##$ASSFACI= 0
##$ASSFACX= 0
##$ASSWID= 0
##$AUNMP= <proc_prof1d_extract.lims>
##$AXLEFT= 0
##$AXNAME= <>
##$AXNUC= <1H>
##$AXRIGHT= 0
##$AXTYPE= 0
##$AXUNIT= <>
##$AZFE= 0.1
##$AZFW= 0.1
##$BCFW= 0
##$BC_mod= 0
##$BYTORDP= 0
##$COROFFS= 0
##$CY= 15
##$DATMOD= 1
##$DC= 0
##$DFILT= <>
##$DTYPP= 0
##$F1P= 0
##$F2P= 0
##$FCOR= 0.5
##$FTSIZE= 131072
##$FT_mod= 6
##$GAMMA= 0
##$GB= 0
##$INTBC= 1
##$INTSCL= 1
##$ISEN= 128
##$LB= 0.3
##$LEV0= 0
##$LPBIN= 0
##$MAXI= 10000
##$MC2= 0
##$MEAN= 0
##$ME_mod= 0
##$MI= 0
##$NCOEF= 0
##$NC_proc= -2
##$NLEV= 6
##$NOISF1= 0
##$NOISF2= 0
##$NSP= 0
##$NTH_PI= 0
##$NZP= 0
##$OFFSET= 14.96086
##$PC= 1
##$PHC0= -4.32312
##$PHC1= 0
##$PH_mod= 1
##$PKNL= yes
##$PPARMOD= 0
##$PPDIAG= 0
##$PPIPTYP= 0
##$PPMPNUM= 2147483647
##$PPRESOL= 1
##$PSCAL= 4
##$PSIGN= 0
##$PYNMP= <proc.py>
##$REVERSE= no
##$SF= 400.020009691633
##$SI= 131072
##$SIGF1= 0
##$SIGF2= 0
##$SINO= 400
##$SIOLD= 131072
##$SPECTYP= <>
##$SREGLST= <1H.CDCl3>
##$SSB= 0
##$STSI= 131072
##$STSR= 0
##$SW_p= 8223.68421052631
##$SYMM= 0
##$S_DEV= 0
##$TDeff= 65536
##$TDoff= 0
##$TI= <>
##$TILT= no
##$TM1= 0
##$TM2= 0
##$TOPLEV= 0
##$USERP1= <user>
##$USERP2= <user>
##$USERP3= <user>
##$USERP4= <user>
##$USERP5= <user>
##$WDW= 1
##$XDIM= 131072
##$YMAX_p= 395170496
##$YMIN_p= -12479
##$CURPLOT= <Network HP LaserJet P1505>
##$CURPRIN= <$Network HP LaserJet P1505>
##$DFORMAT= <normdp>
##$LAYOUT= <+/1D_H.xwp>
##$LFORMAT= <normlp>
##$PFORMAT= <normpl>
##$SURQMSG= 1
$$ End of Bruker specific parameters
$$ ---------------------------------
##NTUPLES= NMR SPECTRUM
##VAR_NAME=  FREQUENCY,     SPECTRUM/REAL,   SPECTRUM/IMAG
##SYMBOL=    X,             R,               I
##VAR_TYPE=  INDEPENDENT,   DEPENDENT,       DEPENDENT
##VAR_FORM=  AFFN,          ASDF,            ASDF
##VAR_DIM=   131072,        131072,          131072
##UNITS=     HZ,            ARBITRARY UNITS, ARBITRARY UNITS
##FACTOR=    0.0627417313425164, 1,          1
##FIRST=     8223.62146879497, 750,          -58428
##LAST=      0,             2619,            -59541
##MIN=       0,             -12479,          0
##MAX=       8223.62146879497, 395170496,    0
$$ Real data points
##PAGE= N=1
##DATA TABLE= (X++(R..R)), XYDATA
$$ [...]
65285 139696 139766 139518 139127 138869 138741 138511 138078 137526 136926 136381 136093 135992 135491 134123 132371 131286 131236 131545
65267 131545 131500 131177 131068 131380 131976 132606 132910 132573 131763 131105 130954 131032 131095 131502 132633 134005 134580 133936 132760
65248 132760 132139 132659 134160 135945 137159 137223 136155 134456 132691 131198 130067 129206 128457 127780 127311 127137
65232 127137 127108 127010 126873 126944 127358 127925 128231 127904 126873 125459 124149 123233 122677 122339 122090 121738 121137 120531 120553
65213 120553 121567 123150 124450 124990 124930 124689 124637 125015 125797 126521 126519 125491 123782 122064 120894 120476 120664 121063
65195 121063 121267 121126 120765 120422 120326 120626 121244 121886 122416 123170 124527 126118 126855 126067 124403 123261 123369 124234
65177 124234 124997 125504 126292 127702 129299 130240 130036 128848 127209 125685 124751 124673 125287 126034 126450 126640 127053
65160 127053 127896 128976 130185 131771 133922 136296 138279 139626 140648 141849 143630 146257 149713 153554
65146 153554 157283 161062 165700 171759 178967 186787 195148 204090 212988 220848 227436 233547 239967 246661
65132 246661 253205 259516 265702 271527 276466 280197 282729 284219 284892 285032 284733 283800 282074 279689 276794
65117 276794 273323 269339 265338 261732 258218 254111 249132 243434 237041 229892 222412 215357 208991 202913
65103 202913 196839 190967 185423 179944 174447 169375 165081 161297 157622 154179 151372 149304 147836 146925
65089 146925 146498 146190 145637 144823 143825 142535 141094 140265 140722 142093 143334 143990 144436 144888 144858 143868 142130
65072 142130 140245 138679 137854 138213 139658 141232 141983 142050 142438 143716 145386 146646 147307 147725 148144 148544 148962
65055 148962 149538 150185 150557 150577 150691 151265 151808 151252 149133 146187 143622 142001 141116 140667 140632 140913 140995 140239
65037 140239 138421 135914 133439 131645 130754 130427 130027 129121 127738 126214 124899 124025 123640 123436 122826 121445
65021 121445 119591 117967 116998 116634 116838 117840 119630 121520 122704 123180 123644 124498 125478 126442 127931 130448
65005 130448 133583 136414 138639 140787 143325 146093 148718 151069 153140 154828 156061 156876 157211 156862 155869
64990 155869 154695 153872 153676 154228 155603 157597 159708 161656 163787 166643 170255 174061 177396 179816 181094
64975 181094 181220 180441 179069 177225 174928 172397 170078 168260 166682 164645 161626 157847 154143 151149 148790
64960 148790 146727 145074 144185 143829 143208 141997 140851 140594 141297 142438 143509 144071 143671 142287 140678 139788
64944 139788 139852 140364 140687 140375 139267 137772 136871 137204 138241 138844 138557 137857 137246 136773 136449 136519 137025 137549
64926 137549 137616 137079 136080 134959 134267 134443 135352 136406 137156 137474 137286 136649 136090 136251 137046 137713 137871 138008
64908 138008 138664 139714 140783 141917 143417 145427 148071 151614 155989 160466 164385 168085 172632 178595
64894 178595 185493 192419 198876 204932 210757 216196 220835 224588 228137 232453 237750 243177 247673 250825
64880 250825 252729 253473 253156 252087 250444 247859 243767 238151 231637 224970 218738 213444 209362 206298 203876
64865 203876 202080 201146 200829 200252 198699 196357 194017 192203 190772 189260 187329 184807 181471 177101 171916
64850 171916 166798 162725 159916 157786 155811 154080 152811 151697 150187 148228 146307 144771 143477 142124
64836 142124 140711 139598 139314 140159 141742 143059 143378 143019 142894 143355 143925 144198 144503 145442 147157 149375 151908
64819 151908 154772 157920 161061 163755 165687 167051 168726 171813 176794 183265 190522 198092 205526 212118
64805 212118 217332 221416 225148 228865 232082 234108 234734 234170 232608 230158 227070 223691 220128 216150 211588
64790 211588 206743 202253 198571 195649 193137 190765 188478 186324 184422 183045 182473 182594 182796 182564 182230
64775 182230 182819 184945 188011 190863 193179 195829 199712 204612 209519 213834 217865 222280 227561 233944
64761 233944 241325 249013 256051 262049 267369 272297 276535 279939 283274 287526 292655 297702 302112 306211
64747 306211 310238 313581 315433 315740 315005 313330 310093 304607 296877 287739 278400 269744 261950 254772 248129
64732 248129 242216 237106 232617 228749 225816 223864 222269 220393 218402 216952 216146 215410 214488 214027 214843
64717 214843 216967 219814 223048 226824 231221 235913 240584 245366 250554 255948 260698 263798 264662 263244
64703 263244 259849 254946 249108 242933 236886 231116 225380 219298 212856 206599 201153 196578 192478 188801
64689 188801 186088 184688 184058 183300 182177 181132 180473 180105 180113 180897 182513 184446 186449 189129 193213 198541
64673 198541 204367 210426 217083 224455 231960 238895 245051 250541 255309 259037 261395 262240 261637 259751 256667
64658 256667 252375 247025 241150 235462 230502 226605 223977 222516 221677 220931 220358 220450 221372 222804 224503 226546
64642 226546 228962 231659 234912 239377 245279 252000 258870 266011 274022 283145 293115 303497 313632 322540
64628 322540 329489 334645 338649 341596 342860 341821 338298 332384 324506 315674 307004 298726 290143 280792
64614 280792 271193 262229 254280 247272 241139 235838 231217 227218 223929 221138 218200 214727 211125 208066
64600 208066 205738 204005 202981 202852 203335 203953 204815 206535 209303 212583 215818 219008 222427 226199 230339
64585 230339 234915 239960 245435 251376 257810 264532 271277 278119 285313 292648 299437 305312 310526 315206
64571 315206 318794 320662 320952 320265 318704 315685 310661 303674 295209 285878 276294 266986 258294 250351 243070
64556 243070 236106 229045 221910 215354 210130 206422 203847 201924 200327 198867 197609 196886 196906 197426 198103
64541 198103 199048 200639 202862 205250 207459 209431 210897 211235 210137 208091 205882 203819 201716 199470 197275
64526 197275 195287 193384 191424 189651 188644 188723 189472 190097 190292 190505 191116 191684 191441 190438 189663 189975 191370
64509 191370 193378 195643 197878 199747 201218 202778 204940 207749 211108 215354 221070 228407 236903 245859
64495 245859 254546 262164 268051 272073 274567 275840 275909 274737 272502 269629 266703 264307 262765 262014 261854
64480 261854 262157 262652 262708 261742 259820 257499 255074 252360 249251 245998 242728 239107 234901 230666 227468
64465 227468 225959 225955 226944 228726 231413 234937 238734 242000 244183 245191 245190 244431 243338 242433 241850 241076 239548
64448 239548 237431 235481 234157 233313 232814 232951 233977 235635 237466 239333 241382 243799 246929 251305 257138
64433 257138 263955 271203 279098 288443 299741 312951 328074 345429 365245 387564 412856 442409
64421 442409 477798 520119 569933 627602 693262 766436 845850 929561 1015153 1100016 1181867
64410 1181867 1259162 1330826 1395477 1451101 1495737 1528552 1550007 1560813 1560801 1549102 1525380 1490490
64398 1490490 1445684 1391572 1328342 1256863 1179116 1097570 1014604 932559 853725 779836 711782
64387 711782 650001 594889 546543 504442 467789 436133 409379 387285 369204 354276 341654
64376 341654 330604 320688 311828 304067 297294 291325 286125 281676 277656 273512 268884 263830 258626 253444
64362 253444 248218 242735 236961 231353 226620 222999 219983 217055 214528 213250 213522 214770 216367 218359
64348 218359 221187 224993 229446 234107 238663 242799 245933 247272 246307 243391 239615 235943 232594 229396
64334 229396 226355 223448 220222 216350 212525 210016 209165 209091 209132 209734 211384 213424 214757 215300 215856 216788
64318 216788 217718 218508 219681 221629 224070 226560 229031 231532 233862 235685 236644 236188 233744 229437 224306
64303 224306 219460 215199 211198 207217 203257 199288 195365 191938 189587 188303 187358 186050 184403 183004
64289 183004 182293 182177 182309 182597 183302 184625 186327 187949 189453 191445 194631 199139 204481 210094 215769
64274 215769 221634 227832 234209 240301 245664 250229 254173 257435 259630 260547 260509 259993 259162 258138 257501 257989
64258 257989 259590 261377 262445 262704 262576 262129 260804 257929 253336 247588 241658 236241 231214 225890 219909
64243 219909 213785 208439 204377 201534 199736 198928 198918 199213 199333 199267 199481 200410 201879 203059 203161 202286 201403
64226 201403 201319 201863 202306 202350 202202 201842 200905 199501 198518 198581 199129 199061 198050 196587 194937 192849 190424 188531
64208 188531 187860 188060 188286 188257 188247 188268 187945 187238 186695 186738 187141 187457 187715 188339 189601 191536 194333 198442 204187
64189 204187 211471 219945 229313 239317 249607 259872 270085 280463 291058 301373 310312 316486
64177 316486 318686 316444 310395 302027 292869 283777 274937 266338 258040 250075 242455 235382 229170 223730
64163 223730 218417 212751 207195 202773 199871 197785 195629 193285 191161 189337 187542 185960 185455 186632
64149 186632 188999 191444 193474 195603 198516 202211 206178 210137 214226 218468 222382 225327 227118 228117
64135 228117 228654 228492 226969 223762 219488 215475 212813 211613 211158 210685 209933 209057 208347 208148 208829 210559
64119 210559 213137 216267 219980 224623 230350 236842 243679 250876 258861 267864 277402 286422 293986 299871
64105 299871 304563 308637 312191 314937 316813 318359 320365 323274 327009 331296 335953 340847 345748 350329
64091 350329 354300 357449 359565 360312 359236 356058 351066 345034 338530 331408 323295 314522 306072 298500
64077 298500 291398 284304 277708 272561 268975 266076 263117 260110 257238 254373 251560 249423 248490 248416 248396
64062 248396 248158 247974 247865 247431 246604 245991 246218 247280 248852 250938 253867 257710 262014 266179 270057 274094
64046 274094 278874 284537 290720 297099 303794 311160 319390 328535 338575 349083 359022 367425 374279 380270
64032 380270 385598 389561 391397 390972 388488 384130 378433 372484 367190 362650 358678 355607 353960 353481 353117
64017 353117 351991 349924 346991 343060 338016 332131 325989 320131 314808 309945 305346 301002 297028 293211
64003 293211 288941 283989 279106 275384 273097 271659 270653 270315 270908 272220 273939 276003 278268 280232 281622
63988 281622 283006 285322 288811 292804 296581 300133 303925 308155 312523 316743 321113 326368 332979 340763
63974 340763 349198 357915 366696 375266 383445 391409 399519 407965 416921 426948 438705 452136 466397
63961 466397 480891 496095 513123 532700 554788 579047 605472 634811 668595 708621 756208
63950 756208 812053 876858 951810 1038310 1137512 1250339 1377587 1519523 1675488 1844261
63940 1844261 2024732 2215884 2416108 2622849 2832859 3042446 3247384 3442908 3624172
63931 3624172 3786806 3927196 4042432 4130085 4188009 4214476 4208699 4171195 4103462 4007369 3885111
63920 3885111 3739783 3575628 3397457 3209793 3016540 2821133 2626686 2436023 2251806
63911 2251806 2076616 1912595 1760835 1621285 1493577 1377952 1275113 1185164 1107013 1039061
63901 1039061 980260 930136 887938 852260 821723 795718 774202 756813 742353 729125 715696
63890 715696 701434 686414 670923 655176 639545 624809 611841 600989 591990 584523 578643 574691
63878 574691 573028 573917 577463 583580 592257 603798 618545 636352 656671 679161 703725 729887 756691
63865 756691 783518 810549 838071 865754 893022 919736 945956 971267 994878 1016173 1034629
63854 1034629 1049400 1059626 1065226 1066804 1064706 1058651 1048416 1034379 1017096 996695 973021 946204
63842 946204 916876 885892 853903 821082 787297 752721 718197 684768 652907 622451 593233
63831 593233 565367 538897 513636 489621 467408 447598 430168 414500 399971 386324 373546
63820 373546 361535 349992 338659 327650 317450 308479 300760 294137 288608 284154 280367 276633 272720
63807 272720 268909 265543 262799 260852 259744 258873 257118 253906 249956 246550 244173 242187 239759 236747
63793 236747 233553 230486 227536 224693 222192 220325 219144 218476 218135 217935 217574 216783 215630 214389 213078
63778 213078 211533 210057 209458 209974 210602 210145 208677 207293 206527 205811 204588 203144 202057 201490 201442 202033 203024
63761 203024 203562 203072 202104 201643 201748 201570 200661 199569 198926 198558 197970 197357 197599 199221 201705 203964 205299
63744 205299 205752 205807 206142 207554 210545 214651 218578 221454 223744 226443 229549 231976 233069 233563 234794
63729 234794 237360 240842 244478 247851 251164 255056 259910 265239 270074 274064 277770 281725 285704 289206
63715 289206 292077 294212 295160 294601 292931 290764 288106 284595 280407 276309 272865 270109 267910 266137 264454
63700 264454 262561 260711 259518 259163 259252 259570 260418 262000 263997 266115 268695 272240 276485 280392 283138
63685 283138 284905 286599 288963 292045 295361 298330 300495 301631 301957 302137 302687 303305 303199 302210 301135 300724
63669 300724 300843 301072 301597 302807 304347 305364 305666 305852 306203 306181 305260 303601 301562 299047 295750 291642
63653 291642 286869 281549 276056 271159 267378 264392 261492 258517 255977 254321 253532 253473 254221 255799 257816
63638 257816 259687 261263 262989 265259 267737 269709 271202 273290 276947 281851 286800 291199 295603 300836
63624 300836 307141 314349 322251 330542 338876 347426 357100 368769 382488 397726 414180 432046 451603
63611 451603 472865 495602 519553 544733 571481 599874 628932 656722 681531 702650 719878
63600 719878 732812 741159 745409 746610 745606 742965 739425 735751 732084 727926 722768 716258 707698 696022
63586 696022 680636 662082 641660 620589 599498 578408 557081 535682 515175 496790 481038
63575 481038 467572 456016 446495 439188 433927 430599 429532 430926 434110 437879 441600 445621 450590 456707
63561 456707 463660 470996 478468 486232 494774 504488 515308 526940 539515 553837 570973 591740 616593
63548 616593 645709 678895 715448 754191 793504 831250 864837 891763 910432 920634 923407 920447
63536 920447 913517 904153 893666 883285 874103 866783 861241 856586 851334 843879 833062 818488 800299
63523 800299 778601 753316 724715 693903 662464 631646 602080 574168 548327 524699 503034
63512 503034 483113 465076 449055 434714 421545 409531 399122 390496 383167 376412 369825 363401
63500 363401 357354 351996 347565 343994 340989 338468 336729 336039 336195 336674 337071 337237 337158 336951 336933 337428 338458
63483 338458 339762 341186 342969 345616 349477 354320 359290 363453 366597 369421 372749 376482 379479 380495
63469 380495 379208 376350 372956 369547 366009 362087 357798 353277 348465 343268 338020 333381 329679 326628
63455 326628 323829 321180 318650 316126 313923 313053 314350 317479 321388 325624 330567 336410 342771 349625
63441 349625 357925 368751 382334 398480 417540 440193 466317 494697 523890 552857 580568 605506
63429 605506 626000 640985 650399 655087 656538 656562 656910 659062 664228 673363 687019 705275 727870 754265
63415 754265 783526 814323 845237 875010 902345 925617 943212 954365 959622 960303 957638 952506
63403 952506 945777 938423 931025 923362 914662 904159 891204 875102 855356 832218 806617 779308
63391 779308 750364 719824 688642 658507 630643 605086 581264 558989 538680 520767 505208
63380 505208 491651 479939 470341 463284 458863 456633 455913 456288 457795 460648 464906 470473 477374 485920
63366 485920 496536 509354 523995 539845 556721 575320 596857 622113 650839 682071 714946
63355 714946 749053 784061 819148 852958 884091 911535 934595 952511 964498 970405 971257 968771
63343 968771 964164 957632 949115 939261 929142 919047 907986 894572 878109 858662 836456 811698
63331 811698 784912 757016 728867 700979 673854 648412 625877 607178 592545 581645 574034 569380
63319 569380 567145 566024 563840 558352 548449 534663 518532 501484 484214 466917 449914 433984
63307 433984 420026 408346 398400 389444 381395 374821 370034 366512 363435 360505 357897 355589 353187 350486
63293 350486 347769 345392 343310 341314 339550 338483 338274 338398 338043 336884 335333 334011 333050 332053 330697
63278 330697 329155 327786 326638 325453 324083 322643 321266 319967 318761 317670 316581 315332 314112 313511
63264 313511 313991 315419 317206 318776 319750 319965 319696 319733 320820 322877 325076 326882 328746 331498 335179 338917
63248 338917 342037 344946 348638 353591 359514 366040 373141 380814 388996 398080 408994 422170 436757
63235 436757 451507 466279 482044 499505 518466 538590 559858 581898 603639 624273 644037
63224 644037 663535 682746 701343 719537 737852 756392 775074 794346 814716 835604 855511
63213 855511 873468 889543 903725 915127 922660 925803 924307 917839 906474 891028 872329 850562
63201 850562 825898 799349 772332 745676 719736 695308 673602 655204 639706 626580 615957
63190 615957 608307 603827 602441 604103 608722 615865 624858 635251 647088 660658 675994 692668 710129
63177 710129 728147 746733 765625 784218 802191 819947 838072 856480 874372 890903 905599
63166 905599 918224 928542 936146 940195 939450 933020 921158 905018 885626 863361 838340 810786
63154 810786 780981 749422 717244 686040 656881 629752 604229 580340 558485 538774 520941
63143 520941 504782 490306 477532 466446 457125 449576 443399 437944 432855 428293 424536 421561 419086
63130 419086 416842 414725 412830 411481 411159 412141 414159 416457 418329 419671 420986 422862 425510 428828 432723
63115 432723 437146 441850 446306 450012 452798 454825 456414 457916 459607 461604 463858 466214 468420 470191
63101 470191 471463 472559 473887 475452 476849 477707 477952 477686 477173 476952 477476 478396 478642 477595 475917 474804
63085 474804 474640 474833 474871 475028 475951 477939 480799 484115 487535 490985 494742 499126 504065 509165 514319 520059
63069 520059 527092 535591 545073 554926 564894 575057 585630 597004 609902 625199 643360 664107
63057 664107 686846 711352 737952 767149 799339 834819 873678 915531 959669 1005605 1053247
63046 1053247 1102428 1152611 1203212 1253838 1303968 1352865 1400257 1446833 1493565 1540707 1587829
63035 1587829 1634623 1681167 1727496 1773400 1818464 1861673 1900953 1933732 1958193 1973611 1979528
63024 1979528 1975263 1960465 1935606 1901524 1858870 1808345 1751295 1689839 1626575 1564080 1504156
63013 1504156 1447287 1393265 1342607 1297024 1258215 1226687 1202052 1183973 1172294 1166645 1166606 1172169
63001 1172169 1183387 1199618 1219622 1242487 1268054 1296360 1327053 1359458 1392945 1427051 1461413
62990 1461413 1495709 1529641 1562984 1595602 1627151 1656641 1682633 1704113 1720840 1732446 1737534
62979 1737534 1734295 1721932 1700974 1672332 1636663 1594628 1547059 1494684 1438277 1379390 1320347
62968 1320347 1263104 1208386 1156146 1106407 1059307 1014822 973025 934333 898992 866514 836197
62957 836197 808076 782750 760201 739362 719091 699202 680206 662377 645488 629378 614375
62946 614375 600907 588801 577119 564824 551634 538240 525751 514936 505851 497942 490456 482947
62934 482947 475571 468863 463259 458910 455772 453507 451241 447963 443512 438912 435398 433352 432443 432341 432741
62919 432741 432995 432550 431715 431264 431215 430710 429307 427568 426035 424421 422421 420535 419263 418007 415776 412723
62903 412723 409939 407814 405616 402880 400231 398472 397708 397860 399211 401711 404356 406093 407054 408144 409608
62888 409608 410769 411135 410978 410689 410198 409386 408567 408184 408221 408235 407923 407477 407376 407827 408423 408447 407623 406436 405533
62869 405533 405007 404553 404117 403932 403986 403928 403621 403330 403183 402788 401706 400102 398718 398260 398887 400157 401383 402204
62851 402204 402856 403811 405209 406783 408202 409193 409503 409187 408848 409083 409652 409797 409445 409475 410446 411663 411953 410945
62833 410945 409200 407502 406440 406322 406934 407713 408521 409882 411986 413966 414929 415378 416659 419096 421565 423116
62817 423116 424177 425816 428429 431566 434624 437316 439741 442289 445274 448554 451824 455324 459783 465466
62803 465466 471729 477846 483912 490585 498238 506756 515897 525463 535243 545169 555505 566698 579102
62790 579102 593047 608979 627292 648110 671542 698074 728541 763767 804371 850742 902916
62779 902916 960523 1023107 1090451 1162424 1238576 1318091 1399962 1482899 1565038 1644033 1717531
62768 1717531 1783435 1839782 1884759 1917052 1936023 1941414 1933057 1911082 1876401 1830811 1776529 1715578
62756 1715578 1649469 1579307 1506122 1431143 1355819 1281599 1209710 1141076 1076336 1015816 959503
62745 959503 907190 858779 814408 774216 738027 705408 676025 649764 626492 605894 587603
62734 587603 571287 556559 543087 530985 520790 512784 506573 501572 497577 494461 491728 489064 487121
62721 487121 486890 488185 489625 490461 491661 494679 499806 506407 514237 523667 534891 547810 562716 580289
62707 580289 600688 623239 647335 673319 702263 735247 772996 815779 863307 914932 970209
62696 970209 1029175 1091905 1157947 1226363 1296140 1366321 1435765 1503000 1566276 1623681 1673173
62685 1673173 1712648 1740179 1754403 1754899 1742245 1717650 1682452 1637925 1585351 1526129 1461791 1394066
62673 1394066 1324811 1255713 1187965 1122319 1059378 999649 943429 890833 842045 797296 756609
62662 756609 719728 686404 656564 630163 606977 586626 568690 552790 538696 526335 515505
62651 515505 505552 495567 485008 474029 463227 453317 444985 438569 433634 429228 424883 421114 418606
62638 418606 417150 415836 414169 412493 411305 410616 410121 409556 408642 407026 404674 402183 400360 399482 399179 398966
62622 398966 398673 398384 398262 398563 399616 401574 404203 407032 409735 412432 415676 420123 425980 432625 438915
62607 438915 444139 448718 453856 460471 468590 477825 488183 500215 514511 531300 550614 572622 597647
62594 597647 625870 657119 690994 727177 765541 805827 847152 887928 926445 961599 992921
62583 992921 1019861 1041160 1055155 1060726 1057875 1047404 1030261 1007362 979868 949234 916712 882893
62571 882893 847939 812193 776390 741292 707372 674967 644491 616349 590774 567905 547823
62560 547823 530291 514604 500114 486893 475548 466245 458250 450593 442952 435644 429004 423135 418151
62547 418151 414189 411083 408374 405896 404108 403559 404134 405082 405772 406189 406619 407132 407522 407607 407357 406831 406193
62530 406193 405819 406217 407773 410663 414966 420673 427553 435293 443938 454085 466441 481292 498507 517929
62516 517929 539515 563252 589315 618304 650957 687410 726900 768308 810769 853529 895414
62505 895414 934775 969985 999886 1023906 1041928 1054067 1060359 1060691 1055092 1043980 1027971 1007664
62493 1007664 983993 958671 933703 910266 888467 868424 851102 837613 828047 821674 818227 818330
62481 818330 822475 830206 840701 853717 869365 887023 904909 920780 932876 940322 943092 941715
62469 941715 936685 927862 914576 896415 873805 847666 818658 787087 753522 719239 685711 653692
62457 653692 623011 593407 565452 540421 519230 501714 486987 474277 463185 453398 444601 436813
62445 436813 430483 426033 423420 422304 422537 424209 427159 430693 434011 436981 440274 444561 449608 454360
62431 454360 457859 459783 460031 458295 454464 449181 443496 437965 432492 426953 421439 415816 409698 403209
62417 403209 397299 392864 389813 387365 385030 382831 380712 378243 375017 371052 366758 362746 359640 357828
62403 357828 357278 357622 358356 358959 359100 358981 359244 360258 361641 362804 363774 365085 366984 369212 371483 373687
62387 373687 375608 377044 378383 380560 384134 388717 393582 398545 404018 410416 417740 425513 432984 439677
62373 439677 445963 452835 460951 470247 480615 492421 505873 520334 534940 549824 566114 584795
62361 584795 606160 630394 658073 689747 725501 765221 808976 856736 907742 960389 1012705
62350 1012705 1062887 1109546 1151620 1188096 1217934 1240460 1255750 1264254 1266032 1260743 1248501 1230266
62338 1230266 1207036 1179065 1146409 1110019 1071738 1033173 995073 957838 922123 888657 857800
62327 857800 829626 804236 781644 761463 742976 725519 708668 692082 675407 658415 641155
62316 641155 623881 606824 590017 573355 556858 540871 525874 512116 499534 488049 477765
62305 477765 468784 461055 454511 449178 444946 441427 438244 435379 432985 431017 429337 428116 427786 428516 430005
62290 430005 431806 433629 435340 437035 439209 442507 447055 452224 457181 461494 465174 468437 471615 475031
62276 475031 478738 482576 486681 491617 497734 504533 511052 516796 522167 528121 535647 545405 557538 571931
62262 571931 588816 608939 632896 660544 691487 725968 764753 808145 855553 906064 958940
62251 958940 1013331 1067824 1120537 1169504 1212945 1249415 1277963 1298106 1309737 1313156 1309068 1298114
62239 1298114 1280330 1255377 1223362 1185231 1142342 1096036 1047671 998641 950099 902870 857726
62228 857726 815395 776136 739695 706034 675869 650107 628807 610938 595172 580863 568336
62217 568336 558320 550999 545663 541429 538212 536598 536797 538213 540176 542628 545809 549736 554252 559159
62203 559159 563908 567596 569829 571285 572941 574966 576905 578612 580290 581710 582219 581810 581581 582743 585393
62188 585393 588518 591109 593170 595785 600175 606546 613928 621247 628283 635295 642048 647814 652270 655820
62174 655820 658977 662002 665250 669374 675015 682770 693580 708584 728278 752242 779881 810972 845180
62161 845180 881590 919103 956827 993579 1027409 1056310 1079285 1096339 1107685 1113452 1113950 1109552
62149 1109552 1100288 1086002 1066912 1043628 1016697 986616 954279 920946 887698 855313 824624
62138 824624 796518 771471 749532 730853 715711 703812 694056 685344 677374 670515 665270 661994 660705
62125 660705 660851 661682 663218 666491 672416 680745 690474 700823 711252 720880 728751 734669 739102 742214
62111 742214 743681 743571 742674 741590 740041 737499 733930 729376 723190 714515 703546 691844 681282 672992
62097 672992 667248 663934 662869 663935 667092 672177 678647 685691 692686 699538 706583 714317 723148 733132
62083 733132 743749 754157 763933 773625 784452 797384 812509 829281 847268 866540 887365 909674
62071 909674 932928 956401 979471 1001803 1023535 1045301 1067707 1090665 1113526 1136038 1158802
62060 1158802 1182437 1206470 1229441 1249966 1267332 1281170 1291084 1296732 1297929 1294530 1286482 1274148
62048 1274148 1258211 1239016 1216211 1189280 1158348 1124311 1088281 1051011 1012754 973517 933575
62037 933575 893841 855585 819632 785894 753831 723289 694778 668981 646175 626115 608331
62026 608331 592421 578055 564817 552250 540138 528606 517802 507622 497903 488712 480175 472185
62014 472185 464648 457838 452011 446736 441273 435761 431395 429061 428363 428442 429214 431168 434334 438208 442584
61999 442584 447712 453597 459734 465701 471489 477049 481925 485627 488032 489232 489297 488403 486938 485195 483097
61984 483097 480442 477277 473861 470348 466686 462779 458663 454582 450937 448048 445858 443915 441734 439138
61970 439138 436320 433673 431570 430082 428806 427102 424650 421752 419056 417032 415700 414712 413633 412286
61956 412286 410954 410100 409825 409758 409636 409877 411260 414071 417810 421864 426239 431447 437948 446018 455980 468003
61940 468003 481565 495623 509716 524551 541060 559169 577991 596992 616153 635084 652879
61929 652879 669175 684501 699055 711848 721790 729054 734475 737937 738416 735608 730558 724422 717395
61916 717395 709277 700521 692234 685532 681222 679732 680900 684081 688875 695623 704878 716524 729712 743529
61902 743529 757347 770420 781479 789091 792512 792142 788963 783551 775793 765570 753330 739769 725249
61889 725249 709970 694478 679488 665268 651680 638744 626575 614785 602634 590004 577657
61878 577657 566254 555674 545603 536222 527812 520135 512710 505468 498711 492716 487753 484187 482146
61865 482146 481352 481652 483402 486809 491275 496076 501574 509069 519445 532517 547666 564517 582882
61852 582882 602705 624371 648540 675324 703995 733865 765085 798098 832373 866087 897135
61841 897135 924215 946974 965405 979384 988690 993197 992900 987978 979120 967807 955966 945150 936097
61828 936097 929044 924201 921849 922329 926048 933116 942645 952775 961853 969400 975509 979520 979895 975390
61814 975390 965804 951505 932756 909851 883491 854675 824301 793126 761955 731695 703104 676518
61802 676518 651791 628588 606864 586996 569401 554183 541257 530501 521480 513308 505262 497458
61790 497458 490433 484187 478199 472391 467400 463657 460757 458114 455782 454150 453083 451860 449954 447608
61776 447608 445620 444592 444356 444073 443037 441315 439439 437637 435810 434181 433318 433339 433644 433712 433664 433792 434116
61759 434116 434812 436426 439024 441594 443079 443716 444615 446199 447886 449144 449963 450214 449497 448013 446818 446669
61743 446669 447083 446998 445986 444377 442549 440647 438840 437386 436432 435970 435938 436202 436582 437083 437900 439062 440317
61726 440317 441569 443131 445223 447514 449514 451174 452650 453767 454371 455124 457180 460828 465011 468533 471223
61711 471223 473504 475254 475757 474734 472854 471014 469418 467509 464677 460910 456821 453120 450044 447298
61697 447298 444511 441613 438720 435867 433040 430318 427715 425034 422151 419420 417428 416286 415472 414432
61683 414432 413026 411300 409225 406940 404898 403391 402172 400902 399739 399005 398415 397251 395320 393190 391288
61668 391288 389387 387297 385516 384608 384262 383581 382226 380711 379576 378762 377946 377048 376215 375617 375439 375812 376561
61651 376561 377277 377814 378431 379261 379901 379923 379657 380150 382283 386061 390664 395015 398424 400965 403241 405637
61635 405637 407831 409121 409083 407752 405415 402563 399904 397917 396281 394103 390854 386856 382817 379219 376284
61620 376284 374154 372825 372096 371801 371896 372172 372167 371666 371006 370505 369754 367972 364991 361415 357719 353656 348840
61603 348840 343522 338358 333524 328526 323034 317617 313368 310785 309204 307431 304885 301993 299564 297929
61589 297929 296763 295596 294310 293127 292204 291335 290132 288533 286955 285747 284558 282592 279629 276525 274411
61574 274411 273569 273285 272760 271893 271154 270894 270838 270269 268787 266844 265359 264720 264470 264078 263683 263736 264258 264925
61556 264925 265746 267091 269025 271054 272648 273697 274394 274988 275726 276637 277323 277304 276686 276138 276111 276503 277181 278306
61538 278306 279863 281412 282746 284364 286766 289622 292260 294759 297778 301248 303990 305000 304629 304066 303993
61523 303993 304196 304277 304143 303701 302650 300931 299072 297584 296141 293957 291071 288695 287854 288145 288382 288146
61507 288146 287970 288102 288002 287335 286701 286780 287285 287403 286965 286533 286449 286434 286147 285601 284853 283778 282424 281288 280969
61488 280969 281609 282829 284075 284881 284972 284427 283782 283760 284672 286124 287486 288639 289981 291597 292818 292958 292263
61471 292263 291644 291574 291823 292247 293144 294544 295804 296354 296424 296616 297167 298059 299345 300760 301442 300869 299877 299939
61453 299939 301379 303069 303994 304319 304674 305051 305001 304538 304287 304824 306128 307632 308632 308808 308543 308713 310038
61436 310038 312653 316198 320111 323838 327029 329726 332213 334636 336868 338722 340150 341251 342265 343495
61422 343495 345023 346586 348020 349752 352467 356196 360100 363248 365368 366778 367897 368937 369741 369792 368688
61407 368688 366743 364813 363355 361995 360226 358132 356098 354133 351980 349778 348133 347438 347404 347371 346885 345866
61391 345866 344390 342514 340406 338559 337694 338204 339693 341237 342150 342398 342260 341861 341190 340348 339579 339085 338955
61374 338955 339191 339730 340540 341770 343648 346051 348314 349738 350339 350868 352000 353649 355252 356547 357789
61359 357789 359244 360899 362897 365830 370093 375125 379943 384508 389895 396866 404860 412822 420512 428324
61345 428324 436203 443488 449753 455135 459829 463799 467135 470201 473288 476391 479326 481776 483314 483831
61331 483831 483886 484205 484812 485046 484339 482573 479881 476655 473649 471386 469506 467375 465241 463957 463560 463158
61315 463158 462433 462244 463255 465022 467104 470142 474920 481027 487524 494540 503215 514151 526693 539658
61301 539658 552073 563265 572850 580762 586901 590838 592200 591189 588341 584015 578486 572239 565649 558573
61287 558573 550823 542798 535168 528136 521518 515340 509728 504477 499371 494820 491453 489148 487180 485378
61273 485378 484453 485063 487152 490296 494119 498191 502054 505602 509074 512580 516091 519970 525020 531727 539790
61258 539790 548545 557567 566725 575947 584986 593252 599975 604935 608811 612399 615603 617745 618690 618908 618477
61243 618477 616885 613982 610361 606510 602331 597840 593635 590168 587201 584459 582224 580717 579432 577763
61229 577763 575977 574895 574867 575594 576741 578174 579752 581478 583723 586788 590317 593640 596641 599877 603913
61214 603913 608958 614960 621529 627775 632789 636357 638827 640310 640587 639908 639248 639497 640773 642850 645837
61199 645837 650098 655824 663125 672345 683850 697516 712709 728775 745307 762028 778626 794660
61187 794660 809400 821875 831463 838553 844379 850042 855784 861129 865419 868181 869399 869638 869526 868845
61173 868845 866441 861454 854355 846287 837616 827752 816359 804000 791367 778520 765267 751783 738357
61160 738357 724858 710958 696699 682468 668599 655417 643413 632934 623807 615780 609235 604940
61148 604940 603033 602700 602918 603101 602914 601909 599671 596072 591195 585161 578179 570670 563185 556297 550585
61133 550585 546582 544598 544558 545988 548221 550870 554227 559002 565536 573545 582839 593881 607199 622525
61119 622525 639133 656952 676721 698987 723414 749188 775652 802422 829284 856210 883221
61108 883221 910148 936677 962563 987470 1010765 1031901 1050936 1068116 1082937 1094163 1100877 1102936
61096 1102936 1100388 1093181 1081758 1067222 1050422 1031298 1009583 985725 960648 934916 908625 881910
61084 881910 855159 828829 803337 778973 755753 733572 712664 693572 676493 661041 646918
61073 646918 634330 623371 613487 604110 595524 588535 583462 579967 577749 576853 577281 578692 580571 582508
61059 582508 584425 586750 590165 594923 600631 607043 614745 624526 636202 648657 661085 673764 687556
61046 687556 703032 720243 739012 759188 780723 803619 827864 853497 880651 909305 938977
61035 938977 969099 1000033 1033254 1070062 1110220 1152224 1194723 1237221 1279645 1321899 1364015
61024 1364015 1406318 1449326 1493799 1540943 1592190 1648555 1710444 1778245 1852871 1935519 2027105
61013 2027105 2128586 2242409 2373781 2530388 2721087 2955769 3246912 3610798 4067595
61004 4067595 4643260 5373560 6301589 7460322 8849094 10426682 12127665 13877427 15581391
60995 15581391 17106926 18305598 19086127 19479316 19626160 19693571 19793741 19965675 20198460
60986 20198460 20439771 20580540 20463092 19943176 18968135 17604850 15997997 14301351 12633412
60977 12633412 11069353 9649816 8390117 7288507 6334975 5517364 4822804 4237495 3747544
60968 3747544 3339796 3001439 2719795 2483370 2282937 2111431 1963414 1834882 1722911
60959 1722911 1625004 1539050 1463871 1399030 1343726 1296439 1255844 1221293 1191922 1166022 1141962
60948 1141962 1119232 1097970 1077926 1058648 1040383 1023969 1009827 997617 986809 977045 967923 959087
60936 959087 950651 943067 936322 929654 922348 914539 906990 900312 894712 890350 887540 886454 886847 888298
60922 888298 890670 894189 899049 905045 911662 918391 924961 931397 937946 944797 951775 958463 964742 970992
60908 970992 977557 984207 990385 995798 1000390 1003867 1005711 1005686 1003967 1000760 996190 990538 984113 976757 967962
60893 967962 957668 946526 935118 923269 910419 896332 881106 864859 847832 830586 813683
60882 813683 797241 781176 765732 751362 738061 725261 712533 700146 688743 678584 669281 660182
60870 660182 650887 641431 632219 623937 617371 612833 609556 606046 601485 596604 592720 589987 587219 583448
60856 583448 578929 574296 569416 563740 557396 551209 545630 540257 534541 528543 522792 517593 512698 507587
60842 507587 501974 496054 490214 484567 478913 473093 467105 460796 453892 446603 439819 434229 429457 424604
60828 424604 419560 415237 412330 410340 408182 405523 403184 402250 402950 404472 405760 406435 406935 407886 409457
60813 409457 411321 413015 414245 415031 415714 416685 417995 419327 420466 421568 422751 423683 423910 423463 422793 422116
60797 422116 421200 419810 418087 416429 415236 414784 414986 415186 414484 412548 409982 407713 406081 404618 402619
60782 402619 399768 396273 392571 388951 385460 382063 378791 375687 372714 369853 367209 364861 362669 360419
60768 360419 358166 356269 355079 354707 355042 355777 356439 356661 356530 356506 356927 357778 358924 360272 361609 362597 363189
60751 363189 363797 364766 365897 366853 367930 369954 373358 377732 382406 387095 391629 395328 397161 396628 394266
60736 394266 391146 388048 385130 382150 378792 374922 370789 366961 363767 360765 357030 352207 347101 342946
60722 342946 340203 338308 336511 334567 332534 330410 328315 326708 325941 325665 325057 323686 321813 319870 318065
60707 318065 316622 315906 315975 316304 316274 315707 314661 313079 311175 309883 310205 311950 313722 314407 314280 314415 315433
60690 315433 317122 318955 320560 321893 323306 325365 328289 331643 334773 337450 339934 342586 345673 349400
60676 349400 353769 358443 362998 367293 371407 375296 378767 381790 384566 387233 389625 391365 392159 392080 391550
60661 391550 390892 389895 388121 385757 383743 382807 382711 382782 382835 383132 383754 384562 385539 386568 387078 386568 385457 384717
60643 384717 384583 384229 382823 380317 377077 373348 369377 365503 361810 358134 354654 351984 350357 349210 347957
60628 347957 346763 346066 345692 344990 343725 342361 341450 341080 340987 341023 341411 342497 344196 345805 346599 346514 346038 345551
60610 345551 345186 345134 345538 346057 346183 346030 346250 347036 347850 348295 348508 348469 347737 346306 344994 344510 344773 345658 347513
60591 347513 350256 352772 354136 354851 355823 356687 356284 354565 352785 351829 351443 351235 351435 352301 353578 354905
60575 354905 356288 357963 360231 363490 367949 373312 379257 386149 394684 404915 416282 428463 441304
60562 441304 453841 464363 471846 476639 479492 480557 479638 476764 472124 466033 459227 452656 446719 441306
60548 441306 436809 434276 434163 435684 437977 441241 446069 452351 459583 467838 477596 488880 501227 514260
60534 514260 527582 540243 550997 559177 564868 568294 569465 568384 565251 560509 554885 549156 543539
60521 543539 537635 531385 525714 521646 519052 516920 514704 512746 511454 510835 510903 511839 513435 514957 515934
60506 515934 516834 518715 522482 528632 537450 549230 564443 583745 607652 636164 668896 705499 745604
60493 745604 788387 832589 877007 920503 961371 997144 1025387 1044469 1053426 1051535 1038579 1015443
60481 1015443 984089 946860 905860 862785 818981 775591 733734 694500 658651 626430 597761
60470 597761 572545 550611 531566 514969 500616 488359 477668 467721 458144 449412 442209 436454
60458 436454 431187 425498 419351 413434 408377 404271 400812 397585 394215 390489 386568 382957 380142 378273
60444 378273 377209 376701 376370 375698 374401 372801 371565 370959 370569 369898 369054 368605 368783 369075 368714 367474 365879
60427 365879 364663 364103 363912 363692 363391 363338 363957 365496 367904 370797 373547 375609 376876 377697 378520 379566
60411 379566 380816 382156 383381 384144 384152 383500 382705 382276 382305 382570 382938 383521 384445 385637 386975 388490 390313
60394 390313 392453 394786 397212 399698 402170 404517 406818 409430 412705 416584 420564 424136 427205 430021
60380 430021 432729 435132 436992 438494 440188 442460 445189 448090 451221 454951 459425 464303 469131 473809
60366 473809 478454 482876 486450 488721 489943 490784 491571 492182 492737 493926 496227 499101 501593 503752 506877
60351 506877 512169 519677 528830 539363 551081 563043 573809 582537 589288 594123 596467 595643 591702
60338 591702 585426 577768 569563 561586 554434 548260 542743 537461 532316 527585 523574 520197 516936 513201
60324 513201 508594 502879 495988 488295 480692 474106 468989 465426 463457 462917 463091 463122 462940 463506 466034 471218
60308 471218 479226 490060 503688 520055 539127 560784 584479 609101 633169 655043 673034 685639
60296 685639 691863 691354 684343 671705 654845 635200 613885 592112 571616 553934 539268 526702
60284 526702 515665 506498 499379 493555 488153 483149 478898 475207 471593 468108 465156 462610 459868 456839
60270 456839 454198 452525 451661 451053 450333 449342 447980 446302 444584 443035 441554 439909 438160 436782 436319
60255 436319 436806 437537 437561 436512 434887 433493 432770 432675 432979 433456 433983 434624 435470 436297 436645 436428 436191 436469
60237 436469 437059 437266 436745 435863 435334 435738 437255 439574 442066 444166 445566 446090 445831 445543 446390 448824 452009
60220 452009 454798 457006 459298 462093 465250 468654 472479 476797 481482 486575 492325 498758 505624 512813
60206 512813 520370 528025 535130 541286 546747 552108 557841 564091 570549 576478 581230 584887 588090 591218
60192 591218 594016 596022 596941 596537 594622 591334 587141 582456 577535 572779 568627 565055 561574 557933 554441
60177 554441 551385 548554 545554 542251 538667 534782 530778 527179 524405 522388 520836 519604 518536 517222
60163 517222 515362 513276 511692 510998 510911 510849 510514 510146 510276 511212 512739 514437 516224 518321 520735 523162
60147 523162 525447 527736 530087 532347 534627 537411 540879 544554 548029 551664 556104 561398 567141 573265
60133 573265 580012 587117 593551 598323 601204 602654 603363 603914 604554 605083 605233 605193 605523 606448 607502 608096 608268
60116 608268 608611 609554 610905 612136 612951 613478 614006 614695 615605 616802 618197 619277 619238 617552 614380 610391
60100 610391 606254 602257 598279 594145 590128 587033 585506 585290 585443 585411 585554 586517 588392 590758 593246 595814
60084 595814 598616 601800 605270 608490 610790 611987 612462 612471 611817 610439 608782 607036 604435 600023 593904
60069 593904 587061 580070 572713 564856 556894 549080 541179 533205 525932 520127 515583 511380 506878 502039
60055 502039 497069 492253 488049 484819 482379 480209 478230 477105 477613 479898 483428 487543 491851 496241
60041 496241 500752 505545 510838 516668 522679 528233 532809 536238 538555 539744 539779 538815 537124 534788 531598
60026 531598 527337 522084 516192 510007 503691 497291 490949 484939 479377 473907 467912 461220 454471 448577
60012 448577 443893 440099 436802 433912 431382 428885 425987 422567 418980 415812 413467 411893 410789 410167
59998 410167 410570 412451 415433 418533 421139 423392 425550 427424 428685 429378 429851 430416 431420 433325 436285
59983 436285 439758 442927 445452 447454 448879 449323 448584 446991 445007 442793 440301 437566 434768 432162 430055
59968 430055 428690 428077 428087 428743 430168 432171 434158 435598 436394 436784 437198 438282 440518 443404 445450 445626
59952 445626 444654 444254 445161 446544 447453 448089 449156 450589 451622 451956 452161 452809 453674 454042 453485 452080 450082
59935 450082 447721 445325 443361 442111 441403 440859 440437 440519 441334 442515 443490 444203 445059 446232 447522 449053
59919 449053 451570 455542 460311 464705 468363 471942 476009 480325 484390 488210 492184 496500 500960 505183
59905 505183 508735 511205 512387 512331 511142 508972 506357 504167 502806 501726 500239 498682 498206 499339 501407
59890 501407 503617 506150 509614 513798 517698 520792 523666 527203 531615 536604 542031 547966 554225 560325
59876 560325 565873 570703 574586 577165 578246 577904 576268 573497 569986 566234 562372 558137 553505 548930
59862 548930 544709 540501 535921 531333 527503 524651 522405 520697 520096 521158 523879 527989 533332 539727
59848 539727 546813 554264 561843 568967 574563 577738 578539 577859 576817 576344 577014 578741 580701 581902 581835 580431
59832 580431 577563 573048 567214 561068 555665 551362 547761 544272 540607 536794 532873 528764 524528 520601
59818 520601 517433 514794 511746 507601 502791 498531 495664 494037 492869 491420 489296 486512 483498 480933
59804 480933 479319 478622 478331 477821 476711 474941 472586 469677 466268 462701 459620 457517 456333 455625 455107
59789 455107 454904 455241 456042 456947 457678 458315 459137 460172 460952 460847 459681 457987 456620 456143 456479 457007 457002 456235
59771 456235 455243 454865 455431 456581 457899 459450 461487 463842 465898 467097 467325 466940 466634 467140 468772 471239
59755 471239 474068 477161 480728 484759 488839 492564 495967 499486 503576 508367 513585 518789 523717 528394
59741 528394 532897 537181 541173 544875 548233 551062 553241 554839 555935 556494 556545 556247 555607 554424 552805
59726 552805 551357 550414 549400 547599 545452 544323 544824 545989 546409 545663 544304 542924 541754 540910 540439 540151
59710 540151 539751 539236 538901 538907 539048 539030 538871 538945 539592 540666 541522 541603 541053 540625 540873 541583 542102 542123 541941 541927 541938
59689 541938 541414 540116 538600 537721 537692 537890 537732 537465 537755 538705 539633 539744 538644 536276 532777 528484 523697
59672 523697 518422 512692 507129 502596 499155 495884 492083 488156 484907 482434 480236 478116 476338 475070
59658 475070 474289 474232 475330 477566 480310 482967 485470 488043 490802 493766 496917 500024 502591 504205 504821
59643 504821 504573 503495 501628 499284 496963 495003 493407 491984 490494 488680 486311 483418 480507 478394
59629 478394 477584 477716 477723 476741 474850 472870 471417 470228 468459 465598 462106 459137 457528 457046 456672 455649
59613 455649 454060 452390 450869 449508 448521 448307 449028 450535 452679 455323 458024 460127 461407 462321 463418
59598 463418 464664 465570 465803 465443 464821 464344 464333 464742 465087 464932 464450 464236 464568 465095 465330 465233 465156 465360 465696
59579 465696 465657 464658 462426 459259 455894 452978 450669 448746 447001 445394 443916 442487 441063 439736 438691
59564 438691 438103 438151 439036 440791 443014 444934 445957 446191 446297 446789 447615 448444 449113 449634 450025 450467 451499
59547 451499 453654 456843 460429 463989 467753 472326 478448 487148 499393 514957 531984 548336 563310
59534 563310 577423 590462 600531 605437 604739 600093 593890 587864 582762 578786 576107 575042 575863 578475
59520 578475 582351 586745 590916 594212 596155 596479 594955 591251 585251 577494 568943 560172 551074 541507
59506 541507 531872 522773 514404 506585 499237 492445 486191 480398 475178 470730 466918 463260 459499 456012
59492 456012 453527 452380 452138 451991 451570 451250 451479 451947 451855 451012 450245 450462 451787 453928 456945 461051 465862
59475 465862 470515 474552 478201 481713 484938 487735 490408 493397 496740 500086 503205 506287 509673 513295
59461 513295 516530 518904 520941 523887 528322 533449 538223 542851 548536 555936 564546 573577 582603 591199
59447 591199 598702 604815 609883 614073 616706 616903 614556 610171 604054 596246 587190 577881 569240 561653
59433 561653 555143 549619 544862 540596 536767 533577 531142 529393 528543 529457 533148 539781 548446 558164 569036
59418 569036 582128 598277 617368 638844 662388 687645 713614 738882 762346 783032 799157
59407 799157 808139 808192 799898 786052 770237 755570 744142 736841 733496 733359 735401 737945 738270 733290
59393 733290 721205 702672 680339 657207 635276 615396 597868 582772 569774 558201 547785
59382 547785 539152 533099 529430 526991 524968 523692 523929 525744 528441 531360 534363 537569 540923 544126
59368 544126 546856 549093 551315 554339 558762 564484 570706 576499 581553 586486 592308 599376 607001 614341
59354 614341 621532 629635 639532 651174 663880 676995 690260 703976 718849 735278 752674 769839
59342 769839 786060 801371 815692 828286 838356 845694 850391 852356 851443 847715 841271 832163 820798
59329 820798 808014 794286 779229 762418 744474 726808 710409 695295 681086 667648 655232
59318 655232 644336 635452 628610 623172 618312 613704 609582 606246 603748 601996 600988 600951 602331 605556
59304 605556 610774 617986 627397 639171 652707 666437 678455 687015 690523 687918 679556 667257 652961
59291 652961 637794 622698 609107 598056 589058 580811 572927 566183 561200 557680 555033 553126 552223
59278 552223 552642 554554 557849 562222 567673 574664 583493 593857 605444 618437 632808 647617 661817
59265 661817 675264 687959 698730 706003 709802 711633 712213 710602 705981 699043 691021 682402 673279 664067
59251 664067 655052 645973 636816 628358 621208 614963 609138 604341 601598 600980 601830 603968 607622 612295 616809
59236 616809 620626 624294 628392 632780 637219 642000 647420 652905 657092 658767 657686 654649 650917 647342
59222 647342 643893 640031 635428 630172 624374 618009 611275 604844 599415 595053 591184 587289 583479 580213
59208 580213 577572 575062 572244 569275 566617 564442 562573 560809 558881 556289 552781 548998 546052 544358
59194 544358 543388 542742 542810 544013 545909 547578 548582 549140 549638 550388 551635 553351 555126 556580 557808 559200
59178 559200 561013 563325 566199 569625 573514 577891 582803 587938 592833 597793 604044 612439 622396 632639
59164 632639 642605 652500 662334 671691 680312 688121 694727 699588 702653 704146 703759 700877 695742 689530
59150 689530 682915 675311 665999 655449 644924 635177 626085 617245 608432 599598 590886 582564 574652 566791
59136 566791 558785 551087 544338 538576 533313 528292 523753 519967 517021 515137 514756 515983 518217 520691
59122 520691 523238 526343 530533 535933 542320 549324 556604 564153 572453 582044 592739 603553 613700
59109 613700 623441 633536 643992 653903 662667 670791 679032 687119 693917 698777 702116 704548 706013 706160
59095 706160 705201 703843 702441 700685 698258 695428 692795 690711 689158 688018 687084 685905 683976 681164 677657
59080 677657 673404 667954 661116 653495 645988 638886 631804 624428 616951 609754 603062 597016 591733 587079
59066 587079 582640 578125 573650 569516 565881 562742 560019 557486 554838 552045 549476 547463 545860 544188
59052 544188 542166 539956 538010 536777 536428 536713 537160 537483 537677 537704 537416 536923 536682 536901 537098 536666 535750 535166
59034 535166 535466 536463 537667 538859 540111 541552 543292 545493 548481 552871 559410 568376 579073 590301
59020 590301 601480 613052 625616 638891 651841 663589 673808 682259 688439 691960 693071 692513 690932
59007 690932 688621 685735 682423 678818 675228 672458 671563 673027 676398 680967 686509 693029 700024 706578
58993 706578 712211 717219 722024 726514 730160 732548 733723 734116 734137 733652 731965 728609 724075 719407 715226
58978 715226 711590 708704 707101 707007 708145 710371 713938 718875 724723 731295 739135 748737 759666 771000
58964 771000 782319 793784 805481 817161 828461 839041 848695 857505 865502 871891 875160 874462 870469
58951 870469 864299 856050 845120 831573 816398 800565 784597 768906 753826 739355 725588 713276
58939 713276 703116 694520 686058 677297 669371 663385 659118 655718 652896 650817 649349 648077 646810 645530
58925 645530 644068 642217 640024 637665 635256 632984 631125 629648 628151 626461 624953 623905 622956 621736
58911 621736 620792 621228 623439 626671 629891 632702 635403 638660 643297 650011 658880 669245 680253 691495
58897 691495 702964 714580 726074 737406 749085 761860 776162 791990 809342 828500 849727
58886 849727 872715 896475 919828 942057 963072 982867 1000797 1015557 1026066 1032206 1034462 1033081
58874 1033081 1028098 1019994 1009605 997163 982210 964828 946278 927865 909848 892196 875786 861737
58862 861737 849828 838676 827490 816616 806202 795437 783634 771200 758913 746859 734717
58851 734717 722624 711118 700495 690762 682050 674554 668150 662432 657012 651545 645644 639105 632121
58838 632121 625005 617783 610289 602570 594979 587882 581414 575464 569910 564934 561087 558781 557752 557271
58824 557271 556902 556751 557004 557622 558597 560083 562113 564572 567570 571441 576233 581582 587211 593008 598474
58809 598474 602720 605444 607338 609083 610473 611056 611034 610791 609969 607904 604736 601160 597153 591986 585667
58794 585667 579445 574369 570060 565502 560567 556067 552565 549846 547597 546054 545708 546698 548740 551454 554541
58779 554541 557747 560957 564309 567941 571522 574340 576022 576938 577578 577738 576706 574189 570619 566527 562094
58764 562094 557451 552925 548703 544610 540567 536983 534311 532443 530973 529942 529858 530983 532998 535527 538639
58749 538639 542524 546778 550365 552538 553738 555325 558317 562564 567307 572196 577345 582618 587516 591913
58735 591913 596337 601255 606544 611971 617774 624336 631585 639171 647049 655391 663976 672054 678928 684511
58721 684511 689347 694206 699608 705554 711790 718292 725329 733049 741274 749774 758354 766575 773896 780303
58707 780303 786237 791430 794370 793591 789215 782492 773985 762996 748847 731995 713644 694763 675819
58694 675819 656997 638300 619651 601323 584219 569456 557606 548407 541069 534768 528910 523176
58682 523176 517521 512098 507040 502205 497257 492155 487491 484088 482247 481554 481414 481530 481887 482661 484291
58667 484291 487392 492413 499452 508285 518300 528537 538323 547877 557657 567052 574461 579030 581560 583209
58653 583209 584004 583304 581103 577997 574273 569928 565385 561292 557648 553907 549962 546286 543127 540334 538039
58638 538039 536752 536523 536712 536876 537357 538725 541062 543982 546913 549177 550286 550434 550358 550508 550709 550786 551020
58621 551020 551755 552987 554659 557057 560601 565414 571269 577748 584400 591037 597934 605349 612679 618483
58607 618483 621541 621675 619518 615973 611991 608250 604669 600602 595806 590884 586511 582728 579315 576361
58593 576361 573909 571471 568626 565988 564962 566478 570375 576020 583052 591394 600862 611006 621223 631010
58579 631010 640218 649019 657507 665440 672470 678445 683322 687054 689935 692915 697153 703304 711561 722283
58565 722283 736074 753148 773082 795350 819725 845865 872899 899775 925808 950540 973213
58554 973213 992756 1008234 1019091 1025078 1026424 1024124 1019690 1014388 1008835 1003255 997663 991630 984295
58541 984295 975020 963814 950842 935867 918678 899879 880587 861290 841585 821289 801299 782993
58529 782993 767041 753253 741405 731785 724818 720413 717910 716627 716327 716973 718143 719095 719653 720574 722534
58514 722534 724969 726538 726567 725377 723265 720177 716577 713553 711379 708745 704303 698480 692935 688629 685285
58499 685285 682450 680013 677641 674610 670543 665881 661512 658320 656929 657239 658167 658534 658416 659091 661542
58484 661542 665593 670706 676997 685036 695085 706894 720006 733931 748341 763302 779035 795076
58472 795076 809915 821819 829958 834498 835760 833722 828456 820709 811675 802202 792548 783080 774826 768814
58458 768814 765010 762559 761279 762232 766417 773533 782552 792960 804551 816329 826547 833905 838076
58445 838076 839035 836675 831308 823909 815582 807122 799174 792285 786574 781760 777734 774694 772639 771180
58431 771180 770116 769866 771048 773900 778267 783934 790791 798854 808205 818734 829896 840862 850837 859094
58417 859094 864880 867668 867470 864668 859730 853369 846572 839925 832991 824964 815803 806211 796628 786966
58403 786966 777357 768483 760958 754859 749986 746154 743196 741168 740539 741665 743998 746350 748010 749188
58389 749188 750425 752056 754118 756117 756969 755968 753931 752661 753164 755005 757486 760617 764706 769732 775512
58374 775512 781957 788921 796354 804737 814723 826155 838085 849892 861646 873206 883915 893633 903315
58361 903315 913971 925629 937843 950636 964279 978423 992050 1004189 1014445 1022942 1029912 1035285
58349 1035285 1038819 1040838 1042485 1044690 1047162 1049121 1050790 1053276 1057120 1061921 1067396 1073801 1081246 1089610
58335 1089610 1099302 1111079 1124878 1139774 1155215 1171236 1187317 1202266 1215625 1228026 1239782
58324 1239782 1250314 1259346 1267370 1274387 1279494 1282451 1284444 1286556 1288643 1290575 1293358 1297980 1304111 1310943
58310 1310943 1318529 1327386 1337574 1349077 1362293 1377334 1393554 1410503 1428516 1447715 1467335 1486790
58298 1486790 1506374 1526182 1545414 1563610 1581498 1599698 1617736 1635322 1653411 1672812 1692804
58287 1692804 1712457 1732322 1753483 1775818 1798554 1821738 1845736 1869922 1893203 1915435 1937271
58276 1937271 1959246 1982084 2007195 2035766 2067850 2103122 2141702 2183376 2226952 2271378 2316603
58265 2316603 2362585 2408686 2455028 2503078 2553722 2606147 2659765 2715636 2774526 2835238 2896615
58254 2896615 2959716 3026082 3095205 3165731 3237967 3313209 3391721 3473337 3558917 3649283 3743898
58243 3743898 3842495 3946620 4057510 4173928 4294375 4420036 4553202 4694249 4842718 4999898
58233 4999898 5167634 5345945 5534632 5735806 5951930 6182752 6427253 6687340 6966471
58224 6966471 7265981 7586017 7928839 8297913 8695092 9122050 9583128 10083407 10625717
58215 10625717 11213218 11853248 12555019 13325749 14173184 15109693 16149805 17306806 18597053
58206 18597053 20045199 21680594 23533081 25639658 28053644 30844226 34096310 37923624
58198 37923624 42482690 47973367 54642222 62806643 72882419 85398096 101010957 120496223
58190 120496223 144588678 173622347 207166183 243948827 282066869 319137612 352226068
58183 352226068 377899964 392882136 395170496 384864706 364073260 336028099 304059201
58176 304059201 270938561 238656819 208458884 180993474 156499658 134970685 116262253
58169 116262253 100156353 86401621 74734215 64884695 56587304 49596448 43697288
58162 43697288 38704749 34461053 30836648 27727272 25046007 22719428 20689143 18909781
58154 18909781 17342373 15952248 14712742 13605397 12614548 11724824 10924017 10203709 9555396
58145 9555396 8969261 8437603 7955940 7519403 7120936 6753998 6414141 6097138 5798608
58136 5798608 5516631 5252039 5004937 4773180 4554997 4350532 4159758 3981182 3813719
58127 3813719 3657637 3512508 3376087 3246408 3123430 3007786 2899483 2798574 2705509 2619959
58117 2619959 2540560 2466467 2397862 2334478 2275023 2218556 2165082 2114267 2064909 2016114 1967776
58106 1967776 1919544 1870610 1820947 1771552 1723095 1675440 1628710 1583622 1540564 1499520 1460973
58095 1460973 1425552 1392691 1360984 1330014 1300472 1272413 1244965 1217871 1191760 1166662 1141930
58084 1141930 1117919 1095937 1076004 1056291 1035439 1013835 991988 969418 946125 923574 903018
58073 903018 884046 865834 848625 832857 817932 803134 788955 776338 765202 754723 744519
58062 744519 734724 725432 716834 709317 702647 695651 687441 678429 669399 660225 650367 640188 630860 623121
58048 623121 616789 611319 606309 601621 597418 593867 590546 586502 581224 575264 569553 564464 559744 554923
58034 554923 549530 543330 536665 530179 524011 517642 510648 503093 495062 486481 477599 469062 461208 453853
58020 453853 446911 440565 434607 428427 422066 416501 412443 409514 407057 405028 403511 402049 400153 398015
58006 398015 396060 394212 392196 390243 388921 388540 389130 390704 393094 395885 398886 402350 406385 410520 414247
57991 414247 417556 420507 422636 423271 422230 419868 416748 413503 410609 407924 404809 401047 397234 393939
57977 393939 390913 387539 383624 379310 374655 369840 365471 362095 359513 356998 354087 350852 347608 344666
57963 344666 342265 340488 339380 339142 339893 341180 342162 342416 342136 341416 339947 337687 335284 333470 332456 332150
57947 332150 332367 332560 332053 330976 330415 331183 333036 335488 338689 342929 348007 353863 361225 370768 381944
57932 381944 393422 404365 414645 424191 432915 440907 447869 452677 454404 453664 452044 450223 447442 442876
57918 442876 436746 429905 422940 415892 408444 400322 391861 384103 377912 373074 368745 364554 360772 357539
57904 357539 354585 351674 348684 345242 340902 335824 330767 326278 322351 318942 316322 314751 314156 314281 314903
57889 314903 315901 317414 319848 323417 327655 331709 335040 337583 339492 341078 342759 344496 345470 344866 342865
57874 342865 340357 337856 335289 332680 330322 328314 326584 325304 324536 323544 321390 318345 315813 314594 314080
57859 314080 313556 313371 314216 315971 318055 320421 323425 326927 330190 332634 334236 335253 335870 336064 335622 334476
57843 334476 333084 332095 331416 330044 327216 323339 319379 315714 312082 308314 304459 300345 295656 290550 285775
57828 285775 282071 279781 278957 279511 281200 283738 286960 290663 294457 298073 301725 305811 310342 315026 319679
57813 319679 323989 326929 327138 324153 318816 312294 305228 297995 291142 285031 279605 274967 271762 270268
57799 270268 269524 268145 265859 263511 261700 260367 259707 260352 262195 264041 265105 266073 267876 270090 271562
57784 271562 272235 273201 275048 277292 279537 282224 285834 290186 294914 299982 305289 310356 314897 319178 323333
57769 323333 326781 328816 329379 328787 327121 324425 321122 317592 313549 308395 302118 295324 288534 281928 275727
57754 275727 270361 266218 263528 262357 262435 263173 264236 265898 268469 271597 274588 277183 279528 281514 282794
57739 282794 283342 283448 283140 282193 280786 279610 279172 279302 279333 278428 275901 271797 267108 262911 259277 255541
57723 255541 251536 247817 244665 241706 238807 236523 235211 234316 233041 231269 229421 227868 226949 227031 227911
57708 227911 228513 227809 225961 224055 222884 222483 222697 223539 224885 226345 227680 229081 230818 232787 234566
57693 234566 235805 236482 236781 236766 236198 234723 232298 229337 226400 223817 221653 219984 219077 219301 220868 223715
57677 223715 227763 233392 241529 253087 268473 287920 312269 343070 381780 428786 482906 541321
57665 541321 599869 653658 697650 726979 737691 728324 701112 661190 614251 564792 515977 469977
57653 469977 428056 390875 359058 333036 312230 295079 280307 267711 257479 249385 243109 238630
57641 238630 235639 233104 230218 227378 225450 224394 223500 222776 223069 224687 226765 228332 229245 229736 229655 228700
57625 228700 227024 225082 223050 220775 218213 215615 213247 211092 208883 206440 204014 202225 201483 201447 201204
57610 201204 199944 197392 193805 189884 186586 184510 183296 181985 180170 178496 177751 177810 177840 177430 177031 177214
57594 177214 177791 177928 176934 174726 171596 167831 163710 159633 155981 152813 149922 147226 144940 143260 142034
57579 142034 140891 139636 138362 137176 135909 134150 131601 128413 125112 122105 119332 116561 113950 112027
57565 112027 111099 110905 110945 110925 110814 110709 110794 111181 111668 111848 111642 111569 112281 113958 116257 118728 121214 123908
57547 123908 126997 130144 132503 133630 134185 135191 136702 137953 138922 140657 143592 146549 148294 149307 150867
57532 150867 152893 154034 153815 153384 153835 154865 155558 155650 155461 155231 155103 155307 155835 156261 156288 156126 156011 155764
57514 155764 155248 154889 155236 156196 157190 157882 158362 158739 158992 159101 158932 158076 156241 153858 151902 150976 150800 150623
57496 150623 149863 148267 145810 142779 139913 138100 137724 138302 138901 138960 138680 138567 138763 138979 139010 139024 139242 139539
57478 139539 139585 139286 138900 138683 138542 138123 137202 135858 134225 132205 129614 126571 123527 120861 118705 117154
57462 117154 116280 115778 115060 114063 113585 114298 115758 116969 117706 118522 119567 120278 120383 120374 120612 120755 120600 120782
57444 120782 121861 123176 123473 122530 121438 121255 122017 123169 124335 125397 126266 126921 127492 128060 128489 128628 128558
57427 128558 128546 128790 129303 129953 130571 131037 131324 131442 131379 131199 131217 131949 133673 135963 137790 138362 137914 137425 137476
57408 137476 137721 137738 137901 138786 139974 140332 139654 139170 139958 141523 142560 142646 142444 142535 142820 143066 143360 143889 144740
57389 144740 145993 147615 149178 150144 150532 150945 151816 153026 154349 155858 157614 159312 160514 161045 160941 160200
57373 160200 158824 156971 154887 152803 150975 149589 148442 146962 144828 142411 140331 138650 136885 134825
57359 134825 132969 131958 131792 131926 132126 132869 134673 137211 139440 140631 140966 141016 141090 141430 142675 145355 148884
57342 148884 151712 152829 152700 152408 152334 152212 152146 152777 154344 156226 157689 158670 159516 160335 161039 161811 163013
57325 163013 164580 165910 166515 166488 166215 165877 165469 165106 164951 164849 164342 163222 161881 160913 160384 159715 158415
57308 158415 156831 155961 156354 157293 157316 155710 153303 151533 150733 149682 147037 143003 139191 136843 135582 134136
57292 134136 131971 129717 128057 126743 125037 122697 120086 117488 114914 112495 110468 108508 105674 101482
57278 101482 96673 92454 89181 86290 83418 81111 80386 81942 85833 91654 98977 107794 118361 130419
57264 130419 142823 154401 165034 175392 185705 195375 203749 210691 216345 221004 225293 229794 234267
57251 234267 237877 240407 242491 244425 245642 245899 246095 247092 248471 249345 249816 250557 251406 251633 251445 252036 254012
57234 254012 256821 259906 263364 267185 270847 274146 277580 281327 284628 286855 288562 290703 293297 295605
57220 295605 297352 299041 301191 303911 307183 310965 314954 318746 322350 326207 330584 335268 339970 344809
57206 344809 350215 356410 363133 369979 376991 384761 393783 403875 414601 426085 438868 452842 466956
57193 466956 480333 493250 506562 520519 534655 548640 562698 577177 592080 607050 621644
57182 621644 635742 649904 665116 681895 699764 717840 735761 753766 772172 791113 810609
57171 810609 830448 850105 869197 887867 906396 924625 942219 959292 976174 992672 1008217
57160 1008217 1022857 1037545 1053321 1070639 1089525 1109682 1130236 1150057 1168860 1187679 1207812
57149 1207812 1229538 1252199 1275196 1298472 1322181 1346443 1371504 1397752 1425347 1453948 1482969
57138 1482969 1512093 1541449 1571223 1601202 1630921 1660290 1689848 1720262 1751813 1784541 1818555
57127 1818555 1853854 1890141 1927279 1965718 2006004 2048087 2091679 2137075 2184893 2235132 2287319
57116 2287319 2341717 2399632 2462437 2531055 2606555 2690390 2783708 2887217 3002135 3130608 3274893
57105 3274893 3436968 3619400 3825987 4061493 4332074 4646845 5018444 5462009 5995160
57096 5995160 6639969 7423701 8376494 9528999 10912084 12555336 14481571 16700850 19207746
57087 19207746 21979228 24970927 28117906 31345763 34584661 37772839 40849067 43745066
57079 43745066 46381396 48660611 50461829 51654799 52138134 51876107 50904717 49308816
57071 49308816 47196554 44686266 41898084 38941594 35905301 32856278 29847335 26923602
57063 26923602 24125719 21490807 19050686 16827453 14830374 13057203 11497719 10136102
57055 10136102 8952655 7926570 7038373 6270217 5605426 5029227 4529452 4095474 3716981
57046 3716981 3384852 3092689 2836188 2611048 2412390 2236025 2079182 1939836 1816098
57037 1816098 1706447 1609879 1525663 1453438 1393677 1347577 1316170 1299593 1297118 1307460 1328509
57026 1328509 1356149 1382816 1397763 1390493 1355736 1295839 1218577 1132877 1046012 962873 886013
57015 886013 816128 753237 697643 649583 608397 572693 541267 513499 489163 468347 451273
57004 451273 437625 426259 416058 406748 398391 390466 382220 373711 365752 358954 353462 349469 347163
56991 347163 346181 345828 345966 347078 349496 353173 358267 365290 374437 385157 396229 405791 411492 411509 405644
56976 405644 394998 380720 363789 345785 328709 313667 300515 289040 279677 272763 268009 265245
56964 265245 264964 267572 272836 280741 292248 308372 328775 351837 375714 398694 418860 434205
56952 434205 443138 444564 437920 423870 404784 383723 362741 342496 323300 305876 290997 279046
56940 279046 270225 264830 263101 265129 271095 281332 295921 314441 336412 361693 389966 419566
56928 419566 447021 468075 479483 480143 470923 453711 430613 403660 374809 345947 318662 293832
56916 293832 271498 251400 233722 218979 207070 196964 187762 179724 173655 169563 166547 163918 161744
56903 161744 160274 159545 159735 161218 164081 168089 173341 180302 188978 198767 209552 222256 237744 255779
56889 255779 275731 297710 322122 348330 374644 399534 422024 440802 453822 459275 456660 446737
56877 446737 430927 411091 389510 368430 349367 332783 318457 306174 296338 290103 288942 294015
56865 294015 305862 324625 350506 383981 425424 474279 528454 584451 637943 684146 718121
56854 718121 735730 735180 717903 687963 650495 610231 570666 533966 501597 475041 455704 444193
56842 444193 440161 443228 453937 473793 504654 548167 605183 675119 755842 844102 935587 1024216
56830 1024216 1101885 1159861 1191191 1192644 1165539 1115349 1049934 976875 901653 827823 758244
56819 758244 695608 642011 598533 565217 541378 526330 520377 525000 541749 570996 611914 663043
56807 663043 722150 785573 848262 904441 947993 972923 974991 953825 913283 859407 798016 733841
56795 733841 670826 612181 559916 514606 475917 443484 417468 398322 386163 380669 381746 390015
56783 390015 406208 430015 459715 492716 526058 556455 580381 594558 596653 585893 563489 532469
56771 532469 496595 459011 421612 385409 351115 319405 290847 265707 243809 224709 208131
56760 208131 194114 182595 173012 164570 156763 149421 142436 135813 129911 125302 122323 120851 120392 120200
56746 120200 119536 118150 116418 114725 112886 110530 107889 105758 104623 104135 103490 102104 100010 97919 96840
56731 96840 97304 98896 100678 101975 102530 102176 100852 98950 97148 95838 95001 94687 95192 96575 98258 99374
56715 99374 99478 98900 98445 98721 99679 100880 102179 103869 106051 108181 109535 109873 109424 108559 107769 107588 108048
56698 108048 108431 108024 106913 105673 104520 103312 102137 101250 100510 99524 98371 97624 97620 98128 98720 99057 98870
56681 98870 98194 97616 97803 98781 100054 101346 102711 104040 105095 106124 107827 110570 113953 117272 120060
56666 120060 122272 124336 126873 129923 132695 134599 136298 139035 143193 148301 154171 160959 168123 174480
56652 174480 179553 183830 187472 189821 190691 191039 191679 192208 191979 191400 191362 191890 192199 191854 191167 190612 190348 190130
56634 190130 189360 187571 185188 183372 182675 182284 181132 179345 177959 177513 177529 177252 176316 174721 172669 170410
56618 170410 168002 165247 162095 158972 156394 154386 152480 150215 147490 144604 142044 140038 138253 136153
56604 136153 133623 130873 127862 124430 121073 118804 117908 117478 116620 115540 114945 114945 115179 115630 116637 118273
56588 118273 120217 122087 123541 124312 124570 125044 126402 128648 131368 134268 137138 139567 141122 141769 141907
56573 141907 142166 143193 145264 147968 150610 152970 155281 157495 159317 161035 163539 167242 171826 177295
56559 177295 184304 192846 201548 209032 215179 220353 224269 226675 228409 230585 233116 235144 236543 237915
56545 237915 239373 240499 241393 242577 243802 244016 242752 240725 238839 237225 235485 233260 230420 227186 224101
56530 224101 221450 218812 215719 212534 210019 208208 206451 204481 202583 200684 198100 194503 190541 187222
56516 187222 185038 183746 182645 181075 179008 177078 175713 174508 172853 170808 168750 166546 163956 161555
56502 161555 160256 159946 159502 158263 156668 155317 154251 153344 152655 152129 151571 151142 151290 152002 152588 152318 150844
56485 150844 148203 145023 142596 141915 142646 143742 144982 146935 149482 151518 152428 152812 153393 154147 154955 156136
56469 156136 157739 159087 159670 159866 160293 161066 162164 163837 165968 167641 168078 167667 167497 168173 169486 170847
56453 170847 171592 171307 170342 169683 169916 170643 171224 171589 171941 172239 172517 173191 174416 175563 176013 176106 176613 177520
56435 177520 178126 178227 178441 179234 180286 181042 181439 181810 182342 182903 183337 183774 184589 186046 188011 190151 192385
56418 192385 194876 197562 199972 201715 202995 204500 206842 210026 213271 215425 215949 215505 215222 215360 215169
56403 215169 214157 212949 212553 213131 213867 213865 212939 211682 210950 211107 211659 211780 211170 210214 209378 208892 208997 209938
56385 209938 211544 213229 214622 215873 217264 218952 221209 224370 228289 232183 235206 236885 237033 235821
56371 235821 234076 232820 232196 231363 229734 227784 226249 225121 223877 222265 220422 218641 217437 217323 218068
56356 218068 218616 218339 217978 218768 220918 223585 226067 228333 230437 232139 233275 234083 234996 236312 238087 240147
56340 240147 242207 244171 246220 248473 250711 252601 254061 255200 256079 256709 257170 257527 257775 258010 258516 259564
56324 259564 261244 263490 266027 268278 269691 270341 270865 271630 272285 272376 272060 271893 272207 272970 274092 275501 277006
56307 277006 278360 279536 280854 282867 285988 290109 294575 298686 302190 305150 307578 309555 311474 313746
56293 313746 316333 319002 321875 325195 328678 331739 334356 337109 340358 343974 347902 352340 357361 362967
56279 362967 369486 377123 385193 392732 399972 408234 418080 428572 438706 448572 458669 469077 480001
56266 480001 492178 505942 520550 535260 550487 567282 586237 607621 631931 659540 690242
56255 690242 723986 761702 804762 853919 909312 971085 1039425 1114395 1196328 1285948 1383472
56244 1383472 1487969 1598056 1712646 1830337 1948619 2064524 2175715 2280179 2375169 2457311
56234 2457311 2523680 2572322 2602109 2612780 2604974 2579672 2537795 2480780 2411063 2331331 2243583
56223 2243583 2149514 2051419 1951949 1853069 1755791 1660683 1568120 1478338 1391885 1309885 1233399
56212 1233399 1162781 1098036 1039376 986818 939612 896701 857521 821838 789182 759130 731868
56201 731868 707801 686760 668098 651405 636627 623677 612350 602463 593743 585806 578453 571669
56189 571669 565180 558601 552232 546990 543176 540041 536972 534226 531958 529514 526559 524082 523299 524119 525570
56174 525570 527157 528914 530670 532191 533671 535314 536942 538688 541428 545718 550962 556401 562163 568475
56160 568475 574720 580458 586617 594425 603713 613496 623617 634534 646054 657719 670193 684923 702659
56147 702659 723392 747417 775339 807540 844901 889711 944440 1009960 1086011 1172763 1270133
56136 1270133 1375797 1485516 1595415 1702541 1803584 1895147 1975915 2047259 2111400 2170026
56126 2170026 2224427 2275090 2320452 2357334 2383337 2398174 2402707 2397969 2385337 2366161 2340319 2305734
56114 2305734 2259789 2200834 2128514 2043718 1948691 1846707 1741473 1637026 1537506 1445961 1363477
56103 1363477 1290160 1226479 1172726 1127756 1089579 1056989 1029572 1006630 987484 972478 962150
56092 962150 955485 950392 945927 942752 941487 941873 943495 946087 949148 952375 956383 961916 968634 975743
56078 975743 983347 991911 1000954 1009700 1018492 1028036 1037832 1046998 1056076 1066204 1077086 1087786 1098978
56065 1098978 1112216 1127278 1142529 1157698 1174005 1191661 1209678 1228188 1248464 1270339 1291935
56054 1291935 1312303 1332124 1351557 1369671 1386380 1402693 1418717 1433716 1448359 1464471 1482149
56043 1482149 1499611 1516363 1533964 1553106 1572565 1591748 1611733 1632960 1654539 1676726 1701546
56032 1701546 1729877 1760312 1791843 1825238 1860855 1897614 1935197 1974731 2016165 2057481 2097751
56021 2097751 2138628 2181632 2226403 2272791 2322226 2375687 2432588 2492798 2557426 2626511 2698379
56010 2698379 2772434 2850168 2932363 3017813 3105830 3197388 3292793 3391007 3492362 3599086 3712076
55999 3712076 3829984 3952528 4081642 4218376 4361906 4512661 4673061 4844040 5024317
55990 5024317 5214147 5416120 5631313 5858786 6100050 6359685 6640254 6941052 7263108
55981 7263108 7610477 7985104 8385794 8814254 9276981 9779384 10323681 10914565 11560984
55972 11560984 12270265 13046977 13900162 14845577 15899110 17075642 18397011 19893727 21597348
55963 21597348 23541196 25772712 28358151 31376832 34926829 39144682 44214339 50363777
55955 50363777 57878035 67130651 78605013 92905127 110754271 132884560 159712297
55948 159712297 190933857 225387598 261293933 296511221 328451453 353930806 369623656
55941 369623656 373232208 364561354 345591223 319531849 289657193 258616339 228279112
55934 228279112 199820528 173858701 150622968 130119978 112238723 96796216 83568466
55927 83568466 72317364 62799229 54766792 47985154 42250236 37388946 33250418 29707417
55919 29707417 26660950 24032974 21755410 19770324 18034189 16512950 15174344 13989488
55911 13989488 12937535 12002273 11166401 10413674 9733420 9118009 8558304 8045721 7575944
55902 7575944 7146320 6751793 6386959 6049602 5738675 5451061 5183583 4935795 4707502
55893 4707502 4495797 4297605 4112956 3942754 3785468 3638932 3503296 3379247 3265178
55884 3265178 3158781 3059485 2966671 2877427 2788961 2701762 2617977 2538242 2462323 2391025 2324798
55873 2324798 2261864 2200069 2139331 2080218 2021622 1962008 1901644 1841599 1781925 1722689 1665303
55862 1665303 1610830 1558533 1508050 1461364 1420307 1383479 1348021 1313328 1280803 1250952 1222962
55851 1222962 1196383 1171096 1146077 1120000 1092729 1064883 1036658 1008289 980706 954400 928643
55840 928643 903090 879013 857482 837561 817858 798743 781382 765633 750611 736415 723658
55829 723658 712124 701480 692364 685153 678595 671303 663736 656940 650172 641713 631507 621154 611595
55816 611595 602432 593294 584317 575472 566733 558743 552162 546651 541557 537135 534089 532384 531570 531676 532812
55801 532812 534649 537394 542411 550411 559719 567717 573453 577523 580074 580613 579433 577536 575139 571555
55787 571555 566556 560690 554331 547382 539738 531116 520680 507781 492870 477018 460996 445600 432072
55774 432072 421108 411993 403776 396712 391503 387846 384971 382884 381659 380174 377228 373511 370761 369163
55760 369163 367235 364262 361125 358505 355799 352371 348653 345477 343147 341477 339973 337798 334359 330065
55746 330065 325808 321656 316884 311253 305469 300294 295915 292178 288777 285216 281260 277397 274268 271841
55732 271841 269687 267734 265979 263907 261084 257998 255341 252780 249423 245243 240908 236442 231279 225623
55718 225623 220552 216596 213292 210369 208353 207676 208018 208878 210126 211799 213864 216313 218959 221245 222812
55703 222812 224063 225440 226394 225889 223707 220396 216169 210968 205445 200678 196787 192937 188865 185345 182906
55688 182906 181180 179794 178873 178356 177849 177600 178657 181505 185403 189523 193891 198631 203207 207129 210690
55673 210690 214184 216926 217869 216874 214688 212001 209172 206594 204601 203055 201586 200230 199342 198889 198347
55658 198347 197514 197093 198143 201017 205037 209220 213078 216576 219595 221902 223671 225477 227498 229086 229447
55643 229447 228397 226084 222390 217219 211157 205181 199642 194007 187696 180848 174179 168324 163393 159065
55629 159065 155094 151595 148644 145771 142460 139152 136979 136266 136061 135549 135063 135103 135241 134864 134232 133782 133077
55612 133077 131599 130012 129275 128819 127026 123531 119724 116818 114678 112856 111630 111445 112142 113188 114066
55597 114066 114179 113121 111310 109666 108429 106950 104906 102910 101584 100749 99971 99351 99282 99810 100650 101583
55581 101583 102617 103991 106131 109283 113164 117242 121304 125440 129692 134183 139325 145248 151256 156585
55567 156585 161510 166847 172426 176942 179353 179578 177807 174205 169541 165123 161592 158358 154606 150236
55553 150236 145575 140824 136103 131532 127062 122680 118759 115576 112603 109137 105606 103279 102574 102679 103041
55538 103041 104060 105944 108114 110337 113357 117531 121731 124495 125640 125958 125964 125747 125545 125543 125411 124740 123696
55521 123696 122695 121684 120189 117832 114469 110177 105453 100968 96872 92826 88954 86064 84561 83828
55507 83828 83212 82893 83208 83765 83910 83519 82665 81068 78611 75846 73327 70889 68346 66331 65575 65720 65742
55490 65742 65255 64557 63684 62306 60457 58498 56418 53976 51486 49720 48910 48540 48186 47933 47882 47915 48200
55473 48200 49379 51925 55532 59285 62302 64235 65431 66650 68436 70755 73247 75567 77289 77906 77397
55458 77397 76604 76558 77480 78699 79467 79545 79172 78792 78765 79100 79560 80101 80960 82150 83272 84059 84726 85459 85939
55439 85939 85743 84932 83909 83050 82712 83116 83784 83628 82179 80316 79171 78694 77973 76645 75248 74353 74056
55422 74056 74241 74746 75350 76034 77100 78532 79639 79987 80358 81923 84563 86916 88056 88261 88062 87453 86399
55405 86399 85301 84471 83682 82741 82095 82380 83554 84865 85640 85850 85894 85944 85640 84569 83025 81910 81671 81718
55387 81718 81282 80530 80321 81093 82566 84385 86431 88477 90095 91027 91288 90960 90250 89661 89587 89749 89447 88375
55369 88375 86781 84994 83253 81861 80879 79788 78127 76389 75498 75403 75058 74044 73272 73601 74508 74861 74477
55352 74477 74150 74351 74612 74283 73447 72882 73203 74162 74858 74708 74108 73870 74178 74512 74540 74545 74814 75109 75092 74899
55332 74899 74957 75430 76091 76539 76390 75466 74053 72774 72103 72080 72530 73246 73872 73983 73509 72868 72504 72538 72939
55313 72939 73693 74621 75336 75682 75904 76129 76036 75407 74787 75043 76327 77895 79044 79802 80534 81182 81319 80858
55295 80858 80350 80392 80976 81657 82190 82634 82916 82791 82404 82420 83226 84324 84943 84969 84832 84699 84330 83641 82822 81951
55275 81951 81016 80357 80495 81387 82344 82814 82780 82298 81233 79749 78462 77728 77134 76112 74768 73708 73283
55258 73283 73407 73958 75001 76628 78738 80905 82351 82311 80684 78258 76141 75018 74927 75472 76123 76487 76498
55241 76498 76296 76027 75923 76326 77156 77458 76168 73555 71241 70439 70699 70840 70600 70722 71732 73285 74681
55224 74681 75472 75554 75103 74487 73981 73600 73360 73465 73932 74288 74110 73719 73830 74566 75314 75627 75755 76149 76886
55205 76886 77799 78772 79600 79858 79323 78433 77968 78227 78777 79108 79336 80014 81318 82670 83325 83119 82467 81841
55187 81841 81531 81789 82669 83621 83791 83036 82246 82251 82710 82598 81596 80426 79861 79937 80245 80514 80737 81061 81722
55168 81722 82855 84178 85179 85713 86165 86843 87537 87917 88037 88150 88252 88193 88086 88166 88304 88090 87470 86885 86644
55149 86644 86528 86289 86208 86789 88028 89353 90253 90678 90762 90493 89798 88741 87474 86109 84802 83820 83411 83606
55131 83606 84212 84900 85324 85344 85209 85350 85826 86173 85953 85309 84748 84569 84713 85011 85266 85235 84942 84978 86022 87928
55111 87928 89630 90190 89718 89125 89182 89977 91057 91824 91898 91422 90984 91135 91876 92703 93096 92913 92417 92104 92488
55092 92488 93828 95843 97671 98347 97546 95894 94430 93696 93455 93228 92839 92351 91794 91246 90939 90982 91112 90989
55074 90989 90646 90327 90076 89871 90092 91288 93376 95495 96839 97326 97327 97085 96659 96149 95675 95228 94731 94214
55056 94214 93871 93940 94484 95163 95417 95082 94634 94464 94172 93172 91865 91441 92332 93572 94033 93709 93336 93272 93344
55037 93344 93413 93544 93749 94014 94386 94770 94879 94726 94779 95252 95653 95556 95400 95793 96326 95933 94504 93331 93721
55018 93721 95648 97917 99203 98855 97252 95635 95149 95814 96681 97037 96992 96784 96165 94931 93663 93318 94186
55001 94186 95650 96933 97789 98448 99163 99924 100516 100818 100997 101325 101764 101897 101380 100407 99616 99565 100269 101181 101614
54982 101614 101286 100463 99529 98549 97472 96616 96576 97522 98906 100016 100607 100863 101026 101292 101887 102881 104007 104921
54964 104921 105630 106447 107505 108548 109286 109733 110000 109914 109178 108031 107423 108188 110008 111528 111674 110647 109451
54947 109451 108659 108043 107266 106453 105951 105878 106152 106731 107497 108044 107903 107082 106232 106125 106923 107994 108504 108259 107871
54928 107871 108029 108736 109506 110187 111289 113379 116454 120181 124529 129838 136228 143159 149725 155317 159932
54913 159932 163830 166925 168651 168466 166393 162935 158601 153756 148872 144475 140649 136872 132670 128318
54899 128318 124634 122129 120623 119609 118731 117842 116866 115797 114743 113841 113143 112629 112281 112127 112243 112785 113961
54882 113961 115902 118532 121592 124841 128303 132317 137287 143344 150220 157338 163988 169513 173560 176210
54868 176210 177671 177792 176112 172627 168277 164260 160845 157189 152463 146846 141228 136241 131940 128303
54854 128303 125455 123249 121022 118245 115286 113148 112355 112365 112191 111385 110256 109281 108595 107984 107201 106279 105615
54837 105615 105632 106213 106551 105869 104257 102496 101067 99755 98355 97393 97689 99362 101632 103553 104673 104975
54821 104975 104569 103622 102435 101377 100670 100205 99578 98493 97298 96939 98076 100266 102314 103433 103815 104106
54805 104106 104709 105690 106919 108023 108498 108146 107226 105957 104278 102429 101451 102387 105001 107770 109330 109589
54789 109589 109335 109223 109414 109869 110528 111205 111626 111689 111584 111634 112052 112810 113773 114925 116476 118593 121094 123549
54771 123549 125745 127966 130719 134257 138428 143002 148096 154170 161474 169504 177239 183966 189609 194138
54757 194138 197020 197638 195968 192444 187397 181178 174578 168429 162764 157062 151346 146291 142098 138150
54743 138150 134177 130870 128731 127074 125039 123001 122029 122274 122908 123523 124548 126101 127333 127291 125958 124191
54727 124191 123060 123345 125208 128192 131849 136260 141523 146935 151493 155238 159229 163832 167876 170046
54713 170046 170463 170219 169774 168538 165832 161683 156728 151785 147470 143848 140441 136785 132965 129426 126475
54698 126475 124184 122578 121538 120646 119444 117883 116309 115065 114245 113774 113524 113383 113331 113387 113421 113170 112496
54681 112496 111457 110115 108563 107267 106960 107856 109204 110001 110026 109930 110397 111472 112589 113046 112505 111268 109982
54664 109982 108958 108010 107075 106642 107150 108204 108890 108815 108378 107980 107486 106684 105897 105776 106592 107956 109224 109977
54646 109977 110165 110016 109876 109982 110231 110219 109712 109006 108653 108796 109043 109047 108900 108825 108848 108998 109429 109966 110012 109436 109197
54625 109197 110234 111968 112770 111992 110630 109837 109642 109530 109438 109623 110085 110657 111251 111686 111712 111489 111494 111664 111303
54606 111303 110177 108994 108327 107858 107286 107205 108260 110113 112070 114084 116180 117544 117340 116112 115234 115186
54590 115186 115434 115779 116570 117597 117975 117381 116449 115798 115558 115968 117368 119311 120603 120643 119982 119293 118618 117937
54572 117937 117562 117503 117167 116263 115350 115020 115069 114958 114562 114062 113560 113205 113194 113329 113089 112415 111874 111730 111535 111085
54552 111085 111043 112012 113571 114886 115837 116876 118161 119495 120848 122274 123503 124184 124435 124723 125282 126012
54536 126012 126743 127269 127331 126952 126601 126732 127357 128245 129208 129960 130147 129851 129543 129184 127964 125551 123059 122019
54518 122019 122678 124059 125397 126704 128028 129044 129524 129604 129448 129109 128720 128330 127535 125828 123430 121298
54502 121298 120211 120260 121187 122661 124069 124669 124329 123775 123758 124179 124316 123774 122998 122839 123740 125271 126477 126750
54484 126750 126382 126206 126767 127930 129136 129871 129980 129746 129683 130064 130704 131258 131653 132144 133055 134533 136370 137992
54466 137992 138885 139142 139305 139590 139659 139338 138988 138806 138350 137346 136466 136499 137063 137060 136312 135829 136332 137373 138166
54447 138166 138497 138396 137634 136154 134593 133730 133670 133974 134380 134884 135255 135035 134149 133156 132665 132627 132356 131239
54429 131239 129376 127534 126530 126676 127759 129348 130991 132302 133097 133462 133518 133184 132384 131387 130691 130532 130735
54412 130735 130999 131133 131040 130797 130808 131530 132916 134378 135406 135976 136307 136572 137026 138044 139622 141099 141845
54395 141845 142176 143111 145081 147285 148585 148755 148516 148489 148572 148375 147864 147315 146924 146779 147041 147773 148631 149063
54377 149063 148893 148452 148149 148157 148509 149127 149689 149824 149595 149440 149510 149423 148936 148492 148783 150013 151877 153988 155940
54358 155940 157207 157454 156956 156426 156409 157058 158308 159979 161785 163488 165027 166361 167392 168179 169006 169970
54342 169970 170721 170905 170590 169959 168849 167021 164726 162547 160765 159147 157253 154719 151485 148136 145720
54327 145720 144812 144925 145211 145411 145681 145913 145930 146056 146653 147274 147107 146258 145699 145862 146134 145912 145282 144360 142833
54308 142833 140689 138713 137646 137366 137385 137659 138386 139362 140130 140467 140357 139817 139234 139441 140811 142489 143135
54291 143135 142407 141197 140409 140003 139353 138185 136906 136162 136244 136954 138000 139330 140826 141867 141726 140571
54275 140571 139556 139579 140277 140587 139998 138887 137941 137697 138457 140090 141976 143552 144869 146268 147576 148100
54259 148100 147538 146505 145985 146491 147857 149594 151238 152541 153507 154217 154571 154329 153488 152463 151760 151533 151618
54242 151618 151942 152619 153512 153926 153097 151023 148534 146430 144812 143452 142504 142446 143410 144877 146087 146565 146364
54225 146364 145990 145941 146074 145608 144136 142386 141484 141562 141706 141268 140594 140368 140904 142340 144833 148104 151206
54208 151206 153219 153945 153700 152809 151601 150458 149452 148279 146901 145894 145713 145899 145557 144438 143107 142213
54192 142213 141958 142136 142285 141904 140887 139680 138787 138318 138195 138436 138895 139141 139050 139143 139754 140232 139732 138535
54174 138535 137758 137808 138034 137976 138043 138582 139082 138883 138141 137526 137346 137484 137880 138514 139063 139091 138574 137842 137061 136142
54154 136142 135200 134672 134826 135376 135826 136046 136368 137129 138223 139157 139532 139435 139299 139369 139409 139090 138607 138665 139737
54135 139737 141483 143054 143896 144084 143942 143640 143252 142874 142467 141776 140708 139663 139187 139358 139839 140505 141638
54118 141638 143424 145562 147532 149045 150133 151005 151921 153038 154272 155382 156138 156275 155492 153905 152318
54103 152318 151502 151255 150759 149909 149494 149819 150022 149306 148185 147756 148211 148800 148971 148798 148528 148460 149142 150868
54085 150868 152973 154319 154587 154528 154892 155742 156885 158285 159798 161060 161946 162732 163611 164499 165507 167124
54069 167124 169699 173157 177500 183129 190288 198546 207152 215656 223886 231585 238305 243380 245857 244983
54055 244983 241162 235998 230861 225745 220125 214499 210154 207461 205409 203162 201271 200759 201611 202952 204449
54040 204449 206667 209982 213856 217515 220832 224187 227867 232025 236966 242843 249164 255014 259851 263782
54026 263782 267139 270192 273206 276214 278663 279887 280111 280286 280621 279988 277463 273855 270870 269031 267355
54011 267355 264933 261864 258479 254586 249980 245054 240386 236096 232023 228163 224549 221030 217579 214576
53997 214576 212337 210551 208608 206369 204162 202083 199798 197177 194743 193252 192986 193650 194854 196483 198591
53982 198591 201142 203930 206693 209185 211195 212717 214076 215703 217604 219252 220232 220777 221305 221495 220347
53967 220347 217388 213480 210097 207954 206625 205372 203959 202577 201325 200110 198976 198195 197909 197905 197959 198280
53951 198280 199277 200888 202486 203613 204530 205773 207429 209216 211132 213595 216893 220851 225111 229474 233814
53936 233814 237962 241900 245951 250537 255744 261218 266522 271535 276510 281768 287371 293178 299174 305587
53922 305587 312634 320280 328366 336910 346271 357148 370403 386583 405424 425886 446571 465821
53910 465821 481480 491421 494905 493191 488332 481510 472856 462488 451091 439545 428529 418456 409324
53897 409324 400687 392132 383740 375710 367825 359788 351893 344632 337747 330386 322297 314121 306443 299236
53883 299236 292355 285851 279606 273405 267668 263263 260182 257145 253096 248401 243934 239633 234887 229901
53869 229901 225692 222739 220458 218124 215719 213701 212328 211387 210351 208788 206798 204976 203734 202783 201526
53854 201526 199807 198043 196728 196068 195937 195949 195715 195239 194874 194649 193996 192526 190794 189818 189945 190585 190945
53837 190945 190618 189591 188215 187213 187217 188160 189381 190373 191152 191912 192689 193487 194398 195465 196513 197242 197390
53820 197390 196884 196048 195550 195908 196988 198196 199093 199631 199913 200119 200697 202240 204937 208313 211693 214894
53804 214894 218421 222995 228890 235670 242535 248956 254964 260944 267271 274038 280740 286218 289379 290288
53790 290288 290234 290460 291146 291844 292438 293130 293763 293819 293004 291348 288843 285515 281807 278270 274812 270804 265999
53773 265999 260787 255469 249882 244073 238749 234593 231443 228642 225918 223470 221294 218938 216105 213171
53759 213171 210868 209453 208299 206431 203480 200043 197061 195056 194087 194139 195071 196260 196809 196345 195278 194121
53743 194121 192912 191520 190182 189371 189318 189960 191244 193080 195048 196505 197193 197590 198472 200139 202170 203961
53727 203961 205431 207018 209031 211179 212927 214130 215050 215803 216118 215777 215048 214507 214550 215203 216291 217623
53711 217623 219040 220443 221813 223207 224722 226421 228213 229893 231397 233048 235356 238504 242058 245267
53697 245267 247660 249421 251202 253506 256176 258624 260590 262474 264718 267079 268878 269884 270471 270833 270516
53682 270516 269070 266945 265351 265183 266228 267433 267822 267174 265949 264717 263744 263056 262668 262537 262401 261929
53666 261929 261095 260273 259872 259964 260275 260430 260188 259515 258502 257266 256022 255184 255102 255468 255284 253771 251251 248827
53648 248827 247299 246726 246955 247977 249667 251619 253491 255199 256580 257281 257299 257308 258051 259558 261324 263079
53632 263079 265000 267209 269489 271524 273145 274306 275093 275905 277345 279704 282681 285763 288811 292028 295433
53617 295433 298613 301205 303440 305972 309132 312615 315989 319304 322987 327263 331939 336713 341463 346203
53603 346203 351016 356074 361528 367233 372710 377512 381555 385055 388225 391009 393045 393845 393166 391247 388594
53588 388594 385539 382160 378592 375119 371850 368521 364880 361122 357779 355138 352923 350544 347683 344628
53574 344628 342056 340429 339563 338833 337721 336117 334173 332110 330236 328946 328616 329467 331425 333927 336034
53559 336034 337135 337565 338184 339234 340075 340248 340294 341005 342160 342742 342431 342204 343112 344917 346530 347615 349118
53542 349118 351988 355844 359397 362027 364447 367665 371789 376198 380609 385446 391179 397756 404860 412403
53528 412403 420541 429383 438882 448929 459432 470360 481760 493658 505936 518484 531453 545124
53516 545124 559450 574009 588664 603993 620833 639415 659226 679624 700398 721685 743574
53505 743574 765953 788693 811837 835473 859332 882602 904368 924387 943310 962093 981248
53494 981248 1000685 1019984 1038642 1056247 1072772 1088764 1105040 1122083 1139801 1157832 1175946
53483 1175946 1194101 1212234 1230128 1247482 1264108 1280052 1295474 1310344 1324231 1336504 1346797
53472 1346797 1355215 1361970 1366835 1369116 1368230 1364171 1357310 1348003 1336742 1324510 1312405 1300651 1288430
53459 1288430 1274997 1260634 1246092 1231429 1215997 1199436 1182005 1163846 1144590 1124003 1102611
53448 1102611 1081356 1060925 1041635 1023606 1006649 990211 973887 958024 943597 931501 922022
53437 922022 914788 909038 904011 899323 895048 891458 888814 887375 887322 888543 890774 894077 898932 905651 913940
53422 913940 923286 933545 944856 957206 970437 984550 999688 1015977 1033680 1053323 1075135 1098404
53410 1098404 1121961 1145516 1170120 1196994 1226188 1256751 1288050 1320511 1355015 1391944 1431053
53399 1431053 1472122 1515364 1561088 1609110 1658716 1709160 1760080 1811442 1863226 1915286 1967449
53388 1967449 2019660 2071901 2123838 2174632 2223390 2269987 2315161 2359460 2402305 2442455 2479196
53377 2479196 2512486 2542059 2567186 2587644 2604224 2617716 2627770 2633329 2633815 2629256 2619364 2603193
53365 2603193 2579919 2549626 2513263 2472191 2427826 2381323 2333294 2283858 2233037 2181175 2129106
53354 2129106 2078066 2029145 1982534 1937427 1892956 1849149 1806675 1765763 1725793 1685985 1646119
53343 1646119 1606463 1567417 1529387 1492730 1457565 1423794 1391482 1361074 1333068 1307588 1284417
53332 1284417 1263332 1244286 1227281 1212225 1198851 1186663 1174943 1162931 1150163 1136684 1122968
53321 1122968 1109563 1096767 1084583 1072862 1061481 1050593 1040882 1033359 1028438 1025267 1022429 1019497
53309 1019497 1017450 1017318 1018975 1021685 1025293 1030122 1035986 1042264 1049053 1057465 1068391 1081576 1096278
53296 1096278 1112367 1130275 1150255 1172203 1195965 1221206 1247054 1272499 1297335 1322305 1348020
53285 1348020 1374005 1399068 1422400 1443969 1463900 1481902 1497453 1510298 1520549 1528354 1533687 1536339
53273 1536339 1535966 1532288 1525474 1516226 1505178 1492234 1476841 1458868 1438785 1416967 1393419 1368410
53261 1368410 1342747 1316904 1290408 1262749 1234578 1207145 1180677 1154128 1126707 1098936 1071931
53250 1071931 1046276 1021900 998466 975342 951683 927209 902732 879336 857093 835085 812642
53239 812642 790070 768099 747148 727394 709138 692626 677691 663954 651367 640237 630644 622118
53227 622118 613981 605815 597429 588645 579381 569842 560277 550506 539912 528020 514978 501474 488320
53214 488320 476019 464520 453375 442406 432141 423236 415475 407843 399773 391795 384676 378388 372434
53201 372434 366743 361547 356539 350843 343973 336340 328734 321654 315269 309618 304636 300198 296289 292948
53187 292948 290034 287215 284249 281137 278029 275183 272875 271143 269645 268023 266299 264655 263000 261141
53173 261141 259252 257699 256518 255548 255014 255335 256247 256779 256366 255394 254374 253203 251738 250506 250079 250011 249183
53156 249183 247223 244985 243476 242748 242095 240923 239167 237084 235007 233309 232343 232222 232683 233242 233545 233560
53140 233560 233434 233267 233039 232703 232282 231927 231909 232423 233298 234078 234595 235274 236627 238565 240521 242156 243599
53123 243599 244966 246048 246611 246736 246736 246940 247626 248907 250547 252046 252974 253129 252444 251066 249458 248056 246711
53106 246711 244863 242375 239807 237682 235836 233834 231728 230078 229319 229407 230005 230762 231465 232041 232436 232414 231668
53089 231668 230231 228674 227704 227534 227720 227595 226931 226185 225985 226308 226434 225956 225538 226152 227719 229149 229731
53072 229731 229865 230180 230527 230266 229148 227496 225770 224321 223375 222947 222839 222862 222896 222702 222048 221128 220457 220122
53054 220122 219608 218662 217871 217946 218815 219907 221048 222472 224105 225412 225997 225961 225611 225157 224730 224417 224135 223602
53036 223602 222491 220712 218697 217335 217312 218360 219492 220067 220268 220422 220454 220361 220674 221856 223556 225043 226126
53019 226126 227130 228143 228865 229096 228879 228301 227641 227558 228506 229986 230962 231042 230704 230362 229849 229020 228245 227940
53001 227940 227923 227635 226802 225696 224841 224589 224925 225608 226527 227725 228961 229567 229163 228319 228011 228468 229085 229519
52983 229519 230270 231963 234485 237161 239462 241272 242649 243624 244192 244389 244464 244973 246477 249037 252105 254956
52967 254956 257109 258380 258762 258360 257357 256061 255028 254858 255601 256447 256404 255281 253745 252476 251581 250815
52951 250815 249927 248623 246496 243376 239713 236489 234541 233812 233284 231970 230075 228835 229014 230000 230692 230737
52935 230737 230365 229513 227999 226302 225213 224759 224342 223969 224316 225307 225667 224495 222541 221220 220924 220949 220722
52918 220722 220357 220199 220427 221028 221771 222229 222198 221966 221897 221882 221449 220373 218993 218055 218277 219751 221700 223120
52900 223120 223797 224260 224642 224267 222787 221061 220239 220445 221090 222098 223901 226302 228327 229425 230149 231254
52884 231254 232662 233696 233960 233586 232823 231743 230323 228678 227180 226340 226418 227169 228152 229261 230709 232486
52868 232486 234192 235548 236818 238470 240584 242815 244805 246373 247358 247583 247108 246346 245701 245108 244101 242417
52852 242417 240360 238409 236569 234344 231364 227814 224178 220807 217909 215694 214203 213117 212065 211119
52838 211119 210633 210526 210146 209112 208082 208275 210189 213045 215539 216934 217320 217174 216946 216932 217092 216940 215946
52821 215946 214135 212040 209996 207865 205708 204266 204342 205926 208339 211030 213750 216157 217932 219327 220966
52806 220966 222861 224118 223946 222587 220982 219823 219193 218772 218037 216566 214479 212455 211015 209975 208851
52791 208851 207577 206482 205742 205249 204950 204924 205120 205347 205652 206458 208146 210536 212823 214151 214386 214310 214854
52774 214854 216072 217088 217122 216292 215216 214265 213520 213107 213007 212659 211380 209386 207916 208079 209747 211772
52758 211772 213067 213280 212632 211507 210310 209410 208957 208798 208742 208877 209397 210114 210496 210435 210678 212044 214367 216669
52740 216669 218387 219953 222009 224534 227009 229115 230955 232772 234666 236459 237753 238384 238871 240011 241791
52725 241791 243150 243178 242196 241189 240482 239522 237845 235667 233453 231367 229297 227125 224854 222670 220968
52710 220968 220154 220319 221173 222288 223329 224172 224872 225476 225847 225853 225720 225935 226659 227501 228008 228036 227550 226580 225709
52691 225709 226029 227970 230481 232029 232256 232026 231995 231939 231563 231138 230955 230709 229932 228733 227690 227114 226757 226221
52673 226221 225433 224637 224036 223562 223090 222814 223134 224058 224983 225368 225428 225864 226982 228428 229715 230660 231335 231917
52655 231917 232648 233714 235109 236780 238772 241019 243135 244676 245451 245308 243941 241413 238684 236924 236290
52640 236290 235907 235114 234118 233343 232805 232484 232706 233716 235189 236619 237992 239726 242097 244985 248030 250799
52624 250799 252878 254033 254243 253549 251951 249532 246586 243613 241192 239655 238674 237401 235428 233487 232708
52609 232708 233273 234306 235070 235600 236122 236585 237075 237978 239247 240077 239910 239353 239501 240579 241836 242597 242803
52592 242803 242574 241856 240712 239592 239105 239577 240810 242152 242870 242655 241841 241195 241551 243442 246597 249676
52576 249676 251013 250045 247783 245669 244342 243778 244055 245215 246608 247196 246632 245528 244534 243674 242757 241990
52560 241990 241761 242012 242195 241906 241388 241303 241963 242848 243086 242447 241616 241327 241546 241807 242048 242503 242862 242200 240123
52541 240123 237578 236072 236213 237291 238193 238387 237957 237087 235890 234751 234400 235345 237259 239215 240539 241258
52525 241258 241696 241955 241973 241867 241908 242186 242452 242318 241564 240376 239415 239469 240924 243621 247236 251559 256263 260692
52507 260692 264200 266588 267996 268524 268270 267569 266822 266022 264755 262750 260262 257822 255708 253687 251252
52492 251252 248191 244983 242514 241277 241002 241163 241586 242341 243294 244169 244968 245932 247089 248136 248880 249540 250555
52475 250555 252159 254138 255913 257000 257544 258214 259326 260334 260596 260536 261453 264099 267848 271446 274202 276261
52459 276261 278020 279614 280880 281562 281475 280503 278504 275431 271706 268228 265640 263680 261606 259203 256928
52444 256928 255103 253504 251939 250694 250086 249923 249771 249454 248975 248213 247058 245659 244228 242756 241301 240343
52428 240343 240452 241588 243143 244676 246282 248150 250044 251435 252015 251951 251665 251416 251170 250934 251145 252446
52412 252446 254998 258333 262105 266685 272676 280059 288311 297204 306866 316966 326394 333986 339133 341479
52398 341479 340611 336631 330667 324209 317976 311852 305784 300147 295172 290627 286343 282627 279855 278003
52384 278003 276901 276656 277404 278862 280534 282227 283992 285646 286869 287841 289302 291761 294981 298471 302159
52369 302159 306282 310814 315371 319621 323451 326734 329191 330636 331202 331172 330643 329532 327961 326484 325674
52354 325674 325470 325254 324728 324487 325381 327484 330092 332559 334674 336276 337212 337883 339193 341533 344267 346708
52338 346708 349204 352732 357702 363724 370376 377562 385183 393060 401277 410176 419958 430705 442777 456713
52324 456713 472540 489518 506714 523608 540247 557152 574980 593784 612595 630275 646811
52313 646811 663182 679884 696310 711884 727015 742386 757871 772801 787002 800879 814702
52302 814702 828313 841434 853827 865300 875924 886000 895357 902956 907745 909808 910045 908856 905809
52289 905809 900599 893586 885181 875419 864568 853624 843653 834907 827051 820114 814764 811652 810825 811869
52275 811869 814413 818356 823625 829886 836751 844400 853735 865446 878913 892402 904545 915373 925790
52262 925790 936474 947547 958924 970540 982316 994278 1006639 1019494 1032493 1045052 1056750
52251 1056750 1067303 1076329 1083535 1089011 1092902 1094801 1093949 1090206 1084393 1077483 1069776 1061100 1051437 1040949
52237 1040949 1029647 1017516 1004966 992826 981798 972080 963492 955729 948520 941772 935619 930145 925156
52224 925156 920519 916635 914130 912893 911891 910336 908732 908292 909456 911497 913621 915896 918883 922785
52210 922785 927379 932518 938217 944227 949941 954817 958729 961875 964584 967306 970515 974364 978491 982384
52196 982384 985928 989541 993832 999150 1005358 1011910 1018244 1024235 1030132 1035928 1040925 1044172 1045270 1044441
52182 1044441 1041939 1037818 1032318 1025931 1018801 1010505 1000908 990920 981832 974031 966936 960178 954228 949638
52168 949638 946265 943655 941810 941090 941565 942895 944749 946991 949540 952418 955848 959896 963979 967099 968683
52153 968683 968947 968420 967453 966308 965350 964866 964875 965318 966266 967744 969489 971065 972117 972436 971986 971102 970403 970218
52135 970218 970258 970224 970610 972404 975980 980795 986448 993629 1003623 1017030 1033335 1051676 1071677 1093440
52121 1093440 1116999 1141977 1167728 1193701 1219644 1245432 1270774 1295201 1318445 1340697 1362273
52110 1362273 1383000 1402084 1418630 1432238 1443161 1452055 1459646 1466430 1472449 1477374 1480941 1483374 1485377
52097 1485377 1487590 1489887 1491166 1490027 1485803 1478844 1469616 1457823 1442844 1424995 1405795 1386775 1368489
52084 1368489 1350942 1334471 1319665 1306732 1295574 1286397 1279683 1275580 1273870 1274601 1278130 1284327 1292212
52071 1292212 1300819 1310092 1320632 1332759 1346112 1359998 1373875 1387564 1401208 1414952 1428633 1441894
52059 1441894 1454520 1466351 1476951 1485899 1493566 1500982 1508532 1515271 1519979 1522362 1522559 1519969 1513525
52046 1513525 1503112 1489809 1474600 1457638 1439067 1419803 1400904 1382579 1364341 1345933 1327700
52035 1327700 1310227 1293951 1278992 1265068 1251714 1238839 1226897 1216186 1206114 1195492 1183590
52024 1183590 1170618 1157211 1143775 1130499 1117718 1105920 1095276 1085278 1075043 1064147 1053127
52013 1053127 1043040 1034471 1027043 1019931 1012615 1004979 996819 987569 976699 964271 950907 937125 922761
52000 922761 907262 890563 873485 857118 841958 827875 814732 802652 791668 781545 772106 763363
51988 763363 755126 746771 737746 728108 718224 708093 697378 686031 674432 662751 650528 637232
51976 637232 623076 608990 595790 583637 572359 562078 553348 546750 542534 540628 540829 542907 546637
51963 546637 551869 558469 566115 574216 582123 589401 595762 600787 603839 604331 602008 597038 589932 581468
51949 581468 572630 564470 557817 552982 549791 548074 548039 549988 553717 558594 564390 571689 581165 592638
51935 592638 605053 617195 628197 637648 645522 651797 655812 656342 652750 645865 637166 627265 615778
51922 615778 602559 588321 573984 560140 547304 535988 526162 517285 509249 502786 498527 496197 495248
51909 495248 495944 499290 506102 516535 530214 546267 563297 579688 593977 604941 611827 614802 614764
51896 614764 612224 606676 597462 584956 570313 554395 537576 520440 503914 488667 474935 463018
51884 463018 453426 446377 441585 438691 437584 438300 440957 445810 452937 461761 471247 480668 489845 498630
51870 498630 506514 512882 517310 519539 519460 517303 513528 508415 502036 494706 487225 480548 475376 472033 470351
51855 470351 469686 469438 469738 471256 474150 477511 480035 480947 480155 477869 474424 470214 465491 460300 454737
51840 454737 449090 443559 438107 432818 428195 424831 422916 422182 422183 422405 422404 422190 422338 423329 424781 425684 425444
51823 425444 424333 422818 420836 418065 414688 411414 408720 406496 404691 403930 404993 407709 410906 413605
51809 413605 415841 418060 420126 421367 421360 420209 418192 415610 412916 410508 408323 406093 404061 402975 403148
51794 403148 403864 404000 402988 400996 398406 395462 392350 389440 387347 386583 386990 387625 387571 386843 386210 386133 386314
51777 386314 386346 386260 386224 386143 385995 386280 387722 390642 394958 400669 408030 417229 428065 439912 451861 462946
51761 462946 472345 479433 483722 484982 483430 479630 474147 467489 460240 452856 445319 437429 429588 422778
51747 422778 417513 413265 409267 405519 402572 400698 399709 399442 399970 401488 404380 409219 416201 424569 432886
51732 432886 439922 445121 448496 450433 451486 451965 451792 451012 450204 449899 449745 448766 446471 443215 439464 435313
51716 435313 430911 426835 423644 421271 419165 416873 414292 411568 409088 407510 407481 409173 412086 415456 418868
51701 418868 422450 426372 430206 433010 434134 433775 432667 431515 430897 431347 433015 435307 437169 437770 436744
51686 436744 434047 429989 425354 421009 417264 413811 410266 406517 402679 399143 396613 395632 396022 397181 398937
51671 398937 401612 405192 409052 412768 416638 421031 425659 429969 433877 437581 440824 442878 443248 442029
51657 442029 439685 436904 434655 433877 434933 437632 441903 448123 456483 466126 475130 481442 483894 482518
51643 482518 478094 471508 463486 454695 445782 437105 428575 419964 411355 403158 395736 389225 383765 379627
51629 379627 376890 375099 373557 372017 370925 370858 371819 373221 374422 375027 374751 373354 370946 368154 365665
51614 365665 363627 361677 359570 357577 356226 355778 356033 356601 357365 358664 360949 364194 367798 371284 374994
51599 374994 379817 386224 393797 401834 410199 419317 429357 439532 448256 453908 455568 453257 447857 440901
51585 440901 434081 428464 424037 420290 417271 415743 416265 418675 422823 429324 438942 451433 465549 480141
51571 480141 494770 509379 523987 538818 554109 569621 584758 599376 614182 630352 649264
51560 649264 672591 701810 737102 777193 820514 865980 912181 956539 996089 1028906 1054203
51549 1054203 1071309 1079310 1077627 1066316 1045827 1017087 981903 942614 901047 858019 813989 769829
51537 769829 726892 686664 650363 618467 590467 565430 542952 523351 506866 493113 481435
51526 481435 471344 462349 453863 445715 438504 432922 428829 425378 421945 418542 415350 412385 409768 407887
51512 407887 406978 406744 406739 406976 407818 409272 410740 411617 411900 411973 411935 411408 410025 407906 405557 403418 401557 399741
51494 399741 397792 395913 394576 393934 393470 392490 390978 389620 388946 388760 388561 388075 387033 384884 381283 376763
51478 376763 372381 368649 365266 361873 358514 355153 351303 346591 341471 336921 333505 331015 328969 327169
51464 327169 325737 324815 324364 324194 324167 324392 325220 326895 329161 331319 332789 333693 334854 337174 340949 345803
51448 345803 351248 357275 364398 373275 384274 397214 411374 425809 439803 452851 464188 472649
51436 472649 477453 479050 478814 477774 475919 472713 467869 461428 453457 444052 433558 422573 411794 401914
51422 401914 393511 386792 381497 377148 373404 370235 367911 366816 366995 367833 368551 369171 370633 373599 377491
51407 377491 381122 384087 387065 390810 395279 399731 403301 405482 406475 407194 408578 410803 413480 416551 420431
51392 420431 425126 429822 433855 437703 442513 448949 457115 467433 480905 498379 520142 546480 578134
51379 578134 615847 659733 709414 764461 824159 886938 950406 1011979 1069128 1119179 1159551
51368 1159551 1188633 1206234 1212816 1208446 1192788 1166038 1129434 1084802 1033967 978833 921709 865033
51356 865033 810593 759151 710908 666177 625572 589652 558608 532233 510057 491432 475638
51345 475638 462041 450138 439441 429535 420410 412618 406744 402618 399314 396067 392929 390272 387935
51332 387935 385295 382132 378913 376026 373108 369472 365038 360506 356682 353828 351698 349979 348562 347464
51318 347464 346617 345809 344949 344321 344416 345421 346998 348642 350160 351631 353088 354424 355610 356838 358456 360839
51302 360839 364204 368355 372642 376317 378919 380252 380186 378765 376394 373611 370615 367273 363552 359702 355963
51287 355963 352457 349468 347485 346799 347321 348909 351584 355163 358999 362380 365071 367246 369093 370710 372110
51272 372110 373016 372954 371970 371001 371011 371949 373144 374519 376571 379072 380799 381087 380794 380980 381190 380021 377149
51255 377149 373750 370908 368533 366194 364122 362694 361484 359653 357147 354830 353405 352704 352246 351997 352298
51240 352298 353337 355012 357165 359594 361795 362985 362574 360597 357649 354436 351464 349052 347420 346597 346280
51225 346280 345950 345286 344451 343900 343923 344432 345195 346150 347384 348832 350154 351040 351609 352415 353954 356195 358675
51208 358675 361037 363396 366178 369729 374085 378955 383726 387667 390387 392147 393480 394480 394656 393602
51194 393602 391540 389008 386288 383433 380714 378569 377074 375809 374475 373314 372721 372621 372533 372173 371711 371415
51178 371415 371279 371075 370660 370158 369859 369937 370286 370662 370968 371234 371338 371059 370597 370721 371987 374012 375937 377521
51160 377521 379229 381215 382859 383568 383508 383057 382020 380030 377504 375488 374483 374024 373561 373277 373670 374678
51144 374678 375622 375955 375731 375353 375046 374659 373883 372644 371241 370079 369269 368577 367820 367192 367069 367505 368010 367906
51126 367906 366977 365708 364811 364549 364745 365442 367113 369873 372794 374610 375115 375402 376624 378968 381926 385004
51110 385004 387808 389941 391380 392777 394923 397976 401541 405299 409151 412862 416078 418721 420879 422254
51096 422254 422228 420738 418699 417189 416425 415834 415025 414319 414244 414706 414884 414043 412360 410772 409952 409647 409168 408256
51078 408256 407155 406043 404907 403955 403655 404213 405404 407066 409285 411909 414359 416371 418582 421925 426703
51063 426703 432683 439907 448831 459639 471818 484462 496722 507970 517933 526771 534900 542838 551472
51050 551472 562152 575810 591823 608229 623330 636772 648916 659614 668018 673270 674974 673169
51038 673169 668272 661104 652721 644056 635579 626972 617067 604541 589144 572179 555466 539965 525642
51025 525642 512444 500858 491426 484160 478693 474796 472555 472144 473583 476674 481112 486668 493226 500584
51011 500584 508359 516239 524309 532888 542138 551965 562249 572878 583567 593978 604121 614435 625312
50998 625312 636709 648230 659458 670154 680423 690687 701262 711810 721439 729461 735862 741066
50986 741066 745567 749943 754755 760145 765776 771418 777239 783270 789042 794241 799396 805325 812192 819858
50972 819858 829062 841390 857888 878448 902859 931716 965723 1004593 1047333 1093385 1142876 1195851
50960 1195851 1251743 1309644 1368651 1427929 1486757 1544528 1600448 1653223 1701377 1743906 1780429
50949 1780429 1810855 1835340 1854663 1870158 1883026 1893876 1903013 1910804 1917483 1922815 1926223 1927129 1925035
50936 1925035 1919581 1910933 1899981 1887731 1874326 1858891 1840412 1818591 1793768 1766221 1735746 1701818
50924 1701818 1664046 1622439 1577392 1529544 1479705 1428780 1377522 1326289 1275309 1225388 1178138
50913 1178138 1135048 1096289 1060859 1028045 998264 972125 949055 927527 906642 886946 869505
50902 869505 854611 841678 830033 819373 809561 800436 791935 784256 777768 772810 769448 767303 765707
50889 765707 764181 762726 761560 760795 760593 761372 763339 765945 768362 770603 773588 777874 782894 787910 793162
50874 793162 799424 806711 814321 822146 831141 842175 854965 868577 882607 897486 913939 932556
50862 932556 953716 977459 1003515 1031793 1062900 1097951 1137876 1183117 1233886 1290467 1353307
50851 1353307 1423113 1500801 1586962 1681309 1782983 1891502 2007028 2129492 2257785 2390149
50841 2390149 2525064 2661236 2796714 2928428 3052807 3166660 3267524 3353592 3423738 3477549
50831 3477549 3515138 3536948 3543957 3538079 3522147 3499335 3472577 3444503 3417695 3394663 3377408 3366985
50819 3366985 3363383 3365537 3371175 3376853 3378682 3373485 3359372 3335161 3299446 3250448 3186835 3108512
50807 3108512 3016651 2913175 2800406 2681021 2557988 2434201 2311980 2192910 2078323 1969962
50797 1969962 1869978 1779985 1700213 1629838 1568134 1514979 1470307 1433670 1404640 1383158 1368849
50786 1368849 1360241 1355276 1352591 1351732 1352074 1352357 1351669 1350337 1349088 1347604 1344544 1339027 1331555 1323277 1314743
50771 1314743 1305532 1294778 1281801 1266433 1249048 1230266 1210467 1189649 1167775 1145149 1122321
50760 1122321 1099778 1077907 1057173 1038154 1021373 1007133 995397 985738 977587 970819 966077 964203
50748 964203 965316 968712 973797 980838 990583 1003397 1019153 1037933 1060401 1087371 1119242 1156045
50736 1156045 1197789 1244502 1296034 1352063 1412305 1476499 1544117 1614267 1685993 1758585 1831516
50725 1831516 1904149 1975601 2044945 2111439 2174438 2232928 2285116 2328635 2361402 2382385 2391604
50714 2391604 2389568 2377026 2355244 2326305 2292896 2257857 2223900 2193433 2168233 2149158 2136242
50703 2136242 2129115 2127311 2130166 2136483 2144322 2151165 2154477 2152228 2142917 2125222 2097963 2060664 2013991
50690 2013991 1959476 1898889 1834133 1767517 1701587 1638396 1579095 1524362 1475003 1431928 1395718
50679 1395718 1366493 1344230 1329020 1321024 1320292 1326656 1339714 1358907 1383682 1413456 1447302 1483733
50667 1483733 1520971 1557494 1592245 1624420 1653332 1678616 1700423 1719221 1735536 1750043 1763749
50656 1763749 1777680 1792189 1806669 1820156 1832251 1843438 1854577 1866144 1877987 1889794 1901884
50645 1901884 1915570 1932617 1954219 1980416 2010449 2043478 2078898 2116228 2155084 2195223 2236271
50634 2236271 2277283 2316954 2354587 2390740 2426627 2462889 2499020 2533751 2565433 2591821 2609773
50623 2609773 2615667 2606522 2581155 2540798 2488961 2430643 2371184 2315179 2265830 2224818 2192605 2168928
50611 2168928 2153165 2144399 2141365 2142519 2146250 2150931 2154724 2155485 2151031 2139587 2120014 2091698 2054457
50598 2054457 2008696 1955628 1897170 1835479 1772499 1709788 1648533 1589577 1533492 1480786 1432061
50587 1432061 1387782 1347931 1312006 1279450 1249987 1223509 1199841 1178667 1159592 1142191 1126197
50576 1126197 1111795 1099569 1089974 1082896 1077899 1074791 1073785 1075165 1078945 1084807 1092205 1100650 1110118
50563 1110118 1121163 1134478 1150398 1169035 1190677 1215634 1243658 1273971 1306024 1339930 1375892
50552 1375892 1413447 1451552 1489284 1526209 1562153 1596869 1629949 1661011 1690043 1717733 1745389
50541 1745389 1774430 1805950 1840784 1879726 1923394 1971921 2025021 2082514 2144661 2212036 2285181
50530 2285181 2364421 2449880 2541526 2639204 2742615 2851131 2963589 3078319 3193523 3307679
50520 3307679 3419469 3527206 3628340 3719686 3798210 3861597 3908212 3936896 3947038 3938641 3911970
50509 3911970 3867178 3804615 3725594 3632677 3529226 3418833 3305160 3191980 3083123 2982368
50499 2982368 2893201 2818298 2759150 2716446 2690720 2682239 2690189 2712504 2746607 2789728 2838052 2886104
50487 2886104 2927756 2957840 2972562 2968902 2944566 2898754 2832506 2748255 2649428 2540326 2425515
50476 2425515 2308768 2192645 2079080 1969932 1866848 1771004 1683178 1603642 1531765 1466206
50466 1466206 1405926 1350902 1301648 1258370 1220833 1188672 1161408 1138429 1119436 1104734 1094638
50455 1094638 1088680 1085834 1085413 1087262 1091120 1096320 1102199 1108332 1114313 1119874 1125453 1132084 1140266 1149314
50441 1149314 1158294 1167215 1176668 1186498 1195595 1203186 1209699 1216024 1222382 1228460 1234430 1241265 1249908 1260458
50427 1260458 1272347 1285137 1298951 1314235 1331363 1350537 1371981 1395998 1422745 1452038 1483617
50416 1483617 1517655 1554792 1595526 1639701 1686808 1736704 1789696 1845829 1904294 1963667 2022584
50405 2022584 2080107 2135618 2188540 2238055 2282924 2321657 2353016 2376293 2391017 2396533 2392120 2377399
50393 2377399 2352334 2316847 2270910 2215255 2151768 2082920 2011013 1938186 1866831 1799425 1737825
50382 1737825 1683128 1636322 1598640 1570918 1552918 1543796 1543086 1550679 1565684 1585801 1608051 1629735
50370 1629735 1648407 1661451 1666508 1662401 1649199 1627248 1596651 1557901 1512590 1463041 1411360 1359059
50358 1359059 1307300 1256951 1208364 1161430 1116096 1072692 1031764 993724 958745 926890 898301
50347 898301 873241 851904 834105 819247 806753 796442 788410 782669 779234 778509 781201 787621 797308
50334 797308 809498 823766 839924 857380 874909 891060 904521 914078 918649 917873 912732 905293 897615
50321 897615 890889 885534 881723 879504 878518 878054 877523 876769 875932 875251 875022 875449 876377 877439 878600 880258
50305 880258 882594 885162 887498 889832 892711 896067 899292 902293 905879 910809 916868 923269 929694 936549
50291 936549 944292 952858 961809 970841 980044 989770 1000353 1011970 1024627 1037928 1050611 1060527 1065584
50278 1065584 1064998 1059569 1050860 1040475 1030056 1021276 1015198 1011694 1009805 1008645 1007834 1007258 1006764 1006099 1004945
50263 1004945 1003089 1000677 998163 995822 993425 990606 987464 984542 982298 980788 979759 978866 978001 977761 979495
50248 979495 984436 992733 1003611 1016519 1031741 1049857 1071031 1095018 1121533 1150320 1180978 1212863
50236 1212863 1244969 1275873 1304134 1329105 1351245 1371495 1390420 1407929 1423428 1435953 1444386
50225 1444386 1447847 1445760 1437435 1422019 1399274 1370191 1336366 1299005 1259053 1218106 1178410 1141772
50213 1141772 1108967 1080305 1056136 1036333 1019739 1004569 989206 972395 953178 931250 907326
50202 907326 882773 858864 836483 816205 798174 782016 767269 753857 741851 731023 721111 712311
50190 712311 704903 698384 691613 684002 676065 668673 662260 656915 652650 649221 646104 643068 640383 638162
50176 638162 635887 633052 629980 627484 625925 625046 624578 624515 624860 625492 626272 627061 627841 629095 631810 636589
50160 636589 642877 649545 656134 663146 671253 680754 691682 703858 716725 729625 742261 754452 765475
50147 765475 774286 780543 784847 787845 789667 790445 790796 791422 792707 794955 798530 803502 809656 817262 827342
50132 827342 840812 857776 878044 901805 929242 960066 994084 1031854 1074053 1120378 1169754
50121 1169754 1221333 1274574 1328515 1381856 1433933 1484983 1535351 1584991 1633809 1681801 1728524
50110 1728524 1772743 1812633 1845900 1869793 1881817 1880848 1867213 1841596 1804499 1756996 1701346 1640318
50098 1640318 1576177 1510669 1445493 1382310 1322549 1267531 1218387 1175411 1137818 1104648 1075679
50087 1075679 1051051 1030332 1012648 997534 984964 974600 965732 958072 951977 947566 944199 941112
50075 941112 938159 935574 933392 931444 929583 927509 924643 920585 915499 909673 902976 895266 887125 879491
50061 879491 872448 865046 856576 847539 838993 831423 824680 818706 813692 809645 806336 803766 802274 802121
50047 802121 803331 806029 810511 816747 824105 831830 839716 848089 857215 866926 876765 886479 896329 906823
50033 906823 918003 929099 939153 947887 955666 962706 968864 974242 979324 984133 987806 989478 989245 987740
50019 987740 985112 981066 975706 969672 963545 957762 953036 950100 948819 948333 948545 951039 957979 970281
50005 970281 987146 1007142 1029519 1054671 1083663 1117096 1154167 1192888 1231442 1269199 1306303
49994 1306303 1342594 1377321 1409710 1439310 1465569 1487311 1502813 1510388 1508804 1497256 1475200 1442590
49982 1442590 1400421 1350807 1296259 1238946 1180773 1123783 1069782 1019554 973041 930485 892796
49971 892796 860485 832821 808616 787389 769192 753601 739653 726783 715214 705317 697053 690178
49959 690178 684622 680554 678374 678676 681851 687648 695476 705145 716848 730269 744186 757312 769192
49946 769192 779982 789703 798158 805357 811490 816413 819538 820331 818706 814852 808840 800486 789441 775386
49932 775386 758280 738568 717226 695616 675199 657074 641530 628111 616355 606434 598867 593647
49920 593647 589996 587128 584936 583758 583751 584810 586881 589867 593177 595884 597680 599429 602508 607627 614474
49905 614474 622427 631377 641878 654688 670103 687466 705332 722304 737800 751851 764204 773986
49893 773986 780463 783834 784927 784201 781387 776110 768485 758920 747582 734418 719698 704235 688857
49880 688857 673801 658840 643915 629388 615608 602591 590342 579265 569913 562366 556215 551177
49868 551177 547416 545219 544636 545479 547414 549975 552893 556611 562095 569860 579481 590376 602687 616850
49854 616850 632522 648538 663966 678632 692495 705046 715677 724308 731257 736659 740327 742092
49842 742092 741942 739781 735284 728190 718762 707817 696157 683988 671144 658004 645850 635959 628461
49829 628461 622544 617734 614377 612716 612104 611718 611718 613177 616953 623179 631746 642629 655419 669063 682594
49814 682594 695985 709761 723770 736815 747830 757097 765772 774162 780984 784641 784934 783025 779892
49801 779892 775393 768986 760736 751198 740700 729321 717420 705586 694015 682422 670754 659615
49789 659615 649735 641281 633921 627327 621349 615962 611351 607866 605477 603323 600276 596151 592051 589321
49775 589321 588431 589066 591015 594529 599905 607086 615726 625315 635124 644335 652496 659748 666468 672795 678621
49760 678621 683834 688297 691656 693450 693459 691722 688170 682498 674563 664748 653736 642038 629960 617968
49746 617968 606765 596825 588029 580001 572783 566957 562972 560516 558754 557153 555828 555119 555069 555481 556192
49731 556192 557069 557893 558594 559524 561193 563774 567193 571703 577927 586146 595952 606897 619118 632879
49717 632879 647651 662124 675118 686123 694966 701389 705185 706459 705563 702881 698728 693292 686590
49704 686590 678683 670013 661330 653147 645500 638347 631920 626502 622034 618190 614688 611345 608024 604840
49690 604840 602310 601006 601158 602796 606092 611146 617575 624838 632898 642101 652409 663374 675105 688512
49676 688512 704095 721029 738071 754930 771894 788216 801821 810964 815617 817012 816350 814386 811835
49663 811835 809601 808560 809273 811663 814657 816339 814849 809180 799087 784658 766472 746009 725238
49650 725238 705584 687507 671019 656109 642543 629848 617986 607814 600414 596014 593904 593318
49638 593318 593982 595695 597777 599296 599736 599217 598073 596376 593877 590272 585510 579993 574485 569639 565428
49623 565428 561113 555997 550251 544832 540544 537343 534647 532157 530145 529040 528929 529491 530267 530949 531530
49608 531530 532208 533076 533958 534709 535569 536973 538945 540935 542405 543307 543880 544191 544220 544193 544480 545118 545707 545910
49590 545910 545872 546125 547167 549161 551828 554600 556941 558659 559916 560996 562142 563463 564783 565670 565951
49575 565951 566194 567296 569486 572126 574757 578016 583105 590498 599570 609452 619892 631228 643773 657244
49561 657244 670520 681961 690311 695530 698569 700250 700575 699152 695955 691351 685682 679261 672738 667049
49547 667049 662748 659608 657036 654796 653106 652063 651199 649823 647758 645566 643957 643074 642540 642140 642236 643448
49531 643448 646156 650511 656749 665190 675878 688387 702169 717013 733038 750161 767617 784129
49519 784129 798605 810577 819969 826711 830937 833495 835783 838801 842585 846769 851447 857077 863610 870063
49505 870063 875039 877408 876501 872028 864084 853162 839981 825381 810367 796000 782938 771101 760032
49492 760032 749607 740189 731993 724570 717246 709965 703461 698499 695252 693546 693295 694262 695652 696591 697096
49477 697096 698061 700066 702696 705298 707834 710492 712886 714390 715175 716171 717968 720303 722709 725080 727421
49462 727421 729574 731529 733545 735555 736812 736559 734897 732597 730167 727446 724030 719764 714846 709685
49448 709685 704672 699924 695292 690744 686616 683214 680251 677010 673190 669382 666547 665138 664866 665323 666621
49433 666621 669274 673519 679018 685339 692503 700767 710127 720484 732249 746159 762252 779452 796502
49420 796502 812874 828307 841748 851449 856195 856151 852552 847060 841472 837495 836263 838053 842600 849652
49406 849652 859149 870987 884736 899608 914666 929164 942809 955834 968789 982135 995811 1009238
49394 1009238 1021920 1033985 1045805 1057026 1066429 1073036 1076985 1078902 1078710 1075680 1069599 1061273 1051684
49381 1051684 1041056 1029039 1015595 1001436 987755 975644 965556 957121 949598 942712 937102 933873
49369 933873 933689 936274 940650 945785 951053 956179 960844 964481 966527 966734 965111 961658 956300 949043 940049
49354 940049 929710 918784 908364 899372 892040 885985 880793 876374 872928 870828 870457 871734 873716 874994
49340 874994 874693 872904 870130 866651 862544 857960 853020 847668 841934 836275 831317 827282 823909 821012
49326 821012 818809 817619 817466 818267 820289 824055 829642 836262 842774 848527 853551 858105 862375 866655 871396
49311 871396 876877 883043 889778 897105 904972 913198 921947 931938 943814 957463 972251 987707 1003609
49298 1003609 1019662 1035519 1050908 1065085 1076330 1082696 1083515 1079736 1072753 1063442 1052381 1040290
49286 1040290 1027846 1015492 1003722 993099 983609 974373 964478 953926 943551 934354 927177 922568
49274 922568 920400 919784 919873 920722 923027 927146 932753 939370 946757 954665 962538 969617 975264 979241 981895
49259 981895 984055 986541 989733 993749 998929 1005886 1015039 1026264 1038999 1052476 1065726 1077451 1086065
49246 1086065 1090023 1088376 1081159 1069273 1053961 1036454 1017934 999436 981529 964356 948246 934110
49234 934110 922918 914816 909098 905133 903088 903591 906815 912067 918353 925217 932858 941419 950392 959035
49220 959035 967296 975915 985480 995565 1004931 1012495 1018156 1022938 1028331 1035156 1042913 1050505 1057596 1064913
49206 1064913 1073177 1082363 1092317 1103449 1116194 1130146 1144382 1158490 1172660 1186845 1200559 1213562
49194 1213562 1226149 1238484 1250110 1260433 1269370 1277248 1284306 1290572 1296114 1301119 1305772 1310217 1314687
49181 1314687 1319547 1325311 1332690 1342616 1356025 1373503 1395181 1421053 1451319 1486190 1525230 1567074
49169 1567074 1609900 1651865 1690733 1723457 1747006 1760026 1763524 1759958 1752177 1743214 1735991 1732239
49157 1732239 1731745 1733145 1735275 1737536 1739451 1740581 1740811 1740235 1738941 1737423 1736942 1738778 1743094 1749085 1756177
49142 1756177 1764422 1773712 1783387 1792989 1802855 1813577 1825242 1837559 1850437 1864046 1878453 1893455
49130 1893455 1908746 1924090 1939408 1954778 1970295 1985955 2001695 2017453 2033051 2048261 2063165
49119 2063165 2078228 2093697 2109248 2124752 2141123 2159831 2181671 2206794 2235996 2271117 2313805
49108 2313805 2364428 2422587 2488197 2561429 2641575 2726029 2810395 2890131 2962962 3029613 3090881
49097 3090881 3143246 3178275 3187757 3169956 3130907 3079909 3023715 2963897 2898468 2825843 2747868
49086 2747868 2669426 2595384 2528276 2468863 2417778 2375594 2341775 2314748 2293153 2276262 2263226
49075 2263226 2252741 2243762 2235900 2228815 2221780 2214187 2206106 2198014 2190287 2183138 2176722 2171026 2165900 2161324
49061 2161324 2157351 2153707 2149837 2145580 2141452 2138031 2135390 2133308 2131577 2129788 2127280 2123818 2120011 2116543
49047 2116543 2113295 2109860 2106707 2105040 2105465 2107622 2111348 2117397 2126456 2138013 2150838 2164135 2177504
49034 2177504 2190021 2200329 2207852 2213276 2217496 2220583 2222103 2222029 2220904 2219319 2217593 2215801 2213788 2211241
49020 2211241 2208058 2204562 2201216 2198294 2196079 2195104 2195775 2197855 2200746 2204188 2208261 2212815 2217491 2222442
49006 2222442 2228431 2235879 2244203 2252461 2260347 2268070 2275532 2282224 2287994 2293343 2298685 2303605 2307236 2309224
48992 2309224 2309928 2309645 2308063 2304812 2300312 2295535 2290896 2285863 2279970 2273790 2268388 2264025 2260001 2255844
48978 2255844 2252088 2249625 2248652 2248603 2248889 2249272 2249539 2249234 2248022 2246234 2244736 2244071 2243873 2243411 2242571 2241857 2241418
48961 2241418 2240750 2239762 2239562 2241382 2244997 2249048 2252877 2257296 2263390 2271371 2280930 2292039 2304833 2319184
48947 2319184 2334958 2352376 2371574 2391940 2412342 2432034 2451178 2470673 2491748 2515459 2542178
48936 2542178 2571529 2603042 2636784 2673203 2712512 2754466 2798625 2844582 2891990 2940557 2990072
48925 2990072 3040462 3092008 3145420 3201288 3259272 3318150 3376855 3435145 3493043 3550068 3605463
48914 3605463 3658941 3710696 3760798 3808944 3854830 3898448 3939973 3979556 4017214 4052863 4086524
48903 4086524 4118539 4149300 4178703 4206227 4231712 4255709 4278814 4300996 4321922 4341508 4359734
48892 4359734 4376186 4390272 4401730 4410556 4416630 4419828 4420192 4417549 4411199 4400629 4386451 4370008 4352050
48879 4352050 4332270 4310119 4285509 4258548 4228998 4196239 4159595 4118741 4074024 4026293 3976131
48868 3976131 3923396 3867865 3810183 3751770 3693919 3637391 3582657 3529966 3479217 3430334 3383740
48857 3383740 3339948 3298829 3259895 3223284 3189727 3159444 3131803 3106268 3082984 3062224 3043981
48846 3043981 3028484 3016446 3008279 3003490 3001255 3001123 3002858 3006164 3011048 3017969 3027080 3037758 3049416
48833 3049416 3062384 3077337 3094147 3112013 3130484 3149641 3169343 3189013 3208299 3227434 3246806
48822 3246806 3266602 3286961 3308032 3329739 3351862 3374421 3397594 3421074 3443947 3465504 3485988
48811 3485988 3506328 3527282 3549047 3571504 3594532 3618032 3641811 3665622 3689405 3713584 3738997
48800 3738997 3766304 3795374 3825315 3855203 3884685 3913857 3942678 3970628 3996893 4020820 4042251
48789 4042251 4061586 4079506 4096482 4112361 4126396 4137747 4145940 4150778 4151824 4148216 4139125 4124318
48777 4124318 4104142 4079134 4049903 4017302 3982324 3945631 3907300 3867085 3824710 3779907 3732536
48766 3732536 3682999 3632420 3582076 3532558 3483604 3434767 3386141 3338425 3292368 3248318 3206342
48755 3206342 3166675 3129865 3096335 3066000 3038432 3013245 2990116 2968582 2948257 2929258 2912013
48744 2912013 2896560 2882466 2869719 2859299 2852397 2849157 2848592 2849645 2851909 2855210 2858871 2861745 2862920
48731 2862920 2862267 2860365 2858038 2855981 2854627 2854108 2854197 2854422 2854455 2854494 2855074 2856417 2858055 2859223 2859528 2859143 2858418
48714 2858418 2857453 2856025 2853833 2850854 2847559 2844773 2843171 2842873 2843500 2844618 2846006 2847553 2849099 2850540 2852061
48699 2852061 2854138 2857194 2861300 2866222 2871707 2877673 2884130 2891038 2898177 2905093 2911141 2915794 2919026 2921353
48685 2921353 2923457 2925745 2928219 2930640 2932808 2934869 2937288 2940290 2943228 2944809 2944058 2940874 2935534 2928098
48671 2928098 2918594 2907454 2895204 2881790 2866623 2849426 2830786 2811822 2793345 2775221 2756366
48660 2756366 2735573 2712584 2688202 2663099 2636794 2608141 2576633 2542834 2507853 2472946 2439483
48649 2439483 2408534 2380362 2354732 2331659 2311287 2293083 2275877 2258849 2241850 2224613 2206410
48638 2206410 2186896 2166630 2146332 2126164 2106208 2087068 2069333 2052747 2036436 2019785 2002651
48627 2002651 1984973 1966686 1947840 1928499 1908727 1889057 1870532 1853738 1838073 1822652 1807842
48616 1807842 1795238 1786086 1780337 1777370 1776992 1779306 1783941 1789866 1795989 1801634 1806385 1809730 1811180 1810895
48602 1810895 1809897 1809253 1809081 1808835 1808622 1809584 1812605 1817077 1821391 1824224 1824827 1822489 1816644 1807598 1796527
48587 1796527 1784518 1771974 1758930 1745477 1731733 1717878 1704398 1691909 1680523 1669730 1659163
48576 1659163 1649260 1640885 1634474 1629793 1626416 1624173 1623143 1623449 1625225 1628716 1634254 1641936 1651268 1661162
48562 1661162 1670299 1677426 1681472 1681767 1678428 1672306 1664310 1654841 1644082 1632625 1621470 1611366 1602442
48549 1602442 1594362 1586606 1578509 1569405 1558920 1547068 1533974 1519614 1503948 1487271 1470342 1454051
48537 1454051 1438907 1424859 1411665 1399324 1388023 1377869 1369026 1362125 1358108 1357450 1359894 1365096 1373212
48524 1373212 1384497 1398569 1414305 1430209 1444495 1455035 1459812 1457681 1448748 1434229 1416104 1396624
48512 1396624 1377673 1360477 1345922 1334872 1327973 1325377 1326959 1332618 1342150 1355065 1370854 1389179
48500 1389179 1409429 1430316 1450414 1468941 1485483 1498924 1507123 1507983 1500834 1486936 1468848 1449086
48488 1449086 1428936 1408388 1387160 1365574 1344341 1323950 1304603 1286398 1269205 1252727 1237177
48477 1237177 1223521 1212400 1203127 1194499 1186426 1179922 1175534 1172641 1170451 1168857 1167973 1167558 1167397 1167701
48463 1167701 1168713 1170346 1172675 1176393 1182243 1190069 1198841 1207470 1215323 1221997 1226992 1229705 1229704 1227011 1222151
48448 1222151 1215895 1208998 1202201 1196189 1191155 1186503 1181281 1174986 1167634 1159145 1149141 1137559 1125074
48435 1125074 1112666 1100889 1089719 1078946 1068610 1059132 1051037 1044441 1038834 1033536 1028297 1023281 1018625
48422 1018625 1014241 1009936 1005377 1000144 994169 988031 982354 977017 971437 965557 959960 954984 950333 945750
48408 945750 941453 937541 933467 928591 923105 918009 914225 911902 910445 909069 907352 905356 903219 900814
48394 900814 897971 894841 891665 888260 884139 879159 873679 867992 862008 855687 849486 844097 839772 836061
48380 836061 832235 828052 824064 821016 818954 817259 815562 814087 812853 811255 808950 806594 804948 803696
48366 803696 801937 799532 797101 794924 792781 790738 789151 787852 786263 784468 783374 783553 784579 785629
48352 785629 786188 786180 786055 786663 788406 790573 792233 793600 795712 799051 803449 809182 816929 826658 837756
48337 837756 850336 865207 882335 900483 918556 936090 952234 965649 975904 983804 990003 994580
48325 994580 998365 1003268 1010609 1020263 1031850 1045477 1060843 1077060 1094020 1112627 1133075 1154367
48313 1154367 1176180 1199734 1226191 1255765 1289121 1327902 1372971 1423916 1481253 1547331 1624117
48302 1624117 1712160 1813086 1931305 2072188 2240693 2443371 2690130 2993475 3368914 3838085
48292 3838085 4431082 5188275 6164115 7422439 9007660 10905009 13031256 15267600 17485548
48283 17485548 19521697 21142035 22081583 22166399 21414675 20021641 18250831 16332082 14425366
48274 14425366 12629937 10999287 9552687 8289156 7199710 6271451 5487795 4830950
48266 4830950 4284361 3832003 3457746 3147472 2890474 2677606 2499744 2349227 2221157
48257 2221157 2111866 2017331 1934163 1860897 1796937 1740943 1691149 1646466 1606408 1570458 1538127
48246 1538127 1509110 1482936 1458909 1436656 1416204 1397519 1380634 1366116 1354452 1344988 1336579 1329385
48234 1329385 1324813 1323362 1323742 1324550 1325653 1327154 1327986 1326392 1321190 1311925 1298419 1280905 1260274 1237614
48220 1237614 1213643 1188813 1163580 1138316 1113326 1089140 1066368 1045155 1025166 1006096 987683
48209 987683 969316 950424 931300 912755 894855 876879 858737 841352 825260 809802 794353
48198 794353 779487 766185 754566 744172 734918 726895 719694 712767 706206 700440 695336 690311 685276
48185 685276 680803 677365 674901 673143 671880 670762 669241 666935 663987 661010 658686 657264 656316 655098
48171 655098 653272 651180 649416 648270 647568 646792 645431 643536 641922 641390 641735 642006 641744 641381 641259 641025
48155 641025 640327 639444 638687 637691 636013 634099 633036 633415 634894 636714 638290 639460 640484 641709 643016
48140 643016 643942 644521 645478 647084 648377 648276 647158 646492 647063 648333 649534 650520 651367 651963 652432 653379 655214
48123 655214 657632 660197 663134 667074 672155 677786 683233 688163 692687 697189 702092 707567 713418 719385
48109 719385 725581 732495 740574 749941 760469 771927 783986 796329 808938 822170 836339 851179
48097 851179 865954 880095 893622 906938 920456 934511 949306 964644 979844 994229 1007643
48086 1007643 1020297 1032250 1043303 1053288 1062158 1069916 1076855 1083750 1091289 1099259 1106785 1113477 1119784
48073 1119784 1126017 1131718 1136406 1140428 1144510 1148907 1153629 1159121 1165967 1173991 1182366 1190626 1198910 1207098
48059 1207098 1214338 1219754 1223195 1225075 1225863 1225893 1225205 1223170 1218613 1210758 1199922 1187062 1172876 1157714
48045 1157714 1142098 1126781 1112139 1097777 1082841 1066555 1048551 1029001 1008550 987920 967414
48034 967414 946934 926556 906850 888461 871488 855471 839959 824857 810253 796095 782170
48023 782170 768326 754632 741352 728749 716841 705352 694044 683097 672966 663848 655526 647869
48011 647869 641203 635827 631373 627100 622813 619072 616321 614214 612032 609557 607215 605530 604681 604522 604817
47996 604817 605417 606367 607814 609702 611685 613470 615173 617131 619382 621483 622909 623498 623487 623199 622779 622236
47980 622236 621655 621231 621023 620792 620281 619562 618843 617963 616455 614166 611481 608713 605725 602520 599821 598468
47964 598468 598341 598439 598063 597414 596925 596550 596027 595504 595484 596264 597702 599501 601605 604329 608133 613154 618874
47947 618874 624440 629428 634196 639422 645467 652297 659787 667868 676388 685040 693478 701519 709274 717022
47933 717022 724786 732051 738120 742768 746261 748683 749677 749125 747664 746092 744437 742114 738847 734924 730563
47918 730563 725571 719859 713756 707542 700973 693621 685526 677250 669435 662510 656633 651719 647577 644208
47904 644208 641787 640196 638815 637084 635168 633813 633655 634913 637507 641056 644846 648334 651795 656132
47890 656132 661890 668699 675752 682527 689006 695554 702730 710878 719730 728660 737375 746017 754440 761936
47876 761936 768000 772950 777298 780817 782738 782703 781066 778386 775061 771329 767109 761886 755194 747247 738721
47861 738721 730013 721076 711880 702415 692311 681142 669323 658099 648399 640207 633238 627544 623014
47848 623014 618925 614732 610978 608714 608140 608385 608581 608605 608756 609240 610169 611691 613936 616931 620580 624504
47832 624504 628014 630572 632389 634297 636950 640302 643842 647087 649823 652193 654682 657809 661677 665924
47818 665924 670208 674679 679883 686263 693830 702359 711978 723551 738272 756696 778246 801834 826810
47805 826810 853067 880345 907797 934339 959187 982006 1002734 1021323 1037441 1050324 1058999 1062825
47793 1062825 1061862 1056863 1048887 1038745 1026627 1012415 996521 980176 964612 950177 936620 924063
47781 924063 913095 903853 895606 887515 879415 871625 864321 857432 850870 844512 838067 831197 823768 815888
47767 815888 807865 800219 793516 787970 783322 779175 775244 771262 766993 762570 758512 755092 751874 748245
47753 748245 744235 740477 737464 735219 733757 733433 734652 737321 740837 744600 748534 752997 758236 764069
47739 764069 770354 777568 786513 797333 809222 821283 833261 845267 857300 869498 882349 895935
47727 895935 909123 920265 928752 935351 940987 945756 949235 951082 950986 948589 943935 937708 930547 922293
47713 922293 912304 900409 887213 873534 859832 846253 832947 820242 808544 798124 789006 781104
47701 781104 774421 769038 764926 761959 760078 759268 759384 760246 761958 764889 769266 775097 782521 791821 802834
47686 802834 814696 826520 838130 849825 861703 873596 885486 897506 909527 921103 931852
47675 931852 941604 950167 957242 962586 966066 967581 967220 965438 962771 959361 954994 949481 942665 934195
47661 934195 923842 912145 900176 888479 876647 864177 851278 838578 826525 815443 805745 797490
47649 797490 790063 782915 776528 772085 770158 770206 771338 772970 774712 776331 778235 781496 786839 793782 801178
47634 801178 808486 816163 824962 835316 847479 861855 878857 898600 920939 945787 973205 1003119
47622 1003119 1035028 1068183 1102073 1136590 1171489 1205714 1237430 1264890 1287152 1303909 1314743
47611 1314743 1318777 1315175 1303930 1286104 1263163 1235960 1204325 1167847 1127058 1083772 1040159 997602
47599 997602 956461 916688 878441 842250 808844 778811 752253 728769 707884 689372 673067
47588 673067 658535 645319 633409 623145 614551 607144 600445 594291 588491 582676 576866 571840 568350
47575 568350 566093 564032 561719 559732 558609 557929 556935 555659 554829 554661 554367 553069 550843 548536 546742
47560 546742 545304 543800 542148 540547 538972 537002 534187 530505 526470 522827 520103 518279 516851 515294
47546 515294 513534 511888 510585 509494 508409 507395 506651 506160 505720 505308 505104 505109 505022 504674 504353 504457 504965 505580
47528 505580 506363 507860 510394 513432 515929 517274 517712 517810 517813 517692 517622 517984 518804 519514 519554 519033 518480 518080 517564
47509 517564 516872 516447 516583 516874 516732 516268 516182 516792 517631 518153 518448 518941 519614 519966 519725 519254 519051 519047 518691 517745
47489 517745 516689 516197 516351 516630 516635 516538 516771 517527 518670 519952 521154 522262 523726 526236 529902 533807 536797
47472 536797 538724 540543 543098 546238 549218 551631 553630 555491 557250 558741 559810 560472 560912 561273 561514
47457 561514 561625 561876 562543 563375 563757 563576 563579 564656 567053 570576 575163 580901 587743 595715 605229 616712
47441 616712 630019 644712 660899 679265 700073 722651 746083 770107 794954 820578 846356
47430 846356 871521 895576 918175 938678 955997 969100 977851 983126 985762 985457 981049 971964 959037
47417 959037 943766 927210 909844 892073 874316 856643 838836 820984 803740 787764 773064
47406 773064 759128 745682 733093 721849 711814 702320 693129 684963 678731 674337 670666 666795 662839
47393 662839 659520 657328 656353 656620 658137 660756 664350 669101 675284 682673 690438 697823 704819 712052 719994
47378 719994 728351 736262 743085 748859 753923 758223 761224 762488 762053 760276 757571 754316 750595 745843
47364 745843 739095 729885 718674 706257 693115 679637 666490 654128 642151 629754 616861 604304
47352 604304 592928 582935 574083 565971 558089 550179 542722 536582 531907 527865 523762 519954 517219 515626
47338 515626 514501 513361 512376 511965 512337 513368 514690 515984 517424 519618 522804 526306 529256 531696 534386
47323 534386 537574 540576 542815 544618 546582 548508 549563 549310 548155 546828 545827 545331 545218 544993 544016
47308 544016 542077 539597 537196 535182 533616 532642 532476 533043 533922 534699 535359 536296 538070 541123 545545 550955
47292 550955 556664 562068 566963 571613 576628 582733 590302 598926 607612 615734 623671 632209 641380 650299
47278 650299 658287 665697 673316 681222 688663 694960 700084 704357 708005 711166 713982 716431 718271 719388
47264 719388 720084 720773 721399 721401 720283 718227 716128 715031 715418 717008 719381 722754 727814 734580 741746 747447
47248 747447 750489 750547 747500 741294 732533 722549 712501 702777 693514 685276 678722 673848 670085 667117
47234 667117 665192 664656 665602 668028 672003 677473 684125 691564 699488 707694 716110 724854 733991 743226 752073
47219 752073 760371 768278 775613 781590 785507 787469 788168 788155 787616 786581 784903 782049 777375 770730 762620
47204 762620 753775 744811 736282 728655 722027 716119 710733 706006 702069 698710 695677 693182 691867 692265
47190 692265 694466 698180 702917 708201 713949 720661 728966 738925 750088 762255 775758 790775 806829
47177 806829 823390 840692 859327 879109 898925 917817 935646 952525 968159 982192 994703
47166 994703 1005796 1014940 1021310 1024758 1026006 1025831 1024447 1021653 1017193 1010931 1003018 994040 984731 975463
47152 975463 966196 956815 947211 937096 926296 915354 905376 897139 890651 885636 881992 879554 877950
47139 877950 877039 877145 878541 880980 884062 887756 892243 897513 903363 909524 915505 920730 925162 929381 933562
47124 933562 936722 937520 935570 931468 925782 918598 909923 899964 889115 878099 867871 858748 849858 840050
47110 840050 829242 818195 807241 796143 785167 775192 766448 758015 748987 739419 729774 720243 711117
47097 711117 703144 696854 691976 688019 684871 682374 679934 677315 675323 674907 675868 677215 678573 680424 683106
47082 683106 686380 690056 694307 699191 704397 709617 714715 719476 723710 727686 731912 736240 739680 741390
47068 741390 741510 740809 739816 738635 737374 736396 736025 736073 735756 734317 731998 730209 730392 732723 736256 740179
47052 740179 744464 749294 754491 759756 764997 770161 775158 780225 785989 792776 800166 807580 814986 822613
47038 822613 830239 837334 843829 850219 856890 863808 870933 878470 886455 894421 901831 908693 915461 922367
47024 922367 929063 934937 939705 943646 947265 950656 953212 954095 953047 950659 947760 944708 941300 937162
47010 937162 932021 925804 918873 912171 906676 902525 898892 894987 890978 887762 885968 885453 885622 885937 886226
46995 886226 886795 888221 890755 893942 897139 900382 904328 909316 914968 920861 927133 934112 941724 949726
46981 949726 958222 967537 977699 988455 999695 1011446 1023499 1035411 1046952 1058230 1069423 1080632
46969 1080632 1091899 1102973 1113067 1121338 1127767 1133152 1138102 1142359 1145315 1146843 1147327 1147150 1146493 1145531
46955 1145531 1144498 1143631 1143240 1143703 1145128 1147105 1149075 1150988 1153401 1156891 1161494 1166788 1172336 1178012 1184003
46940 1184003 1190585 1197812 1205333 1212657 1219735 1227247 1236097 1246464 1257424 1267663 1276625 1284867 1293277
46927 1293277 1302029 1310353 1317203 1321940 1324354 1324264 1321401 1315854 1308416 1300135 1291365 1281515 1269992 1257133
46913 1257133 1243854 1230527 1216816 1202699 1189026 1176734 1165948 1156320 1147887 1141120 1136366 1133779
46901 1133779 1133625 1136126 1141038 1147906 1156739 1167970 1181657 1197204 1214030 1232121 1251776 1273059
46889 1273059 1295547 1318329 1340268 1360664 1379719 1397990 1415368 1431065 1444644 1456435 1466729
46878 1466729 1475180 1481429 1485911 1489542 1492856 1495825 1498279 1500210 1501901 1504090 1507743 1513320 1520475 1528747
46864 1528747 1538280 1549503 1562363 1576322 1590927 1605943 1621059 1635880 1650178 1663829 1676582
46853 1676582 1688217 1698787 1708359 1716613 1723041 1727383 1729500 1729079 1726034 1721118 1715545 1709840 1703495 1695839
46839 1695839 1686852 1677067 1667172 1657885 1649783 1642986 1637223 1632425 1629010 1627586 1628623 1632391 1638766 1646954
46825 1646954 1655927 1665449 1676262 1688974 1703112 1717621 1731848 1745515 1758046 1768655 1777195 1784292
46813 1784292 1790405 1795115 1797691 1798107 1797143 1795465 1792860 1788576 1782322 1774715 1766642 1758369 1749509 1739838
46799 1739838 1729755 1719776 1709861 1699597 1688974 1678723 1669784 1662571 1656761 1651699 1647023 1643023 1640397
46786 1640397 1639573 1640221 1641520 1642838 1644103 1645542 1647349 1649653 1652586 1656071 1659643 1662780 1665459 1668134
46772 1668134 1671017 1673681 1675668 1677320 1679621 1683232 1688057 1693774 1700355 1707885 1716253 1725364 1735357 1746311
46758 1746311 1758027 1770472 1784128 1799372 1815644 1831797 1847311 1862657 1878429 1894543 1910356
46747 1910356 1925061 1937832 1948196 1956597 1964176 1971584 1978173 1982690 1984575 1984410 1983344 1982359 1981881 1981836
46733 1981836 1982131 1983065 1985040 1987790 1990402 1992377 1994293 1997112 2001209 2006419 2012563 2019299 2025749 2031050
46719 2031050 2035291 2039337 2043570 2047290 2049499 2049911 2048969 2047084 2043996 2038831 2030834 2020103 2007448 1993436
46705 1993436 1977896 1960573 1941787 1921938 1900810 1878112 1854433 1830790 1807303 1783208 1758320
46694 1758320 1733588 1709887 1687014 1664251 1641246 1618022 1594944 1573189 1554438 1539297 1526448
46683 1526448 1514055 1501573 1489562 1478275 1467419 1457022 1447609 1439493 1432590 1426827 1422011 1417445
46671 1417445 1412544 1407878 1404773 1403751 1404182 1405624 1408568 1413450 1419748 1426679 1434269 1443126 1453510 1465041
46657 1465041 1476935 1488142 1497712 1505560 1512551 1519387 1525716 1530774 1534423 1536998 1538527 1538827 1538119 1536778
46643 1536778 1534702 1531748 1528741 1527172 1527720 1529856 1533200 1538508 1546875 1558551 1573054 1590002 1609156
46630 1609156 1629900 1651320 1672760 1693890 1714255 1733205 1750323 1765608 1779071 1790360 1798835
46619 1798835 1803908 1805287 1803008 1797262 1788144 1775621 1759873 1741657 1722113 1702161 1682088 1661729
46607 1661729 1640939 1619866 1598808 1577921 1557252 1537101 1518219 1501356 1486632 1473602 1461972
46596 1461972 1451894 1443410 1435917 1428562 1420993 1413359 1405736 1397975 1390125 1382551 1375446 1368547 1361544 1354532
46582 1354532 1347787 1341298 1334837 1328430 1322390 1316817 1311404 1305955 1300907 1296983 1294335 1292373 1290576 1289164
46568 1289164 1288688 1289114 1289746 1290064 1290245 1290707 1291519 1292515 1293696 1295136 1296670 1298076 1299525 1301464 1304016 1306833
46552 1306833 1309612 1312491 1315860 1320057 1325329 1331679 1338573 1345165 1351188 1357503 1365398 1375329 1386560 1398010
46538 1398010 1409244 1420719 1433301 1447648 1463843 1481501 1500184 1519732 1540171 1561490 1583725
46527 1583725 1607197 1632408 1659539 1688126 1717284 1746224 1774585 1802392 1829753 1856549 1882331
46516 1882331 1906566 1928985 1949591 1968293 1984652 1998182 2008914 2017539 2024799 2030746 2034764 2036446
46504 2036446 2036308 2035393 2034192 2032231 2028787 2023824 2018098 2012533 2007616 2003173 1998455 1992574 1985126 1976367
46490 1976367 1966658 1955930 1943977 1930959 1917097 1901946 1884608 1864860 1843524 1821403 1798289
46479 1798289 1773405 1746498 1718001 1688362 1657788 1626712 1596064 1566854 1539599 1514180 1490098
46468 1490098 1466985 1445071 1425150 1407968 1393728 1382401 1374227 1369492 1367883 1368628 1371371 1376473 1384278
46455 1384278 1394450 1406304 1419414 1433595 1448537 1463797 1479003 1493764 1507517 1519751 1530368
46444 1530368 1539537 1547261 1553319 1557588 1560204 1561386 1561318 1560228 1558368 1555851 1552604 1548593 1544029 1539327
46430 1539327 1534854 1530692 1526689 1522841 1519672 1518102 1518844 1522002 1527291 1534449 1543413 1554287 1567360 1582971
46416 1582971 1601206 1621834 1644729 1670142 1698319 1729018 1761690 1796004 1831865 1868970 1906625
46405 1906625 1944090 1980846 2016578 2051025 2083811 2114230 2141368 2164684 2184346 2200678 2213427
$$ [...]
##END NTUPLES=NMR SPECTRUM
##END=
