
##TITLE=AC1216_HNAAH12057_7164140_aGhcq856Ux
##JCAMPDX= 6.0         $$ Bruker NMR JCAMP-DX V2.0
##DATA TYPE= NMR SPECTRUM
##DATA CLASS= NTUPLES
##ORIGIN= BRUKER
##OWNER= Administrator
$$ 1.72 TOPSPIN		Version 2.1
$$ 2012-12-01 16:50:25.615 -0500  Administrator@X
$$ Compression mode = diff/dup
##.OBSERVE FREQUENCY= 400.02188249412
##.OBSERVE NUCLEUS= ^1H
##.ACQUISITION MODE= SIMULTANEOUS (DQD)
##.ACQUISITION SCHEME= undefined
##.AVERAGES= 8
##.DIGITISER RES= 22
##SPECTROMETER/DATA SYSTEM= spect
##.PULSE SEQUENCE= zg30
##.SOLVENT NAME= COFFEE_meoh
##.SHIFT REFERENCE= INTERNAL, COFFEE_meoh, 1, 14.98509
##AUDIT TRAIL= $$ (NUMBER, WHEN, WHO, WHERE, PROCESS, VERSION, WHAT)
$$ ##TITLE= Audit trail, TOPSPIN		Version 2.1
$$ ##JCAMPDX= 5.01
$$ ##ORIGIN= Bruker BioSpin GmbH
$$ ##OWNER= Administrator
$$ $$ E:\/data/COFFEE/nmr/AC1216_HNAAH12057_7164140_aGhcq856Ux/10/pdata/1/auditp.txt
$$ ##AUDIT TRAIL=  $$ (NUMBER, WHEN, WHO, WHERE, PROCESS, VERSION, WHAT)
(   1,<2012-12-01 16:50:16.635 -0500>,<Administrator>,<X>,<go>,<TOPSPIN 2.1>,
      <created by zg
	started at 2012-12-01 16:49:13.081 -0500,
	POWCHK enabled, PULCHK disabled,
       configuration hash MD5:
       86 BA 57 50 F2 9D 5C 9B 26 00 A9 28 5F 66 2E 89
       data hash MD5: 64K
       E2 71 13 24 C2 46 6A D2 B1 99 D8 13 F3 CF EB C3>)
(   2,<2012-12-01 16:50:19.938 -0500>,<Administrator>,<X>,<proc1d>,<TOPSPIN 2.1>,
      <Start of raw data processing
       efp LB = 0 FT_mod = 6 PKNL = 1 PHC0 = 0 PHC1 = 0 SI = 32K 
       data hash MD5: 32K
       34 E6 44 56 AC 63 5D 6F 81 81 9C 5D B3 80 F3 8F>)
(   3,<2012-12-01 16:50:20.427 -0500>,<Administrator>,<X>,<proc1d>,<TOPSPIN 2.1>,
      <pk PHC0 = 94.70764 PHC1 = 0 
       data hash MD5: 32K
       89 7A 9F D2 90 CB A5 4E 41 95 01 0B F3 DF 44 EE>)
(   4,<2012-12-01 16:50:20.679 -0500>,<Administrator>,<X>,<proc1d>,<TOPSPIN 2.1>,
      <abs ABSG = 1 
       data hash MD5: 32K
       5E A2 38 2E 5E B6 08 2F 80 B7 38 24 7F 55 B3 19>)
(   5,<2012-12-01 16:50:20.864 -0500>,<Administrator>,<X>,<proc1d>,<TOPSPIN 2.1>,
      <abs ABSG = 2 
       data hash MD5: 32K
       7B 4C 39 85 32 BB 9D 84 06 4A AD F8 AF 87 FB 6A>)
(   6,<2012-12-01 16:50:21.033 -0500>,<Administrator>,<X>,<proc1d>,<TOPSPIN 2.1>,
      <abs ABSG = 3 
       data hash MD5: 32K
       04 0D EC B1 64 1F 49 B9 73 C0 BF E4 90 1C EA 2D>)
(   7,<2012-12-01 16:50:21.201 -0500>,<Administrator>,<X>,<proc1d>,<TOPSPIN 2.1>,
      <abs ABSG = 4 
       data hash MD5: 32K
       11 B1 C7 9B 37 EC 96 12 20 A4 3C F8 3E 20 D9 E6>)
(   8,<2012-12-01 16:50:21.370 -0500>,<Administrator>,<X>,<proc1d>,<TOPSPIN 2.1>,
      <abs ABSG = 5 
       data hash MD5: 32K
       2C E7 07 0E 7C 0A 64 03 C5 FD 65 8C 87 7D 6F 3B>)
$$ ##END=
$$ 
$$ $$ hash MD5
$$ $$ 1B 55 05 EA F6 5E DA C5 A0 3E 7E 5A F6 F1 50 39
##$RELAX= 
##$RELAX= 
##$RELAX= 
##$RELAX= 
##$RELAX= 
##$RELAX= 
##$RELAX= 
$$ Bruker specific parameters
$$ --------------------------
##$DU= <E:\>
##$EXPNO= 10
##$NAME= <AC1216_HNAAH12057_7164140_aGhcq856Ux>
$$ [...]
150 150 150 150 150 150 150 150
##$TP07= 0
##$TPNAME0= <>
##$TPNAME1= <>
##$TPNAME2= <>
##$TPNAME3= <>
##$TPNAME4= <>
##$TPNAME5= <>
##$TPNAME6= <>
##$TPNAME7= <>
##$TPOAL= (0..7)
0.5 0.5 0.5 0.5 0.5 0.5 0.5 0.5
##$TPOFFS= (0..7)
0 0 0 0 0 0 0 0
##$TUNHIN= 0
##$TUNHOUT= 0
##$TUNXOUT= 0
##$USERA1= <user>
##$USERA2= <user>
##$USERA3= <user>
##$USERA4= <user>
##$USERA5= <user>
##$V9= 5
##$VALIST= <valist>
##$VCLIST= <CCCCCCCCCCCCCCC>
##$VD= 0
##$VDLIST= <DDDDDDDDDDDDDDD>
##$VPLIST= <PPPPPPPPPPPPPPP>
##$VTLIST= <TTTTTTTTTTTTTTT>
##$WBST= 1024
##$WBSW= 4
##$XGAIN= (0..3)
0 0 0 0
##$XL= 0
##$YL= 0
##$YMAX_a= 663173
##$YMIN_a= -558911
##$ZGOPTNS= <>
##$ZL1= 120
##$ZL2= 120
##$ZL3= 120
##$ZL4= 120
##$ABSF1= 14.98509
##$ABSF2= -5.573092
##$ABSG= 5
##$ABSL= 3
##$ALPHA= 0
##$AQORDER= 0
##$ASSFAC= 0
##$ASSFACI= 0
##$ASSFACX= 0
##$ASSWID= 0
##$AUNMP= <proc_prof1d_extract_pilot.lims>
##$AXLEFT= 0
##$AXNAME= <>
##$AXNUC= <1H>
##$AXRIGHT= 0
##$AXTYPE= 0
##$AXUNIT= <>
##$AZFE= 0.1
##$AZFW= 0.1
##$BCFW= 0
##$BC_mod= 0
##$BYTORDP= 0
##$COROFFS= 0
##$CY= 15
##$DATMOD= 1
##$DC= 0
##$DFILT= <>
##$DTYPP= 0
##$F1P= 0
##$F2P= 0
##$FCOR= 0.5
##$FTSIZE= 32768
##$FT_mod= 6
##$GAMMA= 0
##$GB= 0
##$INTBC= 1
##$INTSCL= 1
##$ISEN= 128
##$LB= 0
##$LEV0= 0
##$LPBIN= 0
##$MAXI= 10000
##$MC2= 0
##$MEAN= 0
##$ME_mod= 0
##$MI= 0
##$NCOEF= 0
##$NC_proc= -8
##$NLEV= 6
##$NOISF1= 0
##$NOISF2= 0
##$NSP= 0
##$NTH_PI= 0
##$NZP= 0
##$OFFSET= 14.98509
##$PC= 1
##$PHC0= 94.70764
##$PHC1= 0
##$PH_mod= 1
##$PKNL= yes
##$PPARMOD= 0
##$PPDIAG= 0
##$PPIPTYP= 0
##$PPMPNUM= 2147483647
##$PPRESOL= 1
##$PSCAL= 4
##$PSIGN= 0
##$PYNMP= <proc.py>
##$REVERSE= no
##$SF= 400.02
##$SI= 32768
##$SIGF1= 0
##$SIGF2= 0
##$SINO= 400
##$SIOLD= 32768
##$SPECTYP= <>
##$SREGLST= <1H.CDCl3>
##$SSB= 0
##$STSI= 32768
##$STSR= 0
##$SW_p= 8223.68421052631
##$SYMM= 0
##$S_DEV= 0
##$TDeff= 65536
##$TDoff= 0
##$TI= <>
##$TILT= no
##$TM1= 0
##$TM2= 0
##$TOPLEV= 0
##$USERP1= <user>
##$USERP2= <user>
##$USERP3= <user>
##$USERP4= <user>
##$USERP5= <user>
##$WDW= 1
##$XDIM= 32768
##$YMAX_p= 477408709
##$YMIN_p= -736396
##$CURPLOT= <Network HP LaserJet P1505>
##$CURPRIN= <$Network HP LaserJet P1505>
##$DFORMAT= <normdp>
##$LAYOUT= <+/1D_H.xwp>
##$LFORMAT= <normlp>
##$PFORMAT= <normpl>
##$SURQMSG= 1
$$ End of Bruker specific parameters
$$ ---------------------------------
##NTUPLES= NMR SPECTRUM
##VAR_NAME=  FREQUENCY,     SPECTRUM/REAL,   SPECTRUM/IMAG
##SYMBOL=    X,             R,               I
##VAR_TYPE=  INDEPENDENT,   DEPENDENT,       DEPENDENT
##VAR_FORM=  AFFN,          ASDF,            ASDF
##VAR_DIM=   32768,         32768,           32768
##UNITS=     HZ,            ARBITRARY UNITS, ARBITRARY UNITS
##FACTOR=    0.250966925370066, 1,           1
##FIRST=     8223.43324360094, -95687,       -161019
##LAST=      0,             218480,          131447
##MIN=       0,             -736396,         0
##MAX=       8223.43324360094, 477408709,    0
$$ Real data points
##PAGE= N=1
##DATA TABLE= (X++(R..R)), XYDATA
$$ [...]
19515B40357c85291J17098B09136G3426h0236p3062K8216e4294H611a35273k6942
19504a62215n575J0420P2300j46257j27149A99431f6190j35371O9643B79581a88261
19492g4051j323l9983E8591O5411c708j40670j74584d1536O056m6403I6369h5481
19479a97297o8535D46827f9404n4796I3474a19360o6873A7935P4687Q8797a58394
19467f8508k47172h2990A95344d5216o5988L8376L4232j96068o5475o3392J45791
19456b17740h1029k58164R8651j3496E032a25033k6719b2456j66795l484O4822
19445a27913E3791c27787f7285l59383h2158j8794l5653D0103c90096g9869r1755
19434a71624j05137G6334J62911f346k87389a37992b4904p7873A123c7170k38657
$$ plain form
19515 240357 -385291 -268193 209136 73426 -80236 -153298 -125082 -54294 8611 -135273 -162215
19504 -162215 -167790 -157370 -85070 -231327 -358476 199431 -66190 -201561 -131918 279581 -188261
19492 -74051 -75374 -115357 58591 124002 -3708 -144378 -318962 -41536 -35480 -81883 96369 -85481
19479 -197297 -265832 446827 -69404 -124200 93474 -119360 -186233 17935 92622 181419 -158394
19467 -68508 -315680 -82990 195344 -45216 -111204 -72828 -38596 -234664 -300139 -363531 -217740
19456 -217740 -81029 -339193 -240542 -254038 5032 -125033 -151752 -22456 -189251 -192735 -127913
19445 -127913 53791 -327787 -67285 -426668 -82158 -100952 -136605 40103 -390096 -79869 -171624
19434 -171624 -276761 76334 239245 -6346 -293735 -137992 -24904 -102777 1123 -37170 -275827
19423b75827c5723l60659F5188j1518J07046a90962c5588E815K55414A01212J56894
19412B58106e1104A98016A7163b54905A18497A9597a09853D52362A21511E2079
19401A22190k3169f0742j43504f7581k03564e9129C28900a10586A2900h6341k62556
19390c48897d6188A21188m1098D792f8102j99847F517a24250r7601N972D4301
19378D90712B6911j1832b85488J15096A80913a33764A34972a07164L8274j41440
19368b10330g8186A96805P9029b75655A2214P5025J98552a99254c7860k2512l60828
19357d21200B86161g3005A8954b33942C86R5253K317a49012j34897N6711d5433
19345f0419j88100K5526R6573d1793a9495o3852p0105d28k64663a02812k3179
$$ plain form
19423 -275827 -35723 -396382 65188 53670 160716 -190962 -35588 5815 261229 101212 258106
19412 258106 -51104 198016 17163 -254905 118497 19597 -109853 452362 121511 52079
19401 122190 99021 -60742 -204246 -67581 -271145 -59129 328900 -110586 12900 -86341 -348897
19390 -348897 -46188 121188 80090 4792 -68102 -267949 6517 -124250 -221851 -215879 44301
19378 490712 26911 15079 -285488 -170392 180913 -133764 134972 -107164 -68890 -210330
19368 -210330 -78186 196805 275834 -275655 12214 87239 285791 -199254 -37860 -60372 -421200
19357 -421200 286161 -73005 18954 -233942 386 95639 97956 -149012 -283909 -227198 -45433
19345 -60419 -248519 -222993 -126420 -41793 -19495 -83347 -153452 -428 -265091 -102812 -125991
19334a25991H7947d7348k7122H2308a92492g4119A6191J3249h0890B35979a66961
19322f4778p8958A26937b63828K6433F9457c62574I4360J22129a49868p167m7450
19311b04485i1487l54196f8241C27506f9342j50197A0429a60056L4086A97963
19300c50901A529b75668D7735L7441o727e5598j40599j93180R5077B8889a79534
19288e5015p6639n5948o1143L0726A92035d08497d1204B7410c1754C9110e7240
19276A05363b11367D25790b6026l32030A25906a61842C2707b47060i3342j73675
19266b67017b5045j35720k55995a14322J6508j25561A5058J03268b67947J12004
19256a55943k47328a35458m1248b3820q5472I8907l1689J51451g6615B57120l6376
$$ plain form
19334 -125991 87947 -47348 -74470 82308 -192492 -74119 16191 29440 -80890 235979 -166961
19322 -64778 -143736 126937 -263828 -237395 69457 -362574 94360 216489 -149868 -157035 -204485
19311 -204485 -91487 -445683 -68241 327506 -69342 -219539 10429 -160056 -125970 197963
19300 -350901 1529 -275668 47735 85176 78449 -55598 -196197 -389377 -294300 28889 -179534
19288 -55015 -131654 -187602 -248745 -218019 192035 -408497 -41204 27410 -31754 39110 -57240
19276 105363 -211367 425790 -26026 -358056 125906 -161842 32707 -247060 -93342 -267017
19266 -267017 -25045 -160765 -416760 -114322 -97814 -223375 15058 118326 -267947 -155943
19256 -155943 -403271 -135458 -176706 -23820 -109292 98907 67218 218669 -76615 257120 220744
19245B20744b15585i3770I5480B4248a68666j10546L8956o3613d0823l4642j35478
19234b10943n0984B02398g5800l79424e4213a512j28691A23051K49433c4076o7340
19223a01416A53303h4017L1340o8431F8403N1368a40141n231k24382G2507b38747
19211a9313A46051k4692a71678j0275h5575k6601l7251j94323A64841A290M7554
19200D8844c6486j60259A04611m2100J64949J76355a62370I3680i2780l75188
19190d67968A28057a33707D758e4531l25127a78970d1985G450J21068n6942d06546
19178b89077h3740A82274c68489I7347a79391a5430k27376i6346G1398b47000
19167c18959J28767C32594d08317a68536p2190R2143E5935b67475B25762L6363
$$ plain form
19245 220744 -215585 -93770 95480 24248 -168666 -279212 -240256 -303869 -40823 -75465 -210943
19234 -210943 -261927 202398 -75800 -455224 -54213 -1512 -130203 123051 372484 -34076 -101416
19223 -101416 153303 -84017 -52677 -121108 68403 119771 -140141 -145372 -369754 72507 -238747
19211 -19313 146051 121359 -171678 -181953 -85575 -112176 -149427 -343750 164841 1290 48844
19200 48844 -36486 -196745 104611 62511 227460 403815 -162370 93680 -92780 -467968
19190 -467968 128057 -133707 4758 -54531 -379658 -178970 -41985 7450 128518 71576 -406546
19178 -289077 -83740 182274 -368489 97347 -179391 -15430 -242806 -96346 71398 -247000
19167 -318959 -190192 332594 -408317 -168536 -240726 -148583 55935 -267475 225762 262125
19157B62125a30868p1042b7152G8595a35569n3692B23370f9077o5543j62043d2139
19145I7986b97620E0921a31323E2719a86560m0073l2096a25926M9368A2013b24163
19133h0133A28430H453L90508e1673H8976K1024l421b56138A02804a95409e9836
19121g8712D029K82805a46634j10994l21560B72353f1792C2688a74453j8591j77648
19110c70692Q3342A32488B6000J00896b05864o633c0942f870r407A15943a46839
19098a12422C11319b32563A72207l8938f20022A95922c46317A0587a32567A9003
19087i7510L5291j61472D3529a53469B34231a17131B06071d049C5978J69030H4864
19075a9610k53067a12269q9M3756c0944J2490L971k38600P4036a57A29443g538
$$ plain form
19157 262125 -130868 -201910 -27152 78595 -135569 -189261 223370 -69077 -134620 -296663 -42139
19145 97986 -297620 50921 -131323 52719 -186560 -226633 -258729 -125926 -76558 12013 -224163
19133 -80133 128430 8453 398961 -51673 88976 110000 106579 -256138 102804 -195409 -59836
19121 -78712 4029 286834 -146634 -257628 -579188 272353 -61792 32688 -174453 -193044 -370692
19110 -370692 -287350 132488 26000 126896 -205864 -212497 -30942 -6870 -16277 115943 -146839
19098 -112422 311319 -232563 172207 133269 -620022 195922 -346317 10587 -132567 19003
19087 -97510 -62219 -223691 43529 -153469 234231 -117131 206071 -4049 35978 205008 84864
19075 -19610 -272677 -112269 -112358 -68602 -30944 -18454 -14483 -253083 -179047 -157 129443 -7538
19062d59833b01532j15978R6503n593C05220J34506j70770A05122M046c7551n3452
19051i1003q9085h4046o5455e755F036i8863j51009A21521f4312j32904a1668
19039D2127f8007B05154h0226m288m3882b2484j30757e5334j35399B54632b16693
19027h9158j26346j76878J49505j25848D0623K55331A43243m0277i4801A06463
19016A82360J5836a82906f6187A5679A531L05207j06334f086k2029E9361k8825
19005C0536K6850a53678m006p6463L4481l1308B61649b27860L7950E2597a23389
18993i612A18907C3374J21153a35673j93578i4999j54373l3859b9278C0990p122
18982B3868b34632P0897A32562g7891A25947a21261F2658b24556R9602B29136
$$ plain form
19062 -459833 -201532 -317510 -221007 -226600 305220 439726 268956 105122 109168 -37551 -91003
19051 -91003 -180088 -84046 -149501 -5755 6036 -98863 -249872 121521 -64312 -197216 -11668
19039 42127 -68007 205154 -80226 -84514 -128396 -22484 -153241 -55334 -190733 254632 -216693
19027 -89158 -215504 -392382 -242877 -368725 40623 295954 143243 102966 -94801 106463
19016 182360 198196 -182906 -66187 15679 1531 306738 200404 -6086 -28115 59361 30536
19005 30536 57386 -153678 -157684 -234147 -199666 -230974 261649 -227860 -189910 52597 -123389
18993 -9612 118907 33374 154527 -135673 -329251 -94999 -249372 -283231 -29278 30990 23868
18982 23868 -234632 -163735 132562 -77891 125947 -121261 62658 -224556 -124954 229136
18971g6334B64609L92945r7360k29597b74986A7297J8588O0573A2003a90556e0018
18959c71221e0629k31612O0698K1370K1533F1239h5371B5928g6408n9500f6137
18947B09230n5775a12559E1817g8700b3408j0478j83997L3j52052F3476J16053
18936A79529J61745i01j59622j63579C40867A21377B2729Q5510E3195i6143D4738
18924A75463l4793a99827C4535B553K78981C963a63843D2469a06836A81412a31613
18912g7087k70762G4661C5449a48347D4556L01477K75282q612B29165m7876D4519
18900d3183m04014I7262h9709H0862a05840j95690b5400k47523J26588e7456G9263
18888f3146K8648A42602B5485K13588A0466a7923B08081c4737o9349l43502a31597
$$ plain form
18971 -76334 264609 657554 560194 330597 -274986 17297 35885 96458 12003 -190556 -50018
18959 -371221 -50629 -282241 -221543 -200173 -178640 61239 -85371 25928 -76408 -135908 -66137
18947 209230 153455 -112559 51817 -78700 -23408 -33886 -217883 -217850 -369902 63476 179529
18936 179529 341274 -901 -160523 -324102 340867 121377 22729 108239 53195 -96143 44738
18924 175463 140670 -199827 34535 2553 281534 3963 -163843 42469 -106836 181412 -131613
18912 -77087 -347849 74661 35449 -148347 44556 346033 621315 612703 229165 181289 44519
18900 -43183 -447197 97262 -89709 80862 -105840 -301530 -25400 -272923 -146335 -57456 79263
18888 -63146 -34498 142602 25485 239073 10466 -17923 208081 -34737 -104086 -447588 -131597
18876a38914d0673F5693a42089n7045A96059b54129R3420j5251J2628A45623b63580
18864C11426H5822b55015N9538G588a16037c490j58194C01229c13421I8828A7262
18852a9055k08580H1185a76639F660a21423A6699N2556a31063k79796i9912L9120
18841f0792E2952a27652k7845A78189j4118J1279f3320K5101j94127B93626B05
18829a614D174J40697J5814a67462b0760A6594J60277a72658j43260J10212P4064
18818a31642D2946J07260c25243Q8988B12724a15879o3164C71247G0890a58161
18807A12481B3146J27347m3154b7439l4135o1360n0188A0979a87875N3307C9780
18795A34741l4899b42554f6079A41797a76388l7813B89721a22360r8505e2288
$$ plain form
18876 -138914 -40673 65693 -142089 -199134 196059 -254129 -160709 -175960 -163332 145623 -263580
18864 311426 85822 -255015 -195477 7588 -116037 -3490 -161684 301229 -313421 98828 17262
18852 -19055 -227635 81185 -176639 6660 -121423 16699 69255 -131063 -410859 -99912 -60792
18841 -60792 52952 -127652 -155497 178189 164071 175350 -63320 -38219 -232346 293626 205
18829 -1614 4174 144871 160685 -167462 -20760 16594 176871 -172658 -315918 -205706 -131642
18818 -131642 42946 150206 -325243 -236255 212724 -115879 -179043 371247 70890 -158161
18807 112481 23146 150493 107339 -27439 -61574 -122934 -173122 10979 -187875 -134568 39780
18795 134741 99842 -242554 -66079 141797 -176388 -214201 289721 -122360 -220865 -52288
18784d11248B44151i8417A12232b19246g6974k50073A28893b22428J04394A22245
18773a31733j81990f6693B51320a70524I1540h4505m9380b0937A72019l2951Q3326
18762B22394g4244B9990f20305a82208A41974b27232A44015N03h9158o0993A21561
18750H3902e1836B49898a28242D6905i7423A76389b821k73904B6504K6354a30871
18738B93K03724r3506b9323A58408c95363B04748b2977l16734A13787E5314h8406
18726A44167b18903R1706f1587a6055A08604a20568N4236L2932k7640j64003L0159
18715a94884A31120b95555a01306R746E0168j1824a05278l7010K194j6306B72583
18703a35188j6525m3365F8926a71009M5023j04377j21709G1544L1181B5263a10241
$$ plain form
18784 -411248 244151 -98417 112232 -219246 -76974 -327047 128893 -222428 -118034 122245
18773 -131733 -313723 -66693 251320 -170524 91540 -84505 -133885 -20937 172019 139068 222394
18762 222394 -74244 29990 -620305 -182208 141974 -227232 144015 144518 -89158 -150151 121561
18750 83902 -51836 249898 -128242 46905 -97423 176389 -2821 -276725 26504 52858 -130871
18738 293 204017 110511 -29323 158408 -395363 204748 -22977 -339711 113787 55314 -88406
18726 144167 -218903 -127197 -61587 -16055 108604 -120568 -66332 -33400 -61040 -225043 -194884
18715 -194884 131120 -295555 -101306 -91560 50168 38344 -105278 -142288 -140094 -156400 272583
18703 -135188 -151713 -195078 68926 -171009 -125986 -230363 -352072 71544 102725 25263 -110241
18691E0765a05043e1864k5711p6359l77324a99613P0848r8841h6149A48860a07480
18679c26062a34051A73170a75235H5492o764O1462a4535m43640d910E3632J03456
18668A57088J783c85477J24002j41906a57168f257C09648d23188a27538A79337
18657f7064j29532j65888G4697b25235e9576k1837F2494Q9197b48444j13644A32154
18645A71337J05313b50221l335N7388A7043J85438a25071A40538k8809D2997h1860
18633B3440b23404B67643j31286O6209a84356O3219L0498B25532D5868c63308
18622i986A75160d80464B77054g7240p4369A79684a49716A4197e4800J4746B7534
18610e4623a1760j99780B03803C4494R4420a6704q033E8604d9396p4185k69156
$$ plain form
18691 50765 -105043 -51864 -77575 -153934 -531258 -199613 -128765 -227606 -86149 148860 -107480
18679 -326062 -134051 173170 -175235 85492 78728 140190 -14535 -458175 -4910 53632 157088
18668 157088 158871 -385477 -261475 -403381 -157168 -6257 309648 -423188 -127538 179337
18657 -67064 -196596 -362484 74697 -225235 -59576 -81413 62494 151691 -248444 -362088 132154
18645 171337 276650 -250221 -253556 -196168 17043 202481 -125071 140538 111729 42997 -81860
18633 23440 -223404 267643 136357 202566 -184356 -121137 -90639 225532 45868 -363308
18622 -9986 175160 -480464 277054 -77240 -151609 179684 -149716 14197 -54800 -40054 27534
18610 -54623 -11760 -211540 203803 34494 128914 -16704 -24737 58604 -49396 -123581 -392737
18599c92737a06648m5931H8266f9762j17877C477A112b23308B03304j00945B9262
18587d44303a41960L3047M5310k52193g7735m4956H2516O4138c73088a36668k82061
18576d18729c4286j66930B0320h1694J1116a395A8742c28914J36152c2708k539
18565c5247k5724J7034l06183A50768f3000D1506a65811K826N9540A59786a7888
18553A16900a44213G4618j1749a09937B5718b33740j53685F8552b23775a04677
18542E3145b7906k2399G0820a24829J0522A64978b41137D727c37083B54273K28074
18531D82347j95579b07259F0642g5484I7169b24286R9551G2123c5847j73780l248
18520b12875G6086q55a93841B5824O2626a7556A3241a18724E0158b71523m9985
$$ plain form
18599 -392737 -106648 -152579 88266 -69762 -187639 3477 1112 -223308 203304 102359 29262
18587 -444303 -141960 -108913 -63603 -315796 -77735 -122691 82516 146654 -373088 -136668 -418729
18576 -418729 -34286 -201216 20320 -81694 -70578 -1395 18742 -328914 -192762 -32708 -35247
18565 -35247 -60971 -43937 -350120 150768 -63000 41506 -165811 -162985 -103445 159786 -17888
18553 116900 -144213 74618 62869 -109937 25718 -233740 -387425 68552 -223775 -104677
18542 53145 -27906 -50305 70820 -124829 -114307 164978 -241137 4727 -337083 254273 482347
18531 482347 286768 -207259 60642 -75484 97169 -224286 -124735 72123 -35847 -209627 -212875
18520 -212875 76086 75231 -193841 25824 88450 -17556 13241 -118724 50158 -271523 -321508
18509c21508g4401J2687A6973f9595j16258P5191q0808l8554C1774a41967M5429
18498i6538A70361L9128k3318f149n2090B04436f6951A8337c05714R0102B87383
18486A76069b87634O9416B26389c4057l79851B79059a57011A04506J38543a23525
18475A02328b77891K0052n6015A88961d1183l14283c7926j39437h5113E1281K80337
18464C31618A9072b8325j4517a3245E7783i4161L1228m3343j27000m8358D4793
18452H5485n097b15031e9942l27255B89126E3513a50874P5123n2690k7351E7109
18440f8842D3953g172j13637p71A78090a21011M2443K6926D2007c1077B66042
18428a26974A15504A6300a20631A1780a7413D9352e1200Q405a8849B63655G4358
$$ plain form
18509 -321508 -74401 -61714 16973 -69595 -185853 -110662 -191470 -230024 31774 -141967 -96538
18498 -96538 170361 209489 186171 -6149 -58239 204436 -66951 18337 -305714 -215612 287383
18486 176069 -287634 -218218 226389 -34057 -413908 279059 -157011 104506 243049 -123525
18475 102328 -277891 -257839 -313854 188961 -41183 -355466 -37926 -177363 -85113 51281 331618
18464 331618 19072 -28325 -42842 -13245 57783 -94161 -62933 -106276 -233276 -281634 44793
18452 85485 80388 -215031 -59942 -387197 289126 53513 -150874 -75751 -128441 -155792 57109
18440 -68842 43953 -7172 -120809 -121580 178090 -121011 -78568 -51642 42007 -31077 266042
18428 -126974 115504 16300 -120631 11780 -17413 49352 -51200 -42795 -18849 263655 74358
18416A77150c2242j69738a1497k47218B13912b50208c6933A55802J84629E7702
18405i2756K3702C02949a91G4304L94323a69096N0916r584C35838f8471A3697
18393a27981c4319B02079a48114I2500c4335A55951G2532K76323F9733I205c45750
18381b0560o5187G035J99852j03073a79881c5735q2825B26777d2970G0489A5596
18369b52898A0630a32199C2518J08694a20984K914l5578M1491m0485A10918K8909
18358A39827b76791b6403j15749d7756k7145A85377h453j38742q5180A42303a08112
18346b17938B98145j41405n6723L45128a44492C8067K66394e7137a1626j8737
18336c0363k71644B16854H3023b20246a7063j05115G5262e771r3143j87662K3302
$$ plain form
18416 177150 -32242 -201980 -11497 -258715 213912 -250208 -36933 155802 340431 57702
18405 -92756 -69054 302949 -191 74304 468627 -169096 -118180 -127764 335838 -68471 13697
18393 -127981 -34319 202079 -148114 92500 -34335 155951 72532 348855 69733 9205 -345750
18381 -20560 -85747 7035 206887 103814 -179881 -35735 -118560 226777 -42970 70489 15596
18369 -252898 10630 -132199 32518 141212 -120984 -118070 -153648 -112157 -152642 110918 139827
18358 139827 -276791 -26403 -142152 -47756 -74901 185377 -8453 -147195 -232375 142303 -108112
18346 -217938 298145 156740 100017 445145 -144492 38067 304461 -57137 -11626 -30363
18336 -30363 -302007 216854 83023 -220246 -17063 -122178 75262 -5771 -98914 -286576 -263274
18325b63274A02269a73422A07753J74935A09411L8908h9728j00080f6675A5669
18314C27884H4209B7360c19455A50282D406d3532A07542b86506P4555B32590f0134
18302a69304L6909I4455J16754a22894O652D22218A99327b26897c0178B60297
18291a1787q9999k9938B87136b02466j02467e8260A00149b14215c9260A75786
18280a34299A5658b71475C31712b89417J30411c3430H5202O786e4441j39004Q736
18269a84709k36476a83235A31080D461i7113h707k80365a14496k90643B36494
18258a2831k0324C23123a62665d1287n0048G3148a4948A79050q7263j2375f8376
18246I9122L8931d27577A45098d7995j34001A5855g7628d415j42169J7937C8936
$$ plain form
18325 -263274 102269 -173422 107753 282688 109411 148319 -89728 -189808 -66675 15669
18314 327884 84209 27360 -319455 150282 4406 -43532 107542 -286506 -211951 232590 -60134
18302 -169304 -132395 94455 211209 -122894 -116242 422218 199327 -226897 -30178 260297
18291 -11787 -101786 -131724 287136 -202466 -304933 -58260 100149 -214215 -39260 175786
18280 -134299 15658 -271475 331712 -289417 -159006 -33430 85202 91988 -54441 -193445 -184709
18269 -184709 -421185 -183235 131080 4461 -97113 -8707 -289072 -114496 -405139 236494
18258 -12831 -33155 323123 -162665 -41287 -91335 73148 -14948 179050 91787 79412 -68376
18246 99122 138053 -427577 145098 -47995 -181996 15855 -77628 -4415 -146584 -128647 38936
18234A35063D7107d327k58042f6676j92167J06728e4098A87157d04831h0944E9854
18222H7981K6799b02034D69340k01531b14478h9226k10609A12449k9082g220B772
18210A04495a54775l8201c5627j66262j80510a23738j75028B46551c5756m07476
18200d43232a87309d649C51132a83122A90579a93728m7751E5304J2740e0990B55202
18188a69358G1384c0500m3803b6673k42956R834e0971j12059C40798j674c43222
18176A51268b39276j94032a86662A33733N8125a56410j49612C8663f2960E4506
18165d1796k080k4273m1411K138o4614c4646B1273a01227d3367B66944i7007C6922
18152B63386I0338J06811a17654E1224k2786Q0255M60665b47919D1892e4049q4854
$$ plain form
18234 135063 47107 -4327 -262369 -66676 -258843 -152115 -54098 187157 -404831 -80944 59854
18222 87981 114780 -202034 469340 267809 -214478 -89226 -299835 112449 83367 -7220 2772
18210 104495 -154775 -192976 -35627 -201889 -382399 -123738 -298766 246551 -35756 -443232
18200 -443232 -187309 -4649 351132 -183122 190579 -193728 -241479 55304 68044 -50990 255202
18188 -169358 71384 -30500 -74303 -26673 -269629 -259795 -50971 -163030 340798 339124 -343222
18176 151268 -239276 -433308 -186662 133733 191858 -156410 -306022 38663 -62960 54506
18165 -41796 -43876 -68149 -109560 -107422 -172036 -34646 21273 -101227 -43367 266944 -97007 36922
18152 263386 90338 197149 -117654 51224 28438 108693 569358 -247919 41892 -54049 -138903
18141a38903q804j63861c5133A630J81126n109a83228B1087c38974f1973k89743
18130c51716L8846B14262a07269D05051A50623c04725A40727f415E591a30889
18119B38930a6686D2079J58701a09828H4341b12254a03520B89899c2612o7245
18109i9857k44823J00608N3488r3387A87285p8579n714c2357A898c6050A93106
18097a73925E348K62957k8919A9558a96397c2163q6914e6282D0136g8583B18672
18085B38315r1325L2474J19759B6795f4390A04567J28253A12419h2090F2591K03072
18074B65663p5284a57671e5414K898j25262J6654C9576K34528b61760J21760O8588
18063g1412j76095C58614a27467C9873a73469f3556j13387b0563l6479B49522
$$ plain form
18141 -138903 -147707 -311568 -35133 1630 182756 177647 -183228 21087 -338974 -61973 -351716
18130 -351716 -312870 214262 -107269 405051 150623 -304725 140727 -6415 5591 -130889
18119 238930 -16686 42079 200780 -109828 84341 -212254 -103520 289899 -32612 -99857
18109 -99857 -344680 -244072 -190584 -283971 187285 108706 102992 -32357 1898 -36050 193106
18097 -173925 5348 268305 239386 19558 -196397 -32163 -119077 -56282 40136 -78583 218672
18085 238315 146990 179464 299223 26795 -64390 104567 232820 112419 -82090 62591 265663
18074 265663 190379 -157671 -55414 -52516 -177778 -161124 39576 274104 -261760 -140000 -71412
18063 -71412 -247507 358614 -127467 39873 -173469 -63556 -176943 -20563 -57042 249522
18052b13945C25545a66407A83645m4860n7117g7047j11647A27812a05394C15725
18041b0123G2177J6094a03034B97055F7706b474I3505c61990B95104c06825f5545
18029A37026d00832f9822f595j36814A30284G912a01454l563C43066A53519O8891
18018B22410a4555B24331j03484L54774D3826K6749K1150l5844K66884r5372A00601
18006a54666A30478E0466K81143b33870k82842a64324j13542b7862j65211B28774
17995G085a73055m9483C4459i1057j3262k9913A19770J87909a69338C12958a05545
17983A8560c40763a41696K3308E8097J29556A7093c50277j90250e4254A13656
17972C47845D0774a03726k85291a43437B07596b49997E9188K6983g2288j33872
$$ plain form
18052 -213945 325545 -166407 183645 138785 81668 -77047 -188694 127812 -105394 315725
18041 -20123 72177 88271 -103034 297055 67706 -2474 93505 -361990 295104 -306825 -65545
18029 137026 -400832 -69822 -6595 -143409 130284 7912 -101454 -105017 343066 153519 222410
18018 222410 -14555 224331 120847 475621 43826 70575 91725 55881 322765 227393 100601
18006 -154666 130478 50466 331609 -233870 -516712 -164324 -277866 -27862 -193073 228774
17995 7085 -173055 -222538 34459 -91057 -104319 -134232 119770 307679 -169338 312958 -105545
17983 18560 -340763 -141696 -118388 58097 187653 17093 -350277 -540527 -54254 113656
17972 347845 40774 -103726 -389017 -143437 207596 -249997 59188 86171 -72288 -206160
17962b06160e5229k10014A83488h4020p5914A56833l0982n2946p018J69933a35715
17950a706A13501K71568a84859A98263n5169O4189a75087k724N5280e7681A08654
17938a01800l3946j09985A14703a03449j5162j76217a06297n480K3144C50425
17927A9404f3196i411j56110j30360B2484L21728f0468C4187a0316k94579b5315
17915a39670O1223j05622j18461B09786d58570B7681i4064I8276c03084A31976
17904C82169b33986A24998J08952a1618k02174D9904J81732A108b84065A78742
17893b0240I8329a20008b2280k08842d3979A04961K5170h5943A11809r185J1560
17882A14184d1828o33j29344A59908i9609o0312q7535A98542k368k3243f10A4271
$$ plain form
17962 -206160 -55229 -265243 183488 -84020 -159934 156833 125851 72905 65887 235820 -135715
17950 -1706 113501 385069 -184859 198263 143094 207283 -175087 -177811 -122531 -57681 108654
17938 -101800 -135746 -245731 114703 -103449 -118611 -294828 -106297 -111777 -88633 350425
17927 19404 -63196 -9411 -165521 -295881 22484 344212 -60468 34187 -10316 -304895 -25315
17915 -139670 -78447 -184069 -302530 209786 -458570 27681 -94064 98276 -303084 131976
17904 382169 -233986 124998 233950 -11618 -213792 49904 231636 1108 -284065 178742
17893 -20240 98329 -120008 -22280 -231122 -43979 104961 130131 -85943 111809 102624 114184
17882 114184 -41828 -42461 -171805 159908 -99609 -159921 -247456 198542 196174 172931 -610 14271
17869b74369A68612J86711i1755D57J05433K5391a02351A6504F883J66154a98560
17857D8974K06169a2746A98449C1938K31529A21299a80605c8318o1414d625l8317
17846d2942N603A529K51661E77J45314c49637e6978K0475k2730A53313o2568J69105
17834B59850G6455g5812A63946R8715b4483B11552D7473a18551A03719m2854i361
17822A42013e5673l4010K5153n7576l9606G816f0144j35633g169k00383A65721
17810f4728j90075P0441b0022k33330q993B03722q4234a05246D5457a19078A69272
17798a8284j7997j10756B57839i0371r332A63326J65520e1369B14673a29446A66126
17786b01577B26302a8928A2870P646b1984m553J2472B72485d5273D6004J60695
$$ plain form
17869 -274369 168612 355323 -91755 457 105890 131281 -102351 16504 6883 173037 -198560
17857 48974 255143 -12746 198449 31938 263467 121299 -180605 -38318 -99732 -4625 -42942
17846 -42942 -37339 1529 253190 577 145891 -349637 -56978 -36503 -59233 153313 90745 259850
17834 259850 76455 -75812 163946 262661 -24483 211552 47473 -118551 103719 60865 -9361
17822 142013 -55673 -89683 -64530 -122106 -161712 7816 -60144 -195777 -7169 -207552 165721
17810 -64728 -254803 -184362 -20022 -253352 -262345 203722 119488 -105246 45457 -119078 169272
17798 -18284 -36281 -147037 257839 -90371 -99703 163326 328846 -51369 214673 -129446 166126
17786 -201577 226302 -18928 12870 20516 -21984 -26537 -14065 272485 -45273 46004 206699
17775B06699b40674A79233d6908G2327a6323C2977d2599P955C29476i4301A26239
17763a62205A39700a48859b9507C869a53087m9942A23925O0228c14408A54980
17752F240L49747b21486e3860j00642A36526g3327F6098a15723F6896J23970o0558
17741A30308c7760B23142F7561J81487R139a68885h088A08392K24830A62673F5948
17729E0115P7137h02A16643e1447I7110C0789a87137A75627e01433a57131A5792
17717b01830O8301c9942H8925N9753E3190J87597d3190j01408A96136M3992n7304
17706A82824e6850A14560K2877g809n4079b87A77712a81147a5261A07919g6277
17694B30801a631r1523F8164J50222e4853k15368B85854R1863j77931K7528a02608
$$ plain form
17775 206699 -240674 179233 -46908 72327 -16323 32977 -42599 -34644 329476 -94301 126239
17763 -162205 139700 -148859 -29507 3869 -153087 -203029 123925 184153 -314408 154980
17752 6240 355987 -221486 -53860 -154502 136526 -73327 66098 -115723 66896 190866 130308
17741 130308 -37760 223142 67561 249048 258187 -168885 -8088 108392 333222 162673 65948
17729 50115 127252 -802 116643 -51447 97110 30789 -187137 175627 -501433 -157131 15792
17717 -201830 -133529 -39942 88925 148678 53190 240787 -43190 -144598 196136 240128 182824
17706 182824 -56850 114560 137437 -7809 -61888 -287 177712 -181147 -15261 107919 -76277
17694 230801 -1631 -93154 68164 218386 -54853 -270221 285854 377717 199786 227314 -102608
17682a08264A09399l5916P3596c7066o0B24713c29270E6730K67630c07264A45858
17670I9942J9035Q492M4344K364D6254J77637K1039h1263B5452K05323p9071o3439
17658H8265J74399j13226A7229J73053a42720C6143J24919c166B59077m8918F6892
17646A63833J66051A47227h4508B06710M9457E1205A9513J17044a77337h3289
17635c26744A63310a38108A91853b6739D46188a58635A57331L18087k36131I9549
17624A55297K12539R3916i2957C09476J05678c24828A6451N7970J76623B6467
17613a35819f1396C30579I6502c69550A21516B8307f2879C26587e0834B41571
17602H6503a71766A31303a78782D24967e8065I5716l6107J0180K9159M4681L51234
$$ plain form
17682 -108264 109399 73483 147079 -37066 -37126 224713 -329270 56730 324360 -307264 145858
17670 99942 118977 127469 171813 174177 46254 223891 244930 -81263 25452 230775 151704 88265
17658 88265 262664 149438 17229 190282 -142720 36143 161062 -3166 259077 210159 66892
17646 163833 329884 147227 -84508 206710 256167 51205 19513 136557 -177337 -83289
17635 -326744 163310 -138108 191853 -26739 446188 -158635 157331 475418 239287 99549
17624 155297 367836 461752 -92957 309476 415154 -324828 16451 74421 251044 26467
17613 -135819 -61396 330579 96502 -369550 121516 28307 -62879 326587 -50834 241571
17602 86503 -171766 131303 -178782 424967 -58065 95716 59609 69789 98948 143629 494863
17591D94863h7259C56478A59319B2956J40960a14335A97463a7583A17619B1445
17580b59987C77305A39120J58250q8183D0539f1943C00394p0395B9177L4948k1835
17569D2290J3386J16616b42131B75300A10772e4531H6503K24916f4136C04271
17558C2652K45024I6029J24574G7690J93343n0434J63023D8957j4486J82508b2723
17546I7160L6359k6161K05641L21904A3705J91510n9437j3138l931N1367J62756
17535C42832p8519P1077m9241n1708k0435E6620K17793K53057j50944K20955B78515
17523F69483J7038O72616l34806k10784l49904A98349L33455m5457j14450R7223
17513D69120k00209n2754L7216K0940J55479M92271j426k6960l30311n5028Q3162
$$ plain form
17591 494863 -87259 356478 159319 22956 163916 -114335 197463 -17583 117619 21445
17580 -259987 377305 139120 297370 209187 40539 -61943 300394 229999 29177 64125 42290
17569 42290 55676 172292 -242131 275300 110772 -54531 86503 311419 -64136 304271
17558 32652 277676 96029 220603 77690 271033 220599 383622 48957 34471 216979 -22723
17546 97160 133519 107358 312999 634903 13705 205215 145778 132640 128709 180076 342832
17535 342832 264313 335390 286149 234441 214006 56620 274413 527470 376526 597481 278515
17523 669483 686521 1359137 1024331 813547 463643 198349 531804 486347 371897 469120
17513 469120 268911 216157 253373 274313 429792 922063 920637 893677 563366 508338 591500
17502E91500k12430j50618M6176J13521A54217P9615K22523c083C55329J4150
17492C69479J05124q268a40000A69057L10611A12126n3252r350K61861o8741O1563
17481C04207f7972C53972J69770G8405L66777A33612K68769A43987O2037n07L68407
17470E73924n1574N0579B29140l433N1213J28329j01035a68818C10474p1312c4723
17458E5458a99196B51066J2657p5502N7014L3068I4824M04716j6026r4029J65484
17447E54969k10883l1196L29641k53805J52910M4941B91456J2729L23239k57649
17437C69775K60713J58688l42256o175J29323j98117J64643B24064n7829p5244
17427I0991K29625j17078L41301j67535J52656j12016L78241B22831M12353e5407
$$ plain form
17502 591500 379070 228452 274628 388149 154217 233832 456355 -3083 355329 369479
17492 369479 474603 466335 -140000 169057 479668 112126 58874 49524 311385 242644 304207
17481 304207 -67972 353972 523742 78405 445182 133612 402381 143987 206024 205517 573924
17470 573924 522350 572929 229140 225707 276920 405249 304214 -168818 310474 239162 -34723
17458 55458 -199196 251066 263723 188221 245235 278303 94824 499540 483514 389485 554969
17447 554969 344086 312890 642531 388726 541636 586577 291456 304185 627424 369775
17437 369775 630488 789176 446920 440745 570068 371951 536594 224064 166235 90991
17427 90991 320616 203538 544839 377304 529960 417944 796185 222831 635184 -55407
17416C19522j05944A02996J52178N6677j13008k8542N1300A05496R7854J46183
17406C49533p9847j08889q980D9142L2300G649M7129N29183b235C73546L44j58757
17394B15133M4028m1061K10590A59347J80467j01896J7528r0748L18686q8463
17384C94921J6045J67379E6948B5815h0169C46282A52486L23607k16562J23253
17374C82784A07960b458B65657A24679j7886K51407A25398K66396j70207J53669
17364C75256J9580J39991H695K9752L00021N0439j67549C5703L56701B70a24905
17352A43952P2478k8509J14408L0048K44387B01269o1840C117J93152d9851C38574
17340B17442K42836A05534J28373K62011k37570M60876H8212N69041g723B46635
$$ plain form
17416 319522 213578 102996 255174 311851 198843 170301 221601 105496 203350 349533
17406 349533 269686 160797 151817 49142 81442 7649 54778 583961 -2235 373546 373890 215133
17394 215133 259161 218100 428690 159347 339814 237918 255446 164698 483384 394921
17384 394921 410966 578345 56948 25815 -80169 346282 152486 476093 259531 382784
17374 382784 107960 -2458 265657 124679 106793 358200 125398 391794 221587 375256
17364 375256 394836 534827 8695 38447 338468 388907 221358 35703 392404 270 -124905
17352 143952 216430 187921 302329 332377 576764 201269 139429 3117 196269 -49851 338574
17340 217442 460278 105534 233907 495918 258348 719224 88212 657253 -7723 246635
17329B33030A00289J73617m6924A00545M05101L8515i8766E7853J34632q7271
17319A05214J42050J06700e9056A37814J50426H2685j6218L35212j06761l7292
17309B57626K33174f3830F9558L88476I1971Q3358k269b39244A20316N9732O3610
17298B43658K88793j39124j36496L4937C0011J29588L9009E9140m484L75019J80582
17287F10257B93100K5281A2811J36405J67424G1804O4002L954K78669R6107j83991
17276C30545J73494j28567a20786C04819n6992J79992A49789r177J55581N71629
17266H67822A26110L35035j32365J01111j50608r0842R9420j39995J51796e5688
17255B95649K33537j68544q1154K77678m8896j15534J35951k00026L9888j73575
$$ plain form
17329 233030 100289 273906 226982 100545 505646 544161 -98766 57853 192485 105214
17319 105214 247264 353964 -59056 137814 288240 82685 66467 401679 294918 257626
17309 257626 490800 -63830 69558 458034 91971 175329 173060 -239244 120316 180048 243658
17298 243658 532451 393327 256831 291768 30011 159599 198608 59140 54656 429675 610257
17287 610257 293100 318381 12811 149216 316640 71804 135806 139760 418429 514536 330545
17276 330545 504039 375472 -120786 304819 247827 427819 149789 140612 296193 867822
17266 867822 126110 461145 328780 429891 279283 188441 287861 147866 299662 -55688
17255 295649 529186 360642 279488 557166 508270 392736 528687 328661 368549 194974
17245A94974J79814j20594a07811B96969r2780J82766n3758j27388J06678j18369
17235A94118p7471L13328A77712p9803K36270q5712N41511C47474K52898k50617
17225C49755A15883K11354l6136M8271A63019P597K2554m5405m8164L79594k37650
17214B41545J2377J8743J59295G8918K21797J25701A07575K56297L13580C14012
17203D01662J00728d6202D98939J19971k53096D5853O3201L36541H8865L73627
17193D62492k14300F1312L79136J44754j40564n5454J41204j01900p8350k2970
17183C27168l3887K72852B44712J59323J19693J5021k27661r38N85674l49235
17173E46589K7892A34474P7883K67013B37685p2191N12563l09177N1444J12525
$$ plain form
17245 194974 374788 254194 -107811 296969 204189 386955 333197 205809 312487 194118
17235 194118 116647 429975 177712 97909 334179 248467 789978 347474 600372 349755
17225 349755 115883 327237 291101 339372 163019 170616 193170 147765 99601 479195 241545
17214 241545 253922 272665 431960 78918 300715 426416 107575 363872 677452 314012
17203 401662 502390 -46202 498939 618910 365814 45853 109054 445595 88865 462492
17193 462492 248192 61312 440448 585202 444638 389184 530388 428488 350138 327168
17183 327168 293281 566133 244712 404035 523728 538749 311088 310150 895824 546589
17173 546589 574481 134474 212357 479370 237685 165494 678057 368880 420324 532849
17163E32849D248L29714n548D9739L96739M497J49805R4594C34447L70713B44498
17151E81587N6096B98433J71814J22951n3778j77464J49416j8472P8016N6371
17141F27287l4301O5056l03551M9706A84368L85362j04079L9287L60888A35169
17130B65977L13028j26375p9044l8919Q2590K5178K31557j94739n753j7624J10030
17119E65906q5242N4214J26088k18551P890J24387K3444n8161A45457P34615k51012
17108F29060r040K199j10192j22735M38207C78298p5304L69809Q7672C38975K60522
17097E99497p9933M40481C95902L51769C38067J73891B09889M49689J02112j5929
17087G45761k39037j0504J97732n2118J52567j34626k99922J05650K69950M679
$$ plain form
17163 532849 4248 333962 328414 49739 446478 450975 600780 695374 334447 705160 244498
17151 581587 637683 298433 470247 593198 539420 361956 511372 492900 570916 627287
17141 627287 592986 658042 354491 404197 184368 569730 465651 504938 865826 135169
17130 265977 579005 452630 373586 334667 417257 442435 673992 479253 473500 455876 565906
17119 565906 480664 534878 660966 442415 450305 574692 598136 539975 145457 880072 629060
17108 629060 620020 622219 512027 389292 827499 378298 302994 672803 760475 338975 599497
17097 599497 519564 960045 395902 747671 338067 511958 209889 659578 761690 745761
17087 745761 506724 496220 693952 641834 794401 659775 359853 465503 735453 740132
17077G40132j30888j0704L42564k50572J79692k71603o323P3643L6684q463J08913
17066H03075j47287r6717L63595k16525m235J25104J10886k56627K16466m2091
17056H55644J3547D33379J99683M868L61032j22924o8384M9479l23588N03120
17046A036665n8817m02598L38203J73362k70844J26197p5902K34947E41605L42654
17036H84259K36774q6018n3447j62947N8693L45156j83117K19390n02757N1867
17026H07853j0881K85383j07930j29962l35738L15690N9171K90436j00554k12768
17016H60700L34228k75147j31115J64768j7920K57227q077j35715j64662p7735
17006H06552N44373r3905l59119K68053j37526J64078k62735n7641L66209E62757
$$ plain form
17077 740132 609244 598540 941104 690532 870224 598621 592298 665941 702625 694162 803075
17066 803075 655788 559071 922666 706141 701906 827010 937896 681269 897735 855644
17056 855644 869191 433379 633062 637930 998962 876038 807654 857133 533545 1036665
17046 1036665 977848 575250 913453 1086815 815971 942168 866266 1101213 541605 884259
17036 884259 1121033 1035015 981568 818621 877314 1222470 1039353 1258743 755986 807853
17026 807853 796972 1082355 974425 844463 508725 824415 883586 1174022 1073468 860700
17016 860700 1194928 919781 788666 953434 935514 1192741 1184664 1048949 884287 806552
17006 806552 1350925 1257020 897901 1165954 1028428 1192506 929771 872130 1238339 562757
16995A592306m54591o8959l6644M5221K7590M8871K02587l21224R2063L4246J0633
16984A172099J29420l4231J00052m99533O43614j20687n0424k01774P5228K48988
16974A462752j58436r8997M4483p2662M0086L67921k00707j08838K03856l41897
16964A137561K69580m12008M11982L58864m54785M53992l31687j47161M74595
16955A760933l96021J66997k09561L04032k92497J55215k6L56436l03355J60301
16945A702454Q3j50905n177j15997K34325K82953l72972N4001K05827k550k77940
16934A554102M52792j80363K70850l19624O2868l20133j41599M63776J05304j39795
16924A808178L7640J9617k32469K71047P8902l33609K74294P8886R0873J00125
$$ plain form
16995 1592306 1137715 1068756 1032112 1077333 1104923 1153794 1356381 1035157 1127220 1161466 1172099
16984 1172099 1301519 1267288 1367340 867807 1511421 1390734 1340310 1138536 1213764 1462752
16974 1462752 1304316 1205319 1249802 1177140 1217226 1585147 1384440 1275602 1479458 1137561
16964 1137561 1407141 995133 1407115 1765979 1311194 1765186 1433499 1286338 1760933
16955 1760933 1364912 1531909 1322348 1626380 1333883 1489098 1489072 1845508 1542153 1702454
16945 1702454 1702537 1551632 1546455 1430458 1664783 1947736 1574764 1628765 1834592 1832042 1554102
16934 1554102 2006894 1826531 2097381 1777757 1840625 1520492 1378893 1842669 1947973 1808178
16924 1808178 1845818 1865435 1632966 1904013 1982915 1649306 1923600 2002486 2093359 2193484
16914B193484J25243n945j89628R2372j09308K20070J92205l73978J23988M26377
16904B694880l98896K1653L29049k56345M6435K40491l7954k59913L73544J06772
16894B859716o7642j79460L7876M24182k93861K4728j73252L50305J16750j21639
16884B977703O8900R3350l7221K88852n32575M36602j76191K25210J88129j54559
16874C378200R1099J01279n743k58398N48318j50898J9470p7355K48007j69226
16864C724753J08550J50900k7029K31572j65779K41747m374J21073J80685k49488
16854D312610k80820N33839K8484k33838N42768k89905r69k6042L04795Q9389
16844D980311j04082K89499j1305P0576k9640J66983J97023L59076k32581L3877
$$ plain form
16914 2193484 2318727 2312782 2123154 2215526 2106218 2326288 2518493 2144515 2268503 2694880
16904 2694880 2295984 2317637 2646686 2390341 2436776 2677267 2639313 2379400 2752944 2859716
16894 2859716 2792074 2612614 2650490 3074672 2780811 2805539 2632287 2982592 3099342 2977703
16884 2977703 3046603 3139953 3102732 3391584 2859009 3295611 3119420 3344630 3532759 3378200
16874 3378200 3469299 3570578 3564835 3306437 3854755 3703857 3723327 3645972 3893979 3724753
16864 3724753 3833303 3984203 3957174 4188746 4022967 4264714 4260340 4381413 4562098 4312610
16854 4312610 4031790 4565629 4594113 4360275 4903043 4613138 4612169 4586127 4890922 4980311
16844 4980311 4876229 5165728 5154423 5224999 5195359 5362342 5559365 5918441 5685860 5719737
16834E719737M25714k17152M94336j58885J92350p5123K12453k0153K35384K08947
16824G017608J54647N2548j24407O28841J52845L1425n892K37950L86929k46756
16814H285738M30866J35601N18941K10847j27852k1526N28178p8960L25586O35493
16804A0842912J90126L37483k02899L10528K51970K84259O51641m9559N0443L6412
16794A2703316P90975M88927L67801O8047M55519M78376K77186N69177N17715
16785A6717039K46616R93937p4420M68233O21220N72296O56544M13344O90266
16776B1305075J001515K35656O63306Q33085Q52813N20611R21296R14235P29745
16767B7977337J046215J046514R72279J289292R83752J337408J145014J408480
$$ plain form
16834 5719737 6145451 5928299 6422635 6263750 6456100 6380977 6593430 6573277 6808661 7017608
16824 7017608 7172255 7224803 7100396 7729237 7882082 7913507 7907615 8145565 8532494 8285738
16814 8285738 8716604 8852205 9371146 9581993 9454141 9432615 9960793 9881833 10207419 10842912
16804 10842912 11033038 11370521 11167622 11478150 11730120 12014379 12666020 12616461 12666904 12703316
16794 12703316 13494291 13983218 14351019 14419066 14874585 15352961 15630147 16199324 16717039
16785 16717039 16963655 17957592 17883172 18351405 18972625 19544921 20201465 20614809 21305075
16776 21305075 22306590 22542246 23205552 24038637 24891450 25412061 26333357 27247592 27977337
16767 27977337 29023552 30070066 31042345 32331637 33315389 34652797 35797811 37206291
16759C7206291J231496J626024J655107J410834J579086J662329K045828J760320
16751E0177315K125473K203994K156488K252040K695044K601897K572708L175264
16743F9960223K637692K990275L359846K907056L731425L326426L644072L739705
16735I6296720L727374L579940L709147L845345L609991L827825L220930L418284
16727A25235556L337041K632767K813218J923359J778038J611988J005194M17626
16719A40754787K9673n23932o48247j695663j607201k232371k764592k789033
16711A28523421k930687l444070l989224l276250m105388l442188l797682l792054
16703I9745878l953255l520070l703220l631419l573437l352393k988601l493692
$$ plain form
16759 37206291 38437787 40063811 41718918 43129752 44708838 46371167 48416995 50177315
16751 50177315 52302788 54506782 56663270 58915310 61610354 64212251 66784959 69960223
16743 69960223 72597915 75588190 78948036 81855092 85586517 88912943 92557015 96296720
16735 96296720 100024094 103604034 107313181 111158526 114768517 118596342 121817272 125235556
16727 125235556 128572597 131205364 134018582 135941941 137719979 139331967 140337161 140754787
16719 140754787 140784460 140260528 139612281 137916618 136309417 134077046 131312454 128523421
16711 128523421 125592734 122148664 118159440 114883190 110777802 107335614 103537932 99745878
16703 99745878 95792623 92272553 88569333 84937914 81364477 78012084 75023483 71529791
16695G1529791k775364k901238k630781k645206k288366k423149k581669k122190
16687E1161828j899890j702080k120687j745663j578836j727384j333915j729373
16679C7324000j340910j165060j105440j614124p76712j242136q48167j199616
16671B8031835p71584p23848j196752p66390o16906r48548n57847p10667n32205
16662B1207088p00496r64591j45503l85567p14104p72291l97651k97451n70563
16653A6258871o44757k21090m93322r6676m78892n7764p55224l25658n28322o7587
16643A2589579n02020l39376r0153k89257l73479j57833O063m23972K18237n40406
16633A0097383m36867j45249j48721j79105r2259k90861m24616j04169j17840
$$ plain form
16695 71529791 68754427 65853189 63222408 60577202 58288836 55865687 53284018 51161828
16687 51161828 49261938 47559858 45439171 43693508 42114672 40387288 39053373 37324000
16679 37324000 35983090 34818030 33712590 32098466 31321754 30079618 29231451 28031835
16671 28031835 27260251 26536403 25339651 24573261 23956355 23007807 22449960 21739293 21207088
16662 21207088 20506592 19542001 19396498 19010931 18296827 17524536 17126885 16829434 16258871
16653 16258871 15614114 15393024 14899702 14803026 14324134 14266370 13511146 13185488 12657166 12589579
16643 12589579 12087559 11748183 11658030 11368773 10995294 10837461 10843524 10419552 10637789 10097383
16633 10097383 9660516 9515267 9366546 9187441 9095182 8804321 8379705 8275536 8157696
16624H157696p9676j71748M7163l83160R663k10359q0374l05459q5659j18052
16614F780035k02458K37055k72256L614r8512k56449q0548j39022K6009m03814
16604E593654J66178l13439N8718J57421k63898m76183N39234p76183L50101k02953
16594D832650j5820J15324l72629N6386l29336K23414j59398J04355j16784j97559
16584D140603r7709K84166o54361M82300n2593l51448k98057K65759Q6304k5908
16574C779056m53209N36111l39130q4352p8497n0396J20457m18158M32072m94968
16564B948986J6378K51246n0410j32900j62478J09439Q4410l87126J97751l45441
16554B529855J70851J35705k43913J52833K120k7269k81014J77957l32941J24880
$$ plain form
16624 8157696 8078020 7906272 7953435 7570275 7579938 7369579 7289205 6983746 6898087 6780035
16614 6780035 6577577 6814632 6542376 6545990 6447478 6191029 6110481 5971459 5997468 5593654
16604 5593654 5759832 5446393 5505111 5662532 5398634 4922451 5461685 4685502 5035603 4832650
16594 4832650 4816830 4932154 4559525 4615911 4286575 4509989 4350591 4454946 4338162 4140603
16584 4140603 4042894 4327060 3672699 4154999 4102406 3750958 3452901 3718660 3804964 3779056
16574 3779056 3325847 3861958 3522828 3438476 3359979 3309583 3430040 3011882 3443954 2948986
16564 2948986 2965364 3216610 3166200 3033300 2870822 2980261 3064671 2677545 2875296 2529855
16554 2529855 2700706 2836411 2592498 2745331 2747451 2720182 2439168 2617125 2284184 2409064
16544B409064R8449J8626O9804m78363K53999P0181j49117J03495j74124j37043
16534B084971J64987j367m9165k08629M75632l66792k54503J09471j59986J95310
16524A989929k12948J83006Q5445J88688j82202o1192J56107o04804L74956k77739
16514A639246m7321j18567O05886k89161k95441r869O26598k38801k87089j58070
16504A427411K1853L23519N3804l14881j56611R0629L31337j77016k49683M84340
16494A834702l52938l7062p8497m9319J80240j25750o4776k57273K83109J40966
16484A473402J18539j35662r3116J84304k53638l60676L53775J36935l00620R2969
16474A216212q0828L9889R0207q8786J36648l5865J67801j66774k32950L38650
$$ plain form
16544 2409064 2507513 2526139 2595943 2117580 2371579 2441760 2292643 2396138 2222014 2084971
16534 2084971 2249958 2248591 2199426 1990797 2466429 2099637 1845134 1954605 1794619 1989929
16524 1989929 1776981 1959987 2045432 2234120 2051918 1990726 2146833 1542029 1916985 1639246
16514 1639246 1591925 1473358 2079244 1790083 1494642 1484773 2111371 1872570 1585481 1427411
16504 1427411 1449264 1772783 1826587 1511706 1355095 1445724 1777061 1600045 1350362 1834702
16494 1834702 1481764 1444702 1366205 1316886 1497126 1371376 1306600 1049327 1332436 1473402
16484 1473402 1591941 1456279 1363163 1547467 1293829 933153 1286928 1423863 1123243 1216212
16474 1216212 1135384 1175273 1265480 1176694 1313342 1277477 1445278 1278504 1045554 1384204
16464A384204j16906j11438N2642J8226l12308J42154m3424j6746K11177L5278
16454A242859k35511m34151M78814J654m15781L57294K59104m9943k58688j43461
16444H02190M30749j07670p5576m9894j74515p5772J31801O7402J6167k13302
16434G51580J84117o7916K5802M6159M31320n87859q1107J4522L93303k28564
16424H81357j03281k90319L35596p1198Q9759J59218K54192n24139J37823j73180
16414F95828K41881k28654J45977J89746J1982k97126k17837L61603p8160o3010
16404G62230j22066n1638J56285k83740J57182k01081L59828k7697j91250L21564
16394H79617C90887M05630O739J95462C54156J10735K47175P071p3881k61804
$$ plain form
16464 1384204 1267298 1155860 1208502 1226728 914420 1056574 1013150 996404 1207581 1242859
16454 1242859 1007348 573197 1052011 1053665 637884 995178 1254282 1204339 945651 802190
16444 802190 1232939 1125269 1049693 999799 825284 749512 881313 948715 964882 751580
16434 751580 935697 867781 893583 939742 1371062 783203 702096 716618 1109921 881357
16424 881357 778076 487757 823353 752155 841914 1001132 1255324 731185 869008 695828
16414 695828 937709 709055 855032 1044778 1056760 759634 541797 903400 825240 762230
16404 762230 640164 588526 744811 461071 618253 417172 777000 749303 558053 879617
16394 879617 390887 796517 803256 998718 354156 464891 712066 719137 645256 383452
16384C83452K5624r657M49486m19745K29339L84405k63711p8308r1701J10512
16374G19696j75004P6067j96014N3672K33026K44581k07368J44518l04871K25734
16364H14037j73204k27893Q7944K79099r2040j88021J3301P2792n8000p3584K36315
16353F90746p5507K17027p6786l38654J39528B48114J55380J8310J29624o1696
16343D89732K30621C20628j11863M75753l2793j72793J80583k14250J05741q1318
16333D69688B03128L28970K5177j39494L1595j23663K94791j05533J13550B09196
16322F39275B92363K46745J14084j56844J01341j59792K9294K30519B04226M47685
16312F51911k74735R1939m8631K04621j22004j97709j25855K54910J0937M7299
$$ plain form
16384 383452 409076 399419 848905 429160 658499 1042904 779193 700885 609184 719696
16374 719696 544692 620759 424745 478417 711443 956024 748656 893174 588303 814037
16364 814037 640833 412940 500884 779983 687943 499922 513223 586015 528015 454431 690746
16353 690746 615239 832266 755480 416826 556354 248114 403494 421804 551428 489732
16343 489732 720353 320628 208765 684518 651725 478932 659515 445265 551006 469688
16333 469688 203128 532098 557275 417781 449376 325713 620504 514971 628521 209196
16322 639275 292363 539108 653192 496348 597689 437897 467191 697710 204226 651911
16312 651911 377176 469115 420484 625105 503101 305392 179537 434447 445384 492683
16302D92683j93444K83053A72272L23833j46956K10084k08888j02113P5371J1161
16292C34764K37900j04963n1617j47614K26842B32425n3456J94095K09806k19924
16282C62946F543L68103K18303B269J41027L20423n8222j1396k667j06258j01600
16271A83576I0246L09781j20026M10326C01049K00537L626M248j57407j48821
16261B03232C3988Q6452K99519P6129B38957q646J9583M6143j05879m8307K40419
16250C82270l0403K72492B95685l0531A15665J60302O1529H3732K67044J61290
16240E12066J6127A37219J76678A26203a3538B05586L35007r4176j92401m6478
16230B07538a594F3743K27720K1916I8894J40177J79965j99595D1188L00477A43341
$$ plain form
16302 492683 299239 582292 172272 496105 349149 559233 350345 248232 323603 334764
16292 334764 572664 467701 416084 268470 495312 232425 178969 373064 582870 362946
16282 362946 6543 374646 592949 2269 143296 463719 405497 394101 391434 285176 183576
16271 183576 90246 400027 280001 690327 301049 501586 505212 509460 352053 203232
16261 203232 33988 120440 419959 496088 238957 230311 249894 296037 190158 141851 382270
16250 382270 351867 624359 295685 265154 115665 275967 337496 83732 350776 512066
16240 512066 528193 137219 313897 126203 -13538 205586 540593 446417 254016 207538
16230 207538 -1594 63743 291463 313379 98894 239071 419036 219441 41188 341665 143341
16218D28144F3972a8756D16789j72215J53390c6012B21919N343F6097R0082R687
16207A65866J025R7302J65734A58340b02869B37543a0223G9362J98075D751L5009
16196C9760M13387A40508q718K22274I2569J8161m1541A4733J21877a65706C21028
16184A53689a8559C39012R3796j99092F4572K81023j59492C9153K02714A17952
16173C02786Q38J51475A69138g6372B42825j13123L15113j61897J7180q3023A5290
16161a16795A65908O3252a21172J8490H3354N1229L23873j9432B1188k143L29436
16150C48481e3289A44674i1145B21051J16622e352q7139j09441d5699J299j38990
16139a83390B00183B3147R543P7950m3511J25944G1126K33153I8251R2239H0884
$$ plain form
16218 428144 63972 -18756 416789 244574 397964 -36012 221919 227262 66097 156179 165866
16207 165866 166891 264193 429927 158340 -202869 237543 -10223 79362 277437 4751 39760
16196 39760 453147 140508 131790 354064 92569 110730 69189 14733 136610 -165706 321028
16184 153689 -18559 339012 432808 233716 64572 345595 186103 39153 241867 117952
16173 302786 303624 455099 169138 -76372 242825 129702 444815 282918 300098 217075 15290
16161 -116795 165908 229160 -121172 -102682 83354 134583 458456 439024 21188 19045 348481
16150 348481 -53289 144674 -91145 221051 337673 -5352 -92491 -201932 -45699 -44400 -183390
16139 -183390 200183 23147 32690 110640 67129 193073 71126 304279 98251 190490 80884
16127a27975G511K56471D2396f3061A85811b6940A30037a24849A85906a54631
16116h5029E8213i149j0894C56470H7448a69181d3853a7597D0642K92162a17546
16104e4776A20174b8768H6725a77942F6933Cb75296H5928b87316h2581H3886J07811
16092A91697k8216f9133C9566J73347A01653L70a47943A41434a32253A91291H3295
16080B2713a4325q9854A52493i5462B86786f2194A86057J0516K6565n8184C6860
16068C95256C1662J77181G3908N9652L62363h8381A86245C8887b83334A69387
16057a89804R709A53716P132J72151B3280K11966M0096g5284j10966a8761A66089
16045e6373C01451A31582J52000K19644h9431G7678J06432j746m9873i7273c226
$$ plain form
16127 -127975 7511 263982 42396 -63061 185811 -26940 130037 -124849 185906 -154631
16116 -85029 58213 -9149 -20043 356470 87448 -169181 -43853 -17597 40642 332804 -117546
16104 -54776 120174 -28768 86725 -177942 66933 3 -275296 85928 -287316 -82581 83886 191697
16092 191697 163481 -69133 39566 212913 101653 102023 -147943 141434 -132253 191291 83295
16080 22713 -14325 -104179 152493 -95462 286786 -62194 186057 196573 223138 164954 36860
16068 395256 31662 208843 73908 133560 495923 -88381 186245 38887 -283334 169387
16057 -189804 -180095 153716 160848 332999 23280 235246 275342 -75284 -186250 -18761 166089
16045 -56373 301451 131582 283582 503226 -89431 77678 184110 182364 132491 -97273 -3226
16033A23289d4814B92048I9637C7108f8231r167E7885h523k26829B06261o8392
16022A37869a16628M5570A70630a80580A92732b04761h0846a5587A78505a55749
16011G2986Q74a56737A83052p3156k0307N4222L0749O963B2331J6806b10933M9867
15999a61066I0427e3110A13917c3780A79369e9543j63355C18538b87312F6012
15988C44507A59299K70350K56652M37998K58568n61286J17481k96507k90261O0148
15978D12442A74012N7206d9029j27442a1056D32763a27199A33212a30712C62464
15967B48516E6345K87982E6113M5771a50326C74625C5652g2256j38253D2986N79819
15956F22805b85083B81281a59985C8383L69235A45516a86824A38824f1415l1927
$$ plain form
16033 123289 -44814 292048 99637 37108 -68231 -77398 57885 -8523 -235352 206261 137869
16022 137869 -116628 -71058 170630 -180580 192732 -204761 -80846 -15587 178505 -155749
16011 72986 73860 -156737 183052 109896 89589 143811 174560 181523 22331 39137 -210933 -161066
15999 -161066 90427 -53110 113917 -33780 179369 -59543 -222898 318538 -287312 66012
15988 344507 159299 429649 686301 1124299 1382867 821581 939062 642555 352294 412442
15978 412442 174012 231218 -49029 -176471 -11056 432763 -127199 133212 -130712 362464
15967 248516 56345 344327 56113 101884 -150326 374625 35652 -72256 -210509 42986 622805
15956 622805 -285083 281281 -159985 38383 407618 145516 -186824 138824 -61415 -93342
15946i3342n1148M6619A56691l6945n1086i8174B07006f42l00565A36435a52915
15934a14294j03705I2419C7135a94312D1953Q4062a24432A32070J25292A01090
15923a56850E6902A3419J7077b08567l12163D246Q6978O647b37551B12481f083
15911b31998B08161a68327A78366b96317B35249a61242N1550B32343b95237C66070
15900H7902a38922B64618M3281C3040J49271c5255H1742h2310k9490L8016l4943
15889a08727l6585G519J34691i8727I8440C1738N6286b3295p3604B72273H2943
15877D461N262a58106E1091a21477b2587k40241K5264O1322A06995D6018F172
15865a29967N1256F6587b03427q0074A35432i0441J1988A23900a11580k03539
$$ plain form
15946 -93342 -144490 -97871 156691 119746 68660 -98174 207006 -642 -301207 136435 -152915
15934 -114294 -217999 92419 37135 -194312 41953 126015 -124432 132070 257362 101090
15923 -156850 56902 13419 30496 -208567 -520730 4246 91224 97871 -237551 212481 -6083
15911 -231998 208161 -168327 178366 -296317 235249 -161242 -109692 232343 -295237 366070
15900 87902 -138922 264618 307899 33040 182311 -35255 81742 -82310 -111800 -73784 -108727
15889 -108727 -145312 7519 142210 -98727 98440 31738 88024 -23295 -96899 272273 82943
15877 4461 9723 -158106 51091 -121477 -22587 -262828 -237564 -176242 106995 46018 6172
15865 -129967 -78711 66587 -203427 -283501 135432 -90441 -78453 123900 -111580 -315119
15855c15119N3635e0961C00249a10038G6183d7140p2057A14765c50528J28749
15845b21779A57443c90245C9831R5649N0499M4174h5850A99614a87103n2566C77988
15833H9190h4243L542k14513J01758H8957a13817A52164l4654a0386E9433c02587
15821i187l96966A39652n5098k4020d41503a04418B92234a66601g4127B49728
15810A60150b27025P1748H9065a71692N0709J7284I5849b3192j10497I4956b04828
15798f4018J1034j77194J0410E1901J0987d2486r5043A93650k1812m2535a83977
15786d2828o8843j13351L2239h6162H2035c33803m2590H0397b3205A32041b4704
15774I0427a14461B01949O1168f4644o6483G191f3727k06680f3521j5500l8701
$$ plain form
15855 -315119 -261484 -50961 300249 -110038 76183 -47140 -119197 114765 -350528 -221779
15845 -221779 157443 -390245 39831 135480 185979 230153 -85850 199614 -187103 -239669 377988
15833 89190 -84243 -80701 -295214 -193456 88957 -113817 152164 117510 -10386 59433 -302587
15821 -9187 -406153 139652 84554 60534 -441503 -104418 292234 -166601 -74127 249728
15810 160150 -227025 -155277 89065 -171692 -120983 -103699 95849 -23192 -133689 94956 -204828
15798 -64018 -52984 -230178 -219768 51901 62888 -42486 -137529 193650 171838 129303 -183977
15786 -42828 -111671 -225022 -192783 -86162 82035 -333803 -376393 80397 -23205 132041 -24704
15774 90427 -114461 201949 263117 -64644 -131127 7191 -63727 -270407 -63521 -79021 -117722
15763a17722a9660L582A77888E9550a05164B6029N104J2300a5982B8K10796a8466
15750B7287b2984A08860M12a9406A37239c8620A52398g3622k10885a3688I975
15738H5941b3293o231j89701g7220c2729l1903N793D5975c6199l7358l1878M4790
15726f0645j22318B10934M3830e2100m38310a72784q3024e6183F2829M4484K43563
15715C50876j53080B5452J62338B2215b17224F1884A3650R019O3493N0043h5759
15703E4020a00173L9443k30326e8031p9658A94765E2397b23335B9704c05856f2945
15691A56551A429a21647H4001a76569B77864m3369a85362A92861o154H8608k6288
15680F2320J15633i0046k50939a40270A9244Q0639D8969b35850e6216B8670e034
$$ plain form
15763 -117722 -19660 -16078 177888 59550 -105164 26029 31133 43433 -15982 28 210824 -18466
15750 27287 -22984 108860 109272 -19406 137239 -38620 152398 -73622 -284507 -13688 9975
15738 85941 -23293 -29524 -219225 -77220 -32729 -64632 -58839 45975 -36199 -73557 -105435 -60645
15726 -60645 -182963 210934 254764 -52100 -490410 -172784 -255808 -56183 62829 107313 350876
15715 350876 197796 25452 187790 22215 -217224 61884 13650 22669 86162 136205 -85759
15703 54020 -100173 -60730 -291056 -58031 -137689 194765 52397 -223335 29704 -305856 -62945
15691 156551 1429 -121647 84001 -176569 277864 234495 -185362 192861 186707 88608 62320
15680 62320 177953 -90046 -340985 -140270 19244 99883 48969 -235850 -56216 28670 -5034
15668a7031D01638a98245Q2948k0354k602A80441g3952j46579B28326n7150a05712
15656a76625j1301L7777l55759a8762F2773b08104A41948D2821b75266B8391f7754
15644a79043l26681A00523a00261B35601N968C9186Q5837b20776Q8036G5452b8901
15632a26454l3672G2183N8725c98000B1419d90628a91757j314A46584c09122A42372
15620D0600b38290K9643k531b2881o1912L5860A79316b41806a8619p4515q4565
15609a77699A60721D0209Q0302A4585f5148p8834j80282J22055a6923I4568A1150
15597c13823d3816q7028L3929k64542b1385j53273K3758e9836A35928a37017j73300
15586c10317c6325f027m7805o6636j81767P7784a10151B07190m4955a74736b9615
$$ plain form
15668 -17031 401638 -198245 -115297 -135651 -138253 180441 -73952 -220531 228326 171176 -105712
15656 -176625 -187926 -150149 -505908 -18762 62773 -208104 141948 42821 -275266 28391 -67754
15644 -179043 -505724 100523 -100261 235601 241569 39186 125023 -220776 -132740 75452 -28901
15632 -126454 -160126 72183 130908 -398000 21419 -490628 -191757 -193071 146584 -309122 142372
15620 40600 -238290 -208647 -211178 -22881 -84793 -48933 179316 -241806 -18619 -93134 -177699
15609 -177699 160721 40209 120511 14585 -65148 -143982 -324264 -202209 -16923 94568 11150
15597 -313823 -43816 -130844 -96915 -361457 -21385 -174658 -150900 -59836 135928 -137017 -310317
15586 -310317 -36325 -6027 -53832 -120468 -302235 -224451 -110151 207190 162235 -174736 -29615
15574C57582i954k76644Q0521L4686C7468d5602j35239G0657i2661D0432j2142
15563B8290a186m4646j5266E6739i0761e537j3130E81755A33914b2023j1208p9185
15551a12416B05873F8072l0444a4254C1594K40127n5301h7825J5368a7235o4577
15540h1812j68690a2869A7156M5030J89347e3126k38063e7600F1652b9071C45348
15528C2852a20491A80194a90554J9958f9969i728A37043b9414J4404B08421K0825
15517B29246q5906b03447a0998C11163J43482j96744A11667P7282H3973M4520
15507A28493i3991K9934B06757J02589H0154a57142D89301d81975B39107A18136
15496g0964D0953b10458a35l56990A31320o729e0551j01165B13059a77333B36761
$$ plain form
15574 357582 -9954 -286598 -206077 -171391 37468 -45602 -180841 70657 -92661 40432 28290
15563 28290 -1186 -45832 -61098 56739 -90761 -5537 -18667 581755 133914 -22023 -33231 -112416
15551 -112416 205873 68072 37628 -14254 31594 271721 216420 -87825 -72457 -17235 -81812
15540 -81812 -250502 -12869 17156 62186 251533 -53126 -291189 -57600 61652 -29071 345348
15528 32852 -120491 180194 -190554 -170596 -69969 -9728 137043 -29414 -15010 208421 229246
15517 229246 143340 -203447 -10998 311163 454645 257901 111667 188949 83973 128493
15507 128493 -93991 -64057 206757 309346 80154 -157142 489301 -481975 239107 118136
15496 -70964 40953 -210458 -135 -357125 131320 124591 -50551 -151716 213059 -177333 236761
15484A30130B973c7871J2117M599j51993j7240A72777o6063J28572j0242B7492
15472B55413K78786n3763o5184n0932d5873A41397k7651j972b044A77789Q9491
15461B67280l9444k6889I0898a3627B44048a30598B3538A1601c1056C0620J46078
15450A76698c39181A5572J39624c72082A32527n3877Q9083B9832M97507P823M48570
15439I83732P1951N7448C90698J71211A42983C1181Q89J31994J70531b36318A68677
15427a73511E623J06772g1483C590P1187B472b2032e640k04078O0655E20107i4067
15414A05959L3194e5176A46250l3b00416k0130h5245j72296J3452i0544A82344
15402F3595N4921c2104j91468k1062J044C3357K37683r6754e011j0748r0624M0097
$$ plain form
15484 130130 2973 -37871 -25754 -21155 -173148 -190388 172777 106714 235286 225044 27492
15472 255413 534199 480436 415252 364320 -45873 141397 113746 111774 -2044 177789 267280
15461 267280 227836 200947 90898 -13627 244048 -130598 23538 11601 -31056 30620 176698
15450 176698 -339181 15572 155196 -372082 132527 78650 167733 29832 527339 535162 983732
15439 983732 1055683 1113131 390698 561909 142983 31181 32070 164064 334595 -236318 168677
15427 -173511 5623 112395 -71483 3590 74777 2472 -22032 -5640 -209718 -149063 520107 -94067
15414 105959 139153 -55176 146250 146217 -200416 -220546 -85245 -257541 -244089 -90544 182344
15402 63595 118516 -32104 -223572 -244634 -243590 33357 271040 174286 -5011 -15759 -106383 -66286
15390f6286j20549B91554B8050L39208b00118D1273p339c2836k32207d9358r998
15379e9356k80403B2684J47631M6587d0193E64398A23927C4091J41918P2109K2641
15368B70759A14561J33690B0812L73191B5451L36926F187e3549C06032A27737
15357a06419C06574L8j13759h2202A3857J29562J72305n0398A32219J46691C6105
15345B55265K37940k37979o4234M1640L82531j20276i2215C69481a10442B74497
15334A85946a64450B77725A3064g815D5423K13896j19344a39767C2698K17180
15324B49878a30928B35790J7366a68474A05201L89701k02961A07681J12513J2138
15314B32332j5220B1836J33724K73280b9199A3773L42822d8181q9791A33578a12690
$$ plain form
15390 -66286 -186835 291554 28050 367258 -200118 41273 33934 -32836 -265043 -49358 -59356
15379 -59356 -339759 22684 170315 216902 -40193 564398 123927 34091 176009 248118 270759
15368 270759 114561 248251 20812 394003 25451 362377 6187 -53549 306032 127737
15357 -106419 306574 306612 192853 -82202 13857 143419 315724 265326 132219 278910 36105
15345 255265 493205 255226 190992 232632 615163 494887 -92215 369481 -110442 274497
15334 185946 -164450 277725 13064 -7815 45423 259319 139975 -139767 32698 249878
15324 249878 -130928 235790 253156 -168474 105201 494902 291941 107681 220194 232332
15314 232332 217112 21836 155560 428840 -29199 13773 356595 -48181 -137972 133578 -112690
15302D0757d617G17258C1009N4923J89127H1131a06343A96308P6691J04063C2716
15290c14066L5894B31325B7633P3427L47072e5781k84n2183k36072G8232P0387
15279A48619P898K82205j31566i1322B4501O7928k7126R7206i7479C9174L69214
15268D08388E433c5087F7140a6107k68459a36662D5670J40294a18670A96618J36759
15257C33377a12017B51462j10427D645J65473L750Q0354m1657N9812H5457N1896
15246A37353J20142O12809M69754P35307o88002N97817p65368C17700n4813K64501
15236E27388a85777C6952E007O1276j3583b49184e7927m5811C21057b2171n33
15225b2704l8236A79729H7564D605d5891A41761O8463F1174J84236A1801a87735
$$ plain form
15302 40757 -4617 717258 31009 85932 275059 81131 -106343 196308 272999 377062 32716
15290 -314066 -278172 231325 27633 101060 448132 -55781 -56065 -108248 -344320 78232 148619
15279 148619 156517 438722 307156 -91322 24501 92429 65303 162509 -97479 39174 408388
15268 408388 5433 -35087 67140 -16107 -284566 -136662 45670 185964 -118670 196618 333377
15257 333377 -112017 251462 141035 4645 170118 173868 254222 212565 272377 85457 137353
15246 137353 257495 870304 1340058 2075365 1387363 1985180 1219812 317700 262887 527388
15236 527388 -185777 36952 5007 66283 52700 -249184 -57927 -103738 321057 -22171 -22704
15225 -22704 -60940 179729 87564 4605 -45891 141761 210224 61174 245410 11801 -187735
15213A88927K3144A4007K58605N9223a40451A03497c6126A07374C2672j3990J34473
15202A53155a56643K1776C14544j20535a07875A3045K7550J03598f6826B77662
15191B31500a133B05704A1550P5394K2798B9003J28488F557J17176j8831a52274
15179A96219m888m9933P3771g6471A33594A8139l94O9822b45148j60877D16081
15167d7992A3986L02990a23641i423A48796G2665Q6825B089N2787b5244j25420
15156a50664f4206J4788B09373l8492o1827l0496a4951G8141A6467O7031J57726
15145B41224J15367D9775g7727C21530j1993c6338A29561M2547k2176b89451A90239
15133C61463i5731D2160J03218P3130c3982B42804i1813C39796g3400a7548C69146
$$ plain form
15213 188927 212071 14007 272612 331835 -140451 103497 -36126 107374 32672 18682 153155
15202 153155 -156643 -134867 314544 194009 -107875 13045 40595 144193 -66826 277662
15191 231500 -1133 205704 11550 86944 109742 29003 157491 6557 123733 104902 -152274
15179 196219 191331 141398 215169 -76471 133594 18139 17745 87567 -245148 -406025 416081
15167 -47992 13986 316976 -123641 -9423 148796 72665 159490 2089 54876 -25244 -150664
15156 -150664 -64206 -49418 209373 170881 109054 78558 -14951 78141 16467 83498 241224
15145 241224 356591 49775 -77727 321530 309537 -36338 129561 172108 149932 -289451 190239
15133 361463 -95731 42160 145378 218508 -33982 242804 -91813 339796 -73400 -17548 369146
15121E160R7756L39732A21149C2441M09455o5369a320C79386A33480Q4488a8992
15109B72906B5897M8426K61137D3962n487J12691C9985f930l2273j37782A78013
15097D65014B08069B2357e3862A03330K5800h2320A68144G0211K96519j49180
15087B17550r6158J43164e8412K1725A52871g0056B89934q5294D129L27184j7067
15076C14246H5855Q9677L88381h614A34902b6359K525B43985I3071R9200H7846
15064B77679b02866B17233A02944b70695C06586L644q1797J64127j62104A7647
15053D03989e3209B97512j29954C3506J30361J69543j56958K23311l7029A08879
15042B72789o6081K63876n0257M5307o2896l9759M5505j98981L26759A49646k3355
$$ plain form
15121 5160 102916 442648 121149 32441 441896 376527 -1320 379386 133480 217968 -18992
15109 272906 25897 74323 335460 43962 38475 151166 39985 -6930 -39203 -176985 178013
15097 465014 208069 22357 -53862 103330 129130 -82320 168144 70211 366730 217550
15087 217550 121392 264556 -58412 -36687 152871 -70056 289934 204640 4129 331313 314246
15076 314246 85855 175532 563913 -8614 134902 -26359 -23834 243985 93071 192271 87846
15064 277679 -202866 217233 102944 -270695 306586 310230 228433 392560 230456 17647
15053 403989 -53209 297512 167558 33506 163867 333410 176452 399763 362734 108879
15042 272789 206708 470584 420327 465634 402738 362979 408484 209503 536262 149646 126291
15031A26291L74751j15661o326N06497k61283j57504L97199m21694J78976k57635
15021C63611K15215P661j79148j472r020M299m7742A27388K95973j74684J92604
15010D41281J10812N9692B88184J11526M3749A82278L6985P2021a40029F93135
14999C94295M6829O9549K44497l30456A21807L49758B1079M03689j45657m6664
14989B32447J04437p279A60160O24382l72984A13880N57625j56706K55912k48122
14979E22589K95831j33007J19833l79283A65421K24382j54110L83270k44163L38799
14969G13599j34548m2352B26048I5431L96308J81444B69094L0349K1762o1701
14959B59504O2773o1464K91779j69736G0101j087K97921K33859j59477o0109N40
$$ plain form
15031 126291 501042 385381 379055 885552 624269 466765 863964 442270 621246 363611
15021 363611 578826 586487 407339 405867 396847 401146 353404 127388 423361 248677 441281
15010 441281 552093 611785 288184 399710 443459 182278 219263 291284 -140029 693135
14999 394295 441124 510673 755170 424714 121807 471565 21079 424768 279111 232447
14989 232447 336884 329605 160160 784542 411558 113880 671505 514799 770711 522589
14979 522589 818420 685413 805246 425963 165421 389803 235693 618963 374800 713599
14969 713599 579051 536699 226048 95431 491739 673183 269094 299443 321205 259504
14959 259504 322277 260813 552592 382856 70101 69014 366935 600794 441317 381208 381748
14948C81748D4389N12429j68354H6520K08639k6532N94632B38687L82947J51542
14938G73176j76002q3404l0371l4282P7753L4671J23014J49737j46765K35929
14928I23456k55811N77939J02568K31047m28856Q33463n12739J63301m75253O7228
14918A226343j46322L06240K16224K72616L19453n46446J8182k00214m72524K57249
14908A250801n39083j22543A96409K67804A49278L72230J05483K1773k59237m8531
14898C40996P6961J64930B67999P7350m3311D6684L16992K08152k2399k36132
14888C13297J9403Q5955q536M09458l12391L12647j66106k86241K57874K61680
14878H87040J11075m12786R8248m2238K12280j77606j66798M1538k62846j02414
$$ plain form
14948 381748 44389 556818 388464 86520 295159 268627 863259 238687 621634 773176
14938 773176 597174 513770 483399 449117 526870 561541 684555 834292 687527 923456
14928 923456 667645 1245584 1348152 1579199 1150343 1983806 1471067 1634368 1159115 1226343
14918 1226343 1080021 1386261 1602485 1875101 2194554 1648108 1666290 1466076 993552 1250801
14908 1250801 711718 589175 196409 464213 149278 521508 626991 648764 389527 340996
14898 340996 417957 582887 267999 345349 302038 46684 363676 571828 549429 313297
14888 313297 332700 418655 410119 819577 507186 819833 653727 367486 625360 887040
14878 887040 998115 585329 683577 641339 853619 676013 509215 550753 287907 185493
14868A85493J76901j25067p2421O77240j70955J21972l84871N5583L15631j00181
14858F79325k89680M6173K6165N47B00740M78635B24655L52938k71213k2518M12101
14847F95963j53486J41503n6947j30970K63975k83504M53176P7975J7891k62467
14837G63109L43600O5421n42595K35372p3391k70699R9678P6641M6672k72237
14827D71571J29662k75845J46854j9966J59307o3866J92929p8079o5210l9376
14817E57981L71959j01608k19971J18180J01504m8051j26824J28969k03093L9076
14807F18122J084j19569j77427L31488r9770n5532M53283k39914l27883R5685
14797D79567l3562L2029k9706K96510j59463j7923j83053K99148q317k0995j27025
$$ plain form
14868 185493 362394 237327 164906 842146 671191 793163 408292 463875 779506 679325
14858 679325 389645 435818 461983 462530 200740 679375 224655 577593 306380 283862 695963
14847 695963 542477 683980 627033 496063 760038 476534 929710 1007685 1025576 763109
14837 763109 1106709 1172130 629535 864907 791516 520817 620495 697136 743808 471571
14827 471571 601233 325388 472242 452276 611583 547717 740646 662567 597357 557981
14817 557981 929940 828332 608361 726541 828045 779994 653170 782139 579046 618122
14807 618122 619206 499637 322210 653698 553928 498396 951679 711765 383882 479567
14797 479567 446005 478034 448328 744838 585375 567452 384399 683547 675230 654235 527210
14786E27210j20320J36746J96919k94884J71727j79039J26877K07832m2705K03985
14776I34348D56648K63133N03113k65238j59492J88707k47975O4275j22726J15109
14766G95554l10131K18244j524k01657J66910j10230j44597J64903K5198J25247
14756G27917j81060L87150j57553M6907K05791m28986o0783Q0202J64409p7560
14746G06434B99937L67382k3559L7973k22299J48711k4584J06860L7810j04972
14736F23259J93848J57186q5518j24725K65227k34689M4259L0243J22604M45234
14726A436928k68865J08207L47513j18280K70107l75362K04939j23853l98088
14717A083246k3077l64722m5893M7622J21594J3807j07363L1610K53204k01101
$$ plain form
14786 527210 406890 543636 740555 445671 617398 438359 565236 773068 730363 934348
14776 934348 456648 719781 1222894 957656 798164 986871 738896 803171 680445 795554
14766 795554 485423 703667 702143 500486 667396 557166 412569 577472 602670 727917
14756 727917 546857 934007 776454 823361 1029152 600166 539383 619585 783994 706434
14746 706434 299937 667319 643760 681733 459434 608145 583561 690421 728231 623259
14736 623259 817107 974293 888775 764050 1029277 794588 838847 869090 991694 1436928
14726 1436928 1168063 1276270 1623783 1505503 1775610 1400248 1605187 1481334 1083246
14717 1083246 1060169 695447 649554 697176 818770 832577 725214 756824 1010028 808927
14707H08927L58879N2603l07268k22287J70813L63866k95213M96038J10955M21953
14697A959266j42848l00733L7640m32285m05609L05368j38265J21935P9040k75673
14687H07836J55545o6197Q459J58829j11181P2157q9674j50441J84240j0799j6528
14676I42246l0620n2054K11081k55609K11199k78335O87915l99621p305l57566
14666F71331L66848j07011K66443k50753J61115J36411j63697j49873k177L71445
14656A300082j67889L21368k85140k55089M13446j13283j27427N02118j56331
14647A431855j20601j15988j50328M93833l88250O5498J61674j46707k1649k1293
14637A188044J95934l187J33406k03215J63358k49006R3971R8718J05314l15609
$$ plain form
14707 808927 1167806 1220409 913141 690854 861667 1225533 930320 1426358 1537313 1959266
14697 1959266 1816418 1515685 1553325 1121040 715431 1020799 882534 1004469 1083509 807836
14687 807836 963381 897184 905643 1064472 953291 1025448 935774 785333 969573 958774 942246
14676 942246 911626 859572 1070653 815044 1026243 747908 1435823 1036202 1028897 671331
14666 671331 1038179 931168 1197611 946858 1107973 1244384 1080687 930814 928637 1300082
14656 1300082 1132193 1453561 1168421 913332 1326778 1213495 1086068 1588186 1431855
14647 1431855 1311254 1195266 1044938 1538771 1150521 1216019 1377693 1230986 1209337 1188044
14637 1188044 1383978 1380791 1514197 1310982 1474340 1225334 1319305 1418023 1523337 1207728
14627A207728j4022L58271n9249j39222L3142j27346n7043J84936l05851M42653
14617A523997N9339j7873j49100r6862M13416k37076k49113L16063Q6551J74136
14607A823478k55414R2153J30542j59889o0132j69519L81838k6417j42163j02279
14597A512198L22685l38409k05155M15387l39809O29784P5964j06581p8081j38483
14587A749500K89613k6856n642k09994N9892P0519K42598Q2152m26896k5785J58864
14576A957965J78211m8223j30559J6885j57290K49071J25166N9806Q053L3491
14566B292576N3703J61671n31870P51069l9632j43358K87380j80742J40808L12162
14556C103767r9806n2100K36309L41619N60218P65709N05934J558611L613175
$$ plain form
14627 1207728 1193706 1551977 1492728 1353506 1386648 1259302 1202259 1387195 1081344 1523997
14617 1523997 1583336 1565463 1416363 1319501 1732917 1495841 1246728 1562791 1649342 1823478
14607 1823478 1568064 1660217 1790759 1630870 1570738 1401219 1783057 1756640 1614477 1512198
14597 1512198 1834883 1496474 1291319 1706706 1366897 1996681 2072645 1966064 1887983 1749500
14587 1749500 2039113 2012257 2006615 1796621 1856513 1927032 2169630 2251782 1824886 1799101 1957965
14576 1957965 2136176 2087953 1957394 1974279 1816989 2066060 2191226 2251032 2259085 2292576
14566 2292576 2346279 2507950 1976080 2727149 2687517 2544159 2831539 2650797 2791605 3103767
14556 3103767 3003961 2951861 3188170 3529789 4090007 4855716 5361650 6920261 10533436
14547A0533436Q770419J7516526J2857157B2141569I105003m053592j139884M50485
14539D362012K122070k703821j169765m87411k4207O6629j08653K61947q335m61811
14529A848655p8973N84779j79946j7764k0982R1342q2475L6146k16965O07827
14519B571644j55586K24244j54629N2466K62635l28138K97141j89733L6949N9484
14509B676477j74683N62356m20211K96372r1820L17831J51607l27126j6040K12317
14499C187080k75427J02526j61050N82366J48441m94475J65341J35153J09871
14490C499826R9677p4371J34377l49795N30435j83410J60863r8116J95603q4540
14480C830549j40655J84521Q122K79991j13667r992j3835K16394o8025O1621j26120
$$ plain form
14547 10533436 19303855 36820381 49677538 22141569 9105003 5051411 3911527 4362012
14539 4362012 6484082 3780261 2610496 2123085 2098878 2165507 2056854 2318801 2310466 1848655
14529 1848655 1769682 2354461 2174515 2156751 2135769 2227111 2144636 2180782 1963817 2571644
14519 2571644 2416058 2640302 2485673 2538139 2800774 2472636 2769777 2580044 2616993 2676477
14509 2676477 2501794 3064150 2643939 2940311 2848491 3166322 3317929 2990803 2974763 3187080
14499 3187080 2911653 3014179 2853129 3435495 3583936 3089461 3254802 3389955 3499826
14490 3499826 3599503 3525132 3659509 3309714 3840149 3656739 3817602 3719486 3915089 3830549
14480 3830549 3689894 3874415 3882537 4162528 4048861 4038869 4025034 4241428 4173403 4235024 4108904
14469D108904J87870k7060J67721l0268J93437L44583m43019K75336k79627J2376
14459D510253Q02046k46305j95301L7100L21957k8231J8713N23677m15259R0781
14449E419431m4128L05497j71057j91231J02084N50760k77585L31583j60034Q2457
14439E947777K43362K41003L78649m18570j04997N25326l8330o9951L53238J11025
14429G168532k18108K39138L0672L948J99389M03953k94896L21661O33274l99306
14419H088257J22423L45958j4298L49366K34550k41064Q7083J02149K1887J82643
14409I278954Q7531R005M02824n4882K85460J90940M07456n28538P46395Q4775
14399A0909920J33615K1205J4547J02848K84249J66873l9648J27622M36440L43638
$$ plain form
14469 4108904 4296774 4269714 4437435 4407167 4600604 4945187 4502168 4777504 4497877 4510253
14459 4510253 5312299 5065994 4870693 4907793 5229750 5201519 5220232 5743909 5328650 5419431
14449 5419431 5375303 5680800 5509743 5318512 5420596 5971356 5693771 6025354 5865320 5947777
14439 5947777 6191139 6432142 6810791 6392221 6287224 6812550 6774220 6704269 7057507 7168532
14429 7168532 6950424 7189562 7220234 7224182 7423571 7827524 7532628 7854289 8487563 8088257
14419 8088257 8210680 8556638 8542340 8891706 9126256 8885192 8972275 9074424 9096311 9278954
14409 9278954 9366485 9375490 9778314 9723432 10008892 10199832 10607288 10078750 10825145 10909920
14399 10909920 11043535 11064740 11079287 11182135 11466384 11633257 11593609 11721231 12157671 12501309
14389A2501309n9424J50325L59805J60089O72201L16001n86209O21318L45211
14380A4480626L32229L49724M72016P05598m7151j4574K57482J07171R90590J1768
14370A7645479K52887M12109Q82416R0017P70362M39706M35715K42378M70112
14361B1641181M84783L98615N10234M46342M90634K36601J057596J95919J079431
14352B6541336N82322P21894O05727O03369P01174Q18648J053719O93099O74418
14343C2995706J202030J015997R25015P40000N95259J680334P02057J608488P56421
14334D2221307J514237J496005J038051J644948J518252J534186J789166J847051
14326E4603203J331118K116207K038194J826212K437813K224620K221510K676107
$$ plain form
14389 12501309 12441885 12592210 12952015 13112104 13784305 14100306 13514097 14135415 14480626
14380 14480626 14812855 15162579 15634595 16340193 16293042 16278468 16535950 16643121 17633711 17645479
14370 17645479 17898366 18310475 19192891 19282908 20053270 20492976 20928691 21171069 21641181
14361 21641181 22125964 22524579 23034813 23481155 23971789 24208390 25265986 25461905 26541336
14352 26541336 27123658 27845552 28451279 29054648 29755822 30574470 31628189 32321288 32995706
14343 32995706 34197736 35213733 36138748 36878748 37474007 39154341 39856398 41464886 42221307
14334 42221307 43735544 45231549 46269600 47914548 49432800 50966986 52756152 54603203
14326 54603203 55934321 58050528 60088722 61914934 64352747 66577367 68798877 71474984
14318G1474984K408361L016992K365861L441243L374584K850904M030624L453212
14310I6416765M204510M166804M608210M689012N146128N337049N468288O007042
14302A36043808O434010O913988O991740P184669Q101732Q640745Q911809R682569
14294A98905070R688647J0737643J1487157J1339633J2671191J2880852J3117441
14287B80827634J4074789J4345935J4773599J5172370J5334152J5257171J5212354
14280C84998004J5039614J4194545J3803355J2777912J1554618R818868P976993
14273D70163909N723526J521274k476736l184091k010206n472960o539719q501835
14265D49223162r957009j1625025j2852516j3506104j5002286j6088029j6477034
$$ plain form
14318 71474984 73883345 76900337 79266198 82707441 86082025 88932929 92963553 96416765
14310 96416765 100621275 104788079 109396289 114085301 119231429 124568478 130036766 136043808
14302 136043808 142477818 149391806 156383546 163568215 171669947 180310692 189222501 198905070
14294 198905070 208593717 219331360 230818517 242158150 254829341 267710193 280827634
14287 280827634 294902423 309248358 324021957 339194327 354528479 369785650 384998004
14280 384998004 400037618 414232163 428035518 440813430 452368048 462186916 470163909
14273 470163909 475887435 477408709 474931973 471747882 469737676 464264716 457724997 449223162
14265 449223162 439266153 427641128 414788612 401282508 386280222 370192193 353715159
14258C53715159j5973883j5670493j5762562j4867900j4414115j3601773j3402722
14251B50021711j2779045j1215028j0201663j0674965j0364174r438128q946170
14244A76402538q184127p836359p697998p085920o563515o467471n377025n399449
14236A21790674n359063n153107n024524m007913l879828l644103l706350l646344
14228H7369442l380190l503883k802488l094948k581523k474513k209665k331972
14220F4990260k038295k391702j987994k143441j663185j385216k161307p11455
14212E0507665j888129j840013j253042j138462j398485o99188p44785j688800
14204C9856761j311759q88445j107380m40044q16100j354555j135920o54809o49883
$$ plain form
14258 353715159 337741276 322070783 306308221 291440321 277026206 263424433 250021711
14251 250021711 237242666 226027638 215825975 205151010 194786836 185348708 176402538
14244 176402538 168218411 160382052 152684054 145598134 139034619 132567148 127190123 121790674
14236 121790674 116431611 111278504 106253980 102246067 98366239 94722136 91015786 87369442
14228 87369442 83989252 80485369 77682881 74587933 72006410 69531897 67322232 64990260
14220 64990260 62951965 60560263 58572269 56428828 54765643 53380427 51219120 50507665
14212 50507665 48619536 46779523 45526481 44388019 42989534 42290346 41545561 39856761
14204 39856761 38545002 37656557 36549177 36109133 35293033 33938478 32802558 32147749 31497866
14195C1497866q81545o22972l98633j182164q13764l39260n29718q94866n06255
14186B5328689m50527q11048n12362q7562q90023m60762k78114o25117l77822
14177B0835352o09026J64099j037619J89995n64730m19745k52605n66765M1518
14168A7780474p72214O8995m07601m34987k22483N2691m48850n88857J86007k89774
14158A4923401n07693k99160k41893K06225l62513j09135m99140m24894l5449
14149A2649749J26120n53114j70718j76404q3775k06271j06207n25894l18736
14140A0634750M36788n75491M8118j17663j86636m14487k50044j2645K00770j28893
14130I634567k28412j47787m22380J70359k20307n6177P8789n06117p007k09943
$$ plain form
14195 31497866 30616321 29993349 29594716 28412552 27598788 27259528 26729810 25834944 25328689
14186 25328689 24878162 24067114 23554752 23467190 22577167 22116405 21838291 21213174 20835352
14177 20835352 20226326 20390425 19352806 19542801 18978071 18558326 18305721 17738956 17780474
14168 17780474 17008260 17077255 16669654 16234667 16012184 16064875 15616025 15027168 15213175 14923401
14158 14923401 14415708 14116548 13874655 14080880 13718367 13609232 13110092 12685198 12649749
14149 12649749 12775869 12222755 12052037 11875633 11791858 11585587 11479380 10953486 10634750
14140 10634750 11071538 10496047 10544165 10426502 10239866 9825379 9575335 9562690 9763460 9634567
14130 9634567 9406155 9258368 8835988 9006347 8786040 8729863 8808652 8302535 8295528 8085585
14120H085585J04875p5827l13149j57047p1850l9740o804k92829J04803m68986
14110F869031O31821j76367l87824m8572j48151j10325p5327j62721J39215L6679
14100F567459l35810J49763J0464l67385l85348J21885k12344R4507J24247O7827
14090E835265k61274j27322J10921j65698j98716k7128L43328n49015N2432k24225
14080D788568J9665k11223M07904k92334M42940l11405N71j77892O2010o2732
14070D666072n3997k96145J37307K84072l93020J3092j47952l72722O74802l64456
14060D147053J52024m0906L8765J2800r5737l28214K77157k47474p834K11917
14050D119551j15948k29960j49188O6M53252n01783l8682N7882J8593k48080K64420
$$ plain form
14120 8085585 8190460 8114633 7801484 7644437 7572587 7532847 7526043 7233214 7338017 6869031
14110 6869031 7500852 7324485 6936661 6888089 6739938 6629613 6554286 6391565 6530780 6567459
14100 6567459 6231649 6381412 6391876 6024491 5639143 5761028 5548684 5643191 5767438 5835265
14090 5835265 5573991 5446669 5557590 5391892 5193176 5166048 5509376 4960361 5012793 4788568
14080 4788568 4808233 4597010 5004914 4712580 5155520 4844115 4844686 4666794 4728804 4666072
14070 4666072 4612075 4315930 4453237 4737309 4344289 4357381 4209429 3836707 4511509 4147053
14060 4147053 4299077 4258171 4296936 4309736 4213999 3885785 4162942 3915468 3907634 4119551
14050 4119551 4003603 3773643 3624455 3624521 4077773 3575990 3537308 3595190 3613783 3365703 3630123
14039C630123k74736m0447j26889L39881l20179L10302J0907k71139k8802P825
14029C236846M8205L5368l13563q3989J75837l3186k19995K48967l53765j50288
14019B590437K97672j27855J26687k24566j46398J41677j12138J69486l84365
14010B330637J24667N1740k06733M34564N9987l10850M6706l60333L1950J24468
14000B326803Q9639K1033m4229m97666J96216Q9635J27930Q5125l1148J14474
13990B477812J36364J095907J353371O947540J5740711K3342147k2302592j3597041
13982A5194219o134674k403711j531861q50725n29684J1390m66325m2322j5831
13973C230476m87211j04541m78749N18647l73165L93768l11717j50650k96509
$$ plain form
14039 3630123 3355387 3314940 3188051 3527932 3207753 3518055 3528962 3257823 3229021 3236846
14029 3236846 3285051 3320419 3006856 2922867 3098704 3065518 2845523 3094490 2740725 2590437
14019 2590437 2888109 2760254 2886941 2662375 2515977 2657654 2545516 2715002 2330637
14010 2330637 2455304 2507044 2300311 2734875 2794862 2484012 2530718 2170385 2202335 2326803
14000 2326803 2416442 2437475 2393246 1895580 2091796 2181431 2309361 2394486 2363338 2477812
13990 2477812 2614176 3710083 5063454 12010994 27751705 51093852 28791260 15194219
13982 15194219 9059545 6655834 5123973 4273248 3743564 3754954 3288629 3246307 3230476
13973 3230476 2743265 2638724 2159975 2678622 2305457 2699225 2387508 2236858 1940349
13964A940349M81349k21893r8531N95913m70708J06129j63017l15745J85212L92874
13954B431932l94778O4152M5806j65924j94962K06775k41980O9845q4729J36545
13944A872682j08450K6499M05835m43340J38906L9478J3575P2050j41425j14372
13934A761438J83646p0498Q4598n55136L06602j63863L56766m72828k08955K54751
13924A476521K78504k27679K15751n2260J2492K66843j03569l41023m8982P6544
13914A553142O1635p2559R14K67487m01862M8650P1271j63114Q2276L17344m18131
13903A347053L25123j69198l79469M17094j2618k23753k16009M2379K94499j23118
13893A301983k24146M64359j29074j4374M6958k74499K14059l82804L29824k09214
$$ plain form
13964 1940349 2421698 2199805 2101274 2697187 2226479 2332608 2169591 1853846 2039058 2431932
13954 2431932 2037154 2101306 2147112 1981188 1786226 1993001 1751021 1820866 1736137 1872682
13944 1872682 1764232 1790731 2196566 1753226 1892132 1931610 1945185 2017235 1875810 1761438
13934 1761438 1945084 1874586 1959184 1404048 1710650 1546787 1903553 1430725 1221770 1476521
13924 1476521 1755025 1527346 1743097 1690837 1703329 1970172 1866603 1525580 1476598 1553142
13914 1553142 1614777 1542218 1543132 1810619 1408757 1457407 1528678 1365564 1447840 1765184 1347053
13903 1347053 1672176 1502978 1123509 1540603 1527985 1304232 1088223 1130602 1425101 1301983
13893 1301983 1077837 1542196 1413122 1398748 1445706 1171207 1385266 1002462 1332286 1123072
13883A123072L61337k00016k15944J18502j11057M85737k72396l6105k43309L51795
13873A361616j78576l3077N4802j64533k62548J98490J2994J87525J01773R1944
13863A370410l11265K6938M1415J04923j71525Q682l3089J82346O573J84384l26482
13852A083310R1346k73303k13272N66303k2163j83707n0665Q8107K71577n49811
13842H07722K29315P8228l51316L07797m447o0304m32925L56991J38974P779p2513
13831A005301J94901n6606N0226j99506J45445m49785K87602J24869k71266K56282
13821A087463j49905K1181J34308N6506m67544L72004k91657M14434j69389k0470
13811I86931k15482L3920m8818j6506j01106J35173k1845K97560m85643L78471
$$ plain form
13883 1123072 1484409 1284393 1068449 1186951 1075894 1561631 1289235 1253130 1009821 1361616
13873 1361616 1183040 1149963 1204765 1040232 777684 976174 989168 1176693 1278466 1370410
13863 1370410 1059145 1086083 1127498 1232421 1060896 1069578 1036489 1218835 1225408 1409792 1083310
13852 1083310 1174656 901353 688081 1254384 1232221 1048514 997849 1085956 1357533 807722
13842 807722 1037037 1115265 763949 1071746 1067299 1006995 574070 931061 1070035 1077814 1005301
13831 1005301 1200202 1143596 1193822 994316 1139761 689976 977578 1102447 831181 1087463
13821 1087463 937558 958739 1093047 1149553 682009 1054013 762356 1176790 1007401 986931
13811 986931 771449 805369 756551 740045 638939 774112 752267 1049827 564184 942655
13801I42655j64929r033j09198J63510J3403K412K1954k33805Q3139J83779j99399
13790F94488J53690j89080k151J83849j88451K37298m29875K58343L7178k11805
13780E43484J94373k50692K58396j07130M73125k65067j07025l36186N88783j80793
13770H11268C63446K4047K56087K46308J56206k44445k32066L94296q624l94278
13760E60977K04167K0915k13094n6702K71264j05666J01035k60078L2116K42886
13750G97820n2833j60058J41089k66759K29796m2614L37963l86710P5880Q7031
13740G60605j69810J11149K14952D53546L84999D06968M80146l41797K50451k64491
13730E31277J29881l29297L46265k00469j14384K04770n9068Q5288J27360j17438
$$ plain form
13801 942655 777726 768693 659495 823005 836408 838820 860774 626969 710108 893887 694488
13790 694488 848178 659098 656947 840796 652345 889643 459768 718111 755289 543484
13780 543484 737857 487165 745561 638431 1111556 846489 739464 403278 992061 811268
13770 811268 363446 387493 643580 889888 1046094 801649 569583 963879 955255 560977
13760 560977 765144 786059 572965 516263 787527 681861 782896 522818 554934 797820
13750 797820 744987 584929 726018 459259 689055 646441 984404 597694 673574 760605
13740 760605 590795 701944 916896 453546 838545 406968 887114 545317 795768 531277
13730 531277 661158 331861 678126 477657 363273 568043 508975 594263 721623 604185
13720F04185j19917J13385K9180K06605r4966K05473l44086o2935M1638q0367
13710D98195J03437J97890l88767L6768J17286j84103K18355J66491j78776k7235
13700E59541K09694A82852N20985K79351D51191P4941J49164j60317j06537K71061
13690F79503m5906k53638L05101j04091q5387J18851k9916j20583K25817q1780
13680F07971J9544J3495r2975j51925J65992A35515M42400Q8841L7832J26k46412
13669D58302r7242J95764j30252Q6940N3706p8443M60759l53523j75465A22389
13658F29582o0087H8573K63553q746K08183j9451B6905M73700j3180j86644j0107
13647B90674L58823r2100o6941j45118K72887P1609l733B89738R5656j59368m4776
$$ plain form
13720 604185 484268 597653 626833 833438 738472 943945 599859 536924 578562 498195
13710 498195 601632 799522 410755 447523 564809 380706 599061 765552 586776 559541
13700 559541 769235 182852 703837 983188 451191 526132 675296 514979 408442 679503
13690 679503 633597 379959 685060 580969 495582 614433 584517 463934 689751 607971
13680 607971 627515 641010 548035 396110 562102 135515 577915 666756 704588 704714 458302
13669 458302 361060 556824 426572 513512 567218 488775 949534 596011 420546 122389
13658 629582 569495 88573 352126 343380 551563 532112 26905 500605 487425 300781 290674
13647 290674 649497 557397 490456 345338 618225 689834 686101 289738 385394 226026 181250
13636A81250M03402M4708B96123j40033K44020K48474k36229A69O49336j01794
13626E47711J97710k93152J08903M9110l1325k04305k7724R7155j83654M62931
13616G23360k63782j46670K58888k43974J5917i3301B3103K02293K00818L3787
13606D60001j11827j24171L09570A06771J64302R3985J38200j58634j5484A31773
13595A45440K12069O4852r6643L4789b3162F03776j49098L7684j69397J30013
13585D52978j47764L11516A51150K03479p6021o6637J62462j29351J59590P3548
13575D78220j98394k6879C628N74145k67887P3810J75326k25880J19844l9835
13565D13151j59187J88118J20222k14987O4430j08761j39235E3847L40249A93093
$$ plain form
13636 181250 584652 629360 296123 156090 400110 648584 412355 169 649505 547711
13626 547711 745421 452269 561172 610282 578957 374652 346928 444083 260429 723360
13616 723360 459578 312908 571796 327822 343739 -93301 23103 225396 426214 460001
13606 460001 348174 224003 533573 106771 271073 365058 503258 344624 329140 131773
13595 145440 357509 422361 325718 360507 -23162 603776 454678 492362 322965 452978
13585 452978 305214 616730 151150 354629 278608 211971 374433 245082 404672 478220
13575 478220 279826 252947 3628 577773 309886 383696 559022 333142 452986 413151
13565 413151 253964 442082 562304 347317 411747 302986 163751 53847 394096 193093
13554D00837j81137K20613j98888J09899r4425J33029N8649o2044A68085J45358
13544C13443o8993J3464J9957n1026F3623L63405j78159J38760j90520J99444
13534C96553L7886o8649B0203K70176C4785M762L08931b1588C91417j17923K64700
13523E38194A46656L67534b00435G9658K67251r1481M26391B27402L34974B60150
13512A3959J07851J81198G4379h2345G80936C51652g749D59138J71738g7148B99867
13500C107L03658A45280J70272P9819j75454J17867O6729n5784c3375A73161a4213
13488G2186K91791j44799J37361p3058J1008b6364C55303a01225D71466A49010
13477D95982k35990j23818J89461f8088G91219C83678I7807J58809r2561J43372
$$ plain form
13554 400837 219700 440313 241425 351324 256899 389928 448577 386533 168085 313443
13544 313443 244450 257914 277871 226845 63623 427028 248869 387629 197109 396553
13534 396553 434439 365790 20203 290379 34785 39547 348478 -21588 391417 273494 538194
13523 538194 146656 514190 -200435 79658 346909 255428 681819 227402 562376 260150
13512 13959 121810 303008 74379 -82345 780936 351652 -7749 459138 630876 -77148 299867
13500 3107 306765 145280 315552 395371 219917 337784 404513 348729 -33375 173161 -14213
13488 72186 363977 219178 356539 283481 294489 -26364 355303 -101225 471466 149010
13477 495982 259992 136174 325635 -68088 791219 383678 97807 256616 164055 307427
13467C07427j05106j00891l7691J33921O2841J90610p9177j55208o166K60679
13457D71239q9490A53297L89500k26607J76740B16610K9209n8668Q2071N2686
13447C21908q2129F132M87295A4619O4524N37038A41116J56834n7282a6982q1948
13436i8930D8558K32407J02943A90690b6762B93896J88321j74226J56776A55362
13425A52239g1373D59530r2130j39834O515A07566a34242B61860L5050l0242b3329
13413D17806j82383K66591A05518K74966j78137J52674p5432J58819q203A16799
13402A13010c794D18255n0253q2763I4178K6050l0237j9234J35099K7567Q156
13391B41579H8896e9078A55272J60417a1664j9793E88393a61054L9587A59349
$$ plain form
13467 307427 202321 101430 63739 197660 260501 451111 371934 216726 210560 471239
13457 471239 381749 153297 542797 316190 492930 216610 245819 187151 269222 321908
13447 321908 239779 6132 493427 14619 79143 616181 141116 297950 240668 -16982 -98930
13436 -98930 48558 280965 383908 190690 -26762 293896 482217 307991 464767 155362
13425 152239 -71373 459530 367400 227566 234081 107566 -134242 261860 296910 266668 -23329
13413 417806 235423 502014 105518 380484 202347 355021 279589 438408 430205 116799
13402 113010 -3794 418255 368002 285239 94178 120228 89991 70757 205856 233423 241579
13391 241579 88896 -59078 155272 315689 -11664 -31457 588393 -161054 -121467 159349
13380H3928K86234K26290a2383B41845C3423K87745A45051K90149A38729M01779
13370E40508k64482m4138n1831L21582F4118J7457N2755m3459L13329j27810E0097
13358A97275E6197J45677J3637K51044F1773a72349A92661J39667r1360f2580
13347C69000D2825Q9943M3531J32589j22618K21559A79806L3904J4612K03562
13337D31884J10262r671r6774R5804A33916J04745J78404A18965J94544A09914
13326A61882K87747A17147J93717a00647F5520B8541K42086K61344I6268L85565
13316D81833d5072e588C46557A5880L92840j72290I1876K87287A71136m0567f8360
13304h2025a255C546K09731R4592r8250k3424N2996G1010K55157E3140F576J3034
$$ plain form
13380 83928 370162 596452 -12383 241845 33423 321168 145051 435200 138729 540508
13370 540508 276026 231888 180057 501639 64118 81575 134330 90871 404200 276390 50097
13358 197275 56197 201874 215511 466555 61773 -172349 192661 332328 240968 -62580
13347 369000 42825 132768 176299 308888 186270 407829 179806 213710 228322 431884
13337 431884 542146 532475 435701 531505 133916 238661 417065 118965 313509 109914
13326 161882 449629 117147 310864 -100647 65520 28541 270627 531971 96268 481833
13316 481833 -45072 -5588 346557 15880 408720 236430 91876 379163 171136 130569 -68360
13304 -82025 -1255 3546 213277 307869 209619 186195 239191 71010 326167 53140 6576 19610
13292A9610Q4693O6787J67915p0604b4587C7359J44011F2424J34901i1530N343
13281h6187D34135A49042c12172h5C12870M6834A41932K01082J31796B33389J80457
13270D13846B06508J03261l9528H1066k5309L69426A00380L66533f4748D5480
13259A37967b8342B25928j00772J73325a38936B87216c1695I0497O5240J12602
13249B68339j29730O5150B4067L56560n988A30857b02692D7236K82146G8625B5803
13237C63124a74510A50085d6452C29468j29254K8455D2323J49148E5649H70a08718
13225D09139I3615K66125F1037b3783A85655i3623A06817Q0898m8337j2876a9288
13213b30001C17139j35432J1161A2532L5172M7571a15929n11351b31796I1761
$$ plain form
13292 19610 104303 171090 339005 268401 -24587 37359 181370 62424 197325 -91530 -86187
13281 -86187 434135 149042 -312172 -85 312870 359704 141932 343014 474810 233389 413846
13270 413846 206508 309769 270241 81066 55757 425183 100380 466913 -64748 45480
13259 137967 -28342 225928 125156 298481 -138936 287216 -31695 90497 155737 268339
13249 268339 138609 203759 24067 380627 374639 130857 -202692 47236 329382 78625 25803
13237 363124 -174510 150085 -46452 329468 200214 228669 42323 191471 55649 870 -108718
13225 409139 93615 359740 61037 -23783 185655 -93623 106817 187715 139378 126502 -19288
13213 -230001 317139 181707 192868 12532 47704 95275 -115929 -627280 -231796 91761
13202b58052B6764J28586B8102J64725J7330J61881p94A03378b61931d4517A89688
13190A01395q46i6109I5668c4556A90995J3578a4954j30150A14099J96493b56361
13178C3978J22746j2532E8095J60945R9444g1801I2848N59618B58585F9179K20437
13167B89616c886m1463E8642f5650r143B55930a807D01534a15173D443J41682
13156A46125F3892L31454a82472H0376L78171d2413D5427d956j38372B43208A9050
13144A4455h1925O506C79057e5819D4178K42651j32053a91304A44157K0986l1645
13133A33498e7994A22152I212a22k13262C9633j433J03784F6389J4177C3349j0845
13121B2504J39522o0851N2996B3933R2129K75830H8649L2640e6752b5921B485
$$ plain form
13202 -258052 26764 155350 28102 192827 210157 372038 371244 103378 -261931 -44517 189688
13190 101395 100549 -96109 95668 -34556 190995 204573 -14954 -145104 114099 310592 -256361
13178 33978 156724 144192 58095 219040 318484 -71801 92848 652466 258585 69179 289616
13167 289616 -3886 -45349 58642 -65650 -74793 255930 -1807 401534 -115173 4443 146125
13156 146125 63892 395346 -182472 80376 458547 -42413 45427 -4956 -143328 243208 19050
13144 14455 -81925 -75419 379057 -55819 44178 286829 154776 -191304 144157 165143 133498
13133 133498 -57994 122152 9212 -122 -213384 39633 38200 141984 66389 80566 33349 22504
13121 22504 162026 101175 154171 23933 116062 391892 88649 121289 -56752 -25921 2485
13109G1695a80878B27308C1037K22390b8645m5152j12646A23436O014k4952K44153
13098C48651E846N03061A16797b60077L8253G1363I378J55758c03455A58156J95907
13087C54063A47888J53479A47457D4512M12088A47571n3390d8113g409C0922b48892
13075g672D22069g3033G5604J35321n9505a09413M4536A57362i5248j23264A43269
13063A19064a92796g291l1720B71574e3558m9833E0940P5820N6311N6601A14038
13051d7046a5043C467J29866C0549K35869o794A20985b19913g7598B14295R8501
13040C12796D4811b97663A16391a56122A24082F1287k1200P5783E6887K44211
13030C01098C1818b23160B09096o3971J07054A18927l2266K08036e841B22814
$$ plain form
13109 71695 -180878 227308 31037 253427 -28645 -73797 -186443 123436 129450 104498 348651
13098 348651 5846 508907 116797 -260077 -221824 71363 9378 165136 -303455 158156 354063
13087 354063 147888 301367 147457 44512 456600 147571 94181 -48113 -7409 30922 -248892
13075 -7672 422069 -73033 75604 210925 151420 -109413 -64877 157362 -95248 -218512 143269
13063 119064 -192796 -7291 -39011 271574 -53558 -103391 50940 126760 183071 239672 114038
13051 -47046 -15043 3467 133333 30549 266418 259624 120985 -219913 -77598 214295 312796
13040 312796 44811 -297663 116391 -156122 124082 61287 40087 115870 56887 301098
13030 301098 31818 -223160 209096 145125 252179 118927 86661 294697 -5841 222814
13019A40190e9739B9248K5042D818J24827b063C45195r4997a07833E5819K03791
13008B59610F9356K17249G9424K15665c28948a06615C42710C016L66306h3927
12997C91503G1589J13220A9721c77955B29381J57190g3145A27161h9362A30407
12986a43581H4298b42870h5739A0353L61482B261O6883O6809i8531D46846A94974
12974A29231b78749g3238l04404d9696m1526A93797a8984j91634A49160J67325
12964C16485p4792r8612c9275I6166l1556J36553a31965N9025j54803j62160C75249
12952h3000A7744K6320J18371L0059Q3775b33860h2162L3993A70107b1124l1957
12941e3081A56050d49357A97874D0038d1526A50168G2344B8265K0996c9019A23130
$$ plain form
13019 140190 -59739 29248 54290 4818 129645 -2063 345195 250198 -107833 55819 259610
13008 259610 69356 286605 79424 295089 -328948 -106615 342710 3016 369322 -83927
12997 391503 71589 184809 19721 -377955 229381 386571 -73145 127161 -89362 130407
12986 -143581 84298 -242870 -85739 10353 371835 2261 69144 135953 -98531 446846 194974
12974 129231 -278749 -73238 -377642 -49696 -91222 193797 -18984 -210618 149160 316485
12964 316485 241693 143081 -39275 96166 64610 201163 -131965 -72940 -227743 -389903 375249
12952 -83000 17744 44064 162435 192494 276269 -233860 -82162 -48169 170107 -21124 -53081
12941 -53081 156050 -449357 197874 40038 -41526 150168 72344 28265 49261 -39019 123130
12929G7535l1101N5724P4825q2937c25422C189K6485J71162D9251D435J11938
12918A16373b56243G6775J2724a25500j81436D9889K90834G8695a70632C21928
12907C3348L7090i2425E9214i3032d4979A6459K30544E7878J13260e7740D53463
12895a88545A7857K47963d8814C48445A25293A1312b05415B1084L6961K2857l0913
12884D9989a38595h481l2617n6101A29646a52070F5264K1043N06004C0330b28503
12872A18318g6213G5561K5928f7186A08119b1897B86576a51208A47686a00235
12861I281e9734A643c17222O6051C23837A48506c8281G5209g0024k25115D79922
12849f366r5252J0176j17067J04022K1011k44584A1919J52638a8028A38498M1775
$$ plain form
12929 77535 46434 102158 176983 94046 -325422 3189 29674 200836 49251 4435 116373
12918 116373 -256243 76775 89499 -125500 -306936 49889 340723 78695 -170632 321928
12907 33348 70438 -92425 59214 -93032 -44979 16459 247003 57878 171138 -57740 453463
12895 -188545 17857 265820 -48814 348445 125293 11312 -205415 21084 58045 80902 49989
12884 49989 -138595 -8481 -41098 -97199 129646 -152070 65264 86307 592311 30330 -228503
12872 118318 -76213 75561 101489 -67186 108119 -21897 286576 -151208 147686 -100235
12861 9281 -59734 1643 -317222 -251171 323837 148506 -38281 75209 -70024 -295139 479922
12849 -6366 -101618 -91442 -208509 -104487 -83476 -328060 11919 164557 -18028 138498 180273
12838A80273K61276b8839r3536j70440F7891J60771d2971A60594a23289D3279
12827a72123b4851K203A16065f3299B05338b06991H0646J28667a50029G3791L7915
12816A11706a62507k8430C25079d7901m0941A94990b14508d2511G4735b7393A04023
12804b92138b6589j25240B94185j28331L9550b3914B0344L1671b2379q802H8463
12792a13542B6007B23f4940B40642i3351C19825H9357J31804j5463g5817D7270
12780A9328c7364j7569j0473B04781O655b36211B71611b15999I1101h7550p3143
12769a60693B3402J01253f4963A700b08291e4861A21000a22160b7437a1763k08334
12758b20097g6165A27571E466R5774j244a98094j42465J16378B54418b54944d1058
$$ plain form
12838 180273 441549 -28839 -122375 -292815 67891 228662 -42971 160594 -123289 43279
12827 -172123 -24851 -22648 116065 -63299 205338 -206991 80646 209313 -150029 73791 111706
12816 111706 -162507 -190937 325079 -47901 -88842 194990 -214508 -42511 74735 -27393 104023
12804 -292138 -26589 -151829 294185 165854 205404 -23914 20344 52015 -22379 -31181 88463
12792 -113542 26007 223 -64940 240642 -93351 319825 89357 221161 205698 -75817 47270
12780 19328 -37364 -54933 -65406 204781 211436 -236211 271611 -215999 91101 -87550 -160693
12769 -160693 23402 124655 -64963 1700 -208291 -54861 121000 -122160 -27437 -11763 -220097
12758 -220097 -76165 127571 5466 101240 99996 -198094 -340559 -224181 254418 -254944 -41058
12746a48330O4941A05294c5501H3640b47242A65565c09864A39409a37835A03529
12735a05233j1441d5778B07561G8325J7052L206b38195b3070r7816M5250A54796
12723A79778K3469D4445i8212D1979i9035A44744b958F9978R1247B6002k663b45039
12710B78258a98071B24321C2423K04400J25245k9722i5276C70983A80190q880
12700A71310B871J08606j5040L82772H0177J43958B478L55802A22813d4313F2277
12688B5336L62122C1465h4635c1029C60663A5469a8449B49619J69179g5937A90246
12676I7712C0880R427J59744r21h8899L7806n6406c8044A09780J70963a22558
12664C9400a17096B38387n7997a75280A65012a0470d967l1610B5170a9923D8673
$$ plain form
12746 -148330 -83389 105294 -35501 83640 -247242 165565 -309864 139409 -137835 103529
12735 -105233 -116674 -45778 207561 78325 95377 98583 -238195 -23070 -120886 -75636 154796
12723 179778 203247 44445 -98212 41979 -99035 144744 -2958 69978 161225 26002 23339 -245039
12710 278258 -198071 224321 32423 236823 362068 332346 -95276 370983 180190 171310
12700 171310 2871 111477 96437 479209 80177 224135 2478 358280 122813 -44313 62277
12688 25336 387458 31465 -84635 -31029 360663 15469 -18449 249619 418798 -75937 190246
12676 97712 30880 40307 200051 199130 -88899 -51093 -107499 -38044 109780 280743 -122558
12664 39400 -117096 238387 180390 -175280 165012 -10470 -4967 -36577 25170 -19923 48673
12652A49838g1871j90872B30192j09238B0967b29659B6315K39405D6369J32120
12642A78489i0731m9401a3992B38903d14099B62010d6920A28670a08352B2057
12631a86884e3424H0754O6656K8597J08924j28959O9531r5249J55059A01797j1996
12620H9801J93100f7279J8861A79743E3869c92092B41177A7060a15666j5815A47020
12608B67626o0148p1385a04858A64073N2795a956A81352e1960D26468k11704a59592
12596B32926H1057a83294a6006l27076j02967B07759a69992d284A91099F4569
12585H4296b47684C3888f9072j39278B00461c80120a52317N9793r7256A90252
12574A94769O571O399K7719B9083m997a70325f5334j04765G4911g6612L5144A27721
$$ plain form
12652 149838 -71871 -262743 230192 120954 20967 -229659 26315 265720 46369 178489
12642 178489 -90731 -140132 -13992 238903 -414099 262010 -46920 128670 -108352 22057
12631 -186884 -53424 80754 147410 176007 284931 155972 225503 130254 285313 101797 89801
12620 89801 282901 -67279 -48418 179743 53869 -392092 241177 17060 -115666 -131481 147020
12608 267626 207478 136093 -104858 164073 216868 -1956 181352 -51960 426468 214764 -159592
12596 232926 81057 -183294 -16006 -343082 -446049 207759 -169992 -4284 191099 64569
12585 84296 -247684 33888 -69072 -208350 200461 -380120 -152317 -92524 -189780 190252
12574 194769 201340 207739 235458 29083 24086 -170325 -65334 -170099 74911 -76612 -41468 127721
12561A73289f3729r4543k1650D02799j88490L1148j01698K2776a58499A47337
12550A05453h4171B9187J05011g407j97736A11444Q4066m5748b14586A5294C660
12538C3107K9167h556A04393b917k47562J2345A6748f4367A49075M835K5031F5655
12525a48858j28932a121k44845e5362J6586j3727A06149P6782a57191k3406B29912
12513b72554b6753B91325j09681d0231A58306o1645J63720A19880c02507A77557
12502B74506b25759B19431C1330a57996B87082Id45521K04232A10424M1964j4902
12491A37486m6696N2776l3371l2794c72937e2484B06114G2188L72358i6692E24944
12479d6455o3126A61365k6048f2560P469n9799A59192N452Q9061F7724d32315
$$ plain form
12561 173289 -63729 -158272 -179922 402799 214309 245457 143759 166535 -158499 147337
12550 105453 -84171 29187 134198 -7407 -205143 111444 195510 149762 -214586 15294 3660
12538 33107 62274 -8556 104393 -2917 -250479 -238134 16748 -64367 149075 153910 178941 65655
12525 -148858 -277790 -1121 -245966 -55362 -38776 -52503 106149 182931 -157191 -180597 229912
12513 -272554 -26753 291325 181644 -40231 158306 96661 260381 119880 -302507 177557
12502 274506 -225759 219431 31330 -157996 287082 9 -445521 -241289 110424 152388 137486
12491 137486 90790 143566 110195 77401 -372937 -52484 206114 72188 444546 -96692 524944
12479 -46455 -109581 161365 135317 -62560 -55091 -114890 159192 164644 253705 67724 -432315
12467c68621f3772C5618L9532a4608j13407c1409q381k60503A55551b95301A08733
12455c0568o0288A86519k2611l3303O6345f783j17441J0347H632a446l4253l15179
12443c50878J25929E7198k0808e9762C15405F8197A4406a10510C6190P0619h5184
12431g225I1985b63761A3140J05233b61279B40301a44407E3048P8422H913c12858
12419A76569J72184B3498d7737j8301m1836F0067j3973J13807e6616A89162a44515
12407B5985G039J00971b56391O0430L4571O7699n9750a8641B2893m139h4458F8609
12394a86114D0763R1483J07361E779e34229K01777J61534A01824K31908A45410
12383B8965L87185A42243b8899o4364A20635a82605d6435A19805j0421b67070
$$ plain form
12467 -368621 -63772 35618 75150 -14608 -128015 -31409 -39790 -300293 155551 -295301 108733
12455 -30568 -90856 186519 163908 130605 196950 -6783 -124224 -113877 8632 -1446 -35699 -350878
12443 -350878 -224949 57198 36390 -59762 315405 68197 14406 -110510 36190 106809 -85184
12431 -7225 91985 -263761 13140 118373 -261279 240301 -144407 53048 131470 8913 -312858
12419 176569 348753 23498 -47737 -66038 -107874 60067 46094 159901 -56616 189162 -144515
12407 25985 7039 108010 -256391 -195961 -161390 -93691 -153441 -18641 22893 18754 -84458 68609
12394 -186114 40763 132246 239607 5779 -534229 -332452 -170918 101824 333732 145410
12383 28965 416150 142243 -28899 -93263 120635 -182605 -46435 119805 109384 -267070
12372g1110B09274B3700b50599C28018A53902a35671j50299A0630a43122b9535
12361A49993D0000a66120c045q1924C50128j06796h0205l8841B07057g9248j73100
12350b52348B06592d8122F9493a3909m6675o4253A73491B6328I67M4593J36004
12339A81564a19639A64305L5523h4469A5899a56558B93548f6140b5854H6749h0115
12327B44896j05463b99398A28101h8199B82591E5898L86996d6271A10766L10008
12317D20774B6618R1757J56638A9363J68521R293F1839a77238A01459J42469a15437
12305d68485A97994K59692A58880A1986J4367a45290N3132m8440B16625b81B2942
12293b35357g2338A16099c910l0189A97045G2405Q1642o6943J26564D4332J70989
$$ plain form
12372 -71110 209274 23700 -250599 328018 153902 -135671 -285970 10630 -143122 -29535
12361 149993 40000 -166120 -3045 -84969 350128 243332 -80205 -119046 207057 -79248 -252348
12350 -252348 206592 -48122 69493 -13909 -60584 -124837 173491 26328 967 45560 181564
12339 181564 -119639 164305 199828 -84469 15899 -156558 293548 -66140 -25854 86749 -80115
12327 244896 139433 -299398 128101 -88199 282591 55898 442894 -46271 110766 420774
12317 420774 26618 118375 275013 19363 187884 197177 61839 -177238 101459 243928 -115437
12305 -468485 197994 457686 158880 11986 26353 -145290 -92158 -140598 216625 -281 22942
12293 -235357 -72338 116099 -3910 -34099 197045 72405 154047 87104 213668 44332 215321
12282B15321L0920J30445A11156m2367IP6674J694a54431A78484R9670A29856
12270g1702A47286l0618Q3196q918a29204E8427J43079Q795j6329e0680A1732
12258E15751A28413P4414H8701k9057K70825A17701b78601a6923B99836F8104
12247B46041l3893i5572A95762J06172j00260a43338a9874A85881a03793I4266
12236B04887p6121c3053B41041a6674B35332e47306A34030a22613A72773C0017
12225A35371a77288C09930D7716N10502A80218J48130H8870K71147a5102I355
12214A11359J2863J6789D9787J07683p3123C7850J52486B6271a11436I5693R7475
12203A93168b0773j19780F5927c43B88181K13657D3800N34380A66785K09721J05130
$$ plain form
12282 215321 246241 376686 111156 68789 9 76683 78377 -154431 178484 278154 129856
12270 -71702 147286 116668 199864 190946 -129204 58427 201506 210301 193972 -50680 11732
12258 515751 128413 202827 88701 59644 330469 117701 -278601 -16923 299836 68104
12247 246041 212148 -95572 195762 301934 201674 -143338 -19874 185881 -103793 94266
12236 204887 128766 -33053 241041 -16674 235332 -547306 134030 -122613 172773 30017
12225 135371 -177288 309930 47716 558218 180218 328348 88870 360017 -15102 9355
12214 111359 124222 141011 49787 157470 84347 37850 190336 26271 -111436 95693 193168
12203 193168 -20773 -140553 65927 -343 288181 501838 43800 578180 166785 376506 481636
12192D81636a4800n8670A06747L30109A55653L01774E4065a0517B60479L5995
12182B96474a037C26192C1093a05202c3897J3948C74462p1701j11846F3869R3799
12171A57668J32743J21291A30124k2972N6604m1809K83272A04077J78848A01608
12160C08914L0589E3634L03061A72684K1163C0893K73376e4197B55345j2599l2376
12149B10370J99739F0414j7783K16825R7958a23618e6500j00591B44102p8108
12139A65994F5700L60012b5975j07102e872E2367J066a06801c7856j43899O4395
12128a17360F1916J55346k217F3697J81245b39623b4038E48481j46656b51346
12117B25405j06940h7915j377B75161B5978K11402a9243k05985I7228b29208C23936
$$ plain form
12192 481636 -14800 -73470 106747 436856 155653 457427 54065 -10517 260479 296474
12182 296474 -1037 326192 31093 -105202 -33897 -19949 374462 302761 190915 63869 157668
12171 157668 290411 411702 130124 107152 163756 121947 405219 104077 282925 101608
12160 308914 339503 53634 356695 172684 193847 30893 304269 -54197 255345 242746 210370
12149 210370 410109 60414 42631 259456 357414 -123618 -56500 -157091 244102 165994
12139 165994 65700 425712 -25975 -133077 -5872 52367 53433 -106801 -37856 -181755 -117360
12128 -117360 61916 217262 215045 63697 244942 -239623 -24038 548481 401825 -251346
12117 225405 118465 -87915 -89292 275161 25978 237380 -19243 -225228 97228 -229208 323936
12105d264j25880H0753K5137J80866Q246a0385A13051J18104a22608B59032K22553
12094D81585H7486K42579f4448B32559c8978k7653B53228r5245F3383a17422A68738
12082c15388a55855A42063B8942J70612c0476A3098J44074c6856q7366C54905
12071C68359j34868a04820B16598D4178e7250H0931b81418C34050n1439l1495
12061B51116J5384E5377a14077M1643P59B3466a39759A92176I2670a10942a6031
12049A91401b3573F3747K8973l5418M8912a2673n1239B61069a56074k0535P6749
12038i9860D8973J4255J52695a36480c1740A24744N0305N5076D4504J03421o8888
12027G9037L49104b56282A84343H2883e6226k59805A61313R2302p2714R107I3694
$$ plain form
12105 -4264 -130144 80753 105890 286756 295002 -10385 113051 231155 -122608 259032 481585
12094 481585 87486 330065 -64448 232559 -38978 -66631 253228 157983 63383 -117422 168738
12082 -315388 -155855 142063 28942 199554 -30476 13098 157172 -36856 -124222 354905
12071 368359 233491 -104820 216598 44178 -57250 80931 -281418 334050 282611 251116
12061 251116 266500 55377 -114077 -72434 -71675 23466 -139759 192176 92670 -110942 -16031
12049 191401 -23573 63747 92720 57302 106214 -12673 -63912 261069 -156074 -176609 -99860
12038 -99860 48973 63228 215923 -136480 -31740 124744 175049 230125 44504 147925 79037
12027 79037 428141 -256282 184343 82883 -56226 -316031 161313 253615 180901 190008 93694
12015d0376o5791h783A58205j540a27930D7797J07883c70347F3122a24805B489
12003d4434E0577a1106j31991L3882G3515d06046B1920J3722f5402j12015f9409
11991a60621A08150h5528A47221n9350B4441b99357H56M4476k253e0211H4657
11979D3778O2886b32762a6220C4424g158l7628G2795k7785a68302B77586G6816
11967B239J19525a01497H3937h127j52481d2915G7871J19572e26787I1841P4455
11956A66296h8292A02262b83142a4121O1r5002l4471d1613B15751l5995o4145
11945A15611a90062r3767G0936A8835J83621D0368I696J74163a2386E9130c64974
11933a01675j03599j05290N7360f75B96002a3164p164B50254r0244E6653a08800
$$ plain form
12015 -40376 -106167 -8783 158205 156665 -127930 47797 155680 -370347 63122 -124805 2489
12003 -44434 50577 -11106 -143097 -109215 73515 -406046 21920 35642 -65402 -177417 -69409
11991 -160621 108150 -85528 147221 87871 24441 -299357 856 45332 43079 -50211 84657
11979 43778 106664 -232762 -16220 34424 -7158 -44786 72795 45010 -168302 277586 76816
11967 2239 121764 -101497 83937 -8127 -160608 -42915 77871 197443 -526787 91841 166296
11956 166296 -88292 102262 -283142 -14121 -14060 -109062 -143533 -41613 215751 179756 115611
11945 115611 -190062 -283829 70936 18835 202456 40368 9696 183859 -12386 59130 -364974
11933 -101675 -205274 -310564 -253204 -675 296002 -13164 -20328 250254 160010 56653 -108800
11921d50254B9129J05141P239a3707k62260A38943a41883a8418A04649f1728K0666
11910d1062C29674e2872j92344E79332a52209A08968P0149a22481A9276K97553
11900C16829q6704a29799e0213j53102C0848L72205f1353A83304J25177c25791
11889a44460k6306C86752b07783D0538b5082k76394A18963a49764A33792c13795
11878e1254B6596M31189C2798K61453b33183A40474b14729c930n6063D1678b40106
11866A20426C640d2877A92949D0263J24495b32334a15149F523f3817j9272r1152
11855a74241B33842A05520b51196C5416a48435e1614A02994k9015c4714A21196
11844A38083D7961N4664f7198k84452H9474J82940b25001M7201e2942k7142B5801
$$ plain form
11921 -450254 29129 134270 141509 -13707 -275967 138943 -141883 -18418 104649 -61728 -41062
11910 -41062 329674 -52872 -245216 579332 -152209 108968 179117 -122481 19276 316829
11900 316829 230125 -129799 -50213 -203315 30848 403053 -61353 183304 308481 -325791
11889 -144460 -170766 386752 -207783 40538 -25082 -301476 118963 -149764 133792 -313795
11878 -51254 26596 457785 32798 294251 -233183 140474 -214729 -3930 -59993 41678 -240106
11866 120426 3640 -42877 192949 40263 164758 -232334 -115149 6523 -63817 -83089 -174241
11855 -174241 233842 105520 -251196 35416 -148435 -51614 102994 73979 -34714 121196
11844 138083 47961 102625 -67198 -351650 89474 272414 -225001 -177800 -52942 -80084 25801
11832h8730j92566c7770G4132c85533m3018B3116a18407A43921k679C0454L27634
11821C58088f5491r351m7395k29315I4683J69755c04858J12901K4803J5910I0982
11809f1389j25603h2720a0676A68303B0177a62356B8736K8445b2097A0780a38897
11797a18460E6590g1486E8238A0356J01918N479b46008J14058a3281A12358b09935
11785B52145c907A60950K6024a35316J6876D9070M2720N610J31278C6315a96420
11773a00493G6258I931J9978M1033b3683m3882j84190J8864A85612a04858a3738
11761C0301L065b39419A99697a56426B52322h1014Q29K5995A03449C9958b39822
11749a55275A0772d72693B91218a84503B03501c64142A62019a29021f2317e959
$$ plain form
11832 -88730 -281296 -37770 74132 -385533 -428551 23116 -118407 143921 141242 30454 358088
11821 358088 -65491 -74842 -122237 -351552 94683 264438 -304858 -191957 -167154 -151244 90982
11809 -61389 -186992 -82720 -10676 168303 20177 -162356 28736 57181 -22097 10780 -138897
11797 -118460 56590 -71486 58238 10356 112274 117753 -246008 -131950 -13281 112358 -209935
11785 252145 -3907 160950 186974 -135316 -118440 49070 91790 97400 228678 36315 -196420
11773 -100493 76258 9931 29909 70942 -23683 -67565 -251755 -232891 185612 -104858 -13738
11761 30301 33366 -239419 199697 -156426 252322 -81014 -80185 -54190 103449 39958 -239822
11749 -155275 10772 -472693 291218 -184503 203501 -364142 162019 -129021 -62317 -5959
11738a4883A42989C8238J04448D2547K73282a80553H2149J02686a8804j36037
11728a54841P7393J067l6524j89362N2272j6310r2837h9160A04781e2678I187
11716a29470J0870l992B1887J67189b6568j00434q798A7409J64858J76076A52458
11704A26323b21706O2580O5944D19P5448R4603b13298F9424b4404j6394j44287
11693a85085L7923B34013o4935b43384B46079p7844o8942l6524d0734A58614c541
11681a18717G4663J53355L8689R4275R1136A08000B5303i7408F752e8838o7530
11670a26368j7403B9172J48113b18851D642J55173j2688E9593a7643B34621a83142
11658B90181a66940C9812J79650b85297N6396j3708R4534M0452A5996J62481h6352
$$ plain form
11738 -14883 142989 38238 142686 42547 315829 -180553 82149 184835 -18804 -154841
11728 -154841 -77448 -76381 -112905 -302267 -249995 -266305 -359142 -89160 104781 -52678 9187
11716 -129470 -118600 -122592 21887 189076 -26568 -127002 -135800 17409 182267 358343 152458
11704 126323 -221706 -159126 -93182 419 75867 170470 -213298 69424 -24404 -40798 -185085
11693 -185085 -147162 234013 169078 -243384 246079 168235 99293 62769 -40734 158614 -3541
11681 -118717 74663 228018 266707 360982 452118 108000 25303 -97408 6752 -58838 -126368
11670 -126368 -143771 29172 177285 -218851 4642 159815 147127 59593 -17643 234621 -183142
11658 290181 -166940 39812 219462 -285297 -228901 -242609 -148075 -107623 15996 178477 -86352
11646A45027a01971m1457m270A20059g7403A36514O4963j5254r0622k9979g24
11634E8608J36627k1760b7023m4339i791C758Q9403e6329A22059b12698A86750
11622B69486a37714N1689L8032J1735j28853E7936c21335C20397l4187b61564
11611a41619A91926a22304k8846A13274a8317k79251E7905g1802j8121q1900P8595
11600i3228K6874j06857F2110J54378k1893J05342j02980a35223A92693G4549
11589B07093b88934H1500a31498C85825a72917B6084N8252J44810d4738C52949
11578A71799a46493J8653c2530A65534M2723H5653a11751B04780J67371g1428
11567A91885K90652a18139r036c2436H2880b56801B23291G8978i9490A31876g1176
$$ plain form
11646 145027 -101971 -143428 -147698 120059 -77403 136514 201477 186223 95601 65622 -724
11634 58608 195235 173475 -27023 -71362 -9791 3758 93161 -56329 122059 -212698 186750
11622 269486 -137714 -86025 -47993 -36258 -165111 57936 -321335 320397 286210 -261564
11611 -141619 191926 -122304 -151150 113274 -18317 -297568 57905 -71802 -89923 -171823 -93228
11600 -93228 -66354 -173211 62110 216488 194595 299937 196957 -135223 192693 74549
11589 207093 -288934 81500 -131498 385825 -172917 26084 84336 229146 -44738 352949
11578 171799 -146493 -127840 -32530 165534 208257 85653 -111751 204780 372151 -71428
11567 191885 482537 -118139 -127175 -32436 82880 -256801 223291 78978 -99490 131876 -71176
11555F1287J77892D6161J23273A9224J71171E4711O6382M4177A0227J03290J45770
11544B59287A08070c68045a33559H3600K96897c11606A28694l8365M0927k7558
11534A03698a62266B93379K4034a65352e5674A03099J91602h1737H3333d0536
11523h4918c3802D85106B39282m2009J4261Q3918d6026K1341k01233a3351I9401
11511A87597n3031a68163B80459a74044B20643E0261J23794a16906j0603J7893
11501a09616A6241L7160a50730l0060P433A06551d2213E0304P9980K52197b78568
11489B37809F6997N8063j3321a76953C75329a28848A06989K8774b41661C35954
11478D67118k32473O3995a33548C79518n0605a27342A28208E0525J13835l9247
$$ plain form
11555 61287 239179 46161 169434 19224 190395 54711 121093 165270 10227 113517 259287
11544 259287 108070 -368045 -133559 83600 380497 -311606 128694 90329 131256 103698
11534 103698 -162266 293379 317413 -165352 -55674 103099 294701 -81737 83333 -40536
11523 -84918 -33802 485106 239282 197273 211534 295452 -46026 -24685 -225918 -13351 99401
11511 187597 134566 -168163 280459 -174044 220643 50261 174055 -116906 -127509 -109616
11501 -109616 16241 53401 -150730 -180790 -173357 106551 -42213 50304 130284 382481 -278568
11489 237809 66997 125060 111739 -176953 375329 -128848 106989 135763 -241661 335954
11478 467118 234645 298640 -133548 379518 328913 -127342 128208 50525 164360 125113
11468A25113K0742J5674n4477J07431r9683m922K58117j78228e434l034k21628
11457b30096c9900D172g5125a3030D2685J16120K3987a47409C8477P6594J21545
11446B36616M0498j26628G1845K46053e7776f073j00421A14126R910c489j0513
11435a4002A23363J40865l7277N0356a82160e6483m134A91565Q3154e9089I7228
11423B87641f3432A727a47146B77498a23153N6086Q022k522C20599E4552e4551
11411h9121k11391i8995j48892N7397B74061B0257D215J62740m4210d05704a44135
11399C0035a69765F2920b24404B67635n8144c55001a10985a4248p7698p0842A69998
11387A36554C235a10321A00890J57577a64687A28005e1757A91928a27501c4800
$$ plain form
11468 125113 145855 161529 107052 214483 114800 109878 367995 189767 -5434 -8468 -230096
11457 -230096 -39900 4172 -75125 -13030 42685 158805 182792 -147409 38477 115071 236616
11446 236616 277114 150486 71845 317898 -57776 -6073 -106494 114126 124036 -3489 -14002
11435 -14002 123363 264228 226951 277307 -182160 -56483 -60617 191565 274719 -59089 97228
11423 287641 -63432 1727 -147146 277498 -123153 -67067 -59045 -61567 320599 54552 -54551
11411 -89121 -300512 -98995 -247887 -190490 274061 20257 4215 166955 122745 -405704 -144135
11399 30035 -169765 62920 -224404 267635 209491 -355001 -110985 -14248 -91946 -162788 169998
11387 136554 3235 -110321 100890 258467 -164687 128005 -51757 191928 -127501 -34800
11376b62985a2166q4464j97210G8804l8219J22152b77522D52772c41433a30821
11365A55579J10919G171a90281M4015A6362K393f3531k7106j48685A72820a33042
11353a41996f6240j17400A4013K1077a18230A69118a5606I7768e9820A69198b21532
11341g7230a90A20869a48608A65939b65176k5077i391B46130K3560b34226b313
11329b86679P3384l1498A12625a05627A62781B4726e4712b7177j59390j45063
11319c31630A38302f1753g92r1804D05109b09038E9950c07745A79134D4068g9890
11307d27077J82041A9669c20152e8795J0942m3235A88673G3874J39013J3592B5686
11295a71381D215a41244m2686o2306C3127i3468A13366a64125M4855m69276E5126
$$ plain form
11376 -262985 -12166 -96630 -293840 78804 40585 162737 -277522 452772 -341433 -130821
11365 155579 266498 7171 -190281 -146266 16362 18755 -63531 -90637 -239322 172820 -133042
11353 -141996 -66240 -183640 14013 35090 -118230 169118 -15606 97768 -59820 169198 -221532
11341 -77230 -190 120869 -148608 165939 -265176 -290253 -9391 246130 269690 -234226 -2313
11329 -286679 -213295 -244793 112625 -105627 162781 24726 -54712 -27177 -186567 -331630
11319 -331630 138302 -61753 -792 -92596 405109 -209038 59950 -307745 179134 44068 -79890
11307 -427077 -245036 19669 -320152 -58795 -47853 -91088 188673 73874 212887 226479 25686
11295 -171381 4215 -141244 -183930 -246236 33127 -93468 113366 -164125 -119270 -588546 55126
11283a34385j9872j18004B57159a36829O5581o8410r7504b1429j29433C4397a01545
11271b4626I6743i7090j05596L2930q3154B17932j3881d2080a099l03800J46622
11260a58277A05176H621K86812B2046a9013D0412j4158b36071O0807N448L1082
11249a38734L5123c3448A67453D8195j0753K3170h500j11979A18969n0624g0094
11237b5521A97359b15633G786b0194k19227K6351B12214r2307b29775N2868M7022
11226a29885A88626h0543j05723m497j58742A54336g7243j69521a00642d9613
11215A50765f1262k2767c1100D776R3772a03233B41284a38017q5577k0336G6049
11203I2288e2186q8350H858a75869B8760J70j2390K40330a01863j34916B14567
$$ plain form
11283 -134385 -154257 -272261 257159 -136829 -71248 -139658 -237162 -21429 -150862 34397 -101545
11271 -24626 96743 -97090 -202686 -169756 -252910 217932 204051 -42080 -1099 -304899 -158277
11260 -158277 105176 8621 295433 22046 -19013 40412 26254 -236071 -175264 -169816 -138734
11249 -138734 -103611 -33448 167453 48195 37442 60612 -8500 -120479 118969 68345 -70094
11237 -25521 197359 -215633 7786 -20194 -239421 -213070 212214 119907 -229775 -176907 -129885
11226 -129885 188626 -80543 -186266 -190763 -349505 154336 -77243 -246764 -100642 -49613
11215 150765 -61262 -84029 -31100 4776 98548 -103233 241284 -138017 -223594 -243930 76049
11203 92288 -52186 -140536 8858 -175869 28760 28930 16540 256870 -101863 -236779 214567
11191b60587h4664A04838p341b04126Q3018H8620C3602M777g7962A73273b35773
11179A7561i0146C1516K91778a62139D5966a02655J3155A14307J30354m9065b9371
11167b78715J19085A50461D2605d1847p320I1241a10282J6945m3539C6422a22102
11155b30740A39331a21335j45013f9478D6007J33129J93512j83880r1828b22546
11144D3878P4638a25081f318A6666K38990q6061a61351d6866B17384F5216d4577
11132A41803C0329R0481i0452F9645K11568o5682L12954j53877a74729M8945E8286
11120g68B6478M1203K12356k1429q4190h5515H6098c4484A61111d835A33503K18029
11108C51532d6002r2747I9116F391c39260d8581C9224K12442H9228K58345J2082
$$ plain form
11191 -260587 -84664 104838 97497 -204126 -121108 88620 33602 38379 -77962 173273 -235773
11179 17561 -90146 31516 323294 -162139 45966 -102655 -89500 114307 244661 195596 -29371
11167 -278715 -159630 150461 42605 -41847 -49167 91241 -110282 -93337 -136876 36422 -122102
11155 -230740 139331 -121335 -266348 -69478 46007 179136 372648 188768 96940 -222546
11144 43878 118516 -125081 -6318 16666 255656 169595 -161351 -46866 217384 65216 -44577
11132 141803 30329 120810 -90452 69645 281213 215531 528485 374608 -174729 -125784 58286
11120 -768 26478 67681 280037 258608 174418 -85515 86098 -34484 161111 -4835 133503 351532
11108 351532 -46002 -138749 99116 6391 -339260 -48581 39224 251666 89228 347573 359655
11097C59655C6433K5944M80858I840J40930K53744j3505n2964k3343A08614N33618
11086F42232D7121K23146i0202A62161K29472A46832f2475D73085k13731J74809
11076D34163L5892A35902N62315k66660N7149Q1430A50568E595K42163M20212
11066F67970k38065J61202j98784K550J05805r1771k01449J45864K12461P4417
11056F40200j89733N02570l81439J27980l05802N73199j36374l0456m6842k13342
11046E39961K39031P9427j65374J68860J42631n9659l00378L58819q1504k65310
11036F56504K17911n2022N6393j57955L42489k04578l32799J19910J30278L2508
11026H08639j23394L26206j98979r7147j3993J45681j05799K94843m71158k41676
$$ plain form
11097 359655 36433 62377 543235 9840 150770 404514 391009 338045 314702 108614 642232
11086 642232 47121 270267 -90202 162161 391633 146832 -62475 473085 259354 434163
11076 434163 470055 135902 698217 431557 488706 570136 150568 5595 247758 667970
11066 667970 429905 591107 392323 394873 500678 408907 207458 353322 565783 640200
11056 640200 450467 953037 571598 699578 393776 966975 830601 800145 753303 539961
11046 539961 778992 858419 693045 861905 1004536 944877 644499 1003318 921814 656504
11036 656504 874415 822393 878786 720831 1063320 858742 525943 645853 776131 808639
11026 808639 685245 1011451 812472 715325 701332 847013 741214 1036057 564899 323223
11016C23223L20971J43545k41988M0583L37457l05735P8295j7423j66265J02887
11006F15550n9753p4288J78492O8341J46538k9013C85447L53061p398Q3839j66501
10995F48448j09332J04030K09319m573N4370l4691n2064m1654J54308j26119K9056
10984H31098l6521J63371r662k77388L91280j38562K62793L31242j96047l9663
10974A281941O16243N45430l30122K89772j5603O07035J19771J15748l49806J17580
10964B997989k23856k24153o53797j5269o86203L13341R5540l22961K07793n1417
10954A437007K40840o865k71972n9047J43877m37422j50493j65951j40284k19559
10944C70131L40046C31761n5862A02325K73119A60832P5642M5380A06614J0737
$$ plain form
11016 323223 644194 787739 545751 586334 923791 618056 696351 678928 512663 615550
11006 615550 555797 481509 660001 728342 874880 845867 385447 738508 731110 814949 648448
10995 648448 539116 643146 852465 847892 902262 867571 815507 773853 928161 802042 831098
10984 831098 794577 957948 948286 670898 1062178 923616 1186409 1517651 1321604 1281941
10974 1281941 1898184 2443614 2113492 2403264 2387661 2994696 3114467 3230215 2880409 2997989
10964 2997989 2774133 2549980 1896183 1880914 1194711 1508052 1603592 1280631 1488424 1437007
10954 1437007 1677847 1670982 1399010 1339963 1483840 1046418 895925 729974 589690 370131
10944 370131 710177 331761 275899 102325 375444 160832 236474 281854 106614 117351
10934A17351D5662c0402G9264c0741o8884g120j5899C70119a46809n6013g7056
10922b1985A52405a21560E02610m1301j52934n4677K44441i1427k7443D01469
10911I7700J56333b3744B81221j12934D7590j4669b75448i8963B90843B5384R6644
10900A22028k4785L8638e1832n2913A78734a59270C30894b06292A83533a00687
10889a27265j3244N4199B15165d6449k41332A57559E7514f170A69558c80843a7031
10877b40338A32174c3230O634q1877j46127M0169A15752d75692K05108I5828f1641
10865a41762j1173g5941F7342d29920i5522B40821a38545l5455k33715h5880j0947
10854i6827A7951e7560I5501b63997h9707D070P8786b2745A05589l260a70882
$$ plain form
10934 117351 45662 -30402 79264 -30741 -99625 -7120 -23019 370119 -146809 -202822 -77056
10922 -21985 152405 -121560 502610 461309 308375 253698 498139 -91427 -118870 401469
10911 97700 254033 -23744 281221 168287 47590 32921 -275448 -98963 290843 25384 122028
10900 122028 97243 135881 -51832 -104745 178734 -159270 330894 -206292 183533 -100687
10889 -127265 -140509 -86310 215165 -46449 -287781 157559 57514 -6170 169558 -380843 -17031
10877 -240338 132174 -33230 -26596 -108473 -254600 -214431 115752 -475692 -270584 95828 -61641
10865 -141762 -152935 -75941 67342 -429920 -95522 240821 -138545 -174000 -407715 -85880 -96827
10854 -96827 17951 -57560 95501 -263997 -89707 4070 82856 -22745 105589 102329 -170882
10842A53985b56046J13799M7088c9818a9109k48287A7168p608b98023a12250J829
10831a10421G114i8652I1087b61182N1227k9555A49783G1535b55306a5189A57025
10819a243l47326J24482A29246a95464E10444h0782k69198a70657n5992B08636
10808a25622l14715d647A22290a33182B60547c9125r9731e2934j18728N0254A78318
10796F4524b58829J05584A70638g2224j07006D7331b75176a19909F9478J24221
10786A93699F1314J67156a9945k42165F4379k4861Q9501h6408B3632j568n428
10775A6636a7984B72367b57194A69370a84193B55660b00023M6769j43962B2997
10764a13323j88413d2568r097l1953c3459F4472i4909c9716G6199d5448R226a263
$$ plain form
10842 153985 -256046 -142247 -95159 -39818 -19109 -267396 17168 9560 -298023 -112250 -110421
10831 -110421 7114 -98652 91087 -261182 -209955 -239510 149783 71535 -255306 -15189 157025
10819 -1243 -348569 -224087 129246 -195464 510444 -80782 -349980 -170657 -226649 208636
10808 -125622 -440337 -4647 122290 -133182 260547 -39125 -138856 -52934 -171662 -121408 178318
10796 64524 -258829 -153245 170638 -72224 -179230 47331 -275176 -119909 69478 193699
10786 193699 61314 228470 -19945 -262110 64379 39518 129019 -86408 23632 22064 16636
10775 16636 -17984 272367 -257194 169370 -184193 255660 -200023 -153254 -297216 22997
10764 -113323 -301736 -42568 -51665 -83618 -33459 64472 -94909 -39716 76199 -45448 -36222 -1263
10751a57982D80165h2723A14743J01615F264J56449f4240A72763e2187j67444
10741b19631A32512q543b37839l9057e5441k15210i4486h3C97707p2262b27682
10729a60790f3340j53635j49731A73583b57671A82011g036m48793I7016J67262
10719B64278A1002c64790J50998P6911j49154a05506q4861L1245F9062g035p5113
10708h2148j2885A05053f2317j03814O1328e2078l26743f7039l16597a08898E8481
10696i7422A17625i5300j54593B4946J256a2121j11529J0248k44330A60189a63387
10684a11208A38863a43397j18735A48360P005b12581A97322D7086J22098g2976
10673b28472C5232f864l51268O3696P3916C3625a34385M966l2947F9160a37384
$$ plain form
10751 -157982 480165 -82723 114743 216358 6264 162713 -64240 172763 -52187 -219631
10741 -219631 132512 123969 -237839 -276896 -55441 -270651 -94486 -83 397707 325445 -227682
10729 -160790 -63340 -216975 -366706 173583 -257671 182011 -7036 -455829 97016 264278
10719 264278 11002 -364790 -213792 -136881 -286035 -105506 -190367 -159122 69062 -7035 -82148
10708 -82148 -95033 105053 -62317 -166131 -104803 -52078 -378821 -67039 -383636 -108898 58481
10696 -97422 117625 -95300 -249893 24946 26202 -12121 -123650 -113402 -357732 160189 -163387
10684 -111208 138863 -143397 -262132 148360 155365 -212581 197322 47086 169184 -72976
10673 -228472 35232 -6864 -358132 -294436 -220520 33625 -134385 -129419 -162366 69160 -137384
10661A95617a00741A77898J26000b10587B2798N805a29901j5957F044a02441K3418
10650g9023k7906A02825K73059B7115M6588c41185B00243b20835C870J27251c8178
10638c06845g5515j64028J10077e2520J4498k02751d7221A01562b52475N6083
10628a96392e9738q6506l4265E4650f2232A56980a36044E6940b03244k48875A12764
10616b83925h0862B334J34229a50681F2920b58439J13445i79A41276c13189O9922
10605b43267M7059A4708j891c66867E0854c03303f6398n6689l81595A23319g9668
10593b34525R2766A03492d23420B6569N348a41265C7355b89381f6689j29336M2343
10582a53682A04662M8572a05376B854c3337l5293k24143P3108A52152b55973H208
$$ plain form
10661 195617 -100741 177898 303898 -210587 22798 28603 -129901 -145858 6044 -102441 -79023
10650 -79023 -106929 102825 375884 27115 73703 -341185 200243 -220835 3870 131121 -38178
10638 -306845 -75515 -239543 -129466 -52520 -38022 -240773 -47221 101562 -252475 -196392
10628 -196392 -59738 -146244 -180509 54650 -62232 156980 -136044 56940 -203244 -452119 112764
10616 -283925 -80862 2334 136563 -150681 62920 -258439 -144994 -979 141276 -313189 -243267
10605 -243267 -196208 14708 12817 -366867 50854 -303303 -66398 -123087 -504682 123319 -79668
10593 -234525 -141759 103492 -423420 26569 31917 -141265 37355 -289381 -66689 -196025 -153682
10582 -153682 104662 153234 -105376 2854 -33337 -68630 -292773 -219665 152152 -255973 8208
10570f4196r9193B2253K30461i810A41105o5650b21231q1244e1157j82259A91719
10558g3621C7804Q163a76058l519D4857R8763F8032a61492C07590A2506h6066
10546i0796A33875j1258l3198g1773j10631l8109f4523b2829B10017j9920b13553
10534b17709P8169O4627r5699A8876f6790l54103E3499B1040i7162p8816q8100
10523b64078g5783A17500b89609a25430A92468b66010B3031J83204i4147j46470
10513b40617p9714A42384M9209d9360A90244A0425b15697D1075b52205d2690j06774
10502a49464B43483N6373B5293M8937d2059o4735A67161a05992n5541l3625h5809
10490D2931e7800A3708i3776q4795q1377D1782e7449A81080n9480L7229Q2033
$$ plain form
10570 -64196 -163389 22253 252714 -9810 141105 75455 -221231 -302475 -51157 -233416 191719
10558 -73621 37804 45967 -176058 -179577 44857 143620 68032 -161492 307590 12506 -86066
10546 -90796 133875 122617 89419 -71773 -182404 -220513 -64523 -22829 210017 190097 -213553
10534 -217709 -139540 -74913 -170612 18876 -66790 -420893 53499 21040 -97162 -175978 -264078
10523 -264078 -75783 117500 -289609 -125430 192468 -266010 23031 206235 -94147 -240617
10513 -240617 -320331 142384 191593 -49360 190244 10425 -215697 41075 -252205 -42690 -149464
10502 -149464 243483 299856 25293 74230 -42059 -106794 167161 -105992 -161533 -195158 -85809
10490 42931 -57800 13708 -93776 -178571 -259948 41782 -57449 181080 121600 158829 240862
10479B40862A01757M80736C0213P18508l46110A50444K40803D7546J68365a62224
10468b04543A1591K67342n8935a4619F3584i1872p876k73270A95966a29840C8966
10456F7688A1025c67003B94672q4312n8078J42212i2672H2783b401j00811A4400
10444B8385b00333l03694C9488a65123M7349j0867I0334l9562k0342q95a64540
10432G13a1290k23368M4005f6821J7237A32568a90735E9263r563a61333f2144
10420A84567q7995b01581A64361J8728a26482E6512c58575Q4726J07635i395p088
10409a6483k23236A1330J78129E9573c30721a20991f412A19842b6449E6233J57488
10398B13721A03209M8468A7212b44752a15340j29612E3273P238a13393j95137
$$ plain form
10479 240862 101757 582493 30213 748721 402611 150444 391247 47546 215911 -162224
10468 -204543 11591 278933 219998 -14619 63584 -91872 -99748 -373018 195966 -129840 38966
10456 67688 11025 -367003 294672 210360 152282 294494 -92672 82783 -2401 -103212 14400
10444 28385 -200333 -504027 39488 -165123 -117774 -128641 90334 50772 30430 29535 -164540
10432 713 -11290 -234658 -190653 -66821 -49584 132568 -190735 59263 49700 -161333 -62144
10420 184567 96572 -201581 164361 183089 -126482 56512 -358575 -273849 -166214 -9395 -16483
10409 -16483 -239719 11330 189459 59573 -330721 -120991 -6412 119842 -26449 56233 213721
10398 213721 103209 151677 17212 -244752 -115340 -244952 53273 60511 -113393 -308530
10388c08530I0044P7098J38222A29264j1730K06873a5776I1297N3704R7545a6892
10376A40706R3636G9902L92660A34508J83937E5209O998K26064A12191Q2845K81896
10365D76932L5608O0079j71400j78436J85557J97326A97306K35971j07182K93752
10355F19847e7364E3165J3627R7928L64591K00122p9939k08900k9919M2738I8957
10343G2179J47595L07715k22930l8385B3211K59132A1582J36744o9024J6910M7283
10332A43495J74779k4013j46618b52975Q9061j51892a10553a8096G603J08006
10322A15609Q3436K56992j03181K5727C2470J72071J29354H6800L23117j63126
10312B46791j14248i438j24285f2157B1838J32252h2337A43988a11474J299N1895
$$ plain form
10388 -308530 90044 167142 305364 129264 117534 324407 -15776 91297 145001 242546 -16892
10376 140706 234342 79902 472562 134508 318445 55209 62207 288271 112191 195036 476932
10365 476932 512540 572619 401219 222783 408340 605666 197306 433277 326095 619847
10355 619847 -57364 53165 66792 164720 529311 729433 649494 440594 410675 453413 98957
10343 72179 219774 527489 304559 266174 23211 282343 11582 148326 79302 96212 143495
10332 143495 318274 294261 147643 -252975 -163914 -315806 -110553 -18096 7603 115609
10322 115609 199045 456037 352856 378583 32470 204541 333895 86800 409917 246791
10312 246791 132543 -9438 -133723 -62157 21838 154090 -82337 143988 -111474 -110175 -58280
10301e8280D43940a40775B3786b35747B81277i9024o687j3162J2844C42045i7195
10289a62926I5688b2451H5480C5151a44848A37030d3535r036k7838j1109E1147
10277A98647D7261b0901n9850r7138j2501L0640n0682A08529b09197o6664B14244
10265A15778b2470B50984j6796b0977j92300Q5658l1603D5419L6880J20610I5193
10253E36760j23357j23877A20410d4121E7628f8985I9220a70916A9265J18757
10243A38022B0623b99412a40975a343A90757c61521i1019M3967K1355j23752o3577
10232b13026i2290F3321a6403j31267J5918f852n0425A22692C2045f1165B666
10220G8416b03016J3670A3093a26479M7303n0640e7370J2585j17812j91407a55105
$$ plain form
10301 -58280 443940 -140775 23786 -235747 281277 -99024 -105711 -118873 -106029 342045 -97195
10289 -162926 95688 -22451 85480 35151 -144848 137030 -43535 -52571 -80409 -91518 51147
10277 198647 47261 -20901 -80751 -177889 -190390 -159750 -210432 108529 -209197 -275861 214244
10265 115778 -22470 250984 234188 -20977 -213277 -127619 -159222 45419 82299 202909 95193
10253 536760 413403 289526 120410 -44121 57628 -68985 99220 -170916 19265 138022
10243 138022 20623 -299412 -140975 -1343 190757 -361521 -91019 -47052 -25697 -149449 -213026
10232 -213026 -92290 63321 -16403 -147670 -131752 -6852 -57277 122692 32045 -61165 2666
10220 78416 -203016 -189346 13093 -126479 -79176 -129816 -57370 -44785 -162597 -354004 -155105
10208a53156n5381I1880J20569r9697F923Q4551a75180O3314E1873c21183c8426
10196B0585c01870a28780l7309h1282q2227N2293j32941a12985o3702I1795a55137
10184H198b79427G9061Q7798k5231a17986D8628J33335a51772j80350F9390K2932
10173I2322B5201Q0969c35380O6760n4078Q6006a02510k90757r347H0269J94027
10162B74296A04516a0895A55125a97863A3813a97504A5684c07367h2216D2631
10151C5427a81229B11041a56205B24847a41069n2736h1696B04212b42639i5215
10140h1207A68352b7926A1436K66650F404b60726e1276C9745h4412j3270r8769
10129a96451R2524A14491D4533R0425B5459L2814a08195K2305O396M293j35185
$$ plain form
10208 -153156 -208537 91880 212449 112752 6923 91474 -175180 -111866 51873 -321183 -38426
10196 20585 -301870 -128780 -166089 -81282 -163509 -111216 -244157 -112985 -176687 91795 -155137
10184 8198 -279427 79061 166859 141628 -117986 48628 181963 -151772 -332122 69390 92322
10173 92322 25201 106170 -335380 -268620 -322698 -236692 -102510 -393267 -402614 80269 274296
10162 274296 104516 -10895 155125 -197863 13813 -197504 15684 -307367 -82216 42631
10151 35427 -181229 211041 -156205 224847 -141069 -193805 -81696 204212 -242639 -95215
10140 -81207 168352 -27926 11436 278086 6404 -260726 -51276 39745 -84412 -97682 -196451
10129 -196451 -103927 114491 44533 134958 25459 58273 -108195 -85890 -79494 -75201 -210386
10118b10386B46669C391a81724n2160n6540e9939b9714f473l04829a44840d1742
10106e9611B63012c11119a22734B71433e55166H5504b36259b5130j66904c2328
10095i255I9344a91778B542b74638P2993Q8838A38278a86525j72192B11675b7208
10083a06509B26621b16900d5909l32497a53665A30425b650j98157R0932I847b8537
10071B16756a64203J8647l7728F024L58962c62726h1949K5178F8769i912l8210
10060d8122F8272a09569A85611C2819a10562B39232D9922l448K7950i8211l52208
10049d50419f6669q6784C6796i6733a1744j01068B57324h586C43725I1776K6296
10038A18072b76713J26803j32663P5762e4415k07512A61094b20350O1599P2245
$$ plain form
10118 -210386 246669 3391 -181724 -233884 -290424 -59939 -29714 -6473 -311302 -144840 -41742
10106 -59611 263012 -311119 -122734 271433 -555166 85504 -236259 -25130 -192034 -32328
10095 -9255 99344 -191778 2542 -274638 -201645 -112807 138278 -186525 -358717 211675 -27208
10083 -106509 226621 -216900 -45909 -378406 -153665 130425 -2650 -200807 -109875 9847 -28537
10071 216756 -164203 -145556 -183284 6024 364986 -362726 -81949 -56771 68769 -9912 -48122
10060 -48122 68272 -109569 185611 32819 -110562 239232 49922 46474 74424 -98211 -450419
10049 -450419 -66669 -153453 36796 -96733 -11744 -112812 257324 -8586 343725 91776 118072
10038 118072 -276713 -149910 -282573 -206811 -54415 -261927 161094 -220350 -158751 -86506
10028h6506c9399D9945J20514a19834j12259a1441A61184B1962N3388a2608j25622
10017a38230a7358A14276c0468i386r5612l0371F6079a2382k83297h9269j34940
10006b24209k27421J68805a15242M462j35298A0898b17708g8335A9733J1265N8609
9995H9607A7744b80840k98765b33266k34842a69432O0463l2738A21241K36132
9985C57373b08360A48864c30758B03877b26208B2087J5409A6265N029R8461A5182
9973A1697Q0531b67522C00805a96950j46728a41447O9917j38575e010B62154j1788
9962B50366q4966d4812n177j0750j81553A25299j7265a10698A94105E3914e69207
9950A19831a44899O8725Q029l9881n7647a0552j87810q2001J10454M8815J5880
$$ plain form
10028 -86506 -39399 49945 170459 -119834 -232093 -11441 161184 21962 75350 -12608 -138230
10017 -138230 -17358 114276 -30468 -9386 -104998 -135369 66079 -12382 -295679 -89269 -224209
10006 -224209 -451630 -282825 -115242 -110780 -246078 10898 -217708 -78335 19733 30998 89607
9995 89607 17744 -280840 -579605 -233266 -468108 -169432 -108969 -141707 121241 357373
9985 357373 -208360 148864 -330758 203877 -226208 22087 37496 16265 21294 119755 15182
9973 11697 92228 -267522 300805 -196950 -343678 -141447 -71530 -210105 -5010 262154 250366
9962 250366 165400 -44812 -49989 -60739 -242292 125299 108034 -110698 194105 53914 -569207
9950 119831 -144899 -76174 -68145 -108026 -165673 -10552 -198362 -280363 -169909 -121094 -105214
9939a05214A41713c7264l00413P6934J19905j47565I2150C9391a01408B83545
9928f5982e562B11101f0978I1623L59453i5185F4994a36289R555c2730D3191c90741
9915A4319a43613m1312O2323o8893k06294K9325a36672o8172f4068j57698b7342
9903a87357L6451A53973i863k16886A32500a03238L5535C4677K24076c6498A9388
9891a95277A34454e0767j56857E0493b65401f0342B2409a83463h5160k9869J7154
9880i7875J8508n7476A08999B2811J09813r403j4295a27731M0311q0487M7742
9869a20165A02110a2726A00603b91203A09766b10599N8725E0223b37804b7622
9858b06271g2892b926k31639b7476j29245J2795D6465j0267d46020a9417k51815
$$ plain form
9939 -105214 141713 -37264 -337677 -260743 -140838 -288403 92150 39391 -101408 283545
9928 -65982 -5562 211101 -60978 91623 451076 -95185 64994 -136289 -126734 -32730 43191 -390741
9915 14319 -143613 -184925 -122602 -191495 -397789 -368464 -136672 -204844 -64068 -221766 -27342
9903 -187357 -150906 153973 -9863 -226749 132500 -103238 -67703 34677 258753 -36498 19388
9891 -195277 134454 -50767 -207624 50493 -265401 -60342 22409 -183463 -85160 -115029 -97875
9880 -97875 -79367 -136843 108999 22811 132624 123221 108926 -127731 -87420 -167907 -120165
9869 -120165 102110 -12726 100603 -291203 109766 -210599 -151874 50223 -237804 -27622
9858 -206271 -72892 -2926 -234565 -27476 -156721 -143926 46465 36198 -446020 -19417 -271232
9847b71232Q6497A07161a33556f671A52748A9879J51633c84459C31471c7085N102
9836c1983j23676F2491a31307j78933H207d7548l37131A692L6600b35872B28215
9824i8763j31848J07528B24545a27926b1580j90547b2137F3384K0629l7568a40708
9812d2341A32352b3217j66700b3760A8986O724a0993k77679f7997A58J04791A2915
9799a51052C9968a88224j85991P2750P1051R1889A33657b644j10306l29524J47686
9788b94788h5804H0636a59731b448G2106a66444C3868d8557m19561h674j03551
9777a12225D0652a60917A10284h8021j14929c386l3723o4809c7591E0759a35177
9765A36389a78466A70264F7036R657J98651p6477N4343g2569B6856a67537E0753
$$ plain form
9847 -271232 -184735 107161 -133556 -6671 152748 19879 171512 -384459 331471 -37085 -31983
9836 -31983 -155659 62491 -131307 -310240 8207 -47548 -384679 1692 38292 -235872 228215
9824 -98763 -230611 -123083 224545 -127926 -21580 -212127 -22137 63384 84013 46445 -140708
9812 -42341 132352 -23217 -189917 -23760 18986 25710 -10993 -288672 -67997 158 104949 12915
9799 -151052 39968 -188224 -374215 -301465 -230414 -138525 133657 -2644 -112950 -442474 -294788
9788 -294788 -85804 80636 -159731 -2448 72106 -166444 33868 -48557 -468118 -8674 -112225
9777 -112225 40652 -160917 110284 -88021 -202950 -3386 -37109 -101918 -37591 50759 -135177
9765 136389 -178466 170264 67036 76693 275344 198867 253210 -72569 26856 -167537 50753
9753a06948j46197o9983J017J14678e4178G5878R3324l1017n8372a38638N4442
9742h4196A11379a98806c6278A81625l1813b70476K6100A274R0516K15536N749
9731C13075E0712P0003i8855p718B64488h4127k25746N6303G8829a77417J4268
9720a63149A60113a29867B97722b43183N8221B7285J18585M030J09744i0470A10907
9708g3306N858j40227A49579f267k62166m3540j00466a97374c3577A29563a28603
9696b32389K1043J03885A3917c46464J25546L453M8139b5655p0108A28605b32300
9684B24775a68119B0987J51b18200f5011j22451d6638j99994B04287a5858r902
9673b5760p4887j98080J3152i9925H7829a60519A10482h8630j52554l9988J1144
$$ plain form
9753 -106948 -253145 -323128 -322111 -207433 -54178 75878 169202 138185 79813 -138638 -84196
9742 -84196 111379 -198806 -36278 181625 149812 -270476 -244376 1274 91790 307326 313075
9731 313075 50712 120715 -98855 -106573 264488 -84127 -309873 -253570 78829 -177417 -163149
9720 -163149 160113 -129867 297722 -243183 -184962 27285 145870 149900 259644 -90470 110907
9708 -73306 -67448 -207675 149579 -6267 -268433 -311973 -412439 -197374 -33577 129563 -128603
9696 -232389 -211346 -107461 13917 -346464 -220918 -217465 -169326 -25655 -95763 128605 -232300
9684 224775 -168119 20987 21138 -218200 -65011 -187462 -46638 -246632 204287 -15858 -25760
9673 -25760 -100647 -298727 -285575 -99925 87829 -160519 110482 -88630 -241184 -281172 -270028
9662b70028A44056p071M8613i5311G0708a29692A67708a64046M0672a1613j81740
9651a93353C0057b01883i3906A35168J35004A29072E3333a02213n71320a7704
9640a6914n1989O249J8432o6372A54839a41793j13875O7424f4918E3231a94729
9628A17230g562B35884c1227j99080a14257c8177j20808C02280d27680o0514a50403
9616a15422B01911c79115P7739A25702K1863a45549A79267b25351R0553j86490
9606c21288A88562H5809J48767h3230B405P2767a4044M380k17726J06917l368
9595a23841j86610A61799a59333A81015I494l955O6576c15869A59663a87587B9819
9583a72549M8499m0932j20113N5863d2954m54858J84714B9402c12955e1936A77861
$$ plain form
9662 -270028 144056 136985 185598 -95311 70708 -129692 167708 -164046 -123374 -11613 -193353
9651 -193353 30057 -201883 -93906 135168 270172 129072 53333 -102213 -673533 -17704
9640 -16914 -68903 -62654 -44222 -110594 154839 -141793 -255668 -188244 -64918 53231 -194729
9628 117230 -7562 235884 -31227 -230307 -114257 -38177 -158985 302280 -427680 -488194 -150403
9616 -115422 201911 -379115 -301376 125702 147565 -145549 179267 -225351 -134798 -321288
9606 -321288 188562 85809 234576 -83230 2405 75172 -14044 -9664 -227390 -120473 -123841
9595 -123841 -310451 161799 -159333 181015 9494 5539 72115 -315869 159663 -187587 29819
9583 -172549 -124050 -164982 -285095 -229232 -42954 -497812 -313098 29402 -312955 -51936 177861
9571I7505K09465A10271c5631I8348R1998p6712d20431A1157f8155A52227a67997
9559a19028j73021F1635N860a81962e154B12743a2424k97730a54677C2676i6383
9547f8333B77487e5744j1790o8717H7641J4446a59617b0853H618b18625k13667
9536d32292f5870j34428d1109d978j20168j44306F729K920b18019L7119B7902
9524A4644P5165b05194n3831B2487b02886A04811b77714B9414a83077A31858i3778
9512c8914j98592L1902N5546J515Q182B15818h1834M802A69314b7440G2947R8725
9500A71672n7123J61d63703C0297E757a04868K6478l94541J32691A84596m4409
9489A40187F5006c05823b3636p0342k51858a51600c9517k0826A39150b48258P7451
$$ plain form
9571 97505 306970 110271 -35631 98348 190346 113634 -420431 11157 -68155 152227 -167997
9559 -119028 -292049 61635 67495 -181962 -5154 212743 -12424 -310154 -154677 32676 -96383
9547 -68333 277487 -55744 -67534 -136251 87641 102087 -159617 -20853 8618 -218625 -432292
9536 -432292 -65870 -200298 -41109 -4978 -125146 -269452 6729 9649 -218019 -180900 27902
9524 14644 89809 -205194 -259025 22487 -202886 104811 -277714 29414 -183077 131858 -93778
9512 -38914 -237506 -205604 -150058 -148543 -140361 215818 -81834 -77032 169314 -27440 72947 171672
9500 171672 114549 114710 -463703 30297 5757 -104868 -78390 -472931 -340240 184596 140187
9489 140187 65006 -305823 -23636 -93978 -345836 -151600 -39517 -60343 139150 -248258 -170807
9478a70807a8411l1352k01387I0645b08003m9212f781n5974A94753j0145a30517
9466i6855n1005D6595c65468J56211h136j22630C775c34304i9444A9401O9562
9455H8963c2983k28945M2313j7582e1538r8599A49666D7476Q712J62761a40855
9443d84982A9275L19920d05129J79994h4413o2454B87258g0112j07330e2627k97900
9432c50527B52878a12710l08133D6522A7768i1068a8240k15118D0209g1835j80278
9421b52113j02538J36534A08192J03052g9951A13661J23329F1226a25271e2931
9410a86624B2735a44880B28413d1233j93294B24608A7519i6379C3109L9196a70414
9398h2460j33515j1505p457A5681b0717D56334G5855q673C003J17843a46431A5560
$$ plain form
9478 -170807 -18411 -49763 -251150 90645 -208003 -257215 -6781 -62755 194753 184608 -130517
9466 -96855 -147860 46595 -365468 -209257 -8136 -130766 3775 -334304 -99444 19401 88963
9455 88963 -32983 -261928 -219615 -237197 -51538 -150137 149666 47476 56188 218949 -140855
9443 -484982 19275 339195 -405129 -225135 -84413 -146867 287258 -70112 -177442 -52627 -350527
9432 -350527 252878 -112710 -420843 46522 17768 -91068 -18240 -233358 40209 -71835 -252113
9421 -252113 -354651 -218117 108192 211244 -79951 113661 236990 61226 -125271 -52931
9410 -186624 22735 -144880 228413 -41233 -234527 224608 17519 -96379 33109 72305 -170414
9398 -82460 -215975 -227480 -234937 15681 -20717 456334 75855 67182 3003 120846 -146431 15560
9385b8606j89129k12199F8183A0713J15566j0452b84215i3856B1180R9777i7235
9373G5352A1616a70255m9490F5741a24213e4788F4490b8860j17423e6474A71068
9361a86480M0364h995k89234A01981e6292k14722D9749c38576i4269A44437o312
9350A38125c29435J2769I7764a68392A60660a85194h0519k87077R3120b2033o6872
9339h8905L0653j27529g4849j38413A66807a54774k81388B59525b10155d9773
9328G4031e7813B11783a41747L1910L0383j37787A41523b78450R1145D3309c7268
9316b9549H600e32631a75364H0890c5598C1776a81260G3888B6805i4227G6559
9304b17561L5635L3920q5602o7778m0134a5545k01191q9108d1797j01772E4693
$$ plain form
9385 -28606 -217735 -429934 68183 10713 126279 115827 -284215 -93856 21180 120957 -97235
9373 75352 11616 -170255 -219745 65741 -124213 -54788 64490 -28860 -146283 -56474 171068
9361 -186480 -146116 -8995 -298229 101981 -56292 -271014 49749 -338576 -94269 144437 138125
9350 138125 -329435 -316666 97764 -168392 160660 -185194 -80519 -367596 -274476 -22033 -88905
9339 -88905 -58252 -185781 -74849 -213262 166807 -154774 -436162 259525 -210155 -49773
9328 74031 -57813 211783 -141747 -109837 -79454 -217241 141523 -278450 -187305 43309 -37268
9316 -29549 8600 -532631 -175364 80890 -35598 31776 -181260 73888 26805 -94227 76559
9304 -217561 -181926 -148006 -233608 -301386 -341520 -15545 -216736 -305844 -41797 -143569 54693
9292c06267E1389a53891a5045A78398d6801A05099a76645c9732B64733A17274
9281A54698g8500j46534A2170a46236A8541N6921A1437a62130P776a4545j66359
9270a80904q8448A03476b11693P5990j74623D76231g7068j55949a03654A060i7675
9258b08366K7088b1610r900J3971j86686O4242A29021b3858m4918B04951e1949
9246b99868J13438M8229L1534B14661q1712b68660J20929I2515c51709g4774j45769
9235b20543B44808e7855D7617a56629B6837d7378k93545A97727c34766G0728K7722
9224I8450a01852L0166b609F1282a875A28767N9810d9645I6749E221b9795B34072
9211B45734h0190a3424G0113a27510l0245G9754A4759g3986h172l18309A37548
$$ plain form
9292 -306267 51389 -153891 -15045 178398 -46801 105099 -176645 -39732 264733 117274
9281 154698 -78500 -225034 12170 -146236 18541 75462 11437 -162130 -154354 -14545 -180904
9270 -180904 -269352 103476 -211693 -135703 -310326 476231 -77068 -233017 -103654 1060 -97675
9258 -208366 -181278 -21610 -31510 -17539 -204225 -139983 129021 -23858 -68776 204951 -51949
9246 -299868 -186430 -138201 -106667 214661 132949 -268660 -147731 92515 -351709 -74774 -220543
9235 -220543 244808 -57855 47617 -156629 26837 -47378 -340923 197727 -334766 70728 98450
9224 98450 -101852 -71686 -2609 61282 -1875 128767 188577 -49645 96749 5221 -29795 234072
9211 245734 -80190 -13424 70113 -127510 -157755 79754 14759 -73986 -8172 -326481 137548
9199a38750B56175l5805F7411J6512J48l6790b50690k5575a23083O0926A02927
9187i0450A15029a21509j19454C20004e6416b1837p6555j18154F942a74480i822
9175d03324B58716b59694h4295k17893A23489M6701a63693A32730Q3977a66039
9164a95611C1100P1396K8356J02783a44881A58679b14733A58786a81566g0899
9153B0944K3811J422h6527A48201m4372i544G7660c26404Q4573D2788J819K7590
9141G2197L12438c60548R8153f0458C9094d35454a69995L3041H6599B8474a18841
9129F2958i9242a3085o233k44548A53947o8690a44875F2321I845K68137a09748
9117d12903A34682b6006j38354B63600i9278j56772G6816b09888G9315c88142
$$ plain form
9199 -138750 256175 220370 67411 83923 84071 47281 -250690 -276265 -123083 -62157 102927
9187 -90450 115029 -121509 -240963 320004 -56416 -21837 -98392 -216546 6942 -174480 -9822
9175 -403324 258716 -259694 -84295 -302188 123489 170190 -163693 132730 216707 -166039
9164 -195611 31100 102496 130852 233635 -144881 158679 -214733 158786 -181566 -70899
9153 20944 44755 46177 -86527 148201 103829 -9544 77660 -326404 -241831 42788 44607 72197
9141 72197 384635 -360548 -262395 -60458 39094 -435454 -169995 -136954 86599 28474 -118841
9129 62958 -99242 -13085 -19318 -263866 153947 85257 -144875 62321 9845 277982 -109748
9117 -412903 134682 -26006 -164360 263600 -99278 -256050 76816 -209888 79315 -388142
9106b23405K2779A54676J97940a5867j06461d0283C8673b83006F8989J77331f0099
9094a94472d4353j31402M3353k62896h2272a9599r3391A74249O8391i8977j01781
9083b00758e5866P355k80627a18022j77452J21661F3586a56924J747O4288B65403
9071A7977g961j46290A33330l0265P3019b49718A9231a97224d9062C44647a60167
9059B00870i6427m0667E7454a58658k44929A30917b20225A58202c38814a31397
9048A3364a13795C5790c41206L0189B5659J9322J4903f4258H2448L9082a5065
9036h5952G5145J29414a95136O1032k80765a0002B00501a60791f9340j2114K3822
9025e7632j78702J15104B1226K0060J7641a49307n233L0494H6998a30009D07859
$$ plain form
9106 -223405 -200626 154676 352616 -15867 -122328 -40283 38673 -283006 68989 246320 -60099
9094 -194472 -44353 -175755 -132402 -395298 -82272 -19599 -112990 174249 242640 -98977 -200758
9083 -200758 -55866 -48511 -329138 -118022 -295474 -173813 63586 -156924 -155177 -90889 265403
9071 17977 -7961 -154251 133330 103065 176084 -249718 19231 -197224 -49062 344647 -160167
9059 200870 -96427 -137094 57454 -158658 -403587 130917 -220225 158202 -338814 -131397
9048 13364 -113795 35790 -341206 -311017 25659 44981 59884 -64258 82448 121530 -15065
9036 -85952 75145 204559 -195136 -134104 -414869 -10002 200501 -160791 -69340 -81454 -57632
9025 -57632 -236334 -121230 21226 41286 58927 -149307 -154540 -124046 86998 -130009 407859
9013C27490b08113C4236O855K3432N6068E1776a69250B4031a88662A91250o7449
9002A23801B8634c71040B598L11577n8634a95532P4356c0814A91314b28722D02877
8990a72330p3481B95733d4936g239j29922o5674o6106B4983c40832B84991G0044
8978G5102c74114A3779b36733p257i3310F1881J86023a89256o3481C15707p5246
8967B40461D3793M00922A35603a09185A33786a92629p8510i8666k05918i2594
8956D5490b28820N1770k76781a10013h938j44950H0892M13263b48981b8508p43
8945b9251a3547q0538Q040l64152B79497r289J33386j45043b1265j78193A32566
8933e2714E28696A35713b75909H7772a08213M1825A52477j7967b5638D42371J6950
$$ plain form
9013 327490 -208113 34236 41091 64523 120591 51776 -169250 24031 -188662 191250 123801
9002 123801 28634 -371040 2598 314175 255541 -195532 -121176 -30814 191314 -228722 402877
8990 -172330 -245811 295733 -44936 -7239 -137161 -202835 -268941 24983 -340832 284991 70044
8978 75102 -374114 13779 -236733 -243990 -93310 61881 247904 -189256 -252737 315707 240461
8967 240461 43793 444715 135603 -109185 133786 -192629 -271139 -98666 -304584 -92594
8956 45490 -228820 -177050 -453831 -110013 -8938 -153888 80892 494155 -248981 -28508 -29251
8945 -29251 -13547 -94085 -86045 -450197 279497 270208 403594 258551 -21265 -199458 132566
8933 -52714 528696 135713 -275909 87772 -108213 -66388 152477 134510 -25638 442371 459321
8922D59321M91768J598645N972316L99693B515174G18351l31774j73081J50222
8913C63718A57929J20695N5204C930a81865A18486K89183D5450K65489g8355D6087
8901i5861E8614b94878d58k48327F2244J06103e5178A82014b02103K0156B06865
8889B2007d3660B19134b55327H012c26870L8737a18037D4280e973j99928D7316
8877d3942J9294o2542k3841b017G104e8937k77907g0868l20565A2818R0205J23612
$$ plain form
8922 459321 951089 2549734 8522050 8921743 2515174 718351 386577 213496 363718
8913 363718 157929 278624 333828 3930 -181865 118486 407669 45450 310939 -78355 46087
8901 -95861 58614 -294878 -458 -248785 62244 168347 -55178 182014 -202103 -181947 206865
8889 22007 -43660 219134 -255327 8012 -326870 -288133 -118037 44280 -5973 -205901 47316
8877 -43942 -24648 -87190 -111031 -2017 7104 -58937 -336844 -70868 -391433 12818 103023 226635
$$ [...]
##END NTUPLES=NMR SPECTRUM
##END=
