
##TITLE=AC1217_HTEAH12048_5973559_hhJ8dNpkPY
##JCAMPDX= 6.0         $$ Bruker NMR JCAMP-DX V2.0
##DATA TYPE= NMR SPECTRUM
##DATA CLASS= NTUPLES
##ORIGIN= BRUKER
##OWNER= Administrator
$$ 1.72 TOPSPIN		Version 2.1
$$ 2012-04-14 18:35:08.328 -0500  Administrator@TOPSPIN
$$ Compression mode = diff/dup
##.OBSERVE FREQUENCY= 400.13188235
##.OBSERVE NUCLEUS= ^1H
##.ACQUISITION MODE= SIMULTANEOUS (DQD)
##.ACQUISITION SCHEME= undefined
##.AVERAGES= 8
##.DIGITISER RES= 22
##SPECTROMETER/DATA SYSTEM= spect
##.PULSE SEQUENCE= zg30
##.SOLVENT NAME= COFFEE_meoh
##.SHIFT REFERENCE= INTERNAL, COFFEE_meoh, 1, 14.98061
##AUDIT TRAIL= $$ (NUMBER, WHEN, WHO, WHERE, PROCESS, VERSION, WHAT)
$$ ##TITLE= Audit trail, TOPSPIN		Version 2.1
$$ ##JCAMPDX= 5.01
$$ ##ORIGIN= Bruker BioSpin GmbH
$$ ##OWNER= Administrator
$$ $$ C:\Bruker\TOPSPIN/data/COFFEE/nmr/AC1217_HTEAH12048_5973559_hhJ8dNpkPY/10/pdata/1/auditp.txt
$$ ##AUDIT TRAIL=  $$ (NUMBER, WHEN, WHO, WHERE, PROCESS, VERSION, WHAT)
(   1,<2012-04-14 18:34:58.031 -0500>,<Administrator>,<TOPSPIN>,<go>,<TOPSPIN 2.1>,
      <created by zg
	started at 2012-04-14 18:33:50.156 -0500,
	POWCHK enabled, PULCHK disabled,
       configuration hash MD5:
       1A 1E CE 29 27 FD 77 03 67 4E F0 E3 C4 B2 CB 90
       data hash MD5: 64K
       A4 27 C8 F9 42 0A 69 B1 41 8B 1E 39 85 DB 18 98>)
(   2,<2012-04-14 18:35:02.109 -0500>,<Administrator>,<TOPSPIN>,<proc1d>,<TOPSPIN 2.1>,
      <Start of raw data processing
       efp LB = 0 FT_mod = 6 PKNL = 1 PHC0 = 0 PHC1 = 0 SI = 32K 
       data hash MD5: 32K
       B1 44 D7 C0 DA 10 57 05 50 DE 7F C2 E0 D2 75 C8>)
(   3,<2012-04-14 18:35:02.593 -0500>,<Administrator>,<TOPSPIN>,<proc1d>,<TOPSPIN 2.1>,
      <pk PHC0 = 209.7729 PHC1 = 0 
       data hash MD5: 32K
       90 BB 84 CA 4A FD 49 40 4B 7F BE E7 FE 1F 77 04>)
(   4,<2012-04-14 18:35:02.718 -0500>,<Administrator>,<TOPSPIN>,<proc1d>,<TOPSPIN 2.1>,
      <abs ABSG = 1 
       data hash MD5: 32K
       9D E8 5D 19 F0 D2 1A 66 4A 11 5A 49 C9 78 D3 40>)
(   5,<2012-04-14 18:35:02.750 -0500>,<Administrator>,<TOPSPIN>,<proc1d>,<TOPSPIN 2.1>,
      <abs ABSG = 2 
       data hash MD5: 32K
       CC 03 CC DA 53 CD 8B C7 A6 B2 8F A2 D2 F5 FA 34>)
(   6,<2012-04-14 18:35:02.812 -0500>,<Administrator>,<TOPSPIN>,<proc1d>,<TOPSPIN 2.1>,
      <abs ABSG = 3 
       data hash MD5: 32K
       F9 09 E7 40 C2 25 0E 11 D4 54 42 D8 21 04 E0 B2>)
(   7,<2012-04-14 18:35:02.843 -0500>,<Administrator>,<TOPSPIN>,<proc1d>,<TOPSPIN 2.1>,
      <abs ABSG = 4 
       data hash MD5: 32K
       A3 6E E2 E2 1D 34 FB 0C E9 A8 C1 0D 8C D2 B3 C5>)
(   8,<2012-04-14 18:35:02.890 -0500>,<Administrator>,<TOPSPIN>,<proc1d>,<TOPSPIN 2.1>,
      <abs ABSG = 5 
       data hash MD5: 32K
       DE 2F 75 5E 0E BA 2D 19 20 0E 65 67 C4 1B 6B F0>)
$$ ##END=
$$ 
$$ $$ hash MD5
$$ $$ DC D8 57 D4 48 1D 21 29 65 02 18 55 22 15 BE 28
##$RELAX= 
##$RELAX= 
##$RELAX= 
##$RELAX= 
##$RELAX= 
##$RELAX= 
##$RELAX= 
$$ Bruker specific parameters
$$ --------------------------
$$ [...]
##$TP= (0..7)
150 150 150 150 150 150 150 150
##$TP07= 0
##$TPNAME0= <>
##$TPNAME1= <>
##$TPNAME2= <>
##$TPNAME3= <>
##$TPNAME4= <>
##$TPNAME5= <>
##$TPNAME6= <>
##$TPNAME7= <>
##$TPOAL= (0..7)
0.5 0.5 0.5 0.5 0.5 0.5 0.5 0.5
##$TPOFFS= (0..7)
0 0 0 0 0 0 0 0
##$TUNHIN= 0
##$TUNHOUT= 0
##$TUNXOUT= 0
##$USERA1= <user>
##$USERA2= <user>
##$USERA3= <user>
##$USERA4= <user>
##$USERA5= <user>
##$V9= 5
##$VALIST= <valist>
##$VCLIST= <CCCCCCCCCCCCCCC>
##$VD= 0
##$VDLIST= <DDDDDDDDDDDDDDD>
##$VPLIST= <PPPPPPPPPPPPPPP>
##$VTLIST= <TTTTTTTTTTTTTTT>
##$WBST= 1024
##$WBSW= 4
##$XGAIN= (0..3)
0 0 0 0
##$XL= 0
##$YL= 0
##$YMAX_a= 492898
##$YMIN_a= -611021
##$ZGOPTNS= <>
##$ZL1= 120
##$ZL2= 120
##$ZL3= 120
##$ZL4= 120
##$ABSF1= 14.98061
##$ABSF2= -5.57192
##$ABSG= 5
##$ABSL= 3
##$ALPHA= 0
##$AQORDER= 0
##$ASSFAC= 0
##$ASSFACI= 0
##$ASSFACX= 0
##$ASSWID= 0
##$AUNMP= <proc_prof1d_extract_pilot.lims>
##$AXLEFT= 0
##$AXNAME= <>
##$AXNUC= <1H>
##$AXRIGHT= 0
##$AXTYPE= 0
##$AXUNIT= <>
##$AZFE= 0.1
##$AZFW= 0.1
##$BCFW= 0
##$BC_mod= 0
##$BYTORDP= 0
##$COROFFS= 0
##$CY= 15
##$DATMOD= 1
##$DC= 0
##$DFILT= <>
##$DTYPP= 0
##$F1P= 0
##$F2P= 0
##$FCOR= 0.5
##$FTSIZE= 32768
##$FT_mod= 6
##$GAMMA= 0
##$GB= 0
##$INTBC= 1
##$INTSCL= 1
##$ISEN= 128
##$LB= 0
##$LEV0= 0
##$LPBIN= 0
##$MAXI= 10000
##$MC2= 0
##$MEAN= 0
##$ME_mod= 0
##$MI= 0
##$NCOEF= 0
##$NC_proc= -8
##$NLEV= 6
##$NOISF1= 0
##$NOISF2= 0
##$NSP= 0
##$NTH_PI= 0
##$NZP= 0
##$OFFSET= 14.98061
##$PC= 1
##$PHC0= 209.7729
##$PHC1= 0
##$PH_mod= 1
##$PKNL= yes
##$PPARMOD= 0
##$PPDIAG= 0
##$PPIPTYP= 0
##$PPMPNUM= 2147483647
##$PPRESOL= 1
##$PSCAL= 4
##$PSIGN= 0
##$PYNMP= <proc.py>
##$REVERSE= no
##$SF= 400.13
##$SI= 32768
##$SIGF1= 0
##$SIGF2= 0
##$SINO= 400
##$SIOLD= 32768
##$SPECTYP= <>
##$SREGLST= <1H.CDCl3>
##$SSB= 0
##$STSI= 32768
##$STSR= 0
##$SW_p= 8223.68421052632
##$SYMM= 0
##$S_DEV= 0
##$TDeff= 65536
##$TDoff= 0
##$TI= <>
##$TILT= no
##$TM1= 0
##$TM2= 0
##$TOPLEV= 0
##$USERP1= <user>
##$USERP2= <user>
##$USERP3= <user>
##$USERP4= <user>
##$USERP5= <user>
##$WDW= 1
##$XDIM= 32768
##$YMAX_p= 456209473
##$YMIN_p= -678568
##$CURPLOT= <Network HP LaserJet P1505>
##$CURPRIN= <$Network HP LaserJet P1505>
##$DFORMAT= <normdp>
##$LAYOUT= <+/1D_H.xwp>
##$LFORMAT= <normlp>
##$PFORMAT= <normpl>
##$SURQMSG= 1
$$ End of Bruker specific parameters
$$ ---------------------------------
##NTUPLES= NMR SPECTRUM
##VAR_NAME=  FREQUENCY,     SPECTRUM/REAL,   SPECTRUM/IMAG
##SYMBOL=    X,             R,               I
##VAR_TYPE=  INDEPENDENT,   DEPENDENT,       DEPENDENT
##VAR_FORM=  AFFN,          ASDF,            ASDF
##VAR_DIM=   32768,         32768,           32768
##UNITS=     HZ,            ARBITRARY UNITS, ARBITRARY UNITS
##FACTOR=    0.250966925370066, 1,           1
##FIRST=     8223.43324360095, 121806,       98195
##LAST=      0,             -89532,          -51261
##MIN=       0,             -678568,         0
##MAX=       8223.43324360095, 456209473,    0
$$ Real data points
##PAGE= N=1
##DATA TABLE= (X++(R..R)), XYDATA
$$ [...]
19479a33990C0052J09280b04763O1410M827c9049A46637l0678i0878n8153l09853
$$ -133990 30052 139332 -204763 -143353 -138526 -39049 146637 115959 -90878 -149031 -458884
19468d58884a03691j69499D6231P6063h5042K211l33862a26090j29181J19624
$$ -458884 -103691 -273190 46231 122294 -85042 -82831 -416693 -126090 -255271 -135647
19458a35647D0839b88894B15854c45486a43005a5330j7618j46717c4869C2364
$$ -135647 40839 -288894 215854 -345486 -143005 -15330 -32948 -179665 -34869 32364
19447F3101a24842g951o2703j64367j4297J3090Q0324C1606b08062r5001a40429
$$ 63101 -124842 -7951 -70654 -235021 -249318 -236228 -155904 31606 -208062 -303063 -140429
19435C24786o5815g9260j17121G5309b22670p620A7438h2033j16507P4238m2890
$$ 324786 258971 -79260 -196381 75309 -222670 -230290 17438 -82033 -198540 -124302 -167192
19424a67192m8377A30500I001K48300f564j63923p7693A49666a91410a1980l66222
$$ -167192 -215569 130500 9001 257301 -6564 -170487 -248180 149666 -191410 -11980 -378202
19413c78202B3752a48365d0936j33361F0152a68353M7085p690A74657e160A4992
$$ -378202 23752 -148365 -40936 -174297 60152 -168353 -121268 -128958 174657 -5160 14992
19401i2743j79226C73098a31806j12677j5959j90716D1981b71397D7603A5888
$$ -92743 -271969 373098 -131806 -244483 -260442 -451158 41981 -271397 47603 15888
19390C1109O4436M6245b96862A9788H757f1262K8975H417b6058l12157C10872
$$ 31109 95545 141790 -296862 19788 8757 -61262 -32287 8417 -26058 -338215 310872
19378I3751c09760E0225j8293c3394A71931c0810j0556A25295a46201C13056b34133
$$ 93751 -309760 50225 31932 -33394 171931 -30810 -41366 125295 -146201 313056 -234133
19366c09570J40265p428g4047j14965C3918c40842a9781p6834d1498j82306P9500
$$ -309570 -169305 -176733 -74047 -189012 33918 -340842 -19781 -96615 -41498 -223804 -144304
19355a44304j8157j53693J32333M9937j88230E7075D473L87401a86526Q3592o4288
$$ -144304 -162461 -316154 -183821 -133884 -322114 57075 4473 391874 -186526 -102934 -167222
19344a67222k00129f0867A57431J94799a74887A4567J65996b20548p618E5494
$$ -167222 -367351 -60867 157431 352230 -174887 14567 180563 -220548 -228166 55494
19333a02455k11242G2861k3730a76154N8547B14410c67080a11683N4892B758P4229
$$ -102455 -313697 72861 49131 -176154 -117607 214410 -367080 -111683 -56791 2758 76987
19322G6987k6278G449a91298g5871K0702q4529C22993D3233a11045A62489b36698
$$ 76987 50709 7449 -191298 -75871 -55169 -139698 322993 43233 -111045 162489 -236698
19310B52988c27118a27524F1523b15914O140j30711a06037O079B31932c4827j10706
$$ 252988 -327118 -127524 61523 -215914 -209774 -340485 -106037 -99958 231932 -34827 -145533
19299a45533q4503C9053J44807i8153j5687N3717n6815n5287k35495e0921A22297
$$ -145533 -230036 39053 183860 -98153 -113840 -60123 -116938 -172225 -407720 -50921 122297
19287b01383L9982a2616j91599g3365l44376A59249b97090m1445A06969h6208
$$ -201383 -161401 -12616 -204215 -73365 -417741 159249 -297090 -338535 106969 -86208
19276a83038j86903a08370m3996I0503f2827b6999j92039c7533q0651j63239b0056
$$ -183038 -369941 -108370 -152366 90503 -62827 -26999 -219038 -37533 -118184 -281423 -20056
19264a1231n9743D6712b55752l0199R9235b614A7863c81689E5035B1023L8360
$$ -11231 -70974 46712 -255752 -285951 -186716 -2614 17863 -381689 55035 21023 59383
19253E9383i1316M5602j47560k6606A88324I4048a01031d7748l00647f6453G6062
$$ 59383 -91316 -45714 -193274 -219880 188324 94048 -101031 -47748 -348395 -66453 76062
19241i9494k94934H499a77453C358a91599K363A12442J07633o1810a21423k53743
$$ -99494 -394428 8499 -177453 3358 -191599 -189236 112442 220075 158265 -121423 -375166
19230c75166i659k23802E8349a23759D7337g567p7335j2128I2857b01620d4165
$$ -375166 -9659 -233461 58349 -123759 47337 -7567 -84902 -97030 92857 -201620 -44165
19218G2237b22301D7749L0223J47791b30768A09690n2118A4014d87183a05106
$$ 72237 -222301 47749 77972 225763 -230768 109690 57572 14014 -487183 -105106
19207A2032Q5767b67141p4099B3519e5274j02215l6414A26181F2426a39583L1568
$$ 12032 97799 -267141 -341240 23519 -55274 -157489 -193903 126181 62426 -139583 -108015
19196a08015b6958A50663a71014c9987k09894F0367J17903a06471o1572A24383
$$ -108015 -26958 150663 -171014 -39987 -249881 60367 178270 -106471 -168043 124383
19185g1799j08616j115p6735R7218I1506J15262a24391D65268a92707d9437C3261
$$ -71799 -180415 -181530 -258265 -161047 91506 206768 -124391 465268 -192707 -49437 33261
19173e6669a289m0956j70496R1102E7292a38050A18489e9509l8213J7068j32169
$$ -56669 -1289 -42245 -212741 -121639 57292 -138050 118489 -59509 -97722 -80654 -212823
19162b12823k83P5147B36843a49994o7175A66082d06205J05725C3612a86676A4095
$$ -212823 -213106 -137959 236843 -149994 -217169 166082 -406205 -300480 33612 -186676 14095
19150b40046a9575k23285h9291j11203P16b885k09775B36805j10098B6791J76919
$$ -240046 -19575 -242860 -89291 -200494 -199778 -2885 -212660 236805 126707 26791 203710
19139B03710c14529B63468b19471B14955d47408A33014a06569C0286J1268a14609
$$ 203710 -314529 263468 -219471 214955 -447408 133014 -106569 30286 41554 -114609
19128a54066G84c6944C7855R3821e3897j01352M6566H1141d4148K407f318o4568
$$ -154066 784 -36944 37855 131676 -53897 -155249 -108683 81141 -44148 -41741 -6318 -70886
19116g0886k70723A30691f3464J6003B47418r173b29278A19443N9701o2448l9175
$$ -70886 -341609 130691 -63464 -47461 247418 238245 -229278 119443 179144 116696 77521
19105G7521A4896c6375B45313c73737J05438l3091j71372a2896a642B54304a4739
$$ 77521 14896 -36375 245313 -373737 -268299 -301390 -472762 -12896 -1642 254304 -14739
19093b2243A13031c36127e8983b1226C8513K5126a59452g4278E0710d5907C8148
$$ -22243 113031 -336127 -58983 -21226 38513 63639 -159452 -74278 50710 -45907 38148
19081B06613B1903e0701o9377J389F6231B9070c49573A24193a34426j40440h4167
$$ 206613 21903 -50701 -120078 -118689 66231 29070 -349573 124193 -134426 -274866 -84167
19069A55667a35588l2795l88326H4890d9838C2513e10131b22705b3970j22915
$$ 155667 -135588 -168383 -556709 84890 -49838 32513 -510131 -222705 -23970 -146885
19059a46885j52003a44005A69452a89194g6110D0194b51574c8712A83275q2182
$$ -146885 -298888 -144005 169452 -189194 -76110 40194 -251574 -38712 183275 101093
19049A01093b06340K7752O0503A67788G0796b60294I5265a65648C9785J63268
$$ 101093 -206340 -178588 -118085 167788 70796 -260294 95265 -165648 39785 203053
19039B03053F1329A3037h6768L3961r7381o3945L0852m1666C6177A3123O0758
$$ 203053 61329 13037 -86768 -52807 -150188 -214133 -183281 -224947 36177 13123 73881
19028G3881b7219B37861P619A11760i1703H5366a01773k19565B309c18336e1850
$$ 73881 -27219 237861 245480 111760 -91703 85366 -101773 -321338 2309 -318336 -51850
19016a3995B02861b76028c4750k7496A63923G3800K22819K1036E0323J66693f212
$$ -13995 202861 -276028 -34750 -62246 163923 73800 296619 317655 50323 217016 -6212
19004B98773j46999a56583O3811j05604B5528L7292b36070M2256l1566e2738p8363
$$ 298773 151774 -156583 -92772 -198376 25528 62820 -236070 -193814 -225380 -52738 -131101
18993a31101E3760a6506F2158e2717j89287e9489A69268D4466B0111O3450C7079
$$ -131101 53760 -16506 62158 -52717 -242004 -59489 169268 44466 20111 83561 37079
18981A40649b09666A32691a09209j18167i0671a3563o4121m7121k33307J74284
$$ 140649 -209666 132691 -109209 -227376 -90671 -13563 -77684 -124805 -358112 -183828
18971a83828b7777j77219B10592b38068A18236h5670G5221J00508F4072a06430
$$ -183828 -27777 -204996 210592 -238068 118236 -85670 75221 175729 64072 -106430
18960F7252J08856q4980B7147M76734j97940I5898m6790K87770d6084j04379O4354
$$ 67252 176108 91128 27147 503881 305941 95898 49108 336878 -46084 -150463 -86109
18949h6109B11541C5838h6090C159b47426q7860g3109K7262l5510H2455i9170
$$ -86109 211541 35838 -86090 3159 -247426 -335286 -73109 -45847 -81357 82455 -99170
18937C9626c9934j21044A97779a58531a0468k36870N9346a3629A42953f2275J2090
$$ 39626 -39934 -160978 197779 -158531 -10468 -247338 -187992 -13629 142953 -62275 -50185
18926e0185D8154c39716m0757a6359o711A43530c024k5855r2143r2393E6400g2555
$$ -50185 48154 -339716 -380473 -16359 -23070 143530 -3024 -28879 -121022 -213415 56400 -72555
18913b99381A18483D5979F294a78214e2105r6296f1291E9807o875c66009A59835
$$ -299381 118483 45979 6294 -178214 -52105 -148401 -61291 59807 52932 -366009 159835
18901a33048l232B44225a43184A15471b31672H8732J58044L17014J14516k45970
$$ -133048 -136280 244225 -143184 115471 -231672 88732 246776 563790 678306 432336
18891D32336j34239j42524O5681G8466f8426a5676n1127B1804O0783P592c48427
$$ 432336 298097 155573 221254 78466 -68426 -15676 -66803 21804 82587 90179 -348427
18879B116c59493J61317L0452K9483D6729b29667G9729c6297j50346N9819A64384
$$ 2116 -359493 -198176 -167724 -138241 46729 -229667 79729 -36297 -186643 -126824 164384
18867f0383a3481A173Q4559m1224a29245m5040J4736j30924J39206A27607a94944
$$ -60383 -13481 1173 85732 44508 -129245 -174285 -159549 -290473 -151267 127607 -194944
18855C655g2023A39504O1883a54346d6136A39752o3618b44547N7134Q1612j83210
$$ 3655 -72023 139504 201387 -154346 -46136 139752 76134 -244547 -187413 -105801 -289011
18844b89011a32118d7534j15291B2355e40710b29868B0523a68009A85605a00400
$$ -289011 -132118 -47534 -162825 22355 -540710 -229868 20523 -168009 185605 -100400
18833C97232d4234k3755l0488F4136a50435D3575f214B17269a6871j14599k11229
$$ 397232 -44234 -67989 -98477 64136 -150435 43575 -6214 217269 -16871 -131470 -342699
18822c42699H0138O938L2508k3796b8795k65569C1851K6830a08140m9614E9853
$$ -342699 80138 87076 119584 95788 -28795 -294364 31851 58681 -108140 -157754 59853
18810H6682D0020i0997H0553b7827j68463C401N8789L40615c3767M314C03784
$$ 86682 40020 -90997 80553 -27827 -196290 3401 62190 402805 -33767 -29453 303784
18798B80702m3939A05322a74850B2775O0494g8740C7868K18897h646l7832k13092
$$ 280702 236763 105322 -174850 22775 83269 -78740 37868 256765 -8646 -46478 -259570
18787b59570A75080N0971I0071b55o2316A5461L2225k3225G334a05581D019K17478
$$ -259570 175080 226051 90071 -255 -62571 15461 47686 24461 7334 -105581 4019 221497
18775B21497h2550D8473i9120M4894E1658J90585i6826O743j97119P8679J0746
$$ 221497 -82550 48473 -99120 -54226 51658 242243 -96826 -90083 -287202 -208523 -197777
18764a97777C5518c47568E4774d2332j76487F0032c7805C4283c71204J18945B5091
$$ -197777 35518 -347568 54774 -42332 -218819 60032 -37805 34283 -371204 -252259 25091
18752b5977l50042H1922b32581i0212j07181B20281a00292F1538c0958j14980
$$ -25977 -376019 81922 -232581 -90212 -197393 220281 -100292 61538 -30958 -145938
18742a45938A00368J46012a10321C6674J50427i2053k8400j79761E5630L9987
$$ -145938 100368 246380 -110321 36674 187101 -92053 -120453 -300214 55630 95617
18732I5617B3321a53442a8928B63304b0707j35335j34128d6335k7065k64379g5557
$$ 95617 23321 -153442 -18928 263304 -20707 -156042 -290170 -46335 -73400 -337779 -75557
18720H4693h2294A23536J00096q0282a8726F7642K53096e17340e8725A20593K11045
$$ 84693 -82294 123536 223632 143350 -18726 67642 320738 -517340 -58725 120593 331638
18709C31638a12399C1726Q669a08925o227N3059p1715p0060D6238a81914f1104
$$ 331638 -112399 31726 40395 -108925 -115152 -62093 -133808 -203868 46238 -181914 -61104
18697b26528n2357J32140B85340b31690P4419C4296P8788n4906G879c28039J62239
$$ -226528 -278885 -146745 285340 -231690 -157271 34296 113084 58178 7879 -328039 -165800
18686a65800a2055A4098a03009m4098C5200a75745j03232D8957J016e3559j63938
$$ -165800 -12055 14098 -103009 -147107 35200 -175745 -278977 48957 49973 -53559 -217497
18675b17497E2864c11023h0917H8634a68912L6458O3661m4692B00956a70057J2419
$$ -217497 52864 -311023 -80917 88634 -168912 -132454 -68793 -113485 200956 -170057 -157638
18664a57638N7632C5877a32653A4676a67110l4191A19772k4255c08049f3208j08894
$$ -157638 -100006 35877 -132653 14676 -167110 -201301 119772 95517 -308049 -63208 -172102
18653a72102c6386A35713b62031q4175H0539b78509A68393F729c86905A85805
$$ -172102 -36386 135713 -262031 -346206 80539 -278509 168393 6729 -386905 185805
18642F5392a9983A46443h0300q4958N0394c6252H2405e09317B36309C7455M2063
$$ 65392 -19983 146443 -80300 -165258 -114864 -36252 82405 -509317 236309 37455 79518
18631G9518b30220P4306N4071j401j3397B29d12617A24972n56a13492I1055d20740
$$ 79518 -230220 -155914 -101843 -103244 -116641 229 -412617 124972 124416 -113492 91055 -420740
18618e29531b25139B73009b51727Q933B46513g9218o8856A16017l8029a13547
$$ -529531 -225139 273009 -251727 -242794 246513 -79218 -148074 116017 77988 -113547
18607C24906a20127A31500b59860A50945a26585G0747l2406K31844c03272h8761
$$ 324906 -120127 131500 -259860 150945 -126585 70747 38341 270185 -303272 -88761
18596A3444c74139C079J87833a51972O8937A66234j1230Q5996h1887J1015H6426
$$ 13444 -374139 3079 190912 -151972 -83035 166234 155004 241000 -81887 -70872 86426
18584a97763R3723K2128C7170R3765D6120K06215a97783B82705c25734I5688O8773
$$ -197763 -104040 -81912 37170 130935 46120 252335 -197783 282705 -325734 95688 164461
18573A64461a55479E6521f2993d78j54660G089a05557k2395A75249B0141d3085
$$ 164461 -155479 56521 -62993 -478 -155138 7089 -105557 -127952 175249 20141 -43085
18561e27842b01200A03932l2368R042b71454A22357b7357A5781g243k71646Q450
$$ -527842 -201200 103932 71564 80606 -271454 122357 -27357 15781 -7243 -278889 -270439
18550b70439J26995k59283J86182L3615G0590f03581b98744P1891A0372J39114
$$ -270439 -143444 -402727 -216545 -182930 70590 -603581 -298744 -226853 10372 149486
18540A49486D2917a7724k36285A6333c24483a12970E1822J85497b78774N0162
$$ 149486 42917 -17724 -254009 16333 -324483 -112970 51822 237319 -278774 -228612
18530b28612a12305B17425o7567a80486k80713H5110a40064K9742k38568a07937
$$ -228612 -112305 217425 149858 -180486 -461199 85110 -140064 -110322 -348890 -107937
18519h2328D4806c2177b125l05251J32022F1137a28525d4735K1086A89883b73219
$$ -82328 44806 -32177 -2125 -307376 -175354 61137 -128525 -44735 -23649 189883 -273219
18507C02787h3344A64097N1150h2773l7123j81234h8507I3232K50662a4177j17048
$$ 302787 -83344 164097 215247 -82773 -119896 -301130 -88507 93232 343894 -14177 -131225
18496a31225p5692A24167E6810b24780K979P5817o760e8979O613j49147g588E4061
$$ -131225 -206917 124167 56810 -224780 -221801 -145984 -152744 -58979 -52366 -201513 -7588 54061
18483a5297A33964c64713a24141j04261R0376A87328o0709a17254E5470L14866
$$ -15297 133964 -364713 -124141 -228402 -138026 187328 126619 -117254 55470 370336
18473C70336a30157e9590k80158E1020a33568k0110k9790B24925a86480K0527
$$ 370336 -130157 -59590 -339748 51020 -133568 -153678 -183468 224925 -186480 -165953
18463a65953B07252c26481B5085a15373I6819J55139j11900i7509L7981a3712
$$ -165953 207252 -326481 25085 -115373 96819 251958 140058 -97509 -59528 -13712
18452a29681F693K1796R3962R0063a6662j99465b574A47616b90851a13842j3152
$$ -129681 6693 28489 122451 212514 -16662 -216127 -2574 147616 -290851 -113842 -126994
18441a26994J3264G4114K58296I1695l0455b13282B98120A1531J0671c3624a3768
$$ -126994 -113730 74114 332410 91695 61240 -213282 298120 11531 22202 -33624 -13768
18429D6804B0020M0699K86226d06040i5078G4804d04679J45898l315R584E6291
$$ 46804 20020 60719 346945 -406040 -95078 74804 -404679 -258781 -262096 -252512 56291
18417f6360n2206b6729a0579B29208a34213B09696b53241a24871E4866Q6604e5549
$$ -66360 -118566 -26729 -10579 229208 -134213 209696 -253241 -124871 54866 141470 -55549
18405e2799C1536f0028m7460d66F8678a59035q6584A27911f9978D6366M9272b68593
$$ -52799 31536 -60028 -107488 -466 68678 -159035 -245619 127911 -69978 46366 95638 -268593
18392A00797c9765k65177M9472R6408b9926j71959C6898M1429c86571A16248a07922
$$ 100797 -39765 -304942 -255470 -159062 -29926 -201885 36898 78327 -386571 116248 -107922
18380e7711k62802a19234A13945m5399a9635j83617B67527a89169M3512j959F5041
$$ -57711 -320513 -119234 113945 68546 -19635 -203252 267527 -189169 -145657 -147616 65041
18368g0990B00793b13918j25528a33967j12263a8817m1713j59419L1989j2784
$$ -70990 200793 -213918 -339446 -133967 -246230 -18817 -60530 -219949 -187960 -200744
18358b00744i917G7389b15805J06359r7646j13262a34981J3854Q725B4212L654
$$ -200744 -9917 77389 -215805 -109446 -207092 -320354 -134981 -121127 -112402 24212 27866
18347B7866J99022o323j9915a6118A13165a1138N270k34416g4250j31028E9447
$$ 27866 226888 220565 200650 -16118 113165 -11138 -5868 -240284 -74250 -205278 59447
18335e7103r27j64442f811j25026J282k99765a07546A05070d1753A59689i423
$$ -57103 -58030 -222472 -6811 -131837 -130555 -430320 -107546 105070 -41753 159689 -9423
18323E8079g0171c1072o9115k43324B6740N6528C3483J59846C6679a11037B22417
$$ 58079 -70171 -31072 -100187 -343511 26740 83268 33483 193329 36679 -111037 222417
18311a03821b4661A04587K3029K5171i9123j23014C07116H8818b02568P0231A69691
$$ -103821 -24661 104587 127616 152787 -99123 -222137 307116 88818 -202568 -132337 169691
18299E2748b5415J1791j3563A4088a77333J5420e9347C19863j08293n4736F1730
$$ 52748 -25415 -13624 -27187 14088 -177333 -161913 -59347 319863 211570 156834 61730
18287b91100i2152j61305F6262a13189D0316R0434e3021j7855A81355l6405D3566
$$ -291100 -92152 -253457 66262 -113189 40316 130750 -53021 -70876 181355 144950 43566
18275a92528d2172E7549M6882A39Q663L02377a77446p867I4791c27026e8736j42317
$$ -192528 -42172 57549 104431 139 8802 311179 -177446 -185313 94791 -327026 -58736 -201053
18263b01053A41154l8954b06647C8603b18827J2983G981a96427C8778c309l75318
$$ -201053 141154 102200 -206647 38603 -218827 -205844 7981 -196427 38778 -3309 -378627
18252c78627j0278f133H1444l3474K48257A8871b19426C4598f4131K0265j3442
$$ -378627 -388905 -6133 81444 47970 296227 18871 -219426 34598 -64131 -43866 -57308
18241e7308C28578G9637a79406h9443F1872e3895E1528a82862L2796a6526A27003
$$ -57308 328578 79637 -179406 -89443 61872 -53895 51528 -182862 -150066 -16526 127003
18229h2294L1749j48054C49065a13566M6421A26900J19699a43118I4455b56997
$$ -82294 -50545 -198599 349065 -113566 -67145 126900 246599 -143118 94455 -256997
18218a26559G1970K41068A08274i3074j1903J6443j85704J30631L8038E0875J21721
$$ -126559 71970 313038 108274 -93074 -104977 -88534 -274238 -143607 -105569 50875 172596
18207A72596b0246m05600F697J42139a31858A69455b86067a11652A20961c08725
$$ 172596 -20246 -425846 6697 148836 -131858 169455 -286067 -111652 120961 -308725
18196g365A62482a10807k08041Q2447B3190k562g7542n918a1863N249C4382b4577
$$ -7365 162482 -110807 -318848 -236401 23190 20628 -77542 -83460 -11863 -6614 34382 -24577
18183B22726J15435g3519B19311b4626d361p08A59639b75381R0130p947D1886
$$ 222726 338161 -73519 219311 -24626 -4361 -5069 159639 -275381 -185251 -193198 41886
18171A55468k2945a4025F0036d4834F754N806g2023J4955G6301b51931b9324j7985
$$ 155468 132523 -14025 60036 -44834 6754 12560 -72023 -57068 76301 -251931 -29324 -47309
18159d7309A1393a77285o7164j07115i824r0194C2915a52863B77797a13644A9307
$$ -47309 11393 -177285 -244449 -351564 -9824 -100018 32915 -152863 277797 -113644 19307
18147b866k51032F2119N9056a44269c1473A72186C8512J75535q1210c64039J32220
$$ -2866 -253898 62119 121175 -144269 -31473 172186 38512 214047 132837 -364039 -231819
18136b31819D0966m796a83385d204A64138b92483p5871A58415c11825P3543B00294
$$ -231819 40966 36170 -183385 -4204 164138 -292483 -368354 158415 -311825 -238282 200294
18124A59857a48338L827B0611O7335a86435j23637A92517a5486A11623a17242
$$ 159857 -148338 -144511 20611 87946 -186435 -310072 192517 -15486 111623 -117242
18113B08711b38709C3063K0645J27487e3117o1239A16537O6398a41162A21635
$$ 208711 -238709 33063 53708 181195 -53117 -114356 116537 182935 -141162 121635
18102B03705F3448N5407i854k27653I4770B1869a31579j17077A06179e66549J29087
$$ 203705 63448 118855 -9854 -237507 94770 21869 -131579 -248656 106179 -566549 -437462
18091d37462f1688m3674j62186e561J865n5720G2301J93126j17329B6951a00759
$$ -437462 -61688 -105362 -267548 -5561 -3696 -59416 72301 265427 148098 26951 -100759
18079a83B02818b38410C1843A2835L50563j08484J6163F5169J06349b06723F262
$$ -183 202818 -238410 31843 12835 363398 254914 271077 65169 171518 -206723 6262
18067b10028A88955e0995H4147d74907A85450a29417J8557j1002B36756a60829
$$ -210028 188955 -50995 84147 -474907 185450 -129417 -110860 -121862 236756 -160829
18056A76593H8282f3808q7577A30647b63529A11978K44846k5749b31172A76612
$$ 176593 88282 -63808 -151385 130647 -263529 111978 356824 331075 -231172 176612
18045a97859A8281J34136D5233b52546n6361C3446J16667a10622e4258c598l653
$$ -197859 18281 152417 45233 -252546 -308907 33446 150113 -110622 -54258 -3598 -7251
18034g251n1811I3999c0965j44218D9375L046a55143A61461L0419b88015h1389
$$ -7251 -59062 93999 -30965 -175183 49375 52421 -155143 161461 191880 -288015 -81389
18022a83903B59805b40549D9610a9472A81511a44730M7379M2719j50405Q4153
$$ -183903 259805 -240549 49610 -19472 181511 -144730 -97351 -54632 -205037 -120884
18012a20884n274F0047a79613A48666b9124k5829A11999B1111L9870R4417c71193
$$ -120884 -126158 60047 -179613 148666 -29124 -54953 111999 21111 60981 155398 -371193
18000c58198n1422H4881B1911a20654j23386A90675h1392H6299c56772a04478
$$ -358198 -409620 84881 21911 -120654 -244040 190675 -81392 86299 -356772 -104478
17989A26084n181J6926n6808a80983N9939E6289J531K43412a28432d73j79825
$$ 126084 120903 137829 81021 -180983 -121044 56289 57820 301232 -128432 -473 -180298
17978a80298A64761a90253n7688B79765E1336a88890C14358a6003A7963b579B10325
$$ -180298 164761 -190253 -247941 279765 51336 -188890 314358 -16003 17963 -2579 210325
17966A30985P2328o6063e404q634E030i470G930M9251B2028J43223b53715C05735
$$ 130985 203313 137250 -5404 -14038 5030 -9470 7930 57181 22028 165251 -253715 305735
17953C6195b4981B49574M463B1734M8288b82888A86419f1510B61802e5998j22667
$$ 36195 -24981 249574 254037 21734 70022 -282888 186419 -61510 261802 -55998 -178665
17942a78665h3401b9250A7386J21624C2717J07016K801e8215l5377B31725b66975
$$ -178665 -83401 -29250 17386 139010 32717 139733 142534 -58215 -93592 231725 -266975
17930A21956c6254k19714A73106a7260F0428L2335M6944m2445J34518d5867o3787
$$ 121956 -36254 -255968 173106 -17260 60428 92763 139707 97262 231780 -45867 -109654
17919a09654B6424J22012a61240F2926a62185A13210A0502J63769d90727A41875
$$ -109654 26424 148436 -161240 62926 -162185 113210 10502 174271 -490727 141875
17908A03472a81416B62715E147K98424b90677B10873b9904F2063M85131C6936
$$ 103472 -181416 262715 5147 303571 -290677 210873 -29904 62063 547194 36936
17897h2552A34382b53987Q7654g6647A0992J56662b0799A6049e8023E2893J26624
$$ -82552 134382 -253987 -166333 -76647 10992 167654 -20799 16049 -58023 52893 179517
17886A79517R491m4081c07974A18220M3265k9233c0518A570f8483A52171e4413
$$ 179517 189008 144927 -307974 118220 161485 132252 -30518 1570 -68483 152171 -54413
17874g2033j07055p3280h7924j9605F3950a57626A3765a79285B06328i440F2351
$$ -72033 -179088 -252368 -87924 -107529 63950 -157626 13765 -179285 206328 -9440 62351
17862a02326A18783d6047B58939f3490A91585a26481H7344d87297b2493A23368
$$ -102326 118783 -46047 258939 -63490 191585 -126481 87344 -487297 -22493 123368
17851A3462d2263C49670g8182A69572B6489E486g5113n182b4576C56252b31445
$$ 13462 -42263 349670 -78182 169572 26489 5486 -75113 -80295 -24576 356252 -231445
17839D1132a60681A36325J8549J78387A28714b5478E6853Q6100b54805A72974
$$ 41132 -160681 136325 154874 333261 128714 -25478 56853 142953 -254805 172974
17828B49985J6867a90907C92658A716g9572B40640d3337A28745d7653A95915a47388
$$ 249985 266852 -190907 392658 1716 -79572 240640 -43337 128745 -47653 195915 -147388
17816c4048C85941j04758j5721r7411H936N602c2866B10053p8097F2973a83384
$$ -34048 385941 281183 265462 168051 8936 14538 -32866 210053 131956 62973 -183384
17804A42100a62231B30719a29391A675K19266E380e6182H0160L2334a82225n2762
$$ 142100 -162231 230719 -129391 1675 220941 5380 -56182 80160 112494 -182225 -234987
17793b34987A4621J42758p3384E400g5381C6876b3958f386j16391a7148A20021
$$ -234987 14621 157379 83995 5400 -75381 36876 -23958 -6386 -122777 -17148 120021
17781A2820J96223H5892d1482H3367b19380K846F3938K7234E168M2773J73193
$$ 12820 209043 85892 -41482 83367 -219380 -216534 63938 91172 5168 47941 221134
17770B21134A00095a45924A24851N1850b93512F4005L22553h5427C6628L1856
$$ 221134 100095 -145924 124851 176701 -293512 64005 386558 -85427 36628 68484
17760F8484h3371J851l8961A37756n2144f2609A23473a36000M3823A63973m9377
$$ 68484 -83371 -81520 -120481 137756 85612 -62609 123473 -136000 -92177 163973 114596
17749A14596d5693a476n7980o052a6094j68004B50619r5693K05326a32597F2651
$$ 114596 -45693 -1476 -59456 -65508 -16094 -184098 250619 154926 360252 -132597 62651
17737d1239A30527J07676q8112a31234B0682f3499D76234B29459A05051i3747
$$ -41239 130527 238203 150091 -131234 20682 -63499 476234 229459 105051 -93747
17726c7158q154k24468A23287i0653A21130K1058a26197F0100L20336e1894E5710
$$ -37158 -45312 -269780 123287 -90653 121130 142188 -126197 60100 380436 -51894 55710
17714G8773Q0161a73348B5619Q7880M0370a88417F7435B838a15774A2033c692
$$ 78773 158934 -173348 25619 113499 153869 -188417 67435 2838 -115774 12033 -3692
17702F8201J01036A5776N3096K51693D6648L9994C9687g7066B15031J1435H1702
$$ 68201 169237 15776 68872 320565 46648 86642 39687 -77066 215031 226466 81702
17690h8803G3613b14342D2597b29663a12492B51548b88417A5366J48206k6441
$$ -88803 73613 -214342 42597 -229663 -112492 251548 -288417 15366 163572 137131
17680A37131P764a98451A11657N3157k8938C987K2757P766e3013A09335m9164
$$ 137131 144895 -198451 111657 164814 135876 3987 26744 34510 -53013 109335 60171
17669F0171O8261n6812J72369a63232A81951b34871C44981l8929H9766M036l0666
$$ 60171 128432 71620 243989 -163232 181951 -234871 344981 306052 89766 93802 63136
17658F3136a76616P2909F6743K74281A6521e833j96905A49220a14226j25815a13989
$$ 63136 -176616 -103707 66743 341024 16521 -5833 -202738 149220 -114226 -240041 -113989
17646c7220B01133a86233A47542M4301L3099a20987H0919k1568J24185J14840
$$ -37220 201133 -186233 147542 191843 224942 -120987 80919 59351 183536 298376
17636B98376c582F382J67423F4527b09147A49179b59395C7815O7878c578C91693
$$ 298376 -3582 6382 173805 64527 -209147 149179 -259395 37815 105693 -3578 391693
17624f18994A70424B5464G874L56196D6118L84264G0934c0640I8373h121C15464
$$ -618994 170424 25464 7874 364070 46118 430382 70934 -30640 98373 -8121 315464
17612C59361e2855j11052N8925j33910C25204o8339A20957P751J43566a58104
$$ 359361 -52855 -163907 -104982 -238892 325204 256865 120957 128708 272274 -158104
17601C7380k329d0640j48980A05902n2480K26742A33040a84922B81533a22218
$$ 37380 35051 -40640 -189620 105902 53422 280164 133040 -184922 281533 -122218
17590B39338N374a1672A74480O1765m1713a06168A82708a80735A99542M39707
$$ 239338 244712 -11672 174480 236245 194532 -106168 182708 -180735 199542 639249
17580F39249B06335B0281L03218A01746c8043C81142H6550K5564J53729A21335
$$ 639249 206335 20281 323499 101746 -38043 381142 86550 112114 265843 121335
17569b3335D2278K25472l0077k5943o2135J20022j14793a78591H1723H673K68063
$$ -23335 42278 267750 237673 211730 149595 269617 154824 -178591 81723 8673 276736
17558B76736a34936e8492A0424J45034O9608c7650B16501m1760M8646G7152g1325
$$ 276736 -134936 -58492 10424 155458 225066 -37650 216501 174741 223387 77152 -71325
17546E2168K04560a27008A92197H2032I488J58187l869J01604H9883g1236C94008
$$ 52168 256728 -127008 192197 82032 9488 167675 163806 265410 89883 -71236 394008
17534B7687J30094M4034B0910J99912C4088M19157p126A88501l9136K68724q6338
$$ 27687 157781 201815 20910 220822 34088 453245 446119 188501 149365 418089 331751
17523C31751O150r5739I7992J64183R062f8625C15439H7717K32491H8893O84358
$$ 331751 337901 242162 97992 262175 271237 -68625 315439 87717 320208 88893 773251
17512G73251j55267M22819L2061l61301k03059R4183l930j31333J10642j95674
$$ 773251 617984 1040803 1072864 711563 508504 602687 598757 467424 578066 382392
17502C82392j04199O6958K55344o8078j54135K83111m5577K77571l739N4861j36403
$$ 382392 278193 345151 600495 532417 378282 661393 615816 893387 889648 944509 808106
17491H08106j40053Q163K5745B90556K53729j64142j52754J1835n679J71326A90038
$$ 808106 668053 676216 701961 290556 544285 380143 227389 239224 233545 404871 190038
17479A64959J23154D4256J24588l3099J00112K8838J3848j33627Q0419a90148
$$ 164959 288113 44256 168844 135745 235857 264695 278543 144916 225335 -190148
17468C59951A49676F6829J89111A23705k5353m5160J6691L16097A04559L47666
$$ 359951 149676 66829 255940 123705 98352 53192 69883 385980 104559 452225
17458D52225A92745J61324j55558L27485j36563j1339A38994L47356A76815J72727
$$ 452225 192745 354069 198511 525996 389433 378094 138994 486350 176815 349542
17448C49542A31221J59292h988A62505F4984J40195N3487j24218O2879B8634J81810
$$ 349542 131221 290513 -8988 162505 64984 205179 258666 134448 197327 28634 210444
17437B10444Q2224k8747k3824K71880D1525R0485J49991J57918k04282j01125
$$ 210444 292668 263921 240097 511977 41525 132010 282001 439919 235637 134512
17427A34512o6772L4713a93029E71428o6819j74100F1720L71597j31561m3408
$$ 134512 67740 102453 -193029 571428 504609 330509 61720 433317 301756 258348
17417B58348J23640q7844o3953a0196A57373o5037M60918j93711n7541q0562J31776
$$ 258348 381988 294144 230191 -10196 157373 92336 553254 359543 302002 221440 353216
17406C53216J5928H2807M32499j97500K00583A22539f084A57313N14092B41158
$$ 353216 369144 82807 515306 317806 518389 122539 -6084 157313 671405 241158
17395I6627m3656K51297j24950K80241L8645p4501p2372j53541c9133A57014L21923
$$ 96627 52971 304268 179318 459559 498204 423703 351331 197790 -39133 157014 478937
17384D78937B07972J04924A25530j5938J08429o5917L0835h8417A54408m356K9421
$$ 478937 207972 312896 125530 109592 218021 152104 182939 -88417 154408 150052 179473
17373A79473C3541K96433A13343J03144J42652j19813r7055J60709J02379o1090
$$ 179473 33541 329974 113343 216487 359139 239326 142271 302980 405359 344269
17363C44269j20181D7057M0987M09264j60779q5903J31093j30682N3221a16040
$$ 344269 224088 47057 88044 497308 336529 250626 381719 251037 304258 -116040
17352B35079O4014A0866P7921e7931A62410M93771a73098I9997D6302K31739j25610
$$ 235079 299093 10866 88787 -57931 162410 656181 -173098 99997 46302 278041 152431
17341A52431L36488r6697l4279e285A63979L68558k47514P4121j10522a24361
$$ 152431 488919 392222 357943 -5285 163979 532537 285023 359144 248622 -124361
17330B52763q0533J98327N7735r1539L3476A82225H7693J81032E0778L75971j51868
$$ 252763 172230 370557 428292 336753 370229 182225 87693 268725 50778 426749 274881
17319B74881l1888A6828P8161J0283M43798B54420K01674B3692L45970g6435E09787
$$ 274881 242993 16828 94989 105272 549070 254420 456094 23692 369662 -76435 509787
17307H398J84391J91678J76490k23290p5183L00208R143A14626L15833j94597
$$ 8398 192789 384467 560957 337667 262484 562692 571835 114626 430459 235862
17297B35862j16486M42490D0903M50265I5529K53992B8718K34290I9637J99488
$$ 235862 119376 561866 40903 491168 95529 349521 28718 263008 99637 299125
17287B99125A16033n4946B5426h1572B17924K61807r946A24247L17487q1441A20678
$$ 299125 116033 61087 25426 -81572 217924 479731 469785 124247 441734 360293 120678
17275B94294j39688C5396L1528N17476e9310B16562L21836j51750R45j6714p8798
$$ 294294 154606 35396 66924 584400 -59310 216562 538398 386648 387593 370879 292081
17264B92081J91582A95843J51875j27773j09277K16287G7066J83389K40156B44127
$$ 292081 483663 195843 347718 219945 110668 326955 77066 260455 500611 244127
17253A06059K79780j55629J13449J82475B21403J85480h3475B7064M53283B23573
$$ 106059 385839 230210 343659 526134 221403 406883 -83475 27064 480347 223573
17242D39957j97303K33500a68051B05489J30440p0510J91741A56384L42094B47257
$$ 439957 242654 476154 -168051 205489 335929 265419 457160 156384 498478 247257
17231B45374O9685P9508n4846J86421k19773J13990G2043L9610L91088E5598K82089
$$ 245374 315059 394567 339721 526142 306369 420359 72043 111653 502741 55598 337687
17220C37687R0140A70910K14528G2787L59409A8355L42945l2493J96128k09220
$$ 337687 427827 170910 385438 72787 432196 18355 361300 328807 524935 315715
17210C15715K9760M6903j46114J42178l262k5185N4598j61241j26193O48836B87633
$$ 315715 345475 392378 246264 388442 385180 359995 414593 253352 127159 775995 287633
17198C55517J6176k0849K62717B89365l5932J23044j55400L21664B50480J43610
$$ 355517 371693 350844 613561 289365 253433 376477 221077 542741 250480 394090
17188C94090o8750J81350k11392M9825M13799F4333K48619J28793j57913r1444
$$ 394090 325340 506690 295298 345123 758922 64333 312952 441745 283832 192388
17178A92388D6515L56524J24841k06249j15072K52089J1185j13065R7940J45724
$$ 192388 46515 403039 527880 321631 206559 458648 469833 356768 454708 600432
17168F00432k52503K3601j05387J79715K426k5234k290R9663J62577C08144L8506
$$ 600432 347929 371530 266143 445858 448284 423050 420760 520423 683000 308144 346650
17157C46650A61381L85550d8277G66540B98923J23591j17975m1655j27084O96714
$$ 346650 161381 546931 -48277 766540 298923 422514 304539 262884 135800 832514
17147H32514C19222L4236J71014j42752K51885K1581l02227R8554D5525O30671
$$ 832514 319222 353458 524472 381720 633605 655186 352959 451513 45525 676196
17137F76196l07765Q5978K35053k25211K36781C26422I8255K54123J65548J56049
$$ 676196 368431 454409 689462 464251 701032 326422 98255 352378 517926 673975
17127F73975j38226j81314L11407A942K67173J60468o0557L27270k32767B07599
$$ 673975 535749 354435 665842 1942 269115 429583 369026 696296 463529 207599
17116B94749J42884j39612O9503j44363M28397o6878j99743K40257m2092p8241
$$ 294749 437633 298021 367524 223161 651558 584680 384937 625194 583102 504861
17106E04861L05866k01289j42053J15153j05060J87397n5528k38742N9340K12221
$$ 504861 810727 609438 467385 582538 477478 664875 609347 370605 429945 642166
17096F42166k95188J01006M5685p0572J16186K16154k51030k8381J91466j47158
$$ 642166 346978 447984 493669 423097 539283 755437 504407 476026 667492 520334
17086E20334Q472k00577L94226M6659q3949J99210l32892k47765L96309q0541
$$ 520334 528806 328229 722455 769114 685165 884375 551483 303718 700027 619486
17076F19486J14675J10326k52331L83631m36162j26793L75925j09177r4113B83315
$$ 619486 734161 844487 592156 975787 539625 412832 788757 679580 585467 283315
17065E00710J12268j7389j24670J37929R2887N1155j66460L57081l65314J27330
$$ 500710 612978 595589 470919 608848 701735 752890 586430 943511 578197 705527
17055G05527k55459L43618J13493m37429L89648j14567J66284k21692J53190k03543
$$ 705527 450068 793686 907179 469750 859398 744831 911115 689423 842613 639070
17045F39070K36116j56788l4798J19810j14630r3858K48122l7356j10353L87735
$$ 639070 875186 718398 683600 803410 688780 594922 843044 805688 695335 1083070
17035A083070j70404k81971K57386j83207J19748M2358j84599J94466M6204O6613
$$ 1083070 912666 630695 888081 704874 824622 866980 682381 876847 923051 989664
17025I89664k90380r452J06066O6740J1089q7121J9034K20226m25648p5873L58607
$$ 989664 699284 689832 795898 862638 873727 786606 805640 1025866 600218 524345 882952
17014H82952J6608k2057R455K33825j6248j72446k15546O2263J63303k50992J29896
$$ 882952 899560 877503 886958 1120783 1104535 932089 716543 778806 942109 691117 821013
17003H21013J90016l13635K21362j08274K60499K7284j17593K39203j64878J46019
$$ 821013 1011029 697394 918756 810482 1070981 1098265 980672 1219875 1054997 1201016
16993A201016l04375k7077K2119J37114j63940K75544l29255K62053J96827J65156
$$ 1201016 896641 869564 891683 1028797 864857 1140401 811146 1073199 1270026 1435182
16983A435182n86970L35586k19979N9051N6050j17725k2805K21809N3505j85065
$$ 1435182 848212 1183798 963819 1022870 1078920 961195 938390 1160199 1213704 1028639
16973A028639q3229r8727L95393j82854J95203j96459K98111J71176m05127L30047
$$ 1028639 945410 846683 1242076 1059222 1254425 1057966 1356077 1527253 1122126 1452173
16963A452173k0232j31317j26609J53505k920N2620K13676m40443R2275J83540
$$ 1452173 1431941 1300624 1174015 1327520 1324600 1377220 1590896 1150453 1242728 1426268
16953A426268j90505K70952J28916r1134R5762k23052j41900K31160j21870r2551
$$ 1426268 1235763 1506715 1635631 1544497 1640259 1417207 1275307 1506467 1384597 1292046
16943A292046L50369j24149j9490P1007J04809j35939K77873m03086M0044J95780
$$ 1292046 1642415 1518266 1498776 1569783 1674592 1538653 1816526 1413440 1453484 1649264
16933A649264q5897J08769J15988j23529O6612J64372o5743J7550j30222N0962
$$ 1649264 1563367 1672136 1788124 1664595 1731207 1895579 1829836 1847386 1717164 1768126
16923A768126k36071O92050l23801k90486M32663l41910K63474J48920k72442
$$ 1768126 1532055 2224105 1900304 1609818 2042481 1700571 1964045 2112965 1840523
16914A840523K0198O1249P5171j69103J70146l84290M30450L33575l63720L4170
$$ 1840523 1860721 1921970 1997141 1828038 1998184 1613894 2044344 2377919 2014199 2048369
16904B048369P5296N9878L10553j5146l62698k55567L88505j18983K96632Q9734
$$ 2048369 2123665 2183543 2494096 2478950 2116252 1860685 2249190 2130207 2426839 2516573
16894B516573j50813K20903j78691K20892l04754Q6999K65254j52735M069q8646
$$ 2516573 2365760 2586663 2407972 2628864 2324110 2411109 2676363 2523628 2527697 2439051
16884B439051L0642K00633j95333L23541j46311M95717l09288k6499P1930K87942
$$ 2439051 2469693 2670326 2474993 2798534 2652223 3147940 2838652 2812153 2884083 3172025
16874C172025l57819J40229P0048R2617n1695M1637K65562r5773r3952J3604L27012
$$ 3172025 2814206 2954435 3024483 3117100 3065405 3107042 3372604 3276831 3182879 3196483 3523495
16863C523495J87964n53102O54355m06194O6518M24282k01957J40767k58466L91119
$$ 3523495 3711459 3158357 3812712 3406518 3473036 3897318 3695361 3836128 3577662 3968781
16853C968781k38038n2169J43879j24536M33115k71839K40233K30048k32930K64210
$$ 3968781 3730743 3678574 3822453 3697917 4131032 3859193 4099426 4329474 4096544 4360754
16843D360754K6885M2815J14593l49323N83163o9496q0107K16266K03265p6016
$$ 4360754 4387639 4430454 4545047 4195724 4778887 4709391 4629284 4845550 5048815 4972799
16833D972799J30114j29379K19771j3095M41186j55011L67489k90279K97245j6251
$$ 4972799 5102913 4973534 5193305 5180210 5621396 5466385 5833874 5543595 5840840 5824589
16823E824589K49990P0848j6021j6058J45842M03243l06825L44601J51745j32804
$$ 5824589 6074579 6145427 6129406 6113348 6259190 6662433 6355608 6700209 6851954 6719150
16813F719150K14975K41413N7371J77206J62900M2525j58292N69324J04473J12198
$$ 6719150 6934125 7175538 7232909 7410115 7573015 7615540 7457248 8026572 8131045 8243243
16803H243243L40748J07857K89141L53621K4717P2140P8061n9512Q99027j37865
$$ 8243243 8583991 8691848 8980989 9334610 9359327 9431467 9509528 9450016 10349043 10211178
16793A0211178M05904o5933K14259K63346O55528J65152J27045j15849M56253
$$ 10211178 10617082 10551149 10765408 11028754 11684282 11849434 11976479 11860630 12316883
16784A2316883Q6264R41008K06689L3142O27504M08420K82947J82290P06375J04139
$$ 12316883 12403147 13344155 13550844 13583986 14211490 14619910 14902857 15085147 15791522 15895661
16774A5895661M16995O72694N61791J20728Q04084L49242Q02818J87584P99586
$$ 15895661 16312656 16985350 17547141 17667869 18471953 18821195 19624013 19811597 20611183
16765B0611183K56663J024150L44335Q84252M86267Q50591M96596J048372N39773
$$ 20611183 20867846 21891996 22236331 23120583 23606850 24457441 24954037 26002409 26542182
16756B6542182J150682R46488J034969Q82631J324957N41625J481289P95893J354054
$$ 26542182 27692864 28639352 29674321 30556952 31881909 32423534 33904823 34700716 36054770
16747C6054770J338716J374180J073409K090125J516918J469822J502548K031579
$$ 36054770 37393486 38767666 39841075 41931200 43448118 44917940 46420488 48452067
16739D8452067J726139K048728J690467K327260K383969K156672J776591K832168
$$ 48452067 50178206 52226934 53917401 56244661 58628630 60785302 62561893 65394061
16731F5394061K575968K782861K152838L145197K340259K818690L285087L003681
$$ 65394061 67970029 70752890 72905728 76050925 78391184 81209874 84494961 87498642
16723H7498642K962024K934720K684584K882294K654425K823810K210559K963118
$$ 87498642 90460666 93395386 96079970 98962264 101616689 104440499 106651058 109614176
16715A09614176K209231J985246K054089J319720J683507N58607R07460J0797
$$ 109614176 111823407 113808653 115862742 117182462 118865969 119424576 120332036 120342833
16707A20342833M20362o75298l13888j032722j145427j712398j869447j789189
$$ 120342833 120763195 120087897 119774009 118741287 117595860 115883462 114014015 112224826
16699A12224826k244943k554201k504206l068296k610798k487019l137764l047032
$$ 112224826 109979883 107425682 104921476 101853180 99242382 96755363 93617599 90570567
16691I0570567l198198k864203k853298l141381k867727k628448k493163l123628
$$ 90570567 87372369 84508166 81654868 78513487 75645760 73017312 70524149 67400521
16683F7400521k102422k530758k403042j889751k619830k102992j944003k046603
$$ 67400521 65298099 62767341 60364299 58474548 55854718 53751726 51807723 49761120
16675D9761120j752379j780246j744164j615553j580666j831622j310010j094858
$$ 49761120 48008741 46228495 44484331 42868778 41288112 39456490 38146480 37051622
16667C7051622j623381n89494j626400q94696j145604j230520r51635j048169
$$ 37051622 35428241 34838747 33212347 32317651 31172047 29941527 28989892 27941723
16659B7941723r36357m65423j041450q34634p81745n85446o99614p90085o44747
$$ 27941723 27005366 26539943 25498493 24663859 23882114 23296668 22597054 21806969 21162222
16650B1162222m59012n54038p96387m86500m34125o50197m43589k47022l16581
$$ 21162222 20703210 20149172 19352785 18866285 18432160 17781963 17338374 17091352 16774771
16641A6774771n95010m03898o74010l83631l25326l03530o36717j04763k89375
$$ 16774771 16179761 15775863 15101853 14718222 14392896 14089366 13452649 13347886 13058511
16632A3058511n31414k22975l74155J81786l95047l16701k40441m06961P7409
$$ 13058511 12527097 12304122 11929967 12111753 11716706 11400005 11159564 10752603 10830012
16623A0830012j92301l44111k58923j49425k47748j14960k87069o7630k69823
$$ 10830012 10637711 10293600 10034677 9885252 9637504 9522544 9235475 9167845 8898022
16614H898022l66121N602l98572K56167n46387k30906M78553q10911j1348J70621
$$ 8898022 8531901 8537503 8138931 8395098 7848711 7617805 8096358 7285447 7274099 7444720
16604G444720l14715j30109J01323l81548k55207N3383j80565K8089r9180m5421
$$ 7444720 7130005 6999896 7101219 6719671 6464464 6517847 6337282 6365371 6266191 6220770
16594F220770m07296J68050l94005K37052n31081L19010j91143P1069l81352n3254
$$ 6220770 5813474 5981524 5587519 5824571 5293490 5612500 5421357 5492426 5111074 5057820
16584E057820P2453k17734M8358J25861k19958j83407j71798n7105K53055r1672
$$ 5057820 5130273 4912539 4960897 5086758 4866800 4683393 4511595 4454490 4707545 4615873
16574D615873j45102l28058K42043j34239P9277K4158m04518J28432j81832J94536
$$ 4615873 4470771 4142713 4384756 4250517 4329794 4353952 3949434 4077866 3896034 4090570
16564D090570n00329J03417N6428l6120N4432k28784M03637o30315J58983p5541
$$ 4090570 3590241 3693658 3750086 3713966 3768398 3539614 3943251 3312936 3471919 3396378
16554C396378r6343R1263o4766l899n21062L57633k00242P7860O7072K9300j77923
$$ 3396378 3300035 3391298 3326532 3322633 2801571 3159204 2958962 3036822 3103894 3133194 2955271
16543B955271l21238M32817k63492k9172j14640L91735m88711J73965O32j1089
$$ 2955271 2634033 3066850 2803358 2774186 2659546 3051281 2562570 2736535 2737167 2726078
16533B726078r1354n9480r2250j07159K82238k75388J72582o0746j53652j07600
$$ 2726078 2634724 2575244 2482994 2375835 2658073 2382685 2555267 2494521 2340869 2233269
16523B233269L54314j35311l17326J88909j02087L058P0868k01440K06910k26646
$$ 2233269 2587583 2452272 2134946 2323855 2221768 2224826 2295694 2094254 2301164 2074518
16513B074518m0502j55021K71359r7658K16350m82553J65460j74301j46565L69467
$$ 2074518 2034016 1878995 2150354 2052696 2269046 1786493 1951953 1777652 1631087 2000554
16503B000554r7881Q5380p3920q6544Q3696k15708m3378q2590K67311j18624N9475
$$ 2000554 1902673 1988053 1914133 1827589 1911285 1695577 1652199 1569609 1836920 1718296 1777771
16492A777771p611n5288j69011K64627n7688j62336O8557j47828j13765M7145
$$ 1777771 1770160 1714872 1545861 1810488 1752800 1590464 1659021 1511193 1397428 1444573
16482A444573L60148j72667o1878J40679k91531J01388l9032j98494O1660P6099
$$ 1444573 1804721 1632054 1570176 1710855 1419324 1520712 1481680 1283186 1344846 1420945
16472A420945L71597j90511l37000J8401j52872K29795k3312o7376K62698j16601
$$ 1420945 1792542 1602031 1265031 1283432 1130560 1360355 1337043 1269667 1532365 1415764
16462A415764o1257Q8911r4674j1859J84055m35283j21378L33158j07000J8366
$$ 1415764 1354507 1443418 1348744 1336885 1520940 1085657 964279 1297437 1190437 1208803
16452A208803k72852L94219l39958M41897l53238J54991L858N3882N9023k37225
$$ 1208803 935951 1330170 990212 1432109 1078871 1233862 1237720 1291602 1350625 1113400
16442A113400J36467k97680K09313J57298k95942M07486l85467j01231L50310
$$ 1113400 1249867 952187 1161500 1318798 1022856 1430342 1044875 943644 1293954
16433A293954j43400L68751o41891K23999J36061j27358K49921j09962l9010j23726
$$ 1293954 1150554 1519305 877414 1101413 1237474 1110116 1360037 1250075 1211065 1087339
16423A087339k10328m6059K04670l35830K91256M9513L9039r8799O3420k77748
$$ 1087339 877011 830952 1035622 699792 991048 1040561 1079600 980801 1044221 766473
16413G66473L77065j96210j54248J7344K03309k09700N6995j36368K31492J51729
$$ 766473 1143538 947328 793080 810424 1013733 804033 861028 724660 956152 1107881
16403A107881K9858p9793J08893m07221L78620j41188P3856k77126K08026p5577
$$ 1107881 1137739 1057946 1166839 759618 1138238 997050 1070906 793780 1001806 926229
16393I26229J52450l34218L607J73486l79445N14935k95301J50906k09019J77380
$$ 926229 1078679 744461 748068 921554 542109 1057044 761743 912649 703630 881010
16383H81010j69116K5914K19010j79337J06211J52734l02856J05426J8932k52077
$$ 881010 711894 737808 956818 777481 883692 1036426 733570 838996 857928 605851
16373F05851K33159o8132r4608J38414K7340M6393k40214Q01256G05588Q5930
$$ 605851 839010 770878 676270 814684 842024 888417 648203 1449459 705588 791518
16363G91518j86391K12300j85977K57911o8117j46951J40290n8548L1705J2660
$$ 791518 605127 817427 631450 889361 821244 674293 814583 756035 787740 800400
16353H00400K5187p2432m0165N2743j76568j35923L03457r6867O9521J1995p6937
$$ 800400 825587 753155 712990 765733 589165 453242 756699 659832 729353 741348 664411
16342F64411R4938o1577k2616r1704J7235j9113j25211A94424L22083o7126J55671
$$ 664411 759349 697772 675156 583452 600687 581574 456363 194424 516507 449381 605052
16331F05052M40669D16106K79810M8125p3526J2866m4378j82376j03526K87117
$$ 605052 1045721 416106 695916 744041 670515 683381 639003 456627 353101 640218
16321F40218O1915q9474n709p6537k50376K5621J52098J35123O8453j96731K89772
$$ 640218 702133 612659 606950 530413 280037 305658 457756 592879 661332 464601 754373
16310G54373j63062p9920L2629n1649m8193J59630j31966J96212j54394F4915
$$ 754373 591311 511391 544020 492371 444178 603808 471842 668054 513660 64915
16299F74670C08345N3132J81035r9885L04368j87599j25057L4168J3382M4917
$$ 674670 308345 361477 542512 442627 746995 559396 434339 468507 481889 526806
16289E26806L10162m01053Q6037A67893K28219J70608k46671R1761J31534N5435
$$ 526806 836968 435915 521952 167893 396112 566720 320049 411810 543344 598779
16279E98779r6327K80628A47215L88311K61700B57080J65735R7787B48985p2643
$$ 598779 502452 783080 147215 535526 797226 257080 422815 520602 248985 176342
16269A76342J70627j54313L53377B62678K86984n7553l8362p3227n1730Q2892
$$ 176342 346969 192656 546033 262678 549662 492109 453747 380520 328790 411682
16259D11682j5969J29083L5417L0357B03510Q1138J17878J23729r6188K82736
$$ 411682 395713 524796 560213 590570 203510 284648 402526 526255 430067 712803
16249G12803k8301B59783J70497o1203A43544K884J36714j4016R6199J45660l3499
$$ 712803 684502 259783 430280 369077 143544 146428 283142 269126 365325 510985 477486
16238D77486j29202j45080Q5407J64538r6583H4175L17582K40375B53552R4135
$$ 477486 348284 203204 288611 453149 356566 84175 401757 642132 253552 347687
16228C47687n7884l9929J66347K42039C20352E9760K11889L38292k01803j72056
$$ 347687 289803 249874 416221 658260 320352 59760 271649 609941 408138 236082
16218B36082Q3405O7797M162G9057K94045p8686H0422C2489J14632L58499k12546
$$ 236082 319487 387284 391446 79057 373102 294416 80422 32489 147121 505620 293074
16207B93074N0653L0575J6602K39680B66323k6689J3349j2074K66649q6953k9707
$$ 293074 343727 374302 390904 630584 266323 239634 252983 240909 507558 420605 390898
16196C90898j10114j8076j4937K04537o0564H881k071P8851J15495E7194K29289
$$ 390898 280784 262708 247771 452308 391744 8881 6810 85661 201156 57194 286483
16185B86483q3490K11762r8862A22325K18474A35853L85798n2390M1716A29936
$$ 286483 202993 414755 315893 122325 340799 135853 521651 469261 510977 129936
16174D03106m8331j35830J12251j03873J72467j59454J99358A94036J09375O1112
$$ 403106 354775 218945 331196 227323 399790 240336 439694 194036 303411 364523
16164C64523K22810j07540A58935K20136d2198A42885O6812F7636L3114M1889
$$ 364523 587333 479793 158935 379071 -42198 142885 209697 67636 100750 142639
16154A42639P8647R1708A47844L72712k46849G0434J76904M01410A91184Q5170
$$ 142639 221286 312994 147844 520556 273707 70434 247338 648748 191184 276354
16144B76354J4248C747K43771J42681F1844J58155r4977L18704j59267F5982Q1808
$$ 276354 290602 3747 247518 390199 61844 219999 125022 443726 284459 65982 147790
16133A47790J76623G8664B3256J96725N0043o1243L34021B64532K27464i8002
$$ 147790 324413 78664 23256 219981 270024 208781 542802 264532 491996 -98002
16122D4615R2896J07656J1244n079F3329J2282J18448k187a92829C05799J76669
$$ 44615 137511 245167 256411 251332 63329 75611 194059 191872 -192829 305799 482468
16111D82468F0203K7921J82583l7907a9485D14960b2172G2037K36935d1456q0441
$$ 482468 60203 88124 270707 232800 -19485 414960 -22172 72037 308972 -41456 -121897
16100a21897D82616q6119G5791L06922D6291O6968J35111F4413Q9838M1968R3004
$$ -121897 482616 396497 75791 382713 46291 113259 248370 64413 154251 196219 289223
16089B89223a57858D4523K09181k0680a75756I3294a71549C31729A1638K02166
$$ 289223 -157858 44523 253704 233024 -175756 93294 -171549 331729 11638 213804
16079B13804a37977I4813L18095G1717K82423p4991d5607r3314b1469A41312B8941
$$ 213804 -137977 94813 412908 71717 354140 279149 -45607 -138921 -21469 141312 28941
16067A9909N34021j43015a14173q0643O9841d8770C3825L15825G3691O061d8255
$$ 19909 553930 410915 -114173 -194816 -124975 -48770 33825 349650 73691 79752 -48255
16055A31335J68381j43875o0406a84737b5273A92802c2068k1747H6685M26580
$$ 131335 299716 155841 95435 -184737 -25273 192802 -32068 -53815 86685 513265
16045E13265A34926l5734b30596B56376c60528A51275J2516f2191D2208a55473
$$ 513265 134926 99192 -230596 256376 -360528 151275 163791 -62191 42208 -155473
16034a26592F7810N4633L6097Q6658p4557j3028a50889C16110b41896A13327a17985
$$ -126592 67810 122443 158540 245198 170641 157613 -150889 316110 -241896 113327 -117985
16022b70815F9692a20103d2088C05073B6118J66055m9767o2732O8531b06419A58653
$$ -270815 69692 -120103 -42088 305073 26118 192173 142406 79674 148205 -206419 158653
16010D9263J25871K1028a29730E9628b1206C3426b28090F776J56731a67703D69204
$$ 49263 175134 196162 -129730 59628 -21206 33426 -228090 6776 163507 -167703 469204
15998B18754g6031G8606m384a9777n0943A89153J04638k0195G6249J88944H7987
$$ 218754 -76031 78606 74222 -19777 -70720 189153 293791 273596 76249 265193 87987
15986C32733c7902H3120K80238j44477A6176K195J42981l3108J47257K8125J25434
$$ 332733 -37902 83120 363358 218881 16176 18371 161352 128244 275501 303626 429060
15975D29060O6948A59457O53234n6843N7064k09360O5160J61185j3950l85739
$$ 429060 496008 159457 812691 755848 812912 603552 668712 829897 815947 430208
15965D30208j45196n6225K32355I5714M00520A52440J87178j17497b66964c9305
$$ 430208 285012 228787 461142 95714 496234 152440 339618 222121 -266964 -39305
15954F5628J27384e8030D1291A052a73932d6359l40376C7010P9409K4898c1901
$$ 65628 193012 -58030 41291 1052 -173932 -46359 -386735 37010 116419 141317 -31901
15942b46015o7172I6283b7445n889q6998A61714n6651a45708A30584A2657a04244
$$ -246015 -313187 96283 -27445 -33334 -120332 161714 105063 -145708 130584 12657 -104244
15930A02479f0628A20991C7135a30193c5275a5980o0889m4682C24945j23384d3681
$$ 102479 -60628 120991 37135 -130193 -35275 -15980 -76869 -121551 324945 201561 -43681
15918C50888f6905j89885E7492a75107j27899B4573a3466B88015c13778o4826
$$ 350888 -66905 -256790 57492 -175107 -303006 24573 -13466 288015 -313778 -378604
15908c78604E1076P1387J17879o336b58871J07416E5906K2873a02161A77727h1565
$$ -378604 51076 122463 240342 234006 -258871 -151455 55906 78779 -102161 177727 -81565
15896A65103g4513C4068a71988j40076j7135H3783a95492Q2472C7734h110C54685
$$ 165103 -74513 34068 -171988 -312064 -329199 83783 -195492 -113020 37734 -8110 354685
15884b45746h7497A21117P5068o6659a19428F3475B1414a09081G0840a5531q7037
$$ -245746 -87497 121117 196185 129526 -119428 63475 21414 -109081 70840 -15531 -102568
15873a02568B2728c7855q829j91559H431K71517a15143p5374G2207R7437k9391
$$ -102568 22728 -37855 -46684 -238243 8431 279948 -115143 -190517 72207 169644 140253
15862A40253g9143B6778g4227l0823H8469f6403L296E1054J29172G7531B6478
$$ 140253 -79143 26778 -74227 -105050 88469 -66403 -63107 51054 180226 77531 26478
15850b1908Q205A56894b21950G1828a31389o7720l45033e9017K5157k06543d1915
$$ -21908 -13703 156894 -221950 71828 -131389 -199109 -544142 -59017 -33860 -240403 -41915
15838A28478a46339A8731K7867b91108C329a23959D9099K1325j1361K7947d5713
$$ 128478 -146339 18731 46598 -291108 3329 -123959 49099 70424 59063 87010 -45713
15826a43741j50635B68858A12696L79863j70669B9293b2417j68547I7729M9148
$$ -143741 -294376 268858 112696 492559 321890 29293 -22417 -190964 97729 146877
15816A46877k5144a29893d880F5313e2379J168p2590K9658l79188a23888B95411
$$ 146877 121733 -129893 -4880 65313 -52379 -51211 -123801 -94143 -473331 -123888 295411
15804B32642N0076j35181J4830a70158F6526b91233h0112j19196A92170a17181
$$ 232642 282718 147537 162367 -170158 66526 -291233 -80112 -199308 192170 -117181
15793d6965k06193k3184K6307P4298j3302c3860n1251E1814h4606r3788C4147
$$ -46965 -253158 -276342 -250035 -175737 -189039 -33860 -85111 51814 -84606 -178394 34147
15781h5474r5429A36014n2163J5837R8682o2617h4730A05057K6941a15925A7697
$$ -85474 -180903 136014 83851 99688 198370 135753 -84730 105057 131998 -115925 17697
15769A49117a7399A77563a04090m7069L9164k8908A95026f8380k40622b0914l94371
$$ 149117 -17399 177563 -104090 -151159 -111995 -140903 195026 -68380 -309002 -20914 -415285
15758d15285C69183B9781e9792A57028C4834b15843M0071k09248a51940J4457
$$ -415285 369183 29781 -59792 157028 34834 -215843 -175772 -385020 -151940 -137483
15748a37483k15350d0026n2928D65318A83022g1587M747C02522e9878B57681g6772
$$ -137483 -352833 -40026 -92954 465318 183022 -71587 -66840 302522 -59878 257681 -76772
15736F8017J08260n3311c4715J308j833A34716a20729j21431B3303R4195R5809
$$ 68017 176277 122966 -34715 -33407 -35240 134716 -120729 -242160 23303 117498 213307
15725B13307b17784e9230B53190a84255f8966J4855B28917a06472B7671d6250
$$ 213307 -217784 -59230 253190 -184255 -68966 -54111 228917 -106472 27671 -46250
15714b76636A61998e2717D0437b13654c9775K741l83929a76286A88522D5936J94241
$$ -276636 161998 -52717 40437 -213654 -39775 -37034 -420963 -176286 188522 45936 240177
15703B40177r5620d28963A18236d3696j18946A96693h8381B02251p2630I91b06785
$$ 240177 144557 -428963 118236 -43696 -162642 196693 -88381 202251 129621 991 -206785
15691g7560q4479B12775a51539k52567J14729b3513o4869r518A06257a08319j17235
$$ -77560 -162039 212775 -151539 -404106 -289377 -23513 -88382 -97900 106257 -108319 -225554
15680b25554b6945A08414l1343J3539F769c8553A89701r3069K28434A00263l4117
$$ -225554 -26945 108414 77071 90610 6769 -38553 189701 96632 325066 100263 66146
15669F6146c66531A25942a46059K3080C7738b15725B8047A956O2376Q5348L33596
$$ 66146 -366531 125942 -146059 -122979 37738 -215725 28047 1956 64332 149680 483276
15658D83276a95958A749J08273O7760o5642J32904q7440C0347P2863h2185C6836
$$ 483276 -195958 1749 110022 177782 112140 245044 157604 30347 103210 -82185 36836
15646h658j42326l7004O2381N2073D8547r777A619a45123L8937B09304c39047
$$ -8658 -150984 -187988 -125607 -73534 48547 38770 1619 -145123 -106186 209304 -339047
15634a0724j28366A75302b00258A07825b7467l7570j31544G7380J540A6987a29868
$$ -10724 -139090 175302 -200258 107825 -27467 -65037 -196581 77380 78920 16987 -129868
15622F3934K0188a78432P7562j10133e8055j31881j59715J35947j76920A92534
$$ 63934 84122 -178432 -100870 -211003 -58055 -189936 -349651 -213704 -390624 192534
15611b4850j52156B16798a39790H0569b00269L8092A51073F8704b77942r0923
$$ -24850 -177006 216798 -139790 80569 -200269 -162177 151073 68704 -277942 -368865
15601c68865J82582F9978N3693a39862B34314m0983e3917m9175M3048A51186C9544
$$ -368865 -186283 69978 123671 -139862 234314 193331 -53917 -103092 -60044 151186 39544
15589c92675h2199D8551M7890a52733L7036o8583E2303c295l9228G8005i5851
$$ -392675 -82199 48551 96441 -152733 -115697 -184280 52303 -3295 -42523 78005 -95851
15577c13825j7014g9320A92091k2685b8123j40483g8175j35260B12862b69402
$$ -313825 -330839 -79320 192091 169406 -28123 -168606 -78175 -213435 212862 -269402
15566b78470E9447O4301j1278j2187i6586A12113K00632A13690i9038A11658e4987
$$ -278470 59447 123748 112470 100283 -96586 112113 312745 113690 -99038 111658 -54987
15554B73705I9746b23024A29554l1706E219Q1231O2586L2299h1513A08132b40500
$$ 273705 99746 -223024 129554 97848 5219 86450 149036 181335 -81513 108132 -240500
15542a11698j7923k02011a03589N647l2137F9663L9582a29445k9078n1029Q1350
$$ -111698 -129621 -331632 -103589 -97942 -130079 69663 109245 -129445 -158523 -209552 -128202
15531a28202j7317l3014B92834j29391O0841i3603g52A20692J04704G7544a62462
$$ -128202 -145519 -178533 292834 163443 224284 -93603 -752 120692 225396 77544 -162462
15519I2950a84233b7855I3226a53217B39440F5952d1017B52986c4245l355Q234
$$ 92950 -184233 -27855 93226 -153217 239440 65952 -41017 252986 -34245 -37600 -29366
15508b9366q9833b8853A10326O6205L5145a89260m6893a16468B55885Q6751a5706
$$ -29366 -119199 -28853 110326 176531 211676 -189260 -236153 -116468 255885 342636 -15706
15496B04781m2587J45282b00608G1167l4757c9824B08642F6032J54443b32528
$$ 204781 162194 307476 -200608 71167 36410 -39824 208642 66032 220475 -232528
15485A59171e6702B0646J16221P8421K6369l32b40931F2555f5710B86513a38100
$$ 159171 -56702 20646 136867 215288 241657 241325 -240931 62555 -65710 286513 -138100
15473a34366A04719a4399l6442A85219G9271j1326L03472o9210d6368l8101B41584
$$ -134366 104719 -14399 -50841 185219 79271 67945 371417 302207 -46368 -84469 241584
15461D9184K2957J24559M80759J47723l98370J05715j81119F7413J66184A6120
$$ 49184 72141 196700 677459 825182 426812 532527 351408 67413 233597 16120
15450d3723j52766A48529c54766f8369A44457O0864a64208I5113k6952c24100
$$ -43723 -196489 148529 -354766 -68369 144457 205321 -164208 95113 68161 -324100
15439b43563A44670e6249l7040B24104A09072M0717P4800j4546Q2575o7307H3609
$$ -243563 144670 -56249 -93289 224104 109072 149789 224589 210043 292618 225311 83609
15427B33890J70667L04653P2325K07277k68365l29593l1150l824D3362b335C77621
$$ 233890 404557 709210 781535 988812 720447 390854 359704 355880 43362 -2335 377621
15415B9975i9933b7144C6590J31836c8993j4197B78984g5519j43148m2264k8474
$$ 29975 -99933 -27144 36590 168426 -38993 -53190 278984 -75519 -218667 -260931 -289405
15404b89405J38136I7947K3231a20426A70613B246R1891A9043a67301j07994A3496
$$ -289405 -151269 97947 121178 -120426 170613 2246 94137 19043 -167301 -275295 13496
15392B4522a9773A94832g6653K2180I8226a47980Q731B34979a849I3754c56176
$$ 24522 -19773 194832 -76653 -54473 98226 -147980 -139249 234979 -1849 93754 -356176
15380B51636h8197P710A25518J23534a69933j45974A13624r24c6996R356j9443
$$ 251636 -88197 -80487 125518 249052 -169933 -315907 113624 112700 -36996 -27640 -47083
15369d7083D0602L81084B8236a4224A56644a0076D6507A6925K74985A39288J43838
$$ -47083 40602 421686 28236 -14224 156644 -10076 46507 16925 291910 139288 283126
15358B83126o1103O0119I1644J72187K40956A72610A3628J51926k5879B7307O97004
$$ 283126 222023 282142 91644 263831 504787 172610 13628 165554 139675 27307 724311
15347G24311A92678I5224N4154M05568a6760j0052h172A45724o1330b13689A89443
$$ 724311 192678 95224 149378 554946 -16760 -26812 -8172 145724 84394 -213689 189443
15335A44496l9092J6534A0868i9944L5397A89680g0679I1470K39323a73163C85249
$$ 144496 105404 121938 10868 -99944 -64547 189680 -70679 91470 330793 -173163 385249
15323a00679D71340A53106L26158B12508J19371G8072J30698A0597J6276J34854
$$ -100679 471340 153106 479264 212508 331879 78072 208770 10597 26873 161727
15313A61727n7285J32610m2639M997J2232J42852A71684C3304f8961B52842a07743
$$ 161727 104442 237052 194413 199410 211642 354494 171684 33304 -68961 252842 -107743
15301a59829J1534B40236k7832i2104A04030e6837j87679d891j56645d0834j1854
$$ -159829 -148295 240236 212404 -92104 104030 -56837 -244516 -4891 -161536 -40834 -52688
15290e2688I9427a43835C01377c10847C35900q6243n5856k8246a90542c127F8373
$$ -52688 99427 -143835 301377 -310847 335900 249657 193801 165555 -190542 -3127 68373
15278A34819k4a57725b962j3463A73992b07870b8848p9045B12202d0566C19737
$$ 134819 134795 -157725 -2962 -16425 173992 -207870 -28848 -107893 212202 -40566 319737
15266d15757d3766m3749G1472a25713j80962B1124c30197K9302A02781J15143
$$ -415757 -43766 -87515 71472 -125713 -306675 21124 -330197 -300895 102781 217924
15256B17924F4578L1563a00424m3921L2821j4712j15365A49804K69666l2997E1037
$$ 217924 64578 96141 -100424 -144345 -111524 -126236 -241601 149804 419470 386473 51037
15244g6734k72273b1713A7906h700C58150A41104J89081D0451J79676A8533J40457
$$ -76734 -349007 -21713 17906 -8700 358150 141104 330185 40451 220127 18533 158990
15233A58990b3254C57113p035p7923K48097L84682L76417O037J36480k37721m04455
$$ 158990 -23254 357113 350078 272155 520252 904934 1281351 1287388 1423868 1186147 781692
15222G81692k91807A25890M09070a02921c5980l5693l9255A57824o6906J28795
$$ 781692 489885 125890 534960 -102921 -35980 -71673 -110928 157824 90918 219713
15212B19713a01703A945J25832j9408e5260k5765A870a5746B10637a84414B02110
$$ 219713 -101703 1945 127777 108369 -55260 -81025 1870 -15746 210637 -184414 202110
15200d6621D7974K45096C2816j5852a31446E2939L2868c10913A50660n152g1242
$$ -46621 47974 293070 32816 16964 -131446 52939 85807 -310913 150660 145508 -71242
15188D7017O5542C6085K950c39312e3664E967J75578a61176E1032J36022I537
$$ 47017 112559 36085 39035 -339312 -53664 5967 181545 -161176 51032 187054 9537
15176B4854N8644e720I2546C8806N6190J1903Q2321K04320b40236B81077A11325
$$ 24854 83498 -5720 92546 38806 94996 106899 189220 393540 -240236 281077 111325
15164c0687B50951q1336a24664H6405P7755F5869J26800r1901D0399i3397A37088
$$ -30687 250951 169615 -124664 86405 164160 65869 192669 100768 40399 -93397 137088
15152I3811H748g5592B84192d37497A06134L19931B0543K88570A20108Q3254F907
$$ 93811 8748 -75592 284192 -437497 106134 426065 20543 309113 120108 203362 6907
15140D6561j1131K15907K24899a61629N8140j02270A66693k92K6093e9050H3958
$$ 46561 35430 251337 476236 -161629 -103489 -205759 166693 166401 192494 -59050 83958
15128B5254a71508I4083K13912b07516A12030C7141J92801c8684a6809I864O726
$$ 25254 -171508 94083 307995 -207516 112030 37141 229942 -38684 -16809 9864 16590
15117A6590g9557F43014c7148A11838B2218J82209g5380A0426K41547J96361B6612
$$ 16590 -79557 643014 -37148 111838 22218 204427 -75380 10426 251973 448334 26612
15105C17355C0233O21716l07469A21131k6354B8119J2313J39276k6335L44379
$$ 317355 30233 651949 344480 121131 94777 28119 40432 179708 153373 497752
15095D97752j99300a22141j8426F2771J34997n9534C2920J71840I6112a96396
$$ 497752 298452 -122141 -140567 62771 197768 138234 32920 204760 96112 -196396
15084B32768h7473k4482j53963C13066A49909L5502G4481b5133j279j02799A06586
$$ 232768 -87473 -111955 -265918 313066 149909 185411 74481 -25133 -26412 -129211 106586
15072I9234l4297%J18887L7596r6632L1924a77572D9704L10533j0196A10951P7789
$$ 99234 64937 64937 183824 221420 124788 156712 -177572 49704 360237 350041 110951 188740
15060A88740M9075H0157b2039j8637B80221J68686a14444d4303B53165P9499c18262
$$ 188740 237815 80157 -22039 -40676 280221 448907 -114444 -44303 253165 332664 -318262
15048A05526L30539A19654P5343k8855K0580G3111C6436L54299O738A88492m1740
$$ 105526 436065 119654 194997 166142 186722 73111 36436 390735 397473 188492 146752
15037A46752P0425K45564B06979I4595O9782Q9595p2752n8235J1718K69079e0341
$$ 146752 217177 462741 206979 94595 164377 253972 181220 122985 134703 403782 -50341
15025C1649M74195j81812J8518o7525K02550L6392k1195B22356L35227k30321
$$ 31649 505844 324032 342550 275025 477575 513967 492772 222356 557583 327262
15015C27262K29328j85490O0158K10280N1025M6437k87187Q6797B44745L55554
$$ 327262 556590 371100 431258 641538 692563 739000 451813 538610 244745 600299
15005F00299j6755j25817J7444Q3935B44723J79909N4891B28735K25686k0320
$$ 600299 583544 457727 475171 559106 244723 424632 479523 228735 454421 434101
14995D34101M0839j30183J63931j75471J58899j11525K00427J0220j72199A51818
$$ 434101 474940 344757 508688 333217 492116 380591 581018 591238 419039 151818
14984B80257L65688k89130K20664A70425L27364N975k17231M2536j3502J69382
$$ 280257 645945 356815 577479 170425 497789 503764 286533 329069 315567 484949
14974D84949J42933k15171O0151J64831j20583p5390j59062Q08937l41910K40585
$$ 484949 627882 412711 472862 637693 517110 441720 282658 1091595 749685 990270
14964I90270k55424j17714k70980A67457L97491K25125j93302q0054m6007A66501
$$ 990270 734846 617132 346152 167457 564948 790073 596771 516717 470710 166501
14953D86480Q5054j02396E8946K27380K8463P9565o4235M8051m5407n195P4564
$$ 486480 571534 469138 58946 286326 314789 394354 330119 378170 332763 327568 402132
14942D02132K490L7925R6857A67367M27748B13148J29530J64818A35324K16443
$$ 402132 404622 442547 539404 167367 595115 213148 342678 507496 135324 351767
14932C51767J62138p1751A62650J27766j07240K85241L14385q2847j86451L80789
$$ 351767 513905 442154 162650 290416 183176 468417 782802 699955 513504 894293
14922H94293D42565j72500Q7167L54885k47196L34518l28929N38205j94798N16430
$$ 894293 442565 270065 357232 712117 464921 799439 470510 1008715 813917 1330347
14912A330347P9509k84093L32297p185L9262L1209j74654J08375L36635k77134
$$ 1330347 1409856 1125763 1458060 1450875 1490137 1521346 1346692 1455067 1791702 1514568
14902A514568M47984j71068Q5959j85524k32377j86328l08524J27478j37687C67588
$$ 1514568 1962552 1791484 1877443 1691919 1459542 1273214 964690 1092168 954481 367588
14891G57055o8046k2071j21812B45652L85170m8421j41401p7927B3501L81407
$$ 757055 689009 666938 545126 245652 630822 582401 441000 363073 23501 404908
14881D04908R816j58094K89302A12788N26694k44224j35228K45534o7244r9061
$$ 404908 414724 256630 545932 112788 639482 395258 260030 505564 438320 339259
14871C39259R5429K50002L1128J84157l61854J56775j84437K56616n6917J09624
$$ 339259 434688 684690 715818 899975 538121 694896 510459 767075 710158 819782
14861H19782k26326K55364l10139A75576J91645R9991K83000k93655n0478J64972
$$ 819782 593456 848820 538681 175576 367221 467212 750212 456557 406079 571051
14851E71051A22115L64071J12558j8616q1978q4474L47326C61030K10347k63583
$$ 571051 122115 486186 598744 580128 498150 413676 761002 361030 571377 307794
14841C07794J56337j92781l9310K14007k4039L0585l7589K0245J3541l1961A59690
$$ 307794 464131 271350 232040 446047 422008 452593 415004 435249 448790 416829 159690
14829G58389k5127k13155K67871M07999D22165K49400J62931J32512o6906k38498
$$ 758389 733262 520107 787978 1195977 422165 671565 834496 967008 900102 661604
14819F61604n2578L5700n8732k6075B42818M19900p4713j97920L84563j50315
$$ 661604 609026 644726 585994 559919 242818 662718 588005 390085 774648 624333
14809F24333j79021L35845j4691C09282L09726L48820k48942j13223j83332L14360
$$ 624333 445312 781157 766466 309282 619008 967828 718886 605663 422331 736691
14799G36691k97408K4951J09260J78833j16141K33915B20391M40128J04200K8157
$$ 736691 439283 464234 573494 752327 636186 870101 220391 660519 764719 792876
14789G92876J57051k86248K28511K7546j59795l22735K29099j79860K238K4432
$$ 792876 949927 663679 892190 919736 759941 437206 666305 486445 488683 513115
14779E13115L1577o2957L3745o4627J61655k01795J01599Q0397K9032k97222N26874
$$ 513115 544692 481735 515480 450853 612508 410713 512312 592709 621741 324519 851393
14768H51393l44871k1157J01031L64713D50737R4781L06922l59404L87467p1657
$$ 851393 506522 485365 586396 951109 450737 545518 852440 493036 880503 808846
14758H08846q364j4090l23100R7337j86602K9862q6898K74867M0999r4997k55030
$$ 808846 800482 786392 463292 560629 374027 403889 316991 591858 632857 537860 282830
14747B82830J87759m1791K54087k31561N420P0068k29780K14766K14356j66224
$$ 282830 470589 428798 682885 451324 456744 526812 297032 511798 726154 559930
14737E59930k05620K92100J59119r6687r0332J48837k01729j69757K27126l0405
$$ 559930 354310 646410 805529 708842 618510 767347 565618 395861 622987 592582
14727E92582K6698q1636Q347l8030L18067j58095L16273l48491Q7761K9246p2258
$$ 592582 619280 537644 545991 507961 826028 667933 984206 635715 723476 752722 680464
14716F80464l8568M82143r4279J98194K90224j47466K93161k89046K91063m11514
$$ 680464 641896 1124039 1029760 1227954 1518178 1370712 1663873 1374827 1665890 1254376
14706A254376j83367m4006K10245k37041k71960K56807l84500L22430l25720Q3362
$$ 1254376 1071009 1027003 1237248 1000207 728247 985054 600554 922984 597264 680626
14696F80626O8892L1772k37122N51824k32631l4440P2312L03893j13428O43293
$$ 680626 749518 781290 544168 1095992 863361 828921 901233 1205126 1091698 1734991
14686A734991j36245l1867Q1368k26504k06653J60399j09756j38755m41937K06440
$$ 1734991 1598746 1566879 1648247 1421743 1215090 1375489 1265733 1126978 685041 891481
14676H91481j17062J25409j53420p7080K89939J85164n08692L02288J39734j87364
$$ 891481 774419 899828 746408 669328 959267 1144431 635739 938027 1077761 890397
14666H90397k13323K89584n6256l73584M21094r7980k37624k01L19855q1071l37587
$$ 890397 677074 966658 910402 536818 957912 859932 622308 622107 941962 860891 523304
14655E23304K68135M61952n15247L64980l30735J88143j10667J95495M098M6835
$$ 523304 791439 1253391 738144 1103124 772389 960532 849865 1045360 1049458 1096293
14645A096293k6803m19400L03251l6297R2793L33169k58266K24986k76389K30003
$$ 1096293 1069490 650090 953341 917044 1009837 1343006 1084740 1309726 1033337 1263340
14635A263340q4149J86827k31745M8107n2312J32767j0759n4494r4373J5324K09244
$$ 1263340 1179191 1366018 1134273 1182380 1130068 1262835 1252076 1197582 1103209 1118533 1327777
14624A327777j20601M8371k20006j4560K18168j28724P8855j17163J18440k4237
$$ 1327777 1207176 1255547 1035541 1020981 1239149 1110425 1189280 1072117 1190557 1166320
14614A166320O1556o3807Q7308k50356J38201q5967j01600M24609l3598m67272
$$ 1166320 1227876 1164069 1251377 1001021 1139222 1053255 951655 1376264 1342666 875394
14604H75394K76338J77964J776K4589k07746K82048j29319J14387q7193M5018
$$ 875394 1151732 1329696 1331472 1356061 1148315 1430363 1301044 1415431 1328238 1373256
14594A373256R4106l14175J71262Q9825j70681M97422N0034o11102J28432K20081
$$ 1373256 1467362 1153187 1324449 1414274 1243593 1741015 1791049 1179947 1308379 1528460
14584A528460R7526r5127J16257o9666J15572q4292k92135p143L98333p9324p626
$$ 1528460 1625986 1530859 1647116 1577450 1693022 1608730 1316595 1309452 1707785 1628461 1620835
14573A620835J14056K4312j82581J20694l36096O1474M68849m50871J83330J45966
$$ 1620835 1734891 1759203 1576622 1697316 1361220 1422694 1891543 1440672 1624002 1769968
14563A769968K12566k37917j13247M64756j38534r7641P0249j4883n9379K46202
$$ 1769968 1982534 1744617 1631370 2096126 1957592 1859951 1930200 1915317 1855938 2102140
14553B102140J88228l10837r3753N2386O0199K66045L82394l27987M38938k00892
$$ 2102140 2290368 1979531 1885778 1938164 1998363 2264408 2646802 2318815 2757753 2556861
14543B556861J4086Q2577P4889M35104L09337O05874K74102O64377J844232K250128
$$ 2556861 2570947 2653524 2728413 3163517 3472854 4078728 4352830 5017207 6861439 9111567
14533I111567M023770N768073R157747K308049j1692577p718703m104095k029950
$$ 9111567 13135337 18903410 28061157 30369206 18676629 10957926 6853831 4823881
14525D823881o79498l39652M60398k220j127916m33182j91666m42716n874P2459
$$ 4823881 4144383 3804731 4265129 4262909 3134993 2701811 2510145 2067429 2061555 2134014
14515B134014l9532j65037O06127l64032k03950M32871m14522J17033J04508k95104
$$ 2134014 2094482 1929445 2535572 2171540 1967590 2400461 1985939 2102972 2207480 1912376
14505A912376L67615k35801m8724J59310j05163J679L7236N57279l96074O0806
$$ 1912376 2279991 2044190 1995466 2154776 2049613 2051292 2088528 2645807 2249733 2310539
14495B310539R1273m8198j5113p9532J39142k0590N72369l69484L48925l12948
$$ 2310539 2401812 2353614 2338501 2258969 2398111 2377521 2949890 2580406 2929331 2616383
14485B616383M44158k0062l76693O67918k54442k00919K99231n1080k54024L90845
$$ 2616383 3060541 3040479 2663786 3331704 3077262 2876343 3175574 3124494 2870470 3261315
14475C261315r7633j04099P6274k6424J1337M70104q6126r084r0472M8780p2073
$$ 3261315 3163682 3059583 3135857 3109433 3120770 3590874 3504748 3495664 3405192 3453972 3381899
14464C381899K7501J25306m4727J82371M3357k68253K07208Q4908J30889k17772
$$ 3381899 3409400 3534706 3489979 3672350 3715707 3447454 3654662 3739570 3870459 3652687
14454C652687j02220L75164J04832O6879q2625R3984K44981J46227o5559q7910
$$ 3652687 3550467 3925631 4030463 4097342 4014717 4108701 4353682 4499909 4434350 4346440
14444D346440j74068O985K68199j38364J47774K66348j22848K78788m363k09766
$$ 4346440 4172372 4179357 4447556 4309192 4456966 4723314 4600466 4879254 4874891 4665125
14434D665125J44722J1315o5868L43296k67664K22848K651K95262l21190M47614
$$ 4665125 4809847 4821162 4755294 5098590 4830926 5053774 5056425 5351687 5030497 5478111
14424E478111q0438J58977J32900M4937J56224L3341K22151K6906o6086o4930
$$ 5478111 5397673 5556650 5689550 5734487 5890711 5924052 6146203 6173109 6107023 6042093
14414F042093J39816J67871M25834k6688k50278L4670J04148K39166L66448Q318
$$ 6042093 6181909 6349780 6775614 6748926 6498648 6533318 6637466 6876632 7243080 7251398
14404G251398K69476K95486k18479K74403k44100K03750L97877l0830R1119J4789
$$ 7251398 7520874 7816360 7597881 7872284 7628184 7831934 8229811 8198981 8290100 8304889
14394H304889M03105j0806k15448K67879K68006J37500M36114l0717P7570M29687
$$ 8304889 8707994 8697188 8481740 8749619 9017625 9155125 9591239 9560522 9638092 10067779
14384A0067779k75298L3642J15538L23877J9861J62894M2086J89940M71263j74257
$$ 10067779 9792481 9826123 9941661 10265538 10285399 10448293 10490379 10680319 11151582 10977325
14374A0977325R7698P03877n8458K86718K42901J31618M65829K50410J92429K33074
$$ 10977325 11075023 11778900 11720442 12007160 12250061 12381679 12847508 13097918 13290347 13523421
14364A3523421K99142N68393k61803K82459K27745L37030R3824Q51856J83066
$$ 13523421 13822563 14390956 14129153 14411612 14639357 14976387 15070211 15922067 16105133
14355A6105133N9170J63390K91620M46484R72681Q2230K01101N88773L81715M93945
$$ 16105133 16164303 16327693 16619313 17065797 18038478 18120708 18321809 18910582 19292297 19786242
14345A9786242L07075L33056K59689P63889N72090L29577K08492R87763L76554
$$ 19786242 20093317 20426373 20686062 21449951 22022041 22351618 22560110 23547873 23924427
14336B3924427O03210O04703O40124M77241Q24519O82020J186004J72023J059064
$$ 23924427 24527637 25132340 25772464 26249705 27074224 27756244 28942248 29114271 30173335
14327C0173335P32610Q77383J091986L68972J202968R41446J076042J486559Q17620
$$ 30173335 30905945 31783328 32875314 33244286 34447254 35388700 36464742 37951301 38768921
14318C8768921J062510J309141J602733J356249J500833J445002J117945K275732
$$ 38768921 39831431 41140572 42743305 44099554 45600387 47045389 48163334 50439066
14310E0439066J604336J671861K091525J739281K464247K327807K091707K315857
$$ 50439066 52043402 53715263 55806788 57546069 60010316 62338123 64429830 66745687
14302F6745687K603931K588995L115623L002262K469261L994646L215801L993255
$$ 66745687 69349618 71938613 75054236 78056498 80525759 84520405 87736206 91729461
14294I1729461M274116M156612M568629M794801N569520N543528N869152O321730
$$ 91729461 96003577 100160189 104728818 109523619 115093139 120636667 126505819 132827549
14286A32827549O908268P161717P484511P863787Q547436R011678R398979J0490776
$$ 132827549 139735817 146897534 154382045 162245832 170793268 179804946 189203925 199694701
14278A99694701J0629621J1782947J1932470J2516824J3249492J3486752J4240954
$$ 199694701 210324322 222107269 234039739 246556563 259806055 273292807 287533761
14271B87533761J4691966J4479487J4851707J4965749J4946938J4721078J3792458
$$ 287533761 302225727 316705214 331556921 346522670 361469608 376190686 389983144
14264C89983144J3146386J2231938J1321113J0272333Q957261O284869K579650
$$ 389983144 403129530 415361468 426682581 436954914 445912175 452197044 454776694
14257D54776694O4628J93627J174524n03187q903377o773778p112356j0371686
$$ 454776694 454841322 455034949 456209473 455706286 446802909 440029131 432916775 422545089
14249D22545089j2229395j3432527j4050934j4993126j4750989j4835047j4899995
$$ 422545089 410315694 396883167 382832233 367839107 353088118 338253071 323353076
14242C23353076j4709322j4742409j3811766j3570009j3124946j2351401j1992055
$$ 323353076 308643754 293901345 280089579 266519570 253394624 241043223 229051168
14235B29051168j1843387j1993037j0707961r913014r879730r177075q252500
$$ 229051168 217207781 205214744 194506783 184593769 174714039 165536964 157284464
14228A57284464q020437p046681p232060o159246o415829n326134n242893n330076
$$ 157284464 149264027 142217346 134985286 128826040 122410211 117084077 111841184 106511108
14220A06511108m506431m389781m089633m279479l302502l443323l586500l094766
$$ 106511108 102004677 97614896 93525263 89245784 85943282 82499959 78913459 75818693
14212G5818693k736196k899445l140935j985269k624978k241968j780627k115303
$$ 75818693 73082497 70183052 67042117 65056848 62431870 60189902 58409275 56293972
14204E6293972j869349j905662j753882j695650j640383j454679j113628j361653
$$ 56293972 54424623 52518961 50765079 49069429 47429046 45974367 44860739 43499086
14196D3499086j557575j207660j226387p96637p48097j326074r50905j364864
$$ 43499086 41941511 40733851 39507464 38710827 37962730 36636656 35685751 34320887
14188C4320887r16864p45469p47594q71152j169986m19691n28016r37336p05097
$$ 34320887 33404023 32658554 31910960 31039808 29869822 29450131 28922115 27984779 27279682
14179B7279682q70170n61549r76692j10805p40070m07717o77628n38128p68044
$$ 27279682 26409512 25847963 24871271 24760466 24020396 23612679 22935051 22396923 21628879
14170B1628879o32886j85185k65350o46384l47419m45424l24303p01936m43553
$$ 21628879 20995993 20810808 20545458 19899074 19551655 19106231 18781928 18079992 17636439
14161A7636439l20775n7183m05797l27122l51644n85720m6151K8181n38202n84814
$$ 17636439 17315664 17258481 16852684 16525562 16173918 15588198 15542047 15570228 15032026 14447212
14151A4447212k28646L05069n03723k43005n39069J39247k95952j17792p47200
$$ 14447212 14218566 14523635 14019912 13776907 13237838 13377085 13081133 12963341 12216141
14142A2216141k67655L91179m88485j39253j6021m31768K41745m33676k41087
$$ 12216141 11948486 12339665 11851180 11711927 11695906 11264138 11505883 11072207 10831120
14133A0831120j33278k45562o1883k39757l13589l82333k8876J80794m17271j72487
$$ 10831120 10697842 10452280 10390397 10150640 9837051 9454718 9425842 9606636 9189365 9016878
14123I016878Q3968J94025l01119k45984j75081p884l58424k68190M25640m32460
$$ 9016878 9100846 9294871 8993752 8747768 8572687 8564803 8206379 7938189 8363829 7931369
14113G931369k60517j4964K03918n12357j4784P65k11552R9853l56388L7222r3534
$$ 7931369 7670852 7655888 7859806 7347449 7332665 7333430 7121878 7221731 6865343 6902565 6809031
14102F809031k13579J4248J33664m82281K68641L531j54421J26515n06556K68540
$$ 6809031 6595452 6609700 6743364 6261083 6529724 6533255 6378834 6505349 5998793 6267333
14092F267333o78473K61582q0695P1982l71383J84282O4080j09794p2500k86429
$$ 6267333 5588860 5850442 5769747 5841729 5470346 5654628 5718708 5608914 5536414 5249985
14082E249985l39244N28847k97932k528j78485J86289j64172O0845l4183M846
$$ 5249985 4910741 5439588 5141656 5139128 4960643 5146932 4982760 5043605 5009422 5014268
14072E014268n07534k3632J12026L6151J19277l61609j75442M06145k48769j40338
$$ 5014268 4506734 4483102 4595128 4631279 4750556 4388947 4213505 4619650 4370881 4230543
14062D230543L2958j67298o2175k8554R975Q8441q4116J86293l48318L17297o08841
$$ 4230543 4263501 4096203 4034028 4005474 4015449 4103890 4019774 4206067 3857749 4175046 3566205
14051C566205Q03476p68365J75586J78161r8685j55713L15807k69096n7653k49181
$$ 3566205 4369681 3601316 3776902 3955063 3856378 3700665 4016472 3747376 3689723 3440542
14041C440542K78642k30857j11554K82573j85448j07586J64134l20864J75666
$$ 3440542 3719184 3488327 3376773 3659346 3473898 3366312 3530446 3209582 3385248
14032C385248k79524L5852j86000j13954r8834P01678l14167M0520k27739p4580
$$ 3385248 3105724 3141576 2955576 2841622 2742788 3444466 3130299 3170819 2943080 2868500
14022B868500K33415l43682M48169l70900j61250M3788j20616J85981J31045k43138
$$ 2868500 3101915 2758233 3206402 2835502 2674252 2718040 2597424 2783405 2914450 2671312
14012B671312k77999Q174J09638j82664j61101N85578j79819k36725J57309l0335
$$ 2671312 2393313 2401487 2511125 2328461 2167360 2752938 2573119 2336394 2493703 2463368
14002B463368l11650K09299o8411K52724k85480L9382m0222J7200J25945l72672
$$ 2463368 2151718 2361017 2292606 2545330 2259850 2299232 2259010 2276210 2402155 2029483
13992B029483J2975K24110k10193j48973L07331k9395N5859l24299J80015M7493
$$ 2029483 2042458 2266568 2056375 1907402 2214733 2185338 2241197 1916898 2096913 2144406
13982B144406m71593M96937R4728J64046k59886P56898L23077Q36136J676497
$$ 2144406 1672813 2169750 2264478 2428524 2168638 2925536 3248613 4084749 5761246
13973E761246L128114N198425R269919P806378q783422p690725n097772k824494
$$ 5761246 8889360 14087785 23357704 31164082 22380660 14689935 9592163 6767669
13965F767669j124813j100706n13379k65451n88867n0110l31989n282O5688m88905
$$ 6767669 5642856 4542150 4028771 3763320 3174453 3124343 2792354 2787072 2852760 2363855
13955B363855n1840R4453j67081m1179r4952L4875R7288l30451n949L2541L41188
$$ 2363855 2312015 2406468 2239387 2198208 2103256 2138131 2235419 1904968 1899019 1931560 2272748
13944B272748o66544K06775R1067P6048m6815M5702k73047o9293J78163J61863
$$ 2272748 1606204 1812979 1904046 1980094 1933279 1978981 1705934 1636641 1814804 1976667
13934A976667m09848P4785J77975m14595J4226J02262L32510p351r5233l40504
$$ 1976667 1566819 1641604 1819579 1404984 1419210 1521472 1853982 1846631 1751398 1410894
13924A410894J13835P998L01453l19721O4822j09100J35704L3467j25605k16662
$$ 1410894 1524729 1532727 1834180 1514459 1579281 1470181 1605885 1639352 1513747 1297085
13914A297085K11528r6747K42932k15115J65832N1477k11043k16731L70296j0966
$$ 1297085 1508613 1411866 1654798 1439683 1605515 1656992 1445949 1229218 1599514 1588548
13904A588548n94049O06570k28729Q8317j51892l2284K29927m71652N48905j78152
$$ 1588548 994499 1601069 1372340 1460657 1308765 1276481 1506408 1034756 1583661 1405509
13894A405509N7311j81880p9919Q3389k37527J36363K70020j46546j26068n6802
$$ 1405509 1462820 1280940 1201021 1284410 1046883 1183246 1453266 1306720 1180652 1123850
13884A123850J85073m10702L1959K3921L09129R5609l79534J67047J94491j75297
$$ 1123850 1308923 898221 930180 954101 1263230 1358839 979305 1146352 1340843 1165546
13874A165546n7728j63378J91745j85472K22834l5611K84349j60542k65939L6514
$$ 1165546 1107818 944440 1136185 950713 1173547 1137936 1422285 1261743 995804 1032318
13864A032318J75740j38279J61222k30750J36277j73793L65503k87634k33867
$$ 1032318 1208058 1069779 1231001 1000251 1136528 962735 1328238 1040604 806737
13855H06737L88949N5474k15006r8607J12773m6011L28198k83641k75420M96560
$$ 806737 1195686 1251160 1036154 937547 1050320 1004309 1332507 1048866 773446 1270006
13845A270006l65012J09608L72252l40840K44613o43226j36273N04597j10156
$$ 1270006 904994 1014602 1386854 1046014 1290627 647401 511128 1015725 905569
13836I05569L84085n90022L39487j54378N4015J11970k57745L14997k7501m29462
$$ 905569 1289654 699632 1039119 884741 938756 1050726 792981 1107978 1080477 651015
13826F51015k1713J87708N62573F72557K97739q2214j76217j3560J36936j05180
$$ 651015 629302 817010 1379583 672557 970296 888082 711865 698305 835241 730061
13816G30061j71937J62324J19702J27926j57095k10077K73008K94331l45813j31448
$$ 730061 558124 720448 840150 968076 810981 600904 873912 1168243 822430 690982
13806F90982R6687r076j99478J44940j39549J78169j68546J48231J5879K3887
$$ 690982 787669 778593 579115 724055 584506 762675 594129 742360 758239 782126
13796G82126J13176r238k40949N18560m69313r5185L5065J09289j65795K33879
$$ 782126 895302 886064 645115 1163675 694362 599177 634242 743531 577736 811615
13786H11615O9379k86462O4605L21912q2869l986n0822K73266n26520B47176L56556
$$ 811615 880994 594532 659137 981049 898180 894194 843372 1116638 590118 247176 603732
13775F03732M4253K8646r7028K11737k43193J47759Q1279k95369K43199j27176
$$ 603732 647985 676631 579603 791340 548147 695906 777185 481816 725015 597839
13765E97839J23495K1663l58633L23065k18690K92021C54761K78242q7009J59138
$$ 597839 721334 742997 384364 707429 488739 780760 354761 633003 545994 705132
13755G05132O917C29775K32756B39276K34305J55046J81282n2864j62615J35734
$$ 705132 712049 329775 562531 239276 473581 628627 809909 757045 594430 730164
13745G30164L04645m66188K50302q4860k21082j22710l012L15216j74342K16129
$$ 730164 1034809 568621 818923 734063 512981 390271 387259 702475 528133 744262
13735G44262k72742J29248L78614m33100j25218N11940C70375j0110M0409K22299
$$ 744262 471520 600768 979382 546282 421064 933004 370375 360265 400674 622973
13725F22973j49607J2296q9922J92967Q181A72707N77721l59320j05471J82982
$$ 622973 473366 485662 395740 588707 596888 172707 750428 391108 285637 468619
13715D68619J17128P634K9419A87792P47962D22798m3155K51898K72823D16733
$$ 468619 585747 593381 622800 187792 935754 422798 379643 631541 904364 416733
13704E17530j54090L19581J37647m02632A61501J17589J85834J12619j8811k29589
$$ 517530 363440 683021 820668 418036 161501 279090 464924 577543 558732 329143
13694C29143J36524j17698J76588p9886L12323C42002M32519q1122j57126Q2032
$$ 329143 465667 347969 524557 444671 756994 342002 774521 693399 536273 618305
13684F18305j30288J90469k44711k12347M61551l12995A41836L54030L7798j95029
$$ 618305 488017 678486 433775 221428 682979 369984 141836 495866 533664 338635
13674C38635j36913j5690L37710L17514k78484j02834m612o8768J53008B27652
$$ 338635 201722 186032 523742 841256 562772 459938 455326 386558 539566 227652
13663E20796q2538m6525J61855k48023P9025K18234P7779j77561B13910K0971
$$ 520796 438258 391733 553588 305565 384590 602824 680603 503042 213910 234881
13653B34881E2111O71970A25473J8112J77033M10014A70183J50438J4445L19150
$$ 234881 52111 724081 125473 143585 320618 730632 170183 320621 335066 654216
13643F54216k32624l9197K37882j27131H2977N01513k31902J77736j6242r8762
$$ 654216 421592 382395 620277 493146 82977 584490 352588 530324 514082 415320
13633D15320J10580j57175q6485j34486K44044K11572M8319B05221L69557o5062
$$ 415320 525900 368725 282240 147754 391798 603370 651689 205221 574778 509716
13623E09716O9795j22772j33416C1344K81535n9899M08L20554n057B62991Q910
$$ 509716 579511 456739 323323 31344 312879 252980 253388 573942 568885 262991 271901
13612B71901K4546L77383B00612J16120j03103K19071j88307M96398k80756J02398
$$ 271901 296447 673830 200612 316732 213629 432700 244393 740791 460035 562433
13602E62433k25487E4668K50378n113R4638n803j28625N4045K24242j3039B59034
$$ 562433 336946 54668 305046 299933 394571 388768 260143 314188 538430 525391 259034
13590A56503M8346J67150J03906J58824q5378J98006C11632L0281J58609j45735
$$ 156503 204849 371999 475905 634729 549351 747357 311632 341913 500522 354787
13580C54787K02253B35322K04753j88692J40707h952D38218A81510L87002B19108
$$ 354787 557040 235322 440075 251383 392090 -8952 438218 181510 568512 219108
13569a18703B43863P5919j23696K74614q1397F0118a0138D29306j51957r2422
$$ -118703 243863 319782 196086 470700 389303 60118 -10138 429306 277349 184927
13559A84927J92701L9927L4250l9774k971A64331L63146K4827A03554K73369K29036
$$ 184927 377628 417555 451805 412031 409060 164331 527477 552304 103554 376923 605959
13548F05959C02731j06696J12870J9628F1143K79441B1477K09447K01691A76267
$$ 605959 302731 196035 308905 328533 61143 340584 21477 230924 432615 176267
13537A72647J1507J81183h3946C36394a56686E23591A32085E4327K84404A54724
$$ 172647 184154 365337 -83946 336394 -156686 523591 132085 54327 338731 154724
13526B49907O9318O8822j20332K9658l6242J10263p5947q1402I9656Q6629D5559
$$ 249907 319225 388047 267715 297373 261131 371394 295447 214045 99656 186285 45559
13514h5073E46242j78322j60928f6808B40683r8462E289L17526K39048k18861
$$ -85073 546242 367920 206992 -66808 240683 142221 5289 322815 561863 343002
13504C43002K74334A38885J28549l1502j06215b12969B64986O4388k9064G2284
$$ 343002 617336 138885 267434 235932 129717 -212969 264986 329374 300310 72284
13493C6981J82986r8710A5663j618K06682N12759C31448J436n4358A38093K81915
$$ 36981 219967 121257 15663 14045 220727 733486 331448 332884 278526 138093 420008
13482D20008A74548m1922J47634j9561P2997j18295p4842m963P8642J93200a33330
$$ 420008 174548 132626 280260 260699 333696 215401 140559 135596 214238 407438 -133330
13470B17440K79379B40286K02278B06279p7979k8859L9648m0792K54916J5699
$$ 217440 496819 240286 442564 206279 128300 99441 139089 98297 353213 368912
13460C68912j0297C9063L2262A6492J49331J85890H5826E474J49186L3962J55666
$$ 368912 358615 39063 71325 16492 165823 351713 85826 5474 154660 188622 344288
13449C44288A32783J02113J20429n060m3619f6822D09593G868L18380j18570R2382
$$ 344288 132783 234896 355325 350265 306646 -66822 409593 7868 326248 207678 300060
13438C00060E3819L45406A80125L2263G0057L15690j88548B5627J7972P968J41324
$$ 300060 53819 399225 180125 212388 70057 385747 197199 25627 43599 51567 192891
13427A92891Q8773B0679a0572A19586f803E17538H3901a57250B63126K28262A45968
$$ 192891 281664 20679 -10572 119586 -6803 517538 83901 -157250 263126 491388 145968
13415B9588J92631l5575Q3822R3035A31389K10162j9993A08465J32119N0328g6306
$$ 29588 222219 186644 270466 363501 131389 341551 321558 108465 240584 290912 -76306
13403B08636J60511K25755B89655f565D47685j27308A35169K40687j19250g763
$$ 208636 369147 594902 289655 -6565 447685 320377 135169 375856 256606 -7763
13392C9804M47052B29888k9305M72082A70949J0659B9108i1407l2399B65108d6192
$$ 39804 486856 229888 200583 672665 170949 181608 29108 -91407 -123806 265108 -46192
13380B78354N3463j23629J4865q5604e3774E1305l871O43j7915Q6713J39187j4361
$$ 278354 331817 208188 223053 137449 -53774 51305 47434 48077 30162 116875 256062 241701
13368B41701B1436a82879H6659K75342g6562A24454N0208K1616E3255K60056a23476
$$ 241701 21436 -182879 86659 362001 -76562 124454 174662 196278 53255 313311 -123476
13356B07375k5886g9273E10152j09198A65358J38961r0025Q67Q1065D3483H435
$$ 207375 181489 -79273 510152 400954 165358 304319 214294 215161 296226 43483 8435
13344F27798G0051k2659L88624b4357A95730R7087K62387a39966d0220B55528
$$ 627798 70051 47392 436016 -24357 195730 292817 555204 -139966 -40220 255528
13333C44778j10724J58662j07857a860B78314h9561H3775L97314c1330B11819
$$ 344778 234054 392716 284859 -1860 278314 -89561 83775 481089 -31330 211819
13322F9508M8069K88841m7662r3932J56377j41315n7963J74156A43469j3711M7619
$$ 69508 117577 406418 358756 264824 421201 279886 221923 396079 143469 129758 177377
13311A77377e5895A3219J29192M12256j38147E7743K7446R4987p2729M2620K6372
$$ 177377 -55895 13219 142411 554667 416520 57743 85189 180176 107447 150067 176439
13300A76439J42251A49946a80069B12213r2693g885A50396L00175B05127A7079
$$ 176439 318690 149946 -180069 212213 119520 -7885 150396 450571 205127 17079
13289d6690B45434C8006P5500J4464B3686O2804d1483A45444J86178K58763A96010
$$ -46690 245434 38006 113506 127970 23686 86490 -41483 145444 331622 590385 196010
13277A0071K47090J65944A88777B8563K04293A8918K78655G2715J33751L599a32698
$$ 10071 257161 423105 188777 28563 232856 18918 297573 72715 206466 210065 -132698
13265B98361K7122A1758J78427a00026A89025Q5451a94231E9373J03450b7984
$$ 298361 325483 11758 190185 -100026 189025 274476 -194231 59373 162823 -27984
13254A82585n490K26943j27083I1218C2010M60450B2023J39502F882J52320J01989
$$ 182585 177095 404038 276955 91218 32010 492460 22023 161525 6882 159202 261191
13243B61191j08263c14350I8906A9912b4150m4756H2257m855l5105J23968J14792
$$ 261191 152928 -314350 98906 19912 -24150 -68906 82257 77402 42297 166265 281057
13232B81057m7971M8031b4318A75324c18383B21499G8203k8889a69176A34071
$$ 281057 233086 281117 -24318 175324 -318383 221499 78203 49314 -169176 134071
13221A41883O3662M1902c18035A15484J92882e4151k00901C16650h794l9860k04450
$$ 141883 205545 247447 -318035 115484 308366 -54151 -255052 316650 -8794 -48654 -253104
13210b53104a1920A73892R1975L1778F967L43351b00650h1367B69850H546K40409
$$ -253104 -11920 173892 265867 297645 6967 350318 -200650 -81367 269850 8546 248955
13199B48955H8240p792J95844r3329F2146j9076N4362d051k93144A27152K15050
$$ 248955 88240 80448 276292 182963 62146 43070 97432 -4051 -297195 127152 342202
13188C42202j16512c30611I1821l1045c1916D6328a39716A3603K38009A12992
$$ 342202 225690 -330611 91821 60776 -31916 46328 -139716 13603 251612 112992
13177A60251b8871l5991K7661C46530c7255B62035c1561K606A36899O1968l9380
$$ 160251 -28871 -64862 -37201 346530 -37255 262035 -31561 -28955 136899 198867 159487
13166A59487J75154j3152p3277L1341F5717e46A67694g0186A38402a11798B73010
$$ 159487 334641 321489 248212 279553 65717 -546 167694 -70186 138402 -111798 273010
13154H3443a32032G8712a00028A66837d7264A60201a76645C13779a93418L8065
$$ 83443 -132032 78712 -100028 166837 -47264 160201 -176645 313779 -193418 -155353
13144a55353c3236A80224h4292j7654B73485E1867J09995o3951Q1795c8074C8874
$$ -155353 -33236 180224 -84292 -101946 273485 51867 161862 97911 179706 -38074 38874
13132E233K85116M7090A23266d8457A55953D8119J1586B0545M5642e6740M651
$$ 5233 290349 337439 123266 -48457 155953 48119 59705 20545 66187 -56740 -52089
13121e2089A32899b3889B29939p6037j2383b2862A912R9484J68017E4109g1032
$$ -52089 132899 -23889 229939 153902 141519 -22862 1912 101396 269413 54109 -71032
13109I5160a19201A03463b92504H0620L2555A7313g3396K1075A8129h378o8980
$$ 95160 -119201 103463 -292504 80620 113175 17313 -73396 -52321 18129 -8378 -77358
13098g7358a9201A85519b34049K1355A69439G911i5893B54760J0326j28059j3676
$$ -77358 -19201 185519 -234049 -212694 169439 7911 -95893 254760 265086 137027 123351
13087A23351b786A14525m5871h5119c2382a2752B16522G8273R8613E3131h7226
$$ 123351 -2786 114525 68654 -85119 -32382 -12752 216522 78273 176886 53131 -87226
13075e6913H9216K5526J56531A2898B174Q9217K59572b06302A68894a26151I266
$$ -56913 89216 114742 271273 12898 2174 91391 350963 -206302 168894 -126151 9266
13063b35685A17325n575K63236B4809K55721b48741B54090g708L725B06426B2955
$$ -235685 117325 111750 374986 24809 280530 -248741 254090 -7708 -3983 206426 22955
13051A12700d8723E5086a20455I126a95947D1084N2192c7843A80592b41424I2512
$$ 112700 -48723 55086 -120455 9126 -195947 41084 93276 -37843 180592 -241424 92512
13039g3133D3985J75028a53110e4517C41438j17862e8546G1297r732a8750G6298
$$ -73133 43985 219013 -153110 -54517 341438 223576 -58546 71297 61565 -18750 76298
13027A65345R016J23f1823j43162f2146A28584e4485A74232k1936E4588J4646
$$ 165345 174361 174484 -61823 -204985 -62146 128584 -54485 174232 152296 54588 69234
13016F9234c4299C3824j4142P5735j1251R3109Q987a46052A70499g2778C1300
$$ 69234 -34299 33824 19682 95417 84166 177275 186262 -146052 170499 -72778 31300
13004D02945a3984C67412C3779f2566A08337J06303b71455b0647A62948d8624
$$ 402945 -13984 367412 33779 -62566 108337 214640 -271455 -20647 162948 -48624
12993e9585A32683E9544L8094K40312O7955g0070L2089l27842B22341H5404i6150
$$ -59585 132683 59544 97638 337950 405905 -70070 -37981 -365823 222341 85404 -96150
12981b31316I7666b24888c1688A08129A5159a13335b8613n728B7677d6918C5723
$$ -231316 97666 -224888 -31688 108129 15159 -113335 -28613 -34341 27677 -46918 35723
12969A40257a90169R2391l1411A39589f2755E1287N6468a30557j81529A13000
$$ 140257 -190169 -97778 -129189 139589 -62755 51287 107755 -130557 -312086 113000
12958a41276o2298d468l8883j15382k9843A97885A6668i3504A91437a82265A1401
$$ -141276 -203574 -4468 -43351 -158733 -188576 197885 16668 -93504 191437 -182265 11401
12946b48912Q3064i938l97265A51204b1003m5995G5015J05926k7101L8635g5314
$$ -248912 -165848 -9938 -407203 151204 -21003 -66998 75015 180941 153840 192475 -75314
12934H628K1554J60818b69267B0787b11727k8414E85426A04338a75729B09000
$$ 8628 30182 191000 -269267 20787 -211727 -240141 585426 104338 -175729 209000
12923d6180A61963j0876K16667E2749R3401j0732m8639d6613A20516n0541k1627
$$ -46180 161963 151087 367754 52749 146150 135418 86779 -46613 120516 69975 48348
12912D8348g0305B67697m1572J66541A12723a05652L073A29300P5098n7042B5392
$$ 48348 -70305 267697 226125 392666 112723 -105652 -102579 129300 204398 147356 25392
12900D0375J21094o7135a09374o6665e649D0763b2673o6250C06021a34689L1414
$$ 40375 161469 94334 -109374 -176039 -5649 40763 -22673 -88923 306021 -134689 -103275
12889a03275B76793B4682P0760M5036B2984J62271C7806f0106K7571l10003B40795
$$ -103275 276793 24682 95442 140478 22984 185255 37806 -60106 -32535 -342538 240795
12877A51334g7784B0219L04370a65121g9390B37900G9720f326n6927b5868A89347
$$ 151334 -77784 20219 324589 -165121 -79390 237900 79720 -6326 -63253 -25868 189347
12865a8925j86310a00041A69565E626a3267k09735G2541b18843J03636j80765
$$ -18925 -205235 -100041 169565 5626 -13267 -223002 72541 -218843 -115207 -295972
12855b95972P9429B5098c85888b5601A86450h6926L3868j54892b1609A46587F6117
$$ -295972 -216543 25098 -385888 -25601 186450 -86926 -53058 -207950 -21609 146587 66117
12843D9532J33523h8230A32367a05866c2918j7306k6061C3249L43372b6272C8179
$$ 49532 183055 -88230 132367 -105866 -32918 -50224 -76285 33249 376621 -26272 38179
12831b00807R209O6330o6805h6202l9200f2535k29462e2727P377A778a87717P4773
$$ -200807 -191598 -125268 -192073 -86202 -125402 -62535 -291997 -52727 -45350 1778 -187717 -112944
12819a12944H3179h4974A23955c1030A64856E5879L10887b6374E6677B5917J82547
$$ -112944 83179 -84974 123955 -31030 164856 55879 366766 -26374 56677 25917 208464
12808B08464d310I8986J00298b7499H9494P931a35895a6299j27284l03933K16138
$$ 208464 -4310 98986 199284 -27499 89494 97425 -135895 -16299 -143583 -447516 -231378
12797b31378A71729K1798F2067a4258E827c02323A37848a42760f1771E5030B0281
$$ -231378 171729 193527 62067 -14258 5827 -302323 137848 -142760 -61771 55030 20281
12785A40774b13347C4980Q2154a04110A55279J8067b45498A11142a89562j15663
$$ 140774 -213347 34980 117134 -104110 155279 173346 -245498 111142 -189562 -305225
12775c05225A49605h1067l12458d3462j39089h135o9132D06774A35229c9150C1952
$$ -305225 149605 -81067 -393525 -43462 -182551 -8135 -77267 406774 135229 -39150 31952
12763A60299L8781c6531k5003J6155B62831a03478b2128j00424I1905N7930B1084
$$ 160299 199080 -36531 -61534 -45379 262831 -103478 -22128 -122552 91905 149835 21084
12751h2077F7310J09729O7099r5564a01844A93416G2144P6403i214A47726a33872
$$ -82077 67310 177039 244138 148574 -101844 193416 72144 148547 -9214 147726 -133872
12739c87005P5522a30725n6651e8248B42369N8405h5868n0911j44853c0013o6277
$$ -387005 -311483 -130725 -187376 -58248 242369 300774 -85868 -136779 -281632 -30013 -96290
12728i6290A69359h7978M688j63964a16691A40118d8540C24128a44514D9758Q6845
$$ -96290 169359 -87978 -83290 -247254 -116691 140118 -48540 324128 -144514 49758 136603
12717A36603d3664C09467A03887J24335k9646b36929g0851K454A46958G3402l3610
$$ 136603 -43664 309467 103887 228222 198576 -236929 -70851 -68397 146958 73402 39792
12706C9792N25452a97832Q541a5887q6429k13469B45307f7940B57832H8079A2808
$$ 39792 565244 -197832 -189291 -15887 -102316 -315785 245307 -67940 257832 88079 12808
12694E6549J12391n8223a28421C80861J94626c35326B76097o2520o5665k8290
$$ 56549 168940 110717 -128421 380861 575487 -335326 276097 213577 147912 119622
12684A19622J6281b37281A66892E2204K14607j22322m7459o258a04111G5842L65760
$$ 119622 135903 -237281 166892 52204 266811 144489 97030 90772 -104111 75842 441602
12673D41602i5292p2027A30344a18955G9527L2008l886f1870A15877J29032H4708
$$ 441602 -95292 -167319 130344 -118955 79527 111535 107649 -61870 115877 244909 84708
12661A91139M5371b78504a31485J0861A52309o0627a35132A4669h5985I9189c42501
$$ 191139 236510 -278504 -131485 -120624 152309 91682 -135132 14669 -85985 99189 -342501
12649A4392a49725C2678c98584a46942c1505I3869K84787A33401R5095b3870a1080
$$ 14392 -149725 32678 -398584 -146942 -31505 93869 378656 133401 228496 -23870 -11080
12637a6037p607A42107J57244a2156H6361C7895M1169i1570a8689j89310P528
$$ -16037 -23644 142107 299351 -12156 86361 37895 79064 -91570 -18689 -207999 -200471
12626b00471f7075B77325B3621J51592p4232O721M5050l16a60447B70188q3449
$$ -200471 -67075 277325 23621 175213 100981 107702 152752 152436 -160447 270188 186739
12615A86739a5320A93250r4240g1327B0105a61424B8877J88495a42125E1286J09958
$$ 186739 -15320 193250 99010 -71327 20105 -161424 28877 217372 -142125 51286 161244
12604A61244d3994o7188j3480A35612P990N13k2735r797a57617I5725b84875c2112
$$ 161244 -43994 -111182 -124662 135612 143602 144115 121380 111583 -157617 95725 -284875 -32112
12591a96290A5731e2497A01652b862j71203H0803a64575F9794i1491A40591E3885
$$ -196290 15731 -52497 101652 -2862 -174065 80803 -164575 69794 -91491 140591 53885
12579A71818a2177I7804a49231C11494D9698k0171a18546C5785J34052G9201N9714
$$ 171818 -12177 97804 -149231 311494 49698 29527 -118546 35785 169837 79201 138915
12568A38915k8560b90052P2118A09453B4713L9680b27146F4520l2227H888M51762
$$ 138915 110355 -290052 -217934 109453 24713 64393 -227146 64520 32293 8888 460650
12557D60650E8562J29138g7447l1387B8577M6049J67782c0722j99687B3342K8422
$$ 460650 58562 187700 -77447 -108834 28577 74626 242408 -30722 -230409 23342 51764
12546E1764L2708g9269k41749Q7828D3058J2490b67315A94936f0400A81099E6467
$$ 51764 84472 -79269 -321018 -233190 43058 55548 -267315 194936 -60400 181099 56467
12534B99847a50968B37622r0598a19894k3153a5621q5644I1623e5766A08143b28219
$$ 299847 -150968 237622 147024 -119894 -143047 -15621 -101265 91623 -55766 108143 -228219
12522B1305J01236J448a39474A0738K56715k6073f4815k74518a08712F0995b0701
$$ 21305 122541 123989 -139474 10738 267453 241380 -64815 -339333 -108712 60995 -20701
12510I5804j4280g4083A02205B7914b50734F1464F414b5207A71981m2394i4570
$$ 95804 81524 -74083 102205 27914 -250734 61464 6414 -25207 171981 129587 -94570
12498d396E2328L6054L12a48225A57117P5974j03867c6267a6194j25269A91946
$$ -4396 52328 88382 88694 -148225 157117 233091 129224 -36267 -16194 -141463 191946
12486a13636N4221j3576l3305j75899G8797a92512H6413N310l5592e9987a3690
$$ -113636 -59415 -72991 -106296 -282195 78797 -192512 86413 91723 56131 -59987 -13690
12474b6331A07611i0046K4837m4771B03493h9208A07876K2381n7151c8794j43261
$$ -26331 107611 -90046 -65209 -109980 203493 -89208 107876 130257 73106 -38794 -182055
12463a82055i0861B45747c6825k0114A1635L0844M8773i6798n1929j05289B47425
$$ -182055 -90861 245747 -36825 -56939 11635 42479 91252 -96798 -148727 -254016 247425
12451g440A59200a8124A79235J3684h9455j72698H8341b19532j27553B16692B7036
$$ -7440 159200 -18124 179235 192919 -89455 -262153 88341 -219532 -347085 216692 27036
12439C6601b40028d2018j60431M8492K3439e8614k6676L8482H5432a19270B35635
$$ 36601 -240028 -42018 -202449 -153957 -130518 -58614 -85290 -46808 85432 -119270 235635
12427D5498a92793j45161A4581e0411j42382j334D93L21550A32117n0729c8289
$$ 45498 -192793 -337954 14581 -50411 -192793 -194127 493 322043 132117 81388 -38289
12415a78323G1267b6576D8087J87389A03873a00494c1065q0397c1031k7560l8553
$$ -178323 71267 -26576 48087 235476 103873 -100494 -31065 -111462 -31031 -58591 -97144
12404i7144r8917P1235H2609C9860a14290H7397f0428j01392E184b9387E6715
$$ -97144 -196061 -124826 82609 39860 -114290 87397 -60428 -161820 5184 -29387 56715
12392b33874A52053b69346b6502l848B21576q0760B4678P3666J24533b00995Q7322
$$ -233874 152053 -269346 -26502 -30350 221576 140816 24678 98344 222877 -200995 -113673
12381a13673j55080J20069g1564B40982a33606a7121c067B82755e20746K60043
$$ -113673 -268753 -148684 -71564 240982 -133606 -17121 -3067 282755 -520746 -260703
12371b60703B02136J4849o8497D5465A2503R25a02599A01130M760P6991c3524
$$ -260703 202136 216985 148488 45465 12503 13428 -102599 101130 105890 182881 -33524
12359A9753J50425c5178G5492k0674a01445A5004M52489A73010P9354c6194j6963
$$ 19753 170178 -35178 75492 54818 -101445 15004 467493 173010 252364 -36194 -53157
12348e3157f971F3376Q7530P1580C4553N302b49508E8640K5676d9606k7166m7140
$$ -53157 -6971 63376 150906 222486 34553 39855 -249508 58640 84316 -49606 -76772 -123912
12336a23912J3334F3320K88963a68545D7107b92932k1602E3531j4492A2186J32045
$$ -123912 -110578 63320 352283 -168545 47107 -292932 -314534 53531 39039 12186 144231
12325A44231C7004K44328g2792o8904C00440A02386P1938G9925L6091L88034a18106
$$ 144231 37004 281332 -72792 -141696 300440 102386 174324 79925 116016 504050 -118106
12313C55934A6032J53069o7000d9596A11629J19628E0490J61756m3040o0202J42116
$$ 355934 16032 169101 102101 -49596 111629 231257 50490 212246 169206 109004 251120
12302B51120L6724i5878A43011M6706J46626a8843j38881Q029A60291o247M2821
$$ 251120 287844 -95878 143011 189717 336343 -18843 -157724 -149695 160291 154044 196865
12291A96865G2842P5641c00402A50628E0965K31036j06327j9517b5597n9946r5015
$$ 196865 72842 148483 -300402 150628 50965 282001 175674 156157 -25597 -85543 -180558
12280a80558A25463P2634L9322j9447J69721a82546b9143B02712d8964E295b13285
$$ -180558 125463 198097 237419 217972 387693 -182546 -29143 202712 -48964 5295 -213285
12268E6188L77883a71712c3681G2093g5697H2202A7711a2781l597B95752n4514
$$ 56188 434071 -171712 -33681 72093 -75697 82202 17711 -12781 -16378 295752 241238
12257B41238J28427f1103A44243M9829B233a1978A78859g2509B08937N243k8595
$$ 241238 369665 -61103 144243 194072 2233 -11978 178859 -72509 208937 214180 185585
12246A85585A1071K19085b5208A63243K26048j78094J3124a86947A33706A2819
$$ 185585 11071 230156 -25208 163243 389291 211197 224321 -186947 133706 12819
12235G7984J45429b5315A58750o6387A8300J30269K62285A47262a23905B24168
$$ 77984 223413 -25315 158750 92363 18300 148569 410854 147262 -123905 224168
12224a99058B29181A14314m9527h7915A92880e8688B39078G9683h3885D87753
$$ -199058 229181 114314 64787 -87915 192880 -58688 239078 79683 -83885 487753
12213H0428a8736B36711J30528a26015B22111B3636P060J83263a92473B95895
$$ 80428 -18736 236711 367239 -126015 222111 23636 30696 213959 -192473 295895
12202e0131n856B76151a82707J7859F0969N8640M1547a59181B69003N4467j02180
$$ -50131 -55987 276151 -182707 -164848 60969 119609 161156 -159181 269003 323470 221290
12191B21290J4427j1630M7046k9233i2606B58227q0341a08480d6348A02885P8520
$$ 221290 235717 224087 271133 241900 -92606 258227 177886 -108480 -46348 102885 181405
12180A81405G7934k5223g5654a4114F2833J93039p5963O9386I6198J28601l2172
$$ 181405 77934 52711 -75654 -14114 62833 255872 179909 249295 96198 224799 192627
12169A92627A7553e26511B00021i5098b8060A61985l4662h6182B58925k0025A12562
$$ 192627 17553 -526511 200021 -95098 -28060 161985 127323 -86182 258925 238900 112562
12157A04399l5231K38209M0263l1678N3042A75950F3514K4362j0129J52210J04630
$$ 104399 69168 307377 347640 315962 369004 175950 63514 87876 77747 229957 334587
12146C34587E1576J27603d9354A86315n4741B8788R8096l2427P1842P6647o7477
$$ 334587 51576 179179 -49354 186315 131574 28788 126884 94457 166299 242946 175469
12135A75469M5400F4734L63906b24462B16678b68341B74258b73297B11280I1857
$$ 175469 220869 64734 428640 -224462 216678 -268341 274258 -273297 211280 91857
12124h2666j3948j64026A391b29205h3358A84969n9519d8735j0309A0043e8136
$$ -82666 -96614 -260640 1391 -229205 -83358 184969 125450 -48735 -59044 10043 -58136
12112b05561C36119N1182A79700k1830J52401b67G927L85679j89939B3798b975
$$ -205561 336119 387301 179700 157870 310271 -267 7927 393606 203667 23798 -2975
12100A00537L8838m9750L16391A92986b02966B57716r2038k5729a9598B87650
$$ 100537 139375 89625 406016 192986 -202966 257716 165678 139949 -19598 287650
12089a03102A4056K51840b43527E5671M9831B3729K50686j6336b265B9953e7832
$$ -103102 14056 265896 -243527 55671 105502 23729 274415 258079 -2265 29953 -57832
12077c43857A53146p4334K78681a85487B35811A17360N7655a291n3437A14638
$$ -343857 153146 78812 357493 -185487 235811 117360 175015 -1291 -54728 114638
12066a41668B11827D1276J24617e205B50558I2563A6296J09249n5128O7641J29382
$$ -141668 211827 41276 165893 -5205 250558 92563 16296 125545 70417 138058 267440
12055B67440e4194f605m2940B2132K75420H5557l5190f554A75541G1086J90799
$$ 267440 -54194 -6605 -49545 22132 297552 85557 50367 -6554 175541 71086 261885
12044B61885a22719A47338O3703A3018f4370B08443b373p2771A81012b09016Q7047
$$ 261885 -122719 147338 211041 13018 -64370 208443 -2373 -75144 181012 -209016 -121969
12033a21969r3290A90373E8863a03433A17689O4209P3262D2902a77573j91603
$$ -121969 -215259 190373 58863 -103433 117689 181898 255160 42902 -177573 -369176
12023c69176A95236m7007A7459a51740H8383K12935a69421f5361A93092g1251
$$ -369176 195236 148229 17459 -151740 88383 301318 -169421 -65361 193092 -71251
12012f1092P22g087A27338J97813d7020C16224F6613f0751p0348M4348k08701
$$ -61092 -60370 -7087 127338 325151 -47020 316224 66613 -60751 -131099 -86751 -295452
12001b95452b20A8709a04373A53630K0211a37489B46144j15005K45409A14525
$$ -295452 -220 18709 -104373 153630 173841 -137489 246144 131139 376548 114525
11990A55717J68082a07546A53757B9890J0796H338b70561M1425C55962b7608C88399
$$ 155717 323799 -107546 153757 29890 40686 8338 -270561 -229136 355962 -27608 388399
11978b61343H0494L5370J44441a21798A47407c4822A67088D7566g6147G9472a40082
$$ -261343 80494 115864 260305 -121798 147407 -34822 167088 47566 -76147 79472 -140082
11966a50180f9050K3979m7209j96095E229d9327m8074j96146B31949i4628g38
$$ -150180 -69050 -45071 -92280 -288375 5229 -49327 -97401 -293547 231949 -94628 -738
11954C40236a26431j56670B1716e0989j86450n840A52007p5223a99543j02630
$$ 340236 -126431 -283101 21716 -50989 -237439 -243279 152007 76784 -199543 -302173
11944c02173J01453q9861h7986F9181P6272a05282F8832P6853A8671O4035A0879
$$ -302173 -200720 -290581 -87986 69181 145453 -105282 68832 145685 18671 82706 10879
11932a12570K1887D5407b53545A14501a84758g0365j22750G5984b5820I7299M617
$$ -112570 -90683 45407 -253545 114501 -184758 -70365 -193115 75984 -25820 97299 101916
11921A01916L46946b31305R1939O6156k44323a17453b6082B52946F4895c7683
$$ 101916 448862 -231305 -139366 -73210 -317533 -117453 -26082 252946 64895 -37683
11910i2151A64098a7407B06641M8590O6722a2136j70256f5755l3159K6998D0157
$$ -92151 164098 -17407 206641 255231 321953 -12136 -182392 -65755 -98914 -71916 40157
11898d4794A0846e1967B62812A4721J23624J40429d42804b00581I1378O9769B9477
$$ -44794 10846 -51967 262812 14721 138345 278774 -442804 -200581 91378 161147 29477
11886c7700G4086a62142m6918A60732c829D7084k0529O7442J9774a08696A91649
$$ -37700 74086 -162142 -209060 160732 -3829 47084 26555 93997 113771 -108696 191649
11874c27046a6840B23166a45362L092c1008p6133M8961b5320n1610G9507C4146
$$ -327046 -16840 223166 -145362 -142270 -31008 -107141 -58180 -25320 -76930 79507 34146
11862g2290A39327K3912n4549P2908a42457G4274a3171A25925M9704c90804f9756
$$ -72290 139327 163239 108690 181598 -142457 74274 -13171 125925 175629 -390804 -69756
11850d1511C45683a54359c6134i832k46198a26419q9438i6652J6291r1439A24057
$$ -41511 345683 -154359 -36134 -9832 -256030 -126419 -215857 -96652 -80361 -171800 124057
11838C6928a14544D1846Q3639E2670b49207B55591C5800r703J0954a33346j30108
$$ 36928 -114544 41846 125485 52670 -249207 255591 35800 26097 37051 -133346 -263454
11827b63454D633a95378D8252b84592j7401J06783G6378R5752a65109a7122j54265
$$ -263454 4633 -195378 48252 -284592 -301993 -195210 76378 172130 -165109 -17122 -171387
11816a71387E4634a09821b0085C93097c41235h3009I0242Q7820p3701J39428j10001
$$ -171387 54634 -109821 -20085 393097 -341235 -83009 90242 178062 104361 243789 133788
11805A33788a44920d8010D8310a73902A36999e2265A14711a64895M5478j75783
$$ 133788 -144920 -48010 48310 -173902 136999 -52265 114711 -164895 -119417 -295200
11795b95200A11678b71637G7325i2560r7878C12140d5279G4064N0951k3123B885
$$ -295200 111678 -271637 77325 -92560 -190438 312140 -45279 74064 125015 101892 2885
11783b7720k61019b9429q000k6335K5521r1572j87632P1895e5155D3600h9823
$$ -27720 -288739 -29429 -37429 -63764 -38243 -129815 -317447 -245552 -55155 43600 -89823
11771a06946j23785i528I5256a46362C8197J28815L22260A99584a16778h169j57693
$$ -106946 -230731 -9528 95256 -146362 38197 167012 489272 199584 -116778 -8169 -165862
11760a65862k87840C0573J16457e1833j33691A49203a18430I942e4691o946b6325
$$ -165862 -453702 30573 147030 -51833 -185524 149203 -118430 9942 -54691 -61637 -26325
11748a36371k65218e3170j27942m0656f4963j36065r4516C08836j27099a92424
$$ -136371 -401589 -53170 -181112 -221768 -64963 -201028 -295544 308836 181737 -192424
11737H6646b8853k92312c0140n1537D11208B7678j2486c11338A01783a15110q1388
$$ 86646 -28853 -321165 -30140 -81677 411208 27678 15192 -311338 101783 -115110 -196498
11726a96498B82940a26573A67051n0826e6536C7105a36323j0560C31311A1649
$$ -196498 282940 -126573 167051 116225 -56536 37105 -136323 -146883 331311 11649
11715I4491J23438f6950H6190c0316j97587J06836l28754b06435C2642a60083
$$ 94491 217929 -66950 86190 -30316 -227903 -121067 -449821 -206435 32642 -160083
11704c18984A11059N7532a31967k37024a55603A88394B0571a16375j69900H8891
$$ -318984 111059 168591 -131967 -368991 -155603 188394 20571 -116375 -286275 88891
11693B50068A2932a12252A99293h4022c0566k77633F5756J13116e2977B32445
$$ 250068 12932 -112252 199293 -84022 -30566 -308199 65756 178872 -52977 232445
11682B4325J45984J1691J75844a3536c788j59078n9423a048p7301b3937G8226
$$ 24325 170309 182000 357844 -13536 -3788 -162866 -222289 -1048 -78349 -23937 78226
11670b31234h4919j63506H9415J26539a44130A37448J26548N8292g8251J3450
$$ -231234 -84919 -248425 89415 215954 -144130 137448 263996 322288 -78251 -64801
11660f4801B15639q5839e9460A84923a61266E1385a0450l40153B1188O192d9719
$$ -64801 215639 129800 -59460 184923 -161266 51385 -10450 -350603 21188 27380 -49719
11648C2356L08588A0535a82278A32600l656a71245f2153A23427c2774A17065n1258
$$ 32356 340944 10535 -182278 132600 128944 -171245 -62153 123427 -32774 117065 65807
11637F5807N4845a77635A12352J2726l1005i3599B22950F4223J45849C7242g3600
$$ 65807 120652 -177635 112352 125078 94073 -93599 222950 64223 210072 37242 -73600
11625a51939d7824A31258m9133a17718e2130l5630p4878r8956A54206F2689A1889
$$ -151939 -47824 131258 82125 -117718 -52130 -87760 -162638 -261594 154206 62689 11889
11613H6681d4032j4918A06909b82032a19316G3848i4463l652d0756A02696K20882
$$ 86681 -44032 -58950 106909 -282032 -119316 73848 -94463 -98115 -40756 102696 323578
11602C23578j1648A54042K00535a47280G1682g2531B1297b45313f1408I3490e5257
$$ 323578 311930 154042 354577 -147280 71682 -72531 21297 -245313 -61408 93490 -55257
11590A80322F9877J7828i1556G2913J31089h8030A9861i1947K3835F8089R4413
$$ 180322 69877 87705 -91556 72913 204002 -88030 19861 -91947 -68112 68089 162502
11579A62502h1721B65448C6111e2253o5612d6206B46689f9303G2592b0360B09767
$$ 162502 -81721 265448 36111 -52253 -117865 -46206 246689 -69303 72592 -20360 209767
11567A33652g089j1919A81250g0687k6378j46810p5512a07359l19966B7568K51778
$$ 133652 -7089 -19008 181250 -70687 -97065 -243875 -319387 -107359 -427325 27568 279346
11556B79346H7277J50222E8295L5566g2021B12863B1479F471J21172L9382k3111
$$ 279346 87277 237499 58295 93861 -72021 212863 21479 6471 127643 167025 143914
11545A43914J00019B3314L7838g4656C2900f4119b3961D62285A00672a9242D66929
$$ 143914 243933 23314 61152 -74656 32900 -64119 -23961 462285 100672 -19242 466929
11533A10960R2896E2643K22675j4196A4184R5046K31023B5955K20941N0795a86750
$$ 110960 203856 52643 275318 261122 14184 109230 340253 25955 246896 297691 -186750
11521A30474a7590B33840L0965H3808K04558e7230l15452a84001A4844b6679B94548
$$ 130474 -17590 233840 264805 83808 288366 -57230 -372682 -184001 14844 -26679 294548
11509C28239a75133D1487f0490F2955b57307A99443p1309Q315J77637J219q8559
$$ 328239 -175133 41487 -60490 62955 -257307 199443 128134 136449 314086 315305 226746
11498B26746l6580L7260k2105H2278K03134P372f0214R008k98192A10501a3880
$$ 226746 190166 227426 205321 82278 285412 292784 -60214 -51206 -349398 110501 -13880
11486B37517a16406A58913k2098I352J50185a09084E4433L7262D5466a19237A82340
$$ 237517 -116406 158913 136815 9352 159537 -109084 54433 91695 45466 -119237 182340
11474b08758B14830R9519o3172A22397J99391h2365D6224a71239P3528B21790
$$ -208758 214830 314349 251177 122397 321788 -82365 46224 -171239 -97711 221790
11463g0623B34437a59971f1640n8725B38565b7631p3793b5394j56002A03958D0051
$$ -70623 234437 -159971 -61640 -120365 238565 -27631 -101424 -25394 -181396 103958 40051
11451C3654K52769n839F4672B2165K54918c17706i7218e630A80675A2049b2845
$$ 33654 286423 280584 64672 22165 277083 -317706 -97218 -5630 180675 12049 -22845
11439F4095L38855C9595a30824o5153D962K24814a22794A04271a41679f4585B58245
$$ 64095 402950 39595 -130824 -195977 4962 229776 -122794 104271 -141679 -64585 258245
11427h1816B91000R20a4319I9544e4009F9255h7098H4543J49382J01824b67198
$$ -81816 291000 291920 -14319 99544 -54009 69255 -87098 84543 233925 335749 -267198
11415a01568K0663C2292a04900l70781c4847H2103b0741j0853n7010E6335g4378
$$ -101568 -80905 32292 -104900 -475681 -34847 82103 -20741 -31594 -88604 56335 -74378
11403A77239Q2541c9232B52464O0165k4704j20440a12165l9384A20762J15648
$$ 177239 259780 -39232 252464 312629 287925 167485 -112165 -151549 120762 236410
11393B36410K60359B8867R5381B1926N8971J41845o0020a06361p8698A30057a48360
$$ 236410 496769 28867 124248 21926 80897 222742 162722 -106361 -185059 130057 -148360
11381I862O1702a13052A26597b99450H9569c16408C5343P6414a32696j33272J03873
$$ 9862 71564 -113052 126597 -299450 89569 -316408 35343 111757 -132696 -265968 -162095
11370a62095a0156E9058a57452O9199G4269J05098c2212j02322F2987J05466J00432
$$ -162095 -10156 59058 -157452 -88253 74269 179367 -32212 -134534 62987 168453 268885
11359B68885a38760c9746B80798a91051e664k23469F464L25295a75690K4133J2357
$$ 268885 -138760 -39746 280798 -191051 -5664 -229133 6464 331759 -175690 -151557 -139200
11348a39200e301k78641J12516j416n753I5149a74033A36560g3490D94L13051
$$ -139200 -5301 -283942 -171426 -172842 -178595 95149 -174033 136560 -73490 494 313545
11337C13545a07951A77533a1849d972p7324l8712I7331J90238j36734C8349b12829
$$ 313545 -107951 177533 -11849 -4972 -82296 -121008 97331 287569 150835 38349 -212829
11325A49865a39170i195q7691r161j4409A2a53836A76081c76679I8467j9976g6485
$$ 149865 -139170 -9195 -96886 -106047 -120456 12 -153836 176081 -376679 98467 78491 -76485
11312b6433A01921D4025a32494F7612J25623i1118A47885a99745H0904C2116g9624
$$ -26433 101921 44025 -132494 67612 193235 -91118 147885 -199745 80904 32116 -79624
11300A3900J38309n0610e4914b3890I7428c90724a85377I8212a67010L1575A55411
$$ 13900 152209 101599 -54914 -23890 97428 -390724 -185377 98212 -167010 -135435 155411
11288b12417a2304d115k53754C7729h0270I9702h4524I5765A7649a36296L7524
$$ -212417 -12304 -4115 -257869 37729 -80270 99702 -84524 95765 17649 -136296 -98772
11277i8772D3684j8804g8708C2310a62019A1419b68211K8130H0237K0103k8648
$$ -98772 43684 24880 -78708 32310 -162019 11419 -268211 -240081 80237 100340 71692
11266G1692J7356b03507e0227n589o3640J7010l05745H6395j891C6803L7405l4497
$$ 71692 89048 -203507 -50227 -55816 -119456 -102446 -408191 86395 84504 36803 74208 39711
11254C9711g0329j36220m0100E0207L5279P0945e2037j22206C5496J71727d6018
$$ 39711 -70329 -206549 -246649 50207 85486 156431 -52037 -174243 35496 207223 -46018
11242a29237c2819n4938C6105a0939B15138h8430G100J74032d78964K15954i3700
$$ -129237 -32819 -87757 36105 -10939 215138 -88430 7100 181132 -478964 -263010 -93700
11230A24207K525J19655f8870j1493A16127c12531a28168n3630A09693J4639M331
$$ 124207 126732 246387 -68870 -80363 116127 -312531 -128168 -181798 109693 124332 128663
11219A28663a09697d9615j01981p4114J05038I3921c413E1849J65825g8565j69642
$$ 128663 -109697 -49615 -151596 -225710 -120672 93921 -3413 51849 217674 -78565 -248207
11208b48207E0759K54350e9331j24110f2635k7259E4749f2351B262b48741a7985
$$ -248207 50759 305109 -59331 -183441 -62635 -89894 54749 -62351 2262 -248741 -17985
11196A33714b86477a9656j41128j8009p6230d9541r2153A90096E2570h6331j13877
$$ 133714 -286477 -19656 -160784 -178793 -255023 -49541 -141694 190096 52570 -86331 -200208
11185b00208h5072o9217a4920C6915K86316a51667E7761a33710A32390b7549B0980
$$ -200208 -85072 -154289 -14920 36915 323231 -151667 57761 -133710 132390 -27549 20980
11173h561H5957a01334p022f822k25407L9273D2072J82154c1328j13077r3658
$$ -8561 85957 -101334 -108356 -6822 -232229 -192956 42072 224226 -31328 -144405 -238063
11162b38063E3831c0120o787B36090b18074C59657c10705A78710a05117B40369
$$ -238063 53831 -30120 -36907 236090 -218074 359657 -310705 178710 -105117 240369
11151G1154b53072j1329A61000a98564l6487E9199d09685i4977C373J82275g6099
$$ 71154 -253072 -264401 161000 -198564 -235051 59199 -409685 -94977 3373 185648 -76099
11139a96087f3554l39394A48393b30814O5135H1983a11294L3891B13810b20045
$$ -196087 -63554 -402948 148393 -230814 -165679 81983 -111294 -77403 213810 -220045
11128a17767P727k66666a82780A41506l2257J65571C6272P9477A4054c1503C6595
$$ -117767 -110040 -376706 -182780 141506 109249 274820 36272 115749 14054 -31503 36595
11116b32916k6017A1253K74728C9530K14590A4548J80888c04116H6066J68421
$$ -232916 -258933 11253 285981 39530 254120 14548 195436 -304116 86066 254487
11106B54487g904B57265E8586c5941C81275A45221b7270l42778C607f9428j377
$$ 254487 -7904 257265 58586 -35941 381275 145221 -27270 -370048 3607 -69428 -70805
11095g0805D3659b13188g8966C5314J76528d4981A6229d4478B13992j0544a13572
$$ -70805 43659 -213188 -78966 35314 211842 -44981 16229 -44478 213992 203448 -113572
11083D28244k3247A37943m0974c9718A01715l5105J2743M7042A3471K6609J95488
$$ 428244 404997 137943 96969 -39718 101715 66610 79353 126395 13471 40080 235568
11072B35568N4564J50367h1944a1222B07497R3107F9538b8650B63815j12823N3044
$$ 235568 290132 440499 -81944 -11222 207497 300604 69538 -28650 263815 150992 204036
11061B04036E3694L28327A61322b25823B61470k7247J09313M1791M0843A28576
$$ 204036 53694 382021 161322 -225823 261470 234223 343536 385327 426170 128576
11050i2173C96K91476l0799L910H4272O9216l6767K34393N8326j7931l3194K05034
$$ -92173 396 291872 261073 264983 84272 153488 116721 351114 409440 391509 358315 563349
11038E63349k21675K18532J81039k95600j61033L19021J2534k41635J99358Q4114
$$ 563349 341674 560206 741245 445645 284612 603633 616167 374532 573890 658004
11028F58004j22307J1198n0262L60814k11477k9956K5421K11037k19989n9146
$$ 658004 535697 546895 496633 857447 645970 616014 641435 852472 632483 573337
11018E73337K36056p4620C14697L52089K49245l81006j4839J13858A30718O01118
$$ 573337 809393 734773 314697 666786 916031 535025 520186 634044 130718 731836
11008G31836k27793L23248j09382B86643K69738k0376N7737k51859L01756n1553
$$ 731836 504043 827291 717909 286643 556381 536005 593742 341883 643639 592086
10998E92086j48505k07435Q2247L67562k73269J55407j37010j06887j14249O98230
$$ 592086 443581 236146 318393 685955 412686 568093 431083 324196 209947 908177
10988I08177k86102A42986L38964j23712q6852K84142L5686j54681J36608A70306
$$ 908177 622075 142986 481950 358238 271386 555528 591214 436533 573141 170306
10977G25027k50991j1811J00742R8029j15276L02014l58004j21088M40829k46661
$$ 725027 474036 462225 562967 660996 545720 847734 489730 368642 809471 562810
10967E62810N6466n8100J09579o1998J47610O1853R1131L38877k95115K93685
$$ 562810 619276 561176 670755 608757 756367 818220 909351 1248228 953113 1246798
10957A246798L42556k56231j86267O94473k30326L99124j00136k30954o0309K6618
$$ 1246798 1589354 1333123 1146856 1841329 1611003 2010127 1909991 1679037 1618728 1645346
10947A645346j38409q1952R362l50793N1815P8870N67430n87050K78949M5442
$$ 1645346 1506937 1424985 1434347 1083554 1135369 1214239 1781669 1194619 1473568 1519010
10937A519010K97656m72386L2722J44236l66737R4662l47867k02280j02588K11667
$$ 1519010 1816666 1344280 1377002 1521238 1154501 1249163 901296 699016 596428 808095
10927H08095l36913J64796F3346J55010o5783J71591j3358L1594d22255e9941
$$ 808095 471182 635978 63346 218356 152573 324164 310806 342400 -422255 -59941
10916f4374C03720a0528B82050j22552G5762J14847f454A55466k8359a38755C19042
$$ -64374 303720 -10528 282050 159498 75762 190609 -6454 155466 127107 -138755 319042
10904h7476G8750J92084f4871k24815h6324C28416j24779B8831c0231j90364h7834
$$ -87476 78750 270834 -64871 -289686 -86324 328416 203637 28831 -30231 -220595 -87834
10892c38802O3645D1989J8447D222e6507K0258n2498K3542I2162a90862P3853
$$ -338802 -275157 41989 60436 4222 -56507 -36249 -88747 -65205 92162 -190862 -117009
10881a17009j08076C3393a3659d561l72925d6858a1362l453q9001k28988B78160
$$ -117009 -225085 33393 -13659 -4561 -377486 -46858 -11362 -14815 -103816 -332804 278160
10869b900j39424C967c8328A58149g0948q9279B6528J46077a24628A85491c5566
$$ -2900 -142324 3967 -38328 158149 -70948 -160227 26528 172605 -124628 185491 -35566
10857i0544d0714H1376b01327k5367j5805B68230I8391D2535a53630B38760a78072
$$ -90544 -40714 81376 -201327 -226694 -242499 268230 98391 42535 -153630 238760 -178072
10845C7283a52957g5445b157A37268B7589a85679A08703a19183d3671A67129a61547
$$ 37283 -152957 -75445 -2157 137268 27589 -185679 108703 -119183 -43671 167129 -161547
10833A7775b474j10936l3254e3830k53377C10173d8791D6682k3192J49703C899
$$ 17775 -2474 -113410 -146664 -53830 -307207 310173 -48791 46682 23490 173193 3899
10821G0993O501h0306j35377K6213l3528j70982C9467K06573a31382A6292K91923
$$ 70993 77494 -80306 -215683 -189470 -222998 -393980 39467 246040 -131382 16292 308215
10810C08215c2826A82893b23642H0642i7696l4119j58568B69907b92581a27503
$$ 308215 -32826 182893 -223642 80642 -97696 -131815 -290383 269907 -292581 -127503
10799c04082a16446j07023l1052L995A00436L19816D0031J01807d32526c8987
$$ -304082 -116446 -223469 -254521 -250526 100436 420252 40031 141838 -432526 -38987
10788F4362M4004b59189C21213b375l33244a05111P927B18426C8971b83122B05522
$$ 64362 108366 -259189 321213 -2375 -335619 -105111 -97184 218426 38971 -283122 205522
10776B0871g6523a0276I8413M6920A8908K49801A29807F1073a63178I5581b03074
$$ 20871 -76523 -10276 98413 145333 18908 268709 129807 61073 -163178 95581 -203074
10764b83769j5861A10068m9219b52245L2238E7429a67018m1656O3092B4084a03627
$$ -283769 -299630 110068 60849 -252245 -220007 57429 -167018 -208674 -145582 24084 -103627
10752a5538D4812J82707A0237a64309l86647K14005d9791B07882M880d628m01532
$$ -15538 44812 227519 10237 -164309 -550956 -336951 -49791 207882 212762 -4628 -406160
10741d06160a44804M4495F2751a58303N4025B3745K48606A7582f6203A89298g9488
$$ -406160 -144804 -100309 62751 -158303 -104278 23745 272351 17582 -66203 189298 -79488
10729b50074M5637c1820j9549B70174g9515B4295c6997d88j65734A26855a30623
$$ -250074 -204437 -31820 -51369 270174 -79515 24295 -36997 -488 -166222 126855 -130623
10717a45206j0555d2708k00239E4980J37317b76214j78103c9667j9858g551F2407
$$ -145206 -155761 -42708 -242947 54980 192297 -276214 -454317 -39667 -59525 -7551 62407
10705a69589b3446n8869j25223k55j41835H1694a7716F1662b71252I5613L6596
$$ -169589 -23446 -82315 -207538 -207793 -349628 81694 -17716 61662 -271252 95613 132209
10694A32209d0330A64365a2225o3285l41534B6882O6246j8728k445K00733A0803
$$ 132209 -40330 164365 -12225 -75510 -417044 26882 93128 74400 71955 272688 10803
10682a70402a7270q2840F432N8499J59042c11977A56538a04031m3231M9309r9549
$$ -170402 -17270 -100110 6432 64931 223973 -311977 156538 -104031 -147262 -97953 -197502
10671a97502A21305c2125l81700c5002B45333a21694k49912C6321Q3066A1799
$$ -197502 121305 -32125 -413825 -35002 245333 -121694 -371606 36321 119387 11799
10660H2792K6584b5633j4755q0505G7254K50322h5489o0284d1052j78525B73475
$$ 82792 109376 -25633 -40388 -120893 77254 327576 -85489 -145773 -41052 -219577 273475
10648a60914d3597l0835I3736b16161c6726o9750r0210G1c19885J43488j8674
$$ -160914 -43597 -74432 93736 -216161 -36726 -106476 -196686 71 -319885 -176397 -195071
10637a95071R5840r4441F1002a34570j03523d7796D5936b50900F7508i7678A93690
$$ -195071 -99231 -193672 61002 -134570 -238093 -47796 45936 -250900 67508 -97678 193690
10625b9514o0461j72092J11934n3997j4319A99778D459K4615d38459b00102j13616
$$ -29514 -89975 -262067 -150133 -204130 -218449 199778 4459 29074 -438459 -200102 -313718
10614c13718A09948d46678B9252b86556R6685O395j03711A80208a71222E7986
$$ -313718 109948 -446678 29252 -286556 -189871 -183476 -287187 180208 -171222 57986
10603a66229B1342a33171p3803j0672d5594A52229a88158O3412A26142a17507
$$ -166229 21342 -133171 -206974 -217646 -45594 152229 -188158 -124746 126142 -117507
10592G8897j167b07796j1238h8720A20672J19864b59920K7507C72180A76998n7058
$$ 78897 77730 -207796 -219034 -88720 120672 240536 -259920 -232413 372180 176998 119940
10581A19940k0554K10958c02966O8534b6973k8442k45655C2529a80603F5290a76675
$$ 119940 99386 310344 -302966 -234432 -26973 -55415 -301070 32529 -180603 65290 -176675
10569c08965A46024e2671o6325M4469B47856F8100a24906j01748K4821i9214A18537
$$ -308965 146024 -52671 -118996 -74527 247856 68100 -124906 -226654 -201833 -99214 118537
10557b35915c5893A73678G1433a04305I4324c2294A44817D5571Q3976J92637F021
$$ -235915 -35893 173678 71433 -104305 94324 -32294 144817 45571 129547 322184 6021
10545c7757B75663d3663A90143c61748B61341a97520f6854j67113e2225M979E2423
$$ -37757 275663 -43663 190143 -361748 261341 -197520 -66854 -233967 -52225 -47246 52423
10533c19729B54659m3495a91122A50705a80622j4429j03675f8676G1745e7832
$$ -319729 254659 211164 -191122 150705 -180622 -195051 -298726 -68676 71745 -57832
10522B44194f8860n661K4870B59902b27441j24618c7347D5808g5349j06365B00030
$$ 244194 -68860 -74521 -49651 259902 -227441 -352059 -37347 45808 -75349 -181714 200030
10510b9523r080j05042c9188E7734c68877L3943E5482g3428G9231j3624B3003
$$ -29523 -38603 -143645 -39188 57734 -368877 -334934 55482 -73428 79231 65607 23003
10498c00354f4220l2095j17595n4349a02824j63234E1423a04898k65010f831m6676
$$ -300354 -64220 -96315 -213910 -268259 -102824 -266058 51423 -104898 -369908 -6831 -53507
10487e3507F1579f1267C70002e9193k42241O9921J1733A4958f0452r6667A56803
$$ -53507 61579 -61267 370002 -59193 -301434 -231513 -219780 14958 -60452 -157119 156803
10475C1758a9717p7419m1731c7930n7166j04753A38013O1007c05761c8173A33668
$$ 31758 -19717 -97136 -138867 -37930 -95096 -199849 138013 199020 -305761 -38173 133668
10463a323A97131r1293J37663N638K92318j66555k0796j37320P7579H9556i4734
$$ -1323 197131 105838 243501 249139 541457 374902 354106 216786 294365 89556 -94734
10451A24008J42327a00618A95140a03911B05948k6233c9824p7123k8379A9208
$$ 124008 266335 -100618 195140 -103911 205948 179715 -39824 -116947 -145326 19208
10440i2921j45331f072l97426J27337A30757O8973e799B21829I2370b45020C7113
$$ -92921 -238252 -6072 -403498 -276161 130757 199730 -5799 221829 92370 -245020 37113
10428D0502b15085d2923l6422r5930m1454A48001a83547c7582D8854h6391j80757
$$ 40502 -215085 -42923 -79345 -175275 -216729 148001 -183547 -37582 48854 -86391 -267148
10417b67148a05685j2280o6530f0661j59208c1323k6592r1099H4214K7873f392
$$ -267148 -105685 -117965 -184495 -60661 -219869 -31323 -57915 -149014 84214 112087 -6392
10405a89244h1826C10938a94569o4368p5928E5296J39700l3853b64995R6320A1479
$$ -189244 -81826 310938 -194569 -258937 -334865 55296 194996 161143 -264995 -168675 11479
10393D3053a16340j18591b7439A23695a22506k92638g1113o7504j92618f6376
$$ 43053 -116340 -234931 -27439 123695 -122506 -415144 -71113 -138617 -331235 -66376
10382A6472c08416I5362J2325m5258a4931B97291c55668J21248B425J69583B5277
$$ 16472 -308416 95362 107687 62429 -14931 297291 -355668 -234420 2425 172008 25277
10370A72397O205a19223B3711b39473f8467A14728a31654H1305l81B8749M9726
$$ 172397 178602 -119223 23711 -239473 -68467 114728 -131654 81305 80924 28749 78475
10359G8475R5994H5172P9183b1808D7472j3568K4357O2009b2730B7361K51436
$$ 78475 174469 85172 164355 -21808 47472 33904 58261 120270 -22730 27361 278797
10348B78797J68955O3469j86630B9415K10873j08389L8566f9609A21885K41136
$$ 278797 447752 511221 324591 29415 240288 131899 170465 -69609 121885 363021
10338C63021q5568A07210J50512q7732L07836k3171j83839r2299B3569R0969K71993
$$ 363021 277453 107210 257722 169990 477826 454655 270816 178517 23569 114538 386531
10327C86531J9270j00256A42666J02791L33201A08219k4236J26211R6724N6849
$$ 386531 405801 305545 142666 245457 578658 108219 83983 210194 306918 363767
10317C63767I1493e0775k9045j3574C18720j00717B198b95072A62449B2293J40998
$$ 363767 91493 -50775 -79820 -93394 318720 218003 2198 -295072 162449 22293 163291
10306A63291h8048o2944B03508I7618l3568M9592K69891b52866D9434N0447J30907
$$ 163291 -88048 -150992 203508 97618 64050 113642 383533 -252866 49434 99881 230788
10295B30788M8933b20909J5971D0979i0A16710h1352C18350I6937C6023d05532
$$ 230788 279721 -220909 -204938 40979 -90 116710 -81352 318350 96937 36023 -405532
10283G6422K53409c39591A18971b58497A43393b9410k18496q6436O5033H6327
$$ 76422 329831 -339591 118971 -258497 143393 -29410 -247906 -334342 -269309 86327
10272i1379j987A60236b34845A45445C258a40444a339k55941P7086K405P4988
$$ -91379 -93366 160236 -234845 145445 3258 -140444 -1339 -257280 -180194 -177789 -102801
10261a02801m9549P177O9985D3513K23520a4772k2009A15267a17994B8850R3959
$$ -102801 -152350 -145173 -75188 43513 267033 -14772 -36781 115267 -117994 28850 122809
10250A22809j3122d3773A47466m715o1031b263B01622O7834A15661L43495A46391
$$ 122809 109687 -43773 147466 142751 81720 -2263 201622 269456 115661 459156 146391
10238A60480J65450F3695K77417j26967K20757A61278j9763b13155I8707O322
$$ 160480 325930 63695 341112 214145 434902 161278 141515 -213155 98707 105029
10228A05029b33417N245N5759P2381a4036B4032K0891b47486A43278a35483p2423
$$ 105029 -233417 -228172 -172413 -100032 -14036 24032 44923 -247486 143278 -135483 -207906
10217b07906k01455c3545k03720J05301l9358I1445C7785d49222B16724a34193
$$ -207906 -409361 -33545 -237265 -131964 -171322 91445 37785 -449222 216724 -134193
10206c87763A15383a36779M1216j52913d2528A9376a07010L9558G2744Q090E326
$$ -387763 115383 -136779 -95563 -248476 -42528 19376 -107010 -67452 72744 80834 5326
10194c1781k96093a18190j4310q2785g9965G9276k5633a63071J384N1083L1835
$$ -31781 -327874 -118190 -132500 -215285 -79965 79276 53643 -163071 -161687 -110604 -78769
10183g8769A07343c25898A11919R072c46941a24434N5592J7107n1146b9011l0908
$$ -78769 107343 -325898 111919 120991 -346941 -124434 -68842 -51735 -102881 -29011 -59919
10172e9919J6266G4434a46367j82415J21394G2712j2728c1168G2951a57316j1368
$$ -59919 -43653 74434 -146367 -328782 -207388 72712 59984 -31168 72951 -157316 -168684
10161a68684m042E2910b9506R731F5038b11505O9026B47179a11665K7384j95181
$$ -168684 -172726 52910 -29506 -19775 65038 -211505 -142479 247179 -111665 -84281 -279462
10150b79462g0156o0383C10449c10572a51156O0944D0040e853k7968A70353d9761
$$ -279462 -70156 -130539 310449 -310572 -151156 -90212 40040 -5853 -33821 170353 -49761
10138h1295q2740J7381p8951C970a35167m3197h0521A42140b65281A57442b1266
$$ -81295 -164035 -146654 -225605 3970 -135167 -178364 -80521 142140 -265281 157442 -21266
10126A68527J54938I874M5819h7467j62974a10933j66205C98489r6435a36263
$$ 168527 323465 9874 55693 -87467 -250441 -110933 -277138 398489 302054 -136263
10115B04814a7159j05330k44144J76158E0665d25436a18810A20984a93636B35040
$$ 204814 -17159 -122489 -366633 -190475 50665 -425436 -118810 120984 -193636 235040
10104A36603c29933c3178B07794d8028F6932l1423a23434d2579n6516H4838a3984
$$ 136603 -329933 -33178 207794 -48028 66932 35509 -123434 -42579 -99095 84838 -13984
10092B1034a98455j07447I159a35166N6656J9357C9023a00637j18511k8967A16178
$$ 21034 -198455 -305902 9159 -135166 -78510 -59153 39023 -100637 -219148 -248115 116178
10080F0940h2516j41754K2056f8072l66066G4202b93823j2714A89766d8044A49949
$$ 60940 -82516 -224270 -202214 -68072 -434138 74202 -293823 -306537 189766 -48044 149949
10068B24445b0450l64254a87910d080j12372A90718c63140F9080a30814j30684
$$ 224445 -20450 -384704 -187910 -4080 -116452 190718 -363140 69080 -130814 -261498
10058b61498e0309b2963k74161B0716O297c79630a53450C09782e63067D7634c78127
$$ -261498 -50309 -22963 -297124 20716 27013 -379630 -153450 309782 -563067 47634 -378127
10046c26316B06910G8320a87814D0859J55566b30034I6242b29075f6507k0590
$$ -326316 206910 78320 -187814 40859 196425 -230034 96242 -229075 -66507 -87097
10036h7097k54529B04002g2808C3596b34845B98627a08524C0354B355b79061H650
$$ -87097 -341626 204002 -72808 33596 -234845 298627 -108524 30354 2355 -279061 8650
10024C78362B9320c7319R990l8134n3990d9621j36306A04516a24400K2481D7535
$$ 378362 29320 -37319 -27329 -65463 -119453 -49621 -185927 104516 -124400 -101919 47535
10012a06883K8579G6983a94911N845C8539c26420H0104a19903l8590j7644M0692
$$ -106883 -78304 76983 -194911 -189066 38539 -326420 80104 -119903 -158493 -176137 -135445
10001a35445l954k17065b3260j93057n431k3529H2438b99104A51495a55204L3384
$$ -135445 -139399 -356464 -23260 -216317 -221748 -245277 82438 -299104 151495 -155204 -121820
9990a21820M6020g365j3838E4199A4406b20081C6313J04540d2425r7530F8753
$$ -121820 -75800 -7365 -21203 54199 14406 -220081 36313 140853 -42425 -139955 68753
9978A6810c37656A74588J0178b47374K7696R9266p5873L3391r1008J08360c8577
$$ 16810 -337656 174588 184766 -247374 -219678 -120412 -196285 -162894 -253902 -145542 -38577
9966E2080b44355C51814a15474k0557n5596P8088m1569A90817a66364A30503O591
$$ 52080 -244355 351814 -115474 -136031 -191627 -113539 -155108 190817 -166364 130503 137094
9955A37094b27133A1433J73790a07849k16883J14718l7238Q379C9195j9309a587
$$ 137094 -227133 11433 185223 -107849 -324732 -210014 -247252 -238873 39195 19886 -1587
9943c42865b0226l16916A9949L43672a53257J4578H872K80764m7310J8161c13191
$$ -342865 -20226 -337142 19949 363621 -153257 -138679 8872 289636 242326 260487 -313191
9931H5620B377c2126j49944r8466m746A51856a68452G3690J13093b08642B9401
$$ 85620 2377 -32126 -182070 -280536 -285282 151856 -168452 73690 186783 -208642 29401
9919a47714L8120F2876b53069d3266j16932q1659g7561n8229r3477A56721a29804
$$ -147714 -109594 62876 -253069 -43266 -160198 -241857 -77561 -135790 -229267 156721 -129804
9907B8762M3690c39967I6659a83010a2233j57479g0604C3280a71184g1647A19694
$$ 28762 72452 -339967 96659 -183010 -12233 -169712 -70604 33280 -171184 -71647 119694
9895e12974F9942b3566A0478i8052G7285e7162m5847q254A9729a18508B90106
$$ -512974 69942 -23566 10478 -98052 77285 -57162 -103009 -111263 19729 -118508 290106
9883a44253p405R692A33020n0358a59575b7024E30O3675f1077b908o4668m4181
$$ -144253 -151658 -141966 133020 82662 -159575 -27024 530 64205 -61077 -2908 -67576 -111757
9871a11757o9958C5841D285J40226E5649L41349A28429a76730g7520j57119B90279
$$ -111757 -181715 35841 4285 144511 55649 396998 128429 -176730 -77520 -234639 290279
9859A19138a42169A58306h6892L5910o9535m4088m6437r1306D67275h0724C17985
$$ 119138 -142169 158306 -86892 -50982 -120517 -164605 -211042 -302348 467275 -80724 317985
9847a73869O5831L5228C958g7929j00622Q1987p9975b0869l12307a40387n1719
$$ -173869 -108038 -72810 3958 -77929 -178551 -96564 -176539 -20869 -333176 -140387 -192106
9836a92106a7704A51820b32447e3847j47999R1876B7598h6507h273m8472k07491
$$ -192106 -17704 151820 -232447 -53847 -201846 -109970 27598 -86507 -8273 -56745 -264236
9825b64236F0366a57592A88845a48779j32303M0348I073a36479B6055J31202a01420
$$ -264236 60366 -157592 188845 -148779 -281082 -240734 9073 -136479 26055 157257 -101420
9813H8239J55431b21368j9941E8158h0385j04745A04839c58705f5520H0678a49611
$$ 88239 243670 -221368 -241309 58158 -80385 -185130 104839 -358705 -65520 80678 -149611
9801a68018I8607d190j72733h1145j47038a12317K5480F615d5298D12178a21127
$$ -168018 98607 -4190 -176923 -81145 -228183 -112317 -86837 6615 -45298 412178 -121127
9789a72859n4634a10769A30738c24101C25581p3515c26224p6995a18394f100j54858
$$ -172859 -227493 -110769 130738 -324101 325581 252066 -326224 -403219 -118394 -6100 -160958
9778a60958k06100J35330G2454a1631I9750h5666j18303m625A1045d581A60509
$$ -160958 -367058 -231728 72454 -11631 99750 -85666 -203969 -208594 11045 -4581 160509
9766B35041f8768o1633j59018g5573c7243k33656A09797f0707k6501B70759c87936
$$ 235041 -68768 -130401 -289419 -75573 -37243 -270899 109797 -60707 -87208 270759 -387936
9754e8704A80318a90620L1847D3147i0361m0622m8767l44473c0537j71801k9835
$$ -58704 180318 -190620 -158773 43147 -90361 -130983 -179750 -524223 -30537 -202338 -232173
9743b32173G4743b65075J0591J03783a6971G750a52622H2885Q6680D8135c51593
$$ -232173 74743 -265075 -254484 -150701 -16971 7750 -152622 82885 169565 48135 -351593
9731a09594j00387J3931h1209k57165a27490B09193F7647a30016N3900j40602
$$ -109594 -209981 -196050 -81209 -338374 -127490 209193 67647 -130016 -76116 -216718
9721b16718h4420J074j39708b45H4469c7888A81221d5750C8813Q2464b51815m2243
$$ -216718 -84420 -83346 -223054 -245 84469 -37888 181221 -45750 38813 121277 -251815 -294058
9709b94058q8921H413a76530c6012j13652A1764g7514j77915a27595q5975L581
$$ -294058 -382979 8413 -176530 -36012 -149664 11764 -77514 -255429 -127595 -213570 -209989
9698b09989A8599a79801F0654b33330N264J02019f725k51505A57477m9625a32631
$$ -209989 18599 -179801 60654 -233330 -228066 -126047 -6725 -258230 157477 107852 -132631
9686b41355A37835d1647n7009D422J89687J53458g7715A66135n4049e20889A00963
$$ -241355 137835 -41647 -98656 4422 194109 347567 -77715 166135 112086 -520889 100963
9674c5356L021A49075E2833a71329E9273c92410J59142A03507A0516J73082c8491
$$ -35356 -32335 149075 52833 -171329 59273 -392410 -233268 103507 10516 183598 -38491
9662a26940d0204q7246A69951a26049I2509g3765j22555A53206g2609j4595j13942
$$ -126940 -40204 -127450 169951 -126049 92509 -73765 -196320 153206 -72609 -87204 -201146
9651b01146Q1591o6503Q4615l6272c2954j07833o9130A54872a81553p9590G262
$$ -201146 -119555 -186058 -101443 -137715 -32954 -140787 -209917 154872 -181553 -261143 7262
9639d7654j0580k63735C7725J53655D002d5465j36536E9936h4637o7364C0626
$$ -47654 -58234 -321969 37725 191380 4002 -45465 -182001 59936 -84637 -152001 30626
9627a38518j85232J34392N6989d1924G7199K03086b07326P8730j343B66203i7648
$$ -138518 -323750 -189358 -132369 -41924 77199 280285 -207326 -128596 -129939 266203 -97648
9615a69352P1475E4287A7564e1726k14157R8571o0410R9080P865J7995j50332
$$ -169352 -97877 54287 17564 -51726 -265883 -167312 -227722 -128642 -120777 -102782 -253114
9604b53114d0686B02581B1473a46428C7485r367d0759l4620j60186D4267b02726
$$ -253114 -40686 202581 21473 -146428 37485 28118 -40759 -75379 -235565 44267 -202726
9592a99564R6380B57749a20354A75067c75038A67964c3553j91069F6674a23937
$$ -199564 -103184 257749 -120354 175067 -375038 167964 -33553 -224622 66674 -123937
9581A28707a28030A0969a90696F3187a40421f9416D3696J51640c0216A585J7390
$$ 128707 -128030 10969 -190696 63187 -140421 -69416 43696 195336 -30216 1585 18975
9570A8975J46604d9677B86579i6155j8596A14168o623d21665J06459L2896a21564
$$ 18975 165579 -49677 286579 -96155 -114751 114168 107545 -421665 -315206 -282310 -121564
9558H942f8937k54537d062l35168A8894c0919j16873C3769R4643a80974o719C0864
$$ 8942 -68937 -323474 -4062 -339230 18894 -30919 -147792 33769 128412 -180974 -187693 30864
9545F2090Q0204a90859n7536m3119F7460M3744b28006f7883j53077O6302A69609
$$ 62090 142294 -190859 -248395 -291514 67460 111204 -228006 -67883 -220960 -154658 169609
9533A3278a54012j68298e4675A28437j3207n2260a62785A25630a03856k1304A44478
$$ 13278 -154012 -322310 -54675 128437 115230 62970 -162785 125630 -103856 -125160 144478
9521b06224d4639k60808B9688K06296a27050A7870c50656b2738k7674j45499o4655
$$ -206224 -44639 -305447 29688 235984 -127050 17870 -350656 -22738 -50412 -195911 -260566
9510b60566m0718A79516i4731A71746b12682B14284d7814r7112f1224p2700r7826
$$ -260566 -301284 179516 -94731 171746 -212682 214284 -47814 -144926 -61224 -133924 -231750
9499b31750b5235A18409a1111A32943a81060B5151b23619D7606h5771o2247l37914
$$ -231750 -25235 118409 -11111 132943 -181060 25151 -223619 47606 -85771 -148018 -485932
9488d85932A13466k7988r706J3840l9588b01567O3743b5883D5444M3405A8175
$$ -485932 113466 85478 75772 89612 50024 -201567 -137824 -25883 45444 88849 18175
9476c09849d5055E2679K02129c92618C36932a18017A8168a66322A97485r3543
$$ -309849 -45055 52679 254808 -392618 336932 -118017 18168 -166322 197485 103942
9466A03942O6981g690m1684A27461b19493Q8204M188C665c00102J36976b4166
$$ 103942 170923 -7690 -49374 127461 -219493 -131289 -127101 3665 -300102 -163126 -24166
9454a13597K2439a3688A03491c16859O2128J21725N2765A23078a07209A60798
$$ -113597 -91158 -13688 103491 -316859 -254731 -133006 -80241 123078 -107209 160798
9443F9715d082j32412D7507a32864c5777j76335B65075I0180M8634b54531G6405
$$ 69715 -4082 -136494 47507 -132864 -35777 -212112 265075 90180 138814 -254531 76405
9431e1914q25A94212m4137a78040r8972A95969a17319r6127j30280C02806a32730
$$ -51914 -52739 194212 150075 -178040 -277012 195969 -117319 -213446 -343726 302806 -132730
9419a62077a7516l7550r4408B72554f5806j22428A13606A5295b36778a08241j39162
$$ -162077 -17516 -55066 -149474 272554 -65806 -188234 113606 15295 -236778 -108241 -247403
9408b47403j8366a7096B07975b76951P5364P3362o7031h1551b1771B10556c10957
$$ -247403 -265769 -17096 207975 -276951 -201587 -128225 -195256 -81551 -21771 210556 -310957
9396a93992C4931A4828J98267a19813B27748q3723c00642g4606j74106N7436A39331
$$ -193992 34931 14828 213095 -119813 227748 144025 -300642 -74606 -248712 -191276 139331
9384c48495g1486j9333j16035j32522B30467h6070A4729b54395a20197p5419G202
$$ -348495 -71486 -90819 -206854 -339376 230467 -86070 14729 -254395 -120197 -195616 7202
9372E9916a4977j6781A71468a64116D5914c01666L2937B68954R8147a20026p933
$$ 59916 -14977 -31758 171468 -164116 45914 -301666 -268729 268954 367101 -120026 -127959
9361a27959B6457a42775j06685I5201R352b07974e9429k16049a13099m06628a39251
$$ -127959 26457 -142775 -249460 95201 104553 -207974 -59429 -275478 -113099 -519727 -139251
9349F6021a39268H9364i8684A94182q6385a96323A27282l7809d06318d1905F2884
$$ 66021 -139268 89364 -98684 194182 107797 -196323 127282 89473 -406318 -41905 62884
9337D4095L6267b57547a9183M402l37771C6322h5945j32009g4421p0999c5967
$$ 44095 80362 -257547 -19183 -14781 -352552 36322 -85945 -217954 -74421 -145420 -35967
9325e6185a027G2904d4032q6335H8025b0308j03838F7825b00355j37299B3142
$$ -56185 -1027 72904 -44032 -130367 88025 -20308 -124146 67825 -200355 -337654 23142
9313c06746c2446F6622J55011L8544c19205m9556J05972A14457D0735a52390K4432
$$ -306746 -32446 66622 221633 260177 -319205 -368761 -262789 114457 40735 -152390 -127958
9302a27958B24571a43985B07802i5065c1658B45783a63122B8804b78287B96269
$$ -127958 224571 -143985 207802 -95065 -31658 245783 -163122 28804 -278287 296269
9291a07979k3962J1449j13822H8707C4470d76694a48279C500c13087A61322d0407
$$ -107979 -131941 -120492 -234314 88707 34470 -476694 -148279 3500 -313087 161322 -40407
9279a66526d5991F726a95727j22873A735M9492K56304D0851c01995a5902A65991
$$ -166526 -45991 6726 -195727 -318600 1735 51227 307531 40851 -301995 -15902 165991
9267b49572J07768A7126e0555k20580j6598d2951dA74117a55150l15584K06364
$$ -249572 -141804 17126 -50555 -271135 -287733 -42951 -4 174117 -155150 -470734 -264370
9256b64370b6656B49662g530j15514k8987n2842d7148B12958d812l7312l30445
$$ -264370 -26656 249662 -7530 -123044 -152031 -204873 -47148 212958 -4812 -42124 -372569
9245c72569E0629J10493a87617A19284Q659b14897O1245j34172g0656A1161h8091
$$ -372569 50629 161122 -187617 119284 127943 -214897 -153652 -287824 -70656 11161 -88091
9233a51401K4608A9635O2269J31608p3584a18927n5403B5043a99250C7726J37197
$$ -151401 -126793 19635 81904 213512 139928 -118927 -174330 25043 -199250 37726 174923
9222A74923A5521a36495k02458F0733P9188a6357A14542P1210l6548E4992L15737
$$ 174923 15521 -136495 -338953 60733 139921 -16357 114542 185752 149204 54992 370729
9211C70729a66740c9311j48687B647J11100b2324m7650j95340A45816d7509A64113
$$ 370729 -166740 -39311 -187998 2647 113747 -22324 -69974 -265314 145816 -47509 164113
9199a34987k01774A2478i6914r0668P0946k1422j2972B32723e0061A2745J13781
$$ -134987 -336761 12478 -96914 -187582 -116636 -138058 -151030 232723 -50061 12745 126526
9188A26526c65205a11668H9628a95789m6484a02772j19909A5782b14749G6306
$$ 126526 -365205 -111668 89628 -195789 -242273 -102772 -222681 15782 -214749 76306
9177a370j12464J8919E9558J6951J87623a4604o692m25526A42886P3976a26560
$$ -1370 -113834 -94915 59558 76509 264132 -14604 -21296 -446822 142886 216862 -126560
9165a55938E7764A2237J6951N5079a31880O1268B09032d08908C50141a19368l32977
$$ -155938 57764 12237 29188 84267 -131880 -70612 209032 -408908 350141 -119368 -452345
9154d52345M3465a00736E6209J05020d08693J33778i9707j48952P2580r7507p9094
$$ -452345 -408880 -100736 56209 161229 -408693 -274915 -99707 -248659 -176079 -273586 -352680
9143c52680g9020k09073h4212A90627b13291g1961D8162J87593d25238b08620
$$ -352680 -79020 -288093 -84212 190627 -213291 -71961 48162 235755 -425238 -208620
9132C9472b24558k378A88283d00529A42781d0234j69792L8887D7314b0950B14248
$$ 39472 -224558 -226936 188283 -400529 142781 -40234 -210026 -171139 47314 -20950 214248
9120i1854A91585C6929b5944A78001C8132a87422C39659C6399a49213C91310B4768
$$ -91854 191585 36929 -25944 178001 38132 -187422 339659 36399 -149213 391310 24768
9108c7811r9890j11820E0546J9039f1018A76275J19547a35667e9363j5800E2481
$$ -37811 -137701 -249521 50546 69585 -61018 176275 295822 -135667 -59363 -75163 52481
9096i9864G7949l4392a61318j27352A43363d04190I4326d9219B1940m600a0902
$$ -99864 77949 43557 -161318 -288670 143363 -404190 94326 -49219 21940 17340 -10902
9084h1617j14601A201a5013B04117a71837P3679m3411p1267A4165g6515j93551
$$ -81617 -196218 1201 -15013 204117 -171837 -98158 -141569 -212836 14165 -76515 -270066
9073b70066e9880k8907L1333a5843B9173b05505n634O3491p9521o0889L9485Q2597
$$ -270066 -59880 -88787 -57454 -15843 29173 -205505 -211139 -147648 -227169 -288058 -248573 -165976
9061a65976k5957b2587A53333h7390C1983L2650e3430J1811k32072f6209k54322
$$ -165976 -191933 -22587 153333 -87390 31983 64633 -53430 -41619 -273691 -66209 -320531
9050c20531J50572H5966a6722j10404j49202H6943b4669j50232d7685m3587k05186
$$ -320531 -169959 85966 -16722 -127126 -276328 86943 -24669 -174901 -47685 -91272 -296458
9039b96458O4641B21351g3193B60021c04923f1694j16841A90540c0685C99395
$$ -296458 -231817 221351 -73193 260021 -304923 -61694 -178535 190540 -30685 399395
9028C12379A43039i741q0756B71872G1968e7587C0271b54302I3373B112R9580
$$ 312379 143039 -9741 -90497 271872 71968 -57587 30271 -254302 93373 2112 101692
9017A01692d41484g7058B1660g4978m9866r7646B91692q0498q0867a60637P9618
$$ 101692 -441484 -77058 21660 -74978 -124844 -222490 291692 211194 130327 -160637 -81019
9006h1019r3031B03775C3031i5277b1772k76512A61040E6248h7347n0016j01324
$$ -81019 -174050 203775 33031 -95277 -21772 -298284 161040 56248 -87347 -137363 -238687
8995b38687g1539c0840C54311a61801B43329B5197d7654A7539i6168H7103C640
$$ -238687 -71539 -30840 354311 -161801 243329 25197 -47654 17539 -96168 87103 3640
8983A5610a86125I390a84778E5563J10182n0973c00852N5539A26463a846k92213
$$ 15610 -186125 9390 -184778 55563 165745 114772 -300852 -245313 126463 -1846 -294059
8972b94059a40141d3381A48191b880l936k73679i0210N537j65821R794B6141e1430
$$ -294059 -140141 -43381 148191 -2880 -6816 -280495 -90210 -84673 -250494 -240700 26141 -51430
8959e4641j51313b0928A45065e34365g7122l2922j02082j06007A3015J71855Q6616
$$ -54641 -205954 -20928 145065 -534365 -77122 -110044 -212126 -318133 13015 184870 271486
8948B71486a35706p5088P1585n8272j40839C44459b32409B1818f0567q0240c3978
$$ 271486 -135706 -210794 -139209 -197481 -338320 344459 -232409 21818 -60567 -140807 -33978
8936h9889C1525b8327A96888a08018j15411K6734e8293F452J61897a07303j54018
$$ -89889 31525 -28327 196888 -108018 -223429 -196695 -58293 6452 168349 -107303 -261321
8925b61321A0941a20786q1090g3772j6125I2043a25399k2636f9945B50836q9093
$$ -261321 10941 -120786 -201876 -73772 -89897 92043 -125399 -148035 -69945 250836 161743
8914A61743J50382A47934a88257A23405L2084D5615L62286j94526N30676N79440
$$ 161743 312125 147934 -188257 123405 155489 45615 407901 213375 744051 1323491
8904A323491J434941K540651j265701A746354o19611n60056B30276H1003g5797
$$ 1323491 2758432 5299083 4033382 1746354 1126743 566687 230276 81003 -75797
8894B96044j29925p2592L87379G6097m570i4733C3216J23804a10018A81670K19873
$$ 296044 166119 93527 480906 76097 71527 -94733 33216 157020 -110018 181670 401543
8883D01543G5814K34510a98804G9634c57754A79837b12974A79132C6307M4768
$$ 401543 75814 310324 -198804 79634 -357754 179837 -212974 179132 36307 81075
8873H1075i3395B72866a74832d8208A26259b71156D6071b45530a04863J9384p6763
$$ 81075 -93395 272866 -174832 -48208 126259 -271156 46071 -245530 -104863 -85479 -162242
8862a62242q3877f9174b2934j59845a5343A63560J13010a78588e5562k29451A91740
$$ -162242 -246119 -69174 -22934 -182779 -15343 163560 276570 -178588 -55562 -285013 191740
8850b505j1004B3967K01049k7518B0270b59389a3652A16721A4411c71341B7283
$$ -2505 -13509 23967 225016 197498 20270 -259389 -13652 116721 14411 -371341 27283
8838B2371M5237b019l2982l1076K5923A19980b86354P6869d1739J0028r3404n908
$$ 22371 67608 -2019 -35001 -66077 -40154 119980 -286354 -209485 -41739 -31711 -125115 -131023
$$ [...]
##END NTUPLES=NMR SPECTRUM
##END=
