
##TITLE=AC1217_HTEAH12048_5973559_hhJ8dNpkPY
##JCAMPDX= 6.0         $$ Bruker NMR JCAMP-DX V2.0
##DATA TYPE= NMR SPECTRUM
##DATA CLASS= NTUPLES
##ORIGIN= BRUKER
##OWNER= Administrator
$$ 1.72 TOPSPIN		Version 2.1
$$ 2012-04-14 18:48:49.906 -0500  Administrator@TOPSPIN
$$ Compression mode = diff/dup
##.OBSERVE FREQUENCY= 400.13188235
##.OBSERVE NUCLEUS= ^1H
##.ACQUISITION MODE= SIMULTANEOUS (DQD)
##.ACQUISITION SCHEME= undefined
##.AVERAGES= 64
##.DIGITISER RES= 22
##SPECTROMETER/DATA SYSTEM= spect
##.PULSE SEQUENCE= noesygpps1d.comp
##.SOLVENT NAME= COFFEE_meoh
##.SHIFT REFERENCE= INTERNAL, COFFEE_meoh, 1, 14.9686
##AUDIT TRAIL= $$ (NUMBER, WHEN, WHO, WHERE, PROCESS, VERSION, WHAT)
$$ ##TITLE= Audit trail, TOPSPIN		Version 2.1
$$ ##JCAMPDX= 5.01
$$ ##ORIGIN= Bruker BioSpin GmbH
$$ ##OWNER= Administrator
$$ $$ C:\Bruker\TOPSPIN/data/COFFEE/nmr/AC1217_HTEAH12048_5973559_hhJ8dNpkPY/12/pdata/1/auditp.txt
$$ ##AUDIT TRAIL=  $$ (NUMBER, WHEN, WHO, WHERE, PROCESS, VERSION, WHAT)
(   1,<2012-04-14 18:48:43.203 -0500>,<Administrator>,<TOPSPIN>,<go>,<TOPSPIN 2.1>,
      <created by zg
	started at 2012-04-14 18:37:10.921 -0500,
	POWCHK enabled, PULCHK disabled,
       configuration hash MD5:
       1A 1E CE 29 27 FD 77 03 67 4E F0 E3 C4 B2 CB 90
       data hash MD5: 64K
       37 E0 55 1E 2A 5C 7D 8A 70 4E DA EB A6 83 84 1F>)
(   2,<2012-04-14 18:48:46.515 -0500>,<Administrator>,<TOPSPIN>,<proc1d>,<TOPSPIN 2.1>,
      <Start of raw data processing
       efp LB = 0.3 FT_mod = 6 PKNL = 1 PHC0 = 0 PHC1 = 0 SI = 128K 
       data hash MD5: 128K
       2D F8 CD C9 CC 38 06 CE BC 0E 7D CC FE 61 A5 CA>)
(   3,<2012-04-14 18:48:48.562 -0500>,<Administrator>,<TOPSPIN>,<proc1d>,<TOPSPIN 2.1>,
      <pk PHC0 = 35.76599 PHC1 = 0 
       data hash MD5: 128K
       3A 64 A4 B3 55 D7 CB 20 F7 09 79 98 78 FA 79 2C>)
(   4,<2012-04-14 18:48:49.343 -0500>,<Administrator>,<TOPSPIN>,<proc1d>,<TOPSPIN 2.1>,
      <abs ABSG = 1 
       data hash MD5: 128K
       5D B2 50 DE B6 20 22 13 3F 11 B3 DE 9F AE 39 4E>)
(   5,<2012-04-14 18:48:49.468 -0500>,<Administrator>,<TOPSPIN>,<proc1d>,<TOPSPIN 2.1>,
      <abs ABSG = 2 
       data hash MD5: 128K
       1C C1 20 43 8F E8 EE 27 8E B5 CB 9D 5C 7C 6D 33>)
(   6,<2012-04-14 18:48:49.546 -0500>,<Administrator>,<TOPSPIN>,<proc1d>,<TOPSPIN 2.1>,
      <abs ABSG = 3 
       data hash MD5: 128K
       1C 08 06 31 18 34 50 73 3A A5 4C F9 4D B6 AA 2A>)
(   7,<2012-04-14 18:48:49.640 -0500>,<Administrator>,<TOPSPIN>,<proc1d>,<TOPSPIN 2.1>,
      <abs ABSG = 4 
       data hash MD5: 128K
       AB CE A1 3A E1 CC 50 D9 5F 9E EB 9C 8D 58 7D 3D>)
(   8,<2012-04-14 18:48:49.796 -0500>,<Administrator>,<TOPSPIN>,<proc1d>,<TOPSPIN 2.1>,
      <abs ABSG = 5 
       data hash MD5: 128K
       0A 84 A9 06 9C 00 83 F5 E4 0D 1F B3 8B 7C C6 E8>)
$$ ##END=
$$ 
$$ $$ hash MD5
$$ $$ 23 01 CE D9 73 AE 7D 9F 95 19 7F E8 D6 65 17 08
##$RELAX= 
##$RELAX= 
##$RELAX= 
##$RELAX= 
##$RELAX= 
##$RELAX= 
##$RELAX= 
##$RELAX= 
$$ Bruker specific parameters
$$ [...]
##$TP07= 0
##$TPNAME0= <>
##$TPNAME1= <>
##$TPNAME2= <>
##$TPNAME3= <>
##$TPNAME4= <>
##$TPNAME5= <>
##$TPNAME6= <>
##$TPNAME7= <>
##$TPOAL= (0..7)
0.5 0.5 0.5 0.5 0.5 0.5 0.5 0.5
##$TPOFFS= (0..7)
0 0 0 0 0 0 0 0
##$TUNHIN= 0
##$TUNHOUT= 0
##$TUNXOUT= 0
##$USERA1= <user>
##$USERA2= <user>
##$USERA3= <user>
##$USERA4= <user>
##$USERA5= <user>
##$V9= 5
##$VALIST= <valist>
##$VCLIST= <CCCCCCCCCCCCCCC>
##$VD= 0
##$VDLIST= <DDDDDDDDDDDDDDD>
##$VPLIST= <PPPPPPPPPPPPPPP>
##$VTLIST= <TTTTTTTTTTTTTTT>
##$WBST= 1024
##$WBSW= 4
##$XGAIN= (0..3)
0 0 0 0
##$XL= 0
##$YL= 0
##$YMAX_a= 12109820
##$YMIN_a= -6123173
##$ZGOPTNS= <>
##$ZL1= 120
##$ZL2= 120
##$ZL3= 120
##$ZL4= 120
##$ABSF1= 14.9686
##$ABSF2= -5.58393
##$ABSG= 5
##$ABSL= 3
##$ALPHA= 0
##$AQORDER= 0
##$ASSFAC= 0
##$ASSFACI= 0
##$ASSFACX= 0
##$ASSWID= 0
##$AUNMP= <proc_prof1d_extract.lims>
##$AXLEFT= 0
##$AXNAME= <>
##$AXNUC= <1H>
##$AXRIGHT= 0
##$AXTYPE= 0
##$AXUNIT= <>
##$AZFE= 0.1
##$AZFW= 0.1
##$BCFW= 0
##$BC_mod= 0
##$BYTORDP= 0
##$COROFFS= 0
##$CY= 15
##$DATMOD= 1
##$DC= 0
##$DFILT= <>
##$DTYPP= 0
##$F1P= 0
##$F2P= 0
##$FCOR= 0.5
##$FTSIZE= 131072
##$FT_mod= 6
##$GAMMA= 0
##$GB= 0
##$INTBC= 1
##$INTSCL= 1
##$ISEN= 128
##$LB= 0.3
##$LEV0= 0
##$LPBIN= 0
##$MAXI= 10000
##$MC2= 0
##$MEAN= 0
##$ME_mod= 0
##$MI= 0
##$NCOEF= 0
##$NC_proc= -3
##$NLEV= 6
##$NOISF1= 0
##$NOISF2= 0
##$NSP= 0
##$NTH_PI= 0
##$NZP= 0
##$OFFSET= 14.9686
##$PC= 1
##$PHC0= 35.76599
##$PHC1= 0
##$PH_mod= 1
##$PKNL= yes
##$PPARMOD= 0
##$PPDIAG= 0
##$PPIPTYP= 0
##$PPMPNUM= 2147483647
##$PPRESOL= 1
##$PSCAL= 4
##$PSIGN= 0
##$PYNMP= <proc.py>
##$REVERSE= no
##$SF= 400.130004806725
##$SI= 131072
##$SIGF1= 0
##$SIGF2= 0
##$SINO= 400
##$SIOLD= 131072
##$SPECTYP= <>
##$SREGLST= <1H.CDCl3>
##$SSB= 0
##$STSI= 131072
##$STSR= 0
##$SW_p= 8223.68421052632
##$SYMM= 0
##$S_DEV= 0
##$TDeff= 65536
##$TDoff= 0
##$TI= <>
##$TILT= no
##$TM1= 0
##$TM2= 0
##$TOPLEV= 0
##$USERP1= <user>
##$USERP2= <user>
##$USERP3= <user>
##$USERP4= <user>
##$USERP5= <user>
##$WDW= 1
##$XDIM= 131072
##$YMAX_p= 465581065
##$YMIN_p= -500165270
##$CURPLOT= <Network HP LaserJet P1505>
##$CURPRIN= <$Network HP LaserJet P1505>
##$DFORMAT= <normdp>
##$LAYOUT= <+/1D_H.xwp>
##$LFORMAT= <normlp>
##$PFORMAT= <normpl>
##$SURQMSG= 1
$$ End of Bruker specific parameters
$$ ---------------------------------
##NTUPLES= NMR SPECTRUM
##VAR_NAME=  FREQUENCY,     SPECTRUM/REAL,   SPECTRUM/IMAG
##SYMBOL=    X,             R,               I
##VAR_TYPE=  INDEPENDENT,   DEPENDENT,       DEPENDENT
##VAR_FORM=  AFFN,          ASDF,            ASDF
##VAR_DIM=   131072,        131072,          131072
##UNITS=     HZ,            ARBITRARY UNITS, ARBITRARY UNITS
##FACTOR=    0.0627417313425165, 1,          1
##FIRST=     8223.62146879498, 1375,         -87791
##LAST=      0,             4689,            -87134
##MIN=       0,             -500165270,      0
##MAX=       8223.62146879498, 465581065,    0
$$ Real data points
##PAGE= N=1
##DATA TABLE= (X++(R..R)), XYDATA
$$ [...]
65498 81802 82748 85215 88066 89870 90535 90685 90246 88908 87450 87299 88834 91090 93074 94525 95379 95441
65482 95441 94859 94320 94471 95508 97354 99712 101784 102570 101831 100446 99548 99541 100169 101143 102275 103217 103578 103398
65464 103398 103168 103262 103506 103430 102826 101990 101501 101845 103199 105512 108723 112666 116687 119643 120795 120808 121388
65447 121388 123563 126533 128555 128856 128277 128026 128220 127835 125977 122974 120230 119029 119525 120975 122749 124670
65431 124670 126234 126234 123976 120666 118779 119856 123428 128151 133261 138599 143837 148258 151091 151842 150678
65416 150678 148746 147587 147753 148247 147647 145509 142386 138923 135454 132171 129241 126815 125092 123967 122512
65401 122512 119598 115523 112225 111048 110921 109729 107020 104220 102498 101679 101191 100828 100348 99464 98598 98643
65385 98643 99649 100674 101223 101727 102124 101200 98270 94575 91926 90591 89582 88483 87846 88025 88836 90338
65369 90338 92798 95544 96881 95877 93803 93131 95073 98375 100528 100042 97593 95136 94057 94204 94530
65354 94530 94358 93968 94151 95276 96760 97579 97512 97642 99217 102157 105251 107681 109629 111360 112645 113414
65338 113414 114177 115307 116579 117783 119028 119932 119396 117096 114544 113795 115508 118923 123037 126879 129337
65323 129337 130078 130388 131999 135204 139103 143228 147594 151476 153901 155592 158799 164543 171294 177002 181330
65308 181330 185202 189398 194529 201419 210418 220896 232208 244490 257676 270473 281346 289984 296729
65295 296729 300980 301302 297132 289485 280089 270484 261679 253684 245375 235682 225072 215284 207618 201966
65281 201966 197250 192067 185269 177028 169308 164189 161554 159383 156369 152938 149427 144906 138858 132735
65267 132735 128295 125097 121291 116651 113231 112669 114132 115436 115166 113083 109486 105180 101564 99647 99065
65252 99065 98781 98615 99261 100828 102321 102877 102707 102304 101479 99916 98169 97165 96902 96524 95701 94906 94064
65235 94064 91981 87952 83329 80548 80684 82728 85171 87409 89325 90390 90119 89306 89901 93091 97635
65220 97635 100661 100321 97455 94430 92700 92014 91778 92249 93974 96706 99576 101978 103685 104353 103701 102249
65204 102249 101173 101227 102248 103808 105787 108071 110184 111631 112363 112671 112868 113242 113978 114845 115245 114805 113637
65187 113637 111901 109522 106773 104617 103806 103720 102847 100637 98438 98209 100375 103231 104591 103867 102235 100720
65171 100720 98724 95109 90380 86638 85028 84361 82987 80987 79344 77806 75281 72245 70887 72277
65157 72277 74777 76166 76246 76412 77540 79463 81930 84865 87821 90133 91548 92072 91500 89902 88218 87422
65141 87422 87299 87028 86695 87064 87947 88188 87438 86651 86420 86208 85783 85964 86953 87223 85417 82509 80724 80910
65123 80910 82252 84018 86166 88509 90642 92551 94104 94274 92398 89968 89381 90648 91232 89707 87719
65108 87719 87269 87820 87723 87220 88008 90294 92128 91805 89654 87204 85622 85190 85495 85837 85908 86110 86824 87680
65090 87680 88177 88708 90112 92389 94766 96839 98590 99362 98134 95294 92940 92700 93998 95179 95534 95375
65074 95375 94746 93251 91124 89518 89349 90237 90891 90452 89359 88856 89620 91090 92442 93918 96496 100200
65058 100200 103621 105539 106306 107058 108229 109562 111046 112839 114515 115372 115483 115663 116339 117274 118462 120420
65042 120420 123234 126037 127873 128578 128609 128706 130081 133996 140341 147131 152347 156008 159711 164500 170116
65027 170116 176172 182818 189972 196897 203100 208825 214023 217539 218227 216525 214098 212012 210001 207514
65013 207514 204759 202381 200454 198022 193609 186465 177626 169398 163197 158163 152622 146641 141991 139420
64999 139420 137284 133669 128920 125018 123005 122085 121024 119396 117366 115097 112569 109465 105249 100040
64985 100040 95385 93312 94163 95956 96346 94874 93007 92376 93441 95536 97647 98997 99161 97904 95173
64970 95173 91448 87876 85616 85007 85605 86959 88786 90389 90597 88854 86074 83961 83425 83885 84046 83262
64954 83262 82162 81965 83201 85247 87288 89262 91412 93266 93928 93316 92230 91136 89888 88887 89241
64939 89241 91010 92426 91949 90343 89522 89948 90610 91179 92511 94758 96471 96272 94433 92224 90552 89725
64923 89725 89620 89413 87969 85284 82829 81687 81150 80185 79518 80738 83638 86112 86977 87372 88640 90158
64907 90158 90395 89274 88170 87877 87776 87080 85899 84855 84356 84544 85398 86559 87502 88069 88417 88352 87303
64890 87303 85198 82785 80717 78931 77424 76942 78056 79936 81041 80930 80563 80760 81253 81521 81723 82344
64874 82344 83398 84460 85115 85028 83942 82032 80089 78989 79087 80219 81905 83326 83563 82332 80410 78982
64858 78982 78655 79242 80255 81348 82455 83740 85253 86518 86751 85663 83748 81626 79600 78156 78245 80355
64842 80355 83594 86428 88194 89303 90099 90290 89653 88582 87599 86726 85752 84909 84894 86057 87662 88229 86938
64825 86938 84708 83427 83965 85391 86384 86773 87148 87616 87842 87956 88417 89023 89016 88269 87516 87235 87101 86727 86163
64806 86163 85373 84081 82518 81555 81600 82136 82851 84371 86993 89453 90169 89406 89061 90322 92530 94488 95755
64789 95755 96189 95177 92245 88099 84228 81460 79431 77552 75965 75285 75729 76837 77932 78593 78760 78751
64773 78751 79281 81082 84210 87791 90686 92387 93197 93669 94011 93974 93223 91964 91204 91975 93999 95555 95207
64756 95207 93414 91900 91631 92115 92505 92547 92307 91805 91243 90888 90407 89008 86668 84532 83503 83113 82448
64739 82448 81576 81212 81392 81555 81735 82619 84248 85539 85516 84415 83299 83094 84355 87292 91333 94839 95998
64722 95998 94344 91250 88836 88335 89450 91059 92353 93299 94209 95141 95806 95855 95145 93891 92732 92513 93642
64705 93642 95571 97025 96966 95488 93810 93211 93769 94273 93611 92095 91026 91138 92086 93431 95314 97776
64689 97776 100144 101689 102407 102588 102102 100824 99421 98990 100018 102250 105140 107716 108388 106109 101849 97949
64673 97949 95788 94922 94591 94948 96207 97588 98046 97592 97100 97094 97400 97748 98047 98214 98330 98854 100086 101503
64655 101503 102259 102377 102709 103497 103654 102097 99395 97384 97147 97968 98503 98376 98134 97967 97285 95697 93754
64638 93754 92299 91530 91150 91093 91514 92272 93056 93969 95337 96903 97864 97893 97606 97758 98489 99577 100982 102758
64620 102758 104756 106666 108074 108418 107474 106113 105832 107040 108336 108118 106408 104393 102665 100913 99145
64605 99145 98109 98243 99001 99643 100183 101155 102818 104859 106568 107130 106105 103920 101657 100201 99774 100282
64589 100282 101622 103398 104867 105596 105938 106447 107057 107296 107093 106789 106349 105251 103499 102194 102446 103875
64573 103875 104822 104189 102583 101326 100890 100808 100782 100981 101260 101021 100280 100145 101630 104480 107781 111109 114216
64556 114216 116089 115639 113344 110995 109515 108184 106522 105654 106747 108952 110292 110310 110567 112392 115255
64541 115255 117695 118980 119261 118691 117129 114627 111758 109279 107528 106194 104845 103757 103863 105449 107299
64526 107299 107908 107539 108142 110751 113698 114170 111329 107258 104843 105181 107141 108975 110022 110830 111925 112946
64510 112946 113260 112984 112681 112128 110394 107553 105385 105475 107260 108943 109987 111437 113734 115561 115460 113727
64494 113727 111882 110839 110357 109996 109793 109990 110585 111276 111562 110984 109575 108003 106987 106677 106789 107105 107431
64477 107431 107392 106846 106387 106696 107377 107239 106022 105008 105296 106173 106117 105033 104320 104689 105129 104625 103931 104644
64459 104644 106989 109538 111094 111838 112417 112786 112498 111585 110540 109666 108919 108112 106848 104574 101322 98257
64443 98257 96865 97521 99357 101472 103653 105850 107624 108523 108555 107983 107060 106207 105893 105905 105240 103378 101349
64426 101349 100863 102489 105363 108501 111525 114030 115242 114966 114295 114546 115669 116357 115674 113899 111643 108812
64410 108812 105030 100792 97586 96713 98211 100969 103674 105615 106894 108107 109718 111615 113258 114223 114410
64395 114410 113797 112396 110631 109403 109421 110614 112328 113806 114272 113179 110979 109230 109171 110328 111243 111327
64379 111327 111125 110981 110658 110431 111226 113142 114981 115980 116911 118559 120032 119809 117831 115422 113682 113020
64363 113020 113628 115002 115531 114188 112498 113134 116446 120067 122176 123359 124652 125682 125957 126403 127947
64348 127947 129658 129940 128940 128159 128128 128061 127633 127522 128008 128429 128392 128368 128590 128390 127196 125460 124057 123347
64330 123347 123267 123761 124658 125542 126141 126403 125910 123855 120180 116327 114233 114641 116699 118931 120313 120707 120736
64313 120736 121100 121756 121928 121109 119685 118298 117069 115954 115416 115972 117266 118330 118759 118888 118754 117783 115861
64296 115861 114002 113342 113847 114583 114978 115239 115670 116180 116571 116903 117395 118221 119459 121033 122681 124186 125632
64279 125632 127161 128430 128671 127501 125520 123905 123533 124502 126250 127942 128992 129465 129873 130454 130856 130830
64263 130830 130979 132296 134949 138002 140550 142767 145530 149264 153532 157657 161384 164849 168158 171088
64249 171088 173076 173553 172506 170796 169600 169270 168874 167163 163991 160591 158504 158489 160342 163216 165840
64234 165840 166982 166440 165648 166738 170680 176514 182464 187513 191762 195662 199316 202453 204846 206777 209083
64219 209083 212435 216385 219491 220834 221233 222449 225198 228428 230708 231850 232806 234185 235347 235071 232867
64204 232867 229369 225470 221411 217063 212843 209742 208234 207689 207225 206641 206000 204796 202469 199571 197393
64189 197393 196240 195049 193257 192196 193735 197871 202535 205763 207375 208426 209730 211338 213138 215388
64175 215388 218551 222803 227933 233675 239903 246310 252194 256941 260627 263594 265380 264905 262243 259584
64161 259584 259398 261659 263737 263342 260917 258714 258008 257887 256582 253366 248993 244737 241332 238739 236649
64146 236649 235053 234317 234761 236300 238522 240965 243194 244899 246228 247936 250650 253961 256754 258672 260638
64131 260638 263398 266123 267316 266881 266254 266388 266610 265975 264859 264548 265703 267863 270042 271298 271252 270767
64115 270767 271672 274931 279329 282774 284716 286543 289853 295235 302449 310513 317677 322771 327135 333963
64101 333963 344978 358638 372298 385162 398067 411416 424889 438933 454839 472694 490328
64090 490328 505248 517318 528792 541618 555203 567087 575329 579675 580597 578334 573462 567417 561185
64077 561185 553697 542845 528230 511929 496344 482403 470115 459558 450479 441886 432983 423996
64065 423996 415490 407592 400474 394704 390271 385983 380739 374785 368976 363582 358789 355456 354112 353836
64051 353836 353514 353722 355941 360197 365000 369409 373703 378042 381981 385513 389217 393210 397347 402677 411151
64036 411151 423266 437315 451598 466193 481887 498545 515345 531602 546557 559369 570230
64025 570230 580581 591287 601332 609198 614677 618186 619181 616742 611421 605030 598432 590784 581294 570826
64011 570826 561197 553362 546818 540630 534697 529919 527094 525887 525259 524937 525823 528612 532553 536106 538520
63996 538520 540236 542048 544564 548500 554897 564629 577694 592938 608609 623544 638053 653553 671339
63983 671339 691958 715458 741464 768760 795543 820595 843977 866451 888750 911363 934141
63972 934141 955720 974348 990011 1004934 1021201 1038563 1055327 1070520 1083995 1095163 1103246 1108758
63960 1108758 1113348 1117906 1121847 1124337 1125115 1123875 1120117 1114313 1108354 1104086 1101964 1101757 1103899 1109251
63946 1109251 1117828 1128641 1140848 1154455 1169857 1187307 1207086 1229725 1255572 1284367 1315657
63935 1315657 1349505 1386291 1425810 1467332 1511012 1558602 1611886 1670719 1733526 1799655 1870230
63924 1870230 1946642 2029498 2119495 2217927 2325195 2439847 2560452 2687969 2825027 2973239
63914 2973239 3132575 3303236 3486784 3685222 3900251 4133905 4388916 4667965 4973344
63905 4973344 5307971 5676233 6083524 6535478 7037834 7596328 8216231 8902437 9660144
63896 9660144 10494590 11409399 12405332 13480516 14630797 15849043 17124666 18444704 19795194
63887 19795194 21160795 22523078 23859627 25144720 26350760 27449962 28416551 29229042
63879 29229042 29871249 30331488 30600985 30673225 30544954 30217798 29698765 28999254 28134245
63870 28134245 27123005 25989836 24762466 23468459 22132677 20777176 19421936 18084874
63862 18084874 16781804 15526880 14332434 13207773 12158561 11187798 10296681 9483998
63854 9483998 8745632 8076106 7470618 6925007 6434376 5993045 5595821 5238158 4915055
63845 4915055 4621215 4352850 4108310 3886249 3683957 3498137 3326534 3167855 3020606
63836 3020606 2883026 2753954 2632861 2519042 2411522 2309676 2213162 2121188 2032644 1947160
63826 1947160 1865180 1786658 1710482 1635856 1563586 1495199 1431139 1370672 1313366 1259750 1210368
63815 1210368 1164882 1122490 1082760 1045701 1011293 979219 948959 920046 892432 866591 842973
63804 842973 821360 801116 782119 764913 749781 736123 723178 711061 700681 692739 687080 682970
63792 682970 679814 677665 677051 678142 680089 681488 681564 680604 679157 677181 674134 669503 663054 654919 645611
63777 645611 635604 624737 612440 598620 583811 568390 552372 536181 520662 505834 490553
63766 490553 474205 458008 443716 431596 420541 409600 398453 386996 375752 366333 360088 356205
63754 356205 352237 346582 339488 331818 324132 317126 311606 307549 304147 301133 299046 297837 296326 293677
63740 293677 290495 287777 285491 282801 279183 274858 270575 267140 264569 261675 257410 252661 249521 248499
63726 248499 247847 246159 244093 242634 241225 239063 236964 236168 236059 234898 232389 229826 227931 226307 225004
63711 225004 224826 225610 225785 224348 222173 220682 220244 220556 221568 223047 223907 223087 220953 219054 218458 218861
63695 218861 219264 219055 218318 217512 217035 216947 216962 216792 216652 217376 219680 223107 225986 227000 226724 227019 228755 230852
63677 230852 231944 232284 233332 235912 239527 243239 246529 249410 252331 255959 260579 265826 271306 277067
63663 277067 282913 287819 290895 292605 294060 295397 295986 296132 297164 299516 301944 303208 303509 303648 303744 303593
63647 303593 303397 303148 301938 299009 295107 291613 288523 284565 279560 275330 273462 272906 270880 265938 259242
63632 259242 252756 247184 242249 238197 235931 235669 236433 237188 237844 238835 240386 242666 246028 250512 255670
63617 255670 261501 268800 277486 285216 289263 289891 290384 293203 297328 300165 300964 301189 302078 303061 302692 300302
63601 300302 296458 292199 288175 284517 281355 279028 277434 275572 272566 269201 267497 268353 270397 271740
63587 271740 272186 273049 275323 278857 282964 286994 290398 292996 295256 297832 300858 304127 307888 312925 319867
63572 319867 328856 339851 352706 366878 381497 395931 410057 424035 438267 453666 471533 492738
63560 492738 517015 543185 570130 597551 625675 654240 682092 708238 733099 757946 782822
63549 782822 805807 824784 839307 850091 857457 861354 862498 862120 860502 856961 851592 845904 841077
63536 841077 836451 830507 822653 813158 801867 788165 772262 755558 739412 724096 709240 694681
63524 694681 680327 665565 649575 632452 615659 601074 589685 581174 574426 568191 561634 554920
63512 554920 549358 546414 546235 547495 548975 550948 554611 560544 568434 578119 590111 604857 622112 641233
63498 641233 661525 682041 701880 721517 743418 770207 801879 835290 866644 894081 917717
63487 917717 937894 954237 966435 975191 981844 987164 990896 992533 992176 990396 987423 982894 976450 968219
63473 968219 958310 945935 929555 908273 882997 855905 828700 801523 773636 744810 715804 687648
63461 687648 660843 635261 610527 586363 562839 540462 519940 501717 485814 472070 460183
63450 460183 449459 438935 428142 417557 408018 399921 393319 388492 385664 384076 382053 378578 374610
63437 374610 372367 373190 376268 379507 381530 382686 384201 386653 389670 393038 397415 403398 410211 416082
63423 416082 420110 423223 427059 432281 438211 443693 447853 450256 450866 449948 447895 445109 442114 439498 437486
63408 437486 435643 433289 430182 426694 423449 421022 419818 419887 420796 421919 423005 424357 426437 429425 433170
63393 433170 437447 442174 447421 453241 459491 465949 472589 479620 487233 495539 504871 515784 528424 542213
63379 542213 556689 572576 591427 613937 639045 664971 690912 717508 745964 777012 810469
63368 810469 845348 880401 914951 949405 984900 1022325 1061639 1101865 1141412 1178358 1210757
63357 1210757 1237103 1256759 1269954 1277391 1279818 1277975 1272765 1265278 1256479 1246861 1236355 1224462 1210538
63344 1210538 1194240 1175751 1155279 1132217 1105380 1074520 1041194 1007466 974064 940590 907228
63333 907228 875043 844506 815163 787454 763502 744833 730140 716774 704136 694141 688328 685826
63321 685826 684582 683555 683299 685204 690619 700002 712509 726936 743195 762177 784008 807382 830972
63308 830972 854588 878569 903122 928949 957419 989028 1022395 1055783 1088842 1121693 1153000
63297 1153000 1180469 1202997 1220869 1233915 1240996 1241650 1237038 1228839 1218254 1206365 1194355 1182755
63285 1182755 1171238 1159494 1147372 1133774 1116657 1095027 1070143 1043988 1017261 989649 961275
63274 961275 932775 904422 876213 848498 821675 795612 770337 746988 726892 709691 693535
63263 693535 677408 662317 649717 639581 630636 622020 614068 607652 603242 600602 599117 598331 598102 598211
63249 598211 598021 596846 594661 592110 589786 587791 586071 584832 584375 584608 584882 584380 582755 580348 577681
63234 577681 574846 571780 569026 567436 566737 565274 562011 558245 556241 556466 557380 557900 558693 560627 563261
63219 563261 565721 568150 571238 574967 578800 582690 586824 590662 593390 595478 598743 604413 611783 619220
63205 619220 625895 631954 637510 642346 646665 651380 657205 663789 670304 676849 684665 694722 706514 718767
63191 718767 731037 743945 757874 772154 785860 798957 812287 826825 843181 861467 881297
63180 881297 902294 924935 950453 979487 1011256 1044577 1079196 1115530 1153578 1193065 1234346
63169 1234346 1278030 1323606 1369483 1414649 1459355 1503808 1547196 1588622 1628298 1667141 1705704
63158 1705704 1744031 1781909 1818565 1852723 1883813 1912657 1940095 1965297 1986370 2002225 2012617
63147 2012617 2016562 2012224 1998905 1977942 1950932 1917990 1878686 1834051 1786657 1738910 1691986 1646302
63135 1646302 1602349 1560963 1523197 1489855 1460884 1435495 1413363 1395501 1383367 1377139 1375505 1377275
63123 1377275 1382688 1392814 1408076 1427694 1450424 1475407 1502161 1529926 1557416 1583564 1608424
63112 1608424 1632940 1657672 1682164 1705734 1728401 1750490 1771670 1790876 1806985 1819022 1826002
63101 1826002 1827285 1823068 1813964 1800132 1781383 1757919 1730121 1697680 1660142 1618771 1576829 1537203
63089 1537203 1500239 1464440 1428709 1393186 1358525 1325403 1294609 1266784 1241841 1219080 1197925
63078 1197925 1178272 1160285 1144194 1130068 1117450 1105561 1094396 1085241 1079366 1076434 1074904 1073816
63066 1073816 1073280 1073309 1073263 1072859 1072857 1074174 1076841 1080293 1084138 1088111 1091721 1094514 1096578 1098490 1101025 1105127
63050 1105127 1111573 1120123 1129375 1138105 1146552 1155763 1165830 1175551 1184009 1191730 1199843 1208459 1216435 1222693
63036 1222693 1227360 1231406 1235319 1238544 1240465 1241752 1244119 1248477 1253701 1257808 1260213 1262360 1266134 1272259
63022 1272259 1280435 1290389 1302181 1315670 1330260 1345229 1360039 1374394 1388512 1403458 1420753 1441255
63010 1441255 1464622 1490119 1517708 1547955 1580971 1615949 1651937 1688851 1727635 1769601 1815585
62999 1815585 1865450 1918252 1973135 2030241 2090663 2155445 2224769 2298053 2374509 2453509 2534792
62988 2534792 2618606 2705447 2795459 2888099 2982259 3076296 3168073 3255892 3339901 3422060 3504122
62977 3504122 3586099 3667059 3746670 3825039 3901622 3975454 4046202 4113689 4176383 4231577 4277301
62966 4277301 4312761 4336547 4345904 4338846 4316081 4279732 4230738 4168592 4093277 4006479 3910986 3809764
62954 3809764 3705675 3601486 3499984 3404061 3316052 3236527 3164439 3099298 3042619 2996290 2960186
62943 2960186 2932765 2913734 2904298 2904451 2911632 2923062 2938336 2958726 2984754 3015560 3050118 3087823
62931 3087823 3127842 3168824 3209452 3248743 3285771 3319722 3350452 3378443 3403796 3425283 3440515
62920 3440515 3447048 3443390 3429154 3404356 3368782 3322272 3265568 3200266 3127500 3047032 2958376 2862893
62908 2862893 2764160 2665913 2569833 2475540 2382440 2291221 2203663 2121444 2045338 1975331 1911121
62897 1911121 1852273 1798015 1747170 1698663 1652338 1609242 1570774 1537215 1507147 1478585 1450718
62886 1450718 1424288 1400313 1379010 1360127 1343535 1328615 1313431 1295717 1275061 1253451 1233236
62875 1233236 1215035 1197880 1180794 1163650 1146959 1131455 1117638 1105187 1092981 1080281 1067761
62864 1067761 1056834 1048028 1040519 1033200 1025545 1017407 1008706 999784 991600 984993 979842 975276 970684 966244
62850 966244 962413 959058 955359 950712 945697 941836 940052 939489 938286 935596 932531 930930 931420 932887 933732
62835 933732 933385 932607 932462 933125 933682 933012 930679 927062 922878 918724 914754 910547 905552 900022 895261 892519
62819 892519 891690 891477 890629 888587 885247 880957 876813 874085 872893 872058 870623 869007 868184 868201 868000 866378
62803 866378 862691 856988 850050 843126 837153 832265 828164 824476 820382 814549 806339 796925 788497 782342
62789 782342 778224 775419 773546 772265 770944 769016 766397 763415 760639 758630 757403 756172 754212 751996
62775 751996 750874 751431 752727 753350 752763 751504 750640 751228 753679 757331 761072 764633 768707 773529 778149
62760 778149 781665 784525 787829 791780 795789 799927 805256 812355 820208 827165 832853 838671 846198 855349
62746 855349 864528 872759 881131 891611 904750 919544 935520 953835 975677 1000458 1026489 1052956
62734 1052956 1080394 1109569 1140771 1174143 1210059 1249125 1292214 1340194 1393092 1449876 1509759
62723 1509759 1573456 1642480 1717497 1798217 1884590 1977041 2075666 2180338 2291784 2411295 2538883
62712 2538883 2672554 2809814 2948972 3088529 3226270 3359681 3486458 3603827 3708083
62703 3708083 3795746 3864765 3913862 3941375 3945904 3927954 3889838 3833804 3760976 3672146 3568764
62692 3568764 3452943 3327152 3194219 3057148 2918600 2780763 2645652 2515040 2389921
62683 2389921 2270535 2157140 2050372 1950673 1857765 1771021 1690071 1614866 1545434 1481852 1424119
62672 1424119 1371722 1323564 1278775 1237505 1200567 1168290 1140064 1115100 1093255 1074884 1060077
62661 1060077 1048339 1038960 1031383 1025121 1019644 1014786 1011286 1010588 1013845 1021152 1031831 1045232 1061058
62648 1061058 1079230 1099913 1123651 1150883 1181143 1213351 1247386 1284965 1328257 1377792 1432483
62637 1432483 1491642 1555945 1625960 1700772 1779079 1861066 1947908 2039439 2133497 2227751 2320898
62626 2320898 2411423 2496362 2572581 2638764 2694894 2739903 2771124 2786369 2785638 2770269 2741170 2698542
62614 2698542 2642983 2576175 2500408 2417670 2329185 2235813 2139022 2041417 1945939 1854354 1766765
62603 1766765 1682650 1602032 1525428 1453017 1384439 1319513 1258901 1203734 1154412 1109877 1068356
62592 1068356 1028922 991924 957802 926105 896254 868687 844255 822625 802260 782055 762126
62581 762126 742847 724257 706870 692029 680522 671386 662849 654031 645096 636294 627824 620330 614480
62568 614480 609892 605210 599564 593525 588502 585486 584537 585265 587601 591917 598076 604525 609070 611064 612277
62553 612277 614961 619452 624464 629461 635706 644714 656480 669769 683770 698868 715877 735063 756315
62540 756315 780038 807201 838141 871904 907553 945868 988718 1036825 1089327 1145847 1207473
62529 1207473 1274741 1345822 1418027 1490236 1562407 1633287 1700321 1761761 1817369 1866872 1909094
62518 1909094 1942865 1967556 1982261 1985546 1976611 1956051 1925261 1885907 1840122 1790068 1736815 1680481
62506 1680481 1621804 1562510 1503650 1444728 1385290 1326561 1270678 1218956 1171642 1128605 1089333
62495 1089333 1052698 1017672 984111 952436 922972 896087 872208 850955 830896 810958 791536
62484 791536 773421 756368 739844 724554 711772 701327 691628 681835 672777 665547 660341 657029 655780
62471 655780 656555 658865 662549 668030 675241 683090 690700 698585 707838 718659 730468 743150 757348
62458 757348 773677 792362 813606 837584 864103 893021 925116 961789 1003457 1048797 1096039
62447 1096039 1144505 1194341 1245154 1295803 1345504 1394223 1441481 1485143 1522018 1549790 1568293
62436 1568293 1578943 1582966 1580137 1569332 1550385 1525079 1495813 1463452 1427197 1386663 1343208 1298840
62424 1298840 1254666 1211115 1168926 1128862 1090897 1054797 1021273 991489 965489 942284 921531
62413 921531 903819 888903 875005 860739 846810 834933 825748 818747 813683 810920 810493 811645 813503
62400 813503 815842 819146 824097 830714 837918 844425 850330 857243 866484 877748 889968 902690 915848
62387 915848 928801 940611 950987 960136 967863 973544 976698 976785 972794 964002 951191 936312 920840
62374 920840 905001 888366 870450 850900 829973 808940 789411 772198 757250 744298 732846
62363 732846 721986 711288 701664 694218 688400 682554 676283 670901 667348 665135 663870 664424 667723 673425
62349 673425 680597 688712 697223 705218 712615 720843 731246 743391 755929 768296 780332 790964 799075
62336 799075 805580 812974 822272 831550 838070 840992 841544 841311 840973 840114 837652 832827 826326 820214 816321
62321 816321 814916 815344 817581 822456 830379 840663 852629 866877 884743 906623 931639 959150 989754
62308 989754 1024264 1062521 1104237 1150382 1202202 1258850 1317659 1377462 1440261 1508408 1580980
62297 1580980 1654216 1724935 1792098 1855121 1912194 1960903 1999802 2028925 2049064 2060687 2063262
62286 2063262 2055801 2038404 2012959 1981674 1945176 1902924 1855274 1804071 1751083 1696944 1642077
62275 1642077 1587666 1535011 1484551 1436289 1390635 1348113 1308459 1270757 1234510 1200154 1168417
62264 1168417 1139373 1112168 1085691 1059712 1035419 1014662 998565 986869 978228 970697 962355 952496
62252 952496 942325 933685 926913 920843 915038 910663 908377 906633 903409 898856 894729 891514 887683 881907
62238 881907 874607 866968 859588 852773 847201 843440 841215 839782 838791 838583 839965 843914 850883 859984 869327
62223 869327 877693 885575 894278 904381 915550 927432 940174 954269 970355 988944 1009897 1032334
62211 1032334 1055560 1079934 1106419 1135479 1166938 1200707 1237040 1276058 1317702 1362275 1410354
62200 1410354 1461835 1515514 1570160 1625780 1683288 1742765 1802286 1858631 1909079 1952338 1987789
62189 1987789 2014352 2030723 2036708 2033657 2023189 2005972 1982034 1951638 1915100 1872259 1823210 1769652
62177 1769652 1714613 1660578 1608436 1558256 1510284 1464923 1422612 1384148 1350412 1321233 1295128
62166 1295128 1270780 1248293 1228513 1211712 1197644 1186315 1177734 1171200 1165761 1161211 1157784 1155008
62154 1155008 1151876 1148230 1145006 1142871 1141557 1140959 1141813 1144439 1147517 1149272 1149759 1151074 1155091 1161621 1168985
62139 1168985 1175861 1182155 1188454 1195228 1202694 1211141 1221165 1233619 1249335 1268626 1290805 1314314
62127 1314314 1337786 1361061 1384816 1409082 1432632 1454321 1474660 1495478 1518103 1542470 1567970
62116 1567970 1594544 1622650 1652704 1685045 1720185 1758625 1800341 1844595 1890298 1936636 1983510
62105 1983510 2031314 2080038 2128549 2174977 2217730 2255753 2287918 2313010 2330799 2342642 2350398
62094 2350398 2354860 2355684 2352617 2346117 2336730 2324457 2309143 2291189 2271552 2251159 2230598 2210351
62082 2210351 2191134 2173949 2159815 2149326 2142223 2137357 2133315 2129385 2125829 2123147 2121286 2119947 2119532
62069 2119532 2121147 2125390 2131641 2138976 2147433 2157851 2170676 2185587 2202219 2220638 2240963 2263042
62057 2263042 2286728 2312128 2339405 2368600 2399721 2432773 2467689 2504567 2543919 2586157 2630789
62046 2630789 2676577 2722650 2769034 2816084 2863927 2912726 2962971 3015214 3069843 3127230 3187548
62035 3187548 3250270 3314441 3379731 3446599 3514993 3583410 3649772 3712979 3773432 3832643 3892636
62024 3892636 3954965 4019613 4085201 4150641 4215920 4280838 4343933 4403737 4460658 4516749 4573981
62013 4573981 4633480 4695782 4760693 4827205 4894714 4964104 5036596 5111778 5187950 5264209 5340872
62002 5340872 5417839 5493915 5567887 5638934 5705755 5766806 5821986 5872683 5919487 5961199 5996951
61991 5996951 6027969 6056044 6081312 6102905 6120946 6136384 6149308 6158920 6165173 6169320 6172802 6176500
61979 6176500 6180933 6186177 6191552 6196162 6199766 6202335 6203013 6200641 6195401 6188967 6182691 6176468 6169604 6161909
61965 6161909 6153437 6143933 6133190 6121551 6109503 6097168 6084614 6072399 6061309 6051711 6043416 6036005
61953 6036005 6029022 6022089 6015142 6008393 6001887 5995308 5988578 5982477 5978332 5976980 5978145 5980683 5983282 5984990
61939 5984990 5985382 5984434 5982306 5979128 5974806 5968884 5960638 5949453 5935135 5917866 5897970 5875676 5850777
61926 5850777 5822430 5789807 5753447 5715596 5678396 5641702 5603335 5561628 5517114 5471469 5425581
61915 5425581 5379275 5332434 5285565 5239230 5193508 5148161 5102958 5057655 5011993 4965996 4920222
61904 4920222 4875459 4832125 4790020 4748751 4708408 4669661 4633185 4599108 4567102 4536704 4507247
61893 4507247 4477762 4447601 4417416 4389055 4364057 4342386 4322888 4304810 4288479 4274556 4263057
61882 4263057 4253431 4245449 4239648 4236738 4236871 4239893 4246228 4256934 4272541 4292360 4315497 4342309 4374253
61869 4374253 4412495 4457346 4508937 4567462 4632632 4703937 4782023 4869037 4966930 5076223 5197245
61858 5197245 5331883 5482883 5651851 5839301 6046669 6276940 6533092 6817496 7133623
61849 7133623 7486870 7882137 8321200 8803918 9331689 9907972 10534973 11211169 11932637
61840 11932637 12695177 13493244 14316603 15148386 15965395 16738740 17434579 18016995 18452985
61831 18452985 18716702 18791503 18671641 18364547 17890992 17280834 16566827 15780767 14952161
61822 14952161 14106601 13263716 12437481 11639078 10878530 10163119 9495621 8875603 8302240
61813 8302240 7775031 7292332 6850721 6446426 6076843 5740291 5434625 5156542 4902265
61804 4902265 4668891 4454888 4259198 4080158 3915893 3765650 3629705 3507356 3395835
61795 3395835 3292143 3195529 3107240 3028117 2957445 2893999 2837077 2786166 2740525 2699590 2663241
61784 2663241 2631320 2603402 2579226 2558726 2541357 2526081 2512554 2501746 2494670 2490795 2488277 2485647
61772 2485647 2482857 2480988 2481539 2485803 2494090 2505184 2517017 2528378 2539909 2553214 2569078 2586865
61760 2586865 2605673 2625811 2648808 2676111 2708097 2744323 2784290 2827776 2874933 2926405 2982971
61749 2982971 3044632 3110554 3180563 3256351 3340263 3432935 3533019 3639369 3752598 3874298
61739 3874298 4005760 4148050 4302447 4469876 4650360 4843812 5051136 5273910 5513337
61730 5513337 5770343 6046626 6344811 6667583 7017423 7397533 7812372 8266734 8764514
61721 8764514 9308849 9903555 10554209 11267668 12050439 12907404 13841891 14856576 15953894
61712 15953894 17135369 18400349 19744761 21159980 22631692 24138673 25651235 27129558
61704 27129558 28523278 29773951 30820192 31603937 32077076 32208453 31989730 31437007 30587022
61695 30587022 29490360 28204737 26789065 25297872 23777047 22262447 20781258 19354258
61687 19354258 17997277 16721350 15532292 14431074 13415553 12482245 11626651 10843105
61679 10843105 10125984 9471336 8876119 8335619 7843014 7392178 6979671 6603195 6259411
61670 6259411 5944486 5655682 5391007 5148118 4925010 4721062 4535763 4366846 4211126
61661 4211126 4066700 3932828 3808246 3691577 3583110 3483975 3393392 3308827 3229165 3155496
61651 3155496 3088004 3024308 2962201 2902140 2845435 2791508 2738766 2687187 2638164 2592282 2548822
61640 2548822 2507129 2467022 2427964 2389131 2350424 2312602 2276404 2242184 2210062 2179697 2150153
61629 2150153 2120807 2092079 2064538 2037689 2010664 1983897 1959057 1937186 1917662 1899049 1880322
61618 1880322 1861332 1842798 1826000 1811897 1800365 1790573 1781878 1773981 1766464 1758863 1751041 1742891 1733858
61605 1733858 1723442 1712154 1701286 1691650 1682989 1674599 1666001 1657022 1647716 1638381 1629421 1621200 1614011
61592 1614011 1607792 1601762 1594922 1587369 1580404 1574866 1570170 1565655 1561941 1559786 1558463 1556864 1555642 1556450
61578 1556450 1559111 1561495 1562612 1564018 1567309 1571760 1575597 1578473 1581347 1584597 1587566 1589815 1591853 1594602
61564 1594602 1598612 1603651 1608698 1612540 1614695 1615463 1614998 1612908 1609068 1604093 1598544 1592338 1585490 1578698
61550 1578698 1572361 1565591 1557214 1547418 1537414 1527568 1516959 1505026 1492751 1481662 1472161 1463441 1454907
61537 1454907 1447214 1441591 1438171 1435246 1430704 1424401 1418810 1416927 1419658 1425413 1432003 1438492 1445353 1453375
61523 1453375 1462765 1473229 1484775 1498187 1514405 1533514 1554839 1578203 1604450 1634237 1666696
61512 1666696 1700004 1733255 1767373 1804205 1845042 1889767 1936884 1984297 2030509 2075288 2119216
61501 2119216 2162880 2206657 2250686 2294307 2335818 2373753 2408521 2441900 2474658 2505540 2533037
61490 2533037 2557194 2578816 2597587 2612261 2622570 2629736 2634781 2637282 2636313 2631878 2624715 2615225 2603438
61477 2603438 2589874 2575718 2562101 2549671 2538702 2529071 2520202 2511887 2505324 2502632 2505033 2512120 2523247
61464 2523247 2538823 2559610 2585482 2615954 2651751 2694861 2746861 2807833 2877066 2954330 3040425
61453 3040425 3137056 3246268 3369401 3506373 3656436 3819825 3998263 4193711 4407114 4638542
61443 4638542 4887862 5154691 5437914 5735585 6044983 6362237 6681935 6997356 7300950
61434 7300950 7584352 7838219 8052787 8219355 8331932 8388206 8389506 8339933 8245238 8112073
61424 8112073 7947667 7759456 7554592 7339677 7120766 6903245 6691475 6488600 6296891
61415 6296891 6118308 5954878 5808541 5680480 5570487 5477280 5399771 5338008 5292661 5263793
61405 5263793 5250380 5250800 5263429 5286961 5320631 5364036 5416345 5475894 5541037 5611156 5686098 5764609
61393 5764609 5843980 5921383 5995270 6065679 6133784 6201021 6268062 6334750 6401500 6470039 6541507
61382 6541507 6614156 6684483 6750784 6814110 6875532 6934245 6989132 7040355 7087954 7130190 7164938
61371 7164938 7191946 7212115 7225044 7228945 7222933 7208090 7186133 7158017 7124005 7084300 7039592 6991640
61359 6991640 6943228 6896892 6853762 6813997 6777830 6745475 6716680 6691462 6670863 6655813 6645438
61348 6645438 6637656 6631184 6625718 6620385 6613633 6604964 6595392 6585645 6575108 6563184 6550747 6539661 6531655
61335 6531655 6528229 6530951 6541282 6560797 6591986 6638005 6701045 6781634 6880157 6998385 7138890
61324 7138890 7303497 7492975 7707616 7947194 8210487 8495418 8799464 9119467 9451364
61315 9451364 9790472 10131415 10466847 10786441 11078177 11331216 11537635 11691953 11790115 11829698
61305 11829698 11811017 11737530 11614660 11447843 11241513 10999725 10727202 10429337 10111495 9778926
61295 9778926 9437190 9091846 8747549 8408075 8077248 7758849 7455181 7166710 6893929
61286 6893929 6638991 6404606 6191762 5999400 5826085 5671053 5533706 5413168 5308863
61277 5308863 5220984 5149913 5095363 5056309 5031566 5020205 5021524 5034742 5058724 5091965 5132993
61266 5132993 5180824 5234891 5294402 5357757 5422790 5487722 5551905 5615460 5678147 5738783 5795768
61255 5795768 5847837 5894223 5934694 5969864 6000967 6028565 6051734 6069165 6080674 6086703 6086572 6078591
61243 6078591 6062159 6038628 6009553 5975049 5934351 5887046 5833087 5772536 5706182 5635769 5562798
61232 5562798 5487668 5410710 5333238 5256564 5180677 5105226 5031441 4961814 4897937 4839782 4786998
61221 4786998 4739648 4697452 4659469 4625041 4594396 4567893 4545182 4525158 4506113 4485976 4463338
61210 4463338 4438583 4413376 4388936 4365612 4344196 4326380 4313218 4304045 4297798 4294872 4296921 4305304
61198 4305304 4320636 4343639 4375557 4417546 4470221 4534054 4609944 4699149 4802421 4918921 5046017
61187 5046017 5180628 5320857 5465680 5612623 5756306 5889932 6007720 6105136 6177066 6217117
61177 6217117 6219562 6181967 6106015 5996397 5859186 5700565 5525957 5339694 5145512 4947466
61167 4947466 4750233 4558218 4374273 4199436 4034073 3879055 3735629 3604397 3484941
61158 3484941 3376505 3278608 3190821 3112389 3042329 2979693 2923612 2873451 2829208 2791419 2760326
61147 2760326 2735325 2715446 2700109 2689144 2682491 2680328 2683128 2690957 2702844 2717473 2734289 2753060
61135 2753060 2772176 2788360 2798814 2803372 2804015 2802554 2799286 2793691 2785459 2774394 2759747 2740482 2716472
61122 2716472 2689120 2660413 2631376 2601724 2570958 2539346 2507391 2474757 2440403 2403949 2366332
61111 2366332 2328828 2291830 2255083 2218795 2183699 2149777 2115548 2079301 2040975 2002275 1964732
61100 1964732 1928078 1890884 1852517 1813961 1776846 1742224 1710308 1680601 1651798 1622169 1590863
61089 1590863 1558720 1527188 1496560 1465937 1434898 1404364 1375501 1348529 1323079 1299176 1277224
61078 1277224 1257369 1239605 1224387 1212472 1203937 1197793 1192851 1188829 1186432 1186404 1188603 1192125 1196384
61065 1196384 1201811 1209194 1218464 1228647 1239008 1249653 1260873 1272719 1285579 1300263 1316766 1333632
61053 1333632 1349500 1364718 1380395 1396355 1411327 1424850 1437486 1449059 1458369 1465085 1470369 1474820
61041 1474820 1477260 1476681 1474159 1471416 1468344 1463594 1457104 1450348 1444076 1437349 1429214 1420170 1411482 1403820
61027 1403820 1396917 1389886 1381577 1371341 1359773 1348182 1337131 1326106 1314716 1303458 1292950 1283143
61015 1283143 1273761 1264921 1256724 1248699 1240241 1231486 1223280 1216380 1210893 1206324 1201974 1197468 1193093 1189489
61001 1189489 1187068 1185977 1186488 1188779 1192242 1195786 1199216 1203732 1210511 1219192 1228269 1236631 1244154 1251008
60987 1251008 1257141 1262687 1268540 1276236 1287038 1300913 1316397 1331755 1346326 1360477 1374473 1388258
60975 1388258 1402618 1419605 1440924 1466215 1493677 1522149 1551873 1583305 1616059 1649348 1683039
60964 1683039 1717934 1755118 1795041 1837126 1880327 1924234 1969547 2017361 2068314 2122769 2181553
60953 2181553 2245914 2316598 2393369 2475627 2563347 2657310 2758603 2868011 2985920 3112678
60943 3112678 3248823 3394812 3550842 3717478 3896400 4089966 4299995 4527641 4774608
60934 4774608 5043688 5337731 5659003 6010493 6397497 6827378 7308328 7849114 8459552
60925 8459552 9150213 9932018 10817045 11819498 12955006 14239450 15689802 17325997 19170593
60916 19170593 21246007 23570491 26149158 28954605 31902914 34844600 37586115 39936215
60908 39936215 41755745 42993359 43700224 44018061 44134462 44213138 44328585 44438702 44406216
60899 44406216 44051823 43213883 41798208 39808418 37347264 34585246 31709565 28878409
60891 28878409 26198366 23724613 21473195 19437153 17602147 15956541 14492081 13198356
60883 13198356 12059332 11055879 10170220 9387133 8692436 8072504 7515714 7013464 6559310
60874 6559310 6147530 5772706 5430182 5116357 4828398 4563737 4319766 4093950 3884194
60865 3884194 3689124 3507856 3339288 3181608 3032769 2891687 2758790 2634987 2520177
60856 2520177 2413141 2312788 2218816 2131012 2048721 1971574 1900100 1834785 1774833 1718652 1665431
60845 1665431 1615533 1569498 1527371 1488913 1453656 1420708 1389266 1359518 1332344 1308058 1286114
60834 1286114 1266032 1247739 1230920 1215172 1201143 1190361 1183258 1178401 1174472 1171971 1171837 1173258 1174400
60821 1174400 1174880 1175926 1178029 1179985 1180664 1180466 1180228 1179657 1177818 1174723 1171526 1169287 1168136 1167643 1167445 1167264
60805 1167264 1166521 1164174 1159235 1151815 1143693 1137381 1134163 1133092 1132047 1129667 1126217 1123038 1121647 1123106
60791 1123106 1127537 1133935 1140945 1148236 1156994 1168660 1183255 1199346 1215765 1232855 1251653 1272129
60779 1272129 1292853 1312393 1330434 1347275 1362839 1376845 1389666 1402244 1415024 1427562 1439435
60768 1439435 1450998 1462792 1474525 1485197 1494168 1501627 1508000 1513333 1517429 1520284 1522140 1523267 1523910
60755 1523910 1524294 1524502 1524383 1523681 1522159 1519494 1515290 1509373 1501964 1493391 1483782 1473203 1461852 1449831
60741 1449831 1437060 1423866 1411310 1400068 1389043 1376087 1360579 1344586 1330862 1320319 1312060
60730 1312060 1305294 1300136 1296769 1294942 1294610 1296297 1300389 1306477 1313653 1321182 1328876 1337198 1347138 1359608
60716 1359608 1374801 1392345 1411811 1432546 1453319 1473190 1492884 1514245 1537798 1561694 1583687
60705 1583687 1603415 1621901 1639518 1655528 1669305 1680869 1690279 1697453 1702788 1707164 1711141 1714716
60693 1714716 1717936 1721022 1723754 1725428 1725755 1725230 1724452 1723642 1723007 1722752 1722415 1720986 1718170 1714736 1711027 1705944
60677 1705944 1698374 1688962 1679387 1670387 1661727 1653676 1646862 1640543 1632755 1622907 1612899 1604703 1597968 1591091
60663 1591091 1583774 1577174 1572105 1568443 1566028 1564809 1564176 1563443 1563053 1564028 1566016 1567271 1567011 1566478 1566929 1567751
60647 1567751 1567510 1565795 1562808 1558018 1550788 1542084 1534008 1527409 1521027 1513387 1504673 1496315 1489412 1484050
60633 1484050 1479749 1476061 1472723 1469464 1465730 1460820 1454343 1446250 1436356 1424428 1411135 1398200 1386700
60620 1386700 1375596 1362876 1347942 1331909 1315812 1299721 1283739 1268594 1254755 1241944 1230071
60609 1230071 1219808 1211716 1205614 1201357 1199358 1199563 1200704 1201495 1202050 1203119 1204363 1204568 1203515 1202597 1203342
60594 1203342 1206037 1210042 1214781 1219996 1225413 1230553 1234876 1238076 1240389 1242543 1245091 1247721 1249548 1250240
60580 1250240 1250723 1252478 1256166 1261096 1266157 1271133 1276874 1284237 1293371 1304163 1316740 1330890 1345487
60567 1345487 1359446 1373136 1387911 1404348 1421998 1440984 1462382 1486387 1511378 1535812 1560080
60556 1560080 1585272 1610938 1635542 1658750 1681742 1705237 1728470 1750241 1769774 1786294 1798980
60545 1798980 1807845 1813668 1816477 1814976 1808190 1796904 1782664 1765923 1746066 1722957 1697660 1671646
60533 1671646 1646031 1621569 1598837 1578197 1559916 1544305 1531405 1520498 1510412 1500570 1491512 1484214
60521 1484214 1479042 1475510 1472851 1470494 1467991 1464786 1460379 1454790 1448818 1443753 1440657 1439739 1440309 1441485
60507 1441485 1443067 1445735 1450283 1456699 1464150 1471813 1479540 1487687 1496595 1506362 1516927 1528188 1540063
60494 1540063 1552517 1565418 1578318 1590582 1601966 1612977 1624552 1637415 1651868 1668084 1686376
60483 1686376 1707083 1730277 1755818 1783860 1815257 1851113 1891766 1936494 1984347 2034597 2085677
60472 2085677 2134086 2175500 2207257 2229064 2241189 2243088 2234437 2216706 2192768 2165304 2136371 2108037
60460 2108037 2082409 2060835 2043771 2031532 2024745 2024012 2029636 2041664 2059656 2082262 2107557 2134136
60448 2134136 2161787 2191178 2223346 2259644 2301681 2350807 2407664 2472474 2545785 2628786 2722906
60437 2722906 2829426 2949825 3086347 3241577 3417006 3612384 3827010 4061476 4317417
60428 4317417 4595692 4895696 5216714 5559242 5924657 6314090 6727321 7160883 7605431
60419 7605431 8044660 8457210 8819692 9108702 9302713 9385361 9348744 9194299 8931546 8576786
60409 8576786 8151898 7681819 7190904 6699804 6223603 5771101 5345914 4949367 4582838
60400 4582838 4247391 3942341 3665728 3416173 3193011 2994430 2816702 2655882 2509732
60391 2509732 2377737 2259819 2155186 2061901 1977370 1899629 1828148 1763111 1704411 1651904 1605898
60380 1605898 1566088 1530367 1496064 1462448 1430713 1401488 1373880 1347221 1322131 1299129 1277583
60369 1277583 1256949 1237822 1220624 1204238 1187189 1169684 1153544 1140489 1131185 1125264 1121400 1117864
60357 1117864 1114000 1110829 1109473 1109437 1109237 1108316 1107429 1107443 1108685 1111304 1115345 1120383 1125680 1130706 1135183 1138976
60341 1138976 1142531 1146881 1152386 1157949 1162566 1167378 1174687 1184745 1194953 1203008 1209681 1217297 1226126
60328 1226126 1233737 1238081 1239987 1241932 1245054 1248343 1250565 1251892 1253145 1254170 1253792 1251199 1246767 1241571
60314 1241571 1236699 1232943 1230413 1228284 1225567 1222415 1220121 1219547 1220153 1220914 1221698 1223250 1226143 1230121 1234261
60299 1234261 1237614 1240030 1242508 1246376 1252005 1258817 1266475 1275213 1284751 1294043 1302711 1311858 1322609 1334629
60285 1334629 1347041 1360004 1374050 1388257 1400543 1409928 1417353 1423955 1429550 1433286 1435056 1435624 1435674
60272 1435674 1435215 1433942 1432062 1430723 1431321 1434085 1437691 1440760 1443454 1446901 1451186 1454792 1456308 1455985 1455097
60257 1455097 1454146 1452175 1447844 1440922 1432643 1424636 1417626 1411323 1405447 1400363 1396556 1394029 1392599 1392317
60243 1392317 1392941 1393423 1392793 1391626 1391887 1395011 1400415 1406039 1410142 1412620 1414939 1418720 1424147 1429867 1434727
60228 1434727 1439243 1444736 1451263 1457300 1461712 1465349 1470206 1477403 1486417 1496078 1505788 1515612 1525440 1534497
60214 1534497 1542024 1548394 1555065 1563230 1572881 1583669 1596256 1612029 1631326 1652573 1673683 1694276
60202 1694276 1716217 1741829 1771677 1804446 1839175 1877128 1920715 1970704 2025523 2083664 2145824
60191 2145824 2213930 2288848 2370010 2456869 2549673 2649129 2756297 2872739 2999643 3136565
60181 3136565 3281758 3433932 3592940 3758579 3929511 4103721 4279326 4454385 4626300
60172 4626300 4791932 4948270 5092905 5224120 5340665 5441186 5523876 5587121 5630853 5657100
60162 5657100 5668909 5668590 5656916 5634101 5601681 5563409 5523887 5486260 5451731 5421402 5397783 5383863
60150 5383863 5381382 5390819 5412726 5448252 5498647 5565035 5648393 5748886 5865298 5995803 6138947
60139 6138947 6292963 6454467 6618998 6782792 6942875 7095400 7235347 7358468 7462710
60130 7462710 7547346 7611554 7654235 7674366 7671078 7644083 7594421 7524314 7436341 7333692 7221261
60119 7221261 7105136 6990326 6879846 6776324 6683227 6603695 6539309 6491079 6460828 6450426
60109 6450426 6460206 6489114 6535998 6599762 6678580 6769868 6870882 6978748 7090228 7202085 7311300
60098 7311300 7414386 7507117 7585871 7648936 7695893 7726450 7741035 7742125 7733717 7719532 7702763
60087 7702763 7687336 7677974 7678648 7691936 7720143 7766038 7832124 7920250 8032464 8171336 8338653
60076 8338653 8534501 8758458 9011271 9294661 9609920 9957543 10337850 10750769 11194611
60067 11194611 11665771 12159945 12673054 13200425 13735502 14270013 14795369 15303492 15786547
60058 15786547 16236665 16646241 17007956 17314314 17558055 17734005 17840398 17877696 17846220 17745674
60048 17745674 17577000 17343929 17052674 16711085 16328556 15915756 15483483 15041861 14600860
60039 14600860 14170739 13760927 13378564 13028810 12716308 12445426 12218963 12037450 11900105
60030 11900105 11806038 11754099 11741850 11765122 11818615 11896651 11993215 12101449 12213600 12321935
60020 12321935 12419780 12501537 12562032 12596572 12601921 12576810 12521383 12436601 12324283 12186880 12026514
60009 12026514 11844594 11642767 11423685 11190224 10944644 10689607 10429772 10171219 9918976
60000 9918976 9675828 9443770 9225918 9026464 8849094 8695742 8566704 8461772 8381434 8327069
59990 8327069 8299877 8299775 8325552 8375799 8449247 8544322 8658883 8790246 8934839 9087773 9243373
59979 9243373 9396231 9541409 9673800 9788269 9880706 9948247 9988259 9998040 9976140 9923349 9841681
59968 9841681 9732934 9599069 9443507 9270976 9086088 8892972 8696395 8502259 8316360
59959 8316360 8143025 7985120 7844763 7723572 7622730 7543374 7486762 7453711 7444305 7458737
59949 7458737 7498096 7563598 7655207 7771833 7912804 8078026 8266151 8473454 8695367 8928478
59939 8928478 9169842 9414358 9654086 9880860 10089107 10275520 10436468 10566799 10661686 10719191
59929 10719191 10740419 10727219 10680440 10600615 10489607 10350706 10187574 10004457 9807791 9606406
59919 9606406 9409106 9222286 9050147 8896125 8762972 8652107 8564323 8501152 8464420 8454503
59909 8454503 8470170 8510259 8574348 8661475 8769336 8895113 9035861 9187457 9344468 9502394
59899 9502394 9659405 9814766 9965908 10108252 10238005 10354313 10458547 10552097 10635231 10707865
59889 10707865 10771170 10828319 10883642 10941384 11005599 11080740 11171299 11280835 11412374 11570008
59879 11570008 11758985 11983651 12246335 12548823 12893537 13281855 13711785 14178485 14676522
59870 14676522 15200363 15742838 16294152 16842265 17373244 17871304 18319420 18700362 18997495
59861 18997495 19196430 19288076 19270590 19147755 18926016 18614115 18224751 17774360 17280476 16759833
59851 16759833 16228175 15699457 15184345 14690714 14226079 13798099 13412177 13070265 12773201
59842 12773201 12522963 12321545 12168927 12063707 12004866 11991244 12019671 12085253 12183608 12311516
59832 12311516 12465193 12638882 12825219 13015850 13201206 13370487 13512616 13617255 13675236
59823 13675236 13679064 13623776 13507350 13330264 13095091 12806711 12472474 12101603 11704189 11290308
59813 11290308 10869261 10448857 10035146 9632829 9245976 8878442 8533794 8214811 7922808
59804 7922808 7657267 7416371 7198283 7002127 6827691 6674091 6538728 6417738 6307587
59795 6307587 6206280 6112987 6026644 5945180 5866262 5788768 5713425 5642015 5575938 5515579 5460828
59784 5460828 5411738 5368177 5328944 5291908 5255340 5218635 5181244 5141287 5096081 5044277 4987118
59773 4987118 4927320 4866911 4806237 4744963 4684067 4626809 4577336 4537962 4508009 4485663 4470632
59762 4470632 4464400 4468164 4481372 4502391 4529802 4562768 4600856 4644125 4693176 4748753 4811408 4881595
59750 4881595 4959539 5044575 5134626 5226446 5316462 5401808 5481216 5554947 5623303 5685214 5739019
59739 5739019 5784721 5824526 5860715 5893961 5924560 5954629 5987972 6028026 6076852 6135968 6207152
59728 6207152 6292398 6394096 6515544 6660315 6830482 7026187 7247700 7497412 7778892 8094151
59718 8094151 8442676 8823098 9234610 9675933 10143145 10628659 11121166 11604976 12059148
59709 12059148 12458587 12777881 12996033 13100259 13088470 12969997 12763376 12491436 12176600
59700 12176600 11838818 11495285 11159784 10841915 10547939 10282823 10051009 9855206 9695408
59691 9695408 9569924 9477340 9417333 9390014 9395094 9431747 9499060 9596392 9723288 9879286 10064183
59680 10064183 10278580 10523744 10800703 11109870 11451940 11828792 12243094 12697296 13193336
59671 13193336 13732847 14316994 14946514 15622631 16347571 17123312 17949947 18825839 19748718
59662 19748718 20715263 21719649 22753579 23807610 24871230 25931928 26976367 27993776
59654 27993776 28977748 29925007 30834645 31709946 32559469 33394263 34223783 35054747 35892473
59645 35892473 36741065 37601698 38471122 39341253 40199078 41027173 41805804 42515741 43139884
59636 43139884 43663889 44077277 44374931 44557603 44631338 44607045 44500380 44331088 44121694 43896228
59626 43896228 43678759 43491403 43352720 43277832 43279880 43371107 43562808 43864573 44283313 44822516
59616 44822516 45482244 46259637 47148836 48140046 49218767 50365588 51555556 52756943 53931000
59607 53931000 55033249 56014918 56824344 57410641 57730327 57753401 57465846 56869966 55984815
59598 55984815 54845106 53496266 51987874 50369616 48689675 46992255 45313991 43682054
59590 43682054 42114496 40620453 39199554 37842355 36532190 35247243 33963555 32660617
59582 32660617 31327421 29964319 28580202 27189180 25808967 24458630 23154725 21909011
59574 21909011 20729590 19622445 18590559 17632750 16745266 15924790 15169358 14476980 13844566
59565 13844566 13268238 12743890 12267287 11834097 11440062 11081352 10755198 10460214 10195316
59556 10195316 9957822 9743150 9546896 9366662 9201181 9048092 8903333 8762673 8623178
59547 8623178 8483121 8341004 8195108 8044179 7888509 7730008 7570787 7411785 7253205
59538 7253205 7096011 6942272 6794109 6653144 6520953 6398942 6287429 6185904 6094675 6015280
59528 6015280 5948629 5893791 5849460 5815716 5793235 5781474 5778815 5784118 5796975 5816775 5842702 5874639
59516 5874639 5913022 5957571 6006910 6059536 6114559 6171626 6230949 6293590 6361169 6435211 6517126
59505 6517126 6608555 6710998 6825180 6951475 7090850 7244755 7414229 7599983 7803286 8025842
59495 8025842 8268624 8531710 8815424 9120647 9447608 9795254 10162420 10548723 10953356
59486 10953356 11373389 11804127 12240979 12680141 13117478 13547626 13964865 14364712 14744226
59477 14744226 15100761 15430879 15730819 15997938 16231302 16431140 16598639 16736690 16850127
59468 16850127 16944295 17023465 17091235 17152276 17212867 17279560 17357669 17450621 17559608 17683346 17818480
59457 17818480 17960092 18101141 18231543 18338982 18411296 18437933 18409591 18318107 18157720 17925953
59447 17925953 17622918 17250817 16815060 16325137 15793226 15231891 14653218 14068888 13489414
59438 13489414 12923201 12377022 11856990 11367982 10912499 10491581 10107055 9761613 9456256
59429 9456256 9188831 8955868 8755152 8585918 8447424 8338399 8257629 8204274 8177733 8177728 8204526
59418 8204526 8258551 8339832 8447977 8582417 8742417 8927193 9136296 9369264 9624345 9898077
59408 9898077 10186928 10488753 10801365 11119613 11435016 11738481 12022180 12278247 12497098
59399 12497098 12668576 12784599 12840002 12831569 12757922 12620715 12424847 12176847 11883359 11551234
59389 11551234 11188189 10802683 10403355 9998624 9596069 9201448 8818467 8449758 8097804
59380 8097804 7764746 7451928 7160129 6889800 6640561 6411023 6199908 6007089 5832843
59371 5832843 5676459 5536534 5412390 5304082 5210953 5131237 5063388 5006811 4960885 4924364
59361 4924364 4896478 4877767 4868974 4869555 4878002 4893196 4914826 4943009 4978205 5020982 5070994 5126371
59349 5126371 5184681 5244029 5302708 5358901 5412409 5466497 5526611 5596969 5679311 5774691 5884825
59338 5884825 6011024 6152910 6308824 6476773 6654869 6842320 7041041 7255625 7491132
59329 7491132 7751474 8040172 8361132 8717468 9110494 9541238 10012396 10527526 11088534
59320 11088534 11695055 12345978 13040373 13776731 14551945 15360627 16194225 17040672 17885891
59311 17885891 18716151 19519118 20283720 21000694 21663532 22268180 22811918 23293520 23714111
59302 23714111 24076179 24381071 24628258 24817093 24947829 25020153 25031833 24979787 24861892 24677281
59292 24677281 24425953 24109477 23732009 23299908 22820407 22300814 21748252 21169214 20569129
59283 20569129 19952308 19321729 18678760 18024143 17360309 16692517 16027312 15370270 14725673
59274 14725673 14097523 13489636 12904926 12345652 11814598 11315309 10850714 10421733 10027252
59265 10027252 9665309 9334426 9033919 8762988 8519793 8302118 8109019 7940828 7797068
59256 7797068 7675252 7572603 7488151 7422002 7373062 7338949 7318214 7311371 7319179 7340724 7373716
59245 7373716 7416203 7467613 7528518 7599639 7680706 7769854 7864147 7960903 8058738 8157531 8257363
59234 8257363 8357104 8453983 8545084 8629567 8708872 8784539 8856721 8925326 8991564 9057289 9123811
59223 9123811 9192850 9267948 9352903 9448792 9554238 9668783 9794003 9930636 10076539 10228613
59213 10228613 10385014 10543753 10700309 10848599 10983674 11101475 11196208 11260443 11289017 11281762
59203 11281762 11241719 11171867 11074890 10955323 10820064 10676141 10528654 10381252 10237834 10102878
59193 10102878 9980198 9871971 9778982 9701198 9637856 9587617 9549341 9522680 9507616 9503454 9508392
59182 9508392 9519923 9535739 9554862 9578334 9608419 9646765 9693818 9750416 9819152 9903302 10005130
59171 10005130 10126508 10270776 10442427 10644814 10879414 11147387 11450159 11787681 12157275
59162 12157275 12554866 12976096 13415044 13862556 14306679 14733906 15129071 15475308 15756381
59153 15756381 15959737 16076743 16100439 16024764 15846812 15569470 15201492 14755364 14245154 13685611
59143 13685611 13092074 12479920 11863075 11252677 10657447 10085050 9542125 9032645 8557266
59134 8557266 8115104 7705680 7328662 6982780 6666298 6378100 6117122 5880986 5666450
59125 5666450 5471265 5294516 5134995 4990439 4858797 4739372 4632124 4536412 4450969 4374713
59115 4374713 4307147 4248119 4197360 4154142 4117486 4086991 4063347 4047568 4039828 4039428 4045639 4057908
59103 4057908 4075430 4097476 4124398 4157586 4198145 4246081 4300861 4362078 4429300 4501902 4579514
59092 4579514 4662330 4750818 4845355 4946038 5052246 5162402 5274908 5389409 5506357 5625218
59082 5625218 5744055 5861109 5975684 6086905 6192698 6290956 6380900 6462280 6533913 6594320
59072 6594320 6643557 6683276 6715009 6739456 6757625 6771722 6784524 6798482 6815580 6837394 6864909
59061 6864909 6898869 6940825 6993672 7060833 7144875 7246747 7365959 7501466 7652860 7820954
59051 7820954 8006993 8211225 8432563 8669651 8921745 9188061 9466354 9752286 10040116
59042 10040116 10323906 10598153 10857271 11094399 11300985 11468120 11588704 11658487 11675565 11639832
59032 11639832 11553300 11420301 11246478 11037431 10798679 10536706 10259044 9972417 9680686
59023 9680686 9384969 9085918 8785528 8486655 8191402 7900809 7615826 7337434 7065464
59014 7065464 6798510 6536127 6280480 6034587 5799270 5573121 5355469 5147817 4951849
59005 4951849 4767413 4593316 4428993 4274287 4128514 3991095 3862606 3743908 3634487
58996 3634487 3532787 3437838 3349292 3266099 3186845 3111633 3041992 2978213 2918096 2859138 2800866
58985 2800866 2744120 2689197 2635959 2584908 2536678 2490735 2445826 2401639 2359049 2318934 2281807
58974 2281807 2248438 2219558 2194702 2172416 2152014 2134307 2120258 2109671 2101653 2095681 2091675 2089510
58962 2089510 2088956 2089800 2091650 2093896 2096092 2098071 2099641 2100584 2101125 2101894 2103254 2105212 2108159 2112992 2120042
58947 2120042 2128458 2137176 2146003 2155252 2164777 2174067 2183050 2192243 2202322 2213957 2227711 2243377 2259605
58934 2259605 2274868 2288882 2302643 2317121 2332426 2348265 2364677 2382179 2401512 2423171 2446704
58923 2446704 2470452 2492663 2513271 2534266 2557858 2584345 2612068 2639469 2666933 2696414 2729378
58912 2729378 2765373 2802737 2840381 2878596 2918425 2960890 3006878 3056980 3110929 3167598 3226040
58901 3226040 3286307 3348882 3413665 3480040 3547765 3617207 3688696 3762108 3837189 3914099 3993644
58890 3993644 4077138 4165882 4260518 4361009 4467441 4580576 4701479 4830977 4969824 5118906
58880 5118906 5278744 5449148 5630017 5822352 6027935 6248271 6484458 6737784 7009608
58871 7009608 7300724 7611681 7943889 8299851 8682312 9093808 9536966 10014320 10527697
58862 10527697 11078530 11668927 12301495 12977914 13698650 14464424 15276776 16136340 17041272
58853 17041272 17987987 18972420 19989181 21029650 22081662 23130555 24159306 25147671
58845 25147671 26072388 26908867 27632851 28221506 28654994 28918571 29003772 28908354 28636163 28197357
58835 28197357 27607875 26887879 26060340 25150091 24182220 23179597 22161424 21143969 20141853
58826 20141853 19167723 18230650 17335484 16484259 15678490 14920382 14211946 13552928 12939972
58817 12939972 12368469 11835271 11339000 10877781 10447894 10045390 9668069 9314761 8983504
58808 8983504 8672085 8380139 8108862 7858206 7626075 7411057 7214163 7036216 6874806
58799 6874806 6726060 6589093 6466471 6359901 6267474 6186093 6114896 6054749 6005495 5965736
58789 5965736 5935230 5915812 5909435 5916218 5934874 5964345 6004603 6056344 6120392 6197044 6285761 6385811
58777 6385811 6497474 6622251 6761648 6916186 7085933 7271516 7473849 7693102 7928779
58768 7928779 8181052 8451461 8742016 9054281 9389947 9751861 10143575 10567716 11025410
58759 11025410 11517531 12045967 12613459 13222914 13877391 14579917 15332043 16132432 16977661
58750 16977661 17864439 18789988 19749566 20734100 21730624 22724346 23699325 24637174 25515850
58741 25515850 26310257 26994492 27544600 27940835 28168823 28219848 28091074 27786095 27315254
58732 27315254 26695079 25946968 25095317 24165025 23179174 22158335 21121480 20086332 19067778
58723 19067778 18076133 17117776 16197640 15320598 14490568 13709108 12975467 12287762 11643916
58714 11643916 11041780 10478925 9952707 9460646 9000660 8570753 8168498 7791228 7436928
58705 7436928 7104748 6794309 6504705 6234441 5982150 5746969 5528242 5325150 5136713
58696 5136713 4961966 4800061 4650176 4511283 4382083 4261498 4149231 4045509 3950195 3862571
58686 3862571 3781910 3707605 3638546 3573236 3511008 3452373 3397568 3345527 3295219 3247332 3203360
58675 3203360 3163248 3125044 3086895 3048357 3009709 2971100 2932732 2894959 2857669 2820146 2781889
58664 2781889 2743026 2703590 2662942 2620344 2575744 2529780 2483259 2436706 2389955 2342193 2292996
58653 2292996 2243514 2195986 2151705 2109928 2069169 2029159 1991126 1956334 1924659 1894586 1864571
58642 1864571 1834535 1805853 1779568 1754872 1730057 1704925 1681430 1661543 1644976 1629403 1612589
58631 1612589 1594046 1575017 1557283 1541848 1528506 1516529 1505546 1495585 1486753 1479483 1474860 1473806
58619 1473806 1475811 1479184 1482720 1486430 1490274 1492889 1492273 1487657 1480491 1473586 1469033 1466532 1463861 1459341
58605 1459341 1453585 1448359 1444266 1440673 1437577 1436054 1436510 1437803 1438748 1439431 1440357 1441345 1442267 1444254 1449166
58590 1449166 1458043 1470532 1485397 1501272 1517614 1535482 1556758 1581990 1609719 1638551 1669124
58579 1669124 1703123 1741027 1781839 1824687 1869769 1918008 1970662 2028942 2093120 2162156 2235022
58568 2235022 2312255 2395660 2486926 2587378 2698480 2821251 2955303 3099777 3255437 3424622
58558 3424622 3608877 3807806 4020747 4248329 4491355 4748904 5018579 5298110 5585551
58549 5585551 5877746 6169404 6453799 6723617 6970651 7185185 7356736 7476223 7538087 7540954
58539 7540954 7486812 7379732 7225236 7030424 6804046 6555612 6293779 6025347 5755715 5489905
58529 5489905 5232551 4986887 4754403 4535836 4332094 4143989 3971644 3814734 3672904
58520 3672904 3545442 3431047 3328511 3237090 3155387 3080575 3010063 2943684 2882807 2827216 2774352
58509 2774352 2721955 2670102 2620006 2572101 2526081 2481703 2438554 2395722 2352528 2309028 2265302
58498 2265302 2221100 2176754 2133283 2090698 2047316 2002072 1956720 1914242 1875501 1838891 1803145
58487 1803145 1769035 1738088 1710682 1685862 1662397 1639778 1618552 1599668 1583092 1567275 1550447
58476 1550447 1532280 1513860 1496375 1480379 1465951 1452943 1441196 1430998 1422994 1417245 1412739 1408255
58464 1408255 1403153 1396893 1388751 1378991 1369535 1362101 1355845 1347978 1336700 1322794 1308540 1295889 1285324
58451 1285324 1275582 1264685 1252108 1239575 1228893 1219561 1209740 1199125 1189326 1181449 1174820 1168281 1161448
58438 1161448 1154342 1147038 1140148 1134686 1131009 1128663 1127311 1126794 1126174 1124014 1120108 1115839 1112295 1108997
58424 1108997 1105004 1100219 1095015 1089612 1084628 1081275 1079986 1079391 1077614 1074303 1070758 1068472 1068097 1069361
58410 1069361 1071294 1072898 1074150 1075952 1078543 1080573 1080716 1079766 1079978 1082353 1085690 1088617 1091515 1095625 1101008
58395 1101008 1106472 1111395 1116531 1122545 1128487 1132482 1133665 1132744 1130745 1127970 1124228 1119246 1112527 1103645
58381 1103645 1093272 1083305 1075132 1068171 1060814 1052522 1044164 1036508 1029367 1022383 1015823 1010180 1005537 1001779
58367 1001779 999059 997566 996959 996501 995917 995856 997146 999654 1002389 1004864 1007732 1011557 1015708 1019487 1023841
58352 1023841 1030439 1039099 1047723 1055156 1062520 1071080 1080455 1090131 1101208 1114900 1130155 1144451 1156596
58339 1156596 1167394 1177920 1188389 1198432 1207278 1213905 1218246 1222096 1227692 1235262 1242678 1247421 1248414
58326 1248414 1246576 1244337 1244067 1246114 1248818 1250984 1253312 1256676 1260390 1263482 1266385 1269629 1272057 1272452
58312 1272452 1272084 1273344 1276362 1279271 1281595 1284915 1289986 1295470 1300094 1304279 1309086 1315021 1322152 1329973
58298 1329973 1337004 1342029 1345816 1350191 1355503 1360621 1365197 1369979 1374939 1379218 1383131 1388075 1394092 1399445
58284 1399445 1403072 1405543 1407403 1408801 1411116 1416431 1424524 1432654 1439404 1446527 1455780 1466141 1475780 1485064
58270 1485064 1495861 1509070 1524267 1540682 1557297 1572995 1587794 1603075 1619794 1637403 1655244
58259 1655244 1673845 1693991 1715474 1737429 1759121 1780061 1800464 1821740 1845192 1870056 1894250
58248 1894250 1917214 1940314 1964365 1988762 2013408 2039394 2067164 2095964 2125588 2156617 2188513
58237 2188513 2219819 2250784 2283152 2316583 2348173 2376902 2405756 2437696 2471991 2506573 2541853
58226 2541853 2579957 2621714 2666302 2712639 2759695 2806808 2855046 2906944 2963898 3025241 3090475
58215 3090475 3160322 3234707 3311898 3390723 3471589 3554716 3639927 3728858 3824159 3925306 4028583
58204 4028583 4132767 4241339 4357193 4478831 4604252 4734999 4873247 5018103 5168134
58195 5168134 5324837 5490166 5663129 5842206 6029010 6226282 6434235 6651914 6880060
58186 6880060 7119576 7369313 7628571 7899966 8186912 8490273 8810104 9148236 9506149
58177 9506149 9882791 10277769 10694447 11137009 11607148 12106780 12641069 13215128 13830345
58168 13830345 14487380 15189951 15942123 16745043 17600298 18513592 19491228 20535957 21650020
58159 21650020 22839002 24109163 25465237 26915350 28474106 30156583 31974057 33940437
58151 33940437 36077688 38409386 40954177 43731794 46771370 50110827 53798010 57900904
58143 57900904 62508565 67712299 73593153 80238355 87765699 96328440 106110413 117321935
58135 117321935 130169637 144791175 161214054 179394195 199308952 221063101 245009489
58128 245009489 271796143 302067146 335661296 370706654 403425691 429097080 443706052
58121 443706052 445293529 434353482 413333000 385675924 354833044 323536827 293511080
58114 293511080 265585638 240002667 216706205 195546952 176409015 159245970 144031242
58107 144031242 130694265 119110320 109130154 100600546 93372157 87314807 82326527 78314311
58099 78314311 75170658 72785765 71084101 70037064 69633317 69827092 70481253 71317260 71911256
58090 71911256 71780810 70544786 68066453 64492344 60172908 55522473 50895074 46523774
58082 46523774 42523203 38922608 35700058 32810997 30212188 27873514 25772944 23886970
58074 23886970 22190832 20664475 19292001 18056100 16937710 15920408 14991107 14137367
58066 14137367 13348113 12616477 11938251 11308003 10719792 10170556 9659124 9182483 8736440
58057 8736440 8319364 7931758 7572287 7237205 6923361 6628734 6350254 6084063 5827997
58048 5827997 5581408 5342859 5110676 4885647 4670714 4467980 4278093 4102030 3940737
58039 3940737 3792824 3654930 3524760 3402208 3287711 3181375 3083474 2993808 2910495 2830978
58029 2830978 2754267 2680888 2611028 2544123 2479759 2417436 2356016 2294884 2235109 2177869 2122425
58018 2122425 2067305 2012820 1960575 1911008 1863161 1816464 1771115 1727189 1685100 1646412 1612380
58007 1612380 1582023 1553303 1525861 1500913 1478899 1459067 1441205 1426069 1414062 1404780 1397592 1391398
57995 1391398 1384313 1375109 1364709 1354920 1346161 1337727 1329589 1322293 1315716 1309590 1304642 1301378 1298275 1293270
57981 1293270 1286798 1281329 1277873 1274897 1270881 1266159 1261955 1259205 1258675 1260724 1264452 1268115 1270659 1272026
57967 1272026 1272212 1271187 1269471 1267458 1264232 1258326 1249593 1239187 1227977 1216256 1204740 1194358 1185054
57954 1185054 1176097 1167510 1159839 1152620 1144494 1135042 1125288 1116258 1108060 1100325 1092547 1083993 1074231 1063674
57940 1063674 1052952 1042270 1032202 1024242 1019259 1016072 1012884 1009406 1006158 1002552 997487 991244 984961
57927 984961 978868 972923 968567 967631 969850 973558 978241 984036 989256 991484 991221 991408 992822 992946 990244
57912 990244 986553 983811 981084 976585 970508 964104 957814 951986 947645 944701 940902 934442 926381 918816
57898 918816 911927 904643 897076 890288 884349 878501 872776 867836 863652 859839 856919 855724 855816 855971 856009
57883 856009 856770 858356 859834 860844 862100 863909 865260 865039 863436 861531 859937 858343 856195 853276 849551
57868 849551 844824 839046 832935 827680 823619 819627 814531 808736 803633 799640 795985 792461 790273 790832
57854 790832 794630 801472 810594 820134 827843 833215 838068 844156 851090 857492 863375 870072 878171 886608
57840 886608 893813 898915 901838 902946 902916 902550 902341 902029 900576 896876 890774 883184 874912 865858 856012
57825 856012 846505 838407 830896 822247 812731 804782 799763 796223 792209 787816 784334 782154 780907 780762
57811 780762 782178 784940 788649 793652 800351 808065 815660 822861 829856 836127 841009 845194 850273 856570
57797 856570 862487 866244 867424 866630 864484 861435 857973 854398 850387 845024 837442 827647 816721 805994
57783 805994 796024 786668 777932 770061 762816 755626 748781 743405 739683 735990 730628 723751 716777 710491
57769 710491 704520 698138 690828 682470 673685 665444 657673 648930 638339 627055 616723 607192 597213
57756 597213 586942 578077 571387 565649 559547 553458 548661 545657 544013 543299 543382 543926 544234 543942 543785 545300
57740 545300 549295 554648 559293 562669 566581 573154 582458 592635 601709 608673 613549 617475 622249 628597
57726 628597 634872 638460 638537 636749 635232 634731 634598 633823 631902 629247 626792 624743 621968 617308 611307
57711 611307 605860 602229 600167 598874 597905 597005 595843 594250 592378 590666 589990 591412 594929 598656 600256
57696 600256 599311 597573 596845 597364 598258 598760 598851 599428 601901 606907 613453 620042 626527 633880 642277 650628
57680 650628 658255 665733 673586 681260 688133 694627 701525 708829 716068 723252 730872 739355 749003 760086
57666 760086 772472 785516 798703 812070 825815 840007 854975 871339 889243 908149 927722
57655 927722 948311 970161 992915 1016511 1041790 1069430 1098891 1129237 1160520 1193477 1228404
57644 1228404 1265334 1304983 1348292 1395101 1444415 1496237 1552141 1613716 1681319 1754811 1834786
57633 1834786 1922464 2018884 2124766 2240707 2366990 2503564 2650860 2810330 2983497 3170634
57623 3170634 3371174 3585349 3814303 4057900 4313119 4575285 4840290 5104515 5362901
57614 5362901 5608442 5833980 6033608 6202285 6335742 6432052 6492184 6517118 6504359 6448653
57604 6448653 6346418 6198717 6010310 5787841 5539711 5276057 5006827 4739779 4480854
57595 4480854 4235614 4008827 3802621 3616308 3448504 3298773 3167044 3052286 2952514 2865764
57585 2865764 2790600 2726005 2671417 2626850 2592445 2567802 2552136 2545100 2546895 2557301 2575283 2600248
57573 2600248 2633333 2676470 2730199 2793439 2865762 2948766 3044348 3152383 3271321 3400739 3542012
57562 3542012 3696223 3862339 4037768 4219855 4406330 4594780 4782005 4963287 5131723
57553 5131723 5278682 5395734 5476631 5517905 5518416 5478885 5401583 5289834 5147542 4979270 4790585
57542 4790585 4587971 4377995 4166208 3956549 3751720 3554046 3365759 3188386 3022296
57533 3022296 2867288 2723439 2591019 2469753 2358638 2256389 2161752 2073612 1991296 1914679
57523 1914679 1843697 1778035 1717707 1663425 1615525 1572752 1533002 1495088 1458905 1424184 1390499
57512 1390499 1358720 1331066 1308945 1291550 1277059 1264380 1253239 1243556 1235623 1230292 1228157 1228813
57500 1228813 1231402 1235451 1240835 1247533 1255868 1266393 1278982 1292683 1306988 1322618 1340475 1360540
57488 1360540 1382540 1407062 1434967 1465979 1498738 1532280 1567162 1605328 1649085 1699540 1755700
57477 1755700 1815734 1879499 1948922 2025467 2108515 2197277 2293066 2398062 2512590 2635327 2765676
57466 2765676 2903984 3049376 3199142 3350565 3501691 3649593 3789251 3915066 4022569
57457 4022569 4107964 4167003 4195611 4191624 4155599 4090297 3999740 3888314 3760285 3620161 3473258
57446 3473258 3324951 3178871 3036290 2897737 2764848 2640198 2525622 2421176 2325740 2238395
57436 2238395 2159277 2089233 2028668 1976768 1931903 1892578 1857965 1827935 1803043 1784209 1771903
57425 1771903 1765681 1764877 1769428 1779602 1795225 1815857 1841524 1872669 1909590 1952647 2002798 2061051
57413 2061051 2127326 2200490 2279532 2364227 2455064 2553358 2660923 2778250 2903069 3031978
57403 3031978 3163503 3297988 3434077 3566894 3690348 3799615 3890245 3956475 3992577 3995724
57393 3995724 3966305 3905770 3815635 3698755 3560339 3406987 3244901 3078761 2911598 2745444
57383 2745444 2582416 2425212 2276368 2137105 2007188 1885671 1771646 1664663 1565017 1473507
57373 1473507 1390533 1315468 1247083 1184219 1125807 1070732 1018315 968803 922911 881014 843043
57362 843043 808654 776943 746443 716380 687808 662565 640882 620898 600887 581216 563461
57351 563461 548115 534056 520133 506406 493434 480983 468092 454352 440572 428180 418332 411582
57339 411582 407714 405500 403229 400204 397502 396631 397463 398132 396986 394074 390696 388082 386698 386206 385736
57324 385736 384519 382507 380090 377153 372976 367317 361200 356205 353145 351512 349905 346792 341242 333339
57310 333339 324007 314479 305852 298702 292715 287028 281423 276810 273817 271375 267866 263554 260626 260546 262516
57295 262516 264910 267009 268693 269636 269864 270389 272244 275168 277963 279829 280800 281300 281835 282695 283549 283729
57279 283729 283299 283235 284172 285586 286589 286773 285816 283252 279425 275779 273261 271145 268337 265172 262874 261834
57263 261834 261533 261698 262410 263342 263916 264084 264208 264483 265197 266995 269977 273002 274882 275839 276879 278327 280100
57246 280100 282742 286778 291518 296030 301107 308721 319490 332003 344625 356658 367866 378440 389458
57233 389458 401917 415081 427327 438728 451175 465688 481434 498055 516989 539419 564539
57222 564539 591387 621252 656740 699110 747776 801898 861147 925041 992316 1060898 1128050
57211 1128050 1191007 1247947 1297843 1339188 1369971 1389717 1400546 1405039 1403729 1395930 1382414 1365635
57199 1365635 1347219 1326613 1302732 1276017 1248244 1220926 1194568 1169194 1144921 1121838 1099726
57188 1099726 1078331 1058006 1039761 1024370 1011582 1000550 990853 982668 976051 970624 965998 961866
57176 961866 957652 952772 947518 943055 940101 938120 936164 934016 932018 930185 928160 925977 924481 924898
57162 924898 928070 933988 941883 950732 959794 968948 979038 991990 1009932 1033554 1061643 1092771 1127086
57149 1127086 1165839 1209636 1257924 1309858 1364618 1421108 1478391 1536436 1595588 1655526 1715738
57138 1715738 1776745 1839539 1903876 1968524 2033240 2098895 2165277 2230348 2292474 2352160 2410910
57127 2410910 2469526 2528182 2586960 2645516 2703275 2760821 2819961 2881452 2943572 3003800 3061127
57116 3061127 3115904 3168470 3219004 3267951 3315488 3361053 3404253 3445580 3485382 3522833 3556878
57105 3556878 3587597 3615699 3641227 3663876 3684188 3703193 3720757 3735014 3743627 3745390 3740819 3731470
57093 3731470 3718535 3701904 3680810 3655149 3625511 3592032 3554027 3510695 3461178 3403874 3336637
57082 3336637 3257654 3165157 3056562 2929394 2782983 2617606 2431957 2223380 1990863 1735549
57072 1735549 1457581 1154343 822665 460960 68454 -355708 -811851 -1300456 -1824833 -2391319
57062 -2391319 -3005946 -3672881 -4396994 -5185667 -6046931 -6988167 -8017786 -9145785 -10381521
57053 -10381521 -11733764 -13214595 -14840948 -16631592 -18606399 -20790774 -23217644 -25923041
57045 -25923041 -28943040 -32317163 -36091441 -40316414 -45047419 -50352655 -56322684 -63076694
57037 -63076694 -70769708 -79597686 -89786023 -101558483 -115102702 -130543012 -147920287
57030 -147920287 -167191410 -188260208 -211001765 -235225623 -260627379 -286874921 -313842411
57023 -313842411 -341724170 -370736422 -400514232 -429712389 -456206870 -477764197 -492696388
57016 -492696388 -500165270 -500150827 -493255011 -480461585 -462918366 -441793529 -418198981 -393110485
57008 -393110485 -367259415 -341076578 -314768867 -288485968 -262451386 -236987515 -212466547
57001 -212466547 -189248002 -167629526 -147813406 -129893383 -113865070 -99652156 -87135560
56994 -87135560 -76175908 -66624897 -58328658 -51132445 -44890653 -39474704 -34772227 -30682883
56986 -30682883 -27118474 -24004676 -21278345 -18883442 -16771604 -14904331 -13250306 -11780562
56978 -11780562 -10468591 -9293796 -8240911 -7295572 -6442833 -5669886 -4967403 -4327597 -3742801
56969 -3742801 -3206167 -2712010 -2255257 -1832100 -1441053 -1081656 -751936 -448548 -169346
56959 85863 317343 526548 714873 882573 1029698 1157336 1267337 1361309 1440233 1504777
56949 1504777 1555822 1594782 1623334 1642922 1654975 1661280 1662979 1659084 1647961 1631796 1618387 1616079
56937 1616079 1625862 1638204 1636780 1605226 1532969 1418702 1270460 1101955 927417 758165 601584
56926 601584 461239 337698 230051 137007 56662 -13761 -76963 -134568 -187579 -237103 -283726
56915 -283726 -326726 -365004 -398660 -428804 -456038 -480035 -500477 -517685 -532245 -544473 -554111 -560207
56903 -560207 -561795 -559200 -554107 -547728 -539452 -528102 -513982 -498942 -485099 -474472 -469228 -470758 -478512
56890 -478512 -490761 -506413 -525079 -545619 -566002 -584893 -602306 -618239 -631488 -640253 -643426 -641071
56878 -641071 -634205 -624322 -612602 -599287 -583904 -565827 -544257 -518209 -487707 -455216 -425186 -401877
56866 -401877 -387976 -384805 -392541 -409630 -432748 -458156 -483172 -506452 -527495 -546288 -562976 -577416
56854 -577416 -588993 -597007 -601149 -601751 -599810 -596602 -592852 -588315 -582475 -575507 -568021 -559997 -550579 -539064
56840 -539064 -525492 -510162 -493201 -475028 -456786 -439742 -424377 -410343 -397210 -384889 -373453
56829 -373453 -362947 -353559 -345640 -339334 -334433 -331121 -330916 -336270 -348769 -367929 -392022 -419539 -449178
56816 -449178 -478849 -505843 -528168 -544871 -554885 -556601 -549113 -533155 -510257 -481565 -447962 -410576
56804 -410576 -370451 -328017 -283204 -235488 -183708 -127089 -67618 -10749 37237 72414 93677
56793 93677 101634 98512 88338 75249 61366 47275 34245 24528 19503 18872 22009 28985 40061
56780 40061 55422 75898 103011 137749 179949 229094 284661 345060 406856 465579 516864 556660
56768 556660 581363 588814 579274 555277 520746 480107 437350 395348 356148 321815 294313 274324
56756 274324 260897 252721 249484 251817 260506 276022 298266 326221 358143 392479 428372 464814
56744 464814 499287 527372 543964 545388 531085 503554 466635 423842 378073 331867 287001 244284
56732 244284 204678 170377 143697 124948 112498 105100 103073 106938 115976 128712 144104 161749
56720 161749 181565 203415 226134 246490 260027 263642 257028 241625 219404 193046 165764 139565
56708 139565 114240 89007 64508 42251 22752 5402 -10199 -24014 -36471 -48547 -60671 -72314
56696 -72314 -82759 -91705 -99146 -105238 -110248 -114193 -116649 -117448 -117321 -117331 -117904 -119079 -121366 -125388 -130648
56681 -130648 -135546 -138867 -140543 -140796 -139454 -136687 -133749 -132120 -131991 -132179 -131641 -130542 -129542 -128454 -126380
56666 -126380 -123290 -120640 -119689 -119700 -118876 -116978 -115664 -115809 -115830 -113776 -110158 -107354 -106546 -106636 -106207 -105352 -105184
56649 -105184 -106325 -108245 -109609 -109106 -106621 -103763 -102714 -104306 -107573 -111089 -114095 -116283 -117443 -117815 -118103
56634 -118103 -118523 -118229 -116354 -113390 -110941 -110107 -110464 -110706 -109995 -108507 -106852 -105217 -103280 -100866 -98339 -96174
56618 -96174 -94401 -92760 -91095 -89255 -86903 -83991 -81257 -79612 -79095 -79060 -79394 -80691 -82983 -85115 -85937 -85537
56602 -85537 -84627 -83173 -80463 -76475 -72422 -69718 -68738 -68779 -68881 -68465 -67415 -65892 -64177 -62546 -61094 -59645
56586 -59645 -57949 -56043 -54240 -52584 -50487 -47260 -42978 -38510 -34737 -32110 -31061 -32144 -35180 -38541
56572 -38541 -40014 -38642 -35543 -32819 -31892 -32887 -35121 -37671 -39590 -40148 -39282 -37674 -36174 -35125 -34386 -33751
56556 -33751 -33051 -31979 -30234 -27941 -25555 -23317 -21197 -19483 -18913 -19835 -21494 -22506 -21952 -19971 -17615
56541 -17615 -16200 -16231 -16677 -15871 -13427 -10673 -8853 -7719 -6585 -5751 -5643 -5266 -3167 219 2830 3792 4370
56524 4370 5671 7086 8048 9833 14009 19783 24545 26965 28363 30778 34683 39000 42792 46388 50811
56509 50811 56254 61443 64921 66862 69008 72764 78269 85475 94791 105777 116439 125260 133240 142241
56495 142241 151759 159217 163651 167163 171940 177471 181941 185228 188896 193689 198558 202275 204830 206799
56481 206799 208093 207951 205965 202697 199224 196090 192715 187995 181644 174678 168347 162725 156685 149191
56467 149191 140328 131216 123337 117859 114961 113408 111181 107032 101487 96221 92568 90821 90574 91188 91932
56452 91932 92315 92525 93089 93756 93193 90335 85781 81228 77710 75074 73062 71905 71508 70918 69403 67572
56436 67572 66695 67132 68161 69135 69996 70615 70438 69235 67717 66954 67408 68834 70933 73697 77109 80823
56420 80823 84462 88229 92911 98953 105556 111122 114825 117486 120718 125498 131707 138561 145035 150313
56406 150313 154587 159237 165497 172905 179675 184715 188729 193232 199010 205746 212568 218715 224023 228955
56392 228955 233847 238130 240872 242178 243240 244616 245158 243280 238897 233532 228879 225827 224446 224135 223804
56377 223804 222604 220546 218036 215022 211237 207180 203985 202087 200692 198922 196816 194700 192217 188842
56363 188842 185166 182686 182207 183057 184186 185258 186188 186269 184683 181649 178141 174534 170515 166560 164387
56348 164387 165080 167460 169258 169533 169037 168467 167532 166045 164919 165483 168097 171785 175020 176854 177682 178936
56332 178936 181617 185097 187805 189026 189363 189452 189091 187981 186583 185694 185701 186605 188378 190888 193934 197626
56316 197626 202231 207328 211729 214589 216022 216290 215287 213439 212200 212569 213649 213748 212631 211726 212365 214763
56300 214763 218576 223288 227942 231539 234140 236983 241255 247120 253878 260464 265839 269694 272876 276431
56286 276431 280104 282671 283971 285703 289558 295207 300784 304990 308113 311238 315068 319565 324331 329180
56272 329180 334425 340631 348182 357172 367530 378894 390468 401571 412506 424370 437692 451608
56260 451608 464794 477032 489436 503103 517816 532241 545262 556912 568081 579634 592074
56249 592074 605663 620136 634305 646699 656943 665803 673559 679308 682679 685312 689317 694691 699724
56236 699724 703824 708402 714641 721986 729638 738284 749161 762147 776070 790723 807478 827761 851553
56223 851553 877633 904905 933357 963957 997744 1035041 1075621 1119601 1167843 1221260 1279869
56212 1279869 1342739 1408931 1478593 1553212 1634647 1723784 1820496 1925188 2039868 2166854 2306636
56201 2306636 2457899 2619710 2792770 2978335 3176877 3388200 3611924 3847005 4091268
56192 4091268 4342038 4596871 4853072 5106805 5353299 5587765 5805786 6003157 6175988
56183 6175988 6321021 6435673 6518128 6567862 6585932 6574472 6536054 6473640 6390643 6290399 6175655
56172 6175655 6048869 5912836 5770573 5624467 5475644 5324031 5168937 5009880 4847098
56163 4847098 4681258 4512738 4341545 4168026 3993311 3818929 3646321 3476708 3310912
56154 3310912 3149054 2991039 2837674 2690905 2552490 2422741 2300830 2185941 2077799
56145 2077799 1976540 1882612 1796562 1718383 1647103 1581300 1519869 1462158 1407760 1356676 1309563
56134 1309563 1267364 1230505 1198537 1170401 1144974 1121537 1099988 1080733 1064366 1051365 1041775
56123 1041775 1034927 1029748 1025642 1022847 1021651 1021762 1022983 1025939 1031325 1038887 1048126 1059527 1073618 1089049
56109 1089049 1103373 1116281 1130480 1148491 1169728 1191475 1211610 1229465 1245278 1260090 1275390
56098 1275390 1291468 1306485 1318380 1327549 1336700 1348122 1361891 1376744 1392061 1408915 1429408 1454908
56086 1454908 1484964 1518389 1555366 1597727 1647149 1704192 1769369 1843740 1927627 2020025 2120479
56075 2120479 2230568 2352146 2484486 2624128 2766873 2908776 3045899 3174791 3293688
56066 3293688 3402641 3502483 3594035 3677585 3752163 3815424 3864872 3898990 3916999 3918511 3904268
56055 3904268 3876534 3837690 3788717 3729509 3659725 3578370 3483439 3373613 3250418 3118109 2981769
56044 2981769 2846062 2714918 2591161 2476501 2372246 2279345 2197189 2123615 2057219 1998793
56034 1998793 1949438 1908235 1872978 1842032 1813958 1786494 1758040 1729675 1703840 1681379 1661597
56023 1661597 1644624 1631461 1621633 1613044 1604795 1598484 1595877 1596496 1598320 1600143 1602707 1607929 1617196 1630179
56009 1630179 1645421 1662154 1680829 1701589 1723365 1745206 1767393 1790290 1813316 1836229 1860120
55998 1860120 1885658 1911564 1936494 1961346 1987916 2016263 2045242 2074599 2104598 2134595 2164294
55987 2164294 2195599 2230952 2270346 2311964 2355007 2399731 2445730 2492792 2542713 2597639 2657128
55976 2657128 2719478 2785262 2856682 2933927 3015111 3099434 3187410 3278378 3371183 3467173 3569081
55965 3569081 3676707 3787160 3899748 4017303 4141940 4272774 4408576 4549584 4695857
55956 4695857 4846776 5003177 5167301 5339912 5519946 5707260 5902850 6106177 6315627
55947 6315627 6532205 6759512 6999541 7251725 7516469 7795969 8090958 8400379 8725135
55938 8725135 9068449 9431761 9814224 10217207 10645312 11101909 11587773 12105286 12659766
55929 12659766 13255409 13894062 14578961 15314952 16103687 16943552 17836126 18788068 19805150
55920 19805150 20889415 22043862 23274757 24587938 25988996 27489544 29107773 30860901
55912 30860901 32763282 34833911 37098612 39581736 42302821 45285773 48567282 52197177
55904 52197177 56240719 60783261 65922153 71749708 78354101 85842484 94356635 104067918
55896 104067918 115171776 127885561 142426442 158981034 177715769 198820020 222504802
55889 222504802 248942783 278229049 310337562 344854467 380399552 414138849 442041526
55882 442041526 460057032 465581065 458302600 440033975 413831452 382989080 350314069
55875 350314069 317809250 286697221 257624798 230883850 206568278 184670250 165130683
55868 165130683 147845756 132652874 119337781 107669403 97429000 88416288 80451697
55861 80451697 73386682 67106252 61515590 56528660 52070362 48079252 44501025 41283633
55853 41283633 38381629 35759204 33384906 31227761 29261073 27464753 25820662 24309844
55845 24309844 22916671 21630928 20442882 19340128 18311637 17350986 16453204 15612038
55837 15612038 14822307 14081284 13385607 12730098 12111345 11528999 10981862 10466086 9978808
55828 9978808 9519968 9088742 8681541 8295428 7930278 7585776 7259394 6949057 6654812
55819 6654812 6376266 6111358 5859204 5620985 5396438 5182580 4977622 4782944 4599333
55810 4599333 4424279 4254948 4090961 3932400 3778139 3628412 3486309 3354386 3232084
55801 3232084 3118267 3013671 2918862 2832516 2753970 2684773 2625129 2571167 2518385 2465844 2414572
55790 2414572 2364005 2312720 2260890 2209176 2156636 2102390 2048170 1996649 1948218 1901698 1857329
55779 1857329 1816799 1780888 1748941 1719924 1692410 1664429 1635029 1605251 1576185 1547095 1516826
55768 1516826 1485884 1455522 1425967 1397112 1369732 1344194 1319099 1293045 1266739 1241644 1217555
55757 1217555 1193510 1170136 1148910 1129598 1110482 1091033 1072667 1056921 1044152 1033769 1024591
55746 1024591 1015334 1005875 997696 992192 989077 987271 986421 986498 986786 986455 985360 983207 978954 972205 964114
55731 964114 955636 946092 934897 923304 912442 900821 886149 868986 852255 837441 823626 810287
55719 810287 798637 789551 781992 774338 765977 756928 746828 734839 719942 701317 679341 656203
55707 656203 634579 615515 598180 581471 564986 548776 533333 519758 508865 499895 490881 480325
55695 480325 467961 454340 440671 428769 419791 412871 406034 398675 392278 388557 387690 388482 389429 389347
55681 389347 387674 384476 379911 373897 366810 360102 355282 352348 350020 347402 344536 341334 337198 332083
55667 332083 327058 323114 319875 316033 310851 304828 299027 294109 290041 286454 282985 279290 275162 271034
55653 271034 268104 267423 268968 272078 276428 281629 286115 287943 287220 286568 288380 292494 297161 301225 304414
55638 304414 306442 307190 307389 308112 309770 312340 316119 321477 328154 335509 343118 350635 357553 363655 369116
55623 369116 373720 376759 378300 379577 381312 382582 382303 380815 378856 376090 372192 368513 366749 366377 365272
55608 365272 362840 360800 360668 361996 363545 364851 366154 367785 370191 373698 377904 381878 385229 388341
55594 388341 391409 393872 395003 394689 393562 392547 392056 391375 389242 385290 380280 374556 367356 358314 348459
55579 348459 338624 328053 316007 303656 292590 282357 271554 260674 251461 243676 235043 224755
55567 224755 214664 206326 199071 191929 185415 180086 174980 168930 162351 156550 152174 149247 147660 146548
55553 146548 144155 139523 133694 128373 124134 120801 118648 117959 117970 117455 116184 114917 114110 113413 112348 110833
55537 110833 109002 106813 103866 99620 94213 88967 85444 83918 83452 83481 84232 85467 86123 85812 85460 85684
55521 85684 85626 84372 82521 81196 80404 79606 79219 80114 81957 83382 83715 83476 83270 83253 83571 84187 84240 82671
55503 82671 79776 77250 76349 76691 77150 77209 77090 77106 77432 78218 79556 81393 83540 85674 87413 88597 89434
55486 89434 90169 90916 92050 94337 97938 101575 103623 104162 105079 107788 111561 114642 116506 118338 121526
55471 121526 126325 131967 137516 142355 146225 149135 151189 152373 152474 151351 149238 146715 144354 142399
55457 142399 140748 139121 137185 134586 130924 125764 118858 110543 101847 93904 87185 81492 76687 72982
55443 72982 70276 67644 63966 58987 53497 48624 45154 43154 41709 39271 34963 29628 25178 22879
55429 22879 22637 23796 25910 28512 30783 31967 31968 31305 30604 30183 29934 29558 29053 28760 28566 27332 23764
55412 23764 17986 11692 6604 3233 1213 158 -194 -238 -407 -920 -1794 -2862 -3757 -4195 -4300 -4287 -3872 -2616
55394 -2616 -944 -117 -860 -2595 -4371 -6049 -8066 -10517 -13047 -15333 -17115 -17986 -17710 -16711 -15870 -15813 -16569
55377 -16569 -17779 -18971 -19775 -20108 -20152 -20101 -20088 -20285 -20703 -20803 -19776 -17408 -14366 -11523 -9494 -8941 -10544
55360 -10544 -14069 -17938 -20362 -20721 -19553 -17780 -16513 -16943 -19293 -21939 -22585 -20582 -17400 -14666 -12528
55345 -12528 -10353 -8280 -7199 -7355 -7789 -7352 -5902 -4253 -3210 -2965 -3286 -3784 -3840 -2753 -538 1483 1526
55328 1526 -841 -4051 -6030 -6240 -5883 -6185 -6961 -7099 -6129 -4826 -4239 -4622 -5604 -6922 -8341 -9127 -8595 -7430
55310 -7430 -7592 -10246 -14434 -18376 -21289 -23111 -23349 -21710 -19426 -18213 -17855 -16491 -13695 -11518 -11613 -12980
55294 -12980 -13835 -14365 -15924 -18318 -19838 -19774 -19155 -18761 -17919 -15830 -13022 -10816 -10007 -10464 -11496 -12201 -11960
55277 -11960 -10965 -9911 -9044 -8052 -7028 -6881 -8334 -10995 -13859 -16331 -18294 -19592 -20112 -20241 -20626 -21426
55261 -21426 -22243 -22796 -23222 -23640 -23866 -23833 -23880 -24192 -24242 -23289 -21378 -19325 -17650 -16101 -14487 -13417 -13630 -14867
55243 -14867 -16000 -16251 -15846 -15495 -15679 -16457 -17455 -17990 -17621 -16673 -15789 -15039 -14020 -12852 -12312 -12658 -13038 -12541
55225 -12541 -11327 -10170 -9435 -9061 -9045 -9120 -8256 -5447 -1183 2523 3846 2567 -198 -3148 -5456 -6794
55209 -6794 -7277 -7463 -8018 -9141 -10215 -10173 -8425 -5491 -2607 -713 104 372 705 1307 1507 -77 -4136 -9168
55191 -9168 -12101 -10963 -6729 -2203 507 1144 635 25 -197 -337 -997 -2096 -2684 -2148 -1129 -654 -751 -717
55173 -717 -492 -986 -2975 -6316 -10276 -13970 -16455 -17032 -15728 -13150 -9897 -6573 -4060 -2935 -2538 -1482
55157 -1482 556 2350 2885 2893 3857 5892 7464 7204 5421 3604 2843 3001 3334 3651 4601 6713 9369 11191
55139 11191 11500 11016 10989 11924 13318 14235 13848 11814 8719 6056 5187 6176 7933 9513 10851 12135 13074
55122 13074 13305 13155 13294 13625 13195 11501 9369 8012 7552 7038 5844 4424 3538 3266 3156 3055 3323
55105 3323 4192 5141 5122 3521 965 -966 -1059 468 2348 3650 4592 5933 7795 9248 9139 7437 5701
55088 5701 5787 7795 9722 9611 7714 5952 5625 6470 7710 8797 8965 7295 3967 689 -788 -157 1782
55070 4172 6309 7629 8245 9013 10357 11601 12188 12943 15089 18411 21444 23310 24413 25405 26514 27939
55054 27939 30030 32772 35750 38747 41776 44568 46706 48347 50011 51519 51968 51090 49896 49425 49378 48615
55038 48615 46722 44586 43428 43672 44789 45990 46871 47379 47486 47331 47687 49555 52896 56308 58515 59685
55022 59685 60599 61022 60042 57818 55783 54803 54199 53145 52200 52680 54888 57634 59395 59586 58827 58242 58409
55005 58409 58836 58526 57113 55283 54155 54352 55469 56086 54620 50784 46258 43319 42710 43283 43700 43824
54989 43824 44284 45323 46484 47095 46813 46019 45739 46765 48735 50500 51408 51698 51625 51026 50041 49495 49919 50746
54971 50746 51070 50861 50818 51249 51676 51529 50837 50179 50187 51077 52485 53840 54919 55927 57079 58373 59782 61317
54953 61317 62874 64348 65925 67742 69266 69724 69408 69776 71592 73496 73302 70653 67627 66474 67189 67685
54937 67685 66167 63064 60442 59728 60450 61368 62270 63889 66216 67970 68209 67715 68002 69169 69539 67511
54921 67511 63422 59334 57185 57208 58153 58825 59143 59606 60281 60914 61799 63688 66643 69626 71595 72609 73611
54904 73611 75599 79180 84291 89890 94450 97336 99480 102324 106492 111921 118781 127465 137744 148639
54890 148639 159367 170089 181541 194103 207420 220928 234720 249518 265334 280306 291615
54879 291615 297905 300277 300482 298652 293407 283868 270957 256809 243325 231060 219029 205640 190329
54866 190329 174392 160050 148826 140964 135958 133006 131080 129143 126597 123407 119933 116834 114830
54853 114830 114163 114444 115465 117959 122961 130501 139516 149156 159535 170991 183281 196031 209515
54840 209515 224205 239510 253604 264807 272753 277868 280015 278277 272080 262043 249606 236263
54828 236263 223224 211012 198848 185157 169631 154487 142668 134787 128860 123007 117299 112576
54816 112576 108605 104299 99070 93171 87174 81815 77912 75624 73974 71756 68821 65978 63823 62145
54802 62145 60343 58079 55706 54270 54695 56655 58624 59379 58878 57437 55019 52108 50342 50932 52940
54787 52940 54377 54671 54725 54833 54200 52757 51758 51836 51850 50639 48804 47605 46822 45125 42259 39695 38964
54770 38964 40222 42610 45253 47545 49010 49400 48947 48393 48689 50449 53403 56480 58743 60168 61284
54755 61284 62249 62867 63545 65461 69213 73709 77188 79316 81548 85185 89730 93720 96715 99801 104286
54740 104286 110626 118555 127438 136307 144370 152009 160793 171901 184805 197947 210439 222641 235367
54727 235367 248982 263074 276484 287769 296193 302160 306317 308354 307125 301838 292698 280636 267054
54714 267054 253770 242365 233223 225504 218148 210610 202844 195267 188847 184592 182631 182339 183479 186451
54700 186451 191033 195626 198640 200357 202778 207733 215578 225546 236710 248579 261351 275809 292596
54687 292596 311400 331054 350454 369061 386570 402658 417234 430303 441152 448230 450601 449149
54675 449149 445406 439310 429192 414235 395853 376097 355860 335588 316639 300239 285555 270650
54663 270650 255530 242445 232596 224166 214635 203770 193046 183303 174516 167136 161828 157968 153956
54650 153956 149173 144373 140131 136313 133337 132305 133083 133538 131861 128836 126762 126663 127664 128717 129679
54635 129679 130607 131056 130591 129460 128324 127566 127060 126371 125093 123240 121495 120801 121527 123211 125239 127430
54619 127430 129659 131275 131660 131500 132770 136843 142806 148222 151473 152906 153849 155242 157410 160451 164399
54604 164399 169320 175488 182989 191009 198197 204170 209961 216349 222467 226999 230239 233837 238626 243799
54590 243799 248254 251811 254968 258416 262976 269029 275621 281154 285597 291164 299903 311238 322963 334383
54576 334383 347304 363623 382732 402002 419568 435990 452838 470007 485097 495689 501586 504105
54564 504105 503565 498649 488521 474480 458709 442066 424041 404571 384852 366276 349421 334412
54552 334412 321471 310508 300587 290634 280736 272110 265634 260785 256365 251838 247452 243258 238687 233249
54538 233249 227169 221100 215542 210755 206851 203650 200687 197591 194273 190551 185908 179940 172835 165226
54524 165226 157817 151204 145601 140620 135827 131619 128754 126793 124171 120478 117431 116395 115995 113863
54510 113863 110090 107031 105862 105281 103884 101936 100172 98576 97280 97234 98769 100575 101193 100647 99573
54495 99573 97792 95041 92371 91286 91776 92525 92907 93543 94904 96529 97852 98824 99501 99852 100320 101657
54479 101657 103772 105364 105472 105021 106154 110065 115987 122449 128902 135665 142582 148712 153737 159004 166444
54464 166444 176677 188763 201430 213602 223994 231485 236267 239598 241941 242273 239704 234851 228851
54451 228851 221934 213844 204936 195878 186782 177596 168931 161490 154956 148478 142137 137043 133865 131942
54437 131942 129920 126837 122711 118517 115361 113382 111878 110726 110769 112066 112790 111173 108000 105853 106217
54422 106217 108530 111614 114470 115952 115593 115050 117010 122101 128252 133453 137535 140591 141704 140653 139443
54407 139443 140306 142941 145229 146130 146367 146682 147053 147632 148983 150961 152339 151972 149756 146339 142593 139336
54391 139336 136782 134106 130232 125257 120457 116859 114474 112964 112136 111479 110155 108011 105950 104700 103867
54376 103867 102830 101972 102226 103724 105677 107280 107959 107068 104475 101470 99974 100425 101265 100925 99531 98197
54360 98197 97567 97921 99844 103541 107817 111014 113014 115175 118179 121123 123195 125066 127802 131320 134806
54345 134806 138000 140972 143139 143810 143672 144606 147711 152275 156893 160831 164002 166478 168704 171692 176314
54330 176314 182367 188578 193406 195851 195977 194962 194224 194050 193288 190668 186200 181011 176142 171932 168233
54315 168233 164655 160694 156202 151757 148074 144960 141355 136648 131562 127395 124639 122780 121318 120537
54301 120537 121013 122568 124034 124200 122931 121209 120041 119484 118890 118004 117460 118085 119937 122311 124626 127021
54285 127021 129863 132869 135014 135565 135207 135878 139180 144915 151359 156967 161507 165394 168532 170440 171338
54270 171338 172228 173551 174468 173981 172385 170922 170110 169022 166295 161426 155043 148309 142144 136617 130868
54255 130868 123989 116230 109159 104440 102455 102035 101279 98754 94374 89417 85469 83191 82138 81616 81266
54240 81266 80792 79689 77669 75113 72816 71395 71007 71411 72096 72572 72685 72533 72099 71206 69820 68080 66200
54223 66200 64723 64662 66528 69128 70267 69114 67165 66387 67159 68541 69722 70335 70051 68976 68128 68537
54207 68537 70022 71676 73214 74799 75864 75446 73881 72938 73832 76066 78613 81200 83724 85356 85333 84294
54191 84294 83838 84716 86102 86829 86856 87260 88853 91080 92541 92645 92408 93229 95124 96760 97045 96074 94545
54174 94545 93098 92426 92987 93992 93464 90239 85615 82190 81190 81653 82130 82262 82436 82751 83147 84207 86827
54157 86827 90710 93814 94050 91495 88282 86222 85217 84321 83487 83321 83635 83525 82928 82903 83912 84826 84361
54140 84361 82896 82184 83603 87120 91379 94247 93963 90728 86907 84791 84337 83885 82855 82496 83763 85633
54124 85633 86367 85688 84769 84324 83644 81643 78290 74770 72675 73138 76222 80601 84095 85180 84221 82948
54108 82948 82516 82409 81394 79172 76584 74485 73063 72232 72052 72470 73160 73954 75003 76210 76984 77017 76876
54091 76876 77214 77767 77821 77379 76966 76422 75042 73187 72526 73921 76004 76903 76705 76890 77682 77483 75296 72329
54073 72329 70506 70290 70859 71544 72046 71694 69767 66600 63493 61388 60272 59835 59827 59733 59019 58020 57702 58124
54055 58124 57960 56240 53943 53047 54364 56955 59447 61173 62095 62328 62026 61532 61476 62546 64829 67360
54039 67360 68942 69570 70387 71867 72880 72255 70538 69151 68330 67032 64777 62443 61076 60853 61470 62698
54023 62698 64183 65283 65545 65067 64317 63847 64108 65080 66164 66885 67482 68246 68638 67842 65946 63698 61367
54006 61367 59021 57744 59039 62653 66393 68749 70513 73047 76133 78536 79759 80126 79885 79411 79741
53991 79741 81636 84382 86595 88086 89894 92511 95106 96747 97604 98623 100520 103347 106688 110141 113717
53976 113717 117768 122408 127385 132675 138687 145456 152279 158863 166230 175479 185932 195642 203720 211074
53962 211074 218715 226471 233833 241080 248715 256298 262642 267055 269967 272402 275144 278303 281404 283947
53948 283947 285844 287133 287385 285928 282854 279300 276292 273673 270535 266497 262036 257647 253209 248362
53934 248362 243190 238193 233659 229288 224565 219464 214651 210876 208191 205947 203584 201181 199095 197229
53920 197229 194976 191923 188332 184764 181412 178044 174586 171503 169470 168737 168957 169589 170378 171455 172963
53905 172963 174616 175727 175796 175020 174046 173318 173040 173716 176076 180067 184391 187690 190000 192490 195903 199814
53889 199814 203407 206407 209109 212000 215464 219439 223232 226088 228065 229975 232347 234932 237412 240129
53875 240129 243734 248362 253431 258140 262086 265551 269254 273645 278519 283432 288186 292573 296092 298550
53861 298550 300616 303007 305455 307529 310133 314787 321241 327348 331890 336099 341613 348290 355169 362309
53847 362309 370075 377467 382935 386585 390057 394253 398602 402556 406358 409966 412486 413384 413329 413160 412606
53832 412606 410696 407029 402162 397037 392428 388679 385489 381945 377052 370484 362867 355293 348319 341405
53818 341405 333663 325129 316770 309024 301069 292119 282827 274458 267001 259186 250392 241615 234173 228200
53804 228200 222888 217720 212814 208208 203370 197777 191849 186792 183101 179567 174496 167885 161541 156753
53790 156753 152801 148362 143492 139334 136498 134809 134196 134762 136050 137136 137413 136673 134754 131939 129282
53775 129282 127585 126321 124560 122704 122070 122872 123940 124549 125171 126051 126350 125428 124051 123560 124381 125919
53759 125919 127427 128629 129986 132589 137183 142875 147389 148945 147625 144826 142025 140271 140189 141917 145201
53744 145201 149660 154790 159883 164471 168716 172911 177001 181229 186618 193694 201147 207218 212218 218002
53730 218002 224810 230448 233259 234297 235754 238683 243238 249666 257658 265620 271915 276183 278521 278332
53716 278332 275309 270845 267110 264984 263858 262885 261330 258245 253230 247442 242711 239569 236863 233260
53702 233260 228472 223269 218973 216684 216225 216077 214867 212560 209767 206707 203708 201801 201393 200957 198576
53687 198576 194643 191593 190945 191973 193393 194865 196381 197423 197512 196867 196031 195395 195332 196051 197047 197339 196544
53670 196544 195188 193948 193287 193803 195808 198220 198883 196688 192786 189161 186616 184650 182698 180814 179431
53655 179431 178979 179604 180949 182353 183423 184178 184718 185215 186227 188330 191217 193776 195362 196468 197929
53640 197929 200062 202818 206034 209179 211535 213088 214692 216887 219243 221371 223762 226924 230367 233348
53626 233348 236056 239060 242004 243935 244726 245141 245684 246553 248574 252764 258583 263909 267451 270083 273023
53611 273023 275688 276536 275339 273296 271139 268466 265065 261679 259061 257134 255581 254522 254092 253903 253488
53596 253488 252742 251517 249453 246887 245317 245901 247747 248726 247952 246599 246156 246927 248461 250411 252349 253597
53580 253597 254009 254435 255621 257097 257935 258328 259433 261656 263887 264804 264430 264045 264814 266717 268703 269719
53564 269719 269641 269386 270227 273010 277656 282967 287079 288864 289190 290200 293032 296858 300552 304438 309505
53549 309505 315499 321056 325567 329839 334770 340397 346384 352356 357380 360303 361437 363147 367694 374784
53535 374784 382087 387912 392611 397403 402748 408179 413139 417439 421146 424474 427866 431882 436755 441955
53521 441955 446354 448988 449803 449567 449164 449096 449549 450558 451983 453604 455469 457881 460864 463961 466860 469858
53505 469858 473152 475903 476820 475880 474738 474952 476238 477104 476931 476657 477388 479094 481047 482994 485364 488554
53489 488554 492501 496896 501406 505649 509221 511861 513519 514452 515411 517476 521407 527151 534040 541139 547294
53474 547294 551607 554579 558283 564376 571995 578624 583143 587092 592740 600895 610931 621915 633000
53461 633000 643576 653893 665022 677531 690752 704105 718451 735201 754530 775389 796881
53450 796881 818616 840000 860405 880125 900197 921175 942944 965803 990679 1017954 1046915
53439 1046915 1076718 1107195 1138327 1169734 1201214 1233178 1265915 1298851 1331077 1362393 1393518
53428 1393518 1425535 1459363 1495149 1531618 1566421 1597987 1627078 1656016 1686280 1717299 1747670
53417 1747670 1777017 1806239 1836157 1866487 1896321 1925237 1953549 1981623 2009399 2036595 2062858
53406 2062858 2087486 2109582 2129043 2147137 2165477 2184304 2202143 2217153 2228581 2236928 2243041 2247149
53394 2247149 2248703 2247226 2243225 2237843 2231380 2222714 2210623 2195275 2177826 2158957 2138695 2117471
53382 2117471 2096461 2076545 2057481 2038177 2017346 1994062 1968502 1942377 1917892 1895918 1875526
53371 1875526 1855446 1835412 1815830 1796760 1777801 1758808 1740340 1723393 1708789 1696808 1687388
53360 1687388 1680655 1676792 1675103 1673714 1671010 1667387 1664997 1665696 1669594 1675440 1681844 1688297 1695688 1705813
53346 1705813 1719728 1736572 1754609 1773298 1793624 1816559 1842113 1869896 1899591 1930608 1962175
53335 1962175 1994179 2027413 2062949 2101830 2145031 2192535 2242626 2293498 2345672 2401211 2460217
53324 2460217 2519952 2578302 2636319 2696063 2757572 2819721 2882812 2948037 3014848 3080928 3144892
53313 3144892 3207412 3269457 3330802 3390550 3447899 3501942 3551747 3597211 3639231 3678578 3714943
53302 3714943 3747138 3773952 3794907 3810622 3822122 3829280 3830378 3824004 3810937 3793117 3771076 3743625
53290 3743625 3710029 3671109 3628051 3581526 3532594 3483182 3434634 3386448 3337309 3286908 3236033
53279 3236033 3185301 3134663 3084048 3033886 2984874 2937483 2891633 2846730 2802185 2757975 2714454
53268 2714454 2671595 2628872 2586126 2544233 2504649 2468385 2435343 2404264 2373420 2342141 2311885
53257 2311885 2285191 2263130 2244229 2226174 2207860 2189154 2169453 2147698 2123845 2099330 2075717
53246 2075717 2053515 2032516 2012677 1994146 1976861 1960689 1945855 1932695 1921050 1910453 1901073
53235 1901073 1893986 1890130 1889222 1890112 1891975 1894674 1898079 1901873 1906499 1913693 1925228 1941050 1959214 1977897
53221 1977897 1997094 2018116 2041714 2067160 2093105 2118791 2144086 2168694 2192028 2213994 2235286
53210 2235286 2256338 2276295 2293686 2308039 2320156 2330755 2339593 2346227 2350936 2354290 2356256 2356208 2353521
53197 2353521 2347742 2338607 2326501 2312567 2297658 2281284 2262210 2240087 2215848 2190460 2163904 2135714
53185 2135714 2106158 2076542 2048293 2021666 1995344 1967630 1938289 1908981 1881568 1856399 1832678
53174 1832678 1810018 1788659 1768285 1747617 1725593 1702313 1678528 1654820 1631756 1610287 1591215
53163 1591215 1574181 1557613 1539921 1520829 1501587 1483773 1467798 1452684 1437497 1422729 1409749
53152 1409749 1398954 1389085 1378546 1366831 1354300 1341035 1326551 1310440 1292758 1273690 1253327
53141 1253327 1232008 1210519 1189473 1168582 1146989 1124514 1102234 1081472 1062468 1044375 1026359
53130 1026359 1008184 989871 971600 954005 937802 922722 907432 890942 873524 855798 837592
53119 837592 818387 798404 778535 759585 742129 726615 712767 699381 685591 671959 659387
53108 659387 647490 635332 623519 613871 606670 599651 590500 579394 568285 558457 549558 540573 531014
53095 531014 521256 512087 503833 495949 487740 479313 471216 463367 455215 446837 438827 431031 422784 414761
53081 414761 409130 406887 406193 404525 401664 399339 398504 398253 397176 394716 391315 388042 386027 385474 385312
53066 385312 384369 382615 380724 378938 377227 376020 375622 375148 373255 369908 366322 363189 360246 357728 356761
53051 356761 357630 358805 358661 357378 356366 356476 357708 360023 363281 366533 368526 369021 368833 368441 367449 365785
53035 365785 364570 364934 366260 366386 363722 358760 353412 349235 346482 344481 342444 339901 336679 332720 328030
53020 328030 322845 317691 312852 307637 300684 291618 282181 274986 270939 268406 265151 260571 255702 251596
53006 251596 248275 245097 241575 237893 234952 233733 234194 234893 234144 231606 228370 225510 223003 220223 217066
52991 217066 214218 212419 211757 211693 211574 210966 209605 207340 204431 201807 200573 200989 202071 202418 201370 199331
52975 199331 197205 195718 195040 194711 193969 192410 190444 188988 188685 189387 190297 190640 190408 190431 191426 192951 193680
52958 193680 192819 190874 188848 187160 185723 184577 183848 183260 182263 180655 178765 177120 176234 176517 177932 179807
52942 179807 181251 181724 181132 179864 178975 179651 181705 183113 182021 178997 176262 174902 174036 172898 172278 173184
52926 173184 175183 177038 178302 179334 180236 180775 181015 181099 180679 179599 179001 180668 185000 190460 195262 198750
52910 198750 200846 201321 200529 200128 201868 205741 210212 214226 218084 222177 225936 228713 231102 234495 239413
52895 239413 244896 249651 253406 257082 261919 268336 275254 280547 282770 282686 282672 284258 286577 287610 286593
52880 286593 284665 283310 283018 283653 285258 287677 289670 289436 286421 282089 278488 276439 275531 275390 275987 276759
52864 276759 276548 275028 273454 273222 274076 274632 274390 274330 275414 277376 279213 280119 279633 277649 274880 272794
52848 272794 272377 273118 273725 273679 273591 274194 275474 276855 277875 278563 279355 280673 282465 284080 284678 283841 281983
52831 281983 280338 280278 282184 285037 287493 289283 291036 292950 294562 295896 297711 300024 301374 300537 298385
52816 298385 297066 297626 299289 300833 301849 302773 304410 307335 311136 314368 315851 315801 315195 314444 313484 312686
52800 312686 312617 313135 313820 315036 317185 319046 318556 315793 313668 314738 318414 322231 324801 326422 327621
52785 327621 328585 329773 331822 334668 337537 339993 342496 345865 350476 355819 360605 363692 365299 366883
52771 366883 369308 371701 372750 372605 372494 372791 372616 371329 369335 367152 364738 362211 360294 359342 358526 356820
52755 356820 354389 352135 350039 346812 341444 334417 327065 320189 313779 307776 302450 297968 294061 290361
52741 290361 286708 282961 278935 274893 271727 269995 268883 266803 263078 258451 253872 249542 245537 242573
52727 242573 241410 241799 242643 243126 243261 243569 244549 246157 247259 246083 241988 236583 232200 229326 226442 222498
52711 222498 218362 215373 213441 211507 209218 207048 205077 202755 199986 197451 195476 193475 191112 189309
52697 189309 189143 190000 189868 187700 184639 182421 181212 179734 177172 174006 170925 167864 164550 161373 158959
52682 158959 157103 154866 151807 148612 146189 144443 142384 139463 136447 134557 133774 132457 129150 124526
52668 124526 120850 119406 119102 118090 116192 114955 115542 117359 118898 119249 118541 117443 116727 116920 117862 118628
52652 118628 118364 117293 116623 117320 119088 120707 121281 120920 120176 119174 117682 115961 114958 115307 116422 117076
52636 117076 116812 116451 117203 119642 123512 128089 132548 136310 139329 141890 144097 145790 147056 148424 150284
52621 150284 152477 154740 157186 159801 161793 162240 161482 161132 162204 163752 163870 161677 157659 152346 145674
52606 145674 138098 131490 127958 127780 129091 129739 128982 127344 125529 124015 123258 123471 124011 123573 121368 117939
52590 117939 114582 112138 110577 109591 109182 109538 110631 112127 113598 114740 115468 116006 116776 117976 119228 119839
52574 119839 119492 118468 117115 115391 113204 111019 109716 109811 111076 112945 114933 116577 117401 117363 117150 117578
52558 117578 118655 119521 119331 117971 115827 113192 110171 107069 104492 102904 102206 101908 101697 101707 102209 103261
52542 103261 104790 106877 109676 112977 116070 118144 118857 118492 117633 116718 115860 115093 114736 115297 116852 118651
52526 118651 119736 119987 120318 121750 124482 127873 131040 133415 135034 136496 138365 140415 141689 141535 140405
52511 140405 139481 139799 141917 145885 150926 155286 157251 156679 155225 154742 155586 156699 157197 157587 159300 163086
52495 163086 168057 172420 175016 175943 175898 175504 175446 176606 179336 182834 185814 187772 189096 190038 190270 189652
52479 189652 188806 188419 188328 187886 187188 187475 190066 194986 200831 205943 209629 212225 214297 216187 218194 220550
52463 220550 222882 224260 224304 223956 224498 226067 227796 229226 230667 232096 232834 232772 232964 234109 235085 234026
52447 234026 230688 226851 224357 223566 223855 224692 225683 226240 226084 225908 226736 228475 229611 228759 226130 223095
52431 223095 220649 218875 217781 217747 218783 220065 220892 221703 223397 225935 228440 230553 232705 234906 236323
52416 236323 236592 236654 237504 238748 239292 239035 238950 239625 240668 241601 242544 243734 245010 246141 247194 248234 248969
52399 248969 249128 249119 250071 252926 257267 261083 262254 260734 258876 258979 260826 262413 262819 263205 264832 267336
52383 267336 269653 271602 273568 275249 275884 275475 274786 274237 273796 273993 275946 279924 284583 288127 289670 289163
52367 289163 286699 282644 278061 274172 271365 269173 267230 265835 265615 266919 269398 271909 273056 272436 271291
52352 271291 271427 273384 276149 278604 280596 282425 284060 285298 286140 286456 285805 284199 282637 282074 282110 281505
52336 281505 279919 278362 277936 278891 281005 283960 287069 289524 291387 293523 295951 297022 295117 290669 285712
52321 285712 281864 279683 279549 281704 285191 287928 288575 287742 286888 286601 286409 285816 284929 284295 284596 286339 289408
52304 289408 292984 296209 298913 301554 304673 308534 313001 317483 321239 324026 326316 328706 331439 334702
52290 334702 338890 344017 349240 353607 357114 360362 363325 365380 366682 368594 372190 376962 381607 385599
52276 385599 389300 392998 396751 401126 407068 414653 422744 430304 437333 443898 448995 451680 453217 456748
52262 456748 464070 473517 481881 487978 493465 500438 509321 519328 529905 540924 552031 562779 573425
52249 573425 584868 597607 611314 625807 641944 660858 682279 704235 724898 744453 764724
52238 764724 787051 811053 835548 859992 884584 909447 934566 960505 988420 1018896 1050940
52227 1050940 1082426 1111626 1138457 1164485 1191677 1220947 1251791 1283232 1314635 1345413 1374585
52216 1374585 1401439 1426434 1450672 1474557 1497702 1519963 1541545 1561929 1579855 1594813 1607577
52205 1607577 1618796 1628020 1634844 1640013 1644520 1648361 1651189 1653499 1656087 1658860 1661230 1663246 1665216 1666718
52191 1666718 1667182 1667157 1667675 1668618 1669117 1669525 1671479 1675787 1681768 1689043 1698597 1711305 1726528 1742861 1759487
52176 1759487 1776303 1793623 1812140 1832235 1852891 1872396 1890579 1909084 1928760 1948133 1965428
52165 1965428 1980829 1995529 2009519 2021743 2031715 2039795 2046416 2052136 2057623 2062337 2064075 2061269 2055063
52152 2055063 2047536 2038554 2026278 2010397 1992737 1974668 1955887 1936109 1915955 1895539 1873980 1851234
52140 1851234 1828865 1808048 1788209 1768647 1750096 1733402 1717774 1701773 1685357 1669732 1655795
52129 1655795 1643815 1633984 1625951 1618210 1609282 1599389 1589990 1581875 1574732 1568267 1562451 1556711 1550168 1542970
52115 1542970 1536265 1530459 1524561 1517855 1511329 1506508 1503338 1500038 1495009 1488218 1480667 1473113 1465671 1458470
52101 1458470 1452120 1447182 1443301 1439338 1434439 1428592 1421961 1414340 1405937 1398251 1393146 1390775 1389114 1385873
52087 1385873 1380411 1373634 1366706 1360434 1355332 1351412 1347908 1343836 1338980 1333894 1328814 1323196 1316686 1310167
52073 1310167 1305254 1302860 1302561 1303262 1303908 1303625 1301798 1298422 1294080 1289338 1284438 1279720 1275893 1273488 1272300
52058 1272300 1271686 1271090 1270028 1268119 1265745 1264213 1264562 1266501 1269296 1273260 1279365 1287606 1297057 1307644
52044 1307644 1320489 1336087 1353403 1371489 1390892 1412621 1436659 1462504 1490277 1520130 1551252
52033 1551252 1582805 1615481 1650776 1688819 1728136 1767529 1806990 1846649 1886102 1925177 1964202
52022 1964202 2002897 2039915 2074182 2105927 2135621 2162540 2185430 2204349 2220899 2236381 2250296
52011 2250296 2260972 2267431 2270433 2271801 2272733 2272726 2270111 2263607 2253332 2240419 2226004 2210807 2195463
51998 2195463 2180773 2167281 2154587 2141314 2126226 2109620 2093572 2080488 2071325 2065089 2059902 2054448
51986 2054448 2048694 2043614 2040322 2039292 2040272 2042881 2047040 2052833 2060212 2069031 2079069 2089768 2100222
51973 2100222 2109747 2118332 2126268 2133648 2140567 2147507 2155029 2163043 2170683 2176764 2180124 2179951 2176398 2170773
51959 2170773 2164603 2158433 2151705 2143478 2132917 2119675 2104529 2089178 2074374 2058415 2038587 2014100
51947 2014100 1986558 1957494 1926897 1894561 1861358 1828087 1794082 1758227 1720700 1682422 1643223
51936 1643223 1602067 1559149 1516416 1475425 1435552 1395081 1353562 1312454 1273544 1237195 1202166
51925 1202166 1166935 1131099 1095589 1061609 1029455 998317 967021 934913 902300 870387 840622
51914 840622 813753 789371 766457 744284 722687 701755 681605 662419 644258 626822 609749
51903 609749 593199 577767 563677 550592 538513 528300 520473 513592 504826 492740 478974 466475
51891 466475 456368 447364 438142 429201 421829 416037 410541 404483 398215 392306 386674 381167 376414 373411
51877 373411 372348 372252 371790 370237 367700 364704 361696 358738 355450 351228 345799 339833 334807 331786 330208
51862 330208 328360 325365 322295 320875 321359 322234 321881 319948 317045 313799 310544 307591 305268 303514 301553
51847 301553 298236 293071 286948 281498 277659 275209 273647 272657 271432 268643 264071 259412 256282 254073
51833 254073 251280 248415 247543 248785 249442 247545 244451 242527 241672 239902 236473 232536 228956 225407 221989
51818 221989 220095 220824 223391 226044 228114 230360 233402 236560 238613 239302 239527 239995 240302 239812 238983 238920
51802 238920 239771 240526 240544 240354 240578 241067 241690 243033 245382 247711 248810 249049 249961 252208 254944 257224 259053
51785 259053 260763 262180 263067 264094 266702 271633 277654 282151 283469 282569 281873 282561 283719 284056 283397 282111
51769 282111 280287 278283 277043 276781 276083 273545 269914 267535 267929 270792 274865 278674 280773 280559 278812
51754 278812 276597 273941 270609 267616 266534 267477 269292 271667 275371 280214 284421 286640 287192 286860 285845
51739 285845 284574 284042 284353 284089 282142 279183 276409 273881 271243 269111 268404 268872 269596 270514 272161 274258
51723 274258 275814 276640 277577 279042 280246 280211 278920 277268 276314 276672 278163 279932 281193 281911 282597 283633
51707 283633 285057 286752 288386 289290 288713 286276 282234 277700 274616 274719 278021 282706 286982 290563 294021
51692 294021 297410 300252 302384 304082 305772 308245 312580 318876 325389 329969 332287 333897 336397 340432
51678 340432 346200 353698 362304 371064 379575 387833 395288 401213 406192 412064 419804 428388 436259 443028
51664 443028 449095 454490 459047 463223 467743 472484 476377 478423 478484 477267 475861 474994 474344 472831 469926
51649 469926 466371 463197 460428 457368 453930 451004 449443 449163 449418 449662 449978 450813 452297 453805 454393 453793
51633 453793 452703 451918 451555 451455 451900 453326 455493 457650 459596 462014 465526 469852 474185 478237 482701
51618 482701 488618 496099 503571 508639 510282 509999 510237 511782 513355 513698 512982 511816 509986 507253 504806
51603 504806 504655 507471 511919 516338 520365 524584 529224 533789 537669 540632 542814 544470 545737 546416 546023
51588 546023 544084 540401 535133 528907 522728 517286 512232 506602 500144 493759 488276 483210 477270 469822
51574 469822 461335 452583 444035 435996 428694 421986 415419 408843 402702 397461 392944 388482 383690 378959
51560 378959 375053 372224 369916 367598 365787 365585 367023 368513 368461 366814 364290 360718 355412 349074 343930
51545 343930 341519 341269 341764 342460 343599 345192 346917 348466 349303 348648 346477 344141 343120 343423 343966 344233
51529 344233 344728 345986 348059 351006 355001 359724 364365 368502 372507 376973 382247 388495 395533 402420
51515 402420 407939 411846 415170 419024 423663 428907 434689 440620 445539 448330 449025 448595 447792 446729 445481
51500 445481 444417 443796 443277 442042 439309 434859 429332 424008 420098 418200 418396 420460 423694 426888 429111
51485 429111 430656 432789 436394 441146 446080 450632 454821 458749 462378 465803 469422 473589 478148 482386
51471 482386 485594 487781 489834 492791 496798 500874 503828 505349 506026 506447 506613 506297 505646 505174 505295 505993
51455 505993 506777 506795 505328 502665 500369 499998 501383 502653 502384 501266 501069 502202 503053 501928 499019 495997
51439 495997 493998 492510 490100 485757 479470 472152 465310 460349 457470 455228 451703 446272 439928 433948
51425 433948 428915 425199 423381 423291 423256 421556 418581 416467 416364 417135 417162 416289 415281 414358 413450 413369 415509
51408 415509 420410 427484 435982 445304 454493 462617 470012 478209 488059 498528 507827 515329 521916 528786
51394 528786 536288 543734 550166 555430 560447 566112 572118 577497 582206 587165 592556 597174 600087 602010
51380 602010 604169 606519 608097 608620 608621 608344 607712 607302 608141 610162 611952 612475 612311 612644 613777 615235 616787
51363 616787 618549 620266 621086 620202 617538 613897 610406 607457 604187 599551 593991 589182 585686 581762 575434
51348 575434 567102 559052 552754 547876 543716 540094 536558 532154 526843 522040 518830 516456 513651 510805
51334 510805 509607 510857 513722 516958 519706 521131 520651 518946 517734 517965 518920 519523 519697 519864 519945 519626
51318 519626 518996 518003 515727 511130 504384 496625 488516 479864 470675 461637 453233 445019 436217 426655 416803
51303 416803 407191 398104 389599 381469 373267 364614 355585 346860 339495 334323 331232 329059 326459 322934
51289 322934 318885 314829 310948 307325 304140 301447 299002 296451 293575 290456 287645 285951 285489 284996 282819
51274 282819 278942 275454 274441 275759 277440 278084 278082 278325 278494 277386 274855 272586 272429 274271 276281 277188
51258 277188 277535 278319 279215 279044 277720 276743 277577 280162 283299 286085 288768 292501 298272 305742 313251 319421
51242 319421 324634 330269 336608 342388 346529 349260 351079 351637 350534 348486 346654 345110 342871 339315
51228 339315 334841 330243 326107 322692 319659 315901 310346 303108 295342 287957 281044 274611 269118 264920
51214 264920 261705 258952 256574 254696 252993 250678 247242 243004 238823 235260 232103 228788 225285 222267
51200 222267 220267 218992 217821 216692 215996 215708 215232 214176 212701 210921 208522 205455 202647 201463 202400
51185 202400 204538 206337 206989 207092 208031 210558 213938 216656 217889 217959 217410 216337 215006 214496 215763 218099
51169 218099 219352 218134 215401 213348 213063 213823 214542 215161 216361 218468 221195 224110 226670 227971 227260
51154 227260 225016 222947 222440 223343 224633 225873 227419 229336 230862 231144 230150 228538 226871 225250 223708
51139 223708 222774 223368 225945 229792 233470 236011 237431 238042 237763 236498 234729 233105 231609 229714 227392
51124 227392 225391 224309 223763 222703 220484 217628 215603 215588 217191 218598 218420 217142 216309 216499 216740 215760
51108 215760 213158 209529 206228 204923 206288 208891 210352 210010 209486 210176 211320 211344 210037 208240 206253
51093 206253 204009 202347 202451 203911 204837 204355 203786 204727 206889 208521 208274 205963 202099 197578 193548 190834
51077 190834 189415 188816 188743 188949 188787 187568 185421 183335 182217 182162 182648 183171 183659 184466 185932 187776 189111
51060 189111 189378 189242 190156 192896 196747 200268 202735 204744 207486 211443 215744 218875 220183 220539 221258
51045 221258 222399 222459 219935 215038 209794 206617 206715 209472 213061 215771 217062 217496 217830 218410 219446 221365
51029 221365 224404 228055 231428 234197 236739 239176 240819 240988 240108 239415 239601 240248 240724 241063 241506 241618
51013 241618 240523 238022 234906 232078 229920 228746 229159 231335 234295 236577 237563 237653 237370 237056 237365 239109
50997 239109 242119 244981 246475 246865 247263 248093 248742 248396 246697 243919 241124 239878 241041 243820 246690
50982 246690 249134 251797 255032 258287 261160 264126 267618 271097 273822 276103 279057 283133 287388 290262
50968 290262 290886 289754 288367 288121 289344 291477 294008 296815 299572 301532 302293 302376 302660 303649 305550 308536
50952 308536 312461 316751 321014 325349 329706 333664 337424 342255 348999 356719 363953 370772 378286 386414
50938 386414 393788 400144 407315 417079 429120 441805 454105 465975 477681 489701 502922 518077
50926 518077 535081 553374 572729 593360 615551 639534 665436 693203 722966 755644 792508
50915 792508 833820 878473 925452 975114 1028657 1086953 1150343 1218878 1292213 1369969 1452849
50904 1452849 1542600 1639984 1743354 1850118 1958971 2069676 2181318 2292146 2400862 2506738
50894 2506738 2608533 2704498 2793464 2874777 2947179 3009074 3060070 3101004 3132108 3152343 3161059
50883 3161059 3159236 3148700 3131253 3109125 3084879 3059659 3032367 3001720 2968632 2935536 2903648
50872 2903648 2871754 2837555 2799476 2757268 2711418 2662103 2608604 2549985 2486242 2418096 2345581
50861 2345581 2267956 2185572 2100752 2015878 1931414 1846893 1763077 1681840 1604357 1530707 1461031
50850 1461031 1395747 1334690 1277410 1224419 1176932 1135096 1097616 1063469 1032863 1006055 982348
50839 982348 960929 941829 925290 910933 898331 887792 879667 873320 867791 863365 861578 863378 867777
50826 867777 872725 877177 882100 889326 899461 911155 922621 933653 945679 959987 976459 994071
50814 994071 1012160 1031164 1052594 1078219 1108523 1141924 1176233 1211080 1248079 1288580 1332437
50803 1332437 1379520 1431143 1488784 1552126 1619645 1691040 1768199 1853906 1950204 2057690 2175636
50792 2175636 2303091 2440625 2590667 2755308 2934047 3124552 3325360 3536793 3759323
50783 3759323 3992065 4232773 4478258 4724778 4969112 5209302 5443111 5665675 5870170
50774 5870170 6051361 6207222 6336494 6436544 6505250 6543951 6556630 6546486 6515031 6464658
50764 6464658 6400423 6328345 6252756 6175977 6099817 6026288 5956582 5889959 5824258 5757613 5689239
50753 5689239 5617980 5540348 5451123 5346596 5226743 5093739 4948981 4792407 4624204 4445838
50743 4445838 4259383 4066931 3871131 3675444 3483136 3296278 3115962 2943141 2779026
50734 2779026 2624956 2482052 2350599 2229709 2118016 2014813 1920103 1833661 1754879 1683705
50724 1683705 1620693 1565571 1516641 1472428 1433160 1399596 1370936 1345053 1320611 1297818 1277229
50713 1277229 1258961 1243140 1229794 1217927 1205928 1193544 1182359 1173574 1166400 1159709 1154247 1151599
50701 1151599 1151494 1151903 1151985 1153367 1157964 1165783 1175644 1187010 1200133 1215085 1231742 1250520 1272271
50688 1272271 1297569 1326638 1359740 1396876 1437280 1480111 1525800 1576053 1632164 1693857 1760198
50677 1760198 1831405 1909377 1996315 2092865 2197634 2308658 2425395 2549024 2680659 2819653
50667 2819653 2963955 3111563 3260977 3410560 3558368 3702607 3841368 3971726 4089971
50658 4089971 4193138 4279701 4348338 4396846 4423096 4426800 4409779 4374746 4324474 4262073 4191336
50647 4191336 4116360 4040687 3966606 3895140 3826864 3762837 3704410 3651980 3604244 3558905 3513718
50636 3513718 3466574 3415142 3357110 3290676 3214598 3128280 3032472 2929533 2822144 2711699 2598565
50625 2598565 2483821 2369944 2259487 2153698 2052734 1956748 1866319 1782132 1704623 1633986
50615 1633986 1570325 1513754 1464253 1421367 1384233 1352102 1324619 1301331 1281285 1263623 1248441
50604 1248441 1236508 1228299 1223890 1223579 1227665 1235536 1245820 1257742 1271514 1287173 1304141 1322648
50592 1322648 1344501 1371270 1402202 1435206 1469714 1507312 1549427 1595486 1643898 1694023 1746616
50581 1746616 1802867 1863557 1928768 1997881 2070094 2145263 2223857 2305640 2388833 2471345 2552648
50570 2552648 2633536 2713892 2791522 2863702 2929287 2988590 3041607 3087328 3124915 3154680 3177393
50559 3177393 3193178 3201838 3204155 3202186 3198112 3193194 3188120 3183900 3181781 3182194 3184254 3186707 3189273 3192578
50545 3192578 3196652 3200023 3200795 3198447 3193801 3186979 3176020 3158040 3131367 3095956 3051997 2999059 2936924
50532 2936924 2866648 2790326 2709985 2626960 2542083 2456088 2369777 2284020 2199663 2117489 2038373
50521 2038373 1963344 1893195 1827907 1766812 1709569 1656756 1609286 1567383 1530414 1497508 1468025
50510 1468025 1441600 1418318 1398982 1384772 1376231 1372702 1372979 1376358 1382797 1392260 1404463 1419359 1437290
50497 1437290 1458220 1481194 1505145 1530194 1557522 1587859 1620626 1654860 1690302 1727112 1764944
50486 1764944 1803098 1841520 1880986 1922123 1964666 2007764 2050670 2093126 2135523 2178872 2224329
50475 2224329 2272587 2324005 2379298 2439634 2505862 2578039 2655939 2739630 2829357 2925367 3028332
50464 3028332 3139505 3259750 3388386 3523512 3663425 3807144 3953367 4099592 4242821
50455 4242821 4380897 4512549 4636219 4749530 4850197 4936771 5007808 5060728 5092554 5102022
50445 5102022 5090192 5058769 5008781 4941553 4860072 4768319 4669607 4566618 4462662 4361501 4265806
50434 4265806 4176978 4096815 4028102 3972911 3931289 3902316 3885510 3880250 3884557 3895466 3910118 3925532
50422 3925532 3937800 3942620 3936616 3917409 3882780 3830951 3761784 3676817 3578104 3467789 3348725
50411 3348725 3224306 3097255 2969319 2842282 2718205 2598287 2482594 2371639 2267374
50402 2267374 2171728 2084852 2005822 1934532 1871687 1817112 1769286 1726877 1689833 1658625 1633173
50391 1633173 1613003 1597888 1587793 1582512 1581801 1585625 1593854 1605980 1621519 1640472 1662915 1688340
50379 1688340 1715949 1745573 1777730 1812703 1849999 1888854 1928723 1969101 2009370 2049339 2089453
50368 2089453 2129953 2169930 2207775 2242549 2274522 2304380 2332350 2358266 2382161 2404423 2425295
50357 2425295 2444332 2460692 2474367 2487127 2501677 2519588 2540471 2563405 2588543 2616667 2647855
50346 2647855 2681644 2718265 2758603 2802810 2849793 2898108 2946395 2992872 3035572 3073574 3107024
50335 3107024 3135444 3156873 3169259 3171754 3163916 3144681 3113244 3070411 3017992 2957140 2888283 2812417
50323 2812417 2731636 2648538 2565754 2485708 2409947 2338934 2273266 2214747 2165349 2125419 2093964
50312 2093964 2070510 2055473 2048685 2048720 2053874 2062604 2072744 2081454 2086655 2087700 2084152 2074797 2058513
50299 2058513 2035345 2005973 1970737 1929977 1884857 1837030 1787771 1738151 1689766 1644372 1602597
50288 1602597 1563556 1525863 1488746 1452271 1417088 1384158 1354303 1327647 1303616 1281802 1262724
50277 1262724 1247355 1235729 1226404 1217838 1210188 1205086 1203564 1204900 1207946 1212878 1220859 1232373 1246805
50264 1246805 1263353 1281449 1300267 1318883 1337229 1356238 1376710 1398597 1421551 1445561 1470744
50253 1470744 1496975 1523929 1551078 1577580 1602764 1626849 1650617 1674203 1696727 1717152 1734897
50242 1734897 1749615 1761239 1770415 1777971 1783550 1785607 1783305 1777723 1770705 1763123 1754663 1744695 1732775
50229 1732775 1718892 1703767 1688403 1672943 1656554 1638769 1620299 1602046 1584033 1565703 1546556
50218 1546556 1526032 1503743 1480409 1457604 1435914 1414381 1392607 1372105 1354136 1337229 1318651
50207 1318651 1297900 1277080 1258042 1240818 1224956 1210707 1198294 1187206 1176980 1168181 1162110 1159720
50195 1159720 1160569 1162526 1163135 1162030 1161488 1163616 1167680 1171452 1174476 1178105 1182576 1186223 1188074 1189334 1191369
50180 1191369 1193704 1194989 1194749 1193284 1190826 1187683 1184313 1180556 1175657 1169698 1163896 1158664 1152544 1144191
50166 1144191 1134495 1125580 1118487 1112999 1108944 1106202 1103860 1100858 1097443 1094932 1094113 1094792 1096639 1099437
50152 1099437 1102683 1106069 1110254 1116060 1122923 1129211 1134145 1138326 1142221 1145395 1147579 1149342 1150955 1151498
50138 1151498 1149848 1146007 1140743 1134485 1127287 1119496 1111634 1103688 1095179 1085991 1076576 1067235 1057554 1046890
50124 1046890 1035223 1023291 1011887 1001222 991063 981294 972030 963137 954029 944302 934422 925551 918655
50111 918655 913793 910093 906311 901728 896740 892376 888988 885718 881572 876645 871794 867306 862463 856298
50097 856298 848311 838567 827740 817085 807754 799944 793035 786567 780569 774891 768853 761841 753919 745726
50083 745726 738138 732091 728241 726472 726007 726112 726451 726762 726697 726133 725279 724356 723595 723558 724940 727844 731736
50066 731736 736223 741347 747075 753262 760293 768855 778559 787729 795395 802792 811899 823019 834868 846688
50052 846688 858949 871941 884941 897280 909292 921538 933634 944414 952998 959354 964211 968766
50040 968766 974099 980372 986750 992453 997640 1002855 1007962 1012379 1016477 1021918 1029895 1039393 1048036 1054806
50026 1054806 1061179 1069128 1078732 1088583 1097990 1107439 1116801 1124666 1130423 1135997 1144284 1156270 1170638
50013 1170638 1185806 1201183 1216681 1232293 1248389 1265381 1282863 1299912 1316386 1332944 1349703
50002 1349703 1366064 1382173 1399250 1417773 1436507 1454225 1471285 1488477 1505415 1521420 1537172
49991 1537172 1553777 1570612 1585775 1598679 1610560 1622137 1632313 1639745 1644356 1646539 1646058 1642786
49979 1642786 1637668 1631839 1625178 1616741 1606311 1594583 1581922 1567876 1552174 1535447 1518550 1501597
49967 1501597 1484123 1466018 1447845 1430164 1413064 1396788 1382435 1371169 1362464 1354053 1344311 1334100
49955 1334100 1325393 1318578 1312391 1306262 1301187 1297940 1295844 1294022 1292680 1292233 1292123 1291612 1291017 1291022 1291251 1290604
49939 1290604 1288690 1285840 1282026 1276917 1270918 1265027 1259511 1253643 1246916 1239705 1232636 1226027 1220048 1214650
49925 1214650 1209319 1203688 1198445 1194736 1192644 1191214 1190057 1189770 1190470 1191175 1191201 1190980 1190775 1189786 1187526 1185101
49909 1185101 1183878 1183637 1183282 1182701 1182541 1182505 1181330 1178226 1172972 1164713 1152355 1136431 1119013 1101095
49895 1101095 1081408 1058610 1033404 1007469 981414 955147 929472 905641 883546 861815 839911
49884 839911 818918 799928 782754 766735 751865 738406 726182 715054 705582 698213 692045 685305
49872 685305 677188 668589 660893 654613 649403 644776 640381 635955 631478 627299 623870 621450 620199 620153 620821
49857 620821 621146 620492 619574 619758 621303 622846 622930 621668 620461 620404 621469 623009 624377 624939 624217 622551 621233
49840 621233 621382 622748 624119 624874 625510 626547 627598 628040 628138 628834 630620 633329 636875 641424 646664 651741
49824 651741 656326 661067 666453 671884 676567 680941 686341 693471 702044 711845 723231 736341 750605
49811 750605 765454 781033 797803 815874 835047 855220 876428 898727 922133 946374 970614
49800 970614 993996 1016700 1039823 1063769 1087325 1108953 1128551 1147240 1165707 1183590 1200384
49789 1200384 1216123 1230891 1244081 1254369 1260181 1260432 1255305 1246308 1235043 1221909 1206444 1188667
49777 1188667 1169245 1148304 1125223 1100160 1074830 1050806 1027482 1002728 975506 947157 920107
49766 920107 895987 875033 856480 839087 821840 804724 788715 774677 762414 751036 740046
49755 740046 729713 720455 712231 704587 697122 689876 683447 678588 675446 673212 670885 668288 665897 663634
49741 663634 660602 656433 652255 649471 647894 646028 643188 640383 638807 638368 638241 638056 637778 637057 635628
49726 635628 634020 632846 631587 629110 625456 622049 619846 618222 616197 613866 611962 610707 609983 610063 611277
49711 611277 613158 614809 616050 617421 619104 620661 622003 623830 626728 630429 634364 638521 643373 649271
49697 649271 656232 664039 672265 680546 689106 698661 709491 721017 732802 745534 760327 777171 794861
49684 794861 812563 830804 850573 871975 894161 916223 937699 958354 977964 996406 1013660
49673 1013660 1029643 1044131 1056959 1068372 1079235 1090817 1103894 1117859 1130949 1141679 1149825
49662 1149825 1155694 1158745 1157651 1151731 1141664 1128552 1112907 1095010 1075655 1055830 1035965 1016171
49650 1016171 997036 979316 962886 946971 931710 918544 908274 899480 889946 879422 870007 863685
49638 863685 860396 858826 858159 858246 858579 858166 856749 855467 855720 857384 858567 857407 854006 850328 848248 848080
49622 848080 849090 850769 852950 855075 856318 856616 856881 857888 859470 861056 862425 863625 864742 866218 868733
49607 868733 872125 874961 876008 875783 875770 876395 876827 876779 877283 879168 881652 883211 883422 883226 883667 884988 886935
49590 886935 889330 891999 894364 895518 894994 893357 891774 890956 890897 891692 893854 897280 900497 901931 901756 901593
49574 901593 902407 903679 904738 905898 907834 910583 913657 916539 918727 919986 920918 922640 925524 928920 932510
49559 932510 937029 943119 950336 958059 966516 976059 986193 996284 1006460 1016703 1025864 1033083 1039729
49546 1039729 1048255 1059286 1071401 1083931 1098218 1115393 1134371 1153042 1170631 1187984 1206114
49535 1206114 1225317 1245426 1266222 1287598 1309584 1332187 1355353 1379368 1405043 1432893 1462391
49524 1462391 1492811 1524548 1558552 1594505 1630929 1667504 1705923 1747697 1792159 1837558 1883296
49513 1883296 1930139 1978838 2029535 2082112 2136257 2191359 2246980 2303117 2359582 2415799 2471854
49502 2471854 2529101 2588695 2649898 2710806 2770497 2829461 2888075 2945713 3001559 3055466 3107663
49491 3107663 3158144 3206545 3252188 3294079 3331320 3363752 3392028 3416971 3438916 3457466 3471776
49480 3471776 3481386 3487064 3490397 3492234 3492000 3489002 3483879 3478091 3472542 3467613 3464031 3462371 3461734 3460258
49466 3460258 3457495 3455372 3456266 3460701 3467452 3475377 3484667 3496549 3512109 3531168 3552153 3573372 3594572
49453 3594572 3616885 3641182 3667024 3693466 3720221 3747272 3773556 3796808 3815068 3828182 3837613
49442 3837613 3844778 3849645 3850798 3846552 3835906 3818826 3796164 3769157 3738343 3702892 3661686 3615219
49430 3615219 3565594 3514268 3460758 3404207 3345123 3284411 3221666 3156178 3089306 3023982 2961465
49419 2961465 2899926 2836741 2770995 2703444 2635437 2568729 2505201 2445737 2389768 2336440 2285463
49408 2285463 2236478 2188742 2142252 2098185 2057113 2017729 1978505 1939868 1903333 1869115 1836277
49397 1836277 1805068 1777226 1753448 1732014 1710670 1688946 1667890 1648390 1630694 1615031 1601715
49386 1601715 1590566 1580742 1571237 1561493 1551796 1543123 1536174 1530364 1524278 1517527 1511597 1508319 1507947 1509317
49372 1509317 1511530 1514608 1518700 1523738 1530109 1538726 1549797 1562153 1574486 1587010 1601413 1619515
49360 1619515 1642320 1669709 1699925 1729505 1754868 1774570 1789545 1801047 1809167 1813724 1815750 1817198
49348 1817198 1819503 1823077 1828011 1834649 1843497 1854972 1869161 1885551 1903206 1921550 1940700 1960711
49336 1960711 1980977 2000954 2021065 2042108 2063935 2085477 2105965 2125435 2144167 2162412 2180603
49325 2180603 2198960 2216858 2233490 2249306 2265873 2284058 2303246 2322672 2342595 2363672 2385978
49314 2385978 2409211 2433136 2457258 2480853 2504086 2528373 2554852 2583072 2612191 2642849 2676634
49303 2676634 2713812 2752700 2791451 2829687 2868266 2908322 2950830 2996420 3045062 3096132 3149042
49292 3149042 3203670 3260150 3318495 3378447 3439504 3501263 3564138 3629556 3698861 3771813 3846617
49281 3846617 3921732 3997443 4075526 4157546 4243586 4332418 4422623 4513549 4605362 4698394 4792671
49270 4792671 4888022 4984287 5081212 5178382 5275436 5372203 5468402 5563444 5656697 5747645 5835429
49259 5835429 5918703 5996570 6069574 6139131 6205849 6268809 6326524 6378058 6423116 6461667 6494086
49248 6494086 6521480 6545158 6565408 6580995 6590275 6592961 6590604 6585193 6577672 6568238 6557749 6547849 6539333
49235 6539333 6531164 6521800 6511181 6500829 6492270 6486021 6481919 6479654 6478805 6478967 6480300 6483767 6490678 6502010
49221 6502010 6517955 6537615 6559051 6580208 6600260 6619937 6640270 6661092 6680987 6698596 6713521
49210 6713521 6725750 6734558 6738502 6736507 6728447 6714414 6693977 6666736 6633195 6594288 6550160 6500189
49198 6500189 6444285 6383282 6317817 6247742 6173227 6095729 6017098 5938100 5858338 5777365 5695499
49187 5695499 5613898 5534150 5457278 5382761 5309108 5235763 5163779 5094188 5026734 4961087 4898349
49176 4898349 4840053 4786069 4734671 4684424 4635023 4586699 4539945 4495513 4453527 4412870 4372696
49165 4372696 4334111 4298861 4266650 4235647 4205648 4178573 4155248 4133795 4112400 4091778 4073322
49154 4073322 4056231 4038402 4019409 4000764 3983632 3967902 3953413 3940465 3928842 3917494 3905675
49143 3905675 3893713 3882488 3872785 3865206 3859988 3856643 3854223 3852111 3850315 3849173 3849253 3851283 3855659 3862145
49129 3862145 3870482 3880929 3893465 3906819 3919353 3931019 3943601 3958733 3976321 3995080 4013925
49118 4013925 4032640 4051823 4072396 4094605 4117320 4139141 4160470 4183676 4210695 4241199 4273690
49107 4273690 4307485 4342632 4378567 4414287 4449823 4486392 4524941 4565601 4608794 4655570 4706058
49096 4706058 4758591 4811434 4864889 4920674 4979560 5040732 5103333 5167323 5232487 5297771 5362429
49085 5362429 5427189 5493491 5561900 5631719 5701645 5770058 5835129 5895677 5952064 6005669 6057377
49074 6057377 6107046 6154376 6199587 6243048 6284676 6323974 6360447 6393943 6424826 6453750 6480985
49063 6480985 6506254 6529590 6552046 6574776 6597568 6619108 6638770 6657286 6675440 6693021 6709508
49052 6709508 6725042 6740072 6754556 6768056 6780234 6790752 6799244 6806059 6812686 6820583 6829627 6838310
49040 6838310 6845577 6852072 6859516 6869155 6880879 6893561 6906188 6918726 6931961 6946583 6962624 6979632
49028 6979632 6997017 7014189 7030851 7047326 7064213 7081639 7099318 7117427 7136673 7157165 7177842
49017 7177842 7197574 7216349 7234973 7254064 7273744 7293659 7312728 7329469 7343481 7356195 7369307
49006 7369307 7382613 7394080 7401967 7406261 7408262 7409378 7410062 7409197 7404595 7394722 7379836 7361093 7339088
48993 7339088 7314038 7286662 7257609 7226275 7191509 7153488 7113640 7072708 7030340 6986870 6943857
48982 6943857 6902094 6860426 6817514 6773698 6730097 6687000 6644526 6603944 6566562 6531600 6496895
48971 6496895 6461993 6429055 6400157 6374835 6351089 6327970 6306249 6287044 6270764 6257320 6246481
48960 6246481 6237796 6230702 6225037 6221079 6218726 6216914 6214479 6211591 6209719 6209752 6210609 6210302 6208227 6205707 6204173
48945 6204173 6203484 6202412 6200192 6196992 6193044 6187897 6180571 6170048 6155755 6138019 6118213 6098028 6078231
48932 6078231 6058092 6036143 6011533 5984632 5956430 5927379 5896970 5864436 5829677 5793270 5755712
48921 5755712 5717051 5677322 5636764 5595182 5551469 5504367 5453826 5401368 5349060 5298307 5249374
48910 5249374 5201496 5153339 5103889 5053415 5003447 4955561 4910158 4866458 4823604 4781580 4741189
48899 4741189 4703414 4668819 4637353 4608577 4582082 4557744 4535678 4516109 4499461 4486449 4477779
48888 4477779 4473585 4473329 4476381 4482511 4491568 4503010 4516302 4531800 4550571 4572978 4597934 4624079
48876 4624079 4651335 4680577 4711985 4744560 4777461 4810937 4845538 4881194 4917770 4955961 4996631
48865 4996631 5039432 5083079 5127063 5172096 5218534 5265319 5311310 5357093 5404532 5454686 5506963
48854 5506963 5560239 5614033 5668445 5723839 5780987 5840879 5903773 5968764 6034857 6102161 6171533
48843 6171533 6243248 6316698 6391400 6467680 6546086 6626340 6707022 6786325 6863367 6939050 7015267
48832 7015267 7092716 7169644 7243355 7312914 7379612 7444779 7507988 7567704 7622791 7672686 7716767
48821 7716767 7754534 7786233 7812615 7834069 7850445 7861591 7867502 7867875 7862026 7849507 7830744 7807057
48809 7807057 7779886 7749574 7714857 7674107 7627365 7576531 7523185 7467196 7408318 7348129 7288728
48798 7288728 7229687 7168086 7102019 7032722 6962663 6892949 6823570 6754988 6687950 6622308 6557507
48787 6557507 6494138 6433639 6376292 6320732 6266003 6213073 6163546 6117515 6073617 6030981 5990161
48776 5990161 5952181 5917424 5885839 5857632 5833207 5812642 5795598 5781553 5769825 5759613 5750592
48765 5750592 5743369 5738757 5736676 5736435 5738134 5742838 5750999 5761610 5773632 5787413 5803631 5821472 5839227
48752 5839227 5856596 5875102 5896056 5919348 5944559 5971966 6001715 6032982 6065044 6098505 6134465
48741 6134465 6172790 6212104 6251319 6290315 6329161 6367522 6405152 6442564 6480831 6520773 6562210
48730 6562210 6603874 6644248 6682713 6719733 6755762 6790452 6823372 6855105 6886949 6919654 6952966
48719 6952966 6986346 7019404 7051567 7081947 7109842 7135113 7157874 7178172 7196112 7211976 7225987
48708 7225987 7238024 7247597 7253909 7256003 7253252 7245847 7234518 7219534 7200195 7175567 7145540 7110849
48696 7110849 7072057 7028919 6981117 6929507 6876111 6822491 6768354 6712216 6653421 6593002 6532521
48685 6532521 6472699 6413540 6355242 6298298 6242978 6189399 6138131 6090190 6046234 6005963 5968353
48674 5968353 5932499 5898650 5868792 5845707 5830732 5822488 5818496 5817924 5822104 5832304 5847808 5866572
48662 5866572 5887203 5909934 5936023 5966506 6001135 6038134 6075255 6111414 6147258 6184145 6222829
48651 6222829 6263174 6304541 6346168 6387502 6428427 6468984 6508841 6547560 6585425 6623216 6660672
48640 6660672 6695921 6727154 6754594 6780250 6806160 6833434 6862374 6892489 6922682 6952508 6983332
48629 6983332 7017204 7054417 7093283 7132648 7173604 7218057 7266517 7318268 7373040 7431314 7493050
48618 7493050 7557151 7622482 7688802 7756575 7826351 7898473 7972838 8048618 8124479 8199293 8272489
48607 8272489 8343730 8412611 8478695 8541386 8599476 8651125 8694643 8729302 8755259 8772862 8781962
48596 8781962 8781543 8769864 8745432 8708318 8660503 8604592 8542125 8473122 8397017 8313774 8224242 8129826
48584 8129826 8031887 7931306 7828474 7723679 7617406 7510372 7403453 7297492 7192810 7089036
48574 7089036 6986056 6885266 6788992 6697967 6610089 6522621 6435283 6350097 6268416 6189448 6112068
48563 6112068 6036715 5964623 5895993 5829932 5765717 5703130 5641805 5581302 5521918 5464620 5409901
48552 5409901 5357308 5306232 5256587 5208436 5161622 5116231 5072849 5031682 4991635 4951117 4909870
48541 4909870 4869325 4830878 4794353 4758641 4723348 4689059 4656193 4624449 4593524 4563576 4534572
48530 4534572 4505875 4477056 4448633 4421318 4395035 4369547 4345748 4325248 4308593 4294814 4282910
48519 4282910 4272764 4264189 4256137 4247762 4239688 4233353 4229256 4226473 4223799 4220859 4218369 4217764 4220350 4226295
48505 4226295 4234471 4243599 4253293 4263625 4274073 4283666 4292127 4300222 4308834 4318029 4327130 4335557 4343674
48492 4343674 4352848 4364263 4377426 4390427 4402187 4413921 4427645 4443777 4461133 4478845 4496988
48481 4496988 4515270 4532526 4548083 4562736 4577780 4593758 4610606 4628170 4645917 4662790 4678252
48470 4678252 4693130 4708710 4725165 4741569 4757350 4773105 4789934 4808432 4828303 4848580 4868158
48459 4868158 4886580 4904508 4923344 4944302 4967733 4993087 5019327 5045699 5072521 5101110 5132578
48448 5132578 5166682 5202176 5238364 5275901 5315829 5358059 5401290 5444518 5488271 5533993 5582368
48437 5582368 5632650 5683628 5734733 5786046 5837906 5891048 5946567 6004850 6064587 6123651 6180985
48426 6180985 6236950 6291899 6345419 6397268 6447945 6497587 6544989 6588668 6628401 6664776 6697360
48415 6697360 6724388 6744532 6758277 6767097 6771750 6771921 6767309 6758455 6746262 6731172 6713229 6692682
48403 6692682 6669755 6643676 6612904 6577038 6537812 6497097 6454261 6406930 6354443 6299082 6243242
48392 6243242 6186680 6127581 6065378 6001280 5936557 5871465 5805659 5738719 5670463 5601648 5534077
48381 5534077 5469023 5405697 5342248 5278211 5214923 5153543 5093934 5035928 4980535 4929097 4881830
48370 4881830 4837949 4796862 4758691 4723854 4692605 4664926 4640581 4619308 4601033 4585768 4573365
48359 4573365 4563646 4556635 4552236 4549776 4548364 4547737 4548187 4549687 4551784 4554459 4558334 4563673 4569864 4576350
48345 4576350 4583540 4592310 4602993 4615274 4628616 4642355 4655871 4669362 4684169 4701584 4721316 4741658
48333 4741658 4761215 4780057 4799149 4819105 4839768 4860814 4882315 4904325 4925983 4945573 4961978
48322 4961978 4975842 4988719 5001333 5013465 5025313 5037675 5050430 5062105 5071706 5079992 5087981 5095172
48310 5095172 5100629 5105175 5110810 5118009 5125203 5131274 5137146 5144241 5152533 5161091 5169674 5178817 5188849 5199856
48296 5199856 5212362 5226993 5243324 5259856 5275508 5290658 5306388 5323155 5340622 5358612 5377611
48285 5377611 5398172 5420144 5442831 5465717 5488696 5511657 5534315 5556659 5579110 5601770 5623771
48274 5623771 5643807 5661446 5677605 5693754 5710800 5728504 5745606 5760618 5772981 5783529 5793514
48263 5793514 5803220 5811934 5819287 5826015 5833003 5839933 5845363 5848210 5848910 5848912 5849073 5848763 5846859 5843468 5840055
48248 5840055 5837519 5834802 5830076 5823017 5815245 5808734 5804501 5802551 5802053 5801592 5800299 5799068 5799716 5802748 5806853
48233 5806853 5810793 5814599 5818460 5822020 5825798 5831920 5841765 5853697 5864816 5874495 5884467 5895593 5906511
48220 5906511 5915763 5923472 5930143 5935269 5938127 5938852 5937651 5933714 5925885 5913799 5897428 5876244 5849969
48207 5849969 5819851 5787941 5754993 5719933 5681409 5639088 5593288 5544287 5492502 5438801 5384143
48196 5384143 5329079 5273962 5219378 5165909 5113380 5060612 5006263 4950000 4892720 4835482 4778441
48185 4778441 4721243 4664241 4608616 4555025 4502833 4451204 4400425 4351447 4304481 4258896 4214325
48174 4214325 4170947 4128535 4086105 4043086 4000410 3959893 3922548 3887659 3853383 3818261 3782428
48163 3782428 3747404 3714518 3683533 3652960 3621520 3588830 3555007 3520403 3485782 3451863 3418320
48152 3418320 3384008 3348627 3313392 3279373 3245829 3211174 3175140 3138931 3103277 3067481 3030634
48141 3030634 2992883 2955019 2917435 2880045 2842714 2805298 2767505 2729178 2690525 2651779 2612976
48130 2612976 2574487 2537475 2503218 2471966 2442926 2415395 2389432 2365342 2342956 2321721 2301154
48119 2301154 2280897 2260662 2240644 2221946 2206115 2194033 2185423 2179428 2175303 2172367 2169820 2167278
48107 2167278 2165434 2165510 2167792 2171177 2174569 2178248 2183297 2189928 2197205 2204497 2212373 2221597 2231836 2242147
48093 2242147 2252423 2263564 2276195 2289916 2304072 2318556 2333423 2348168 2362130 2375436 2388901
48082 2388901 2402866 2416694 2429728 2442313 2455392 2469295 2483403 2497059 2510314 2523553 2536795
48071 2536795 2549820 2562777 2576097 2589694 2602706 2614425 2625215 2636154 2647891 2660181 2672423
48060 2672423 2684288 2695870 2707739 2720898 2736143 2753071 2770121 2785987 2800820 2815752 2831559
48049 2831559 2848211 2865449 2883108 2900834 2918010 2934191 2949391 2964010 2978800 2994718 3012150
48038 3012150 3030288 3047969 3065227 3083295 3102785 3122860 3142841 3163794 3187440 3213862 3241397
48027 3241397 3268669 3295656 3322679 3349569 3376354 3403930 3433259 3464306 3496272 3528456 3560449
48016 3560449 3592001 3623313 3655049 3687342 3719092 3749150 3778209 3808608 3841945 3877421 3912854
48005 3912854 3946754 3978927 4009598 4038795 4066614 4093439 4119552 4144754 4168533 4190593 4211063
47994 4211063 4230336 4248706 4266069 4281952 4296019 4308599 4320509 4332161 4343063 4352571 4361092 4370091
47982 4370091 4380715 4392810 4405566 4418929 4433968 4451990 4473668 4498937 4527015 4555917 4581931
47971 4581931 4599785 4603744 4589201 4554262 4500565 4432644 4356036 4275385 4193624 4112267 4032061
47960 4032061 3953449 3876634 3801437 3727392 3654266 3582386 3512170 3443375 3375273 3307704 3241562
47949 3241562 3177947 3117084 3058263 3000553 2943321 2886458 2830540 2776623 2725550 2677592 2632869
47938 2632869 2591574 2553333 2516841 2480954 2445929 2412881 2382135 2352987 2325096 2299112 2275569
47927 2275569 2253937 2233237 2212975 2193034 2173343 2154257 2136795 2121767 2108935 2097519 2087098
47916 2087098 2077436 2067932 2058172 2048804 2040935 2034583 2028594 2022175 2015736 2010000 2005055 2000624 1996490 1992202
47902 1992202 1987068 1981024 1974989 1969597 1963900 1956052 1945180 1932025 1917965 1904048 1890909 1878806
47890 1878806 1867340 1855528 1842404 1827468 1810702 1792583 1774102 1756235 1739172 1722411 1705702
47879 1705702 1689537 1674536 1660786 1648015 1636020 1624603 1613492 1602736 1592923 1584657 1577989 1572610
47867 1572610 1568340 1565187 1563326 1563355 1566033 1571181 1577345 1583361 1589900 1598488 1609286 1621102 1633546 1647509
47853 1647509 1662955 1677828 1690449 1701876 1714370 1728149 1741205 1752031 1760953 1768760 1775605 1781601
47841 1781601 1787044 1791398 1793298 1792320 1789691 1786446 1782034 1775751 1768467 1761508 1754538 1746116 1736050 1725611
47827 1725611 1715415 1704668 1692928 1681350 1671567 1664303 1659595 1657355 1656901 1656641 1655088 1651984 1648137
47814 1648137 1644642 1642531 1642390 1643707 1645184 1646263 1647788 1650634 1654441 1658519 1663278 1669698 1677845 1687082
47800 1687082 1697423 1709251 1721659 1732433 1740319 1746435 1752879 1760478 1768347 1775080 1779934 1783165 1785466
47787 1785466 1786891 1786359 1782750 1776387 1768690 1760307 1750564 1739184 1727392 1716368 1705284 1691994 1675497
47774 1675497 1656840 1637666 1618786 1600361 1582673 1566092 1550484 1535207 1519876 1505001 1491611
47763 1491611 1480149 1470025 1460543 1451995 1445258 1440429 1436596 1433049 1429962 1427558 1425427 1423282 1421696
47750 1421696 1421348 1421973 1422813 1423751 1425305 1427795 1431252 1435879 1441736 1447951 1452946 1455553 1455573 1453518 1450459
47735 1450459 1447945 1447227 1448428 1450931 1454388 1458660 1463057 1466672 1469678 1473431 1479068 1486681 1495939 1506514
47721 1506514 1517526 1527646 1536678 1546554 1559934 1577819 1598832 1620596 1641611 1662128 1683644 1707391
47709 1707391 1733175 1759770 1786367 1813074 1839877 1865818 1889669 1911140 1931181 1951321 1972676
47698 1972676 1995011 2016462 2034652 2048382 2058034 2064514 2068537 2070901 2072279 2072195 2069145 2062510 2053627
47685 2053627 2044181 2034157 2022263 2007859 1991558 1974293 1956705 1939174 1921605 1903447 1884786
47674 1884786 1867160 1852324 1840288 1829504 1818998 1809370 1801488 1795176 1789550 1784024 1778648 1773970 1770885
47661 1770885 1770166 1771927 1775789 1781503 1788960 1797829 1807978 1820361 1836555 1856918 1879750 1902770 1925143
47648 1925143 1947831 1972311 1999237 2027956 2056919 2084688 2110719 2135143 2157943 2178722 2197120
$$ [...]
##END NTUPLES=NMR SPECTRUM
##END=
