
##TITLE=AC1217_HTEAH12048_7155294_vUIiVK8vfx
##JCAMPDX= 6.0         $$ Bruker NMR JCAMP-DX V2.0
##DATA TYPE= NMR SPECTRUM
##DATA CLASS= NTUPLES
##ORIGIN= BRUKER
##OWNER= Administrator
$$ 1.72 TOPSPIN		Version 2.1
$$ 2012-11-30 21:45:39.527 -0500  Administrator@X
$$ Compression mode = diff/dup
##.OBSERVE FREQUENCY= 400.02188249412
##.OBSERVE NUCLEUS= ^1H
##.ACQUISITION MODE= SIMULTANEOUS (DQD)
##.ACQUISITION SCHEME= undefined
##.AVERAGES= 8
##.DIGITISER RES= 22
##SPECTROMETER/DATA SYSTEM= spect
##.PULSE SEQUENCE= zg30
##.SOLVENT NAME= COFFEE_meoh
##.SHIFT REFERENCE= INTERNAL, COFFEE_meoh, 1, 14.98509
##AUDIT TRAIL= $$ (NUMBER, WHEN, WHO, WHERE, PROCESS, VERSION, WHAT)
$$ ##TITLE= Audit trail, TOPSPIN		Version 2.1
$$ ##JCAMPDX= 5.01
$$ ##ORIGIN= Bruker BioSpin GmbH
$$ ##OWNER= Administrator
$$ $$ E:\/data/COFFEE/nmr/AC1217_HTEAH12048_7155294_vUIiVK8vfx/10/pdata/1/auditp.txt
$$ ##AUDIT TRAIL=  $$ (NUMBER, WHEN, WHO, WHERE, PROCESS, VERSION, WHAT)
(   1,<2012-11-30 21:45:31.779 -0500>,<Administrator>,<X>,<go>,<TOPSPIN 2.1>,
      <created by zg
	started at 2012-11-30 21:44:27.423 -0500,
	POWCHK enabled, PULCHK disabled,
       configuration hash MD5:
       86 BA 57 50 F2 9D 5C 9B 26 00 A9 28 5F 66 2E 89
       data hash MD5: 64K
       2C 96 7B B4 CB 85 F6 C2 86 19 1B A8 DF A3 31 AF>)
(   2,<2012-11-30 21:45:34.719 -0500>,<Administrator>,<X>,<proc1d>,<TOPSPIN 2.1>,
      <Start of raw data processing
       efp LB = 0 FT_mod = 6 PKNL = 1 PHC0 = 0 PHC1 = 0 SI = 32K 
       data hash MD5: 32K
       B6 65 2F 7B FE 96 EF 24 DF 48 A1 DD 3F EA A8 7F>)
(   3,<2012-11-30 21:45:35.168 -0500>,<Administrator>,<X>,<proc1d>,<TOPSPIN 2.1>,
      <pk PHC0 = 96.04797 PHC1 = 0 
       data hash MD5: 32K
       96 B0 05 1A 31 7E 01 2E FA 6D 99 0D 81 86 F7 9E>)
(   4,<2012-11-30 21:45:35.385 -0500>,<Administrator>,<X>,<proc1d>,<TOPSPIN 2.1>,
      <abs ABSG = 1 
       data hash MD5: 32K
       C7 E7 10 47 C7 43 34 D5 F0 30 82 2A 60 E7 F0 CB>)
(   5,<2012-11-30 21:45:35.530 -0500>,<Administrator>,<X>,<proc1d>,<TOPSPIN 2.1>,
      <abs ABSG = 2 
       data hash MD5: 32K
       07 5F D5 D5 62 AC 13 F2 19 95 BD 42 D6 B6 3D 77>)
(   6,<2012-11-30 21:45:35.675 -0500>,<Administrator>,<X>,<proc1d>,<TOPSPIN 2.1>,
      <abs ABSG = 3 
       data hash MD5: 32K
       F1 DC F5 90 A1 8C 59 FC E1 6F 5D 71 5D 43 65 32>)
(   7,<2012-11-30 21:45:35.805 -0500>,<Administrator>,<X>,<proc1d>,<TOPSPIN 2.1>,
      <abs ABSG = 4 
       data hash MD5: 32K
       B0 89 4E 40 8B 5D 23 C4 29 F8 57 16 AE 00 6B F6>)
(   8,<2012-11-30 21:45:35.950 -0500>,<Administrator>,<X>,<proc1d>,<TOPSPIN 2.1>,
      <abs ABSG = 5 
       data hash MD5: 32K
       0A 37 5F 7D 94 B0 C3 A8 67 BD D6 41 2C 06 CE 03>)
$$ ##END=
$$ 
$$ $$ hash MD5
$$ $$ 88 72 AF 39 F6 7D 4B 53 62 88 D7 FB EE 0B 03 50
##$RELAX= 
##$RELAX= 
##$RELAX= 
##$RELAX= 
##$RELAX= 
##$RELAX= 
##$RELAX= 
$$ Bruker specific parameters
$$ --------------------------
##$DU= <E:\>
##$EXPNO= 10
##$NAME= <AC1217_HTEAH12048_7155294_vUIiVK8vfx>
$$ [...]
##$TP= (0..7)
150 150 150 150 150 150 150 150
##$TP07= 0
##$TPNAME0= <>
##$TPNAME1= <>
##$TPNAME2= <>
##$TPNAME3= <>
##$TPNAME4= <>
##$TPNAME5= <>
##$TPNAME6= <>
##$TPNAME7= <>
##$TPOAL= (0..7)
0.5 0.5 0.5 0.5 0.5 0.5 0.5 0.5
##$TPOFFS= (0..7)
0 0 0 0 0 0 0 0
##$TUNHIN= 0
##$TUNHOUT= 0
##$TUNXOUT= 0
##$USERA1= <user>
##$USERA2= <user>
##$USERA3= <user>
##$USERA4= <user>
##$USERA5= <user>
##$V9= 5
##$VALIST= <valist>
##$VCLIST= <CCCCCCCCCCCCCCC>
##$VD= 0
##$VDLIST= <DDDDDDDDDDDDDDD>
##$VPLIST= <PPPPPPPPPPPPPPP>
##$VTLIST= <TTTTTTTTTTTTTTT>
##$WBST= 1024
##$WBSW= 4
##$XGAIN= (0..3)
0 0 0 0
##$XL= 0
##$YL= 0
##$YMAX_a= 679015
##$YMIN_a= -576999
##$ZGOPTNS= <>
##$ZL1= 120
##$ZL2= 120
##$ZL3= 120
##$ZL4= 120
##$ABSF1= 14.98509
##$ABSF2= -5.573092
##$ABSG= 5
##$ABSL= 3
##$ALPHA= 0
##$AQORDER= 0
##$ASSFAC= 0
##$ASSFACI= 0
##$ASSFACX= 0
##$ASSWID= 0
##$AUNMP= <proc_prof1d_extract_pilot.lims>
##$AXLEFT= 0
##$AXNAME= <>
##$AXNUC= <1H>
##$AXRIGHT= 0
##$AXTYPE= 0
##$AXUNIT= <>
##$AZFE= 0.1
##$AZFW= 0.1
##$BCFW= 0
##$BC_mod= 0
##$BYTORDP= 0
##$COROFFS= 0
##$CY= 15
##$DATMOD= 1
##$DC= 0
##$DFILT= <>
##$DTYPP= 0
##$F1P= 0
##$F2P= 0
##$FCOR= 0.5
##$FTSIZE= 32768
##$FT_mod= 6
##$GAMMA= 0
##$GB= 0
##$INTBC= 1
##$INTSCL= 1
##$ISEN= 128
##$LB= 0
##$LEV0= 0
##$LPBIN= 0
##$MAXI= 10000
##$MC2= 0
##$MEAN= 0
##$ME_mod= 0
##$MI= 0
##$NCOEF= 0
##$NC_proc= -8
##$NLEV= 6
##$NOISF1= 0
##$NOISF2= 0
##$NSP= 0
##$NTH_PI= 0
##$NZP= 0
##$OFFSET= 14.98509
##$PC= 1
##$PHC0= 96.04797
##$PHC1= 0
##$PH_mod= 1
##$PKNL= yes
##$PPARMOD= 0
##$PPDIAG= 0
##$PPIPTYP= 0
##$PPMPNUM= 2147483647
##$PPRESOL= 1
##$PSCAL= 4
##$PSIGN= 0
##$PYNMP= <proc.py>
##$REVERSE= no
##$SF= 400.02
##$SI= 32768
##$SIGF1= 0
##$SIGF2= 0
##$SINO= 400
##$SIOLD= 32768
##$SPECTYP= <>
##$SREGLST= <1H.CDCl3>
##$SSB= 0
##$STSI= 32768
##$STSR= 0
##$SW_p= 8223.68421052631
##$SYMM= 0
##$S_DEV= 0
##$TDeff= 65536
##$TDoff= 0
##$TI= <>
##$TILT= no
##$TM1= 0
##$TM2= 0
##$TOPLEV= 0
##$USERP1= <user>
##$USERP2= <user>
##$USERP3= <user>
##$USERP4= <user>
##$USERP5= <user>
##$WDW= 1
##$XDIM= 32768
##$YMAX_p= 480208213
##$YMIN_p= -727462
##$CURPLOT= <Network HP LaserJet P1505>
##$CURPRIN= <$Network HP LaserJet P1505>
##$DFORMAT= <normdp>
##$LAYOUT= <+/1D_H.xwp>
##$LFORMAT= <normlp>
##$PFORMAT= <normpl>
##$SURQMSG= 1
$$ End of Bruker specific parameters
$$ ---------------------------------
##NTUPLES= NMR SPECTRUM
##VAR_NAME=  FREQUENCY,     SPECTRUM/REAL,   SPECTRUM/IMAG
##SYMBOL=    X,             R,               I
##VAR_TYPE=  INDEPENDENT,   DEPENDENT,       DEPENDENT
##VAR_FORM=  AFFN,          ASDF,            ASDF
##VAR_DIM=   32768,         32768,           32768
##UNITS=     HZ,            ARBITRARY UNITS, ARBITRARY UNITS
##FACTOR=    0.250966925370066, 1,           1
##FIRST=     8223.43324360094, 47256,        -4938
##LAST=      0,             -138501,         58669
##MIN=       0,             -727462,         0
##MAX=       8223.43324360094, 480208213,    0
$$ Real data points
##PAGE= N=1
##DATA TABLE= (X++(R..R)), XYDATA
$$ [...]
19535a85189g8510G6289d8766A40011b76702l3646a13841q9879R7960j18962j63185
19524c87907C35297d6740e271A327L04063a46207f9821j12617Q4139A38518L2276
19513A70794b67400P8586A49759d32526J72035H4061J41125M9210b57017j55417
19503d12434d78A84324N9449j14776f3050C5355a29361A978b0156j8536k4011
19492f2703j46514B13677m7340l6130b08011f1943o2334k9021H6750C7704c27595
19480h8065k4085n6162g8175A04990L6587d6647O461j70678o0488B04001a62864
19468h5462B56647d1124B5303a90558a2360B2088b41096B7231b32746H1500b03603
19456A00771a24694e755m13516J81340o86J17608A79986b42152c0922l35895a46984
$$ plain form
19535 -185189 -78510 76289 -48766 140011 -276702 -310348 -113841 -203720 -105760 -224722 -387907
19524 -387907 335297 -46740 -5271 1327 305390 -146207 -69821 -182438 -98299 138518 170794
19513 170794 -267400 -188814 149759 -432526 -260491 84061 225186 274396 -257017 -412434
19503 -412434 -478 184324 243773 128997 -63050 35355 -129361 1978 -20156 -38692 -62703
19492 -62703 -209217 213677 166337 130207 -208011 -61943 -124277 -153298 86750 37704 -327595
19480 -88065 -112150 -168312 -78175 104990 141577 -46647 -40186 -210864 -271352 204001 -162864
19468 -85462 256647 -41124 25303 -190558 -12360 22088 -241096 27231 -232746 81500 -203603
19456 100771 -124694 -5755 -419271 -237931 -238617 -121009 179986 -242152 -30922 -366817 -146984
19444B73842b90599A15358j0199k5657b73666A05984h7412k2950C9905b59324
19433C5548A1986e9350g847k04907A6052b06997h2846J2890B38138D9600M0698
19422I0298L8886b88034B48527i3051C5266n619h1720A94497b72414P9885C93261
19410A80575b35367e7867j43797A62571g4998K3675j18858i866m2060K1616k9146
19399e9456B7932b31865M6737A63401a41889c4405n2760A54216b21908A80956
19388I9583C2714b9668k706k119j47055d0887B02705b20542G990a69822B93988
19376h8713A9520a04773l01528J50202g2582J9849B78748R1749b52903J11140
19366a41763B1565f4598A69864a41A62103b207l4648A77255d4124j09378A15346
$$ plain form
19444 273842 -290599 115358 105159 79502 -273666 105984 -87412 -110362 39905 -259324
19433 35548 11986 -59350 -7847 -212754 16052 -206997 -82846 -69956 238138 49600 90298
19422 90298 129184 -288034 248527 -93051 35266 29647 -81720 194497 -272414 -192529 393261
19410 180575 -235367 -57867 -201664 162571 -74998 -51323 -170181 -9866 -51926 -30310 -59456
19399 -59456 27932 -231865 -185128 163401 -141889 -34405 -87165 154216 -221908 180956
19388 99583 32714 -29668 -32374 -34493 -181548 -40887 202705 -220542 7990 -169822 293988
19376 -88713 19520 -104773 -406301 -256099 -72582 -52733 278748 370497 -252903 -141763
19366 -141763 21565 -64598 169864 -141 162103 -2207 -36855 177255 -44124 -153502 115346
19354F076J56965b62141g9918k10048b4636m8054E7175b99955B6033d12478C42181
19342a81831A70511D1076f5752E1781f2806o0319F6039f6100j1485j37038A42453
19330b99517E7042L270h0696j07329KC4249h3708j03472c0489B44501a25125k36144
19318c61269L8312c8377o3775b5756A03831b63489f2463k3593j87476J16924A06190
19306f3246b6378A71524b12602N5814g3199D7429b37810c9385j52468c7703l23156
19295c60859n1807f0899j54864D04602c72938a70481A5001J26499a7187j31503
19285a48690D5991b09146P2499I8747B7545b36653j42790A36622c44614J46583
19275a98031P0206p0393A1446d9027j31039a457j91676B925g7883J8480o9001
$$ plain form
19354 6076 163041 -262141 -79918 -289966 -24636 -72690 57175 -299955 26033 -412478 342181
19342 -181831 170511 41076 -65752 51781 -62806 -123125 66039 -66100 -77585 -214623 142453
19330 -299517 57042 60312 -80696 -188025 -188023 34249 -83708 -187180 -30489 244501 -125125 -361269
19318 -361269 -322957 -38377 -102152 -25756 103831 -263489 -62463 -86056 -273532 -156608 106190
19306 -63246 -26378 171524 -212602 -156788 -73199 47429 -237810 -39385 -191853 -37703 -360859
19295 -360859 -412666 -60899 -215763 404602 -372938 -170481 15001 141500 -17187 -148690
19285 -148690 45991 -209146 -136647 98747 27545 -236653 -379443 136622 -344614 -198031
19275 -198031 -127825 -198218 11446 -49027 -180066 -1457 -193133 2925 -77883 -59403 -128404
19264a28404j8297I4534a45414A62424J59820A8205d5718H2142J27953a94655
19253e8974G429h607k02530f8257k96121J00572F638c60156i3512A29088b27336
19241A5821K2200L47326a00146A01492b1844k84808Q0183F903P2262b37434k51672
19230d89106e8083j84988g6817A79464f6638A20070D3488p478a80545F3307a940
19218a76426d6981K0711G6794A2003a7921j76064B0237J15374c05392G6330a13817
19206B30746C6560a68584C19813a54342B1882a04073h707l81403e1054A34937
19195a50890k60499a72510b5001A22539a36497C28761j62082b6690B5839b0208
19184c30071A43475a59993j671I5350i6035j9660A52150c55260f0998k5353k63595
$$ plain form
19264 -128404 -146701 94534 -145414 162424 322244 18205 -45718 82142 210095 -194655
19253 -58974 7429 -8607 -211137 -68257 -364378 -263806 6638 -360156 -93512 129088 -227336
19241 15821 38021 385347 -100146 101492 -21844 -306652 -226469 6903 79165 -237434 -489106
19230 -489106 -58083 -243071 -76817 179464 -66638 120070 43488 36010 -180545 63307 -1940
19218 -176426 -46981 -26270 76794 12003 -17921 -193985 20237 135611 -305392 76330 -113817
19206 230746 36560 -168584 319813 -154342 21882 -104073 -8707 -390110 -51054 134937
19195 -150890 -411389 -172510 -25001 122539 -136497 328761 166679 -26690 25839 -20208
19184 -330071 143475 -159993 -161664 95350 -96035 -115695 152150 -355260 -60998 -86351 -349946
19173c49946a63235O8745C1230e1643j29149I4228k4005a47812E3672a74124a7079
19161b01882M1359A81161c68545D4906c089A15598c39627J49649o0898j12182
19151c63058B93558j06657b8221j00805j09276F4418c28775H7186J41990b00524
19140c8303B04052H907d3517E8281a74991B02210B1333c20124g6496L2425I51
19128a80809l10602B00509d0121C7762b12718M1961A76940h9248D21959a00577
19117a92362c7662J3637j17223f9034A49482g8557K5304r5788I2274b18353j66659
19106c85012J78700b6517A47644K0062a59168K2132h88j00652k0642E9602b50696
19094a57316a6221r3889C72607H790a05370j48543c7492Q531g995j43361A55576
$$ plain form
19173 -349946 -163235 -94490 31230 -51643 -180792 94228 70223 -147812 53672 -174124 -17079
19161 -201882 -160523 181161 -368545 44906 -3089 115598 -339627 -189978 -250876 -363058
19151 -363058 293558 186901 -28221 -129026 -238302 64418 -328775 87186 229176 -200524
19140 -38303 204052 8907 -43517 58281 -174991 202210 21333 -320124 -76496 -44071 951
19128 -180809 -491411 200509 -40121 37762 -212718 -170757 176940 -89248 421959 -100577
19117 -192362 -37662 -24025 -141248 -69034 149482 -78557 -53253 -149041 92274 -218353 -385012
19106 -385012 -206312 -26517 147644 167706 -159168 -137036 -888 -101540 -122182 59602 -250696
19094 -157316 -16221 -110110 372607 8790 -105370 -253913 -37492 -28961 -7995 -151356 155576
19082a23641J6479q9623A9002L1634b07976E5c5033k65307H3604B2855a44730
19070H5542b37868c6343H5533P4573F5995d56516H0492b10836j57158H0182a19552
19058H6213l7727j8724M837p138g9933E05676b4962A82860f3827B1947f0075k8109
19046h8184A17286J54259a52360j93805F2306b15673A62971a29455B9762J22484
19036A52246a29066r9568A90405a25915A53236E3938b12400A67444h4951r9537
19026a84488A93426C1277a09674H500J17354a81498n7062F3454J7666b68390H6013
19014B37987I139a08254D63306f7297K5587j32582a05r2661B17282I0818b59593
19002a22719N6116l4662H9068a14278F7511J01956c64899c1445N720j29218b375
$$ plain form
19082 -123641 -107162 -196785 19002 50636 -207976 55 -35033 -300340 83604 22855 -144730
19070 85542 -237868 -36343 85533 160106 65995 -456516 80492 -210836 -367994 80182 -119552
19058 86213 48486 29762 34599 27461 -79933 505676 -24962 182860 -63827 21947 -60075 -88184
19046 -88184 117286 271545 -152360 -346165 62306 -215673 162971 -129455 29762 152246
19036 152246 -129066 -228634 190405 -125915 153236 53938 -212400 167444 -84951 -184488
19026 -184488 193426 31277 -109674 8500 125854 -181498 -238560 63454 81120 -268390 86013
19014 237987 9139 -108254 463306 -67297 -41710 -174292 -105 -92766 217282 90818 -259593
19002 -122719 -66603 -101265 89068 -114278 67511 169467 -364899 -31445 -25725 -154943 -2375
18990a7090E9370a85827o8584C22923f850B32308K9628b92019a35237j44732Q9681
18979a90288N0252j33332N2692A368c08093H2457e4580B16819p2666b02077i0864
18967h999A75473g0003j10607A19709b46870D6853L65319b8978J0800r4367k82743
18956c95288J97400F4623a48975c7654H24a98840C8776J23808F8527B5763h658
18944h1205q2433d9753A26476d9391I4621b29361G213a11981j47237i1247B22629
18932I2177a33914C29156j3752b38113J16354j44016c7514j70982H7733M345a91372
18920B54747A3134a41240g123A8453a22445j47485f6960j42600B7824h0565A74929
18908a91410m2889a08911B8537J48548c76070A50846c94095A26728b61081A48385
$$ plain form
18990 -17090 59370 -185827 -254411 322923 -6850 232308 261936 -292019 -135237 -279969 -190288
18979 -190288 -140036 -273368 -220676 1368 -308093 82457 -54580 216819 144153 -202077 -90864
18967 -8999 175473 -70003 -180610 119709 -246870 46853 412172 -28978 -18178 -112545 -395288
18956 -395288 -197888 64623 -148975 -37654 824 -198840 38776 162584 68527 25763 -8658
18944 -81205 -163638 -49753 126476 -49391 94621 -229361 7213 -111981 -259218 -91247 222629
18932 92177 -133914 329156 315404 -238113 -121759 -265775 -37514 -208496 87733 92078 -191372
18920 254747 13134 -141240 -7123 18453 -122445 -269930 -66960 -209560 27824 -80565 174929
18908 -191410 -234299 -108911 28537 177085 -376070 150846 -394095 126728 -261081 148385
18897b97197e5341P776A61111p7513a21021N6265a3645l6733j00524f354j69519
18886a75873A72039J16152a17875A14203a79894L8311r85M1405k88853F309M76
18875F785b17177A57690i2467d3990m1126k09653A74506b2268r7272H6224b09751
18863c39449b5839o8956j1032B18772d8584C2022a34804G1367N225a48274j74067
18852c22341B4814L32729b82439a8803E5099f8716l25622I7804b72365f339k01945
18841b08284D5202b09537r1498B12889E7592a49253B75586o0381B2438b22485
18830b17469A87107f7078l85749A42189b66694A17820i8767j06748R6530A79739
18819b20573A74396b7650H4094c5020j26856B97103d8267N081E27035h3687D13443
$$ plain form
18897 -297197 -55341 -47565 161111 83598 -121021 -64756 -13645 -50378 -150902 -6354 -175873
18886 -175873 172039 288191 -117875 114203 -179894 -141583 -142568 -101163 -390016 6309 6785
18875 6785 -217177 157690 -92467 -43990 -85116 -294769 174506 -22268 -119540 86224 -209751
18863 -339449 -25839 -94795 -105827 218772 -48584 32022 -134804 71367 76592 -148274 -322341
18852 -322341 24814 357543 -282439 -18803 55099 -68716 -394338 97804 -272365 -6339 -208284
18841 -208284 45202 -209537 -301035 212889 57592 -149253 275586 215205 22438 -222485
18830 -217469 187107 -67078 -452827 142189 -266694 117820 -98767 -205515 -108985 179739
18819 -220573 174396 -27650 84094 -35020 -161876 297103 -48267 -43186 527035 -83687 413443
18807C42418c1990a4387j3318B3862P7488i6406j9239q1099D8385a44117L2146
18796a11971d7079l026A93460D8483b14794I908K6680a45685n1462A00275b1886
18784c1764A98091m3746A3970c06411d1637B54404C8238K16874F9001c66183g6875
18772B06275g3508m8304k56853R7758i9771k31788C93675b66026h4203b3216r2768
18761a15984K7131o1768A67879a79726g90l25384h5379j0638M2879m40201B82817
18749e11756J22838C87518g3803L3373k17199B22971D2008a35592l3292B1577
18738a69778I4843d416k73254a18716J2928c5208B33872b97994B52082e7080n8952
18727a16032k38256a39988l8489a3958n7139j23733C18673B4241a72688F9823
$$ plain form
18807 342418 -31990 -14387 -27705 23862 101350 -96406 -115645 -196744 48385 -144117 -111971
18796 -111971 -47079 -50105 193460 48483 -214794 9908 36588 -145685 -197147 100275 -21886
18784 -31764 198091 154345 13970 -306411 -41637 254404 38238 255112 69001 -366183 -76875
18772 206275 -73508 -121812 -378665 -280907 -99771 -331559 393675 -266026 -84203 -23216 -115984
18761 -115984 -88853 -150621 167879 -179726 -790 -326174 -85379 -96017 -53138 -493339 282817
18749 -511756 -388918 387518 -73803 -40430 -257629 222971 42008 -135592 -168884 21577
18738 -169778 94843 -4416 -277670 -118716 -105788 -35208 233872 -297994 252082 -57080 -116032
18727 -116032 -354288 -139988 -178477 -13958 -71097 -194830 318673 24241 -172688 69823
18716a3582B17892i5650B76925a78436A1795b50125g7468o0884F3529J17514a01809
18704e1664n0925k3246E5089b8040j51980q2310A33165a383C89832B9173J01222
18693A30395M8586p0605a89516A45410e7962n1835j70518b471j16378K8332A09041
18681B97548a18298o1433m418b4085p9381l9286a1079k05056l6745A77305E1976
18669b70800f3296R10k80301O5587b9475l68081a74594g9017m1229H3874d05263
18657b33225Q5025b509B39058E4226A0287a80110j37071J36865A70292e7556m1203
18646i8759A50113E8994a41873E8771a42901f0779n4686B5138g3929l3577c3580
18634I766a35684O6972C0781J86966g411A25234a14328A59200a12768J7103K5929
$$ plain form
18716 -13582 217892 -95650 276925 -178436 11795 -250125 -77468 -138352 63529 181043 -101809
18704 -51664 -102589 -125835 55089 -28040 -180020 -262330 133165 -1383 389832 29173 130395
18693 130395 178981 108376 -189516 145410 -57962 -109797 -280315 -2471 -118849 -90517 109041
18681 297548 -118298 -179731 -184149 -24085 -103466 -142752 -11079 -216135 -252880 177305 51976
18669 -270800 -63296 -62386 -342687 -277100 -29475 -397556 -174594 -79017 -120246 83874 -405263
18657 -233225 -148200 -2509 239058 54226 10287 -180110 -317181 -180316 170292 -57556 -98759
18646 -98759 150113 58994 -141873 58771 -142901 -60779 -115465 25138 -73929 -107506 -33580
18634 9766 -135684 -68712 30781 217747 -7411 125234 -114328 159200 -112768 -95665 -69736
18623f9736C14195A26814b07405r0814D0199b14804Q8030H6359a16610E5447a38318
18611b5183A30669b44295D3375b45485J4690j25038Q6821J23630j36628a30780
18600A6821e8585q3750G4067j3705A302b64111A13975a29612D8281J2055b33360
18588a67172a373B34568c13858b7451A6651i4114j8517o716B5879D539P2947b50116
18575B2094j867b09273c6484a0889p2149j81837a1125r982j53002B16100o5577
18564A50523B0788a34737k90905B47584e7312A1121J6689a83271K0266g9825B01515
18552g16j07797D488O214e7705A76962b16902J07864N3224A32767e721E1282k1026
18540C0256a63287D2593a01343A84022c1560C746a5913m4901E2334a41902A45135
$$ plain form
18623 -69736 314195 126814 -207405 -298219 40199 -214804 -126774 86359 -116610 55447 -138318
18611 -25183 130669 -244295 43375 -245485 -230795 -355833 -269012 -145382 -282010 -130780
18600 16821 -58585 -142335 74067 60362 1302 -264111 113975 -129612 48281 60336 -233360
18588 -167172 -1373 234568 -313858 -27451 16651 -94114 -112631 -119347 25879 4539 77486 -250116
18575 22094 20227 -209273 -36484 -10889 -83038 -264875 -11125 -21107 -174109 216100 150523
18564 150523 20788 -134737 -425642 247584 -57312 11121 27810 -183271 -163005 -79825 201515
18552 -716 -108513 4488 10702 -57705 176962 -216902 -109038 -55814 132767 -5721 51282 30256
18540 30256 -163287 42593 -101343 184022 -31560 3746 -15913 -60814 52334 -141902 145135
18528b98912B36508I9430k8028A239J31860k8873b05319j13912B33256b44983
18517A81084c07103g1814j54750p6232e0884n1648J8526A94377c8385k03127j02265
18506c43777d6355j15470B44990c51996J38151P4663O6812j84598j6344J17125
18496a56187k9950A29269g5198D2337L61141c6990l9045k35313J46360a7992A11956
18484e4697D9693g6126K7459j70182A14410A3492a67792c560j16578A48242C2254
18472C3813c34863C0411L49541B3142R9706L0937B5091N458b40379A4224a38709
18460h0424E1196N5640K7229c67337a43626B89921a994j7304j68667A78121c9859
18448A60673b143k344p1102H5291C0721a21698B50622c84330J24910F3620f9734
$$ plain form
18528 -298912 236508 99430 71402 1239 133099 104226 -205319 -319231 233256 -244983
18517 181084 -307103 -71814 -226564 -302796 -50884 -102532 -84006 194377 -38385 -241512 -343777
18506 -343777 -46355 -161825 244990 -351996 -213845 -139182 -72370 -256968 -273312 -156187
18496 -156187 -186137 129269 -75198 42337 403478 -36990 -76035 -311348 -164988 -17992 111956
18484 -54697 49693 -76126 -48667 -218849 114410 13492 -167792 -3560 -120138 148242 32254
18472 33813 -334863 30411 379952 23142 122848 153785 25091 30549 -240379 14224 -138709
18460 -80424 51196 106836 134065 -367337 -143626 289921 -1994 -19298 -187965 178121 -39859
18448 160673 -2143 -4487 -75589 85291 30721 -121698 250622 -384330 -259420 63620 -69734
18436c32215J37495N1452C4206a11432N0538A26647b28298A00186c92771C38646
18425f3100k65432G583J78788e05697A0932c86567a89492I4131b22466d9096k2063
18414g1159j58052B59583a18088b2112k79883c0371k16569f350D2461N6798l369
18403I5890D6487c14905A29733a88053f9283J7857A36089O179l0867K3806a47195
18391a98194B02a64001b6607A31071g0264k1714m1445f1244B8295K27730a41447
18379a17809A11246k9667i5816q9321b7821A75813b6766A06769a1694C6114P4555
18368A10669L3579a16487A33994J2962A5756i6974H4494d74007E9616A8405K63504
18357B81909m1835e3122A18097m4644C3807o487b85313B780Q2997a07615c4308
$$ plain form
18436 -332215 -194720 -143268 34206 -111432 -60894 126647 -228298 100186 -392771 338646
18425 -63100 -328532 7583 186371 -505697 10932 -386567 -189492 94131 -222466 -49096 -71159
18414 -71159 -229211 259583 -118088 -22112 -301995 -30371 -246940 -6350 42461 99259 95890
18403 95890 46487 -314905 129733 -188053 -69283 -51426 136089 142268 111401 135207 -147195
18391 -198194 202 -164001 -26607 131071 -70264 -91978 -133423 -61244 28295 256025 -141447
18379 -117809 111246 81579 -95816 -185137 -27821 175813 -26766 106769 -11694 36114 110669
18368 110669 144248 -116487 133994 146956 15756 -96974 84494 -474007 59616 18405 281909
18357 281909 240074 -53122 118097 73453 33807 27320 -285313 2780 85777 -107615 -34308
18345A44683d62236I0800b38545P2200A19685D6685L59690G9248a83150M1065
18335a42085j06667C6188b32600R5758B72214c32541O2688H445M8121K05114q8481
18324A73199f08289A86218i8078B16603c8314j69005O8982n6484k5664F5632o95
18313F4937r515a85153j44376e8297j01538r3242e7543j03362k49188e8163d593
18301b61435D0031M4828J59614C674a5752B584a02664B0780M2076A4137d07055
18289D1803J28585a83672g9950j63866A84675i4827A70847a70957A93604A821
18278a66330n2436d7277l17134A8752b32400J13181a6808c227n6894A05799R2230
18267A98029K5187d2980A34895b31064a10037E5526a94612j1168A94613a37731
$$ plain form
18345 144683 -462236 90800 -238545 -166345 119685 46685 406375 79248 -183150 -142085
18335 -142085 -248752 36188 -232600 -136842 272214 -332541 -269853 8445 56566 261680 173199
18324 173199 -608289 186218 -98078 216603 -38314 -207319 -138337 -194821 -220485 65632 64937
18313 64937 55422 -185153 -329529 -58297 -159835 -253077 -57543 -160905 -410093 -58163 -4593
18301 -261435 40031 84859 244473 3674 -15752 2584 -102664 20780 62856 14137 -407055
18289 41803 170388 -183672 -79950 -243816 184675 -94827 170847 -170957 193604 1821
18278 -166330 -218766 -47277 -364411 18752 -232400 -119219 -16808 -3227 -60121 105799 198029
18267 198029 223216 -42980 134895 -231064 -110037 55526 -194612 -205780 194613 -137731
18256c08042a7575A50290a27333A24701a06687A41291C9472a48470k12559A04892
18245f3039A55744a68072b0439B41889b5016l09067a64772A1417K810N7695a60971
18233A2203J93706d8379n6695B77223B2795O0099J0862b44847L8602A06383b13064
18221A27147g3629J3091I1084c0145H8182c3415E491L4209J69008a08294c6880
18209a27528d0729l2293a4502j66048c5210k15863i2969A79215f1518A15683k9743
18198H5940M9339e0183F5464g9781H0811e0850F026g0004E5434a15555G872a58210
18185b522r849H3642b68127K9247M8213e8997G7490f2262C1204b26369l46898
18174e73267A16764h7002A50257j0922b78747c2934A4821O5770C2047a41500r8628
$$ plain form
18256 -308042 -17575 150290 -127333 124701 -106687 141291 39472 -148470 -361029 104892
18245 -63039 155744 -168072 -20439 241889 -25016 -334083 -164772 11417 14227 71922 -160971
18233 12203 205909 -48379 -105074 277223 22795 82894 93756 -244847 -206245 106383 -213064
18221 127147 -73629 -60538 91084 -30145 88182 -33415 5491 39700 208708 -108294 -36880
18209 -127528 -40729 -73022 -14502 -180550 -35210 -251073 -92969 179215 -61518 115683 85940
18198 85940 135279 -50183 65464 -79781 80811 -50850 6026 -70004 55434 -115555 7872 -158210
18185 -2522 -12371 83642 -268127 -238880 -190667 -58997 77490 -62262 31204 -226369 -573267
18174 -573267 116764 -87002 150257 139335 -278747 -32934 14821 80591 32047 -141500 -240128
18163b40128o9476a13111J8117j04288c4404D4576a3881j08626D5839h3807m5085
18152a28892E2005b15684D7649K69827a25503L539M0351c2747j65787J2371A04145
18140b51314B06510b42573J8108E6808f0202A66098A1645c83017B16780o2607
18130A54173b77587C41349f7617n6768A11500N4904G4161a63180B7253J8855e5818
18118G5104b5886m5264A183M4937b03280m1047f1655q9183f401D7586c4395A29287
18105a39298f7852C3019i6981I3882C9499a3382d991C9013Q7669b640q3710j32987
18093b19337E7489a65557G0773c1931B21611j09904k2757M7839m781D5560A3627
18081b4600A38875o8609J46198a9092j56856I6888K48930a53784A61464c25724
$$ plain form
18163 -240128 -309604 -113111 -94994 -199282 -34404 44576 -13881 -122507 45839 -83807 -128892
18152 -128892 52005 -215684 47649 317476 -125503 -121964 -81613 -32747 -198534 -186163 104145
18140 -251314 206510 -242573 -224465 56808 -60202 166098 11645 -383017 216780 154173
18130 154173 -277587 341349 -67617 -124385 111500 166404 74161 -163180 27253 46108 -55818
18118 75104 -25886 -71150 1183 46120 -203280 -244327 -61655 -150838 -6401 47586 -34395 129287
18105 -139298 -67852 33019 -96981 93882 39499 -13382 -4991 39013 126682 -2640 -86350 -219337
18093 -219337 57489 -165557 70773 -31931 221611 111707 88950 136789 132008 45560 13627
18081 -24600 138875 70266 216464 -19092 -175948 96888 345818 -153784 161464 -325724
18070G1045J49186h9066J4562A14108a0891B10738C6653b34594O463A30321b53183
18058B43816a26915B8226a15684n0855m9984A39616a25621N6498J9535A56153
18047g7307k1967b2487a0251A22913n3305c6142A46822f075A5663a45985K3937
18036a22048j23411B37944i2698r1j36015j54208a8677l6687G704K75299a16557
18024a14892A17836J02803a72691A04467d3401p866A84128I1343b95898f0436
18013b83424A18834J53150j0371K3978I8271a70199C1888K38260K2834a09523
18002b1188k22815B90134a79677L0792d694I1275b71412H5336i7616E706a21012
17990B20679a82348M831H518O546N6584J02674a35148k50157a33821B4076K5459
$$ plain form
18070 71045 220231 -89066 -74504 114108 -10891 210738 36653 -234594 -228131 130321 -253183
18058 243816 -126915 28226 -115684 -166539 -216523 139616 -125621 -69123 -49588 156153
18047 -77307 -99274 -22487 -10251 122913 69608 -36142 146822 -6075 15663 -145985 -122048
18036 -122048 -245459 237944 -92698 -92789 -228804 -383012 -18677 -55364 7704 283003 -116557
18024 -114892 117836 220639 -172691 104467 -43401 -51267 184128 91343 -295898 -60436
18013 -283424 118834 271984 261613 285591 98271 -170199 31888 270148 292982 -109523
18002 -21188 -244003 290134 -179677 -148885 -4694 91275 -271412 85336 -97616 5706 -121012
17990 220679 -182348 -177517 8518 15064 71648 174322 -135148 -385305 -133821 24076 49535
17979D9535J39339c99938h1476A07719k2107h5194H321a06469j14446Q0241o1016
17968b01690C24686c20180a50986A11401m7399h500I8418F435d28798A45817o4708
17957H1109C8885f9943n7076G1022c30855d2657n4061a2811p1652n29479b37818
17945e6629B5732K61887a75490D9240a01145B62556E8177a19120A21673b07511
17934c80919J50767g9213A3788g7550b6889H2990b94101A35240b52886H6915j0076
17923G6839k773c3188A34972J65640b09390M7834A02624e445B4265K6413P7642
17912A28320a00382k55981N8834f0552m81036d6305k5916r3990A41035a26240
17901c4181k62934B93407A29364J44914g3129m0000r5255j16329J27262A9197
$$ plain form
17979 49535 188874 -399938 -81476 107719 85612 -85194 8321 -106469 -220915 -140674 -201690
17968 -201690 324686 -320180 -150986 111401 64002 -8500 98418 6435 -428798 145817 81109
17957 81109 38885 -69943 -127019 71022 -330855 -42657 -96718 -12811 -84463 -613942 -237818
17945 -56629 25732 287619 -175490 49240 -101145 262556 58177 -119120 121673 -207511
17934 -380919 -230152 -79213 13788 -77550 -26889 82990 -294101 135240 -252886 86915 76839
17923 76839 74066 -33188 134972 300612 -209390 -161556 102624 -5445 24265 50678 128320
17912 128320 -100382 -356363 -297529 -60552 -541588 -46305 -72221 -166211 141035 -126240
17901 -34181 -297115 293407 129364 274278 -73129 -113129 -208384 -324713 -197451 19197
17890C2525J0176J0708b77542l5734A34252l7365b70562I8167c33557C06423i3593
17878b42415F491f2962F7275j6325O975K81108f7492A5986a55746N8822A7153
17866G0020k5993j8288g6626l33348g9979E8904A7129K62510A9981b59398G0802
17854C2194P7128b84187E129K00390C384b05763B60040e1114q8425j11381H037
17842b23429C1738j5266b4019k51974c3208E6806a81160f3369B6870K00701a24046
17830c1828P323A14248l3115M915R4503a80648D6380J74257a1034j61208n9104
17819b31346A27670c32006R6000M3080B03583L2421B9264K52379c16657j843H5100
17807A3346j053e8759B56743b79123E9629a1344B4463c2951G7585Q4549K1560
$$ plain form
17890 32525 42701 53409 -277542 -313276 134252 96887 -270562 98167 -333557 306423 -93593
17878 -242415 6491 -62962 67275 50950 57925 339033 -67492 15986 -155746 -96924 17153
17866 70020 44027 25739 -76626 -409974 -79979 58904 17129 279639 19981 -259398 70802
17854 32194 109322 -284187 5129 205519 3384 -205763 260040 -51114 -139539 -250920 8037
17842 -223429 31738 16472 -24019 -275993 -33208 56806 -181160 -63369 26870 227571 -124046
17830 -31828 -24505 114248 81133 86048 180551 -180648 46380 220637 -11034 -172242 -231346
17819 -231346 127670 -332006 -236006 -192926 203583 236004 29264 281643 -316657 -318500 85100
17807 13346 12293 -58759 256743 -279123 59629 -11344 24463 -32951 77585 162134 183694
17796A83694d3608i54A88570c3823J6299A1642h9701m5349j29669a02459M0000
17785f2459r9017C67692a2557B13793a1547n524A53579P320K0916j8464C7316
17773g3731A70145C445d8343p0145d8609A30604L0344k2758a36608m6359O3487
17762a19480C856a31229a0846A20522G325b83186a2557G3097M9070B7010c01916
17750a9981r0598A0262L91395b99341h3672l8003j62062A02785J06323C4679d4408
17738C07135g2175A16048J00391I4546e9780A49772j0434C7456K83355a66544
17727A62184d8571k80513c0566q3691c2504J3427E3531a12482K6669C78581K56576
17716F35157c1120n6211f302j57888C6624c25935g3183L3533A42861J56536f5471
$$ plain form
17796 183694 -43608 -954 188570 -33823 -17524 11642 -89701 -135050 -264719 -102459 -62459
17785 -62459 -161476 367692 -12557 213793 -11547 -17071 153579 160899 181815 163351 37316
17773 -73731 170145 3445 -48343 -118488 -48609 130604 160948 138190 -136608 -182967 -119480
17762 -119480 3856 -131229 -10846 120522 7325 -283186 -12557 73097 122167 27010 -301916
17750 -19981 -110579 10262 401657 -299341 -83672 -121675 -283737 102785 209108 34679 -44408
17738 307135 -72175 116048 216439 94546 -59780 149772 139338 37456 320811 -166544
17727 162184 -48571 -329084 -30566 -114257 -32504 -19077 53531 -112482 -85813 378581 635157
17716 635157 -31120 -87331 -6302 -164190 36624 -325935 -73183 -39650 142861 299397 -65471
17704f9431a7119c296E0605J54909G0343d96774h9357l55955a20138f090G6299
17692B41146R9528a62343a9207A03007B9406J68581h9665A37124o158N5091N6295
17681B42352a74989d9314j48821o54b7305A20820J42031b70106p8619c667m9824
17670e3491A83570a24668F9216K01421d4955p0453A85887g1822C1041a35193A33535
17658d7012B47365q4225p3043K15136C3532a71310j01671B21103M4620A6281c5481
17646A10702H600J45167b47645D09046A18002a29519j99541D92368f8905b4062
17635d0645j7100C32228B2261a48841B79378a49330O4054A69837E0045d0467A91755
17623C3816d3147A015c26l5651k53219B08552c27588l9001B44287j03031n826
$$ plain form
17704 -69431 -17119 -3296 50605 205514 70343 -496774 -89357 -445312 -120138 -6090 76299
17692 241146 340674 -162343 -19207 103007 29406 197987 -89665 137124 130966 186057 242352
17681 242352 -174989 -49314 -198135 -198789 -27305 120820 262851 -270106 -348725 -3667 -53491
17670 -53491 183570 -124668 69216 270637 -44955 -115408 185887 -71822 31041 -135193 133535
17658 -47012 247365 163140 90097 305233 33532 -171310 -272981 221103 265723 16281 -35481
17646 110702 8600 153767 -247645 409046 118002 -129519 -329060 492368 -68905 -24062
17635 -40645 -57745 332228 22261 -148841 279378 -149330 -85276 169837 50045 -40467 191755
17623 33816 -43147 1015 -326 -35977 -289196 208552 -327588 -366589 244287 141256 135430
17612A35430R5592a15612C06471g1298E7895J19751a9941i117A48806D3249i3890
17600A58691D141L65291a10615A70467L1195J2483l8180i8221o3792C22485A26504
17588B08948b76621C18820E5100L599O8003J97329A29790a83381J4352M3158A52479
17576A43438l3892C2861O1272a99407e8684A24145b94295a37562k1532B99752
17565d52508A09255b3554A37750o3179l865c934E1109K62386g1829B99481L7531
17554C37012b1617E05878k12807B8063J8280R0621J74272d0780j98519P7967C2458
17542A16775J8588a4643B48638j16493b03881E83212B30234r9345b36032a14878
17531a21955A39746P0299a27183a9113n9584B90149A19053L7423J02964o7154
$$ plain form
17612 135430 231022 -115612 306471 -71298 57895 177646 -19941 -9117 148806 43249 -93890
17600 158691 4141 369432 -110615 170467 201662 214145 175965 -98221 -162013 322485 126504
17588 208948 -276621 318820 55100 58699 126702 324031 129790 -183381 -169029 -125871 152479
17576 143438 109546 32861 94133 -199407 -58684 124145 -294295 -137562 -159094 299752
17565 -452508 109255 -23554 137750 74571 70706 -3934 51109 313495 -71829 299481 337012
17554 337012 -21617 505878 293071 28063 46343 136964 311236 -40780 -239299 -161332 32458
17542 116775 135363 -14643 248638 132145 -203881 583212 230234 130889 -236032 -114878
17531 -121955 139746 210045 -127183 -19113 -78697 290149 119053 156476 259440 192286
17521A92286a34303B16391l0259H6481C8508a27250G0946b25402C0249J54547
17511A84796P5185H0475d5093A49036k2049K53725D953J63961a03291j01484b3249
17499A69215H0110L679f312j2058D6796a8789A14076i7305A9928J85247G3798
17487B24720b7226I4544M28364i8908c0607j09190E951L67048A09246N5410K33000
17476C97656A50883J55274a15933D07738H452J4917M7563K70432J46006e2082
17465A73261l5476a37726B12473K63497A10220K4510J95399M1951b118C67180
17454E45626j83872a19667A99508n7030L39169j44314L6146H7279L65804E1032
17443A84150N06539B3129K23681k592R2788j05750a99610B06884J11473M5595
$$ plain form
17521 192286 -134303 216391 186132 86481 38508 -127250 70946 -225402 30249 184796
17511 184796 259981 80475 -45093 149036 126987 380712 4953 168914 -103291 -204775 -23249
17499 169215 80110 83789 -6312 -18370 46796 -18789 114076 -97305 19928 205175 73798
17487 224720 -27226 94544 522908 -98908 -30607 -139797 5951 372999 109246 164656 397656
17476 397656 150883 306157 -115933 407738 8452 23369 70932 341364 487370 -52082
17465 173261 137785 -137726 212473 475970 110220 134730 330129 372080 -2118 367180
17454 545626 361754 -119667 199508 142478 481647 337333 373479 87279 453083 51032
17443 184150 690689 23129 246810 244218 337006 231256 -199610 206884 318357 363952
17433C63952A44225l0885L0011a20235c728C10994A26469J58180o1428P6166J69550
17422D68937j18648a6187C34503j58546L00495A34302n7402K93286L27556A99792
17411A08588P8401P0650Q3999j40559E8194J45833A0559b48452C23110a95619
17400B26905K30065h7303c9468J7340A58564B2804M01221D9699g9573B08677k9487
17389A79190F8215L21901h9012D2313J39619K5009E8305P5218N0434J62219n3913
17378B92263J7165A26057a07980A79199c3552D04657e0297A3400K77155D6081
17367C11337n3487A20160a85458B11327A4704J34001q478N7508J77825A15878
17356I2052i3458A93960M6444g663D0442P5610J94907M3387A34717a57354F6317
$$ plain form
17433 363952 144225 113340 143351 -120235 -3728 310994 126469 284649 223221 299387 468937
17422 468937 350289 -16187 334503 175957 476452 134302 76900 370186 697742 199792
17411 108588 186989 257639 341638 201079 58194 204027 10559 -248452 323110 -195619
17400 226905 456970 -87303 -39468 -22128 158564 22804 424025 49699 -79573 208677 179190
17389 179190 68215 390116 -89012 42313 181932 206941 58305 133523 183957 346176 292263
17378 292263 309428 126057 -107980 179199 -33552 404657 -50297 13400 290555 46081
17367 311337 257850 120160 -185458 211327 14704 148705 140227 197735 375560 115878
17356 92052 -93458 193960 240404 -7663 40442 116052 310959 354346 134717 -157354 66317
17344i0104C50283r1446C1530N07539A67430n0180k3100j6528a9762A90850n5261
17333A35589J41826a5173A07131K9539L231J12236K93162o0284e9900A00448O7612
17322A68060h7233A39452K18009j20869j18085J41666H5753K4625K72341j83565
17312A99154D7850J86835d5961E0104O7472a3280B83082J38824H9318O0858K09256
17301C59432a03991B51105A13531L71218k18199G5336i577C01510a06303a9106
17290C09642m1619a22024D46221c9463k9610D40654k05154i4037D48570A90889
17279f3437B17916K09637j33364m6935k1310L07865j83560N9105a8920A08150
17268B8970M06012A72271B0767M85616j16373N5899a24861D11412E9483O6222
$$ plain form
17344 -90104 350283 258837 31530 539069 167430 117250 94150 77622 -19762 190850 135589
17333 135589 277415 -15173 107131 136670 139901 252137 545299 485015 -59900 100448 168060
17322 168060 -87233 139452 357461 236592 118507 260173 85753 110378 382719 199154
17312 199154 47850 234685 -45961 50104 117576 -13280 283082 421906 89318 150176 359432
17301 359432 -103991 251105 113531 484749 266550 75336 -9577 301510 -106303 -19106
17290 309642 268023 -122024 446221 -39463 -69073 440654 235500 -94037 448570 190889
17279 -63437 217916 427553 294189 247254 225944 533809 350249 409354 -18920 108150
17268 28970 434982 172271 20767 506383 390010 445909 -124861 411412 59483 125705
17258A25705l3969J53642g5740B23087I797O4024K73093c7480A4850K27656O923
17247B49429a41052B40538m1493K36456j94587B0711P5040K00699j25052G3740
17236F5860g5040C55699b0624A54957B7078K94736D9374K14659I3402m0525J76653
17225B29530P6496D9034K08814f8133D9897K01665L8350m4186c0998F3694b29869
17213B86317J10879o025P1894I7101K09580r6671e2095B25190l0274O8877N0073
17202C13866K48090A45826K33101J1062j29111r9667R0593J14230A31374Q8980
17192B20354r4229J33085J53984M5677q1385o6140n3690h3409A65137b5420C64960
17180A34656K54793j09727e3377A81292L68418A25552J12984a18280A96846L61661
$$ plain form
17258 125705 91736 245378 -75740 223087 9797 73821 346914 -37480 14850 242506 249429
17247 249429 -141052 240538 199045 435501 240914 20711 95751 296450 171398 73740
17236 65860 -75040 355699 -20624 154957 27078 321814 49374 264033 93402 52877 229530
17225 229530 306026 49034 257848 -68133 49897 251562 289912 245726 -30998 63694 -229869
17213 286317 397196 391171 463065 97101 306681 210010 -52095 225190 194916 263793 313866
17202 313866 561956 145826 378927 389989 260878 161211 251804 366034 131374 220354
17192 220354 126125 259210 413194 458871 377486 311346 257656 -83409 165137 -25420 364960
17180 134656 389449 279722 -53377 181292 549710 125552 238536 -118280 196846 558507
17170E58507j02809P6123A88101K83875J36495B43243K84096Q520j97926I2586
17159a29791C91452a72077c2499C68722f8838B19560K53774q7765a24006C03953
17148A76869L0277L68155k45729f6287B20772J5634A1604L96362D9771K90108
17138C39879o6089R7592j85126L15111j07479j16922P0327J77030B35726N8593
17128B94319l6312K69653I4680L86729J26057f5469D19973J93623j50491o7804
17118C95301A33217m6540L68105k04788M31688B42040J72777K68881k42537F2657
17107G05951j64634B35087K31930r3260K75222a4914C58984N2778Q2709j48170
17097C46301J25844M1493j3498J04971J23802j14316B14635M72847k99458K5108
$$ plain form
17170 558507 455698 531821 188101 471976 608471 243243 527339 535859 337933 92586
17159 -129791 391452 -172077 -32499 368722 -68838 219560 473334 385569 -124006 303953
17148 176869 207146 575301 329572 -66287 220772 236406 11604 407966 49771 339879
17138 339879 273790 371382 186256 501367 393888 276966 347293 524323 235726 294319
17128 294319 258007 527660 94680 481409 607466 -65469 419973 613596 463105 395301
17118 395301 133217 86677 454782 249994 681682 242040 414817 683698 441161 62657
17107 705951 541317 235087 467017 373757 648979 -14914 358984 411762 494471 346301
17097 346301 472145 513638 500140 605111 728913 614597 214635 687482 388024 413132
17087D13132J80718j15581j25892J12098Q228B26020K40345n7029L09390k39231
17077D79495j25509L09212k75614l0764R6682j3918K51353k73447R5282j91001
17067C21771L91821m1444A79924L30749o0679J57271o2304k1396K9691A10708
17056C42869J96893K00470k01288q8415J36016k2853k07254A40108K74386K95941
17046G10435M0195l07121J00449j77407K62319p5763B48020L48348B16480J22133
17036C38613L05090J23013r5352N4500l43696Q0647L94849l5482l96576L89680
17026H15286k71762L19687j12063j35111k06265K4442M02902l33860J41711B82029
17015F59622q2810K06759k7541m1094j3737j80204m8738K42083K31537k28171
$$ plain form
17087 413132 593850 478269 352377 464475 472703 226020 466365 409336 718726 479495
17077 479495 353986 663198 387584 356820 453502 439584 690937 417490 512772 321771
17067 321771 713592 672148 179924 510673 449994 607265 544961 523565 553256 110708
17056 342869 539762 740232 538944 450529 586545 563692 356438 140108 414494 710435
17046 710435 750630 443509 543958 366551 628870 553107 248020 596368 216480 338613
17036 338613 643703 766716 671364 725864 382168 462815 857664 822182 425606 815286
17026 815286 543524 863211 751148 616037 409772 434214 837116 503256 644967 282029
17015 659622 576812 783571 756030 714936 701199 520995 472257 714340 945877 717706
17005G17706K57744j0086j28029j94433k36673L26320K27834k64499J27120O8122
16995H91126j90744O975J45701L51756m99732Q3595J45287j92459k77146M05836
16985H70195k4887J21924j83256J99254q8225k12068M38449l66074J8238J11768
16975H85318K18586l30093K85952K04184k54956J64870q6022j13241k9150J07077
16965A052525M7258j01709J80443j33534Q9336k11881L6955m9553J96739n5191
16955A051388j95678K21553K52999p7547Q1914k59552J77951J87713l22504K18105
16945A336342j67674j6414j59406L78485m90615J61511K07871L62467k01797L0569
16935A441339k14167j82148M37161l43352J88042L04893l16302J03522j20027
$$ plain form
17005 717706 975450 965364 837335 642902 406229 732549 960383 695884 823004 891126
16995 891126 700382 707357 853058 1204814 705082 788677 933964 741505 464359 870195
16985 870195 845308 967232 783976 983230 895005 682937 1121386 755312 773550 885318
16975 885318 1103904 773811 1059763 1263947 1008991 1173861 1087839 974598 945448 1052525
16965 1052525 1099783 998074 1178517 1044983 1134319 922438 959393 909840 1106579 1051388
16955 1051388 855710 1077263 1330262 1252715 1334629 1075077 1253028 1440741 1118237 1336342
16945 1336342 1168668 1152254 992848 1371333 880718 1042229 1250100 1612567 1410770 1441339
16935 1441339 1227172 1045024 1482185 1138833 1326875 1631768 1315466 1418988 1298961
16926A298961N2533P0521M6439J4043P6603J66672k85297L41846n5736k83700
16916A442885J45835J53905j40988j01502J75664k12049O64131o06964R0662L7752
16906A649331j33582R9344J90566j6065L68631m08379L339q582L61238r6155j06274
16895A903412n8404K70300K17580l63143J38421K31161k21705o6905J63203Q1341
16885B295261j69521J29983K4069n9088O5417L33363p653k77165P3288J34457
16875B542411j11144M76164m14715J55611j10433O0972J60083l47917N80481j87467
16865B804046L63457j31164q8307K20899j34800Q687q6335K33956P8297J32334
16855C401070O2287j0322j50852p5054M98346j77155K00000k42666K5904L05412
$$ plain form
16926 1298961 1351494 1422015 1468454 1482497 1559100 1725772 1440475 1782321 1726585 1442885
16916 1442885 1588720 1742625 1601637 1500135 1675799 1463750 2127881 1520917 1611579 1649331
16906 1649331 1515749 1615093 1805659 1789594 2158225 1749846 1753185 1744603 2105841 2009686 1903412
16895 1903412 1845008 2115308 2332888 1969745 2108166 2339327 2117622 2050717 2213920 2295261
16885 2295261 2125740 2255723 2279792 2220704 2286121 2619484 2611831 2334666 2407954 2542411
16875 2542411 2431267 2907431 2492716 2648327 2537894 2598866 2758949 2411032 2991513 2804046
16865 2804046 3167503 3036339 2948032 3168931 3034131 3042818 2956483 3190439 3268736 3401070
16855 3401070 3463357 3453035 3302183 3227129 3725475 3548320 3748320 3505654 3531558 3836970
16845C836970K0244l0735N09399l59103J87594K83814j7431k45172K42461K20688
16835D648729p5606N2011J2864Q2635P3348J72812K35168K02539k52575J14816
16825E266741K3153L49663L56060k86171J92161J64439l61226M32425L40204k5219
16815F452230R0132L11798O4108K90604M3583K64971J31029j14281K64315M86085
16805H284574J1856Q8560K16036Q4848N40325j14564O77996J2724q6166O87972
16795A0404161R5220O0034K94811K92956M32691J71244M21149L14289O91909p2313
16785A3106151L65549M95897N72358M58337K13615M76218O46518K87221M00204
16776A7022068Q92441K07912R41664O50878M97439N54049Q81647Q15058P96435
$$ plain form
16845 3836970 3857214 3826479 4335878 3976775 4164369 4448183 4430752 4185580 4428041 4648729
16835 4648729 4573123 4625134 4637998 4720633 4793981 4966793 5201961 5404500 5151925 5266741
16825 5266741 5289894 5639557 5995617 5709446 5901607 6066046 5704820 6137245 6477449 6452230
16815 6452230 6542362 6854160 6918268 7208872 7252455 7517426 7648455 7534174 7798489 8284574
16805 8284574 8296430 8384990 8601026 8685874 9226199 9111635 9789631 9802355 9716189 10404161
16795 10404161 10499381 10559415 10854226 11147182 11579873 11751117 12172266 12486555 13178464 13106151
16785 13106151 13471700 13967597 14539955 14998292 15211907 15688125 16334643 16621864 17022068
16776 17022068 17914509 18122421 19064085 19714963 20212402 20766451 21648098 22463156 23259591
16767B3259591P74555J041318R90375P85651J100226J111683J398910J372307
16759C1834616R19438J374077J502722J545657J354392K081965J920911J545567
16751D4079345K840268J938017K636250K681031K104441L150270L216190L313007
16743F5958819L258309M025333M026798M299659M465775M797480N244971N292610
16735A01369754N862571N829005O199470O536192O600158O783659O918175O622657
16727A52721641O536609O236282N997487N166889M763320L994566K579405K003706
16719A89999905Q53658l07748j539730k528391l623854m471035n011209n826431
16711A67545165o047117o806179o188914p166082o997211o574558o513033o538665
$$ plain form
16767 23259591 24034146 25075464 26065839 26851490 27951716 29063399 30462309 31834616
16759 31834616 32754054 34128131 35630853 37176510 38530902 40612867 42533778 44079345
16751 44079345 46919613 48857630 51493880 54174911 56279352 59429622 62645812 65958819
16743 65958819 69217128 73242461 77269259 81568918 86034693 90832173 96077144 101369754
16735 101369754 107232325 113061330 119260800 125796992 132397150 139180809 146098984 152721641
16727 152721641 159258250 165494532 171492019 176658908 181422228 185416794 187996199 189999905
16719 189999905 190853563 190545815 189006085 186477694 182853840 178382805 173371596 167545165
16711 167545165 161498048 154691869 148502955 141336873 134339662 127765104 121252071 114713406
16703A14713406o228337o016254n317263n654551m720460m557592m759602l577018
16695G3882329m505423l223362l527891l322059k871976k930670k504366k477685
16687D8518897k151834k618613k265334j668224j580072j705862j748278j469765
16679C3310915j589867j144883j059212j540673q95123q16903j064406j119627
16671B4080221q22642p25064q32385j113976m62006o71819o92687r08441o24016
16662A7227185l56779l48878m90870l51797n76966o56499n04134k63868m83620
16653A3193774l18238l7439o18915k66269m47954l34139l91864j85110l28114
16644A0265732n74136N1392K21301l12021n60378l10214n9175l37768j74125j19292
$$ plain form
16703 114713406 108485069 102468815 97151552 91497001 86776541 82218949 77459347 73882329
16695 73882329 69376906 66153544 62625653 59303594 56431618 53500948 50996582 48518897
16687 48518897 46367063 43748450 41483116 39814892 38234820 36528958 34780680 33310915
16679 33310915 31721048 30576165 29516953 27976280 27081157 26264254 25199848 24080221
16671 24080221 23257579 22532515 21700130 20586154 20124148 19452329 18759642 17851201 17227185
16662 17227185 16870406 16521528 16030658 15678861 15101895 14445396 13941262 13677394 13193774
16653 13193774 12875536 12838097 12219182 11952913 11504959 11170820 10778956 10593846 10265732
16644 10265732 9691596 9742988 9964289 9652268 9091890 8781676 8722501 8384733 8210608 8091316
16634H091316l75378J66625m99076q6657k11203r2608p0424Q075m07067M25221
16624F948824n60879m38493J66177k72246J22490j22463m7063l99450j20762k5281
16614E250854L21702k55655k08571l31256K08423k71596j16352p1921K70362n13177
16604D282813L8653k25145j97810M40878m59553L29128n05898K81732K4298k73605
16594C735491j96199j18191J58481k31758P5259L5599j45345j37736m3227k6953
16584C105421M4385L0516k52014Q2285j00788L49383k52509k83958r1092n4080
16574B577549k20590M20904L12806m10491k75760J26121K88666o34520K30518
16565B415203j42977L0351J84777m85820L94784l6942k55905R5244L2635k91825
$$ plain form
16634 8091316 7715938 7882563 7383487 7296830 7085627 6993019 6922595 6930670 6523603 6948824
16624 6948824 6387945 5949452 6115629 5843383 5965873 5843410 5796347 5396897 5276135 5250854
16614 5250854 5572556 5316901 5108330 4777074 4985497 4713901 4597549 4525628 4795990 4282813
16604 4282813 4321466 4096321 3898511 4339389 3879836 4208964 3703066 3984798 4009096 3735491
16594 3735491 3539292 3421101 3579582 3347824 3423083 3458682 3313337 3175601 3132374 3105421
16584 3105421 3149806 3180322 2928308 3010593 2909805 3259188 3006679 2722721 2631629 2577549
16574 2577549 2356959 2777863 3090669 2680178 2404418 2530539 2819205 2184685 2415203
16565 2415203 2272226 2302577 2487354 2001534 2396318 2359376 2103471 2198715 2231350 1939525
16555A939525R2481Q2356P43n4887l18127K84730l5444j55915j47186K66842m19026
16544A536092N11755l04364Q9852k07295P9291Q6356m5685j69965P210n4724J82799
16533A711322p3738R2464p5341p1558j53130L29329l66554J14904q4925Q7175
16523A509948m697j43370N5666j14851r0713K10322L4713j92633K85348l99872
16513A149861J51264R1994l02615J12649J4502q3225K41238R8816o2540l035m8496
16502A360413k56455L48348n64079J28493J87528j63109j52956Q5987K6366J69655
16492A170191k30959p9011K78500n5624l22391K05321J96911k43358k33088J74998
16482H61490j17762J81397k18435K1043J04634j50074J50525m8786K50977k16333
$$ plain form
16555 1939525 2032006 2114362 2115105 2060218 1742091 2026821 1991377 1835462 1688276 1955118 1536092
16544 1536092 2047847 1743483 1833335 1626040 1705331 1791687 1746002 1576037 1583247 1528523 1711322
16533 1711322 1637584 1730048 1654707 1583149 1430019 1759348 1392794 1507698 1422773 1509948
16523 1509948 1505251 1361881 1417547 1302696 1211983 1422305 1457018 1264385 1549733 1149861
16513 1149861 1301125 1393119 1090504 1203153 1217655 1134430 1375668 1474484 1411944 1408909 1360413
16502 1360413 1103958 1452306 888227 1016720 1204248 1041139 888183 974170 1000536 1170191
16492 1170191 939232 860221 1138721 1083097 760706 966027 1162938 919580 686492 861490
16482 861490 743728 925125 706690 727733 832367 682293 832818 784032 1035009 818676
16472H18676L37274k63170J32895j41293p2000P8627j9376J3829k61738O7471
16462F91195K76093J60970r0653j04336l4492q0389r638R1191M6345L86007C61464
16450A006405k44112k94556L56998j58010m6654M0748n7102J69381j09934K6095
16440F89259j14668J62720l9439j63043K57501l49542p5192K83054l1118L5191
16430F54723k8816k35962L25737j85756k0299O6512k27771M9412K93580C07587
16419G17608J0822j77826k52909M72332j49371J26038j92763J93645C38818K09891
16409E48709J82165l41810L21130B30960M02595B78081K60493j51849j4090q3510
16399B89125M91108k08542B84047p2920N3458J31634j52296R8349n5281K36500
$$ plain form
16472 818676 1155950 892780 1025675 884382 812382 891009 871633 885462 623724 691195
16462 691195 967288 1128258 1037605 933269 898777 818388 808750 899941 946286 1332293 361464
16450 1006405 762293 467737 824735 666725 620071 660819 603717 773098 663164 689259
16440 689259 574591 737311 697872 534829 792330 442788 367596 650650 619532 654723
16430 654723 625907 389945 715682 529926 509627 576139 348368 397780 691360 307587
16419 717608 728430 550604 297695 770027 620656 746694 553931 747576 338818 548709
16409 548709 730874 389064 710194 230960 633555 278081 538574 386725 372635 289125
16399 289125 780233 571691 284047 211127 264585 396219 243923 342272 286991 523491
16389E23491j87278J27221A57771K54614j65216K69082j96683J36009J98659o4388
16379E89848J35670j05878K15387k44417o5281j62054J64543p5101J95008r008
16369F38717N7571k86408k02667K74794j78904l9690P6835I1189L13482J10794
16359E15465J09940B79083M0551j11975J63137J30721k11121R3815J28974B39961
16348D41197p8193j23396e9475E38047j27764J19613k34036A26941P0482K46517
16338D43940j1887k0574j96381J98359L4604j72138J27542j70443j00699B160
16327E84597q3061A52778J87080A52592J54746R2971j67565K22008k05095J1045
16317B60702K9470l9642O8772A45128J62711J05600j09291K05389A40886O1121
$$ plain form
16389 523491 336213 463434 157771 412385 247169 516251 319568 455577 654236 589848
16379 589848 725518 619640 835027 590610 525329 363275 527818 452717 647725 638717
16369 638717 696288 409880 207213 482007 303103 263413 340248 91189 404671 515465
16359 515465 625405 279083 319634 207659 370796 501517 290396 384211 513185 239961
16348 441197 363004 239608 -59475 538047 410283 529896 295860 126941 197423 443940
16338 443940 432053 411479 215098 413457 448061 275923 403465 233022 132323 2160
16327 584597 501536 152778 339858 152592 307338 400309 232744 454752 249657 260702
16317 260702 290172 250530 319302 145128 307839 413439 304148 509537 140886 202007
16307B02007M06116A85244J22789j28535L10500A01592J81608B6155a84635B48870
16296A31244f611E2069L08172a18033A27316Q0891K36791a67441B22524J63666
16286C86190i3957B1649L71369J60184r4231k15471G462M49027k8929A88640k7017
16275A61623K65L39820A08624K67555D8641J7133J30960F2046M08300a0226A59528
16263I3396L5168K9312L30541A38106K69824A83531B9822J24214L3054K9583j05423
16252A11250d69123B41055p9718F1049J40443I0483J10779q5978l7275K19792
16242B97801I5616B4168L03940J1869q6921G6318L43973c0626B3243K96921h4794
16230a08025b0321B50632H0642K02736k1606e9784B11068J34834d1280C78545
$$ plain form
16307 202007 608123 185244 308033 179498 489998 101592 283200 26155 -184635 248870
16296 131244 -6611 52069 360241 -118033 127316 208207 444998 -167441 222524 386190
16286 386190 -93957 21649 393018 553202 458971 243500 7462 456489 427560 188640 161623
16275 161623 161888 501708 108624 376179 48641 65774 196734 62046 470346 -10226 159528
16263 93396 128564 157876 488417 138106 407930 183531 29822 154036 187090 216673 111250
16252 111250 -469123 241055 161337 61049 201492 90483 201262 115284 78009 297801
16242 297801 95616 24168 328108 339977 253056 76318 420291 -30626 23243 320164 -84794
16230 -108025 -20321 250632 80642 283378 261772 -59784 211068 345902 -41280 378545
16219A59723c04760D0470a3661B20596N5222b3644A41450j2885a1013B37355J18001
16208C55356a17902B20640K4703n7423J5480F321a47228G3488N41443A58571L7202
16197A95773o9827J29937J55351B00035M51301k95651j72384M6898j00942J69611
16187B98868f5199B8018K3381D076R1694L88857a38149I7616a00347C41373a35596
16175B84161A8369R6254M3174k7987M1125a10141C76555g2686A49328D7030R432
16164E6462a08328j32328J10663B1167J36320d0031A49838n4141b4493p0348C01914
16152c6870D31637b15547C41319b07655J4964A21506Q6747r010b47285B6584f3832
16140E3833b34472D55587F3141k1852O9797r561a89869A4788J48492n1304d3556
$$ plain form
16219 159723 -304760 40470 -13661 220596 275818 -23644 141450 128565 -11013 237355 355356
16208 355356 -117902 220640 245343 187920 203400 6321 -147228 73488 614931 158571 195773
16197 195773 125946 255883 411234 200035 651336 355685 183301 230199 129257 298868
16187 298868 -65199 28018 51399 4076 95770 484627 -138149 97616 -100347 341373 -135596
16175 284161 18369 114623 157797 129810 170935 -110141 376555 -72686 149328 47030 56462
16164 56462 -108328 -240656 -129993 21167 157487 -40031 149838 95697 -24493 -94841 301914
16152 -36870 431637 -215547 341319 -207655 -192691 121506 208253 199243 -247285 26584 -63832
16140 53833 -234472 455587 63141 41289 111086 101525 -189869 14788 163280 111976 -43556
16128f0513A52823a96220A56899L6605n6834F7037a05342M0243A57899F5894J57739
16117B23633k5441a01918F5427K5287N2935K526M1311a28115q1917A8993b02274
16105B9758e6234B41712a91376G6983a12430C39584H6549C1189J34768k1487g7770
16093E4626e8590j56489B61260a42802a0452l56228a03352o9868j31728B41020
16082a47296A29405m5744C5986b21280C00253a66646B07954a50533H9107b0187
16071a61692H3568L61098A37297K68885A61750J1351d6333A50470K09279a04443
16060f8182j95237g9206C28335H818c98909a51221L0298M707M2049F7579a8103
16048A93978n3061e9698B36271D2787a8354m4694o6549c6304A48359B1268J20142
$$ plain form
16128 -60513 152823 -196220 156899 193504 136670 67037 -105342 -65099 157899 65894 223633
16117 223633 198192 -101918 65427 90714 143649 146175 187486 -128115 -210032 18993 -202274
16105 29758 -56234 241712 -191376 76983 -112430 339584 86549 31189 165957 144470 -77770
16093 54626 -58590 -215079 261260 -142802 -10452 -366680 -103352 -173220 -304948 241020
16082 -147296 129405 83661 35986 -221280 300253 -166646 207954 -150533 89107 -20187
16071 -161692 83568 444666 137297 406182 161750 173101 -46333 150470 359749 -104443
16060 -68182 -263419 -79206 328335 8818 -398909 -151221 -120923 -116216 -74167 67579 -18103
16048 193978 140917 -59698 236271 42787 -18354 -63048 -129597 -36304 148359 21268 141410
16037A41410D725L88523a67649O754e4816I1053R8660c87133H5927J9606L8645
16026A44178Q7538I1045J25199n6460a70779B41424K67049C636K03435b96287
16015c12468B9489b38668e09I9980i3446k09201J42992q02J9184C3337b1335j9752
16003d1087q050j33383P2204B20835L60991f013j400A35338d18202A25446n0789
15992G4657e06569C6393M26378a48430q6275b992j22242A24271L1281K05663F5630
15980A25624L44167b7574B57097F1691N39462h5892B54007C1788c3163j27017
15970a60180p2438N7086p607p55B74521F0551O1055J51700a94350A33434a56161
15958B44286A9053K1648J83625C9445J96732c71257J04700a11806d0816A81843
$$ plain form
16037 141410 4725 393248 -167649 -160895 -54816 91053 189713 -387133 85927 105533 144178
16026 144178 231716 91045 216244 159784 -170779 241424 508473 3636 207071 -296287
16015 -312468 29489 -238668 -509 99980 -93446 -302647 -159655 -160457 -141273 33337 -21335 -41087
16003 -41087 -49137 -182520 -110316 220835 581826 -6013 -7413 135338 -418202 125446 74657
15992 74657 -506569 36393 462771 -148430 -234705 -2992 -125234 124271 155552 361215 65630
15980 125624 469791 -27574 257097 61691 601153 -85892 254007 31788 -33163 -160180
15970 -160180 -232618 -175532 -183139 -183894 274521 60551 121606 273306 -194350 133434 -156161
15958 244286 19053 40701 224326 39445 236177 -371257 -266557 -111806 -40816 181843
15947C09756H7086b55580J06810D6842a4346G1742K38808Q7709c33028k01037
15937e34065a25866D3142M5733l2368A3298a15772j2521j28800D73280A39588
15926b91624B47205r8401c06395a0532D5092a17099r95C07522r8263a4106B76117
15914C74164E9207j6091p803K6549a02441K3738l9591b667H4127a573a5I6431
15901D7531J63540J05001k9495E6464k2549c0789m26194i8375I0278J33700O2831
15890B86809k9516d8775p5386m9562A4205a46761B26369a64771f9031A1843L3394
15879D5237B099a56907j6979C26982e5625o5863A97318a10453c3253j24922F57086
15867A19717c3645j30736k79465G4335c51241H11d88541a60127e9300k27812d5007
$$ plain form
15947 309756 87086 -255580 -148770 46842 -14346 71742 310550 398259 -333028 -534065
15937 -534065 -125866 43142 88875 56507 13298 -115772 -128293 -257093 473280 139588
15926 -291624 247205 148804 -306395 -10532 45092 -117099 -118094 307522 209259 -14106 276117
15914 374164 59207 43116 35313 61862 -102441 -78703 -118294 -2667 84127 -1573 -15 96431
15901 47531 211071 316072 286577 56464 33915 -30789 -456983 -98375 90278 223978 286809
15890 286809 257293 -48775 -124161 -173723 14205 -146761 226369 -164771 -69031 11843 45237
15879 45237 2099 -156907 -173886 326982 -55625 -121488 197318 -110453 -33253 -158175 657086
15867 119717 -33645 -164381 -443846 74335 -351241 811 -488541 -160127 -59300 -287112 -45007
15855c0449p4708q8958j7169A19227K70422b04156a9995l45181J05563A10033
15844b93214J03783H2338a78099l3150o1769C091J63844p0343a98435G9637m03
15833G9234P1179f6718r4676I6571O0782e9965A49616f3155k5992j25754C83232
15821E710b93573g293m4336A07291d6119j80020a666B26603a68783f4684n4169
15810a18853A8181L44236a16662j38070N946B4641a52341B30848a0710C4452a15705
15798a04850j60048e9864A20186f9804C6591f0478b9957A14604b98718A20051
15787c09230a17653M8587c2915D8249b3871q2525j98113B85683a82474j10054
15777b92528A08529a28788B27100l5559q8850b45396P1639H5484a36311k60507
$$ plain form
15855 -30449 -105157 -194115 -211284 119227 389649 -204156 -19995 -365176 -259613 110033
15844 -293214 -189431 82338 -178099 -211249 -273018 3091 166935 96592 -198435 79637 79234
15833 79234 150413 -66718 -161394 96571 157353 -59965 149616 -63155 -89147 -214901 383232
15821 5710 -293573 -7293 -51629 107291 -46119 -226139 -1666 226603 -168783 -64684 -118853
15810 -118853 18181 362417 -116662 -254732 -248786 24641 -152341 230848 -10710 34452 -115705
15798 -104850 -264898 -59864 120186 -69804 36591 -60478 -29957 114604 -298718 120051
15787 -309230 -117653 -69066 -32915 48249 -23871 -106396 -304509 285683 -182474 -292528
15777 -292528 108529 -128788 227100 191541 102691 -245396 -173757 85484 -136311 -396818
15767c96818g9322j66182M9505Q3146B34147r5229h2286j99679a8382r0336G6904
15755d9994j91819A65734a35624b6655k85551A09491a21452a2177B0398a2147
15744B31635J66136q5230I3671e3386A94075a40635A44427C0289J18212J75777
15734C24278j39195o872a51689j69980B03764a47549A32989c73860B4131K18395
15724B42526a30275j44843B1494d0213A42705A4930J65017n5765i3094d0185p7008
15713a17193N6420j69663L1823b1601H4933g1245I7317C8384P8944e0795j00673
15702a51468C24256j15336f7071l96746b17497f7378m6374A40778n9048l6069
15692D5661P3529J60204q009J28212D773K09567a23131C35138e2171k36145A08206
$$ plain form
15767 -396818 -79322 -245504 -195999 -112853 234147 138918 -82286 -281965 -18382 -108718 76904
15755 -49994 -241813 165734 -135624 -26655 -312206 109491 -121452 -12177 20398 -12147
15744 231635 397771 312541 93671 -53386 194075 -140635 144427 30289 148501 324278
15734 324278 185083 178211 -151689 -321669 203764 -147549 132989 -373860 24131 242526
15724 242526 -130275 -275118 21494 -40213 142705 14930 179947 124182 -93094 -40185 -117193
15713 -117193 -60773 -230436 -198613 -21601 84933 -71245 97317 38384 117328 -50795 -151468
15702 -151468 324256 208920 -67071 -463817 -217497 -67378 -113752 140778 81730 45661
15692 45661 119190 279394 271385 399597 4773 214340 -123131 335138 -52171 -288316 108206
15680b84286p9249a54836b670H6240a53726e0514j44949D1529b0073k68663H1318
15668a83335B9436h4786j33276a5924A22525n7756L0601b5118E5546P2032J73205
15657C00783j46670d18932J89156j68995a64002j8704n006E7142J23869B2588
15646a26077j31179h5535k7297c2184n3735B3633J91796i2218A24528M3810b57357
15634E7552J0080b9038c613k93310D7600a00391F8024b11930C6229N9901P5739
15623A71869K2043B3483h9727L4913I3911a39722M0414C36882b34292h1025p8717
15612a59742r5151B9998P0336C4060d23589A95576b36513M6452C62678e1014k86840
15601c37854C5690c26802Q1017d1547B55081a31239A0546c5625H9781d9233j54982
$$ plain form
15680 -284286 -363535 -154836 -2670 86240 -153726 -50514 -195463 41529 -20073 -288736 81318
15668 -183335 29436 -84786 -218062 -15924 122525 64769 95370 -25118 55546 127578 300783
15657 300783 154113 -418932 -229776 -398771 -164002 -182706 -187712 57142 181011 22588
15646 -126077 -257256 -85535 -112832 -32184 -85919 23633 215429 -92218 124528 168338 -257357
15634 57552 67632 -29038 -3613 -296923 47600 -100391 68024 -211930 36229 96130 171869
15623 171869 193912 23483 -89727 -54814 93911 -139722 -99308 336882 -234292 -81025 -159742
15612 -159742 -254893 29998 100334 34060 -423589 195576 -236513 -190061 362678 -51014 -337854
15601 -337854 35690 -326802 -245785 -41547 255081 -131239 10546 -35625 89781 -49233 -204215
15590b04215f4263B9697i0641F0808C382L10936A5392a64939I8747a20426C9481
15578A48987e6041k70229C91232a69592k4111g1206j07804E0453b22237D7104
15567e3959G6318c19820g1177A03655a06589A95937B629f8197k8380m9302j31846
15556b77725G6035L6605R840K14486o0815D9559b33963A5149c4246o0077j88555
15545b82878A0016a72518G8815c6501o0908I2117m1892J10042a17242A81884a54465
15533g601A31784J52998a85149F1586J09410N72L3336a37410q0450A98540Q3691
15522B82231a65100j41406A2208b18254g29k22938N9340M9914B17262J27733a6206
15510e05326A99594a61531l6501D2293R1314B9483b39757j9887B13490a06437
$$ plain form
15590 -204215 -64263 29697 -90641 60808 3382 314318 15392 -164939 98747 -120426 39481
15578 148987 -56041 -326270 391232 -169592 -193703 -71206 -179010 50453 -222237 47104
15567 -53959 76318 -319820 -71177 103655 -106589 195937 2629 -68197 -96577 -145879 -277725
15556 -277725 76035 112640 122480 336966 276151 49559 -233963 15149 -34246 -94323 -282878
15545 -282878 10016 -172518 78815 -36501 -97409 92117 50225 160267 -117242 181884 -154465
15533 -7601 131784 284782 -185149 61586 170996 171568 204904 -137410 -217860 198540 282231
15522 282231 -165100 -306506 12208 -218254 -729 -223667 -164327 -114413 217262 344995 -16206
15510 -505326 199594 -161531 -198032 42293 133607 29483 -239757 -259644 213490 -106437
15499A36143J43882D3846a92115K5122d0209j82478C358J0861J22924b67704g7865
15487b96010c9351E9968O2860c06941B03927O7707A7595O2543h2984k12979A12699
15475G9299Q5141b0720A19603L8101C311M2518J06753b43444C55064a2157B02571
15463A67475A5347c2835m7710j6303B30359h6218B84754c0146q5170H9514J67689
15452B57203H9526i7294P542p5551k9612Q0831B4390a09167k0844e8227B32565
15440c4593o9319q2350a7117l85398e1721O786A80145G8698b60973C00884e9489
15428c21298a31583d7663B28075A9088K31402D1814P6564O8331l4980K04137f6589
15416H1229L26997A67506D8356a95342j9378C26813a51051A34543f4839j43561
$$ plain form
15499 136143 280025 43846 -192115 -166993 -40209 -222687 3358 14219 137143 -267704 -77865
15487 -296010 -39351 59968 122828 -306941 203927 271634 17595 80138 -82984 -295963 112699
15475 79299 164440 -20720 119603 157704 3311 45829 152582 -243444 355064 -12157 202571
15463 167475 15347 -32835 -80545 -96848 230359 -86218 284754 -30146 -115316 89514 257203
15452 257203 89526 -97294 -89752 -165303 -194915 -114084 24390 -109167 -130011 -58227 232565
15440 -34593 -103912 -186262 -17117 -402515 -51721 -44935 180145 78698 -260973 300884 -59489
15428 -321298 -131583 -47663 228075 19088 250490 41814 118378 186709 151729 355866 -66589
15416 81229 408226 167506 48356 -195342 -214720 326813 -151051 134543 -64839 -208400
15406b08400h8652l4362A17824J4811a45807C17735a8352l81015G860a16042l74189
15395d90231A32153E898R8377B8937b10039R3466B35250a31178j68992i7263B37819
15383a78532k60903J56168G5069j2218j6489J99724E1121b02467P1550B2977a54444
15371F4030a57840C17174K1879a44077b8807C8344h7413k46935B49530g6777C9983
15359b00511R7886B89015d5061k86517A19249L0820a73540H0011k2585r33L625
15348F0118A8918a13825A45874b5154A38372O2549A1127d86514a89117K4501A94317
15336F4284N8365l5537i8329C39943j49205C1525o214L46440g0321B08755a8232
15324C1280M1563A3110g6442k22765C8021K05136N7751C3125l963a84667g7124
$$ plain form
15406 -208400 -88652 -123014 117824 132635 -145807 317735 -18352 -399367 7860 -116042 -490231
15395 -490231 132153 5898 104275 28937 -210039 -116573 235250 -131178 -300170 -97263 237819
15383 -178532 -439435 -283267 75069 62851 46362 246086 51121 -202467 -130917 22977 -154444
15371 64030 -157840 317174 339053 -144077 -28807 38344 -87413 -334348 249530 -76777 39983
15359 -200511 -102625 289015 -45061 -331578 119249 150069 -173540 80011 57426 56493 60118
15348 60118 18918 -113825 145874 -25154 138372 200921 11127 -486514 -189117 -164616 194317
15336 64284 122649 87112 -98329 339943 190738 31525 25311 371751 -70321 208755 -18232
15324 31280 72843 13110 -76442 -299207 38021 243157 300908 33125 29162 -184667 -77124
15312A29441n999c3792o4944M4539C20987E2466K6924b7634A07921C3368a75183
15300b11239D6272i619B43929a13041A02299J00657F6031J3653k2641j6326R2436
15289A33153I51a35351B9068L71861H8677a3169A12643B1810J644f0873l5560
15278i6433l170G747g4674A51372f2342j8197N608l4288F8486p101d0101E7693
15265D04262b34315C22463l8825r961M3797c3589j72971A85787J47213A56942
15254C65840k5253b61390A30224J38951O76705O36410k70231l69504O39811F58212
15243B82867E0583J84108m0526c249F8920J15509P38f4512F0035G739c45736C34768
15230a66315r7304A33515n2270N7961a88622B27106L2705A3541K9938Q426a8221
$$ plain form
15312 129441 123442 -33792 -98736 -54197 320987 52466 79390 -27634 107921 33368 -175183
15300 -211239 46272 -9619 243929 -113041 102299 202956 66031 79684 57043 40717 133153
15289 133153 951 -135351 29068 400929 88677 -13169 112643 21810 23454 -60873 -96433
15278 -96433 -99603 7747 -74674 151372 -62342 -80539 -74931 -109219 68486 61385 -40101 57693
15265 404262 -234315 322463 283638 273677 317474 -33589 -206560 185787 333000 156942
15254 365840 340587 -261390 130224 269175 945880 1582290 1312059 942555 1582366 658212
15243 282867 50583 234691 194165 -3249 68920 184429 185167 -64512 60035 7739 -345736 334768
15230 -166315 -263619 133515 81245 139206 -188622 227106 259811 13541 43479 51905 -18221
15218h0638j95630E8761c50014D4492a83914M2538A67742a7948a747o2263B84254
15206a50332d5121j23038C61181D9071G708K20514I8509L99275A78274L8553c4814
15194B54486j16244a61200O9689j35763B28007E4842J05794b69965B06188D2733
15183A29747l1860L93458A67281Q1041I8555M7250a32659L1267F6608K51181F6883
15171A20890a77032i788C65345f7181B4488K91274b64636B54043A5119J95745
15161B10864a11427I8996b64164C29281F5541J97024p3377J56700A3186J85105
15151A98291J63967A19312J64966r1809j3138A8475K40450p053l5888I0219h7817
15139c2283B51509l8118a33426C80330C612b93054i9638C5391J49705a11764A75984
$$ plain form
15218 -80638 -276268 58761 -350014 44492 -183914 -141376 167742 -17948 -1747 -64010 284254
15206 -150332 -45121 -168159 361181 49071 7708 228222 98509 497784 178274 216827 -34814
15194 254486 138242 -161200 -91511 -227274 228007 54842 160636 -269965 206188 42733
15183 129747 97887 491345 167281 248322 98555 145805 -132659 -101392 66608 317789 66883
15171 120890 -177032 -9788 365345 -67181 24488 315762 -264636 254043 15119 210864
15161 210864 -111427 98996 -264164 329281 65541 262565 189188 345888 13186 198291
15151 198291 362258 119312 284278 192469 179331 18475 258925 251872 215984 90219 -87817
15139 -32283 251509 213391 -133426 380330 3612 -293054 -99638 35391 185096 -111764 175984
15127A89931n5096h9361K1691n2993B36139e189B01544K54161A27440N4073J88672
15116C70185A82774j3817K11144d1842D49682A66000L3692j6622a21292A04012
15105b50495D33819j14421A3872J41689e7069A54555a12916A82121C6823O8371
15095A05194a45877A30357a65156e0924A09039J39782f5335D00386l419O9954
15085D66921I6238e0127D02708K5818b97228A96757G4910e8512B38109J07948
15075C46057D6746K34767J22518j85668G5740a16095p1149A78267J93997k3648
15065C48616A62050K36499F055M90788B25623A9149J35688M21381A80654h4734
15054D60521r8216q3188l8347B8721K05103b01929A06685K0070o824g7880n1546
$$ plain form
15127 189931 134835 -89361 -67670 -120663 236139 -5189 201544 455705 127440 181513 370185
15116 370185 182774 168957 380101 -41842 449682 166000 199692 183070 -121292 104012
15105 -250495 433819 319398 13872 155561 -57069 154555 -112916 182121 36823 105194
15095 105194 -145877 130357 -165156 -50924 109039 248821 -65335 400386 396967 466921
15085 466921 96238 -50127 402708 428526 -297228 196757 74910 -58512 238109 346057
15075 346057 46746 281513 404031 218363 75740 -116095 -187244 178267 372264 348616
15065 348616 162050 398549 6055 496843 225623 19149 154837 576218 180654 -84734
15054 460521 362305 279117 240770 28721 233824 -201929 106685 126755 119931 -77880 -129426
15043a29426B47819b0973C11032L7410C1803L25609F7541n28a25202B87116I7894
15031A49060J73329A33400m7022J80400a53186B83310h370C90041q6269a49689
15020C12096j42014a09762B09632f842C42836A63138c1672B44974A09732O6514
15010A76246a5039B60701o2544D956K91242h6178i661E7775K13391K98616k63468
14999C06314o0814L7455H3066K00646m9569K15219k12581k7288J78484b7749A69886
14987A25174J6200K03164A13600P3801l1502p6115O1682J39907I8457J87478c4580
14975c6102j05322C44189h0605B37284j02760N3613K59688H8528J54641O6600
14965C09769j12082Q4103m0918n3265J43156K49811i9226D38989j27655O0220
$$ plain form
15043 -129426 247819 -20973 311032 348442 31803 357412 67541 67013 -125202 287116 97894
15031 149060 322389 133400 86378 266778 -153186 283310 -8370 390041 303772 -149689
15020 312096 170082 -109762 209632 -6842 342836 163138 -31672 244974 109732 176246
15010 176246 -15039 260701 198157 4956 296198 -86178 -9661 57775 271166 569782 306314
14999 306314 245500 282955 83066 283712 234143 449362 236781 209493 387977 -27749 169886
14987 125174 141374 344538 113600 187401 155899 79784 141466 281373 98457 285935 -34580
14975 -36102 -141424 344189 -80605 237284 134524 188137 447825 88528 243169 309769
14965 309769 197687 281790 240872 187607 330763 580574 -99226 438989 311334 371554
14955C71554B4114O36N3732A2110R1664e3648A93808M5540f3434B91904J74987
14944D66891A73056P0965L7627n1128N8428A34556a28224C34928o6423K5174G3021
14932C73205Q3652F7833M04705k9407j41711K67112k52102n0875J00387p0878
14922B95064j45818J48374K81716B16119H0243e0308C42888K3771j12246K4494
14912B78907p069J78554B09763q4940J69589p2154K42880A78776g4977B64207
14901C67482K79122A68943f1099A40269J73466J86244k07907J72516k700K13700
14891F75588B77225K17400A68869p0752M11368B14662H3113J50325L30154k05130
14881C58462L3193m8448A64005K61814R9414j46591j58952M75300A27350K83225
$$ plain form
14955 371554 24114 24750 78482 12110 103774 -53648 193808 239348 -63434 291904 466891
14944 466891 173056 244021 281648 230520 288948 134556 -128224 334928 268505 293679 73021
14932 373205 456857 67833 472538 443131 301420 568532 316430 265555 365942 295064
14922 295064 149246 297620 579336 216119 80243 -50308 342888 366659 254413 278907
14912 278907 271838 450392 209763 124823 294412 222258 465138 178776 -74977 264207
14901 367482 646604 168943 -61099 140269 313735 499979 292072 464588 461888 675588
14891 675588 277225 494625 168869 98117 509485 214662 83113 233438 563592 358462
14881 358462 391655 343207 164005 425819 525233 378642 219690 694990 127350 410575
14871D10575j30884K65621K9688p1654L044q8852I7209J21024K66032j23950K18986
14860E79301k23120O6964j91091M50353B55771K82794B5277M83577k927A17175
14849D30617k14957K90604r2729A08163L36566J53057r1275j10756A079L43333
14839C44412K72850q4384M9071k2541K7989k00005L3159L34267A62840M76659
14829F39499k73625Q0233J7090H2732K66425L3070p0607L11961j96395K57642
14819F84828A59119O34036k61161K09691k06175r6333J85902k38099L67729p8293
14809F76416j60827J57912k98318J07847B38837J63253K32706J81903C11249M73790
14799G85039k24001J28243J22389l46405p4395r9102K97275Q682B36852L03232
$$ plain form
14871 410575 279691 545312 575000 503346 506390 417538 97209 218233 484265 360315 579301
14860 579301 356181 423145 232054 682407 255771 538565 25277 508854 505927 117175
14849 430617 215660 506264 413535 108163 444729 597786 506511 395755 1079 344412
14839 344412 617262 532878 581949 559408 587397 387392 420551 754818 162840 639499
14829 639499 365874 446107 463197 82732 349157 382227 311620 623581 427186 684828
14819 684828 159119 793155 531994 741685 535510 439177 625079 386980 754709 676416
14809 676416 515589 673501 375183 483030 238837 402090 634796 816699 311249 785039
14799 785039 561038 689281 811670 465265 390870 291768 589043 597725 236852 540084
14789E40084k1813J05847N3934j67848P3926J97492l61679M4771K19189J63712
14779H47615m22871K06751j32240J65777K85828m45714K51949k49411R9935k16419
14769C91200M4272P2041J38852l1282n5322L97426m03867j51914K65851j0259
14759F56998n2037p9281J57053k21409L14994o0822o8995K25853j76101n5791
14749F40462J26761k16056M8354k5871L27607j67058Q9417k36134J77545k5871
14739G39156j85373P9947j05518K84962q0496j02360j11752L70113j44046R9191
14729H43824j27319J64050r386K1941k3624k44488Q2976L14064n8476j47948J73644
14718I89258l73262K76194J26171l57416K90886l26088K29310o1906q1385j84273
$$ plain form
14789 540084 518271 624118 678052 510204 584130 781622 419943 464714 683903 847615
14779 847615 424744 631495 499255 665032 950860 505146 757095 507684 607619 391200
14769 391200 435472 507513 646365 615083 559761 957187 553320 401406 667257 656998
14759 656998 604961 525680 682733 461324 776318 715496 646501 872354 696253 640462
14749 640462 767223 551167 599521 573650 901257 734199 823616 587482 765027 739156
14739 739156 553783 633730 528212 813174 732678 630318 518566 888679 744633 843824
14729 843824 716505 880555 871169 893110 869486 624998 707974 1022038 963562 815614 989258
14718 989258 615996 892190 1018361 660945 951831 625743 855053 793147 711762 527489
14708E27489L91489j01058j14881J28338j43717l0878L55602l55413K84301R0059
14698A031331P6140l73765K62882j80531M52600j92354k95417J57843j64293O35685
14688A410121n52782k15137M37912r4393o4612K44407o7210j17341M6270j24054
14678I03181K49305n33837K41777K35025o5366K0097N32K4806M6347n2353j47270
14667I22244R0076K71696j37364K2064j0320M68969n17128k22119L85798J00184
14657A374100m26841J0342J76125J34140Q3778m24047L52413k61250J82374K83046
14647A484180k0181q1399K91100j55055K11984m73984q6183R6489k5089O9379
14637A311241P8008J20239l21054J14771o6979J1692J88339N1794k05171K09076
$$ plain form
14708 527489 918978 817920 703039 831377 687660 656782 1012384 656971 941272 1031331
14698 1031331 1107471 733706 996588 816057 1268657 1076303 780886 938729 774436 1410121
14688 1410121 857339 642202 1080114 985721 921109 1165516 1098306 980965 1027235 903181
14678 903181 1152486 618649 860426 1095451 1030085 1050182 1050714 1075520 1121867 1069514 922244
14667 922244 1012320 1284016 1146652 1168716 1158396 1627365 1110237 888118 1273916 1374100
14657 1374100 947259 957601 1133726 1267866 1351644 927597 1280010 1018760 1201134 1484180
14647 1484180 1463999 1382600 1673700 1518645 1730629 1256645 1170462 1266951 1241862 1311241
14637 1311241 1389249 1509488 1188434 1303205 1236226 1247918 1436257 1488051 1282880 1491956
14627A491956p6311J31079l36325j3465j93692M77479p5690L95028l00991k0838
14617A478230O3982k10571K9630K34697N2649q8044J78605m01340M28327M22289
14607B188454n69775q6093J21705L7302k87961K73277O0644R7809o0954k55778
14597A518630k4179L23961J16930m78493K63462K26654r2260J93696q9553k16604
14587A742244L43902j31029k78840L53389L78756l71155L39694m62583L10118
14578B224496k14220M5326n2248L41356j7201l7103m09120K25350o1065M6426
14568B091997N6748j23113K79780J81119L34934m24350L98973j74688J96459J95708
14558C013567j75620L17858J58099J85475j63866O03858K01937M84755J194881
$$ plain form
14627 1491956 1415645 1546724 1210399 1196934 1003242 1480721 1405031 1800059 1499068 1478230
14617 1478230 1542212 1331641 1361271 1595968 1648617 1560573 1739178 1337838 1766165 2188454
14607 2188454 1618679 1532586 1654291 1691593 1403632 1676909 1737553 1835362 1774408 1518630
14597 1518630 1494451 1818412 1935342 1456849 1720311 1946965 1854705 2048401 1958848 1742244
14587 1742244 2086146 1955117 1676277 2029666 2408422 2037267 2376961 1914378 2224496
14578 2224496 2010276 2055602 2003354 2344710 2327509 2290406 1881286 2106636 2045571 2091997
14568 2091997 2148745 2025632 2305412 2486531 2821465 2397115 2796088 2621400 2817859 3013567
14558 3013567 2837947 3155805 3313904 3499379 3335513 3939371 4141308 4626063 5820944
14549E820944J672318K897086R575691J8975978J2032707B4757991A0697792n038057
14541E659735j956473j030107k60511k18057k45338M84901l69876K55128k87716
14532B031686J22463j10613Q8436r9790M18140j83708J92829J04340j61943K68270
14522B670110j39287L433M7837j8372l3715O293L19916L09j45050j25662K59719
14511B845531M44735n88179L1779K60031j54247L26086j51490K66240o6637m38680
14501B775169M95957l1482J28917L8257K77649m37391J94522Q7996J41901n63654
14491C107841P08523J3060n7334M9172j24365J60924J16893K34419q7376j29345
14481C992412J1133K37922j88069K25483l4919R1165k84966J12073J66452q3031
$$ plain form
14549 5820944 7493262 10390348 19966039 38942017 50974724 24757991 10697792 5659735
14541 5659735 3703262 2673155 2412644 2194587 1949249 2434150 2064274 2319402 2031686
14532 2031686 2154149 2043536 2131972 2032182 2450322 2266614 2459443 2563783 2401840 2670110
14522 2670110 2530823 2534256 2582093 2563721 2530006 2536299 2856215 2856524 2711474 2585812 2845531
14511 2845531 3290266 2702087 2733866 2993897 2839650 3165736 3014246 3280486 3213849 2775169
14501 2775169 3271126 3239644 3368561 3406818 3684467 3247076 3441598 3529594 3671495 3107841
14491 3107841 3816364 3829424 3772090 3821262 3696897 3857821 3974714 4209133 4121757 3992412
14481 3992412 4003545 4241467 4053398 4278881 4243962 4335127 4050161 4162234 4328686 4245655
14471D245655N67971n92506L07330L22840k46070L00523r2545J24639j21329J07970
14461D924478K52843j30038K45906k00595J65406K169K10547k8619L49937k90342
14451E501692K32080J4202J19353L55716p05842O39560k74265l9737N02459k38968
14441F106250N67855j82792n071L56425n03379L26648J85253k6539N37627l41710
14431G020567K31904M7781L95662K56018m41275M22266j9380K18610j21116O8346
14421H079383J77314K77268K98406l53853M43857P1246J44490m3143M51358J6419
14411I562745k38426M47891j6766o771L62842L96938j35846M26978k60902L32340
14401A0871023K91583K15984J10331N50816j00282P0240K15204J2265L06567N57430
$$ plain form
14471 4245655 4813626 4221120 4528450 4851290 4605220 4905743 4813198 4937837 4816508 4924478
14461 4924478 5177321 5047283 5293189 5092594 5258000 5260169 5470716 5442097 5792034 5501692
14451 5501692 5733772 5747974 5867327 6223043 5517201 6156761 5882496 5842759 6345218 6106250
14441 6106250 6674105 6491313 6486242 6842667 6339288 6665936 6851189 6824650 7362277 7020567
14431 7020567 7252471 7300252 7695914 7951932 7510657 7932923 7913543 8132153 8011037 8079383
14421 8079383 8256697 8533965 8832371 8478518 8922375 8993621 9138111 9094968 9546326 9562745
14411 9562745 9324319 9772210 9755444 9748673 10111515 10508453 10372607 10799585 10538683 10871023
14401 10871023 11162606 11378590 11488921 12039737 11939455 12009695 12224899 12237164 12543731 13101161
14391A3101161O6097j10620N46586L77349j22827K41887L33386J50706K44097
14382A4827822J76005J46600O45072J09565N12123m122P65126k99165M54024P35028
14372A8068078L91571L75178M22249M87149K21359K78547O68700M942R77735N7837
14362B1953345N81502P84458L47724P28894L29380L34031J125183O35201M18217
14353B7237935M90081M90229R17517M05297J083390M28877Q66184Q77766P66239
14344C3563515J140752O47592J018740J369604R96027Q06501P87398J241715J511269
14335D3083113Q80959Q71535K146264J404333J279705J488565J487863J802214
14327E4444551J559395J835158J692382K202038K296112K058793K428874K318884
$$ plain form
14391 13101161 13167258 13056638 13603224 13980573 13857746 14099633 14433019 14583725 14827822
14382 14827822 15003827 15150427 15795499 15905064 16417187 16413065 17178191 16879026 17333050 18068078
14372 18068078 18459649 18834827 19257076 19744225 19965584 20244131 20912831 20917773 21895508 21953345
14362 21953345 22534847 23319305 23667029 24395923 24725303 25059334 26184517 26819718 27237935
14353 27237935 27728016 28218245 29135762 29541059 30624449 31053326 31919510 32797276 33563515
14344 33563515 34704267 35351859 36370599 37740203 38736230 39542731 40330129 41571844 43083113
14335 43083113 43964072 44835607 46981871 48386204 49665909 51154474 52642337 54444551
14327 54444551 56003946 57839104 59531486 61733524 64029636 66088429 68517303 70836187
14319G0836187K482407K887209K543652L004815L312237L145935L515389L222807
14311I4950638L910972M423659M066713M270236N022704M691365N529046N809671
14303A32675004N858873O571325O774262P018207P573646P878884Q392117Q976427
14295A91718745R536887J0032316J0599181J1195214J1364568J2537050J2875468
14288B69859429J3220844J4156011J4058063J4654631J5178572J5195636J5201964
14281C71525150J5255579J5056302J4421579J3659790J2663262J1618038J0098166
14274D64297866Q165560N463823K280964j881493l342893j846655m153717o392189
14266D62591266q057802r038345j0854316j1422395j3028080j3436490j5118078
$$ plain form
14319 70836187 73318594 76205803 78749455 81754270 85066507 88212442 91727831 94950638
14311 94950638 98861610 103285269 107351982 111622218 116644922 121336287 126865333 132675004
14303 132675004 138533877 145105202 151879464 158897671 166471317 174350201 182742318 191718745
14295 191718745 201255632 211287948 221887129 233082343 244446911 256983961 269859429
14288 269859429 283080273 297236284 311294347 325948978 341127550 356323186 371525150
14281 371525150 386780729 401837031 416258610 429918400 442581662 454199700 464297866
14274 464297866 472463426 477927249 480208213 478326720 474983827 473137172 468983455 462591266
14266 462591266 454533464 445495119 434640803 423218408 410190328 396753838 381635760
14259C81635760j5597385j6021891j5883946j5203477j4627762j4278144j4235352
14252B75787803j3330119j2618670j2153532j1753822j0954456j0643392r507586
14245A94826226r198027q303483q384071p710080p456417p201967o547340n792205
14237A34232636n283424n934401n420156m567202m730943m021481l980248m089480
14229I6205301l930487l396790l321519l408643k689364l139788k880977k269334
14221G1168399k797631k133107k335968j856736k226341j725860j896796j462196
14213E4733764j550698j367228j732899j915162j518011p97481j218029o78932
14205D3955324k236278p81267j303650j262504r09896k56754j078646j145995
$$ plain form
14259 381635760 366038375 350016484 334132538 318929061 304301299 290023155 275787803
14252 275787803 262457684 249839014 237685482 225931660 214977204 204333812 194826226
14245 194826226 185628199 177324716 168940645 161230565 153774148 146572181 140024841 134232636
14237 134232636 128949212 123014811 117594655 113027453 108296510 104275029 100294781 96205301
14229 96205301 92274814 88878024 85556505 82147862 79458498 76318710 73437733 71168399
14221 71168399 68370768 66237661 63901693 62044957 59818616 58092756 56195960 54733764
14213 54733764 53183066 51815838 50082939 48167777 46649766 45852285 44634256 43955324
14205 43955324 41719046 40937779 39634129 38371625 37461729 37204975 36126329 34980334
14197C4980334q34203j254487r62686l99866m35786j015499r82991o47591n29187
14188B7918038n01768p64678m31558m98711r94516n49364k73067l34196j045281
14179B2524899k35064m21195m45440n09510l90883m98688k31131n43571j96636
14170A9052781m58276O9131p17846k07001k08385l39941m74418o54542M96020
14161A6557523n02170l47313k24129o34413j30852l22383j61532J7644k72675
14152A3979700o96605n4737q3973J10403l85609m02763j84327k2715l23569l45063
14142A1590742j05895J14799m95365j38063k48175K68572k94726j6011o38320
14133A0037558L65133l17212j71805r4167k66055J578j61352j73085j67404k57516
$$ plain form
14197 34980334 34146131 32891644 31928958 31529092 31093306 30077807 29094816 28447225 27918038
14188 27918038 27416270 26651592 26220034 25721323 24726807 24177443 23904376 23570180 22524899
14179 22524899 22289835 21868640 21423200 20913690 20522807 20024119 19792988 19249417 19052781
14170 19052781 18594505 18663636 17945790 17738789 17530404 17190463 16716045 16061503 16557523
14161 16557523 16055353 15708040 15483911 14849498 14718646 14396263 14234731 14252375 13979700
14152 13979700 13283095 13228358 13144385 13254788 12869179 12466416 12282089 12259374 11935805 11590742
14142 11590742 11484847 11599646 11104281 10966218 10718043 10986615 10691889 10675878 10037558
14133 10037558 10402691 10085479 9913674 9819507 9553452 9555030 9393678 9220593 9053189 8795673
14123H795673O685R5165m6624l57371k22923L9252j46665r3001P9827m66852R2147
14112G775313k92733k0053J01525k85882P7726j26810k08612K24278j50513l76639
14102F717600K27275l51093L3708m8727L4960K7014p4246j82413l1691l68146
14092E984241O0279M0762Q516k42312K4211k36801R8481K27535o22046M27931
14082E770797k07785j96230M21243n24340J68671k56222k39349M45547m43995
14073D938337j04727P4362O1673n59399K55053K95753l16465k03706J30045J8154
14063D589080n2654K3285k1537j63423L89602j47358k55298j6177k82150L27288
14053D390658l11708L12914o05399K22109P8l90350L61724k01728J12650m48437
$$ plain form
14123 8795673 8802358 8897523 8850899 8493528 8270605 8309857 8163192 8070191 8150018 7683166 7775313
14112 7775313 7482580 7462527 7564052 7278170 7355896 7229086 7020474 7244752 7094239 6717600
14102 6717600 6944875 6593782 6627490 6578763 6613723 6640737 6566491 6384078 6352387 5984241
14092 5984241 6044520 6085282 6093798 5851486 5875697 5638896 5737377 5964912 5342866 5770797
14082 5770797 5563012 5366782 5788025 5263685 5432356 5176134 4936785 5382332 4938337
14073 4938337 4833610 4907972 4969645 4410246 4665299 4961052 4644587 4440881 4570926 4589080
14063 4589080 4536426 4559711 4538174 4374751 4764353 4616995 4361697 4345520 4063370 4390658
14053 4390658 4078950 4391864 3786465 4008574 4008652 3618302 3980026 3778298 3890948 3442511
14043C442511L21787j47011R3701j12308l1531J9555l09057J99679P8667k14452
14033C341541j445L12459l36903M27886j85793l33918M17629o14113K08048j68957
14023C066434K65684m36602K71432k60324K71815k24883L9958J77143j18683l49654
14013B702320L08708l45931j78683L99973J8853k63577o1852l13306J59494J82017
14003B608016o6423j49531k75717M6316K05377K12819l21259L41434L089k45370
13993B358751l37461K71777K1031N31445P10568K050399O844580J6630003J9724293
13984D8805386j8260931j4301830o131137l040075j337088p00890o64577k48108
13976D120750o39846j55317j67447k37437Q852j61641j28138l975J15163k19016
$$ plain form
14043 3442511 3764298 3617287 3710988 3598680 3567149 3586704 3277647 3477326 3555993 3341541
14033 3341541 3340096 3652555 3315652 3743538 3557745 3223827 3641456 3027343 3235391 3066434
14023 3066434 3332118 2895516 3166948 2906624 3178439 2953556 2993514 3170657 3051974 2702320
14013 2702320 3011028 2665097 2486414 2886387 2905240 2641663 2579811 2266505 2425999 2608016
14003 2608016 2541593 2392062 2116345 2162661 2368038 2580857 2259598 2601032 2604121 2358751
13993 2358751 2021290 2293067 2314098 2845543 3556111 5606510 12451090 29081093 48805386
13984 48805386 30544455 16242625 10111488 7071413 5734325 5033435 4368858 4120750
13976 4120750 3480904 3325587 3158140 2920703 2929555 2767914 2639776 2635801 2750964 2531948
13966B531948r4637K24341R2702l97370K82701n4036q1745m32266K34242L60763
13956B666643k50346j45082O53j63167K44358j59490J10698q6324k01033o7353
13946A949557j46652J08868J90378r8779L71180m05208j01044N7808m75496P53089
13936B203701l24970p8245N4111k8843M3418K07301j35559M1293o21665M56385
13926A816927m26927L44179m6722K32318O4184k88885J23933k92326o238J16594
13916A637037K81011r8918k10381j25670J77512j1028j78941J63616K1375q4711
13906A570902k53887J51917m41349N00860J71402k31171R4731j79536P643K34736
13896A626248k34756p6643Q9037o6950J04709O9256K13097j12704n7124j40883
$$ plain form
13966 2531948 2437311 2661652 2754354 2356984 2639685 2585649 2503904 2071638 2305880 2666643
13956 2666643 2416297 2271215 2271868 2108701 2353059 2193569 2304267 2217943 2016910 1949557
13946 1949557 1802905 1911773 2102151 2003372 2374552 1969344 1868300 1926108 1450612 2203701
13936 2203701 1878731 1800486 1854597 1825754 1869172 2076473 1940914 1982207 1360542 1816927
13926 1816927 1390000 1734179 1687457 1919775 1983959 1695074 1819007 1526681 1520443 1637037
13916 1637037 1918048 1819130 1608749 1483079 1660591 1649563 1470622 1634238 1655613 1570902
13906 1570902 1317015 1468932 1027583 1528443 1699845 1468674 1563405 1383869 1391512 1626248
13896 1626248 1391492 1314849 1403886 1336936 1441645 1510901 1723998 1611294 1554170 1413287
13886A413287J33331O7765M66547r29084J66408J65653j85008k06996K99309J19019
13876A510231l20169P6901J39285n1974m9447p0378j61211J03004O3524j43503
13866A096263K28089O2588K3975k69710N4427Q0546l10943J21860J76454K1198
13856A284747N792j09933L2881j99366L25091k52815K02623k48687O2259J04342
13846A206934J38678j92790j7752q123k54220J91799J77913k42016j26387O21549
13836A495585k58565l74967K39195r4738K6472k516M10296q4379k64306k24089
13826H67988J40422K45967j80788J18741M1985k48184M9917r8850K14789j75299
13816I76688J92976q6089n3521j59824J99658K74060m10493K7146J3126O8721
$$ plain form
13886 1413287 1546618 1614383 2080930 1151846 1318254 1483907 1298899 1091903 1391212 1510231
13876 1510231 1190062 1266963 1406248 1354274 1304827 1234449 1073238 1176242 1239766 1096263
13866 1096263 1324352 1386940 1410915 1141205 1195632 1276178 965235 1087095 1263549 1284747
13856 1284747 1290539 1180606 1213487 1014121 1339212 1086397 1289020 1040333 1102592 1206934
13846 1206934 1345612 1152822 1135070 1126947 872727 1064526 1242439 1000423 874036 1495585
13836 1495585 1237020 862053 1101248 1006510 1032982 1030466 1440762 1356383 1092077 867988
13826 867988 1008410 1254377 1073589 1192330 1234315 986131 1036048 937198 1151987 976688
13816 976688 1169664 1083575 1030054 870230 1069888 1343948 933455 960601 973727 1042448
13806A042448M0657m1379J32701m54297K39383q9247J94730l70191J67345q9845
13796G72305L1951J50720q7523K68814k16846k10947J86850j03186Q3280l38994
13786E36424K48713P4539n831j51801M67758l22572N0625k46052K17321n9685
13776H09439j02478j21868K36536k762k1911N3000J31384j84143n7517J5089j26200
13765F28569J21323j53377m3076L21302l04465J75479N8485R3097J56797j43351
13755I10783k2274N2933k08576j05535Q0385r2761J09468j24138K99744n5194
13745H44835k01178J76866K65256j67147k86742L28210k53664K67001l58967r2030
13735E22440k8791A80870o897K00814j14486P58065D50306K67085K28692j79652
$$ plain form
13806 1042448 1083105 1041726 1174427 720130 959513 870266 1064996 694805 862150 772305
13796 772305 804256 954976 867453 1136267 919421 708474 895324 792138 875418 536424
13786 536424 785137 859676 853845 702044 1169802 847230 897855 651803 869124 809439
13776 809439 706961 585093 821629 818867 796956 849956 981340 797197 739680 754769 628569
13765 628569 749892 596515 553439 874741 570276 745755 804240 897337 1054134 910783
13755 910783 888509 941442 732866 627331 707716 614955 724423 600285 900029 844835
13745 844835 643657 820523 1085779 918632 631890 960100 706436 973437 614470 522440
13735 522440 493649 180870 173973 374787 260301 1018366 450306 717391 946083 766431
13725G66431j01085l25209L90807n0018J7497q6254N7322j10786P2283L4513l20339
13714C45162M27940j46346l4530P6172k90782J44793j61549P4669O31766C19288
13703E73314A76807O39813k15749q3949N7982J73242M2274B03696L21826j29120
13693C96402K63670k2634J1137r9267J61645p4371R0283j10404A78986L54209
13683E33195l4536K61378k50151B40014M92730l5441k83750J68891J85290l9740
13673G27994j86400k24323M57660j44386n0106O6470j26129K003J3915J67911
13663G04609j71958j01699J04840J06209j33123L3584j9989G5630N39733J62194
13653G77557l45668K5144M219L07192l67296N4515J8702k7009L62362j82403M8697
$$ plain form
13725 766431 665346 340137 730944 680926 698423 612169 669491 558705 630988 665501 345162
13714 345162 773102 626756 592226 668398 377616 522409 360860 435529 1067295 319288
13703 573314 176807 816620 600871 516922 574904 748146 790420 203696 525522 396402
13693 396402 660072 637438 648575 549308 710953 636582 726865 616461 178986 533195
13683 533195 498659 760037 509886 240014 732744 697303 413553 582444 767734 727994
13673 727994 541594 317271 774931 630545 580439 646909 520780 522783 536698 704609
13663 704609 532651 430952 535792 642001 508878 542462 522473 75630 615363 777557
13653 777557 431889 457033 461252 768444 401148 455663 474365 447356 809718 627315 676012
13642F76012k1341P8547C26005m045M16487l52760m3031J58345N1869L45571m29748
13631D68693L30122l81284o7362j53598J27626M03952j41072p5186n5810p5759
13621C80322p8638m4415L82777B94097M38559J5054g064A00594Q4725H9079M59289
13610E48368J29535j44167j12609L6789B10158K49355m3471J25348N0326k03129
13600C88587J36520r6487G5710M82870o7747C1061N71125A95223K92457m2706
13590D44974m6242J38335p3381A17065P32791A62389J90464J53758q0380N4445
13580D80676A24816P1695K26427J0618j05361A56217O6977J32498c5762C84152
13569E49658k18231K4512A19064M66490k31519j29742q7628M11605r43k67006
$$ plain form
13642 676012 654671 733218 326005 321960 738447 385687 342656 501001 552870 898441 468693
13631 468693 798815 417531 350169 196571 324197 728149 587077 511891 456081 380322
13621 380322 301684 257269 640046 294097 732656 747710 -7064 100594 185319 89079 548368
13610 548368 677903 533736 421127 457916 210158 459513 416042 541390 591716 388587
13600 388587 525107 428620 75710 558580 490833 31061 602186 195223 487680 444974
13590 444974 398732 537067 463686 117065 849856 162389 352853 506611 426231 480676
13580 480676 124816 196511 422938 433556 328195 156217 223194 355692 -35762 384152
13569 549658 331427 355939 119064 585554 354035 224293 136665 548270 547327 280321
13559B80321N8172K97348P3297C17943J68093A45565K02823j19457K49557m596
13549D73892j46658j21105L37403B63364K30766o0733k1645Q7983r3354J1788
13539D18169l4647R5282c4149A28709L43105n690j48821J43518j04078B5233J01872
13528A27105J97874J27678j97777O4779m6472L09259k28102j31529J89033l4852
13518C76996q2583J23010j99498q2003O238M04844l0795A33311M44611j32928
13508D44994m1521j13339J90289B09360c6989C53851o3012k3883K899A14500J50205
13497B64705l9573K98127j26637A04295a19271B18088J77059A37291L49305E1158
13486E10506A88465M34501A33417L72011q3987F3079a74936A43026c3392B81199
$$ plain form
13559 280321 338493 635841 709138 317943 486036 145565 348388 228931 478488 473892
13549 473892 327234 206129 543532 263364 494130 433397 411752 499735 406381 418169
13539 418169 383522 478804 -34149 128709 471814 466124 317303 460821 356743 25233 127105
13528 127105 324979 452657 254880 319659 273187 582446 354344 222815 411848 376996
13518 376996 294413 417423 217925 135922 142160 547004 516209 133311 577922 444994
13508 444994 403473 290134 480423 209360 -36989 353851 290839 266956 269855 114500 264705
13497 264705 225132 523259 396622 104295 -119271 218088 395147 137291 486596 51158
13486 510506 188465 622966 133417 505428 421441 63079 -174936 143026 -33392 281199
13475B29242K2973l5197K97947D4043N16702G1151K37852m0146D7855K05591o8051
13464A85395m6217C8993J96408l7750l8184J30224J8544k7890P6539j57981D5595
13452C84343p3100A43478P0938J81947G4411J45976L9188J37698j71165K34906
13442D61014k03854l5992K75386j96412m5170r4467N1270J9651f013D15986D7574
13430A93204J09604p0775K52845L4157k47582k3937k7064K13053N3359A13219
13419D10555l0444A77578K62656P734k09508H7261N5041J33860G666a61677P015
13408a54662A94134a15427D19681Q9564A07880K01911b02356C68564a7649G1625
13397D31806q8535Q5035j43957q9945q9115K23732a398A85151j5067o5437J26023
$$ plain form
13475 229242 252215 217018 514965 44043 560745 71151 309003 268857 47855 253446 185395
13464 185395 139178 38993 235401 197651 159467 289691 308235 280345 356884 198903 45595
13452 384343 311243 143478 214416 396363 74411 220387 259575 397273 226108 461014
13442 461014 257160 221168 496554 300142 254972 160505 211775 231426 -6013 415986 47574
13430 193204 302808 232033 484878 519035 271453 247516 220452 433505 486864 113219
13419 410555 380111 177578 440234 447968 238460 87261 142302 276162 7666 -161677 -154662
13408 -154662 194134 -115427 419681 509245 107880 309791 -202356 368564 -17649 71625
13397 431806 343271 428306 284349 194404 105289 329021 -1398 185151 170084 104647 230670
13386B30670q4612J4855G3642B9606L96953p2569J51846B21987K10091I2421j4714
13375G7707N7717Q5456I3866K1327L36374d396D05317D4038L4990L19428a15189
13363c6732C69887G4140O5157K04281m373j25091J47236I9821K17834n4248a59532
13351B71289D7486M88277A26265J83205K34118A15109L99101j07417J69873j01311
13341D75355B20379K15069j97110r8787J3368J3918M6926K02377J16615n6285
13331D76470A56635J98883o0162A45450K78984r6117J74280k35951L47303k56589
13321C57360E9607K10605o4568c57035b3543B15426J83997k5630A69785J75286
13311C45071J34588A62619e8512E4385K41432b3295D63904F2786J49120J34031
$$ plain form
13386 230670 146058 160913 73642 29606 426559 353990 505836 221987 432078 92421 77707
13375 77707 135424 220880 93866 115193 451567 -4396 405317 44038 79028 398456 -115189
13363 -36732 369887 74140 139297 343578 339205 214114 361350 99821 317655 263407 -159532
13351 271289 47486 535763 126265 309470 543588 115109 514210 406793 576666 475355
13341 475355 220379 435448 238338 139551 152919 166837 213763 416140 532755 476470
13331 476470 156635 355518 295356 145450 424434 328317 502597 266646 613949 357360
13321 357360 59607 270212 205644 -357035 -23543 215426 399423 373793 169785 345071
13311 345071 479659 162619 -58512 54385 295817 -23295 463904 62786 211906 345937
13301C45937o4473J45678A40943J05850Q1845j08122a46225C15736b52859I3672
13290A39144d0006B148M79099D2181B0474h4754A11811j4510L56451I5721P7592
13279A73313J4615P3619L1753L57230B25786J24278A67242G2989L54351J4465
13269D41805B0070K65323E0191A9272J90932o5100L58697b09435A99963J33906
13259C33869A47250d6077A61179J91185j36415J07787f2574B82514j19924L0169
13249A92759e0824B3173K3454h9127H4382l3821K8374M3396r967m8590J9253Q4996
13237A68023N2067M1160A23998D1449J06320L5893F3423O05390A59603L752Q446
13226A71801J18038g3068D7685R7010g5B25128C9920K15847C9497b12612A21357
$$ plain form
13301 345937 281464 427142 140943 246793 328638 220516 -146225 315736 -252859 93672
13290 139144 -40006 2148 481247 42181 20474 -84754 111811 97301 453752 95721 173313
13279 173313 187928 261547 293300 650530 225786 350064 167242 72989 427340 441805
13269 441805 20070 285393 50191 19272 210204 145104 503801 -209435 199963 333869
13259 333869 147250 -46077 161179 352364 215949 323736 -62574 282514 162590 192759
13249 192759 -50824 23173 46627 -89127 84382 50561 78935 122331 112364 63774 83027 168023
13237 168023 220090 261250 123998 41449 147769 183662 63423 668813 159603 163355 171801
13226 171801 289839 -73068 47685 144695 -75 225128 39920 255767 39497 -212612 121357
13214F0634a01579A86506A9455K47330c4108n5829b5564J2309C79501E3897J7924
13203G1821M6605c0810B96936G2305i1259C84041m9595A61983J24149b10297B01984
13191A12330E0747k4157a0833D22495e7459k2973C4166J5132L29534j27002m9825
13180B02005J15163A58421a56910B65356A8949N64998k53499j64033b6101n9262
13170h5363A32870n770J9010c329A1368f7545m0923A63412k8537b15644c8029
13158I9073J7890a0795j73853A69027D9907j3010K83324j29903f8293A02636l711
13147I8925f1344C13816E6705d1454E06289A80177Q576A1289K8370K68642H5092
13135C0569A0203N4034J29022J15863l1131B2026b805B48834a88065G5281O6169
$$ plain form
13214 60634 -101579 186506 19455 266785 -34108 -89937 -25564 -13255 379501 53897 71821
13203 71821 118426 -30810 296936 72305 -91259 384041 334446 161983 286132 -210297 201984
13191 112330 50747 26590 -10833 422495 -57459 -80432 34166 49298 378832 251830 202005
13180 202005 317168 158421 -156910 265356 18949 583947 330448 166415 -26101 -85363
13170 -85363 132870 127100 146110 -3329 11368 -67545 -108468 163412 134875 -215644 -38029
13158 99073 116963 -10795 -184648 169027 49907 36897 320221 190318 -68293 102636 98925
13147 98925 -61344 313816 56705 -41454 506289 180177 188753 11289 39659 308301 85092
13135 30569 10203 64237 193259 309122 277991 22026 -2805 248834 -188065 75281 141450
13124A41450H841a50047B80012b66981A12724K8388R464A3800J68319k1196N7774
13113B18697H7269J75571A02073J82639A05805c00876B00605P3642j07663c32434
13102E3418K66432c16591d4951n7747A38849c3699A26207h3839A76541K29734
13092D06275j39217r0620A171K44137d1675D16432A02733R272J44696f2071E75081
13080A81569e1027B97686a9338k6832B01524P9012o4628a35771C25499C5185A0153
13068A08700P7165M6671A12064P6680J56874c037D0102J73903H6526K75711H9276
13056A90367b4045A551K474K65085f7923B92200a9286A34002O5564n6422a2755
13044g3495j8886B61148k4219F72c8860G3801J86891o7454H5311J0492B6713L53499
$$ plain form
13124 141450 8841 -150047 280012 -266981 112724 141112 150576 13800 182119 160923 218697
13113 218697 87269 262840 102073 284712 105805 -300876 200605 274247 166584 -332434
13102 53418 319850 -316591 -44951 -102698 138849 -33699 126207 -83839 176541 406275
13092 406275 267058 176438 1171 245308 -41675 416432 102733 112005 256701 -62071 575081
13080 181569 -51027 297686 -19338 -46170 201524 280536 215908 -135771 325499 35185 10153
13068 108700 185865 232536 112064 188744 345618 -3037 40102 214005 86526 362237 89276
13056 190367 -24045 1551 4025 269110 -67923 292200 -19286 134002 199566 143144 -12755
13044 -73495 -92381 261148 236929 672 -38860 73801 260692 193238 85311 95803 26713 380212
13032C80212j50914b09879E58944j06722g5792B39946a21685R023D451J93417
13022A97868J3232F6631J41674E6430K38456j06301o9334a02293B1127d4398A39589
13010B67911n8642p528m5505K86791j34674B3146K48420e2352A06459B5972a28399
12998a60194H3643K50669C1230i2253A09864A9818h1153l8190k57216H2388J68656
12987B51044N925b12589B07471B3588J12857J81998j43420F9589K37933E7741
12976c9101j00125B71617a20517C19211r9038K06464a38277B48616H2136D0226
12965b9803j36836B27653h024A60827F4539L01052A79874a86285Q3883J3715b3548
12953a7251A19297g9888h100A81357n1241f8937n3263D0328a17490a0545j62248
$$ plain form
13032 380212 229298 -209879 558944 452222 -75792 239946 -121685 -112662 4451 197868
13022 197868 211100 66631 208305 56430 294886 188585 119251 -102293 21127 -44398 139589
13010 267911 209269 201741 156236 443027 308353 23146 271566 -52352 106459 25972 -128399
12998 -160194 83643 334312 31230 -92253 109864 19818 -81153 -119343 -376559 82388 251044
12987 251044 256969 -212589 207471 23588 136445 318443 175023 69589 307522 57741
12976 -39101 -139226 271617 -120517 319211 220173 426637 -138277 248616 82136 40226
12965 -29803 -166639 227653 -8024 160827 64539 365591 179874 -186285 -102402 -88687 -23548
12953 -17251 119297 -79888 -8100 181357 130116 -68937 -122200 40328 -117490 -10545 -172793
12942a72793O2424B62981a5884N296J686H9392B738J13092b322A15596d1763a6829
12929G993K36425e8031C8459K20910c14994A00882B097a6000j01573d8379j67107
12918b15486B01923c7928F2583b1927B78027Q0353i2023B63025D382J11078k6998
12907H8462J0543j7071B203K03599b746A03343J32903q7654E1242a30861i960
12895B6156K06011p7094B6783M6409e6969D8927J01411J36947F4762M3113l0308
12884G7567K07419H4117J63733l1312a45186G6395J45111K11271A28616J41341
12874B69957c20789A01002h6896L8118A68920K35892b9516F2355b4062g67B25121
12862I374f8185B33475i6355A67893a10620N275J0962A58026g5380r33B12530
$$ plain form
12942 -172793 -110369 262981 -15884 -10588 -8902 89392 2738 115830 -2322 115596 -41763 -16829
12929 7993 244418 -58031 38459 259369 -314994 100882 2097 -16000 -117573 -48379 -215486
12918 -215486 201923 -37928 62583 -21927 278027 358380 -92023 263025 4382 115460 88462
12907 88462 99005 81934 2203 205802 -2746 103343 236246 148592 51242 -130861 -9960
12895 26156 232167 155073 26783 73192 -56969 48927 150338 287285 64762 107875 77567
12884 77567 284986 84117 247850 216538 -145186 76395 221506 432777 128616 269957
12874 269957 -320789 101002 -86896 -48778 168920 404812 -29516 62355 -24062 -767 225121
12862 9374 -68185 233475 -96355 167893 -110620 -105345 -94383 158026 -75380 -76313 212530
12850c09592A59526a13331F2011a39145d3363A9406a33164c2763k38546A12240
12839D1255J7168J21531l5467a78l6708r2799p5283c5193A12842o868a4466k00740
12827b15206C60755g9630A55292h7058B68921E3735b26373C65351p3190r352a94824
12815I56a23304I8864a4284k3123I5851J48603j21716O3685q0530B6098c46746
12803A73663A4576J26178g5546B54097j07775k248M6650E8223K12425b50181f5036
12791A5649i6404B08200d6621A30866o937J8796b54803c805A19668J09614I5722
12779a82227r7464I9043B1947J6426b42745E5637c5047j91102O5654E83627B32501
12767A88434d9520H4499a06284n0046B5120P9722g20k59732a10979a5303A88247
$$ plain form
12850 -309592 159526 -113331 62011 -139145 -43363 19406 -133164 -32763 -271309 112240
12839 41255 58423 179954 144487 -178 -36886 -129685 -204968 -35193 112842 105974 -14466 -215206
12827 -215206 360755 -79630 155292 -87058 268921 53735 -226373 365351 292161 282809 -194824
12815 956 -123304 98864 -14284 -37407 95851 244454 122738 186423 105893 26098 -346746
12803 173663 14576 140754 -75546 254097 146322 144074 190724 58223 270648 -250181 -65036
12791 15649 -96404 208200 -46621 130866 123929 142725 -254803 -3805 119668 229282 95722
12779 -182227 -279691 99043 21947 38373 -242745 55637 -35047 -226149 -160495 583627 232501
12767 188434 -49520 84499 -106284 -156330 25120 104842 -720 -260452 -110979 -15303 188247
12755b40718B49741n3049i8825H1443J66762n7904c3084A94418n2062J34920n9120
12744B18156J25539a20189a3431A9710a3928A65394G3310a67768D30219b24058
12733C43050A02622J54400H5163a51692L7738B58074G2511O9896g5073m3303j60050
12722b78426A59646N9610o9743a67932e8151A64608D2400K9822a15819A06338
12711A28759c07710A4357K7274J32600J601N7819J44368F5346J53204k6352a76014
12699h4939G4472k17M04186h3708A00701L89867a92368D2807K15395D2120j9020
12688B3100K60901e8028A23210a49786e0386A67168q2253K29647b03449F78205
12677B7339J09404a0352j6002o6104D1184c9662l6957K6320B78081a23252N4505
$$ plain form
12755 -240718 249741 196692 -98825 81443 248205 190301 -33084 194418 142356 277276 218156
12744 218156 343695 -120189 -13431 19710 -13928 165394 73310 -167768 430219 -224058
12733 343050 102622 257022 85163 -151692 -113954 258074 72511 142407 -75073 -118376 -278426
12722 -278426 159646 219256 149513 -167932 -58151 164608 42400 72222 -115819 106338
12711 128759 -307710 14357 41631 174231 175832 233651 378019 65346 218550 192198 -176014
12699 -84939 74472 74255 478441 -83708 100701 490568 -192368 42807 258202 42120 23100
12688 23100 284001 -58028 123210 -149786 -50386 167168 84915 314562 -203449 678205
12677 27339 136743 -10352 -26354 -92458 41184 -39662 -76619 -50299 278081 -123252 -68747
12666f8747D436K25261a13975G8224a69654A04786a86285D8682d5145B31230a31290
12654D16306a709C94874A00853J23750p5159q215J42723l9025p8968C8997J279
12643D0276J01035J41322A05371c4038H1690k9410c0307A69260K25346d1160P278
12632c3882I2517L00070A05329l1147J70028B3604K67349L8097a72096C22313
12621B19492j04409K87503A81130a66961P7146B0274e7755E7597c0520p9085G066
12609B71587f8619D00918I2467J15168R0214a54336A71027G8175P482B7413J58209
12598A85622L76131d1246B97508D193K89033e5998r9306A16494n1233b09219j9427
12587b28646F4363k1436K5821a60293j09835H5367l2552Q146q007b77768j85818
$$ plain form
12666 -68747 4436 229697 -113975 78224 -169654 104786 -186285 48682 -45145 231230 -131290
12654 416306 -1709 394874 100853 224603 149444 141229 283952 244927 165959 38997 40276
12643 40276 141311 282633 105371 -34038 81690 52280 -30307 169260 394606 -41160 -33882
12632 -33882 92517 392587 105329 74182 244210 23604 290953 329050 -172096 322313
12621 219492 115083 402586 181130 -166961 -89815 20274 -57755 57597 -30520 -109605 7066
12609 271587 -68619 400918 92467 207635 297849 -154336 171027 78175 85657 27413 185622
12598 185622 561753 -41246 297508 4193 293226 -55998 -155304 116494 65261 -209219 -228646
12587 -228646 64363 42927 68748 -160293 -270128 85367 52815 60961 52954 -277768 -463586
12576d63586C26007A47837a94472f6414H2905L5547h6847j62884d4482D6217f8072
12564A01489H220J60158P3322b55298g6107A23944R6515b58997A16574M85677
12554F02251k86471a08901L7611A24907j7142O5193F0132a97616C7090c14289
12543B44966l2445a09558Q042m4661C89095l7080f0324j36536B64470h9300I3981
12531E4422a51749A36217Q508n3632J5906e9610j73449g8685J7563A7368g669
12519A05898g5516a5698A14793D8341a17168j11263f3589A17092e1588A31832
12508A17563A5873R2511b59617g9639j39685m2741A11705C4349a192C57069c52505
12496a56001B19369J92086a45153a2111A2941a43928E5584J99433b0993A26306
$$ plain form
12576 -463586 326007 147837 -194472 -66414 82905 118452 -86847 -249731 -44482 46217 -68072
12564 101489 8220 168378 241700 -255298 -76107 123944 220459 -258997 116574 602251
12554 602251 315780 -108901 -71290 124907 107765 172958 60132 -197616 37090 -314289
12543 244966 212521 -109558 -101516 -146177 389095 352015 -60324 -196860 264470 -89300 93981
12531 54422 -151749 136217 144725 91093 106999 -59610 -233059 -78685 -61122 17368 -7669
12519 105898 -75516 -15698 114793 48341 -117168 -228431 -63589 117092 -51588 131832
12508 117563 15873 108384 -259617 -79639 -219324 -262065 111705 34349 -1192 357069 -352505
12496 -156001 219369 411455 -145153 -12111 12941 -143928 55584 255017 -20993 126306
12485f4473C97440c5701k08082A27390l379J72230p8910a06644l14048a67010
12474A2144a93820C51716r5868a86329H3896L0477i3348J9452N366A18575J29522
12463B48097I8401b77156A914a45125F2323L52852c32039A91461B4346c85233
12452B65065j01100J9576a77357c2400n4454b1569k85919N1037K7352k8155d9586
12440g6989B9409P2284d26819B52172A25755g6152B02053f1803j80179J20027
12430a21955A20707b19447A10318a35957A72689L04a55303K6460A88370c6414
12419a43263l1191E0683L663b3273i750k01747I6976h6976G3911J21253f2240
12407b06047B19638O9067A7645J375a22258O384B90364N4445D742R4359l8367
$$ plain form
12485 -64473 397440 -35701 -243783 127390 124011 296241 217331 -106644 -420692 -167010
12474 12144 -193820 351716 255848 -186329 83896 114373 -93348 -73896 -68530 118575 248097
12463 248097 98401 -277156 1914 -145125 62323 415175 -332039 191461 24346 -385233
12452 265065 163965 183541 -177357 -32400 -86854 -21569 -307488 -256451 -229099 -257254 -49586
12440 -76989 29409 101693 -426819 252172 125755 -76152 202053 -61803 -241982 -121955
12430 -121955 120707 -219447 110318 -135957 172689 172993 -155303 -128843 188370 -36414
12419 -143263 -174454 50683 54346 -23273 -9750 -211497 96976 -86976 73911 195164 -62240
12407 -206047 219638 288705 17645 19020 -122258 -115874 290364 344809 4742 99101 60734
12396F0734J20280B8929P4059h7264G9397c04360A05695m6286l976i3648B33922
12384H4858g5294D41845j94724A6625a85750B0709a28521j36152h3049j02999
12374a86048A97587a68682e2829F7486a0624r205j35432a9370k10172F1624d4891
12362A02926J00075p6509b82345A1518P8781h3877D1688L59444A97848H8037g5478
12350A27756b67207c9533I360J938g276E71445b8276A76659N038R8266B3844b21246
12337e4053l9303H8148j9758h0110j94045D03703i4423C120N8107b21887E55666
12325b72131P2266d9844H964J42330c7679l04800i2540j7950M2993F6892K25028
12314B91920q8628a35324h82H4888J39057a88397L1200A01728a91060i2003A11488
$$ plain form
12396 60734 181014 28929 102988 -87264 79397 -304360 105695 59409 55433 -93648 233922
12384 84858 -75294 441845 247121 16625 -185750 20709 -128521 -264673 -83049 -186048
12374 -186048 197587 -168682 -52829 67486 -10624 -19829 -155261 -19370 -229542 61624 -44891
12362 102926 203001 126492 -282345 11518 90299 -83877 41688 401132 197848 88037 -75478
12350 127756 -267207 -39533 9360 11298 -7276 571445 -28276 176659 181697 279963 23844 -221246
12337 -54053 -93356 88148 68390 -80110 -274155 403703 -94423 3120 61227 -221887 555666
12325 -272131 -199865 -49844 8964 151294 -37679 -342479 -92540 -110490 -67497 66892 291920
12314 291920 203292 -135324 -882 84888 223945 -188397 -157197 101728 -191060 -92003 111488
12302g3099O390k6307E2745P5488a25565D3731d5527j1087F8236M0890g9843B07082
12289f7523B5233f1861j34977c9120C14601H1142O5820K29678k3509G5420c3600
12277a80521h0194L59B34352m7785H1515O8198b90963H9373K29750a9302k371
12266b1673C14919e1880A20906K2062f3799I4033J14466g8777A27358j2645i009
12254a73240A87259d39766C93524G3737A9220J28568d2014B47907n5455r4087
12244I8365i3541C04535a40911l7990A31524l5267e3561C14130A4530J95232e9225
12232A62039l3983a00239g858D18843A33500k1991A7985a0735C12248i4995a9785
12220A54627K51381H2649J57375A16992k8114P9049E4103K1629B7558R3575O2364
$$ plain form
12302 -73099 -66709 -93016 52745 128233 -125565 43731 -45527 -56614 68236 109126 -79843 207082
12289 -67523 25233 -61861 -196838 -39120 314601 81142 146962 376640 353131 75420 -33600
12277 -180521 -80194 -79835 234352 186567 81515 149713 -290963 89373 319123 -19302 -21673
12266 -21673 314919 -51880 120906 142968 -63799 94033 208499 -78777 127358 114713 -9009
12254 -173240 187259 -439766 393524 73737 19220 147788 -42014 247907 192452 98365
12244 98365 -93541 304535 -140911 -178901 131524 96257 -53561 314130 14530 209762 -59225
12232 162039 128056 -100239 -7858 418843 133500 111509 17985 -10735 312248 -94995 -19785
12220 154627 406008 82649 240024 116992 88878 167927 54103 75732 27558 121133 183497
12209A83497P4289J75082O456j46351J76277j49528o1871A04917a38965b1024
12198D25579A72091l5846E7619K13060a92193B05066n203O001a75097b3732j15399
12187a39131A05040K67449G6754P0703R3989F8396J17311D6703D821J59497D9933
12175C0239M43422E3271g7805A42343b19946C92547b00362D78377E8066L64893
12165D22959j10556j44917H0696h9798j11697A8979K20087A3353a80801o606D246
12153A03702k5093O6642m9495R0125n8848k0849F751K64845b96097E4073K01684
12142B55757a99167j21716B33944j00674b25757A34389q137m8947B6894B611K4004
12131B6615b3069p1983A5904K14733a75111D0238J82021o6917D3831j6095J36478
$$ plain form
12209 183497 257786 432868 439324 292973 469250 319722 257851 104917 -138965 -21024
12198 425579 172091 136245 57619 270679 -192193 205066 199863 205864 -175097 -23732 -139131
12187 -139131 105040 372489 76754 147457 241446 68396 185707 46703 4821 164318 49933
12175 30239 473661 53271 -77805 142343 -219946 392547 -200362 478377 58066 422959
12165 422959 312403 167486 80696 -89798 -201495 18979 239066 13353 -180801 -187407 4246
12153 103702 78609 145251 95756 185881 127033 106184 6751 271596 -296097 54073 255757
12142 255757 -199167 -320883 233944 133270 -225757 134389 126252 77305 26894 2611 26615
12131 26615 -23069 -95052 15904 230637 -175111 40238 222259 155342 43831 27736 164214
12120A64214E8331e4482C47941b6061B7705P4045M3853J40158j31767q416k1659
12109A23919J10082H0087P9358a67240e7479j32531B10669O7330A21930l9809
12099H2121N5298a15114L7638F7653g5839C187K7938J35616c86333J25308B04418
12087A16626k762a36042E96600A74937a31988j14582A86411K0043p9504c2676
12076H9170J56021R7661J324733j16384p45324G7991J53194N2756c9971A70919
12065b56239G5391a8999A08134m2049a8617B46068b71678e1406D0784a73602c3944
12053a05270j52307h2345B54772a42779M6897I2479K7390J25430J6720o094a0322
12041a28576h379j41930j01036L4627N1995K2395c6414E08203a75562M3544A5221
$$ plain form
12120 164214 58331 -54482 347941 -26061 27705 101750 145603 285761 153994 145578 123919
12109 123919 234001 80087 159445 -167240 -57479 -190010 210669 277999 121930 82121
12099 82121 137419 -115114 -77476 67653 -75839 3187 31125 166741 -386333 -261025 204418
12087 116626 113864 -136042 596600 174937 -131988 -246570 186411 206454 126950 -32676
12076 89170 245191 342852 1667585 1551201 805877 77991 231185 283941 -39971 170919
12065 -256239 75391 -18999 108134 66085 -18617 246068 -271678 -51406 40784 -173602 -33944
12053 -105270 -257577 -82345 254772 -142779 -95882 92479 119869 245299 262019 255925 -10322
12041 -128576 -8379 -150309 -251345 -216718 -164723 -142328 -36414 508203 -175562 -132018 15221
12029a25182E5107a16864j6793H6577J40580f6890k1542C86190A04170h9227k33325
12018c22552B52841j5325I9027a84923M3529q0259e4188F9348d5273k20640b2732
12006A48938M9635J29125d17489G054a6825j79878P5316B9632a0441l15544c403
11994b5649k76195F7486c1521A75568a21880A36384n0538J39296j05595c2264
11983a7025p0502D20451A09756J92730d0226m6284d360m56313A94593c3812h350
11971i5951M2254B96035E5378D619a18354A56375f4477n136J1392j7839j73087
11960b49147K4364f8651G4768d7747C1388m698K11254K00039G7531N171d4730
11948A39860m3115e3723A21587C9887A1784P4978i8845A5604P0500a78969L5238
$$ plain form
12029 -125182 55107 -116864 -133657 86577 227157 -66890 -88432 386190 104170 -89227 -322552
12018 -322552 252841 237516 99027 -184923 -141394 -221653 -54188 69348 -45273 -265913 -22732
12006 148938 198573 327698 -417489 7054 -16825 -196703 -121387 29632 -10441 -325985 -3403
11994 -25649 -301844 67486 -31521 175568 -121880 136384 85846 225142 119547 -32264
11983 -17025 -87527 420451 109756 302486 -40226 -86510 -4360 -460673 194593 -33812 -8350
11971 -95951 -53697 296035 55378 4619 -118354 156375 -64477 -69613 -58221 -76060 -249147
11960 -249147 -224783 -68651 74768 -47747 31388 26690 237944 437983 77531 82702 -44730
11948 139860 96745 -53723 121587 39887 11784 86762 -98845 15604 86104 -178969 -143731
11937a43731H1049c09096J00004J7073j5964A26024a20169B73733r3974D6078
11926b57349H2481d3061n0032k61192J49476H4286a22031A40972b6787F1410A6174
11914b74748P696B4258J35302c33881M4607C24026i2485J2058B5224e7929k32392
11903b90321a24705G8232M0301a74284J7587p3299j9404E4363K48131a35549B912
11891g5632C6233e6592D07572j60027a0065A58265O1476c1992B71265a18128B41611
11879a92455B48455a16290M6127F3785a02664k26913B60999e58378d3753A46895
11868F9444a43732A06587h2485E7282a6227A46406d8594F4259C1032c65104C28618
11856b61360a02037C5143o254K1803d8339A24808A5914K27444b28A13521O0754
$$ plain form
11937 -143731 81049 -309096 -209092 -192019 -207983 126024 -120169 273733 179759 46078
11926 -257349 82481 -43061 -93093 -354285 -204809 84286 -122031 140972 -26787 61410 16174
11914 -274748 -267052 24258 159560 -333881 -289274 324026 -92485 -80427 25224 -57929 -290321
11903 -290321 -124705 78232 118533 -174284 -156697 -229996 -249400 54363 302494 -135549 2912
11891 -75632 36233 -56592 407572 247545 -10065 158265 219741 -31992 271265 -118128 241611
11879 -192455 248455 -116290 -70163 63785 -102664 -329577 260999 -558378 -43753 146895
11868 69444 -143732 106587 -82485 57282 -16227 146406 -48594 64259 31032 -365104 328618
11856 -261360 -102037 35143 28889 50692 -48339 124808 15914 243358 -228 113521 174275
11845A74275h6888H5360R4609i5687A20257L5541F0848J15384o1909j2758N2135
11834A53700a6096H2064h6895d0340b731n7003C728i4165k62428e5597q2099f7899
11821a07294K205j97430r1695J55734P374L334C18450j130b92976B15099a56922
11809B4176Q7620J6727a68690A04986a92891j13556d3835j56287B32190B2835
11798a43279b8379j6648j04901c4465l3365A67194M817J59513C223K44544f6168
11786e3180b319B71706E3022e2814r9090a1316B49047m515i6972I9058e2903j58278
11774b11181O1437j49538a8192F1845c2847k118j1648a0077D0043N5294J12150
11763B07487b09326A39793c5300I1426P728j5381i1429j39623D2998Q9195A8009
$$ plain form
11845 174275 -86888 85360 179969 -95687 120257 155798 60848 176232 114323 101565 153700
11834 153700 -16096 82064 -86895 -40340 -2731 -59734 3728 -94165 -356593 -55597 -137696 -67899
11821 -107294 -105089 -302519 -394214 -238480 -231106 -227772 318450 317320 -292976 215099 -156922
11809 24176 111796 128523 -168690 104986 -192891 -306447 -43835 -200122 232190 22835
11798 -143279 -28379 -45027 -149928 -34465 -67830 167194 172011 331524 3223 247767 -66168
11786 -53180 -2319 271706 53022 -52814 -151904 -11316 249047 244532 -96972 99058 -52903 -211181
11774 -211181 -149744 -299282 -18192 61845 -32847 -34965 -46613 -10077 40043 95337 207487
11763 207487 -209326 139793 -35300 91426 99154 83773 -91429 -231052 42998 132193 18009
11751C20386b55873N0601R566Q7181J9974C0985a15482C37117a8021E9569K50186
11740C09755e3102B53806p1093b35469A257a98820c2667r75A41045a10415H9147
11728I0668f27977B55379g6867C03267b55206A73217b24480C47321b70791a27192
11717i3595I7545c8382G2300k5058J12156b74815A18365a55654E5295h0818A89775
11705A24250g1210E1052a01517C6435K0506P2884E228P37b17572B24394L5347
11694B59741i7747I9893J68812g9925f580A73352K24983j21816M6498h4336E8544
11682A66413b160C75819g2704C84394i6716C25241i4921A87504Q6403e4286l341
11671e7627A19656a17839e5632D7838b62941J14653a3621f130k4234C1460P1186
$$ plain form
11751 320386 -255873 -205272 -195706 -108525 -88551 30985 -115482 337117 -18021 59569 309755
11740 309755 -53102 253806 182713 -235469 1257 -198820 -32667 -33642 141045 -110415 89147
11728 90668 -627977 255379 -76867 303267 -255206 173217 -224480 347321 -270791 -127192
11717 -93595 97545 -38382 72300 47242 159398 -274815 118365 -155654 55295 -80818 189775
11705 124250 -71210 51052 -101517 36435 56941 129825 5228 5965 -217572 224394 259741
11694 259741 -97747 99893 268705 -79925 -6580 173352 398335 276519 323017 -84336 58544
11682 166413 -2160 375819 -72704 384394 -96716 325241 -94921 187504 273907 -54286 -57627
11671 -57627 119656 -117839 -55632 47838 -262941 -148288 -13621 -6130 -30364 31460 102646
11660A02646h281k5425A87392M5198I9591J19964d9329m6534A02524a11372j04487
11649b15859A1199J21144b40562h4603G2167b12837F5251b86451j47650A63637
11638b7810A27075b40563O913a06072F5290J26344K19286j32519b4910l85235
11628d10145e6339j38128d0234F7988K2454c8528B98615H6165a84210A36718L18302
11617D55020d1574H3037i502m8139A8642h587o8336B80221a18176A52535a33394
11605A88890d7567n7908K2959c1729A05168c02575H2957J89268a33570A28228
11594D52199e6926A4785a85773A37M1159e9486k6982F5565c7338C971J89254Q5879
11582B79104O7654A46805N7162q5595J3301m8499a31148B87928G3557a620E0592
$$ plain form
11660 102646 -8281 -33706 187392 232590 99591 219555 -49329 -95863 102524 -111372 -215859
11649 -215859 11199 132343 -240562 -84603 72167 -212837 65251 -286451 -434101 163637
11638 -27810 127075 -240563 -233650 -106072 65290 191634 410920 278401 -24910 -410145
11628 -410145 -56339 -194467 -40234 67988 90442 -38528 298615 86165 -184210 136718 455020
11617 455020 -41574 83037 -9502 -57641 18642 -8587 -76923 280221 -118176 152535 -133394
11605 188890 -47567 -105475 -82516 -31729 105168 -302575 82957 272225 -133570 128228
11594 452199 -56926 14785 -185773 137 41296 -59486 -86468 65565 -37338 3971 193225 279104
11582 279104 346758 146805 203967 118372 131673 83174 -131148 287928 73557 -1620 50592
11570D0911O560L78108a00394A22208f754j06783A21626K27984G9023J5412M2641
11559A37076K69673D8062K11540a3399F7679a85218F4388c2964E07763a32288
11548B18112n292K0144D0242a3978n8381C22877j4615E6253H032a34314f918j0712
11536a7630B5531J39089B5290J47376F7583e487m1786D6211b9882D13453l9455
11525C73998A86905H0181a14893B76417C6266f4792k35507F642a7284I1831a237
11513A55030D6118K54050H6431D1735e6031k07608B25648J83651g119A49369c46253
11501C15830E7600i6285A46947M6196q476E5250A8571M8282M9042A8398J43264
11490A61662L04501b36143B24238Q3322p681C5356K06405p7581h4261j1986A47562
$$ plain form
11570 40911 47471 425579 -100394 122208 -6754 -113537 121626 349610 79023 94435 137076
11559 137076 406749 48062 259602 -13399 67679 -185218 64388 -32964 507763 -132288
11548 218112 212820 232964 40242 -13978 -72359 322877 308262 56253 8032 -134314 -6918 -17630
11536 -17630 25531 164620 25290 172666 67583 -5487 -47273 46211 -29882 413453 373998
11525 373998 186905 80181 -114893 276417 36266 -64792 -300299 6642 -17284 91831 -1237
11513 155030 46118 300168 86431 41735 -56031 -263639 225648 409299 -7119 149369 -346253
11501 315830 57600 -96285 146947 193143 184667 55250 18571 66853 115895 18398 161662
11490 161662 466163 -236143 224238 307560 299879 35356 241761 164180 -84261 -96247 147562
11478A67084B8032J36190N7420r6728m104a07750E4977J88025r5632b0985j16587
11467a37572D4834N3372J18623a61251d4759A37787F3955N7425K0273K42840F6210
11455H3108a55894C65439p6064h4894B10307O809J09127g7861o5671A51867L6117
11444A87984K372r3541L45755b52306D46551G4753P4225J4009J43873E2693N4745
11433A07438k9959b6216j9563E9312a34858B5402a72663b1073j63014A62288N0909
11422B13197g9153E868J51051f8200B0040e1122C58768q1123c19509B59398a67599
11410C11014b49915a11591A77146q5544M42284h4759e559k0618B17554M0533C4138
11398G5980J96247O7930A11490a42745A09967i5086j45437D5664f5857a4655D49
$$ plain form
11478 167084 28032 164222 221642 124914 120810 -107750 54977 243002 147370 -20985 -137572
11467 -137572 44834 98206 216829 -161251 -44759 137787 63955 121380 141653 384493 66210
11455 83108 -155894 365439 289375 -84894 210307 217116 326243 -77861 -143532 151867 187984
11444 187984 190356 96815 442570 -252306 446551 74753 148978 162987 306860 52693 107438
11433 107438 77479 -26216 -45779 59312 -134858 25402 -172663 -21073 -184087 162288 213197
11422 213197 -79153 5868 156919 -68200 20040 -51122 358768 277645 -319509 259398 -167599
11410 311014 -249915 -111591 177146 91602 533886 -84759 -5559 -26177 217554 258087 34138
11398 75980 272227 340157 111490 -142745 109967 -95086 -240523 45664 -65857 -14655 449
11386a00602R098j45539A33253a53516B6529J60128b4346r1352m3662f5403a4203
11374E9396f5953D12794a00470A0004d9319k8105j39179K476m9061a14433A64358
11362a8823n6111k27591O7525Q0469K4205M6335A34342b16893f747B33712a04922
11350B22318P1864A42156k7542d5966F3243P8464l9885q854D4078g28B40557B4708
11337a37315K6174j1043j40229j1680E6454c41782J28116i4036l8500O1884L3999
11326c6653k3857A423J64682Q860a2114j67922D8751b9456D3222a47493H8733
11314E9227a83553I4372k4525a49835G1532J4534i1380D6660c7722a2541k8607
11303d1148p7208A98977c68619A52226D1382M2256a63831g0951B37192a58314
$$ plain form
11386 -100602 -91504 -237043 133253 -153516 26529 186657 -24346 -115698 -159360 -65403 -14203
11374 59396 -65953 412794 -100470 10004 -49319 -77424 -216603 -214127 -263188 -114433 164358
11362 -18823 -74934 -302525 -235000 -154531 -130326 -83991 134342 -216893 -6747 233712 -104922
11350 222318 294182 142156 114614 -45966 63243 141707 101822 92968 44078 -728 240557 24708
11337 -137315 -111141 -122184 -262413 -274093 56454 -341782 -213666 -94036 -132536 -70652 -36653
11326 -36653 -60510 1423 166105 174965 -12114 -180036 48751 -29456 43222 -147493 88733
11314 59227 -183553 94372 69847 -149835 71532 86066 -91380 46660 -37722 -12541 -41148
11303 -41148 -118356 198977 -368619 152226 41382 83638 -163831 -70951 237192 -158314
11292b39177O5424j18673A70088c8198j60131A04406A6411b26527h9369n4788
11282a44157H0136a40590j1217j96734C93086c5258A61580f7771E4170a93391
11271c24187B95168i4051A03365a40863m03713a9304l31153a24190p3598i5648
11260C1119J68409o2600n2372a04165C1157K15514f8165r3327A12850b66583A29294
11248a00554G2422N9997J91469i2581D0699a17722F4129b5634j9245j80782C6891
11236F059a68408Q094K2281f2548A13482c13345A20104d3571P117k12949J10112
11225a39291k61615J14106B71181b09671B24632i3481A25349b43680f0329A02690
11214a704j30165A55187d9929d797l1437A62125J7183f7837B6121N988e3557j87686
$$ plain form
11292 -239177 -173753 -292426 170088 -38198 -198329 104406 16411 -226527 -89369 -144157
11282 -144157 80136 -140590 -151807 -348541 393086 -35258 161580 -67771 54170 -193391
11271 -324187 295168 -94051 103365 -140863 -544576 -19304 -350457 -124190 -197788 -95648
11260 31119 199528 136928 84556 -104165 31157 246671 -68165 -161492 112850 -266583 129294
11248 -100554 72422 132419 323888 -92581 40699 -117722 64129 -25634 -44879 -225661 36891
11236 6059 -168408 -160314 -138033 -62548 113482 -313345 120104 -43571 -36454 -249403 -139291
11225 -139291 -400906 -286800 271181 -209671 224632 -93481 125349 -243680 -60329 102690
11214 -1704 -131869 155187 -49929 -4797 -36234 162125 179308 -67837 26121 32109 -53557 -241243
11202b41243A3996e1248j11588a0368j39628j43632a12028k34818a2610A81918
11191b393A67424d7226E6902N5369D5795c8555f845A28126A2555a28825b8274
11179a11250j01833B87619a07104D7169e3494m9546E8683e063A47477E2837f6013
11167c3675A16510b7028j6310G1712a64685A40233a10400j8220e2504a6960F9320
11155B29715o4527f399j4452A01491m0473O8913b78372B06163l4180n358a96295
11143A92916a0183A46559d9914r3106d7697E3565D266a79722B83367J2665a46890
11131G6813i5695L6347o5396A18415g8312A04254K00860r7276a40477O3528n6619
11120a33568K0727A03378M3517C8802c31347a63079G9296a27160B51639j16962
$$ plain form
11202 -241243 13996 -51248 -162836 -10368 -149996 -293628 -112028 -346846 -12610 181918
11191 -2393 167424 -47226 56902 112271 45795 -38555 -6845 128126 12555 -128825 -28274
11179 -111250 -213083 287619 -107104 47169 -53494 -103040 58683 -5063 147477 52837 -66013
11167 -33675 116510 -27028 -43338 71712 -164685 140233 -110400 -128620 -52504 -16960 69320
11155 229715 165188 -6399 -20851 101491 61018 129931 -278372 206163 171983 166625 -196295
11143 192916 -10183 146559 -49914 -143020 -47697 53565 4266 -179722 283367 296032 -146890
11131 76813 -95695 -59348 -124744 118415 -78312 104254 305114 207838 -140477 -76949 -133568
11120 -133568 -112841 103378 146895 38802 -331347 -163079 79296 -127160 251639 134677
11110A34677h7504B6035G143M5725b2069H3610J26780C2282J04462D3863J4039
11099E7902b73686B63962J54821O8939A24002K03413r2546F0826P4623P4948Q6709
11088B97106A754N92697D8811a26845D65984A23188J48882L43160D952J80169
11078A85121O1928K4524M3169E9041J18582K99509j81114J36152J29319B69892
11067D15679j34853N1274J34457Q8492k48092K19068J21336j16180M7479J9227
11057E97887J07467N7069j94238L9552L46375l07543B83090J08534M50266j75147
11047F66743j34929K46454P7376k17849r4992P5000m3713O0375j19544K82823
11037G97744m8778j48063K59863J66720m51070j85155L72538C47606L37937j95464
$$ plain form
11110 134677 -87504 26035 7143 52868 -22069 83610 210390 32282 136744 43863 57902
11099 57902 -273686 263962 418783 487722 124002 327415 234869 60826 135449 210397 297106
11088 297106 1754 594451 48811 -126845 465984 123188 272070 615230 4952 185121
11078 185121 247049 271573 314742 59041 177623 477132 296018 432170 561489 269892
11067 415679 280826 332100 466557 555049 306957 526025 647361 531181 578660 597887
11057 597887 705354 762423 568185 607737 954112 646569 283090 391624 841890 666743
11047 666743 531814 778268 855644 637795 542803 617803 574090 634465 514921 797744
11037 797744 748966 600903 860766 1027486 576416 391261 763799 347606 685543 490079
11027D90079K88047o3815O6473n6522L1851J06552k21940L15628l93581j58138
11017D04634O56768l41549k19959r3480K04499R8053j43961J23524B97111J85596
11007D82707L29068j11448r7095K45903p2955j4781O7434j46460K43025j15548
10997H09850J92414l09682J23816l42472J65698R4382J23876L4725J03232k83474
10987G12365K18480k4092j93187M73649j49042j05201L33170J62269j52698K35662
10977A511375L16494j07061M0727L74326K29913n7081P15364l80725J29566j2560
10967B760338m26702l51691q8307j08260j68053K13155k741j1473k91148L17565
10957A842683K59324l10668j03206J33877j37231k37358l36947n21128J79259
$$ plain form
11027 490079 778126 714311 780784 724262 756113 862665 640725 956353 562772 404634
11017 404634 1061402 719853 499894 406414 610913 708966 565005 688529 297111 482707
11007 482707 811775 700327 603232 849135 776180 761399 828833 682373 925398 809850
10997 809850 1002264 692582 816398 473926 639624 734006 857882 892607 995839 712365
10987 712365 930845 906753 713566 1187215 1038173 932972 1266142 1428411 1275713 1511375
10977 1511375 1827869 1720808 1761535 2135861 2365774 2308693 3024057 2643332 2772898 2760338
10967 2760338 2333636 1981945 1893638 1785378 1617325 1830480 1827739 1816266 1525118 1842683
10957 1842683 2102007 1791339 1688133 1822010 1684779 1447421 1110474 589346 768605
10948G68605q0573J17979k65487J08992I5962J24331J6821K29244K0744D0270
10937C89079j84385p6729Q3120D1868J06022o1152O1648B2906b19731A36630k1913
10926A14717J3093O6481H1285C9586q406J7789g3644H0078c21853F5279l2565
10915C2714M8044J27888b65743E7540E30L47185A63048m8121p264D6035g930l5575
10903d3505j87423b265m32446A26087C830J5886a10248J8626H2037c04517h5773
10891e3321C8530a59815d9207B23727E2883k2189a41925G2190a89403L5294A52034
10879A82459c02093A73904p6649g5643B26964b12319O4204j48989J08176h4745
10868E0604i7116L6277j33448A41272b55713A87830C1871a09573A17455J40156
$$ plain form
10948 768605 688032 806011 540524 649516 95962 220293 237114 466358 487102 40270
10937 389079 204694 127965 211085 41868 147890 86738 148386 22906 -219731 136630 114717
10926 114717 127810 194291 81285 39586 31180 48969 -73644 80078 -321853 65279 32714
10915 32714 80758 208646 -265743 57540 530 347715 163048 114927 107663 46035 -7930 -43505
10903 -43505 -230928 -2265 -434711 126087 3830 19716 -110248 -91622 82037 -304517 -85773
10891 -53321 38530 -159815 -49207 223727 52883 30694 -141925 72190 -189403 -154109 152034
10879 182459 -302093 173904 97255 -75643 226964 -212319 -148115 -297104 -188928 -84745
10868 50604 -97116 -60839 -194287 141272 -255713 187830 31871 -109573 117455 257611
10858B57611A7707J7962a43000o3048C2990a01153A31121d928k8943o0686A18299
10846D2001O3512J32699a01576e144q6911K3872D3714a88014K8035B41598h0303
10834C76187a62870j03565B59156g0147q3039q7270P1115B04297b449j5851A60054
10822F7578a01105A82326N0500r9016a28283p5775A02293a75232C3169K26242
10812B59411c34987e902l26532M0511A48646l19a30644j3458A45795b57637n1008
10801c08645B0237M26130j97635O5207b34227b658j97314A55052a29804k64840
10791c94644e0226a8768A57112J24454a25301C0515i1262A2442J29014G0108a97362
10779f2392j74656A5333P4753J70078i9849b8660A72902j3611E4309N3366c106
$$ plain form
10858 257611 17707 35669 -143000 -206048 32990 -101153 131121 -4928 -33871 -94557 118299
10846 42001 105513 238212 -101576 -5144 -92055 -68183 43714 -188014 -159979 241598 -80303
10834 376187 -162870 -266435 259156 -70147 -153186 -240456 -169341 204297 -2449 -18300 160054
10822 67578 -101105 182326 232826 133810 -128283 -204058 102293 -175232 33169 259411
10812 259411 -334987 -5902 -332434 -291923 148646 148327 -130644 -144102 145795 -257637 -308645
10801 -308645 20237 446367 248732 313939 -234227 -2658 -199972 155052 -129804 -394644
10791 -394644 -50226 -18768 157112 281566 -125301 30515 -91262 12442 141456 70108 -197362
10779 -62392 -237048 15333 90086 260164 -99849 -28660 172902 159291 54309 107675 -3106
10767c68960A54681R375G5152b29300A05961b31540N0358j95753a26839k8200
10757a55039H6083b27749B62323g5866A74722b97987h991r4875i180j03486d3492
10745a26803B85064a04707B40878H241J74147F5852K8017Q3126D3436b53042A68971
10733B3779a73397Q4608G0530c8347G9429a64675j15186i3041A02421a65396A47858
10721c73061a23047p1400B5301b85699a22737N0561k01274A97499a90146o5805
10711b55951b183G729P1326C2111J57029p3394a47420A3475a69578K9329A87779
10699g3734A8079d1696A89561a78297M3968q044G7057C7468b17577e3660k21996
10688b75656C3560a62344I7774d6218F707h6728C8670a2662k81631o502A35983
$$ plain form
10767 -368960 154681 164056 75152 -229300 105961 -231540 -181182 -376935 -126839 -155039
10757 -155039 86083 -227749 262323 -75866 174722 -297987 -8991 -103866 -9180 -112666 -43492
10745 -126803 285064 -104707 240878 8241 182388 65852 93869 176995 43436 -253042 168971
10733 23779 -173397 -88789 70530 -38347 79429 -164675 -279861 -93041 102421 -165396 147858
10721 -373061 -123047 -194447 25301 -285699 -122737 -72176 -273450 197499 -190146 -255951
10711 -255951 -2183 7729 79055 32111 189140 115746 -147420 13475 -169578 -140249 187779
10699 -73734 18079 -41696 189561 -178297 -134329 -142373 77057 37468 -217577 -53660 -275656
10688 -275656 33560 -162344 97774 -46218 6707 -86728 38670 -12662 -294293 -300795 135983
10676B07022E0970a31729B1422a11267j73624B48473f338A98865i0347c80n9553
10665e9933B3170a94366D22435d03404a56632d9853j04146B08217c9661a7767
10654C7498c94197e1736B16809D7744R0752B2912J86951C4199a37957A92310r1205
10643A01105N9797a17289c4002j19525o1975A48175m4866f3412m22720B21004
10632b12198c2771j35204j2165A18182j9453m6231J04865d97311Q0727B9653a16506
10620A48337c5145E0718O7106c03044p7457a30889j1226c5770k32486C4086b26697
10608H1208c78101A72076c7990G3084L0787L1161l7880M30244b08110R2229j0504
10597a26385j6551C41616a16466d539A89513b1257C8145d2289A77291n672F601
$$ plain form
10676 207022 50970 -131729 21422 -111267 -284891 248473 -6338 198865 -90347 -380 -59933
10665 -59933 23170 -194366 422435 -403404 -156632 -49853 -153999 208217 -39661 -17767
10654 37498 -394197 -51736 216809 47744 138496 22912 209863 34199 -137957 192310 101105
10643 101105 160902 -117289 -34002 -153527 -215502 148175 103309 -63412 -486132 221004
10632 -212198 -32771 -167975 -180140 118182 98729 52498 157363 -497311 -416584 29653 -116506
10620 148337 -35145 50718 117824 -303044 -380501 -130889 -142115 -35770 -268256 34086 -226697
10608 81208 -378101 172076 -37990 73084 103871 135032 97152 527396 -208110 -115881 -126385
10597 -126385 -142936 341616 -116466 -4539 189513 -21257 38145 -42289 177291 171619 6601
10585G557c38700K515B49640B9281b48447K8455B7901c60570a24098A79921n7344
10574A22577b35009b6771j14770a9212B49311c27074a29078j24118E7409b7660
10563A4197J49923b39610C2173g0348a7952j85455N4954A3558a13828A16845k6451
10552I0394L2707a85205l7426J08249C51240n3479b72768c0378B34101p9192F2579
10540a4589D33326a48535O7881C6506H535a20742j2769A3354b12439B5212c44815
10528G8025a90157L0865C07365A33912a67501N7919q2567e9025j22691h446B3903
10516h0159j93249a31795N1066k66256e2036F9448L8029a4936l34366d0422j04141
10505a44563j67094f4618m91278h9870C76965a74579o0697m100j5482A7565L2862
$$ plain form
10585 7557 -338700 -336185 249640 29281 -248447 -219992 27901 -360570 -124098 179921 122577
10574 122577 -235009 -26771 -141541 -19212 249311 -327074 -129078 -253196 57409 -27660
10563 14197 164120 -239610 32173 -70348 -17952 -203407 -148453 13558 -113828 116845 90394
10552 90394 123101 -185205 -222631 -114382 351240 297761 -272768 -30378 234101 154909 62579
10540 -14589 433326 -148535 -80654 36506 8535 -120742 -133511 13354 -212439 25212 -344815
10528 78025 -190157 -159292 307365 133912 -167501 -109582 -192149 -59025 -181716 -8446 23903
10516 -80159 -273408 -131795 -80729 -346985 -52036 69448 107477 -14936 -349302 -40422 -144563
10505 -144563 -311657 -64618 -555896 -89870 376965 -174579 -235276 -239376 -254858 17565 50427
10494E0427g5523E4803a1175A9428L55213b4233p2554c200B04514H3038K64062
10483C47100J59974j441P270j47178M29930C03257j20374g3629F9618K4530b98749
10471B49964o6466B9915R8427K00289e8109o128j8272r8012j42109c1903A333
10459A71550G1335i0621L183j47312a08489G9811a90411A2396e0978k0961j41130
10448b13069h2698A16513C6905K04375c46291P4382D1337b18551f3308j90736
10438b54044i7323j4050A11094j7495c8077B37116D8959b13397B22743b89814
10427a64465A5504M0562a61958M9191A14704b55115j77056Q502e7601F0083j1690
10416D8393A3140a51044N0195A26634L7147b49371I2408c09901h2473j69624B10669
$$ plain form
10494 50427 -75523 54803 -11175 19428 374641 -24233 -96787 -3200 204514 83038 347100
10483 347100 507074 505633 512903 365725 795655 303257 182883 -73629 69618 94148 -298749
10471 249964 183498 29915 128342 328631 -58109 -64237 -82509 -180521 -322630 -31903 1333
10459 171550 71335 -90621 -87438 -234750 -108489 79811 -190411 12396 -50978 -71939 -213069
10448 -213069 -82698 116513 36905 241280 -346291 -271909 41337 -218551 -63308 -254044
10438 -254044 -97323 -111373 111094 93599 -38077 237116 48959 -213397 222743 -289814
10427 -164465 15504 56066 -161958 -112767 114704 -255115 -432171 -423669 -57601 60083 48393
10416 48393 13140 -151044 -100849 126634 163781 -249371 92408 -309901 -82473 -252097 210669
10404C3364c7563A54760a4538m78265A23382K8250a02905j06007A21577J30435
10394B52012d8629j02385I7172O0941m9254B7545q747N8579J88756n2035h6159
10382F5667d6820l1610B6946K34025Q6348n9918a24148D13335n8566j73736K34896
10371D15929A9127K19089M8611R066K97870L05124l23407B72802J92628n8374
10361D07056J54705B15713C8269L90704A27704J15434J76604A93733l7521O5414
10351B21626L15498A11513M25177B29981D8051a3983j8805E04238J69223A27119
10340B43513J63297O2520A88938G8760N9108C8872N3396J099L1828L24123E5666
10328A55657M8325e4363H4189J78206j21867K39175A22389J21645J62963j43748
$$ plain form
10404 33364 -37563 154760 -14538 -492803 123382 151632 -102905 -208912 121577 252012
10394 252012 -48629 -151014 97172 158113 108859 27545 18798 77377 266133 214098 -86159
10382 65667 -46820 -78430 26946 260971 347319 287401 -124148 413335 354769 181033 415929
10371 415929 19127 238216 286827 295893 593763 898887 575480 272802 465430 407056
10361 407056 561761 215713 38269 428973 127704 243138 419742 193733 156212 221626
10351 221626 537124 111513 536690 229981 48051 -13983 -32788 504238 673461 127119
10340 243513 406810 469330 188938 78760 137868 38872 92268 93367 125195 449318 55666
10328 155657 203982 -54363 84189 262395 140528 379703 122389 244034 406997 263249
10318B63249A17219K33706j24417h7101B36764j07930B2582M41979E9149L4821
10308I3970D3791c1898B7879L92369a40978B83591a05290m5980b705D5529J51208
10297A96737C7910a07249n8846A31206d7106A39574e7403l34482B8967K0275b1491
10285a42828f0123C01136D417a09611B38957i8567A11625a22555I5054D0158L8708
10274G8866a17095C8670a70307B33012a85858A30429N0359g8691m32352H904Q4038
10263I2942f1626i707B51501K45876j42107M3138l7958A59386b630A21105l9266
10252H1839C7184e6718j23952K7645P134G5516b64567A62304b34885j9436A13204
10240d5447k6972A52603P9261M965b54138a05055j56934I4288g9938m4269j14990
$$ plain form
10318 263249 117219 350925 226508 -87101 236764 128834 22582 464561 59149 93970
10308 93970 43791 -31898 27879 420248 -140978 283591 -105290 -151270 -2705 45529 196737
10297 196737 37910 -107249 -166095 131206 -47106 139574 -57403 -391885 28967 49242 -21491
10285 -142828 -60123 301136 4417 -109611 238957 -98567 111625 -122555 95054 40158 78866
10274 78866 -117095 38670 -170307 233012 -185858 130429 180788 -78691 -511043 8904 92942
10263 92942 -61626 -9707 251501 497377 355270 398408 360450 159386 -2630 121105 81839
10252 81839 37184 -56718 -180670 -153025 -145891 75516 -264567 162304 -234885 -254321 113204
10240 -45447 -72419 152603 231864 236829 -254138 -105055 -261989 94288 -79938 -124207 -239197
10229b39197a11758l3935l0519b0807A05927E1106J78574c8547o9697A11975J02945
10218B14920C77b96229f9392a2691m05473H0060h8515L0391j61725d3824J6252
10207b7572k65675a45157d872l38993k2982H616J28956B5709a64182l2361R2901
10196a03642q2270n4208A63407b17467A08063c16614A10710J41316i8252k720
10186a00972M65G0841b77387C28140A50687o0193b81194A19341a27066E0353d6032
10174B6400a49418A61414a00505d6599F1090f3121A6546J05417h1019C661c76286
10162a69105M8894I0700N7970a84883d8451B32521a57503p4718f8580c3085A39532
10150C0028b7163E44866d45293a46348D1642b09147j45734i6828A91480a10188
$$ plain form
10229 -239197 -111758 -145693 -176212 -20807 105927 51106 229680 -38547 -108244 111975 214920
10218 214920 377 -296229 -69392 -12691 -418164 80060 -88515 -58124 -219849 -43824 -27572
10207 -27572 -293247 -145157 -4872 -343865 -366847 8616 137572 25709 -164182 -196543 -103642
10196 -103642 -185912 -240120 163407 -217467 108063 -316614 110710 252026 -98252 -100972
10186 -100972 -100507 70841 -277387 328140 150687 90494 -281194 119341 -127066 50353 -46032
10174 26400 -149418 161414 -100505 -46599 61090 -63121 16546 121963 -81019 3661 -376286
10162 -169105 -120211 90700 148670 -184883 -48451 232521 -157503 -232221 -68580 -33085 139532
10150 30028 -27163 544866 -445293 -146348 41642 -209147 -354881 -96828 191480 -110188
10139c48943f8560A56531a36451k2880B49387c13138A68485a73681B02088I2685
10128C32003r3088G422d99559a64759I1322b66699J22342J3374l7949o7474A73639
10116e0321a7152B89153b48843B2857L6610a495j7937o5241i006A27888j4368
10105A13520M1067e42039e192k49122H113b03767j4464e199k76236a18965E2629
10093a71255C15349b55279A56364B7164a37746e8114a126A16789f8075j78087
10083b46162B5189d67493J42468E375O6790b90662Q7796E0291d78642a67938f2317
10071A72928J09864h5473k1626A43289b5534D5310P2309B8937J03993A525f8382
10059c77760J00954C34090a51507C1845N408d6410b1858o1915A01980R5460G2558
$$ plain form
10139 -348943 -68560 156531 -136451 -159331 249387 -313138 168485 -173681 202088 92685
10128 332003 238915 7422 -499559 -164759 91322 -266699 -144357 -130983 -168932 -236406 173639
10116 -50321 -17152 289153 -248843 22857 59467 -1495 -19432 -84673 -9006 127888 113520
10105 113520 154587 -542039 -5192 -254314 8113 -203767 -218231 -5199 -281435 -118965 52629
10093 -171255 315349 -255279 156364 27164 -137746 -58114 -1126 116789 -68075 -246162
10083 -246162 25189 -467493 -325025 5375 72165 -290662 -202866 50291 -478642 -167938 -62317
10071 172928 282792 -85473 -107099 143289 -25534 45310 117619 28937 132930 1525 -68382
10059 -377760 -276806 334090 -151507 31845 37253 -46410 -21858 -83773 101980 197440 72558
10047b72707i803A39738a86728c1306j49233n70P9306a5458l97914g7982k46596
10036c24578A52115c64602E9620R7800L1054a73256q7441A24692d45566K04601
10026b40965k9317A25007a52280d4851A24817C2301a23654C0918a01283r7669
10016a98952G3265b5420B58622I0759b88158c2102C27768c4996j52578c5560H6512
10004a38307j60868C8238J3642a48881F1057k8105a65456M4683e3306j85799j70134
9993d09239a79371F5587K0979K51242d8421p6882a5776j21029r268e3749E2127
9981G0576M1264a19106a3677D9622e1700F6880e6040r1509A16007a99360k4838
9970b24198B35678a44598k87634a77011m6045O6753B45436a47103e5961A7094
$$ plain form
10047 -272707 -9803 139738 -186728 -31306 -180539 -181109 -101803 -15458 -413372 -77982 -324578
10036 -324578 152115 -364602 59620 157420 188474 -173256 -260697 124692 -445566 -240965
10026 -240965 -270282 125007 -152280 -44851 124817 32301 -123654 30918 -101283 -198952
10016 -198952 73265 -25420 258622 90759 -288158 -32102 327768 -34996 -187574 -35560 86512
10004 -138307 -299175 38238 51880 -148881 61057 32952 -165456 -120773 -53306 -239105 -409239
9993 -409239 -179371 65587 86566 337808 -48421 -125303 -15776 -136805 -146073 -53749 52127
9981 70576 111840 -119106 -13677 49622 -51700 66880 -56040 -147549 116007 -199360 -224198
9970 -224198 235678 -144598 -432232 -177011 -223056 -156303 245436 -147103 -55961 17094
9959c14569I0422i703A2720g8631G6502N1594H017N2770i1487k13914C7492K49216
9947B86708c52612J30028L9090O364g7502B34132d41797D24600e6816G9O3251
9936F3330h4994L2410k45909a09878c4593A50792a5838A93915a30022f4129j88276
9925b52405E7816a43472b5835l71535B5727i5878b6928B34082E866i5399H2506
9913d7810F4684c29032a16951A05987K10908A23897e53m8786k17720H1013N3130
9902A34143c02558a4355B976g3759K892B92809H3294a23847c7929B2545c64003
9890A7344a10637B18644r8277f8556l35780e1936A43415i7293G6767B1292a01172
9878b54104R3259H3130a7754A85180a13824O400G8452h4720K7501B5633b1165
$$ plain form
9959 -314569 90422 -9703 12720 -78631 76502 128096 8017 60787 -91487 -305401 37492 286708
9947 286708 -352612 -222584 -183494 -177130 -77502 234132 -441797 424600 -56816 79 63330
9936 63330 -84994 -52584 -298493 -109878 -34593 150792 -15838 193915 -130022 -64129 -252405
9925 -252405 57816 -143472 -25835 -397370 25727 -95878 -26928 234082 5866 -95399 82506
9913 -47810 64684 -329032 -116951 105987 316895 123897 -553 -49339 -267059 81013 134143
9902 134143 -302558 -14355 2976 -73759 -70867 292809 83294 -123847 -37929 22545 -364003
9890 17344 -110637 218644 120367 -68556 -404336 -51936 143415 -97293 76767 21292 -101172
9878 -254104 -160845 83130 -17754 185180 -113824 -107424 78452 -84720 -57219 25633 -21165
9866a50575O6089q5584A38996b62625B5395J32982b02376L407I435J99199b34624
9854B7417M1623d11529B08652b7542j60951l00731J17447J18801k0622J1579A59417
9842I7021d07848A35328e5967B0852a78052j4401n05185K88856A52710e6467k39386
9831b95853C971J45017J23258i847j88326A15960d91k64442A12230C3378a54746
9819d35169f8883A69020B7779a9017F1217a22403N9666k09648J30490e0350o9818
9808a20168A12245d07622a49959A40464o6075a25165A01800a15634o0415h030
9797c09665P6138A48480b32178a054j66118f4403l4049A20298O9551a85479B44269
9785a13709c6243I3050a47401M8947D09683b81750g5790r9680f8577A43219c8374
$$ plain form
9866 -150575 -84486 -170070 138996 -262625 25395 158377 -202376 -198969 9435 208634 -234624
9854 27417 69040 -411529 208652 -27542 -188493 -489224 -371777 -252976 -273598 -262019 159417
9842 97021 -407848 135328 -55967 20852 -178052 -192453 -697638 -408782 152710 -56467 -295853
9831 -295853 3971 148988 272246 -9847 -198173 115960 -491 -264933 112230 33378 -154746
9819 -435169 -68883 169020 27779 -19017 61217 -122403 -62737 -272385 -141895 -50350 -120168
9808 -120168 112245 -407622 -149959 140464 74389 -125165 101800 -115634 -176049 -8030
9797 -309665 -233527 148480 -232178 -1054 -167172 -64403 -98452 120298 189849 -185479 244269
9785 -113709 -36243 93050 -147401 -98454 409683 -281750 -75790 -175470 -68577 143219 -38374
9773a9472H0104C3139P3902k8104J97897a39297A328L8647b54023R866q1620e1366
9760b00218L2708j27685M8253A9448K13943p4897L3878o1533K65402a85547O8986
9749a16561A60149d7738m19872a26053L8682b1762G2963a11012k15131B80541
9738b31859d7165G6726a01726k7030A53671K45577j86457b05857b0573B6209K0540
9727D6749N9252c08523P1954b4456k00213A71892a27048D2188a76442c7296a7003
9715a79107n6629a00312c1341F8986g2661l02421i7153k41845e7394l94450D1917
9703B1875c34351A53965b21805g2025D3209a25032j27443B09240O5035k8654a69593
9691c99n9615A8918a77777k73681D1030a10016j27891j14051P6066j48834c5709
$$ plain form
9773 -19472 80104 33139 107041 78937 276834 -139297 1328 39975 -254023 -244157 -325777 -51366
9760 -200218 -167510 -295195 -246942 19448 233391 158494 192372 130839 396241 -185547 -116561
9749 -116561 160149 -47738 -467610 -126053 -87371 -21762 72963 -111012 -326143 280541
9738 -231859 -47165 76726 -101726 -128756 153671 399248 212791 -205857 -20573 26209 46749
9727 46749 106001 -308523 -236569 -24456 -224669 171892 -127048 42188 -176442 -37296 -17003
9715 -179107 -235736 -100312 -31341 68986 -72661 -375082 -97153 -338998 -57394 -451844 41917
9703 21875 -334351 153965 -221805 -72025 43209 -125032 -252475 209240 274275 245621 -169593
9691 -399 -60014 18918 -177777 -451458 41030 -110016 -237907 -351958 -275892 -424726 -35709
9679A17609Q5456c0383A08927b73977O606A77336a59650m9907A94077g5524k59370
9668c34894B13195b98119j5955M777I6107J6772a79535o053k53619a40303C439
9656b24035R4942G2808M79956A94145D8924M2794a3680b493G4120e11154d7538
9644a78584o0096A72710c4467H009P8364c3066k62169C9042e7024n5965b4585
9632b05309B8797a71084K0699k99098A26341E339b9514j30421j76832a33097c7501
9620i2699j2028n474K1966q3649L3830B4282e9414M123j35639d4742n8782q7125
9608a90649B39001f3239k2272q3841I0061a55619j17916Q3130a1307j33729j01094
9597b46130F0944a5906k64239A10976a13781o2594g1743m369J6067a5657I3028
$$ plain form
9679 117609 203065 -30383 108927 -273977 -267371 177336 -159650 -209557 194077 -75524 -334894
9668 -334894 213195 -298119 -314074 -309297 96107 112879 -179535 -185588 -439207 -140303 3439
9656 -224035 -129093 72808 552764 194145 48924 91718 -13680 -2493 74120 -511154 -47538
9644 -178584 -238680 172710 -34467 8009 86373 -33066 -295235 39042 -57024 -112989 -24585
9632 -205309 28797 -171084 -150385 -449483 126341 5339 -29514 -159935 -336767 -133097 -37501
9620 -92699 -104727 -110201 -88235 -171884 -138054 24282 -59414 -55291 -190930 -44742 -103524 -190649
9608 -190649 239001 -63239 -85511 -169352 90061 -155619 -273535 -190405 -11307 -145036 -246130
9597 -246130 60944 -15906 -280145 110976 -113781 -176375 -71743 -76112 -60045 -15657 93028
9585h9640D5961R025J31223l1575a00656L7007J832A16401J0803d46051J50278
9574b95773D8127a11291M2050K0865l41827D0337g0633K8007A99687b35935j3621
9563b49556B35383A16343k4530Q6352l3116c27770J43272J1730A816Q5490c2558
9551D5013b12449k53840a53319F4413J82458m8336q0139b9976q7229j97826L9115
9540b75916j47843a74573C8901M502a20647B4263K73519a86203n8495d2519A56174
9528b76433F6345l1324R0780A2003L46948f2964j23234l2099B17595d78161A60224
9516C5b21236A66690A0500a839E5397e8480k91665C878J51607b9607A40057a94775
9503B3300c9958k9517k27337C1127b1061j1370j29434J3203A79224b62978K7132
$$ plain form
9585 -89640 45961 54986 186209 154634 -100656 -63649 -61817 116401 127204 -446051 -295773
9574 -295773 48127 -111291 -69241 -48376 -390203 40337 -70633 -42626 199687 -235935 -249556
9563 -249556 235383 116343 91813 178165 145049 -327770 -184498 -172768 1816 87306 -32558
9551 45013 -212449 -466289 -153319 64413 246871 198535 118396 -29976 -117205 -315031 -275916
9540 -275916 -423759 -174573 38901 43403 -120647 24263 297782 -186203 -244698 -42519 156174
9528 -276433 66345 35021 125801 12003 358951 -62964 -186198 -218297 217595 -478161 160224
9516 35 -221236 166690 10500 -1839 55397 -58480 -350145 3878 155485 -29607 140057 -194775
9503 23300 -39958 -69475 -296812 31127 -21061 -32431 -161865 -148662 179224 -262978 -235846
9492b35846r4766B58301D1188a18722A57341C5025b23367A0695b32865j85630
9482d18495A08763i0578c3214o1870C1759a28161k07955F2908a12145o0723M046
9471a68822j31903H3792J15585b3065B41206a52604c8227A04023f5949E1221a78223
9459A2594a21379a5525j72778m0208A8692a92067f9337c1501A82982b94695G2316
9447a60655o906A77023e0084k49097j29664A23429b62224J22984a5960A118i8665
9435c09295a4140j4205A35425a43701k68967B58151a33074k29891c9767j43963
9425a83730G1536A3473J85133E9321a70752I8615c68334c2479o0951l37296c9827
9413a21296A1077a02450c3076n7016j41846k3031A98685E5013K4897J00520n5832
$$ plain form
9492 -235846 -330612 258301 41188 -118722 157341 35025 -223367 10695 -232865 -418495
9482 -418495 108763 -90578 -33214 -95084 31759 -128161 -336116 62908 -112145 -172868 -168822
9471 -168822 -300725 83792 199377 -23065 241206 -152604 -38227 104023 -65949 51221 -178223
9459 12594 -121379 -15525 -188303 -228511 18692 -192067 -69337 -31501 182982 -294695 72316
9447 -160655 -167561 177023 -50084 -299181 -428845 123429 -262224 -139240 -15960 1118 -98665
9435 -309295 -14140 -28345 135425 -143701 -412668 258151 -133074 -362965 -39767 -183730
9425 -183730 71536 13473 198606 59321 -170752 98615 -368334 -32479 -93430 -430726 -39827
9413 -121296 11077 -102450 -33076 -90092 -231938 -254969 198685 55013 79910 180430 124598
9402A24598A1375c40875G4303b31815N5345A20076k1470k8043g6311n6677A43198
9390B61910A15111a8519A0794K20531b15770f4713B23206L4545n4271F7450j7864
9379D9586c83131a33818a7119j70769j71340D1892J5045a85830j89793J69550
9369b06073e1838q3888B25273f8311a3545m8170k09891c1100a3631k62981C0039
9357a59770j19246C49236b76296J22159c3569j92685E6464b62262A94546b10269
9346E880K11250f4314k14747A36276a02119A47646a48382j61679k48491d1908
9335A40654d3555B5780O6957b22213C06184b42933N5663l9546E8170e3669m19170
9324d72839J37493J54867G0374e7377H6342k933c91940A25408J13559c39724D271
$$ plain form
9402 124598 11375 -340875 74303 -231815 -176470 120076 98606 70563 -76311 -132988 143198
9390 261910 115111 -18519 10794 231325 -215770 -64713 223206 257751 203480 67450 49586
9379 49586 -383131 -133818 -17119 -187888 -359228 41892 56937 -185830 -375623 -206073
9369 -206073 -51838 -135726 225273 -68311 -13545 -61715 -271606 -31100 -13631 -276612 30039
9357 -159770 -279016 349236 -276296 -154137 -33569 -226254 56464 -262262 194546 -210269
9346 5880 217130 -64314 -279061 136276 -102119 147646 -148382 -310061 -558552 -41908
9335 140654 -43555 25780 92737 -222213 306184 -242933 -187270 -226816 58170 -53669 -472839
9324 -472839 -335346 -180479 70374 -57377 86342 83409 -391940 125408 238967 -339724 4271
9312d4921l3200D23846j01665e7492B7893b90021J34219P0180o9408A13406a83230
9300A17275b07260b5103H4223b44223A62953a66456J8298M6755r502k47199F4729
9288A82204a099C12201m1654a46163j76089f8491A09607b37733f4150B5350K24617
9277B49967c0934q7252A02801c2091k5942j57234a07477j97254C66113j28409
9267B37704a10345k06218B82967c83329I4074i1341C44594G7873e81776a35862
9256d4492k01088R7931E738a34898B53569b52456B0050a44516N0175j77958E0929
9244b9213k45922P5452G0780M1371b8520A86530q3407k0150f6586K3326q5690
9233a28950C09641a27391k00990E7821K56766E9112g7918K9727D8297b34017b5842
$$ plain form
9312 -44921 -78121 423846 322181 -57492 27893 -290021 -155802 -85622 -155030 113406 -183230
9300 117275 -207260 -25103 84223 -244223 162953 -166456 -148158 -101403 -110905 -358104 64729
9288 182204 -1099 312201 270547 -146163 -322252 -68491 109607 -237733 -64150 25350 249967
9277 249967 -30934 -118186 102801 -32091 -58033 -215267 -107477 -304731 366113 237704
9267 237704 -110345 -316563 282967 -383329 94074 -91341 344594 77873 -581776 -135862
9256 -44492 -245580 -147649 5738 -134898 253569 -252456 20050 -144516 -94341 -272299 50929
9244 -29213 -275135 -199683 70780 112151 -28520 186530 103123 82973 -66586 -43260 -128950
9233 -128950 309641 -127391 -328381 57821 314587 59112 -77918 -48191 48297 -234017 -25842
9221E8975K3118J0462J65827c32839m9522a71097I5050c717j15434e7475q9398
9210a46873f6930C32187H1096c7493j37341G567f2939m89550K03239a60415P8363
9199h2052A27309C4593a83741A58690B4835a19751j23104B4884a5459j72540j47293
9188c35292A56139k406c6086k20211A44255J5317a01631C327f4380K9646o0579
9177i5313q3405g4678A81713N1068j03106a04241A01673N9523a773A62250f6820
9165a51936j88412g8346k77534i0549a4223B99229B1953a08931d8829k18633e9821
9153a52853d0435J4754G905K42393a80187f0227I9611Q9343H573a91866D06446
9141E1777j8172J67862d08730N8371i7165C3277j0483J51552a13180k13054A73061
$$ plain form
9221 58975 82093 92555 258382 -332839 -382361 -171097 95050 -3717 -119151 -57475 -146873
9210 -146873 -66930 332187 81096 -37493 -174834 7567 -62939 -552489 -349250 -160415 -82052
9199 -82052 127309 34593 -183741 158690 24835 -119751 -242855 24884 -15459 -187999 -335292
9188 -335292 156139 153733 -36086 -256297 144255 159572 -101631 3327 -64380 -34734 -95313
9177 -95313 -178718 -74678 181713 232781 129675 -104241 101673 161196 -1773 162250 -66820
9165 -151936 -340348 -78346 -355880 -90549 -14223 299229 21953 -108931 -48829 -267462 -59821
9153 -152853 -40435 -25681 7905 250298 -180187 -60227 99611 188954 8573 -191866 406446
9141 51777 33605 201467 -408730 -350359 -97165 33277 22794 174346 -113180 -326234 173061
9129b52754F6488b96971f502E4074a86715f9128j95724A28189c3560B46118c11546
9117A62550G8353b54737h7294f088j22161B42211r0395J4511a0978A57120b13126
9105c9729m5166j5853k05337J40083C37174b7719A36445b50994a19615j08723
9095b28338R4806f1517k16983C65425a38857m0228A13382j4867b03813b4566A58376
9083a36007j7982e490k06623C3486R6045C4944a42044N4936k07482m2740O4875
9072b72455D2229A0036b97389J6531C26881n6428b26442A28942J2309a98923e7357
9060a63289e6040K1906o4051b9691r0721I6552b25316a4874q7146d7895I5319
9048a05657k3197A46380p2441f7729J1961N237k17926B92882c4348J5511k02829
$$ plain form
9129 -252754 66488 -296971 -6502 54074 -186715 -69128 -264852 128189 -33560 246118 -311546
9117 162550 78353 -254737 -87294 -6088 -128249 242211 151816 166327 -10978 157120 -213126
9105 -39729 -84895 -100748 -306085 -166002 337174 -27719 136445 -250994 -119615 -228338
9095 -228338 -133532 -61517 -278500 365425 -138857 -179085 113382 98515 -203813 -24566 158376
9083 -136007 -153989 -5490 -212113 33486 129531 34944 -142044 -87108 -294590 -337330 -272455
9072 -272455 42229 10036 -297389 -280858 326881 270453 -226442 128942 141251 -198923 -57357
9060 -163289 -56040 -34134 -98185 -29691 -120412 96552 -225316 -14874 -102020 -47895 95319
9048 -105657 -128854 146380 73939 -67729 -55768 -50531 -268457 292882 -34348 -18837 -221666
9037b21666j02477M263b4153A4593K28814c70491J38613f0296B44747a52988A6534
9025B81475c02331A76629d8365j09520E7121c14765h6827k66959f2048A804b18167
9013C7404q651b08025h7546A00741j5916a29407j61381e4323B51853A09637C9456
9001c36372J62997b1164o5607A0804O5674a55077B50747G3528h3273A47959a76862
8989a31785a8726j77296c762l11156A2712K61724I3859k5745b27599a11265k12191
8978c23456a56475B62440c17336a35088k93378A01038a44056f3289G8903J95004
8968B73907A24950a19313P634j04060B31133b05166A68571N1646b41410A45779
8957i1154H1106b36832d173A81928n7085m0127K7033C0760e4901i922j56684d559
$$ plain form
9037 -221666 -324143 -319880 -24153 14593 243407 -370491 -231878 -60296 244747 -152988 16534
9025 281475 -302331 176629 -48365 -157885 57121 -314765 -86827 -353786 -62048 1804 -218167
9013 37404 28753 -208025 -87546 100741 84825 -129407 -290788 -54323 251853 109637 39456
9001 -336372 -173375 -21164 -86771 10804 76478 -155077 250747 73528 -83273 147959 -176862
8989 -131785 -18726 -196022 -3762 -314918 12712 274436 93859 68114 -227599 -111265 -323456
8978 -323456 -156475 262440 -317336 -135088 -428466 101038 -144056 -63289 78903 273907
8968 273907 124950 -119313 -111679 -215739 231133 -205166 168571 220217 -241410 145779
8957 -91154 81106 -236832 -4173 181928 124843 84716 111749 30760 -54901 -9922 -166606 -4559
8944d9162q2147l37740P2614a4944j54027A1026a36928A15737C2812N9048k6396
8933F5464e1599j75900B49817A9087b6688j48556A38199J58062A05121M68374
8923E73495J608954N785974O172635C332260A450028n97268l58006G4004K56031
8914C30035C9922b80481c0040c541j77591A75491K28665B3179A1535K42346m6743
8903B07138j0555a6567B1230f9995F0944P5761D3947O2273h2525k10978B69121
8891A74686b30618B12386k470a31561q7316J07060j87425J38393J3633D23447
$$ plain form
8944 -49162 -131309 -469049 -396435 -14944 -168971 11026 -136928 115737 32812 91860 65464
8933 65464 -51599 -227499 249817 19087 -26688 -175244 138199 296261 105121 573495
8923 573495 2182449 7968423 14141058 3332260 1450028 852760 494754 74004 330035
8914 330035 39922 -280481 -30040 -3541 -181132 175491 404156 23179 11535 253881 207138
8903 207138 196583 -16567 21230 -69995 60944 136705 43947 106220 -82525 -293503 269121
8891 174686 -230618 212386 209916 -131561 -218877 -111817 -299242 -160849 -147216 423447
$$ [...]
##END NTUPLES=NMR SPECTRUM
##END=
