
##TITLE=AC1217_HTEAH12048_7155294_vUIiVK8vfx
##JCAMPDX= 6.0         $$ Bruker NMR JCAMP-DX V2.0
##DATA TYPE= NMR SPECTRUM
##DATA CLASS= NTUPLES
##ORIGIN= BRUKER
##OWNER= Administrator
$$ 1.72 TOPSPIN		Version 2.1
$$ 2012-11-30 21:58:33.550 -0500  Administrator@X
$$ Compression mode = diff/dup
##.OBSERVE FREQUENCY= 400.02188249412
##.OBSERVE NUCLEUS= ^1H
##.ACQUISITION MODE= SIMULTANEOUS (DQD)
##.ACQUISITION SCHEME= undefined
##.AVERAGES= 64
##.DIGITISER RES= 22
##SPECTROMETER/DATA SYSTEM= spect
##.PULSE SEQUENCE= noesygpps1d.comp
##.SOLVENT NAME= COFFEE_meoh
##.SHIFT REFERENCE= INTERNAL, COFFEE_meoh, 1, 14.96101
##AUDIT TRAIL= $$ (NUMBER, WHEN, WHO, WHERE, PROCESS, VERSION, WHAT)
$$ ##TITLE= Audit trail, TOPSPIN		Version 2.1
$$ ##JCAMPDX= 5.01
$$ ##ORIGIN= Bruker BioSpin GmbH
$$ ##OWNER= Administrator
$$ $$ E:\/data/COFFEE/nmr/AC1217_HTEAH12048_7155294_vUIiVK8vfx/12/pdata/1/auditp.txt
$$ ##AUDIT TRAIL=  $$ (NUMBER, WHEN, WHO, WHERE, PROCESS, VERSION, WHAT)
(   1,<2012-11-30 21:58:27.091 -0500>,<Administrator>,<X>,<go>,<TOPSPIN 2.1>,
      <created by zg
	started at 2012-11-30 21:47:08.648 -0500,
	POWCHK enabled, PULCHK disabled,
       configuration hash MD5:
       86 BA 57 50 F2 9D 5C 9B 26 00 A9 28 5F 66 2E 89
       data hash MD5: 64K
       6D 60 43 84 42 57 CA 57 E9 26 3C 0A 1B AE AC 14>)
(   2,<2012-11-30 21:58:30.405 -0500>,<Administrator>,<X>,<proc1d>,<TOPSPIN 2.1>,
      <Start of raw data processing
       efp LB = 0.3 FT_mod = 6 PKNL = 1 PHC0 = 0 PHC1 = 0 SI = 128K 
       data hash MD5: 128K
       FB 48 04 63 78 C3 65 87 A1 7A F4 48 E6 DB 4A C3>)
(   3,<2012-11-30 21:58:31.628 -0500>,<Administrator>,<X>,<proc1d>,<TOPSPIN 2.1>,
      <pk PHC0 = -81.81519 PHC1 = 0 
       data hash MD5: 128K
       F8 42 E3 30 CA 1A AB 66 42 B0 40 86 A0 89 05 15>)
(   4,<2012-11-30 21:58:32.364 -0500>,<Administrator>,<X>,<proc1d>,<TOPSPIN 2.1>,
      <abs ABSG = 1 
       data hash MD5: 128K
       3E DF AC 42 C5 8C 02 47 D3 F1 6C CD 9E 62 FB 0E>)
(   5,<2012-11-30 21:58:32.541 -0500>,<Administrator>,<X>,<proc1d>,<TOPSPIN 2.1>,
      <abs ABSG = 2 
       data hash MD5: 128K
       AE 1E 90 BE C8 21 DF 3C 7C D6 4F 0A 39 D3 92 95>)
(   6,<2012-11-30 21:58:32.718 -0500>,<Administrator>,<X>,<proc1d>,<TOPSPIN 2.1>,
      <abs ABSG = 3 
       data hash MD5: 128K
       26 BE 55 1A A3 BA AA 2E 54 BB 9D 81 D2 41 0F 09>)
(   7,<2012-11-30 21:58:32.913 -0500>,<Administrator>,<X>,<proc1d>,<TOPSPIN 2.1>,
      <abs ABSG = 4 
       data hash MD5: 128K
       1F BF 78 FE 2D BE 67 96 08 5B FD 8D 3E 42 DE 3C>)
(   8,<2012-11-30 21:58:33.143 -0500>,<Administrator>,<X>,<proc1d>,<TOPSPIN 2.1>,
      <abs ABSG = 5 
       data hash MD5: 128K
       83 93 BF AD 97 50 0B DE B9 B7 CC ED 8E B5 F3 90>)
$$ ##END=
$$ 
$$ $$ hash MD5
$$ $$ 7A 7F BB 36 03 33 AB B4 C3 7D 65 3F 59 EA AA 79
##$RELAX= 
##$RELAX= 
##$RELAX= 
##$RELAX= 
##$RELAX= 
##$RELAX= 
##$RELAX= 
##$RELAX= 
$$ Bruker specific parameters
$$ --------------------------
##$DU= <E:\>
##$EXPNO= 12
$$ [...]
##$TP07= 0
##$TPNAME0= <>
##$TPNAME1= <>
##$TPNAME2= <>
##$TPNAME3= <>
##$TPNAME4= <>
##$TPNAME5= <>
##$TPNAME6= <>
##$TPNAME7= <>
##$TPOAL= (0..7)
0.5 0.5 0.5 0.5 0.5 0.5 0.5 0.5
##$TPOFFS= (0..7)
0 0 0 0 0 0 0 0
##$TUNHIN= 0
##$TUNHOUT= 0
##$TUNXOUT= 0
##$USERA1= <user>
##$USERA2= <user>
##$USERA3= <user>
##$USERA4= <user>
##$USERA5= <user>
##$V9= 5
##$VALIST= <valist>
##$VCLIST= <CCCCCCCCCCCCCCC>
##$VD= 0
##$VDLIST= <DDDDDDDDDDDDDDD>
##$VPLIST= <PPPPPPPPPPPPPPP>
##$VTLIST= <TTTTTTTTTTTTTTT>
##$WBST= 1024
##$WBSW= 4
##$XGAIN= (0..3)
0 0 0 0
##$XL= 0
##$YL= 0
##$YMAX_a= 6437872
##$YMIN_a= -12497499
##$ZGOPTNS= <>
##$ZL1= 120
##$ZL2= 120
##$ZL3= 120
##$ZL4= 120
##$ABSF1= 14.96101
##$ABSF2= -5.597172
##$ABSG= 5
##$ABSL= 3
##$ALPHA= 0
##$AQORDER= 0
##$ASSFAC= 0
##$ASSFACI= 0
##$ASSFACX= 0
##$ASSWID= 0
##$AUNMP= <proc_prof1d_extract.lims>
##$AXLEFT= 0
##$AXNAME= <>
##$AXNUC= <1H>
##$AXRIGHT= 0
##$AXTYPE= 0
##$AXUNIT= <>
##$AZFE= 0.1
##$AZFW= 0.1
##$BCFW= 0
##$BC_mod= 0
##$BYTORDP= 0
##$COROFFS= 0
##$CY= 15
##$DATMOD= 1
##$DC= 0
##$DFILT= <>
##$DTYPP= 0
##$F1P= 0
##$F2P= 0
##$FCOR= 0.5
##$FTSIZE= 131072
##$FT_mod= 6
##$GAMMA= 0
##$GB= 0
##$INTBC= 1
##$INTSCL= 1
##$ISEN= 128
##$LB= 0.3
##$LEV0= 0
##$LPBIN= 0
##$MAXI= 10000
##$MC2= 0
##$MEAN= 0
##$ME_mod= 0
##$MI= 0
##$NCOEF= 0
##$NC_proc= -2
##$NLEV= 6
##$NOISF1= 0
##$NOISF2= 0
##$NSP= 0
##$NTH_PI= 0
##$NZP= 0
##$OFFSET= 14.96101
##$PC= 1
##$PHC0= -81.81519
##$PHC1= 0
##$PH_mod= 1
##$PKNL= yes
##$PPARMOD= 0
##$PPDIAG= 0
##$PPIPTYP= 0
##$PPMPNUM= 2147483647
##$PPRESOL= 1
##$PSCAL= 4
##$PSIGN= 0
##$PYNMP= <proc.py>
##$REVERSE= no
##$SF= 400.020009634773
##$SI= 131072
##$SIGF1= 0
##$SIGF2= 0
##$SINO= 400
##$SIOLD= 131072
##$SPECTYP= <>
##$SREGLST= <1H.CDCl3>
##$SSB= 0
##$STSI= 131072
##$STSR= 0
##$SW_p= 8223.68421052631
##$SYMM= 0
##$S_DEV= 0
##$TDeff= 65536
##$TDoff= 0
##$TI= <>
##$TILT= no
##$TM1= 0
##$TM2= 0
##$TOPLEV= 0
##$USERP1= <user>
##$USERP2= <user>
##$USERP3= <user>
##$USERP4= <user>
##$USERP5= <user>
##$WDW= 1
##$XDIM= 131072
##$YMAX_p= 456640056
##$YMIN_p= -15610
##$CURPLOT= <Network HP LaserJet P1505>
##$CURPRIN= <$Network HP LaserJet P1505>
##$DFORMAT= <normdp>
##$LAYOUT= <+/1D_H.xwp>
##$LFORMAT= <normlp>
##$PFORMAT= <normpl>
##$SURQMSG= 1
$$ End of Bruker specific parameters
$$ ---------------------------------
##NTUPLES= NMR SPECTRUM
##VAR_NAME=  FREQUENCY,     SPECTRUM/REAL,   SPECTRUM/IMAG
##SYMBOL=    X,             R,               I
##VAR_TYPE=  INDEPENDENT,   DEPENDENT,       DEPENDENT
##VAR_FORM=  AFFN,          ASDF,            ASDF
##VAR_DIM=   131072,        131072,          131072
##UNITS=     HZ,            ARBITRARY UNITS, ARBITRARY UNITS
##FACTOR=    0.0627417313425164, 1,          1
##FIRST=     8223.62146879497, 1347,         -60549
##LAST=      0,             2621,            -60957
##MIN=       0,             -15610,          0
##MAX=       8223.62146879497, 456640056,    0
$$ Real data points
##PAGE= N=1
##DATA TABLE= (X++(R..R)), XYDATA
$$ [...]
63944A300668J27352J42140J57404J71539J83447J93261K01485K07967K11839
63935B897102K11994K07404J97341J81767J61401J37248J10002Q0035M7922J4772
63925D246988j8164n0213q1337j11130j38033j60110j76673j88531j96480k00234
63915B926083j99313j94313j86575j76994j65895j53799j41402j28846j15793
63906A463153j02477q9985p9262p0279o2333n4830m7598m0882l5153l0672k7206
63895H22476k4365k2045k0164j8304j6269j4723j4414j4807j4431j2796j0902
63884F39256r551q169n977l391j314L31K382N039P686R974J2239J4784J7422J9883
63870G00594K2110K4024K5460K6419K7016K7171K6738K5975K5385K4959K3988
$$ y = [1300668, 1428020, 1570160, 1727564, 1899103, 2082550, 2275811, 2477296, 2685263, 2897102, 3109096, 3316500, 3513841, 3695608, 3857009, 3994257, 4104259, 4184294, 4232216, 4246988, 4228824, 4178611, 4097274, 3986144, 3848111, 3688001, 3511328, 3322797, 3126317, 2926083, 2726770, 2532457, 2345882, 2168888, 2002993, 1849194, 1707792, 1578946, 1463153, 1360676, 1270691, 1191429, 1121150, 1058817, 1003987, 956389, 915507, 880354, 849682, 822476, 798111, 776066, 755902, 737598, 721329, 706606, 692192, 677385, 662954, 650158, 639256, 629705, 621536, 615559, 612168, 610854, 611185, 613567, 618606, 626292, 636266, 648505, 663289, 680711, 700594, 722704, 746728, 772188, 798607, 825623, 852794, 879532, 905507, 930892, 955851, 979839]
63859I79839K1915J9045J6119J3444J0709P513L804j98m295q431j2595j6649k0202
63846A010018k2740k4079k4754k5787k7748l0112l1787l2356l2418l2573l2507
63835F93157l1566k9894k8388k7569k7054k6195k4721k2642k0141j7766j6171
63824D21050j5372j4669j3602j2571j2082j1885j1274j0077q777p875p449p275
63812B88142o976o228n072l940l139k520j866j384j454k024k609k758k402j823
63798B43947j517j786k277k294j745j410j844k553k682k212j741j515j355j360
63784B17656j775k260k113j396j018j465k156k336k001j490q15N2O88O72K89K01
63768B00733N57R21J072J263J606J658R73k49j307j700j408o48L04R96R64K89
$$ y = [979839, 1001754, 1020799, 1036918, 1050362, 1061071, 1068584, 1072388, 1072190, 1067895, 1059464, 1046869, 1030220, 1010018, 987278, 963199, 938445, 912658, 884910, 854798, 823011, 790655, 758237, 725664, 693157, 661591, 631697, 603309, 575740, 548686, 522491, 497770, 475128, 454987, 437221, 421050, 405678, 391009, 377407, 364836, 352754, 340869, 329595, 319518, 310741, 302866, 295417, 288142, 281166, 274938, 269866, 265926, 262787, 260267, 258401, 257017, 255563, 253539, 250930, 248172, 245770, 243947, 242430, 240644, 238367, 236073, 234328, 232918, 231074, 228521, 225839, 223627, 221886, 220371, 219016, 217656, 215881, 213621, 211508, 210112, 209094, 207629, 205473, 203137, 201136, 199646, 198831, 198883, 199571, 200243, 200532, 200733, 201290, 202211, 203283, 204546, 206152, 207810, 208783, 208534, 207227, 205527, 204119, 203471, 203775, 204771, 205735, 206024]
63752B06024k34O3Q55J164O07k34p35r36r97o02N19J780K279K013J887K407L024
63735B18884K978K247J362O99L54L89Q11J363J713J813J916K275K945L833M726
63720B48308N328N396M915M172L592L462L639L641L051J872L55j344l072m382
63706B78933m729m089l065k247j680j154p07n49o22n88k72J53N05Q84J463K137
63690B64373K558K568K423K522K963L448L625L435L143L001K883K332J044o04
63676B99714j747j885j424j132j224j209o18M72J619K469K883K892K635K157J318
63661C06920J27r95j609j923k531l405l807l322k450j859j675j847k536l551l943
63646B71594l047j553p84j048j471j359r68q35r97j037n06P56K334L349L309K757
$$ y = [206024, 205790, 205853, 206708, 207872, 208479, 208245, 207510, 206574, 205577, 204975, 205494, 207274, 209553, 211566, 213453, 215860, 218884, 221862, 224109, 225471, 226170, 226524, 226913, 227724, 229087, 230800, 232613, 234529, 236804, 239749, 243582, 248308, 253636, 259032, 263947, 268119, 271711, 275173, 278812, 282453, 285504, 287376, 287731, 286387, 283315, 278933, 274204, 270115, 267050, 264803, 263123, 261969, 261262, 260713, 260091, 259503, 259231, 259384, 259889, 260773, 262236, 264373, 266931, 269499, 271922, 274444, 277407, 280855, 284480, 287915, 291058, 294059, 296942, 299274, 300318, 299714, 297967, 296082, 294658, 293526, 292302, 291093, 290475, 290947, 292566, 295035, 297918, 300810, 303445, 305602, 306920, 307047, 306052, 304443, 302520, 299989, 296584, 292777, 289455, 287005, 285146, 283471, 281624, 279088, 275537, 271594, 268547, 266994, 266210, 265162, 263691, 262332, 261364, 260529, 259532, 258495, 257989, 258745, 261079, 264428, 267737, 270494]
63630B70494K595K959L307L471L833M536N314O200P511Q961R674R480R426J0440
63616C58201J2175J3726J4954J6393J8296K0394K2439K4340K5908K6981K7719
63605E81526K8397K8837K8396K6436K2720J7476J1414N528O15l012n354o549o946
63592G29484p062p140p041o818p114q623j1297j4446j7446k0089k2274k3751k4250
63579E52133k3704k2266k0180j7634j4820j2115j0025q604p128m815j923M37J649
63566D11005K246K977L893M748N723P124Q683R774J0182J0208J0242J0647J1828
63553E09280J3784J5848J7431J8965K1475K5264K9674L4144L8622M2450M3607
63542H10544L9956L1281J9730Q223j337q435j3145j5443j5322j3277j0352p609
$$ y = [270494, 273089, 276048, 279355, 282826, 286659, 291195, 296509, 302709, 310220, 319181, 328855, 338335, 347761, 358201, 370376, 384102, 399056, 415449, 433745, 454139, 476578, 500918, 526826, 553807, 581526, 609923, 638760, 667156, 693592, 716312, 733788, 745202, 750730, 751345, 748333, 742979, 736430, 729484, 722422, 715282, 708241, 701423, 694309, 685686, 674389, 659943, 642497, 622408, 600134, 576383, 552133, 528429, 506163, 485983, 468349, 453529, 441414, 431389, 422785, 415657, 410842, 408919, 409356, 411005, 413251, 416228, 420121, 424869, 430592, 437716, 446399, 456173, 466355, 476563, 486805, 497452, 509280, 523064, 538912, 556343, 575308, 596783, 622047, 651721, 685865, 724487, 766937, 810544, 850500, 881781, 901511, 909734, 908397, 899962, 886817, 871374, 856052, 842775, 832423, 824814]
63530H24814n579m234l490l641n298q864j3995j9601k4475k7944k9915l0553l0180
63517F17045k9348k8500k7539k5998k3791k1443j9437j7699j5917j4054j2283
63506C81036j0750r562q784q171p232n835m462l632l368l437l734m063l909k976
63492C01121j724q51m94l05j54j97l40k24K89R59J514J835J941K110K789L975
63476C12244M906M921M380M067L913L139J681M81N6l67j695l575m834m903m276
63461C20138l685l420l399l445l460l453l396l005j934m13P13R19P78J366K953
63446B97257M712N778O200O707P819R508J1518J3718J6047J8399K0855K3911K7998
63433D70427L2503L5509L4989L0488K3404J5667Q419K066k882n565n468k949J094
$$ y = [824814, 819235, 815001, 811511, 807870, 802572, 793708, 779713, 760112, 735637, 707693, 677778, 647225, 617045, 587697, 559197, 531658, 505660, 481869, 460426, 440989, 423290, 407373, 393319, 381036, 370286, 360724, 351940, 343769, 336537, 330702, 326240, 322608, 319240, 315803, 312069, 308006, 304097, 301121, 299397, 298546, 298052, 297747, 297593, 297396, 297056, 296832, 297121, 298080, 299594, 301429, 303370, 305480, 308269, 312244, 317150, 322071, 326451, 330518, 334431, 337570, 339251, 339732, 339788, 339421, 337726, 334151, 329317, 324414, 320138, 316453, 313033, 309634, 306189, 302729, 299276, 295880, 292875, 290941, 290528, 291241, 292160, 292938, 294304, 297257, 301969, 307747, 313947, 320654, 328473, 337981, 349499, 363217, 379264, 397663, 418518, 442429, 470427, 502930, 538439, 573428, 603916, 627320, 642987, 651406, 653472, 650590, 645025, 639557, 636608, 637702]
63420F37702N932J1280J6949K2578K7675L1751L4348L5208L4526L2754K9824K4884
63408I45411J7407Q469L09n519r011j0694j0664r175p408o704p386r078j1866
63395H84091j6183k1576k6573l0038l1977l2879l2944l2254l0988k9118k6472
63384E73089k3384k0752j9029j7698j6011j3830j1363q687o005l803k204n70J655
63371D31408M057N801O761P490Q340R328J0647J2567J4832J6852J8542K0377K2615
63358E89617K5010K7423L0009L2593L4451L5020L4411L2879L0247K6162K0676
63347I18498J4239P432R86m226p673r534j0296j0192r375q440q340r658j2262
63334H51159j5671j9488k3370k6857k9380l0491l0042k8257k5612k2592j9492
$$ y = [637702, 643634, 654914, 671863, 694441, 722116, 753867, 788215, 823423, 857949, 890703, 920527, 945411, 962818, 971287, 971596, 966077, 957066, 946372, 935708, 926533, 919125, 912421, 905035, 895957, 884091, 867908, 846332, 819759, 789721, 757744, 724865, 691921, 659667, 628679, 599561, 573089, 549705, 528953, 509924, 492226, 476215, 462385, 451022, 442335, 436330, 432527, 430323, 429753, 431408, 435465, 441266, 448027, 455517, 463857, 473185, 483832, 496399, 511231, 528083, 546625, 567002, 589617, 614627, 642050, 672059, 704652, 739103, 774123, 808534, 841413, 871660, 897822, 918498, 932737, 940169, 941155, 936929, 929256, 919722, 909426, 899234, 889859, 881419, 873079, 863421, 851159, 835488, 816000, 792630, 765773, 736393, 705902, 675860, 647603, 621991, 599399, 579907]
63323E79907j6399j3191r509n106n81K381K047j867p922j4154j9201k2218k2518
63310D51669k0104j6407j3594j2659j2513j1436r190p167o504o648o191m734l308
63297C21214k900l181l055k144j133p58j039j621k382l267l908l875l214k314
63283B86423j411n75p9k04p27j075j056r71r05n14K39P74O93L91L92M64J15m07
63265B81567k62Q15K190L143L483L340K885K427K338K643L007L183L219L220L297
63250C20495L718M619N527N736N326N232O066P396Q581R700J1167J2798J4054
63237D20415J4963J6195J8134K0358K2138K3113K3430K3538K3956K4950K6263
63226F57453K7197K7100K5865K4106K2786K2425K2644K2686K2483K2752K3869
$$ y = [579907, 563508, 550317, 540808, 535702, 535121, 537502, 539549, 537682, 529760, 515606, 496405, 474187, 451669, 431565, 415158, 401564, 388905, 376392, 364956, 355766, 348599, 342095, 335447, 329256, 324522, 321214, 318314, 315133, 312078, 309934, 308801, 308043, 307004, 305383, 303001, 299734, 295826, 291951, 288737, 286423, 285012, 284437, 284358, 284154, 283427, 282352, 281296, 280325, 279420, 278906, 279145, 279919, 280612, 281003, 281395, 281859, 281974, 281567, 281305, 282120, 284310, 287453, 290936, 294276, 297161, 299588, 301926, 304569, 307576, 310759, 313978, 317198, 320495, 324213, 328832, 334359, 340095, 345421, 350653, 356719, 364115, 372696, 382396, 393563, 406361, 420415, 435378, 451573, 469707, 490065, 512203, 535316, 558746, 582284, 606240, 631190, 657453, 684650, 711750, 737615, 761721, 784507, 806932, 829576, 852262, 874745, 897497, 921366]
63215I21366K5120K5436K4519K2729K0167J6570J1973O800J218n021j1818j8331
63203A040728k3620k7423l0110l2083l3493l4216l3838l1979k8780k4978k1256
63192G18952j7755j4368j1180q252n212j573K543O408R542J2136J4499J6431J7553
63179G39724J8058J8667J9768K0946K1584K1657K1654K1851K1997K1723K0927
63168I68556J9647J7875J5689J3353J0952Q046M051j125p003j3053j8965k4425
63156I93598k9064l2754l5617l7575l8203l7364l5709l4081l2521l0358k7293
63145F23059k3977k1245j9219j7441j5603j3765j1978j0198q589p478o855o241
63133D60470n223l967k914k257j888j713j711j721j452p63K06J173J873K169K123
$$ y = [921366, 946486, 971922, 996441, 1019170, 1039337, 1055907, 1067880, 1074680, 1075898, 1070877, 1059059, 1040728, 1017108, 989685, 959575, 927492, 893999, 859783, 825945, 793966, 765186, 740208, 718952, 701197, 686829, 675649, 667397, 662185, 660612, 663155, 669563, 679105, 691241, 705740, 722171, 739724, 757782, 776449, 796217, 817163, 838747, 860404, 882058, 903909, 925906, 947629, 968556, 988203, 1006078, 1021767, 1035120, 1046072, 1054118, 1058169, 1057044, 1050041, 1036988, 1018023, 993598, 964534, 931780, 896163, 858588, 820385, 783021, 747312, 713231, 680710, 650352, 623059, 599082, 577837, 558618, 541177, 525574, 511809, 499831, 489633, 481044, 473566, 466711, 460470, 455247, 451280, 448366, 446109, 444221, 442508, 440797, 439076, 437624, 436861, 437067, 438240, 440113, 442282, 444405]
63118D44405J929J743J695K029K935M037M482L908L022K762L092L248K928K591
63104D84806K550K544K309J914J326L83n72o85K13J088R06j30j092j533j550j123
63088D91354k03P58J153R83P56P74J124K065L608M945N144M463M143M796N811
63073E31674O480O899P411Q034Q750R716J0750J1338J1539J2213J3830J5740J7252
63060F71626J8693K0668K2844K4530K6085K8629L2429L6563M0294M3869M7655
63049A013885N1316N4327N6688N8626O0046O0743O0842O0596N9962N8801N7350
63038A653182N6125N5437N5292N5567N5990N6092N5571N4567N3161N0618M5721
63027B247323L8004K8176J7104M928q363k1986l4746m6240n6819o6289p3431p7288
$$ y = [444405, 446334, 448077, 449772, 451801, 454736, 458773, 463255, 467163, 470185, 472947, 476039, 479287, 482215, 484806, 487356, 489900, 492209, 494123, 495449, 495832, 495260, 494575, 494788, 495876, 496782, 496652, 495560, 494027, 492477, 491354, 491151, 491909, 493062, 494045, 494801, 495575, 496699, 498764, 502372, 507317, 512461, 516924, 521067, 525863, 531674, 538154, 545053, 552464, 560498, 569248, 578964, 589714, 601052, 612591, 624804, 638634, 654374, 671626, 690319, 710987, 733831, 758361, 784446, 813075, 845504, 882067, 922361, 966230, 1013885, 1065201, 1119528, 1176216, 1234842, 1294888, 1355631, 1416473, 1477069, 1537031, 1595832, 1653182, 1709307, 1764744, 1820036, 1875603, 1931593, 1987685, 2043256, 2097823, 2150984, 2201602, 2247323, 2285327, 2313503, 2330607, 2335535, 2327172, 2305186, 2270440, 2224200, 2167381, 2101092, 2027661, 1950373]
63015A950373p8224p7184p4384o9629o3457n7014n0643m3555l5224k6413j8321
63004A356325j1227m491K415R412J6072K1908K6479K9733L2176L4411L6389L7522
62992A587124L7557L7118L7169L8006L8904L8800L7334L5099L2731K9901K5541
62981A975284J9017J0749J569q020j7789k7489l6960m6191n4845o2137o7541p1301
62969A614346p3670p4109p1996o7913o3383n9310n5397n1235m7045m3098l9142
62958I68048l5009l1256k8608k7020k5768k4338k2733k1123j9599j8282j7326
62947F96986j6731j6337j6008j5686j5296j4657j3562j1901r867q034p013o940
62935E44954p423p977q327q289p659o466n063l863l103k852k951k958k522j872
$$ y = [1950373, 1872149, 1794965, 1720581, 1650952, 1587495, 1530481, 1479838, 1436283, 1401059, 1374646, 1356325, 1345098, 1340607, 1343022, 1352434, 1368506, 1390414, 1416893, 1446626, 1478802, 1513213, 1549602, 1587124, 1624681, 1661799, 1698968, 1736974, 1775878, 1814678, 1852012, 1887111, 1919842, 1949743, 1975284, 1994301, 2005050, 2006619, 1998599, 1980810, 1953321, 1916361, 1870170, 1815325, 1753188, 1685647, 1614346, 1540676, 1466567, 1394571, 1326658, 1263275, 1203965, 1148568, 1097333, 1050288, 1007190, 968048, 933039, 901783, 873175, 846155, 820387, 796049, 773316, 752193, 732594, 714312, 696986, 680255, 663918, 647910, 632224, 616928, 602271, 588709, 576808, 566941, 558907, 551894, 544954, 537531, 529554, 521227, 512938, 505279, 498813, 493750, 489887, 486784, 483932, 480981, 478023, 475501, 473629]
62921D73629j575j692j679j304j014j105j128o63j44k61q68j240j162j035j070
62906D57689j101j174j524j976k052j760j550j424r38k43k02j033j693j311m52
62891D39256j67m01l17J73K89k40p24o16k14R3N20J307K006J950J180L78Qm3k7
62872D44411N9L49Q22J194J072L60m43n92L6O36L99m36q90n29J14M75P54J376
62854D49167K111K277J678Q46L30K24M56J103K108K956K980K010N75n15p95m19
62838D67092R6L75M77N68N09pr21j722j967j585o49P71K309L273L254K596J921
62821D76390J448J078Q75J056J599K314L138M004M531M341L668L158L068L133
62807E13801L179L384L853M473N296O523P933Q890R136R091R135R181R252R872
$$ y = [473629, 472054, 470362, 468683, 467379, 466365, 465260, 464132, 463469, 463325, 463064, 462196, 460956, 459794, 458759, 457689, 456588, 455414, 453890, 451914, 449862, 448102, 446552, 445128, 444190, 443947, 443745, 442712, 441019, 439708, 439256, 439089, 438688, 438371, 438544, 438833, 438593, 437869, 437253, 437039, 437132, 437652, 438959, 440965, 442915, 444095, 444473, 444481, 444438, 444411, 444470, 444819, 445641, 446835, 447907, 448267, 447824, 447232, 447268, 447904, 448303, 447867, 446977, 446448, 446562, 447037, 447791, 449167, 451278, 453555, 455233, 456079, 456409, 456633, 457089, 458192, 460300, 463256, 466236, 468246, 468821, 468306, 467511, 467092, 467188, 467563, 468040, 468608, 469117, 469110, 468189, 466467, 464500, 462915, 462266, 463037, 465346, 468619, 471873, 474469, 476390, 477838, 478916, 479791, 480847, 482446, 484760, 487898, 491902, 496433, 500774, 504442, 507600, 510668, 513801, 516980, 520364, 524217, 528690, 533986, 540509, 548442, 557332, 566468, 575559, 584694, 593875, 603127, 612999]
62793F12999J1385J3367J5255J7184J9581K2366K5188K8226L2026L6698M1914
62782H76189M7568N3710N9928O5621P1065P7327Q4713R1948R7449J00882J02849
62771A729249J03332J01238R5608Q6722P5616O2847M8144L1299J3008n429k3025
62760B318609l9371n4045o6389p6047q3393q8976r2829r4632r4368r2437q9292
62749A446830q5287q0726p5663o9867o3444n7301n2349m8360m4277l9638l5109
62738G94809l1420k8430k5580k2652j9832j7359j5412j3989j2668j0937q954p405
62726E80171o423n233l375j579p62o52k26P87J701K199K933M593O923R104J0698
62711F00859J1972J3440J5396J7814K0512K3409K6512K9735L2923L6224M0126
$$ y = [612999, 624384, 637751, 653006, 670190, 689771, 712137, 737325, 765551, 797577, 834275, 876189, 923757, 977467, 1037395, 1103016, 1174081, 1251408, 1336121, 1428069, 1525518, 1626400, 1729249, 1832581, 1933819, 2029427, 2116149, 2191765, 2254612, 2302756, 2334055, 2347063, 2341634, 2318609, 2279238, 2225193, 2158804, 2082757, 1999364, 1910388, 1817559, 1722927, 1628559, 1536122, 1446830, 1361543, 1280817, 1205154, 1135287, 1071843, 1014542, 962193, 913833, 869556, 829918, 794809, 763389, 734959, 709379, 686727, 666895, 649536, 634124, 620135, 607467, 596530, 587576, 580171, 573748, 568515, 565140, 563561, 562799, 562147, 561921, 562708, 564409, 566608, 569541, 574134, 581057, 590161, 600859, 612831, 626271, 641667, 659481, 679993, 703402, 729914, 759649, 792572, 828796, 868922]
62700H68922M4846M9957N4959O0019O5614P1538P6932Q1251Q4587Q6801Q7022
62689A632448Q4464P9326P2252O3263N1781L7729K2014N792j0336k6150m1178
62678A971405n4572o5563p3813p9374q2524q3656q3186q1421p8570p4854p0537
62667A143335o5837o0922n6034n1421m7105m2788l8250l3696k9610k6276k3592
62656F67804k1282j9166j7263j5787j4900j4315j3430j2064j0849j0384j0257
62645E08107r573q349p544p467p100n553l482k193j863j575q33j31R0K9q5m73
62629D52005j205j756j662j180q27n68m7O42R69Q37Q20J347K029K188J891J991
62613D57474L084M738O054O710P084P474P722P809Q216R337J0850J2185J3351
$$ y = [868922, 913768, 963725, 1018684, 1078703, 1144317, 1215855, 1292787, 1374038, 1458625, 1545426, 1632448, 1716912, 1796238, 1868490, 1931753, 1983534, 2021263, 2043277, 2049069, 2038733, 2012583, 1971405, 1916833, 1851270, 1777457, 1698083, 1615559, 1531903, 1448717, 1367296, 1288726, 1213872, 1143335, 1077498, 1016576, 960542, 909121, 862016, 819228, 780978, 747282, 717672, 691396, 667804, 646522, 627356, 610093, 594306, 579406, 565091, 551661, 539597, 528748, 518364, 508107, 498534, 490185, 482641, 475174, 468074, 462521, 459039, 456846, 454983, 453408, 452575, 452444, 452534, 452563, 452478, 452005, 450800, 449044, 447382, 446202, 445375, 444807, 444760, 445402, 446371, 447208, 448028, 449375, 451404, 453592, 455483, 457474, 460558, 465296, 471350, 478060, 485144, 492618, 500340, 508149, 516365, 525702, 536552, 548737, 562088]
62600E62088J4839J6818J9056K1589K4877K9067L3564L7679M1271M4474M7051
62589H92373M8458M8488M7534M6128M4268M1249L6190K8796J9634R642m55j0148
62577A252157j8832k6003l1770l6711m1064m4352m6088m6404m5847m4723m2933
62566H27430m0333l7061l3644l0777k8785k7191k5132k2372j9570j7406j5779
62555E29380j4149j2298j0369q529p019o236o207o164n301l864k874k726k745
62542D40899k322j756j573j553j128l78J7k20n53l59L65J143J585J692J849K593
62526D40301M096N818P041P876R342J2085J5379J7908J9412K0904K3266K6339
62514F09767K9598L3141L7302M1670M5153M7110M7962M8487M8810M8239M5845
$$ y = [562088, 576927, 593745, 612801, 634390, 659267, 688334, 721898, 759577, 800848, 845322, 892373, 940831, 989319, 1036853, 1082981, 1127249, 1168498, 1204688, 1233484, 1253118, 1262760, 1262305, 1252157, 1233325, 1207322, 1175552, 1138841, 1097777, 1053425, 1007337, 960933, 915086, 870363, 827430, 787097, 750036, 716392, 685615, 656830, 629639, 604507, 582135, 562565, 545159, 529380, 515231, 502933, 492564, 484035, 477016, 470780, 464573, 458409, 453108, 449244, 446370, 443644, 440899, 438577, 436821, 435248, 433695, 432567, 432189, 432206, 431986, 431433, 431074, 431439, 432582, 434167, 435859, 437708, 440301, 444397, 450215, 457256, 465132, 474474, 486559, 501938, 519846, 539258, 560162, 583428, 609767, 639365, 672506, 709808, 751478, 796631, 843741, 891703, 940190, 989000, 1037239, 1083084]
62503A083084M1194L4659K7119J9235J0962J992p368j6040k3015k8098l1656l3889
62491A078179l4598l3619l1170k7725k3675j9202j4436r626n082r05L066P003
62479H88210J0890J4629J8139K1082K2616K1870J8779J4162Q961L695j318n805
62467A035910r964j4653k0522k6985l2461l5806l7197l7607l7691l7324l6025
62456G09675l3620l0502k7369k4727k2558k0481j8143j5472j2669j0075p963o336
62444D79760m902l396j880o00M37J548K937M296N009M774L975L337L221L255K694
62429E04465J164r48k888m246n254o333p480q259q374q063p783p678p547p276
62415D23500o992o728o246n336m139k983k103j605j605k035k529k722k634k517
$$ y = [1083084, 1124278, 1158937, 1186056, 1205291, 1216253, 1218245, 1210877, 1194837, 1171822, 1143724, 1112068, 1078179, 1043581, 1009962, 978792, 951067, 927392, 908190, 893754, 884128, 879046, 878141, 881207, 888210, 899100, 913729, 931868, 952950, 975566, 997436, 1016215, 1030377, 1039338, 1043033, 1041715, 1035910, 1025946, 1011293, 990771, 963786, 931325, 895519, 858322, 820715, 783024, 745700, 709675, 676055, 645553, 618184, 593457, 570899, 550418, 532275, 516803, 504134, 494059, 486096, 479760, 474858, 471462, 469582, 468982, 469419, 470967, 473904, 478200, 483209, 487983, 491958, 495295, 498516, 501771, 504465, 505629, 504681, 501793, 497547, 492293, 485960, 478480, 470221, 461847, 453784, 446001, 438323, 430776, 423500, 416508, 409780, 403534, 398198, 394059, 391076, 388973, 387368, 385763, 383728, 381199, 378477, 375843, 373326]
62401C73326k435k193j674r69k27M41R04J106J180J302J448J505J508J577J706
62386C78505J886K230K661K768K336J889K090K853L632M473N838P386P986P408
62372D33941O967P768R120R597R090Q771R329J0370J1530J3126J5376J7803J9952
62359E82740K2226K5542L0271L5817M1134M5496M8886N1632N3607N3983N2035
62348A043369M7986M2674L6511K9237K0824J2102M216k306p828j3133j8728k4419
62336A170505k9480l3379l6191l8123l8880l8006l5769l3050l0308k7236k3691
62325H06392k0356j8001j6592j5590j4873j4732j5125j5508j5545j5574j6126
62314F28370j7209j8205j8432j7716j6442j5031j3513j1707r855q664q527q880
$$ y = [373326, 370891, 368698, 367024, 366055, 365828, 366269, 367173, 368279, 369459, 370761, 372209, 373714, 375222, 376799, 378505, 380391, 382621, 385282, 388050, 390386, 392275, 394365, 397218, 400850, 405323, 411161, 418547, 426533, 433941, 440908, 448676, 457796, 467393, 476483, 485254, 494583, 504953, 516483, 529609, 544985, 562788, 582740, 604966, 630508, 660779, 696596, 737730, 783226, 832112, 883744, 937351, 991334, 1043369, 1091355, 1134029, 1170540, 1199777, 1220601, 1232703, 1236919, 1234613, 1226785, 1213652, 1194924, 1170505, 1141025, 1107646, 1071455, 1033332, 994452, 956446, 920677, 887627, 857319, 830083, 806392, 786036, 768035, 751443, 735853, 720980, 706248, 691123, 675615, 660070, 644496, 628370, 611161, 592956, 574524, 556808, 540366, 525335, 511822, 500115, 490260, 481596, 473069, 464189]
62302D64189q747p780o441n252m287l492l002k800k434j498k69O00R66J277J752
62287D22782K025J884J831K388L189L392K865K343K375K831L489M410N375N663
62273D66842M991M095L865M333N148O448Q405J0214J0772J0382J0758J2976J6371
62260E75600J9845K3362K7455L1977L6330M0561M5367N0943N6457O0756O3096
62249A031749O3199O1042N6863N1033M3872L5665K6821J7836R112R90o273j2879
62237A379030j9642k7239l5286m2570m8177n2067n4457n5250n4381n2321m9783
62226H87857m7029m3802l9917l5658l1610k8202k5419k2830k0004j7004j4419
62215E61963j2758j1931j1425j0890j0263r383p938n914l945k902l104m012m667
$$ y = [464189, 455442, 447662, 441221, 435969, 431682, 428190, 425188, 422388, 419954, 418456, 418187, 418787, 419753, 421030, 422782, 424807, 426691, 428522, 430910, 434099, 437491, 440356, 442699, 445074, 447905, 451394, 455804, 461179, 466842, 471833, 475928, 479793, 484126, 489274, 495722, 504127, 514341, 525113, 535495, 546253, 559229, 575600, 595445, 618807, 646262, 678239, 714569, 755130, 800497, 851440, 907897, 968653, 1031749, 1094948, 1155990, 1212853, 1263886, 1307758, 1343423, 1370244, 1388080, 1397192, 1398182, 1391909, 1379030, 1359388, 1332149, 1296863, 1254293, 1206116, 1154049, 1099592, 1044342, 989961, 937640, 887857, 840828, 797026, 757109, 721451, 689841, 661639, 636220, 613390, 593386, 576382, 561963, 549205, 537274, 525849, 514959, 504696, 495313, 487375, 481461, 477516, 474614, 471510, 467498, 462831]
62202D62831m406l304k007j144p97n07K41J572L183M614N514N844N962O377P267
62187D91240Q302R054R514J0008J0686J1327J1640J1529J1005J0017Q524O648
62175F09494M778L455L128L770M849N902P108R065J2052J5814K0123K5003L0258
62162G54799L5130L8824M1094M2023M1407L8841L4251K8083K1014J3811P331K194
62150A098802j721n199r015j3439j8257k2972k6959k9734l1177l1439l0707k9217
62138H48966k7358k5314k2720j9114j4801j0818p815n447l117r55M67J187J984
62125G15145L406N086O364P338Q854J1304J3834J4997J4114J1689Q550N103J635
62112H27419j120k388k267j809k122l611o077r040j1900j4118j5508j6106j5711
$$ y = [462831, 458425, 455121, 453114, 451970, 451173, 450666, 450907, 452479, 455662, 460276, 465790, 471634, 477596, 483973, 491240, 499542, 508596, 518110, 528118, 538804, 550131, 561771, 573300, 584305, 594322, 602846, 609494, 614272, 617727, 620855, 624625, 629474, 635376, 642484, 651549, 663601, 679415, 699538, 724541, 754799, 789929, 828753, 869847, 911870, 953277, 992118, 1026369, 1054452, 1075466, 1089277, 1096608, 1098802, 1097081, 1091882, 1082867, 1069428, 1051171, 1028199, 1001240, 971506, 940329, 908890, 878183, 848966, 821608, 796294, 773574, 754460, 739659, 728841, 721026, 715579, 712462, 711507, 711974, 713161, 715145, 718551, 723637, 730001, 737339, 746193, 757497, 771331, 786328, 800442, 812131, 820681, 825784, 827419, 826299, 823911, 821644, 819835, 817713, 814102, 808025, 798985, 787085, 772967, 757459, 741353, 725642]
62099G25642j3883j0685p076m200k314p29J235L457N271O281O749P154P528P483
62085G31913O923O443O738P723Q510Q357P441O748P293R389J2410J5287J7358
62072H52533J8737J9766K0404K0462K0154J9902J9700J9264J8765J8833J9711
62061A068231K1020K2454K3967K5006K4337K1263J6591J1759P461L616L05k239
62049A243771m391p093j0833j5166j9399k3313k7056l0729l4204l7078l8809l9145
62037I56555l8489l7475l6186l4250l1716k9303k7500k5875k3696k0943j8269
62026F32853j6136j4428j2897j1509j0287r175q308q090q698r636j0141j0026
62014E03522r811r909j0001r438q079o390m890l728k805j942q41P07K436L693
$$ y = [725642, 711759, 701074, 693998, 689798, 687484, 686755, 687990, 691447, 696718, 702999, 709748, 716902, 724430, 731913, 738836, 745279, 752017, 759740, 768250, 776607, 784048, 790796, 798089, 807478, 819888, 835175, 852533, 871270, 891036, 911440, 931902, 952056, 971958, 991658, 1010922, 1029687, 1048520, 1068231, 1089251, 1111705, 1135672, 1160678, 1185015, 1206278, 1222869, 1234628, 1242089, 1245705, 1246010, 1243771, 1239380, 1232287, 1221454, 1206288, 1186889, 1163576, 1136520, 1105791, 1071587, 1034509, 995700, 956555, 918066, 880591, 844405, 810155, 778439, 749136, 721636, 695761, 672065, 651122, 632853, 616717, 602289, 589392, 577883, 567596, 558421, 550113, 542023, 533325, 523689, 513548, 503522, 493711, 483802, 473801, 464363, 456284, 449894, 445004, 441276, 438471, 436529, 435688, 436395, 438831, 442524]
62000D42524M161M312M875N914O733O634N595M197L047K317J694P71n29j928l167
61985D87150m262n315o189o562o274n538m800m464m638n067n287n012m405l969
61971D15368m096m636m914m348l145k210k166k613k665k101j518j377j334q07
61957C77438K06J119J418J086N50M23J031K023K647K640K654L490N173P021Q533
61942D17452R794J1082J2436J3710J4845J5934J7053J8165J9121J9805K0143J9944
61930F09484J8925J7150J5315J4195J3675J2789J0840Q139N421K917L44k418n111
61917G21665p411r183j0359j0774j0076p910m394l99L060N842Q653J1895J4993
61904G05602J7177J8351J8766J8262J6513J3696J0367O785K863j321n399r046
$$ y = [442524, 446685, 450997, 455872, 461786, 468519, 475153, 480748, 484945, 487992, 490309, 492003, 492774, 492245, 490317, 487150, 482888, 477573, 471384, 464822, 458548, 453010, 448210, 443746, 439108, 434041, 428754, 423742, 419337, 415368, 411272, 406636, 401722, 397374, 394229, 392019, 389853, 387240, 384575, 382474, 380956, 379579, 378245, 377438, 377644, 378763, 380181, 381267, 381817, 382240, 383271, 385294, 387941, 390581, 393235, 396725, 401898, 408919, 417452, 427246, 438328, 450764, 464474, 479319, 495253, 512306, 530471, 549592, 569397, 589540, 609484, 628409, 645559, 660874, 675069, 688744, 701533, 712373, 720512, 725933, 728850, 729194, 726776, 721665, 714254, 705071, 694712, 683938, 673862, 665952, 661558, 661159, 664219, 670061, 678714, 690609, 705602, 722779, 741130, 759896, 778158, 794671, 808367, 818734, 825519, 828382, 827061, 821662, 812616]
61892H12616j2116j4522j6288j7537j8202j8066j7316j6607j6221j5640j4563
61881F35538j3676j3665j3932j3375j2103j1298j1369j1417j0716r642q758p903
61869D97684o697n217l640j983n45%l58m34Q55L114M991N906O576P968J0329J3269
61853E31818J6294J9079K1473K3487K5308K7261K9545L1842L3296L3321L2339
61842H25063L1319L0434K8694K5091J9717J3462P028O47n424j0618j4326j6265
61830I34822j6523j5255j2445q128k983J723N174P808J0551J3394J5304J5468
61818I48910J3964J1142P091J981l705r606j5633k1401k6080k9193l1108l2375
61806H13987l3000l2692l1433k9454k7045k4658k2734k1102j9058j6307j3413
$$ y = [812616, 800500, 785978, 769690, 752153, 733951, 715885, 698569, 681962, 665741, 650101, 635538, 621862, 608197, 594265, 580890, 568787, 557489, 546120, 534703, 523987, 514345, 505587, 497684, 490987, 485770, 482130, 480147, 479602, 479602, 479244, 478810, 479665, 482779, 487770, 493676, 500252, 508220, 518549, 531818, 548112, 567191, 588664, 612151, 637459, 664720, 694265, 726107, 759403, 792724, 825063, 856382, 886816, 915510, 940601, 960318, 973780, 980808, 981455, 976031, 965413, 951087, 934822, 918299, 903044, 890599, 882471, 879488, 881211, 886385, 894193, 904744, 918138, 933442, 948910, 962874, 974016, 981107, 983088, 979383, 969777, 954144, 932743, 906663, 877470, 846362, 813987, 780987, 748295, 716862, 687408, 660363, 635705, 612971, 591869, 572811, 556504, 543091]
61795E43091j1040r323q261q021q363q376p447o007m806l982l378l147l313l256
61781D54371k519j669j535j949k098j877j903k351k697k616k328k003j568j116
61767D26142q32n56l6L85J34n93r70p11l19j03K54Q63J216R42L72k0k30m26n21
61748D24991l81j29M9P3j10n23r41j082j014j051j197j155q99o52m08QL99M09
61730D16387K88O82J538K003J700J316J461J760J556R82P43J178K065K978L535
61715D40172L559L326L269L278K791J725P22K18j16o77j339j997k904l979m482
61700D43566m063l479l564m060m228m024l818l507k906k532k914l441l048j945
61686C96037j484k213l192l415k987k526k308k366k743l163l134k646k306k410
$$ y = [543091, 532051, 522728, 514467, 506446, 498083, 489707, 482260, 476253, 471447, 467465, 464087, 460940, 457627, 454371, 451852, 450183, 448648, 446699, 444601, 442724, 440821, 438470, 435773, 433157, 430829, 428826, 427258, 426142, 425310, 424754, 424718, 425103, 425237, 424644, 423674, 422963, 422644, 422541, 422795, 423658, 424874, 425816, 426188, 426168, 425938, 425512, 424991, 424610, 424481, 424530, 424603, 424493, 423970, 423029, 421947, 420933, 419882, 418685, 417530, 416631, 415979, 415571, 415579, 415978, 416387, 416675, 417357, 418895, 420898, 422598, 423914, 425375, 427135, 428691, 429673, 430416, 431594, 433659, 436637, 440172, 443731, 447057, 450326, 453604, 456395, 458120, 458842, 459060, 458944, 458267, 456928, 454931, 452027, 448048, 443566, 439503, 436024, 432460, 428400, 424172, 420148, 416330, 412823, 409917, 407385, 404471, 401030, 397982, 396037, 394553, 392340, 389148, 385733, 382746, 380220, 377912, 375546, 372803, 369640, 366506, 363860, 361554, 359144]
61672C59144k519k238j760j358r02l54j47n25r70q43k52K02L05L47N15P06P90
61655C50141P36M97J18j43o3K62N55P06P97R12J123J529K089K546K753K944L403
61638C70905L976M104L397K074P92L1l67r80k070l210l879m130m268m117l285
61623C58973k140j698k294l016k867j926q83K3R96K033K838L177K871J747O7j395
61607C56506k252l062m403n799o300n879n285m780l972k932k411k730l304l574
61593B99823l569l271k332r46j83p11j767k134j698j281j311j416j253j037j111
61578B75803j483j862j875j330n24l9J1J90P82J064K35j233k037j762j257j060
61562B63623n09J005K669K998J689q7j108j133n19L99J229J406Q04K03N61J783
$$ y = [359144, 356625, 354387, 352627, 351269, 350367, 350013, 349866, 349341, 348371, 347528, 347276, 347478, 347783, 348130, 348645, 349351, 350141, 350877, 351374, 351492, 351349, 351286, 351548, 352103, 352809, 353606, 354518, 355641, 357170, 359259, 361805, 364558, 367502, 370905, 374881, 378985, 382382, 384456, 385248, 385279, 384912, 383932, 381862, 378652, 374773, 370643, 366375, 362258, 358973, 356833, 355135, 352841, 349825, 346958, 345032, 344149, 344172, 345168, 347201, 350039, 353216, 356087, 357834, 357901, 356506, 354254, 351192, 346789, 340990, 334690, 328811, 323526, 318746, 314774, 311842, 309431, 306701, 303397, 299823, 296254, 292983, 290651, 289705, 289522, 288811, 287044, 284910, 283212, 281931, 280620, 279204, 277951, 276914, 275803, 274320, 272458, 270583, 269253, 268729, 268690, 268701, 268891, 269673, 270737, 270972, 269739, 267702, 265940, 264683, 263623, 263114, 264119, 266788, 269786, 271475, 271388, 270280, 269147, 268628, 269027, 270256, 271662, 272466, 272669, 273230, 275013]
61546B75013K661K240R33K8K87J282K024J957J339Q28Q15J049R73M64M5K02O85
61529B92825Q64O71O19Q98J011N82Jj61k8j90q05j417j566j214n84J6K43p3o61
61510B91031j040j045r10q65q71q07o46m26k64l24o62j012j025o85k65Q2L88N71
61492B81225L78k11p58p88l43M5o8n51q69p60n65o81q31l09R45K073K392K240
61474B82564K273K368J965J200R09J400J978J845R70r0p39o15J41P62M71n22j118
61457B95762o75K32O14K56k29k30L31J026J331J112P50N56L04k32m65M03J946
61440C02792K700K111J369J739K889L662L735L575L365K974K718L007L402K992
61426C43030J781Q13P59J183J362J138P43L57J44K39N16P34R70J413J736J328
$$ y = [275013, 277674, 279914, 280847, 280875, 281162, 282444, 284468, 286425, 287764, 288592, 289407, 290456, 291429, 291893, 291938, 292140, 292825, 293689, 294360, 294979, 295877, 296888, 297470, 297471, 297310, 297282, 297092, 296287, 294870, 293304, 292090, 291506, 291522, 291765, 291692, 291031, 289991, 288946, 288036, 287171, 286300, 285493, 284847, 284421, 284157, 283833, 283171, 282159, 281134, 280449, 280184, 280266, 280654, 281225, 281603, 281392, 280634, 279846, 279503, 279548, 279480, 278929, 278060, 277300, 276735, 276054, 275223, 274914, 275859, 277932, 280324, 282564, 284837, 287205, 289170, 290370, 291279, 292679, 294657, 296502, 297472, 297382, 296643, 296028, 296169, 296931, 297402, 296880, 295762, 295087, 295319, 295933, 296189, 295960, 295730, 296061, 297087, 298418, 299530, 300280, 300836, 301140, 300908, 300443, 300846, 302792, 305492, 307603, 308972, 310711, 313600, 317262, 320997, 324572, 327937, 330911, 333629, 336636, 340038, 343030, 344811, 345624, 346383, 347566, 348928, 350066, 350809, 351166, 351310, 351549, 352065, 352799, 353769, 355182, 356918, 358246]
61410C58246L14l50j39K90J8r87k099k901l371l460l143k652k229j761j147p90
61394C33839j158j887k010j203k61l1l33l85L0L57J69k97n35k91M27J406K090
61377C29927J852P96k0K78J241J591Q55j26l17M26J525K359K560K075J315Q89
61361C47226R31J035J004J202J916K854L614M179M616M811M961N774P486R162
61347D00771R678R071Q096O899N087L052K103K911M548N492N136M031L062K644
61333D72581K588K432K013J503R12r9j535k694l031k968l189l491l200k473k152
61318D57197k349k234j335j29R07J857K703L047K936L179M337O065P809R445J0819
61303E04254J1468J1294J0836J0336R305P491N546M056K679R31q62k173l189m253
$$ y = [358246, 358560, 358210, 358071, 358361, 358379, 357392, 355293, 352392, 349021, 345561, 342418, 339766, 337537, 335776, 334629, 333839, 332681, 330794, 328784, 327581, 327320, 327289, 326956, 326571, 326601, 326958, 327127, 326830, 326295, 326004, 326431, 327837, 329927, 331779, 332575, 332555, 332833, 334074, 335665, 336520, 336394, 336077, 336503, 338028, 340387, 342947, 345022, 346337, 347226, 348157, 349192, 350196, 351398, 353314, 356168, 359782, 363961, 368577, 373388, 378349, 384123, 391609, 400771, 410449, 419520, 427616, 434515, 439602, 442654, 444757, 447668, 452216, 457708, 462844, 466875, 469937, 472581, 475169, 477601, 479614, 481117, 482029, 481930, 480395, 477701, 474670, 471702, 468513, 465022, 461822, 459349, 457197, 454848, 452614, 451279, 451150, 452057, 453914, 456617, 459664, 462600, 465779, 470116, 476181, 483990, 493435, 504254, 515722, 527016, 537852, 548188, 557493, 564984, 570530, 574586, 577265, 578196, 577334, 575161, 571972, 567719]
61289E67719n030n171n275o098p175p407o795o430o737o861o051m677l500k626
61275D87886j633k80J238K467L023L066L277M017M695M475L511K804K952L718
61261E25216M776O037P147P465O874O001N388N039M952N278N620M981L081J140
61247E98995N24J045J293N14p08j625k341l343m482n021m557l572k964l215m041
61232E66502m738m774m056k833j485l36M52Q82J095J338J930K991M168M829M703
61217E70668M252M195M748N495N877N716N296N075N155N001L958K180P29M90J245
61202F30080K140K764L349M138N154O478Q275J0376J2329J3894J5178J6199J6618
61189G46972J6008J4244J1651Q972P050O146N634M679L195J798Q93K69m72j448
$$ y = [567719, 562689, 557518, 552243, 546145, 538970, 531563, 524768, 518338, 511601, 504740, 498689, 494012, 490512, 487886, 486253, 485973, 487211, 489678, 492701, 495767, 499044, 503061, 507756, 512231, 515742, 518546, 521498, 525216, 529992, 536029, 543176, 550641, 557515, 563516, 568904, 573943, 578895, 584173, 589793, 594774, 597855, 598995, 599519, 600564, 601857, 602371, 601663, 600038, 597697, 594354, 589872, 584851, 580294, 576722, 573758, 570543, 566502, 561764, 556990, 552934, 550101, 548616, 548280, 548732, 549614, 550709, 552047, 553977, 556968, 561136, 565965, 570668, 574920, 579115, 583863, 589358, 595235, 600951, 606247, 611322, 616477, 621478, 625436, 627616, 628345, 628835, 630080, 632220, 634984, 638333, 642471, 647625, 654103, 662378, 672754, 685083, 698977, 714155, 730354, 746972, 762980, 777224, 788875, 797847, 804897, 811043, 816677, 821356, 824551, 826349, 827242, 827511, 827039, 825591]
61175H25591k608l848m957n715o138o445o808p329q104q994r578r693r779j0210
61161G25385j0618j0548j0510j1368j2817j3479j2718j1357j0209q909o876m573
61149F01403k976k268j849j319q68r23j911m005o602q426q771q297q036p936p107
61134E30109n306l320j867q10L55J725K937L562L519L316L840N635Q355J1179
61120E63229J3590J5518J6971J8001J8876J9873K0921K1842K2794K4011K5199
61109G80825K5717K5391K4627K3784K2843K1722K0397J8680J6324J3485J0598
61098A004393P706M411O04l290o879j0140j2981j5124j6648j8089j9558k0419
61086H93986k0312j9955k0228k0850k0841j9992j9010j8196j6928j4818j2541
$$ y = [825591, 822983, 819135, 814178, 808463, 802325, 795880, 789072, 781743, 773639, 764645, 755067, 745374, 735595, 725385, 714767, 704219, 693709, 682341, 669524, 656045, 643327, 631970, 621761, 612852, 605976, 601403, 598427, 596159, 594310, 592991, 592123, 591200, 589289, 585284, 578682, 570256, 561485, 553188, 545152, 537216, 530109, 524803, 521483, 519616, 518806, 519161, 520886, 523823, 527385, 530904, 534220, 538060, 543695, 552050, 563229, 576819, 592337, 609308, 627309, 646185, 666058, 686979, 708821, 731615, 755626, 780825, 806542, 831933, 856560, 880344, 903187, 924909, 945306, 963986, 980310, 993795, 1004393, 1012099, 1016510, 1017114, 1013824, 1006945, 996805, 983824, 968700, 952052, 933963, 914405, 893986, 873674, 853719, 833491, 812641, 791800, 771808, 752798, 734602, 717674, 702856, 690315]
61075F90315j1020j0233r447q265o940n800m903m182l543k750j616k78R43K013
61061F24294L145M327N227N646N817O080O623P614R248J1367J3353J4719J5577
61048G33037J6322J7081J7824J8739K0100K1877K3844K5906K7973K9748L1090
61037I83541L2450L4388L6840L9394M2109M5272M8432N0609N1544N1857N1804
61026A468240N0980M9802N0090N3275N8807O5247P2203Q0074Q8545R6735J04676
61015B238674J13581J24829J39914J61176J91262K31807K83889L49833M33137
61006D268102N36550O61782Q11479R89766J200036J441736J703176J945576K089574
60997A5647777K033339J713948J172194N56179M6406k38029k77225j23496J35122
$$ y = [690315, 679295, 669062, 659615, 651350, 644410, 638610, 633707, 629525, 625982, 623232, 621616, 621338, 622281, 624294, 627439, 631766, 636993, 642639, 648456, 654536, 661159, 668773, 678021, 689388, 702741, 717460, 733037, 749359, 766440, 784264, 803003, 823103, 844980, 868824, 894730, 922703, 952451, 983541, 1015991, 1050379, 1087219, 1126613, 1168722, 1213994, 1262426, 1313035, 1364579, 1416436, 1468240, 1519220, 1569022, 1619112, 1672387, 1731194, 1796441, 1868644, 1948718, 2037263, 2133998, 2238674, 2352255, 2477084, 2616998, 2778174, 2969436, 3201243, 3485132, 3834965, 4268102, 4804652, 5466434, 6277913, 7267679, 8467715, 9909451, 11612627, 13558203, 15647777, 17681116, 19395064, 20567258, 21123437, 21169843, 20931814, 20654589, 20531093, 20666215]
60988B0666215L82615M81048L18120j20424p23543j311971j736786j940767j949819
60979A4064688j826629j633080j416186j206282j018118q55175p16281n99563
60971D793374n02375m21161l53130k97269k53001k18705j91966j70534j52672
60962B232561j37306j24134j13057j03188r3174q2645p2614o4008n6659n0154
60952A335622m4889m1474l9695l8705l7863l6713l4657l1537k8238k5828k4231
60941I51792k2503k0342j8504j7609j7371j7270j7280j7616j8221j8814j9154
60930G47108j8963j8014j6493j5006j4038j3613j3483j3293j2623j1365j0136
60919E90081r641r515q541o396m317l523l767m120m434m930m929l439r25Q51J064
$$ y = [20666215, 21048830, 21529878, 21847998, 21727574, 21004031, 19692060, 17955274, 16014507, 14064688, 12238059, 10604979, 9188793, 7982511, 6964393, 6109218, 5392937, 4793374, 4290999, 3869838, 3516708, 3219439, 2966438, 2747733, 2555767, 2385233, 2232561, 2095255, 1971121, 1858064, 1754876, 1661702, 1579057, 1506443, 1442435, 1385776, 1335622, 1290733, 1249259, 1209564, 1170859, 1132996, 1096283, 1061626, 1030089, 1001851, 976023, 951792, 929289, 908947, 890443, 872834, 855463, 838193, 820913, 803297, 785076, 766262, 747108, 728145, 710131, 693638, 678632, 664594, 650981, 637498, 624205, 611582, 600217, 590081, 580440, 570925, 562384, 555988, 551671, 548148, 544381, 540261, 535827, 530897, 525968, 522529, 521604, 522455, 523519]
60904E23519P35J020J669J898J814K021K439K509K174J746J090q1j223j316m51
60889E39563p7j197l020m012l803l386l681m584n479o064o473o809o869o389n471
60874D72249m718m710n315n634m955l612k653k646l062k970k047p58K68Q24J120
60859D31381J439J826K001J648P93j27p36j046j163q23K46J503J800P35o32r86
60843D37859m00o6n15r65o46n6k31j315k466l035l180l338l665m067m302l941
60827D05671k684r38L16N29Q1l69o90j041j268j057n65l25n72j099j749k528l156
60810C88556l154k583k145k156j994j104j01p4j021j857j960j857k081k246j847
60795C62376j284j322j891k251k185k177k418k461k091j792j986k361k448k340
$$ y = [523519, 524254, 525274, 526943, 528841, 530655, 532676, 535115, 537624, 539798, 541544, 542634, 542553, 541330, 540014, 539563, 539486, 538289, 535269, 531257, 527454, 524068, 520387, 515803, 510324, 504260, 497787, 490978, 484109, 477720, 472249, 467531, 462821, 457506, 451872, 446917, 443305, 440652, 438006, 434944, 431974, 429927, 429169, 429437, 430261, 431381, 432820, 434646, 436647, 438295, 439088, 438961, 438225, 437179, 436016, 435193, 435439, 436942, 438742, 439477, 438845, 437859, 437459, 437393, 436878, 435913, 435267, 435211, 434980, 433665, 431199, 428164, 424984, 421646, 417981, 413914, 409612, 405671, 402987, 402049, 402365, 402894, 402975, 402606, 401916, 400875, 399607, 398550, 397985, 397660, 397088, 395989, 394240, 391712, 388556, 385402, 382819, 380674, 378518, 376524, 375420, 375319, 375245, 374224, 372367, 370407, 368550, 366469, 364223, 362376, 361092, 359770, 357879, 355628, 353443, 351266, 348848, 346387, 344296, 342504, 340518, 338157, 335709, 333369]
60781C33369k305k092j356m76k11m70k98P28J797J983J542J411J826K180K120
60766C39748K015K173K287K089J954K344K942K996K320J458Q33L55o1k30j36j05
60750C62982k56j89L74J073J423J510J667J811J605J055M17l83j550k856l812
60735C64871m397m954n395n219m459l804l632l539l185k842k756k606k156j832
60721C14095k062k468k425j942j447j021n76l46n29o95l54J35J44n3L08J012J023
60704C02799K58o0O45J274P96J1L73J655K205J385M96R49K465L670L763L065K311
60687C28060J971K161K636K918K722K361K427L004L427L033J937Q56K95J75K87
60672C58270O32J167J521J347P91K09m08j280k213k668k606k742l497m235l970
$$ y = [333369, 331064, 328972, 327616, 327140, 326929, 326459, 326161, 326889, 328686, 330669, 332211, 333622, 335448, 337628, 339748, 341763, 343936, 346223, 348312, 350266, 352610, 355552, 358548, 360868, 362326, 363159, 363514, 363453, 363223, 363087, 362982, 362726, 362537, 362911, 363984, 365407, 366917, 368584, 370395, 372000, 373055, 373472, 373089, 371539, 368683, 364871, 360474, 355520, 350125, 344906, 340447, 336643, 333011, 329472, 326287, 323445, 320689, 318083, 315927, 314095, 312033, 309565, 307140, 305198, 303751, 302730, 302154, 301808, 301279, 300584, 300230, 300365, 300509, 300456, 300764, 301776, 302799, 303057, 302997, 303642, 304916, 305712, 305723, 306096, 307751, 309956, 311341, 311837, 312786, 315251, 318921, 322684, 325749, 328060, 330031, 332192, 334828, 337746, 340468, 342829, 345256, 348260, 351687, 354720, 356657, 357513, 357808, 357983, 358270, 358902, 360069, 361590, 362937, 363728, 363937, 363529, 362249, 360036, 357368, 354762, 352020, 348523, 344288, 340318]
60657C40318k712j504j123j231r83p9J032J843K285K611K994L383L601L400K558
60642C56393J148k74j086j350j821k913l948l947k987k176k188k430k051j150
60628C29220m99l59k42K20P41Q65N99L21L12N07O81O86M88J09l67o79m88J66O32
60609C32913K67o64j121n42M43Q91O54K63J1k19m01k84P8L14L31M74R05J263J181
60590C36757P87M58L37L56M15M09J88k34n60m54J90J216K262K845K686K061J631
60573C51350J789K396L168M067N203O558P962R151R897J0279J0735J1450J1734
60560D45739J0583P906M627J477j570m390o140o288n565n093m924m288k908j243
60546D27923M33K203L829M754N001N336O293P676R168J0825J2678J4405J5643
$$ y = [340318, 337606, 336102, 334979, 333748, 332765, 332686, 333718, 335561, 337846, 340457, 343451, 346834, 350435, 353835, 356393, 357541, 357267, 356181, 354831, 353010, 350097, 346149, 342202, 339215, 337039, 334851, 332421, 330370, 329220, 328721, 328362, 328120, 328340, 329081, 329946, 330545, 330866, 331178, 331685, 332366, 333052, 333540, 333649, 333282, 332603, 332115, 332281, 332913, 333180, 332516, 331395, 330853, 331296, 332187, 332841, 333104, 333115, 332896, 332495, 332211, 332289, 332603, 332934, 333408, 334313, 335576, 336757, 337544, 338002, 338339, 338695, 339110, 339519, 339707, 339473, 338913, 338459, 338649, 339865, 342127, 344972, 347658, 349719, 351350, 353139, 355535, 358703, 362770, 367973, 374531, 382493, 391644, 401541, 411820, 422555, 434005, 445739, 456322, 464228, 468855, 470332, 468762, 464372, 458232, 451944, 446379, 441286, 436362, 432074, 429166, 427923, 428356, 430559, 434388, 439142, 444143, 449479, 455772, 463448, 472616, 483441, 496119, 510524, 526167]
60533E26167J6205J5775J3937J0720O765K754r07l827n664o618p239p532p048
60520E53488n985n361n553n595m624l215k409k078j383l04M78R67J866L154L936
60505E27382M012M553O653R931J3145J5714J8139K1295K5659L0976L6370M0963
60493G54792M4429M6742M7495M6054M2341L6790K9390J9647P852m412j5614k5515
60481A029991l4445m1885m6680m8387m7622m5225m1827l8203l5130l2589k9739
60470E88259k6112k2377j9520j7591j5826j3855j2196j1303j0648r252p086n366
60458D17127n104n764n842m696l180k420k526k847k996l111l320l503l528l315
60444C64975k674j477r1P53P00K44J51N42P19J6j327k301k164j212l97k63n39
$$ y = [526167, 542372, 558147, 572084, 582804, 589569, 592323, 591416, 587589, 581925, 575307, 568068, 560536, 553488, 547503, 542142, 536589, 530994, 526370, 523155, 520746, 518668, 517285, 516981, 517459, 518426, 520292, 523446, 527382, 531394, 535947, 542600, 552531, 565676, 581390, 599529, 620824, 646483, 677459, 713829, 754792, 799221, 845963, 893458, 939512, 981853, 1018643, 1048033, 1067680, 1075532, 1071120, 1055506, 1029991, 995546, 953661, 906981, 858594, 810972, 765747, 723920, 685717, 650587, 617998, 588259, 562147, 539770, 520250, 502659, 486833, 472978, 460782, 449479, 438831, 429579, 422493, 417127, 412023, 406259, 400417, 395721, 392541, 390121, 387595, 384748, 381752, 378641, 375321, 371818, 368290, 364975, 362301, 360824, 360733, 361486, 362186, 362430, 362581, 363123, 363842, 363858, 362531, 360230, 358066, 356854, 356457, 356194, 355655]
60427C55655p37q14r60j037o42K40J005J128Q99J104J914K526K218J492J495K247
60411C67733K300O53j634k568j608KJ130J895K673L082K638J655P90J45m62p31
60395C77693j58J061K074K329K040J711J636J892K378K838L072L135L204L283
60381D08188L214K872K215J428J048J580K759L654L767L570L596L587L165K737
60367D47380K895L314L173K449J879J692J398R26R31J698K585L065L506M462N749
60352D87102O854P792Q939J0230J1094J1058J0116Q536O528M041Q69k766n854
60339E64539p310p262p019p509q251q254p414o404n582m803m170m133m700n136
60325D76592m832m116l792m094m434m168l264k213j456j059p42n2J410L648O154
$$ y = [355655, 354918, 354104, 353144, 352107, 351465, 351705, 352710, 353838, 354737, 355841, 357755, 360281, 362499, 363991, 365486, 367733, 370033, 370686, 369052, 366484, 364876, 364878, 366008, 367903, 370576, 373658, 376296, 377951, 378741, 378886, 378424, 377693, 377535, 378596, 380670, 382999, 385039, 386750, 388386, 390278, 392656, 395494, 398566, 401701, 404905, 408188, 411402, 414274, 416489, 417917, 418965, 420545, 423304, 426958, 430725, 434295, 437891, 441478, 444643, 447380, 450275, 453589, 456762, 459211, 461090, 462782, 464180, 465106, 466037, 467735, 470320, 473385, 476891, 481353, 487102, 493956, 501748, 510687, 520917, 532011, 543069, 553185, 561721, 568249, 572290, 573159, 570393, 564539, 557229, 549967, 542948, 535439, 527188, 518934, 511520, 505116, 499534, 494731, 490561, 486428, 481728, 476592, 471760, 467644, 463852, 459758, 455324, 451156, 447892, 445679, 444223, 443164, 442422, 442370, 443780, 447428, 453582]
60310D53582Q328J0096J1910J4038J6121J7597J8301J8480J8377J8034J7248J5483
60298F37595J2098P062J265m225r105j3618j7651k0519k1695k1224j9428j6695
60286E13860j3652j1047r199p795o416n069m092l695l688l586l077k390k010j981
60272D36163j866j560j586k140k456j862r80r60j791k346k040j389r19n50l10
60257D13408o27j473k046j784j021k77L98R96J185Q80O12Q47J417J960K315K254
60241D19044J496L72k48j31J1k38k72L64R91P96J65Q1P01J380J725J814J688J431
60223D31170J408J736J803J099J83O8R45K149L140L756L785L145K407K375L216
60208D62385M446N567O215O078N344M878N249N938O110N768N406N059M573M354
$$ y = [453582, 461910, 472006, 483916, 497954, 514075, 531672, 549973, 568453, 586830, 604864, 622112, 637595, 649693, 656755, 658020, 653795, 644690, 631072, 613421, 592902, 571207, 549983, 530555, 513860, 500208, 489161, 479962, 472167, 465751, 460682, 456590, 452895, 449207, 445621, 442544, 440154, 438144, 436163, 434297, 432737, 431151, 429011, 426555, 424693, 423713, 422753, 420962, 418616, 416576, 415187, 414268, 413718, 413408, 412781, 411308, 409262, 407478, 406457, 406180, 406578, 407574, 408759, 409639, 410251, 411098, 412515, 414475, 416790, 419044, 420540, 420912, 420664, 420533, 420544, 420306, 420034, 420398, 421389, 422185, 422350, 422431, 423132, 424512, 426237, 428051, 429739, 431170, 432578, 434314, 436117, 437216, 437399, 437467, 438412, 440561, 443701, 447457, 451242, 454387, 456794, 459169, 462385, 466831, 472398, 478613, 484691, 490035, 494913, 500162, 506100, 512210, 517978, 523384, 528443, 533016, 537370]
60194E37370M723M967M153K581J307N18m22j435j760j481j613k436l141l416l957
60179E35958m919n222m229k911k489k797k899k568k316k437k801l196l311k855
60165D91008k080j641j621j341n78j06m86j008o04P61K268L277L559L045K078
60150D96531J406J304J148M96l9K37Q16O91j2j78O77J865K696L293M064M992N726
60133E25713N946N589M923M426M238L880K841J319j2p85j062r31m25K36P78J194
60117E57868J569J749J563J161P56K82k51l85J66P81N17o35j759k249k388k594
60101E56151k794k739k398j837j160p14q56j323j344o36J78M41L42M63Q39R58
60085E43571O65M46O80R84O58l00j055r20k10K07l6o16j270k118l093l746l938
$$ y = [537370, 542093, 547060, 551213, 553794, 555101, 555619, 555197, 553762, 552002, 550521, 548908, 546472, 543331, 539915, 535958, 531039, 525817, 521588, 518677, 516188, 513391, 510492, 507924, 505608, 503171, 500370, 497174, 493863, 491008, 488928, 487287, 485666, 484325, 483747, 483641, 483155, 482147, 481543, 482304, 484572, 487849, 491408, 494453, 496531, 497937, 499241, 500389, 500885, 500846, 501083, 501899, 502590, 502578, 502400, 503077, 504942, 507638, 510931, 514995, 519987, 525713, 531659, 537248, 542171, 546597, 550835, 554715, 557556, 558875, 558863, 558078, 557016, 556085, 555660, 555896, 556674, 557868, 559437, 561186, 562749, 563910, 564666, 564948, 564697, 564312, 564478, 565259, 565776, 565141, 563382, 561133, 558745, 556151, 553357, 550618, 548220, 546383, 545223, 544509, 543653, 542330, 540986, 540350, 540528, 540969, 541311, 541774, 542613, 543571, 544236, 544682, 545362, 546346, 547004, 546704, 545649, 544729, 544519, 544726, 544690, 544074, 542804, 540686, 537593, 533847, 529909]
60068E29909m194m925n751o096n986n716n174m233l449l467l938l933l394l150
60054D66503l481l649l174k588k425k347j875j243q03j69J173K806L833M136M430
60039D61127N031N407N086M339L673L125K419J564Q94O01N06K25m76j552k805
60024D89164m074n220o011o224n986n771n926o282o452o351o136n859n389m696
60010D08787l928l232k766k765l270l784l644k814j939j459j106m68K92O90O02
59995C79196K52j97o57p94l18M69R32J033J459K543L609L773L073K297J920J733
59979D00323J413R77N45J16l01n66n97n02m46n09p55j221j793k167k013j153L08
59962C91659J873K827K811K191J641J358J009L42m21r07r47o02p0L08L09J03L3
$$ y = [529909, 525715, 520790, 515039, 508943, 502957, 497241, 492067, 487834, 484385, 480918, 476980, 473047, 469653, 466503, 463022, 459373, 456199, 453611, 451186, 448839, 446964, 445721, 444918, 444749, 445922, 448728, 452561, 456697, 461127, 466158, 471565, 476651, 480990, 484663, 487788, 490207, 491771, 492665, 493266, 493772, 493997, 493521, 491969, 489164, 485090, 479870, 473859, 467635, 461649, 455878, 449952, 443670, 437218, 430867, 424731, 418872, 413483, 408787, 404859, 401627, 398861, 396096, 392826, 389042, 385398, 382584, 380645, 379186, 378080, 377612, 377904, 378594, 379196, 379448, 379251, 378594, 377800, 377482, 377951, 378883, 379916, 381375, 383918, 387527, 391300, 394373, 396670, 398590, 400323, 401736, 402713, 403258, 403374, 403073, 402507, 401910, 401408, 400962, 400453, 399698, 398477, 396684, 394517, 392504, 391351, 391659, 393532, 396359, 399170, 401361, 403002, 404360, 405369, 405711, 405290, 404383, 403436, 402834, 402764, 403072, 403381, 403484, 403517]
59945D03517R9L7j33q1K44M48L49K34J72l41j635l114l850l664l117k595j949
59928C84621r78J24R46J221J050R26J440K631L830M329M158L901L941M087L870
59913D20097K957J445j5n66J2J023J683J952K225K502K493K329K484K965L186
59898D46772K801K204J957K087K168J857J168M92L78J089K292L395M185M844N394
59883D83083N551N196M630M205L979L844L758L649L407L013K559K017J200J7j378
59868E28730k678l550l803l609l423l370l014k051j003o13p59o33L7P72J468K830
59852E05331N250P933R709J0242R908Q928P209M835K240lj293j222r2J104J558
59837E71637J240L17j493m365p471r404r517q323o695n166l965l209k798k550
$$ y = [403517, 403616, 403653, 403520, 403439, 403683, 404131, 404480, 404714, 404886, 404545, 402910, 399796, 395946, 392282, 389165, 386570, 384621, 383643, 383767, 384713, 385934, 386984, 387910, 389350, 391981, 395811, 400140, 404298, 408199, 412140, 416227, 420097, 423054, 424499, 424484, 423918, 423930, 424953, 426636, 428588, 430813, 433315, 435808, 438137, 440621, 443586, 446772, 449573, 451777, 453734, 455821, 457989, 459846, 461014, 461506, 461884, 462973, 465265, 468660, 472845, 477689, 483083, 488634, 493830, 498460, 502665, 506644, 510488, 514246, 517895, 521302, 524315, 526874, 528891, 530091, 530108, 528730, 526052, 522502, 518699, 515090, 511667, 508297, 505283, 503232, 502229, 501616, 500857, 500224, 500261, 501033, 502501, 505331, 510581, 518514, 528223, 538465, 548373, 557301, 564510, 569345, 571585, 571582, 570289, 569067, 568975, 570079, 571637, 572877, 573194, 571701, 567336, 559865, 550461, 540944, 532621, 525926, 520760, 516795, 513586, 510788, 508238]
59823E08238k450k529k641k645k693k875k808k154j423j540k546l457l627l494
59809D71356l602l657l107k208j730j875k115j980j499r49o40q48j497j959j660
59794D42030r27o64j088j420j025l28j38m52n85k53P0m9l67m13k11j29k20q2M90
59775D34239J064J027L24m72q55q08m85K03J291K310K619K326K306L033L861L913
59759D55896L331L004L187L220K751K454L006L929M188L709L536M401N736O417
59745E08765O062N278M813M828M949M772M245L683L394L345L252K925K421J788
59731E64520Q97k71j320j697j337q56q92j419j838j733j327j049r47q12p12j023
59715E48184j761k349k255j636j051p44o05o47j013j475j485r33m41n83j130j430
$$ y = [508238, 505788, 503259, 500618, 497973, 495280, 492405, 489597, 487443, 486020, 484480, 481934, 478477, 474850, 471356, 467754, 464097, 460990, 458782, 457052, 455177, 453062, 451082, 449583, 448634, 447994, 447146, 445649, 443690, 442030, 441103, 440439, 439351, 437931, 436906, 436578, 436440, 435988, 435403, 435150, 435220, 435171, 434804, 434391, 434180, 434051, 433831, 433749, 434239, 435303, 436330, 436654, 436182, 435327, 434519, 434034, 434237, 435528, 437838, 440457, 442783, 445089, 448122, 451983, 455896, 459227, 462231, 465418, 468638, 471389, 473843, 476849, 480778, 484966, 488675, 492211, 496612, 502348, 508765, 514827, 520105, 524918, 529746, 534695, 539467, 543712, 547395, 550789, 554134, 557386, 560311, 562732, 564520, 565417, 565146, 563826, 562129, 560792, 559936, 559044, 557625, 555787, 554054, 552727, 551678, 550731, 549919, 549207, 548184, 546423, 544074, 541819, 540183, 539132, 538388, 537783, 537136, 536123, 534648, 533163, 532230, 531789, 531206, 530076, 528646]
59699E28646j244q32l40L14R71J150O93R6j33j69n98j562k543k972k703j934r88
59682E15852k92k01o29j074j205j217j402j684j914k335l219m189m502m148m052
59667D83789m903o147o540n440l296j156Lj81j083j418m28J260K362K455K272
59652D61549K488K817K662K115J752J674J386O78L7j26k45j028k302l076k887
59637D67494k479k693l170k826j384K67J245J457J131L60m83o87j43J67o31k012
59621D55613k716k446k061k207k654l036l418l788l744l087k217j559j045m66
59607D21169P9N07J084J946K624K636K304K412L086L542L085J932R25P39J467
59592D49537K635L382K941J320n66j646j661j206q87p36n10k67k81n26o55n68
$$ y = [528646, 527402, 526570, 526230, 526544, 527515, 528665, 529358, 529454, 529321, 529152, 528554, 526992, 524449, 521477, 518774, 516840, 515852, 515560, 515359, 514730, 513656, 512451, 511234, 509832, 508148, 506234, 503899, 500680, 496491, 491989, 487841, 483789, 478886, 472739, 466199, 460759, 457463, 456307, 456310, 456129, 455046, 453628, 453200, 454460, 456822, 459277, 461549, 464037, 466854, 469516, 471631, 473383, 475057, 476443, 477121, 477158, 477032, 476787, 475759, 473457, 470381, 467494, 465015, 462322, 459152, 456326, 454942, 455209, 456454, 457911, 459042, 459402, 458919, 458232, 458089, 458256, 457625, 455613, 452897, 450451, 448390, 446183, 443529, 440493, 437075, 433287, 429543, 426456, 424239, 422680, 421635, 421169, 421248, 421755, 422839, 424785, 427409, 430045, 432349, 434761, 437847, 441389, 444474, 446406, 447331, 448070, 449537, 452172, 455554, 458495, 459815, 459249, 457603, 455942, 454736, 453849, 453113, 452603, 452336, 452055, 451529, 450874, 450306]
59576D50306o64j261k028k348k085j650j423j426j613k012k422k288j241K85J325
59561D29455J331O87K18K86O04P84Q42R37R43O21J69J22O59J329J686J843K150
59544D44666K705L438M416N695P039Q318R990J2812J6882K1109K3562K2317J6535
59531E99484P376k187r111j2207j2364j1090r148o544l287M9K498L449L248K818
59517E52984K554J932N21j155k298l038m187n928p478q123p960p482p055o891
59503D96396p028p138o796o016n191m559m151m129m461m388l014o81J053J065
59489D40962k12j582k255k054j146p5N26O29Q31J412J969K252K643L366L867L638
59473D54771L103L090L773M638N174N117M379L226K229J664J236P34N01Q82J693
$$ y = [450306, 449642, 448381, 446353, 444005, 441920, 440270, 438847, 437421, 435808, 433796, 431374, 429086, 427845, 428130, 429455, 430786, 431473, 431691, 431977, 432581, 433365, 434207, 435144, 436087, 436708, 436877, 436999, 437658, 438987, 440673, 442516, 444666, 447371, 450809, 455225, 460920, 467959, 476277, 486267, 499079, 515961, 537070, 560632, 582949, 599484, 606860, 604673, 595562, 583355, 570991, 559901, 550753, 544209, 540922, 540971, 543469, 546918, 550166, 552984, 555538, 557470, 557991, 556836, 554538, 551500, 547313, 541385, 533907, 525784, 517824, 510342, 503287, 496396, 489368, 482230, 475434, 469418, 464227, 459668, 455517, 451388, 446927, 442539, 439525, 438844, 439897, 440962, 440750, 439168, 436913, 434859, 433713, 433638, 434164, 434793, 435624, 437036, 439005, 441257, 443900, 447266, 451133, 454771, 457874, 460964, 464737, 469375, 474549, 479666, 484045, 487271, 489500, 491164, 492400, 493134, 493635, 494517, 496210]
59458D96210K663L857N170N934N769N364N702O728P541P668P457P258O950O298
59444E80569N267L874K080q6k491m914o963q234q635q341p349n569l470j976j443
59429E32319j359j338j586j939j443L67K589M282N854Q089J0506J2022J2858J4372
59415E95593J7168K0535K3752K6793K9642L1679L1725K8057J9095N489q718j8572
59403H02238k2123k0969j7287j1922n345J464P635J2309J3399Q355k535j4982
59391G50237k4109k8187k8212k5425k0923j6548j3946j2711j1062q386n864m500
59379E50364l885l179k258j381n31M36J408K124K426K318K073K139K527K612K027
59364E59220J561K269L790M532L734K520K365L311M325M884N443O490P882R208
$$ y = [496210, 498873, 502730, 507900, 513834, 519603, 524967, 530669, 537397, 544938, 552606, 560063, 567321, 574271, 580569, 585836, 589710, 591790, 591704, 589213, 584299, 577336, 569102, 560467, 552126, 544777, 539208, 535738, 533762, 532319, 530960, 529622, 528036, 526097, 524654, 525021, 527610, 531892, 537746, 545835, 556341, 568363, 581221, 595593, 612761, 633296, 657048, 683841, 713483, 745162, 776887, 804944, 824039, 829528, 820810, 802238, 780115, 759146, 741859, 729937, 724592, 726056, 733691, 746000, 759399, 767754, 765219, 750237, 726128, 697941, 669729, 644304, 623381, 606833, 592887, 580176, 569114, 560728, 554864, 550364, 546479, 543300, 541042, 539661, 539130, 539566, 540974, 543098, 545524, 547842, 549915, 552054, 554581, 557193, 559220, 560781, 563050, 566840, 571372, 575106, 577626, 579991, 583302, 587627, 592511, 597954, 604444, 612326, 621534]
59350F21534J0335J1361J2304J3019J3366J3409J3460J3869J4621J5190J4913
59339G67381J3528J1280Q563N628K672m9k380m484o643q840j0678j1854j2524
59326G51600j3086j3669j4077j4130j3883j3373j2460j1103r662q720q495q573
59314F10369q346p608o601n549m384l036j660l17J319L574O248Q881J1377J3647
59300F17914J4634J2588O873r39q269j3485j6338j7168j6455j4883j3066j1155
59288E40251r135p296n921m804l665k705k125j442j61J181J709J779K690M667
59274E15023O449P216P759R031J0638J1627J1915J2026J2052J1841J1697J1872
59262F39146J1677J0138P412M626K384L31j806l648m951o107p392q338q367p699
$$ y = [621534, 631869, 643230, 655534, 668553, 681919, 695328, 708788, 722657, 737278, 752468, 767381, 780909, 792189, 800752, 806380, 809052, 809003, 806623, 802139, 795496, 786656, 775978, 764124, 751600, 738514, 724845, 710768, 696638, 682755, 669382, 656922, 645819, 636157, 627437, 618942, 610369, 602023, 594415, 587814, 582265, 577881, 574845, 573185, 572868, 574187, 577761, 584009, 592890, 604267, 617914, 632548, 645136, 652009, 651070, 642801, 629316, 612978, 595810, 579355, 564472, 551406, 540251, 531116, 523820, 517899, 513095, 509430, 506725, 504600, 503158, 502997, 504178, 505887, 507666, 510356, 515023, 521472, 528688, 536447, 545478, 556116, 567743, 579658, 591684, 603736, 615577, 627274, 639146, 650823, 660961, 668373, 672999, 675383, 675714, 673908, 670260, 665309, 659202, 651810, 643472, 635105, 627406]
59248F27406p080o775o325n304l957k850k113j303m5J401K430K837L009L419M108
59233F08858M841N419N682N382M382L000J930J635J790J397l27l150o021q122
59219F26696r493j0453j0882j0549r731q934q118o965n817n486n943o066n071
59206E23188l533k519k315k517k752k763k215j091k0L74K86L70Q05J218J335J231
59190E09082J024P70N87N48N73O31P97R44Q30P39J425K983M352M650M412M653
59174E39000N245N296M863M953N747O135N411M365M079M517N012N452O062O515
59160F12652O084M670K957J555M51p00k144l906n740p127p679p647p777q499r403
59145E67747r652q858p481o425o275o821p286p037o106n077m499m407m383m005
$$ y = [627406, 620326, 613551, 607226, 601922, 597965, 595115, 593002, 591699, 591654, 593055, 595485, 598322, 601331, 604750, 608858, 613699, 619118, 624800, 630182, 634564, 637564, 639494, 641129, 642919, 644316, 643989, 640839, 634818, 626696, 617203, 606750, 595868, 585319, 575588, 566654, 558536, 551571, 545754, 540268, 534325, 528259, 523188, 519655, 517136, 514821, 512304, 509552, 506789, 504574, 503483, 503463, 503837, 504123, 504493, 505298, 506516, 507851, 509082, 510106, 510876, 511463, 512011, 512584, 513215, 514012, 514956, 515786, 516525, 517950, 520933, 525285, 529935, 534347, 539000, 544245, 549541, 554404, 559357, 565104, 571239, 576650, 581015, 585094, 589611, 594623, 600075, 606137, 612652, 618736, 623406, 626363, 627918, 628369, 627669, 625525, 621619, 615879, 608752, 601073, 593426, 585649, 577150, 567747, 558095, 549237, 541756, 535331, 529056, 522235, 514949, 507912, 501806, 496729, 492230, 487823, 483440, 479435]
59131D79435l240k361j606r81l97J53O40J127J702K315K816L205L730M647N867
59116D97052O993P786Q502R516J0615J1022J0293Q955P939P603P611P647P628
59103F09162P326O423N148M281M138M039L233J912Q37K20l79j125j555j277o16
59088F41767k53m66q82r58n70j25k07j060k455l949n189n980o349o559o879p239
59072E92647p340p100o702o148n232m146l619m032m706m646l833l179l267l675
59058E25022l650l028k185j393o37OJ51m94j569k217j984j379j215j543j636j044
59042E01205j18O26J117J372J052n0j329j807j221j85P05J457K270K900K835K032
59026E12861J310J739L532N712P159P913Q994J0861J2627J3117J2239J0808R433
$$ y = [479435, 476195, 473834, 472228, 471247, 470850, 471003, 471643, 472770, 474472, 476787, 479603, 482808, 486538, 491185, 497052, 504045, 511831, 520333, 529849, 540464, 551486, 561779, 570734, 578673, 586276, 593887, 601534, 609162, 616488, 622911, 628059, 632340, 636478, 640517, 643750, 645662, 646499, 646719, 646340, 645215, 643660, 642383, 641767, 641514, 641048, 640166, 639208, 638638, 638513, 638306, 637246, 634791, 630842, 625653, 619673, 613324, 606765, 599886, 592647, 585307, 578207, 571505, 565357, 560125, 555979, 552360, 548328, 543622, 538976, 535143, 531964, 528697, 525022, 521372, 518344, 516159, 514766, 514129, 514135, 514286, 513792, 512223, 510006, 508022, 506643, 505428, 503885, 502249, 501205, 501087, 501713, 502830, 504202, 505254, 505204, 503875, 502068, 500847, 500662, 501367, 502824, 505094, 507994, 510829, 512861, 514171, 515910, 519442, 525154, 532313, 540226, 549220, 560081, 572708, 585825, 598064, 608872, 618305]
59013F18305Q131O754N249L455J240j057k758l519l650l595l340k427n64J854
58999F24078L885M842M881M676M516M138L422K766K535K603K594K260J373j88
58985F68381j943k934k878k715l383m463m713l672k035o19L75J146J996L320N241
58970F51104P254Q657R394J0003J0750J1344J1511J1323J0860J0082R203Q706
58958G70191Q694Q513P366N206K813R62m45k313n292q860j1716j3162j3699j4123
58944G34135j4521j4455j3689j2342j0604q796p381o500n754m836m084l988m450
58931F22735m925m979m365l017j482p66j149j576r83K21Q11M09l97j250k198k917
58915E94172k818k014j227p20j37O00J146J514K085K781L191L621M941P174R196
$$ y = [618305, 626436, 633190, 638439, 641894, 643134, 642077, 639319, 635800, 632150, 628555, 625215, 622788, 622224, 624078, 627963, 632805, 637686, 642362, 646878, 651016, 654438, 657204, 659739, 662342, 664936, 667196, 668569, 668381, 666438, 663504, 660626, 657911, 654528, 650065, 645352, 641680, 639645, 639026, 639401, 640547, 642543, 645863, 651104, 658358, 667015, 676409, 686412, 697162, 708506, 720017, 731340, 742200, 752282, 761485, 770191, 778885, 787398, 794764, 799970, 802783, 803745, 803300, 800987, 795695, 786835, 775119, 761957, 748258, 734135, 719614, 705159, 691470, 679128, 668524, 659728, 652347, 645847, 640093, 635257, 631173, 627185, 622735, 617810, 612831, 608466, 605449, 603967, 603201, 602052, 600476, 599493, 599714, 600525, 600934, 600537, 599287, 597089, 594172, 591354, 589340, 588113, 587393, 587256, 587856, 589002, 590516, 592601, 595382, 598573, 602194, 607135, 614309, 623505]
58900F23505J0252J0828J1635J2467J2666J2020J0845R643Q977R173R946J0866
58888G52823J2230J4704J7999K0733K1853K1388J9699J6990J3824J1043Q656N746
58876I37688K032j533m272o801r733j2357j3704j4103j4520j4932j4563j3340
58864H19862j1900j0420q597o784n937o285o908o966o609o440o719p410q409r338
58850G11140r616r141q633q805r376r312q134o584n778n890o147o090o272p295
58836F04067q639r119q349p068o031n262m565m041l757l435k880k216j429j71
58822E37105J576L044L472L055K725L071L846M367M168L379K669K602K990L158
58808E81227K889K617K558K222J222Q0l40k1J33o27k074l345l893m050m565n592
$$ y = [623505, 633757, 644585, 656220, 668687, 681353, 693373, 704218, 713861, 722838, 732011, 741957, 752823, 765053, 779757, 797756, 818489, 840342, 861730, 881429, 898419, 912243, 923286, 931942, 937688, 939720, 938187, 933915, 927114, 917381, 905024, 891320, 877217, 862697, 847765, 833202, 819862, 807962, 797542, 788945, 782161, 776224, 769939, 763031, 756065, 749456, 743016, 736297, 728887, 720478, 711140, 701524, 692383, 683750, 674945, 665569, 656257, 648123, 641539, 635761, 629871, 623724, 617634, 611362, 604067, 595428, 586309, 577960, 570892, 564861, 559599, 555034, 550993, 547236, 543801, 540921, 538705, 537276, 537105, 538681, 541725, 545197, 548252, 550977, 554048, 557894, 562261, 566429, 569808, 572477, 575079, 578069, 581227, 584116, 586733, 589291, 591513, 592735, 592815, 592475, 592454, 592587, 591960, 589886, 586541, 582648, 578598, 574033, 568441]
58792E68441o418o396n867n660n862n756m921l716k579j535n33L59J279K439L481
58777E26756L703L214L056L726M283L540J581n50k201l509m657n410n413m703
58763E23416l893l781m469m954m157k378j054r76j480j555r54P8J350K518L061
58748E00772K983K863K917K711K186K062K622L055K724K257K476L059L259L283
58734E39229L843M828N473N571N538N489N212M920N087N619N940N843N609N373
58720F13574N054M769M657M528M283M440N511P051Q118Q534Q862R208Q908P554
58706G05051N580L581J613o39l311o241r102j1625j3740j5455j6555j6733j6195
58693F06229j5644j5364j4844j3650j2190j1037j0034q729p269o172n503n002
$$ y = [568441, 562023, 555627, 549760, 544100, 538238, 532482, 527561, 523845, 521266, 519731, 519198, 519557, 520836, 523275, 526756, 530459, 533673, 536729, 540455, 544738, 548278, 549859, 549309, 547108, 543599, 538942, 533532, 528119, 523416, 519523, 515742, 511273, 506319, 502162, 499784, 498730, 497754, 496274, 494719, 493765, 493843, 495193, 497711, 500772, 503755, 506618, 509535, 512246, 514432, 516494, 519116, 522171, 524895, 527152, 529628, 532687, 535946, 539229, 543072, 547900, 553373, 558944, 564482, 569971, 575183, 580103, 585190, 590809, 596749, 602592, 608201, 613574, 618628, 623397, 628054, 632582, 636865, 641305, 646816, 653867, 661985, 670519, 679381, 688589, 697497, 705051, 710631, 714212, 715825, 715186, 711875, 705634, 696532, 684907, 671167, 655712, 639157, 622424, 606229, 590585, 575221, 560377, 546727, 534537, 523500, 513466, 504737, 497468, 491296, 485793, 480791]
58681D80791m690m681m578l827k559j449r04q23r88j099o64N04J925L149M537
58666D64644O635R032J0684J1262J1448J1847J2283J2169J1029Q612N078J232
58654E75955j817l507m147m531n264o246o699o072n015m830n752o479n854m299
58640E05443k944k088j340o40j95K33J052K095K871L308L550L407K666J665Q73
58625E19956K70k47l73PK84J0k97p8K13K1k8R65K478L149K810K554K920L314L209
58606E41137K689J751L26r22j030r7P67R85R16O87j51j530k598k871k763k614
58590E34682k144j204j90O55J609K833M109N391O889Q397R326R628R878J0173
58576F00032R843Q605P209O446O144N715N183N148N907P172Q547J0048J1998J4370
$$ y = [480791, 476101, 471420, 466842, 463015, 460456, 459007, 458103, 457280, 456292, 455193, 454529, 455033, 456958, 460107, 464644, 471279, 480311, 490995, 502257, 513705, 525552, 537835, 550004, 561033, 569645, 574723, 575955, 574138, 570631, 566484, 561953, 556689, 550443, 543744, 537672, 532657, 527827, 522075, 515596, 509742, 505443, 502499, 500411, 499071, 498431, 498236, 498469, 499521, 501616, 504487, 507795, 511345, 514752, 517418, 519083, 519956, 520226, 519979, 519606, 519613, 519897, 519907, 519610, 519532, 519745, 519766, 519738, 520703, 523181, 526330, 529140, 531694, 534614, 537928, 541137, 543826, 545577, 545903, 544981, 543951, 543854, 544621, 545606, 546522, 547209, 547058, 545528, 542930, 540059, 537296, 534682, 532538, 531334, 531144, 531799, 533408, 536241, 540350, 545741, 552630, 561027, 570353, 579981, 589859, 600032, 609875, 618480, 625689, 632135, 638279, 643994, 649177, 654325, 660232, 667404, 675951, 685999, 697997, 712367]
58562G12367J6529J7944J9072K0801K3009K4483K4484K3362K1215J7329J1921
58551I32516P073M419K880L45l096n375n555m849m599m941n664o886q516j0221
58537H87531j2106j4430j6662j7918j8211j8164j7692j6228j4038j1964j0046
58526G20072p805n703m623m062k674o83J51o56j463j118o13j247k567l240k874
58511F80895k063j437j371j936k682l068l206l527l766l380k718k619k917k709
58497F43496k071j949k320k110j118m01m46n97n68q36j114l02J526K896L337M218
58481F41641O337Q405R065Q929R454J0948J2700J3992J4210J2956J0767Q751P027
58468G75182M623J220k321n394q076r805r460p320n233m140l030j046J245L332
$$ y = [712367, 728896, 746840, 765912, 786713, 809722, 834205, 858689, 882051, 903266, 920595, 932516, 939589, 944008, 946888, 947233, 944137, 938762, 933207, 928358, 923759, 918818, 913154, 906268, 897752, 887531, 875425, 860995, 844333, 826415, 808204, 790040, 772348, 756120, 742082, 730118, 720072, 712267, 706564, 701941, 697879, 695205, 694522, 694673, 694017, 692554, 691436, 690823, 689576, 687009, 683769, 680895, 678832, 677395, 676024, 674088, 671406, 668338, 665132, 661605, 657839, 654459, 651741, 649122, 646205, 643496, 641425, 639476, 637156, 635046, 633928, 633527, 633081, 632484, 631916, 631080, 629966, 629664, 631190, 634086, 637423, 641641, 647978, 656383, 665448, 674377, 683831, 694779, 707479, 721471, 735681, 748637, 759404, 768155, 775182, 779805, 781025, 778704, 773310, 765234, 755429, 745969, 738649, 733416, 729276, 726246, 725200, 726445, 729777]
58454G29777N630P926Q938Q452Q069Q665Q908P519N207L064Q05j931m199n169
58440G91661n497n824n435l867k356k066k272j821j032o27j31J098K499L534M906
58425G72770O982Q415Q104P285P733Q971R161P825N858L644J003j556l240m165
58411H38790m909n466n755o303p262p650o819n671n213n012m273l330k733k013
58397G66381p32M80J229K428M554O216O084N013M479M181L046J547J034J546K041
58382H09527K148K169K087J971K482L722M584M562M880O460Q107Q313P540P088
58368H75640O992O759O837P582Q083P774P823R189J0726J1130J1159J1902J2395
58355I93991J1322R613Q929Q835P891O402N576N064L754K211J929K901M073N284
$$ y = [729777, 735407, 743333, 752271, 760723, 768792, 777457, 786365, 793884, 799091, 802155, 802960, 801029, 796830, 791661, 786164, 780340, 774905, 771038, 768682, 766616, 764344, 762523, 761491, 760864, 760733, 761831, 764330, 767864, 772770, 779752, 788167, 796271, 803556, 811289, 820260, 829421, 837246, 843104, 846748, 847751, 846195, 842955, 838790, 833881, 828415, 822660, 816357, 809095, 801445, 794626, 788955, 783742, 778730, 774457, 771127, 768394, 766381, 765649, 766129, 767358, 769786, 774340, 780556, 786640, 791653, 796132, 800313, 803359, 804906, 805940, 807486, 809527, 811675, 813844, 815931, 817902, 820384, 824106, 828690, 833252, 838132, 844592, 852699, 861012, 868552, 875640, 882632, 889391, 896228, 903810, 911893, 919667, 927490, 936679, 947405, 958535, 969694, 981596, 993991, 1005313, 1014926, 1023855, 1032690, 1040581, 1046983, 1052559, 1057623, 1061377, 1063588, 1065517, 1068418, 1072491, 1077775]
58341A077775O789P885Q048Q344R727J1210J1752J2377J4220J6154J6767J6980
58329A218028J8028J8590J6957J4452J3490J3612J2682J0817R766R442Q435P076
58317A371375O796P201O891O331O859P792P603P041P915R796J1076J2215J4570
58304A483461J7091J7729J7160J7637J9074J9787K0079K1391K2926K2863K1997
58293A701195K2367K3286K2710K1483K2096K4039K4763K4359K4997K6473K6817
58282A964585K6645K8189L0639L1152L0148L0773L3379L5330L6100L7804M0707
58271B325451M2888M4350M6806M9636N0730N0992N3219N6900N9156O0332O3315
58260B903775O7727P0344P1044P2654P5154P5840P5079P5902P8015P8370P7600
$$ y = [1077775, 1084564, 1092449, 1100497, 1108841, 1118568, 1129778, 1141530, 1153907, 1168127, 1184281, 1201048, 1218028, 1236056, 1254646, 1271603, 1286055, 1299545, 1313157, 1325839, 1336656, 1346422, 1355864, 1364299, 1371375, 1378171, 1385372, 1392263, 1398594, 1405453, 1413245, 1420848, 1427889, 1435804, 1445600, 1456676, 1468891, 1483461, 1500552, 1518281, 1535441, 1553078, 1572152, 1591939, 1612018, 1633409, 1656335, 1679198, 1701195, 1723562, 1746848, 1769558, 1791041, 1813137, 1837176, 1861939, 1886298, 1911295, 1937768, 1964585, 1991230, 2019419, 2050058, 2081210, 2111358, 2142131, 2175510, 2210840, 2246940, 2284744, 2325451, 2368339, 2412689, 2459495, 2509131, 2559861, 2610853, 2664072, 2720972, 2780128, 2840460, 2903775, 2971502, 3041846, 3112890, 3185544, 3260698, 3336538, 3411617, 3487519, 3565534, 3643904, 3721504]
58249C721504P9447Q3846Q7145Q9327R4084J01569J08156J13782J22119J32883
58239D733862J41588J47688J55318J65096J73148J79328J88284K01053K13708
58230F299073K25574K40420K58354K75193K91283L11841L37283L62547L87312
58221H988880M16974M52085M87486N23512N67001O19255O74725P33710Q03985
58212A4267613Q87616R79120J079238J196592J332991J482139J646197J838216
58204B4709722K065587K329138K642390L032683L519553M114268M846987N772261
58196E3032589O944323Q416060J0268531J2603696J5487926J8930467K2928752
58189A48612344K7489862L2557928L7875728M2787507M5990963M5511363L9361502
$$ y = [3721504, 3800951, 3884797, 3971942, 4061269, 4155353, 4256922, 4365078, 4478860, 4600979, 4733862, 4875450, 5023138, 5178456, 5343552, 5516700, 5696028, 5884312, 6085365, 6299073, 6524647, 6765067, 7023421, 7298614, 7589897, 7901738, 8239021, 8601568, 8988880, 9405854, 9857939, 10345425, 10868937, 11435938, 12055193, 12729918, 13463628, 14267613, 15155229, 16134349, 17213587, 18410179, 19743170, 21225309, 22871506, 24709722, 26775309, 29104447, 31746837, 34779520, 38299073, 42413341, 47260328, 53032589, 59976912, 68392972, 78661503, 91265199, 106753125, 125683592, 148612344, 176102206, 208660134, 246535862, 289323369, 335314332, 380825695, 420187197]
58182D20187197K6851880R600979q834046k4641856l5458974m0896607m1917003
58175C04891570l9933071l6259555l1909930k7538483k3478993j9867491j6750161
58168A09153886j4115538j1906038j0056122q518638p250795o201118n325739
58161D5779898m599872m001882l502055l076430k716277k414661k156620j929794
58153B1382307j731778j559696j404056j259230j128982j015708r14179q20816
58145A1547862p38925o69736o07939n50935n03245m66915m36140m05978l78104
58136F789945l53817l29519l03534k79868k60849k43143k24754k08847j96829
58127D388785j84696j70293j57487j49199j42539j34716j27596j22651j17257
$$ y = [420187197, 447039077, 456640056, 447806010, 423164154, 387705180, 346808573, 304891570, 264958499, 228698944, 196789014, 169250531, 145771538, 125904047, 109153886, 95038348, 83132310, 73076188, 64557550, 57306755, 51105637, 45779898, 41180026, 37178144, 33676089, 30599659, 27883382, 25468721, 23312101, 21382307, 19650529, 18090833, 16686777, 15427547, 14298565, 13282857, 12368678, 11547862, 10808937, 10139201, 9531262, 8980327, 8477082, 8010167, 7574027, 7168049, 6789945, 6436128, 6106609, 5803075, 5523207, 5262358, 5019215, 4794461, 4585614, 4388785, 4204089, 4033796, 3876309, 3727110, 3584571, 3449855, 3322259, 3199608, 3082351]
58118C082351j09913j03573j00003r6093q9425q2460p7693p3634o8930o5635o4809
58107B150183o3538n9790n5921n4093n2467m9214m5999m4318m2376l8920l6177
58096A607370l5854l5916l4509l3298l3802l4046l2140k9794k9034k8524k6361
58085A254092k3628k2094k1109j9692j9086k0402k2110k2438k2034k1959k1503
58074A018037k0161j9294j9659j9668j8185j6546j5924j5324j4062j3504j4227
58063H31483j4285j2432j0430r887r547q042o700p099q282q756r087j0109j0788
58050G06039j0199r522r813r895q607p113o668o301m944l898m691o319o961o874
58036F04234p249p726p248o148n476n387n706o755q245q972q803r209j0574j1142
$$ y = [3082351, 2972438, 2868865, 2768862, 2672769, 2583344, 2500884, 2423191, 2349557, 2280627, 2214992, 2150183, 2086645, 2026855, 1970934, 1916841, 1864374, 1815160, 1769161, 1724843, 1682467, 1643547, 1607370, 1571516, 1535600, 1501091, 1467793, 1433991, 1399945, 1367805, 1338011, 1308977, 1280453, 1254092, 1230464, 1208370, 1187261, 1167569, 1148483, 1128081, 1105971, 1083533, 1061499, 1039540, 1018037, 997876, 978582, 958923, 939255, 921070, 904524, 888600, 873276, 859214, 845710, 831483, 817198, 804766, 794336, 784449, 774902, 766860, 760160, 753061, 744779, 736023, 726936, 716827, 706039, 695840, 686318, 676505, 666610, 658003, 650890, 644222, 637921, 632977, 629079, 624388, 618069, 611108, 604234, 596985, 589259, 582011, 575863, 570387, 565000, 559294, 552539, 544294, 535322, 526519, 517310, 506736, 495594]
58022D95594r921q427p981p649o523n643n745n456l833k387k484k909k347k004
58008D22285l233m620m115k362j243p11K83J192Q91R4K53J023J146Q77J313K254
57992D15327K702K618K309J260o94k291k772l443n414p332p518o788o782o990
57978C74192n994m483m222m914m802l769l267l629l821l576l579l763l391k611
57964C18371k119j633m22J077J881K221L023M071M287L494K347J050m62j627j955
57949C33604k060k596k996k589k076k324k613j694R9J477K200K926L848M903O512
57934C36621Q594R772R133P819P336P316O533N035L491J559j149l520m401m678
57920C89461n845p451q050p777p829q097p607o632o162n887m861l535k985k700
$$ y = [495594, 485673, 477246, 469265, 461616, 455093, 449450, 443705, 438249, 434416, 432029, 429545, 426636, 424289, 422285, 419052, 414432, 410317, 407955, 406712, 406001, 406284, 407476, 408367, 408461, 408714, 409737, 410883, 411760, 413073, 415327, 418029, 420647, 422956, 424216, 423522, 421231, 418459, 415016, 409602, 402270, 394752, 387964, 381182, 374192, 368198, 363715, 359493, 354579, 349777, 346008, 342741, 339112, 335291, 331715, 328136, 324373, 320982, 318371, 316252, 314619, 314197, 315274, 317155, 319376, 322399, 326470, 330757, 334251, 336598, 337648, 337186, 335559, 333604, 331544, 328948, 325952, 323363, 321287, 318963, 316350, 314656, 314755, 316232, 318432, 321358, 325206, 330109, 336621, 345215, 354987, 364120, 371939, 379275, 386591, 393124, 398159, 401650, 403209, 402060, 398540, 394139, 389461, 383616, 376165, 368115, 360338, 352509, 344412, 336805, 330173, 324011, 318124, 313263, 309728, 306743, 304043]
57906C04043j414M90J594J957K679L519L312K299J683J294J64r99n99Q82J338
57891C22242N27L08J294J973J548J047J069Q30O7l48l07p90j801k120j689j983
57875C21867l350m294m132m161n119n729m927l674l183l072k554j952j699j188
57861B72833Q0J338J749J865K756M374N740O204N900N462N630O498P047O265M667
57846C38408L688L526K952J294o96k243l296l677k986j806j555k570l643l910
57832C23486l898m239m715n043n300n070l601j338J49L26L65J050J585J271Q58
57817B95886J191J859K167K156J660l36m107p939r832r731r034q597q294p925
57803B39124p454o709n637m570l670k617j306k75O2L4M7m7l99o23k98M36J207
$$ y = [304043, 302629, 303119, 304713, 306670, 309349, 312868, 316180, 318479, 320162, 321456, 321620, 320621, 320022, 320904, 322242, 322769, 323077, 324371, 326344, 327892, 328939, 330008, 330838, 330905, 330557, 330250, 329460, 327659, 325539, 323850, 321867, 318517, 314223, 310091, 305930, 300811, 295082, 290155, 286481, 283298, 280226, 277672, 275720, 274021, 272833, 272913, 274251, 276000, 277865, 280621, 284995, 290735, 296939, 302839, 308301, 313931, 320429, 327476, 333741, 338408, 342096, 345622, 348574, 349868, 349172, 346929, 343633, 339956, 336970, 335164, 333609, 331039, 327396, 323486, 319588, 315349, 310634, 305591, 300291, 295221, 291620, 290282, 290431, 290757, 291122, 292172, 293757, 295028, 295886, 297077, 298936, 301103, 303259, 304919, 304583, 300476, 292537, 282705, 272974, 263940, 255343, 247049, 239124, 231670, 224961, 219324, 214754, 211084, 208467, 207161, 206886, 206948, 206982, 207029, 206982, 206583, 205960, 205662, 206098, 207305]
57786B07305J817K122K084K179L044M502N695O290O741P265P619P913Q507Q893
57772B81976Q005O057M630M427M293L171J648O42j20j204k236k739l292m581o016
57757B94661o481n941n226m721m248l769l210k034R5K433L836M084L822L518L129
57742B79948K599J965J222N25K92O25R72P91K41k23m78n32k28L73P13M76J65M17
57724B89863J034J280R24M59L67N59N67J29l77k19P17J407P45j034k612l203l186
57707B87420l182l333l627m063m294l896l147k757k692k148r02L53J158J750K073
57692B58713J450l33k609m830o957q496q505p089n643m945m216k870j739j502
57678B00429j173M70K942M919O431Q740J2514J7371K2920K9096L5632M2187M8782
$$ y = [207305, 209122, 211244, 213328, 215507, 218551, 223053, 228748, 235038, 241779, 249044, 256663, 264576, 273083, 281976, 289981, 296038, 300668, 305095, 309388, 312559, 314207, 314849, 314729, 313525, 311289, 308550, 305258, 300677, 294661, 288180, 282239, 277013, 272292, 268044, 264275, 261065, 259031, 259126, 261559, 265395, 269479, 273301, 276819, 279948, 282547, 284512, 285734, 286259, 286551, 287176, 288148, 288939, 289180, 288957, 288479, 287947, 287719, 288092, 288805, 289281, 289446, 289863, 290897, 292177, 293101, 293560, 293927, 294486, 295053, 295182, 294805, 294586, 295303, 296710, 297455, 296421, 293809, 290606, 287420, 284238, 280905, 277278, 273215, 268921, 265025, 261878, 259121, 256429, 254281, 253379, 253732, 254890, 256640, 258713, 260163, 259830, 257221, 252391, 245434, 236938, 228433, 221344, 215701, 210756, 206540, 203670, 201931, 200429, 199256, 199726, 202668, 207587, 214018, 222758, 235272, 252643, 275563, 304659, 340291, 382478, 431260]
57665D31260N5089N9291N8383M9827L3077J0311j3726l3542m5827n0860n0841
57654E02442m7639m2504l6799l1544k6657k1687j7066j3711j1645j0038q419p021
57642B27712n989n117m325l731l226k584j865j304q35k11N25J052J127O93r8p77
57626B01047q99o55o85j148j624k021k714l531l699l215l119l683l650k271r13
57611A67220j195k469k782j765q78j019j451j330q83o63o45m81n9M69P21J85j166
57594A51809k471k775k139j412j108j148j469k124k817l077k857k497k098j529
57580A22288r27o37o55o14l23K5J01l52j367k501l046k762k108j589j261j084
57564A03188j119j074m91K84J87r49j793j334l36Op3L51J067J103N35L94R40J370
$$ y = [431260, 486349, 545640, 604023, 653850, 686927, 697238, 683512, 649970, 604143, 553283, 502442, 454803, 412299, 375500, 343956, 317299, 295612, 278546, 264835, 253190, 243152, 234733, 227712, 221723, 216606, 212281, 208550, 205324, 202740, 200875, 199571, 198736, 198525, 199050, 200102, 201229, 201922, 201824, 201047, 200148, 199493, 198808, 197660, 196036, 194015, 191301, 187770, 184071, 180856, 177737, 174054, 170404, 168133, 167220, 166025, 163556, 160774, 159009, 158131, 157112, 155661, 154331, 153448, 152785, 152140, 151659, 151600, 152069, 152790, 152975, 151809, 149338, 146563, 144424, 143012, 141904, 140756, 139287, 137163, 134346, 131269, 128412, 125915, 123817, 122288, 121361, 120724, 120069, 119455, 119132, 119157, 119258, 118906, 117539, 115038, 111992, 109230, 107122, 105533, 104272, 103188, 102069, 100995, 100504, 100788, 100975, 100026, 98233, 96899, 96563, 96569, 96496, 96847, 97914, 99017, 99552, 99946, 100886, 102256]
57546A02256J338J475K157K888L183L225L264L192K967K859K973L079L046L049
57532A40951L194L332L300L088K852L015L963N327N979N264L833K789K432K421
57518A91740K602K894K880K296J643J488J495R41j65j279k197k953l225k767k149
57503A93244k072k367k530k814l697m693m946m722m957n484n137l735k554k466
57489A41070k871k950k875l138l522l415k603j336p5N77K50o01r67l79N73J001
57473A18739O42o0m53k68J73M01N10R56J502J219mq52l36O78P78Q8k07R8J98p1
57453A23731o5K06n3r44j545j306o27J44J065J818J735R70N22P65R73O49L00M41
57435A28779P74Q34P01O24N73M97M30K86N4J87J065K137K446J924J263O47k77
$$ y = [102256, 103594, 105069, 107226, 110114, 113297, 116522, 119786, 122978, 125945, 128804, 131777, 134856, 137902, 140951, 144145, 147477, 150777, 153865, 156717, 159732, 163695, 169022, 175001, 180265, 184098, 186887, 189319, 191740, 194342, 197236, 200116, 202412, 204055, 205543, 207038, 207979, 207814, 206535, 204338, 201385, 198160, 195393, 193244, 191172, 188805, 186275, 183461, 179764, 175071, 170125, 165403, 160446, 154962, 149825, 146090, 143536, 141070, 138199, 135249, 132374, 129236, 125714, 122299, 119696, 118360, 118285, 118862, 119112, 118511, 117544, 117165, 117738, 118739, 119381, 119321, 118868, 118600, 118773, 119174, 119684, 120640, 122142, 123361, 123357, 122505, 122169, 122847, 123625, 123713, 123506, 123604, 123802, 123731, 123666, 123872, 123819, 122875, 121330, 120024, 119397, 119541, 120606, 122424, 124159, 125129, 125651, 126416, 127389, 128038, 128338, 128779, 129553, 130387, 131088, 131712, 132285, 132782, 133212, 133498, 133552, 133739, 134804, 136941, 139387, 141311, 142574, 143221, 142944]
57418A42944j196j165p3J038J373J110O46K01K82J376K895L566L135K535K151
57403A60818J342L7o04J50J450K134K119J885J510R97O58N53K93q1J70J257K301
57386A76989K463J892J091K96p0O18K108L141L053K620K654K815K518K078K012
57371B06278K024J643J200J221J439J273Q25O77J008J547K046K298K172K028K516
57356B30195L604M374M194L469K884K625K632K866K982K552J917J919K443K399
57342B71055J554J134J941L057L355L046K813K474J703J154J638K751L446L412
57328C04533L057K648K312K259K294J782Q53O91J862L259L748L777M255M765M411
57313C46506L555L252L516L678L948N003O277O308M847L233K570K671K987L461
$$ y = [142944, 141748, 140583, 140510, 141548, 142921, 144031, 144677, 144878, 145160, 146536, 149431, 152997, 156132, 158667, 160818, 162160, 162197, 161593, 161743, 163193, 165327, 167446, 169331, 170841, 171838, 172496, 173049, 173342, 173261, 173431, 174688, 176989, 179452, 181344, 182435, 182731, 182661, 183279, 185387, 188528, 191581, 194201, 196855, 199670, 202188, 204266, 206278, 208302, 209945, 211145, 212366, 213805, 215078, 215903, 216580, 217588, 219135, 221181, 223479, 225651, 227679, 230195, 233799, 238173, 242367, 245836, 248720, 251345, 253977, 256843, 259825, 262377, 264294, 266213, 268656, 271055, 272609, 273743, 275684, 278741, 282096, 285142, 287955, 290429, 292132, 293286, 294924, 297675, 301121, 304533, 307590, 310238, 312550, 314809, 317103, 318885, 319738, 320429, 322291, 325550, 329298, 333075, 337330, 342095, 346506, 350061, 353313, 356829, 360507, 364455, 369458, 375735, 382043, 386890, 390123, 392693, 395364, 398351, 401812]
57299D01812M158M922N639O268O609O541O348O257N966N266M668M699N040N214
57285D79407N565O578P660P808P201O964P489Q096Q338Q528Q979R613J0379J1230
57271E93835J1816J1931J2081J2709J3135J2401J0951J0224J0587J0950J0674
57260G21294J0552J1356J2467J2753J2138J1525J1542J1900J1993J1683J1392
57249H50595J1408J1351J0687R729R492J0316J1348J1821J2010J2304J2179J1087
57237I84327R700R154R463R784R904J0316J0993J1315J1159J1136J1634J2435
57225A111320J3210J3663J3386J2447J1815J2355J3606J4446J4633J4702J4749
57214A260332J4492J4222J4464J4758J4198J3017J2418J2750J3235J3560J4308
$$ y = [401812, 405970, 410892, 416531, 422799, 429408, 435949, 442297, 448554, 454520, 459786, 464454, 469153, 474193, 479407, 484972, 491550, 499210, 507018, 514219, 521183, 528672, 536768, 545106, 553634, 562613, 572226, 582605, 593835, 605651, 617582, 629663, 642372, 655507, 667908, 678859, 689083, 699670, 710620, 721294, 731846, 743202, 755669, 768422, 780560, 792085, 803627, 815527, 827520, 839203, 850595, 862003, 873354, 884041, 893770, 903262, 913578, 924926, 936747, 948757, 961061, 973240, 984327, 994027, 1003181, 1012644, 1022428, 1032332, 1042648, 1053641, 1064956, 1076115, 1087251, 1098885, 1111320, 1124530, 1138193, 1151579, 1164026, 1175841, 1188196, 1201802, 1216248, 1230881, 1245583, 1260332, 1274824, 1289046, 1303510, 1318268, 1332466, 1345483, 1357901, 1370651, 1383886, 1397446, 1411754]
57203A411754J5531J6319J6239J5947J5904J5653J4908J4301J4363J4701J4789
57192A580409J4775J4917J4952J4552J3766J2693J1310R926R089Q817Q595Q345
57180A722146Q551R228R686R619R544R880J0385J0908J1742J2855J3604J3666
57168A851814J3543J3738J4226J4989J6179J7430J7910J7538J7247J7646J8262
57157B030522J8558J8727J8870J8442J7283J6345J6592J7793J9088K0082K0662
57146B232964K0493J9500J8341J7649J7218J6589J5939J5688J5685J5454J4861
57135B420381J4000J2762J1108R319P565N627L520J865J123R63R45J297K323L609
57121B496407M541N283O523Q487J0781J3070J5383J7878K0738K4144K8241L3299
$$ y = [1411754, 1427285, 1443604, 1459843, 1475790, 1491694, 1507347, 1522255, 1536556, 1550919, 1565620, 1580409, 1595184, 1610101, 1625053, 1639605, 1653371, 1666064, 1677374, 1687300, 1696389, 1705206, 1713801, 1722146, 1730697, 1739925, 1749611, 1759230, 1768774, 1778654, 1789039, 1799947, 1811689, 1824544, 1838148, 1851814, 1865357, 1879095, 1893321, 1908310, 1924489, 1941919, 1959829, 1977367, 1994614, 2012260, 2030522, 2049080, 2067807, 2086677, 2105119, 2122402, 2138747, 2155339, 2173132, 2192220, 2212302, 2232964, 2253457, 2272957, 2291298, 2308947, 2326165, 2342754, 2358693, 2374381, 2390066, 2405520, 2420381, 2434381, 2447143, 2458251, 2467570, 2475135, 2480762, 2484282, 2486147, 2487270, 2488233, 2489178, 2490475, 2492798, 2496407, 2500948, 2506231, 2512754, 2521241, 2532022, 2545092, 2560475, 2578353, 2599091, 2623235, 2651476, 2684775]
57109B684775M0069M9365O1161P4632Q9441J06405J26709J51259J81205K18304
57099C783325K64155L19694L86070M65227N58971O67807P90863R25799J067822
57090I229733J209249J340462J450590J527637J560573J543405J476502J363902
57082B0702053J213637J045081Q92901P93498P58883P62202P50892O75999N13122
57073B8108268K64559m8619l93958p33791j033342j268860j430928j522105j552372
57064B0388852j535093j483637j408861j318568j218809j114996j011689r12209
57056A0384990q19144p34780o60291n94906n36883m85418m41094m04479l75061
57047E332934l51547l32397l15761k99668k82840k65050k46566k27618k08565
$$ y = [2684775, 2724844, 2774209, 2835370, 2910002, 2999443, 3105848, 3232557, 3383816, 3565021, 3783325, 4047480, 4367174, 4753244, 5218471, 5777442, 6445249, 7236112, 8161911, 9229733, 10438982, 11779444, 13230034, 14757671, 16318244, 17861649, 19338151, 20702053, 21915690, 22960771, 23853672, 24647170, 25406053, 26168255, 26919147, 27595146, 28108268, 28372827, 28324208, 27930250, 27196459, 26163117, 24894257, 23463329, 21941224, 20388852, 18853759, 17370122, 15961261, 14642693, 13423884, 12308888, 11297199, 10384990, 9565846, 8831066, 8170775, 7575869, 7038986, 6553568, 6112474, 5707995, 5332934, 4981387, 4648990, 4333229, 4033561, 3750721, 3485671, 3239105, 3011487, 2802922]
57038B802922j89799j71225j52335j33112j14238r5984p7630n8543l9367k1827
57028A748862q176j405m701j8892m0115o1219p6130q2914q3220p9781p4639o8723
57016A148947o2222n5316m8617m2766l7772l3178k8943k5679k3767k2643k1372
57005G46672j9669j8035j6849j5799j4432j2971j2168j2262j2542j2180j1103
56994E88662r750q388p126o205n546m278j667J552L796M750N815P960J0150J0635
56980E90360Q945N748J426m009r861j4742j7747j8948j8744j7398j5385j3417
56968D76228j1818j0236q239n920l675j611N09K913N613Q594J1980J5738J9154
56955D99230K0914J9954J6191J0257K849n261j2723j7964k0306k0380j9295j7731
$$ y = [2802922, 2613123, 2441898, 2289563, 2156451, 2042213, 1946229, 1868599, 1810056, 1770689, 1748862, 1740686, 1739281, 1734580, 1715688, 1675573, 1614354, 1538224, 1455310, 1372090, 1292309, 1217670, 1148947, 1086725, 1031409, 982792, 940026, 902254, 869076, 840133, 814454, 790687, 768044, 746672, 727003, 708968, 692119, 676320, 661888, 648917, 636749, 624487, 611945, 599765, 588662, 578912, 570524, 563398, 557193, 551647, 547369, 545702, 547254, 551050, 555800, 561615, 569575, 579725, 590360, 599305, 605053, 606479, 602470, 592609, 577867, 560120, 541172, 522428, 505030, 489645, 476228, 464410, 454174, 445935, 440015, 436340, 434729, 435238, 438151, 443764, 452358, 464338, 480076, 499230, 520144, 540098, 556289, 566546, 569395, 564134, 551411, 533447, 513141, 492761, 473466, 455735]
56943D55735j5874j3712j1079p796m076n56K282M569O911R960J3993J8555K2642
56930D81554K5595K7394K7589K4478J6549M741p746j8085k5311k9408l0371k8776
56918D68203k5973k2919j9574j6026j3155j1483j0301q773p138o024n399m989
56906C16449m896m949m276k492o24K28M25J032K179L290M346N747P333Q673J0002
56891C42467J1830J3946J5826J7604J9589K1349K2300K2662K2517K0408J4580
56880E45078N581l750j1036j5858j8635j9555j9019j7883j6598j4860j2383r254
56868C91828n451q81M057Q873J3957K0142K7279L4356M1114M8058N4393N7177
56856F94902N3326M1916K4331L440j6782l2142m0299m1977l9728l5662l0617k4782
$$ y = [455735, 439861, 426149, 415070, 407274, 403198, 402642, 404924, 409493, 416404, 426364, 440357, 458912, 481554, 507149, 534543, 562132, 586610, 603159, 607900, 600154, 582069, 556758, 527350, 496979, 468203, 442230, 419311, 399737, 383711, 370556, 359073, 348772, 339999, 332861, 326837, 321438, 316449, 311553, 306604, 302328, 299836, 299212, 299440, 299865, 300897, 303076, 306366, 310712, 316459, 323792, 332465, 342467, 354297, 368243, 384069, 401673, 421262, 442611, 464911, 487573, 510090, 530498, 545078, 550659, 546909, 535873, 520015, 501380, 481825, 462806, 444923, 428325, 413465, 401082, 391828, 386377, 385496, 389553, 398426, 412383, 432525, 459804, 494160, 535274, 583332, 637725, 694902, 748228, 790144, 814475, 817915, 801133, 768991, 728692, 686715, 646987, 611325, 580708, 555926]
56844E55926j8405j1982n934NO903J5538K5333L5127M4938N5983O8718Q1687R2290
56831I46127R7451R3462P7039M8307J2310k3350n2436p1809q0976q1488p6365
56820H88272o8633n9920n0698m1445l2700k4299j5493o058L378J2289K0922K9906
56808F55521L9543M9619N9233O6217O7030N8219L8912J2286j5702l9458n6082
56797I35338o5271o7893o5192n8924n1223m3790l7269l1342k5251j8507j1484
56786D59192n111L44N789J2053J8560K4050K8273L1648L3220L0363K1371P618
56774F67370p446k0829l1057l7630m0619m0658l8668l5396l1446k7464k3888k0658
56762C11611j7539j4594j2136j0325r111q294p538o514n299m447m410n016n627
$$ y = [555926, 537521, 525539, 519605, 519610, 526513, 542051, 567384, 602511, 647449, 703432, 772150, 853837, 946127, 1043578, 1137040, 1214079, 1262386, 1274696, 1251346, 1198910, 1127101, 1046125, 964637, 888272, 819639, 759719, 709021, 667576, 634876, 610577, 595084, 589026, 592404, 604693, 625615, 655521, 695064, 744683, 803916, 870133, 937163, 995382, 1034294, 1046580, 1030878, 991420, 935338, 870067, 802174, 736982, 678058, 626835, 583045, 545776, 514434, 489183, 470676, 459192, 454081, 454425, 460214, 472267, 490827, 514877, 543150, 574798, 608018, 638381, 659752, 667370, 659924, 639095, 608038, 570408, 529789, 489131, 450463, 415067, 383621, 356157, 332269, 311611, 294072, 279478, 267342, 257017, 247906, 239612, 232074, 225560, 220261, 215814, 211404, 206388, 200761]
56749B00761n660m874l518k252j754k094k696k983k886k640k350j956j456j019
56735A62623q55r70j072q66n27n26q44q17j31M80J80p81j482j655j696j575p37
56718A48749P85K084K465K117J511Q45L07J96M70P21P99R06J028R12P27R90J620
56701A67232J817J115j16j353k340k695k001o67J55k9n13o18n71p21p51l55M8
56684A57637j3l45o08r42j441j690j448j190j270j202n10L21N48L16K65N05P32
56667A49665R29J099Q34kn86j70N94M45o04j282j009n80p12r45n57K71Q21R49
56649A49160J219K043L120L790L844L856M542N867P030P517P692Q057Q394Q119
56635B24250P243O301N568M877M125L424K732J923J200R74J215J355R49Q6r31
$$ y = [200761, 195101, 190227, 186709, 184457, 182703, 180609, 177913, 174930, 172044, 169404, 167054, 165098, 163642, 162623, 161768, 160798, 159726, 158860, 158333, 157807, 156963, 156146, 156015, 156495, 156675, 155894, 154412, 152757, 151061, 149486, 148749, 149534, 151618, 154083, 156200, 157711, 158556, 158863, 159059, 159529, 160250, 161049, 161955, 162983, 163895, 164622, 165612, 167232, 169049, 170164, 170048, 168695, 166355, 163660, 161659, 160992, 161147, 161118, 160605, 159987, 159416, 158695, 157944, 157589, 157637, 157624, 157279, 156671, 155729, 154288, 152598, 151150, 149960, 148690, 147488, 146978, 147299, 147847, 148163, 148428, 148933, 149665, 150594, 151693, 152527, 152525, 151939, 151769, 152363, 152808, 152204, 150922, 149913, 149333, 148621, 147676, 147119, 147390, 148211, 149160, 150379, 152422, 155542, 159332, 163176, 167032, 171574, 177441, 184471, 191988, 199680, 207737, 216131, 224250, 231493, 237794, 243362, 248239, 252364, 255788, 258520, 260443, 261643, 262617, 263832, 265187, 266136, 266222, 265291]
56620B65291j985l005l677l613k779j678r94j025j473j867k083k246k228j668
56606B34970n68M63P48J15j079k187k584k154j587j639k083j944r70j12k09q62
56590B18318j159r13n52k74K8L20N14P70J138J219P34J01j27p6j34r9M83J280
56572B21571J374O04j31m2O50J297J668J923K138K318K620L200L917M455M717
56557B52279M965N419N826N539M206K336R62O32R30J044O00j57p96j105j118r82
56541B80580q21p06p05q79j122j215j161j317j885k475k529k040j480j134r04
56526B60207o61l79l3K65K12k72q25j276j989l012l501k859j915j805k165j840
56510B38152r74q02j350j293l01K91k42q42o24l39p88j329j137o66n88n20r0q2
$$ y = [265291, 263306, 260301, 256624, 253011, 250232, 248554, 247560, 246535, 245062, 243195, 241112, 238866, 236638, 234970, 234402, 234865, 235613, 235728, 234649, 232462, 229878, 227724, 226137, 224498, 222415, 220471, 219501, 219389, 219180, 218318, 217159, 216246, 215694, 215420, 215448, 215768, 216282, 217052, 218190, 219409, 220143, 220244, 220117, 220041, 219907, 219808, 220291, 221571, 222945, 223549, 223418, 223376, 224026, 225323, 226991, 228914, 231052, 233370, 235990, 239190, 243107, 247562, 252279, 257244, 262663, 268489, 274028, 278234, 280570, 281532, 282164, 283094, 284138, 284738, 284581, 283785, 282680, 281562, 280580, 279759, 279053, 278348, 277469, 276347, 275132, 273971, 272654, 270769, 268294, 265765, 263725, 262245, 261111, 260207, 259546, 259167, 259134, 259399, 259611, 259339, 258514, 257238, 255249, 252237, 248736, 245877, 243962, 242157, 239992, 238152, 237178, 236376, 235026, 233733, 233432, 233723, 233481, 232639, 232015, 231676, 230888, 229559, 228422, 227756, 227168, 226648, 226558, 226476]
56492B26476j037j818j160K33P72L84J90M01K43l56o48m57k22J61J064J927J713
56475B27866N45l56m04n0L58R19J357J135M60J34L32N79P64J119J271N65o72j341
56457B34581j105o15k24L98J206J557J226O64J03o26j313j394q60k23M26J316
56441B35117K014J749Q15M01Q53J239R01K68j92o72j263j538j367j213j245r98
56425B34869l14K71M55N84Q61R48P47O68Q16P31L21J58N04Q17O87M52M57M25L5
56406B44492n29r08r52n94P2N01J96m67o61l64k52l89j45M95P46M89O32J534K281
56387B46177K170J777J780J774J213O82J193K693M132M735M565M094L741L578
56373B84304L240K374J317P60O73K85p09j634j854j465p52K58J338J921J865J650
$$ y = [226476, 225439, 223621, 222461, 222694, 223466, 223850, 224040, 224441, 224684, 224328, 223680, 223223, 223001, 223162, 224226, 226153, 227866, 228411, 228055, 227651, 227601, 227959, 228878, 230235, 231370, 231830, 231964, 232296, 232875, 233639, 234758, 236029, 236594, 235922, 234581, 233476, 232861, 232637, 233035, 234241, 235798, 237024, 237688, 237791, 237165, 235852, 234458, 233598, 233375, 233801, 235117, 237131, 238880, 239695, 240096, 240949, 242188, 243089, 243357, 243165, 242493, 241230, 239692, 238325, 237112, 235867, 234869, 234555, 234826, 235281, 235865, 236726, 237674, 238421, 239089, 239905, 240636, 240957, 241115, 241619, 242436, 243123, 243575, 244032, 244457, 244492, 243963, 243055, 242103, 241509, 241581, 242082, 242278, 241811, 241150, 240786, 240534, 240145, 240000, 240495, 241241, 241730, 242362, 243896, 246177, 248347, 250124, 251904, 253678, 254891, 255573, 256766, 259459, 263591, 268326, 272891, 276985, 280726, 284304, 287544, 289918, 291235, 291995, 292668, 292953, 292244, 290610, 288756, 287291, 286539, 286797, 288135, 290056, 291921, 293571]
56357B93571J511J150O58P65J634K279J852Q08J90L78J093K009K698K605J740
56342C14941Q84N93N27K32M0M96J389J970J901J468J124J116J330J336R30N97
56326C30874R06J495J484R48J026K214L483L598K554J216K76P2O56J504J807J563
56310C55676J665K440K938K342J364J373K551L737L891L149K526K847L927M687
56296C95113M401L626L369L551L246K406K154L047M107M278L887L970M798N738
56282D47691O156N941N506N578O580Q074R229R855J0282J0512J0316J0170J0913
56269E56803J2387J3575J4210J5083J6495J7769J8623J9697K1266K2784K4268
56258G52960K6759L0636L4853L8682M2959M8665N5433O2409O9562P7190Q5143
$$ y = [293571, 295082, 296232, 296890, 297655, 299289, 301568, 303420, 304228, 304418, 304796, 305889, 307898, 310596, 313201, 314941, 315825, 316418, 316945, 317177, 317217, 317713, 319102, 321072, 322973, 324441, 325565, 326681, 328011, 329347, 330277, 330874, 331780, 333275, 334759, 335707, 336733, 338947, 342430, 346028, 348582, 349798, 350074, 350146, 350802, 352306, 354113, 355676, 357341, 359781, 362719, 365061, 366425, 367798, 370349, 374086, 377977, 381126, 383652, 386499, 390426, 395113, 399514, 403140, 406509, 410060, 413306, 415712, 417866, 420913, 425020, 429298, 433185, 437155, 441953, 447691, 453847, 459788, 465294, 470872, 477452, 485526, 494755, 504610, 514892, 525404, 535720, 545890, 556803, 569190, 582765, 596975, 612058, 628553, 646322, 664945, 684642, 705908, 728692, 752960, 779719, 810355, 845208, 883890, 926849, 975514, 1030947, 1093356, 1162918, 1240108, 1325251]
56247A325251R3440J02650J12661J21995J29286J34624J38623J41007J40994J38118
56237B578649J31907J21590J07020Q9089O8591M5723K1280k883k5427m6393o5729
56226C023417q2336r5564j06208j14838j20493j22379j21589j19647j16553j11794
56216A912016j06151j00824r5574q9512q2967p6981p1505o5735n9764n4394m9702
56205A058907m5165m0821l7005l3379k9451k5722k3112k1568k0266j8781j7132
56194G46505j5218j3115j1365j0201r150q076p594p715p305n839m378l701k986
56181F39862j608o31q56r89K73J781J793R82J176K171K352J760J879K820L301
56166F56066L192L641M704N208N077N487O521O913O425O451P761R530J1007J2415
$$ y = [1325251, 1418691, 1521341, 1634002, 1755997, 1885283, 2019907, 2158530, 2299537, 2440531, 2578649, 2710556, 2832146, 2939166, 3028255, 3096846, 3142569, 3163849, 3160966, 3135539, 3089146, 3023417, 2941081, 2845517, 2739309, 2624471, 2503978, 2381599, 2260010, 2140363, 2023810, 1912016, 1805865, 1705041, 1609467, 1519955, 1436988, 1360007, 1288502, 1222767, 1163003, 1108609, 1058907, 1013742, 972921, 935916, 902537, 873086, 847364, 824252, 802684, 782418, 763637, 746505, 731287, 718172, 706807, 696606, 687456, 679380, 671786, 664071, 656766, 650927, 646549, 642848, 639862, 638254, 637623, 636767, 635778, 636051, 637832, 639625, 640607, 641783, 643954, 646306, 648066, 649945, 652765, 656066, 659258, 662899, 667603, 672811, 677888, 683375, 689896, 696809, 703234, 709685, 717446, 726976, 737983, 750398]
56152G50398J3734J4304J4179J4501J6000J8402K1480K5464L0280L5637M2037
56141I96416N0286O0044P0037P9710Q9167R7390J01968J00996R4408Q3553P0716
56130A894691N8897N0652M6610M5628M5955M5550M2181L4827K4753J4192M367
56119B308303m289j1251j6882k3449l3205m5917n9656p3116q5427r4656r8868
56108A761587r8179r3892q6349p5693o3955n3771m5450l7597l0153k4315j9936
56097A132297j5748j1970r932r091p239l945j075M07J615L204M268M393M546N223
56083A096953N861O555Q219J0489J1661J1290J0807J1021J1095J0547J0286J0905
56071A215689J1712J2109J2347J2596J2761J3346J4929J6803J7802J8198J9048
$$ y = [750398, 764132, 778436, 792615, 807116, 823116, 841518, 862998, 888462, 918742, 954379, 996416, 1046702, 1106746, 1176783, 1256493, 1345660, 1443050, 1545018, 1646014, 1740422, 1823975, 1894691, 1953588, 2004240, 2050850, 2096478, 2142433, 2187983, 2230164, 2264991, 2289744, 2303936, 2308303, 2304014, 2292763, 2275881, 2252432, 2219227, 2173310, 2113654, 2040538, 1955111, 1860455, 1761587, 1663408, 1569516, 1483167, 1407474, 1343519, 1289748, 1244298, 1206701, 1176548, 1152233, 1132297, 1116549, 1104579, 1094647, 1085556, 1078317, 1074372, 1073297, 1073704, 1075319, 1078523, 1082791, 1087184, 1091730, 1096953, 1102814, 1109369, 1117588, 1128077, 1139738, 1151028, 1161835, 1172856, 1183951, 1194498, 1204784, 1215689, 1227401, 1239510, 1251857, 1264453, 1277214, 1290560, 1305489, 1322292, 1340094, 1358292, 1377340]
56060A377340K0137K0588K0925K2182K3454K2991K1375K0917K1965K2590K1867
56049A616331K0804K0035J9291J9102K0367K2273K3251K3735K5231K7264K8209
56038A865893K8606L0195L2257L2664L2116L3396L6536L8921M0126M2347M5733
56027B258790M7759M7876M8451N0340N1724N2091N3187N5268N6611N7398N9788
56016B839283O3611O6420O8247P1532P5864P8127P8467Q0654Q5496Q9680R2350
56005C689731R6849J04269J11322J16588J22891J31313J38920J44714J51742J60880
55995D969219J68718J74222J81189J91389K01702K10930K22717K38581K54887
55986F813554K70115K88156L10869L34508L57332L83412M14958M48360M82059
$$ y = [1377340, 1397477, 1418065, 1438990, 1461172, 1484626, 1507617, 1528992, 1549909, 1571874, 1594464, 1616331, 1637135, 1657170, 1676461, 1695563, 1715930, 1738203, 1761454, 1785189, 1810420, 1837684, 1865893, 1894499, 1924694, 1956951, 1989615, 2021731, 2055127, 2091663, 2130584, 2170710, 2213057, 2258790, 2306549, 2354425, 2402876, 2453216, 2504940, 2557031, 2610218, 2665486, 2722097, 2779495, 2839283, 2902894, 2969314, 3037561, 3109093, 3184957, 3263084, 3341551, 3422205, 3507701, 3597381, 3689731, 3786580, 3890849, 4002171, 4118759, 4241650, 4372963, 4511883, 4656597, 4808339, 4969219, 5137937, 5312159, 5493348, 5684737, 5886439, 6097369, 6320086, 6558667, 6813554, 7083669, 7371825, 7682694, 8017202, 8374534, 8757946, 9172904, 9621264, 10103323]
55977A0103323N20590N66490O16300O69052P30307Q03071Q83572R70994J071952
55968A6935651J190468J323843J474102J652535J867260K118483K412721K769010
55960C1744073L204985L732894M378629N189416O215448P504409R124590J1167156
55952H2261600J3703885J6759204K0336776K4442913K9042670L3955950L8690756
55945B59193754M2202325M2783724L8518123K8393645J3367117l654377j9120812
55938D01683499l0461632l6851980l8879392l7759471l4745936l0860929k6801297
55931A65322862k2950992j9481277j6457432j3883611j1716950r899263q385075
55924F2548262p135048o102093n241814m526051l933398l436990l013070k651564
$$ y = [10103323, 10623913, 11190403, 11806703, 12475755, 13206062, 14009133, 14892705, 15863699, 16935651, 18126119, 19449962, 20924064, 22576599, 24443859, 26562342, 28975063, 31744073, 34949058, 38681952, 43060581, 48249997, 54465445, 61969854, 71094444, 82261600, 95965485, 112724689, 133061465, 157504378, 186547048, 220502998, 259193754, 301396079, 344179803, 382697926, 411091571, 424458688, 420804311, 401683499, 371221867, 334369887, 295490495, 257731024, 222985088, 192124159, 165322862, 142371870, 122890593, 106433161, 92549550, 80832600, 70933337, 62548262, 55413214, 49311121, 44069307, 39543256, 35609858, 32172868, 29159798, 26508234]
55916B6508234k347000k087065j859056j659235j486628j334593j196427j072549
55908A3465681r64773q69485p82962p07169o43975n89224n38353m92401m53157
55899G424182m17801l83626l52720l26903l03062k78433k55595k37314k21127
55890D647601k03831j86814j72319j58772j44582j32566j25903j23141j21356
55881C278317j20584j21174j20402j16055j10219j05548j00837r4004q6445q0677
55871B222372p6470p2657o9906o8418o5859o0908n5981n3233n0822m6368m1209
55860A560541l7781l5623l3373l2029l2690l3558l2537l0587k9358k8062k5808
55849A209135k4465k5666k7460k7370k6557k7286k8491k7721k5674k4866k5159
$$ y = [26508234, 24161234, 22074169, 20215113, 18555878, 17069250, 15734657, 14538230, 13465681, 12500908, 11631423, 10848461, 10141292, 9497317, 8908093, 8369740, 7877339, 7424182, 7006381, 6622755, 6270035, 5943132, 5640070, 5361637, 5106042, 4868728, 4647601, 4443770, 4256956, 4084637, 3925865, 3781283, 3648717, 3522814, 3399673, 3278317, 3157733, 3036559, 2916157, 2800102, 2689883, 2584335, 2483498, 2389494, 2303049, 2222372, 2145902, 2073245, 2003339, 1934921, 1869062, 1808154, 1752173, 1698940, 1648118, 1601750, 1560541, 1522760, 1487137, 1453764, 1421735, 1389045, 1355487, 1322950, 1292363, 1263005, 1234943, 1209135, 1184670, 1159004, 1131544, 1104174, 1077617, 1050331, 1021840, 994119, 968445, 943579, 918420]
55838I18420k4306k1984j9837j8418j7103j6121j5905j5332j3351j1268j0814
55827G33981j1143j0412r101q890r375q866p655p579q903j0239j1107j2100j3029
55814F05582j3097j2478j1807j0754q924p275o684o147m383k193j053n51O40K180
55800E23056K922L367M852O956Q044P802P071N839L608J125m52j543l187m774
55786E64686m855l704k941l153l967n884r667j4173j6968j7051j5272j2468r043
55773D45540n849l478r75K793O853Q922Q048M805l29o628j1912j4047j3527j2479
55759D07737j1560j0017q218p525p685o981n274m504n643p348q203q347q217p510
55745C00705o164m915m195l697l328l347l318k366p35K57L6p23j569k760m136
$$ y = [918420, 894114, 872130, 852293, 833875, 816772, 800651, 784746, 769414, 756063, 744795, 733981, 722838, 712426, 703325, 694435, 685060, 676194, 668539, 660960, 652057, 641818, 630711, 618611, 605582, 592485, 580007, 568200, 557446, 548522, 541247, 534563, 528416, 524033, 521840, 520787, 520236, 520876, 523056, 525978, 529345, 534197, 541153, 549197, 556999, 564070, 569909, 573517, 574642, 574190, 572647, 569460, 564686, 559831, 556127, 553186, 550033, 546066, 540182, 530515, 516342, 499374, 482323, 467051, 454583, 445540, 439691, 436213, 435238, 438031, 444884, 453806, 461854, 466659, 466330, 459702, 447790, 433743, 420216, 407737, 396177, 386160, 377942, 370417, 362732, 355751, 350477, 345973, 340330, 332982, 324779, 316432, 308215, 300705, 294541, 289626, 285431, 281734, 278406, 275059, 271741, 269375, 268640, 268897, 268933, 268210, 266641, 263881, 259745]
55730B59745m891m814m490m094l257k317k299l330m293m353l758k998k260j816
55716B10775j800j554k92J571K966L893N260O985P679O449L823Q29j656k737k093
55701B40098q53o02j474k475l392m783o182o276n143m439m874n216m462l286k556
55686A84085j891p20N15J165J378J486J323R43J029J909K958L533L678L437K426
55671B07254P15p93j502j820k212k407k144j865j955j993j420m00N56J270J780
55656A93064K075K247K420K338J696R43R86J882K693K870K856K961K649J499J2
55641B23191j156k069l071m086m846n380n777n977o053o222o414o252n644m847
55627A55397l929k772j625r07m76O0L94j16j131j475q10m0J69N8k84j255k527
$$ y = [259745, 254854, 250040, 245550, 241456, 238199, 235882, 233583, 230253, 225960, 221607, 217849, 214851, 212591, 210775, 208975, 207421, 207129, 208700, 211666, 215559, 220819, 227804, 235483, 241932, 245755, 246584, 244928, 242191, 240098, 239245, 238643, 237169, 234694, 231302, 226519, 220337, 214061, 208918, 204479, 199605, 194389, 189927, 186641, 184085, 182194, 181474, 181989, 183154, 184532, 186018, 187341, 188284, 189313, 191222, 194180, 197713, 201391, 204828, 207254, 207969, 207176, 205674, 203854, 201642, 199235, 197091, 195226, 193271, 191278, 189858, 189458, 190014, 191284, 193064, 195139, 197386, 199806, 202144, 203840, 204783, 205769, 207651, 210344, 213214, 216070, 219031, 221680, 223179, 223191, 222035, 219966, 216895, 212809, 207963, 202583, 196806, 190829, 184776, 178554, 172140, 165888, 160244, 155397, 151468, 148696, 147071, 146164, 145688, 145748, 146142, 146026, 144895, 143420, 142610, 142570, 142739, 142797, 142513, 141258, 138731]
55610A38731k873k028j438k202l326l199j931r62r50j300j477j649j992k252k134
55595A09018j634q71OQ10J369J548J199L84l75n39k66j49k56k9P70J720K497L192
55577A18394L766L928L846M200N239O559P975R720J1378J1744J0299Q004N966
55564B11018M158K111K7j626l016m575o136p204p738p990p940p436o628n793m988
55549A46244m274l838l562k970j999j317j429j925k051j607q90k28N5k05n59k30
55533A19215P70J453J232Q11J054J697J869J375P50L39K4l94r98j704k161k056
55517A23276j692j668j859j516o60l64j074j716j297m54l98j104j680j932k418
55502A03444l230l811l813l261k144o91K53M9p06q87l91q0l64p30p12m24o4L82
$$ y = [138731, 135858, 133830, 132392, 130190, 126864, 123665, 121734, 120772, 119822, 118522, 117045, 115396, 113404, 111152, 109018, 107384, 106513, 106519, 107329, 108698, 110246, 111445, 111829, 111454, 110915, 110649, 110500, 110244, 110215, 110985, 112705, 115202, 118394, 122160, 126088, 129934, 134134, 139373, 145932, 153907, 163627, 175005, 186749, 197048, 205052, 211018, 215176, 217287, 217314, 215688, 212672, 208097, 201961, 194757, 187019, 179029, 171089, 163653, 157025, 151232, 146244, 141970, 138132, 134570, 131600, 129601, 128284, 126855, 124930, 122879, 121272, 120382, 120154, 120209, 120004, 119445, 119215, 119985, 121438, 122670, 123481, 124535, 126232, 128101, 129476, 130226, 130565, 130589, 130195, 129197, 127493, 125332, 123276, 121584, 119916, 118057, 116541, 115881, 115517, 114443, 112727, 111430, 110976, 110578, 109474, 107794, 105862, 103444, 100214, 96403, 92590, 89329, 87185, 86494, 86747, 86796, 86090, 85203, 84812, 84732, 84368, 83638, 82926, 82502, 82438, 82820]
55484H2820P78Q09M16j58o87r62p14m0L43r4q30r87n39j17J14M97Q76N95l42r73
55464H0805o23K32O78M68R8J78Q95J845K230J569K06j007j540j405q05o2L09K1
55446H4092m86m50K60J018J235Q38O0p76j231j035m45M0K96N73Q94R89P97N47
55428H7216K98j42o82q17k38P47J522J721J341O54R3RM41J195K157L229M044M038
55410A06826L054J623M56k33q12j609k430k841k826k815k929k654j642n32k10
55395I0426m71k73O06J103M15q13j420j162o05j41J78K36mk40k20j81m00o84p59
55376H5591p61q41p12j49M10M16%l63o47j108j625j879j891j846j692j434j382
55359G0087j450r02N28J753J680Q61O75J250J499J063P69J018J075M48k14k29
$$ y = [82820, 83598, 84407, 84823, 84665, 83978, 83016, 82302, 82262, 82605, 82511, 81681, 80694, 80155, 80038, 80152, 80649, 81525, 82120, 81778, 80805, 80182, 80414, 81092, 81560, 81658, 81836, 82731, 84576, 86806, 88375, 88581, 87574, 86034, 84629, 83824, 83762, 84071, 84092, 83606, 83156, 83416, 84434, 85669, 86507, 86567, 85791, 84560, 83525, 83080, 83120, 83416, 83989, 84883, 85872, 86669, 87216, 87514, 87372, 86690, 85873, 85635, 86382, 87904, 89625, 90966, 91620, 91713, 91722, 92163, 93358, 95515, 98744, 102788, 106826, 109880, 111503, 111959, 111726, 110914, 109305, 106875, 104034, 101208, 98393, 95464, 92810, 91168, 90636, 90426, 89955, 89682, 90288, 91391, 91806, 90993, 89573, 88411, 87806, 87665, 87843, 88079, 88075, 87835, 87615, 87434, 87034, 86350, 85591, 84830, 83989, 83277, 83128, 83538, 83954, 83954, 83591, 82944, 81836, 80211, 78332, 76441, 74595, 72903, 71469, 70087, 68637, 67735, 68263, 70016, 71696, 72557, 73232, 74482, 75981, 77044, 77813, 78831, 79906, 80354, 80140, 79911]
55343G9911ol06r86j175m54N65Q72J21q55q32K59J050M86o72r06j13M26K7n98
55324G6814o80l49NL43N77L95j06l80l17m03p92j011q09m71M3J205K723L327K384
55305H2498R27K38J95q8o64p73j54N39O70L00p3m7L33N76K75l22n43k98k16o31
55285H2742r93p68l14l41q84j299j042p5J139J824J431L62l28k11N4j61n34m80
55267H0122j37M2J33M71R10J075J053J191J357J151N82k8p02j593k318k229j393
55250G9687o43n15o27l60L34R41J032O64L24M46R16J170Q46J42n66j070j082k41
55232H1398J167J948J184n32j703j652r96n03k54q7j07l53m47nQ32J506J625J175
55214H4196L71n32j284j672j545r52k60N0j17l36j65K92O30P10O73N53L34K87
$$ y = [79911, 79905, 79599, 78613, 77438, 76984, 77549, 78421, 78542, 77687, 76855, 77114, 78164, 78650, 77978, 77072, 76959, 77385, 77412, 76814, 76134, 75785, 75790, 76133, 76710, 77105, 76999, 76619, 76302, 75899, 75107, 74096, 73287, 72816, 72859, 74064, 76787, 80114, 82498, 83425, 83663, 83858, 83770, 83106, 82333, 82179, 82718, 83388, 83688, 83615, 83568, 83901, 84477, 84752, 84430, 83887, 83589, 83373, 82742, 81749, 80981, 80667, 80326, 79442, 78143, 77101, 77026, 78165, 79989, 81420, 81782, 81454, 81243, 81297, 81136, 80602, 80122, 79985, 80027, 80160, 80631, 81541, 82616, 83669, 84860, 86217, 87368, 87950, 87922, 87220, 85627, 83309, 81080, 79687, 79044, 78529, 77902, 77542, 77876, 78817, 79849, 80513, 80837, 81283, 82199, 83369, 84215, 84357, 83791, 82721, 81639, 81398, 82565, 84513, 85697, 85165, 83462, 81810, 80814, 80311, 80057, 79970, 79863, 79510, 79063, 79058, 79890, 81396, 83021, 84196, 84567, 84035, 82751, 81079, 79534, 78582, 78322, 78372, 78255, 77919, 77754, 78046, 78676, 79386, 80059, 80612, 80946, 81233]
55196H1233P46J423J505O87k81m72N8M17L6o83r80n81J58O89P21L64j4j52j71
55177H4703l41n63l50M14J065R25L08J65P32J151O53m21j159j142n65K49R86J296
55159H8106J115Q35P58O65L24J4j2r2n37q75n26O4K1n92r32p74n99l98L11J187
55139H8063J194M17K67J280J992J050p77j759j493q50l32K25P02O59J66l12o83
55122H9809j171j603j548j061n68j59L64Q75J051R83J060J335J515J469J225P12
55106I4288k9o35q86j032j206j028l41K05R9n2N35J437J628J087O52N34K63p8
55088I5441Q0M94K36o24q46L5Q56O05p2J8Q91J584J502P66k90j257j600j098j78
55069I6543N77R70J099J053R67R46P28l0r78j221m93M28P94O94M86J43l25n24
$$ y = [81233, 81979, 83402, 84907, 85594, 85313, 84841, 84899, 85316, 85352, 84669, 83689, 83108, 83266, 83955, 84676, 85040, 85026, 84874, 84703, 84362, 83799, 83449, 83863, 84928, 85853, 86161, 86326, 87058, 88209, 88862, 88441, 87282, 86140, 85575, 85824, 86810, 88106, 89221, 90056, 90814, 91479, 91803, 91817, 91805, 91713, 91176, 90301, 89775, 89839, 89860, 89268, 88336, 87562, 86963, 86565, 86876, 88063, 89257, 89674, 89941, 91221, 93213, 94263, 93486, 91727, 90234, 89384, 89052, 89277, 89979, 90638, 90804, 90492, 89809, 88638, 87035, 85487, 84426, 83858, 83699, 84063, 84938, 85989, 86972, 88032, 89367, 90882, 92351, 93576, 94288, 94259, 93624, 92738, 91706, 90500, 89472, 89131, 89336, 89435, 89383, 89918, 91355, 92983, 94070, 94722, 95256, 95519, 95441, 95521, 96015, 96251, 95627, 94781, 94816, 95672, 96277, 96205, 96223, 97114, 98698, 100200, 100966, 100676, 99419, 97819, 96721, 96543, 97120, 98090, 99189, 100242, 101209, 102155, 102883, 102853, 101875, 100654, 100161, 100589, 101383, 102077, 102563, 102706, 102381, 101857]
55051A01857l37l20p97j139o76K00O19M71K50O3l47p43n23L18J055J141O55m5
55033A01702o27p50l67j7k84r47j230q68l39k0K42N66P02N06K54J82J26p0j80
55014I8581M8M41O18N02L36L23M33M88L12j27n84o83k79L45P77Q58P11N13L05
54995A03918Q4m1J30N65Q32N14j57m35j6N00M52J08K21P53Q20K5q14o76L41J168
54975A08292J038K13m40k62O75J603J661P24m50j067j123j131j233j074n06M8
54959A06968K04J18J72M07N93O42O11M12m1m69l70L28J079J283Q42L9q59j561
54941A10398j628p66O39J647J578N89n91j337j445r84j66O07Q58M28k78o32l63
54924A08554L13J106J988K976L859M396M673N004N481N905O116O121N816M921
$$ y = [101857, 101520, 101200, 100403, 99264, 98588, 98788, 99407, 99878, 100128, 100191, 99844, 99101, 98578, 98896, 99951, 101092, 101747, 101702, 101075, 100325, 99958, 99941, 99657, 98710, 97480, 96612, 96273, 96253, 96495, 97061, 97763, 98269, 98523, 98705, 98831, 98761, 98581, 98629, 99070, 99688, 100190, 100526, 100849, 101282, 101770, 102082, 101955, 101371, 100688, 100409, 100754, 101531, 102389, 103100, 103613, 103918, 104002, 103961, 104091, 104656, 105488, 106002, 105845, 105410, 105394, 105894, 106346, 106454, 106675, 107428, 108248, 108273, 107459, 106783, 107124, 108292, 109330, 109543, 109103, 108841, 109516, 111119, 112780, 113504, 113054, 111987, 110864, 109733, 108500, 107426, 106920, 106968, 107172, 107290, 107462, 107869, 108462, 109104, 109715, 110127, 110086, 109617, 109247, 109575, 110654, 111937, 112779, 112818, 111959, 110398, 108770, 108004, 108643, 110290, 111868, 112457, 111866, 110529, 109084, 108100, 107934, 108541, 109399, 109827, 109549, 108917, 108554, 108867, 109973, 111961, 114937, 118796, 123192, 127865, 132869, 138350, 144255, 150371, 156492, 162308, 167229]
54910A67229L311J254q23k543l593l871l784m005m683n143m736l664k690k224
54896A30035k133k159k116j737q97N3M96K78j54l03j04J81K72Q7j06J79J099K153
54878A25124K728K815K869L079L271L497M100N052N769N776N163M168K762R25
54864A77098j028k705l999m932n400n364n004m512l855l055k410k240k521k939
54850A27134l189l051k447j569q06m04k79l02m78p65j035j281j591j754j317l27
54834A06539M38L49k30m60j30K63M11N51Q69J017N94j85n59o8Q38J140L27r71
54816A10733j623j241m79p6m0L5K60M76P59J331K027K269J719P10j09m00l40k92
54798A15719l67l60j26J22P3j99l60l50m08m44J7R61J503R24k51q15l66L48N07
$$ y = [167229, 170540, 171794, 170971, 168428, 164835, 160964, 157180, 153175, 148492, 143349, 138613, 134949, 132259, 130035, 127902, 125743, 123627, 121890, 120993, 121046, 121542, 121820, 121666, 121363, 121259, 121440, 121712, 121799, 121693, 121872, 122971, 125124, 127852, 130667, 133536, 136615, 139886, 143383, 147483, 152535, 158304, 164080, 169243, 173411, 176173, 177098, 176070, 173365, 169366, 164434, 159034, 153670, 148666, 144154, 140299, 137244, 134834, 132594, 130073, 127134, 123945, 120894, 118447, 116878, 116072, 115668, 115389, 115087, 114609, 113844, 112809, 111528, 109937, 108183, 106866, 106539, 106977, 107326, 107096, 106636, 106506, 106769, 107180, 107731, 108600, 109617, 110211, 110026, 109467, 109399, 110237, 111377, 111704, 110733, 109110, 107869, 107390, 107314, 107274, 107309, 107569, 108045, 108804, 110135, 112162, 114431, 116150, 116860, 116751, 116351, 116011, 115719, 115352, 114992, 114866, 114988, 115061, 114862, 114502, 114152, 113744, 113300, 113317, 114278, 115781, 116705, 116454, 115639, 115273, 115621, 116128]
54779A16128Q1l83l89K40J256K056K200J948J956K392K770K806K901L478M229
54764A43669M496M168L800L904M562N604O645O886N461K489o50k652l685m865
54750A79832o431p296o728n589n147n289m899l714k670k322k047j267m52k75m76
54735A25230l72L3K21R3j5j6o7pM72J180J654J930K476L286L728L482L057L128
54717A49493L742M414M632M134L042J847R62J75j130l071m970o062o266n976n485
54702A39481m780l799k637j509o34j09J41K32K56K65K35n9p68j501j528p86j72
54685A22328l77q55o79j7J25m50q28m70l3k62q53j052q20p18r56j128q01j8P31
54666A12867Q73K65n24o99j18N87Q13N53J29j41O0Q23J511J133l64j700j705o54
$$ y = [116128, 116209, 115826, 115437, 115677, 116933, 118989, 121189, 123137, 125093, 127485, 130255, 133061, 135962, 139440, 143669, 148165, 152333, 156133, 160037, 164599, 170203, 176848, 183734, 189195, 191684, 191034, 188382, 184697, 179832, 173401, 166105, 159377, 153788, 148641, 143352, 138453, 134739, 132069, 129747, 127700, 126433, 125981, 125706, 125230, 124858, 124891, 125112, 125205, 125190, 125174, 125107, 125100, 125572, 126752, 128406, 130336, 132812, 136098, 139826, 143308, 146365, 149493, 153235, 157649, 162281, 166415, 169457, 171304, 172266, 172441, 171311, 168240, 163270, 157208, 150942, 144966, 139481, 134701, 130902, 128265, 126756, 126122, 126013, 126154, 126386, 126642, 126907, 127142, 127083, 126315, 124814, 123286, 122500, 122328, 121951, 121096, 120417, 120400, 120525, 120075, 119247, 118777, 118744, 118482, 117629, 116577, 115757, 115039, 114083, 112955, 112154, 112136, 112867, 113740, 114005, 113481, 112782, 112664, 113251, 114064, 114617, 114746, 114605, 114665, 115488, 116999, 118132, 117768, 116068, 114363, 113709]
54648A13709L06N98N12M61O09R79J310J064J66n32k04P42J175Q16M19L67J15o89
54630A21923j374j196m82r4j98k21R1L05Q4k24j26K65L63o6o03p46n23l31l24
54611A16523l08j76j36l08m34k29J56L34K10J8j16l12n75n92r1P13J207R61J54
54592A16999n97q33o02j49M56J193J675J388M22m54o77m66k60n5L05N56L56n8
54574A19199j61l5k10o61o14K97J302J356M26n20o59j27L16J84k66m43k27j42
54556A19015n61j025p83J31Q82R97R07J106J258P23l31q74j86J304K450K498J724
54539A29235R99Q06P83L25n22j103j041o19k14J77N66O16J35m46n81m06m93r16
54521A27301j208j209j283j563j592j056l47J5P2J68K79K14K12O97J461J722J150
$$ y = [113709, 114015, 114613, 115125, 115586, 116195, 117174, 118484, 119548, 119714, 119182, 118978, 119720, 120895, 121711, 122130, 122497, 122612, 121923, 120549, 119353, 118871, 118777, 118579, 118358, 118449, 118754, 118838, 118614, 118488, 118753, 119116, 119050, 118447, 117701, 117178, 116847, 116523, 116215, 116039, 115903, 115595, 115161, 114932, 115088, 115422, 115632, 115650, 115534, 115222, 114647, 114055, 113964, 114677, 115884, 116845, 116999, 116402, 115569, 114967, 114818, 115274, 116467, 118142, 119530, 119952, 119498, 118821, 118355, 118095, 118040, 118345, 118901, 119257, 119199, 119038, 119003, 118793, 118132, 117518, 117815, 119117, 120473, 120899, 120379, 119720, 119593, 119909, 120093, 119827, 119384, 119157, 119015, 118454, 117429, 116646, 116777, 117659, 118656, 119563, 120669, 121927, 122650, 122319, 121445, 121259, 122563, 125013, 127511, 129235, 130234, 131040, 131823, 132148, 131626, 130523, 129482, 128863, 128649, 128826, 129392, 130008, 130143, 129697, 129116, 128710, 128217, 127301, 126093, 124884, 123601, 122038, 120446, 119390, 119043, 119058, 119130, 119298, 119577, 119791, 120003, 120700, 122161, 123883, 125033]
54504A25033L46K5J98M12M34K55j83p48q42m8R87J053m8j076r21K4N60L11j27
54485A25645l25n06q05q89n52j05K01N58J004J009K74m75k79O75J254R56N44Q25
54467A29009J545J875J562R55L19l18p19n07K43R32J104Q54L85l58j367k127k055
54450A31332j266n26l10l14o7K94J98n36j410j776j363l64P74J524J547J017M58
54433A29212K01J66K61O29J190J320N40o49j193p49N7O89J314K055K348J672N28
54416A39591r6l5l6n14r52p18R6R25J350J162L32o78r94k54P28Q71L27L39J461
54397A42905K588K357J037J98N11Q28j00j660k081q31P05J112N65J3l82j019j597
54380A45149j277o2J012J285J206J310J388J135Q82R69R83M15l37l51N71J758
$$ y = [125033, 125379, 125404, 125602, 126014, 126448, 126703, 126520, 125772, 124930, 124882, 125869, 126922, 126874, 125798, 124877, 124901, 125461, 125772, 125645, 125320, 124814, 124009, 123120, 122568, 122463, 122664, 123222, 124226, 125235, 125509, 125034, 124755, 125430, 126684, 127640, 128184, 129009, 130554, 132429, 133991, 134946, 135265, 134947, 134228, 133721, 133964, 134896, 136000, 136854, 137239, 136881, 135514, 133387, 131332, 130066, 129540, 129230, 128916, 128849, 129143, 129341, 128805, 127395, 125619, 124256, 123892, 124666, 126190, 127737, 128754, 129212, 129413, 129579, 129840, 130469, 131659, 132979, 133519, 132870, 131677, 130928, 130985, 131674, 132988, 135043, 137391, 139063, 139591, 139495, 139460, 139424, 138910, 137958, 137240, 137336, 138261, 139611, 140773, 141105, 140427, 139433, 139179, 139907, 140778, 141105, 141444, 142905, 145493, 147850, 148887, 149085, 149596, 150424, 150324, 148664, 146583, 145752, 146457, 147569, 148134, 148147, 147765, 146746, 145149, 143872, 143810, 144822, 146107, 147313, 148623, 150011, 151146, 152028, 152997, 153980, 154395, 154058, 153707, 154278, 156036]
54364A56036K591K946K853K371J814J561J653J982K694L810M659M405L169J811
54350A94355N99j050l238m912n156m488m154m436m465l557k148j198j093j349
54336A53710j265o86n7K29K42J78j06p73j463j595j213r21q80n41L65J217J281
54319A47722O52m4m89p37p80n42k33j98m55o03k31O67J476J292j78j923k454j434
54301A41508j4O94P51O36K65n32j175r96l46j13l60l98j7K49J42k0j17m16p59
54282A38982n11L67R83P91M10O54J258J286M71n39j111j204j011n36K46J141J784
54265A43461J949J678J153N29mr2M80J253J359O09r1J20Q45J080P62P55J350J707
54247A58903J161K17k66k12j50l23n84q54j119j222j078r54j156j543j644j171
$$ y = [156036, 158627, 161573, 164426, 166797, 168611, 170172, 171825, 173807, 176501, 180311, 184970, 189375, 192544, 194355, 194954, 193904, 190666, 185754, 180598, 176110, 171956, 167520, 163055, 159498, 157350, 156152, 155059, 153710, 152445, 151759, 151702, 151931, 152173, 152351, 152245, 151472, 150009, 148414, 147201, 146280, 145400, 144859, 145224, 146441, 147722, 148374, 148330, 147841, 147104, 146324, 145782, 145549, 145351, 144896, 144293, 144062, 144729, 146205, 147497, 147319, 145396, 142942, 141508, 141494, 142188, 142939, 143575, 143840, 143308, 142133, 141137, 140791, 140678, 140318, 139920, 139903, 140152, 140294, 140274, 140157, 139741, 138982, 138471, 138838, 139821, 140612, 141022, 141676, 142934, 144220, 144691, 144152, 143041, 141837, 140826, 140290, 140536, 141677, 143461, 145410, 147088, 148241, 148770, 148766, 148674, 149154, 150407, 151766, 152375, 152284, 152404, 153249, 154329, 155091, 155846, 157196, 158903, 160064, 160281, 160015, 159803, 159653, 159330, 158746, 157892, 156773, 155551, 154473, 153519, 152363, 150820, 149176, 148005]
54231A48005k57O45R90M90m83j149j073n02J72Q38J386J474R31O7p24j303j529
54214A47978j118k04M35K48k97m06p0P2k21n61o88p79r08p59j46N89R02O49K11
54195A44927Q6L73O92O95N85P12P65J7j405k261j754p05l94q54j131q78n55l10
54177A38605K24R31J143Q15Q05J530K230K062J255N80K63j3l98p48q75o07J24
54160A47926R34J117M67l96q64j016j110r10j07R05J299P66k30r74r99l12M49
54143A46945M45l64q97k42J100J824J450O51O8l45p08p54l34J64L10J46k3j7K38
54124A49657P26J061O70m12j268j103k21M59O33Q19J347J865J964J821J772J598
54108A61388P94n32j513j470o30K73Q24J070J041O28k1l93j19N89J192J378J232
$$ y = [148005, 147748, 148393, 149383, 149873, 149390, 148241, 147168, 146666, 146838, 147676, 149062, 150536, 151467, 151534, 150810, 149507, 147978, 146860, 146656, 147091, 147339, 147042, 146636, 146566, 146638, 146417, 145856, 145168, 144389, 143481, 142722, 142576, 143165, 144067, 144716, 144927, 145013, 145386, 146078, 146773, 147358, 148070, 148835, 148852, 147447, 145186, 143432, 142727, 142333, 141479, 140348, 139470, 138915, 138605, 138829, 139760, 140903, 141718, 142523, 144053, 146283, 148345, 149600, 150180, 150443, 150430, 150032, 149284, 148409, 147802, 147926, 148860, 149977, 150444, 150048, 149184, 148168, 147058, 146148, 146041, 146946, 148245, 149011, 148781, 147807, 146808, 146496, 146945, 147390, 147026, 146129, 145887, 146987, 148811, 150261, 150912, 150980, 150635, 149927, 149173, 148839, 149003, 149313, 149459, 149436, 149419, 149657, 150383, 151444, 152114, 151702, 150434, 149331, 149110, 149569, 150202, 151021, 152368, 154233, 156197, 158018, 159790, 161388, 162182, 161650, 160137, 158667, 158037, 158310, 159134, 160204, 161245, 161873, 161852, 161459, 161340, 161929, 163121, 164499, 165731]
54091A65731J097J341K124L159L935M399N161O747Q757J0163J0331R334P352M356
54077B43987O20k886n138n974o095o156o162n755m861l853l158k853k686k362
54063A86668j763r56j57L49M06J88M4Q6J27O6J26N34J168J712K056K279K455K668
54045A98056L081L710M239M449M649N323O396P328P912Q515R373J0107J0153R356
54031B92647P943O176M300K599J207N0r10j547j829j946k012j927j700j657k071
54016B99323k728l140l125k974l187m045n280o139o087n453n086n209n212m704
54002B36954m160m126m341m271m011l925l706k698j075R9J15p24j740k524k803
53987A97064k325j227j15M77M65J1o09r34o26j6J35l44p82n84L7N52P86P99N71
$$ y = [165731, 166828, 168169, 170293, 173452, 177387, 181786, 186947, 193694, 202451, 212614, 222945, 232279, 239631, 243987, 244607, 241721, 236583, 230609, 224514, 218358, 212196, 206441, 201580, 197727, 194569, 191716, 189030, 186668, 184905, 183949, 183792, 184141, 184547, 184735, 184779, 184865, 184992, 185058, 185184, 185718, 186886, 188598, 190654, 192933, 195388, 198056, 201137, 204847, 209086, 213535, 218184, 223507, 229903, 237231, 245143, 253658, 263031, 273138, 283291, 292647, 300590, 306766, 311066, 313665, 314872, 314922, 314012, 312465, 310636, 308690, 306678, 304751, 303051, 301394, 299323, 296595, 293455, 290330, 287356, 284169, 280124, 274844, 268705, 262618, 257165, 252079, 246870, 241658, 236954, 232794, 228668, 224327, 220056, 216045, 212120, 208414, 205716, 204641, 204740, 204855, 204131, 202391, 199867, 197064, 194739, 193512, 193397, 193874, 194339, 194350, 193741, 192807, 192181, 192165, 192300, 191956, 191174, 190590, 190627, 191179, 191965, 192764, 193335]
53968A93335K50K53O85J031Q89O72J041J861K316J977J285R26J146J690K192K542
53952B14091L003L870N031O054O837P774R100J0540J1904J3535J5573J7027J6313
53939C40652J2703O958O43m743q215r528r171p857o077m200k674j652p37L85J333
53924C07820J625J568J825K289K308K018K367L605M733M974M946N644O904P708
53910C60334P631P144O596N639L888J646k50j204j405j580k181k856k862k117
53896C78423j413j550k538l876n203o378p216p678q089q739r293r089q061o942
53882B92358o400o253n798m769l727l406l885m504m586m087l520l361l639l944
53868B30479l750k895j901j529j818j919j294o58j036k166k728k166j324j048
$$ y = [193335, 193585, 193838, 194523, 195554, 196443, 197115, 198156, 200017, 202333, 204310, 205595, 206521, 207667, 209357, 211549, 214091, 217094, 220964, 225995, 232049, 238886, 246660, 255760, 266300, 278204, 291739, 307312, 324339, 340652, 353355, 360313, 360956, 356213, 347998, 338470, 329299, 321442, 315365, 311165, 308491, 306839, 306102, 306487, 307820, 309445, 311013, 312838, 315127, 317435, 319453, 321820, 325425, 330158, 335132, 340078, 345722, 352626, 360334, 367965, 375109, 381705, 387344, 391232, 392878, 392628, 391424, 390019, 388439, 386258, 383402, 380540, 378423, 377010, 375460, 372922, 369046, 363843, 357465, 350249, 342571, 334482, 325743, 316450, 307361, 299300, 292358, 285958, 279705, 273907, 269138, 265411, 262005, 258120, 253616, 249030, 244943, 241423, 238062, 234423, 230479, 226729, 223834, 221933, 220404, 218586, 216667, 215373, 214715, 213679, 211513, 208785, 206619, 205295, 204247]
53854B04247j087q75n60n70p59p71p70j058j334j089n37l10m52m08j7K51Q5k83
53836A93703o16r44j128p37K56J101J014J48m83o9J151K118K047J264Q03J156
53820B00784J796J983J658J236R59R10J251J833J970J217K09m3N48J310K096L353
53804B23070M894N683N330M818N164O073O579O385N837N053L901K643J883J847
53790B89160K232K688K981K790J987J031N96O51L75q05k517l973m829n191n134
53775B82042m662m092l995m530n081m943m190l583l562l766l657l302l085k965
53761B26629k573j947j667k040k659k984l066l268l533l272k079l84P94P85k8
53746A98708n80l33J51N3n42q22l96L12Q51J259J571J453P87J71K43P89J026O67
$$ y = [204247, 203160, 202285, 201725, 201155, 200396, 199625, 198855, 197797, 196463, 195374, 194837, 194527, 194075, 193667, 193650, 193901, 193986, 193703, 193087, 192143, 191015, 190278, 190534, 191635, 192649, 192797, 192314, 192245, 193396, 195514, 197561, 198825, 199628, 200784, 202580, 204563, 206221, 207457, 208416, 209326, 210577, 212410, 214380, 215597, 215806, 215763, 216311, 217621, 219717, 223070, 227964, 233647, 238977, 243795, 248959, 255032, 261611, 267996, 273833, 278886, 282787, 285430, 287313, 289160, 291392, 294080, 297061, 299851, 301838, 302869, 303465, 304116, 304491, 303686, 301169, 297196, 292367, 287176, 282042, 277380, 273288, 269293, 264763, 259682, 254739, 250549, 246966, 243404, 239638, 235981, 232679, 229594, 226629, 224056, 222109, 220442, 218402, 215743, 212759, 209693, 206425, 202892, 199620, 197541, 197157, 197951, 198736, 198708, 198128, 197795, 197946, 197999, 197457, 196635, 196239, 196551, 197402, 198661, 200232, 201685, 202472, 202643, 202886, 203675, 204701, 205368]
53728B05368K50L75J018J655J869J713J588J757K003J884J324O92L09J58K04N24
53712B22691R59J047P07N65J180K150K576K248J897K195L040L794L966L565L025
53697B55605K856L139L395L193K721K467K457K281J882J747K165K651K501J614
53683B90674M84n08j345j973k027j252j06N05J48o44j062r65q13q01o34k73k61
53666B79147r19j605j390k30R77J471J237O31j10q51j435j788j923j759j172k98
53650B69983M59P88P08M60L69O96J410J985J822R35L3j65M26J296J817J626Q54
53633B85502O8j93R0N62J050J737K708L646M221M493M707M840M672M277M138M618
53617C31136N495O179O351O175N869N328M372L171K076J218N61L23P55J500J812
$$ y = [205368, 205618, 205993, 207011, 208666, 210535, 212248, 213836, 215593, 217596, 219480, 220804, 221496, 221805, 221963, 222167, 222691, 223650, 224697, 225404, 225969, 227149, 229299, 231875, 234123, 236020, 238215, 241255, 245049, 249015, 252580, 255605, 258461, 261600, 264995, 268188, 270909, 273376, 275833, 278114, 279996, 281743, 283908, 286559, 289060, 290674, 291158, 290650, 289305, 287332, 285305, 284053, 283947, 284452, 284600, 283956, 282894, 281929, 281116, 280315, 279681, 279408, 279147, 278228, 276623, 275233, 275003, 275980, 277451, 278688, 279319, 279209, 278358, 276923, 275135, 273212, 271453, 270281, 269983, 270442, 271230, 271938, 272398, 272767, 273463, 274873, 276858, 278680, 279615, 279648, 279483, 279909, 281205, 283022, 284648, 285502, 285570, 285377, 285467, 286029, 287079, 288816, 291524, 295170, 299391, 303884, 308591, 313431, 318103, 322380, 326518, 331136, 336631, 342810, 349161, 355336, 361205, 366533, 370905, 374076, 376152, 377370, 377931, 378254, 379009, 380509, 382321]
53602C82321J619J700K405K876K237R42J18m3k23n55l91L77R17P17L43M01N70
53585C96331K34n30j256j858k440k733k402j646r57m81j21m3m98j292j941k267
53569C76100k356k101j397o56m67p31p02j09L91J92l04k38M77R70N53l44o78q2
53551C68518O86P65L09J91P29J301J369J214J315J538J546J591K132K921L252
53536C89377L120L329M296N438O077O281O504O843P142P404P728Q102Q657R669
53522D79967J0981J1813J1693J1319J1763J3060J4256J4877J5510J6731J8171
53511F30141J9179J9853K0806K2131K3257K3795K3939K3943K3747K3315K2936
53500H77042K2856K2824K2357K1319J9959J8634J7722J7613J8264J8874J8541
$$ y = [382321, 383940, 385640, 388045, 390921, 393158, 394100, 394218, 394175, 393952, 393397, 393006, 393383, 394300, 395017, 395360, 395761, 396331, 396565, 396035, 394779, 392921, 390481, 387748, 385346, 383700, 382743, 382262, 382141, 382098, 381600, 380308, 378367, 376100, 373744, 371643, 370246, 369590, 369123, 368392, 367690, 367581, 367972, 368164, 367860, 367622, 368099, 369069, 369622, 369278, 368600, 368518, 369204, 369969, 370278, 370469, 371198, 372499, 373868, 375082, 376397, 377935, 379481, 381072, 383204, 386125, 389377, 392497, 395826, 400122, 405560, 411637, 417918, 424422, 431265, 438407, 445811, 453539, 461641, 470298, 479967, 490948, 502761, 514454, 525773, 537536, 550596, 564852, 579729, 595239, 611970, 630141, 649320, 669173, 689979, 712110, 735367, 759162, 783101, 807044, 830791, 854106, 877042, 899898, 922722, 945079, 966398, 986357, 1004991, 1022713, 1040326, 1058590, 1077464, 1096005]
53489A096005J7432J6716J7115J8008J8346J8011J7636J7449J7064J6471J6430
53478A286683J7466J8983J9716J8901J6756J4038J1451R231P077M575J874l05
53466A426446j659k985n344q667j1658j3243j3605j3624j3716j3655j3297j3001
53454A301992j3277j4300j5854j7602j9220k0384k0755k0203j9103j8230j8096
53443A104968j8366j8184j7095j5367j3304j0768p819n390m572n194n755n072
53431I78082l444j914q98o2Q60J803K766L892N074O066P010Q333R988J1348J2153
53416A041057J3047J4763J7103J9159K0398K1061K1709K2748K4290K6063K7526
53405A268924K8487K9543L1432L4038L6477L8238L9677M1223M2760M4149M5819
$$ y = [1096005, 1113437, 1130153, 1147268, 1165276, 1183622, 1201633, 1219269, 1236718, 1253782, 1270253, 1286683, 1304149, 1323132, 1342848, 1361749, 1378505, 1392543, 1403994, 1413225, 1420302, 1424877, 1426751, 1426446, 1424787, 1421802, 1416458, 1407791, 1396133, 1382890, 1369285, 1355661, 1341945, 1328290, 1314993, 1301992, 1288715, 1274415, 1258561, 1240959, 1221739, 1201355, 1180600, 1160397, 1141294, 1123064, 1104968, 1086602, 1068418, 1051323, 1035956, 1022652, 1011884, 1004065, 998675, 994103, 988909, 983154, 978082, 974638, 972724, 971826, 971764, 972624, 974427, 977193, 981085, 986159, 992225, 999235, 1007568, 1017556, 1028904, 1041057, 1054104, 1068867, 1085970, 1105129, 1125527, 1146588, 1168297, 1191045, 1215335, 1241398, 1268924, 1297411, 1326954, 1358386, 1392424, 1428901, 1467139, 1506816, 1548039, 1590799, 1634948, 1680767]
53394A680767M8196N0844N2832N3797N4103N4059N3613N2905N2400N2204N1758
53383B257478N0647M9250M8111M6911M4790M1527L7839L4419L1155K7581K3650
53372B693358J9731J6025J2348Q352L669k073r038j6869k4741l1824l7662m2117
53360B589159m5200m7012m7831m8070m8093m8048m7871m7430m6656m5507m3951
53349B073490m2046m0034l8283l7103l6755l7374l8719m0003m0394l9752l8607
53338A644420l7272l5438l2860l0010k7583k5626k3659k1424j9024j6506j3994
53327A361024j2090j1528j2218j3348j4465j5765j7096j7583j6826j5702j5210
53316A199193j5063j4263j2685j1111r832q311o316m417k982j568J85J734K428
$$ y = [1680767, 1728963, 1779807, 1832639, 1886436, 1940539, 1994598, 2048211, 2101116, 2153516, 2205720, 2257478, 2308125, 2357375, 2405486, 2452397, 2497187, 2538714, 2576553, 2610972, 2642127, 2669708, 2693358, 2713089, 2729114, 2741462, 2749814, 2753483, 2751410, 2742372, 2725503, 2700762, 2668938, 2631276, 2589159, 2543959, 2496947, 2449116, 2401046, 2352953, 2304905, 2257034, 2209604, 2162948, 2117441, 2073490, 2031444, 1991410, 1953127, 1916024, 1879269, 1841895, 1803176, 1763173, 1722779, 1683027, 1644420, 1607148, 1571710, 1538850, 1508840, 1481257, 1455631, 1431972, 1410548, 1391524, 1375018, 1361024, 1348934, 1337406, 1325188, 1311840, 1297375, 1281610, 1264514, 1246931, 1230105, 1214403, 1199193, 1184130, 1169867, 1157182, 1146071, 1136239, 1127928, 1121612, 1117195, 1114213, 1112645, 1112830, 1114564, 1116992]
53303A116992K667L447M958O406P254Q005R432J1566J3861J6053J8338K0690K2586
53290A262255K3682K4367K5230K6114K6269K5478K4450K3804K3182K1862J9837
53279A526530J7691J5624J3280J0435P202L646j37l513n741p092q764j1307j3947
53266A543907j5936j7732k0094k2620k4256k4848k5215k5818k6353k6650k7035
53255A287350k7600k7921k7762k7340k6659k5331k3449k1945k1521k1765k1911
53244A014146k1982k2485k3307k3694k3338k2713k2294k1927k1249k0257j9174
53233G71726j7955j6289j4086j1785j0029r064q587q237q068q319q849r213r321
53220F31924r647j0641j2238j4063j5706j6649j6458j5368j4218j3424j2415j0648
$$ y = [1116992, 1119659, 1123106, 1128064, 1134470, 1141724, 1149729, 1159161, 1170727, 1184588, 1200641, 1218979, 1239669, 1262255, 1285937, 1310304, 1335534, 1361648, 1387917, 1413395, 1437845, 1461649, 1484831, 1506693, 1526530, 1544221, 1559845, 1573125, 1583560, 1590762, 1594408, 1594271, 1590758, 1585017, 1577925, 1569161, 1557854, 1543907, 1527971, 1510239, 1490145, 1467525, 1443269, 1418421, 1393206, 1367388, 1341035, 1314385, 1287350, 1259750, 1231829, 1204067, 1176727, 1150068, 1124737, 1101288, 1079343, 1057822, 1036057, 1014146, 992164, 969679, 946372, 922678, 899340, 876627, 854333, 832406, 811157, 790900, 771726, 753771, 737482, 723396, 711611, 701582, 692518, 683931, 675694, 667626, 659307, 650458, 641245, 631924, 622277, 611636, 599398, 585335, 569629, 552980, 536522, 521154, 506936, 493512, 481097, 470449]
53208D70449q730p766p872q121p874p380o985o590o218o352p290q561r395r488
53194C61827r031q313p594p021o464n670m723m064l846l694l320k963k927l062
53180B89135l059k933k887k935k985l046l053k789k265j789j420q01M1K89n57
53165B58946j683j858j122o80j141j808j892j581j443j478j261p06j52Q5n4l88
53149B41784n98m71k41m10j060j601j411n90J97M56K86J17J90L46L15J98M07J026
53131B38940J490J284P28N14O67N92J74L6M97R62Q47M63M13N90M49ok01Q0M30
53112B48949N00M19L92K81j83r96j920k705l156l056k289j082m7K47j39n26l90
53095B34299M6K57K15K98M23M9q05j302r41l81m68r37q60l9Q02J127J029O95J19
$$ y = [470449, 461719, 453953, 446081, 437960, 430086, 422706, 415721, 409131, 402913, 396561, 389271, 380710, 371315, 361827, 352796, 344483, 336889, 329868, 323404, 317734, 313011, 308947, 305101, 301407, 298087, 295124, 292197, 289135, 286076, 283143, 280256, 277321, 274336, 271290, 268237, 265448, 263183, 261394, 259974, 259173, 259214, 259503, 258946, 257263, 255405, 254283, 253603, 252462, 250654, 248762, 247181, 245738, 244260, 242999, 242293, 242141, 242226, 242172, 241784, 241186, 240715, 240474, 240064, 239004, 237403, 235992, 235402, 235599, 236055, 236341, 236458, 236648, 236994, 237309, 237507, 237914, 238940, 240430, 241714, 242442, 242956, 243623, 244215, 244389, 244425, 244922, 245884, 246731, 247194, 247607, 248197, 248646, 248640, 248439, 248519, 248949, 249449, 249868, 250260, 250541, 250358, 249362, 247442, 244737, 241581, 238525, 236236, 235154, 235107, 235354, 235215, 234689, 234299, 234345, 234602, 234817, 235115, 235538, 235587, 234782, 233480, 232539, 232158, 231690, 230753, 229893, 229854, 230656, 231783, 232812, 233507, 233626]
53076B33626l71j37Q42J641J412L99m59o55n01n31r33j467j755j571j068o46n74
53059B27252p74r88j056r47o94l53KL36O27Q09Q40Q10Q87J154J496J621J152k4
53041B32150j375k007j580p88n24p94q33k45O00J252J675J869J600Q31J09L2N98
53024B32570J279J578J279M55m62q55n26J8J27j66k67J92R22J325J090M73O4J74
53006B39270M28J94n03q64l71M85R06Q53P87O65K9r30j305q12l68p60j378j048
52988B35278J70R70N72k80l81M54J430J825J544R10L94M20R93J511J346O28J10
52971B47894K13O09Q59J007J273J529J489J250J158J251J190Q25M79N41R93J412
52955B63972J324M67j039k650l637l577k656j481o17k97m45q65j308j484j118
$$ y = [233626, 233255, 233118, 233960, 235601, 237013, 237412, 236953, 236298, 235797, 235266, 234333, 232866, 231111, 229540, 228472, 227826, 227252, 226478, 225490, 224434, 223487, 222793, 222440, 222442, 222778, 223405, 224214, 225054, 225864, 226751, 227905, 229401, 231022, 232174, 232150, 230775, 228768, 227188, 226400, 225876, 225082, 224249, 224004, 224604, 225856, 227531, 229400, 231000, 231831, 231940, 231972, 232570, 233849, 235427, 236706, 237161, 236699, 235844, 235318, 235336, 235463, 235297, 235030, 235222, 236144, 237469, 238559, 239032, 239096, 239270, 239698, 239892, 239389, 238525, 238154, 238639, 239545, 240398, 241185, 241850, 241879, 240949, 239644, 238832, 238464, 237704, 236326, 235278, 235448, 236418, 236990, 236710, 236329, 236783, 238213, 240038, 241582, 242492, 242886, 243306, 244299, 245810, 247156, 247784, 247894, 248107, 248716, 249575, 250582, 251855, 253384, 254873, 256123, 257281, 258532, 259722, 260547, 261026, 261567, 262560, 263972, 265296, 265763, 264724, 262074, 258437, 254860, 252204, 250723, 250106, 249809, 249364, 248499, 247191, 245707, 244589]
52940B44589k57N96Q61M88qj97k01l85q65j453j856j716q17M33J006K82j097j843
52922B37560j380k35Q09J316J106K71n85o84lO63P50N05L37J09m89j310j942k166
52904B34632j902j116j76J19n40j408j512q73k72j37k32k54p3N45J640K558K446
52887B33445J447O13N00N05k4p27q67m73j53j8M58J504K521K668J756L94n25m80
52869B42544L62J340J844J709J125L72k66n19l38l9k7l57p68j056j216j219r97
52852B42494p41r22j744k691k955k341j496j140j278j388j185r69j119j519j616
52837B19390j054o2O53N16m16j440j758j119O2J151J735J731J313P81L42r0o76
52820B21059j227j341j043q74j034r09O2J346J926J729J608J931K070J656J307
$$ y = [244589, 244332, 244928, 245789, 246277, 246269, 246072, 245871, 245486, 244621, 243168, 241312, 239596, 238779, 239212, 240218, 240500, 239403, 237560, 236180, 235945, 236754, 238070, 239176, 239447, 238862, 238178, 238175, 238838, 239588, 240093, 240430, 240539, 240050, 238740, 236798, 234632, 232730, 231614, 231438, 231557, 231017, 229609, 228097, 227224, 226952, 226815, 226583, 226329, 226256, 226801, 228441, 230999, 233445, 234892, 235505, 236005, 236510, 236486, 235759, 234892, 234419, 234266, 234248, 234706, 236210, 238731, 241399, 243155, 243549, 243024, 242544, 242906, 244246, 246090, 247799, 248924, 249296, 249030, 248511, 248173, 248134, 248107, 247750, 246982, 245926, 244710, 243491, 242494, 241753, 240831, 239087, 236396, 233441, 231100, 229604, 228464, 227186, 225798, 224613, 223644, 222525, 221006, 219390, 218336, 218274, 218927, 219443, 219027, 217587, 215829, 214710, 214772, 215923, 217658, 219389, 220702, 221483, 221825, 221735, 221059, 219832, 218491, 217448, 216574, 215540, 214631, 214693, 216039, 217965, 219694, 221302, 223233, 225303, 226959, 228266]
52805B28266J545J756J147J31l34m17j223k855l911l413k218j746k021j945j073
52790B11689j21K03O9l2j2k1k0J52M76P88R89J107J204J280J172O67j80q75r22
52771B17613l89K65Q15J317J607J331N96j0l21q86j926k578j924l65P90R90Q75
52754B17800J041J212R11K71k86o72r31p78J28J519K559K682K114J542J389J501
52738B32002J493J284J097R25L86n71j108l09J450K648K408J468R45Q01K65o27
52722B44557r65m18J76K7n27o94m71n43j122j633j589j264j173j319j301r44m43
52705B30354OL10K61l08j046j211n88J32K34l6O4O08R36O91K94K18M22P21J176
52686B33238J732J953J508O62o1m31m90l37k60o49j352j519p22K04J17q43j397
$$ y = [228266, 229811, 231567, 232714, 232845, 232511, 232094, 230871, 228016, 224105, 220692, 218474, 216728, 214707, 212762, 211689, 211568, 211771, 211840, 211808, 211796, 211775, 211755, 211907, 212383, 213171, 214160, 215267, 216471, 217751, 218923, 219590, 219410, 218535, 217613, 217224, 217489, 218304, 219621, 221228, 222559, 223155, 223145, 222824, 221938, 220012, 217434, 215510, 215145, 215935, 216925, 217800, 218841, 220053, 220964, 221235, 220949, 220277, 219346, 218568, 218696, 220215, 222774, 225456, 227570, 229112, 230501, 232002, 233495, 234779, 235876, 236801, 237187, 236616, 235508, 235199, 236649, 239297, 241705, 243173, 244118, 244919, 245184, 244557, 243592, 243174, 243350, 243377, 242850, 242156, 241685, 241142, 240020, 238387, 236798, 235534, 234361, 233042, 231741, 230797, 230354, 230360, 230670, 230931, 230623, 229577, 228366, 227778, 227910, 228144, 228108, 228172, 228780, 229716, 230407, 230701, 230919, 231341, 232062, 233238, 234970, 236923, 238431, 239093, 239032, 238601, 238111, 237774, 237514, 236865, 235513, 233994, 233272, 233476, 233593, 232750, 231353]
52669B31353r03o3K39P4M6L07N71O49N86M42L46O14J461K600L375L351K710K113
52651B49871K116K526K422J127q31k139k159j579j364j599j729j527j213q72l81
52636B42669J47M01L97M23M62J71l35k93P33K146L046L303L378L286K433O06j462
52619B61511k808l133k812k313j943j856j909j666r23j31M7m07q07o04O2P37J185
52602B42230J398J324R03K53l97q55r61n57L18J306J924J897J288M61r0r0K81
52585B50633O46R01J150J213P40p5l68L03J178J198L30n04o85m47j93OJ34Ll90
52566B55773p14p44o35n74m79l03k41m27o84q68j144j606j887j558p47l3L02M89
52548B43920P99J140J278J171J008R89J147J301J173O61J2l67l24r7j6j22j96
$$ y = [231353, 230450, 230387, 230626, 230700, 230746, 231053, 231624, 232273, 232859, 233301, 233647, 234261, 235722, 238322, 241697, 245048, 247758, 249871, 251987, 254513, 256935, 258062, 257231, 255092, 252933, 251354, 249990, 248391, 246662, 245135, 243922, 243050, 242669, 242816, 243217, 243614, 244037, 244499, 244670, 244335, 244042, 244775, 246921, 249967, 253270, 256648, 259934, 262367, 262973, 261511, 258703, 255570, 252758, 250445, 248502, 246646, 244737, 243071, 242148, 242017, 242064, 241657, 240850, 240246, 240308, 241045, 242230, 243628, 244952, 245855, 246108, 245711, 244856, 243895, 243338, 243656, 244962, 246886, 248783, 250071, 250532, 250442, 250352, 250633, 251279, 252180, 253330, 254543, 255283, 255208, 254840, 255143, 256321, 257519, 257849, 257345, 256660, 256213, 256020, 256026, 256160, 256163, 255773, 255059, 254315, 253680, 253106, 252627, 252324, 252083, 251656, 250972, 250104, 248960, 247354, 245467, 243909, 243162, 243129, 243431, 243920, 244719, 245859, 247137, 248308, 249316, 250305, 251452, 252753, 253926, 254587, 254599, 254232, 253908, 253811, 253795, 253673, 253477]
52531B53477p6J78M06N37N72N14L70K02qm28j125j716j633q65j00J32J33M89J038
52512B52097J041L90k5N21J594K258K349K541L138L514K939J520Rj088j803k204
52496B68791k131j555r07o92r19j163j150r93q74p35m93k76k60m06n22m55j08
52479B55152N51J328J810J768J434J097O42j74j076j367q01lK00k89p85n91L42
52462B59238J434K070K162K182K586L220L429K733J279l51j620k290k405k254
52448B71413k238k546k900k736j856q63o76j476k386k431j679r75p21m90K4L92
52432B47856K12p4K70J158J746J510P30ol00l0N95R82P00R0p1M28R92J105R78
52413B58871J175J969L239M705O068P117P907Q702R695J0817J1685J1551R582
$$ y = [253477, 253401, 253579, 253985, 254522, 255094, 255608, 255978, 256180, 256172, 255744, 254619, 252903, 251270, 250405, 250305, 250437, 250570, 251059, 252097, 253138, 253528, 253503, 254024, 255618, 257876, 260225, 262766, 265904, 269418, 272357, 273877, 273886, 272798, 270995, 268791, 266660, 265105, 264198, 263506, 262587, 261424, 260274, 259281, 258407, 257672, 257179, 256903, 256643, 256237, 255715, 255260, 255152, 255703, 257031, 258841, 260609, 262043, 263140, 263782, 263608, 262532, 261165, 260364, 260361, 260561, 260272, 259487, 258896, 259238, 260672, 262742, 264904, 267086, 269672, 272892, 276321, 279054, 280333, 279982, 278362, 276072, 273667, 271413, 269175, 266629, 263729, 260993, 259137, 258274, 257598, 256122, 253736, 251305, 249626, 248651, 247930, 247440, 247464, 247856, 248068, 247994, 248264, 249422, 251168, 252678, 253408, 253402, 253102, 253072, 253667, 254649, 255349, 255439, 255368, 255796, 256788, 257893, 258871, 260046, 262015, 265254, 269959, 276027, 283144, 291051, 299753, 309448, 320265, 331950, 343501, 353083]
52400C53083N632P13l704o824q692r421q921p419n692m474l877l546l065k228
52386B91565j222n55n12p36p24n41n00l27O18K202L342L226K130R02K38N75K003
52369C01684L883N166N419N088M636M046L276K504J657M78o79r88m03J43K56O77
52353C36843J711K219J273j14j70J234K709L473L951M414M363L638L002L166L927
52338C75639M649N071N412O060P274Q809R929J0203J0191J0803J2134J3557J4822
52325D94553J6274J7962J9363K0223K1001K2124K3273K3784K3449K2633K1835
52314G26474K1233K0577J9518J8160J7134J6901J7125J7140J6714J6059J5271
52303I22306J4305J3257J2187J0851R153P624O804O338N305L414J181r44k918
$$ y = [353083, 358715, 359428, 355724, 348900, 340208, 330787, 321866, 314447, 308755, 304281, 300404, 296858, 293793, 291565, 290343, 289788, 289276, 288540, 287816, 287275, 286775, 286448, 287066, 289268, 292610, 295836, 297966, 298868, 299106, 299681, 301684, 305567, 310733, 316152, 321240, 325876, 329922, 333198, 335702, 337359, 337837, 337158, 336170, 335767, 335910, 336166, 336843, 338554, 340773, 342046, 341932, 341762, 342996, 345705, 349178, 353129, 357543, 361906, 365544, 368546, 371712, 375639, 380288, 385359, 390771, 396831, 404105, 412914, 422843, 433046, 443237, 454040, 466174, 479731, 494553, 510827, 528789, 548152, 568375, 589376, 611500, 634773, 658557, 682006, 704639, 726474, 747707, 768284, 787802, 805962, 823096, 839997, 857122, 874262, 890976, 907035, 922306, 936611, 949868, 962055, 972906, 982059, 989683, 996487, 1002825, 1008130, 1011544, 1012725, 1011781, 1008863]
52290A008863m689o186p673r365j0656j0624r386q085p367o709n522m053k740
52277I15808j386M66K819N283P467R059R983J0712J1919J3627J5139J5937J6060
52264A032893J5572J4434J3175J2770J3349J3802J3208J2003J1208J1064J1096
52253A174574J0933J0323Q856O458L937K292J550P85q12l293o185q816j0597j1440
52239A178565j1809j2157j2448j2500j2425j2386j2194j1599j0745r989r365q631
52227A042317p654o553n585n062n020m901l979k356r22j24O13J780K911L464L913
52212A012842N013O456P251P174O906O770O354N495M709M371M134L542K704K102
52198A085823K056K545L243L739L908M089M480M611M004L117K903L377L419K264
$$ y = [1008863, 1004174, 997988, 990315, 980950, 970294, 959670, 950284, 942199, 934832, 928123, 922601, 918548, 915808, 914422, 914888, 917707, 922990, 930457, 939516, 949499, 960211, 972130, 985757, 1000896, 1016833, 1032893, 1048465, 1062899, 1076074, 1088844, 1102193, 1115995, 1129203, 1141206, 1152414, 1163478, 1174574, 1185507, 1195830, 1204686, 1211144, 1215081, 1217373, 1218923, 1219708, 1218896, 1215603, 1209418, 1200602, 1190005, 1178565, 1166756, 1154599, 1142151, 1129651, 1117226, 1104840, 1092646, 1081047, 1070302, 1060313, 1050948, 1042317, 1034663, 1028110, 1022525, 1017463, 1012443, 1007542, 1003563, 1001207, 1000285, 1000161, 1000774, 1002554, 1005465, 1008929, 1012842, 1017855, 1024311, 1031562, 1038736, 1045642, 1052412, 1058766, 1064261, 1068970, 1073341, 1077475, 1081017, 1083721, 1085823, 1087879, 1090424, 1093667, 1097406, 1101314, 1105403, 1109883, 1114494, 1118498, 1121615, 1124518, 1127895, 1131314, 1133578]
52184A133578M01j333k822m292n468n914n931o409p687r081r679r259q240p068
52170A050796n900m807l996l566l219k453j192J9O51Q65J214J809K139J838J279
52155A035477J163J722K537L046L038K611J880Q73j26m56L98K063L365L381K290
52140A063262J042L85M16Q13J205J394J539K101L354M983O463P763R405J1788
52126A115913J4714J7626K0085K2023K3716K5531K7553K9421L0684L1239L1262
52115A389767L0819K9770K8091K6081K4198K2749K1606K0171J7847J4709J1523
52104A637331Q841O449L975J736K80o35j893l748n476o499p234q419j0139j1980
52090A602589j3773j5590j7263j8432j8949j8784j7689j5507j2763j0362q508
$$ y = [1133578, 1133979, 1132646, 1129824, 1125532, 1120064, 1114150, 1108219, 1101810, 1094123, 1085042, 1075363, 1066104, 1057864, 1050796, 1044896, 1040089, 1036093, 1032527, 1029308, 1026855, 1025663, 1025682, 1026333, 1027198, 1028412, 1030221, 1032360, 1034198, 1035477, 1036640, 1038362, 1040899, 1043945, 1046983, 1049594, 1051474, 1052347, 1052221, 1051765, 1052163, 1054226, 1057591, 1060972, 1063262, 1064304, 1064689, 1065105, 1065918, 1067123, 1068517, 1070056, 1072157, 1075511, 1080494, 1086957, 1094720, 1104125, 1115913, 1130627, 1148253, 1168338, 1190361, 1214077, 1239608, 1267161, 1296582, 1327266, 1358505, 1389767, 1420586, 1450356, 1478447, 1504528, 1528726, 1551475, 1573081, 1593252, 1611099, 1625808, 1637331, 1646172, 1652621, 1656596, 1658332, 1658612, 1657977, 1656084, 1652336, 1646860, 1640361, 1633127, 1624708, 1614569, 1602589, 1588816, 1573226, 1555963, 1537531, 1518582, 1499798, 1482109, 1466602, 1453839, 1443477, 1434969]
52079A434969o490l794r24J325K990M772O912R011J0911J3039J5607J8029J9596
52066A525953K0200J9976J8759J6654J4697J4034J4365J4140J2508J0243Q460
$$ y = [1434969, 1428479, 1424685, 1423761, 1425086, 1428076, 1432848, 1439760, 1448771, 1459682, 1472721, 1488328, 1506357, 1525953, 1546153, 1566129, 1584888, 1601542, 1616239, 1630273, 1644638, 1658778, 1671286, 1681529, 1689989]
$$ [...]
##END NTUPLES=NMR SPECTRUM
##END=
