
##TITLE=AC1217_HTEAH12048_7160707_EEUpWFWHyQ
##JCAMPDX= 6.0         $$ Bruker NMR JCAMP-DX V2.0
##DATA TYPE= NMR SPECTRUM
##DATA CLASS= NTUPLES
##ORIGIN= BRUKER
##OWNER= Administrator
$$ 1.72 TOPSPIN		Version 2.1
$$ 2012-11-30 23:35:28.857 -0500  Administrator@X
$$ Compression mode = diff/dup
##.OBSERVE FREQUENCY= 400.02188249412
##.OBSERVE NUCLEUS= ^1H
##.ACQUISITION MODE= SIMULTANEOUS (DQD)
##.ACQUISITION SCHEME= undefined
##.AVERAGES= 8
##.DIGITISER RES= 22
##SPECTROMETER/DATA SYSTEM= spect
##.PULSE SEQUENCE= zg30
##.SOLVENT NAME= COFFEE_meoh
##.SHIFT REFERENCE= INTERNAL, COFFEE_meoh, 1, 14.98509
##AUDIT TRAIL= $$ (NUMBER, WHEN, WHO, WHERE, PROCESS, VERSION, WHAT)
$$ ##TITLE= Audit trail, TOPSPIN		Version 2.1
$$ ##JCAMPDX= 5.01
$$ ##ORIGIN= Bruker BioSpin GmbH
$$ ##OWNER= Administrator
$$ $$ E:\/data/COFFEE/nmr/AC1217_HTEAH12048_7160707_EEUpWFWHyQ/10/pdata/1/auditp.txt
$$ ##AUDIT TRAIL=  $$ (NUMBER, WHEN, WHO, WHERE, PROCESS, VERSION, WHAT)
(   1,<2012-11-30 23:35:21.052 -0500>,<Administrator>,<X>,<go>,<TOPSPIN 2.1>,
      <created by zg
	started at 2012-11-30 23:34:19.012 -0500,
	POWCHK enabled, PULCHK disabled,
       configuration hash MD5:
       86 BA 57 50 F2 9D 5C 9B 26 00 A9 28 5F 66 2E 89
       data hash MD5: 64K
       F8 A4 7A E3 60 E3 44 D0 FC C7 6D A4 7C D1 0C 3B>)
(   2,<2012-11-30 23:35:23.835 -0500>,<Administrator>,<X>,<proc1d>,<TOPSPIN 2.1>,
      <Start of raw data processing
       efp LB = 0 FT_mod = 6 PKNL = 1 PHC0 = 0 PHC1 = 0 SI = 32K 
       data hash MD5: 32K
       16 B9 ED 6D D2 EE 68 34 7F 18 52 C0 2E EB 33 28>)
(   3,<2012-11-30 23:35:24.275 -0500>,<Administrator>,<X>,<proc1d>,<TOPSPIN 2.1>,
      <pk PHC0 = 94.6637 PHC1 = 0 
       data hash MD5: 32K
       0F 57 87 A6 1C A2 45 21 0C 90 1D 03 E2 67 42 0B>)
(   4,<2012-11-30 23:35:24.516 -0500>,<Administrator>,<X>,<proc1d>,<TOPSPIN 2.1>,
      <abs ABSG = 1 
       data hash MD5: 32K
       19 60 60 7F 09 D5 A0 55 E6 36 17 C6 EF 6C DF 0F>)
(   5,<2012-11-30 23:35:24.658 -0500>,<Administrator>,<X>,<proc1d>,<TOPSPIN 2.1>,
      <abs ABSG = 2 
       data hash MD5: 32K
       46 D0 AE 10 39 8D 56 88 19 BC 9D 7F CC 51 15 58>)
(   6,<2012-11-30 23:35:24.786 -0500>,<Administrator>,<X>,<proc1d>,<TOPSPIN 2.1>,
      <abs ABSG = 3 
       data hash MD5: 32K
       11 B7 85 8B 12 F4 C6 F9 16 3A 72 01 90 D7 FB 4C>)
(   7,<2012-11-30 23:35:24.928 -0500>,<Administrator>,<X>,<proc1d>,<TOPSPIN 2.1>,
      <abs ABSG = 4 
       data hash MD5: 32K
       2F 42 70 24 C0 F5 91 46 0E 8D FD FD 88 A7 89 B0>)
(   8,<2012-11-30 23:35:25.056 -0500>,<Administrator>,<X>,<proc1d>,<TOPSPIN 2.1>,
      <abs ABSG = 5 
       data hash MD5: 32K
       7E A2 AA C2 3E CA B5 CB 9D 13 34 CC 38 F0 10 54>)
$$ ##END=
$$ 
$$ $$ hash MD5
$$ $$ 10 9B 4C 1C 46 BE A4 B5 12 06 93 95 2F 1E 76 0A
##$RELAX= 
##$RELAX= 
##$RELAX= 
##$RELAX= 
##$RELAX= 
##$RELAX= 
##$RELAX= 
$$ Bruker specific parameters
$$ --------------------------
##$DU= <E:\>
##$EXPNO= 10
##$NAME= <AC1217_HTEAH12048_7160707_EEUpWFWHyQ>
$$ [...]
##$TP= (0..7)
150 150 150 150 150 150 150 150
##$TP07= 0
##$TPNAME0= <>
##$TPNAME1= <>
##$TPNAME2= <>
##$TPNAME3= <>
##$TPNAME4= <>
##$TPNAME5= <>
##$TPNAME6= <>
##$TPNAME7= <>
##$TPOAL= (0..7)
0.5 0.5 0.5 0.5 0.5 0.5 0.5 0.5
##$TPOFFS= (0..7)
0 0 0 0 0 0 0 0
##$TUNHIN= 0
##$TUNHOUT= 0
##$TUNXOUT= 0
##$USERA1= <user>
##$USERA2= <user>
##$USERA3= <user>
##$USERA4= <user>
##$USERA5= <user>
##$V9= 5
##$VALIST= <valist>
##$VCLIST= <CCCCCCCCCCCCCCC>
##$VD= 0
##$VDLIST= <DDDDDDDDDDDDDDD>
##$VPLIST= <PPPPPPPPPPPPPPP>
##$VTLIST= <TTTTTTTTTTTTTTT>
##$WBST= 1024
##$WBSW= 4
##$XGAIN= (0..3)
0 0 0 0
##$XL= 0
##$YL= 0
##$YMAX_a= 667375
##$YMIN_a= -561451
##$ZGOPTNS= <>
##$ZL1= 120
##$ZL2= 120
##$ZL3= 120
##$ZL4= 120
##$ABSF1= 14.98509
##$ABSF2= -5.573092
##$ABSG= 5
##$ABSL= 3
##$ALPHA= 0
##$AQORDER= 0
##$ASSFAC= 0
##$ASSFACI= 0
##$ASSFACX= 0
##$ASSWID= 0
##$AUNMP= <proc_prof1d_extract_pilot.lims>
##$AXLEFT= 0
##$AXNAME= <>
##$AXNUC= <1H>
##$AXRIGHT= 0
##$AXTYPE= 0
##$AXUNIT= <>
##$AZFE= 0.1
##$AZFW= 0.1
##$BCFW= 0
##$BC_mod= 0
##$BYTORDP= 0
##$COROFFS= 0
##$CY= 15
##$DATMOD= 1
##$DC= 0
##$DFILT= <>
##$DTYPP= 0
##$F1P= 0
##$F2P= 0
##$FCOR= 0.5
##$FTSIZE= 32768
##$FT_mod= 6
##$GAMMA= 0
##$GB= 0
##$INTBC= 1
##$INTSCL= 1
##$ISEN= 128
##$LB= 0
##$LEV0= 0
##$LPBIN= 0
##$MAXI= 10000
##$MC2= 0
##$MEAN= 0
##$ME_mod= 0
##$MI= 0
##$NCOEF= 0
##$NC_proc= -8
##$NLEV= 6
##$NOISF1= 0
##$NOISF2= 0
##$NSP= 0
##$NTH_PI= 0
##$NZP= 0
##$OFFSET= 14.98509
##$PC= 1
##$PHC0= 94.6637
##$PHC1= 0
##$PH_mod= 1
##$PKNL= yes
##$PPARMOD= 0
##$PPDIAG= 0
##$PPIPTYP= 0
##$PPMPNUM= 2147483647
##$PPRESOL= 1
##$PSCAL= 4
##$PSIGN= 0
##$PYNMP= <proc.py>
##$REVERSE= no
##$SF= 400.02
##$SI= 32768
##$SIGF1= 0
##$SIGF2= 0
##$SINO= 400
##$SIOLD= 32768
##$SPECTYP= <>
##$SREGLST= <1H.CDCl3>
##$SSB= 0
##$STSI= 32768
##$STSR= 0
##$SW_p= 8223.68421052631
##$SYMM= 0
##$S_DEV= 0
##$TDeff= 65536
##$TDoff= 0
##$TI= <>
##$TILT= no
##$TM1= 0
##$TM2= 0
##$TOPLEV= 0
##$USERP1= <user>
##$USERP2= <user>
##$USERP3= <user>
##$USERP4= <user>
##$USERP5= <user>
##$WDW= 1
##$XDIM= 32768
##$YMAX_p= 478658458
##$YMIN_p= -829924
##$CURPLOT= <Network HP LaserJet P1505>
##$CURPRIN= <$Network HP LaserJet P1505>
##$DFORMAT= <normdp>
##$LAYOUT= <+/1D_H.xwp>
##$LFORMAT= <normlp>
##$PFORMAT= <normpl>
##$SURQMSG= 1
$$ End of Bruker specific parameters
$$ ---------------------------------
##NTUPLES= NMR SPECTRUM
##VAR_NAME=  FREQUENCY,     SPECTRUM/REAL,   SPECTRUM/IMAG
##SYMBOL=    X,             R,               I
##VAR_TYPE=  INDEPENDENT,   DEPENDENT,       DEPENDENT
##VAR_FORM=  AFFN,          ASDF,            ASDF
##VAR_DIM=   32768,         32768,           32768
##UNITS=     HZ,            ARBITRARY UNITS, ARBITRARY UNITS
##FACTOR=    0.250966925370066, 1,           1
##FIRST=     8223.43324360094, 25946,        -67974
##LAST=      0,             -117492,         -232491
##MIN=       0,             -829924,         0
##MAX=       8223.43324360094, 478658458,    0
$$ Real data points
##PAGE= N=1
##DATA TABLE= (X++(R..R)), XYDATA
$$ [...]
19464a06221K7959c7848B4854c45674e4269k0523H2523h2623k61968a63684e0939
19452a74616A95354J01614j11142g4947j84538i6580L9590D9435a70889e8004
19441A52992B7042N6122e2109A33344c34995a8670j0145B3104a27100P063m2028
19430a62065k57213a95884A45210A0921O868a20927l04889J19887c6568c308k01143
19419b04451J01065P031A03984f6334p52q286a1696H9840l8589B5611J04780a7427
19406A38404c03648a02090D1811a32094A90406c11025f5553p8749L8008c5193
19395C01741a3547j98073A8473g3511q8302j50229j11546C2728m577a94562A63159
19383H019a43305A65621a96280h1757l03107A5492R156J08006l2815B9918b25977
$$ plain form
19464 -106221 -78262 -37848 24854 -345674 -54269 -74792 82523 -82623 -344591 -163684 -50939
19452 -174616 195354 296968 185826 -74947 -259485 -96580 -56990 49435 -170889 -58004
19441 152992 27042 83164 -52109 133344 -334995 -18670 -28815 23104 -127100 -120037 -162065
19430 -162065 -419278 -195884 145210 10921 17789 -120927 -425816 -305929 -36568 -3308 -204451
19419 -204451 -103386 -96355 103984 -66334 -67086 -75372 -11696 89840 51251 25611 130391 -17427
19406 138404 -303648 -102090 41811 -132094 190406 -311025 -65553 -144302 -106294 -35193
19395 301741 -13547 -211620 18473 -73511 -161813 -312042 -423588 32728 28151 -194562 163159
19383 8019 -143305 165621 -196280 -81757 -384864 15492 24648 132654 99839 29918 -225977
19371A34986b749C2715b68292J20468k60335a22835k53652g630k03975C87759
19360b63913i90j36338B22265a23697c8793k04398b3435A24318R0083c2443C5229
19348c27668R9156h8224j64224J21227J5323A04002a78132d2680a3418q119j18052
19337a39589j77006A33965c73154J19162M9050j83G2338b81506a15556b8524j56491
19326a85015k0476A95344a34109k49518G2613h9300F7857a04235D3588b07153
19315D5860L6618b05512D2434N6850l660K28561D4869Q8153b56307Q1761Q4014
19304i0532q2087B0155J72476b4729m21706A24606g7406j6692A03161a73658N2290
19293a21368L5537b609A1321c20153F4304l327M6766a471k78643Q3190i3845A05150
$$ plain form
19371 134986 -2749 32715 -268292 -147824 -408159 -122835 -376487 -7630 -211605 387759
19360 -263913 -990 -137328 222265 -123697 -38793 -243191 -23435 124318 214401 -32443 35229
19348 -327668 -228512 -88224 -252448 -131221 -115898 104002 -178132 -42680 -13418 -21537 -139589
19337 -139589 -316595 133965 -373154 -253992 -204942 -205125 72338 -281506 -115556 -28524 -185015
19326 -185015 -205491 195344 -134109 -383627 72613 -89300 67857 -104235 43588 -207153
19315 45860 82478 -205512 42434 99284 95624 324185 44869 133022 -256307 -174546 -90532
19304 -90532 -172619 20155 192631 -24729 -446435 124606 -77406 -94098 103161 -173658 -121368
19293 -121368 -85831 -2609 11321 -320153 64304 60977 107743 -1471 -280114 -196924 -93845 105150
19280C84683a29527E5785J72680A12482h5973n4719N1146j91596L1008N4040A88551
19268a23063j13231O5386g6788B10096e5082F057c31018a35444D6954L1939b00585
19256a35431C4921a28023j39361a00966K4944C435K1933c79752G7775a58373E2819
19244b02610F8041h545m0073l14852O7520L9057R0241J2348C0994Q4495a72574
19232A23078a02185l61777A90312a92780Q6851C5978J13815a14014k5074j55866
19222b94954p3143C10801c26139B0939Q0890a21341j67195c6793k52082D6928
19211b25584c1842j50200k26970a72212f8310q6603A20079B0747J6233a90620
19200b64536B4655a89650j27679a09101j19971j2801d0624a6632B07396C7558
$$ plain form
19280 384683 -129527 55785 228465 112482 -85973 -140692 -89546 -281142 -250134 -196094 188551
19268 -123063 -236294 -170908 -76788 210096 -55082 6057 -331018 -135444 46954 78893 -200585
19256 -135431 34921 -128023 -267384 -100966 -76022 3435 25368 -379752 77775 -158373 52819
19244 -202610 68041 -8545 -48618 -363470 -295950 -256893 -166652 -154304 30994 115489 -172574
19232 123078 -102185 -463962 190312 -192780 -105929 35978 149793 -114014 -139088 -294954
19222 -294954 -368097 310801 -326139 20939 101829 -121341 -288536 -36793 -288875 46928
19211 -225584 -31842 -182042 -409012 -172212 -68310 -154913 120079 20747 36980 -190620
19200 -264536 24655 -189650 -317329 -109101 -229072 -241873 -40624 -16632 207396 37558
19189e4762k16367P2890c760j82712q6322A54132a49060b6783H9912J31802g20880
19177b86655M528a20411e204A37561E0107b94581k19586B4405q007K17995b39425
19165A93279C2469b23408f3466o3664A42605a38909l8186f6846k5824A10126j1096
19154I9030m4015a44021B14144l2699b87646R9173c1201j8482k26452A1823J58014
19143A69837h8841E9100a65466B35386B5054a61027A49731b38935f4365j96111
19133b60476B8342h7436J5564A19291d27502a58232l3412E0389a93755k7734a06681
19121c0952B52466I9118a150B132b06361I6197J63709a72534d6833j98274E4983
19109d7431j18644A3007J06801a59194K5844A32614a4876j50946A13725D1616
$$ plain form
19189 -54762 -271129 -198239 -3760 -186472 -272794 154132 -149060 -26783 89912 221714 -720880
19177 -286655 -282127 -120411 -5204 137561 50107 -294581 -514167 24405 16398 234393 -239425
19165 193279 32469 -223408 -63466 -127130 142605 -138909 -177095 -66846 -92670 110126 99030
19154 99030 55015 -144021 214144 181445 -287646 -188473 -31201 -49683 -276135 11823 169837
19143 169837 -88841 59100 -165466 235386 25054 -161027 149731 -238935 -64365 -260476
19133 -260476 28342 -87436 -71872 119291 -427502 -158232 -191644 50389 -193755 -221489 -106681
19121 -30952 252466 99118 -1150 2132 -206361 96197 259906 -172534 -46833 -245107 54983
19109 -47431 -166075 13007 119808 -159194 -133350 132614 -14876 -165822 113725 41616
19098b02831G5118b29127h8347b1978E7584i4412m4961A16469a41992C7259c29957
19086e16739B96393a70151j37190J20569b8227k2760G705a54094r2515E7053E270
19074A04227i6987c8228o0528l3278r9767I0947a8690j02422e3058B63778H7893
19062A09757c7949j7006J4649k5654A16858L0332j0820c39900a43927d2137r043
19051e1180A32819K2271b23017q5096A88059b41770g9511q9744r5347c7062C5611
19039D04354a06466j17777f4045p775k6057J193J1266k6625A54688m2064C2214
19027A04014c2113l1876k405C23112f7015o910A88650G9444J8407b19813O3130
19016a56683I5330N3147K8978b2039I6070A8006K4207a4849m1033j12178N3576
$$ plain form
19098 -202831 75118 -229127 -88347 -21978 57584 -94412 -139373 116469 -141992 37259 -329957
19086 -516739 296393 -170151 -307341 -186772 -28227 -50987 7705 -154094 -246609 57053 5270
19074 104227 -96987 -38228 -98756 -132034 -231801 90947 -18690 -121112 -53058 263778 87893
19062 109757 -37949 -54955 -40306 -65960 116858 147190 136370 -339900 -143927 -42137 -51180
19051 -51180 132819 155090 -223017 -308113 188059 -241770 -79511 -169255 -264602 -37062 35611
19039 404354 -106466 -224243 -64045 -71820 -97877 -96684 -85418 -112043 154688 112624 32214
19027 104014 -32113 -63989 -66394 323112 -67015 -73925 188650 79444 97851 -219813 -156683
19016 -156683 95330 148477 177455 -22039 96070 18006 42213 -14849 -55882 -168060 -114484
19005a14484j22418b7213B9982K3508M055d1204A07170K239e295n7583A0798a18515
18992h3220A78531a28407O1016a756D0376a9296k86360a04313N0318I4546N1844
18981A46390b33386a4709j63883D3948k087a19349j64098c8910G051J12156K80447
18970C99654J7058L00973B03276K38351b39951d7935n06245a29419L8392d2240
18959a33793B5360g382p0016j34825f3394A22959c4128l1097I2553b24117G539
18947G6070i4714P948B16892a60777b3613A09162a08138K9779A79786e37757J98914
18936c38843A862M5943b61351b2524B3470O0357O1987b29727B47330c1034r5005
18925a26039m07670L1282h6259L4175E1382a15180k33756M3021i2876k4863A50779
$$ plain form
19005 -114484 -236902 -27213 29982 53490 57545 -41204 107170 109409 -5295 -62878 10798 -118515
18992 -83220 178531 -128407 -67391 -1756 40376 -19296 -305656 -104313 -53995 94546 146390
18981 146390 -233386 -14709 -178592 43948 41861 -119349 -283447 -38910 7051 119207 399654
18970 399654 416712 717685 203276 441627 -239951 -47935 -554180 -129419 -91027 -42240
18959 -133793 25360 -7382 -77398 -212223 -63394 122959 -34128 -65225 92553 -224117 7539
18947 76070 -94714 -86766 216892 -160777 -23613 109162 -108138 -78359 179786 -537757 -338843
18936 -338843 1862 47805 -261351 -22524 23470 83827 145814 -229727 247330 -31034 -126039
18925 -126039 -533709 -502427 -86259 -52084 51382 -115180 -348936 -305915 -92876 -117739 150779
18913a29329L9470F3376J40698i4447c0317B05053J74055J16984j02888k6742
18903C66462g2040j67020L2933B5567g515B6615J14105a18005M0103l1340j10108
18892b19350A900a99742L3484G5676J1675M0692b15399h037k80158p3480I4691
18880A34390e51793A90318M58126b45780E7304J5320J1497g5475p3956B11925
18869c0820p0941J7831a7125C07926d1104C99261F4063d7584r3028j08487h7316
18857b59953e6877A73016F1918a83040B21837b33305E5211b61932J20695B14119
18846A0168R7058c07105a8825p8251b1888A8231J04979b31461A22539a42600B5080
18834F8733K0708D1085a54082o5776B22760h3227A75086e718F978a39121k24005
$$ plain form
18913 -129329 -89859 63376 204074 -94447 -30317 205053 379108 496092 393204 366462
18903 366462 -72040 -239060 -206127 25567 -7515 26615 140720 -118005 -77902 -109242 -219350
18892 -219350 1900 -199742 -166258 75676 87351 128043 -215399 -8037 -288195 -361675 94691
18880 134390 -551793 190318 648444 -245780 57304 72624 84121 -75475 -149431 211925
18869 -30820 -101761 -83930 -17125 307926 -41104 399261 64063 -47584 -140612 -249099 -87316
18857 -259953 -56877 173016 61918 -183040 221837 -233305 55211 -261932 -141237 214119
18846 10168 107226 -307105 -18825 -97076 -21888 18231 123210 -231461 122539 -142600 25080
18834 68733 89441 41085 -154082 -219858 222760 -83227 175086 -5718 6978 -139121 -363126
18823c63126G9426A6650L70030a97991D9133a37648q9340L7908B38306p9569e8833
18811A85738M4797a06508F3469C0874b1814A21158a9940A08062h8962m6096l9244
18800a74302a7409C6537a28833O3829m1556A9984a89099d8187C1978c01272i6544
18788a39544G3916c32846d7686C3797b64812k195Q0412Q0993D8894a95429K6385
18777a69044M4782j28232A70566a95019N4273c4426o3949n45506b15001M2432
18767a72569A26090r496b60996D3491k136b80271N5467A33534J8502c22252J50646
18756a71606d5738A70510f9044m95751A78280d1449j85480L1926C0402j4328L47394
18745C63468a5790n7546k4089K7330B12667q9037b87873E7806a43041j64876a3264
$$ plain form
18823 -363126 79426 16650 386680 -197991 49133 -137648 -226988 -189080 238306 158737 -58833
18811 185738 230535 -106508 63469 30874 -21814 121158 -19940 108062 -88962 -135058 -174302
18800 -174302 -17409 36537 -128833 -65004 -106560 19984 -189099 -48187 31978 -301272 -96544
18788 -139544 73916 -332846 -47686 33797 -264812 -267007 -186595 -105602 48894 -195429 -169044
18777 -169044 -124262 -252494 170566 -195019 -140746 -34426 -98375 -643881 -215001 -172569
18767 -172569 126090 116594 -260996 43491 41355 -280271 -224804 133534 152036 -322252 -171606
18756 -171606 -45738 170510 -69044 -564795 178280 -41449 -226929 -195003 30402 16074 363468
18745 363468 -15790 -73336 -97425 -70095 212667 123630 -287873 57806 -143041 -307917 -13264
18733c6055j61594M0725B8106a73634k23450a58460n5752m2168A12507c43611
18722a17411d1654H285P884l758R8243a33284n0289d8838A06298d9161A73124
18710a58285D3819m37a60569F9742a74944B71581j07725c82065J05412D872K43054
18699B47926I120J87221A7550b20778J05559j07976G4897c5069l15809B45625
18688B60558c8541k50054l2572M0755a05345k0167B21201i9531b8604q4143A34495
18676b14315F3936b12696c7215k66875M062K0553c1867M558j35069j55661J42085
18665a75954k0810k71026a12632B1339d188I1339A9158c1965n8423k69947a63172
18653E2754M1252K6273b19835c1851k05532h021B82043A797b86300A45228A0179
$$ plain form
18733 -36055 -197649 -156924 28106 -173634 -397084 -158460 -214212 -256380 112507 -343611
18722 -117411 -41654 8285 16169 12411 110654 -133284 -183573 -48838 106298 -49161 173124
18710 -158285 43819 43382 -160569 69742 -174944 271581 163856 -382065 -276653 4872 247926
18699 247926 9120 196341 17550 -220778 -115219 -223195 74897 -35069 -350878 245625
18688 260558 -38541 -288595 -321167 -280412 -105345 -125512 221201 -99531 -28604 -112747 134495
18676 -214315 63936 -212696 -37215 -304090 -300028 -279475 -31867 -27309 -162378 -318039 -175954
18665 -175954 -196764 -467790 -112632 21339 -4188 91339 19158 -31965 -90388 -360335 -163172
18653 52754 94006 120279 -219835 -31851 -237383 -8021 282043 1797 -286300 145228 10179
18641a27927B3532c34456E8623b9414B26706a30106B78350a85635G0960b99831
18630a99339a4629n1521f721k65088h3164n5202f4099D6995g1925L1961k8262
18619f8226j23251m8590h5305k7972m7620j7418j60094c0042C7467c17823J22422
18608a95401a2179q9504k04433a01291B4167a2565C5299h0722G5145c66615a23532
18596B99414a97965F2094O474a65391a7268C98392a22777p3245d514B53962j18445
18585A35517a12992R666j96946E9323a6863k45002J02649I627d14k48475a14876
18573b34679a2672A92828m1138a9356j05607m5564h4304C50737d8525p2640e7610
18561a75026Q0403J7775c0474j26070O9622A79264q5311c22775e1717j65216f4776
$$ plain form
18641 -127927 23532 -334456 58623 -29414 226706 -130106 278350 -185635 70960 -299831
18630 -199339 -14629 -66150 -6721 -271809 -83164 -138366 -64099 46995 -71925 -39964 -68226
18619 -68226 -191477 -240067 -85305 -113277 -160897 -178315 -338409 -30042 37467 -317823 -195401
18608 -195401 -12179 -101683 -306116 -101291 24167 -12565 35299 -80722 75145 -366615 -123532
18596 299414 -197965 62094 68568 -165391 -17268 398392 -122777 -196022 -4514 253962 135517
18585 135517 -112992 -103326 -300272 59323 -16863 -261865 -159216 9627 -414 -248889 -114876
18573 -234679 -12672 192828 151690 -19356 -124963 -170527 -84304 350737 -48525 -121165 -57610
18561 -175026 -94623 -76848 -30474 -156544 -86922 179264 93953 -322775 -51717 -216933 -64776
18549A07409i7419A45638K42549O2131a88609b4919k94608m451R9586f1368p8357
18538a39725j09118i3101J790r5750c6081j6227j24642M7504D9007j6678J49704
18527A82033b32893n9580A40059J09689C3941a07376F3445R4486A9750a10130
18516B83165d9553C25430d5605B21112E3850e5013A2587K3594b2420j56072A10129
18504b67039k18505J43469a05687L4256C34327j17930q2992a54892f4276J3345
18494e0931p3685m24262a85662P6832f476A18515a04962F0396a51719A68390H1229
18482c7771j07212d4711A28754K9912C7772b88986I221c07841A35783F6584L27965
18471C94549a46545c9919r7625A32553o2830P4578b7161j04237B24064L4155B9387
$$ plain form
18549 107409 -97419 145638 388187 450318 -188609 -24919 -319527 -323978 -224392 -61368 -139725
18538 -139725 -248843 -93101 -91311 -187061 -36081 -52308 -176950 -129446 49007 32329 182033
18527 182033 -232893 -292473 140059 249748 33941 -107376 63445 157931 19750 -110130
18516 283165 -49553 325430 -45605 221112 53850 -55013 12587 36181 -22420 -178492 110129
18504 -267039 -485544 -342075 -105687 -71431 334327 216397 133405 -154892 -64276 -50931
18494 -50931 -124616 -548878 -185662 -108830 -6476 118515 -104962 60396 -151719 168390 81229
18482 -37771 -144983 -44711 128754 158666 37772 -288986 9221 -307841 135783 66584 394549
18471 394549 -146545 -39919 -137544 132553 69723 144301 -27161 -131398 224064 258219 29387
18459B2258M704J0324a96352j01332k97604c0207F5283A3541b0375l0956A6979
18447a13978F3302j8966c84072A22385n8144M8474Q5429a52579J4579m23502a94107
18435C98106c2883B8780a07802A37017a20600c0272l1636n1403E8876J86115a23051
18423b15132f1050l63587a07420p3539A8999J75128a53582k5580K6640B6372f7885
18411C3726a11056N4573o3084a3193A17101J41345a77645P3223A88793d405j03179
18400a07584j2819F370b14028A72432J89987d58268b25921B17982h7315F7553
18389I4229i3211j91759C0193k911R3250m0163K3481A5340a79932j28042A759
18377C12537B0073e4685g064r1310d876j63075N8192n4578k6356B16126i0953
$$ plain form
18459 22258 26962 37286 -196352 -297684 -595288 -30207 65283 13541 -20375 -51331 16979
18447 -113978 63302 44336 -384072 122385 64241 112715 198144 -152579 -138000 -561502 -194107
18435 398106 -32883 28780 -107802 137017 -120600 -30272 -61908 -113311 58876 244991 -123051
18423 -215132 -61050 -424637 -107420 -180959 18999 194127 -153582 -179162 -152522 26372 -67885
18411 33726 -111056 -56483 -119567 -13193 117101 258446 -177645 -104422 188793 -4405 -107584
18400 -107584 -120403 6370 -214028 172432 362419 -458268 -225921 217982 -87315 67553
18389 94229 -93211 -284970 30193 27282 120532 80369 103850 15340 -179932 -307974 1759
18377 312537 20073 -54685 -7064 -98374 -4876 -167951 -109759 -164337 -190693 216126 -90953
18365A18977m4776j5672b3280r3476A50718g7224b3894C8283a2676j63242J6867
18354a59051C08152b45635j58249a76479K8184A4230b55486A51928E2604e4298
18343C21603i4687A43231a9184A17294d1167A32861n1390k603b08977P8987m6112
18332a76102B27931K4186k8633g4648H380J81481p7084m4156e3966j84260H0794
18320A23004a41581j80238D2578b45746l5575a21928G8366K06013p1879B8160
18309H1920a80222j0601F0906g745B52886g8893R618j36589L3892A81722a83909
18297b09724A50543a44652A97873D4506a19435r7089k22837a39647p5547g4633
18286a52222m4881A15857a26890B30247a30713j09811a08812M2479j78309E3374
$$ plain form
18365 118977 74201 58529 -23280 -116756 150718 -77224 -23894 38283 -12676 -175918 -159051
18354 -159051 308152 -245635 -403884 -176479 -148295 14230 -255486 151928 52604 -54298
18343 321603 -94687 143231 -19184 117294 -41167 132861 81471 78868 -208977 -129990 -176102
18332 -176102 227931 252117 223484 -74648 8380 189861 112777 68621 -53966 -238226 80794
18320 123004 -141581 -321819 42578 -245746 -281321 -121928 78366 284379 212500 28160
18309 81920 -180222 -190823 60906 -7745 252886 -78893 -69275 -205864 -171972 181722 -183909
18297 -209724 150543 -144652 197873 44506 -119435 -216524 -439361 -139647 -215194 -74633
18286 -152222 -197103 115857 -126890 230247 -130713 -240524 -108812 -66333 -244642 53374
18275H8203h3275j65555i0215j20003O0550R504b1967j03434Q433K8012B00950
18263i8667B8796O52a28772j0461A24964b91121O6466B21119a49155A76752a11608
18251A6731N748i9964G2968a25147A80550O2828A8611b6140A78402b54015M8504
18240b05511A4424J08505k7293c60323H9952a73599A22563c15170B38069g3860
18229D22457A08362L05436A19418B9790e2304E4585a40223j33921C27452a04027
18218a63155Q523D3375b9530E0736a13233j82676C26097a10027P730E1345i7262
18206a26114l3744P3448d2771K770A8842J35456M5276D8324J76607b20290J07732
18195a12558C1606a68144j55373D9011r55N914b56577F0018J0317d0547l8481
$$ plain form
18275 88203 -83275 -248830 -90215 -210218 -149668 -140164 -21967 -125401 -116968 -88956 200950
18263 -98667 28796 29448 -128772 -139233 124964 -291121 -224655 221119 -149155 176752 -111608
18251 16731 22479 -99964 72968 -125147 180550 243378 18611 -26140 178402 -254015 -205511
18240 -205511 14424 122929 95636 -360323 89952 -173599 122563 -315170 238069 -73860
18229 422457 108362 413798 119418 29790 -52304 54585 -140223 -274144 327452 -104027
18218 -163155 -154632 43375 -29530 50736 -113233 -295909 326097 -110027 -102297 51345 -97262
18206 -126114 -159858 -86410 -42771 -40001 18842 154298 199574 48324 224931 -220290 -112558
18195 -112558 31606 -168144 -323517 49011 48056 53970 -256577 60018 70335 -40547 -79028
18184g9028j95948a7406A44920q077k7192l8573a19118D1670b95722A17490D3235
18172b14192A23551F661J813J28758a37677k17915B16176b83163j3111K3370A16573
18160B10454a38529C5483a34041b2625k2655p0714M7564A74723n2707a82218D9967
18148a28840a4635B9892b9704B70355j15218d469i68j86063C9162f5894G3662
18136g3624j40630p3592G5077A779R7462J2223a6449m9072A49260J75458C6670
18124b37547p7964i0751C8018K14391j16372M5847b09504I7842k3961b89004E2094
18112B40338k4080m4877R8141a75744I228I62K02079a12791H9094g2352A15656
18100b5334I8628c4533j38304m7677A6682a21269j2202f4561A06150a10010E7392
$$ plain form
18184 -79028 -274976 -17406 144920 136843 109651 71078 -119118 41670 -295722 117490 43235
18172 -214192 123551 6661 8474 137232 -137677 -355592 216176 -283163 -296274 -272904 116573
18160 210454 -138529 35483 -134041 -22625 -45280 -115994 -68430 174723 122016 -182218 49967
18148 -128840 -14635 29892 -29704 270355 155137 -4469 -968 -187031 39162 -65894 73662
18136 -73624 -214254 -287846 75077 1779 99241 111464 -16449 -65521 149260 324718 36670
18124 -237547 -315511 -90751 38018 252409 136037 181884 -209504 97842 73881 -289004 52094
18112 240338 216258 171381 269522 -175744 9228 962 203041 -112791 89094 -72352 115656
18100 -25334 98628 -34533 -172837 -220514 16682 -121269 -133471 -64561 106150 -110010 57392
18088B98390a15699A12368l4147a31066f5139D58111b45026a6415F378h987A89606
18076A3838b62179f1975k2287m8033D7136c26613d5062j24242o7025Q5609I3577
18064E3895K2375i7856M7205E7570K68427G9636i7748l24041i9853B80588b53531
18052H9559h3195k5637p2814B34355i3631r5110N4401K622D7856A9149c10837
18040f4576E0865a89154G3975Q6898a38049A48197b26384R1258p0110g7312q6166
18029a63478H4427a22820K5234A00242k432e5693i624C01193F4383K426b41139
18017B58682r8775p4303a09652e2642q9792A90642H0812C4617e3049C76442H8917
18005c5019j75756r4623A51723O365g5984D6269b42998a01051k560A42396i7758
$$ plain form
18088 298390 -115699 112368 78221 -131066 -65139 458111 -245026 -16415 6378 -8987 189606
18076 13838 -262179 -61975 -84262 -132295 47136 -326613 -45062 -169304 -236329 -150720 93577
18064 53895 76270 -97856 -50651 57570 325997 79636 -97748 -421789 -99853 280588 -253531
18052 89559 -83195 -108832 -181646 234355 -93631 -188741 -134340 -131718 47856 19149 -310837
18040 -64576 50865 -189154 73975 160873 -138049 148197 -226384 -135126 -205236 -77312 -163478
18029 -163478 84427 -122820 -97586 100242 97810 -55693 -9624 301193 64383 66809 -241139
18017 258682 159907 85604 -109652 -52642 -142434 190642 80812 34617 -53049 376442 88917
18005 -35019 -210775 -305398 151723 158088 -75984 46269 -242998 -101051 -103611 142396 -97758
17993D0450N8825a18264a8777F695d0626A5975b50305b1265A37931a9022C1767
17981E1576j8418a30513B57180a4961B08767c2485A66528F9223b09439h9089j56087
17970b45176E7600P0853a07105l1549B32666l021f5693A8113K47071a03472G5086
17958b23514F5090K28221K2007b6792n1899L429J9367H0760a51617O4421A25138
17946D5160d8705j99817h0130j55002A75062K8871m848G6537J1538i369A27219
17934F0794b20919A09972i0446B3749L7313c64786a27431D89668F6835g5744h783
17922F3541J42760c61082D4979M0353M050K7437f211A5757c07538A10248J16973
17911B27221j1653G145i6268G1473E872a12408L4351A09182j929J00288I8614
$$ plain form
17993 40450 99275 -118264 -18777 6695 -40626 15975 -250305 -21265 137931 -19022 31767
17981 51576 33158 -130513 257180 -14961 208767 -32485 166528 69223 -209439 -89089 -245176
17970 -245176 57600 128453 -107105 -138654 232666 229645 -65693 18113 265184 -103472 75086
17958 -223514 65090 293311 315318 -26792 -78691 -75262 -55895 80760 -151617 -87196 125138
17946 45160 -48705 -248522 -80130 -235132 175062 203933 199085 76537 88075 -9369 127219
17934 60794 -220919 109972 -90446 23749 61062 -364786 -127431 489668 66835 -75744 -8783
17922 63541 206301 -361082 44979 85332 89382 116819 -6211 15757 -307538 110248 227221
17911 227221 215568 7145 -96268 71473 5872 -112408 -78057 109182 107253 207541 98614
17899C96747G4481k4847g2951n8760r4234A16224K5065C4362a64158e4907B9342
17887d3733j15376c4233E9645f5559G5554h7898A45534b20277f5058D13026D1395
17875a03881d2827J3195a1894D4705L9616J29434J92552A54304O2857J81577a14933
17863a84417A07224J07332B8660K8161A9745f2967D8138j6899f480D06372A69333
17851a70900C77436j39212j03225J48464B0234K7984M02262d79032A66248C7943
17840H276b810m1190A38115b87841h4549I1033c7748j92879M1167B11507q8101
17829A23406g6829A38062K03584b07226o7588i6929J5863d587j71241C3511b42572
17817A92310r1446F683a31377D30c5973B06303r5025g6237B2532a27935K5833
$$ plain form
17899 396747 74481 49634 -72951 -131711 -225945 116224 141289 34362 -164158 -54907 29342
17887 -43733 -159109 -34233 59645 -65559 75554 -87898 145534 -220277 -65058 413026 41395
17875 -103881 -42827 -29632 -11894 44705 84321 213755 406307 154304 217161 398738 -114933
17863 -184417 107224 214556 28660 56821 19745 -62967 48138 31239 -6480 406372 169333
17851 -170900 377436 238224 134999 283463 20234 48218 450480 -479032 166248 37943
17840 8276 -2810 -44000 138115 -287841 -84549 91033 -37748 -230627 -189460 211507 123406
17829 123406 -76829 138062 341646 -207226 -274814 -96929 -81066 -4587 -175828 33511 -242572
17817 192310 100864 6683 -131377 430 -35973 206303 111278 -76237 22532 -127935 -102102
17806a02102C1506j0776K56626c28600J45186j32484d2788G6916J55204A6959
17795a49105B37560H9218K22753f2051F5921J43950a9568j82539D9655B3522J36069
17784A59591n691Q970b10052C05705H8216i4870B21280R8469e7312b5965A4787
17772A00266b09373B93949b18678a1807r9896L1861A5853m7e8085m2126m7019
17761a47230O7075A67535P0924j3433i0966l4651B6757J59192J09211A44193m5982
17750I8211k0435b78733G2419a35304C61669a28175L4518C67074A04400a11491
17739a29627B10864a2182r875D4469b7572q8606B22773r2868Q9294a12386j33667
17728b46053D30999a77965C76227j18501l7060A058b71492J11218A47564J0082
$$ plain form
17806 -102102 31506 20730 277356 -328600 -183414 -315898 -42788 76916 232120 16959
17795 -149105 237560 89218 311971 -62051 65921 209871 -19568 -202107 49655 23522 159591
17784 159591 153900 162870 -210052 305705 88216 -94870 221280 319749 -57312 -25965 14787
17772 100266 -209373 293949 -218678 -11807 -111703 -79842 15853 15806 -58085 -100211 -147230
17761 -147230 -80155 167535 238459 225026 -90966 -125617 26757 185949 295160 144193 98211
17750 98211 77776 -278733 72419 -135304 361669 -128175 -93657 367074 104400 -111491
17739 -129627 210864 -12182 -22057 44469 -27572 -116178 222773 129905 219199 -112386 -246053
17728 -246053 430999 -177965 376227 257726 220666 1058 -271492 -160274 147564 157646
17718A57646J49899G4890c4220H6385O743k3628J12433K2995F6297j7311P6642
17707A25628a63896a3560G9154J49626p0213k7466b48208I869d055D8308j6924
17696C1384J92371r1718c2704e411k7785B37158R2501i5221a3274A25423K55173
17685C80596A39259a61071E9791A3178P5970A6378J68536Q1848G4280K0418b50
17673C63117j57823F1415J5849d0422I9063a1902A12792c36458C71412i65q0087
17662h1052c2701B11904F2498h7179F1687O5069a75320A23145m1205K59566A36002
17650C00030g8523B18310R9178r5702D2541K52860a30451f4726j50406f0006E7910
17638B10472f3208B02818d7739A73262K97556A29255a0801C36401d9427n6353
$$ plain form
17718 157646 307545 74890 -34220 86385 93128 69500 181933 204928 66297 48986 125628
17707 125628 -163896 -13560 79154 228780 158567 131101 -248208 9869 -4055 48308 31384
17696 31384 223755 132037 -32704 -5411 -33196 237158 329659 -95221 -13274 125423 380596
17685 380596 139259 -161071 59791 13178 89148 16378 184914 266762 74280 94698 -250
17673 363117 205294 61415 77264 -40422 99063 -11902 112792 -336458 371412 -965 -81052
17662 -81052 -32701 211904 62498 -87179 61687 126756 -175320 123145 81940 341506 136002
17650 300030 -78523 218310 317488 221786 42541 295401 -130451 -64726 -215132 -60006 57910
17638 210472 -63208 202818 -47739 173262 470818 129255 -10801 336401 -49427 -105780
17628a05780A539e5552k4523G5175J23102q5624c37870A39074J78372C2458b2139
17616A10296b81229H683K18878L35982B01608O8618j04055K17087m1860a3569
17605B21104G4145A2142J16288J91207A29396G25L05618o8638b39293B08953p514
17594B01439M8048a56443D47030e0046B20098o3779J95490C3335L65135A58573
17583B76195K7263c2834D01596j96933J77388J2292A16717P7336J4591m8863c4328
17571c891B41769H0595J08882r1508i7061c5943B19721I9715C7944N002L50849
17560C93795I0284m104B5605a45004f8276B39661K0714R9832K33026A95749G6944
17548B71800R6694j68743J70071j61233k355M1730G7627K89435j17441l1310n2068
$$ plain form
17628 -105780 1539 -55552 -80075 75175 198277 112653 -337870 139074 317446 32458 -22139
17616 110296 -281229 8683 227561 563543 201608 270226 166171 383258 341398 -13569
17605 221104 74145 12142 128430 319637 129396 725 306343 237705 -239293 208953 201439
17594 201439 249487 -156443 447030 -50046 220098 156319 351809 33335 398470 158573
17583 276195 303458 -32834 401596 204663 382051 394343 116717 194053 208644 159781 -34328
17571 -3891 241769 80595 189477 97969 -97061 -35943 219721 99715 37944 42946 393795
17560 393795 90284 86180 25605 -145004 -68276 239661 260375 360207 593233 195749 76944
17548 271800 368494 199751 369822 208589 206234 247964 77627 367062 249621 218311 166243
17537A66243j5381i090D2757J46183o5325R9287k2471n0499l0344m6008L93593
17526D67173K72411l60380P41033j31831M01357n73385l28875J81544k03814o6221
17516C99012p623J80167N9095j80789r6403R8339M07123l63540K92286P3216O8390
17505I29273C87914L71514A69811K31180J00401n6978I4044J29127J61128Q1386
17495D65685j67575j6321K09311A66111N4461A01429L02171j40801A30246P3513
17485B03759K57809K65224A94006K52510K13932A74231G1911j812K73127J94776
17475E38002k12504J58270B09653P1031M50402k76049A37099f4873B38100P6113
17465C14213l9866j08688o9025L5006J87364p8630K66149M0701A14082L4459m1000
$$ plain form
17537 166243 150862 -9090 42757 188940 123615 222902 200431 149932 119588 73580 467173
17526 467173 739584 379204 1120237 988406 1389763 816378 487503 669047 465233 399012
17516 399012 391389 571556 630651 449862 353459 451798 858921 495381 787667 860883 929273
17505 929273 387914 759428 169811 400991 501392 444414 94044 223171 384299 465685
17495 465685 298110 281789 491100 166111 220572 101429 403600 262799 130246 203759
17485 203759 461568 726792 194006 446516 660448 174231 71911 70099 343226 538002
17475 538002 325498 483768 209653 280684 731086 455037 137099 -64873 238100 314213
17465 314213 274347 165659 96634 131640 319004 240374 506523 547224 114082 148541 107541
17454A07541L46679m0205A58308g943C70910A52730j1658j8932J79632J40025
17444D41797J63565B16972K44974O5307p946j80932J38305j67713j02010J03231
17434C10188J34364m6796j41375M29035j28922k55004J3070L09917G3552J0696
17424H4248J14337L47353k20663k684J27914j57458p4009J99387D8398N13944
17414E62342B74270K26947J8095B08347k7245K35821J47759j42964A96266L5303
17404B31569R5010J97538B55069F9832C4903J77567M6414J38895f9849B78408
17393C42787a2707D19763a716B53413J3551J56895j03369K125H8362K97357A50202
17381B06546K23126A68004L99705A1227J08594C4553a5960C14328J51525A12928
$$ plain form
17454 107541 454220 414015 158308 -7943 370910 152730 141072 122140 301772 441797
17444 441797 605362 216972 461946 527253 519307 338375 476680 308967 206957 310188
17434 310188 444552 397756 256381 685416 556494 301490 314560 624477 73552 84248
17424 84248 198585 545938 325275 322591 450505 293047 219038 418425 48398 562342
17414 562342 274270 501217 519312 208347 181102 416923 564682 421718 196266 231569
17404 231569 326579 524117 255069 69832 34903 212470 258884 397779 -69849 278408
17393 342787 -12707 419763 -1716 253413 266964 423859 320490 322615 88362 385719 150202
17381 206546 429672 168004 567709 11227 119821 34553 -15960 314328 465853 112928
17370C16872M5399P757K00886k72160A22635N49750p438k32574f3620G6882q052
17359F8830K75770j28335k9724j136N4454M1790a60308N0369F4210J71256J52079
17348C87545K11874A67607J90102j31494J50247j48838k3164L0214k2092L48581
17338E61163k30673L36620c435A95598n0116i6363B51957J18308n5464j2451c1897
17326B20934b3146D37958J25705j42949A2881K56668K56560j90976q4884K19812
17316D70061j84485m4680J37179j62072J36407A74290K21970j85522J07165r9548
17306B18355n0739Q650g4013B60840K03162A45794K85859E5241O7695F0545K44859
17295C05404L3410L63944l09378J0881k7654J8988l0196J30558A87433L37256
$$ plain form
17370 316872 362271 370028 570914 298754 122635 672385 664947 432373 -63620 76882 68830
17359 68830 344600 216265 186541 185405 239859 281649 -160308 -109939 64210 235466 387545
17348 387545 599419 167607 357709 226215 376462 227624 204460 234674 212582 561163
17338 561163 330490 667110 -3435 195598 145482 -96363 251957 370265 314801 302350 -31897
17326 220934 -23146 437958 563663 420714 12881 269549 526109 335133 250249 470061
17316 470061 285576 240896 378075 216003 352410 174290 396260 210738 317903 218355
17306 218355 167616 176266 -74013 260840 464002 145794 431653 55241 122936 60545 305404
17295 305404 338814 702758 393380 404261 376607 395595 365399 495957 187433 524689
17285E24689j35400L7995j37029q4180m9050k5025l2395K42635K9301k1735o4420
17274B85386o7397n554P1025R9003J5672j29170J63157K6126j47550P4452k4438
17263C60712b567k8095A9372K73248J13526l7532A07047D7335J66164P8695L43133
17252F35327I1280J46950K82428A99210m058J64307A19092R4587m294j02004L68169
17241D75550J66181A98260a17452C74928q832J64233j55913m792J0062K24795
17231F04481K3789k95383J8119L29848k46750A04895J50680M40306g1720E07452
17220A96953J21180E2872J22374J87652n4613o4907Q0612m317K29933j92374L74859
17209G32091k09552A12030L80922J69213B07065M65291B70496K56194H8852M18075
$$ plain form
17285 524689 389289 427284 290255 206075 157025 132000 99605 342240 371541 349806 285386
17274 285386 217989 212435 283460 382463 398135 268965 432122 458248 310698 385150 360712
17263 360712 -2567 -30662 19372 292620 406146 368614 107047 47335 213499 292194 635327
17252 635327 91280 238230 520658 199210 195152 359459 119092 213679 209385 107381 475550
17241 475550 641731 198260 -117452 374928 366096 530329 374416 369624 379686 604481
17231 604481 628270 332887 351006 680854 434104 104895 255575 695881 -71720 507452
17220 196953 318133 52872 175246 362898 308285 243378 323990 319673 549606 357232 732091
17209 732091 522539 112030 492952 662165 207065 672356 270496 526690 88852 506927
17199E06927k6122J26738B98350K85725j8636n6491B43989R4079K09097k69113
17189B78052J79147J5516O4512j31279l8901j40443J53749J84311j52890n5303
17179C56471J47604j22120K60749k41699J8981A38282J62748K60923K23211k34709
17169E50455G4224J86572L39687B75796M459K92892B74088K77972B12744K24558
17159D37302K02247j34782k51575J63680N7673J24114J27207m0231B15104L82796
17149E97900P8376A57545J64576J34960j35044J94688K21556k01812p6364K91018
17139G51123k17819m3359k09877L45017J27441j91820J02561N5948j73764R9341
17129F44792J97501j11985j46803j86760M50831k90704J84117j31519O4639k07432
$$ plain form
17199 506927 480805 607543 298350 584075 565439 508948 243989 338068 547165 278052
17189 278052 457199 472715 537227 405948 367047 226604 380353 564664 411774 356471
17179 356471 504075 381955 642704 401005 419986 138282 301030 561953 785164 550455
17169 550455 74224 260796 600483 275796 280255 573147 274088 552060 212744 437302
17159 437302 639549 504767 253192 416872 474545 598659 725866 685635 215104 597900
17149 597900 676276 157545 322121 457081 322037 516725 738281 536469 460105 751123
17139 751123 533304 489945 280068 625085 752526 560706 663267 719215 545451 644792
17129 644792 842293 730308 583505 396745 847576 556872 740989 609470 674109 466677
17119D66677B22575K73853K40884m6721C44750M75438j94637j1678r7456J22426
17109F38843k40549J41761J71051j27292K74418K2227l50732m1224K50793j36421
17099F02875A93445M72214r4167L29149C82062M4412K57806k48374L57863Q5924
17089H79693o240M1230k93286L09033l14281L56030l06011L27822o4480j2071
17079I17439k94375J52368l44025J92888k3766N32976k99825J0955J1988k53025
17069F03598j2704J69132J82311k7788l93657K70690P7203k85265J88996K8667
17059H01183N5676k39664Q3263N5988m494j31072J02847k27842J65756L46824
17049A008465j03129j8730L9994R2247k10901j72149M68607N6296m42499J61602
$$ plain form
17119 466677 222575 496428 737312 690591 344750 820188 625551 613873 516417 638843
17109 638843 398294 540055 711106 583814 858232 880459 529727 488503 739296 602875
17099 602875 193445 665659 571492 900641 382062 426474 684280 435906 793769 879693
17089 879693 873453 914683 621397 930430 616149 972179 666168 993990 929510 917439
17079 917439 623064 775432 431407 624295 600529 1133505 833680 844635 856623 603598
17069 603598 590894 760026 942337 914549 520892 791582 868785 583520 772516 801183
17059 801183 856859 617195 700458 756446 751952 620880 723727 495885 661641 1008465
17049 1008465 905336 886606 926600 1018847 807946 635797 1104404 1160700 718201 879803
17039H79803K52334j81822K7991l34599N25262l04609O7850J7617K34310l67651
17029H16486J52075K04553l72891K06590M6875o4341L7103j69431j85943J53271
17019H24347K80581K40052k42489J4319j50562J30141k14838J03776q7420K64113
17009A162020j96150n5826M99590k01677J14564l84137L24429N0717J61343m01621
16999A073252M9676M92422m70579K31395k02511j74258L48591L6195K31047m19833
16989A195397K66597m66867M58984N0930j17465J33747l71746J6649J13194L2253
16979A311673m417Q4395R2401k30680J6369J90043J40567J41750n0910l18402
16969A372789n582J32509k19948J54134J02829O9783K57759r5245j79136J0983
$$ plain form
17039 879803 1132137 950315 978306 643707 1168969 864360 932210 949827 1184137 816486
17029 816486 968561 1173114 800223 1006813 1053688 989347 1026450 857019 671076 824347
17019 824347 1104928 1344980 1102491 1116810 966248 1096389 881551 985327 897907 1162020
17009 1162020 965870 910044 1409634 1207957 1322521 938384 1262813 1313530 1474873 1073252
16999 1073252 1122928 1615350 1144771 1376166 1173655 999397 1347988 1384183 1615230 1195397
16989 1195397 1461994 995127 1454111 1505041 1387576 1521323 1149577 1166226 1279420 1311673
16979 1311673 1307256 1391651 1484052 1253372 1269741 1459784 1600351 1742101 1691191 1372789
16969 1372789 1367207 1499716 1279768 1433902 1536731 1606514 1864273 1769028 1589892 1600875
16959A600875l09212L11727j96293K00300k65753N04441m07517M35949r5739o9368
16949A709410K23296l56380L29676j15247J76349j57902m3818J77817J43695p7988
16939B008908Q5898j03052L93619k79985j55557j14252L35488k09678o9593J84281
16929B076077J93802r2161n45820P26142j82083j20871J53681N88490l18939m02166
16919B076152P3227o1709K87086k69519K93014K84261n33660N00684k79678L88527
16909B758385k81452L62078k86578J55040k26283K62255j04513j4535R9823K30395
16899B954615j00691N1110N7601k56539M89326j21753k61349J13817K59289k04079
16889B981347L96072l17615J72648J05851J06745k98998K32206K08999k35103
$$ plain form
16959 1600875 1291663 1603390 1407097 1607397 1341644 1846085 1438568 1874517 1778778 1709410
16949 1709410 1932706 1576326 1906002 1790755 1967104 1809202 1765384 1943201 2086896 2008908
16939 2008908 2094806 1991754 2385373 2105388 1949831 1835579 2171067 1961389 1891796 2076077
16929 2076077 2269879 2177718 1631898 2358040 2175957 2055086 2208767 2797257 2478318 2076152
16919 2076152 2149379 2087670 2374756 2105237 2398251 2682512 2148852 2649536 2369858 2758385
16909 2758385 2476933 2839011 2552433 2707473 2481190 2743445 2638932 2624397 2724220 2954615
16899 2954615 2853924 2905034 2962635 2706096 3195422 3073669 2812320 2926137 3185426 2981347
16889 2981347 3377419 3059804 3232452 3338303 3445048 3146050 3378256 3587255 3352152
16880C352152q8157M80718K5836R7188j19108k34213r9362K75232L08566r6233
16870C902619L46509j47243L9246M3097M02211j87951k74165K84395L7316J09954
16860D555988m3982K72747j31363L9160M06955J63951j10117l68724N29324J40175
16850E454114Q4708l66370J77441K41929q4849K37737k12597L88590j13441L07748
16840F115010K68000k90774L68522j28386Q0369m5887L81881J89976O5356K38700
16830G242767j45164M07990j44830N68925k45240J81560J71080P4706L73863K3725
16820H509382K74528K1216J39621K31166k10490M69871K9667O14806O5295L224
16810A0148286K92081L50458M34119K07477j92642J08372M84451M88350j27199
$$ plain form
16880 3352152 3263995 3744713 3770549 3867737 3748629 3514416 3415054 3690286 3998852 3902619
16870 3902619 4249128 4101885 4141131 4184228 4586439 4398488 4124323 4408718 4446034 4555988
16860 4555988 4512006 4784753 4653390 4692550 5099505 5263456 5153339 4784615 5313939 5454114
16850 5454114 5538822 5172452 5349893 5591822 5506973 5744710 5532113 5920703 5807262 6115010
16840 6115010 6383010 6092236 6460758 6332372 6412741 6366854 6748735 6938711 7004067 7242767
16830 7242767 7097603 7505593 7360763 7929688 7684448 7866008 8037088 8111794 8485657 8509382
16820 8509382 8783910 8805126 8944747 9175913 8965423 9435294 9464961 10079767 10145062 10148286
16810 10148286 10440367 10790825 11224944 11432421 11239779 11348151 11832602 12320952 12193753
16801A2193753L28197N46995q9820N43351L65098J58371L18931M01273M90603
16792A5256752M44726N7694N51655M05237L20559N01353N88807L79561Q84084
16783A9390428J66209O07873L43844P75535O71009N87102N76898P99720J032655
16774B4951273M61053N89349N17036J300386R50491O79509P71910J250801O29295
16765C2101103J264352R51406J322516J581666Q16026J493995J120510J485970
16757D2137544J643190J263648K166268J498676J447985J566034K120575K535616
16749E6379536J770119K484485K322365J818339K750284K469250L214670K511872
16741G5720920K967586L017594K629917L068070L126448K977057L320406L137991
$$ plain form
16801 12193753 12521950 13068945 12979125 13522476 13887574 14045945 14364876 14766149 15256752
16792 15256752 15701478 15759172 16310827 16716064 17036623 17537976 18126783 18506344 19390428
16783 19390428 19556637 20164510 20508354 21283889 21954898 22542000 23118898 23918618 24951273
16774 24951273 25412326 26001675 26518711 27819097 28769588 29449097 30221007 31471808 32101103
16765 32101103 33365455 34316861 35639377 37221043 38037069 39531064 40651574 42137544
16757 42137544 43780734 45044382 47210650 48709326 50157311 51723345 53843920 56379536
16749 56379536 58149655 60634140 62956505 64774844 67525128 69994378 73209048 75720920
16741 75720920 78688506 81706100 84336017 87404087 90530535 93507592 96827998 99965989
16733I9965989L399665K837510L019662K974881K910084K539701K657316K412711
16725A22717519J796994J407545J674188J058672M95794N87334Q2966l99658o08190
16716A28813164q27984j771207j728782k219825j990689k551799k707133l075541
16708A11940204k630597l241155l051221l402189l250067l271434k995362l500846
16700H6597333k977316l038473l091430k683106k595228k973146k435089k874964
16692F3928581k156298l030062j570762k669387j473848k066227j903043j844723
16684D7214231j663434j864302j411264j716323j250686j518962j169766j210181
16676C5409313j080752j298214j458409n41780j424513q86617p03355q90299p98836
$$ plain form
16733 99965989 103365654 106203164 109222826 112197707 115107791 117647492 120304808 122717519
16725 122717519 124514513 125922058 127596246 128654918 129150712 129738046 129821012 129421354 128813164
16716 128813164 127985180 126213973 124485191 122265366 120274677 117722878 115015745 111940204
16708 111940204 109309607 106068452 103017231 99615042 96364975 93093541 90098179 86597333
16700 86597333 83620017 80581544 77490114 74807008 72211780 69238634 66803545 63928581
16692 63928581 61772283 58742221 57171459 54502072 53028224 50961997 49058954 47214231
16684 47214231 45550797 43686495 42275231 40558908 39308222 37789260 36619494 35409313
16676 35409313 34328561 33030347 31571938 31030158 29605645 28719028 28015673 27125374 26326538
16667B6326538j050554p31946n25368j020244n00472n96454p60445l28571r95523
16658A9816961m75060j12989o60141q04384l54900m47301m42643m69208n03997
16649A5546338l47516j04460l47725r61703o0529l35389j20284k75600l90950
16640A2602182k60719q8683k32013m24638m09886j66566l57286m08278J63416
16631A0417529k40107k93679l07725l1823j37929j09731m65961J23215l78867
16622H574922q9611l12222q6921J80426n72435p9838p8388Q0522m54769k47292
16612F914394J3676k8217n49945M04537k75916m76168K30149o1494j71354K6898
16602F026560k22843J24087j56497k71476o1369J9525K8035l57463l66792L76065
$$ plain form
16667 26326538 25275984 24544038 24018670 22998426 22497954 21901500 21141055 20812484 19816961
16658 19816961 19341901 19228912 18568771 17764387 17409487 16962186 16519543 16050335 15546338
16649 15546338 15198822 15094362 14746637 13784934 13724405 13389016 13268732 12993132 12602182
16640 12602182 12341463 12252780 12020767 11596129 11186243 11019677 10662391 10254113 10417529
16631 10417529 10177422 9883743 9576018 9544195 9406266 9296535 8830574 8953789 8574922
16622 8574922 8485311 8173089 8086168 8266594 7694159 7614321 7535933 7616455 7161686 6914394
16612 6914394 6928070 6899853 6349908 6754445 6478529 6002361 6232510 6171016 5999662 6026560
16602 6026560 5803717 5927804 5771307 5499831 5438462 5457987 5486022 5128559 4761767 5137832
16592E137832j65890P1592l95128l0437J02212N2115q3641n02199J80056P8250
16582D444762j58470j32j87042K15203m18757R9093k78008K51622Q648l65696
16572C611223n3137L11488j58302n0564q4252l77278m1046P3213j76909N52951
16562C607387k75901J13223J08727j59243k71844l43791M19922K79286p88625
16553B689141q8931K71440j8254p6112J07847k17894N1787O7030k15374L8067
16543B608747j23073M5357K69095l78960M09785n05529k0545Q2701l1813J85254
16533B541019l6952M2270n09841N35455n05338L64211n84540L81693j18417O3124
16523B172684j93723m0244j09455K42886k93274O7282J75663K1754J9988l35522
$$ plain form
16592 5137832 4971942 5043534 4648406 4617969 4720181 4772296 4688655 4186456 4366512 4444762
16582 4444762 4286292 4286160 4099118 4314321 3895564 3994657 3716649 3968271 3976919 3611223
16572 3611223 3558086 3869574 3711272 3660708 3576456 3199178 3158132 3231345 3054436 3607387
16562 3607387 3331486 3444709 3553436 3394193 3122349 2778558 3198480 3477766 2689141
16553 2689141 2600210 2871650 2853396 2777284 2885131 2667237 2719024 2786054 2570680 2608747
16543 2608747 2485674 2531031 2800126 2421166 2830951 2325422 2304877 2387578 2355765 2541019
16533 2541019 2504067 2546337 2036496 2571951 2066613 2430824 1846284 2227977 2109560 2172684
16523 2172684 1978961 1938717 1829262 2072148 1778874 1846156 2021819 2043573 2063561 1728039
16513A728039J82347q4019J55482k02549K69996k77237q6491J59692K09727j93442
16503A861545m07910J62490r9563N4213K2958j71227K84936Q1036j41833J16014
16493A762659O8092l39646K6261j67283J90648n4908j70454J9571L24908m07967
16483A251881L78731j1868l08223n3274J94832J33140k09716k66461K19143j83903
16473A144282L72168n028Q287j48991k75325K94505k00555l46494L82995q6832
16463A139012L94667l26268P0490j75948J32441m44352M64220r0491K43778k47435
16453A160114j72624L22579k8768k18211k39994K96482P5916j98218J45208k03381
16443I39103O9874K19727k5781r0331P7236l04305j02132J78553J21487l20693
$$ plain form
16513 1728039 1910386 1826367 1981849 1779300 2049296 1772059 1685568 1845260 2054987 1861545
16503 1861545 1453635 1616125 1516562 1570775 1593733 1422506 1707442 1788478 1646645 1762659
16493 1762659 1830751 1491105 1517366 1350083 1540731 1485823 1315369 1334940 1659848 1251881
16483 1251881 1630612 1618744 1310521 1257247 1452079 1585219 1375503 1109042 1328185 1144282
16473 1144282 1516450 1511422 1519709 1370718 1095393 1389898 1189343 842849 1225844 1139012
16463 1139012 1533679 1207411 1277901 1101953 1234394 790042 1254262 1163771 1407549 1160114
16453 1160114 987490 1310069 1281301 1063090 823096 1119578 1195494 997276 1142484 939103
16443 939103 1008977 1228704 1202923 1112592 1189828 885523 783391 961944 1083431 762738
16433G62738K05667l202Q7083j69973R4231J85399j63482q3664k60656K78312
16423I32453m2830J79511j59844J1250q670j67009L864J09252J34674k83721o4925
16412F44005l9616L64526k16191k84952M64008j35415q7307n1677L0719J02454
16402G90554M9148D04941M53373l06764L71405k79868J62691M0974j73477J30947
16392H04222j19986m2360J97902J41935j80256k34727J40846R9726B06351O32607
16382H38958J69060D65335J72493j49382L30122O4768j64186r3138K16426l5262
16372H07176k7830N109k64095K0611K58084k40909R6158K80264k5296j70421k94414
16361D44437m497J25449r5409L098M2518k4092K60795k4528j39017J41233O6636
$$ plain form
16433 762738 968405 965203 1052286 882313 976544 1161943 998461 914797 654141 932453
16423 932453 889623 1069134 909290 920540 911870 744861 748725 857977 992651 708930 644005
16412 644005 604389 968915 752724 467772 931780 796365 709058 657381 688100 790554
16402 790554 839702 404941 858314 551550 922955 643087 805778 846752 673275 804222
16392 804222 684236 641876 839778 981713 801457 566730 707576 807302 206351 838958
16382 838958 1008018 465335 637828 488446 818568 883336 719150 626012 842438 807176
16372 807176 779346 784455 520360 540971 799055 558146 654304 934568 909272 738851 444437
16361 444437 439940 565389 469980 473078 515596 491504 752299 727771 588754 729987 796623
16350G96623r9627j6056n2905R8896A70213M02997L5972o0748J06282A69421L96031
16339E65452q1324J49687l7273A90085L43716B25111L19761k6810k5452M6624
16329E39234m2450R2877k00594A74994N88050C16600j23657N16384k69408J19899
16319E59818n8852p3796J08173A80331L49991j37824J5128O7947l0812j24013
16309C20748O6260K24029k98640J9065f9921B79549J59154k1776J3119A86345
16298B61333R1298K03111D6864K13481j25516K98488Q4120q4730K2613J38999
16288E94319E0799K48759k7213J96914P2239k27003L06070p8419j76134M04295
16278G70307B55758K90444k09658D3987M89365j48890J20882m3584j56080m8596
$$ plain form
16350 796623 696996 680940 628035 726931 170213 573210 609182 548434 654716 169421 565452
16339 565452 484128 633815 596542 190085 533801 225111 544872 518062 492610 539234
16329 539234 496784 589661 389067 174994 763044 316600 192943 709327 439919 559818
16319 559818 500966 427170 535343 180331 530322 392498 407626 475573 444761 320748
16309 320748 387008 611037 312397 331462 -69921 279549 438703 416927 430046 186345
16298 261333 352631 555742 46864 260345 134829 433317 517437 432707 455320 594319
16288 594319 50799 299558 272345 469259 541498 314495 620565 542146 366012 770307
16278 770307 255758 546202 336544 43987 533352 384462 505344 461760 305680 257084
16268B57084K73771B61742R7416n6363O58153B05509o6624d579E10840j30963
16258C79877j78506K9287q3892J73546L4791A64131J54441K30677j31394R0399
16248E08254A81438L3478C5688k806K30381N6927B302i4919B4140M14246j64807
16237B73579H5640J20283J99900r5518l134I4588M38989A83534Q2345J24255j67433
16226B22701K12408A92965J31671A39982o542C3205K94498q8958J06258j61393
16216A83610m1197K65780A73698J1494E6957B5104N53616E9222L9980R1190E4896
16204B91423q9846J30863N2533j64784J29863J05295F9206K10514P888A0049K57321
16193B67370P8161G1324L73927a89749I0321a39758H9321L23787A43221J04802
$$ plain form
16268 257084 530855 261742 359158 302795 960948 205509 138885 -4579 510840 379877
16258 379877 201371 230658 146766 320312 355103 164131 318572 549249 417855 508254
16248 508254 181438 214916 35688 32882 263263 320190 2302 -94919 24140 438386 273579
16237 273579 85640 205923 405823 310305 307171 94588 533577 183534 265879 390134 222701
16226 222701 435109 192965 324636 139982 133440 33205 327703 238745 345003 183610
16216 183610 142413 408193 173698 185192 56957 25104 578720 59222 99202 190392 54896
16204 291423 201577 332440 384973 220189 350052 455347 69206 279720 287608 10049 267370
16193 267370 345531 71324 445251 -189749 90321 -139758 89321 413108 143221 248023
16183B48023h0126A66652D0009L4604L41609A02050J57733J49854F0035a47260
16172C4973K62228A26191K8815F9261a37157B4072J05143L612O982K99565E7301
16160A53708h646B1166a15449B48150n3742J0292p9647C9527J72086J04641a33118
16148D9029J2262j0342L90c1741A53539Q727Q5566A062J85581O6765E901K32030
16136B37931l0537R2331F3726L4622J16738e2699o5987C58909B9274a56431l02403
16125d58834A62744b9312A26819o512R9804K7518a40596B09666a15693K7918A4126
16113a08214A23964k5431J44698a54478A99622L64324H2954i1397F2374K28714
16103B91088r5723c831D16900j56836j00352J26474j10745l8796K30228j45462
$$ plain form
16183 248023 -80126 166652 40009 74613 416222 102050 259783 409637 60035 -147260
16172 34973 297201 126191 155006 69261 -137157 24072 129215 132827 139809 439374 57301
16160 153708 -8646 21166 -115449 248150 194408 204700 125053 39527 211613 316254 -133118
16148 49029 61291 50949 51339 -31741 153539 162266 247832 1062 186643 253408 5901 237931
16136 237931 207394 299725 63726 98348 215086 -52699 -118686 358909 29274 -156431 -458834
16125 -458834 162744 -29312 126819 120307 220111 247629 -140596 209666 -115693 -87775 14126
16113 -108214 123964 98533 243231 -154478 199622 563946 82954 -91397 62374 291088
16103 291088 195365 -3831 416900 260064 159712 286186 175441 136645 366873 221411
16093B21411i6664c407j49682D8677L6158A6128J06700M2061N5853N8288a16805
16081D13169q7813K09183A02778k1331P4039c8255I7136R8262b3095A86849j1985
16070A74864E8112b8082B16490m3058B9449c1153k3432q355F90627c01680e9327
16058B28674F7400K20851a05117C10997G8092N5644e9633a2585E0906J75751G3588
16046i0260n0755M0279m27B5747J85856b6900A43464e0420j80764H2771a38240
16034A45071A90M0120Q5576f4427F9738c6593j98875A5406c2378C4695g8249o612
16022h4861c6950A88890a91043i5441A41110b3917A00823J8313J9561a47440A47640
16010C2125b49817L0791A93402p5204J52879a96644A08182J06911h1505l20091
$$ plain form
16093 221411 -96664 -3407 -153089 48677 84835 16128 122828 164889 220742 279030 -116805
16081 413169 325356 534539 102778 81447 155486 -38255 97136 195398 -23095 186849 174864
16070 174864 58112 -28082 216490 173432 29449 -31153 -54585 -62940 690627 -301680 -59327
16058 228674 67400 288251 -105117 310997 78092 133736 -59633 -12585 50906 226657 73588
16046 -90260 -141015 -100736 -101163 25747 211603 -26900 143464 -50420 -231184 82771 -138240
16034 145071 190 40310 125886 -64427 69738 -36593 -235468 15406 -32378 34695 -78249 -84861
16022 -84861 -36950 188890 -191043 -95441 141110 -23917 100823 119136 138697 -147440 147640
16010 32125 -249817 -219026 193402 118198 271077 -196644 108182 215093 -81505 -401596
16000d01596A19050e2307D17217b7715G0859a55790A34218J77505b2200j32462
15990a54662A03527D7274K99022K42871k23147N71544L19345k72983Q5790k80862
15980G88854l86232j75799j06926n6863J49841J95649j36430b14584C75928b44433
15969B03938C0538a57592d9873n4952c3128p7648A5674b17692A2127b64911E7159
15957B87535I8778i4529k25852D776M4927i8695c2900A40751a29608O3188m0036
15946a06456o0791Q3027c780A67275g6453A34069H778c91524A65641F9259N1221
15935A20480a43491F1051Q0644J83007a17521K097A06623B3629J6831P4194c51969
15923a12402H1171p694a56983C9845J4885a85618E2478a56415o5695l3210A62281
$$ plain form
16000 -401596 119050 -52307 417217 -27715 70859 -155790 134218 311723 -22200 -154662
15990 -154662 103527 47274 346296 589167 366020 937564 1256909 983926 1069716 788854
15980 788854 402622 226823 119897 63034 212875 408524 272094 -214584 375928 -244433
15969 203938 30538 -157592 -49873 -104825 -33128 -110776 15674 -217692 12127 -264911 57159
15957 287535 98778 -94529 -320381 4776 49703 -98695 -32900 140751 -129608 -66420 -106456
15946 -106456 -167247 -84220 -3780 167275 -76453 134069 8778 -391524 165641 69259 120480
15935 120480 -143491 61051 141695 324702 -117521 -115424 106623 23629 40460 114654 -351969
15923 -112402 81171 73477 -156983 39845 54730 -185618 52478 -156415 -222110 -255320 162281
15911b05149D39d310l47970J16226C77132G7968h1860j78875B59734D5877J45453
15900A91330b13810C01457c37438H6820a54025C90545a51201C2152a71952D3900
15889A75963J36368r5508r2992b84435e0428A02860b27188A64238A6690P6532
15879I3222i2935k1081B14754a94656E6497J17540J8075M9289a55889A02249M8376
15868A50625b86245A49847a72460H5627M7976a21370M4957A07840b17090J02326
15858a14764C4557a50303j4735B23932h2320A63860e3549A14855D0574J94667
15848B35241l0210i6500a3593A14780b9303A24005e1037j76681A37658i563I1868
15836C860O7803a48937A75462c32445c5263a3918I2705j7087d73947a65117N3071
$$ plain form
15911 -205149 439 -4310 -352280 -236054 377132 77968 -81860 -260735 259734 45877 191330
15900 191330 -213810 301457 -337438 86820 -154025 390545 -151201 32152 -171952 43900
15889 175963 312331 216823 123831 -284435 -50428 102860 -227188 164238 16690 93222
15879 93222 -92935 -114016 214754 -194656 56497 174037 192112 241401 -155889 102249 150625
15868 150625 -286245 149847 -172460 85627 133603 -121370 -76413 107840 -217090 -114764
15858 -114764 34557 -150303 -165038 223932 -82320 163860 -53549 114855 40574 235241
15848 235241 205031 -96500 -13593 114780 -29303 124005 -51037 -227718 137658 -9563 91868
15836 3860 71663 -148937 175462 -332445 -35263 -13918 92705 75618 -473947 -165117 -112046
15825a12046L6936G268b6766D0543a42207F0813f4128j41193k0946F1486J74060
15814B35546J07591q0504D9580a07145l82422e699B15100b85217A61158a84701
15803b49243I9734b20051A75970K6739c17938C01320j37032o4870K6547C4690
15792A09378a35265C19153A08332f8269A76999a53147d1039F4070a41441c497
15781f3027C3529a574H37M5736A0456c21997d9981B26103i173A46577o1302j4334
15769G0941J53382A8432J08152J6643K19255c09990D5938a5105j05986C54647
15758c35655b4872B22135F8555A4766J30747a18154c8247A02745J33307J23030
15748C59082a40955M5153K969I211A073N4406a20003J3296N0242j13223B90204
$$ plain form
15825 -112046 -75110 7268 -26766 40543 -142207 60813 -64128 -205321 -226267 61486 235546
15814 235546 343137 262633 49580 -107145 -489567 -5699 215100 -285217 161158 -184701
15803 -249243 99734 -220051 175970 202709 -317938 301320 164288 99418 125965 34690
15792 109378 -135265 319153 108332 -68269 176999 -153147 -41039 64070 -141441 -3497
15781 -63027 33529 -1574 837 46573 10456 -321997 -49981 226103 -9173 146577 85275 70941
15769 70941 224323 18432 126584 143227 362482 -309990 45938 -15105 -121091 354647
15758 -335655 -24872 222135 68555 14766 145513 -118154 -38247 102745 236052 359082
15748 359082 -140955 -95802 -92833 9211 1073 55479 -120003 -106707 -56465 -169688 290204
15736d02898J89726J5920N3918B06416q9038k8061a9267j46288K7468A6294P7423
15725I3717d4536D9686b52490j28670a86980g7866A32413J55528C4551K02154
15715B36705A04969Q313a56610p8058m7541C3479J04629b60102f688A14412J52605
15704B67017c17869F4730J2759K36063b37777A35010a62273c2943p2164A35248
15693c8571A38845j8179e2126B88615A1274P6366c69147A51435a04257d2334G5164
15681A86285L9711b59815R9630N3718n2470A49545c23829M9426p280f8732A71252
15669f7115B23691N5866B8530g1912A9497F425a18762j40155b7685j35121d0426
15657c78279J80177r9137N7285G9490g7292A01303a23470B44370c30555C24743
$$ plain form
15736 -402898 -213172 -197252 -143334 206416 117378 89317 -19267 -165555 -138087 16294 93717
15725 93717 -44536 49686 -252490 -381160 -186980 -77866 132413 287941 34551 236705
15715 236705 104969 113282 -156610 -234668 -282209 33479 138108 -260102 -6688 114412 267017
15704 267017 -317869 64730 77489 313552 -237777 135010 -162273 -32943 -105107 135248
15693 -38571 138845 120666 -52126 288615 11274 87640 -369147 151435 -104257 -42334 75164
15681 186285 225996 -259815 -160185 -106467 -158937 149545 -323829 -274403 -281683 -68732 171252
15669 -67115 223691 279557 28530 -71912 19497 6425 -118762 -258917 -27685 -162806 -40426
15657 -378279 -198102 -297239 -239954 79490 -77292 101303 -123470 244370 -330555 324743
15646E2059g4085I5155b37166R4344A13885L1278F7204B1229N794a48657A79809
15634c47666A1545O7467a07229c5149H3065i5972j42624B64415a51878f9670o4570
15623a34240D96148c97857i6670n4530D3419J56762a2810O267j24871B7798d0431
15611a9163e869j44412G8169a21894o4409k7708A02291c88147J36654Q1730D1249
15599A59429d6593A54347A4468a29980e7006I5286g5291H4942a77616l944C2168
15587c7813E1429b45630e1389B34186O5931a42522o5077f3689E130L0155i1363
15575B47545b56781J09392G372L67909c36154P790H3468c9386j657k0274A25570
15563b12174G0301J61481Q4063G7167N1588b42174g2121A36386A7716l188b59453
$$ plain form
15646 52059 -74085 95155 -237166 -142822 113885 145163 67204 21229 27023 -148657 179809
15634 -347666 11545 79012 -107229 -35149 83065 -95972 -238596 264415 -151878 -69670 -134240
15623 -134240 496148 -397857 -96670 -151200 43419 200181 -12810 -6543 -131414 27798 -40431
15611 -19163 -5869 -150281 78169 -121894 -186303 -214011 102291 -388147 -251493 -169763 41249
15599 159429 -46593 154347 14468 -129980 -57006 95286 -75291 84942 -177616 -181560 32168
15587 -37813 51429 -245630 -51389 234186 300117 -142522 -207599 -63689 5130 35285 -91363
15575 247545 -256781 -147389 7372 375281 -336154 -328364 83468 -39386 -41043 -61317 125570
15563 -212174 70301 231782 315845 77167 128755 -242174 -72121 136386 17716 14528 -259453
15551f8394k68270j3547A0927M1635R4860a78650h6682A38382b44788B58088R9273
15540C57361N5526j82372c7145r4809A86287d86571i6062l797m0454L5805D33292
15528D2257g7088K0041j19854A12863g6450B3171b5467A3005L07550b72862h5445
15516A83821H9454P4432J22630B4542K45475L42697A34178N0586O462J27812M5060
15505C64098A08449C5250L25146h5928a5015A15019K9991j7163c91033E6617K59756
15494C16373C7598J22442Q1763a59794I2670C3876A0460J5765J20461i983j87554
15483a97537K3396A3101d8090D5865J84437M67228H0066K58962J95990k55077
15473B79941K76380K86052j61694j16291j40097h0470A53403P1576e8652k25522
$$ plain form
15551 -68394 -336664 -350211 10927 52562 147422 -178650 -86682 138382 -244788 258088 357361
15540 357361 412887 230515 -37145 -131954 186287 -486571 -96062 -99859 -140313 -104508 433292
15528 42257 -77088 -57047 -176901 112863 -76450 23171 -25467 13005 320555 -272862 -85445
15516 183821 89454 163886 286516 24542 270017 612714 134178 184764 191226 319038 364098
15505 364098 108449 35250 360396 -85928 -15015 115019 145010 127847 -391033 56617 316373
15494 316373 37598 160040 241803 -159794 92670 33876 10460 26225 146686 -9983 -197537
15483 -197537 -174141 13101 -48090 45865 230302 697530 80066 339028 535018 279941
15473 279941 556321 842373 680679 564388 424291 -80470 153403 224979 -58652 -284174
15463b84174B0227L22797a66595A40868i1019A778a79054R138A91536a99465F0124
15451I7904r290K07808a1600j25364M3472A6135f4337C76284J79714k4422R0699
15440F22275N93479q9629j32640l59768j88349B06180k575j5597N15419B08663
15429h0811k94194J76251A19207J1178L5883l7452E1033J42082d5950F542a24785
15417b72070G9120K29772a60250M6263j36919b3568P356k28313K5057C23993G1988
15405B7934k951J81732b68990D1233c6657A50535i5397A11903K9515a47102B41252
15393A07854J05792o109H8536M1032c43323J4284a51482J6719A07767d4023n4692
15382i8715A06555J80566c86198B20104G6338a15948J9750D8693J66057p9471
$$ plain form
15463 -284174 20227 343024 -166595 140868 -91019 1778 -179054 -169916 191536 -199465 60124
15451 97904 88614 296422 -11600 -136964 -93492 16135 -64337 376284 555998 531576 622275
15440 622275 1215754 1126125 993485 633717 445368 206180 203605 188008 703427 208663
15429 -80811 -375005 -198754 119207 130385 166268 128816 51033 193115 -45950 6542 -124785
15417 -272070 79120 308892 -160250 -113987 -250906 -23568 -16212 -244525 -219468 323993 71988
15405 27934 24983 206715 -268990 41233 -36657 150535 -95397 111903 141418 -147102 241252
15393 107854 213646 207537 88536 129568 -343323 -329039 -151482 -134763 107767 -44023 -98715
15382 -98715 106555 287121 -386198 220104 76338 -115948 -96198 48693 214750 135279
15372A35279F2613b06594L1425A70077d8318j06475n0282h9393A18013K77506
15362C95519A43079K1947n3651J18371J66577A60692M0937a13207A29214J80260
15352C09474g6367D32632j19996j02582J35235q3806I401J93711J64438j73837
15342A93713M42709A38369J81252G6044J16167J42605j53056J52901g6537J1948
15332f4589D35122j89604c68054B66921K21783o5675A89037l1647l4805J72103
15322B94688G2696b52287B55871C345J41883c9987A26080Q6629l2187b40143B54187
15310C77840A48002a5733A82722J41603G0546N8110D4909L00557l9875A35334
15299b05979B20103c6591K278j18393k8343B87183A25704D1932J8409b4880B69457
$$ plain form
15372 135279 62613 -206594 -175169 170077 -48318 -154793 -205075 -89393 118013 395519
15362 395519 143079 165026 111375 229746 396323 160692 201629 -113207 129214 309474
15352 309474 -76367 432632 312636 210054 345289 261483 9401 203112 367550 193713
15342 193713 636422 138369 319621 76044 192211 334816 181760 334661 -76537 -64589
15332 -64589 435122 245518 -368054 266921 488704 423029 189037 157390 122585 294688
15322 294688 72696 -252287 255871 3345 145228 -39987 126080 212709 180522 -240143 254187
15310 377840 148002 -15733 182722 324325 70546 128656 44909 345466 305591 135334
15299 -205979 220103 -36591 -34313 -152706 -181049 287183 125704 41932 60341 -24880 269457
15287b31179h8773D1994a1186A28119K09191C6468a86460A2815g2051F4777M0092
15276A04869i9901k00403J32455A33192K30194a62700j1508D04304j65047Q647
15266B47904j19725A3254R6124c58345C68761b83467R6522B50819M281d30276
15255h8474a5574C3291L5424c7807O058o6703A96718B3813J19880K624Q3842o5365
15243A64794P83137N26127J69414j34647M70258q73376C85299j69398e8529A30401
15232A85031l4213p1081L15436b05225j06650b1963A36144c23252i2505j4064
15222a06569j24272F0990m430j876a8723A04104P3908c1740A49187E5138Q5674
15211A40812M0783k0677J36350l0052A12153f2587B0538J48131C6793f7484K8062
$$ plain form
15287 -231179 -88773 41994 -11186 128119 337310 36468 -186460 12815 -72051 64777 104869
15276 104869 -99901 -300304 -167849 133192 363386 -162700 -174208 404304 239257 247904
15266 247904 128179 13254 109378 -358345 368761 -283467 -186945 250819 255100 -430276
15255 -88474 -15574 33291 68715 -37807 -31749 -98452 196718 23813 143693 146317 230159 164794
15243 164794 947931 1474058 1643472 1508825 1979083 1105707 385299 215901 -58529 130401
15232 185031 150818 79737 395173 -205225 -311875 -21963 136144 -323252 -92505 -106569
15222 -106569 -230841 60990 56560 54684 -18723 104104 178012 -31740 149187 55138 140812
15211 140812 181595 160918 297268 267216 112153 -62587 20538 168669 36793 -67484 -39422
15200c9422H3258d9479B48736o8918C6532J43892a86078D73774c2844C38996D1108
15188g856A56733h5669B13756O1944A26242M7412a42389A40155h7588d693B55691
15176A34895a6888G1965b81916B73615I5799E21K6235K4224N9809L72204B36513
15164d9237B99513j29505b70298J22009k8086A83797a15169B53999I4143Q109
15154A02252g202n5229B22210g9242D7350L876K41268r5282b0213A33919j3706
15143A20213K08417A17316J15567I6035P9181J41094j16445J00301A12019a47630
15132C73741j78982q2535J98609O4912p4929n1053K1348K1370q6261B7003J62319
15121A89322p9508J50135J3720J73208J38524j59816A99475a88447f2305A38552
$$ plain form
15200 -39422 83258 -49479 248736 179818 36532 180424 -186078 473774 -32844 338996 41108
15188 -7856 156733 -85669 213756 275700 126242 173654 -142389 140155 -87588 -4693 255691
15176 134895 -16888 71965 -281916 273615 95799 521 26756 50980 110789 482993 236513
15164 -49237 299513 170008 -270298 -148289 -176375 183797 -115169 253999 94143 102252
15154 102252 -7202 -62431 222210 -79242 47350 51226 292494 197212 -20213 133919 120213
15143 120213 328630 117316 232883 96035 175216 316310 199865 300166 112019 -147630
15132 373741 194759 112224 310833 375745 300816 249763 271111 292481 206220 27003 189322
15121 189322 109814 259949 273669 446877 585401 425585 199475 -188447 -62305 138552
15110A92995m8756a33734D1044K79708f7594B31827J62287H9929J19686e7540
15099H9655J28452l8641J55921b97700A50355J0766b36B3851K93533F2421g5001
15087A04433i9105H8732n012d2812C23615J8199P700e1740C1897M35777A17984
15075B55143E6814M0164J65395F7235Q0094a63385B86572L06237a09130D07703
15064A91918P0366m3501J06827b641A01793N5064M9353q3768L07195j85508K97270
15053E41399b3877B01280B2848L03401l6895J05136o1056J08121k02085K31057
15043D70527b9541A85337K59368j6377B00110J90345p1500J33989j21516j6431
15033C14997r8782P6749Q4453L15686m0888J8375R1141j99715L32346C74636J0803
$$ plain form
15110 192995 144239 -133734 41044 320752 -67594 231827 394114 89929 209615 -57540
15099 89655 218107 179466 335387 -297700 150355 161121 -236 23851 317384 62421 -75001
15087 104433 -99105 88732 83720 -42812 323615 341814 349514 -51740 31897 467674 117984
15075 255143 56814 96978 262373 67235 147329 -163385 286572 592809 -109130 407703
15064 191918 262284 218783 325610 -2641 101793 156857 206210 122442 429637 244129 541399
15053 541399 -23877 201280 22848 326249 289354 394490 333434 441555 239470 470527
15043 470527 -29541 185337 444705 428328 200110 390455 318955 452944 331428 314997
15033 314997 216215 292964 377417 693103 652215 670590 761731 562016 894362 374636 385439
15022C85439A32830M53370J82808P7586m0432j87393k96703J42574l5500O5370
15012D94510k20700b6369E33578I7324N01505B95998j3150J38191l1066k1612
15002C68361M108R3914L37827B10946J98929O33601D38975o7175D7389N35309
14992E82698q27B00440M48424m06k22518j4300j52552J17535K84059K01369l75608
14981D86443J73814n5192N46378D76485r3669J9562K91079C33139m7120J29933
14971D15952P2961J23976j18443p3469m1256K6381j13625M96221A13219P8954
14961A92173J41527E2459O57864B87819J21389B03126C1469J77628L94133B44503
14950C09249Q4576J755o8059l7870R7469A44548K52264j0453M85423P6761j89015
$$ plain form
15022 385439 132830 586200 769008 846594 806162 618769 322066 464640 429140 494510
15012 494510 273810 -26369 533578 97324 598829 295998 282848 421039 389973 368361
15002 368361 372469 466383 804210 210946 409875 1043476 438975 371800 47389 582698
14992 582698 581871 200440 648864 648458 425940 411640 259088 376623 660682 862051 486443
14981 486443 660257 605065 1151443 476485 382816 402378 693457 333139 286019 415952
14971 415952 488913 612889 494446 420977 379721 406102 292477 788698 113219 192173
14961 192173 333700 52459 710323 287819 409208 203126 31469 209097 603230 244503
14950 309249 393825 395580 327521 289651 387120 144548 396812 386359 871782 948543 759528
14939G59528j89602j03496j77386O6464L9476P2263N5298n9753O83063j39842
14929A006013l12628N30479k24664M65838k87153J68598M38581O7671n29843L34380
14919A657272o41096M92821J30717O11783o637R7009p98834M6357o27214K33546
14909A195724l58691j90160J62246J21129C64476J58090j71281j22415L18844
14900E47714k59514D4992L66989j18974A17241C9056N20379o8833k45191J40512
14890C85923j25709k8923K21452o101L98932l38619J94543K18437k31071L0049
14880G18913J22734j44947K67311k20526k3379J5834r654J38309B89826K49378
14870E39204B40623O27638m28903o8586M26043k8934R6868k3163p4332k25719
$$ plain form
14939 759528 569926 466430 289044 355508 394984 467247 522545 462792 1145855 1006013
14929 1006013 693385 1223864 999200 1465038 1177885 1346483 1785064 1852735 1322892 1657272
14919 1657272 1016176 1508997 1639714 2251497 2244860 2341869 1543035 1589392 962178 1195724
14909 1195724 837033 646873 809119 930248 364476 522566 351285 228870 547714
14900 547714 288200 44992 411981 293007 117241 39056 559435 490602 245411 385923
14890 385923 260214 231291 452743 446642 845574 506955 701498 919935 688864 718913
14880 718913 841647 696700 964011 743485 720106 735940 726286 864595 289826 539204
14870 539204 240623 868261 439358 370772 796815 767881 864749 841586 767254 541535
14860E41535j23881m0847A87572L72800j30976N9084j10773A45317L23244M4445
14850E13006k40122K51006j46066L91116C57572K5173L1793M95475K2037J34053
14840A066103k55290K86902p4998J33149k99388K35170j12209l78909J42956j32063
14830F11423j62521n5416K20080J5632M41221C90791L37662K39447l38369J39199
14820G68730m6097M6099j27155J27472J76991l64788j33149R1099K09607m0916
14810G07893J82117l16444k03487M61224J88128k90150J90258J69273M0447p835
14800A121424o6399k71713M7980C50439O00174k36139n2018p616O2633m257j82309
14789E30907j65548L64031j95518P7862L27051k17958O9091k25810K03697j904
$$ plain form
14860 541535 417654 376807 187572 560372 429396 488480 377707 145317 468561 513006
14850 513006 272884 523890 377824 768940 357572 382745 414538 910013 932050 1066103
14840 1066103 810813 1097715 1022717 1155866 856478 1091648 979439 600530 743486 611423
14830 611423 448902 393486 613566 629198 1070419 390791 728453 967900 629531 768730
14820 768730 722633 768732 641577 769049 946040 581252 448103 539202 748809 707893
14810 707893 890010 573566 370079 831303 1019431 729281 919539 1088812 1129259 1121424
14800 1121424 1055025 783312 831292 350439 950613 714474 662456 654840 717473 713216 530907
14789 530907 365359 729390 533872 611734 938785 720827 789918 564108 767805 765901
14779G65901j70111p2947M87776k1359o7899R390L4088O696l17350J80302o3322
14768G71165j43574j24401K22350j7846K6330l12084N56526k57093j53886l520
14758E63967n3169Q1872J20537K06463j38202L9239k3519J3419l80574J78686
14748F08719K73326l39151K93604l0021m286j33887J23547K18823j92950J12897
14738I30621N1782j64395N0207l23355O13578k08325k70750N81507j72530M9086
14728A137426J80993R7196o1696N99192K1784l90424r6554k91205j95690j57305
14718H43717J52836j29734k35903N2079L20751k49450J37529r1010m59Q1496j7002
14707H64850K95057l95250L55486K3903J50976J16401K81570K040j10079K17841
$$ plain form
14779 765901 595790 522843 1010619 989260 921361 930751 964839 971535 654185 834487 771165
14768 771165 627591 503190 725540 707694 734024 421940 978466 721373 567487 563967
14758 563967 510798 592670 713207 919670 781468 820707 797188 810607 430033 608719
14748 608719 882045 542894 836498 806477 802191 668304 791851 1010674 817724 930621
14738 930621 982403 818008 868215 544860 1158438 950113 679363 1260870 1088340 1137426
14728 1137426 1318419 1415615 1353919 1953111 1974895 1584471 1487917 1196712 1001022 843717
14718 843717 996553 866819 630916 682995 1003746 754296 891825 800815 800356 881852 864850
14707 864850 1159907 764657 1120143 1144046 1295022 1411423 1692993 1695033 1584954 1802795
14697A802795L35924p56346m1108l5284j91524J53795j23400j47271k14350J96549
14687I79780k85105L81871k97760K07933j54146K29370j03489K1717K25088l53261
14677H51998L81359n99658L52026K17539m72593K64472o2796k93208M16279l5778
14667A019640l2476M9706J12497m4472l83836J86431N04499l49477N9858o4123
14657A058247Q5200m37409N18116R8462k07848O6636J13833K09631j0290N603
14647A500181o06096L57433J46042m18077K69940O8751p8959P1948j40629J48219
14637A318753m12221N75704n99652J7311M11312J62235m98569J11733L19324L33414
14627A739344n00643M63407m23160J27025j65467J4143K09603l36781L00067P2718
$$ plain form
14697 1802795 2138719 1382373 1341265 1305981 1114457 1268252 1144852 997581 783231 979780
14687 979780 694675 1076546 778786 986719 832573 1061943 958454 980171 1205259 851998
14677 851998 1233357 633699 985725 1203264 730671 995143 932347 639139 1055418 1019640
14667 1019640 987164 1036870 1149367 1104895 721059 907490 1411989 1062512 1122370 1058247
14657 1058247 1143447 706038 1224154 1322616 1114768 1181404 1295237 1504868 1494578 1500181
14647 1500181 894085 1251518 1397560 979483 1249423 1318174 1239215 1311163 1170534 1318753
14637 1318753 906532 1482236 882584 899895 1311207 1473442 974873 1086606 1405930 1739344
14627 1739344 1238701 1702108 1278948 1405973 1240506 1254649 1464252 1127471 1427538 1500256
14617A500256L06386l42545j29384q0973l5148o3926M09945r3859p684J76373
14607A639441m02836N59240m31760l16475M86210n9565K60742l74201L50881l63048
14597A348629L78103j39388P6805Q4400k78081N0471M43467j90860K522K72505
14587B048573j76098K59260o08059K41601N51843l65853J94662l33935J15140
14578A927134L49282j55226J01522r6826j82189J10223K86623j45522l9520l4333
14568B121168K63176P4248l4841r6964m1400L08348j65201J25554M653K73987
14558B832728M42096k72918L70783R2658j2381M8041L65269N73337Q01318J414640
14548F655571L222800P946896J6171555J5683961k2723990A1028574E336594j922437
$$ plain form
14617 1500256 1806642 1464097 1334713 1253740 1218592 1154666 1564611 1470752 1463068 1639441
14607 1639441 1236605 1795845 1364085 1047610 1533820 1474255 1734997 1360796 1711677 1348629
14597 1348629 1726732 1587344 1664149 1748549 1470468 1520939 1964406 1773546 1776068 2048573
14587 2048573 1872475 2131735 1523676 1765277 2317120 1951267 2145929 1811994 1927134
14578 1927134 2276416 2121190 2222712 2125886 1943697 2053920 2340543 2195021 2155501 2121168
14568 2121168 2384344 2458592 2423751 2326787 2285387 2593735 2428534 2554088 2558741 2832728
14558 2832728 3274824 3001906 3372689 3465347 3452966 3501007 3866276 4439613 5240931 6655571
14548 6655571 9878371 17825267 33996822 49680783 26956793 11028574 5336594 3414157
14540C414157m74623M91813P36965J285850k101030j192641j82068Q4038j14126
14531A948335L66481P5223l48770L73610J64446j23278j45037M3299J23508J04995
14521B582812l1761k28264Q9738l8593m1368M50220L8301k93938J2292K21368
14511B760807n4331J52063K59652J21690j9816m17578L64352q5152L19069r7303
14501C303453k91962K11572Q6573k63023J11309M44579l07797J47584J59739K058
14491C604085k45944K53792M55470n45009J47484J75429j26611L11088j96726
14482C833058k63076O05886j19011K3639j05155L32341k82098r3115L62118K9366
14472D323953k0003J6956L49376p2675J11090l66730M09238j10450J25340n4353
$$ plain form
14540 3414157 2939534 3431347 4168312 5454162 3353132 2160491 1978423 2062461 1948335
14531 1948335 2314816 2390039 2041269 2414879 2579325 2456047 2311010 2354309 2477817 2582812
14521 2582812 2551051 2322787 2412525 2373932 2332564 2782784 2821085 2527147 2539439 2760807
14511 2760807 2706476 2858539 3118191 3239881 3220065 2802487 3166839 3081687 3400756 3303453
14501 3303453 3011491 3223063 3309636 3046613 3157922 3602501 3294704 3442288 3602027 3604085
14491 3604085 3358141 3611933 4067403 3522394 3669878 3845307 3718696 4029784 3833058
14482 3833058 3569982 4175868 4056857 4080496 3975341 4307682 4025584 3932469 4294587 4323953
14472 4323953 4303950 4320906 4670282 4597607 4708697 4341967 4751205 4640755 4766095 4711742
14462D711742M87827l54311N5414k13630K84468K11027l53614L12956k2328J88346
14452E307897K68128j68373J71032k81717M59505n6823K8495n5695L51211j2155
14442F011505J23484J89351K997j12840J25747J14501Q5082J29916k22016M30884
14432F878611M5955L31561j48998L59267j48963J95472K20352j25797M22513j24460
14422G905513o0996K85155l7033O68791K0017N41283K1349j43981M5265k61983
14412H983380k7830N24485q1068j12540N06843L80597r176L6723L58058L60233
14402A0919705O9569K13771K1903J74357P2966P3830Q5183N56196O9715L79912
14392A2637107j47626J87091Q28319k54456K04356K90740M16770j4365L96335
$$ plain form
14462 4711742 5199569 4845258 4900672 4687042 4971510 5182537 4828923 5141879 5119551 5307897
14452 5307897 5576025 5407652 5578684 5296967 5756472 5699649 5728144 5672449 6023660 6011505
14442 6011505 6134989 6324340 6327337 6214497 6340244 6454745 6539827 6669743 6447727 6878611
14432 6878611 6924566 7256127 7107129 7466396 7317433 7512905 7733257 7607460 8029973 7905513
14422 7905513 7844517 8129672 8092639 8761430 8781447 9322730 9344079 9200098 9245363 8983380
14412 8983380 8955550 9480035 9398967 9286427 9793270 10173867 10164691 10201414 10559472 10919705
14402 10919705 10989274 11203045 11224948 11399305 11472271 11546101 11631284 12187480 12257195 12637107
14392 12637107 12489481 12676572 13504891 13250435 13454791 13745531 14162301 14147936 14544271
14383A4544271O0469M18920O08595M23847R2135J56299K98852J2341L01829M95542
14373A7413100J70698N30840K24577L46671O46972K12046M31689P16373J78045
14364B0871011O03771M65319M65216L06382N85174K92081L54886Q09319L41901
14355B5095060N13380N36849J086706M92952R39759K11569O42880R62294R71918
14346C1453367R68310N18299P34619J098111R21320O75154R97352Q16783J493105
14337C9676420J081609J082025J169160J299230J311206J370004J253092J517535
14329D9760281K071344J470066J429031K216630K104136J937224J771154K153362
14321F4913228K321114K630745K650120K534103K780786K512809L177421L178991
$$ plain form
14383 14544271 14604740 15023660 15632255 16056102 16148237 16304536 16603388 16615729 16917558 17413100
14373 17413100 17583798 18114638 18339215 18685886 19332858 19544904 19976593 20692966 20871011
14364 20871011 21474782 21940101 22405317 22711699 23296873 23588954 23943840 24753159 25095060
14355 25095060 25608440 26145289 27231995 27724947 28664706 28876275 29519155 30481449 31453367
14346 31453367 32421677 32939976 33674595 34772706 35694026 36369180 37366532 38183315 39676420
14337 39676420 40758029 41840054 43009214 44308444 45619650 46989654 48242746 49760281
14329 49760281 51831625 53301691 54730722 56947352 59051488 60988712 62759866 64913228
14321 64913228 67234342 69865087 72515207 75049310 77830096 80342905 83520326 86699317
14313H6699317L290879L479598M096010L894383M159272M636740M593071N090696
14305A19939966N106692N671737O288355O242015O407898P229156P712309P679255
14297A72277383Q405949R173843R186133R981032J0793429J1173308J1424937
14290B42416014J1847206J3170272J3128256J3334292J4449204J4812376J4886833
14283C38044453J5524089J5335107J5245345J5145221J4715810J4132779J3305824
14276D41448628J1756095J0169856Q225346N125287J933246j493100l643274k931489
14268D70590595l364169n318594p334615r151687j1487316j4092593j5045981
14261D04795640j5788305j6252594j6133978j6209455j6288293j5485589j5424398
$$ plain form
14313 86699317 89990196 93469794 97565804 101460187 105619459 110256199 114849270 119939966
14305 119939966 125046658 130718395 137006750 143248765 149656663 156885819 164598128 172277383
14297 172277383 180683332 189857175 199043308 209024340 219817769 230991077 242416014
14290 242416014 254263220 267433492 280561748 293896040 308345244 323157620 338044453
14283 338044453 353568542 368903649 384148994 399294215 414010025 428142804 441448628
14276 441448628 453204723 463374579 471599925 476725212 478658458 477165358 473522084 470590595
14268 470590595 467226426 461907832 454573217 445421530 433934214 419841621 404795640
14261 404795640 389007335 372754741 356620763 340411308 324123015 308637426 293213028
14254B93213028j4088346j4083763j3598010j2651670j2134787j1525540r150726
14247B05980186j0237800r712675q951266q285480q292817p321270o959408o574628
14239A39644842o711257n932593n115979n134179n120054m634741m826714l977844
14231I8191481l687772l466306l855335l449675k877981l342517l132918k527730
14223G1851247k355812k786531k179490j543924k545433j962957k120801j566455
14215E4789844j847411j309502j596043j439009j593350j575781j390728j178440
14207D2859580o47457q31588j517950j374494r21587j333923o01866m28893j305762
14198C3896060r27494r27888r91863p25407o00564o86256m77603q57558r96003
$$ plain form
14254 293213028 279124682 265040919 251442909 238791239 226656452 215130912 205980186
14247 205980186 195742386 186029711 177078445 168792965 160500148 153178878 146219470 139644842
14239 139644842 132933585 127000992 121885013 116750834 111630780 106996039 102169325 98191481
14231 98191481 94503709 91037403 87182068 83732393 80854412 77511895 74378977 71851247
14223 71851247 69495435 66708904 64529414 62985490 60440057 58477100 56356299 54789844
14215 54789844 52942433 51632931 50036888 48597879 47004529 45428748 44038020 42859580
14207 42859580 42212123 41380535 39862585 38488091 37566504 36232581 35630715 35201822 33896060
14198 33896060 32968566 32040678 31048815 30323408 29722844 29036588 28558985 27701427 26705424
14189B6705424m42304o44618l17369r71252l38128o73052l82065p06197n15412
14180B1715027m91439k05120n18760j80175p21730j56213m12802n12692o1646
14171A8454450o13491j86968l93455n83699r6684m33246j39235k17246m20800
14162A5369626j86268k64809l09096l57018q2718p8187l48202m68786K1787l89149
14152A2907180j28446k98441l28212p6059n01321O83971p68709J09899k37882
14143A1361980l04975j74769P5102m76550L43640o29049J61149j63407l74770
14134I818351q9622j89487l11997O0873k50848K31155l43858k62353k08143M04915
14124H858986l36435k38110m2353l487m95966J78251j14619k14059J4111j21341
$$ plain form
14189 26705424 26263120 25618502 25301133 24329881 23991753 23318701 22936636 22230439 21715027
14180 21715027 21223588 21018468 20499708 20319533 19597803 19441590 19028788 18516096 18454450
14171 18454450 17840959 17653991 17260536 16676837 16580153 16146907 16007672 15790426 15369626
14162 15369626 15183358 14918549 14609453 14252435 14169717 14091530 13743328 13274542 13296329 12907180
14152 12907180 12778734 12480293 12152081 12076022 11574701 12258672 11489963 11599862 11361980
14143 11361980 11057005 10882236 10957338 10480788 10824428 10195379 10356528 10193121 9818351
14134 9818351 9728729 9539242 9227245 9288118 9037270 9268425 8924567 8662214 8454071 8858986
14124 8858986 8522551 8284441 8242088 8238601 7742635 7920886 7806267 7592208 7606319 7484978
14114G484978j81272J465j4372J291k92533k93665J85477J33942K0763m83687
14104F562387L6418J1538l42691L0367l41161M49273l19087j11441Q3569L12899
14094F372071q67151K05073k78069O9065K74862m42603M97706o16098J96469l8999
14084E372326m78026J80235j21000k3027l6976Q3004k59164J96327k15549K20094
14074D918244J03298n29995J36197o5634j06562k48751J43689j11830j19194L15560
14064D435022j49581K04474r4917m22278M15949k61703N8160j53171L0122N3479
14054D115556M3801j29559j20773k48783L26466p11702K31934j6033k42377M59231
14044C707761l37479J60506m69311M95228k88251l8822p9006j9093J08161q5378
$$ plain form
14114 7484978 7303706 7305171 7290799 7292090 6999557 6705892 6891369 7025311 7046074 6562387
14104 6562387 6598805 6610343 6267652 6298019 5956858 6406131 6087044 5975603 6059172 6372071
14094 6372071 5504920 5709993 5431924 5500989 5775851 5333248 5830954 5214856 5411325 5372326
14084 5372326 4894300 5074535 4953535 4930508 4893532 4976536 4717372 4913699 4698150 4918244
14074 4918244 5021542 4491547 4627744 4562110 4455548 4206797 4350486 4238656 4119462 4435022
14064 4435022 4285441 4489915 4394998 3972720 4388669 4126966 4185126 4031955 4062077 4115556
14054 4115556 4159357 4029798 3909025 3660242 3986708 3275006 3506940 3490907 3248530 3707761
14044 3707761 3370282 3530788 3061477 3556705 3268454 3229632 3150626 3131533 3239694 3154316
14034C154316K91253m69584L66536l90540J21072R3480j15161M0214m1853j84034
14024B865699J3913L02250o74597J03218K55206r5503j86538P8281r2596J08483
14014B677816j47872r8130R1400K29635k12770m8665L84k34011L40356m4727J28863
14003B682279j88571k16981K33345j50028n188k96878M58113j29031j85773M27764
13993B629051l00124q3081k86663J95128Q05389J834433N805580J4761437K2384760
13984D7745910j3255886A7136268p522812k798128j633613p80387o11593j67735
13976C622000l08419L6052n64756M7622K11355p98716M17909k85097l3046J42066
13966B486970k47922p9913N3121N5435J40156l61456K53865J85937r9527M32539
$$ plain form
14034 3154316 3445569 2975985 3342521 2951981 3073053 3166533 3051372 3091586 3049733 2865699
14024 2865699 2879612 3181862 2507265 2610483 2865689 2770186 2583648 2661929 2569333 2677816
14014 2677816 2529944 2431814 2523214 2752849 2540079 2491414 2491798 2257787 2598143 2553416 2682279
14003 2682279 2493708 2276727 2510072 2360044 2354856 2057978 2516091 2387060 2201287 2629051
13993 2629051 2328927 2245846 1959183 2154311 2959700 4794133 10599713 25361150 47745910
13984 47745910 34490024 17136268 9613456 6815328 5181715 4401328 3789735 3622000
13976 3622000 3313581 3349633 2784877 2832499 3043854 2245138 2663047 2377950 2344904 2486970
13966 2486970 2239048 2159135 2212256 2267691 2407847 2046391 2300256 2486193 2386666 2819205
13956B819205o03994o5672k6285r440j10591O6190m27278L26128k47699M32679
13946B153243O984l13613L2160J21812j71952j7341R9956j72258j17078K70195
13936A892108j62723J74729N204j72922Q9921j74770l402O0495K23962K22751
13926B155353m45860J83238l44411k5545J5603J72849j92338M07633k32657l39828
13916A354037J60996J18646k34629J86229K08759j42545Q0460l12157J80780j17965
13906A482611m06942M41340j51980J22783J3122l69163L75457j41824J63141l83066
13896A145479M64767k05060P9914k85298K0531j08057K11746j09057M62355l18583
13886A358737J46261m30650J29699q8524L0015o2515j59226M52504k79851K66588
$$ plain form
13956 2819205 2215211 2149539 2123254 2113814 2003223 2069413 1642135 1968263 1720564 2153243
13946 2153243 2160227 1846614 1878774 2000586 1828634 1811293 1911249 1738991 1621913 1892108
13936 1892108 1729385 1904114 1909318 1736396 1826317 1651547 1648145 1708640 1932602 2155353
13926 2155353 1709493 1892731 1548320 1522775 1538378 1711227 1518889 1926522 1693865 1354037
13916 1354037 1515033 1633679 1399050 1585279 1794038 1651493 1731953 1419796 1600576 1482611
13906 1482611 1075669 1517009 1365029 1487812 1500934 1131771 1507228 1365404 1528545 1145479
13896 1145479 1610246 1405186 1485100 1199802 1220333 1112276 1324022 1214965 1677320 1358737
13886 1358737 1504998 1074348 1204047 1115523 1145538 1083023 923797 1376301 1096450 1363038
13876A363038o637K18114l29160o4564J69326r3037k80841r6529L42929J32214
13866A354853j9322l7263j67556L2967k82551M85898l62530P163L76947l22571
13856A066035m6062K7813J07392m8234J3793k38139K08716J9727n9116k06943
13846H44982k7582M56499o5702m7922o1751l33607L46499n8158j62115J24887
13836A016030J24795j91031J94253k31820j58402L95846j21374p0713K01108K25113
13826A383805k89956n9339j46766M8727J57906j94389J40204o3444r9183K8427
13816I05992K32068r4500l43659K02900J61038k85309J23096r7295K2399J7298
13806H44028j37172n6600L23103K7101l77090K25072m02368M55138j14816j04010
$$ plain form
13876 1363038 1356401 1574515 1245355 1180791 1350117 1257080 976239 879710 1222639 1354853
13866 1354853 1335531 1298268 1130712 1163679 881128 1367026 1004496 1011659 1388606 1066035
13856 1066035 1019973 1047786 1155178 1106944 1120737 882598 1091314 1111041 1051925 844982
13846 844982 817400 1273899 1208197 1160275 1098524 764917 1111416 1053258 891143 1016030
13836 1016030 1140825 949794 1144047 912227 753825 1149671 1028297 957584 1158692 1383805
13826 1383805 1093849 1034510 887744 936471 1094377 899988 1040192 976748 877565 905992
13816 905992 1138060 1043560 699901 902801 1063839 778530 901626 804331 826730 844028
13806 844028 706856 650256 973359 1000460 623370 848442 446074 901212 786396 682386
13796F82386L52365m06286L26132C29248N82713j02366P6648l56576J49701N6538
13786G35906L62714r2656L1339m19463K01097K38981j61763j40721J59827l35630
13776E79631L19755k59629J04646j56741R5396J7076K0088j36952K13467k08132
13766E88605J5353L0729r8812J57747J94430j74745j37858p5741l5691M20022
13756H84039l08011R7648J16094j45415J29077O3260k50754J11197k50261M37929
13746H84803q894j26528m1631r7455k7076B66777N20853B05300M97884o3136j48358
13735D91690J57353j26997n1000P9438J15154J00739m9813k84993J70848B83159
13724D90916M28086D46128Q5431k26020K24813n144J09288k03482Q8219j12937
$$ plain form
13796 682386 1034751 628465 954597 329248 911961 809595 886243 529667 679368 735906
13786 735906 1098620 1005964 1037303 617840 818937 1057918 896155 755434 915261 579631
13776 579631 899386 639757 744403 587662 683058 700134 720222 583270 796737 588605
13766 588605 603958 634687 535875 693622 888052 713307 575449 499708 464017 884039
13756 884039 576028 673676 789770 644355 773432 836692 585938 697135 446874 884803
13746 884803 875909 749381 707750 610295 583219 266777 787630 205300 703184 640048 491690
13735 491690 649043 522046 471046 550484 665638 766377 716564 431571 602419 283159
13724 490916 919002 446128 531559 305539 530352 525208 634496 431014 519233 406296
13714D06296K75486j3126j76087J17170j93649j82383N51890j69168n2295J33532
13704F97666n5281j69639j9375J58710A51908O64749l84979R4444M362p8940N32262
13693I83806m20108J16587M2223l22551K69863p7398K72183C93845K03062k36392
13683C60515L52587B89125K51120p2765o0191r747J27766B50913K03673B10576
13672E90841p9563B31103M98743j51737j17796r643p2445A09803J78217K02953
13662D90973K791K4207Q9360k36098K06272k00074j01536J0617L7040K18539r1902
13651D50189l6761M7870j11670R3610j2133p6929K42512j81361J44147j04271
13641D55203K7847O937j71607J66752p9425k8510L25224k10691N8288J81820J03902
$$ plain form
13714 406296 681782 668656 492569 609739 416090 233707 785597 616429 564134 697666
13704 697666 642385 472746 453371 612081 151908 816657 431678 526122 530484 451544 983806
13693 983806 563698 680285 722508 399957 669820 592422 864605 393845 596907 360515
13683 360515 713102 289125 540245 467480 407289 397542 525308 250913 454586 210576
13672 590841 511278 231103 729846 578109 460313 450670 378225 109803 288020 490973
13662 490973 493764 517971 607331 371233 577505 377431 275895 286512 323552 542091 450189
13651 450189 413428 461298 349628 443238 431105 354176 596688 415327 559474 455203
13641 455203 483050 489987 318380 485132 405707 377197 702421 491730 550018 731838 835740
13630H35740j45998j99041j97825K41053k44689J57991j3128j33815J78026j86519
13620B91795J83752r7137M13689A97272P806N8291L52757J83163C21511A30515
13609B40858j6305N2334p7303M23186k75366J46174k24405J17592J1303J87831
13599E85899k24286K71909B02093J66260J00789m0377A01877J64323o724r8190
13589A61286J42170K4480L22100j80568j64985O3351j4793o7695J79267A58796
13578E99380k05396r8645N5078K00519A65449J75093A50670L32980R4618k00784
13568C77484J3289j38756A01349J88770J98674k5464B23409L00387B22021J35525
13558C57546q4621J29743N5265j41310N7623R7359B17622M47943K5006B42128
$$ plain form
13630 835740 689742 490701 292876 533929 289240 447231 434103 300288 478314 291795
13620 291795 475547 378410 792099 197272 205078 263369 616126 799289 321511 130515
13609 240858 224553 276887 199584 622770 347404 493578 269173 386765 398068 585899
13599 585899 361613 633522 202093 368353 469142 428765 101877 266200 259476 161286
13589 161286 303456 327936 650036 469468 304483 367834 353041 285346 464613 158796
13578 599380 393984 295339 350417 550936 165449 340542 150670 483650 578268 377484
13568 377484 390773 252017 101349 290119 488793 463329 223409 523796 222021 357546
13558 357546 272925 402668 457933 316623 374246 471605 217622 665565 690571 242128
13547C16525J65007J18637B78773Q9744a45390C11232R4426I6122L52175j27688
13537C20609A13702L19146o4536A54708K97018l7909j58104r4780Q2620r7750
13527A45803a1450A25766P3838R3844g9938A77945M67525A03666L20137B02489
13516B42438K62840A49332J4715N0768J64967f0217A63333f458C30622D6362N38034
13505E84396k69117j2706o1939H2307K52578e1016C69677j07041k1974q5752J76567
13494C31477a85512A55453K36880j80990j01323l0640Q4233N814M7950H4066N2863
13483A36929E5815K40702o7850K42528K8985A68125J97177E8405Q9339J75357
13473C23101j63j42192j4619o621k0412f6614A44626L93022C6374M5209K86041
$$ plain form
13547 316525 481532 600169 278773 368517 -145390 311232 405658 96122 448297 320609
13537 320609 113702 432848 368312 154708 451726 413817 255713 160933 243553 145803
13527 145803 -11450 125766 199604 293448 -79938 177945 645470 103666 423803 202489
13516 242438 505278 149332 164047 214815 379782 -60217 163333 -6458 330622 46362 584396
13505 584396 315279 302573 240634 82307 334885 -51016 369677 262636 240662 154910 331477
13494 331477 -185512 155453 392333 211343 110020 79380 163613 169427 217377 84066 136929
13483 136929 55815 296517 228667 471195 500180 168125 365302 58405 147744 323101
13473 323101 322938 180746 166127 159506 139094 -66614 144626 537648 36374 81583 367624
13462C67624o2813M5475I4694K20429A25219C4650K0269f4841B07374J11009Q5945
13451D04328j92752k6291L3336D6931L88083j43876k0854q554B8364J22246R7986
13440B48596j08974n7695J73561K2736A19411O3123l7803b78753B40280a80305
13429D3961J12878D7526j9347L31025G5996N2167J24402r3885L24682A78346N087
13418A83433o8266L24816e1642A63244L7562E9809J80456K03075a1739A40254
13407I4698J21014D2197J64053b8217A69644J09314A17908L71237A28605M78125
13397F06730k05528l3485A57925m1308Q6543N3458J4375g2208a4893C6841K19588
13386B56429c9346F46952E3673M41827F845K43518c2541B8855H461J71811K37407
$$ plain form
13462 367624 304811 350286 94694 315123 125219 34650 54919 -64841 207374 318383 404328
13451 404328 211576 185285 218621 46931 435014 291138 270284 261730 28364 150610 248596
13440 248596 139622 81927 255488 278224 119411 182534 144731 -278753 240280 -180305
13429 43961 156839 47526 28179 359204 75996 128163 252565 158680 483362 178346 183433
13418 183433 115167 439983 -51642 163244 200806 59809 240265 443340 -11739 140254
13407 94698 215712 42197 206250 -28217 169644 278958 117908 489145 128605 606730
13397 606730 401202 367717 157925 116617 203160 256618 270993 -72208 -14893 36841 256429
13386 256429 -39346 646952 53673 495500 6845 250363 -32541 28855 8461 180272 417679
13375D17679j95490E0391L14093A26795o2104K61035J30272k046n1544L5211K964
13364D40583j61487j28128R1688J48166j40034L07267k39460J64021E8469K64029
13354C22498r0985M105G1149N2066L21703m4279H9039g9268B7103K90474l3617
13343B83960A27692K12964l9417N5843m1525P3550N0332q6537A74397L68832j60394
13332C82835K774g8259C71824K9453B00201N656N37107k89652A02057L09693j08428
13321C03322i2088A47008J84541f8049D31985A58188o4041B5698J57948Q0786
13311B64432K59761k32563R8714c036B56476A0730N34628k07522J99918b02499
13300G1310K7681b69280I6450J93449j07725C3155L46242G1259J37597o7862N307
$$ plain form
13375 417679 222189 50391 364484 126795 64691 325726 455998 453952 402408 437619 440583
13364 440583 279096 150968 242656 390822 250788 558055 318595 482616 58469 322498
13354 322498 231513 235618 71149 123215 444918 400639 89039 -79268 27103 317577 283960
13343 283960 127692 340656 301239 357082 315557 389107 439439 352902 174397 543229 382835
13332 382835 385609 -78259 371824 401277 200201 205857 742964 453312 102057 411750 303322
13321 303322 -92088 147008 331549 -68049 431985 158188 94147 25698 183646 264432
13311 264432 524193 291630 390344 -3036 256476 10730 545358 337836 537754 -202499
13300 71310 98991 -269280 96450 289899 182174 33155 379397 71259 208856 140994 146301
13289A46301a66876B37928b7801E21817A31619C3705J69620M1687E7233K87671
13279C44904a05737a9788B54558J3732L0849J18795j22895N859p5155C6282J37799
13268A74081d8955o3698B01375I4243R0306M8307A13060f7767j76998B30404m1821
13257A88583G073g0410E1949J9825a00109C83268A43294o9966J49032O350C2580
13245C31263D1623M08192h279D2057a2553E05532a29136m6673A98439d9816j88294
13234b38110D21610H532f6472B28332A3196h7343H1427M4081J72474I6542B3284
13222B66413k9661A07217M244c33731D2725K19196F3056d9499C28960a07519A00545
13210e3363A12257a11611B57686a48770B25691M102J11224A12003J54172A31597
$$ plain form
13289 146301 -166876 237928 -27801 521817 131619 33705 203325 245012 57233 344904
13279 344904 -105737 -19788 254558 268290 299139 417934 295039 300898 225743 36282 174081
13268 174081 -48955 -112653 201375 94243 184549 232856 113060 -67767 -244765 230404 188583
13257 188583 7073 -70410 51949 71774 -100109 383268 143294 73328 222360 228710 32580
13245 331263 41623 449815 -8279 42057 -12553 505532 -129136 -175809 198439 -49816 -238110
13234 -238110 421610 8532 -66472 228332 13196 -87343 81427 125508 297982 96542 23284
13222 266413 236752 107217 111461 -333731 42725 261921 63056 -49499 328960 -107519 100545
13210 -53363 112257 -111611 257686 -148770 225691 229793 341017 112003 266175 131597
13199B8408K77317e7009F8553Q8080n383F5238L2530K2430J2057K63474A2301
13187A36586a28885C49242a73231H4328a12903A46337a85720E8397J21115H7391
13176C14646I8468a3564k77456B13299b5985C95847j59536L3624J08820A10764
13165D70589L1620h836m6942r076A89702f858B3501K0430K95415D4646A0478K80908
13153B91386a29504C31785A25945e2413A51756M8853D343K06332G2206J52546
13143B24752q6457K296d9437p3818A22011d0837A18391J10783j04622c1591C35556
13131F1045J15094b8940C3566K54945j29523f7131A41216L7472B8676b332k11915
13120b14247F9765L9484F506K14432a9435C290K3511N30559b1612B80860D9774
$$ plain form
13199 28408 305725 -57009 68553 156633 151250 65238 97768 120198 132255 395729 12301
13187 136586 -128885 349242 -173231 84328 -112903 146337 -185720 58397 179512 87391
13176 314646 98468 -13564 -291020 213299 -25985 395847 236311 269935 378755 110764
13165 470589 502209 -8836 -55778 -64854 189702 -6858 23501 43931 339346 44646 10478 291386
13153 291386 -129504 331785 125945 -52413 151756 200609 4343 210675 72206 224752
13143 224752 138295 140591 -49437 -123255 122011 -40837 118391 229174 124552 -31591 335556
13131 61045 176139 -28940 33566 288511 158988 -67131 141216 178688 28676 -2332 -214247
13120 -214247 69765 109249 6506 220938 -19435 3290 26801 557360 -21612 280860 49774
13108b3286C4748g013A8933J36930J6959J29205Q9306G3345A7041M23491B2654
13096E6194n440b44683C74905G5611J38899b56A52327a68430H3151J66853m6180
13085B03824n9205c6855I0861J20228c2088l9239C13780C3241J27273A5155K7843
13074D2998c0271I0227K66093A38153J58269E6435L2297J14757K03849C3480J38032
13063A71512E6295J97689f6409B87566c5029q1120g975k44643B22135Q4224a16245
13051A07215J43154o6530D4882e2105j60170b6985B99774j14292P7767H5328K02894
13040B88222o0759A11292J2604L61778A28881C5811K59089A08488m3517J02906
13030A67877g7006j22175D079J26173J96995j0978p7255B6223L4528L13667J5808
$$ plain form
13108 -23286 34748 -7013 18933 155863 172822 302027 391333 73345 17041 440532 22654
13096 56194 50754 -244683 374905 75611 214510 -256 152327 -168430 83151 250004 203824
13085 203824 144619 -36855 90861 211089 -32088 -71327 313780 33241 160514 15155 42998
13074 42998 -30271 90227 356320 138153 296422 56435 88732 203489 407338 33480 171512
13063 171512 56295 253984 -66409 287566 -35029 -116149 -7975 -252618 222135 306359 -116245
13051 107215 250369 183839 44882 -52105 -212275 -26985 299774 185482 263249 85328 288222
13040 288222 227463 111292 123896 485674 128881 35811 294900 108488 64971 167877
13030 167877 -77006 -199181 4079 130252 327247 316269 239014 26223 60751 374418 390226
13019C90226B6709J69031a58180F0989n313J22752L6339q5559L23573n5867B770
13007b4026p6503R079A44791o8198k0383M5533a25526l1849A73168i7761r8164
12996a95925H5900C4838J37595b96145A9184a44771A34771h2584B88110C0779
12985A0734g0277A0921C774c77564E8817i3367B77224i5332A59533a41193D01479
12973c891D1350j3709K04980a72351B88795r1475a07233D8405Q1842i3349D13965
12961F8856J65809h5955A48991a00384A21234b99386B04754b81757A89414a78216
12950e3060j25017A46520f0142G2894b10519k41666A33665d1758F2150L00743
12940C62893I2802j3974d8306D21672j24311A7947a24592B76809d43973h7388
$$ plain form
13019 390226 26709 195740 -158180 60989 55676 178428 214767 129208 452781 396914 2770
13007 -24026 -100529 -91450 144791 76593 56210 101743 -125526 -157375 173168 -97761 -195925
12996 -195925 85900 34838 172433 -296145 19184 -144771 134771 -82584 288110 30779
12985 10734 -70277 10921 3774 -377564 58817 -93367 277224 -95332 159533 -141193 401479
12973 -3891 41350 27641 232621 -172351 288795 197320 -107233 48405 130247 -93349 413965
12961 68856 234665 -85955 148991 -100384 121234 -299386 204754 -281757 189414 -178216
12950 -53060 -178077 146520 -60142 72894 -210519 -452185 133665 -41758 62150 362893
12940 362893 92802 78828 -48306 421672 297361 17947 -124592 276809 -443973 -87388
12929d51302B26567a46960A7353d0933A69991a95438a5315p12a312I8024C0668
12917B23858B3156d722j30410L4169F4914B6051L08365a61935M2506A73082J11567
12906B84649J4621C1697J03638J3407k3772b32357H6467b39475B4412P4308a11379
12894C2103c7922a3937B00478P110h1926A27388L50866f2578D6249K46100P6942
12883C69291a91585f1058H7579a25312A81570J53918g8524A39537b02552f4257
12872c43287B89214a55758a381q6692p5457j19452M1746P3544B6934L47159a1845
12860B18336A5975a68053B26777f4430b0396A27113F188K79572a13673B25278
12849b0662A52564e4675B90170h1069B50835C5508h5047j51631B373c2362k26951
$$ plain form
12929 -451302 226567 -146960 17353 -40933 169991 -195438 -15315 -16027 -1312 98024 30668
12917 223858 23156 -4722 -135132 -100963 64914 26051 334416 -161935 -119429 173082 284649
12906 284649 299270 31697 135335 148742 124970 -232357 86467 -239475 24412 98720 -111379
12894 32103 -37922 -13937 200478 207588 -81926 127388 478254 -62578 46249 292349 369291
12883 369291 -191585 -61058 87579 -125312 181570 335488 -78524 139537 -202552 -64257
12872 -343287 289214 -155758 -1381 -88073 -163530 -282982 -241236 -167692 26934 374093 -11845
12860 218336 15975 -168053 226777 -64430 -20396 127113 6188 285760 -113673 225278
12849 -20662 152564 -54675 290170 -81069 250835 35508 -85047 -236678 2373 -32362 -259313
12838b59313m1995h1947C1285a26045A22182K4397B871b8802A10694a88473d7118
12826B51664a87314R0082H5099f0004A43889L5001b7823G0658i6304c2548D7426
12814E2572a72737A02926b20919A05393i1086J6651A44652k0015f1095A13203
12803a76971B34898a66232B30733C9705a10273E1110b28297A84361m9632a1942
12792I802J76908i2174C18982D5111J43548K50565h1259B44139b95544G9986g9161
12780b2297j8218A05987M6777j9097J4812a54181B32154q4642K0809l1022c70892
12768a45668e3894l2409J0232K3434C32298f8716j48552B6598f6286I2215e6522
12756b55499a5177l41234A2099K2901R3299D119b52084B8086i0408B35236K83131
$$ plain form
12838 -259313 -301308 -81947 31285 -126045 122182 146579 2871 -28802 110694 -188473 -47118
12826 251664 -187314 -97232 85099 -60004 143889 178890 -27823 70658 -96304 -32548 47426
12814 52572 -172737 102926 -220919 105393 -91086 -74435 144652 124637 -61095 113203
12803 -176971 234898 -166232 230733 39705 -110273 51110 -228297 184361 134729 -11942
12792 9802 186710 -92174 318982 45111 188659 439224 -81259 244139 -295544 79986 -79161
12780 -22297 -40515 105987 152764 133667 148479 -154181 232154 147512 168321 137299 -370892
12768 -145668 -53894 -86303 -76071 -52637 332298 -68716 -217268 26598 -66286 92215 -56522
12756 -255499 -15177 -356411 12099 35000 128299 4119 -252084 28086 -90408 235236 518367
12745E18367B4383E037k466M31799e8145p5822B09980o9474A237f8155F637M34522
12733D41159j34258m4633i7301E7998K85919F8183J0281a59169A52831a13818
12722A12000f8785B25315c3386A20530b11410A57084J26005b26660j2800g7542
12711b90152A01269K86442C9591J74542G3855J73292J52454j11105A836a89673
12700A65575J12689h0895j16632G896a54048A9805L85835b08410G9664A0012J09332
12689A19344a0497A49014a29293A12353a38953e4207J4278B50221L1683a8420
12678B56503p3210F0238g8975A30859M1495L30736b74842a28569P721G9227J80692
12667B59919a08603A38813k0435K62281a32482A29165k7321E263J09559L32883
$$ plain form
12745 518367 24383 5037 2571 434370 -58145 -133967 209980 140506 1237 -68155 6637 441159
12733 441159 306901 262268 -97301 57998 343917 68183 78464 -159169 152831 -113818
12722 112000 -68785 225315 -33386 120530 -211410 157084 283089 -226660 -239460 -77542
12711 -290152 101269 387711 39591 214133 73855 247147 399601 288496 1836 -189673
12700 165575 278264 -80895 -197527 7896 -154048 19805 405640 -208410 79664 10012 119344
12689 119344 -10497 149014 -129293 112353 -138953 -54207 -39929 250221 281904 -18420
12678 256503 183293 60238 -78975 130859 172354 503090 -274842 -128569 -120848 79227 259919
12667 259919 -108603 138813 118378 380659 -132482 129165 101844 5263 114822 447705
12657D47705c69607A19870M6567K0070J17868o1731N1434p0566b33938C2068a75883
12645C16535j42500i834B28867F7755E538b19259D5255p852a49035M86A65817
12633i6197j68652a17963C45088D6772J96310q7969K01612o9782i9875L7862j34652
12622a96665C2653L3411B6749J12566a01447A19274J00801A6797a302l22830B81635
12610g4957m0728A40630K7686f0584F5902L4249c42084J41141B96627a36991B38504
12598A19003f9916c192F5768J06190a88067H375J4492K9317c50407C24612A22690
12586B7788I155i995B17092a03627I7906k1624f6844k33357a36096B42215b4974
12574A88666c1432A11193a26338m2718A2662J04455J6263b18203P1550j31149
$$ plain form
12657 447705 -369607 119870 166437 186507 304375 242644 294078 223512 -233938 32068 -175883
12645 316535 174035 -9834 228867 67755 5538 -219259 45255 37403 -149035 -148549 165817
12633 -96197 -264849 -117963 345088 46772 243082 155113 356725 286943 -99875 -62013 -196665
12622 -196665 32653 66064 26749 139315 -101447 119274 220075 16797 -1302 -324132 281635
12610 -74957 -115685 140630 168316 -60584 65902 100151 -342084 -200943 296627 -136991 238504
12598 119003 -69916 -3192 65768 171958 -188067 8375 22867 52184 -350407 324612 122690
12586 27788 9155 -9995 217092 -103627 97906 76282 -66844 -300201 -136096 242215 -24974
12574 188666 -31432 111193 -126338 -169056 12662 117117 133380 -218203 -146653 -277802
12564b77802B31902q6304c1982h416k92884i8680j7575m115N5791d56j61164C3905
12551A71683b96875L1458a12908A15630h7683k65685J41181F4546L888d9420K0748
12540b8672j08638C16539a4219n5002r4005A23078K6477K65525a9043A74374C7407
12528c0567A9520N8224J05691o4105L583K66629A51179C9241J77846l2579J8874
12517B03382q138a46579A75811a10639H1853f8913b8058Q380J784C09564g3614
12505a3813n21190J60588h1099C21373a73561O1222n6610A449K48944n1632a10916
12493H9636b37045n9220F1411b3781E7442c2362F426a36720k2773G7820b01804
12481f876j17382B93752c02002d0399M72B81488A13323b34879Q1519e412A1896
$$ plain form
12564 -277802 231902 145598 -31982 -8416 -301300 -98680 -116255 -120370 -64579 -456 -161620 33905
12551 171683 -296875 -265417 -112908 115630 -87683 -353368 -212187 64546 68434 -49420 -28672
12540 -28672 -137310 316539 -14219 -69221 -163226 123078 149555 415080 -19043 174374 37407
12528 -30567 19520 77744 183435 119330 122913 389542 151179 39241 217087 184508 203382
12517 203382 195244 -146579 175811 -110639 81853 -68913 -28058 -19678 -17894 309564 -73614
12505 -13813 -535003 -374415 -81099 321373 -173561 -112339 -168949 1449 250393 198761 -110916
12493 89636 -237045 -296265 61411 -23781 57442 -32362 6426 -136720 -159493 77820 -201804
12481 -6876 -124258 293752 -302002 -40399 -39927 281488 113323 -234879 -153360 -5412 11896
12469b76095C45272o6789A9274J55336a73000a3321E9447J68175d7509p9561A02196
12457I9489a3842I4068K39275A7214J97025b98769f4193B14560b97696C23352
12446C73838K9271j72331N2638a8032E5588b57722O5933Q3769h587j36822e1556
12434A9531g8909r9897M1298B52910j22199a9750G1834J16346h9856L9432p7777
12423a28201N3102j64170D818b4925m4939G995g4987k82697a21268F4998O9438
12412A34436b311l6076j90399O7242A1404c1053k48822d1087n916k26695a13257
12400H86Q6636d20208b2112J705D25b2259B70687c4824k39572A87581B4664R31
12388B5595K47771D4955M95894I145a94047I934d3673B46193i2355F049b10403
$$ plain form
12469 -276095 345272 278483 19274 174610 -173000 -13321 59447 227622 -47509 -127070 102196
12457 99489 -13842 94068 333343 17214 214239 -298769 -64193 214560 -297696 323352
12446 373838 403109 230778 283416 -18032 55588 -257722 -191789 -108020 -8587 -145409 -51556
12434 19531 -78909 -178806 -137508 252910 130711 -19750 71834 188180 -89856 -50424 -128201
12423 -128201 -75099 -239269 4818 -24925 -69864 7995 -74987 -357684 -121268 64998 134436
12412 134436 -2311 -38387 -228786 -161544 11404 -31053 -279875 -41087 -47003 -273698 -113257
12400 886 87522 -420208 -22112 -20407 425 -22259 270687 -34824 -274396 187581 24664 25595
12388 25595 273366 44955 540849 9145 -194047 9934 -43673 246193 -92355 6049 -210403
12376i8387c8798A40287n3690J66133h7155C0211a6047l38640D58810g3755A00953
12364h604G288c9922l28960f035j77693a981A44307j6791b80022n9743J69555
12353a70210c5873k2528C49019h5371l7291j26398e6160l95433d6028F7602R9986
12342A67588J2473m8342J20007H7256J61655K9778J38651j46114d3487C19853
12331B43668i2381F4011J64517J55548A27071M7741N0555m2549O7098c2996B82257
12319D5934a20006D89302B436L61101A20343h8603A77284c31551A15934g0886
12308a91934B22784K2013a81539j50229H7480C3968J25505l7307P0000P7224a44992
12296D5338N5871K52146A75817F0782a37032A83174c1649r5812A29120A1854L42719
$$ plain form
12376 -98387 -38798 140287 86597 252730 -87155 30211 -16047 -354687 458810 -73755 100953
12364 -8604 7288 -39922 -368882 -6035 -183728 -1981 144307 127516 -280022 -339765 -170210
12353 -170210 -35873 -58401 349019 -85371 -122662 -249060 -56160 -451593 -46028 67602 167588
12342 167588 180061 131719 251726 87256 248911 278689 417340 271226 -43487 319853
12331 243668 -92381 64011 228528 384076 127071 174812 225367 182818 249916 -32996 282257
12319 45934 -120006 489302 2436 363537 120343 -88603 177284 -331551 115934 -70886
12308 -191934 222784 244797 -181539 -331768 87480 33968 159473 122166 192166 269390 -144992
12296 45338 101209 353355 175817 60782 -137032 183174 -31649 -127461 129120 11854 354573
12285C54573j18906d8914A76151J5234M1775c7989F7589K7738J39385L13468A87904
12273A18410f2903B30512q5066Q2897J5133g6189A89832R3107F7104L10927a12135
12261A66842j7288d8437m3242a2412j32298q9852B23400F6313b5427C31363A7485
12249b94800B00314F7342B9761J0236K0500N9065D4073a10078H3517M3005a25192
12237B05601J46450E4513a54581E1740d980I6815a2091G5690B7141J66101H405
12225B28493H7415K16236n4586k29K675F7266J06851k7768K92756L0364k8609
12214D40860A68326P0714D113N7390J32881f1451B71807K13012b8683D45818B09806
12202B22577p6484J78368j47951J52228k5228J08407A81109K66740K12920F8046
$$ plain form
12285 354573 235667 -48914 176151 191385 233160 -37989 67589 95327 234712 548180 187904
12273 118410 -62903 230512 145446 228343 243476 -76189 189832 282939 67104 378031 -112135
12261 166842 149554 -48437 -91679 -12412 -144710 -234562 223400 66313 -25427 331363 17485
12249 -294800 200314 67342 29761 39997 60497 119562 44073 -110078 83517 126522 -125192
12237 205601 352051 54513 -154581 51740 -4980 96815 -12091 75690 27141 193242 8405
12225 228493 87415 303651 249065 248836 251511 67266 174117 146349 439105 469469 440860
12214 440860 168326 239040 4113 61503 194384 -61451 271807 484819 -28683 445818 209806
12202 222577 146093 324461 176510 328738 303510 411917 181109 447849 660769 68046
12191h3788A11379L6124J97789M2873F5580M8993n4311L28716j49001J20229A54679
12179B11644J65970f095B91698I3902K53129e1218k7520B34165Q9484a12732A38197
12167B08044o5097K56454N2739B04266K31488j59019j2120l2439C9517L96801
12157D36318D1722a36219A15496J63551j30081F7713J26214K05624j72422a10049
12146c0056B58693c3794B4563a78906k7643C54761b29358i7849C68589A62620
12135b9833A22497K07757q1796b25903C00424j49548A9361P3081d5263A00527
12124a57385J0761C25800A37191J89122q7844J24738A03760J08115p1490K22123
12114C62508H3519a98710A32881f7234C96368A28971a85237B97023A20328A6426
$$ plain form
12191 -83788 111379 147503 345292 388165 65580 114573 60262 388978 239977 360206 154679
12179 211644 377614 -6095 291698 93902 347031 -51218 -78738 234165 323649 -112732 138197
12167 208044 142947 399401 452140 204266 435754 276735 264615 232176 39517 436318
12157 436318 41722 -136219 115496 279047 148966 67713 193927 399551 227129 -110049
12146 -30056 258693 -33794 24563 -178906 -206549 354761 -229358 -97849 368589 162620
12135 -29833 122497 330254 248458 -225903 300424 150876 19361 92442 -45263 100527
12124 -157385 -146624 325800 137191 326313 238469 363207 103760 211875 140385 362508
12114 362508 83519 -198710 132881 -67234 396368 128971 -185237 297023 120328 16426
12103I0149a19250D4592J72153P1619a96428Q3411I440P0470O5514a42857B67033
12091A07923J55005d2349j09621B89996e9881A03857J3075e5467B45047E5230
12080b72179A59509J22228f1651A69291j5883K9809H7340N5729L6818a9642B95918
12068c4763A89390a52985n6252i6162K6212O033B42187M9278D8900e4336C67956
12056H5166e316j651H4404R2380E2413P0102l7983a8113C26094J36104E3644R9037
12044A52681K5408G8853a9734D07697B00276m8390J83892a71666f5848A01808
12033a57541A54135k8184k0930J31327f7122A96519B0010d9720A20772J65885
12023B86657a52908a6034j87685B10431K5646h3325b8740A86179A7684O007P5645
$$ plain form
12103 90149 -119250 44592 216745 288364 -196428 -113017 9440 79910 145424 -142857 267033
12091 107923 262928 -42349 -151970 289996 -59881 103857 116932 -55467 245047 55230
12080 -272179 159509 281737 -61651 169291 153408 183217 87340 143069 179887 -19642 295918
12068 -34763 189390 -152985 -209237 -96162 -69950 -63917 242187 291465 48900 -54336 367956
12056 85166 -5316 -6967 84404 176784 52413 122515 84532 -18113 326094 462198 53644 152681
12044 152681 178089 78853 -19734 407697 200276 151886 335778 -171666 -65848 101808
12033 -157541 154135 125951 105021 236348 -67122 196519 20010 -49720 120772 286657
12023 286657 -152908 -16034 -203719 210431 236077 -83325 -28740 186179 17684 23691 99336
12012I9336L8330h4511C61460j34413a63524B95200a68453D5973Q981A4944c57092
12000B79729b5548B15644c874C59101j46560a63978A18463n0184g9924B42274
11989a6762j3937E5116k5509J87610E4810L0895b72298D590a98959A70204d32038
11977B7901c2914k30980A94891B0105i9068j87875h4340L3109B26947C6663a11344
11965a54275h990j52654j63505a25148M2214a0452l01541D1484a13829M7384H7272
11953C75483d99691A04939l1999m076A1219K1630c8774r3855F6411b89760A77909
11941C123b32769J07239A98462B9675J50907b67002g0584k3969A48174a27392
11930a78081k09153B46315E608e2003a6151j27836m364j6239j10008K0358k3566
$$ plain form
12012 99336 137666 -84511 361460 227047 -163524 295200 -168453 45973 54954 14944 -357092
12000 279729 -25548 215644 -3874 359101 212541 -163978 118463 68279 -79924 242274
11989 -16762 -30699 55116 29607 217217 54810 85705 -272298 4590 -198959 170204 -432038
11977 27901 -32914 -263894 194891 20105 -99068 -286943 -84340 -51231 226947 36663 -111344
11965 -154275 -8990 -161644 -325149 -125148 -82934 -10452 -311993 41484 -113829 -66445 87272
11953 375483 -499691 104939 72940 68864 11219 32849 -38774 -132629 66411 -289760 177909
11941 3123 -232769 -125530 198462 29675 180582 -267002 -70584 -94553 148174 -127392
11930 -178081 -387234 246315 5608 -52003 -16151 -143987 -148351 -164590 -274598 -254240 -277806
11919b77806A8732K12908A7264J00754b79961a19893B20219a57427A2090K66242
11909B78332K74178d8227A80185E4713b5639l618k3603j07714m8111l1719k0135
11898b60539G6434i798n675C26798c5850j54687B23037k9181h8977j40776A92735
11886a09271D42058j90085c65108H3883Q8870f09200i6845M3057j76086A55335
11875a50675b1307A57600A3261a44444H2909N2086a17856A08256K33280a37752
11864G9833c0525C13732b15744b6089l1053B4590b29409r045A9457G434K9200
11853C6634c3033j27630C31767i78A82701b7976C1857a14584j8536J4569j42364
11842b60915j9176E5741B5505i8231k02353e2352j59139A99964b00374M8927A23803
$$ plain form
11919 -277806 18732 231640 17264 118018 -279961 -119893 220219 -157427 12090 278332
11909 278332 552510 -48227 180185 54713 -25639 -29257 -52860 -160574 -208685 -240404 -260539
11898 -260539 76434 -9798 -15473 326798 -35850 -190537 223037 193856 -88977 -229753 192735
11886 -109271 442058 251973 -365108 83883 172753 -609200 -96845 -53788 -229874 155335
11875 -150675 -21307 157600 13261 -144444 82909 134995 -117856 108256 341536 -137752
11864 79833 -30525 313732 -215744 -26089 -57142 24590 -229409 -238454 19457 7434 36634
11853 36634 -33033 -160663 331767 -978 182701 -27976 31857 -114584 -133120 -118551 -260915
11842 -260915 -280091 55741 25505 -98231 -300584 -52352 -211491 199964 -200374 -151447 123803
11830b90025e4852j2565B03392h4957a1216C1277L9723d0649A31419M3303d02880
11818c1525l46197D3746f0534j25629B5507a07882A78558C1280J14548c97734
11807b63984l173A79379H3788l9996e5903o1965E7746J11394d7298l3331D4651
11795A05472m7834g3269j26879B22118a18915e7176F1502M7033a08282A18809
11784A2870R2197j4707l4452J23301J1489d2125C75323a28496E6282b8727k62627
11773b91354f8976A4930a21661r9810d6312B3908a99370j25309a41543A43919
11762g2357k36884a07039A36106a58736p4538b0062k19990e1k8068B30940I3411
11750a0138A35047b54497A56665a35145C9911a66429n9857D69635f7801A91992
$$ plain form
11830 -290025 -54852 -67417 203392 -84957 -11216 31277 71000 -40649 131419 174722 -402880
11818 -31525 -377722 43746 -60534 -186163 25507 -107882 178558 31280 145828 -397734
11807 -263984 -267157 179379 83788 43792 -55903 -117868 57746 169140 -47298 -80629 44651
11795 105472 57638 -73269 -200148 222118 -118915 -57176 61502 108535 -108282 118809
11784 12870 105067 90360 55908 179209 190698 -42125 375323 -128496 56282 -28727 -291354
11773 -291354 -68976 14930 -121661 -221471 -46312 23908 -199370 -324679 -141543 143919
11762 -72357 -309241 -107039 136106 -158736 -233274 -20062 -240052 -51 -28119 230940 93411
11750 -10138 135047 -254497 156665 -135145 39911 -166429 -226286 469635 -67801 191992
11739a25307B7503J83501D9105J24703f4571r4400b1592H4170C0363b03947B9959
11727b9954B61350a35321A2126b3360A76786n6082C6895J01223a64146B4685a8470
11715d4519A03528m4022g9861B18521O6117b9770j37239B10198G0961J6998B5277
11703c24064A18186a6302D7903r572M4448J96535E5648f2757l07528C208g2868
11691A02315N2073D7560P1384j45J07027H0248P7902e8439k03215g8599c7891
11679B54173a74854B28377j02254l7543m042b8342B33357k2280b72196B5250a98941
11667c79747P2089H9089j1114k7889k3620f9704G7682O295f5849C79356k1088
11656C58268H7900I399J72286c17369G0671J16547K65726e1739J9720r6655j41150
$$ plain form
11739 -125307 27503 211004 49105 173808 -64571 -158971 -21592 84170 30363 -203947 29959
11727 -29954 261350 -135321 12126 -23360 176786 120704 36895 138118 -164146 24685 -18470
11715 -44519 103528 59506 -79861 218521 284638 -29770 -167009 210198 70961 87959 25277
11703 -324064 118186 -16302 47903 38331 82779 279314 55648 -62757 -370285 3208 -72868
11691 102315 154388 47560 118944 118799 225826 80248 158150 -58439 -261654 -78599 -37891
11679 254173 -174854 228377 126123 88580 84538 -28342 233357 211077 -272196 25250 -198941
11667 -379747 -307658 89089 77975 50086 26466 -69704 77682 83977 -65849 379356 358268
11656 358268 87900 9399 181685 -317369 70671 187218 452944 -51739 -32019 -128674 -269824
11645b69824B51131H0298h461B65421H3608c45401G5041j2465K1214J54611a7267
11633B57892b28613A81841h3002n9362o9672e5070F5554A5994h278A69521A2292
11621B25544b85656k4248F054J96577a14511A3246J34204a54595N6266c3881k9123
11610f3004k12738B31491a80729E4479J440Q8866n6530K38175L3915i5226A39226
11598a24120B02198R8070j1708B9622b5844A5460N0453c75855H953O6920a43553
11586b82627a10922B92456f7669k8271M5552A8278K35331J27380A66411L3334
11576A99745n0960J46903E9815K94491Q743J21920H4748P8228M29704i1973A66019
11564C97554A32106Q1043A06395k0675J95772F9438c2674l820A87725L2313C2832
$$ plain form
11645 -269824 251131 80298 -8461 265421 83608 -345401 75041 62576 83790 238401 -17267
11633 257892 -228613 181841 -83002 -142364 -212036 -55070 65554 15994 -8278 169521 12292
11621 225544 -285656 -309904 6054 202631 -114511 13246 147450 -154595 -98329 -33881 -63004
11610 -63004 -275742 231491 -180729 54479 55919 144785 88255 326430 360345 -95226 139226
11598 -124120 202198 300268 288560 29622 -25844 15460 65913 -375855 8953 75873 -143553
11586 -282627 -110922 292456 -67669 -95940 -50388 18278 253609 380989 166411 199745
11576 199745 148785 295688 59815 354306 363049 484969 84748 162976 592680 -91973 166019
11564 397554 132106 213149 106395 85720 281492 69438 -32674 -36494 187725 220038 32832
11552B01805b7179C26016j60735a64270C18731A55759c68571a81520a9092B51795
11541b6258j02773A10820a65050A64596G9776B0064J69472d217A73067L523o7128
11530A09462B28J85678H6759R650a5256H8265L31802c8671m898G2554K099P8371
11518A53024Q6262R16e786E3177a24122r077B23785P4804k6438A11412K22598
11507C34010i7377C32064R0141f4537B63984b28828B16195J67136f1428C24510
11496a1754n7810D767b05195G6321k4249Q9565J7712D5566K01523K0960i8764
11484H7841h978A51066g6055A32961b2704A49267c5931h805m9785k4895A59148
11472a58940B69347E0622J55399d3557A43256d5964j52947c6617B89746A42495
$$ plain form
11552 201805 -27179 326016 165281 -164270 318731 155759 -368571 -181520 -19092 251795
11541 -26258 -129031 110820 -165050 164596 79776 20064 189536 -4217 173067 176590 109462
11530 109462 228 185906 86759 96409 -15256 88265 420067 -38671 -43569 72554 74653 153024
11518 153024 239286 240202 -5786 53177 -124122 -133199 223785 298589 272151 111412 334010
11507 334010 -97377 332064 422205 -64537 263984 -228828 216195 383331 -61428 324510
11496 -11754 -69564 4767 -205195 76321 52072 141637 159349 45566 247089 268049 -98764
11484 87841 -8978 151066 -76055 132961 -22704 149267 -35931 -8805 -58590 -83485 159148
11472 -158940 269347 50622 206021 -43557 143256 -45964 -198911 -36617 289746 142495
11461a46563A69647D6370Q7664J0468o6023j7162d9111m3105A06627g4763b4028
11449c13103M4011G0860b54126C08511b4600F3619e4916A19512L6976D9578L41544
11438C91122A26420J06028d0859k6827D04631e6917A15080a48125A52017b39209
11427B92983R4489I304i1320j28497Q0661A15931B1296f5162B14888C6301J82515
11416B18816O5182D5508M5602J29784A926J34800c40312A54719b35176B7088a27327
11404b20595a09785C11252f5616B6493A2527K32449D0529K74121g5441j53557
11394b28998G3562J6590e0815n9406B40192D7880b68769e9231B08607b03899A00817
11382A42667D0060b2114a0505B83071b02513g4381G4761b1261j72282D9937O6286
$$ plain form
11461 -146563 169647 46370 134034 144502 78479 61317 -49111 -92216 106627 -74763 -24028
11449 -313103 -269092 70860 -254126 308511 -24600 63619 -54916 119512 156488 49578 391122
11438 391122 126420 232448 -40859 -67686 404631 -56917 115080 -148125 152017 -239209
11427 292983 387472 9304 -91320 -219817 -139156 115931 21296 -65162 214888 36301 218816
11416 218816 283998 45508 91110 220894 1926 136726 -340312 154719 -235176 27088 -127327
11404 -220595 -109785 311252 -65616 26493 12527 244976 40529 314650 -75441 -228998
11394 -228998 73562 90152 -50815 -110221 240192 47880 -268769 -59231 208607 -203899 100817
11382 142667 40060 -22114 -10505 283071 -202513 -74381 74761 -21261 -193543 49937 116223
11371A16223N5714a34935M5008J4093c4715a4927D2231L27509A23804a83424f2978
11359A50252J86362a9750D9853i574B73509b25649H8460g4976a4898j00982A50121
11347b48514M7965c8121O909r8783J3773G0521K07036I9575a22819A79614L6264
11336B15878a98748b5542j41804n9874P8203j185I547b04577N7010Q985M2640
11325i5942A74484O2989h3508I7492b12309F761J95758N5575c47630a54659B84139
11313a02119A83849A9738q479J21063a37814j75326A07290i7863A62307b9807
11302c19842F6291b31059p2088a2909E370K50683C5791i4412a1088E0549R4565
11291A45114a35550M8603r3276e2485C6391J39730H301c13398A98094p3009b22598
$$ plain form
11371 116223 171937 -134935 -89927 -75834 -34715 -14927 42231 369740 123804 -183424 -62978
11359 150252 336614 -19750 49853 -9574 273509 -225649 88460 -74976 -14898 -115880 150121
11347 -248514 -200549 -38121 -31212 -129995 -116222 70521 277557 99575 -122819 179614 215878
11336 215878 -198748 -25542 -167346 -227220 -149017 -150202 9547 -204577 -147567 -138582 -95942
11325 -95942 174484 237473 -83508 97492 -212309 6761 202519 258094 -347630 -154659 284139
11313 -102119 183849 19738 11259 132322 -137814 -313140 107290 -97863 162307 -29807
11302 -319842 66291 -231059 -303147 -12909 5370 256053 35791 -94412 -11088 50549 145114
11291 145114 -135550 -86947 -180223 -52485 36391 176121 8301 -313398 198094 125085 -222598
11279B0930a81248j47141F3003K9612m2926L449m082d30716I6322d41529g7384
11267A58720a07578C80626A27360a09386B03621i8102n2277e8368k34001a0258
11256a587l05029A06897h9415j5363e842C9147d07806J64981K317I2444m1970
11245E0474J1815a39728N807A70012a20152j61619j76660a05565F9556g4780l7793
11234a12573L4723j79796j7367m8263A274K914a27803l13385a96018l1863R112
11223b18769i3286o8289C5129a22286D683M11790C7511c18010n8696J74031e7044
11211G1729R6678a8214D4910b51136F163L45792g6604k83823C0469a39917B22616
11199b06322j29306J5436D04433i0051B23701b82179A62304c80973J79509B5696
$$ plain form
11279 20930 -181248 -328389 63003 92615 49689 53138 49056 -430716 96322 -441529 -77384
11267 158720 -107578 380626 127360 -109386 203621 -98102 -150379 -58368 -292369 -10258
11256 -1587 -306616 106897 -89415 -104778 -5842 39147 -407806 -242825 -240508 92444 50474
11245 50474 62289 -139728 -133921 170012 -120152 -281771 -458431 -105565 69556 -74780 -112573
11234 -112573 -77850 -257646 -275013 -323276 1274 4188 -127803 -441188 -196018 -227881 -218769
11223 -218769 -93286 -161575 35129 -122286 4683 416473 37511 -318010 -376706 -202675 -57044
11211 71729 168407 -18214 44910 -251136 6163 351955 -76604 -360427 30469 -139917 222616
11199 -206322 -335628 -320192 404433 -90051 223701 -282179 162304 -380973 -201464 25696
11188h2295j6067l9526r6411A2885d6626k025j71368p3329a24177B37772b82003
11176a83373F6950m83J90215p8884J16083j43451b8363l32641A58409n5907k4961
11165G7541h2834A16142c27098a2317B05550B9699e1562o9568r1039N9773J3253
11154a39143K334f4588j1105J5150j6508j27702A28086a59769N6243C1237c72977
11142i357C45102a9987m5186B05142i9704H656a71321e5162A62995Q0133K2607
11131B65735a04813m0631B55267o6860B7593K22799B4530c1138A21058a0840m1398
11120e2238H8258M05497H9645k866Q6404c6512F3393a93207A91500b627j22008
11109a24635G1495J60009J25831j49322n8398b35230J15192A43846l9850C893
$$ plain form
11188 -82295 -98362 -137888 -234299 12885 -46626 -48651 -220019 -293348 -124177 237772 -282003
11176 -183373 66950 66467 256682 177798 293881 150430 -28363 -361004 158409 102502 77541
11165 77541 -82834 116142 -327098 -12317 205550 29699 -51562 -121130 -212169 -152396 -139143
11154 -139143 -136809 -64588 -75693 -60543 -77051 -204753 128086 -159769 -103526 31237 -372977
11142 -9357 345102 -19987 -65173 205142 -99704 8656 -171321 -55162 162995 243128 265735
11131 265735 -104813 -145444 255267 188407 27593 250392 24530 -31138 121058 -10840 -52238
11120 -52238 88258 493755 89645 86779 173183 -36512 63393 -193207 191500 -2627 -124635
11109 -124635 71495 231504 357335 208013 149615 -235230 -120038 143846 103996 3893
11098A81821Q1340F9538J51775o4125R1482M184p604a22576C4185J53999m4643
11087A43541n8883K0757M07602G9616K46028p6184H2442K27398j52777J22741
11077B79804J6551L135M5243r9379a19A79460N12906B89951J44471K96372k48472
11066D82322E2468K46725H8524K80210J66801J24500C20339K56919J00562J18468
11056G96288C25065N23809j25172L4311L0695K14887B73402M75654o8903N21043
11046A201196n43876Q3831N2303K01083m7367J468n3037C90286M61228j88347
11036F63167K76127k19314K45943l84255J04472M2940J62678C94625L27271J3814
11026G35710j58268J05783J58834j74176K10879j07315j24135L58712q9703k07707
$$ plain form
11098 181821 263161 69538 221313 157188 248670 252854 245250 -122576 34185 188184 143541
11087 143541 84658 105415 513017 79616 325644 249460 82442 309840 157063 279804
11077 279804 296355 299490 344733 245354 -119 179460 692366 289951 434422 730794 482322
11066 482322 52468 299193 88524 368734 535535 660035 320339 577258 677820 796288
11056 796288 325065 848874 723702 758013 788708 1003595 273402 749056 680153 1201196
11046 1201196 657320 741151 793454 994537 947170 948638 895601 390286 851514 663167
11036 663167 939294 719980 965923 581668 686140 729080 891758 394625 721896 735710
11026 735710 577442 683225 842059 667883 878762 771447 647312 1006024 916321 708614
11016G08614R7706n2253j25049J7669J28567l70105M85557l78693k5034J79457
11006F66436j7768l8368J42355l55984J25707L36820Q8476j18324j54567J52874
10996H27657O2948j04650j35279N04R7954J24077k29264L96820l57870L69449
10986A052346l86237L76234j11198j25208Q4360j46885L3645O7668R8166J55061
10976A097952K94230L34024m34009J39923R53887k33845j57179L89058O05594
10967B989635K99977l60685R197L47640m95712k01196m81281R946m43788K27223
10957A900956o2494j90664j48353M5639L92396k94105j0393K88808o71296k86287
10947I64207q4264j50808K0553j77038J27339l26768j55601p7830J22688n1149
$$ plain form
11016 708614 806320 754067 629018 646687 775254 405149 890706 512013 486979 666436
11006 666436 648668 610300 752655 396671 522378 859198 947674 829350 674783 827657
10996 827657 890605 785955 650676 651180 749134 873211 643947 1040767 682897 1052346
10986 1052346 666109 1042343 931145 805937 890297 743412 777057 844725 942891 1097952
10976 1097952 1392182 1726206 1292197 1432120 2386007 2152162 1994983 2384041 2989635
10967 2989635 3289612 2928927 2938124 3285764 2790052 2588856 2107575 2117521 1673733 1900956
10957 1900956 1838462 1647798 1499445 1545084 1937480 1643375 1632982 1921790 1250494 964207
10947 964207 879943 729135 749688 572650 699989 373221 217620 139790 262478 211329
10937B11329K7765J50224A74529N6908D8055L8038K7276R2898p6672a21577L6203
10926h5374B54060j01420Q2787m1724J09976o8888h1363A57054d5826j45171A8026
10914I3496k080J35128e8339k06612a11467D342c7371j42152B56918A19507a95239
10902b36191c4027j24660j93999B97065J18520e5746r2162B35664i1328k2153
10892a13481M4098J8236J6634A41508h5800H5264a41439A80889A4454b05126k5620
10881b30746h0304I0141i7438j04811M8250J3738A25205D9003g2536L175B82803
10869H0290l0102J27372h8894a6889l3769A14083g6493k4233b090j82164j1603
10858a95857A09278D3248R9771c11697D37059C2474J54388a52571b1464g767A34991
$$ plain form
10937 211329 239094 389318 174529 231437 48055 86093 113369 206267 129595 -121577 -85374
10926 -85374 254060 152640 235427 193703 303679 234791 -81363 157054 -45826 -190997 18026
10914 93496 91416 226544 -58339 -264951 -111467 4342 -37371 -179523 256918 119507 -195239
10902 -236191 -34027 -158687 -352686 297065 415585 -55746 -147908 235664 -91328 -113481
10892 -113481 -69383 -51147 -34513 141508 -85800 85264 -141439 180889 14454 -205126 -230746
10881 -230746 -80304 90141 -97438 -202249 -153999 -140261 125205 49003 -72536 -69361 282803
10869 80290 50188 177560 -88894 -16889 -50658 114083 -76493 -100726 -2090 -184254 -195857
10858 -195857 109278 43248 143019 -311697 437059 32474 186862 -152571 -21464 -7767 134991
10846g0989B20684D3987c34322E6280i5010k60337c1126A47193D8778L14893h4942
10834B43612F990b4078j9764a376k99267A28173a08921k1844o3058F3348c2963
10822A16530c43947R206A64400m1136b46347N1687C7716a80440G7728e3570A56614
10810i7349J0369E17874j75952a35996k76357f099A8894K4701O5585g0033k15717
10799b85750A48458e3871j07549J2415c6043A11034a32166C4071K3852c81782
10788e6190B49704b20811i5941q642q3483f3352I5380C4935d14315F4763J80761
10777B45524E9401K7683J89208a679k94299e5749k8817d0174l4203B28333b1808
10765c4681B05665a67821D19644A4014g8308b9127r2973K1904A4165c8745m0696
$$ plain form
10846 -70989 220684 43987 -334322 56280 -95010 -355347 -31126 147193 48778 363671 -84942
10834 243612 6990 -24078 -43842 -1376 -300643 128173 -108921 -130765 -193823 63348 -32963
10822 116530 -343947 -334741 164400 123264 -246347 -194660 37716 -180440 77728 -53570 156614
10810 -97349 -86980 517874 341922 -135996 -412353 -6099 18894 43595 109180 -70033 -285750
10799 -285750 148458 -53871 -161420 -149005 -36043 111034 -132166 34071 57923 -381782
10788 -56190 249704 -220811 -95941 -104583 -188066 -63352 95380 34935 -414315 64763 245524
10777 245524 59401 87084 276292 -1679 -295978 -55749 -84566 -40174 -74377 228333 -21808
10765 -34681 205665 -167821 419644 14014 -78308 -29127 -122100 -100196 14165 -38745 -79441
10754g9441E3225J35160f9608E0080a49169n7407h8985j89982j79114C8129b39845
10742b97754a01090A24036A7285a6031c001B9447O9779P2833a30278A25005k9455
10731I5550f5822j6316j308B5791h7765m3993l46764I8017b10012j05979A2922
10719A54765h4391K1624m4439a2890N306j48958C3802a01259j02309k2283j839
10708b27690j7827j43505a36469n8628A34036B5524l372b47382M0592Q4954A56928
10696g5302j7633c5194j12488D33460a57364M0689B27456f6745p6324k2614D51505
10684a38769B29774d58499d2550B40957H228b51013J20514a5044E18668h3074
10673F1861J08198c9810l360j25637k3513Q8611A36d0418j34629H5559A8852d03032
$$ plain form
10754 -79441 53225 188385 -69608 50080 -149169 -206576 -88985 -278967 -458081 38129 -239845
10742 -297754 -101090 124036 17285 -16031 -3001 29447 99226 172059 -130278 125005 95550
10731 95550 -65822 -82138 -83446 25791 -87765 -131758 -478522 98017 -210012 -315991 12922
10719 154765 -84391 -62767 -107206 -12890 -7584 -156542 33802 -101259 -203568 -225851 -227690
10708 -227690 -245517 -389022 -136469 -195097 134036 25524 22152 -247382 -206790 -121836 156928
10696 -75302 -92935 -35194 -147682 433460 -157364 -116675 227456 -66745 -143069 -165683 451505
10684 -138769 229774 -458499 -42550 240957 8228 -251013 -130499 -15044 518668 -83074
10673 61861 170059 -39810 -43170 -168807 -192320 -103709 136 -40418 -175047 85559 18852 -403032
10660c38325i4632m30840b24649a02938k37765A16376a69168l8516m4068B33186
10649a67717g8215j78459H0826c3696j83142j84998D8920l198f6047l06284J67015
10638b05316a9514A04154C6689K30501A17084J1261b94900a0368q5571b7588A74021
10626a7811G553L33102A69101a83126j79502a32427H5839a52871a6188A76898
10615D700K89536C9946a15061H5096b46790g4299A0896L12586a69747A52073J55941
10604C08014A30568A9866a08899A81367b06994L7506A95442q4234b49115O6978
10594a82137L3151m7789A9555a98463j6816i7454H7919L958J31581a48964L1012
10583a17952L8486A8897K31016a42431A5760J65344M6951H5720c68787d1611j11527
$$ plain form
10660 -338325 -94632 -525472 -224649 -102938 -340703 116376 -169168 -207684 -251752 233186
10649 -167717 -78215 -256674 80826 -33696 -216838 -401836 48920 45722 -66047 -372331 -205316
10638 -205316 -19514 104154 36689 267190 117084 128345 -294900 -10368 -95939 -27588 174021
10626 -17811 7553 340655 169101 -183126 -362628 -132427 85839 -152871 -16188 176898
10615 4700 294236 39946 -115061 85096 -246790 -74299 10896 323482 -169747 152073 308014
10604 308014 130568 19866 -108899 181367 -206994 -169488 195442 111208 -249115 -182137
10594 -182137 -148986 -196775 19555 -198463 -215279 -97454 87919 91877 223458 -148964 -117952
10583 -117952 -79466 18897 249913 -142431 15760 181104 228055 85720 -368787 -41611 -153138
10572a53138m9472G5138g4673C27965i2817C26212c58983a43159l8824n2786j74660
10561d09429a73855F3816J0144b70908e6594p2383j59866B30738a14052A94829
10550A84356b17900j63022A05299A1497b0097E2956d7114B9407O7947a2834r7553
10539a10387K9291q5796D00967d7721C2465a49087J7055m2887k00901J17330a14613
10527d37753C6993a40618f2085L290q8630B32223f263D1512K50882e63393E2612
10515f3590j29741j6601B40167a76690b6262k56379C6436a91097b1057B29902
10504F6754a49251D9246e3773G676K18174k1107m5654k7597b00593A6040D250
10492c074B13618a23081B674d6182o550m37882i0944A8734g7866l1938B17314
$$ plain form
10572 -153138 -202610 75138 -74673 327965 -92817 326212 -358983 -143159 -181983 -234769 -409429
10561 -409429 -173855 63816 73960 -270908 -56594 -128977 -288843 230738 -114052 194829
10550 184356 -217900 -380922 105299 11497 -20097 52956 -47114 29407 97354 -12834 -110387
10539 -110387 -81096 -166892 400967 -47721 32465 -149087 -132032 -174919 -375820 -258490 -114613
10527 -437753 36993 -140618 -62085 -58795 -147425 232223 -6263 41512 292394 -563393 52612
10515 -63590 -193331 -209932 240167 -176690 -26262 -282641 36436 -191097 -21057 229902
10504 66754 -149251 49246 -53773 7676 225850 204743 159089 131492 -200593 16040 4250
10492 -3074 213618 -123081 2674 -46182 -52732 -490614 -90944 18734 -77866 -109804 217314
10480A31316d8882j24193A21046L64973A95695L10914j18610A00421L9941a32231
10469A29169g6515R004j56162a02680A18196A8305c2722I8951b50970a22726A08820
10457F5640a0354o6301F104N172N4645a69706A01998a25864A36144f2442j74494
10446b36936g9720C0083f6615b2032m200k46958D97268b25785a07260l33458A45689
10434b69764j81H280K00257b32707h6763I7170b1763A75688b31240R9153e1135
10422F8862L5919A1978a11853d5457A56727g6822F4476A0222i694k21188J0412
10411b20470Q1162o3976N322A2965a83438g6538K3957p6407e8602E3202b82217
10399B9K79025c78796A75576a04589F1L3133N6274l8931N5413C843a43971C5849
$$ plain form
10480 131316 -48882 -173075 121046 486019 195695 506609 387999 100421 140362 -132231
10469 129169 -76515 -67511 -223673 -102680 118196 18305 -32722 98951 -250970 -122726 108820
10457 65640 -10354 -76655 6104 11276 65921 -169706 101998 -125864 136144 -62442 -236936
10446 -236936 -79720 30083 -66615 -22032 -26232 -273190 497268 -225785 -107260 -440718 145689
10434 -269764 -269945 8280 208537 -232707 -86763 97170 -21763 175688 -231240 -132087 -51135
10422 68862 104781 11978 -111853 -45457 156727 -76822 64476 10222 -9694 -230882 -220470
10411 -220470 -139308 -203284 -197962 12965 -183438 -76538 -52581 -128988 -58602 53202 -282217
10399 29 279054 -378796 175576 -104589 61 33194 89468 50537 105950 3843 -143971 35849
10386h8451B47082a01712A07695P1906C0973J967D547J4739g922B63358K31139
10375D94497B8282d6546A75734P2853n54J79920J89394k66109R6094j42776k6072
10364B78484M85944n3778j66302n6386J25444j15840j62879A67179P5030k4390
10354B17819K85850A03150J85743J61046N8352K09219j23102B11578I1828L89356
10344D81184b17571D67859l4268B14444J70355p4857J29484j63812K87037k70941
10334B91710r4901R2103l4140q7819b41472C41700g477j61573C57214A11387a48807
10322d6315C28669A58854a10099C11323j7224r7266e4240B65787m6990j9141Q5712
10311B85368o5524f803B34477A07128a30748j87465A5841b70717M1516g6876c6795
$$ plain form
10386 -88451 247082 -101712 107695 179601 30973 32940 4547 19286 -7922 263358 494497
10375 494497 28282 -46546 175734 248587 248033 427953 617347 351238 447332 304556 278484
10364 278484 764428 710650 544348 487962 613406 497566 334687 167179 242209 217819
10354 217819 503669 103150 288893 449939 508291 717510 594408 211578 91828 481184
10344 481184 -217571 467859 433591 214444 384799 309942 439426 275614 562651 291710
10334 291710 196809 288912 254772 166953 -241472 341700 -7477 -169050 357214 111387 -148807
10322 -46315 328669 158854 -110099 311323 294099 196833 -54240 265787 218797 199656 285368
10311 285368 219844 -6803 234477 107128 -130748 -318213 15841 -270717 -229201 -76876 -36795
10299A4128c08317a6656j909P759p1440A89660d5615D0502c25932J34920A20189
10287a72120d4051j93784N8706J7549D7829k0854c9998G2988b46340p4408A3915
10275A56179P7344b22350N2484J1686f5699j59596B4823a52593m0898P3828B730
10263B60451g7651A54534J2733l6466i92E9767J42429M3976l3966K51345A49515
10251f1053B86304l0578f986A9612K45013A08370d9390E4057a8505A45293b14675
10239A78445G014b64666J7547A09306D7937b8681G7794k1885K55711c88903a02460
10227a48464E5454a48733L0783A83973N1335g3334j78311j70790F0798b58120
10216b98913G5564b78835A31193n3155c42605K3915B4031b73053d1310I3218b6697
$$ plain form
10299 14128 -308317 -16656 -18565 -10806 -82246 189660 -45615 40502 -325932 -191012 120189
10287 -172120 -44051 -237835 -179129 -161580 47829 26975 -39998 72988 -246340 -320748 13915
10275 156179 233523 -222350 -169866 -158180 -65699 -225295 24823 -152593 -193491 -119663 2730
10263 260451 -77651 154534 167267 130801 -992 59767 202196 246172 212206 463551 149515
10251 -61053 286304 255726 -6986 19612 264625 108370 -49390 54057 -18505 145293 -214675
10239 178445 7014 -264666 -247119 109306 47937 -28681 77794 55909 311620 -388903 -102460
10227 -148464 55454 -148733 -117950 183973 235308 -73334 -251645 -422435 60798 -258120
10216 -298913 75564 -278835 131193 78038 -342605 -318690 24031 -273053 -41310 93218 -26697
10204H1127K9433c4294j61107Q8586a8927k82618F6876b58137J05004A12336c5188
10192b88066d2724r8019A75293O4310c18157H2540i7002I9793h965F7896B3030
10180A47441a90078c0644B9810K2782P1280C4501R5583h3847j36326k23230i5643
10168b2845k9191C350J81123e5184A70916c01544e0636q4069n5714A49065d67891
10156D8652J10120d4258Q082l26363a55563k07591i2853r0565l38458d7564C19807
10144a44927I8387f1176k40720D8689b20363e6874k34918D45141a11089q6639
10134a97728A46155a06611j28831J08889l08772R9109c8931R844j07416o7795
10124b04298c5870k44098b6305j82098j87574a96583c7667r7774c5532j3539K2379
$$ plain form
10204 81127 110560 -34294 -195401 -106815 -18927 -301545 66876 -258137 -153133 112336 -35188
10192 -288066 -42724 -140743 175293 239603 -318157 82540 -97002 99793 -8965 67896 23030
10180 147441 -190078 -30644 29810 52592 123872 34501 130084 -83847 -220173 -443403 -95643
10168 -22845 -52036 3350 184473 -55184 170916 -301544 -50636 -134705 -190419 149065 -467891
10156 48652 158772 -44258 -36176 -362539 -155563 -363154 -92853 -183418 -521876 -47564 319807
10144 -144927 98387 -61176 -301896 48689 -220363 -56874 -291792 445141 -111089 -197728
10134 -197728 146155 -106611 -235442 -126553 -435325 -336216 -38931 -29087 -136503 -204298
10124 -204298 -35870 -279968 -26305 -208403 -395977 -196583 -37667 -135441 -35532 -49071 -26692
10113b6692j6015B2227a99752l505N1684N7227A43744d10773a74845A02414f212
10101a31195j95179d6841k5897A8436a54484A12156B1861a6740m04863e3019j3502
10090f6521k08233j40675J96909I6811K46614E6446g8921a5630B30383c51509
10079b18328f6156l20078a25995A82940c5268B1835b8727C33686d1230k23362
10069b64592J12907e9990D5985a65015C1182a80828e7285B46621a2510k48303
10059b60813q072f5258B68909a7971k74708N7557F949c18793O5706d5224m3682
10048h8906n9950c888j56311p8582A43174a01027m3920N392I8945B302L9415a57806
10035c13599A53890c43353A51053b75773A06304J21131b76857a18948m8921B01250
$$ plain form
10113 -26692 -42707 22227 -199752 -203257 -151573 -94346 143744 -410773 -174845 102414 -6212
10101 -131195 -326374 -46841 -72738 18436 -154484 112156 21861 -16740 -421603 -53019 -66521
10090 -66521 -274754 -415429 -218520 96811 343425 56446 -78921 -15630 230383 -351509
10079 -218328 -66156 -386234 -125995 182940 -35268 21835 -28727 333686 -41230 -264592
10069 -264592 -151685 -59990 45985 -165015 31182 -180828 -57285 246621 -12510 -260813
10059 -260813 -268885 -65258 268909 -17971 -292679 -235122 6949 -318793 -253087 -45224 -88906
10048 -88906 -148856 -3888 -160199 -238781 143174 -101027 -144947 -139555 98945 2302 41717 -157806
10035 -313599 153890 -343353 151053 -275773 106304 227435 -276857 -118948 -167869 201250
10024g9099A93610P92n9508e5276B38777h8454k5802O337L8011r9050A10184n1729
10012E8455e9485k37604A405g5103C89099c43692D33769H1102a3772l0149m5323
10001h9244f773k67408B9273J6317K31817a47825B95324a97020o2113B32366a64021
9989A1585N7438A043c8183A77331J12366a00899H0660a72307d3049A74702k0376
9978A54326B1596b15994c4238B8179j0925K2052a00475k30752N9559E4035a45100
9966A20764b46635m9800a0203A52875a57265A08037D9463a60150c2041C11828
9955A28923a85939g5803j30865K2220O1471l61016a37643F1571a95039A44667
9944a3741r1009A88591a68015m3991q6612a44245a8984B8457o744O1765a06466
$$ plain form
10024 -79099 193610 194402 134894 -55276 238777 -88454 -114256 -107919 -69908 -168958 110184 58455
10012 58455 -59485 -297089 1405 -75103 389099 -343692 433769 81102 -13772 -43921 -89244
10001 -89244 -6773 -274181 29273 45590 277407 -147825 295324 -197020 -259133 232366 -164021
9989 11585 69023 1043 -38183 177331 289697 -100899 80660 -172307 -43049 174702 154326
9978 154326 21596 -215994 -34238 28179 17254 39306 -100475 -331227 -271668 54035 -145100
9966 120764 -246635 -296435 -10203 152875 -157265 108037 49463 -160150 -32041 311828
9955 128923 -185939 -75803 -206668 -184448 -122977 -483993 -137643 61571 -195039 144667
9944 -13741 -104750 188591 -168015 -212006 -298618 -144245 -18984 28457 21713 83478 -106466
9932d3119I6824e33843J89238O4137j77325J91849P8875L4212j0948P8014H5306
9920a69177q746M3104k70470J12682A27715b13150R4325m2507L5267j04163k41163
9909d71391a16184k27492a21834A51688g7621B7339O5156b46992R6092f3285j59392
9898b22677P0352m6783J966j64345a63497E3600f7306l3327c627k70563i9052
9886g7029c4504A3501b25039O4637j07627B30736b6835j22761E356a12321J1672
9875a00649c2632j24873C9118J0687b90232k71591h7698A38141j3247b39852B22379
9863C8337a17610A04303K9445c34285a35539c3638N856C0553b7850B71562A01185
9851d6143p9774C84623A72296b70463q1794A85920a10209A49862B7381J63756
$$ plain form
9932 -43119 96824 -533843 -344605 -280468 -457793 -265944 -187069 -152857 -163805 -85791 85306
9920 -169177 -177923 -134819 -405289 -292607 127715 -213150 -118825 -161332 -126065 -230228 -471391
9909 -471391 -116184 -343676 -121834 151688 -77621 27339 92495 -246992 -150900 -63285 -222677
9898 -222677 -152325 -199108 -197142 -361487 -163497 53600 -67306 -100633 -3627 -274190 -99052
9886 -77029 -34504 13501 -225039 -160402 -268029 230736 -26835 -149596 5356 -112321 -100649
9875 -100649 -32632 -157505 39118 49805 -290232 -561823 -87698 138141 124894 -239852 222379
9863 38337 -117610 104303 133748 -334285 -135539 -33638 -27782 30553 -27850 271562 101185
9851 -46143 -125917 384623 172296 -270463 -352257 185920 -110209 149862 27381 191137
9841A91137p5469i613E2398a41692j11261k04565C34408D6544a57671f2284n9613
9830a21897l7045j27770a04658b3471F7251c10063J37036J8211j38055E6729a13589
9818f1340q0195l57027A56397a63653A43048a02493D5931b38776c2623j76167
9808b08790g6913l63314a48128A10900E5418a12823o264H9278J1404N551i014
9796a72264j44492a30838A09113m4305c05314B03413d61362a44876O3777A55107
9785b33237i3586j34333n466A20362h6268d0261A40598D539d03818a92056N5915
9774a36141e479k09987A38384g7962a7668j69148A76629l1928a01918c7353C1384
9762a566I3936J52966b54628Q4544P367c2554D4958l1a88839e1349B31649a19632
$$ plain form
9841 191137 115668 -9613 52398 -141692 -252953 -457518 334408 46544 -157671 -62284 -121897
9830 -121897 -158942 -286712 -104658 -23471 67251 -310063 -173027 -154816 -292871 56729 -113589
9818 -61340 -141535 -498562 156397 -163653 143048 -102493 45931 -238776 -32623 -208790
9808 -208790 -76913 -440227 -148128 110900 55418 -112823 -119087 89278 100682 106233 -9014
9796 -172264 -316756 -130838 109113 64808 -305314 203413 -461362 -144876 -81099 155107
9785 -233237 -93586 -227919 -233385 120362 -86268 -40261 140598 4539 -403818 -192056 -136141
9774 -136141 -5479 -215466 138384 -77962 -17668 -186816 176629 144701 -101918 -37353 31384
9762 -1566 93936 246902 -254628 -170084 -162717 -32554 44958 44927 -188839 -51349 231649 -119632
9749a20395A62133a53797j17677B5019N1923a12777k6496j93736A68879q3861
9739H5018a83052l3658O0072F7408Q3983b05769c7144j53334Q3842j41688D9409
9727B63499D7307J56106a68896I1081i5475d4484j89047i5865k57002c1414j73421
9716b04835L3359G921K53899a60214F7467a22648q4562m0545m839B61608j11920
9705A49688K6474b62542h3985r7886G1347b06683A32390f2679a4593p0138J9468
9694f5263n11530a38504I5073b163k52658a25143Q375D00186a53583A3277K09482
9683B22759j05164c06054h5810A43853o6698g5329o3861a9119B12855b7079k3753
9672e0832A83758b6740l21245E8537a14350E151f9739j42020i2407j24282J01480
$$ plain form
9749 -120395 162133 -153797 -271474 25019 76942 -112777 -139273 -333009 168879 85018
9739 85018 -183052 -216710 -156638 67408 151391 -205769 -37144 -190478 -106636 -248324 49409
9727 263499 47307 203413 -168896 91081 -95475 -44484 -233531 -95865 -352867 -31414 -204835
9716 -204835 -171476 7921 261820 -160214 67467 -122648 -207210 -247755 -252594 261608 149688
9705 149688 176162 -262542 -83985 -181871 71347 -206683 132390 -62679 -14593 -84731 -65263
9694 -65263 -576793 -138504 95073 -2163 -254821 -125143 -116768 400186 -153583 13277 222759
9683 222759 117595 -306054 -85810 143853 77155 -75329 -139190 -19119 212855 -27079 -50832
9672 -50832 183758 -26740 -347985 58537 -114350 5151 -69739 -211759 -92407 -216689 -115209
9661a15209D353J98900h7332n4862B9139c01704P5354N7642d3615A54000b57408
9649d54776h9152m1882B8350b31775D2032P2845G97i3335c7240k13880i3630B233
9636b52270C6094b68662A53514c14006H2849a75948f043k13404N2334D421e0985
9624a9508k39204A8099c76590R6070B18863b55897J19326j27451N5595H0665a40015
9612G5901f3664B00099a36521q9521A12920a17962K4094k3557A2535b48144f1106
9600b37659I7290c70205a859D2874j2863a00257D6165b49775I7043J23621c86858
9588c3225j62671g328m17287a27978l2356c4748Q338o7721j77988j4439A79681
9576I990M8878c5258j9985A04560Q1442g6696K0686C07448b49703B58835d7010
$$ plain form
9661 -115209 4353 203253 -87332 -142194 29139 -301704 -226350 -168708 -43615 154000 -257408
9649 -454776 -89152 -131034 28350 -231775 42032 114877 797 -93335 -37240 -251120 -93630 2233
9636 -252270 36094 -268662 153514 -314006 82849 -175948 -6043 -219447 -167113 4421 -50985
9624 -19508 -258712 18099 -376590 -280520 218863 -255897 -136571 -264022 -208427 80665 -140015
9612 75901 -63664 200099 -136521 -226042 112920 -117962 -93868 -117425 12535 -248144 -61106
9600 -237659 97290 -370205 -1859 42874 30011 -100257 46165 -249775 97043 220664 -386858
9588 -33225 -195896 -7328 -424615 -127978 -160334 -34748 -26410 -94131 -272119 -286558 179681
9576 9990 58868 -35258 -55243 104560 186002 -76696 -56010 307448 -249703 258835 -47010
9564a10617G9907c861r1240K5859l18793d7427l59401F1743a001j61895A14542
9552d3680j59093n1824k91880a95176E0249d29817F2556a52103I8522b1012l65756
9541c86768c5940j68530A74723a432k60248F8254a15345k87823A5147M5989a53853
9529b58658O4783o9956D39149b420k40932n390a18056l7130g1442I8131J03029
9518B01160b95148f7587B28237P4018a60257j36092A01233d0471o0762B41885
9507h8747F394N0695L9940d7923l3166G7218d44347a69253I963b8083k14751m846
9495b47680B82082F017b06012h352j07769C7180e6553Q820q9551c9551j04773
9484a44324L7521B69631f7000j59059d3712k3487n4934a8846D0450P8318l8320
$$ plain form
9564 -110617 79907 -3861 -95101 -69242 -388035 -47427 -406828 61743 -1001 -162896 114542
9552 -43680 -202773 -254597 -546477 -195176 50249 -429817 62556 -152103 98522 -21012 -386768
9541 -386768 -35940 -204470 174723 -1432 -261680 68254 -115345 -403168 15147 61136 -153853
9529 -258658 -193875 -263831 439149 -2420 -243352 -248742 -118056 -155186 -71442 98131 201160
9518 201160 -295148 -67587 228237 302255 -160257 -296349 101233 -40471 -101233 241885
9507 -88747 6394 57089 97029 -47923 -81089 77218 -444347 -169253 9963 -28083 -242834 -247680
9495 -247680 282082 6017 -206012 -8352 -116121 37180 -56553 -47733 -137284 -39551 -144324
9484 -144324 -106803 269631 -67000 -226059 -43712 -67199 -122133 -18846 40450 118768 80448
9473H0448c3373B0550Q383h3165r0685B46110K17461a523j751B06455c3692j57452
9461a91144G4739a81204Q1009c3014k3638l83807B01871e3165B10466q5657K43775
9450C68584a29561N8347k01393O1766k201e9600m68593A59743a76119A6330Q7370
9439A03700a36370M0530j93949I0477a92008l4745J9779B27541h8426J8099k10809
9428b81136g6583C9650g6626f403l0481k51640F1724M9078a19606A70315c77594
9416a57091B89093p9675c80614Q7814a22872F2712b15050P203B49775d7738j92186
9405b39924B61371a33704k3334c7419D8009i6058D0696b10669B49569c68998e1837
9393G4579b51590A20698O6105h29924I1704Q243j9278a54805I5050M4992c00090
$$ plain form
9473 80448 -33373 20550 28933 -83165 -173850 246110 463571 -1523 -3274 206455 -33692 -191144
9461 -191144 74739 -181204 -100195 -33014 -56652 -440459 201871 -53165 210466 124809 368584
9450 368584 -129561 -71214 -272607 -210841 -213042 -59600 -528193 159743 -176119 16330 103700
9439 103700 -136370 -95840 -289789 90477 -192008 -226753 -206974 227541 -88426 -70327 -281136
9428 -281136 -76583 39650 -76626 -6403 -36884 -288524 61724 110802 -119606 170315 -377594
9416 -157091 289093 209418 -380614 -292800 -122872 62712 -215050 -207847 249775 -47738 -239924
9405 -239924 261371 -133704 -157038 -37419 48009 -96058 40696 -210669 249569 -368998 -51837
9393 74579 -251590 120698 186803 -829924 91704 99947 80669 -154805 95050 140042 -300090
9381a40419e44l15378f0264E1529J15705a82159N8505j13398n5801f441j45559
9370a52000b1568E8704a48943A0459a9694j54759e3982j57848a1789o1983L2865
9359d0907A55030B0316a13672a5745B15876K7565a53611b7478B39358a04118B8398
9347d90134A77516b76538B72790i4856j77030l685D8010d1034n2454r1214d1731
9335b3949I4273J71675a34656M8838E3851A5774a29315j0486A52154a49687B6183
9323g6233o4713q1544m0039F8794a89622A14010c4099m9732l3141g561j30636
9312a38197c5970j36505O3123j9988a8420J603j54241J4206i370A16598b54792
9300a83696d2376l4088C1885J13281f9103J4906k0476p947B7513a88581j83003
$$ plain form
9381 -140419 -544 -315922 -60264 51529 167234 -182159 -123654 -237052 -292853 -6441 -152000
9370 -152000 -21568 58704 -148943 10459 -19694 -174453 -53982 -211830 -11789 -73772 -40907
9359 -40907 155030 20316 -113672 -15745 215876 243441 -153611 -27478 239358 -104118 28398
9347 -490134 177516 -276538 272790 -94856 -271886 -275571 48010 -41034 -93488 -184702 -41731
9335 -23949 94273 265948 -134656 -85818 53851 15774 -129315 -139801 152154 -149687 26183
9323 -76233 -140946 -222490 -262529 68794 -189622 114010 -34099 -83831 -116972 -7561 -138197
9312 -138197 -35970 -172475 -109352 -129340 -18420 -16817 -171058 -156852 -9370 116598 -254792
9300 -183696 -42376 -76464 31885 145166 -69103 -54197 -74673 -82620 27513 -188581 -371584
9289c71584H3856b68645B20531b5552B90325m4813a35920B13357c21851a36875
9278a89444b1570r4935C8701J58831c94779a40277B37711c25632a8024A53596
9267a76402G9702h0994e355j57788k8750h6470K0366E3853a74992G5236a23814
9255D318a74018A56780A9615J24327a11190m013E2345b60077B00823b35400P3930
9244a61470A84624a0782j4241A27735a54997B4800b97203J23981h1522r0543G5416
9232C1389a3445k51358a9173H3238c9618p3329j00345f3251k91489R2326C4839
9220a8947l11997J32690j86927a63544A49080a18789E6691f2856k46542a45984
9209b40842R1610B34600c14120B50822h8266l21166i8137B2809b21029R7811I3904
$$ plain form
9289 -371584 83856 -268645 220531 -25552 290325 245512 -135920 213357 -321851 -136875
9278 -189444 -21570 -116505 38701 197532 -394779 -140277 237711 -325632 -18024 153596
9267 -176402 79702 -80994 -5355 -163143 -191893 -86470 -66104 53853 -174992 75236 -123814
9255 4318 -174018 156780 19615 143942 -111190 -115203 52345 -260077 200823 -235400 -161470
9244 -161470 184624 -10782 -25023 127735 -154997 24800 -297203 -173222 -81522 -172065 75416
9232 31389 -13445 -264803 -19173 83238 -39618 -112947 -213292 -63251 -354740 -262414 34839
9220 -18947 -330944 -198254 -385181 -163544 149080 -118789 56691 -62856 -309398 -145984
9209 -240842 -149232 234600 -314120 250822 -88266 -409432 -98137 22809 -221029 -123218 93904
9197b5177l26441A81062f0668H7271C7481a61484E049L0885b57250d4842l3646
9186g8488E01153A48836A9051b37308B03882e7253o0289A21642a80376F2099c31986
9174c41790a33519l3048A77436j3551E1080e8743l6547H0406a22477j16642H2577
9162e7837G5976J37641A1876J4106c70671a5724A21506b12312j23775A31134b63845
9150A61141B5002a97914j67249H6402m1451f1901G015c2297n8475n705G5385c06989
9137a33414f4827G5602a20637d2922A9903b13806M2043k30925A65141b84167A67669
9125A1766g4388J4578H8629c18187C4909M3427b23625M4948m1535j0857d6346
9113a23093A28401k0817a43595k42119A26035a64159I3863J11156D42c39896A54015
$$ plain form
9197 -25177 -351618 181062 -60668 87271 37481 -161484 5049 35934 -257250 -44842 -78488
9186 -78488 501153 148836 19051 -237308 203882 -57253 -117542 121642 -180376 62099 -331986
9174 -341790 -133519 -166567 177436 163885 51080 -58743 -95290 80406 -122477 -239119 82577
9162 -57837 75976 213617 11876 25982 -370671 -15724 121506 -212312 -336087 131134 -263845
9150 161141 25002 -197914 -365163 86402 44951 -61901 7015 -32297 -90772 -96477 75385 -306989
9137 -133414 -64827 75602 -120637 -42922 19903 -213806 -171763 -402688 165141 -284167 167669
9125 11766 -74388 -59810 88629 -318187 34909 78336 -223625 -178677 -220212 -231069 -46346
9113 -123093 128401 107584 -143595 -385714 126035 -164159 93863 205019 442 -339896 154015
9101A13461f1209A50310d08223B1837J3549a08009B3913l236b43200p3607J04066
9090b12741A9348f7372k42079d7926k78589e1099b4134A15708M8455a22950K4994
9079i7956k38125a60233N272K3891j364E08696c87448a01827b3664A33913f7860
9067f966B5567f7492A26810l415a57126A65344d4625j38438F658a89200g855j82129
9055a89984a6815j82195q7908c614A03895a86862a9229A98267N2974o6036a8040
9043b11353j12215P8209d1902k26954B02768a8656l64558C47513b7775B02445
9032B0994R0517N7846a25352I9581b77091K3595B32572a84558B05236F9991c39179
9020c82141D8022a71922A63947a67422g836p1747j82280m8726P5940A2860K15575
$$ plain form
9101 113461 -61209 150310 -408223 21837 35386 -108009 23913 20677 -243200 -316807 -212741
9090 -212741 19348 -67372 -309451 -47926 -326515 -51099 -24134 115708 164163 -122950 -97956
9079 -97956 -336081 -160233 -154961 -131070 -132434 508696 -387448 -101827 -23664 133913 -67860
9067 -6966 25567 -67492 126810 123395 -157126 165344 -44625 -183063 6658 -189200 -7855 -189984
9055 -189984 -16815 -199010 -286918 -3614 103895 -186862 -19229 198267 251241 185205 -18040
9043 -211353 -323568 -245359 -41902 -268856 202768 -18656 -383214 347513 -27775 202445
9032 20994 111511 169357 -125352 99581 -277091 -253496 232572 -184558 205236 69991 -339179
9020 -382141 48022 -171922 163947 -167422 -7836 -79583 -261863 -310589 -234649 12860 228435
9009B28435A3928g8188k18661B3518J370a06195j21131B8633c00891f0334A52821
8997a1281k14971B3736b80902F3386a51182j05297C9311b00185i9961E4556a19952
8985b69853P4244d6560m5713H081a35902l52365B43616p9258M4940g5164B8295
8973b20202N8227G3732a01224G3460b03842d0028l43363b3144a0638I270b33065
8961a6770b022B20762d30291g7486A07721E0395b00517r9346B8880b18819N8749
8950a60070k08724B34033A09342J6181m6570F012a22665D2813e9552I9645g3152
8938A24037b3612j5750C34682g0365I3186L09967m2891d2503J2800j60266A40764
8926A07695B1906e4454C02517J871M17157P54635L155497P703145n964134A700026
$$ plain form
9009 228435 13928 -78188 -296849 23518 24888 -106195 -227326 28633 -300891 -60334 152821
8997 -11281 -226252 23736 -280902 63386 -151182 -256479 39311 -200185 -99961 54556 -119952
8985 -269853 -195609 -46560 -92273 8081 -135902 -488267 243616 164358 209298 -75164 28295
8973 -220202 -161975 73732 -101224 73460 -203842 -40028 -383391 -23144 -10638 9270 -233065
8961 -16770 -2022 220762 -430291 -77486 107721 50395 -200517 -299863 28880 -218819 -160070
8950 -160070 -368794 234033 109342 125523 78953 6012 -122665 42813 -59552 99645 -73152
8938 124037 -23612 -39362 334682 -70365 93186 403153 360262 -42503 -29703 -189969 140764
8926 107695 21906 -54454 302517 304388 721545 1476180 4631677 12334822 6370688 1700026
8915E60597j77874l5235D0973a248j69860k54183B30157a54194B09872o3949O1591
8904B07514f2327p3645E5226i2825A95145b40932P8011j07905C8435b53552N7297
8893a96255i0814I4527f3040A83197a80166B47490c18855j62069a06417E5200
8882a18346A45770b75668b0638J0176C25261j54646c61132B02222b77203h6590
8871b67142f0364K9682j76628C5796a58018I8673A5397c34186c1211A68803b21394
$$ plain form
8915 560597 382723 347488 40973 -1248 -171108 -425291 230157 -154194 209872 145923 207514
8904 207514 -62327 -135972 55226 -92825 195145 -240932 -162921 -270826 38435 -253552 -196255
8893 -196255 -90814 94527 -63040 183197 -180166 247490 -318855 -480924 -106417 55200
8882 -118346 145770 -275668 -20638 -10462 325261 170615 -361132 202222 -277203 -86590
8871 -267142 -60364 -30682 -207310 35796 -158018 98673 15397 -334186 -31211 168803 -221394
$$ [...]
##END NTUPLES=NMR SPECTRUM
##END=
